##TITLE=Analysis number 328926
Compound Code cc 10301
Book Reference lab3
Project Code adrs
Chemist Name stores
##JCAMPDX= 6.0         $$ Bruker NMR JCAMP-DX V2.0
##DATA TYPE= NMR SPECTRUM
##DATA CLASS= NTUPLES
##ORIGIN= Bruker BioSpin GmbH
##OWNER= nmr
$$ XWIN-NMR		Version 3.5
$$ Tue Jul 17 09:37:02 2007 GMT Daylight Time (UT+1h)  MAYBRIDGE\nmr@NMR_250MHZ
##.OBSERVE FREQUENCY= 250.131544655141
##.OBSERVE NUCLEUS= ^1H
##.ACQUISITION MODE= SIMULTANEOUS (DQD)
##.ACQUISITION SCHEME= undefined
##.AVERAGES= 16
##.DIGITISER RES= 18
##SPECTROMETER/DATA SYSTEM= dpx250
##.PULSE SEQUENCE= zg30
##.SOLVENT NAME= DMSO
##.SHIFT REFERENCE= (INTERNAL, DMSO, 0, 16.522)
##AUDIT TRAIL= $$ (NUMBER, WHEN, WHO, WHERE, WHAT)
$$ ##TITLE= Audit trail, XWIN-NMR		Version 3.5
$$ ##JCAMPDX= 5.01
$$ ##ORIGIN= Bruker BioSpin GmbH
$$ ##OWNER= nmr
$$ C:\u/data/dgb/nmr/ADRS/1090/pdata/1/auditp.txt
$$ ##AUDIT TRAIL=  $$ (NUMBER, WHEN, WHO, WHERE, WHAT)
(   1,<2007-07-17 09:36:38.45 +100>,<MAYBRIDGE\nmr>,<NMR_250MHZ>,
      <created by zg, POWCHK disabled, PULCHK disabled
       configuration hash MD5:
       76 6E 9A 78 1E 09 19 81 EC 84 63 8F B0 6A 59 2D
       data hash MD5: 64K
       3C C7 D2 6E BD B4 F7 06 38 F7 66 3A 87 55 15 7E>)
(   2,<2007-07-17 09:36:52.26 +100>,<MAYBRIDGE\nmr>,<NMR_250MHZ>,
      <Start of raw data processing
       ef LB = 0.3 FT_mod = 6 PKNL = 1 SI = 32K 
       data hash MD5: 32K
       6A 12 6D 0A 83 54 5C 5D B9 66 6A 3A BE 9C DA 8A>)
(   3,<2007-07-17 09:36:54.69 +100>,<MAYBRIDGE\nmr>,<NMR_250MHZ>,
      <apk 
       data hash MD5: 32K
       52 18 27 96 23 24 8B F4 A0 B8 6D 65 A4 F6 60 AE>)
(   4,<2007-07-17 09:36:55.56 +100>,<MAYBRIDGE\nmr>,<NMR_250MHZ>,
      <abs ABSG = 5 
       data hash MD5: 32K
       AB E7 8F A4 94 C1 DA F9 12 96 51 F6 0C D5 58 21>)
$$ ##END=
$$ 
$$ hash MD5
$$ A2 C8 EA 38 5E EE ED D7 9B C0 D0 34 8B C9 1A 07
##$RELAX= 
##$RELAX= 
##$RELAX= 
##$RELAX= 
##$RELAX= 
##$RELAX= 
##$RELAX= 
$$ Bruker specific parameters
$$ --------------------------
##$DU= <C:\u>
##$EXPNO= 1090
##$NAME= <ADRS>
##$PROCNO= 1
##$TYPE= <nmr>
##$USER= <dgb>
##$AMP= (0..31)
100 100 100 100 100 100 100 100 100 100 100 100 100 100 100 100 100 100 
100 100 100 100 100 100 100 100 100 100 100 100 100 100 
##$AQSEQ= 0
##$AQ_mod= 3
##$AUNM= <au_zg>
##$AUTOPOS= <7 >
##$BF1= 250.13
##$BF2= 250.13
##$BF3= 250.13
##$BF4= 250.13
##$BF5= 500.13
##$BF6= 500.13
##$BF7= 500.13
##$BF8= 500.13
##$BYTORDA= 1
##$CFDGTYP= 0
##$CFRGTYP= 5
##$CHEMSTR= <none>
##$CNST= (0..31)
1 1 145 1 1 1 1 1 1 1 1 1 1 1 1 1 1 1 1 1 1 1 1 1 1 1 1 1 1 1 1 1 
##$CPDPRG= <>
##$CPDPRG1= <>
##$CPDPRG2= <>
##$CPDPRG3= <>
##$CPDPRG4= <mlev>
##$CPDPRG5= <mlev>
##$CPDPRG6= <mlev>
##$CPDPRG7= <mlev>
##$CPDPRG8= <mlev>
##$CPDPRGB= <>
##$CPDPRGT= <>
##$D= (0..31)
0 1 0 0 0 0 0 0 0 0.06 0 0 0 0 0 0 0.0002 0 0 0 0 0 0 0 0 0 0 0 0 0 0 
0 
##$DATE= 1184661397
##$DBL= (0..7)
120 120 120 120 120 120 120 120 
##$DBP= (0..7)
150 150 150 150 150 150 150 150 
##$DBP07= 0
##$DBPNAM0= <>
##$DBPNAM1= <>
$$ [...]
##$SUBNAM7= <"">
##$SUBNAM8= <"">
##$SUBNAM9= <"">
##$SW= 20.6930455092707
##$SWIBOX= (0..15)
0 0 3 0 0 0 0 0 0 0 0 0 0 0 0 0 
##$SW_h= 5175.983436853
##$TD= 65536
##$TD0= 1
##$TE= 296.16
##$TE2= 300
##$TE3= 300
##$TEG= 300
##$TL= (0..7)
0 120 120 120 120 120 120 120 
##$TP= (0..7)
150 150 150 150 150 150 150 150 
##$TP07= 0
##$TPNAME0= <>
##$TPNAME1= <>
##$TPNAME2= <>
##$TPNAME3= <>
##$TPNAME4= <>
##$TPNAME5= <>
##$TPNAME6= <>
##$TPNAME7= <>
##$TPOAL= (0..7)
0.5 0.5 0.5 0.5 0.5 0.5 0.5 0.5 
##$TPOFFS= (0..7)
0 0 0 0 0 0 0 0 
##$TUNHIN= 0
##$TUNHOUT= 0
##$TUNXOUT= 0
##$USERA1= <user>
##$USERA2= <user>
##$USERA3= <user>
##$USERA4= <user>
##$USERA5= <user>
##$V9= 5
##$VALIST= <valist>
##$VCLIST= <CCCCCCCCCCCCCCC>
##$VD= 0
##$VDLIST= <DDDDDDDDDDDDDDD>
##$VPLIST= <PPPPPPPPPPPPPPP>
##$VTLIST= <TTTTTTTTTTTTTTT>
##$WBST= 1024
##$WBSW= 4
##$XGAIN= (0..3)
0 0 0 0 
##$XL= 0
##$YL= 0
##$YMAX_a= 275397
##$YMIN_a= -275129
##$ZGOPTNS= <>
##$ZL1= 120
##$ZL2= 120
##$ZL3= 120
##$ZL4= 120
##$ABSF1= 16.522
##$ABSF2= -4.171173
##$ABSG= 5
##$ABSL= 3
##$ALPHA= 0
##$AQORDER= 0
##$ASSFAC= 0
##$ASSFACI= 0
##$ASSFACX= 0
##$ASSWID= 0
##$AUNMP= <proc_1d>
##$AZFE= 0.1
##$AZFW= 0.1
##$BCFW= 0
##$BC_mod= 0
##$BYTORDP= 0
##$COROFFS= 0
##$CY= 12.5
##$DATMOD= 1
##$DC= 0
##$DFILT= <>
##$DTYPP= 0
##$F1P= 14.0000005364418
##$F2P= -0.99999901652339
##$FCOR= 0.5
##$FTSIZE= 32768
##$FT_mod= 6
##$GAMMA= 0
##$GB= 0
##$INTBC= 1
##$INTSCL= 1
##$ISEN= 128
##$LB= 0.3
##$LEV0= 0
##$LPBIN= 0
##$MAXI= 10000
##$MC2= 0
##$MEAN= 0
##$ME_mod= 0
##$MI= 0
##$NCOEF= 0
##$NC_proc= -4
##$NLEV= 6
##$NOISF1= 0
##$NOISF2= 0
##$NSP= 0
##$NTH_PI= 0
##$NZP= 0
##$OFFSET= 16.522
##$PC= 1
##$PHC0= -24.40606
##$PHC1= -48.98696
##$PH_mod= 1
##$PKNL= yes
##$PPARMOD= 0
##$PSCAL= 4
##$PSIGN= 0
##$REVERSE= no
##$SF= 250.13
##$SI= 32768
##$SIGF1= 0
##$SIGF2= 0
##$SINO= 400
##$SIOLD= 32768
##$SREGLST= <1H.DMSO>
##$SSB= 0
##$STSI= 32768
##$STSR= 0
##$SW_p= 5175.98343685301
##$SYMM= 0
##$S_DEV= 0
##$TDeff= 65536
##$TDoff= 0
##$TI= <Analysis number 999999
Compound Code 99
Book Reference 9
Project Code 9>
##$TILT= no
##$TM1= 0
##$TM2= 0
##$TOPLEV= 0
##$USERP1= <user>
##$USERP2= <user>
##$USERP3= <user>
##$USERP4= <user>
##$USERP5= <user>
##$WDW= 1
##$XDIM= 32768
##$YMAX_p= 374535842
##$YMIN_p= -12354882
$$ End of Bruker specific parameters
$$ ---------------------------------
##NTUPLES= NMR SPECTRUM
##VAR_NAME=  FREQUENCY,     SPECTRUM/REAL,   SPECTRUM/IMAG
##SYMBOL=    X,             R,               I
##VAR_TYPE=  INDEPENDENT,   DEPENDENT,       DEPENDENT
##VAR_FORM=  AFFN,          ASDF,            ASDF
##VAR_DIM=   32768,         32768,           32768
##UNITS=     HZ,            ARBITRARY UNITS, ARBITRARY UNITS
##FACTOR=    0.157963299565203, 1,           1
##FIRST=     4132.6476996994, 0,             0
##LAST=      -1043.33573715361, 0,           0
##MIN=       -1043.33573715361, -12354882,   0
##MAX=       4132.6476996994, 374535842,     0
$$ Real data points
##PAGE= N=1
##DATA TABLE= (X++(R..R)), XYDATA
$$ [...]
16566A69794n472k63j6436o619l544j7694j428L3007J6334j880j655j423o128
$$ 169794 164322 164059 147623 141004 137460 119766 118338 151345 167679 165799 164144 162721 156593
16553A56593j6641M625r947Q121J3285M981J691O599J8929Q03j8655j7945K837
$$ 156593 139952 144577 134630 142751 156036 161017 162708 169307 188236 189039 170384 152439 155276
16540A55276J5506P00j6616j7907q846m814k288j4111j4278L2565L6257L130K379
$$ 155276 170782 171482 154866 136959 128113 123299 121011 106900 92622 125187 161444 164574 166953
16527A66953M650M818j5251j1097R636j1216q444o870m765l21K0737j1673k6684
$$ 166953 171603 176421 161170 150073 159709 148493 140049 133179 128414 128093 148830 137157 110473
16514A10473M287K8682O285j2870P077M5406K9741j3671m5869j4964j8421j1072
$$ 110473 114760 143442 149727 136857 143934 189340 219081 205410 159541 144577 126156 115084
16502A15084p994q336J9954J5428l0029n266n438K986j8335K6345J8883n149o037
$$ 115084 107090 98754 118708 134136 104107 98841 93403 96389 78054 104399 123282 118133 112096
16489A12096M012J2539r334j4258o079K4605J1370l4998k1308L0500K9431r203
$$ 112096 116108 128647 119313 105055 98976 123581 134951 99953 78645 109145 138576 129373
16477A29373J9003q532j6335j5232K30K239R581j1049q516L542j0976q510n49
$$ 129373 148376 139844 123509 108277 108507 110746 120327 109278 100762 104304 93328 84818 84269
16464H4269j0138J6184L5434K7372O563j835j5080J3198N042J7426M21j4512J3809
$$ 84269 74131 90315 125749 153121 159684 157849 142769 155967 161009 178435 178856 164344 178153
16451A78153l350P756k3513r692j8059l5334Q432J3517P182j4709J5848M5843
$$ 178153 174803 182559 159046 149354 131295 95961 104393 117910 125092 110383 126231 172074
16439A72074m869j5398l8171k3463K8348M4048j2350j8681j0314j7250P716K13
$$ 172074 167205 151807 113636 90173 118521 162569 150219 131538 121224 103974 111690 111903
16427A11903j2793k579J7349R196M054k472j0485Q488R795k2915J9343J2260p700
$$ 111903 99110 96531 113880 123076 127130 124658 114173 122661 132456 109541 128884 141144 133444
16414A33444j512R468j6646p828l1052k2635J5623K2411M0845p318j3048l2665
$$ 133444 131932 141400 124754 116926 85874 63239 78862 101273 142118 134800 121752 89087
16402H9087N239J4484J7787O752L513j4875L525R256L1377n139k7309j4362L23
$$ 89087 94326 108810 126597 133349 136862 121987 125512 134768 166145 161006 133697 119335 119658
16389A19658K8272K4222l958j9618Q779j4703k7095k1408J747K022J9026n068
$$ 119658 147930 172152 168194 148576 157355 142652 115557 94149 95896 97918 116944 111876
16377A11876M957K1488K4700J1266j7986j7451K410J8232M779J9251J1015j2779
$$ 111876 116833 138321 163021 174287 156301 138850 141260 159492 164271 183522 194537 181758
16365A81758j3189m0306k2994j7437k548K161K3448J0076K3518K1360k0246q098
$$ 181758 168569 128263 105269 87832 85284 87445 110893 120969 144487 165847 145601 137503
16353A37503O832j0001q987q167l0345J3270r275R782q349l501k1284k2898J9786
$$ 137503 144335 134334 125347 117180 86835 100105 90830 100612 92263 88762 67478 44580 64366
16340F4366K8042k1395J9512j366k1556j0189J986K2795P616K2092J4236j9810
$$ 64366 92408 71013 90525 89159 67603 57414 59400 82195 89811 111903 126139 106329
16328A06329J7448K2261k0111j8395o043k737K019K0430l72q87k5365k1706K9725
$$ 106329 123777 146038 125927 107532 101489 98752 100771 121201 120829 119942 94577 72871 102596
16315A02596J7267K40j7540j2096J2421j0017l3032k2063J7393K5674r677K2218
$$ 102596 119863 120103 102563 90467 102888 92871 59839 37776 55169 80843 71166 93384
16303I3384m160J602J0308j7663l265k785J6413O025k827J8032P398O236O949
$$ 93384 89224 90826 101134 83471 80206 77421 93834 99859 97032 115064 122462 128698 135647
16290A35647j6853m5532j2881n86j4281j0280L1452K8644k497K758R710j5207
$$ 135647 118794 73262 60381 59795 45514 35234 66686 95330 92833 95591 105301 90094
16278I0094N639J7087j1526k4165M22K5521R077P860j777j6243m2K7695j3817
$$ 90094 95733 112820 101294 77129 77551 103072 112149 120009 118232 101989 101947 129642 115825
16265A15825k214j4395r633R834J2167k3506l7279j2321K256J5105O313L1686
$$ 115825 113611 99216 89583 99417 111584 88078 50799 38478 40734 55839 62152 93838
16253I3838q548j4865K862J1626J6623J6210j0941M304J1669k8234M100k202o266
$$ 93838 85290 70425 73287 84913 101536 117746 106805 111109 122778 94544 98644 96442 90176
16240I0176k1007k2K5314N234j769Q699J5262j6066k3921J7312J8956k4787m4460
$$ 90176 69169 69147 94461 99695 97926 106625 121887 105821 81900 99212 118168 93381 48921
16227D8921p22J7237J991r544J5697p798r367J9457L3028j5230j26j2229j9136
$$ 48921 48199 65436 67427 57883 73580 65782 56415 75872 108900 93670 93544 81315 62179
16214F2179k236J9030J2640J5330j0154q553K5616r467j3315O635J2608J538k7010
$$ 62179 59943 78973 91613 106943 96789 88236 113852 104385 91070 97705 110313 111851 84841
16201H4841k0874K0013o48j587J7985J1524M366M297r511j9037J5330K0137o865
$$ 84841 63967 83980 83332 81745 99730 111254 115620 119917 110406 91369 106699 126836 119971
16188A19971Q322k588q900j4868j1431R821R794p26k4756l0710L385L326l87K4502
$$ 119971 128293 125705 116805 101937 90506 100327 110121 109395 84639 53929 57314 60640 60253 84755
16174H4755j3959j8073J4820J0405q243Q025o54j0469l0567J3387J6606Q421K2739
$$ 84755 70796 52723 67543 77948 69705 77730 77076 66607 36040 49427 66033 74454 97193
16161I7193M236o22K1599R966J412J1228J0448O784k9379k9860j3886j3672k485
$$ 97193 101429 100807 122406 132372 133784 145012 155460 162244 132865 103005 89119 75447 72962
16148G2962k3045p958L4458L0229L844l678L5715L063j1842j0742p241l8457p358
$$ 72962 49917 41959 76417 106646 110490 106812 142527 145590 133748 123006 115765 77308 69950
16135F9950M221j3897k2546J1303K6254J6528l181k1917r313m170R920p110p794
$$ 69950 74171 60274 37728 49031 75285 91813 88632 66715 57402 53232 63152 56042 48248
16122D8248k478L98K4018K3132J4721j3550l2578K600J2460M706r249l710J1597
$$ 48248 45770 46168 70186 93318 108039 94489 61911 64511 76971 81677 72428 68718 80315
16109H0315o79M134j6895q278J7533M2109m321j6805r354R263l0142j8561R345
$$ 80315 79636 83770 66875 58597 76130 118239 113918 97113 87759 97022 66880 48319 57664
16096E7664Q875O698p793J0431J40Q791J0885p487m738K4322j0459j1360J3229
$$ 57664 66539 73237 65444 75875 76015 84806 95691 88204 83466 107788 97329 85969 99198
16083I9198o779M828K4174J7621k557m415k8595o592J5761K9945j1837k1655j2310
$$ 99198 92419 97247 121421 139042 136485 132070 103475 96883 112644 142589 130752 109097 96787
16070I6787k8857P180K4010K4027j7148j1819k1641q997j9292M326j3210n734
$$ 96787 67930 75110 99120 123147 105999 94180 72539 63542 44250 48576 35366 29632
16058B9632J136J165M4049Q287J5613M1356p440j7422j6227M020J148j1974j5839
$$ 29632 30768 31933 75982 84269 99882 141238 133798 116376 100149 104169 105317 93343 77504
16045G7504j7692J634j4001p704p704J7011L7604o362n172L7903l299j8975j6389
$$ 77504 59812 61446 47445 39741 32037 49048 86652 80290 75118 113021 109722 90747 74358
16032G4358l608P348Q761j4840j1951R745o58R92N753K3929J9508R753j1425j0065
$$ 74358 70750 78098 86859 72019 60068 69813 69155 70147 75900 99829 119337 129090 117665 107600
16018A07600j3305j7258l703J2923j1924J0319q23j7932r892Q463j1899m62J0493
$$ 107600 94295 77037 73334 86257 74333 84652 83829 65897 56005 64468 52569 52107 62600
16005F2600m816q312K6975J0425J2320K983k095J3060p484j8256l600J0071j9199
$$ 62600 57784 49472 76447 86872 99192 102175 100080 113140 105656 87400 83800 93871 74672
15992G4672k2908m813K9027J5653O085j3168l2865R986J4662m205J721M072J2352
$$ 74672 51764 46951 75978 91631 97716 84548 51683 61669 76331 72126 73847 77919 90271
15979I0271J226m332k0074j1623l260J0316q204j0558m205k538L8371J471P180
$$ 90271 91497 87165 67091 55468 52208 62524 54320 43762 39557 37019 75390 76861 84041
15966H4041P820m7481J4305J8028n40j0055p574m6804R954L104L3782K0215r969
$$ 84041 91861 44380 58685 76713 76173 66118 58544 11740 21694 24798 58580 78795 68826
15953F8826k2203J0769p95j4627n054N283J893J8881j3773l1914J044L477q927
$$ 68826 46623 57392 56597 41970 36916 42199 44092 62973 49200 17286 18330 21807 12880
15940A2880N767l69j4102L7426J7492m0044l2655L561J5041o83Q929L7548K0879
$$ 12880 18647 18278 4176 41602 59094 19050 -13605 -10044 4997 4314 13243 50791 71670
15927G1670j2090j0298J3704L16Q89L1035l353k3946j6631j2060j5028J6729P567
$$ 71670 59580 49282 62986 63302 64191 95226 91873 67927 51296 39236 24208 40937 48504
15914D8504o534J3808J5476j3440j0889K600J5915K783J6725Q044j6492k8651
$$ 48504 41970 55778 71254 57814 46925 49525 65440 68223 84948 92992 76500 47849
15902D7849o908N714K8387K5150j057k3187J8451N367N256p257n752J2608o531
$$ 47849 40941 46655 75042 100192 99135 75948 94399 99766 105022 97765 92013 104621 98090
15889I8090j1014k6036j4273J3760L2231J0194Q623P361k6915k5173N324j5861
$$ 98090 87076 61040 46767 60527 92758 102952 111575 118936 92021 66848 72172 56311
15877E6311K3063L583k8070k6175J262K5212J8796J1283l415j0666q616j3104
$$ 56311 79374 82957 54887 28712 29974 55186 73982 85265 81850 71184 62568 49464
15865D9464J6663J0111R972j7293j2713J0815L832N442J254k2190j2935J5721
$$ 49464 66127 76238 86210 68917 56204 67019 70851 76293 77547 55357 42422 58143
15853E8143r707L367j9304k2410J7935L7262K8979J4592k3482j9944l331k1914
$$ 58143 48436 51803 32499 10089 28024 65286 94265 108857 85375 65431 62100 40186
15841D0186j208j4380o422J3156j276K6509P750M490k1448j4317k8495j2176o979
$$ 40186 38978 24598 18176 31332 30056 56565 64315 68805 47357 33040 4545 -7631 -14610
15828a4610K4013J5807J8701p649j2058j5035J5867r88p646N531J7042j477j0484
$$ -14610 9403 25210 43911 36262 24204 9169 25036 24048 16402 21933 38975 37498 27014
15815B7014O169J5297j026j110J1944J4096j5756j4364N693r564O761N645N694
$$ 27014 33183 48480 47454 46344 58288 72384 56628 42264 47957 38393 45154 50799 56493
15802E6493k6559j1219R837q411L373m469J279r695J3406L312j4799O450P596
$$ 56493 29934 18715 28552 20141 23514 19045 20324 10629 24035 27347 12548 18998 26594
15789B6594P366Q191J4986p023Q088J2192J3126k9362k2730J2876K0983j3061
$$ 26594 33960 42151 57137 50114 58202 70394 83520 54158 31428 44304 65287 52226
15777E2226J9630K5094j4682l9185j6028J1636K8364o710j1013k2656L087J5504
$$ 52226 71856 96950 82268 43083 27055 38691 67055 60345 49332 26676 29763 45267
15765D5267J7545l604k4935l427J0706j6413j7247R355k2635j3316K3176J9310
$$ 45267 62812 59208 34273 30846 41552 25139 7892 17247 -5388 -18704 4472 23782
15753B3782K3515n803j9476j1948K3999j6273n333L183P724j6492P736J3526J3974
$$ 23782 47297 41494 22018 10070 34069 17796 12463 15646 23370 6878 14614 28140 42114
15740D2114k1370R92o833k0985J9578K2466N896K0974K347J6333p864j2749J158
$$ 42114 20744 21736 14903 -6082 13496 35962 41858 62832 65179 81512 73648 60899 62057
15727F2057O599J6857J0989J6204j7326j4237m583k4194k7210j6679n540J04M371
$$ 62057 68656 85513 96502 112706 95380 81143 76560 52366 25156 8477 2937 3041 7412
15714G412M1163j4243j8206O124J5866k6698j6708k729J1378J3175M845J3811
$$ 7412 48575 34332 16126 22250 38116 11418 -5290 -8019 3359 16534 21379 35190
15702C5190K5678J7965j7372J7288K9008l8691j3018j8125j9061l917M389N78
$$ 35190 60868 78833 61461 78749 107757 69066 56048 37923 18862 14945 19334 19912
15690A9912J6219j1924j688J9006K2143J5646j4839k5182j0522j191P727k6081
$$ 19912 36131 24207 22519 41525 63668 79314 64475 39293 28771 27580 35307 9226
15678I226j588J3183m314J2452M053J6800O415K0259O58p497l2930l4038k517
$$ 9226 7638 20821 16507 28959 33012 49812 56227 76486 77144 69647 36717 2679 162
15665A62L64n663J7988O03K2933J1736p789j1188k5666k6841J9723J7721K4982
$$ 162 526 -5137 12851 13454 36387 48123 40334 29146 3480 -23361 -3638 14083 39065
15652C9065M215j2264p292n4Q73o129r724r924N813k808R272O345Q676K0584M933
$$ 39065 43280 31016 23724 23670 24543 18414 8690 -1234 4579 1771 11043 17388 26064 46648 51581
15637E1581K533j1349q561O49K1414r424o741J0849Q265J5370m410k2505j1561
$$ 51581 54114 42765 34204 34853 56267 46843 40102 50951 59216 74586 70176 47671 36110
15624C6110k149N915j5486n17R464J1652J5408r331j5623j3582n073K1457O874
$$ 36110 33961 39876 24390 23873 33337 44989 60397 51066 35443 21861 16788 38245 45119
15611D5119j2928J6512j2050j0137M638J2209j827K3946m804n939j2986j457O832
$$ 45119 32191 48703 36653 26516 31154 43363 41536 65482 60678 54739 41753 40296 47128
15598D7128k1510l3463j3352Q017K8044j2548j3067l812K7465K5468R567k69j4149
$$ 47128 25618 -7845 -21197 -13180 14864 2316 -10751 -14563 12902 38370 47937 47668 33519
15585C3519k8727J142L3134J0419L896j3921j9821k0516L6263J4660j8349j8542
$$ 33519 4792 5934 39068 49487 53383 39462 19641 -875 35388 50048 31699 13157
15573A3157n241J2881K324R154L5627j0033j7751K539p994Q848o030p870j6448
$$ 13157 7916 20797 23121 32275 67902 57869 40118 42657 34663 43511 37481 29611 13163
15560A3163R299K3755P008p185J6411J708j5266j4796k5113j03K5118j1990P8
$$ 13163 22462 46217 53225 46040 62451 64159 48893 34097 8984 8881 33999 22009 22087
15547B2087j3504J1916K998N453J1594j7371k1716k335k111j631J2333M1453K1932
$$ 22087 8583 20499 23497 28950 40544 23173 1457 -878 -2989 -4620 7713 49166 71098
15534G1098l4392j8521m738p90k776Q76p54R000J5042J4834q710k3993j6796J9610
$$ 71098 36706 18185 13447 12657 9881 10757 10003 19003 34045 48879 40169 16176 -620 18990
15520A8990P558L486J0933J1125j8055j630k0726N076L6232O714k5409j2078Q279
$$ 18990 26548 30034 40967 52092 34037 32407 11681 16757 52989 59703 34294 22216 30495
15507C0495J4985n461J753j1036K72K685j9052J1305J6885K5268J9924l14l7701
$$ 30495 45480 40019 41772 30736 31008 33693 14641 25946 42831 68099 88023 87709 50008
15494E0008k8265p347k4222O066o797J9474K2471q147j1061Q175l155q349n365
$$ 50008 21743 14396 -9826 -3760 -10557 8917 31388 23241 12180 20355 17200 8851 3486
15481C486j8288O439k322J9673K3936L1225n886j6486l339L547N674j3541k1747
$$ 3486 -14802 -8363 -10685 8988 32924 64149 58263 41777 38438 41985 47659 34118 12371
15468A2371K874K103k3785K7917K2880N117k088k9995n268P954m617O254J8442
$$ 12371 15245 17348 -6437 21480 44360 49477 47389 17394 12126 20080 15463 21717 40159
15455D0159J4541j6136n337j2940J495j7067J8092K1953q290P858n872l8456j348
$$ 40159 54700 38564 33227 20287 21782 4715 22807 44760 36470 44328 38456 0 -1348
15442a348J418J1337K834j881K1391M501k3813Q170J2057o502J5973r917j5307
$$ -1348 70 11407 14241 12360 33751 38252 14439 22609 34666 28164 44137 34220 18913
15429A8913J9944J2076L6637J6626J7720l1230m0391m8247q333m848o656M2504
$$ 18913 38857 50933 87570 104196 121916 90686 50295 2048 -6285 -11133 -17789 24715
15417B4715j6401K0393O3636K7340l8324p8515j9159L0371K4621r303j2794K0089
$$ 24715 8314 28707 92343 119683 81359 2844 -16315 14056 38677 29374 16580 36669
15405C6669j3220m3073K417J3920k2675J8458j611J1928J3371l72O254K206k3213
$$ 36669 23449 -19624 -17207 -3287 -25962 -7504 -9115 2813 16184 15812 22066 24272 1059
15392A059M257p093L1795J6149k4339j7052J8869J6224J5671P266m119R691R038
$$ 1059 5316 -1777 30018 46167 21828 4776 23645 39869 55540 62806 58687 68378 77416
15379G7416j8112l4535l218q637j3895k208M395J2464l129j0209J7213j8348m261
$$ 77416 59304 24769 21551 12914 -981 -3189 1206 13670 10541 332 17545 -803 -5064
15366e064R951J915m167J7663L859j1148j6353j1326P992J0095R196J7328N125
$$ -5064 4887 6802 2635 20298 24157 13009 -3344 -14670 -6678 3417 12613 29941 35066
15353C5066n105q722j434k0497o68L9428k45k9566R420M208l830J5951j784q727
$$ 35066 29961 21239 19805 -692 -1360 38068 37823 8257 17677 21885 18055 34006 32222 23495
15339B3495j4266K115k409N352j6608k5365j4806J2065m075J8027N841j0751K9097
$$ 23495 9229 11344 8935 14287 -2321 -27686 -42492 -30427 -34502 -16475 -10634 -21385 7712
15326G712K7001J9759q953p815k650j0665J3699l3634O646L2851Q344j766k7341
$$ 7712 34713 54472 45519 37704 35054 24389 38088 4454 11100 43951 52295 50529 23188
15313B3188j5635p687J0873o823n316O294k0001q305J2437J5589J3838Q861k5109
$$ 23188 7553 -134 10739 3916 -1400 4894 -15107 -23412 -10975 4614 18452 27313 2204
15300B204j5504L3240L4971l328k329j1516j7341Q857J164k747J4608l641k5007
$$ 2204 -13300 19940 54911 51583 49254 37738 20397 29254 30418 27671 42279 38638 13631
15287A3631J1221q525j1101Q842K3320P851l316J3968M900R722j1023j1203j2523
$$ 13631 24852 16327 5226 14068 37388 45239 41923 55891 60791 70513 59490 48287 35764
15274C5764j5762k4357o425J6565J118R71l693R053L319j2698l0952q787J274
$$ 35764 20002 -4355 -10780 5785 6903 7874 4181 13234 16553 3855 -27097 -35884 -34610
15261c4610q789J0373J7150l76K931M902o728J917P244j9088k4862K1624K6242
$$ -34610 -43399 -33026 -15876 -16252 -13321 -8419 -15147 -13230 -5986 -25074 -49936 -28312 -2070
15248b070l753P383N77M756m108J7339L1648P329k6242k7068o007J7077k848j9199
$$ -2070 -5823 1560 2137 6893 2785 20124 51772 59101 32859 5791 -216 16861 14013 -5186
15234e186K9361K1225j3733m647P791N633k6472J639p793M198P31l285l0513k1273
$$ -5186 24175 45400 31667 27020 34811 40444 13972 15611 7818 12016 12747 9462 -21051 -42324
15220d2324J5681L5754Q811k528J2587L456o26l177j6140L777R279J3667k2212
$$ -42324 -26643 9111 17922 15394 27981 31437 30811 27634 11494 15271 24550 38217 16005
15207A6005o568J9679j5054R122K0357o589l4786j2442L473J280l91O462p214
$$ 16005 9437 29116 14062 23184 43541 36952 2166 -10276 -6803 -5523 -5914 548 -6666
15194f666J8206n507k2224o621J6008J0727J3730K3039J4746k5803k5673J5448
$$ -6666 11540 6033 -16191 -22812 -6804 3923 17653 40692 55438 29635 3962 19410
15182A9410J3148M952p240L0221P724k0191k2707J5466M467j585j0221J1341j2620
$$ 19410 32558 37510 30270 60491 68215 48024 25317 40783 45250 43665 33444 44785 32165
15169C2165j4434P727J3588Q907O272j814j1783j6330r628K5971L602l2220k7870
$$ 32165 17731 25458 39046 47953 54225 52411 40628 24298 14670 40641 44243 12023 -15847
15156a5847K4472n464j8388J4898M819J326k7120Q560J6052K3467J9989l732l1592
$$ -15847 8625 3161 -15227 -329 4490 5816 -21304 -12744 3308 26775 46764 43032 11440
15143A1440L440K9359q319k2347K3801R432Q469N711j4431k4464q310n98N946
$$ 11440 14880 44239 35920 13573 37374 46806 55275 60986 46555 22091 13781 13183 19129
15130A9129p473N55j3459L6854K183m3414l1556o287J9873J3287j7935N976R277
$$ 19129 11656 12211 -1248 35606 37789 -5625 -37181 -43468 -23595 -10308 -28243 -22267 -12990
15117a2990p662J7297K2048K851J1788J4821J0831r764j4232j4258j6961j1207
$$ -12990 -20652 -3355 18693 21544 33332 48153 58984 49220 34988 20730 3769 -7438
15105g438q536j0312J2124J4162O359j5490k2424N352J3231r21J1359O722j1211
$$ -7438 -15974 -26286 -14162 0 6359 -9131 -31555 -26203 -12972 -13893 -2534 4188 -7023
15092g023m930j1314K1096P838k939j6123J1618P808r354K0774k998k1969R715
$$ -7023 -11953 -23267 -2171 5667 2728 -13395 -1777 6031 -3323 17451 14453 -7516 2199
15079B199K5384R118m2965m557K4613N512p123K960k901Q511j3345j7540J5863
$$ 2199 27583 36701 -6264 -10821 13792 19304 12181 15141 12240 20751 7406 -10134 5729
15066E729j4004p431j6140J8071l033M660M777L708P09j099n637K3456J0195j8840
$$ 5729 -8275 -15706 -31846 -13775 -16808 -12148 -7371 -3663 -2954 -4053 -9690 13766 23961 5121
15052E121k0723r237K1516K0794r571l3991O103l713l649N410M3788Q873j9207
$$ 5121 -15602 -24839 -3323 17471 7900 -26091 -19988 -23701 -27350 -21940 21848 30721 11514
15039A1514k6279m0945L8332K2107l349j4024q232r379r529j7893J2275o290L3797
$$ 11514 -14765 -55710 -17378 4729 1380 -12644 -20876 -30255 -39784 -57677 -45402 -51692 -17895
15026a7895J9985j2699k2538l6371J9860M7776M6231p405j3919Q377j7265j9011
$$ -17895 2090 -10609 -33147 -69518 -49658 -1882 44349 36944 23025 31402 14137 -4874
15014d874k5607K6590L6369J963j6292o167J893p25J8104J8334j0696j4991N918
$$ -4874 -30481 -3891 32478 34441 18149 11982 13875 13150 31254 49588 38892 23901 29819
15001B9819n344K7163j0578k8036L4359J2928m1881m85M943m291J1547q432j6149
$$ 29819 24475 51638 41060 13024 47383 60311 18430 17945 22888 18597 30144 21712 5563
14988E563Q840J9529J5930j9762j6227k6126J2991J605L701r923m291l257l263
$$ 5563 14403 33932 49862 30100 13873 -12253 738 2343 6044 -3879 -8170 -11427 -14690
14975a4690K0267q279K740o500L960J5532p345j8625o348J7809J2220j2526j6607
$$ -14690 5577 -2702 38 -6462 -2502 13030 5685 -12940 -19288 -1479 10741 -1785 -18392
14962a8392K1883L4516J9963l1335j4343K5549p893j1007j3989j9872L6001O116
$$ -18392 3491 38007 57970 26635 12292 37841 29948 18941 4952 -14920 21081 27197
14950B7197l741p401j1492O348q681j3530o281j5645k075N337Q470K2125J6202
$$ 27197 23456 16055 4563 10911 2230 -11300 -17581 -33226 -35301 -29964 -21494 631 16833
14937A6833j1089k4253k032M719j5166M328M031J5255j633p812j077p658O300
$$ 16833 5744 -18509 -20541 -15822 -30988 -26660 -22629 -7374 -9007 -16819 -17896 -25554 -19254
14924a9254l955k898p43K8086J2453J0136K694r914m0721j3815L0283n241q936
$$ -19254 -23209 -26107 -26850 1236 13689 23825 26519 16605 -24116 -37931 -7648 -12889 -21825
14911b1825J0567k6135q664L1017J6759j1413J6864O964j1044m726l99j3862N450
$$ -21825 -11258 -37393 -46057 -15040 1719 -9694 7170 14134 3090 -1636 -2035 -15897 -10447
14898a0447J166N39k524Q320J528l027k7398m615l378k3486J3004M1136O169n14
$$ -10447 -9281 -8742 -11266 -2946 -1418 -4445 -31843 -36458 -39836 -63322 -50318 -9182 -3013 -3527
14884c527p57o058k969O134J5124Jp000k5502O897K3592j3392k5678k4901K998
$$ -3527 -4284 -10342 -13311 -7177 7947 7948 948 -24554 -17657 5935 -7457 -33135 -58036 -55038
14870e5038J0234L294J6854q90j0337O448K7938J5441J734m972k2397Q677m621
$$ -55038 -44804 -41510 -24656 -25546 -35883 -29435 -1497 13944 15678 10706 -11691 -3014 -7635
14857g635L1146J0536k0327k0944K5668N659j6627m953J9974o84K8000M351j2940
$$ -7635 23511 34047 13720 -7224 18444 24103 7476 2523 22497 21813 49813 54164 41224
14844D1224j7762j3425n596k5587p137K3966r105j2693K2271K9715k6846j6074
$$ 41224 23462 10037 4441 -21146 -28283 -4317 -13422 -26115 -3844 25871 -975 -17049
14832a7049R066j8403O028K1922K720l6067j8778J9070J5414P622n85j7238K697
$$ -17049 -7983 -26386 -20358 1564 4284 -31783 -50561 -31491 -16077 -8455 -9040 -26278 -23581
14819b3581J5829l916j2276K2752K6092j0295j8129Q515k0690o16J1089L193J5170
$$ -23581 -7752 -11668 -23944 -1192 24900 14605 -3524 4991 -15699 -16315 -5226 -2033 13137
14806A3137n909k4379J2019n98j3598m571j8745J2143R008J3232j0880j4906J5742
$$ 13137 7228 -17151 -5132 -5730 -19328 -23899 -42644 -30501 -21493 -8261 -19141 -34047 -18305
14793a8305J9485p795j9522J2715K4538J2022o931m9814l2223R897N077Q002J4352
$$ -18305 1180 -6615 -26137 -13422 11116 23138 16207 -33607 -65830 -55933 -50856 -42854 -28502
14780b8502L1002J4832J3946j6728k1951N671j2096j5996K187L300O897j6897
$$ -28502 2500 17332 31278 14550 -7401 -1730 -13826 -29822 -27635 -24335 -17438 -34335
14768c4335r884j1781P387P327J394p604P315L319J1199k311R823J4601j4436
$$ -34335 -44219 -56000 -48613 -41286 -39892 -47496 -40181 -36862 -25663 -27974 -18151 -3550 -17986
14755a7986k1387J8502l400J4583M4705j5924k4178k353R840j4690P025J2234
$$ -17986 -39373 -20871 -24271 -9688 35017 19093 -5085 -7438 2402 -12288 -5263 6971
14743F971J0889K733K1660N791k0703l1456R256r664P913k979j8152J8543Q635
$$ 6971 17860 20593 42253 48044 27341 -4115 5141 -4523 3390 411 -17741 802 9437
14730I437o162P338K0789j4569m700m910N034m39J8062J1415r521k1495j4276
$$ 9437 3275 10613 31402 16833 12133 7223 12257 11818 29880 41295 31774 10279 -3997
14717c997j605q244R947J2931K6088O432n411r679P272M436J559N334j4738k3519
$$ -3997 -5602 -13846 -3899 9032 35120 41552 36141 26462 33734 38170 39729 45063 30325 6806
14703F806l6919k857p924J7286J4696L866R714k7177k8298R487K085m117L3265
$$ 6806 -30113 -32970 -40894 -23608 -8912 -5046 4668 -22509 -50807 -41320 -39235 -43352 -10087
14690a0087L636J2151N099q067j2173N227k563k136J291Q847j0668R019l390k595
$$ -10087 -6451 5700 10799 2732 -9441 -4214 -6777 -8913 -7622 1225 -9443 -424 -3814 -6409
14676f409j6289J137O70j891j868O950m489k9003N43K9490M854j8265l0857J0634
$$ -6409 -22698 -21561 -20891 -22782 -24650 -17700 -22189 -51192 -50649 -21159 -16305 -34570 -65427 -54793
14662e4793R800j3909J7299L3781K7835L8814j3692j0228j6977j3281j1280J1947
$$ -54793 -44993 -58902 -41603 -7822 20013 58827 45135 34907 17930 4649 -6631 5316
14650E316p760p041m223j0649L73K2285J0389J6873j2466j2401L439r188p702
$$ 5316 -2444 -9485 -13708 -24357 -23984 -1699 8690 25563 13097 696 4135 -5053 -12755
14637a2755k9356j782R086J1496L1219j5371k4814K202R803K2437L13k9355M980
$$ -12755 -42111 -43893 -34807 -23311 7908 -7463 -32277 -30075 -20272 2165 2478 -26877 -21897
14624b1897J316p829l501j5615J0112K2777J0211q204j2656P97j4572J4902l326
$$ -21897 -20581 -28410 -31911 -47526 -37414 -14637 -4426 -12630 -25286 -24489 -39061 -24159 -27485
14611b7485j1918J6222K269j2177J2502O983r205N94l2885k2618J7451M2405K9462
$$ -27485 -39403 -23181 -20912 -33089 -20587 -13604 -22809 -22215 -55100 -77718 -60267 -17862 11600
14598A1600J9888M480P055m388j0130j9600l6831J2443K3359k038l4514J0415
$$ 11600 31488 35968 43023 38635 28505 8905 -27926 -15483 7876 5838 -28676 -18261
14586a8261P376M431m300q342K822o222M958K8869n204k1243N657k1078j5979
$$ -18261 -10885 -6454 -10754 -19096 -16274 -22496 -17538 11331 6127 -15116 -9459 -30537 -46516
14573d6516j5477o089L7619J5855N987k5904N285L511p465l082J0094O422k5651
$$ -46516 -61993 -68082 -30463 -14608 -8621 -34525 -29240 -25729 -33194 -36276 -26182 -19760 -45411
14560d5411j1124K9456L1658P123K896O818n732K800q521l5718j0568o097M962
$$ -45411 -56535 -27079 4579 11702 14598 21416 15684 18484 9963 -25755 -36323 -42420 -37458
14547c7458K7523L3752l423o841k7283q925p224K2934J0735j787k713r400l6966
$$ -37458 -9935 23817 20394 13553 -13730 -22655 -29879 -6945 3790 2003 -710 -10110 -47076
14534d7076k4123J0591J8317J7553J8559j4920j3178L0343J2775k116k171N879
$$ -47076 -71199 -60608 -42291 -24738 -6179 -21099 -34277 -3934 8841 6725 4554 10433
14522A0433J124J9673J0368n0312j5429l616J5426J1036k8039j657J3481j8112
$$ 10433 11557 31230 41598 -8714 -24143 -27759 -12333 -1297 -29336 -30993 -17512 -35624
14510c5624j921k2566j948Q336n462j5060j0616J118l836M450L7214N884J2749
$$ -35624 -37545 -60111 -62059 -53723 -59185 -74245 -84861 -83743 -87579 -83129 -45915 -40031 -27282
14497b7282n621j8049M419j3455K6409K2653r912Q097J5745k22J7065k510k459
$$ -27282 -32903 -50952 -46533 -59988 -33579 -10926 -20838 -12741 3004 2782 19847 17337 14878
14484A4878M075k0080N699j9609k9389J3271J6737O201K6062O102m446k8892k4984
$$ 14878 18953 -1127 4572 -15037 -44426 -31155 -14418 -8217 17845 23947 19501 -9391 -34375
14471c4375J5973l358J4030Q233k9877N692k894j5929J5735L6234J6848k8030
$$ -34375 -18402 -21760 -7730 503 -29374 -23682 -26576 -42505 -26770 9464 26312 -1718
14459a718j0882k0457j8897j1452q582Q156K4756J4088q720p204K7248Q201r36
$$ -1718 -12600 -33057 -51954 -63406 -71988 -63832 -39076 -24988 -33708 -40912 -13664 -5463 -6399
14446f399l772r816J2275K0326k654r242l0934j2129O524K5058L349R435J5799
$$ -6399 -10171 -19987 -7712 12614 9960 718 -30216 -42345 -35821 -10763 -7414 2021 17820
14433A7820n753k6085k3149J2106Q498p179K19J4635K1151M43j0460J2645m459
$$ 17820 12067 -14018 -37167 -25061 -16563 -23742 -23523 -8888 12263 12706 2246 14891 10432
14420A0432j2934l0330k3030L9493J3034l011P032q629j6567j7645r297j8789
$$ 10432 -2502 -32832 -55862 -16369 -3335 -6346 686 -7943 -24510 -42155 -51452 -70241
14408g0241R991p955m391J5317K5098K0876J7449p255j1116j90r792j2153J965
$$ -70241 -60250 -68205 -72596 -57279 -32181 -11305 6144 -1111 -12227 -12417 -22209 -34362 -32397
14395c2397M963o132P310J5876L98j2550O201J3009J275k201l091j4784j4761
$$ -32397 -27434 -33566 -26256 -10380 -9982 -22532 -16331 -3322 -2047 -4248 -7339 -22123 -36884
14382c6884q931P46N3139M9929l009j1989l0167k1222k9600j4426o783L233L6237
$$ -36884 -45815 -45069 8070 57999 54990 43001 12834 -8388 -37988 -52414 -59197 -55964 -19727
14369a9727K0745j990l3791j2295P972J9710o324m766l8519j1853N156K3958j571
$$ -19727 1018 -972 -34763 -47058 -39086 -19376 -25700 -30466 -68985 -80838 -75682 -51724 -53295
14356e3295L086J4682Q280N014k196j427J7007n542R219K3079R300M450k3720
$$ -53295 -50209 -35527 -27247 -22233 -24429 -25856 -8849 -14391 -5172 17907 27207 31657 7937
14343G937l0977j4638M474m510J5441J0930q905R192K2261j3443J1866J0650k0114
$$ 7937 -23040 -37678 -33204 -37714 -22273 -11343 -20248 -11056 11205 -2238 9628 20278 164
14330A64l8524L100K6513K0267k1184l6948J1566K5612j2154j1929n106L5093
$$ 164 -38360 -35260 -8747 11520 -9664 -46612 -35046 -9434 -21588 -33517 -38623 -3530
14318c530N208L37j6786O864J4485k3238m376K9981R394j6175m521r137p213M941
$$ -3530 1678 2015 -14771 -7907 6578 -16660 -21036 8945 18339 2164 -2357 -11494 -18707 -13766
14304a3766K738L295j6234j0251L2533N2132j7115k7791j3297k347k787j9576
$$ -13766 -11028 -7733 -23967 -34218 -1685 50447 33332 5541 -7756 -10103 -12890 -32466
14292c2466Q732K9313j2709p569l5391k3085j384j4921k937J3423J0921J8002
$$ -32466 -23734 5579 -7130 -14699 -50090 -73175 -74559 -89480 -92417 -78994 -68073 -50071
14280e0071J153K314K0438J2846q379K303j2100r313O335p353r692J4310J1165
$$ -50071 -48918 -46604 -26166 -13320 -21699 -19396 -31496 -40809 -34474 -41827 -51519 -37209 -26044
14267b6044K354j4769l528j0148m367J4850J3405J6251K377j5339j8512J286K7598
$$ -26044 -23690 -38459 -41987 -52135 -56502 -41652 -28247 -11996 -9619 -24958 -43470 -42184 -14586
14254a4586k9829j6971j795L56K3459j7751J1149K6256j643j081K7728K6411q488
$$ -14586 -44415 -61386 -63181 -62825 -39366 -57117 -45968 -19712 -21355 -22436 5292 31703 23215
14241B3215j4666o463j1570K002K2102k0545k5955R149Q575j6565Q766J9339J1151
$$ 23215 8549 2086 -9484 -7482 14620 -5925 -31880 -22731 -14156 -30721 -21955 -2616 8535
14228H535j5689p373M692j3103k841L107J9758k829l2925L085Q525o112J0335
$$ 8535 -7154 -14527 -9835 -22938 -25779 -22672 -2914 -5743 -38668 -35583 -27058 -33170 -22835
14215b2835M713M58l7941J101M1058n809k0524j2896q19N362J3007J6953m616
$$ -22835 -18122 -17664 -55605 -54504 -13446 -19255 -39779 -52675 -53494 -48132 -35125 -18172 -22788
14202b2788M709j2869J2092J0045N16k9936m993J758O263J6544j9852j9688K7866
$$ -22788 -18079 -30948 -18856 -8811 -8295 -38231 -43224 -41466 -35203 -18659 -38511 -58199 -30333
14189c0333L5108m93k5559k4846j0115l020j8699K2505Q560p181J1717J0014J9531
$$ -30333 4775 4282 -21277 -46123 -56238 -59258 -77957 -55452 -46892 -54073 -42356 -32342 -12811
14176a2811k484N168J591k6504l1275k4257R39K3198p886P294L0233K4911J4999
$$ -12811 -15295 -10127 -8536 -35040 -66315 -90572 -89633 -66435 -74321 -67027 -36794 -11883 3116
14163C116q230J5549j4678j3888r845M714n287J542j6125K0219J5108j3311j0617
$$ 3116 -5114 10435 -4243 -18131 -27976 -23262 -28549 -27007 -43132 -22913 -7805 -21116 -31733
14150c1733j679J086K7055N035J0679N004k4305k1779J4397l690p301J00R2Q775
$$ -31733 -33412 -32326 -5271 -236 10443 15447 -8858 -30637 -16240 -19930 -27231 -27131 -27039 -18264
14136a8264m47K405k4056k6818L47m747J1514L5200K1351k0912J0225J1315L318
$$ -18264 -18711 -16306 -40362 -67180 -66833 -71580 -60066 -24866 -3515 -24427 -14202 -2887 431
14123D31o23l545k2482l2214K7867j1847k2784J3750K2516J3860R56L69j4426
$$ 431 -192 -3737 -26219 -58433 -30566 -42413 -65197 -51447 -28931 -15071 -14115 -13746 -28172
14110b8172l8506J6652L4414J8725O32J1149n912k568j4503j9405P32L425P197
$$ -28172 -66678 -50026 -15612 3113 3745 14894 8982 6414 -8089 -27494 -26762 -23337 -16140
14097a6140K934j0094j0776M2889L6842k4684j3191l686q381o469l1066J304K8159
$$ -16140 -13206 -23300 -34076 8813 45655 20971 7780 4094 -4287 -10756 -41822 -40518 -12359
14084a2359l60k896j0722q865j6530k08j8448O856L1437K4549K4778q643l0039
$$ -12359 -12719 -15615 -26337 -35202 -51732 -51940 -70388 -63532 -32095 -7546 17232 8589 -21450
14071b1450j6826P990K036n781m341M110K3443N502k0682k0615L4145K4512l5423
$$ -21450 -38276 -30286 -28250 -34031 -38372 -34262 -10819 -5317 -25999 -46614 -12469 12043 -23380
14058b3380l5968K1283J3846o155q851O895q145l852K3097M588l0640q049L285
$$ -23380 -59348 -38065 -24219 -30374 -39225 -32330 -40475 -44327 -21230 -16642 -47282 -55331 -52046
14045e2046o902J9061K3143n480j4836q362N197J0324P675J9476O888o523R049
$$ -52046 -58948 -39887 -16744 -22224 -37060 -45422 -40225 -29901 -22226 -2750 4138 -2385 6664
14032F664K1337n403j1956m5942o659J0365k264J3555P282J5536l6016L405L0503
$$ 6664 28001 22598 10642 -35300 -41959 -31594 -33858 -20303 -13021 2515 -33501 -30096 407
14019D07l230k3552N342j5018m684P095p306j0407K0789N994q116n603l465J6659
$$ 407 -2823 -26375 -21033 -36051 -40735 -33640 -40946 -51353 -30564 -24570 -32686 -38289 -41754 -25095
14005b5095J3981k58P898R721r612l276k5647k5014k438M580m900J6770J0395
$$ -25095 -11114 -11372 -3474 6247 -3365 -6641 -32288 -57302 -59740 -55160 -60060 -43290 -32895
13992c2895j957L09N04l7Q390q085J9965l551K518j7851Q252J3072J1180J9633
$$ -32895 -34852 -34543 -34039 -34076 -25686 -33771 -13806 -17357 -14839 -32690 -24438 -11366 -186 19447
13978A9447p355l2730j7684j5788m091k9389k550L3278l125L3477M933q899l9844
$$ 19447 12092 -20638 -38322 -54110 -58201 -87590 -90140 -56862 -59987 -26510 -21577 -30476 -70320
13965g0320k9732K5478K6450k057k143K3976p634J0977J7252l4258l0778J9450
$$ -70320 -100052 -74574 -48124 -50181 -52324 -28348 -35982 -25005 -7753 -42011 -72789 -53339
13953e3339M7330J8324K8462m238k8041k468k599j9128k834j5007N750J2810O613
$$ -53339 -6009 12315 40777 36539 8498 6030 3431 -15697 -18531 -33538 -27788 -14978 -8365
13940h365j8259K7515k223k4408j401j1737j1039n412l018J0146n710k5152J5820
$$ -8365 -26624 891 -1332 -25740 -27141 -38878 -49917 -55329 -58347 -48201 -53911 -79063 -63243
13927f3243M5967j0284k3896k847K6256J1327j6354P937j9939l6713p443K9965
$$ -63243 -17276 -27560 -51456 -54303 -28047 -16720 -33074 -25137 -45076 -81789 -89232 -59267
13915e9267J2496N798j1634L220J0608p999j3800K7675j0n394Q527j3292j9076
$$ -59267 -46771 -40973 -52607 -49387 -38779 -46778 -60578 -32903 -32913 -38307 -29780 -43072 -62148
13902f2148L5453J6934j7384r588j0591R394J2278R876k2404n623k15O667j6803
$$ -62148 -26695 -9761 -27145 -36733 -47324 -37930 -25652 -15776 -38180 -43803 -44018 -37351 -54154
13889e4154Q674J3173k5888l28K5989K153J1112R823j0799P574N476N441k435
$$ -54154 -45480 -32307 -58195 -58523 -32534 -30381 -19269 -9446 -20245 -12671 -7195 -1754 -4189
13876d189J6463j4180k3760j4107k04J0204J8079o998q477q633K8868K434L761
$$ -4189 12274 -1906 -25666 -39773 -39977 -29773 -11694 -18692 -27169 -35802 -6934 -4500 -739
13863g39J3064r644m740k7251j8413J0802M409L653j7952j1925j2374m452J3310
$$ -739 12325 2681 -2059 -29310 -47723 -36921 -32512 -28859 -46811 -58736 -71110 -75562 -62252
13850f2252K0453J6996k1534k2180r086M911L8235J9173J1331k3712K1059M192
$$ -62252 -41799 -24803 -46337 -68517 -77603 -72692 -34457 -15284 -3953 -27665 -6606 -2414
13838b414k5568J0076j3682k1336o827J5740J9516J5017J1188j2151j5606J5181
$$ -2414 -27982 -17906 -31588 -52924 -59751 -44011 -24495 -9478 1710 -10441 -26047 -10866
13826a0866o925k2132P564J7300j3775j1116M016J5263j5781K009p881l0805L2769
$$ -10866 -17791 -39923 -32359 -15059 -28834 -39950 -35934 -20671 -36452 -34443 -42324 -73129 -40360
13813d0360j919k065o345L867j9293J9230l890r865J3012J5705k557p971J6486
$$ -40360 -42279 -44344 -50689 -46822 -66115 -46885 -50775 -60640 -47628 -31923 -34480 -42451 -25965
13800b5965k1499j2668J0275J7282K0620q542j2817k2508N557K6369J2723n711
$$ -25965 -47464 -60132 -49857 -32575 -11955 -20497 -33314 -55822 -50265 -23896 -11173 -16884
13788a6884j8033n410K0355J4294J833k1828n537j2377j5378Q486K6725J3297
$$ -16884 -34917 -40327 -19972 -5678 -3845 -25673 -31210 -43587 -58965 -50479 -23754 -10457
13776a0457J385Q704N436L837n4126l5568l856K5008K2918K4275K3021p748m3399
$$ -10457 -9072 -368 5068 8905 -45221 -80789 -84645 -59637 -36719 -12444 10577 2829 -40570
13763d0570k2157q394R117m894K2782M5778J0559j2759n1432m975K3336m451K5152
$$ -40570 -62727 -71121 -62004 -66898 -44116 1662 12221 -538 -51970 -56945 -33609 -38060 -12908
13750a2908J659j1807M133l14k471J7561J6375j9977m1J0603m824o437j9829j9963
$$ -12908 -11249 -23056 -18923 -19237 -21708 -4147 12228 -7749 -7790 2813 -2011 -8448 -28277 -48240
13736d8240Q005P703m92l09j2598Q163K929J3482R269K906k2238l7001l814K4855
$$ -48240 -40235 -32532 -33024 -33333 -45931 -37768 -34839 -21357 -12088 -9182 -31420 -68421 -72235 -47380
13722d7380L9662M291j6347j1611J9268j2492l3589M725j7254N930L6033Q872
$$ -47380 -7718 -3427 -19774 -31385 -12117 -24609 -58198 -53473 -70727 -64797 -28764 -19892
13710a9892J544j7728l3310J904j5825R19J6602Q59Q627K853k0287J1651Q569
$$ -19892 -18348 -36076 -69386 -67482 -83307 -82388 -65786 -64927 -56300 -53447 -73734 -62083 -53514
13697e3514J7124K2420K151m073k8483o247k932p057Q829k114j8654j361P876
$$ -53514 -36390 -13970 -11819 -15892 -44375 -50622 -53554 -60611 -51782 -53896 -72550 -73911 -66035
13684f6035k5373j5122L5616L0685K9735m479l1996L964J6482j0256q914l721
$$ -66035 -91408 -106530 -70914 -40229 -10494 -14973 -46969 -43005 -26523 -36779 -45693 -49414
13672d9414j6607O540M299Q115L7199J5185k3539j2468K2449J7663J551j1325
$$ -49414 -66021 -59481 -55182 -47067 -9868 5317 -18222 -30690 -8241 9422 10973 -352
13660c52k6494J0454Q403j1121J9331N131j5436l441q982j4534M923l469J2290
$$ -352 -26846 -16392 -7989 -19110 221 5352 -10084 -13525 -22507 -37041 -32118 -35587 -23297
13647b3297k1694j0902j1681r0J7108M829L851O435P313J0005l061J4588p177
$$ -23297 -44991 -55893 -67574 -67664 -50556 -45727 -41876 -35441 -28128 -18123 -21184 -6596 -13773
13634a3773M561R746J8947j6054k3431q985j0554j6426R902Q485j125q035J1719
$$ -13773 -9212 534 19481 3427 -20004 -28989 -39543 -55969 -46067 -37582 -38707 -46742 -35023
13621c5023P152Q601r289O610J9375K768l8790k0968j5916J2918R725O0K8370
$$ -35023 -27871 -19270 -28559 -21949 -2574 194 -38596 -59564 -75480 -62562 -52837 -52777 -24407
13608b4407J6508l4791O782q039J441L6851o495j7675l341K185J3774K0411m255
$$ -24407 -7899 -42690 -35908 -43947 -42506 -5655 -12150 -29825 -33166 -30981 -17207 3204 -1051
13595a051j4018K7372J2746o570l4496j3686j1944j4787J0801K5688J4500m590
$$ -1051 -15069 12303 25049 18479 -16017 -29703 -41647 -56434 -45633 -19945 -5445 -10035
13583a0035k3941j8761j7381J5533p100J0187J6379q394l822K7629O546J1609
$$ -10035 -33976 -52737 -70118 -54585 -61685 -51498 -35119 -43513 -47335 -19706 -13160 -1551
13571a551o863O795l710j6619J937j0941k6488M9326M3033Q206l8971k8190J3038
$$ -1551 -8414 -1619 -5329 -21948 -20011 -30952 -57440 -8114 34919 43125 4154 -24036 -10998
13558a0998K7964p105J2210k981j7740k739p661q958k0792n731J0066J7363k626
$$ -10998 16966 9861 22071 19090 1350 -1389 -9050 -18008 -38800 -44531 -34465 -17102 -19728
13545a9728j0216j4173K236J5655J0600N39m998J493j7065O644J0828K4823j8950
$$ -19728 -29944 -44117 -41881 -26226 -15626 -15087 -20085 -18592 -35657 -29013 -18185 6638 -12312
13532a2312j6929K5186J5604j7847j646j3580j3427J621m557l8414J6914K0850
$$ -12312 -29241 -4055 11549 -6298 -7944 -21524 -34951 -33330 -37887 -76301 -59387 -38537
13520c8537J0606j2786o18J2673k1553k9937K5695J9829l406J3610J1046l546
$$ -38537 -27931 -40717 -41335 -28662 -50215 -80152 -54457 -34628 -38034 -24424 -13378 -16924
13508a6924n525p569o431k0264j0808j740J5467J1010K6649p060J353j19q180
$$ -16924 -22449 -30018 -36449 -56713 -67521 -69261 -53794 -42784 -16135 -23195 -21842 -21961 -30141
13495c0141l269J7968j1303l7894K4749Q563l5623k4677J8293O369j1610R898
$$ -30141 -33410 -15442 -26745 -64639 -39890 -31327 -66950 -91627 -73334 -66965 -78575 -68677
13483f8677N90L608J0927p934n1431K7661K8807O056K821j6626r98J098K4K6242
$$ -68677 -68087 -64479 -53552 -61486 -112917 -85256 -56449 -50393 -47572 -64198 -65196 -64098 -64074 -37832
13469c7832J1155J6714n978l2268j31p058k8475K1614J0352k5169j1276M2692
$$ -37832 -26677 -9963 -15941 -48209 -48340 -55398 -83873 -62259 -51907 -77076 -88352 -45660
13457d5660J6010j8418P362N460Q967P792j2500P809r579j4531Q625L839r089
$$ -45660 -29650 -48068 -40706 -35246 -26279 -18487 -30987 -23178 -32757 -47288 -38663 -34824 -43913
13444d3913J565j262J6479j6471O862q336j0360j271K1804L6184j0138m275k0995
$$ -43913 -42348 -43610 -27131 -43602 -36740 -45076 -55436 -56707 -34903 1281 -8857 -13132 -34127
13431c4127J7610k0262j4496K6658J1776l05p540j385q263j0315j0127l694m260
$$ -34127 -16517 -36779 -51275 -24617 -12841 -13146 -20686 -22071 -30334 -40649 -50776 -54470 -58730
13418e8730p654J5511l858K6J3666P435J1010J6911k2439k1258j1532P229k159
$$ -58730 -66384 -50873 -54731 -54705 -41039 -33604 -22594 -5683 -28122 -49380 -60912 -53683 -55842
13405e5842J0534P814k2863k0075r079J9072J8622J6090L984o172N871o612l3914
$$ -55842 -45308 -37494 -60357 -80432 -89511 -70439 -51817 -35727 -31743 -37915 -32044 -38656 -72570
13392g2570J669J0045J5068O2105J4989k149m7152j0055n590J1488K497n863j5531
$$ -72570 -70901 -60856 -45788 16317 31306 29157 -17995 -28050 -33640 -22152 -19655 -25518 -41049
13379d1049k4457k805L1348N455K1364k9819j2125O558j2784r038K6701J6380
$$ -41049 -65506 -68311 -36963 -31508 -10144 -39963 -52088 -45530 -58314 -67352 -40651 -24271
13367b4271p29K2019j5552j176j4541L09K7362q983M281L0795n881l9196k5530
$$ -24271 -25000 -2981 -18533 -19709 -34250 -33941 -6579 -15562 -11281 19514 13633 -25563 -51093
13354e1093j0412k2342R571L0684P700j3351k7744o3J5466J2262N434j8882k246
$$ -51093 -61505 -83847 -74276 -43592 -35892 -49243 -76987 -77050 -61584 -49322 -43888 -62770 -65016
13341f5016J4308J9837K1192l6509k5064K3248O108k566J978K919q589L635m312
$$ -65016 -50708 -30871 -9679 -46188 -71252 -48004 -41896 -44462 -42484 -39565 -48154 -44519 -48831
13328d8831r381l532P558p859q709p120K883J9201L0620k0088J2573J2562J7184
$$ -48831 -58212 -61744 -54186 -62045 -70754 -77874 -74991 -55790 -25170 -45258 -32685 -20123 -2939
13315b939K41j6368j180j4019j8908j351L5175K090j6311q760q092j9618o641
$$ -2939 -2698 -19066 -20246 -34265 -53173 -54524 -19349 -17259 -33570 -42330 -50422 -70040 -76681
13302g6681J2781K2750L1768j5842p639j3886l3207o846o29J277K1915K2572k1597
$$ -76681 -63900 -41150 -9382 -25224 -32863 -46749 -79956 -86802 -87431 -86154 -64239 -41667 -63264
13289f3264j6744K0428P180j2793K6750J3164o18j5494j870j7818P055L7299L3806
$$ -63264 -80008 -59580 -52400 -65193 -38443 -25279 -25897 -41391 -43261 -61079 -54024 -16725 17081
13276A7081J5314k4470k399R667k2772k5354J1268q036p021k3459k3237j8063
$$ 17081 32395 7925 5526 15193 -7579 -32933 -21665 -29701 -36722 -60181 -83418 -101481
13264a01481Q987M0750L9307n522K583j7470j8542j292j0085l3828R287K6055
$$ -101481 -92494 -51744 -12437 -17959 -15376 -32846 -51388 -52680 -62765 -96593 -87306 -61251
13252f1251K4998N06j3691j2534m5574L4453O3007j0680l8606r102J0733N308
$$ -61251 -36253 -35747 -49438 -61972 -107546 -73093 -10086 -20766 -59372 -68474 -57741 -52433
13240e2433k2608o159J5078J4637J7571J6701K3385r315m3485j56K7025p161l4542
$$ -52433 -75041 -81200 -66122 -51485 -33914 -17213 6172 -3143 -46628 -46784 -19759 -26920 -61462
13227f1462q607M327M825J7415O013J3472k629R840J4644l2895m219K1466P986
$$ -61462 -70069 -65742 -60917 -43502 -37489 -24017 -26646 -16806 -2162 -35057 -39276 -17810 -9824
13214i824j7503R684N097j3113R95R160N018j4352k2413L1855J5426l1219j0127
$$ -9824 -27327 -17643 -12546 -25659 -24664 -15504 -10486 -24838 -47251 -15396 30 -31189 -41316
13201d1316J4630Q767j3166j5112J3794K5222M960j1277J071m564O238k3611k5146
$$ -41316 -26686 -17919 -31085 -46197 -32403 -7181 -2221 -13498 -12427 -16991 -10753 -34364 -59510
13188e9510j1936J7720j6356o445j3846J4359J7919k333j2101P354k4138O704
$$ -59510 -71446 -53726 -70082 -76527 -90373 -76014 -58095 -60428 -72529 -65175 -89313 -82609
13176h2609N502J2760J5461j2953j9726J0236P589j6782j2113m24l521K172K5068
$$ -82609 -77107 -64347 -48886 -61839 -81565 -71329 -63740 -80522 -92635 -93059 -96580 -94408 -69340
13163f9340j955l767j6656M1514N4535j407j3999k7394j5723m56r115j5684J5951
$$ -69340 -71295 -75062 -91718 -50204 4331 2924 -11075 -38469 -54192 -54648 -63763 -79447 -63496
13150f3496M7474L7187K1174M331l9336l0729k2189q075J3804J091M769j1778
$$ -63496 -16022 21165 42339 46670 7334 -23395 -45584 -53659 -39855 -38764 -33995 -45773
13138d5773j3101Q562p429j6395O350J6710r588j2176m334m733L4814J2031j4158
$$ -45773 -58874 -50312 -57741 -74136 -67786 -51076 -60664 -72840 -77174 -81907 -47093 -35062 -49220
13125d9220k7289J9113Q954r270j3586o92K6036K2796k0393p834k4816k5281J0684
$$ -49220 -76509 -57396 -48442 -57712 -71298 -71990 -45954 -23158 -43551 -51385 -76201 -101482 -90798
13112i0798j4424J1701K5961M4367L7279k8526k9962k662J2570Q092J5170m8491
$$ -90798 -105222 -93521 -67560 -23193 14086 -14440 -44402 -47064 -34494 -26402 -11232 -59723
13100e9723j8244J4615l678J4818p778j1348L9909j010k2214l8466K770K0579
$$ -59723 -77967 -63352 -67030 -52212 -59990 -71338 -31429 -32439 -54653 -93119 -90349 -69770
13088f9770J6031J2608l1323k4254O316J5296K6700N421R510P7K95l010R301K1124
$$ -69770 -53739 -41131 -72454 -96708 -90392 -75096 -48396 -42975 -33465 -33388 -33093 -36103 -26802 -5678
13074e678j7392j5931m0810k7599J7797K8361M4632K9144j2360k1623j5166k6237
$$ -5678 -23070 -39001 -79811 -107410 -89613 -61252 -16620 12524 164 -21459 -36625 -62862
13062f2862N093M3272L308K688K6687K3181O607j8118j615m3316j9820n731p273
$$ -62862 -57769 -14497 -11189 -8501 18186 41367 47974 29856 28241 -15075 -34895 -40626 -47899
13049d7899o509K334N377m729q280J0952J1019J1588o017J2282K0293l059o425
$$ -47899 -54408 -52074 -46697 -51426 -59706 -48754 -37735 -26147 -32164 -19882 411 -2648 -9073
13036i073M789q920P167k0568j8676j2227n383J2169m685J9014k786K0101K0488
$$ -9073 -4284 -13204 -6037 -26605 -45281 -57508 -62891 -50722 -55407 -36393 -39179 -19078 1410
13023A410L250k6216l5571j4490K2645L447L141k528J349K9654M1685M6872k1991
$$ 1410 4660 -21556 -57127 -71617 -48972 -45525 -42384 -44912 -43563 -13909 27776 74648 52657
13010E2657j1596l8994k1203p774Q098q661J3017j1733n7191r658q017P727j0339
$$ 52657 41061 2067 -19136 -26910 -18812 -27473 -14456 -26189 -83380 -93038 -101055 -93328 -103667
12997a03667K7949q447n58L93J6046J5249k1436J384j1162o617M017K0620k236
$$ -103667 -75718 -84165 -84723 -84330 -68284 -53035 -74471 -73087 -84249 -90866 -86849 -66229 -68465
12984f8465N373K0366j6004p167M2657J4057k5247p505j107j1288K5951L7624
$$ -68465 -63092 -42726 -58730 -65897 -23240 -9183 -34430 -41935 -43042 -54330 -28379 9245
12972I245K6964O586O147N069l40K4412J7334n316n4024k6399l3101J6631J5584
$$ 9245 36209 42795 48942 54011 53671 78083 95417 90101 36077 9678 -23423 -6792 8792
12959H792j5438p366m0253m5686Q007L1218O286j5489P235j220K5598K2739l3340
$$ 8792 -6646 -14012 -54265 -99951 -91944 -60726 -54440 -69929 -62694 -63914 -38316 -15577 -48917
12946d8917J26J5801l9046j2292K0713M271j3078K559K68J9495M4839L039l5352
$$ -48917 -48791 -32990 -72036 -84328 -63615 -59344 -72422 -69863 -69595 -50100 -5261 -2222 -37574
12933c7574k1787j8074J8892J136l661K2682M4413L1415k0361j7696j3853j2750
$$ -37574 -59361 -77435 -58543 -57407 -61068 -38386 6027 37442 17081 -615 -14468 -27218
12921b7218J5977K698r876N984j4171R254r497k6145J1844N922o424j4158L930
$$ -27218 -11241 -8543 -18419 -12435 -26606 -17352 -26849 -52994 -41150 -35228 -41652 -55810 -51880
12908e1880L866J4049J0119k6981J3647J7535J9557p939j4431J1002p944k4266
$$ -51880 -48014 -33965 -23846 -50827 -37180 -19645 -88 -8027 -22458 -11456 -19400 -43666
12896d3666k6655J6654R94K5437J3019k8715O794O933q86j3881j0168j7996K929
$$ -43666 -70321 -53667 -52673 -27236 -14217 -42932 -36138 -29205 -30091 -43972 -54140 -72136 -69207
12883f9207K1402Q124m913l2457L440J6823J4731L769J1638m634j8749j5080j2984
$$ -69207 -47805 -39681 -44594 -77051 -73611 -56788 -42057 -38288 -26650 -31284 -50033 -65113 -78097
12870g8097L8542Q497r030k3998j4894L9915J2356k2724j1338M929P159J7128
$$ -78097 -39555 -31058 -40088 -64086 -78980 -39065 -26709 -49433 -60771 -55842 -48683 -31555
12858c1555j6070l2038R271m753J0220L762P505J0082L1427P234j6495M52J7947
$$ -31555 -47625 -79663 -70392 -75145 -64925 -61163 -53658 -43576 -12149 -4915 -21410 -20958 -3011
12845c011j9881k2292L41P345p353k5901j3385N252M9537j8295n0610L035K7442
$$ -3011 -22892 -45184 -44843 -37498 -44851 -70752 -84137 -78885 -29348 -47643 -98253 -95218 -67776
12832f7776k145P378K0715l2468J68k270l550P359K0754K0303Q59k1973K626J2303
$$ -67776 -69921 -62543 -41828 -74296 -74128 -76398 -79948 -72589 -51835 -31532 -30673 -52646 -50020 -37717
12818c7717l364j4837l562j0235J1995m178l336o961m165P364K0609L838k8834
$$ -37717 -41081 -55918 -59480 -69715 -57720 -61898 -65234 -72195 -76360 -68996 -48387 -44549 -73383
12805g3383J2725Q687J1003r122J2552M402k083o543O147q077m025k834p270J0803
$$ -73383 -60658 -51971 -40968 -50090 -37538 -33136 -35219 -41762 -35615 -43692 -47717 -50551 -57821 -47018
12791d7018j938k233K6407M365j2219p436l537p637l2037j0799J9570K1477R46
$$ -47018 -48956 -51189 -24782 -20417 -32636 -40072 -43609 -51246 -83283 -94082 -74512 -53035 -52089
12778e2089O21J4233l834k7588Q256P804k3600o629p707n921L054L296L327L626
$$ -52089 -51468 -37235 -41069 -68657 -60401 -52597 -76197 -82826 -90533 -96454 -93400 -90104 -86777 -83151
12764h3151R89M2817N849j2580J1932N740q800j4741j9063j5988j2813L5751J9364
$$ -83151 -82162 -39345 -33496 -46076 -34144 -28404 -37204 -51945 -71008 -86996 -99809 -64058 -44694
12751d4694k5669L326P614r771R246L091J658q213k652M638j1590p372j1380J809
$$ -44694 -70363 -67037 -59423 -69194 -59948 -56857 -55199 -63412 -66064 -61426 -73016 -80388 -91768 -89959
12737h9959N568J9603O095r708J2345L1513J0704k538n294j5378k2675k864K9419
$$ -89959 -84391 -64788 -58693 -68401 -56056 -24543 -13839 -16377 -21671 -37049 -59724 -62588 -33169
12724c3169J6495J4396j2331m8847J6626J1265Q981J5094J8172k3791k623j8639
$$ -33169 -16674 -2278 -14609 -63456 -46830 -35565 -26584 -11490 6682 -17109 -19732 -38371
12712c8371j2528M199n503O009J0348j8226o96Q819O789J1048J2676j4364j8842
$$ -38371 -50899 -46700 -52203 -46194 -35846 -54072 -54768 -45949 -39160 -28112 -15436 -29800 -48642
12699d8642k0963j4134N890K8893M034l992n509L3546Q76j6834k2115P387J543
$$ -48642 -69605 -83739 -77849 -48956 -44922 -48914 -54423 -20877 -20001 -36835 -58950 -51563 -50020
12686e0020J8290K238P026N959Q083k5923q663q488k9186J2297N2421J4562k4796
$$ -50020 -31730 -29492 -22466 -16507 -8424 -34347 -43010 -51498 -80684 -68387 -15966 -1404 -26200
12673b6200j5739N28m604R377J8563N613j1733J26k1262j5852J1578J6958M926
$$ -26200 -41939 -41411 -46015 -36638 -18075 -12462 -24195 -24069 -45331 -61183 -49605 -32647 -27721
12660b7721n672k7672J0955k179J8127L3025j8154q913Q624k67n301j0042j8170
$$ -27721 -33393 -61065 -50110 -52289 -34162 -1137 -19291 -28204 -19580 -19847 -25148 -35190 -53360
12647e3360J0756n752k1617q478k4188Q227J5255K3633k361J2696j0138J3722
$$ -53360 -42604 -48356 -69973 -78451 -102639 -94412 -79157 -55524 -57885 -45189 -55327 -41605
12635d1605J7354j5356j5082K6256R166k3663k0281j7800j883K5565k882q57j1216
$$ -41605 -24251 -39607 -54689 -28433 -19267 -42930 -63211 -81011 -82894 -57329 -60211 -61068 -72284
12622g2284J7396J5086L131K977Q980o570K710p756j3107l008J1977J5529L673
$$ -72284 -54888 -39802 -36671 -33694 -24714 -31284 -28574 -36330 -49437 -52445 -40468 -24939 -21266
12609b1266P317K390q466k8030J693K3518j38O750J0790l4177l1123Q212O299
$$ -21266 -13949 -11559 -20025 -48055 -46362 -22844 -22982 -16232 -5442 -39619 -70742 -62530 -56231
12596e6231j9280j725K9318K6642q62l7833j7186J393L4094J5678j0990K0028
$$ -56231 -75511 -77236 -47918 -21276 -22138 -59971 -77157 -75764 -41670 -25992 -36982 -16954
12584a6954q809j7052o912N518Q380K2310j783k7645L921J1234j3703k1649n458
$$ -16954 -25763 -42815 -49727 -44209 -35829 -13519 -15302 -42947 -39026 -27792 -41495 -63144 -68602
12571f8602J4929L5881K0839k0293j5121J614j8613O339P087J62j9993J407q067
$$ -68602 -53673 -17792 3047 -17246 -32367 -30753 -49366 -43027 -35940 -35778 -55771 -54364 -62431
12558f2431j2833Q347J9981K214J9900j42k2279J0965J3298N021j6855j2537J5078
$$ -62431 -75264 -66917 -46936 -44722 -24822 -24964 -47243 -36278 -22980 -17959 -34814 -47351 -32273
12545c2273L171j3643J4493Q886J0132q881j6470m3832o13n144J5707L16O051
$$ -32273 -29102 -42745 -28252 -19366 -9234 -18115 -34585 -78417 -79030 -84174 -68467 -68151 -62100
12532f2100J9289M908j4353q263r947J7466R642n453K6595N276o499K989j968
$$ -62100 -42811 -37903 -52256 -60519 -70466 -53000 -43358 -48811 -22216 -16940 -23439 -20450 -22418
12519b2418r298j2552j5712k1048J6370K8807L0183q326j2093J2340n733K016
$$ -22418 -31716 -44268 -59980 -81028 -64658 -35851 -5668 -13994 -26087 -13747 -19480 -17464
12507a7464k0503k8866L361J4594K257O352K7878M59j3105k1042J7059r105l5493
$$ -17464 -37967 -66833 -63472 -48878 -46621 -40269 -12391 -11932 -25037 -46079 -29020 -38125 -73618
12494g3618k2215R928L1065P679m158n094l3J6745j5000J672N07L205J241m987
$$ -73618 -95833 -85905 -54840 -47161 -51319 -56413 -56446 -39701 -54701 -53029 -52522 -49317 -48076 -53063
12480e3063L0638K016O743K665j7067J0151M150J610j458r773m2283j0567J1655
$$ -53063 -22425 -20409 -13666 -11001 -28068 -17917 -13767 -12157 -13615 -23388 -65671 -76238 -64583
12467f4583K4042J5133n0590j9396K4690K4642J7438q955k129L3497R555L638
$$ -64583 -40541 -25408 -75998 -95394 -70704 -46062 -28624 -37579 -39708 -6211 3344 6982
12455F982q363j5520j6228J3193Q846J2098j2866m320j8070k4348j854K0390J8455
$$ 6982 -1381 -16901 -33129 -19936 -11090 1008 -11858 -16178 -34248 -58596 -60450 -40060 -21605
12442b1605J1091J4638m0028l1539m878L8439o983l4456J2489K7809J2415J3915
$$ -21605 -10514 4124 -35904 -67443 -72321 -33882 -40865 -75321 -62832 -35023 -22608 -8693
12430h693Q690j4365r41n089j745j2563o916j5942j1743k8274J072J5695L318
$$ -8693 -3 -14368 -15309 -20398 -22143 -34706 -41622 -57564 -69307 -97581 -96509 -80814 -77496
12417g7496K2052l984j1403J0824o899J7608J1142q083K2955M687j6574k5393
$$ -77496 -55444 -59428 -70831 -60007 -66906 -49298 -38156 -46239 -23284 -18597 -35171 -60564
12405f0564K140K0946l84J4780K3587K225j4635j6299O050n923J355n840K738
$$ -60564 -58424 -37478 -37862 -23082 505 2730 -11905 -28204 -22154 -28077 -26722 -32562 -29824
12392b9824K842j2808r48j9024p813j4741N680L5070P214P411n094j6329l524
$$ -29824 -26982 -39790 -40738 -59762 -67575 -82316 -76636 -41566 -34352 -26941 -32035 -48364 -51888
12379e1888R376k1220k3601J2923K3068J218o569k7478K343L5383m695J13n415
$$ -51888 -42512 -63732 -87333 -74410 -51342 -50124 -56693 -84171 -81828 -46445 -51140 -51027 -56442
12366e6442k344L2057j3534k1221K5949J4767k9941k8776l316Q347q228J372p828
$$ -56442 -58786 -26729 -40263 -61484 -35535 -20768 -50709 -79485 -82801 -74454 -82682 -81310 -89138
12353h9138O987R296J0683k023Q097J7453o85o14j5486J0997J9817r216k7585
$$ -89138 -82151 -72855 -62172 -64195 -56098 -38645 -39330 -39944 -55430 -44433 -24616 -33832 -61417
12340f1417J4191o826k2379K9043Q264l669k355j6845L736l0479K7730K5133K1910
$$ -61417 -47226 -54052 -76431 -47388 -39124 -42793 -45148 -61993 -58257 -88736 -61006 -35873 -13963
12327a3963K517j5936k915J1936J2763k2937l1230l2551k5758R930Q263K9123
$$ -13963 -11446 -27382 -30297 -18361 -5598 -28535 -59765 -92316 -118074 -108144 -99881 -70758
12315g0758L0555O964J1511J4288j2130K0396J3748k4408j8203k8968k3878K3959
$$ -70758 -40203 -33239 -21728 -7440 -19570 826 14574 -9834 -28037 -57005 -80883 -56924
12303e6924J5005j482j5452n484M886Q285m959j977J8621k0417l7260J4257j671
$$ -56924 -41919 -43401 -58853 -64337 -59451 -51166 -56125 -58102 -39481 -59898 -97158 -82901 -84572
12290h4572K0298J4008N022l550M816P52J291O362K2963j146l8447l1754o642
$$ -84572 -64274 -50266 -45244 -48794 -43978 -43226 -41935 -35573 -12610 -13756 -52203 -83957 -90599
12277i0599J7179M1586J4097l7265k2932j7429n069J8172J739O172l923P636q18
$$ -90599 -73420 -31834 -17737 -55002 -77934 -95363 -100432 -82260 -80521 -74349 -78272 -70636 -71454
12264g1454j6325j679M3096K9827J9995n620J009k7421j5326l0571j6973J3164
$$ -71454 -87779 -89458 -46362 -16535 3460 -2160 -1151 -28572 -43898 -74469 -91442 -78278
12252g8278J2540L889J7672p662J4135r212j2765J310l347J348p06J0842j2286
$$ -78278 -65738 -61849 -44177 -51839 -37704 -46916 -59681 -58371 -61718 -60370 -61076 -50234 -62520
12239f2520M720j7864j3325N214l274J0002P54k534P939P621l885j1815r386j357
$$ -62520 -57800 -75664 -88989 -83775 -87049 -77047 -76293 -78827 -70888 -63267 -67152 -78967 -88353 -89710
12225h9710j2001m555L1588J3369N399J7585L716j7318J5066j9100j4491o434
$$ -89710 -101711 -106266 -74678 -61309 -55910 -38325 -34609 -51927 -36861 -55961 -70452 -76886
12213g6886O064M6944K7190j2137q876k5275m833Q629Q401r411k691J8910J4675
$$ -76886 -70822 -23878 3312 -8825 -17701 -42976 -47809 -39180 -30779 -40190 -42881 -23971 -9296
12200i296j974j0807j6749l730M114j8604K954O743l319j5603O477M294K4567
$$ -9296 -11270 -22077 -38826 -42556 -38442 -57046 -54092 -47349 -50668 -66271 -59794 -55500 -30933
12187c0933J0481j7268p275r646k756K668N325M774p501K7244M460k2497j9877
$$ -30933 -20452 -37720 -44995 -54641 -57397 -54729 -49404 -44630 -52131 -24887 -20427 -42924 -62801
12174f2801J2383l41j0756J4510J1330j0949J3994N538k1021j1603J0880l379
$$ -62801 -50418 -50759 -61515 -47005 -35675 -46624 -32630 -27092 -48113 -59716 -48836 -52215
12162e2215j0838P416n645L275m597o703j5907K1135J7950k8707l7230J0998N6250
$$ -52215 -63053 -55637 -61282 -58007 -62604 -69307 -85214 -64079 -46129 -74836 -112066 -101068 -44818
12149d4818M1251j8547k0750l3547J3335L3936k0312j7325M964O845j8613K9881
$$ -44818 -3567 -22114 -42864 -76411 -63076 -29140 -49452 -66777 -61813 -54968 -73581 -43700
12137d3700J0523j3432J9674m939o35L252j9586J591j9764j9172q004J0535J5630
$$ -43700 -33177 -46609 -26935 -31874 -32509 -29257 -48843 -47252 -67016 -86188 -94192 -83657 -68027
12124f8027J8262o066k1793l1494j06K0360J56l598J5367L1542K52J7594K819
$$ -68027 -49765 -55831 -77624 -109118 -109224 -88864 -88708 -92306 -76939 -45397 -45145 -27551 -24732
12111b4732j3466j0373n083j9040n297J4277K0016q236j3659K086J7234K9358
$$ -24732 -38198 -48571 -53654 -72694 -77991 -63714 -43698 -51934 -65593 -63507 -46273 -16915
12099a6915n95J238R594q964o561p552K365R267q78k0654r737P851K820m718P894
$$ -16915 -17510 -16272 -6678 -15642 -22203 -29755 -27390 -18123 -19001 -39655 -49392 -41541 -38721 -43439 -35545
12084c5545J185n561L568o874j7082k1500j8110K5501J4172K893l6123j8849J6139
$$ -35545 -34360 -39921 -36353 -43227 -60309 -81809 -99919 -74418 -60246 -57353 -93476 -112325 -96186
12071i6186j886J6704K9340Q714K419J6533j8617j5031j0625k2182k401K4392
$$ -96186 -98072 -81368 -52028 -43314 -40895 -24362 -42979 -58010 -68635 -90817 -93218 -68826
12059f8826J3467O467K3648j3166r90J1581j5122j1785n681o963j4786j3336J4861
$$ -68826 -55359 -48892 -25244 -38410 -39400 -27819 -42941 -54726 -60407 -67370 -82156 -95492 -80631
12046h0631K2210M5033P467j288p002r947l444j1285l5196L610J4048J2187J8805
$$ -80631 -58421 -13388 -5921 -7209 -14211 -24158 -27602 -38887 -74083 -70473 -56425 -44238 -25433
12033b5433j504J944j1624J820n116p468j8543k1847o337M3569J6571J447j2600
$$ -25433 -26937 -24993 -36617 -34797 -39913 -47381 -65924 -87771 -94108 -50539 -33968 -32521 -45121
12020d5121J0506J7622k451j3135l1067k9694J5708M945k920O828J0575R024K2682
$$ -45121 -34615 -16993 -19444 -32579 -63646 -93340 -77632 -72687 -75607 -68779 -58204 -49180 -26498
12007b6498k7279k4927K768p876j1477l561K694J7046J1803K6328j0198k3368
$$ -26498 -53777 -78704 -75936 -83812 -95289 -98850 -96156 -79110 -67307 -40979 -51177 -74545
11995g4545K335K6129O367k1678j7061j5214R710J2457l087k9399j9260O147K0241
$$ -74545 -72210 -46081 -39714 -61392 -78453 -93667 -83957 -71500 -74587 -103986 -123246 -117099 -96858
11982i6858j992L6209q968K4123r781O184K3960J8910n084k9839j3391j7240J4620
$$ -96858 -98850 -62641 -71609 -47486 -57267 -51083 -27123 -8213 -13297 -43136 -56527 -73767 -59147
11969e9147j3469P583j3571m701j1041j1975K0550K4183o004J7761K1305j1684
$$ -59147 -72616 -65033 -78604 -83305 -94346 -106321 -85771 -61588 -67592 -49831 -28526 -40210
11957d0210j2872M829r775k9455j5713Q596m186p30K121J0743m979J1329K9977
$$ -40210 -53082 -48253 -58028 -87483 -103196 -94600 -98786 -99516 -97395 -86652 -91631 -80302 -50325
11944e0325J4231q998K372o730k98l100Rk874O51r295r831m489N624J4175J084
$$ -50325 -36094 -45092 -42720 -49450 -49748 -52848 -52839 -55713 -55062 -64357 -74188 -78677 -73053 -58878 -57794
11929e7794n774r757L995J4752m616j5967K5876L912K602j4426j640j8447r774
$$ -57794 -63568 -73325 -69330 -54578 -59194 -75161 -49285 -45373 -42771 -57197 -58837 -77284 -87058
11916h7058P713N397q245j3599J9655K0528J4093j7304k841P65L411R652p160
$$ -87058 -79345 -73948 -82193 -95792 -76137 -55609 -41516 -58820 -61661 -60896 -57485 -47833 -54993
11903e4993j2803K1055Q789j3364k4330o204r856N520J3485l093J3668R530R534
$$ -54993 -67796 -46741 -37952 -51316 -75646 -81850 -91706 -86186 -72701 -75794 -62126 -52596 -43062
11890d3062J4268k755p731j0488M498k1284k3703k393J0964J2509k816J7037Q986
$$ -43062 -28794 -31549 -39280 -49768 -45270 -66554 -90257 -92650 -81686 -69177 -71993 -54956 -45970
11877d5970m96j6448P794J5195r713n103L4023Q820j5282l7318j4850j7335K0172
$$ -45970 -46466 -62914 -55120 -39925 -49638 -54741 -20718 -11898 -27180 -64498 -79348 -96683 -76511
11864g6511Q963j1311k622j3578o524o309m122J7122J6682k665n933J7636J6751
$$ -76511 -67548 -78859 -81481 -95059 -101583 -107892 -112014 -94892 -78210 -80875 -86808 -69172 -52421
11851e2421j797m592r878K459j1670n65r98R868Q743J6519k493p409l2432j2761
$$ -52421 -54218 -58810 -68688 -66229 -77899 -78464 -79462 -69594 -60851 -44332 -46825 -54234 -86666 -99427
11837i9427P988K140J0339J2522n411J6979J4640P87N772k152j3165J1769P300
$$ -99427 -91439 -89299 -78960 -66438 -71849 -54870 -40230 -39443 -33671 -35823 -48988 -37219 -29919
11824b9919J1588n776j6666j1548m111j890j641J0606J1996l4327p139N480J417
$$ -29919 -18331 -24107 -40773 -52321 -56432 -58322 -59963 -49357 -37361 -71688 -78827 -73347 -71930
11811g1930R926J4376N661P653l6667j1616q266J7749J3063J542l00J6329J0099
$$ -71930 -62004 -47628 -41967 -34314 -70981 -82597 -90863 -73114 -60051 -58509 -58809 -42480 -32381
11798c2381P113J2328j5383k174j1472j9839k4673j2194K3280O082P41L6113J9709
$$ -32381 -25268 -12940 -28323 -30497 -41969 -61808 -86481 -98675 -75395 -69313 -68572 -32459 -12750
11785a2750j8964k1215P626N1498P670j9577j1531j3811l573pk8913m4706J0970
$$ -12750 -31714 -52929 -45303 6195 13865 -5712 -17243 -31054 -34627 -34634 -63547 -108253 -97283
11772i7283J8550l971j6363L2989K620O675j6405j4339l634J5673K5665o943j8055
$$ -97283 -78733 -82704 -99067 -66078 -63458 -56783 -73188 -87527 -91161 -75488 -49823 -56766 -74821
11759g4821k7557j5891R179k6072J77N8632L0548m747l5197j2811M364j499L7274
$$ -74821 -102378 -118269 -109090 -135162 -134985 -76353 -45805 -50552 -85749 -98560 -94196 -95695 -58421
11746e8421L6623J967k3051P737l6731j7613M1712K2651O266P544j3154j6838
$$ -58421 -21798 -19831 -42882 -35145 -71876 -89489 -47777 -25126 -18860 -11316 -24470 -41308
11734d1308n305K0860r423l1294k0991J8932J6231j688N354K6121l8333l439J5249
$$ -41308 -46613 -25753 -35176 -66470 -87461 -68529 -52298 -53986 -48632 -22511 -60844 -64283 -49034
11721d9034j137j8664j2516j3983k8811J0966J8458j6062n185J7149J8499K8172
$$ -49034 -50171 -68835 -81351 -95334 -124145 -113179 -94721 -110783 -115968 -98819 -80320 -52148
11709e2148R213j2174j5547n527m47J0774J0722K250Q240L3117L2190m806l7840
$$ -52148 -42935 -55109 -70656 -76183 -76630 -65856 -55134 -52884 -44644 -11527 20663 15857 -21983
11696b1983j1438R831p063J8650K3844k6064p551P471r481j0365o423q324Q781
$$ -21983 -33421 -23590 -30653 -12003 11841 -14223 -21774 -14303 -23784 -34149 -40572 -48896 -40115
11683d0115k1134o646J0857Q113j5616k1768K2827K6578L721N371P623J0712l290
$$ -40115 -61249 -67895 -57038 -48925 -64541 -86309 -63482 -36904 -33183 -27812 -20189 -9477 -12767
11670a2767K5590k0676L267p938r556p442k8305n712J5955o160j0630l214k063
$$ -12767 12823 -7853 -4586 -12524 -22080 -29522 -57827 -63539 -47584 -53744 -64374 -67588 -69651
11657f9651k067r084q151r246J2673J0128O399N212n470Q424O938J3785J2224
$$ -69651 -71718 -80802 -88953 -98199 -85526 -75398 -68999 -63787 -69257 -60833 -53895 -40110 -27886
11644b7886O473j8340j2669L238o877M936j386K2319J6305O134l8128k031k199
$$ -27886 -21413 -39753 -52422 -49184 -56061 -51125 -52511 -30192 -13887 -7753 -45881 -47912 -50111
11631e0111J4916j2294J2832J3089r506l556L163J6476J7076J973k4016k1785
$$ -50111 -35195 -47489 -34657 -21568 -31074 -34630 -31467 -14991 2085 4058 -19958 -41743
11619d1743r459j4785q519P356m371R178j1066R476j1794O919k7496o324J5471
$$ -41743 -51202 -65987 -74506 -67150 -71521 -62343 -73409 -63933 -75727 -68808 -96304 -102628 -87157
11606h7157O763l379n701K8396r325K0737J6886J211O080j6551j2580n413J2419
$$ -87157 -80394 -83773 -89474 -61078 -70403 -49666 -32780 -31569 -25489 -42040 -54620 -60033 -47614
11593d7614J6773l1550k2635J5082M3301K944m3767k2264J6276K0417j0704k2628
$$ -47614 -30841 -62391 -85026 -69944 -26643 -23699 -67466 -89730 -73454 -53037 -63741 -86369
11581h6369j8020Q435J5302J2080K7346K1584Q505j2841m0246l1767J6599K6797
$$ -86369 -104389 -95954 -80652 -68572 -41226 -19642 -11137 -23978 -64224 -95991 -79392 -52595
11569e2595J326J1752L0799j0519j9430J0975M404j787Q632j0664J334O869k5532
$$ -52595 -51269 -39517 -8718 -19237 -38667 -27692 -23288 -25075 -16443 -27107 -25773 -18904 -44436
11556d4436k1421L385J7376P591K4420M520k2567o589j0270o994J1323K3875L325
$$ -44436 -65857 -62472 -45096 -37505 -13085 -8565 -31132 -37721 -47991 -54985 -43662 -19787 -16462
11543a6462q64m569j9700j8628k442n847k140Q956M138N234l50l520J2885K3263
$$ -16462 -17326 -21895 -41595 -60223 -62665 -68512 -70652 -61696 -57558 -52324 -52674 -56194 -43309 -20046
11529b0046M140q960k3281j9557J9585L1722o813k2283j596J077L283q476o195
$$ -20046 -15906 -24866 -48147 -67704 -48119 -16397 -23210 -45493 -47089 -46012 -42729 -51205 -57400
11516e7400J0215l494m132P99J2880R407j3065l3931j2380K355L1380J6909J1291
$$ -57400 -47185 -50679 -54811 -54012 -41132 -31725 -44790 -78721 -91101 -88746 -57366 -40457 -29166
11503b9166N623j3571L321l333k0495j3786J1545J0678l522k9686j3485L400J8560
$$ -29166 -23543 -37114 -33793 -37126 -57621 -71407 -59862 -49184 -52706 -82392 -95877 -92477 -73917
11490g3917R187j4081l2499K2144K2238J2028j8486l0795j1622j749K3478l013
$$ -73917 -64730 -78811 -111310 -89166 -66928 -54900 -73386 -104181 -115803 -117552 -94074 -97087
11478i7087k7374K9464N8J6223p919k0855j0929k718R292L0843j862k0217J238
$$ -97087 -124461 -94997 -94939 -78716 -86635 -107490 -118419 -121137 -111845 -81002 -82864 -103081 -101843
11465a01843J3314K387l299J140J9683K5932k1284m6500J4780Q324K5107R859
$$ -101843 -88529 -86142 -89441 -88301 -68618 -42686 -63970 -110470 -95690 -87366 -62259 -52400
11453e2400K0127j8726j2299P798O057j4941p141L309j1623J3798J7212p647j7111
$$ -52400 -32273 -50999 -63298 -55500 -49443 -64384 -71525 -68216 -79839 -66041 -48829 -56476 -73587
11440g3587j8260J0385J1005M010k132J9451j6800k216J6289j6409j7514M685
$$ -73587 -91847 -81462 -70457 -66447 -68579 -49128 -65928 -68144 -51855 -68264 -85778 -81093
11428h1093K9280O951k360O047q7k9246k8689Q731K6380K529j4104O082j8473
$$ -81093 -51813 -44862 -47222 -41175 -41262 -70508 -99197 -90466 -64086 -61557 -75661 -69579 -88052
11415h8052k407j4625j8741Q928L5678L2197J7892j8363k7305k1390L7431K5561
$$ -88052 -90459 -105084 -123825 -114897 -79219 -47022 -29130 -47493 -74798 -96188 -58757 -33196
11403c3196r376l988p917k0259l6258j7920J0565N0809L7749l551N720J852k4548
$$ -33196 -42572 -46560 -54477 -74736 -110994 -128914 -118349 -67540 -29791 -33342 -27622 -25770 -50318
11390e0318k1032j5761j2297k0312j3609j724L7173M0028R293J2106p708J5121
$$ -50318 -71350 -87111 -99408 -119720 -133329 -135053 -97880 -57852 -48559 -36453 -44161 -29040
11378b9040R644j1197k5142J22J1341o151O235J9799l444k3513k8247m722K0988
$$ -29040 -19396 -30593 -55735 -55613 -44272 -50423 -44188 -24389 -27833 -51346 -79593 -84315 -63327
11365f3327J6483L606k4432k3088J5130K1562j2487P143O347P593N07J2036M459
$$ -63327 -46844 -43238 -67670 -90758 -75628 -54066 -66553 -59410 -53063 -45470 -44963 -32927 -28468
11352b8468O962j3071m689j4128j7866R597J6961j0860J7854m825j2875k8230
$$ -28468 -21506 -34577 -39266 -53394 -71260 -61663 -44702 -55562 -37708 -42533 -55408 -83638
11340h3638k2470J2423N902k938L105k305O288J2462k359N057K850k5960k1337
$$ -83638 -106108 -93685 -87783 -90721 -87616 -89921 -83633 -71171 -73530 -68473 -65623 -91583 -112920
11327a12920J0537j6937m309L4272L9225l91n099K748J376k694l4355R266J1262
$$ -112920 -102383 -119320 -123629 -89357 -50132 -50523 -55622 -52874 -51498 -54192 -88547 -79281 -68019
11314f8019J8786P86N916j826l2520j114J0581K248j0444j3542P962r59P394J9297
$$ -68019 -49233 -48447 -42531 -44357 -76877 -77991 -67410 -65162 -75606 -89148 -81186 -82145 -74751 -55454
11300e5454m248j7213l655L1643K3844K07m292k1013l0655n318J0324J0545o526
$$ -55454 -59702 -76915 -80570 -48927 -25083 -24876 -29168 -50181 -80836 -86154 -75830 -65285 -71811
11287g1811K912K2126j605p162L471k6302j5830K6403j1523O56K3905K1445K1660
$$ -71811 -68899 -46773 -48378 -55540 -52069 -78371 -94201 -67798 -79321 -78665 -54760 -33315 -11655
11274a1655k1356m738l528j1897j4305k2159N20P676o394l5262p057K1647J7446
$$ -11655 -33011 -37749 -41277 -53174 -67479 -89638 -89118 -81442 -87836 -123098 -130155 -108508 -91062
11261i1062K2110K8102j7015j5103J3742j6746j8033K0055l906k5175J3294J6565
$$ -91062 -68952 -40850 -57865 -72968 -59226 -75972 -94005 -73950 -77856 -103031 -89737 -73172
11249g3172N825k2169k734J2414o82k7090Q917k967N10n265P265J1182j4090p662
$$ -73172 -67347 -89516 -92250 -79836 -80518 -107608 -98691 -101658 -101148 -106413 -99148 -87966 -102056 -109718
11235a09718Q470P332o362o298J9083P727l2349N939J6043L755l140j4816j5099
$$ -109718 -101248 -93916 -100278 -106576 -87493 -79766 -112115 -106176 -90133 -86378 -89518 -104334 -119433
11222a19433K8985J5973P21Q189j449j3843p1k0177j2155j3485M5K1777J813J890
$$ -119433 -90448 -74475 -73754 -65565 -67014 -80857 -80928 -101105 -113260 -126745 -126700 -104923 -103110 -101220
11208a01220k116J2454J0556J2982j4411j4544J1814K1050M981o008j1197l0376
$$ -101220 -103336 -90882 -80326 -67344 -81755 -96299 -84485 -63435 -58454 -64462 -75659 -106035
11196a06035K4605j142j8785j7156m083L0704Q959J290L257m12Q161j0173Q119
$$ -106035 -81430 -82572 -101357 -118513 -122596 -91892 -82933 -81643 -78386 -78798 -70637 -80810 -72691
11183g2691J040J4805j4175n627j4211k3669J4739o553l1781P119p491K2050R428
$$ -72691 -71651 -56846 -71021 -76648 -90859 -114528 -99789 -106342 -138123 -131004 -138495 -116445 -107017
11170a07017j6059o619J7197L2294l280q449J4493O655J056J108o328K6419K0185
$$ -107017 -123076 -129695 -112498 -80204 -83484 -91933 -77440 -70785 -69729 -68621 -74949 -48530 -28345
11157b8345k5922k5478J3652p698J6504p22p717n268j2611k8625J3052J707R759
$$ -28345 -54267 -79745 -66093 -73791 -57287 -58009 -65726 -70994 -83605 -112230 -99178 -97471 -87712
11144h7712K6437L108l0257N365k316m4522Q875L5514J3184o919k678P470K6777
$$ -87712 -61275 -58167 -88424 -83059 -85375 -129897 -121022 -85508 -72324 -79243 -81921 -74451 -47674
11131d7674r623q190p976q575k1179R30K734Q43K24Q5j2248m736m231N441K9670
$$ -47674 -57297 -65487 -73463 -82038 -103217 -102287 -99553 -98710 -98486 -98401 -110649 -115385 -119616 -114175 -84505
11116h4505N677l630K2927k0612Q758L2446l757k353Q857Q33m675k3682k2127
$$ -84505 -78828 -82458 -59531 -80143 -71385 -38939 -42696 -45049 -36192 -35359 -40034 -63716 -85843
11103h5843J7982L936J1260r642l255K4731N041K127k5742J360m144R695l2165
$$ -85843 -67861 -63925 -52665 -62307 -65562 -40831 -35790 -33663 -59405 -58045 -62189 -52494 -84659
11090h4659k0449j92J7004J8334K5904J0058J3241J1147k0164k4651m002k221
$$ -84659 -105108 -105300 -88296 -69962 -44058 -34000 -20759 -9612 -29776 -54427 -58429 -60650
11078f0650J2674Q674O258j455l08n692J7353k1407j0662L532l296J1924K0419
$$ -60650 -47976 -39302 -33044 -34499 -34807 -40499 -23146 -44553 -55215 -51683 -54979 -43055 -22636
11065b2636o215J2957K5256L6060k3408j061K528m269r446Q009p557L4559M5038
$$ -22636 -28851 -15894 9362 45422 22014 20953 23481 19212 9766 17775 10218 44777 89815
11052H9815N0195L7916K9925M0611N8992Q4832R1335Q0048J02119O9497J6440
$$ 89815 140010 177926 207851 248462 307454 392286 483621 563669 665788 735285 751725
11041G51725k2681k0091l05M6490Q5899Q9815J02116J20781J74771J66891O1081
$$ 751725 729044 708953 708648 755138 841037 930852 1032968 1153749 1328520 1495411 1556492
11030A556492l6075j12103j08291q7473L377M7641J16821J60011J79260J89877
$$ 1556492 1520417 1408314 1300023 1212550 1215927 1263568 1380389 1540400 1719660 1909537
11020A909537J65789P6347j29612k45607k39863j89183j13575k9368L5893N2132
$$ 1909537 2075326 2151673 2022061 1776454 1536591 1347408 1233833 1204465 1240358 1292490
11010A292490P7462J01413P1477r018j59852k45619k30287j58394q8240o6586
$$ 1292490 1369952 1471365 1542842 1533824 1373972 1128353 898066 739672 651432 584846
11000E84846n8186J0233P177L685J9374l9329r8338j06135p5777p4533n1972m1330
$$ 584846 526660 536893 544070 547755 567129 527800 429462 323327 247550 173017 121045 79715
10988G9715m7088k7694k47o325j5174l2562k3441n416J6769Q427j9920M548r060
$$ 79715 32627 4933 4686 -1639 -16813 -49375 -72816 -78232 -61463 -53036 -72956 -68408 -77468
10975g7468o055N030J5472k1319R278Q894J3789k2324l1123K7770l0435r108M2000
$$ -77468 -83523 -78493 -63021 -84340 -75062 -66168 -52379 -74703 -105826 -78056 -108491 -117599 -75599
10962g5599J1990j8368k4031K6383K0279P302k2149l6775l1090r443o10J5820
$$ -75599 -63609 -81977 -106008 -79625 -59346 -52044 -74193 -110968 -142058 -151501 -152111 -136291
10950a36291l266k5948P79J8082K277K4589K1053J9861L537k3909L0301k2387
$$ -136291 -139557 -165505 -164726 -146644 -144367 -119778 -98725 -78864 -75327 -99236 -68935 -91322
10938i1322j2060n977J1610j1944L6497K2797J74j7091k3812j5847o225K4787
$$ -91322 -103382 -109359 -97749 -109693 -73196 -50399 -50225 -67316 -91128 -106975 -113200 -88413
10926h8413l3272j6327m587K1498K6344K126j710j869k5758p486J0044J2541J6067
$$ -88413 -121685 -138012 -142599 -121101 -94757 -92631 -94341 -96210 -121968 -129454 -119410 -106869 -90802
10913i0802K6074L893j3231j5384k7590k3155n657K4351J2322p797r40J7246j2740
$$ -90802 -64728 -60835 -74066 -89450 -117040 -140195 -145852 -121501 -109179 -116976 -117916 -100670 -113410
10900a13410j0973q047J1244J5912l728k8284j8201j2809J6849J6008J4927M1604
$$ -113410 -124383 -132430 -121186 -105274 -109002 -137286 -155487 -168296 -151447 -135439 -120512 -78908
10888g8908K0447N688j4198j5527q147j6802J8695J8019N215j6338m746J2991
$$ -78908 -58461 -52773 -66971 -82498 -90645 -107447 -88752 -70733 -65518 -81856 -86602 -73611
10876g3611K8402K8640J6593K1131k8630l4K2441k1727k880M21M5827K5694j4208
$$ -73611 -45209 -16569 24 21155 -7475 -7509 14932 -6795 -9675 -9254 36573 62267 48059
10863D8059L242K9019R869P355K0220m079J2493r01Q529j0132l3476j141J0817
$$ 48059 51301 80320 90189 97544 117764 113685 126178 125277 133806 123674 90198 89057 99874
10850I9874N853p27J951R971K4016Q52k379J0748J4577r693L225q432M447Q402
$$ 99874 105727 105000 106951 116922 140938 141790 139411 150159 164736 155043 158268 149836 154283 162685
10836A62685J4774j5862q582m549j3448j4426k439l2468k1628j6058j6651j0894
$$ 162685 177459 161597 153015 148466 135018 120592 118153 85685 64057 47999 31348 20454
10824B0454q881J401J7877j3268p101l6290k5549L66m582O140j2255m348p748
$$ 20454 11573 12974 30851 17583 10482 -25808 -51357 -50991 -55573 -49433 -61688 -66036 -73784
10811g3784m106J2896J2447k169k8881l3287j3233k441Q649R395j2290o697k2003
$$ -73784 -77890 -64994 -52547 -54716 -83597 -116884 -130117 -132558 -123909 -114514 -126804 -133501 -155504
10798a55504j9296j0213J1045o924o451J934k61p371j5265L636q777P634j5715
$$ -155504 -174800 -185013 -173968 -180892 -187343 -185409 -185670 -193041 -208306 -204670 -213447 -205813 -221528
10785b21528j1177p925K4898L2561N077L5299k4278l7783l4757p021J4665Q642
$$ -221528 -232705 -240630 -215732 -183171 -178094 -142795 -167073 -204856 -239613 -246634 -231969 -223327
10773b23327L3459L5863K3158j7228k3128l5305j6657j1263M745J9126J9612q584
$$ -223327 -189868 -154005 -130847 -148075 -171203 -206508 -223165 -234428 -229683 -210557 -190945 -199529
10761a99529J4789K0542K8329P083R88M750N726L608J8736K4761o462P015j7483
$$ -199529 -184740 -164198 -135869 -128786 -127798 -123048 -117322 -113714 -94978 -70217 -76679 -69664 -87147
10748h7147j534q621o491k060M116j0496J1458L2552L2440K7093K6015L0567j0523
$$ -87147 -88681 -97302 -103793 -105853 -101737 -112233 -100775 -68223 -35783 -8690 17325 47892 37369
10735C7369j7280m3939p4077o4896j3201Q561M1808J09435J32759Q8439K8005
$$ 37369 20089 -23850 -97927 -162823 -176024 -167463 -125655 -16220 116539 204978 232983
10724B32983l2216o2342o6590q9536j11019n2176M988O9287J16767J39681J27331
$$ 232983 200767 138425 71835 -17701 -128720 -180896 -175908 -106621 10146 149827 277158
10713B77158N5438l042k7342o7524j26207j17027o7003l0507M6407Q0931J04081
$$ 277158 332596 329554 302212 234688 108481 -8546 -75549 -106056 -59649 21282 125363
10702A25363J00434L8660Q735n1500m4057n5392m5319k2997l1557l694N995Q455
$$ 125363 225797 264457 273192 221692 177635 122243 76924 53927 22370 18676 24671 33126
10690C3126J6324K2992J1173K1756l303l1348q358m171j7883j3011r719P306J3108
$$ 33126 49450 72442 83615 105371 102068 70720 62362 58191 40308 27297 17578 24884 37992
10677C7992K1658o930o034K545J5941L6059N1489M7667K8326L9178k139Q452M3125
$$ 37992 59650 52720 46686 49231 65172 101231 152720 200387 228713 267891 265752 274204 317329
10664C17329M1395L4042K4573N0839K7942M1061L5707O4140R7293J01367R4446
$$ 317329 358724 392766 417339 468178 496120 537181 572888 637028 734321 835688 930134
10653I30134R3463J26503J13734J39770J67417K09038K76059K85242O5337m0172
$$ 930134 1023597 1150100 1263834 1403604 1571021 1780059 2056118 2341360 2406697 2366525
10643B366525O6114J83617K39150L15986M91976O73843R43539J219362J620376
$$ 2366525 2432639 2616256 2855406 3171392 3663368 4337211 5280750 6500112 8120488
10634H120488J987101K297910K583483K976648L211333K091908k57515j431501
$$ 8120488 10107589 12405499 14988982 17965630 21176963 23268871 23011356 21579855
10626B1579855q88019L69544J856517L454497N147748O896014Q875957J1420579
$$ 21579855 20691836 21061380 22917897 26372394 31520142 38416156 47292113 58712692
10618E8712692J3847908J3864249J1639883J1403903J2234842J0274249M388375
$$ 58712692 72560600 86424849 98064732 109468635 121703477 131977726 136366101
10611A36366101j416698k948304r0442N477868J2200911J8182810K1303338K2377307
$$ 136366101 134949403 132001099 131910657 137388525 149589436 167772246 189075584 211452891
10603B11452891K4157864K4651882J6643136j691314j8038970k1672612j4688711
$$ 211452891 235610755 260262637 276905773 275214459 257175489 235502877 220814166
10596B20814166l357687Q407227J8390579K5325651K9592197L1967034K9505702
$$ 220814166 217456479 225863706 244254285 269579936 299172133 331139167 360644869
10589C60644869J3890973j5424462l9193786m3510861l4179226k0707578p973096
$$ 360644869 374535842 359111380 319917594 276406733 242227507 221519929 213546833
10582B13546833K163680Q974621J3030456J4856624J2349410O02560j9198259
$$ 213546833 215710513 224685134 237715590 252572214 264921624 265524184 246325925
10575B46325925l3806712l5034551k7585514j8146727r983939l946909o7097J984702
$$ 246325925 212519213 177484662 149899148 131752421 121768482 117821573 117754476 119739178
10567A19739178K373320M51869m968592j2573957j7807307j8161568j5339611
$$ 119739178 122112498 122564367 117595775 105021818 87214511 69052943 53713332
10560E3713332j1756405q642361o244833m537328l362161k560109k047658j626491
$$ 53713332 41956927 33314566 27069733 22532405 19170244 16610135 14562477 12935986
10552A2935986j321301j144302r89054q61393p29551o21515n17898m44589l95540
$$ 12935986 11614685 10470383 9481329 8619936 7890385 7268870 6750972 6306383 5910843
10543E910843l62055l34964k96325k72023k27336k18604j89070j87072j72922
$$ 5910843 5548788 5213824 4917499 4645476 4418140 4199536 4010466 3823394 3650472
10534C650472j28756r8020j04775j14057j14305j02837q6201q0692r0303j17359
$$ 3650472 3521716 3423696 3318921 3204864 3090559 2987722 2901521 2820829 2730526 2613167
10524B613167r1717n5133k0764m8180m0921n9027n1501n0157m9605m2728m0600
$$ 2613167 2521450 2466317 2445553 2397373 2356452 2297425 2245924 2195767 2146162 2103434 2062834
10513B062834m2508n9014m8393o5566m5298p201m522j8918j6373k5807k2335k6142
$$ 2062834 2020326 1961312 1912919 1847353 1802055 1794854 1790332 1771414 1755041 1729234 1706899 1680757
10501A680757l9142k5410k6132n0006m9786m1228k2942j5552o996j5537j5619
$$ 1680757 1641615 1616205 1590073 1540067 1490281 1449053 1426111 1410559 1403563 1388026 1372407
10490A372407M757j6254j5624k475j1169N049N732n621j2357l1715k4102n4412
$$ 1372407 1377164 1360910 1345286 1342811 1331642 1336691 1342423 1336802 1324445 1292730 1268628 1214216
10478A214216m4562j4221L5452K4965L2218M3534K1001k745m8528o2330n2804
$$ 1214216 1169654 1155433 1190885 1215850 1248068 1291602 1312603 1309858 1261330 1199000 1146196
10467A146196n6412n428j6943J5328O6770N6511M6397M5099O716m2205n7080n0888
$$ 1146196 1089784 1084356 1067413 1082741 1149511 1206022 1252419 1297518 1304234 1262029 1204949 1154061
10455A154061o6161k738J4708K1458j4173j9513J2668K3525l5357o0044o2202
$$ 1154061 1087900 1085162 1099870 1121328 1107155 1087642 1100310 1123835 1088478 1028434 966232
10444I66232l6998l5814k1650K136J0411k4061k3516J260J963m4352L731M194
$$ 966232 929234 893420 871770 873906 884317 860256 836740 838000 839963 795611 799342 803536
10432H03536k4698k5448r994J0576l5055l4753k7517o706l1535j9028j1142M4493
$$ 803536 778838 753390 743396 753972 718917 684164 656647 649941 618406 599378 588236 632729
10420F32729K2362p039p379J4662p6n7M269L575j8472p5K049j7446P531P416J51
$$ 632729 655091 648052 640673 655335 655259 655202 659471 663046 644574 644499 646548 629102 636633 644049 644200
10405F44200R72r249L2895L674l3308l6737j498R07L770j39J9020r628J0796O129
$$ 644200 645172 635923 668818 672492 639184 602447 600949 601856 605626 605487 624507 614879 625675 631804
10391F31804o283K816l8372l6388l0099r919J7535K653j7048J0329k629k752K762
$$ 631804 625521 628337 589965 553577 523478 513559 531094 533747 516699 527028 524399 521647 524409
10378E24409j8059j9165L392r019N21P485K1789l1095m5096j0701n124k0453j4312
$$ 524409 506350 487185 490577 481558 482079 489564 511353 480258 435162 424461 419337 398884 384572
10365C84572j0022j9102M477N560K944o211q892j3117J4438K5817o195k0952j7795
$$ 384572 374550 355448 359925 365485 368429 362218 353326 340209 354647 380464 374269 353317 335522
10352C35522j1825k093K0713J2370k692R269l344R848M934k3124j4887p996O324
$$ 335522 323697 321604 342317 354687 351995 361264 357920 367768 372702 349578 334691 326695 333019
10339C33019J8904j3968j8584k7729l685k2925j5599K1J4375L8891j7346k1495
$$ 333019 351923 337955 319371 291642 287957 265032 249433 249454 263829 302720 285374 263879
10327B63879N664K4278K1480k538j9512k7451J2308J7372p459k15J318J4004l601
$$ 263879 269543 293821 315301 312763 293251 265800 278108 295480 288021 287806 289124 303128 299527
10314B99527k155R403J8992Q80j2762j4070j8807N662m125L6665j50j2363J5629
$$ 299527 297372 306775 325767 326647 313885 299815 281008 286670 282545 319210 319060 306697 322326
10301C22326l5j2748N596k0900O98j0387J1270J4600j428m248l0353j5457k522
$$ 322326 322291 309543 315139 294239 294937 284550 295820 310420 308992 304744 274391 258934 256412
10288B56412M702K6494M880j732K3065j2617l3688j9118P884J1123n233J3257
$$ 256412 261114 287608 292488 290756 313821 301204 267516 248398 256282 267405 262172 275429
10276B75429J0351j7499r669L0546O953j2935j1599j5408j2653K8114L5880J0046
$$ 275429 285780 268281 258612 289158 296111 283176 271577 256169 243516 271630 307510 317556
10264C17556l1018j6387j6442L881K1297J2401k8329m5704j500J7256K2337m867
$$ 317556 286538 270151 253709 257590 278887 291288 262959 217255 215755 233011 255348 250481
10252B50481j55k9936j0646K4948M0479p785R45P765l0609j3370K5762J7195l522
$$ 250481 250326 220390 209744 234692 275171 267386 268331 276096 245487 232117 257879 275074 271552
10239B71552q860K42k5460j1990K4515O33j8881l2873L109J4798j4618j5806K0890
$$ 271552 262692 262934 237474 225484 249999 250632 231751 198878 201987 216785 202167 186361 207251
10226B07251L1479j739l160q301l5670r813J1143j2536k245L2744J9837k232j6757
$$ 207251 238730 236991 233831 225530 189860 180047 191190 178654 176409 209153 228990 226758 210001
10213B10001j0072M834j2014j3523p350J3225R357j884j9118j1678K0470L9436
$$ 210001 199929 204763 192749 179226 171876 185101 194458 192574 173456 161778 182248 221684
10201B21684K3053R358j503m848M024O2237J7067m194L0096K4235K5620K223j7479
$$ 221684 244737 254095 252592 247744 251768 314005 331072 326878 356974 381209 406829 409052 391573
10188C91573l684J0374K1246K8408K6517J9958L1456R1547J10093Q9094Q0715
$$ 391573 387889 398263 419509 447917 474434 494392 525848 617395 727488 816582 897297
10177H97297Q0539L6746K1696k4722n2893L154M3793Q8515Q3833J29831J56680
$$ 897297 977836 1014582 1036278 1011556 958663 961817 1005610 1094125 1177958 1307789 1464469
10166A464469J58836J37715N1739m6853j24857j12800p2499M731K8710J14326
$$ 1464469 1623305 1761020 1812759 1765906 1641049 1528249 1455750 1460481 1489191 1603517
10156A603517J84148K04260J95715J77567M2579j70692k56949k13856j86213j10515
$$ 1603517 1787665 1991925 2187640 2365207 2407786 2237094 1980145 1766289 1580076 1469561
10146A469561m1811J1143N5570O3396R4998N4113n3157j61589k19686j96753j18281
$$ 1469561 1427750 1438893 1494463 1557859 1652857 1706970 1653813 1492224 1272538 1075785 957504
10135I57504o3080l1811l5479l3407J5705L231k1927k9767o5611j21430r8839
$$ 957504 894424 862613 827134 793727 809432 812663 790736 760969 695358 573928 475089
10124D75089p7812m7819l8937l6838l6998n2128l1262o021j0192J4376J1135K8630
$$ 475089 397277 349458 310521 273683 236685 184557 153295 147274 137082 151458 162593 191223
10112A91223n931j1106j9209R592P83q044p50k0228K918j8428K8549R604Q45j758
$$ 191223 185292 174186 154977 164569 165352 157308 156558 136330 139248 120820 149369 158973 159818 158060
10098A58060k0654j4453l750r131J0988j3399L194R356K3577J4783o335j6980
$$ 158060 137406 122953 119203 110072 121060 107661 110855 120211 143788 158571 152236 135256
10086A35256j7435k0054j9705Q532L5829N202j5203k3552J2247L7019O055n58
$$ 135256 117821 97767 78062 86594 122423 127625 112422 88870 101117 138136 144191 143633
10074A43633m684j3065j1006J661R988r000K3193j2467m393j4381O243J3397J647
$$ 143633 138949 125884 114878 116539 126527 117527 140720 128253 123860 109479 115722 129119 130766
10061A30766l904N143L9864Q605j672l051R602j3364J2281j0087k7357q782J8224
$$ 130766 126862 132005 171869 180474 178802 175751 185353 171989 184270 174183 146826 138044 156268
10048A56268j3277k95J5478j9138J2207K5005J4012j1015k7988K4209J8073k2651
$$ 156268 142991 142696 158174 139036 151243 176248 190260 179245 151257 175466 193539 170888
10036A70888n3703k7419M17K2247j8225J651j3848L508J1357M67J1724j616J5131
$$ 170888 117185 89766 90183 112430 94205 95856 82008 85516 96873 97340 109064 107448 122579
10023A22579R88j0818o526o463R582m463q027j7687P127J7847j72L750j3734j3244
$$ 122579 123567 112749 106223 99760 109342 104879 96852 79165 86292 104139 103967 107717 93983 80739
10009H0739l611K6992Q011L903K5055J6629k13j4224k1333j8733k1223K305r905
$$ 80739 77128 104120 112131 116034 141089 157718 157505 143281 121948 103215 81992 84297 74392
9996G4392k7442K0210J2738J3245p367J9987J0595J31j5055M863K9998J3953j1724
$$ 74392 46950 67160 79898 93143 85776 105763 116358 116489 101434 106297 136295 150248 138524
9983A38524M859L2883J3843l7813o9841l0082L5723K4453j1316J791K5696J0591
$$ 138524 143383 176266 190109 152296 82455 52373 88096 112549 101233 103024 128720 139311
9971A39311j4568p882N858l969k5916j5798n057m954k770j8209L6656M7929j37
$$ 139311 124743 116861 122719 118750 92834 77036 71979 67025 64255 46046 82702 130631 130494
9958A30494M039J002k8774k1929j7280J7201L9911K000k2580k0594j1130o750
$$ 130494 134533 135535 106761 84832 67552 84753 124664 126664 104084 83490 72360 65610
9946F5610k385K890M999K7876k896K690J0991n061O922k0578N474l062k3888r43
$$ 65610 63225 66115 71114 98990 96094 98784 109775 104714 111636 91058 96532 93470 69582 68639
9932F8639K340J4110j0147K0521K0804l652k0649m543k16o275j6541r164K1816
$$ 68639 70979 85089 74942 95463 116267 112615 91966 87423 87207 80932 64391 55227 77043
9919G7043M1094N350J8637l0092k5992m736J0847O989K525Q64J486K9910L200
$$ 77043 118137 123487 142124 112032 86040 81304 92151 99140 101665 102529 104015 133925 137125
9906A37125o952k0146k6891k1038K486j3699p286M102j0153J4557K1O868J8886
$$ 137125 130173 110027 83136 62098 64584 50885 43599 47701 37548 52105 52126 58994 77880
9893G7880J0921N017m521K3886j7268m4900p311J5589n893l824J7438J3051Q566
$$ 77880 88801 93818 89297 113183 95915 51015 43704 59293 53400 49576 67014 80065 88631
9880H8631J3704O266m740p789o749K6281J805P525K5294R388l919k7861k0654
$$ 88631 102335 108601 103861 96072 89323 115604 117409 124934 150228 159616 155697 127836 107182
9867A07182p590m843l497j3642J4250J8028K5202J2495n046m997r117l108k1890
$$ 107182 99592 94749 91252 77610 91860 109888 135090 147585 142539 137542 128425 125317 103427
9854A03427k8214k5119J9615N2188J4120j512Q16l3517j3628j3432k6999L3933
$$ 103427 75213 50094 69709 121897 136017 134505 135321 101804 88176 74744 47745 81678
9842H1678k2542M072J9769j3897L381J5260O721J8848m6320Q878K5503K344O703
$$ 81678 59136 63208 82977 69080 72461 87721 94442 113290 66970 75848 101351 103695 110398
9829A10398m966j7337j5778j008J5246j4165q426k0946R105N1724j2042k102Q365
$$ 110398 105432 88095 72317 71309 86555 72390 63964 43018 52123 103847 91805 89703 98068
9816I8068j0001j7761j322N705j5080j3817K0490J6559l53k6419m995M0987P798
$$ 98068 88067 70306 68984 74689 59609 45792 66282 82841 82488 56069 51074 92061 99859
9803I9859J4169J1454o712j1045k7441M857K2760q050l2194o666K4162P203j0977
$$ 99859 114028 125482 118770 107725 80284 85141 107901 99851 67657 60991 85153 92356 81379
9790H1379J7718L1496o839k3027k5152M189J1743m9557l3550J9869N2655J6590
$$ 81379 99097 130593 123754 100727 75575 79764 91507 41950 8400 28269 80924 97514
9778I7514p599J2988o70n888j3488j8204J4179J1393K4266J1336M7747O3799M5325
$$ 97514 89915 102903 102233 96345 82857 64653 78832 90225 114491 125827 173574 237373 282698
9765B82698N8902Q7086Q3183j1882j18777j05812q9309l9951l1242l5484k9984
$$ 282698 341600 428686 511869 499987 381210 275398 186089 146138 114896 79412 49428
9754D9428L705J7131J6485p885j4751K4030j2523m7612m589p891J0786M5508K734
$$ 49428 53133 70264 86749 78864 64113 88143 75620 28008 23419 15528 26314 71822 74556
9741G4556j3494O059j0559L452K511j3182k5286Q28K3493K766l5368L2872M6927
$$ 74556 61062 67121 56562 60014 62525 49343 24057 24885 48378 51144 15776 48648 95575
9728I5575P35k0610j5809r479K711N634M108K290p532j2597j3737r658q487o517
$$ 95575 96310 75700 59891 50412 53123 58757 62865 65155 57623 45026 31289 21631 13144 6627
9714F627L4219L0874r119k3267N150J5257K090J0291n439J573j487n728M367K8598
$$ 6627 40846 71720 62601 39334 44484 59741 61831 72122 66683 68256 66769 61041 65408 94006
9700I4006J0180o041k1926j3031K1774N664J523J5142j156j639k3954n899Q954
$$ 94006 104186 98145 76219 63188 84962 90626 92149 107291 106135 104496 80542 74643 83597
9687H3597j5412j2512j4459q603J1574M147J9892J8923j4565j5801L016N15J825
$$ 83597 68185 55673 41214 32611 44185 48332 68224 87147 72582 56781 59797 60312 62137
9674F2137j2687q214J4459K1607R48j1110r864j1561J5629k5820M535k947J0289
$$ 62137 49450 41236 55695 77302 78250 67140 57276 45715 61344 35524 40059 37112 47401
9661D7401K7379L5832O158J7100K0673j7836k8350J7690O821m04L1219O6198O3457
$$ 47401 74780 110612 116770 133870 154543 136707 108357 126047 132868 132464 163683 229881 293338
9648B93338J16221J69978J50268J40213K29691L84033K38794l95532m84011l41627
$$ 293338 409559 579537 729805 870018 1099709 1483742 1722536 1327004 842993 501366
9638E01366j62760r1055m9984n5423k5972j4514j7252k1240p851n296J5J0199
$$ 501366 338606 247551 197567 142144 116172 101658 84406 63166 55315 50019 50034 60233
9626F0233j5338j8092M939L594K3694L1143l149k2802n372k3424J2777O361k579
$$ 60233 44895 26803 31742 35336 59030 90173 87024 64222 58850 35426 48203 54564 51985
9613E1985J0092K4374J5865K3231j3930l0318k8241j750J0603r209l5802K9831
$$ 51985 62077 86451 102316 125547 111617 81299 53058 51308 61911 52702 16900 46731
9601D6731L0865L373m208l3320l2610k5438O694J9701K4919k277M432N917j4479
$$ 46731 77596 80969 76761 43441 10831 -14607 -7913 11788 36707 34430 38862 44779 30300
9588C0300L794K1823K2358l464K853n103k0794j3844l8797K718K1440J3566l906
$$ 30300 34094 55917 78275 74811 77664 72561 51767 37923 -874 1844 23284 36850 32944
9575C2944p749R052K5153J9442M430M659k4658j0039J1951j506j4090j7294J736
$$ 32944 25195 34247 59400 78842 83272 87931 63273 53234 65185 63679 49589 32295 34031
9562C4031M4613L847j4765k6638q891k1840K1182K4386k1010m267j177q101J0075
$$ 34031 78644 82491 67726 41088 32197 10357 31539 55925 34915 30648 29471 21370 31445
9549C1445J8135k736n136P927j7757L1559k021k943L789j9555k6252n573J7730
$$ 31445 49580 46844 41708 49635 31878 63437 61416 58473 62262 42707 16455 10882 28612
9536B8612L742K4386Q276J0469P932k8222l0413k788q904P702K3731L0601R813
$$ 28612 32354 56740 65016 75485 83417 55195 24782 21994 13090 20792 44523 75124 84937
9523H4937Q600j0326j8357k124J6783K7327k3051k3564M15n002l1331l7063J0245
$$ 84937 93537 83211 64854 62730 79513 106840 83789 60225 60640 55638 24307 -12756 -2511
9510b511L7944L5557J7886k4556l0843j8238K142J3202L758p665O04J2502J9678
$$ -2511 35433 70990 88876 64320 33477 15239 17381 30583 34341 26676 27280 39782 59460
9497E9460J5546J9397K2598J746j2212j603k8310j545q154n362k2753L378K9525
$$ 59460 75006 94403 117001 118747 106535 104932 76622 75077 66923 61561 38808 42186 71711
9484G1711n37p777j2331J1489n188j9613k3350l366j5750Q359m028k064j2604
$$ 71711 71174 63397 51066 62555 57367 37754 14404 11038 -4712 3647 -381 -2445 -15049
9471a5049L2835K4344N923k4082j5113J0622J9054K1840P827Q75j6677k6043j9934
$$ -15049 17786 42130 48053 23971 8858 19480 38534 60374 68201 69076 52399 26356 6422
9458F422J0784K4081n013P953j3868k0106k9745K2628K5517k845J7142P869K094
$$ 6422 17206 41287 36274 44227 30359 10253 -19492 3136 28653 25808 42950 50819 52913
9445E2913K0615j3202j8621j2170J3050l779J895K6501M637n607j7510m0269j3211
$$ 52913 73528 60326 41705 29535 42585 38806 40701 67202 71839 66232 48722 8453 -4758
9432d758J7893M5262J0953K3176k3397o600m851l731l378j8146k5692j1462R977
$$ -4758 13135 58397 69350 92526 69129 62529 57678 53947 50569 32423 6731 -4731 5246
9419E246Q221q13J5624m918L657K386P495J447J8130J9143J3669m1396j5850M790
$$ 5246 13467 12654 28278 23360 27017 29403 36898 38345 56475 75618 89287 47891 32041 36831
9405C6831j3297l5520L7832R529p536n45k0031R649L2252k485k4052l2278K6356
$$ 36831 23534 -11986 25846 35375 27839 27294 7263 16912 49164 46679 22627 -9651 16705
9392A6705K8317j4220q562K4362K5427q081O90J1829J3890j1158k5277P761l3924
$$ 16705 45022 30802 22240 46602 72029 63948 64638 76467 90357 79199 53922 61683 27759
9379B7759j6092N45K7081Q488j0811P036J7713k2939n349J971p021j514J8863
$$ 27759 11667 12212 39293 47781 36970 44006 61719 38780 33431 35402 28381 26867 45730
9366D5730q473P057O940n357r806j2059K335k225j0881j7029p583N118J3140M111
$$ 45730 37257 44314 51254 45897 36091 24032 26367 24142 13261 -3768 -11351 -6233 6907 11018
9352A1018J6356K0172j2659J2914N609p858k6886j460J2500J3696P60r831j2101
$$ 11018 27374 47546 34887 47801 53410 45552 18666 17206 29706 43402 44162 34331 22230
9339B2230K909l072j6492P63L7458K2467j5912J96M169j6707k733J5007L0085
$$ 22230 25139 22067 5575 6338 43796 66263 50351 50547 54716 38009 35276 50283 80368
9326H0368J5106j845j1088p221k9648J5203M701p893k1372m932K188M65k1839
$$ 80368 95474 93629 82541 75320 45672 60875 65576 57683 36311 31379 33567 34032 12193
9313A2193J5613L4979O767j8938P812J3973J1341o961j3596N690J5457n8860j3465
$$ 12193 27806 62785 69552 50614 58426 72399 83740 76779 63183 68873 84330 25470 12005
9300A2005L3362p02J3662J0591l8166k9787J1758J4399K4490k258j7402l7074
$$ 12005 45367 44665 58327 68918 30752 965 12723 27122 51612 49354 31952 -5122
9288e122L103J9451L720j0530J2723M064m441q589J3183K1974J1812P146M661
$$ -5122 -2019 17432 21152 10622 23345 27409 22968 14379 27562 49536 61348 68494 73155
9275G3155N632k7481n423j5507k3227m535p111j749J4836o02J387K3947L0656
$$ 73155 78787 51306 45883 30376 7149 2614 -4497 -6246 8590 7988 9375 33322 63978
9262F3978J0639k1060Q599J3128m0085j9819j990J4082o824K5428o44j6737K0271
$$ 63978 74617 53557 62156 75284 35199 15380 13390 27472 20648 46076 45432 28695 48966
9249D8966K0152n33j2414N196R301l4659q246J9598j0767J3933M600j9885O945
$$ 48966 69118 68585 56171 61367 70668 36009 27763 47361 36594 50527 55127 35242 42187
9236D2187J0480j6556j0845k917O311j1328K950o559j7971j3978K7146P931j2577
$$ 42187 52667 36111 25266 22349 28660 17332 20282 13723 -4248 -18226 8920 16851 4274
9223D274K8322j0103P426J0035k8949L317L3974N570O498k062k0430r476J7855
$$ 4274 32596 22493 29919 39954 11005 14322 48296 53866 60364 58302 37872 28396 46251
9210D6251K0302J2608k6947k4553k374j1191p958N495j0109R239L3441K21J2168
$$ 46251 66553 79161 52214 27661 25287 14096 6138 11633 1524 10763 44204 44425 56593
9197E6593j8156m5615j6940J3842N3381J533n069l304j1476L073k1460o656L6860
$$ 56593 38437 -7178 -24118 -10276 43105 44638 39569 36265 24789 27862 6402 -254 36606
9184C6606J5458j5173O948J1099K9453J6546M519k1164O353j4180J7249k4202
$$ 36606 52064 36891 43839 54938 84391 100937 105456 84292 90645 76465 93714 69512
9172F9512k3905j8184l2744q068L799K4708K0572R207J7928n649j8153p076j0631
$$ 69512 45607 27423 -5321 -13389 -9590 15118 35690 44897 62825 57176 39023 31947 21316
9159B1316o771M937j5167J5831J6472j9798K9662L3975m143P675p07k5637j3460
$$ 21316 14545 19482 4315 20146 36618 16820 46482 80457 76314 83989 83282 57645 44185
9146D4185j835j9355l3573J8839J7897j9349j6432OM212J2570K8316j135J6422
$$ 44185 42350 22995 -10578 8261 26158 6809 -9623 -9617 -5405 7165 35481 34346 50768
9133E0768J3355q354o586J4059n292k8646k0707J8973K2886l0397L963Q879m9574
$$ 50768 64123 55769 49183 63242 57950 29304 8597 27570 50456 20059 24022 32901 -16673
9120a6673o441K6873K0982K5914O401R5q669O521M860L019j1771j637P4m877m356
$$ -16673 -23114 3759 24741 50655 57056 57151 48482 55003 59863 62882 51111 49474 49548 44671 40315
9105D0315j645j8527K6224m0043j1936J6302K3275R403Q013L35l0336o4429j3706
$$ 40315 38670 20143 46367 6324 -5612 10690 33965 43368 51381 51716 21380 -43049 -56755
9092e6755K6716N8124O711j3808n597J127M155L988K1734J8620j3167k2581k173
$$ -56755 -30039 28085 34796 20988 15391 16518 20673 24661 46395 65015 51848 29267 27094
9079B7094P367J9213R022k8358K6937M366k4368m2436P422O867j280K9298J004
$$ 27094 34461 53674 62696 34338 61275 65641 41273 -1163 6259 13126 11846 41144 42148
9066D2148l852p13j2206j822R27R768N407n621M288j4240j1925K5749K2450n004
$$ 42148 38296 37583 25377 23555 24482 34250 39657 34036 38324 24084 12159 37908 60358 55354
9052E5354k8117j5828j405q712Q047k902J4930N401j2387k0339K042K5101q555
$$ 55354 27237 11409 10004 1292 9339 6437 21367 26768 14381 -5958 -3916 21185 12630
9039A2630q814K8195j4735j889J3207j246n262j7544J1160Q913j1388M324j9639
$$ 12630 3816 32011 17276 15387 28594 27348 22086 4542 15702 24615 13227 17551 -2088
9026b088k4799R583P2914L7180k2713k783O93j5200l2518J462P030K0243m6k0535
$$ -2088 -26887 -17304 55610 92790 70077 67294 67987 52787 20269 21731 28761 49004 48958 28423
9012B8423j9536L676o513p934J0114P850o06N933l476P284j8797J1977k872J8304
$$ 28423 8887 12563 6050 -1884 8230 16080 15474 21407 17931 25215 6418 18395 15523 33827
8998C3827J375j1521n210j0604J9287j1722k6230n158J3000R676K0838l5106k3570
$$ 33827 35202 23681 18471 7867 27154 15432 -10798 -15956 -2956 6720 27558 -7548 -31118
8985c1118K4375K0117j971M350O879K078J151j4935Q907K1693K2399J4673j2893
$$ -31118 -6743 13374 11403 15753 22632 24710 25861 10926 19833 41526 63925 78598 65705
8972F5705j2395R823m501j4483P85J8619o51j2951j0817j2014l2409J658O28K2265
$$ 65705 53310 63133 58632 44149 44934 63553 62902 49951 39134 27120 -5289 -3631 -3003 19262
8958A9262K8J0163m130n869J6349J3382p155J9783j3423j3671J0700J7837o628
$$ 19262 19290 29453 25323 19454 35803 49185 42030 61813 48390 34719 45419 63256 56628
8945E6628j2026j5201J5232K0913O707j3619k5977j4537M162K0991l458J0606
$$ 56628 44602 29401 44633 65546 72253 58634 32657 18120 22282 43273 39815 50421
8933E0421J0783J7711j2329j4781q722K8593Q00k1030j8713j3401o647P886J8009
$$ 50421 61204 78915 66586 51805 43083 71676 72476 51446 32733 19332 12685 20571 38580
8920C8580K7406L3308j6763k1841J932Q676k356k8179L916L049j511K365J8729
$$ 38580 65986 99294 82531 60690 62622 71298 68942 40763 44679 47728 46217 48582 67311
8907F7311O169l4539j2193J4571N144k0231l6052o585K7311J5441j9941q121L2540
$$ 67311 73480 38941 26748 41319 46463 26232 -9820 -16405 10906 26347 6406 -1715 30825
8894C0825J1561k4388j4624n691j987j476K6320K673j230J4687p61N240P465j4224
$$ 30825 42386 17998 3374 -2317 -4304 -5780 20540 23213 21983 36670 35909 41149 48614 34390
8880C4390j1430R052q210k4949P090L6991L2040J126l719l7828j663n185L054
$$ 34390 22960 32012 23802 -1147 5943 42934 74974 76100 72381 34553 32890 27705 30759
8867C0759R110q15p982R975J2903l1659L682M68k595K5080l035N339k4569j7241
$$ 30759 39869 39054 31072 41047 53950 22291 25973 26441 23846 48926 45891 51230 26661 9420
8853I420k4569Q546R217j610N289o314J7040P169q010R828J6474M809j5979J2268
$$ 9420 -15149 -6603 2614 1004 6293 -21 17019 24188 16178 26006 42480 47289 31310 43578
8839D3578r125P035l84k3674k2299j482K2862J5883L0307N676m3488p391R727
$$ 43578 34453 41488 41104 17430 -4869 -6351 16511 32394 62701 68377 24889 17498 27225
8826B7225P422J2253N731j0091k0691K1602J691J5002j1296j4962L5833R161j4027
$$ 27225 34647 46900 52631 42540 21849 43451 45142 60144 48848 33886 69719 78880 64853
8813F4853k409J79q266j6504j5394O340j2215n542k0127M017L1741J585j1486
$$ 64853 62444 62623 54357 37853 22459 28799 16584 11042 -9085 -5068 26673 28258 16772
8800A6772J3816J5321k749j741K1041k2889l221P934r595k0607j7617J0372J6953
$$ 16772 30588 45909 43160 41419 62460 39571 36350 44284 34689 14082 -3535 6837 23790
8787B3790L192J3042l434M6L057J2527J9278Q884m076m173j3955j093k629K126
$$ 23790 26982 40024 36590 36636 39693 52220 71498 80382 76306 72133 58178 57085 54456 56582
8773E6582k9707k7736K2394P396k4858J2012J5494j0803J2814L121l0801Q875
$$ 56582 26875 -861 21533 28929 4071 16083 31577 20774 33588 36709 5908 14783
8761A4783K2327J2870j4309L086p501j2384K7647P43p356j3354q624Q100K345
$$ 14783 37110 49980 35671 38757 31256 18872 46519 47262 39906 26552 17928 26028 28373
8748B8373j889K1915p26k1977m0174M826k581n496p725N553J0861J4107N65K0795
$$ 28373 26484 48399 47673 25696 -14478 -9652 -12233 -17729 -25454 -19901 -9040 5067 5632 26427
8734B6427j3622q64J5369R942j8497K318K3340j818l122j36r976J4568K4210J5522
$$ 26427 12805 11941 27310 37252 18755 21073 44413 42595 39473 39337 29361 43929 68139 83661
8720H3661k7725j6426N976l58k1499K4628K7840j000n967P482J9675J0397j2355
$$ 83661 55936 39510 45486 45128 23629 48257 76097 75097 69130 76612 96287 106684 94329
8707I4329k0351k4653k924k237m167P952q814k531Q87p15J3669J5820K3327q256
$$ 94329 73978 49325 46401 44164 39997 47949 39135 36604 37491 36776 50445 66265 89592 81336
8693H1336k6957k0936N99K4138J469p503k0624q237l901N369L753j5851l0561
$$ 81336 54379 33443 34042 58180 59649 52146 31522 23285 19384 24753 28506 12655 -17906
8680a7906o981k407k550P280J6266K3058K7030L2671o663j7684M310J7023m3430
$$ -17906 -24887 -27294 -29844 -22564 -6298 16760 43790 76461 69798 52114 56424 73447 30017
8667C0017K4324K5653O897M852O795k6845j9558l4346J798n613j9442m895m612
$$ 30017 54341 79994 86891 91743 98538 71693 52135 17789 19587 13974 -5468 -10363 -14975
8654a4975k5368J9688L4633K3039J5198k1419R756j8862K8816j9354L763j1812
$$ -14975 -40343 -20655 13978 37017 52215 30796 40552 21690 50506 31152 34915 23103
8642B3103O313j0896L815J0043J8553p790l6L918j4971N027j429J579K3016k7530
$$ 23103 29416 18520 22335 32378 50931 43141 43105 47023 32052 37079 35650 37229 60245 32715
8628C2715k7340R692L52P480K2788p456j8859k411m69J8181M119K629J171q811
$$ 32715 5375 15067 15419 22899 45687 38231 19372 16961 16492 34673 38792 41421 42592 33781
8614C3781k0354K9068J890l0997K798j3300K5644K6852j7173o999K811j1358r055
$$ 33781 13427 42495 44385 13388 16186 2886 28530 55382 38209 31210 34021 22663 13608
8601A3608L548r941l1519J6585M2931M121k0692j7284J7294P101j4898n3021J886
$$ 13608 17156 7215 -24304 -7719 35212 39333 18641 1357 18651 25752 10854 -42167 -40281
8588d0281K0168P852K5160L4712J9402j3651j7480Q470L392m00r919M662O475
$$ -40281 -20113 -12261 12899 47611 67013 53362 35882 44352 47744 47344 37425 42087 48562
8575D8562J792o58J9152K547k6756j1167J6545J1972m453j4046j2886J3604L0358
$$ 48562 50354 49696 68848 71395 44639 33472 50017 61989 57536 43490 30604 44208 74566
8562G4566q627j3674j3950Q575k5288k5358M2090K8277J927J165q272m1778J2644
$$ 74566 65939 52265 38315 46890 21602 -3756 38334 66611 68538 69703 61431 19653 32297
8549C2297K4827j1512j979k3993j2567K5027R463J2947O204n959j6447l9803j3726
$$ 32297 57124 45612 43633 19640 7073 32100 41563 54510 60714 54755 38308 -1495 -15221
8536a5221k413K0431J1377J5705j0124L385Q816m928n697L5138k078m1933j5875
$$ -15221 -17634 2797 14174 29879 19755 23140 31956 27028 21331 56469 54391 12458 -3417
8523c417L0551L4991J7530j3828j4695M2440J0269K634M0228J1494m6604l9912
$$ -3417 27134 62125 79655 65827 51132 93572 103841 106475 146703 158197 111593 71681
8511G1681l3728L346L451N352J8056n177r646k670o452j2033j7193j465J5095
$$ 71681 37953 41299 44750 50102 68158 62981 53335 50665 44213 32180 14987 13522 28617
8498B8617K1175j1839j119l215j4285O803l970k0738N806J1675J9304q38j2150
$$ 28617 49792 37953 36834 33619 19334 26137 22167 1429 7235 18910 38214 37376 25226
8485B5226k5923J0194J804J7719K4308J2984M2372J2357k378k4609l916K7681
$$ 25226 -697 9497 11301 29020 53328 66312 108684 121041 118663 94054 90138 117819
8473A17819L0997k916O0191Q8684J4579j09435q1935o1855n681l719o030m084
$$ 117819 148816 145900 206091 294775 309354 199919 117984 56129 50448 46729 40699 36615
8461C6615J5410J738j5435J6670L45N695m808j533p271j1425P973J1349K9981
$$ 36615 52025 53763 38328 54998 55343 61038 56230 54697 47426 36001 43974 55323 85304
8448H5304l819k9633J0109N0080K885j5787o260j3274J01j619R231J4237J6964
$$ 85304 81485 51852 61961 112041 114926 99139 92879 79605 79706 78087 87318 101555 118519
8435A18519J7731M582j8788j6410k255M007O910j6114J6113K8992K6518J388l0780
$$ 118519 136250 140832 122044 105634 103379 107386 114296 98182 114295 143287 169805 171193 140413
8422A40413k1419l4096j2315k1615j3622J8572K2308k1397o058J5016P314p607
$$ 140413 118994 84898 72583 50968 37346 55918 78226 56829 50771 65787 73101 65494
8410F5494k0946l8834Q408j2065N375J4411P304P137J3372j6073J50k5487K0665
$$ 65494 44548 5714 14122 2057 7432 21843 29147 36284 49656 33583 33733 8246 28911
8397B8911P885j385R544K0724O996p499j8912K67j1733Q954K3214j9065k6724
$$ 28911 36796 35411 44955 65679 72675 65176 46264 46531 34798 43752 66966 47901 21177
8384B1177j1139O171j1554r114k2626j5594M7883M6967P968J1149J8747m3772
$$ 21177 10038 16209 4655 -4459 -27085 -42679 5204 52171 60139 71288 90035 46263
8372D6263k3122J4952k3341k1246M3051L9526J3505j3236o775J9322l3643l9490
$$ 46263 23141 38093 14752 -6494 36557 76083 89588 76352 69577 88899 55256 15766
8360A5766q175J6233P937j7255m503K0099L222k1620J2516j505l81j2496k7725
$$ 15766 7591 23824 31761 14506 10003 30102 33324 11704 24220 22715 22334 9838 -17887
8347a7887q120M1874r337j4375N672N577m163J6512K5543n065j1712m780J8014
$$ -17887 -26007 15867 6530 -7845 -2173 3404 -759 15753 41296 36231 24519 19739 37753
8334C7753K8336J076p828J0736J1362l7928k2956o322k2247N073K4489K1335K633
$$ 37753 66089 67165 59337 70073 81435 43507 20551 14229 -8018 -2945 21544 42879 45512
8321D5512q982p350l641o642j1718j4233m09J6050K9924M097j3450J7186J3981
$$ 45512 36530 29180 25539 18897 7179 -7054 -7463 8587 38511 42608 29158 46344 60325
8308F0325J5479j8752k8206J2750l463j1807K723K2052J0021K885j9367j6622
$$ 60325 75804 57052 28846 41596 38133 26326 29049 51101 61122 64007 44640 28018
8296B8018j4712M080J2659P815k7138q717K1702n271k135J6677J2090K198l0026
$$ 28018 13306 17386 30045 37860 10722 2005 23707 18436 16301 32978 45068 47266 17240
8283A7240k5067k079K097K2636K2746J9125j5242m2687l734K0433J0233k0261
$$ 17240 -7827 -9906 -7809 14827 37573 56698 41456 -1231 -4965 15468 25701 5440
8271E440j1208P946m0151K0720M769j2974J7245j5238J4792M2314N632j1595k9207
$$ 5440 -5768 2178 -37973 -17253 -12484 -25458 -8213 -23451 -8659 33655 39287 27692 -1515
8258a515J4057j192m734J3616J4218L9279R554j9132k3532l1022Q924L268K4511
$$ -1515 12542 11350 6616 20232 34450 73729 83283 64151 40619 9597 18521 21789 46300
8245D6300K2598j3428n929J5608m258k7013k3203J1845p152J4396J1880M885k2754
$$ 46300 68898 55470 49541 65149 60891 33878 10675 22520 15368 29764 41644 46529 23775
8232B3775r586P929M402P554k857k2867o439N501M101K0549K9422k7766q677J4099
$$ 23775 14189 22118 26520 34074 31217 8350 1911 7412 11513 32062 61484 33718 25041 39140
8218C9140o970n337O870J5746J2200l5114k9557J3904n706k1701p35L598K1690
$$ 39140 32170 26833 33703 49449 61649 26535 -3022 10882 5176 -16525 -17260 -13662 8028
8205H028O503m8782m6402J2992N1136K1194J3369J9307k3364Q41k1112o626K891
$$ 8028 14531 -34251 -80653 -67661 -16525 4669 18038 37345 13981 14822 -6290 -12916 -10025
8192a0025K0455J2095Q739Q101J8073m388j9831j8991l9785J3333M676J8345R126
$$ -10025 10430 22525 31264 39365 57438 53050 33219 14228 -25557 -12224 -7548 10797 19923
8179A9923j1714j6127j581J9882J1365j180j0854J010J0070k91M133j4609k2000
$$ 19923 8209 -7918 -9499 10383 21748 20568 9714 10724 20794 20503 24636 10027 -11973
8166a1973J4944J6285j2913J0580j1332J0374Q260k3274L869K8588J1211J0410
$$ -11973 2971 19256 6343 16923 5591 15965 24225 951 4820 33408 44619 55029
8154E5029j4058l1044J088J3974j1414j4501K370R838p796j2334J9378J3604n212
$$ 55029 40971 9927 11015 24989 13575 -926 1444 11282 3486 -8848 10530 24134 18922
8141A8922M445k90p569M366j0019J6776j0944K0842K3634k5522l4404J9399J8638
$$ 18922 23367 23077 15508 19874 9855 26631 15687 36529 60163 34641 237 19636 38274
8128C8274k8911K6091j128j9843Q320k656R158P529R019R069j4023J014O920j4884
$$ 38274 9363 35454 34326 14483 22803 20147 29305 36834 45853 54922 40899 41913 48833 33949
8114C3949l4823k3025J4418M0878J1949j5842j504J5695k1037m172J4760J5030
$$ 33949 -874 -23899 -9481 31397 43346 27504 26000 41695 20658 16486 31246 46276
8102D6276J5369K6905O58k5105q318m020k4885J4043r871m762n696j9033k8077
$$ 46276 61645 88550 89208 64103 55785 51765 26880 40923 31052 26290 20594 1561 -26516
8089b6516l970J7626J1628m097J2428j3038l4405J712K7953K9319J3401j1346
$$ -26516 -30486 -12860 -1232 -5329 7099 -5939 -40344 -38632 -10679 18640 32041 20695
8077B0695K8095K4519q954j8404P217p027k6812k288r049k537J2757k3570k9846
$$ 20695 48790 73309 64355 45951 53168 46141 19329 17041 7992 5455 18212 -5358 -35204
8064c5204j083N0853J1056j669R179j7078j478k099r165K4721n538k1685j0568
$$ -35204 -36287 14566 25622 23953 33132 16054 14576 12477 3312 28033 22495 810 -9758
8051i758L837J6516K8532j3451j8813J2481M2399J1045j2287J3440o456n0577
$$ -9758 -5921 10595 39127 25676 6863 19344 61743 72788 60501 73941 67485 16908
8039A6908l5500j4635O562R624K7924L2284L3806L2004p11M90k2332n7472k9902
$$ 16908 -18592 -33227 -26665 -17041 10883 43167 76973 108977 108266 108756 86424 28952 -950
8026i50M664k009Q947P774N391K5836j715J0540J9056j6575m2291l97j0391k8248
$$ -950 3714 1705 10652 18426 23817 49653 47938 58478 77534 60959 18668 18271 7880 -20368
8012b0368J4761L3632J8970n352k5941j7984o557k7304p813L082J1893K1561K5306
$$ -20368 -5607 28025 46995 41643 15702 -2282 -8839 -36143 -43956 -40874 -28981 -7420 17886
7999A7886p258j9006K6996L0717j1385m250j913j3875m949r972M786L0242R015
$$ 17886 10628 -8378 18618 49335 37950 33700 31787 17912 12963 2991 7777 38019 47034
7986D7034p096n835j5641N763J7598o550P414l6133l0312K5234L5732K3961M197
$$ 47034 39938 34103 18462 24225 41823 35273 42687 6554 -23758 1476 37208 61169 65366
7973F5366R686P185k7198k9064n481L420k0448j028J6156l470P976K2820L599
$$ 65366 75052 82237 55039 25975 20494 23914 3466 2438 18594 15124 23100 45920 49519
7960D9519j8882j5833l0751k390J5953K1724K534N685M7832P89j2867l3788l3378
$$ 49519 30637 14804 -15947 -18337 -2384 19340 21874 27559 75391 76180 63313 29525 -3853
7947c853j9227j5294o561Q910Q929K881J4299O621j6133K5122j7476j186J6763
$$ -3853 -23080 -38374 -44935 -36025 -27096 -24215 -9916 -3295 -19428 5694 -11782 -12968 3795
7934C795K3231n620o768K5152N935k6090J330J4379o115J7359M73k7135p174K1883
$$ 3795 27026 21406 14638 39790 45725 19635 20965 35344 29229 46588 47061 19926 12752 34635
7920C4635l533J487K7194Q388J5787m4997j6214K8764m787j9343Q481n358n936
$$ 34635 31102 32589 59783 68171 83958 38961 22747 51511 46724 27381 35862 30504 24568
7907B4568k484m7231k4717L1285K7190J8837J0431J2769k3485M106J1679p266
$$ 24568 22084 -25147 -49864 -18579 8611 27448 37879 50648 27163 31269 42948 35682
7895C5682K30q204N081n169J9148L766j2720p629J2850R125j2869k1294j3391
$$ 35682 35912 27708 32789 27620 46768 50534 37814 30185 43035 52160 39291 17997 4606
7882D606R456O889j9144l782N310L0167M882j0141k180j4204L3817O208j6882
$$ 4606 14062 20951 1807 -1975 3335 33502 38384 28243 26063 11859 45676 51884 35002
7869C5002j0294j7092j1151K1061Q27j6796Q870M494k0417k2196J5139R108l80
$$ 35002 24708 7616 -3535 17526 18353 1557 10427 14921 -5496 -27692 -12553 -3445 -3825
7856c825J2175O891Q472K477r26N724M402J7430P333j4547k0203k4457j5345j8245
$$ -3825 8350 15241 23713 26190 25264 30988 35390 52820 60153 45606 25403 946 -14399 -32644
7842c2644J314J7410L3431K710m866N659J7311m049k4589J3552k3655Q241j6527
$$ -32644 -31330 -13920 19511 22221 17355 23014 40325 36276 11687 25239 1584 9825 -6702
7829f702o797j737j2063r105J6864J2878J6224K0386k2395j6694j6268K7473R588
$$ -6702 -13499 -15236 -27299 -36404 -19540 -6662 9562 29948 7553 -9141 -25409 2064 11652
7816A1652k0220J0451M18j0624L338o962k1554m068J9409K05R871N392J7213j8620
$$ 11652 -8568 1883 2301 -8323 -4985 -11947 -33501 -37569 -18160 -17955 -8084 -2692 14521 -4099
7802d099m558K2247r35j5800j3687N207L2589J4524j7136n690R778J0471j1300
$$ -4099 -8657 13590 12655 -3145 -16832 -11625 20964 35488 18352 12662 22440 32911 21611
7789B1611P012J6037k228k8142j6144J8557O631p54L1450q517m639j6798j6147
$$ 21611 28623 44660 42432 14290 -1854 16703 23334 22580 54030 45513 40874 24076 7929
7776G929j4078K4984K2568r387L73j8618J1230j4455r216J061P901Q735J6189
$$ 7929 -6149 18835 41403 32016 32389 13771 25001 10546 1330 2391 10292 19027 35216
7763C5216j8655j771n470k3713N2904K6128k3761k1408m804J5072p260J6277r560
$$ 35216 16561 14790 9320 -14393 38511 64639 40878 19470 14666 29738 22478 38755 29195
7750B9195j5234j0649l1164j7905L8754J8593Q994p036n51L5691n95r295q618
$$ 29195 13961 3312 -27852 -45757 -7003 11590 20584 13548 12997 48688 48093 38798 30180
7737C0180J4181q760J98J4509k4490k1932o893j436m717o263P915j2457j270M2245
$$ 30180 44361 35601 35799 50308 25818 3886 -3007 -4443 -9160 -15423 -7508 -19965 -21235 21010
7723B1010J4541k1631j6347L816K284Q970l812l3325N042K2565Q881k6311j439
$$ 21010 35551 13920 -2427 1389 3673 12643 8831 -24494 -19452 3113 11994 -14317 -15756
7710a5756K7841J7007J1350K5225k1221o619J0295P359l3805k7594j6950J8518
$$ -15756 12085 29092 40442 65667 44446 37827 48122 55481 21676 -5918 -22868 -4350
7698d350K5782M974p66l9523M449K4498K1773k3704Q342n038N227N722j4341k6997
$$ -4350 21432 26406 25640 -13883 -9434 15064 36837 13133 21475 16437 21664 27386 13045 -13952
7684a3952K2232J687P87L1678K660r108j2538K35M339q956l0804J2829R987K1578
$$ -13952 8280 9967 10754 42432 45092 35984 23446 23681 28020 19064 -11740 1089 11076 32654
7670C2654J2741J591m518j474j2870m854p525k948m722J0497L761K408j2475k485
$$ 32654 45395 46986 42468 40994 28124 23270 15745 12797 8075 18572 22333 24741 12266 9781
7656I781K2029j0543p755m51j6830j2141J5530l397j5425j237N474m525j541J509
$$ 9781 31810 21267 13512 13061 -3769 -15910 -380 -3777 -19202 -20439 -14965 -19490 -21031 -19522
7642a9522o526K4193J7598P06M955j151L420Q674J3953q595j7888k1520l186P798
$$ -19522 -26048 -1855 15743 16449 21404 20253 23673 32347 46300 37705 19817 -1703 -4889 2909
7628B909J911o042l388K8182J0279l140j0264O248m3298o175l452k293J9520P217
$$ 2909 4820 -1222 -4610 23572 33851 30711 20447 26695 -16603 -22778 -26230 -28523 -9003 -1786
7614a786J3735p474j4849j0226n531J3206j1080k4316Q097L1977j5865j2378l712
$$ -1786 11949 4475 -10374 -20600 -26131 -12925 -24005 -48321 -40224 -8247 -24112 -36490 -40202
7601d0202J5210J8095J4656k4741l8368j7492K8479J4293J0032J0328J4025Q157
$$ -40202 -24992 -6897 7759 -16982 -55350 -72842 -44363 -30070 -20038 -9710 4315 12472
7589A2472l4192j9982J3389J3619O956r762L500M293K541j7882j3340o775J2748
$$ 12472 -21720 -41702 -28313 -14694 -7738 -17500 -14000 -9707 -7166 -25048 -38388 -45163 -32415
7576c2415K1469K1437P390j4641m808J0639J3421k4872j9481P18o519o645P622
$$ -32415 -10946 10491 17881 3240 -1568 9071 22492 -2380 -21861 -21143 -27662 -34307 -26685
7563b6685L0100J0345M887R100Q536J3446J1105j779l5909p411L5893K5091n3228
$$ -26685 3415 13760 18647 27747 36283 49729 60834 59055 23146 15735 51628 76719 23491
7550B3491j8810N371J3332J4234q289J763J6512m046J483r564l2898j7646J660
$$ 23491 4681 10052 23384 37618 29329 31092 47604 43558 45041 35477 2579 -15067 -13407
7537a3407R3j5970J4912j80K0823K8374K7187j9573j167R938k1073k3243N620
$$ -13407 -13314 -29284 -14372 -14552 6271 34645 61832 42259 41092 51030 29957 6714 12334
7524A2334m993j6145P8O395n703K5273n13o650k4529L889K9372R807K3677J1976
$$ 12334 7341 -8804 -8726 -2331 -8034 17239 16726 10076 -14453 -10564 18808 28615 52292 64268
7510F4268N319j9536j6454O119O023k6363o453Q884R408J0995l059k4378r283
$$ 64268 69587 50051 33597 39716 45739 19376 12923 21807 31215 42210 39151 14773 5490
7497E490j6075J10K5757K4052J3079k7839l6911j4525J4659q894m492J4740L343
$$ 5490 -10585 -10475 15282 39334 52413 24574 -12337 -26862 -12203 -21097 -25589 -10849 -7506
7484g506j8139o33J6182j857K0606K0947Q135l3068k5215k034l799K2344N588
$$ -7506 -25645 -26278 -10096 -11953 8653 29600 37735 4667 -20548 -22582 -26381 -4037 1551
7471A551O110J6683l4157k1569r452L6814J6093j3209j8246O845J7259Q964o27
$$ 1551 7661 24344 -9813 -31382 -40834 -4020 12073 -1136 -19382 -12537 4722 13686 13059
7458A3059j7345k397J8911k7441j594K885K1663J4958Q861J4716k4856k5641j0856
$$ 13059 -4286 -6683 12228 -15213 -16807 -13922 7741 22699 31560 46276 21420 -4221 -15077
7445a5077m699R074j0361j0650l659J4787J3449K0908j9184L934J6070N216q997
$$ -15077 -19776 -10702 -21063 -31713 -35372 -20585 -7136 13772 -5412 -1478 14592 19808 10811
7432A0811P859J9167j9281k8168Q373J1982J1947K9998o621R557R330l7921l1206
$$ 10811 18670 37837 18556 -9612 -1239 10743 22690 52688 46067 55624 64954 27033 -4173
7419d173j255M990R247M3064J4089J2314k0075o865o502j2307Q796m120L694n82
$$ -4173 -5428 -438 8809 51873 65962 78276 58201 51336 44834 32527 41323 37203 40897 40315
7405D0315k7894l0010m318j0944L5059K2833j5950k1535M79J5245M938J8516j6751
$$ 40315 12421 -17589 -21907 -32851 2208 25041 9091 -12444 -11965 3280 8218 26734 9983
7392I983j4510q820j1857J7095M8957K1325L639j7171n600j3644N482m485J1278
$$ 9983 -4527 -13347 -25204 -8109 40848 62173 65812 48641 43041 29397 34879 30394 41672
7379D1672l669k3123k197K4502J0742m3994k8395L329J8234J5570l677j7827J8379
$$ 41672 38003 14880 12683 37185 47927 3933 -24462 -21133 -2899 12671 8994 -8833 9546
7366I546J0721L690j6878j7198N930O710K3040r134j1227J7128K8927j4416l4367
$$ 9546 20267 23957 7079 -10119 -4189 2521 25561 16427 5200 22328 51255 36839 2472
7353B472l9962j293J5967K8610n074l0247l444J3458Q233L9064P712j8969K47
$$ 2472 -37490 -38783 -22816 5794 720 -29527 -32971 -19513 -11280 27784 35496 16527 16774
7340A6774Q721J9221J7968j8606j3053j8452p776j8319o479J0521L0069L0057
$$ 16774 25495 44716 62684 44078 31025 12573 4797 -13522 -20001 -9480 20589 50646
7328E0646L870j3628l5347j5678J2736J0948j9835o632K0381j3422L501L451m245
$$ 50646 54516 40888 5541 -10137 2599 13547 -6288 -12920 7461 -5961 -2460 991 -3254
7315c254L675J1154J5779k6692k1974m214J6418L0195K4115k7160L09J2534j794
$$ -3254 421 11575 27354 662 -21312 -25526 -9108 21087 45202 18042 18351 30885 29091
7302B9091m0474j1322M897J1727J5406j3335J6767K8869l3742k0392j6469L0826
$$ 29091 -11383 -22705 -17808 -6081 9325 -4010 12757 41626 7884 -12508 -28977 1849
7290A849J0347R687J9163J1630j0604p840j7589k8877j1625n997k638j6155K4171
$$ 1849 12196 21883 41046 52676 42072 34232 16643 -12234 -23859 -29856 -32494 -48649 -24478
7277b4478L2026o673j3987J0035j5166k0714K3701J6006m07J9368k2747l5290
$$ -24478 7548 875 -13112 -3077 -18243 -38957 -15256 750 343 19711 -3036 -38326
7265c8326J2959K1235K3173L249j2394J5489J8774j1416j8362L872R629K034j3528
$$ -38326 -25367 -4132 19041 22290 9896 25385 44159 32743 14381 18253 27882 29916 16388
7252A6388K0596J6964l9154m0622R853J1479K332J7269Q343j1685k7409j4221
$$ 16388 36984 53948 14794 -25828 -15975 -4496 -2164 15105 23448 11763 -15646 -29867
7240b9867J0243J0167J9515K066P792R082q433J944k7580k8462k5696J7342K0581
$$ -29867 -19624 -9457 10058 12124 19916 28998 20565 22509 -5071 -33533 -59229 -41887 -21306
7227b1306L4927J5737o162J419J5051M3922K276n5541k4581K269R295J9221j7053
$$ -21306 13621 29358 23196 24615 39666 83588 85864 30323 5742 8011 17306 36527 19474
7214A9474k1056p839J2502K3362n758l2123J6500q159L428J6179K7682J2393O032
$$ 19474 -1582 -9421 3081 26443 20685 -11438 5062 -3097 331 16510 44192 56585 62617
7201F2617j0730k4404k8215k2865J181J0053j1450o003Q130K8874j009J4970J8496
$$ 62617 51887 27483 -732 -23597 -22416 -12363 -23813 -29816 -21686 7188 6179 21149 39645
7188C9645l578k0532k4874r008J8547j896J716o715K7185J1997l5132J3007J1608
$$ 39645 36067 15535 -9339 -18347 200 -1696 20 -6695 20490 32487 -2645 10362 21970
7175B1970Q631k7800k2457J6295J7594J2344K094j4249j5546J3826l6285r450
$$ 21970 30601 2801 -19656 -3361 14233 26577 28671 14422 -1124 12702 -23583 -33033
7163c3033K4416J5961P900K9143k242j7878k2015J5448O79m770o008k4951m558
$$ -33033 -8617 7344 15244 44387 42145 24267 2252 17700 18379 13609 7601 -17350 -21908
7150b1908J7190M61J9581n907j1223j804o074L678K5543J8038L3885j0812l3958
$$ -21908 -4718 -4257 15324 9417 -1806 -3610 -9684 -6006 19537 37575 71460 60648 26690
7137B6690j6795J2898L653J5860K107q237p735K1334l634L543k502k6544j0443
$$ 26690 9895 22793 26446 42306 44413 36176 28441 49775 46141 49684 47182 20638 10195
7124A0195k6932k3767r53L3752P469J2259N93j1126P092J3797k2195m749J0934
$$ 10195 -16737 -40504 -41457 -7705 -236 12023 12616 1490 8582 22379 184 -4565 6369
7111F369J6423j4798p603p805N383J1658L981j8798j2373J6534P408k6417k9688
$$ 6369 22792 7994 391 -7414 -2031 9627 13608 -5190 -17563 -1029 6379 -20038 -49726
7098d9726M197K4359J7739p509j5916J7547O466J8963J6692m431p252L094p947
$$ -49726 -45529 -21170 -3431 -10940 -26856 -9309 -2843 16120 32812 28381 21129 24223 16276
7085A6276l1789n5L1394K081p555j4535j8305Q962J0904j0164o734N519q481J9562
$$ 16276 -15513 -15568 15826 17907 10352 -4183 -22488 -13526 -2622 -12786 -19520 -14001 -22482 -2920
7071b920J5694L571j3347l541p927J6070p76j6315J0700k775j5368n933l595K8691
$$ -2920 12774 16345 2998 -543 -8470 7600 6824 -9491 1209 -1566 -16934 -22867 -26462 2229
7057B229J5621N25L718P498P391j3700j5888j3429j7914O250L0849p654j1282
$$ 2229 17850 18375 22093 29591 36982 23282 7394 -6035 -23949 -17699 13150 5496 -5786
7044e786N791J5325p590O815Q084J2979n511j6654M886R359k9562m2272r807M918
$$ -5786 5 15330 7740 14555 22639 35618 30107 13453 18339 27698 -1864 -44136 -53943 -49025
7030d9025L0643R888J3916L011J4218N45l1427K888k1805M253J7321M913j8082
$$ -49025 -18382 -8494 5422 8433 22651 23196 -8231 -5343 -27148 -22895 -5574 -661 -18743
7017a8743J9634p97l255N862j7387O326R140j0908K399J0807N330O749j8744r779
$$ -18743 891 94 -3161 2701 -14686 -8360 780 -10128 -7729 3078 8408 15157 -3587 -13366
7003a3366O034o347j8505k941L368k582J2359R185J5142M548n105k2710j8562
$$ -13366 -7332 -13679 -32184 -35125 -31757 -34339 -21980 -12795 2347 6895 1790 -20920 -39482
6990c9482L0924N081l921J6585K5844J8246j6108M511L74Q479j7206j5907j4520
$$ -39482 -8558 -3477 -7398 9187 35031 53277 37169 41680 42054 50533 33327 17420 2900
6977B900j9146r343M76R264J008K4022J567p215J9685J8724j1714j7369Q599Q154
$$ 2900 -16246 -25589 -25113 -15849 -14841 9181 10748 3533 23218 41942 30228 12859 21458 29612
6963B9612j9522K0919M31j569L151k0479m506Q365O566j8340j2505J2879k918
$$ 29612 10090 31009 31440 29871 33022 12543 8037 16402 22968 4628 -7877 5002 2084
6950B084q546K0041K0380m628j1841M447n224n044n20j5146r562J3744j029o852
$$ 2084 -6462 13579 33959 29331 17490 21937 16713 11669 11149 -3997 -13559 185 -844 -7696
6936g696J6525q869R997P383r628M3210R936j9200K0465j2862l4526k3576k438
$$ -7696 8829 -40 9957 17340 7712 50922 60858 41658 62123 49261 14735 -8841 -11279
6923a1279J8094L0250k993j947q969r937k2198j1414r190R285K0711K4148L0240
$$ -11279 6815 37065 34072 32125 23156 13219 -8979 -20393 -29583 -20298 413 24561 54801
6910E4801r868K0847j5740k8108o126j5645l232K8839K3364l232p811k5186j6626
$$ 54801 44933 65780 50040 21932 15806 161 -3071 25768 49132 45900 38089 12903 -3723
6897c723K311K587Q30j8574Q325J7515M422J3535N427j1622l642o164m042j9764
$$ -3723 -1412 1175 2005 -16569 -8244 9271 13693 27228 32655 21033 17391 11227 7185 -12579
6883a2579K3130M494l265L8400J2021k4504J0744l53q863Q72J0223l1839l0404
$$ -12579 10551 15045 11780 50180 62201 37697 48441 48088 39225 40097 50320 18481 -11923
6870a1923O101O428j155K072J1790k35q262L0198N449o752k3816j9511O673K1442
$$ -11923 -5822 606 -549 1523 13313 13078 4816 35014 40463 33711 9895 -9616 -2943 18499
6856A8499J7664R763k2573k0984j0347J4663j864n373j732j6254K466K1488J2496
$$ 18499 36163 45926 23353 2369 -7978 6685 4821 -552 -2284 -18538 -16072 5416 17912
6843A7912j153n697P987P697P319j6274j1108J3114R119p352j4035M690Q293p280
$$ 17912 16759 11062 19049 26746 34065 17791 6683 19797 28916 21564 7529 12219 20512 13232
6829A3232j5624j998P004J0495J5908P86J0868J3952L713j8799j3282k0325j9464
$$ 13232 -2392 -4390 2614 13109 29017 29803 40671 54623 58336 39537 26255 5930 -13534
6816a3534K3066j8841O54n997q21j2325q332K1301K4587J6049k0779J401j2058
$$ -13534 9532 -9309 -8655 -14652 -15473 -27798 -36130 -14829 9758 25807 5028 6429 -5629
6803e629L1595J8272p638l113R733j7947j6797J7107q585o571M242j6397J939
$$ -5629 25966 44238 36600 33487 43220 25273 8476 25583 16998 10427 14669 -1728 211
6790B11o921N636K6368K048J7247Q549j1846J1791J269k2961j8218j0440Q812
$$ 211 -6710 -1074 25294 27342 44589 53138 41292 53083 54352 31391 13173 2733 11545
6777A1545K1397O497l0239n0M3641J1200j2418P446j2950n423R735m073m1319
$$ 11545 32942 39439 9200 9150 52791 63991 51573 59019 46069 40646 50381 46308 4989
6764D989L021K0564j8331j2156Q909J2061j1783R818J44k5134P397K9898j854
$$ 4989 8010 28574 10243 -1913 6996 19057 7274 17092 17236 -7898 -501 29397 27543
6751B7543j1183r531L556r980O938L581O894j3318m718R593K0803n37m871k673
$$ 27543 16360 6829 10385 405 7343 10924 17818 4500 -218 9375 30178 29641 24770 22097
6737B2097Q542k6078n02o419n187l52k4718l78j38J1361J3452K4369j5609j2989
$$ 22097 30639 4561 4059 -2360 -7547 -7899 -32617 -32995 -33133 -21772 -8320 16049 440 -12549
6723a2549K3586J5024j3482o390j2394l510n629k3665J3528L6430K3228k3845
$$ -12549 11037 26061 12579 6189 -6205 -9715 -15344 -39009 -25481 10949 34177 10332
6711A0332k7550o002M41Q160K1086J9073Q424l470k54l4193k310p693j4448K1255
$$ 10332 -17218 -23220 -22779 -14619 6467 25540 33964 30494 30240 -3953 -6263 -13956 -28404 -7149
6697g149J0115k017l242J773J5718m443j3265J0055P850j1283j1386J3206n974
$$ -7149 2966 949 -2293 -520 15198 10755 -2510 7545 15395 4112 -7274 5932 -42
6684d2j3285j8211j0419J2553L0558J1568J066q760J114R146k25j8309l901o858
$$ -42 -13327 -31538 -41957 -29404 1154 12722 13788 5028 6142 15288 15063 -3246 -7147 -14005
6670a4005J2328J3580m085K2704J4693j1189N800J234J0036k3115k1020j4527
$$ -14005 -1677 11903 7818 30522 45215 34026 39826 41060 51096 27981 6961 -7566
6658g566N528p016k052k06p172O103l484J0780O42j4638N171Q253K8113K160j279
$$ -7566 -2038 -9054 -11106 -11312 -18484 -12381 -15865 -5085 -4443 -19081 -13910 -5657 22456 24616 23337
6643B3337N2319K2997l2430l2777j1072Q793J5447k7395j126Q651j6485J1342
$$ 23337 75656 98653 66223 33446 22374 31167 46614 19219 18093 26744 10259 21601
6631B1601J2563r699j483j4577P088L620j8676p380k7033q331P932M783K2016
$$ 21601 34164 24465 22982 8405 15493 19113 437 -6943 -33976 -42307 -34375 -29592 -7576
6618g576R03p961l0686J1422L8024l084j3733l857J1799R503N521m96j2587l934
$$ -7576 -6673 -14634 -45320 -33898 4126 1042 -12691 -16548 -4749 4754 10275 9779 -2808 -6742
6604f742k938n890k359o931K1204J9175J2623l458q209m489J0875o197j5766K2412
$$ -6742 -9680 -15570 -17929 -24860 -3656 15519 28142 24684 16475 11986 22861 16664 898 23310
6590B3310r700j5027J02j4395L0937l108k605K398R979K8027j5548P075M389o494
$$ 23310 13610 -1417 -1315 -15710 15227 12119 9514 11912 21891 49918 34370 41445 45834 39340
6576C9340p445l501j7696n074k1612K358J4509j3029J9284j1645j3489K0542J2175
$$ 39340 31895 28394 10698 5624 -15988 -13630 879 -12150 7134 -4511 -18000 2542 14717
6563A4717L1673J6633m5749l5130q006n63R964J0734J9436M252j9342j3448L0682
$$ 14717 46390 63023 17274 -17856 -25862 -26425 -16461 -5727 13709 17961 -1381 -14829 15853
6550A5853n82k5371j4537l548K3364K6842J6183j8929j5292J1638m268J6130J5071
$$ 15853 15271 -10100 -24637 -28185 -4821 22021 38204 19275 3983 15621 11353 27483 42554
6537D2554l4047J2321j199p697o765j9615J9313J5365J0109J4032m238K1918J5469
$$ 42554 8507 20828 19629 11932 5167 -14448 4865 20230 30339 44371 40133 62051 77520
6524G7520k8407m1205j5423K5228J5799k6919j4428j4727J112J0970j6490J1672
$$ 77520 49113 7908 -7515 17713 33512 6593 -7835 -22562 -21450 -10480 -26970 -15298
6512a5298j0008j0945j5822K599J6660N2321L3136k0667M083j0104k525J1760
$$ -15298 -25306 -36251 -52073 -49474 -32814 19507 52643 31976 36059 25955 23430 35190
6500C5190p805k1713p731J0777J0854K0516o003p444N135j5988j7780p484J0103
$$ 35190 27385 5672 -2059 8718 19572 40088 34085 26641 31776 15788 -1992 -9476 627
6487F27n162l578K0837j237j6733r302L0026J6203m25j7277k1263k953J6389M545
$$ 627 -4535 -8113 12724 11487 -5246 -14548 15478 31681 31256 13979 -7284 -10237 6152 10697
6473A0697m916j1822J538J7222L98K1470K1520j1549n116j6835j3137J8072k890
$$ 10697 5781 -6041 -4503 12719 13117 34587 56107 44558 39442 22607 9470 27542 24652
6460B4652j6081N66K8369R549l5917j9325P840k4544J835K5643K3658O686j3393
$$ 24652 8571 9137 37506 47055 11138 -8187 -347 -24891 -23056 2587 26245 32931 19538
6447A9538j780J9231J5442N165k750k2998J0093j3483r509l951l034J9094j8042
$$ 19538 17758 36989 52431 57596 54846 31848 41941 28458 18949 14998 11964 31058 13016
6434A3016r381l24K4409k2264j4125m229J9422K9513K0667N018j410j2309j4472
$$ 13016 3635 3311 27720 5456 -8669 -12898 6524 36037 56704 61722 60312 48003 33531
6421C3531k2284m102K6534n535J075j2117J8200k647j9510r960n415J8663N431
$$ 33531 11247 7145 33679 28144 29219 17102 35302 32655 13145 3185 -2230 16433 21864
6408B1864j217n324l832k390J331J197r550j1464q326k032K7519N757l0920J8838
$$ 21864 20647 15323 11491 9101 10432 11629 2079 -9385 -17711 -19743 7776 13533 -17387 1451
6394A451K4320j6083m835j2111j8641J8588J635P103M633k164k3324J7928K4864
$$ 1451 25771 9688 4853 -7258 -25899 -7311 -5676 1427 6060 3896 -19428 -1500 23364
6381B3364P545N048j2231K086m484j8015l019j6336k5183K9386J2783J6651m665
$$ 23364 30909 35957 23726 25812 21328 3313 294 -16042 -41225 -11839 944 17595 12930
6368A2930K0766J1319K3141k3384j3889o609J5411j3318R695M835k8691K671j075
$$ 12930 33696 45015 68156 44772 30883 24274 39685 26367 36062 40897 12206 14877 13802
6355A3802j0230o791J838J4229K4034O287j7358q579k4210m787J2523j3466k0722
$$ 13802 3572 -3219 -1381 12848 36882 43169 25811 17232 -6978 -11765 758 -12708 -33430
6342c3430O407Q658K3242J4864o880r63O280j0073K3302L0479n315j9835l0738
$$ -33430 -27023 -18365 4877 19741 12861 11898 18178 8105 31407 61886 56571 36736 5998
6329E998o738R704O127j030J332o448L162L0719L716K222p839J834j3178j2241
$$ 5998 -740 8964 15091 14061 15393 8945 12107 42826 46542 48764 40925 42759 29581 17340
6315A7340J5501J5623L668k1567k3993M972R154k4110j1521j1430K766Q941N981
$$ 17340 32841 48464 52132 30565 6572 11544 20698 -3412 -14933 -26363 -23597 -14656 -8675
6302h675K7958l198P234J8680l011J0746R74k182j5789M219j2806k2106k1094
$$ -8675 19283 16085 23319 41999 38988 49734 50708 48526 32737 36956 24150 2044 -19050
6289a9050J9276j5811O063R235l1651j2631P949J4046O210O550Q564p692K4902
$$ -19050 226 -15585 -9522 -287 -31938 -44569 -36620 -22574 -16364 -9814 -1250 -8942 15960
6276A5960O49Q72j8586M588J2404j6968J157Q991K1030K720J4905J13k1063l521
$$ 15960 16609 17481 -1105 3483 15887 -1081 76 9067 30097 32817 47722 47835 26772 23251
6262B3251J2900j7227m820O172L925j7100p459l7879J3910J8602J1679K4357J1319
$$ 23251 36151 18924 14104 20276 24201 7101 -358 -38237 -24327 -5725 5954 30311 41630
6249D1630M216j2854m384j9770O727K1184k4800j3492J5634K2620K7863k6305
$$ 41630 45846 32992 28608 8838 15565 36749 11949 -1543 14091 36711 64574 38269
6237C8269l7581p788K941q573K944r234J6967J0935k2385k7260n383J3105o716
$$ 38269 688 -7100 -4159 -12732 -9788 -19022 -2055 8880 -13505 -40765 -46148 -33043 -39759
6224c9759o246j454Q981J7003j397J234j0466r353O381K6954K5894J2034j4906
$$ -39759 -46005 -47459 -38478 -21475 -22872 -21638 -32104 -41457 -35076 -8122 17772 29806 14900
6211A4900J107j7084k0005J4240J4390j6517l9690J0009J5193O881K6732J7167
$$ 14900 16007 -1077 -21082 -6842 7548 -8969 -48659 -38650 -23457 -16576 10156 27323
6199B7323k4095O602j2174L273K5931J3470L400j859j945Q554J7920k9049j2342
$$ 27323 3228 9830 -2344 929 26860 40330 43730 41871 39926 48480 66400 37351 25009
6186B5009k1633j9685o726j2114o562O00J9483L5816j0805m6766J756K4231Q878
$$ 25009 3376 -16309 -23035 -35149 -41711 -41111 -21628 14188 3383 -43383 -41627 -17396 -8518
6173h518M684N662O783j3254J3633J9486J6412k5229n1727j9286J0795J5202J670
$$ -8518 -3834 1828 8611 -4643 8990 28476 44888 19659 -32068 -51354 -40559 -25357 -23687
6160b3687M839J6676N218m062j134J169o314K2192J839J3657j6798j8248j8750
$$ -23687 -18848 -2172 3046 -1016 -2150 -981 -7295 14897 16736 30393 13595 -4653 -23403
6147b3403K2211J9443j9563K4M870N001N234J3847Q112j0899j1668k54j2051O742
$$ -23403 -1192 18251 -1312 -1288 3582 8583 13817 27664 35776 24877 13209 12955 904 7646
6133G646J6676l646l7307l1730P002J8113j094l536q641k182K3493K8553j564
$$ 7646 24322 20676 -16631 -48361 -41359 -23246 -24340 -27876 -36517 -38699 -15206 13347 11783
6120A1783L5952J6300l3995j3304O742l1913R314R999M155J3625N52J4753q740
$$ 11783 47735 64035 30040 16736 23478 -8435 879 10878 15033 28658 29210 43963 35223
6107C5223n485j8393j0215r69k5351J0056j9546Q601J7949o927j2756N431N26
$$ 35223 29738 11345 1130 161 -25190 -15134 -34680 -26079 -8130 -15057 -27813 -22382 -21856
6094b1856r501j0548K4534l12Q9j371J4395J4083l626K0183K2560k2744J5595
$$ -21856 -31357 -41905 -17371 -17683 -17594 -18965 -4570 9513 5887 26070 48630 25886 41481
6081D1481J6774N929l7667j0347O723j984J1017j0330P625L888J6000k0383k452
$$ 41481 58255 64184 26517 16170 22893 20909 31926 21596 29221 33109 49109 28726 26274
6068B6274j2883j1703K7179K060j1987r939o740J8030J8479k557J1320j3523p305
$$ 26274 13391 1688 28867 30927 18940 9001 2261 20291 38770 36213 47533 34010 26705
6055B6705k706J5722Q780n939k1081q099k541K367J8523j7105j2402J0262j0369
$$ 26705 23999 39721 48501 42562 21481 13382 10841 13208 31731 14626 2224 12486 2117
6042B117n463J841k182j827O147j3314J2592K2393J2340k2437l5491L144K979
$$ 2117 -3346 -1505 -3687 -5514 633 -12681 -89 22304 34644 12207 -23284 -20140 -17161
6029a7161L0687J4354j6168k0347J3188J6897q603k1194J4866m985j4062J3R805
$$ -17161 13526 27880 11712 -8635 4553 21450 12847 -8347 6519 1534 -12528 -12515 -2710
6016b710J6168p304k8025Q360k061M0428J0098J4057J0609m8428k9344r021J1048
$$ -2710 13458 6154 -21871 -13511 -15572 24856 34954 49011 59620 11192 -18152 -27173 -16125
6003a6125J3245M778K0397r009R980k120o612j8001k4545J7442J1549j9203j2663
$$ -16125 -2880 1898 22295 13286 23266 21146 14534 -3467 -28012 -10570 979 -18224 -30887
5990c0887n085J2712J5906J5211J6222L4271L792q649m645q199j0508m3532l951
$$ -30887 -35972 -23260 -7354 7857 24079 58350 62142 53493 48848 40649 30141 -13391 -17342
5977a7342L7904m795j7029k1930j2649Q55L2495J8539j1704p537o66J3561L0301
$$ -17342 20562 15767 -1262 -23192 -35841 -34986 -2491 16048 4344 -3193 -3859 9702 40003
5964D0003J3506k2559j7223j1030l6706m410K0275L5788R286m573j4860j4606
$$ 40003 53509 30950 13727 2697 -34009 -38419 -18144 17644 26930 22357 7497 -7109
5952g109j4674J5287n750J4585K4396J4158k9197J3042J1863k0270j9248p384
$$ -7109 -21783 -6496 -12246 2339 26735 40893 11696 24738 36601 16331 -2917 -10301
5940a0301R558m791J4479l149j381P154J9855k7650o246P233j3750j5445J1939
$$ -10301 -743 -5534 8945 5796 4415 11569 31424 3774 -2472 4761 -8989 -24434 -12495
5927a2495K4759O368q159j5353m513J1350J8013J6744j0489j1730J2850l293O379
$$ -12495 12264 18632 10473 -4880 -9393 1957 19970 36714 26225 14495 27345 24052 30431
5914C0431K3484r277L181j6045n2666q874K0283L2326J77j1688m211k821L989
$$ 30431 53915 44638 47819 31774 -20892 -29766 -9483 22843 23020 11332 7121 4300 8289
5901H289l8771L333P809N183M400O634P671p983j3894N789J3258K2872K4686K725
$$ 8289 -30482 -27149 -19340 -14157 -9757 -3123 4548 -3435 -17329 -11540 1718 24590 49276 52001
5887E2001o887j9599j5622j0159k3320j4868K2090L0803L0669j6142k8165k0315
$$ 52001 45114 25515 9893 -266 -23586 -38454 -16364 14439 45108 28966 801 -19514
5875a9514j0809J5401K1791q451l0750j9398J6861K3639L7117L7234k3913k5244
$$ -19514 -30323 -14922 6869 -1582 -32332 -51730 -34869 -11230 25887 63121 39208 13964
5863A3964r337J2740j6599J6526J868k2021K182q074O846l810l267J3059j483
$$ 13964 4627 17367 768 17294 19162 -2859 -677 -8751 -1905 -5715 -8982 4077 2594
5850B594P168j5296j3764M998J9865j6835R582K2115J3794r749l7319m921j752
$$ 2594 9762 -5534 -19298 -14300 5565 -11270 -1688 20427 34221 24472 -12847 -17768 -19520
5837a9520M0374p069k0433L920J8977k00l588J0418J5226k7677m2118o275O46
$$ -19520 20854 13785 -6648 -2728 16249 16049 12461 22879 38105 10428 -31690 -37965 -37319
5824c7319N118K6879R66l816K6179K088o316k4374J3867N757J0792K2289j9587
$$ -37319 -32201 -5322 -4356 -8172 18007 20095 13779 -10595 3272 9029 19821 42110 22523
5811B2523l1616J7965Q146j3617k2456k8824O432L6201J5689k1205j2686l073
$$ 22523 -9093 8872 17018 3401 -19055 -47879 -41447 -5246 10443 -10762 -23448 -26521
5799b6521K1861j3724m3600K4956M2147Q651m019J245k384k2431R3J3104N179
$$ -26521 -4660 -18384 -61984 -37028 5119 13770 9751 10996 8612 -13819 -13726 -622 4557
5786D557J2759p736K168J3953j3571L938M632l357n292j1802l598R033l822L812
$$ 4557 17316 9580 11748 25701 12130 16068 20700 17343 12051 249 -3349 5684 1862 5674
5772E674k1342J1787m691j5676J6298m084K611O897k2109m541J5243n299K478
$$ 5674 -15668 -3881 -8572 -24248 -7950 -12034 -9423 -2526 -24635 -29176 -13933 -19232 -16754
5759a6754J6069j3123K592J95m0899J401K4978p094j3497M719L0250K4728j3460
$$ -16754 -685 -13808 -11216 -11021 -51920 -50519 -25541 -32635 -46132 -41413 -11163 13565 105
5746A05R212J9997k664q977k128M813j8530j689p201R713Q88j6708M144l1979
$$ 105 9317 29314 26650 17673 15545 20358 1828 139 -7062 2651 3539 -13169 -9025 -41004
5732d1004j7503J0064J1807J0543K5600J8051J2364M108m815j6787k0619M270
$$ -41004 -58507 -48443 -36636 -26093 -493 17558 29922 34030 29215 12428 -8191 -3921
5720c921k838k7104Q547m856r122m231K6571K1453k9657j0884K226L0851j830
$$ -3921 -6759 -33863 -25316 -30172 -39294 -43525 -16954 4499 -25158 -36042 -33816 -2965 -4795
5707d795j4911j2641K2856J644L989j3669j8353J4441L7864K4444j5100k3585
$$ -4795 -19706 -32347 -9491 -7847 -3858 -17527 -35880 -21439 16425 40869 25769 2184
5695B184m0901j7944j5874K8252n817N284J1930r37k579k459M649J4933K793L2539
$$ 2184 -38717 -56661 -72535 -44283 -50100 -44816 -32886 -33823 -36402 -38861 -34212 -19279 -16486 16053
5681A6053J5230M851N544J7324j6317q360q680K7014k1257o773r549P82J1943
$$ 16053 31283 36134 41678 59002 42685 34325 25645 52659 31402 24629 15080 15862 27805
5668B7805O916k0908l7818J005K906K188m624K7766J0078j6399j78K1956J5163
$$ 27805 34721 13813 -24005 -23000 -20094 -17906 -22530 5236 15314 -1085 -1263 20693 35856
5655C5856n775p638J3068N938l2140n057j1215j5818M80R167K3936Q945j2306
$$ 35856 30081 22443 35511 41449 9309 4252 -6963 -22781 -22301 -13134 10802 19747 7441
5642G441M069M281N805r311l7383j0944Q379J3783K6070o222j5138m336l028j2516
$$ 7441 11510 15791 21596 12285 -25098 -36042 -27663 -13880 12190 5968 -9170 -13506 -16534 -29050
5628b9050q996K1876J2015P851q828L032k821j1306K9630j896k1620j8009K6609
$$ -29050 -38046 -16170 -4155 3696 -5132 -2100 -4921 -16227 13403 11507 -10113 -28122 -1513
5615a513K4954O932l701k0476o279L421Q188J8176j5857k5289k672k4804q350
$$ -1513 23441 30373 26672 6196 -83 3338 11526 29702 13845 -11444 -14116 -38920 -47270
5602d7270L3946J118k1908k5750L1002J9024O01K465L0147j7305Q286Q480j4256
$$ -47270 -13324 -12206 -34114 -59864 -28862 -9838 -9237 -6772 23375 6070 14356 22836 8580
5589H580O760p454j6927l3122J270J7212J7442j4593k0823j1389L0951J2954R865
$$ 8580 15340 7886 -9041 -42163 -40893 -23681 -6239 -20832 -41655 -53044 -22093 -9139 726
5576G26L363n917k1658j6542p765M2141K2749q908j2392p474l878L2350O424J5874
$$ 726 4089 -1828 -23486 -40028 -47793 -5652 17097 8189 -4203 -11677 -15555 16795 23219 39093
5562C9093k8227k5447q966m744K9055J0658r574J4233Q832k5916J2186L4092J5940
$$ 39093 10866 -14581 -23547 -28291 764 11422 1848 16081 24913 -1003 11183 45275 61215
5549F1215j9122n783j9892O707J2465j9564j1702M316l528r790J9582J6747k2304
$$ 61215 42093 36310 16418 23125 35590 16026 4324 8640 5112 -4678 14904 31651 9347
5536I347j1959M0768L651l1827j780j2278k3418L383J1480J0174J660l17J1503
$$ 9347 -2612 38156 41807 9980 8200 -4078 -27496 -24113 -12633 -2459 -799 -1116 10387
5523A0387N266k0188o731k562J9636m156k8096J1398J3341j1849p096K9868m151
$$ 10387 15653 -4535 -11266 -13828 5808 1652 -26444 -15046 -1705 -13554 -20650 9218 5067
5510E067k2751l5966K5337J4207j362K1397R777q65k6935p654J8575L9393M5571
$$ 5067 -17684 -53650 -28313 -14106 -15468 5929 15706 14841 -12094 -19748 -1173 38220 83791
5497H3791O191l7910k2308k2478j4810M57j6847l659j8925j3777j15n387K0678
$$ 83791 89982 52072 29764 7286 -7524 -7067 -23914 -27573 -46498 -60275 -60390 -65777 -45099
5484d5099K1266K1175j7742j9417J1525J5836j0198L672K1340J3642K869o626
$$ -45099 -23833 -2658 -20400 -39817 -28292 -12456 -22654 -18982 2358 16000 18869 12243
5472A2243k2m2193j842J7025k236J5072L495J2219n104j9055j1184M2810K0648
$$ 12243 12221 -29972 -31814 -14789 -17025 -1953 1542 13761 8657 -10398 -21582 21228 41876
5459D1876k04K990q564k475j0156q650r088L769K0540j538j5955j6443j8700j9699
$$ 41876 41672 44662 36098 33623 23467 14817 5729 9498 30038 28500 12545 -3898 -22598 -42297
5445d2297L4024L5883j2189P98L763j9742J0928J6091O680R597k559k7965m1074
$$ -42297 -8273 27610 15421 16219 19982 240 11168 27259 33939 43536 40977 13012 -28062
5432b8062p871L5165J1303j7711k7797j957j1198K2187J7731R200K3750K0286
$$ -28062 -35933 -768 10535 -7176 -34973 -36930 -48128 -25941 -8210 990 24740 45026
5420D5026M489l3997j5704J2276N070j0465J6451n096J5609m972O089K2063R093
$$ 45026 49515 15518 -186 12090 17160 6695 23146 18050 33659 28687 34776 56839 65932
5407F5932J66q931q590k2017q250k9310j259L7462M853k396p713k246K281m540
$$ 65932 66098 57167 48577 26560 18310 -11000 -12259 25203 30056 27660 19947 17701 19982 15442
5393A5442r172K652p577j3995j3412j2094n623P178O938k003M177K2059j2232
$$ 15442 6270 8922 1345 -12650 -26062 -38156 -43779 -36601 -29663 -31666 -27489 -5430 -17662
5380a7662J1861J038j5998J189j749J2785R222j929l909L4963K094j0758k607
$$ -17662 -5801 -4763 -20761 -19572 -21321 -8536 686 -1243 -5152 29811 31905 21147 18540
5367A8540N800K1678m136k5602n421j5165n463J0596K6404j9866j9681J7475P525
$$ 18540 24340 46018 41882 16280 10859 -4306 -9769 827 27231 7365 -12316 5159 12684
5354A2684J0700j4907k9766j196K0258O873k0824n938J3257J3133K2444L973k608
$$ 12684 23384 8477 -21289 -22485 -2227 4646 -16178 -22116 -8859 4274 26718 30691 28083
5341B8083o875J6701m588j0884M558L552p477k8056p287J6773J2188j0565K8802
$$ 28083 21208 37909 33321 22437 26995 30547 23070 -4986 -12273 4500 16688 6123 34925
5328C4925j6617j1932L193J0990k0022l462J3797R661j83j6479k0784j5750K8545
$$ 34925 18308 6376 9569 20559 537 -2925 10872 20533 20350 3871 -16913 -32663 -4118
5315d118J1486J0119J927P711M168k639l003n187k986j0586k657K1111k0206J2029
$$ -4118 7368 17487 19414 27125 31293 28654 25651 20464 17478 6892 4235 25346 5140 17169
5301A7169J5327j9571k5996K917L6526K1228j1386l3891j3919j891l299j1941
$$ 17169 32496 12925 -13071 -10154 26372 47600 36214 2323 -11596 -13487 -16786 -28727
5289b8727j299k428j843j6657q605J1360r315j025M5037o817j1866J3943J2155
$$ -28727 -30026 -32454 -34297 -50954 -59559 -48199 -57514 -58539 -13502 -20319 -32185 -18242 -6087
5276f087J4389Q707J0836K3537J0651m659o341j4322p853N600j6955k6240j9725
$$ -6087 8302 17009 27845 51382 62033 57374 51033 36711 28858 34458 17503 -8737 -28462
5263b8462N970n691k1126p341L980j868L8375L1500K468q237j7381P771r788O805
$$ -28462 -22492 -28183 -49309 -56650 -52670 -54538 -16163 15337 17805 9568 -7813 -42 -9830 -3025
5249c025R040l797k0960o829k2422p107L1566K7956j4114J6805J9498j5962L700
$$ -3025 6015 2218 -18742 -25571 -47993 -55100 -23534 4422 -9692 7113 26611 10649 14349
5236A4349m345j6786p128J3713j019O982J7271j1967k9068j0869K4009R401K745
$$ 14349 10004 -6782 -13910 -197 -1216 5766 23037 11070 -17998 -28867 -4858 4543 7288
5223G288J3164R455j7631k2564P123N125j2861L936R019o64k1342K1109J1951
$$ 7288 20452 29907 12276 -10288 -3165 1960 -10901 -6965 2054 1390 -19952 1157 13108
5210A3108J106j4747L550N286k905k6533K601o835j4174j3210L1564L6595j2648
$$ 13108 14214 -533 3017 8303 5398 -21135 -18534 -25369 -39543 -52753 -21189 15406 2758
5197B758q247J8798L484k608r374k6957J3031N970j9263K5438k724k1653j4905
$$ 2758 -5489 13309 16793 14185 4811 -22146 -9115 -3145 -22408 3030 306 -21347 -36252
5184c6252M871p538J973o96m06r993l240M2046J9892j3998K3379J1170m1376k176
$$ -36252 -31381 -38919 -36946 -37642 -38048 -48041 -51281 -9235 10657 -3341 20038 31208 -10168 -12344
5170a2344N349m757N19k0963k2377k038J9022J8004J9629l360j2833J7667K8700
$$ -12344 -6995 -11752 -11233 -32196 -54573 -56611 -37589 -19585 44 -3316 -16149 1518 30218
5157C0218j6455k5119K1792K0780J7471O752o425q947o685J4430o693k1319l029
$$ 30218 13763 -11356 10436 31216 48687 55439 49014 40067 33382 47812 41119 19800 16771
5144A6771j0664l844L56M678p714j3364J6972J4366k745l3404o105P464O516K1655
$$ 16771 6107 2263 2619 7297 -417 -13781 3191 17557 14812 -18592 -24697 -17233 -10717 10938
5130A0938k445j4640j5415M042j068J0611n309p394J5744j8265k423K1431K2040
$$ 10938 8493 -6147 -21562 -17520 -18588 -7977 -13286 -20680 -4936 -23201 -25624 -4193 17847
5117A7847j1886l6305l718L7532L172J3538n296o819J0777j1518n734n77r87p376
$$ 17847 5961 -30344 -34062 3470 6642 20180 14884 8065 18842 7324 1590 1013 26 -7350
5103g350M986j8168j4195k4027M006K3217J2556K0196J2310j9286J4492j214j6685
$$ -7350 -2364 -20532 -34727 -58754 -54748 -31531 -18975 1221 13531 -5755 8737 7523 -9162
5090i162j7078k887K872R880K3877J3325k0760K8377j1016k1819j6303m324L6413
$$ -9162 -26240 -29127 -26255 -16375 7502 20827 67 28444 17428 -4391 -20694 -25018 11395
5077A1395j1624q994O783J4384m962k1964k8135m336J1112K7956K7456K5684j9234
$$ 11395 -229 -9223 -2440 11944 6982 -14982 -43117 -47453 -36341 -8385 19071 44755 25521
5064B5521k6391J8017O771L482j6612l2842j8306J6318K0368L121L1188M0325
$$ 25521 -870 17147 23918 27400 10788 -22054 -40360 -24042 -3674 -553 30635 70960
5052G0960m862n6197k4149j3914L7725J0322k5983O578K3333L9094Q250q452J2600
$$ 70960 66098 9901 -14248 -28162 9563 19885 -6098 480 23813 62907 71157 62705 75305
5039G5305j0830l120j0768k1577m7572j9797J1206K2517q030J8782O695n890k9204
$$ 75305 64475 61355 50587 29010 -18562 -38359 -27153 -4636 -12666 6116 12811 6921 -22283
5026b2283q138J9448j2653R525k8860l3915J6920K8793K2751K3662P360m1752
$$ -22283 -30421 -10973 -23626 -14101 -42961 -76876 -59956 -31163 -8412 15250 22610 -19142
5014a9142l0283K497Q007M467O166J9373K041N149J3926K6063j4476k5641k6360
$$ -19142 -49425 -46928 -38921 -34454 -28288 -8915 -6874 -1725 12201 38264 23788 -1853 -28213
5001b8213K0428K6991l006J274n552l108J8473j3125k0547l5787R6K5830j4251
$$ -28213 -7785 19206 16200 17474 11922 8814 27287 14162 -6385 -42172 -42076 -16246 -30497
4988c0497j3212J8037K633J4173L155N680J5549n706j6518J591J8222K2016K2947
$$ -30497 -43709 -25672 -23039 -8866 -5711 -31 15518 9812 -6706 -5115 13107 35123 58070
4975E8070P452j1834l4310j372q448K1534J1374m0522j4972k446K0m959k595o194
$$ 58070 65522 53688 19378 18006 9558 31092 42466 1944 -13028 -15474 -15454 -20413 -23008 -29202
4961b9202j2906K0938J0265J1733K4220j2196j1876K6165K4769m6195n8563O43
$$ -29202 -42108 -21170 -10905 828 25048 12852 976 27141 51910 5715 -52848 -52205
4949e2205L6440J5963J0782r635Q000j8081j0465j2910K9407m36o386k8J0146
$$ -52205 -15765 198 10980 1345 9345 -8736 -19201 -32111 -2704 -3140 -9526 -9554 592
4936E92J2988N971k0650j6449M040p884J011j2951M723l072n472P066R514O361
$$ 592 13580 19551 -1099 -17548 -13508 -21392 -20381 -33332 -28609 -31681 -37153 -30087 -20573 -14212
4922a4212J1585J8444N467n918j57j018j8384J6864J4189j0934K4195J3686k3559
$$ -14212 -2627 15817 21284 15366 15209 14191 -4193 12671 26860 15926 40121 53807 30248
4909C0248N076M755j9756k3407k5948r092L447J0026J0959o81J355q278J1713
$$ 30248 35324 40079 20323 -3084 -29032 -38124 -34677 -24651 -13692 -14373 -13018 -21296 -9583
4896i583K2997j444k385m105K179j5886j5115Q353M193J6535n157m982k903J4251
$$ -9583 13414 11970 9585 5480 7659 -8227 -23342 -14989 -10796 5739 582 -4400 -7303 6948
4882F948Q323O929M698k717n9038j2162J7356j8196j8675k6098N4157L0902j9942
$$ 6948 15271 22200 26898 24181 -34857 -47019 -29663 -47859 -66534 -92632 -38475 -7573 -27515
4869b7515j0120m655R041J8810O246Q611m122p397k9757P871L5656m821k0829
$$ -27515 -37635 -42290 -33249 -14439 -8193 418 -3704 -11101 -40858 -32987 2669 -2152 -22981
4856b2981j1709J2458k891Q363J1692j8226j5393J2928J0777n729K9142J548k1175
$$ -22981 -34690 -22232 -25123 -16760 -5068 -23294 -38687 -25759 -14982 -20711 8431 9979 -11196
4843a1196O341K2054k3858j2302R564o87L760K544J6083j7427j7782k2547K0676
$$ -11196 -4855 17199 -6659 -18961 -9397 -10084 -6324 -3780 12303 -5124 -22906 -45453 -24777
4830b4777K4399J5303j1587j0235l132j8879m842j872J4532n298J6557J6806K111
$$ -24777 -378 14925 3338 -6897 -10029 -28908 -33750 -35622 -21090 -26388 -9831 6975 9086
4817I086j383o989j8451J7017K9812O858k2619n563J2038J357j0197o745k635
$$ 9086 7703 714 -17737 -720 29092 35950 13331 7768 19806 21163 10966 4221 1586
4804A586j3079J0930J0529m054M146j9224k184K855k4919q681R081J5281Q326
$$ 1586 -11493 -563 9966 5912 10058 -9166 -11350 -8495 -33414 -42095 -33014 -17733 -9407
4791i407J2031J0139J3746j7565j7764J8464m512j9359K8075j3131k5608K1438
$$ -9407 2624 12763 26509 8944 -8820 9644 5132 -14227 13848 717 -24891 -3453
4779c453k635k2020M298O343J6855j9761k3139K7974J3625m175R983J0211k831
$$ -3453 -6088 -28108 -23810 -17467 -612 -20373 -43512 -15538 -1913 -6088 3895 14106 11275
4766A1275j6368p186M953o11p680K097N032k9374k4820J5456K7136p842P085J1978
$$ 11275 -5093 -12279 -7326 -7937 -15617 -13520 -8488 -37862 -62682 -47226 -20090 -27932 -20847 -8869
4752h869J1815M377j9901j5581R541N796J437J3581J3609j2110r887M008j8312
$$ -8869 2946 7323 -12578 -28159 -18618 -12822 -11385 2196 15805 3695 -6192 -2184 -20496
4739b0496K9880J0665M925j5730j2330k3841N358j564J8448J9887k2319k8916
$$ -20496 9384 20049 24974 9244 -3086 -26927 -21569 -23133 -4685 15202 -7117 -36033
4727c6033J3585J4209J1616j2659m764J3425L531p251J7858j832j8188N284n768
$$ -36033 -22448 -8239 3377 -9282 -14046 -621 2910 -4341 13517 11685 -6503 -1219 -6987
4714f987j4110l2453J8522J3981J2060K9959J2147Q702l7243j4918K4089N611
$$ -6987 -21097 -53550 -35028 -21047 -8987 20972 33119 41821 4578 -10340 13749 19360
4702A9360l0073j8727K819k6708J9760N5143Q423l4532l1763R16K4268J6650p530
$$ 19360 -10713 -29440 -26621 -53329 -33569 21574 29997 -4535 -36298 -35382 -11114 5536 -1994
4689a994j2514j0224L3666n975k0992j1096n310l190J5323L9366j6420L755J1264
$$ -1994 -14508 -24732 8934 2959 -18033 -29129 -34439 -37629 -22306 17060 640 4395 15659
4676A5659L218P68k8043J8325K961p407J7669k136j2531k4600j4010j2597J518
$$ 15659 18877 19645 -8398 9927 12888 5481 23150 21014 8483 -16117 -30127 -42724 -41206
4663d1206J1846J4677J7002Q665J2102J3221j2544j3044k2853K22j0076l0127
$$ -41206 -29360 -14683 2319 10984 23086 36307 23763 10719 -12134 -11912 -21988 -52115
4651e2115o135J0485k5N614J0085K6006L0006j0897j1423l316k2622q125K8107
$$ -52115 -58250 -47765 -47790 -42176 -32091 -6085 23921 13024 1601 -1715 -24337 -32462 -4355
4638d355L2239j4001j3146J8309J0167P86k602n526K24L584o793J4031J2312J3335
$$ -4355 27884 13883 737 19046 29213 29999 27397 21871 22095 25679 18886 32917 45229 58564
4624E8564o780j6116j6951j4786L406j1550j1821N400J1574O706k48J2116J3455
$$ 58564 51784 35668 18717 3931 7337 -4213 -16034 -10634 940 7646 7398 19514 32969
4611C2969k4738r843r319k983r592N214M661J7566K924M140k828p051l2329j9890
$$ 32969 8231 -1612 -10931 -13914 -23506 -18292 -13631 3935 6859 10999 8171 1120 -31209 -51099
4597e1099L0012N877j5639L87j0536J6442K3132n186n671J1792j456n020p685
$$ -51099 -21087 -15210 -30849 -30462 -40998 -24556 -1424 -6610 -12281 -489 -1945 -6965 -14650
4584a4650O250j8765r682j1827K368l514m268p457M514L2029K4087q537j3687
$$ -14650 -8400 -27165 -36847 -48674 -46306 -49820 -54088 -61545 -57031 -25002 -915 -9452 -23139
4571b3139j9338N112N396M305q49R806L9818n930k1422o920k2903j7087K9301
$$ -23139 -42477 -37365 -31969 -27664 -28513 -18707 21111 15181 -6241 -13161 -36064 -53151 -23850
4558b3850J5210Q609K7207p732k9045k840M429l0496m3224r995M4688K9991m499
$$ -23850 -8640 -31 27176 19444 -9601 -12441 -8012 -38508 -81732 -91727 -47039 -17048 -21547
4545b1547r68K8634O715J2117K7934q315m1597k1968j8330k1262j622K132J6840
$$ -21547 -22515 6119 12834 24951 52885 44570 2973 -18995 -37325 -58587 -60209 -58077 -41237
4532d1237J0426N150K831L1489L7144k3370l472j3442M338J3628L661J96l2425
$$ -41237 -30811 -25661 -22830 8659 45803 22433 18961 5519 9857 23485 27146 27342 -5083
4519e083P84j6377J6974J799r729R454r600l754k843J1815J3436j7267p980J1059
$$ -5083 -4299 -20676 -3702 -1903 -11632 -2178 -11778 -15532 -18375 -6560 6876 -10391 -18371 -7312
$$ [...]
##END NTUPLES=NMR SPECTRUM
##END=
