##TITLE=Analysis number 328797
Compound Code cc 10501
Book Reference a
Project Code adrs
Chemist Name stores
##JCAMPDX= 6.0         $$ Bruker NMR JCAMP-DX V2.0
##DATA TYPE= NMR SPECTRUM
##DATA CLASS= NTUPLES
##ORIGIN= Bruker BioSpin GmbH
##OWNER= nmr
$$ XWIN-NMR		Version 3.5
$$ Wed Jul  4 14:06:11 2007 GMT Daylight Time (UT+1h)  MAYBRIDGE\nmr@NMR_250MHZ
##.OBSERVE FREQUENCY= 250.131544655141
##.OBSERVE NUCLEUS= ^1H
##.ACQUISITION MODE= SIMULTANEOUS (DQD)
##.ACQUISITION SCHEME= undefined
##.AVERAGES= 16
##.DIGITISER RES= 18
##SPECTROMETER/DATA SYSTEM= dpx250
##.PULSE SEQUENCE= zg30
##.SOLVENT NAME= DMSO
##.SHIFT REFERENCE= (INTERNAL, DMSO, 0, 16.522)
##AUDIT TRAIL= $$ (NUMBER, WHEN, WHO, WHERE, WHAT)
$$ ##TITLE= Audit trail, XWIN-NMR		Version 3.5
$$ ##JCAMPDX= 5.01
$$ ##ORIGIN= Bruker BioSpin GmbH
$$ ##OWNER= nmr
$$ C:\u/data/dgb/nmr/ADRS/380/pdata/1/auditp.txt
$$ ##AUDIT TRAIL=  $$ (NUMBER, WHEN, WHO, WHERE, WHAT)
(   1,<2007-07-04 14:05:47.10 +100>,<MAYBRIDGE\nmr>,<NMR_250MHZ>,
      <created by zg, POWCHK disabled, PULCHK disabled
       configuration hash MD5:
       76 6E 9A 78 1E 09 19 81 EC 84 63 8F B0 6A 59 2D
       data hash MD5: 64K
       18 D2 1F DE EE 9B D5 1B 0E B0 BC DB 88 EC E8 EC>)
(   2,<2007-07-04 14:06:02.29 +100>,<MAYBRIDGE\nmr>,<NMR_250MHZ>,
      <Start of raw data processing
       ef LB = 0.3 FT_mod = 6 PKNL = 1 SI = 32K 
       data hash MD5: 32K
       BF 94 93 57 F8 45 FD 4B B1 5C DF 91 C2 9B FC A9>)
(   3,<2007-07-04 14:06:03.91 +100>,<MAYBRIDGE\nmr>,<NMR_250MHZ>,
      <apk 
       data hash MD5: 32K
       37 BE 7C 68 4A 3A 01 6E 1E EA 9A 53 87 FD AD 7D>)
(   4,<2007-07-04 14:06:04.85 +100>,<MAYBRIDGE\nmr>,<NMR_250MHZ>,
      <abs ABSG = 5 
       data hash MD5: 32K
       0D 90 74 AC 76 F2 CE B8 BF 47 85 6D 44 BA 67 F5>)
$$ ##END=
$$ 
$$ hash MD5
$$ 1B 21 B8 49 22 1C 60 3B 86 D3 D5 8B 79 60 60 9D
##$RELAX= 
##$RELAX= 
##$RELAX= 
##$RELAX= 
##$RELAX= 
##$RELAX= 
##$RELAX= 
$$ Bruker specific parameters
$$ --------------------------
##$DU= <C:\u>
##$EXPNO= 380
##$NAME= <ADRS>
##$PROCNO= 1
##$TYPE= <nmr>
##$USER= <dgb>
##$AMP= (0..31)
100 100 100 100 100 100 100 100 100 100 100 100 100 100 100 100 100 100 
100 100 100 100 100 100 100 100 100 100 100 100 100 100 
##$AQSEQ= 0
##$AQ_mod= 3
##$AUNM= <au_zg>
##$AUTOPOS= <32 >
##$BF1= 250.13
##$BF2= 250.13
##$BF3= 250.13
##$BF4= 250.13
##$BF5= 500.13
##$BF6= 500.13
##$BF7= 500.13
##$BF8= 500.13
##$BYTORDA= 1
##$CFDGTYP= 0
##$CFRGTYP= 5
##$CHEMSTR= <none>
##$CNST= (0..31)
1 1 145 1 1 1 1 1 1 1 1 1 1 1 1 1 1 1 1 1 1 1 1 1 1 1 1 1 1 1 1 1 
##$CPDPRG= <>
##$CPDPRG1= <>
##$CPDPRG2= <>
##$CPDPRG3= <>
##$CPDPRG4= <mlev>
##$CPDPRG5= <mlev>
##$CPDPRG6= <mlev>
##$CPDPRG7= <mlev>
##$CPDPRG8= <mlev>
##$CPDPRGB= <>
##$CPDPRGT= <>
##$D= (0..31)
0 1 0 0 0 0 0 0 0 0.06 0 0 0 0 0 0 0.0002 0 0 0 0 0 0 0 0 0 0 0 0 0 0 
0 
##$DATE= 1183554345
##$DBL= (0..7)
120 120 120 120 120 120 120 120 
##$DBP= (0..7)
150 150 150 150 150 150 150 150 
##$DBP07= 0
##$DBPNAM0= <>
##$DBPNAM1= <>
##$DBPNAM2= <>
$$ [...]
##$SUBNAM7= <"">
##$SUBNAM8= <"">
##$SUBNAM9= <"">
##$SW= 20.6930455092707
##$SWIBOX= (0..15)
0 0 3 0 0 0 0 0 0 0 0 0 0 0 0 0 
##$SW_h= 5175.983436853
##$TD= 65536
##$TD0= 1
##$TE= 296.16
##$TE2= 300
##$TE3= 300
##$TEG= 300
##$TL= (0..7)
0 120 120 120 120 120 120 120 
##$TP= (0..7)
150 150 150 150 150 150 150 150 
##$TP07= 0
##$TPNAME0= <>
##$TPNAME1= <>
##$TPNAME2= <>
##$TPNAME3= <>
##$TPNAME4= <>
##$TPNAME5= <>
##$TPNAME6= <>
##$TPNAME7= <>
##$TPOAL= (0..7)
0.5 0.5 0.5 0.5 0.5 0.5 0.5 0.5 
##$TPOFFS= (0..7)
0 0 0 0 0 0 0 0 
##$TUNHIN= 0
##$TUNHOUT= 0
##$TUNXOUT= 0
##$USERA1= <user>
##$USERA2= <user>
##$USERA3= <user>
##$USERA4= <user>
##$USERA5= <user>
##$V9= 5
##$VALIST= <valist>
##$VCLIST= <CCCCCCCCCCCCCCC>
##$VD= 0
##$VDLIST= <DDDDDDDDDDDDDDD>
##$VPLIST= <PPPPPPPPPPPPPPP>
##$VTLIST= <TTTTTTTTTTTTTTT>
##$WBST= 1024
##$WBSW= 4
##$XGAIN= (0..3)
0 0 0 0 
##$XL= 0
##$YL= 0
##$YMAX_a= 324552
##$YMIN_a= -264149
##$ZGOPTNS= <>
##$ZL1= 120
##$ZL2= 120
##$ZL3= 120
##$ZL4= 120
##$ABSF1= 16.522
##$ABSF2= -4.171173
##$ABSG= 5
##$ABSL= 3
##$ALPHA= 0
##$AQORDER= 0
##$ASSFAC= 0
##$ASSFACI= 0
##$ASSFACX= 0
##$ASSWID= 0
##$AUNMP= <proc_1d>
##$AZFE= 0.1
##$AZFW= 0.1
##$BCFW= 0
##$BC_mod= 0
##$BYTORDP= 0
##$COROFFS= 0
##$CY= 12.5
##$DATMOD= 1
##$DC= 0
##$DFILT= <>
##$DTYPP= 0
##$F1P= 14.0000005364418
##$F2P= -0.99999901652339
##$FCOR= 0.5
##$FTSIZE= 32768
##$FT_mod= 6
##$GAMMA= 0
##$GB= 0
##$INTBC= 1
##$INTSCL= 1
##$ISEN= 128
##$LB= 0.3
##$LEV0= 0
##$LPBIN= 0
##$MAXI= 10000
##$MC2= 0
##$MEAN= 0
##$ME_mod= 0
##$MI= 0
##$NCOEF= 0
##$NC_proc= -5
##$NLEV= 6
##$NOISF1= 0
##$NOISF2= 0
##$NSP= 0
##$NTH_PI= 0
##$NZP= 0
##$OFFSET= 16.522
##$PC= 1
##$PHC0= -60.13486
##$PHC1= 11.43119
##$PH_mod= 1
##$PKNL= yes
##$PPARMOD= 0
##$PSCAL= 4
##$PSIGN= 0
##$REVERSE= no
##$SF= 250.13
##$SI= 32768
##$SIGF1= 0
##$SIGF2= 0
##$SINO= 400
##$SIOLD= 32768
##$SREGLST= <1H.DMSO>
##$SSB= 0
##$STSI= 32768
##$STSR= 0
##$SW_p= 5175.98343685301
##$SYMM= 0
##$S_DEV= 0
##$TDeff= 65536
##$TDoff= 0
##$TI= <Analysis number 999999
Compound Code 99
Book Reference 9
Project Code 9>
##$TILT= no
##$TM1= 0
##$TM2= 0
##$TOPLEV= 0
##$USERP1= <user>
##$USERP2= <user>
##$USERP3= <user>
##$USERP4= <user>
##$USERP5= <user>
##$WDW= 1
##$XDIM= 32768
##$YMAX_p= 357462525
##$YMIN_p= -592363
$$ End of Bruker specific parameters
$$ ---------------------------------
##NTUPLES= NMR SPECTRUM
##VAR_NAME=  FREQUENCY,     SPECTRUM/REAL,   SPECTRUM/IMAG
##SYMBOL=    X,             R,               I
##VAR_TYPE=  INDEPENDENT,   DEPENDENT,       DEPENDENT
##VAR_FORM=  AFFN,          ASDF,            ASDF
##VAR_DIM=   32768,         32768,           32768
##UNITS=     HZ,            ARBITRARY UNITS, ARBITRARY UNITS
##FACTOR=    0.157963299565203, 1,           1
##FIRST=     4132.6476996994, 0,             0
##LAST=      -1043.33573715361, 0,           0
##MIN=       -1043.33573715361, -592363,     0
##MAX=       4132.6476996994, 357462525,     0
$$ Real data points
##PAGE= N=1
##DATA TABLE= (X++(R..R)), XYDATA
$$ [...]
24143d38820M0914k3868M1387L2810J90594J01582o8965j09336L8143Q2211M6276
24132f7072j03718P898P3315q7359J12788J29167O7807J80624j6430k21435k3388
24121E2197j35676L1077o3116j1738K0652J58396R9675J25408k11789j19514j1866
24110f6294J7995k67740j77734J12882J2707O9474O0657L2064K1627j4370j13686
24099c12418M4774L06020J63290r0738k1840J02418O2058J11259j7697n1164n8296
24088B37666J550K0924m4702r3693l5816O2320q4977j74405Q2778Q1604J7770
24077G1019j74072J01390O1577j26739J96487J34128k45566j68239J01377P1397
24067B2759J19313j27895J98J4349o6847n9162j0042R1648J38357Q7953P1409
$$ y = [-438820, -397906, -421774, -380387, -347577, -156983, -55401, -124366, -233702, -195559, -113348, -67072, -170790, -162892, -89577, -176936, -64148, 65019, 132826, 313450, 297020, 75585, 52197, -83479, -52402, -115518, -127256, -106604, 51792, 151467, 276875, 65086, -54428, -66294, -48299, -316039, -493773, -380891, -368184, -298710, -238053, -205989, -184362, -198732, -312418, -267644, 38376, 201666, 110928, 89088, 191506, 253564, 364823, 347126, 295962, 237666, 239216, 260140, 215438, 121745, 85929, 148249, 63272, -111133, -28355, 53249, 71019, -103053, -1663, 59914, -66825, 129662, 263790, 18224, -150015, -48638, 22759, 142072, 14177, 14375, 28724, -38123, -97285, -107327, -15679, 122678, 210631, 282040]
24056B82040j38900m7018q3086q4067k01238J0774K24298J92624l9068m8036j84732
24045a16409r182Q5447J00197J9556k8891l0264K370O7232n0161K9478j06555
24034c7182o1567R0285n8613q8270j16321l2544J1976J98750N2413P0126J16100
24023A45153j585o3107J38090M9597J15759j81706j2810J4288M8375n3618k25369
24012b6933L2192Q3995J63354J736r1707q6479J0579J83883J61387j11089k11266
24001A09652j07007m0941j0842n2101n314J4984m8476J55106J41121O4934q4144
23990A36972j91219r8715J4577M2719r377P6074n1877j48206o0957O9601J18620
23979a01788k1257l3956j76442J56008J2854J00390K41233O9790j75814j13549
$$ y = [282040, 143140, 96122, 13036, -71031, -272269, -261495, -37197, 155427, 116359, 68323, -116409, -125591, -40144, 60053, 79609, 50718, 20454, 22824, 90056, 39895, 69373, -37182, -98749, -8464, -67077, -155347, -271668, -304212, -292236, -93486, -41073, 29053, 145153, 143568, 80461, 218551, 268148, 383907, 202201, 189391, 203679, 252054, 198436, -26933, 5259, 89254, 252608, 254344, 162637, 76158, 86737, 270620, 432007, 320918, 109652, 2645, -38296, -49138, -101239, -106553, -91569, -140045, 15061, 156182, 221116, 136972, -54247, -152962, -138385, -95666, -105043, -28969, -80846, -229052, -290009, -220408, -101788, -123045, -157001, -333443, -177435, -164581, -64191, 177042, 246832, 71018, -42531]
23969d2531j39123j61924J87178L6339r949P3315R1452N5983K3644j26577n2668
23958f4861J42573j1482p3365j10997r7085l0544p2224R8022K7757q913M8259
23947a52860J42948P5694r191N3728K07930j0558k5266j16720m7816n7873j05871
23936d5855L8792m3478R1163J02800L3807o1023k99716j57369J84315K16772P5100
23925A35308m8064m4851j18036K1519J32879J03025j44351p2318P141l5654j02786
23914a66188q1400J44346K13636j58962o2305K9875n2665M7899Q8804q2574q2590
23903a62124p3283q8541Q6922j56961J29622J12698Q3477N5883J2919j20362j83967
23892c03717m3790J34864j0337l2679M6753J20441n8948K1578J83045m4506l1240
$$ y = [-42531, -181654, -343578, -156400, -120061, -130010, -56695, 34757, 90740, 114384, -12193, -64861, 77712, 66230, -7135, -118132, -215217, -245761, -317985, -219963, -192206, -201119, -152860, -9912, 65782, 56591, 110319, 318249, 307691, 282425, 165705, 117889, 60016, -45855, -7063, -50541, 40622, 143422, 177229, 116206, -183510, -340879, -156564, 60208, 135308, 87244, 42393, -75643, -54124, 78755, 181780, 37429, -34889, -27748, -63402, -166188, -247588, -103242, 110394, -48568, -110873, -80998, -133663, -85764, 3040, -79534, -162124, -235407, -323948, -237026, -393987, -264365, -151667, -68190, -12307, 612, -119750, -303717, -347507, -212643, -222980, -255659, -208906, -88465, -147413, -125835, 57210, 12704, -18536]
23881a8536J07475M961N5295k3252n3474L2673k22909q3916R419J26001J37177
23870G0914O8981n1161M8897J170k02628k00043J27169N5798l5528l2233k3690
23859a72354l0898P605L3193k3773j36204O454K12961J39349O693j05507j60724
23848b23205J06874J64020J99690O1345j77267q1110m2834j51570j7346j0557
23838a71960j21860n8889k2210Q1514K4797J22871K9338p5490o1510l3986q9615
23827c77000L0590J59393j1952l97J65083J27629q3088m1495J54078R437r1k3462
23815A08725j7264n8712l7033J30275m6016j3974m694j67678L6324R9042p4881
23804d5886K87N9731J69985k3832P1267K5380K5562p9892k59542k410P5837o0584
$$ y = [-18536, 88939, 93900, 149195, 125943, 72469, 105142, -117767, -201683, -192264, -66263, 70914, 139895, 88734, 137631, 138801, -63827, -263870, -136701, -80903, -116431, -148664, -172354, -203252, -195647, -162454, -186227, -322431, -315977, -103016, 36333, 43026, -62481, -223205, -116331, 47689, 247379, 308724, 131457, 50347, 7513, -144057, -161403, -171960, -293820, -352709, -374919, -293405, -268608, -145737, -116399, -191889, -253399, -287385, -377000, -346410, -187017, -198969, -199366, -34283, 93346, 10258, -31237, 122841, 132278, 132187, 108725, 91461, 32749, -4284, 125991, 79975, 66001, 61307, -106371, -70047, 28995, -45886, -45599, 14132, 184117, 160285, 231552, 256932, 282494, 202602, -56940, -59350, 16487, -44097]
23792d4097M1985J6874l4823J18084j15115l9003J16933o2582M0980m8836r4303
23781a03903J68390M6772j13371o0301l9195l1415K1161M4895J86399J60018j61466
23770A17984r3581n6330n9228m3521J4233k618O7774j13858J9940p6529J7275
23759b08459L8632J10886O727r8386j18117j7844J90162P1977k34634o9668Q5824
23748b42900K71962J42933j15574LJ37630l8449J7644N7561p7428k7353Q4839
23737B10868J05320l4605j70584k04832J10537J6462o0224J2860P7084K4694M6558
23726A34138J26048r0517j42161q4531r3432l3834M5684J93891J31269M4117l8975
23715A91697k56414k00171j9847J0898R9374K35336J77520j67076r4511N7527
$$ y = [-44097, -2112, 14762, -20061, 98023, -17092, -56095, 60838, -1744, 39236, -9600, -103903, 64487, 111259, -2112, -62413, -101608, -133023, -111862, -66967, 119432, 279450, 117984, 24403, -31927, -91155, -134676, -120443, -123061, -55287, -169145, -149205, -225734, -208459, -169827, -58941, -52214, -150600, -268717, -286561, -96399, -24422, -259056, -328724, -242900, 29062, 171995, 56421, 56424, 194054, 155605, 173249, 230810, 153382, 126029, 210868, 316188, 281583, 110999, -93833, 16704, 33166, -27058, -14198, 62886, 87580, 134138, 260186, 169669, 27508, -57023, -150455, -184289, -138605, 55286, 186555, 230672, 191697, -64717, -264888, -284735, -273837, -174463, 60873, 238393, 71317, -23194, 34333]
23705C4333O1206M5450l647n657j2165j57937m9241K10115R1805r700j2660j21124
23693G0778j25985P5437N8977J9121K4484j37227r4247P430n4816J11708L8709
23682e631J7706J89044l9490q9708K5618k77681n299P0668j29109l4911M8795
23671b29998J37587r4541r3282m6367K6734J08561m0619l7971o1361J13011J25918
23660i2328J55147n4113k46481N8190J08118Q1347J70740k04676j01066J66382
23650D1260j0526q9352O1548j2077P4862q8209k950m4678o9813n0100r7683J35350
23638a52368Q8463J00766J23160J4950m41l1765r2792O2394l1544r7135j48261
23627a64573j0583J88575P1551M3040O8967j79320j28378k4030K4249p396J49504
$$ y = [34333, 95539, 140989, 137342, 131685, 119520, -38417, -87658, 122457, 214262, 204562, 191902, 70778, -55207, 20230, 79207, 98328, 122812, -14415, -108662, -101232, -156048, -44340, -5631, 12075, 201119, 161629, 71921, 97539, -180142, -185441, -114773, -243882, -278793, -229998, -92411, -186952, -280234, -326601, -299867, -191306, -231925, -269896, -331257, -218246, -92328, 62819, 8706, -237775, -179585, -71467, 9880, 180620, -24056, -125122, 41260, 30734, -58618, 2930, -9147, 65715, -22494, -25444, -70122, -139935, -190035, -287718, -152368, -63905, 36861, 160021, 174971, 174530, 142765, 49973, 112367, 80823, -16312, -164573, -175156, 13419, 84970, 128010, 196977, 17657, -110721, -134751, -110502, -117898, 31606]
23616C1606k0631j19124m7766J16482J48123K6503k2747M9743o1551l6022l0071
23605C4545J26775J809P6643K6870j6776r2226j49213o5128Q7882q6896j61493
23594b17208j42705M0357N3377J16699M3017k8433J239J143K3220M7423J49282
23583H7411j7230k43239K9066J9317J77603J62493l2755j28122m7092r6973r4246
23572a83767J12105L8333m8900o6368J02120p9385k9919L032J36326L7512n2834
23561c1745n4711j31274J0516J86067N2825K9435J33800j0708j52237j65618P184
23550a26466J12642J04544o6653j0674m4767k2432N0098k97409N066K49206K9860
23539a6985r8290R6838Q7849K2427l5860J13297q3455k51071L0055J4299l2652
$$ y = [31606, 10975, -108149, -155915, -39433, 108690, 135193, 112446, 162189, 100638, 64616, 34545, 161320, 163129, 239772, 266642, 249866, 157640, 8427, -56701, 31181, -55715, -217208, -359913, -319556, -266179, -149480, -106463, -134896, -133657, -132514, -109294, -61871, 87411, 70181, -173058, -143992, -124675, 52928, 215421, 182666, 54544, 7452, -89521, -183767, -71662, -33329, -82229, -148597, -46477, -125862, -155781, -152749, -16423, 21089, -31745, -86456, -217730, -207214, -21147, 31678, 61113, 194913, 184205, 31968, -133650, -126466, -13824, 90720, 24067, 13393, -31374, -53806, -3708, -301117, -296051, -46845, -16985, -115275, -18437, 69412, 91839, 55979, 169276, 85821, -165250, -135195, -120896, -153548]
23528a53548K6554j92524j09507J25277K37741J24054O9384M8118n4587j51420
23518c0458n1957J01538p4111k64385j2802O2715Q3222K03109K5133m5882J0345
23507F467l3383L4934l8581M8588J43564J997j5634l8522q9713r4916k0586k1042
23495a16827J2659P5754P3861P6803J0648j8267k83066o9977Q4644P6572m370
23484h1566q213o8560P5439Q206Q3731J16335m6075l0245q5903J64145J4490J80874
23472C22658k3388p1893m130M8549j1028j89218j01741L2894K12917Q1696m2527
23461B54789j16154j14147o0387J38829J89932J1723j62855j8749Q1685O9657
23451B74323K5183j42553j2850j11437R404k430k3766R7442K72287r474o3030
$$ y = [-153548, -126994, -319518, -429025, -303748, -66007, 58047, 127431, 175549, 120962, -30458, -82415, 19123, -54988, -319373, -332175, -269460, -186238, 16871, 42004, -3878, 6467, -26916, 8018, -30563, 18025, 161589, 163586, 147952, 109430, 19717, -75199, -95785, -116827, -104168, -28414, 45447, 122250, 132898, 114631, -168435, -238412, -153768, -77196, -81566, -89779, -158339, -82900, -74694, 9037, 125372, 79297, 49052, -36851, 127294, 141784, 322658, 299270, 227377, 223247, 271796, 260768, 71550, -30191, 2703, 215620, 297316, 254789, 138635, 24488, -35899, 102930, 292862, 304585, 141730, 122981, 204666, 274323, 299506, 156953, 144103, 32666, 42070, 39640, 15874, 113316, 385603, 376129, 313099]
23440C13099j74582j34218n2237p8823N8433L5898O7934J21467k2383N187l1546
23429A08229J7778o4145P3949O0312K9361j11435J57168J41862l2655j59232j62730
23418E8462l9430j19526q3894o6798R4490J36396m4102o8507K5555J52833j14908
23407f9429l2240k2911K01692L78582M0847l24077j99626j08216J82288J75298
23397B22208Q1122m7668j48157Q4384q4395j44043N3483O0037J18330J19214m4692
23386B69823K0592K03941J27064k52426l92670j04433K1326K0920j467r0168J03349
23375g4149K36746j42l8433l4492N3370N170l7395L3036k21486j4546K342N156
23363h4823j02385k6921J15776j05283K6716L0588R4255N4611j62158O2562M719
$$ y = [313099, 138517, 4299, -47938, -126761, -68328, -32430, 35504, 156971, 134588, 139775, 108229, 126007, 61862, 135811, 196123, 225484, 114049, 271217, 413079, 380424, 221192, 58462, 19032, -100494, -184388, -251186, -156696, -20300, -64402, -132909, -107354, 45479, -69429, -101669, -124580, 77112, 455694, 496541, 172464, -27162, -135378, 46910, 222208, 303330, 255662, 107505, 191889, 107494, -36549, 16934, 76971, 195301, 314515, 269823, 290415, 494356, 621420, 368994, -23676, -128109, -106783, -85863, -87330, -177498, -74149, 162597, 162455, 124022, 89530, 142900, 148070, 110675, 143711, -77775, -92321, -89979, -84823, -187208, -214129, -98353, -203636, -176920, -146332, -52077, 2534, -159624, -97062, -92343]
23352i2343p4375k45320j15830J49067J84515J17823k660M1662l5073k65307j2746
23341c50587O4290K0403k9960m2317L7789J69275l7566K6917K44688m7577q2892
23330b7537q1738P7140j6724j3639n9767J1118O0129J49430M3190k07294L1876
23319c3816K54626k24590j3924Q7968j91818j04436P6195j07536J18959K04148
23309F5776r7001j45002J76914M6152n8952l2328j10036o7661j82782p1041J10112
23298c65849J48371J55752j3750j17921o2029l5257J15559P635P3431N3156O7261
23287B6359O6113k42060r5766J32146j4208l7673J36481j32541o1640J36616k5751
23276a11924o347J01146R0006M3180k77578r360J56216J53922j1753p9243j20910
$$ y = [-92343, -166718, -412038, -527868, -378801, -194286, -76463, -79123, -37461, -72534, -337841, -350587, -286297, -265894, -295854, -338171, -300382, -131107, -168673, -141756, 102932, 55355, -27537, -109275, -32135, -48859, -62498, -122265, -111147, -51018, 98412, 141602, -65692, -33816, 220810, -3780, -17704, 70264, -121554, -225990, -149795, -257331, -138372, 65776, -31225, -176227, 687, 46839, -12113, -44441, -154477, -222138, -404920, -475961, -365849, -217478, -61726, -75476, -193397, -255426, -290683, -175124, -167489, -94058, -40902, 26359, 92472, -149588, -245354, -113208, -127416, -165089, -28608, -161149, -222789, -86173, -111924, -118271, -17125, 72881, 116061, -161517, -170877, -14661, 139261, 127508, 48265, -72645]
23265g2645K4737R498J13955j27104J0404J52177q024n4972m9348n6890n4329
23254a12541n8846Q5261j04396J60297J1552P2795J49767k16776l48346J9536
23244c41697P5043J63582K12899J18808r120j32641p4646k53174K360l7887j43284
23233d19757J14099K70441P2968K5476n3077q6923J08312O2330j42176p1785p4641
23222a94733J10934k1948O4574j14807r5902R5058O279p4490M5566q128J63074
23211b4523J405n9051m3130K7194M4801k7771k3274l7790q1661J11457K8984J12074
23199B8715p52o2306L202J75007J34390P9373p678k54548k38830m8102r9837p5236
23187c66602K04863J73736J01k2442J70689J63560m874k443m4143j69114k05668
$$ y = [-72645, -47908, -38410, 75545, -51559, -41155, 111022, 102998, 48026, -1322, -58212, -112541, -171387, -86126, -190522, -30225, -18673, 54122, 203889, -12887, -361233, -341697, -266654, -103072, 109827, 228635, 219515, 86874, 12228, -240946, -238586, -276473, -419757, -305658, -35217, 37751, 63227, 10150, -76773, 31539, 93869, -48307, -120092, -194733, -83799, -105747, -41173, -155980, -251882, -156824, -150545, -225035, -179469, -187597, -24523, -23118, -82169, -125299, -98105, -53304, -81075, -104349, -142139, -223800, -112343, -83359, 28715, 27963, -34343, -31141, 143866, 278256, 357629, 349951, 95403, -143427, -191529, -291366, -366602, -161739, 11997, 12098, -10344, 160345, 323905, 319031, 316588, 272445, 103331, -102337]
23176a02337j34532L8649J75969J36401o0564m5997l5617o1356P2296j26402J05559
23165c7931K04707M2444r0616j07772M1647Q8006p7101l0881J77456J20745m3309
23154B87395j7863j06259n0334K672L8457q228j34140l5888M7188j8103m5623
23143d0726L523M1394n5734K293J58817q7147J0327l0099k32657K1367l6221j50575
23131c95438K2073K83063Q6841L5761O9248J3659q5005j21688k9094J8503J2266
23120h9811j062k3357k5743m6555l8076p8662J3477P8975O7960K02403m726j9473
23108C5350o7218N1469K0797r4485J06444r0219j52963O7927m8005M1572o0122
23097a89453P4633P752L8396J03377r0235j2637M3189M8819l3632q8431o0693
$$ y = [-102337, -236869, -198220, -22251, 114150, 53586, 7589, -28028, -89384, -17088, -143490, -37931, 166776, 209220, 118604, 10832, 52479, 140485, 63384, 32503, 209959, 330704, 287395, 269532, 163273, 112939, 115611, 154068, 145840, 11700, -24188, 23000, 4897, -40726, -37203, 4191, -51543, -49250, 109567, 22420, 32747, 2648, -230009, -208642, -244863, -395438, -373365, -90302, -3461, 32300, 101548, 115207, 30202, -91486, -120580, -102077, -89811, -90873, -114230, -139973, -186528, -224604, -303266, -289789, -210814, -142854, 59549, 54823, 35350, -31868, 19601, 40398, -54087, 52357, -37862, -190825, -122898, -170903, -129331, -189453, -114820, -107068, -68672, 34705, -55530, -68167, -24978, 23841, -9791, -98222, -158915]
23086a58915p5479l4882K14599j20093j03718J70716J61140l441J9559N4249J1110
23075A34845K8683r3142p614M3602l3420M3397R137r2280r0802j2797j25840K1656
23063a74575O2976J5038L126m8757J8040p9075r8766J95147J8216o4979k03832
23052c57441N2691J99183O915p7497J23261P5800R7071P791j7855L3716q2802
23041F0833r3923J3938O9893J6674r8221r5994j9827K05593O0159o8991J02157
23030A52291J64023k9094k04203k01189p9146K6457O2559J59314J16368j47123
23020B0257q3928M5674o272k99094j50251J17635N7874R6020M9840K4264J15436
23009a2545L1582p0112j38593K68387J97914p9166j3829n0525N8363p3286m7003
$$ y = [-158915, -234394, -269276, -54677, -174770, -278488, -107772, 53368, 49927, 69486, 123735, 134845, 163528, 70386, 62772, 106374, 72954, 116351, 125488, 33208, -57594, -70391, -196231, -174575, -111599, -96561, -93435, -142192, -124152, -203227, -301993, -106846, -88630, -153609, -357441, -304750, -105567, -98652, -176149, -52888, 22912, 119983, 127774, 109919, 143635, 60833, -33090, -19152, 50741, 67415, -30806, -126800, -146627, 58966, 119125, 50134, 152291, 316314, 287220, 83017, -118172, -197318, -170861, -108302, 51012, 167380, 20257, -63671, -17997, -24269, -323363, -473614, -355979, -298105, -202085, -152245, -127981, -12545, 19037, -51075, -189668, 78719, 276633, 197467, 183638, 133113, 191476, 118190, 71187]
22998G1187j24829m8493O7488Q4372p3157n9549J12346p8995N8204M646R6089
22987A09309J0028k40476n9542K29495o585n2065J7847J40802J06648o068k86375
22976c6982o6876l1891q7993k6412p6875Q3913R8190J40112p128k2559J5025k181
22964b1657p2493Q5853J07510j55874j07989J18673n219L0264J8417L1313K4889
22953E3687K12056L1337j80819r2887m9572q7129K4498O0787J17213M0609j92446
22942f2666m1211L7297P3015p8213j67538l3711Q0333R066J8789r4371j0952l465
22930b73627R4651Q8531M8071M5905j744m9356j26514k0928N4913J16515N1282
22919B7699l8863k8744L0613j425K0022j24997Q6052K33181l8528k05059j41887
$$ y = [71187, -53642, -102135, -34647, 49725, -23432, -82981, 29365, -49630, 8574, 13220, 109309, 119337, -121139, -180681, 48814, 42229, -9836, 8011, 148813, 255461, 249393, -36982, -103858, -135749, -223742, -250154, -327029, -243116, -144926, -4814, -11942, -34501, -19476, -21657, -94150, -8297, 99213, -56661, -164650, -45977, -51196, -20932, -2515, 28798, 53687, 265743, 297080, 116261, 23374, -26198, -113327, -88829, -28042, 89171, 129780, -62666, -103877, -66580, 6435, -71778, -239316, -273027, -192694, -183628, -164839, -259210, -270162, -273627, -178976, -90445, -42374, 3531, 1787, -47569, -174083, -195011, -140098, -23583, 27699, -11164, -39908, -9295, -10720, 9302, -115695, -29643, 203538, 165010, -40049, -181936]
22908a81936k4825J64362J76032l6125j6182j1361J544k3649k36441j07418O9582
22897b26417J34206J82982K37j2168n7502M4377r2300l4521k1688q6353j84993
22886c54140J26730J77385J55263M6928M8240p7306J2357P7716L8821R844r0147
22875A71691J3413j25815m2159o720L8643Q2449P1859j42288J336o705Q0414m9024
22863H7094R4000k7654j49171j8590J26916p4129O1849n4816o2445n9536J86635
22852A10153L0873p9945p4203m5108M3364n0891p6932o6819M5315k6922R5896
22841i5219P4645K0483j5823K1757J5309J3009j59557q4539j32822N8035J49761
22830a34961P3188J4775J8615P9348M769P2954j00053j27471j9134J5484K07482
$$ y = [-181936, -206761, -42399, 133633, 97508, 81326, 69965, 71509, 47860, -188581, -295999, -226417, -92211, 90771, 91008, 78840, 21338, 65715, -26585, -61106, -82794, -169147, -354140, -227410, -50025, 105238, 152166, 200406, 123100, 135457, 213173, 251994, 261838, 171691, 185104, 59289, 17130, 10410, 49053, 131502, 203361, 61073, 62409, 55704, 136118, 87094, 181094, 153440, 4269, -14321, 112595, 38466, 100315, 45499, -16946, -76482, 110153, 141026, 61081, -13122, -58230, -14866, -65757, -142689, -209508, -164193, -191115, -95219, -20574, -91, -15914, 5843, 21152, 34161, -125396, -209935, -342757, -284722, -134961, -61773, -46998, -28383, 50965, 55734, 128688, 28635, -98836, -117970, -102486, 104996]
22819A04996J63005j61737k10074r1991N0069J65372R7629j44573k51274J44152
22809a34426J46246J685k0248l1472J9036Q7091O4681J26744j8822j37926k05619
22798a03030P2219K9157N0576q1523Q6196K5248k0556k7875m7408K5282l4132
22787b5846j54531m7143J72386K9771k2741n75p3635O5164p6509r5387Q297j60013
22775c80762J0543J12952J85881J54084j66428k1210K00459O0235r6815l7546
22765B1393j52677P5133J47837k4487j49886k9665J0182J839J667m5051m2745
22754a86460M0986m6557j08857N1542R146l7256j37040j37220J88648O6163r8727
22743c95632L4921N5626j8724K9363P5269J31764r3821j5622l8331N7569M2309
$$ y = [104996, 268001, 106264, -103810, -195801, -145732, 19640, 117269, -27304, -278578, -134426, 11820, 13505, -6743, -38215, -19179, 67912, 132593, 259337, 240515, 102589, -103030, -30811, -1654, 48922, -32601, 53595, 78843, 58287, 30412, -16996, 8286, -25846, -180377, -227520, -55134, -25363, -48104, -48679, -122314, -57150, -133659, -229046, -220749, -380762, -370219, -257267, -71386, 82698, -83730, -104940, 95519, 155754, 58939, 21393, -131284, -56151, 91686, 67199, -82687, -112352, -102170, -100331, -98664, -143715, -186460, -145474, -192031, -300888, -249346, -240200, -277456, -414496, -551716, -363068, -296905, -395632, -360711, -305085, -323809, -294446, -219177, -87413, -181234, -196856, -235187, -177618, -135309]
22732a35309p7963j04393j9754J8222J12202q8004J20110J30791K4353N5786k1861
22721A4180k3846J77314n4721j43551J41211J06931r6135m0250j20054j11235
22711a50156J77801k1110o430L2177k5176o4604o1633k1169p720p9689j9105K54331
22699G517J12342m1161k6669L9710o9061p0260J66602q7014j93466J19306P6281
22688C4127k3961J53955M1656j06515R1319K0644L7201M7291k32906j53830m5051
22677a36070j10118O4659l7208O8633P7364j18885l4438Q2809J87531N176k52620
22666b03167J35907M01830j6655n331p1302j45749j03034J24005l4088j940o4576
22655A5900L0303j2696r3105m1850l6970K09356q8047j51072J6407n6845k2755
$$ y = [-135309, -213272, -317665, -337419, -319197, -206995, -294999, -174889, -44098, -19745, 36041, 14180, -9666, 167648, 112927, -30624, 110587, 217518, 121383, 81133, -38921, -150156, 27645, 6535, 105, 32282, 7106, -57498, -119131, -140300, -148020, -227709, -246814, 7517, 119859, 78698, 52029, 91739, 22678, -47582, 119020, 32006, -161460, -42154, 34127, 10166, 164121, 205777, 99262, 190581, 211225, 248426, 295717, 62811, -91019, -136070, -246188, -181529, -218737, -150104, -72740, -191625, -226063, -143254, 44277, 49453, -203167, -67260, 334570, 317915, 312584, 241282, 95533, -7501, 116504, 82416, 80476, 15900, 46203, 33507, -59598, -101448, -138418, 70938, -17109, -168181, -151774, -208619, -231374]
22644b31374K3876l7625R2459J62902J01780j14219k4686Q7761j96427m3276J725
22633a77104n8905n0429J59696j7637k1917J07008J40000L0288r885l6954j09156
22622d4995Q9364J0273j24469o139M3574p8156j009N1110K12179q543K6226j53099
22610A6316p5374M7057R1154M0580n8072j95002k554J9438J38093J22592M4595
22599A88823j21819M6612J29430n6121l4008K4121n8605J2944J03680n1420m9529
22588A34108j93824j44704Q0937J77046m0648J01949J4595m2936N9266K00424
22578C46213j20303k3962r6702l8103O617j37955Q2205J24930Q3318J04931M0990
22567C72179m5027j71076r7979m5292O4456J09055J50044j01546j42651j1781
$$ y = [-231374, -207498, -245123, -152664, 10238, 112018, -2201, -26887, 60874, -135553, -178829, -177104, -236009, -286438, -126742, -144379, -166296, -59288, 80712, 111000, 101115, 64161, -44995, 44369, 54642, -69827, -75966, -32392, -110548, -111557, -60447, 151732, 143189, 169415, 16316, -59058, -12001, 79153, 119733, 61661, -133341, -135895, -116457, 21636, 144228, 188823, 67004, 113616, 243046, 186925, 152917, 177038, 118433, 131377, 235057, 183637, 134108, -59716, -204420, -123483, 53563, 12915, 114864, 129459, 86523, 145789, 346213, 225910, 201948, 105246, 67143, 73760, -64195, 18010, 142940, 226258, 331189, 372179, 327152, 156076, 58097, 12805, 77261, 186316, 336360, 234814, 92163, 80382]
22557H0382K6925j95654m3828J99983q7993l8905J802M6155K6055m3984o2923
22546i1985J79704j8339j98529k37501O3817J21409N3378p006p7761k5592R8334
22535a40071j13p9083j7313J0962R6320J16237j09109j31119n0879J10643J20933
22524g2592M3919m2246o0967O9480P8067n4705L2674N5093M806m3568q7762j91461
22512b69262m8636Q2580Q2803N0155L7830N9504k3520L1509J76620n1421j14651
22501A3511O0010J60542K1747j49889l427Q2250K2823j46607q3002k2560M8407
22490C805N5512j2368M67j981p2061P3001J02157j77607J869J33571Q30j48172
22478d0977O4934M2004N976J10152o8348l7315J85849n9768j15881l4774k0629
$$ y = [80382, 107307, -88347, -132175, 67808, -20185, -59090, -57288, -11133, 14922, -29062, -91985, 87719, 69380, -129149, -366650, -302833, -181424, -128046, -135052, -212813, -238405, -140071, -140184, -219267, -236580, -225618, -129298, -13061, -122170, -253289, -304168, -193525, -72592, -28673, -70919, -131886, -62406, 15661, -39044, -6370, 48723, 53529, 9961, -77801, -269262, -317898, -235318, -152515, -102360, -64530, -5026, -28546, 2963, 179583, 128162, 13511, 73521, 234063, 255810, 105921, 102494, 184744, 207567, 60960, -22042, -44602, 3805, 59317, 46949, 47416, 45435, -26626, 46375, 148532, -29075, -27206, 106365, 107195, -40977, 23957, 65961, 71937, 182089, 113741, 76426, 262275, 202507, 86626, 51852, 31223]
22467C1223j55598j20274L1423J92637J92410j3172L0399L8954o0327j25339L877
22456D6213O396p001l9970j30684j09749J55415J82582k2440j39257j33770j43480
22445c35745Q8350j09070R8864Q6415J01115q8365j80701J09363L36595o9603
22435C7218J1755L764n0730J862P9580j08992P366n969o960N8932q1575j20253
22423a74002p2876K01141J12788K9693R2691j99503l8287J43626Q1005M2638k6893
22412A92021J0749j8969j9126J92231l6309j48761j03615p0325r5267r1926j04011
22401b93308j19181Q7677J76567R1243J16099j06031m6024J32857M4694N0121
22391A34714r0881j55363N0438R2285q7316j10902Q3878N1674k1304J01653k02747
$$ y = [31223, -124375, -244649, -213226, -20589, 171821, 158649, 189048, 228002, 167675, 42336, 46213, 52609, 45608, 5638, -125046, -234795, -79380, 103202, 80762, -58495, -192265, -335745, -247395, -356465, -257601, -171186, -70071, -158436, -339137, -229774, 106821, 37218, 48973, 52737, 2007, 3869, 83449, -25543, -18177, -24146, -31106, 27826, -53749, -174002, -246878, -45737, 67051, 96744, 189435, -10068, -48355, 95271, 176276, 218914, 192021, 202770, 183801, 164675, 356906, 320597, 171836, 68221, -2104, -97371, -189297, -293308, -412489, -324812, -148245, -57002, 59097, -46934, -92958, 39899, 84593, 134714, 43833, -111530, -61092, 31193, -56123, -167025, -83147, -31473, -52777, 48876, -153871]
22380a53871L7776J49224j35202j69418K02770J41995L9875j6034R5001R3088
22370B85204j73922J15260p666M785R3541j10966q2699K3101j13697L5863N1326
22359A20130n5383o0217k2192J86880J4199k6338j20293j11533j7871J36950J3511
22348E7843P2718O3422m2132r7778p4406j10466N0269M2379k0664N3132m8085
22337e3768l8417L6826l0840N4589j0696j12320O1044k8796j51195R6462J29580
22326d7531M7974o1278j15352L2315L3225J19986J04755K8132k36367n1805J29294
22315a6652P2026n1416K0233n5242k5478n5306J25935J3679j15723j6159J1399
22304i2704q6965k87507O2612J18195j4040p9168K22782J34117j10666p4193r5904
$$ y = [-153871, -116095, 33129, -102073, -271491, -68721, 73274, 113149, 97115, 192116, 285204, 111282, 226542, 218876, 223661, 317202, 206236, 123537, 146638, 32941, 68804, 120130, 64747, 4530, -17662, 169218, 183417, 157079, 36786, -74747, -92618, 44332, 57843, 130561, 193983, 151851, 54073, -20333, -130799, -80530, -38151, -58815, -5683, -53768, -92185, -55359, -86199, -31610, -42306, -154626, -93582, -122378, -273573, -177111, -47531, 443, -60835, -176187, -143872, -110647, 9339, 114094, 142226, -94141, -145946, -16652, 55374, 3958, 24191, -31051, -56529, -111835, 14100, 27779, -87944, -104103, -92704, -179669, -467176, -404564, -286369, -300409, -379577, -156795, -22678, -133344, -207537, -303441]
22293c03441J7056J60612R8139l2014j3875j69319O6010o8967p5285Q7885J26589
22282a06610N5184P3726r2604L087J37921j0247r3676Q39P1479J03076O2895R7559
22270C02629j82402n1982L9129L8889L2714K3982K5883k13026n6881N0723j55567
22259a45909j70883j89330O7708K85845N7104R7562q258j33438k43871j04861
22249d88331J98326J28706O4357J04984J5362L11k5627K7520K1236j12396M399
22238f1153j11133O1656J14439m1092r5009R7127J2226k78644j48925K76809K30641
22227E6942K0614j59784n2175N7179p527J99613J35372j9930j01905r4998j3261
22216B0140K0362r2059J6310N9059j42919k7217L7966J49525r0223J3802K4678
$$ y = [-303441, -286385, -125773, -27634, -59648, -73523, -242842, -176832, -245799, -321084, -233199, -106610, -51426, 22300, -70304, -67217, 70704, 60457, -33219, -32380, 39099, 142175, 205070, 302629, 120227, 68245, 107374, 146263, 178977, 202959, 228842, 15816, -41065, 9658, -145909, -316792, -506122, -438414, -152569, -95465, 2097, -6161, -139599, -383470, -488331, -290005, -161299, -96942, 8042, 23404, 23715, -1912, 25608, 46844, -65552, -61153, -172286, -110630, 3809, -37283, -132292, -35165, -22939, -301583, -450508, -173699, 56942, 77556, -82228, -134403, -77224, -84751, 114862, 250234, 230304, 128399, 33401, 20140, 40502, -51557, -35247, 23812, -119107, -146324, -108358, 41167, -49056, -35254, -10576]
22205a0576L6771r9140J15494r9596j86050j4615N2889O8000p7931J77640J11709
22194G4595O5126l8420J676J62010j9822N5989J6489j48598p4342j16796P2052
22183D9959l786P5029O0461p1950K9517r827m9588n9208J0303j15454l1481j24484
22171b40509r2946R8866M7683K9689N8700j20655J46187Q2524J9040m2525p5583
22160h9529j21671k6798K6547L8107k635j04175K0112n3163K10502J20293J80194
22149A97784q2076P3087j29037l12318n8042Q3895K77804o5517m6186R7747m7668
22138a0527m064p1457r5564J23180K05760Q6094L3421j23458k13367q1810n4331
22127b06123J01757J18070P1574j9857k32535n7150p9760J12133O2086O376O2022
$$ y = [-10576, 26195, -72945, 42549, -57047, -243097, -257712, -204823, -136823, -214754, -37114, 74595, 139721, 101301, 102977, 264987, 245165, 301154, 317643, 169045, 94703, -22093, 49959, 46173, 121202, 181663, 109713, 139230, 129403, 79815, 20607, 30910, -84544, -116025, -240509, -333455, -234589, -186906, -157217, -98517, -219172, -72985, 9539, 28579, -13946, -89529, -211200, -237998, -211451, -173344, -175979, -280154, -260042, -313205, -102703, 17590, 197784, 115708, 188795, 59758, -252560, -310602, -226707, 51097, -14420, -60606, 37141, -10527, -14591, -86048, -181612, -58432, 147328, 233422, 266843, 143385, -69982, -151792, -206123, -104366, 13704, 85278, 65421, -167114, -224264, -304024, -191891, -129805, -123429, -61407]
22116f1407L5036R5465M7336r7823j54758k7933j68145o6430J66572J18490K0543
22105i3054J04346P6017n0721N5625j45005q9855K9387K329Q8919n1647r0001
22094a63660n2758K0416J79070O7374N4296n4824j33614m6309J64211J6679j63467
22083a12586m2210M0150j9888O0428M7086j4318k09678p2432m0997j10180J76902
22072b97723J92632K9907L0871M3334q1858K4791J17763J09700N6280m7299P0501
22061B48899J14012r6842j40207j72757M5650J55822K4332q0404p4255j3993r0925
22050h0668R3043O4287k4917Q341j31060j36590o357K37716K61209p8326k11503
22039d825K4951J03048n6280j40764r2658l8582K5916J82659N0909m4120j04770
$$ y = [-61407, -26371, 69094, 116430, 18607, -136151, -164084, -332229, -398659, -232087, -113597, -93054, 11292, 87309, 36588, 92213, -52792, -142647, -113260, -110931, -22012, -73659, -163660, -216418, -196002, -16932, 50442, 104738, 49914, -83700, -130009, 34202, 50881, -112586, -154796, -114646, -134534, -74106, -27020, -41338, -251016, -323448, -364445, -474625, -297723, -105091, -75184, -44313, -979, -82837, -58046, 59717, 169417, 225697, 178398, 248899, 362911, 266069, 125862, -46895, -1245, 154577, 178909, 98505, 24250, 10257, -80668, 12375, 76662, 51745, 60086, -70974, -207564, -213921, 23795, 285004, 206678, -4825, 20126, 123174, 66894, -73870, -166528, -205110, -179194, 3465, 54374, 10254, -94516]
22028i4516n5962j43101O3930j4739j79933O5703L15736k1619J225O2914j10207
22017a10569k6637M4117J41764n7516Q7939O2105l12370l1984J68975J83367L8719
22006A87910j75298J20786j27994k44278p5572R9480J99401K5124p3872j03808
21996a68121r471P1686K6172J0037p0258R106J61706N5801j07065l4172M6086
21985h493j41631M2154J91135n7038l373m2133J1331J63078K9619o2143m0285
21974H2221O0802L0597o9444j3348O6986l4187n9194Q3420j03840j31372l8875
21963a26234K9442J59514r9813j49082J00435J04546N8377r624p7793n8577L8952
21952b9857J07448q7488m7891L983Q1830M5878j7764J0910P349q2701j0667M8181
$$ y = [-94516, -150478, -293579, -229649, -244388, -424321, -358618, -42882, -64501, -63276, -362, -110569, -137206, -93089, 48675, -8841, 79098, 141203, -171167, -203151, -34176, 149191, 187910, 12612, 133398, 5404, -238874, -314446, -214966, -15565, 9559, -64313, -168121, -177592, -105906, -79734, -69697, -139955, -130849, 30857, 86658, -20407, -54579, -8493, -150124, -107970, 83165, 26127, 22754, -19379, -8048, 155030, 184649, 122506, 82221, 143023, 173620, 104176, 90828, 157814, 123627, 64433, 147853, 44013, -87359, -126234, -96792, 62722, -37091, -186173, -85738, 18808, 77185, 67561, -10232, -68809, -29857, 77591, -9897, -57788, -53805, 28025, 73903, 56139, 67049, 74398, -8303, -18970, 29211]
21940B9211q3148r5330k5255m4531m5084J64440O7556k8427j34588j09061o9558
21929c73775o2913q606k969J48497N0098k5770K03491q3424j88006j74259L6672
21918d80964K65731K69356Q0396N2697J0851j30368j88278J2617J45342o8525
21908c1145j06827k6675O6720O666j1711M2755j6184l5329L2265j16342l5909
21897b31716J27042J23860J7922n1362J03076J07296m1749o1894Q2922N9235j30131
21886A04501j84168q1185J37333l6781O8673q573M6169Q7327j92570j81631J8407
21875b22498M6011L6541p6848j06399j0162J91145N7896K38353K204J3196j37336
21864C2103m9199j26579J38791J57162j36555o7463m6516k1434r137J62616m1149
$$ y = [29211, -53937, -149267, -174522, -219053, -264137, -99697, -32141, -60568, -195156, -304217, -373775, -436688, -445294, -448263, -299766, -249668, -275438, -71947, -155371, -343377, -517636, -480964, -215233, 54123, 134519, 187216, 198067, 67699, -120579, -107962, 37380, -31145, -137972, -164647, -97927, -91261, -102972, -60217, -76401, -111730, -79465, -195807, -231716, -104674, 19186, 37108, -14254, 88822, 196118, 154369, 92475, 175397, 234632, 104501, -79667, -160852, -23519, -60300, 8373, -200, 45969, 133296, -59274, -240905, -222498, -176487, -139946, -216794, -323193, -333355, -142210, -84314, 154039, 156243, 169439, 32103, -17096, -143675, -4884, 152278, 15723, -51740, -98256, -119690, -128827, 33789, -7360]
21853g360R8260O5183r3065J28104P6919j60778r1826m8940K3383O6146J64045
21842B20071K4415k47625j75366m0120j23839j5668j8847J22258J35919J58493
21832C9691J69623O7122m9028j67672p1771N8941o2394J9217N6930j89551o0517
21821a89409J03144l8297l22586j09002K25330K35044l5967J9877J5324N1447
21811d5095J70106R5768o1408j1946p1397j18458p1629O0115J33731n187k65017
21800a90417o7811P7735P8045l6099Q1633J15119J01305j20273j09355J44304
21790G4186q9110r2223O7882J73036j5516j91634l3096J21509Q234M1220j38610
21779g4122j21719j0974o4529M5481J13379K65462J16272n1055j28184j010m1305
$$ y = [-7360, 90900, 156083, 63018, 191122, 268041, 107263, 15437, -33503, -10120, 56026, 220071, 244486, -3139, -178505, -218625, -342464, -358132, -376979, -254721, -118802, 39691, 209314, 276436, 227408, 59736, -12035, 46906, -15488, 3729, 60659, -128892, -189409, -86265, -124562, -447148, -556150, -330820, -95776, -131743, -111866, -96542, -45095, 125011, 220779, 159371, 147425, 76028, -42430, -114059, -53944, 79787, 74600, -190417, -258228, -180493, -102448, -138547, -56914, 58205, 159510, 39237, -70118, 74186, -14924, -107147, -39265, 133771, 118255, -73379, -106475, 15034, 23268, 64488, -74122, -195841, -206815, -271344, -225863, -112484, 152978, 269250, 218195, 90011, 89001, 47696]
21768D7696k0945J6999m7671p2418Q1426J34807O8333p0510j2199k4849j30591
21757b9922n9380K07850J74106j38976r7658p4569Q8745O0543j32406j7981l3317
21746e2965j9654K3815j2682j37844m6604L5448N9975J00559K1099o4766p3933
21735a67552J4889j15034r9674R1357J03639p7551m3265m9180J09265N4949N4231
21724a23926p8515j8091P4842J58791O9492P1676l517l054j43863k7442k00058
21713b23665q7105K01203K9745j26312J80630K25842Q5793j85958j13133N9595
21703D6635L9674P7236k4643k07164j28168O720k5628J11835J23331J42320K6460
21692A88608k30691j02271L5281k8954J00172R9529p2013j35976O3582Q4733K3770
$$ y = [47696, 26751, 43750, -3921, -76339, 5087, 139894, 208227, 137717, 125518, 100669, -29922, -89302, 118548, 292654, 153678, 56020, -18549, 70196, 130739, -1667, -19648, -52965, -72619, -48804, -61486, -199330, -245934, -210486, -150511, -49952, -28853, -93619, -167552, -152663, -267697, -367371, -276014, -172375, -249926, -293191, -342371, -233106, -178157, -123926, -202441, -220532, -145690, 13101, 82593, 154269, 150752, 147698, 3835, -23607, -223665, -310770, -109567, -79822, -206134, -25504, 200338, 286131, 100173, -12960, 46635, 86309, 163545, 138902, -68262, -196430, -189710, -215338, -103503, 19828, 162148, 188608, -42083, -144354, -109073, -138027, -37855, 61674, -10339, -146315, -82733, 2000, 25770]
21681B5770r4544Q863K1733L8480m498M701N5557k4401K3624j66422q2470L0188
21669a63419r5411N735N0400R9010K33353Q4786j59194j29721O8491l7112k9086
21658g2168k8785j63560M0819J41994J72486K13264J10516k5281q3406j42702
21648A63177j76452p4745L4381N5018N6019j11642j684J5641r1785J84468P5467
21637A27863k74853l4753P1391m9332R4590r3054p8341L1231n496M3257O2700
21626a04797K5409j33622O1313p4197M1085J2999M2615J77861O0759m5997j50191
21615h6763m7062P8830J1763o0457k8017O7631l4083K1946M7871j1144L6954O4586
21603F2055j0920o0252L0826P5627Q8447L0605Q2449l6652j31758l7655n8305
$$ y = [25770, -68774, -59911, -38178, 302, -4196, 505, 56062, 31661, 55285, -111137, -193607, -163419, -258830, -253095, -202695, -103685, 129668, 214454, 55260, -74461, -5970, -43082, -72168, -100953, -264513, -223694, -81700, 90786, 304050, 414566, 389285, 305879, 163177, -13275, -88020, -53639, 1379, 57398, -54244, -55928, -40287, -132072, 52396, 127863, -146990, -181743, -110352, -159684, -65094, -158148, -236489, -205258, -210754, -167497, -104797, -79388, -213010, -151697, -225894, -184809, -171810, -129195, 48666, 109425, 63428, -86763, -133825, -54995, -43232, -103689, -131706, -64075, -98158, -76212, -28341, -39485, -2531, 62055, 51135, -9117, 21709, 97336, 185783, 216388, 298837, 262185, 130427, 92772, 34467]
21592C4467j48678m5202m4959p6095N3172J15840M019N257L6262O0400L7160r1523
21580e9880J07564K00205j54482k69068k4728J12354L922m9933q85M85K29524
21569I5078j8079O3283J38294j28287k04306o8471j58965O1294Q0646L7641J34171
21558C2299J62180N3884j48496o3635j09336l5144L8862J5779l1314J61915l3805
21547D3189j64778J6567O4225n6836r440J1772j38630n7521J01239K42210M2676
21536I4673j06985Q3378O6301m921j36384n3529p0337l3676J41476j33853j72889
21525c26746K9510N9688P8040R9826Q0029N9509l3700k26566M6019L9404N6002
21514c8985J59748r4308j81375J4949J33144m3275m3329J02991j06625j41870
$$ y = [34467, -114211, -159413, -204372, -280467, -227295, -111455, -107436, -102179, -65917, -5517, 31643, -59880, 47684, 247889, 93407, -175661, -200389, -88035, -84113, -134046, -134931, -134446, 95078, 76999, 140282, 278576, 150289, -54017, -122488, -281453, -220159, -139513, -101872, 32299, 194479, 248363, 99867, 36232, -73104, -108248, -69386, -53607, -84921, 76994, 43189, -121589, -105022, -40797, -97633, -107073, -95301, -233931, -291452, -190213, 51997, 94673, -12312, 71066, 137367, 132446, -3938, -57467, -127804, -161480, -20004, -153857, -326746, -297236, -237548, -159508, -59682, 20347, 79856, 46156, -180410, -134391, -94987, -38985, 120763, 26455, -154920, -139971, -6827, -50102, -93431, 9560, -97065, -238935]
21504b38935P7140J11263M3392O0196J11762L4352j02702j51634j66371r8337
21494c19874J621M4125M3849R299n689O9604J33432K4972q2661J1704J71835P7212
21482A79429J1055J577L9849O611j54099N4315k6155j209r3327j51914j9387K6931
21470a26324J00920L1097P8989j2747m8670M1592l6450q2798J8959p300j15695
21459a58427J6658J15450P3589j19696n7284J5227j17548k1116J00596J2350J3172
21448a27029N1212J49600o3128j02394n7533J58754J03171J906n7404k8380n0852
21437b2077J01949L8431j62033r4775J55845J992r7931N9963m0990R6827L3218
21426G0419L1977n4769N0114R9611L9687m7406n151l8534M1275j44635q9147k58798
$$ y = [-238935, -161795, -50532, -7140, 53056, 164818, 199170, 96468, -55166, -221537, -319874, -318253, -274128, -230279, -220980, -226669, -157065, -23633, 1339, -81322, -69618, 102217, 179429, 190484, 192061, 231910, 238521, 84422, 138737, 112582, 111373, 18046, -133868, -153255, -126324, -25404, 5693, 84682, 71935, 23265, 64857, 28407, -54391, -35432, -42732, -158427, -141769, -26319, 47270, -72426, -129710, -114483, -232031, -253147, -152551, -140201, -127029, -75817, 73783, 10655, -91739, -149272, 9482, 112653, 114559, 57155, 28775, -22077, 79872, 118303, -43730, -138505, 17340, 19332, -78599, -18636, -59626, 37201, 70419, 102396, 47627, 97741, 197352, 237039, 189633, 184482, 145948, 187223, 42588, -46559, -305357]
21414c05357j07366K6945J30057l4780o04Q9329J27079K24003J1030j73174j28152
21403a40990K20840r7047j42485j16319j227K48780J8244j37852N0638K9966k0394
21392h7846J7320j8692p3415J47806l0019N1787L63387o5820k90070j13922j6365
21381a15849J12577J20158r5129Q3913Q707k8425j16404k77515O1289N5390k280
21370a93568J37236M210J4567r759Q8592R1237P3075n0297K0519p0437j1315k7287
21358F6773j2809L6000M449N894j7369Q8793K9277j4086k6915m0138j6327l1762
21346G1780o5871k0234O0578n1062r426L7006o4797r1903j59446J08671N1426
21335a33278j15643N9341J92138l6360o3583J18664M3370P428L8555j69512k16740
$$ y = [-305357, -412723, -385778, -255721, -290501, -291105, -201776, -74697, 149306, 160336, -12838, -140990, 79850, -17197, -159682, -276001, -277228, -28448, -10204, -148056, -97418, -67452, -87846, -70526, -89218, -162633, -14827, -44846, 6941, 370328, 304508, 14438, -99484, -115849, -3272, 116886, 21757, 105670, 114377, 85952, -30452, -307967, -246678, -191288, -193568, -56332, -52122, -37555, -47314, 41278, 132515, 205590, 155293, 175812, 105375, 94060, 66773, 53964, 89964, 94413, 100307, 82938, 171731, 201008, 186922, 160007, 119869, 103542, 71780, 5909, -14325, 46253, -4809, -14235, 22771, -42026, -133929, -293375, -184704, -133278, -248921, -189580, 2558, -33802, -97385, 21279, 64649, 72077, 110632, -58880, -275620]
21324b75620p0186l3909R8118J15901R9023M7547j7049O6894J4171O5759o0393
21313E0256L7873j99173p5853r847J17007k0615p8625P9879J71877K5340j73157
21302g5038R537J71577k4002m4113j8068j52543l8346L3212k6628M9549J69622
21291E4759l0090q0968N667p8871j56088N8707J15526J00651o7936j01238n5300
21280b35181L5391J06926J47975m7788M2092k7780q5333l0234P4281L0316j7450
21269f785J15215q4417m3003J9490M7949P7466j18669l3758K9604P2511k48194
21258a72591j07570Q8369Q0851Q1862k3682J33725o6432k08473j55547J75856
21248a73632J53667J3623O227j86744m3197P3680K00899j11223j26275R0337J15090
$$ y = [-275620, -345806, -379715, -281597, -165696, -66673, -19126, -36175, 30719, 44890, 110649, 50256, 88129, -111044, -186897, -196744, -79737, -100352, -178977, -99098, 72779, 98119, -75038, -65501, 106076, 82074, 37961, 19893, -132650, -170996, -137784, -164412, -114863, 54759, 24669, -56299, -50632, -129503, -285591, -226884, -111358, -10707, -78643, -179881, -235181, -199790, -92864, 55111, 7323, 49415, 21635, -63698, -93932, -19651, 10665, -6785, 108430, 24013, -18990, 500, 48449, 125915, 7246, -26512, 3092, 75603, -172591, -280161, -191792, -110941, -29079, -52761, 80964, 14532, -193941, -349488, -173632, -19965, -6342, -115, -186859, -230056, -156376, 44523, -66700, -192975, -102638, 12452]
21237A2452M2673j84688k41482J98950J62862P8018p0991R891r0957o3249n4996
21226b01517M9291J26536n3663j05441O1520J56305N931j40079O8067Q7833q190
21215D6593K0286M687j7246l4657J36439J8465r2971r5416j39464J27338P5732
21204D9786o3134K4033K50493J39284o3631k3625k59645p5468J50996J25496q6237
21193A68348j02371j03079O505O3327Q5747k6996M3549K9730L5146j27875j60519
21182h8488j94836R7824J4327p8189L4245M5194J4317J34493R135R8209j63544
21171g7313j98426L7183J90210K43255p8807k49902J6215R8867n5085M8774k6969
21160e1998K2825J69618r0622K4094P0837j04730r0622l2418R263J03539j9837
$$ y = [12452, 55125, -129563, -371045, -172095, -9233, 68785, -2206, 7685, -83272, -146521, -201517, -152226, -25690, -79353, -184794, -123274, 33031, 38962, -101117, -33050, 54783, 46593, 66879, 71566, 54320, 19663, 156102, 174567, 81596, -13820, -153284, -25946, 49786, -13348, 10685, 261178, 400462, 336831, 313206, 53561, -21907, 129089, 254585, 168348, 65977, -37102, -30597, 32730, 118477, 91481, 135030, 164760, 199906, 72031, -88488, -283324, -185500, -171173, -249362, -215117, -169923, -155606, -21113, -11978, 86231, -77313, -275739, -238556, -48346, 194909, 116102, -133800, -117585, -18718, -73803, -25029, -51998, -29173, 140445, 49823, 73917, 144754, 40024, -50598, -83016, -73753, 29786, 9949]
21149I949q5219q8736p1392K04000N9140K3878J27428K3091k15329n9134Q3234
21138A0910K2013j40912m2852R2346K29963k3301j60879p1441j12336r6700M6720
21127b46469J79686j26753j40050k1653L08017Q0336J68029M8628k4726o462J1803
21116B30386N009K31212j17089k94848M9030R2924J00185n9240m3647r0128k1569
21105H2225j46183N4576Q9599l6234m8385M5333K1506j07713K6075j02150J78286
21094E6935J51552P9149o3331m3673j2821K35424j86424r2598j71488o0900Q6128
21083b2047J16635r7742j57531n8741q0510M7357K09998n0185j4824k7763J76857
21072D1504J60381j78158j18900O538N7661P445Q30O5912j0207j51818j04764
$$ y = [9949, -75270, -164006, -235398, -31398, 27742, 51620, 179048, 202139, -13190, -72324, 10910, 32923, -107989, -150841, -58495, 171468, 148167, -12712, -84153, -196489, -293189, -246469, -66783, -193536, -333586, -355239, -47222, 33114, 201143, 249771, 225045, 218583, 230386, 235395, 466607, 349518, 54670, 103700, 196624, 296809, 237569, 193922, 103794, 82225, -63958, -9382, 80217, 43983, -4402, 40931, 62437, -45276, -19201, -121351, 56935, 208487, 287636, 224305, 180632, 167811, 403235, 216811, 124213, -47275, -108175, -22047, 94588, -3154, -160685, -219426, -299936, -252579, -42581, -92766, -107590, -135353, 41504, 201885, 23727, -95173, -88635, -30974, -23529, -22699, 43213, 33006, -118812, -223576]
21061b23576K59139j871k37355K9240J80023J01184j36720q8662q2126J9716M4569
21050a36439n9874J30495O6725n8831o6506j15346j22805M8292J21795J85827
21040f667M7247q5107K6320M7824l2034k5332m4162P8432k8963q0563m8673n2265
21028b03943J52551K62861l2007j92022R5467R5343Q722l4199J6437p3765p444
21017H8001K46891k15687o1364Q1673J05078J44994k78259j66378k140n5086j4837
21006a27114J04350M2798n8215j3366q239R715n5662k01596q3497K36677K4088
20995a30061R5291P6753R1927o3274o3561j7827J14358J23654j03896j05563J09703
20984A27504P423k36364k11497N7074N4848K9126J22326J96010r7697j23308j04825
$$ y = [-223576, 35563, 33692, -203663, -174423, 5600, 106784, -29936, -118598, -200724, -181008, -136439, -196313, -65818, 907, -57924, -124430, -239776, -362581, -314289, -192494, -6667, 40580, -44527, -18207, 29617, -2417, -27749, -71911, 6521, -22442, -103005, -151678, -203943, -51392, 211469, 179462, -12560, 82907, 178250, 186972, 152773, 169210, 95445, 88001, 334892, 119205, 57841, 139514, 244592, 389586, 111327, -55051, -57191, -112277, -127114, -22764, 20034, -38181, -51547, -59786, -50071, -105733, -307329, -390826, -154149, -130061, -34770, 41983, 133910, 70636, 7075, -10752, 103606, 227260, 123364, 17801, 127504, 134927, -101437, -312934, -255860, -201012, -171886, -49560, 146450, 48753, -74555, -179380]
20973a79380q5153k7452O4690J16467m1264r730J04867j7732q8175K4183J0699
20962a27980K0944L3578O8373L265R650j95361m3096J53798J15943J32298p4500
20951I6912j38197L1427P0320l8165J47397j5636j30264R1784M4128l0390Q9835
20940B19151j08294j00523R8133P9767n7034p474l9155q9650j61670o3915J66506
20929f4158N8870J00929K5601J1889O1480m0655M1518L106N4773j91906m8174
20918A3273j59M0951P3645q5109q4116q7999n6201J26167p1637J7321M309j4573
20906a24128l677J58437J31775m9403k25535k4193j7910M6033K00048J74270n8610
20895B07107j42130j98944j84205j15544J87033O5592J80133o4943n1063M6679
$$ y = [-179380, -264533, -291985, -227295, -110828, -152092, -161822, -56955, -74687, -162862, -138679, -127980, -107036, -73458, -5085, -1820, 7830, -187531, -230627, -76829, 39114, 171412, 96912, -41285, -9858, 60462, 22297, 169694, 154058, 23794, 115578, 159706, 129316, 219151, 110857, 10334, 108467, 188234, 131200, 123726, 84571, -5079, -166749, -230664, -64158, -5288, 95641, 121242, 133131, 194611, 153956, 195474, 198580, 253353, 61447, 13273, 13114, 54065, 127710, 42601, -41515, -129514, -185715, -59548, -131185, -113864, -109555, -124128, -127805, 30632, 162407, 113004, -112531, -136724, -154634, -108601, 91447, 265717, 207107, 64977, -133967, -318172, -433716, -246683, -181091, -958, -65901, -116964, -70285]
20885g0285M9307L8021m3773l9483l8744J9953R7422K3049O97j00821n3915p0128
20873a88700J01529N7107k1198M0236J87765J30916k6173j16465j51927K0081
20863C3171j01268P2961O6573k2144M0742L1337j83986o8414J97049K22673k19704
20852F8990k72286J8538k2573j08569J65642J80896O3274O809o3059J0126O299
20841E4087j4742j9512k8919k8509O266k1935P7295q655r9948j13247r0732m4914
20829c33465O7468K80016J54945j08149n5315M4913K4135l9392l6734n4065L5505
20818b0138N3903j86325k7980J8383Q9651k15M4441N1624o4615n9116Q2738r3305
20806a10954j45622N2647J0926L2340K7171m3171O9360K08392J11780O682L753
$$ y = [-70285, -20978, 17043, -26730, -66213, -104957, -85004, 12418, 35467, 36164, -64657, -118572, -188700, -87171, -30064, -51262, -11026, 176739, 307655, 281482, 165017, 13090, 33171, -68097, 4864, 71437, 49293, 90035, 121372, -62614, -131028, 66021, 288694, 68990, -203296, -184758, -207331, -315900, -150258, 30638, 93912, 100721, 37662, 47788, 54087, 39345, 19833, -9086, -37595, -31329, -53264, 24031, 15376, -84572, -197819, -288551, -333465, -265997, 14019, 168964, 60815, 5500, 50413, 74548, 35156, -1578, -55643, -20138, 33765, -152560, -180540, -162157, -72506, -72721, -28280, 23344, -41271, -100387, -17649, -110954, -256576, -203929, -193003, -160663, -133492, -176663, -107303, 101089, 212869, 219551, 223304]
20795B23304J02561n448k0581j40133p9036j13968o0082J05327m7125j19683j27353
20784b82217J30886J09369J7866M1866k92707j37383J47810O6296j00868J14927
20774a84155K15177q4637j1805J47223K3588o758l1484J35654J8170P4707l7644
20763B58036j22915r9453l0415k4277l775l3870o2472K5497m7949N3168J70621
20752H2196J2490L3626N5247o6152j03828q8318p0754Q9541J15850L1356o5973
20741B5281N2387L8348J83394O8023j91065j36491R0616N4715q6010k5080j5799
20730E8319K8623J202j8464n952j6952O4809R2425J03308q2107m9658q4882p3277
20718A7394L0378n107j37082q6412N1320o0289p1628j54411J28286K84808O0888
$$ y = [223304, 325865, 320417, 299836, 159703, 80667, -33301, -93383, 11944, -35181, -154864, -282217, -151331, -41962, -24096, 17770, -274937, -412320, -264510, -198214, -299082, -184155, 31022, -53615, -65420, 81803, 105391, 98633, 67149, 202803, 220973, 295680, 258036, 135121, 35668, 5253, -19024, -22799, -56669, -119141, -93644, -141593, -88425, 82196, 94686, 128312, 183559, 117407, 13579, -74739, -145493, -55952, 59898, 91254, 25281, 77668, 116016, 299410, 367433, 176368, 39877, 130493, 185208, 99198, 74118, 58319, 86942, 88144, 69680, 63728, 46776, 111585, 204010, 307318, 225211, 175553, 90671, 17394, 47772, 42665, -94417, -180829, -129509, -189798, -261426, -415837, -287551, -2743, 58145]
20707E8145J23763J87357p9576j08251o5868j38103j32636j21195M5160j2362
20697b43566R7526K63121r8077j46738m8426N2846L4117j2215M2625l190J22325
20686F0348O5386K7100q1729r4418P2008r8689o2485p368J34771K312mp0042Q1061
20673B8251P6091j22484k15679q2422M0182l3606N0613o2784n5910J80401N9447
20662a37900M8209M0009N9848k3015L2555q1812J27096J10529l03621q0304o0269
20651b68675p4454N9649O3830N2166N8679K05120p1747J6516J3374J09445q6998
20640G6905l4019j42516j87322l853j8486p1003J9381K93984J44851l7071j11487
20629g0636J32217r6777m9299l3978r0024l857J64494L9967M6218n9088L3406
$$ y = [58145, 181908, 369265, 289689, 181438, 115570, -22533, -155169, -276364, -231204, -243566, -146040, 117081, 19004, -127734, -176160, -123314, -89197, -101412, -58787, -61977, 60348, 125734, 152834, 71105, -23313, 48695, -49994, -112479, -119847, 14924, 17236, 17232, -52810, 28251, 104342, -18142, -233821, -316243, -276061, -309667, -259054, -321838, -377748, -197347, -137900, -89691, -49682, 10166, -12849, 19706, -62106, 64990, 175519, -128102, -208406, -268675, -343129, -283480, -219650, -167484, -108805, 96315, 24568, 41084, 54458, 163903, 76905, 42886, -99630, -286952, -290805, -309291, -380294, -360913, -66929, 77922, 40851, -70636, 61581, -35196, -84495, -118473, -208497, -212354, -47860, -7893, 38325, -20763, 12643]
20618A2643j9412J22251O0114N1193r05k7429O7282k65751j51374O5440J24686
20607C8738J28764j46302R4161J42337p040k19752j61666p309J16121J9916J31175
20596A29143P5240k009p5015j30231K7602m8060p8987j54474J5063j7904L0448
20585b29184P9322M9216O7089k8299J32471P9992K31959N0537m3220J714j59697
20574B31900k13400N3639P1217J50835j05685j33870q4778m0901M7527p5095O6471
20563c2140J68472J24165j70882j19801q7114j64292k8207K99888J46632P0661
20553B07382J8426q9884O734k13612J4675O5716o5325J23705j5519o6191L0274
20542A6381o963j15685j7664m8514M5434K3011N9266J67290N7815j28138J4737
$$ y = [12643, -6769, 115482, 175596, 226789, 225884, 198455, 265737, -14, -151388, -85948, 38738, 167502, 21200, 115361, 257698, 250658, 30906, -130760, -138069, -21948, -2032, 129143, 204383, 202374, 127359, -2872, 24730, -23330, -102317, -256791, -241728, -259632, -229184, -149862, -100646, -33557, -61856, 70615, 150607, 382566, 433103, 389883, 391597, 231900, 18500, 72139, 143356, 294191, 188506, 54636, -30142, -71043, -23516, -98611, -32140, 136332, 260497, 89615, -30186, -117300, -281592, -309799, -9911, 136721, 207382, 225808, 135924, 142658, -70954, -56279, 9437, -55888, 67817, 52298, -13893, 16381, 9418, -106267, -123931, -172445, -127011, -104000, -44734, 122556, 180371, 52233, 66970]
20531F6970o8520j03550j00756j0724J45954J15880R5469j6877J27718j2508k4140
20520B14916l1354N4855j09523J1351L6451j59793j16691R8747M0556P8584j13192
20509D907j85531K7381J45350N486M2910M1629L3461J73559m5024r7811l9694
20498A06623j8504o4139N8383N4807p0726j75089J27585N5531k6251J4254j39668
20487g7194j05919O2941j22897j1140p474k06786Q7299J84085P2703J95457r771
20476F1304p2339K0399J5820j07425j03428Q2473Q7678N2987j23670J03067J20029
20465A36895K4084L3188K8455k02879j37753J23010Q3387m7886r7074l2814j68528
20454b57915j9097J44365J35560p1249l8665N6740m112R9142M9142j8205p9625
$$ y = [66970, -1550, -105100, -205856, -216580, -70626, 45254, 140723, 123846, 251564, 239056, 214916, 183562, 238417, 128894, 140245, 176696, 16903, -99788, -1041, 39515, 118099, 4907, -180624, -153243, -7893, -2407, 40503, 82132, 115593, 289152, 244128, 146317, 106623, 88119, 23980, 82363, 137170, 66444, -108645, 18940, 74471, 48220, 62474, -77194, -183113, -120172, -243069, -254209, -261683, -468469, -381170, -197085, -124382, 71075, 61304, -11035, 9364, 25184, -82241, -185669, -103196, -15518, 37469, -86201, 16866, 136895, 160979, 194167, 222622, 19743, -118010, 5000, 88387, 40501, -56573, -89387, -257915, -277012, -132647, 2913, -68336, -107001, -50261, -54373, 44769, 93911, 75706, -3919]
20443c919J47431r3766r7911j2573j00347m5986J74497m4200k59780O35n191M1173
20431b99937n00n1384K2558j14229o453o64J65045P3029O9158Q0297r582p6164
20419a48826r2711p4375J31890P2249O913r746J03201J20990L1280l0409n4225
20408E6231q4319j16322J22148J10678j02615J2676l9154Q4760O5461m4157J6162
20397H1549K9850P6645j33239p4392m852j50694j12870M8664J87180M2368m1324
20386e1115n0214P2917o192J07033Q2078O068l4812k86793P2642M1511N3341j7225
20374a0761j4857q0454K395O8285l8330p1559L4084Q2943K01687o2684p3169m4295
20362f715l4526l8270P6687j97573j29550J7831J65157K03894Q7401n1588j63006
$$ y = [-3919, 143512, 49746, -48165, -60738, -161085, -207071, -32574, -76774, -336554, -335919, -341110, -299937, -300437, -351821, -329263, -443492, -449945, -450609, -285564, -212535, -143377, -63080, -72662, -148826, -241537, -315912, -184022, -111773, -104860, -114606, -11405, 109585, 140865, 110456, 56231, -28088, -144410, -22262, 88416, -14199, -1523, -40677, 44083, 109544, 65387, 81549, 111399, 188044, 54805, -19587, -24439, -175133, -288003, -239339, -52159, -9791, -51115, -101329, -28412, -34604, 72429, 154507, 160575, 125763, -161030, -88388, -46877, 6464, -10761, -25618, -106072, -103677, -35392, -73722, -145281, -111197, -28254, 173433, 110749, 37580, -6715, -41241, -79511, -2824, -200397, -329947, -312116, -146959, 56935, 144336, 92748, -70258]
20351g0258N337R6812J19006J10736r6144q6138k27817l1845J16385o8537r6601
20340b29064J31466J65104J71547P9917N4750j13451l16938j67660M2964Q2180
20330i9185J7650J24884r8613J20956J86696l4436n1996Q4460M7643N5711k36932
20319A16838p8601q7654j15880j69173N2254R2423K15573J1294r2521Q2109J49234
20308A75896J82616j39036K9038N8875j93155j12362N9698O020j58112j2202J18024
20297A5300O1003j76925p2828P3540K48339j35667j52446K4794L1972J1832j1296
20286h2382J34669l7108k20798q2086J68235m4919N9840J16864P6342q954j34804
20275e5101j45490R7P8674J08076J48553j5461j73148K0264M5246j20897J00412
$$ y = [-70258, -64921, 31891, 150897, 261633, 165489, 79351, -148466, -180311, -63926, -132463, -229064, -97598, 67506, 239053, 318970, 373720, 260269, -56669, -224329, -181365, -99185, -81535, 43349, -55264, 65692, 252388, 217952, 165956, 250416, 298059, 353770, 116838, 38237, -49417, -165297, -334470, -282216, -189793, 25780, 37074, -55447, 26662, 175896, 358512, 219476, 248514, 307389, 114234, 1872, 61570, 67590, -90522, -102724, 15300, 76303, -100622, -173450, -99910, 148429, 12762, -139684, -114890, -82918, -71086, -82382, 52287, 15179, -205619, -287705, -119470, -164389, -104549, 12315, 88657, 79703, -55101, -200591, -200494, -121820, -13744, 134809, 119348, -53800, -33536, 11710, -109187, -8775]
20264h775P6696k4006l4503L0801J13652J7110o358r2238O0204O0472k0614J14300
20252B86741L3354j36623j40513j31434n1440J56561M2720Q8097j64722j52608
20242a69867J64215J37265m7386j18021o5349k502k7823J8553l145j33332J60766
20231h6626R1089J1472n3153l0183K1960J0302M786o9735Q511K00408K0832j18311
20219A1352J8320J40118k6420r0987p147J25074K391l0633j53176k61798j31700
20208d04606J82917K50342J13743Q581J1158j44712j11538J18567L6589j07105
20198d6064l307J25490J2240J3541R4761j21658j4474n6728r7881R0890n9343
20187f2533o370R8433J20564R7412N5911J96906j38414k37891k07931O7116K4785
$$ y = [-8775, 67921, 43915, 9412, 40213, 153865, 170975, 164617, 72379, 132583, 193055, 172441, 286741, 320095, 183472, 42959, -88475, -139915, 16646, 59366, 147463, -17259, -169867, -5652, 131613, 84227, -33794, -99143, -101645, -129468, -110915, -114060, -247392, -86626, 4463, 15935, -37218, -67401, -45441, -35139, -30353, -100088, -91577, 108831, 129663, 11352, 29672, 169790, 143370, 52383, 45236, 170310, 172701, 142068, -11108, -272906, -404606, -221689, 28653, 142396, 150977, 162135, 17423, -94115, 24452, 61041, -46064, -49371, 76119, 88359, 101900, 196661, 75003, 60529, 3801, -94080, -3190, -62533, -68903, 29530, 150094, 247506, 303417, 500323, 361909, 124018, -83913, -16797, 7988]
20176G988n6297Q9956L9699m9897Q8910r5935j18710n8548J28061L9247j2770
20165A704p8566L20K6280N9878m0621m4802o376j0872j27221K9648P597p2605
20153b55636L7949J59861J63115k0795j54549j16536M7800J19865r059o2839K24841
20142A34017R7460K5325r5325k19213j44190O2461J31882l8224O3759J43253J8913
20131A80118j21146J3459O0668L1180N0635m98j00731l9969j74766n042m1575
20120a47667K0523R3372j9182p106P1554R4997N6983N9698J07276j14088j32952
20109H3408q1763p7592p1475L4893o0176J58702K81822m5973j50847j54908r1600
20098a75509P385O6853R6932n4701R3754O4753j63472p4385J6877K29084P530
$$ y = [7988, -48309, 41647, 81346, 31449, 120359, 24424, -94286, -152834, -24773, 14474, 1704, -76862, -76542, -50262, 9616, -31005, -75807, -82183, -93055, -220276, -190628, -183031, -255636, -217687, -57826, 105289, 84494, -70055, -186591, -138791, -18926, -27985, -90824, 134017, 231477, 256802, 161477, -57736, -201926, -139465, -7583, -45807, 17952, 161205, 180118, 58972, 72431, 133099, 164279, 214914, 214416, 113685, 73716, -101050, -106092, -147667, -127144, -33772, -52954, -60060, 11494, 106491, 163474, 223172, 330448, 216360, 83408, 1645, -75947, -147422, -112529, -172705, -14003, 267819, 221846, 70999, -83909, -175509, -168124, -101271, -4339, -59040, 34714, 99467, -64005, -138390, -121513, 107571, 115101]
20087A15101j10155k8791K09386n5352k27722M9042P2564J28098j87793J1477
20077b4145m8824k58845N6570J63757L0941r246K42N2309J56571n6467n9321J3831
20065A7373K7952n0212j53305o1460m8708L293j27916j9911Q6984K69494p2201
20054a28617o2991o6210J019K377m9938J9593k7497L381N1285K65577P1114q1139
20042b046k8136p654j74485O074n6775p3830J72270J77945j9341j63695L2158
20031a37515Q7190k6410K9088N3525l456l7956o9427J563Q58n5223J19699O1382
20019B3318L4421K0094j15981N1805j0443o0545N7830L0322J26343k3418J29374
20008B63120K2116p1678O229K7965j59555j38542m3804M1472k8071n200j1699
$$ y = [115101, 4946, -23845, 185541, 130189, -97533, -48491, 24073, 152171, -35622, -24145, -72969, -331814, -275244, -111487, -80546, -89792, -89550, -37241, 119330, 62863, 3542, 17373, 45325, -4887, -158192, -219652, -268360, -265067, -392983, -412894, -325910, -56416, -128617, -191608, -257818, -256799, -254422, -304360, -284767, -312264, -308883, -257598, 7979, 79093, -2046, -30182, -37836, -212321, -206247, -263022, -336852, -164582, 13363, -5978, -169673, -137515, -50325, -76735, -47647, 5878, 2422, -35534, -104961, -103398, -102540, -157763, -38064, 23318, 57739, 77833, -38148, 13657, 3214, -57331, 499, 30821, 157164, 133746, 263120, 285236, 213558, 219787, 247752, 88197, -50345, -94149, -52677, -80748, -85948, -97647]
19997i7647k7075j04062P5177O9619K1000k6703j45946J0571J19106L3630j40316
19986b12646Q4277P3113P0212j20875J400O0416o3104l2863L1500r7641q2523
19975b88734o834j76398J14469J88340K57066o8950J0038k6447l216M3793J65333
19964B08460R6039P0407r5335m476q8710m7303J27389M443l378l5792j48514j94861
19952a11631J04208J52624L8987N9357m6799j81556O1373J34806q0800j8877n5341
19941E6351K801J61280m0687j49372N9944j8812k7990n7848M0146p5389l5275
19930h4851J36863J93553l044p8208J4032o8399j08699J3355j3215L7254j38630
19919i9989J6013o9273Q7653L7922m1757j23152j45011J7741J35535J58978M8740
$$ y = [-97647, -124722, -228784, -153607, -83988, -62988, -89691, -235637, -225066, -105960, -72330, -212646, -128369, -55256, 14956, -105919, -104519, -44103, -107207, -140070, -108570, -206211, -288734, -295568, -471966, -357497, -169157, 87909, 18959, 28997, 2550, -666, 43127, 208460, 304499, 374906, 279571, 275095, 186385, 139082, 266471, 270914, 267536, 231744, 83230, -111631, -7423, 145201, 184188, 243545, 196746, 15190, 76563, 211369, 130569, 111692, 56351, 59152, 220432, 179745, 30373, 90317, 71505, 43515, -14333, 25813, -49576, -84851, 52012, 245565, 242521, 164313, 178345, 109946, 1247, 14602, 1387, 38641, -99989, -83976, -153249, -65596, -27674, -69431, -192583, -337594, -319853, -184318, -25340, 23400]
19908B3400Q6898j34336j78660P3519M9119N2157j23196J27717m2814J1070j2342
19897f7468j12927J0771K1585m4833N8320L6204O7691P0611Q618k3911p028n1311
19885c3678j13929N253M5949p0382J36348J77943o9659k47297P2748K48212R8832
19874B50340M6733j23409p2011m3702k2846K22356j9808j78108j83847M4872O5447
19863a3983j22484j13849j1069k7697J2628L880J01819J15294J37059n5646j01921
19852g5969l8897m5727j26437M1678J87153l8893o9796K10850J95808j08314j79602
19841d8146r4036k2435J21587M4469j10925o0054n9135R3313l920j23751N1277
19830b11756k0074O4982r5425k8172p923M7261l956Q4329J19254p0428J53549
$$ y = [23400, 110298, -24038, -202698, -129179, -80060, -27903, -151099, -23382, -66196, -55126, -67468, -180395, -169624, -148039, -192872, -134552, -98348, -30657, 39954, 48572, 24661, 17633, -33678, -147607, -142354, -96405, -166787, -30439, 147504, 77845, -169452, -96704, 151508, 250340, 297073, 173664, 101653, 57951, 35105, 257461, 237653, 59545, -124302, -79430, -13983, -136467, -250316, -261385, -289082, -276454, -272574, -170755, -55461, 81598, 25952, -75969, -114866, -160593, -287030, -245352, -58199, -97092, -166888, 43962, 239770, 131456, -48146, -142182, -164617, -43030, 1439, -109486, -169540, -228675, -135362, -139282, -263033, -211756, -231830, -166848, -262273, -290445, -298368, -251107, -255063, -170734, -51480, -121908, 31641]
19819C1641J63699L3104L8048O9960j57005j95794j52074p2334L2119j1120L6588
19808a83168J18795J27162Q0845m5429k01913L9063J15614R0572J15711m8688
19798B08564j15879j92961J09252l9868l0692k17285j62774p535N3829J37141
19788b58208n9564n8773J89856K36052O5353l7113j00230N026L1329j3862l3066
19777c3200L9109K6390o504J80788n7237j27897O2246o4113m6754K9986L6491
19766C9305O1007O6421P8699M7344j10178k77678o5682J95889P7447K2724Q6246
19755B21544k712k5131p0140l1974j52829j36909L8161n6417O0671K21834J63768
19744B29866P6446M893k640r4104l9695l3280r1183j53747K852J75791J2645m7923
$$ y = [31641, 195340, 228444, 266492, 336452, 179447, -16347, -168421, -240755, -208636, -219756, -183168, -64373, 62789, 143634, 98205, -103708, -64645, 50969, 141541, 257252, 208564, 92685, -100276, 8976, -30892, -61584, -278869, -441643, -449178, -395349, -258208, -317772, -376545, -186689, 49363, 114716, 77603, -22627, -17601, 13728, -134, -33200, 5909, 32299, 25795, 206583, 149346, 21449, 83695, 19582, -27172, 2814, 39305, 100312, 166733, 245432, 292776, 182598, -95080, -160762, 35127, 112574, 135298, 221544, 218832, 193701, 123561, 91587, -61242, -198151, -159990, -216407, -155736, 66098, 229866, 306312, 311205, 308565, 214461, 174766, 141486, 50303, -103444, -100592, 75199, 87844, 39921]
19732C9921q8025k7232p5026j60114k8126M4446Q6641k02524N9147K43819J60874
19721E3801J9180Q5782L0974k5454m245N5660k8794q8535n2852J9291J3682j6808
19709F1682J10769J46331r7497j56792M3937P6442l9495j69081r5447N229Q1648
19698c2274j6798r1870j3284K24495J22633J38053L7250j73518l2564Q6650l5516
19687B13257q1520m4983J35751j3163l9991o8961j31764R4761J28893j6832L2315
19676B07763p8254J07435J38808M7403j25457k4809j20798o7931p9812J61080
19666A65428J65729J7924j64937q4477j9591J33250j516r8750n3008q1690j941
19655b3579j13731K6984M7145K1878l384q4954m0009K24968J35510J02979q0018
$$ y = [39921, -48104, -75336, -150362, -310476, -338602, -294156, -207515, -410039, -350892, -107073, 53801, 72981, 158763, 189737, 164283, 160038, 215698, 186904, 98369, 45517, 64808, 78490, 61682, 172451, 318782, 221285, 64493, 108430, 184872, 145377, -23704, -119151, -113922, -32274, -49072, -140942, -154226, 70269, 192902, 330955, 368205, 194687, 162123, 248773, 213257, 131737, 86754, 222505, 209342, 169351, 100390, -31374, 63387, 192280, 175448, 207763, 129509, 236944, 375752, 423155, 297698, 272889, 152091, 84160, 4348, 165428, 331157, 349081, 184144, 99667, 80076, 213326, 211810, 113060, 60052, -21638, -23579, -137310, -110326, -63181, -41303, -44687, -129641, -169650, 55318, 190828, 293807, 213789]
19644B13789o7035k15478l4448j19680N7649k1060K6110j0060J09912J34338J17535
19633A91572K1768j24464j6974K2902R706J7089k2062O6166L6715j124n1105Q0279
19621B30468K5204k0356l3021j75700k5930k1390o202P1929p816j09180j07988
19610a79982n3528K6622K9304J98590P0710N657q6705R145q1873j30601O8190
19599a24471J50368m8499q5521j67812L3345O9566Q239J12161k8178j36237j52314
19588c69353n6709J64158J94338J45459p3328q8051J44203J86295J2463j09356
19578A50119q4584Q946q6507q6182M6870m1692k0134K30594J54881M2811q0543
19567B34579n8431q4117j7930l9860p9200J04413R7422k17621m1452K23700N0408
$$ y = [213789, 146754, -68724, -103172, -222852, -165203, -186263, -160153, -170213, -60301, 74037, 191572, 213340, 88876, 71902, 94804, 104510, 121599, 99537, 165703, 202418, 201294, 150189, 230468, 255672, 235316, 202295, 26595, 665, -20725, -26927, 45002, 37186, -71994, -179982, -233510, -206888, -177584, 21006, 91716, 97373, 10668, 19813, -62060, -192661, -124471, 25897, -22602, -108123, -275935, -242590, -173024, -164785, -52624, -80802, -217039, -369353, -426062, -261904, -67566, 77893, 4565, -83486, 60717, 247012, 259475, 150119, 65535, 74481, -12026, -98208, -51338, -93030, -113164, 117430, 272311, 315122, 234579, 176148, 92031, 74101, 34241, -44959, 59454, 156876, -60745, -102197, 121503, 171911]
19556A71911j95545j03217N4738P3139q2416n5907n4859K8801K50364j272q7735
19545a998K9420o7901L1880L3421q8960L9490j37375o260O2781j44012p1869P6682
19533b44701O3197K43067j38186j05056n7248J21611J49091n9770j23831p7910
19523b29736P507j863o3125J47520n9830K9254Q4317j81014J7583J12052P0486
19512f6849j4763L0904J07132M5046k2773p8902r9009P2323J12636R8034L3746
19501B17525p3197j8722j17558K1659j6648p1911L846K0282J15138J80548J2260
19490B73222j18668k25176r5576J37389R4170J2165k9890J2673j16686k139K79191
19479B20675L0565R8800J66760l15157k59214J49324o786L5710J00844j85978
$$ y = [171911, -23634, -126851, -72113, 1026, -81390, -137297, -192156, -163355, 87009, 85737, -1998, 27422, -40479, -8599, 24822, -64138, -24648, -162023, -168283, -105502, -249514, -321383, -244701, -181504, 61563, -76623, -181679, -238927, -117316, 31775, -27995, -151826, -229736, -222229, -224092, -287217, -139697, -199527, -170273, -85956, -266970, -249387, -137335, -66849, -81612, -50708, 56424, 101470, 78697, -205, -99214, -26891, 85745, 183779, 217525, 144328, 125606, 8048, 29707, 13059, -58852, -55006, -34724, 80414, 260962, 273222, 154554, -70622, -166198, -28809, 65361, 77526, 47636, 60309, -56377, -58516, 220675, 251240, 350040, 516800, 201643, -57571, 91753, 84967, 120677, 221521, 35543]
19469C5543n9985j10162J37741K07735J51768j05797j32793r1934J6329J64256
19459B12701N518j23843q2707n3209M4100J38163j17813o4076K6379J09253p9816
19448A4650j28761O25n8077N6892J86818K8022j08964L8830J19202o4291J5488
19437A00434O838J15370K01501o5902m8044P3509L7750k1177k3100M7224J7028
19426D41431L8813O7665N0133O6034J55578J1547Q516m6832N01J10483O5610j1755
19414I57724J86939L70020P3407L2886n0028n8634j98504j00855j79395j22573
19404I10987l2283j28143j29694q0321j81315J814J08758P3363j21886j23373
19394B97907L9467M7054J99834K46943J60043O3308N8544M2835P9392J64216L64
$$ y = [35543, -24442, -134604, 3137, 210872, 362640, 256843, 124050, 32116, 48445, 212701, 218219, 94376, 11669, -41540, 2560, 140723, 22910, -41166, -14787, 94466, 14650, -114111, -113486, -171563, -114671, 72147, 100169, -8795, 30035, 149237, 84946, 100434, 107272, 222642, 424143, 358241, 310197, 383706, 421456, 400279, 377179, 424403, 441431, 480244, 547909, 598042, 664076, 819654, 831201, 839717, 792885, 793386, 903869, 969479, 957724, 1144663, 1514683, 1588090, 1620976, 1570948, 1512314, 1313810, 1212955, 1033560, 910987, 878704, 750561, 620867, 540546, 359231, 361045, 469803, 543166, 421280, 297907, 337374, 384428, 584262, 831205, 991248, 1054556, 1113100, 1155935, 1235327, 1399543, 1399907]
19383A399907j8378j02906k07864j16426j85906j4876M9409N729o9939p1723R566
19372F76593j9153j6622K7239J25175K2184J4990K3388j10289j0412J04919o0841
19361G77171j17441l7673j93234k07489m5029O4780J9012R7135K18712o6732l6184
19350D73028l286j2603p6026J04660j17925m1169J1073n6058L1211J02888k7791
19339C88002j47397m4486M8818q1846p3680m0457K35418J8908J89511o0956l5099
19328C96736j87473n167J09788J39747o6018j36851k44659o6044P2091l6240J16085
19317I1995j7819J09443o0468p7533o3883p6560J435Q156N7086K9212n8525n0415
19305a07876J1047R3234J29538k80322p8559M378J40302q336j5779Q6713L7947
$$ y = [1399907, 1381529, 1278623, 1070759, 954333, 768427, 753551, 802960, 808689, 738750, 667027, 676593, 657440, 640818, 668057, 793232, 815416, 830406, 853794, 743505, 733093, 838012, 777171, 659730, 622057, 428823, 221334, 176305, 241085, 260097, 357232, 575944, 509212, 473028, 469742, 457139, 381113, 485773, 367848, 326679, 337752, 281694, 312905, 415793, 388002, 240605, 196119, 244937, 163091, 89411, 48954, 284372, 303280, 492791, 431835, 396736, 209263, 204096, 313884, 453631, 387613, 250762, 6103, -59941, 12150, -24090, 91995, 74176, 183619, 123151, 45618, -18265, -94825, -93390, -85234, -28148, 1064, -57461, -107876, -96829, -3595, 125943, -154379, -232938, -228560, -88258, -96594, -112373, -25660, 12287]
19294A2287J24091j82553N476Q6346j4906L5546M0213j55971J7114R7565J59305
19283B24513m6915K5156n1830J04170k0536p0674k9314j01321j26034p5215P9674
19272h8326J13964M2656r498j55841J11172P2879Q2236N8472k90821n7868O8589
19261e2386L8931K18589l8139q0292O4390L314o1195J7926j63577j39698m3576
19250b35713l4039q0138M4954M7025J79253k1610O7905J82860o7566J00473L0501
19239B13905J37182K5563m3619j15391j63142K6769J00162R1634J20795j38523
19229B55335j94919L3510O7421J70451o3679N2043o0434j76046k2864J56229N1474
19218B68521k14687j71136J54840K8003k00034l2889M5218M160j51269O6025K63978
$$ y = [12287, 136378, -46175, -40699, 45647, 30741, 66287, 106500, -49471, -32357, 65208, 224513, 177598, 202754, 150924, 255094, 234558, 163884, 134570, 33249, -92785, -168000, -88326, 25638, 68294, 58796, -97045, 14127, 87006, 169242, 227714, -63107, -120975, -52386, -13455, 205134, 166995, 86703, 151093, 154407, 93212, 111138, -52439, -192137, -235713, -269752, -349890, -304936, -257911, -78658, -100268, -32363, 150497, 82931, 183404, 213905, 351087, 376650, 333031, 217640, 54498, 81267, 181429, 273063, 393858, 255335, 60416, 93926, 161347, 331798, 268119, 320162, 259728, 83682, 60818, 217047, 268521, 53834, -117302, 37538, 65541, -134493, -167382, -122164, -118004, -269273, -203248, 60730]
19207F0730O5986O5147o5319p3100L7393q3138L5205N5930M9016k5915j1976o6428
19195D3531O2686O9717J29083o470o0423J46422J63480N550k4477j6580O3213
19184E75732J1451Q8994m6106k710n997L32229J69912J29676j50223l64038j0730
19173G28190q6242q9188o1473j29406k31871K7352J11581J40675L0677j0440k8262
19162D01593J6580J36145j2540j170J66997J93024Q0669o2640R0096J80522M5797
19151A235073L8333p7256l63459k61067j67025J05150m6470m7536l4878j72069
19141B08796M0961Q2713q3145j60871O9623J52484R8806k4078j9795r1668m1853
19130B31973j03849N6020O3334k21758q9781J68554K1886n0091J11760n048j45629
$$ y = [60730, 126716, 191863, 126544, 53444, 90837, 7699, 42904, 98834, 147850, 121935, 109959, 43531, 106217, 175934, 305017, 298547, 238124, 384546, 548026, 553576, 529099, 512519, 575732, 587183, 676177, 630071, 627361, 621364, 953593, 1123505, 1253181, 1102958, 738920, 728190, 641948, 552760, 491287, 361881, 130010, 157362, 268943, 409618, 440295, 429855, 401593, 418173, 554318, 541778, 540608, 707605, 900629, 981298, 918658, 1008754, 1189276, 1235073, 1273406, 1196150, 832691, 571624, 404599, 509749, 463279, 415743, 380865, 208796, 249757, 332470, 249325, 88454, 158077, 310561, 409367, 385289, 365494, 273826, 231973, 128124, 184144, 247478, 25720, -64061, 104493, 126379, 76288, 188048, 183000, 37371]
19119C7371R3342Q2288N5850L3520n1206l0216k6786k8775Q6025k6566m8675N7805
19107B33977J6595m913k5379p46J04328m4484j55113k4278K8760K168j9913K2763
19095A33765K5175M5449j9401L9826j26933K7149L4534Q363O5233j4643j81316
19084C7201Q3775L3942M0535p616P8292N1343K03098L9349j55972o8697L3635
19073C68885P0231P5074l3565k06484p8347j27002l548J18240R8124J48413J70819
19062F00840R2949l9862j76827p4909J09972O0070j1275J37302L3290J16305J05837
19051I53692J51447o5003m2174o2305o3449n954j77531j38930l7496L100J45547
19040F60944J26479k82094j36920J99580K50818J2902J314p8543p3533r5075O6387
$$ y = [37371, 130713, 213001, 268851, 302371, 251165, 220949, 194163, 165388, 251413, 224847, 176172, 233977, 250572, 245659, 220280, 219534, 323862, 279378, 124265, 99987, 128747, 130915, 111002, 133765, 158940, 204389, 184988, 224814, 97881, 125030, 159564, 167927, 233160, 218517, 37201, 120976, 154918, 195453, 187837, 266129, 317472, 520570, 559919, 403947, 335250, 368885, 439116, 514190, 480625, 274141, 195794, 68792, 65244, 183484, 281608, 430021, 600840, 693789, 653927, 477100, 402191, 512163, 572233, 560958, 698260, 731550, 847855, 953692, 1105139, 1040136, 997962, 935657, 872208, 866254, 688723, 549793, 512297, 515397, 660944, 787423, 505329, 368409, 567989, 818807, 831709, 833023, 754480, 680947, 585872, 652259]
19029F52259K16187J25470j06892J08550J57752m4937J6210N007q3574M6867J12596
19018A205495L31126K19384r7388o6661p1938R431K10014J45837J1563K1921Q8335
19007B007119K4026p7456k40405j94240J41443M5369n6390R3664K22836J96692
18997B162658j19079j32489m7473m5888J13860J19059R3543r1258j09197J22740
18987B066476P7378L4734L8783J74475Q7740J09109j71425k44087q0936j08446
18977A983801o7180J20320P0797j60874P8909J82610J48771J60454r073L1494
18967B540029K78950K00895j4966N8823J41183K8864j38506K8177l3906r4683
18957B994860J92663M17439L44060J87309K88235J98921J38466K27101L58512
$$ y = [652259, 868446, 993916, 887024, 995574, 1153326, 1108389, 1124599, 1129606, 1046032, 1092899, 1205495, 1536621, 1756005, 1658617, 1591956, 1520018, 1529449, 1739463, 1885300, 1896863, 1918784, 2007119, 2031145, 1953689, 1713284, 1519044, 1660487, 1705856, 1649466, 1743130, 1965966, 2162658, 2043579, 1911090, 1863617, 1817729, 1931589, 2050648, 2144191, 2052933, 1943736, 2066476, 2143854, 2178588, 2217371, 2391846, 2479586, 2588695, 2417270, 2173183, 2092247, 1983801, 1916621, 2036941, 2107738, 1946864, 2025773, 2208383, 2357154, 2517608, 2508535, 2540029, 2818979, 3019874, 3004908, 3063731, 3204914, 3233778, 3095272, 3123449, 3089543, 2994860, 3187523, 3604962, 3949022, 4136331, 4424566, 4623487, 4761953, 4989054, 5347566]
18948E347566M11442L58768K85495K65459K19817N54998O81863R49056R17392
18939I991856Q74498J255584J442643J685663K330523L008609M283929N717468
18931C0590773P442494Q978136J0211663J1285226J2455509J4276004J6432931
18924A11672736J6230981P919674m493887j3322626j3258078n604914L559271
18917A02703157J1167353J6558081K0551474J9546527R143626n032352j5694489
18910A58943377j9110007j8345182j8482693j8008289j5123535j0480129n610808
18903E3782734j855584J040111K997248K551319q93987m656840o658700o391579
18895C9914722m583550k761522j298558j84678P89145J802529K646305L923999
$$ y = [5347566, 5759008, 6117776, 6403271, 6668730, 6888547, 7443545, 8125408, 9074464, 9991856, 10866354, 12121938, 13564581, 15250244, 17580767, 20589376, 24873305, 30590773, 38033267, 47011403, 57223066, 68508292, 80963801, 95239805, 111672736, 127903717, 135823391, 131329504, 118006878, 104748800, 99143886, 102703157, 113870510, 130428591, 150980065, 170526592, 179670218, 174637866, 158943377, 139833370, 121488188, 103005495, 84997206, 69873671, 59393542, 53782734, 51927150, 52967261, 55964509, 58515828, 57621841, 52965001, 46306301, 39914722, 35331172, 32569650, 31271092, 31086414, 31875559, 33678088, 36324393, 40248392]
18887D0248392N870236Q201336J1596108J5930384J9458249J8649816J3284453
18880A33238974R409645J1923915K2450939L8623193N5808310N8276314K7731235
18873C57462525o944451k5170757k3393785k4317103l1078372l3569236k3972863
18866A89015958r513783L691529J1228333J0208577j888518j9126392l0320926
18859A53294778l0550479k1444326j1002274k567462N309598J4309993K6301075
18852A33650903M2856935N9673790N1938366M028846m4217862o7898756n4809213
18845A25223009l4854232k2324509j4992572j0569262p639487o035657m699059
18838B4108231l376008k546299j930032j673409j056376o36703n90114j031219
$$ y = [40248392, 46118628, 54319964, 65916072, 81846456, 101304705, 119954521, 133238974, 142648619, 154572534, 177023473, 215646666, 271454976, 329731290, 357462525, 350518074, 325347317, 301953532, 277636429, 246558057, 212988821, 189015958, 179502175, 183193704, 194422037, 204630614, 202742096, 183615704, 153294778, 122744299, 101299973, 90297699, 87730237, 93039835, 107349828, 133650903, 176507838, 236181628, 288119994, 292148840, 247930978, 180032222, 125223009, 90368777, 68044268, 53051696, 42482434, 34842947, 28807290, 24108231, 20732223, 18185924, 16255892, 14582483, 13526107, 12889404, 12299290, 11268071]
18830A1268071j241222j345859j102224q31384n62601l41257l55002o7462n8126
18821E362934l8100j65069k44176Q7037L71662K61320J8527k77303l70955m74945
18811D530932l11484k69475k45297k58378l23473k18931k12708j23009j81074
18802B387103r0304j55946J189J62016Q8487P4903j61879k06003n3283J18702
18792B164985p9250j62838r0323K39026J35621o1996o7523j3848Q4936N0023j28423
18781B070390k60292j07606j34022j85392j83874q1392R2123J6287R4123r5561
18771A224784k09548j85510M8278J09981l8178n7944Q8996J48627R9683J93130
18761A422299Q5146M111r2837J02283O3513q5190P5240j41298k25511n8439j17038
$$ y = [11268071, 10026849, 8680990, 7578766, 6747382, 6184781, 5843524, 5488522, 5421060, 5362934, 5324834, 5159765, 4915589, 5002626, 5374288, 5635608, 5654135, 5376832, 5005877, 4530932, 4219448, 3949973, 3704676, 3446298, 3122825, 2903894, 2691186, 2568177, 2387103, 2296799, 2140853, 2142042, 2304058, 2392545, 2467448, 2305569, 2099566, 2046283, 2164985, 2085735, 1922897, 1832574, 2071600, 2207221, 2145225, 2077702, 2063854, 2148790, 2198813, 2070390, 1810098, 1702492, 1568470, 1383078, 1199204, 1117812, 1209935, 1226222, 1320345, 1224784, 1015236, 829726, 878004, 987985, 949807, 891863, 980859, 1129486, 1229169, 1422299, 1507445, 1511556, 1418719, 1521002, 1584515, 1499325, 1574565, 1433267, 1207756, 1149317, 1032279]
18750A032279j56533n4997j9937M4180J81720r9159j16960J5624L251j10645k78491
18739D40332r0337M2691r0822L6868J3862l3959p5862N095N3946R6717m9575n7171
18727B91785K9755O7902m4492O589N6553O3395j27766k70103L6930N0270Q5750
18716B46568J6695J06641N1715L9089J17128J0375r7968o9305J55384J29178L9178
18705G44678J59217L4044N5452M2071l2334O5935n7115j04573R1244J3527J13770
18694A125916N131j46060k7833L07730K68665K4644Q1357l7231M083n371J74877
18683A775908K73950R4852J06679J48890L51420N32981J88248K33783J44683j34348
18673C717046k38375j1691J88479K29272M10619L46635J51986L98371M81528O77035
$$ y = [1032279, 875746, 820749, 800812, 844992, 1026712, 927553, 810593, 826217, 829468, 718823, 440332, 349995, 392686, 301864, 338732, 352594, 318635, 242773, 247868, 301814, 398531, 348956, 291785, 321540, 389442, 344950, 351539, 408092, 471487, 343721, 73618, 110548, 160818, 246568, 263263, 369904, 421619, 460708, 577836, 588211, 490243, 420938, 576322, 705500, 744678, 903895, 937939, 993391, 1035462, 1003128, 1069063, 1011948, 907375, 998619, 1012146, 1125916, 1131047, 984987, 957154, 1264884, 1533549, 1558193, 1639550, 1602319, 1606402, 1601031, 1775908, 2049858, 2144710, 2251389, 2400279, 2751699, 3284680, 3472928, 3706711, 3851394, 3717046, 3478671, 3466980, 3655459, 3884731, 4295350, 4641985, 4793971, 5192342, 5673870, 6350905]
18663F350905P88368P16858P85615O35475P76883J083212J508102J745703K497016
18654A6888137L482285M800657O365399Q484120J2281778J8169646K6964665L9014128
18646A36450815N2592359N2748511K0932795k4899571n5990762n7243351l9651067
18639H4939729k4044968j4470389q826679o002138m303799k773220j705378r68509
18631B1844649j1174P90315J699251K886438M284832O504207J0063697J5775018
18623F3837233K3228103L3627270M4585041M0448695Q968803k7905529m9174783
18616A37614833m4706735k9635484j7707936j0994705p255965n163742l819849
18609A8330417k817628k334728j788435j243215r25620o73741p68638p19640l53018
$$ y = [6350905, 7139273, 7856131, 8641746, 9277221, 10054104, 11137316, 12645418, 14391121, 16888137, 20370422, 25171079, 31536478, 40020598, 52302376, 70472022, 97436687, 136450815, 189043174, 241791685, 262724480, 237824909, 181834147, 124590796, 84939729, 60894761, 46424372, 37597693, 31595555, 27291756, 24518536, 22813158, 21844649, 21833475, 22623790, 24323041, 27209479, 31494311, 37998518, 48062215, 63837233, 87065336, 120692606, 165277647, 205726342, 214695145, 186789616, 137614833, 92908098, 63272614, 45564678, 34569973, 27314008, 22150266, 18330417, 15512789, 13178061, 11389626, 10146411, 9220791, 8547050, 7778412, 7058772, 6705754]
18600F705754j70217j95335j07576n56777m76234m89117k49715j47348o7101n5840
18590D190494l0664M5167J34684j63847m20340m48010k87120k42694l02909k5843
18580B448918M8264j9952k00062k26582p2094K803O1334q4635Q803J54940L2120
18569B153857K5711J42598k5800j44850O2651J87423K3538j89192l33457k3987
18559A878492L7309j14076O0763J76827L8618Q6973l1966m3498j05811N1396Q4175
18548B119202Q8017L1910r9438K4139J84453M8907l5861j4107J60873J91473J41710
18537B841278q678m5892k53654l9825L2169M0413K66340K54674J59229M0487K12794
18526C499335O5526P6434K57185L62231L72169L62781K70299M55773O45136O27698
$$ y = [6705754, 6535537, 6340202, 6232626, 5675849, 5199615, 4710498, 4460783, 4313435, 4246334, 4190494, 4159830, 4204997, 4339681, 4175834, 3755494, 3307484, 3020364, 2777670, 2474761, 2448918, 2497182, 2477230, 2277168, 2050586, 1978492, 1981295, 2042629, 1957994, 1966797, 2121737, 2153857, 2179568, 2322166, 2296366, 2151516, 2214167, 2401590, 2425128, 2235936, 1902479, 1878492, 1915801, 1801725, 1862488, 2039315, 2077933, 2164906, 2132940, 2089442, 1983631, 2035027, 2119202, 2207219, 2239129, 2139691, 2163830, 2348283, 2397190, 2361329, 2347222, 2508095, 2699568, 2841278, 2832600, 2786708, 2533054, 2493229, 2525398, 2565811, 2832151, 3086825, 3246054, 3286541, 3499335, 3564861, 3641295, 3898480, 4260711, 4632880, 4995661, 5265960, 5721733, 6366869, 6994567]
18516F994567P86319J162861J738734K216649L312472M792919O430616P956331
18508C5391468Q182007O190474J569331l658861o711113o279248l414496k95001
18500C0974561K820941N868972Q772315R749911P347477L798243J531382o4406
18492G0799396m305220r321432j1514851r581519o083092l058920q85873J051277
18484B7099766K398057L158478K081831o97912l347744m531218m056156k378142
18476A9726960j209786n56959K57789J365249K027093L000900L902284M240104
18468C2753634L269755J948101J054148J479995K291461K963893M524185P508112
18460E7793284J1696866J6776981K1547425K2690410J8697061J3307564J2153500
$$ y = [6994567, 7780886, 8943747, 10682481, 12899130, 16211602, 21004521, 27435137, 35391468, 43573475, 49763949, 51333280, 47674419, 40963306, 34684058, 31269562, 30974561, 33795502, 39664474, 48436789, 58186700, 65534177, 69332420, 70863802, 70799396, 66494176, 57172744, 45657893, 36076374, 29993282, 26934362, 26048489, 27099766, 29497823, 32656301, 34738132, 34040220, 30692476, 26161258, 22105102, 19726960, 18517174, 17960215, 18218004, 19583253, 21610346, 24611246, 28513530, 32753634, 36023389, 37971490, 39025638, 40505633, 42797094, 45760987, 50285172, 57793284, 69490150, 86267131, 107814556, 130504966, 149202027, 162509591, 174663091]
18453A74663091J6734841K0005910J0041552j1976762l1381996l7069305k9745713
18446A11271618j8272888q704326k269793J583005J856417p97638l854194m361532
18438G6450669k210429j364409m164794q842322j1341058j0263835p173628m499109
18430B6591085k683595j807021j154070p73678k98598J92593M30168P47625J542147
18421B2786656K496971L927897N557956P200590R531091J1511719J1361913P578812
18413H1953605J873377j691339n55638M248083J1576811J9583510K5432938K3622464
18405A66043811J3273573o07858r741710j1098005j0860461j4820712k0365215
18398A11823423k2055707j7608726j1058452n146144l9221M377367Q207863J0180677
$$ y = [174663091, 191397932, 211403842, 221445394, 209468632, 178086636, 141017331, 111271618, 92998730, 84294404, 82024611, 83607616, 85464033, 84666395, 80812201, 76450669, 74240240, 72875831, 68711037, 59868715, 48527657, 38263822, 31090194, 26591085, 23907490, 22100469, 20946399, 20172721, 19874123, 20066716, 20496884, 21244509, 22786656, 25283627, 29211524, 34769480, 41970070, 51501161, 63012880, 74374793, 81953605, 83826982, 82135643, 81580005, 85828088, 97404899, 116988409, 142421347, 166043811, 179317384, 178709526, 168967816, 157869811, 147009350, 132188638, 111823423, 89767716, 72158990, 61100538, 55954394, 55915173, 60292540, 68500403, 78681080]
18390G8681080P847118J805118m129848o673950n340456j508653L933713J0319513
18382H4933635J6578145J9119078J2205412l220467j7262112k2355045j7751069
18375G2247577j0216019l292058J997201N832416N865270j13141p832793j2735631
18367E1752822j2429257r231848n983364l566140k208587j478768n38486L50493
18359A6666865R89291J702047K780417L946819M941578M012123O41704l037160
18351C2643684n067183m541997k734366j129227J30164J225003K448484M110458
18343B7085020O164071Q607502J1180314J2138507J0220463O236669K759527J027831
18335H5419904j569385o760855j1412205j2549892j0057785p368872n913291n354548
$$ y = [78681080, 86528198, 88333316, 84203468, 77529518, 72189062, 70680409, 74614122, 84933635, 101511780, 120630858, 132836270, 129615803, 112353691, 89998646, 72247577, 62031558, 58739500, 60736701, 66569117, 72434387, 72321246, 64488453, 51752822, 39323565, 30091717, 24108353, 20542213, 18333626, 16854858, 16316372, 16666865, 17656156, 19358203, 22138620, 26085439, 31027017, 35039140, 35680844, 32643684, 27576501, 23034504, 20300138, 19170911, 19301075, 20526078, 22974562, 27085020, 33249091, 41856593, 53036907, 65175414, 75395877, 81632546, 84392073, 85419904, 83850519, 77089664, 65677459, 53127567, 43069782, 35700910, 29787619, 24433071]
18327B4433071m535577l636968k740307j931300j507139r78261n34613j96339
18319H372567K73735N29897R63031J482203J994694J793509O14367j097603k254282
18310A2672118k427770j561892p81727m60273k06918K77357L21565O78054J322800
18301I833314J921272K674472K126116L06384j132213j581307o92372O13300J904752
18292A5973718L299337L617763J928020j248332l425474l952079l018436j402794
18284A1771723k90840L66621N08390l62527j742907k136102j850542j566159j057413
18275C640244p17174n65855k87481k92654q3241l72077l03768L7903N438r4291
18265I67044p9148p8656q4065M3882P2816J0427o4508J24366J29937k75166k90740
$$ y = [24433071, 19897494, 16260526, 13520219, 11588919, 10081780, 9103519, 8568906, 8372567, 8646302, 9176199, 10139230, 11621433, 13616127, 15409636, 16024003, 14926400, 12672118, 10244348, 8682456, 7900729, 7440456, 7233538, 7510895, 7832460, 8510514, 9833314, 11754586, 14429058, 16555174, 16861558, 15729345, 14148038, 13455666, 14068966, 15973718, 19273055, 22890818, 24818838, 23570506, 20145032, 16192953, 13174517, 11771723, 11480883, 11847504, 12355894, 11993367, 10250460, 8114358, 6263816, 4697657, 3640244, 2923070, 2357215, 2069734, 1777080, 1693839, 1321762, 1017994, 1055897, 1061335, 967044, 887896, 809240, 725175, 769057, 841873, 852300, 787792, 912158, 1042095, 766929, 476189]
18254D76189J6515N8640K5240k6911J26650L7803N5197j63015j2960L758j9763
18243E77343k548P3703k26720r4709R8664M1696q735q5205p611P4645O2440k3838
18231D79125l9345k6270K3419M6356Q3886M2967J0213r5539r0963j59203k60127
18220A4519J22389J38568O8362M2313p5726o3708N3602J71693N5091R826q2556
18209D54373j62601j5652M3326m7867j4606J37650j8619n3078M9182n8724J9684
18198C33068J11055O3156p0911j9968k1703J10137r9l5622o0264k5488j73724
18187B09637n6335M3344K1037j73649J01380R7500R4418k417o4074o2468k946
18176B05427P6609Q8415o9341n802j894j23915K6574P1679l7925N8630r9510l0817
$$ y = [476189, 492704, 551344, 576584, 549673, 676323, 714126, 769323, 606308, 593348, 597106, 577343, 574795, 648498, 421778, 327069, 425733, 467429, 458694, 373489, 365878, 440523, 502963, 479125, 439780, 413510, 436929, 483285, 567171, 610138, 620351, 524812, 433849, 274646, 14519, 136908, 275476, 343838, 386151, 310425, 246717, 300319, 472012, 527103, 536929, 454373, 291772, 276120, 319446, 271579, 256973, 394623, 376004, 322926, 372108, 313384, 333068, 444123, 507279, 436368, 416400, 394697, 504834, 504735, 469113, 408849, 383361, 209637, 153302, 196646, 217683, 44034, 145414, 242914, 337332, 334915, 270841, 208373, 205427, 282036, 370451, 301110, 295308, 293414, 169499, 196073, 267752, 229827, 288457, 188947, 158130]
18164A58130o5537N9393J10594j1033q7076j31323l5648J84982j82l0977K8664
18153A79987J81897m127L9649m9763k5513K5930j10045j77983O9471P1772q564
18142A92711j21875q6459k2935J84846P0853Q2781Q1876l0742o6406l3046j9627
18131B31977J37682J26689m3922p2711k282k22709j78743J00517J92332J01453
18121C70283n0277k0945m1071K8629r5502n7995J1102K4525N3596J80733J60773
18110E63851J81973O4220J60295L80614J87194k07404j17231j52770j98631k22251
18100F39860k38961r3560j68681M4627J87739n3086j18404j20601j6757R1942
18090A54118J68308K9075J133J67546L8748J29972L44249K52888m408P8724j37179
$$ y = [158130, 92593, 151986, 262580, 251547, 164471, 33148, -2500, 182482, 182300, 151323, 179987, 361884, 357757, 397406, 347643, 322130, 348060, 238015, 60032, 129503, 201275, 192711, 70836, -15623, -38558, 146288, 217141, 299922, 381798, 351056, 284650, 251604, 231977, 369659, 496348, 452426, 379715, 377433, 154724, -24019, 76498, 268830, 370283, 320006, 299061, 257990, 286619, 191117, 133122, 144224, 168749, 222345, 403078, 563851, 745824, 810044, 970339, 1350953, 1538147, 1330743, 1213512, 1060742, 862111, 639860, 400899, 307339, 138658, 183285, 371024, 317938, 199534, 78933, 62176, 154118, 322426, 351501, 352634, 520180, 558928, 688900, 1033149, 1286037, 1281629, 1360353, 1223174]
18079A223174k51265l02628j66054m5119j65027k22235J10905P6312l9093J1293
18069B30263j67994j46007K1481P6887R5423p882K4903R6066R4395m3685j30190
18058A43660L0532L2538O152j26002o4071j02467k202j26159j74878p1981J4213
18047d40665K58412K44377O2842p9676n1532j44889R9479J34926j6168M6646L6565
18036A50317j07275J10788J32499L7619N0133m8711Q7587K8531l38q2484j10788
18025B47878k30K9872j03543j4133j3953j39908O4534m930R1486Q766M7837K15440
18013D29116P5006o6244r4941k2705o9749n7407j27644o4581M9910J11183N9119
18002B21063m5440j97168k32617J73675K76373q9326J7059r8775l916J07426J74194
$$ y = [1223174, 971909, 669281, 503227, 458108, 293081, 70846, 181751, 258063, 218970, 230263, 62269, -83738, -62257, 14630, 110053, 102171, 127074, 223140, 317535, 273850, 143660, 174192, 206730, 212882, 86880, 22809, -79658, -81860, -208019, -382897, -454878, -440665, -182253, 62124, 124966, 45290, -6242, -151131, -51652, 83274, 67106, 113752, 150317, 43042, 153830, 286329, 323948, 374081, 325370, 412957, 441488, 441150, 358666, 247878, 247648, 277520, 173977, 159844, 145891, 5983, 70517, 65587, 157073, 165839, 213676, 429116, 504122, 437878, 342937, 320232, 250483, 193076, 65432, 851, 50761, 161944, 221063, 175623, -21545, -254162, -80487, 195886, 106560, 123619, 24844, 20928, 128354, 302548]
17991C02548L4876j1751j125j4778p9742p4046R7827K19291J73548o2988J37041
17980G20701J66948p6993l5669N3286J9751j50533m0702j64401m1805n1827k3179
17969C75577k18755k83899k0939J26520R6422P8547J80101l9698k5040J09031
17959C77867j91890j2171K1188L7840O5522j25005l8579J0817N7473Q5043J07386
17948C95491j45018n0768P9248J26540J4463J47277o693K46024J48353l9342m8670
17937H66905J75169P4272M8029k1424j85166j56347j20285k754P1113j79668k73579
17926B96265L5441J4973n1304J05066K04121M7558M7188p5907p3371P9285R8207
17915G27522j10735j81504j15035j97375o839k0745K0304P1406m5006R2263J61226
$$ y = [302548, 337424, 325673, 324548, 309770, 230028, 155982, 253809, 473100, 646648, 583660, 720701, 887649, 810656, 774987, 828273, 848024, 697491, 656789, 492388, 450583, 398756, 375577, 156822, -127077, -148016, -21496, 74926, 153473, 333574, 293876, 268836, 377867, 185977, 173806, 194994, 232834, 298356, 173351, 134772, 145589, 203062, 288105, 395491, 250473, 199705, 278953, 405493, 419956, 567233, 560540, 806564, 954917, 915575, 866905, 1042074, 1116346, 1164375, 1142951, 957785, 801438, 681153, 678399, 749512, 569844, 296265, 331706, 346679, 295375, 400441, 604562, 652120, 699308, 623401, 550030, 629315, 727522, 616787, 435283, 320248, 122873, 116034, 95289, 115593, 186999, 141993, 234256, 395482]
17904C95482L9804q6448j38259K2741J02011j7039M5088J7487J58236n116r9417
17893D34570K20886L6849p4013J3935J00682J68278K38076k94029k13216J66210
17883G98228P6679p8997r4239o7492r6105J81677P8360J33149r4234j99303m862
17872F32861J5112j20870l7145Q8283k06420j92113J4151q5079J5050l6495l3384
17861E3951J50037M6867p6682j40296M145K52854P5467j86797M8895n5177o8091
17850A05173K156R7248K17225J58068j04755k64553l6350M8915M0352L2187J8234
17839C13900p5145M5906J09482o4376l4769O6849O1371J6484l4431k4564r0020
17828B90687j43691l1755J13219O8655L6087l3358k09543j24533j68331p3038
$$ y = [395482, 435286, 348838, 210579, 233320, 335331, 318292, 363380, 380867, 539103, 533987, 434570, 655456, 692305, 618292, 632227, 732909, 901187, 1139263, 845234, 632018, 798228, 874907, 795910, 701671, 634179, 538074, 719751, 798111, 931260, 837026, 637723, 632861, 647973, 527103, 489958, 578241, 371821, 179708, 193859, 108780, 123830, 87335, 53951, 203988, 250855, 174173, 33877, 38022, 290876, 366343, 179546, 228441, 173264, 105173, 107329, 204577, 421802, 579870, 475115, 210562, 174212, 223127, 263479, 295666, 313900, 238755, 284661, 394143, 329767, 294998, 361847, 423218, 439702, 405271, 380707, 290687, 146996, 115241, 228460, 297115, 333202, 299844, 90301, -34232, -202563, -275601]
17818b75601Q3987J25681J05083K35299o137k04662O2855P7228N1920k71882l5078
17807e1307n8974j62426Q8074K42075K10624N6191k97756o6653K3617K2348r3125
17796h7312j6714L14701q2569n2534p6544m9764J00670j25110j71735K42433J11575
17785A07097j06406J7520J01139R8169K8519N7119l03416p0447j2827L1914Q1749
17774C0130M1888m2768J0268J19182R6866o8719r7676k3031J21548j49437J9041
17763E7292Q7845j4534N8260j09404k29823j09134J6610J8019P6933J2284j5703
17752a51355J00136O4606p0139o7659m3567n1799N8323J80570L1329J8370K5872
17741I4687j80013k15169k10184J08520K37559P9700M4769j3050l9094j04736
$$ y = [-275601, -191614, -65933, 39150, 274449, 268312, 63650, 126505, 203733, 255653, -16229, -51307, -110281, -272707, -184633, 57442, 268066, 324257, 26501, -40152, -16535, 5813, -87312, -104026, 210675, 128106, 75572, -972, -50736, 49934, -75176, -246911, -4478, 107097, 691, 18211, 119350, 217519, 246038, 303157, -259, -70706, -83533, -51619, 30130, 72018, 29250, 39518, 158700, 255566, 186847, 89171, 66140, 187688, 38251, 57292, 145137, 130603, 188863, 79459, -150364, -259498, -242888, -224869, -147936, -135652, -151355, -51219, 13387, -56752, -124411, -167978, -219777, -161454, 19116, 50445, 68815, 94687, -85326, -300495, -510679, -402159, -164600, -84900, -40131, -53181, -92275, -197011]
17731a97011K7228K8402K39758J2721p8856j44016j28892J7225J77667R7985j3602
17720C8609j44863j42109l2605L3953R6229J50053P7464j19479P9727K00119j2329
17709B24769j60810p0179O9301k6711r5320N9891j39387j2538K0227q7376k4937
17698b43070O974m6788r6835J0569O1279O2455J97534R3702j38244R580P7271
17687e573J43390k6056n3601l3974J19088N3598r0782o2349J8081k6769j03294
17676f8241J12323P9952l13982j76610N9673J48512l5369r39K11438N2237r1471
17665b2477j49122J07703M7728o6894j58236N5157R3817J69212l3822m5548j71881
17654a74363l4757J82776J81884q8598j32658k0017N9236k8286J879K3608L4593
$$ y = [-197011, -169783, -141381, 98377, 111098, 32242, -111774, -240666, -223441, -45774, 52211, 38609, -106254, -248363, -280968, -247015, -150786, -733, 76731, -42748, 36979, 237098, 224769, 63959, -6220, 63081, 36370, -58950, 941, -138446, -150984, -130757, -218133, -243070, -236096, -282884, -379719, -369150, -307871, -245416, -47882, 45820, -92424, -82844, -5573, 137817, 111761, 58160, 24186, 143274, 196872, 106090, 43741, 61822, 35053, -68241, 44082, 124034, -189948, -366558, -306885, -158373, -193742, -194681, 16757, 68994, -22477, -171599, -63896, -16168, -83062, -241298, -186141, -92324, 76888, 43066, -2482, -174363, -209120, -26344, 155540, 66942, -65716, -85733, -26497, -54783, -52904, -29296, 5297]
17643E297J35675j46749r3394M2885K1305q0246O7313J30410K6252j13017l3094
17632c7363o5957j69903J95242J51341O4685J29036j88041r3115K478J71403J22157
17621B81963j16746o6591o4734P0549Q8075q2282r9646J59662O4304q0871N92
17610A54275q4933k9416l5085n6957K25328j73541o6571O4878j41610q3138J48415
17599g8355P4371o7913o3336n6090L1561J12670n8101L2381j00326m3885J23394
17588i3629J05391K30177n8061j37150k27510P545J19979m211l0857l9902J13881
17577a4347l6380n3124l50l1798J5112J73361O2702M9701J6874j80731j56714
17566a55694K9906o2531k520M3296R3797J96730j2483o1539O4518n0351j16946
$$ y = [5297, 140972, -5777, -99171, -56286, -34981, -115227, -47914, 82496, 108748, -4269, -37363, -103320, -273223, -77981, 73360, 138045, 267081, 79040, -14075, -11597, 159806, 281963, 165217, 98626, 33892, 104441, 192516, 110234, 10588, 170250, 234554, 153683, 154275, 69342, 39926, 4841, -52116, 173212, -329, -66900, -2022, -143632, -226770, -78355, -3984, -71897, -135233, -191323, -159762, -47092, -105193, -72812, -173138, -217023, -93629, 11762, 241939, 183878, 46728, -180782, -173237, -53258, -57469, -88326, -128228, -14347, -50727, -103851, -104201, -135999, -120887, 52474, 115176, 164877, 181751, 1020, -155694, -125788, -188319, -190839, -147543, -53746, 142984, 130501, 68962, 133480, 83129, -33817]
17555c3817K3215n412p396p6772m5940j55290Q6448q7439K03308O3665M5972P1406
17543H1948R575m0348o1677J10245J32727r6245k82916j83291p0020j8224K3967
17532c94259p3565J24023n1692j11458J38615K21524J65166J08810J32087j54041
17522A05210N189L1682m306j98211m1317k1293q3876K1541j1279N3539j2075J2453
17510a42743J66252J76604J32490J39164q2343l19441m5563J08355O2396O9912
17500B65083j06292o3373J10901R0116j49623k7471R558O3079r2565l0413r8032
17489b9032K9785N6034p4962m8384j48437n3664L0145j04609n0404n0730M6281
17478c97977K59864Q760P4304j19697j28718K1382J17365J87999R3316m4416j05644
$$ y = [-33817, -10602, -16014, -23410, -100182, -146122, -301412, -214964, -302403, -99095, -35430, 10542, 81948, 91523, 51175, -10502, 99743, 232470, 136225, -146691, -329982, -400002, -418226, -394259, -467824, -343801, -395493, -506951, -368336, -146812, 18354, 127164, 259251, 105210, 110399, 142081, 137775, -60436, -101753, -123046, -206922, -185381, -196660, -143121, -155196, -142743, 23509, 200113, 332603, 471767, 389424, 69983, 24420, 132775, 195171, 265083, 158791, 95418, 206319, 296435, 146812, 119341, 128899, 191978, 99413, 69000, -29032, 753, 56787, -18175, -66559, -214996, -268660, -238515, -343124, -393528, -444258, -397977, -138113, -129353, -55049, -174746, -303464, -282082, -164717, 23282, 116598, 72182, -33462]
17467c3462k02237k2750n6706J47828L3257j16450N7785J6497J56918K8030P4266
17456H2976j0814P6391Q0314j04532k40335j17179q401N3193K5580m1760P3369
17445a31198J54989J9435J3869l0940j00087j4705P5541R1125K72396J81960k23913
17434C08472k61637j35592O6461n7587j58235J10504L3533m5734J9590M0422J3978
17423f5825k9050o4959J66Q0023Q0356R6374K8391j42521k7336M5901k3973J9122
17411c331m0412m6605R149N2467n2740l649K1646L789n07O1439Q4750l34L5230
17398A20892L1999r1745p9381j9526J49264J11952L4648M7796p0986p0030k33414
17387f8531j80286K0835J34405L9018k8829J00642j03872j85686r22J15066O5298
$$ y = [-33462, -235699, -258449, -315155, -167327, -134070, -250520, -192735, -176238, -19320, 8710, 82976, 72162, 148553, 228867, 124335, -116000, -233179, -241580, -188387, -162807, -204567, -131198, 23791, 43226, 57095, 26155, -73932, -88637, -13096, 78029, 350425, 532385, 308472, 46835, -88757, -22296, -79883, -238118, -127614, -94081, -139815, -120225, -79803, -65825, -94875, -159834, -159668, -79645, 711, 97085, 125476, -17045, -44381, 1520, -22453, -3331, -43743, -90348, -81199, -28732, -81472, -85121, -63475, -59686, -60193, 1246, 85996, 85662, 120892, 152891, 61146, -18235, -37761, 111503, 223455, 258103, 305899, 234913, 164883, -68531, -248817, -227982, -93577, -54559, -83388, 17254, -86618, -272304, -273226, -158160, -92862]
17376i2862J28326J1064o8488J45128K59967J19098j89806j99849j14967K1136
17366A8747P3357k1380o0688j4835P4594j8169N3828m2349j53804m4322O2242
17355g2779K9873N9649O7611k14302N175O0829r3122q2488N6963J1013L4532J67455
17343C0409J41931p4728j06895P074L6091O217j00064j11478J34685R4607l5815
17332B2034J36996K5326N2309n9960p9942j78823L1422J35368J8517N1439q5083
17321F9603n4026J594K1171N4679l4346p8875k4858J44219J48077n0471k62736
17310f5969j75300k574J59295L3290K6928P1889j0492l3728O1632N6504j62632
17299d1157N1475P8390K0671k6564n973k28955j25023o3018J76390o8826j85519
$$ y = [-92862, 35464, 46528, -21960, 123168, 383135, 502233, 312427, 112578, -2389, 18747, 92104, 70724, 10036, -4799, 69795, 51626, 105454, 63105, -90699, -135021, -72779, -42906, 16743, 84354, -129948, -124773, -63944, -157066, -239554, -182591, -171578, -137046, 30409, 172340, 97612, -9283, -2209, 33882, 40099, -59965, -171443, -36758, 57849, 22034, 159030, 184356, 236665, 176705, 96763, -82060, -50638, 84730, 103247, 154686, 69603, 15577, 17171, 38342, 93021, 58675, -20200, -45058, 99161, 247238, 196767, -65969, -241269, -243843, -84548, -51258, -24330, 47559, 37067, 3339, 64971, 121475, -41157, 10318, 88708, 109379, 82815, 76842, -152113, -277136, -340154, -163764, -232590, -418109]
17288d18109O6980K12617P5915K0213J23475J8767k27789Q9440l0674n1326J76648
17277E6157N1151p745k1029j10092k12161k3044J74821K5219k452J825o4021m1443
17265a72814J6769l7604J68087P9932O0595r8478j44345j61411J31127K5939Q2525
17254d9678r1052K1408L5801N8109M4811p0732j13144r7302N8233J71988n2279
17243h3837m4069n1499J11179J02352k58736j05908K1879J200J80842K00076K2486
17232I5965n2389k5371L4829r8451j03028Q8244O9302Q4028j53579k2465Q3812
17221H97O8992j05406m3513M8562o3066N0809O6319Q4253K6821J8969k1367q3414
17209D8856L4487l4832L9157j6914j21434p7574j1062k3689r23J7925J04591j4761
$$ y = [-418109, -351129, -138512, -62597, -42384, 81091, 99858, -127931, -38491, -69165, -120491, 56157, 107308, 99563, 78534, -31558, -243719, -266763, -91942, -66723, -69175, -67350, -131371, -172814, -156045, -193649, -25562, 54370, 114965, 16487, -127858, -289269, -158142, -132203, -49678, -140730, -119322, -83521, -25412, 19399, -51333, -164477, -261779, -203546, -31558, -83837, -127906, -179405, -68226, 34126, -224610, -330518, -308639, -307439, -126597, 73479, 95965, 43576, 18205, 53034, -45417, -148445, -60201, 9101, 93129, -60450, -82915, 897, 69889, -35517, -79030, -30468, -93534, -42725, 23594, 107847, 134668, 153637, 132270, 48856, 83343, 48511, 87668, 70754, -50680, -128254, -139316, -163005, -163928, -146003, -41412, -56173]
17197e6173l212K7962o832n0955r130l7098j63937n0085J82045J97116q3933o5908
17185a20140p1408J02494J13004r5500M5757k4464j32669k09317j7171L9448J18759
17174b51207K71453p1727j84662J1366L8291q3811J83707Q5867j6865k1132n0134
17163h8854j07457J30955J99574N3403p6444m296r857n5933J1362L8735J1602
17152A02790J2643l8205j29236j95502o9097J11324L0967m0157j30063K7542K22127
17141i4867J60881j51048j6682R9796R3787k7925n3137L1427m2177N3956J54382
17130B08393J46250j65482m9942J6575M4337L9634r2268j20915k6096J01094l7218
17119F4362r4443N1882R5205p7239j66111P3927R3681O2380M0042q3938q0983
$$ y = [-56173, -59385, -31423, -38255, -89210, -98340, -135438, -299375, -349460, -167415, 29701, -54232, -120140, -191548, -89054, 23950, -71550, -25793, -50257, -182926, -392243, -409414, -369966, -251207, 20246, -51481, -236143, -224777, -186486, -270297, -86590, -723, -17588, -38720, -88854, -196311, -65356, 134218, 187621, 111177, 106881, 97024, 41091, 52453, 91188, 102790, 115433, 77228, -52008, -247510, -316607, -205283, -174316, -214473, -344536, -316994, -94867, 66014, -85034, -101716, -1920, 91867, 63942, 10805, 42232, 55, 54011, 208393, 354643, 189161, 139219, 155794, 200131, 239765, 147497, 26582, 486, 101580, 64362, -30081, 21801, 117006, 39767, -126344, -52417, 41264, 103644, 143686, 59748, -21235]
17108b1235o4729K855j6011J74946L7828j75249k1176J01694J28307n8066J7599
17097A06763l5866L0742p6795j62652Q8024l6761j33369m1976J46774J03536p1280
17086h2860P3958J01024O2947j00793o0088K38819k5704j37319j5344j52995j62239
17075b60594K9107K8231k417j4896N540n3387M5894K7802J39611m457r8551m1351
17063a99468Q3009o4622o125J21780R9688J49394J10747N493j96944q4664L6464
17052E4752q0895j29716j18418o4744O9865K67336J72808l4789o3625l2384J1184
17041E1374o1585q8480Q7783K2762J3945k11184L3062K58875m4572O861n3865
17030A4976j1814K6441m5166J17663l2134J682j83434j65528Q9767N225m3765
$$ y = [-21235, -85964, -83109, -99120, 75826, 113654, -61595, -82771, 18923, 147230, 89164, 106763, 70897, 101639, 24844, -137808, -49784, -86545, -219914, -261890, -115116, -11580, -82860, -8902, 92122, 155069, 54276, -5812, 233007, 207303, 69984, 54640, -98355, -260594, -231487, -203256, -205673, -220569, -215029, -268416, -222522, -194720, -55109, -59566, -158117, -199468, -116459, -181081, -187206, -65426, 34262, 183656, 294403, 299896, 102952, 18288, 54752, -26143, -155859, -274277, -339021, -269156, -1820, 170988, 136199, 72574, 40190, 51374, -10211, -98691, -10908, 11854, 25799, -185385, -152323, 106552, 61980, 68841, 14976, 3162, 29603, -15563, 102100, 69966, 71648, -111786, -277314, -187547, -182322, -226087]
17019b26087K28051l3115M1961L4636J9825K3359l5981r7353P3113M3617M7456
17008A19482N4648j34497j71643j6131n0400J44327j214l0462J18298j229j01143
16997f9964J27748k350q7063P4981k2898l9160M4280p3001o0415J39044L9033
16986G0235L8502l045Q3068l0396J56225j18310j68244j33390Q5024j71641j82142
16975c74114K0609K39257O1899n3971m3714l21189j21140J96912K38628q6208
16965b43031j96908K8607P9709J09597J34888R0441K604P1774J93941J27250k12620
16954A86252k33119J7507q7733Q4864P8603l2540J7821q9145j9243N0652j09119
16943a35200J9687J65820K7633P3905L8377j62612j90509j4621J63115L6117M7855
$$ y = [-226087, 1964, -31151, 10810, 45446, 65271, 88630, 52649, -44704, 28409, 72026, 119482, 174130, 39633, -132010, -148141, -198541, -54214, -55428, -85890, 32408, 31179, -69964, 57784, 55434, -31629, 43352, 20454, -18706, 25574, -47427, -107842, 31202, 70235, 108737, 105692, 188760, 158364, 314589, 196279, 28035, -105355, -20331, -191972, -374114, -353505, -114248, -52349, -106320, -150034, -471223, -592363, -395451, -156823, -243031, -439939, -411332, -331623, -222026, -87138, 3303, 5907, 77681, 271622, 398872, 186252, -46867, -29360, -117093, -32229, 46374, 13834, 31655, -57490, -76733, -26081, -135200, -115513, 50307, 77940, 151845, 190222, 27610, -162899, -177520, -14405, 21712, 69567]
16932F9567n7001l7374M6766o0300J0281m3885l1555K3884L6063J992o7506m5131
16920a54199K00997L2741o9857J9717j40153j22841O9353L4769o9270k2803p9990
16909c01536k3534J09125J51418J49161m9954j70364j52236J23326N2724N5849
16899e6021J42395o0232j59805j8031p7864J5225K30083O5367n4150k99911l621
16888b76565K2749K9621Q0787M6518N6817R9945o0786R9750m5527j33813o7978
16877a48482k4102n9462L58O2300R9001Q285N3737P755M2370L0521P9485n0831
16865A00935j52316p8095j35872K9112R4914P3294r5226L34116J40840j73467
16855A38235O5334p7460j14076k1268M9534l1975J14805j7767j0778O5691R7352
$$ y = [69567, 12566, -24808, 21958, -38342, -28061, -71946, -103501, -79617, -43554, -41562, -109068, -154199, 46798, 79539, 9682, 29399, -110754, -233595, -164242, -129473, -198743, -221546, -301536, -325070, -215945, -64527, 84634, 34680, -135684, -287920, -164594, -111870, -56021, 86374, 26142, -133663, -151694, -229558, -214333, 15750, 81117, 26967, -272944, -276565, -253816, -224195, -143408, -96890, -40073, 59872, -914, 98836, 53309, -80504, -148482, -172584, -232046, -231688, -169388, -70387, -62102, -8365, -610, 41760, 72281, 151766, 100935, -51381, -129476, -265348, -236236, -141322, -68028, -163254, 170862, 311702, 138235, 203569, 126109, 12033, -9235, 40299, 8324, 123129, 105362, 94584, 160275, 257627]
16844B57627L9968k8503k00913j20939j06903q6Q1410k7823k11655q1828J001
16833c98644J53105K18114J83018J0607R1040K1015j85586k17794q7786l0127
16823b43038M2163M2354Q9413k0132o1400J937q8466L5419O8476o150p1573j34455
16811c45452J33142M3545R0239L7112j463p7401o4929K22462O3768L3467k62330
16800a27840r9760R1445K3835M0527J71763Q273J5300q520j51384O1457J8284
16789D3380L5448J82982m1791j45587r207K3770j04383N7328J807m2389O13R0533
16777I2504k3463N1301J64243n5701j77612r4622R4404l9717p0383J0595N6730
16766H279n3560j64572K916J40327q171j09369J17306J78633N2176j42369R7438
$$ y = [257627, 297595, 269092, 68179, -52760, -159663, -159749, -78339, -106162, -317817, -399645, -398644, -245539, -27425, 155593, 166200, 257240, 278255, 92669, -125125, -212911, -243038, -200875, -158521, -69108, -89240, -150640, -148703, -237169, -201750, -133274, -139424, -210997, -345452, -212310, -168765, -78526, -41414, -42877, -120278, -185207, 37255, 101023, 134490, -127840, -227600, -136155, -112320, -71793, 99970, 108243, 123543, 115023, -36361, 25096, 43380, 78828, 261810, 220019, 74432, 65225, 88995, -15388, 41940, 43747, 1358, 1971, 92504, 69041, 120342, 284585, 228884, 51272, -43350, 51054, 11337, -59046, -48451, 8279, -45281, -209853, -206937, -66610, -74781, -184150, -66844, 111789, 163965, 21596, 119034]
16755A19034q6352k29064M0865J99370J22383j56042j75427L1048p853o489P8125
16744g0402o4847j07199j16781l9702Q2174J54223o7023L5713k3932J55421K7924
16733c4431j10765l2423L7845p05K59M8385K2845N7517P1975l6408j18127p5090
16721a69123L0032J27273j90052j17030k0729Q7129J05817J60933k5369j0459
16711b1578K5489L0936j1539M0239K7346j02964J8426o2531o2479p3058q0069
16700b71782P8427K49057j933l0488k7349J7439L0901L9899M0468p0290l4787
16689A9562l3183J17279l6437j74953J1186J63505l7535m7386R8760R3105l7575
16678A36328J30854L3235j43157n4834q6551k02398O457K95273J96727J06511
$$ y = [119034, 32682, -196382, -155517, 43853, 166236, 10194, -165233, -134185, -142038, -148527, -70402, -135249, -242448, -359229, -398931, -316757, -162534, -229557, -193844, -217776, -62355, -34431, -145196, -177619, -139774, -140479, -140220, -91835, -68990, -11473, 60502, 24094, -94033, -169123, -139091, -11818, -201870, -318900, -339629, -252500, -146683, 14250, -11119, -21578, 3911, 34847, 23308, 63547, 90893, -12071, 6355, -56176, -118655, -191713, -271782, -193355, 55702, 53769, 23281, -4068, 13371, 44272, 84171, 124639, 54349, 19562, -13621, 103658, 67221, -107732, -96546, 66959, 29424, -17962, 80798, 173903, 136328, 267182, 300417, 157260, 102426, 15875, -186523, -180066, 115207, 311934, 418445]
16668D18445j45693j44464k9525n8201j83562K7887J35960M4800p2076p7384q3656
16657a67469k0614K72393J55511k67052K0129J1865p5947J20333N7987o008K5774
16646A26902j52176J2245J18462j78502j57371m2934p7244O9824J12054J11400
16636e7340Q5583m4003N4486j86007J19469L250l1213P3844l9388O6469k4246
16625B0904L9738n0670J26931k2028o9968n0505m1816j5544K7230k5610m1714
16614a03052q6409j94031R4013N9811J62258O0640J8368j68077r3101N9338Q783
16603a81459q8162J76299J14736K9787K1462J4149j63008j36965m4837N2447K6599
16592a78952R9149j02405q0822M6138O5546l443P9308J79725R2621j62541o9182
$$ y = [418445, 272752, 128288, 98763, 40562, -143000, -115113, 20847, 65647, -6429, -83813, -167469, -188083, 84310, 239821, -27231, -7102, 4763, -71184, 49149, 107136, 101128, 126902, -25274, -13029, 105433, -73069, -230440, -273374, -350618, -280794, -168740, -57340, 28243, -15760, 38726, -147281, -27812, -24562, -55775, 18069, -21319, 45150, 20904, 60642, 9972, 136903, 114875, 44907, -5598, -47414, -62958, -35728, -61338, -103052, -189461, -383492, -289479, -229668, -67410, -6770, 11598, -156479, -249580, -190242, -181459, -269621, -93322, 21414, 51201, 72663, 86812, -76196, -213161, -257998, -205551, -178952, -79803, -182208, -263030, -216892, -151346, -154789, -75481, 104244, 196865, 34324, -34858]
16581c4858j41623j12104P3919J51491l700p2251l122K9281j9168Q9132j86660
16570b29663j12785P7846K400J71609O2632n5603J98027J13267j24249J0007O0006
16559A73494r4812q2729j51208m101J13243J18401k2031j11093m6755J13728Q14
16548F951j6870k9084J90171M3465j93894j53420L6328J87202P5491r2286K8863
16537H2917m0639L5538P0751j0212M51K7145K0819p0420q7487j74585r9396N3363
16525a91755Q2447J29839M3356j10133J07623K7900o2870O1717Q7018l7686j09404
16514B8052k71889J764J88673J42878Q5347q9106p8110J23710n7746k10353Q539
16503a28241K18671O5129J54931j47560o8766J6114j0502J57648L0623j54491
$$ y = [-34858, -176481, -288585, -214666, -63175, -66875, -139126, -142248, -112967, -132135, -43003, -229663, -342448, -264602, -262202, -90593, -27961, -83564, 114463, 227730, 103481, 113488, 173494, 78682, -4047, -155255, -159356, -46113, 72288, 50257, -60836, -107591, 6137, 6951, -9919, -39003, 151168, 194633, 739, -152681, -116353, 70849, 146340, 54054, 82917, 42278, 77816, 148567, 138355, 138806, 165951, 186770, 116350, 28863, -145722, -245118, -191755, -109308, 20531, 63887, -46246, 61377, 89277, 26407, 88124, 175142, 137456, 28052, -243837, -242073, -53400, 89478, 174825, 85719, 7609, 131319, 73573, -136780, -128241, 90430, 155559, 310490, 162930, 94164, 110278, 99776, 257424, 288047, 133556]
16493A33556n5583j42757o2634q7851j23812M5724K51541K13652j13777j30226
16483g2167n6122l5395J32984O5967J13940J51180l6988k05039j59794J717k1332
16472a21049l3639J950R1381R0507J02459J1794J37397q7528j93120m2824R2675
16461E0003o2568O649R6143l8154j23699j00802J70389m0646j10285l3665Q6845
16450i9790o7653j3257k5940J26131O7239j20089j30820J77923P8788n0838q5067
16439a43373L6046J24503P2594K0236l1376l2147Q1570j8169m5261J7847o4278
16428A8192k3211Q9618j54814k451N0721j08833J4314J78920L3932N0772p9165
16417F7995j17190q1515n0522J9285p5948j34592M1837L3811J09652l8951q3811
$$ y = [133556, 77973, -64784, -127418, -215269, -339081, -293357, -41816, 171836, 58059, -72167, -128289, -163684, -30700, 35267, 149207, 300387, 263399, 58360, -101434, -99717, -121049, -154688, -152738, -61357, 29150, 131609, 143403, 280800, 193272, 152, -42672, 50003, -12565, -5916, 90227, 52073, -71626, -172428, -2039, -42685, -152970, -186635, -99790, -167443, -180700, -206640, -80509, -13270, -133359, -264179, -86256, -7468, -58306, -143373, -107327, 17176, 89770, 110006, 78630, 46483, 128053, 109884, 64623, 82470, 18192, -5019, 84599, -70215, -72666, -21945, -130778, -116464, 62456, 96388, 147160, 67995, -49195, -130710, -181232, -161947, -237895, -372487, -330650, -296839, -187187, -226138, -309949]
16406c09949K03236j33100r3770P7406J60674J20081K3481p9147p3076n555p5284
16395a85003k6803m3950P467L3770j4911P5489J29527M5717N4405j21777n4203
16384a00272m0976N4175n7900O1368P2468J76344p567m6986J4186J2928j36495
16373A273j13682N2839p2037J21695Q5328k7218K9178o5054j23283r7087q0668
16362b88716J31801j03965l7152n9373K0122P601N2111K41421Q9013J37812m6798
16351A43877k04876m5231P7530Q8787j7135j05201n9497P0163l7437j01662J75557
16340a5125J45690r6020j45768k68410K0711J94252K97466k210k2441j97143N3273
16329c5725J29413L5317L880o9399q849P8517Q7387j2497m4517k8148k41437q0866
$$ y = [-309949, -106713, -239813, -333583, -256177, -95503, 24578, 48059, -31088, -104164, -109719, -185003, -211806, -255756, -248289, -214519, -229430, -153941, -24414, 21303, 75708, -46069, -100272, -141248, -87073, -144973, -83605, -11137, 165207, 157640, 110654, 124840, 137768, 1273, -112409, -59570, -131607, -9912, 75416, 48198, 77376, 12322, -110961, -208048, -288716, -156915, -260880, -298032, -357405, -337283, -329682, -277571, -36150, 52863, 190675, 143877, -60999, -106230, -28700, 60087, 42952, -62249, -121746, -51583, -89020, -190682, -15125, 130565, 34545, -111223, -379633, -358922, -164670, 132796, 130586, 108145, -88998, -35725, 93688, 129005, 132885, 63486, 54637, 133154, 220541, 208044, 163527, 135379, -106058, -186924]
16317a86924J07079J03772p371M1740j77507K055J22302J79506j00417j48060
16307f3825N270k827J82138O807j11987l6618m2378l7277O8470J3247J46727J81649
16295C09396k15324m4952j969k6492J39537o1695l06993M2403n1479M4197J61070
16284a2301J42173M3253p8719K7811K39237J17j94465r0177j31544j18972N0596
16273a22991J74490j39994n9124O6950R8405J61867N7648j12693j49637L9420
16263A4341P6275K1325k69178j22428J57206R995J03774k5157P7765l1739j47643
16252a35464j76591o0561K5801M908N5862j3997J69077K8740j78583J08707J37832
16241c4269m9620o3109J35389J30359K6651o2882j9629j55718L46N0677N3566
$$ y = [-186924, -79845, 23927, 16556, 58296, -119211, -117156, 5146, 184652, 84235, -63825, -58555, -61382, 120756, 127563, 15576, -21042, -63420, -100697, -32227, -18980, 127747, 309396, 94072, 49120, 47151, 20659, 160196, 98501, -208492, -166089, -217568, -173371, -12301, 129872, 173125, 94406, 122217, 361454, 361571, 167106, 76929, -54615, -173587, -122991, 51499, -88495, -147619, -80669, 17736, 179603, 237251, 124558, -25079, 14341, 90616, 111941, -157237, -279665, -122459, -112464, -8690, -33847, 43918, 12179, -135464, -312055, -372616, -346815, -341907, -286045, -300042, -130965, -102225, -280808, -172101, -34269, -83889, -146998, -11609, 118750, 145401, 82519, 62890, -92828, -92482, -41805, 11761]
16230A1761j4156j03155j44261Q9088J9444O5511l5426J00750l9542N6497j8242
16219a1731o9725m8020L8140p5056l219k9338L5366K8630m6473M6923L4654M7861
16207e1988o6216l144j95736P444K52873Q3801n0316J65008q8455r3218R0954
16196E1007j6687n6527L0824J7494J3536p1365j19209N5662R7420J26759N8932
16185A87846n9552j66421p7537o5817J39195Q1458Q674R6083J04270K9234M612
16174B82045j97233k70793n4641R1433J48354O0878l911m6631l4155K2045J0917
16163H308q9665n662j5350P5677J5238j45111M7228k914n2918l5581N9176J10883
16151c0691J43254J1832k04870K58502p0270j39024m8692R718J83261J45532l6858
$$ y = [11761, -2395, -105550, -249811, -160723, -141279, -75768, -111194, -10444, -49986, 6511, -11731, -81456, -129476, -91336, -166392, -169611, -198949, -163583, -134953, -181426, -134503, -99849, -51988, -118204, -121348, -317084, -309640, -56767, 27034, -23282, 141726, 53271, -39947, 51007, 34320, -22207, 8617, 26111, 39647, -31718, -150927, -95265, 2155, 128914, 187846, 128294, -38127, -115664, -181481, -42286, 39172, 47846, 143929, 248199, 277433, 282045, 84812, -185981, -240622, -149189, -835, 60043, 56132, 9501, -24654, -2609, 8308, -81357, -87019, -102369, -26692, -11454, -156565, -109337, -112251, -165169, -200750, -141574, -30691, 112563, 124395, -80475, 178027, 107757, -31267, -79959, -70241, 113020, 258552, 221694]
16140B21694m3205r1047J4886q885J81620r8892k28465m8499J8595r8737J7255
16129a63680N1643M8518J09303J21501m5174K0316J42853K0302j16706k83269
16119i4393q5115K30024o2181n8148m6288r175J29885P6699p9999j69357q3532
16108b51580M5348J0623q2141M6102J23128P9772J38164K4859n1677p1847m3034
16097c2283j59381m9301R3388o3529K9267j01025R7722j18003q2810l688O3697
16086c25946J76333K04998m3559j15279J35208j03078j27702n2945j6752K7902
16076b40820M9019J85O5775o4441J1764J9751k1266m6982j59326l3328J16448
16065c03221O4607J67j3005N2762M3026N2632O1222J52399l4234K6165M9276R7466
$$ y = [221694, 178489, 87442, 102328, 93443, 275063, 176171, -52294, -100793, -82198, -180935, -163680, -112037, -63519, 45784, 167285, 122111, 142427, 285280, 305582, 188876, -94393, -179508, 50516, -11665, -69813, -116101, -125276, 4609, 81308, 1309, -168048, -251580, -206232, -195609, -277750, -231648, -108520, -28748, 109416, 134275, 82598, 10751, -32283, -191664, -240965, -147577, -211106, -181839, -282864, -185142, -303145, -385955, -389643, -325946, -149613, 55385, 11826, -103453, 31755, -71323, -199025, -251970, -268722, -240820, -191801, -191616, -125841, -190282, -178518, -158767, -180033, -227015, -386341, -419669, -303221, -238614, -238447, -251452, -198690, -155664, -103032, -41810, 110589, 76355, 102520, 151796, 249262]
16053B49262j22314j18646j00216Q4841j76500q124J4123k6889J09360k5579M2841
16042g7841J89082O838r3707O0108k5717j2533J9966N3624j1784q0207r4224M4755
16030b1640P8794j57566q7941M129J19410O6607k15276J01817J42528J04334j64676
16019b9480O1722R2170p6951j97896j23151R5964M9377m8729P7890L6099k838
16008f5823M0595J12471J7971m6182p2062p9422o5947J1916Q2954J2153j18765
15997a70141J32173J84994k31174j41059J12171J22496J01056O8011r1991K4476
15987A11012K3501L6564k59737j50902N8763L0035K9863O636R0519l9573j40401
15976b03720q8525K31641J42377j6261j3224R3564j40483j4524J39596j01151
$$ y = [249262, 126948, 8302, -91914, -7073, -183573, -191697, -177574, -204463, -95103, -120682, -77841, 111241, 118079, 24372, 84480, 58763, 46230, 66196, 119820, 108036, 27829, -66395, -21640, 57154, -100412, -188353, -184224, -64814, 1793, -213483, -111666, 30862, 135196, -29480, 32242, 124412, 47461, -150435, -273586, -177622, -128245, -176974, -99084, -62985, -65823, -25228, 87243, 105214, 59032, -13030, -92452, -158399, -146483, -63529, -51376, -170141, -37968, 147026, -84148, -225207, -113036, 9460, 110516, 178527, 86536, 111012, 134513, 171077, -88660, -239562, -180799, -150764, -120901, -114265, -23746, -63319, -203720, -292245, -60604, 81773, 65512, 52288, 145852, 5369, -9155, 130441, 29290]
15966B9290N3222J91525p1964k06653l2630n3240J15414J44965j65134l8112K8574
15955d743n6250q5291Q2762j00713K45094L5757k96878n217N9596J93533M6648
15944A14298k1890J39008n5776m587N49P9287J15152l2955j27971o3160j02119
15933C9836j14541l04265N5488K53634J63927N8671K6215N5406J21112j10704
15923B44779j63779O0268n560j57517K5048N3729q3618O6887R1998n9498o5621
15912G116R1665o447O8008n2211j28631j49072J23605J67150J24038j38012j33334
15901b6125K25172J9215o1527K5189r4401r7238O487M7879K3457j37414p5021
15890a44327J33751J07603O8656R6387q2607K4441j2096J9288J7475r1034j01937
$$ y = [29290, 82512, 274037, 202073, -4580, -37210, -90450, 24964, 169929, 4795, -33317, -4743, -60993, -146284, -63522, -164235, 80859, 116616, -180262, -185479, -125883, 67650, 114298, 92408, 231416, 175640, 171053, 171602, 250889, 366041, 333086, 205115, 141955, 39836, -74705, -378970, -323482, -69848, 94079, 152750, 178965, 234371, 355483, 244779, 81000, 141268, 135708, -21809, 3239, 56968, -26650, 40237, 132235, 72737, 7116, 98781, 92334, 160342, 108131, -20500, -169572, -45967, 121183, 245221, 107209, -26125, 199047, 218262, 156735, 181924, 87523, -9715, -3228, 44651, 68108, -69306, -144327, -10576, 97027, 165683, 262070, 179463, 203904, 191808, 211096, 228571, 137537, 35600]
15879C5600j25953j53632Q0698R476O8461R5281L2956M1191p0053r9770P2099
15868a3646n9859O3806J848j7757j6864P6310Q2227j80816q4108J32502o1783
15857g8140L3679J50338j3216j94330j84573J62767N3366l9430p9211K5073M641
15846a59036N4577J14955J5725r4575j26332N351P6348p652n6244J02317j23295
15835a97861r5154J32679p4482N7699J0984R4587J7946j66743j42733P7488J12403
15824a73187O3487J59347k9025j6715N9288r458J16746M0011K4500r5033p9392
15813F0569N0582M4100J2569j8000q645J17155J9069N3906j88783j46242n7205
15802f0925K403r7796J8389p6806j11235J19329j05587o6171K5481K15843R9584
$$ y = [35600, -90353, -243985, -163287, -153811, -85350, 9931, 42887, 84078, 14025, -85745, -13646, -73505, -9699, -7851, -25608, -42472, 33838, 116065, -64751, -148859, -16357, -78140, -44461, 105877, 92661, -101669, -286242, -123475, -70109, -109539, -188750, -163677, -159036, -104459, 10496, 26221, -68354, -194686, -189335, -112987, -120639, -176883, -74566, -197861, -293015, -160336, -234818, -177119, -166135, -71548, -53602, -220345, -363078, -285590, -173187, -109700, 49647, 20622, 3907, 63195, 53737, 170483, 210494, 234994, 139961, 60569, 111151, 155251, 167820, 149820, 141175, 258330, 277399, 331305, 142522, -3720, -60925, -58522, -156318, -137929, -214735, -325970, -206641, -312228, -378399, -352918, -137075, -37491]
15791c7491q8070R3659N4347l1302j9153M3001o8259l3912L1756n8439J93587
15780G9724j30778k33696j12011p9098M7098q953J96288K47315P5082j19106j22043
15769a60178Q2398p9203j46112K7742J02451k8778j68220K8098J93315J56674
15759H187K05139M9451p4847p4280j92823j69604Q9238M0049L9100J67797k3422
15748F3985l0754O8346p4063M9114q0191r8167o1858m8881j59806k05013J84266
15737c93022L17799J12813m9218q4507P8558K8491j9209j04824j31831r163L4982
15726b19131J13175M5578r4308J3279J7872j2546j4024P331J5652m2362j11537
15715b81021J83314O1448J9347j08534l3277J11955p2536o9691l2114k7339r9873
$$ y = [-37491, -125561, -31902, 22445, -8857, -28010, 14991, -53268, -87180, -55424, -113863, 79724, -51054, -284750, -396761, -475859, -428761, -437714, -241426, 5889, 80971, -38135, -160178, -77780, -156983, -303095, -275353, -172902, -201680, -369900, -341802, -148487, 8187, 213326, 262777, 187930, 113650, -79173, -248777, -159539, -119490, -80390, 87407, 63985, 33231, 101577, 27514, 76628, -3563, -101730, -163588, -212469, -372275, -577288, -393022, -75223, 37590, -11628, -96135, -17577, 10914, -8295, -113119, -244950, -254113, -219131, -105956, -60378, -154686, -141407, -123535, -136081, -150105, -142774, -127122, -169484, -281021, -97707, -36259, -16912, -125446, -158723, -46768, -119304, -188995, -221109, -248448, -348321]
15704c48321q4368l1922Q9997J61066M8692K2896o7917J11126J37978J5555j46311
15693i1529n8414K1833J15436j36506J1706R3958K26692K5987r3112p2138j28939
15682h5026J42513Q4780l32513r8715L0402P4235Q19O5280N2927j12795p3358
15671b51451P7592K3875j20032m4947K9737r9666q0309k2070R8541J68422Q1487
15660a38821J48590J6164q51P5158k14095k28450m2932j7808k9358J43781R1634
15649a96988k6485j54339L1867R4245J9838J69519J94842L2895l20591j32864
15639b88061K69123q8748q8711Q5683M7895j13726m0632L5646J60424K4913P1987
15628G5793l8726j88009Q1355l7988o3930O9270n2236J3257N0405q04J7768K5799
$$ y = [-348321, -432689, -464611, -374614, -213548, -164856, -141960, -209877, -98751, 39227, 54782, -91529, -149943, -128110, -12674, -149180, -137474, -43516, 183176, 209163, 116051, 43913, -85026, 57487, 142267, -190246, -288961, -258559, -184324, -183505, -118225, -65298, -178093, -251451, -173859, -149984, -270016, -314963, -285226, -384892, -465201, -487271, -388730, -220308, -138821, 9769, 25933, 25082, 100240, -113855, -342305, -385237, -403045, -432403, -288622, -196988, -223473, -377812, -345945, -251700, -231862, -62343, 132499, 165394, -155197, -288061, -18938, -107686, -196397, -110714, -62819, -176545, -217177, -181531, -21107, 3806, 75793, 37067, -150942, -69587, -107575, -171505, -102235, -154471, -141214, -90809, -91613, -73845, -48046]
15616d8046k8702J3792J14323k6515j2262j23150j24823L4353N4924K0511O0097
15605f5498k29820J07305J68760K33219j08257j68800j10744l2485m0886m649
15595b51855J00965L6155Q4828p9346k119J84713K6826R005N6596j15971m3226
15584F571O5152P8669j67300k8865r852O6400j31651Q5128K44639M1133N7175
15573C07199k2114J3837N7923N4810r2480k33008j0116J16790j02609J11615j0331
15562A91516j33517r7121Q8717j84748K8190J41112J00072N462l4284O639K02240
15551C14278J60j36002p537J43977j27678j64060o9060l0034J1674j57230J5570
15540b05942J22864J39778k1495L4254P1319p2291j06158M2229j65223Q1416J14515
$$ y = [-48046, -76748, -62956, 51367, 24852, 12590, -110560, -235383, -201030, -146106, -125595, -65498, -295318, -188013, -19253, 213966, 105709, -63091, -173835, -206320, -247206, -251855, -150890, -114735, -29907, -109253, -111372, 73341, 100167, 109172, 165768, 49797, 6571, 71723, 150392, -16908, -45773, -55625, 10775, -120876, -35748, 208891, 250024, 307199, 285085, 298922, 356845, 411655, 319175, 86167, 76051, 192841, 90232, 201847, 191516, 57999, -39122, 49595, -135153, -106963, 34149, 134221, 139683, 105399, 112038, 314278, 314438, 178436, 170899, 314876, 187198, 23138, -45922, -75956, -64282, -221512, -205942, -83078, 56700, 35205, 69459, 140778, 68487, -37671, 4558, -160665, -79249, 35266]
15529C5266K8227Q1556R764N7526K2994k10974p4673J55707L3089J4160k2405
15518A30237j34991j2984p249m353N0841K43184P0149p1764r8796j5456j00927
15507D7891Q2003Q0517m502k02588q1074M7770j29140k13334r390J62836J15302
15496a03709N8266M1750R154J56535J0457r8559P9102J33219q9519L8063q5272
15485A49487k14151M7979J18485k666j13915K1842Q6479l7964q3165j33907R3620
15474f7876K1591j12676O8043K46969P7418R3745R159N888k19762j54384J7603
15463a4282O2816j29864p3164J68654J459m2632r6754n3605N5153M6161l5768
15452a11826k1904N6000R9911j3905K0565j01841R0895Q1425P3313R1068l4837
$$ y = [35266, 63493, 145049, 154813, 212339, 235333, 24359, -50314, 105393, 138482, 152642, 130237, -4754, -17738, -24987, -29340, 21501, 264685, 334834, 263070, 164274, 148818, 47891, 129894, 210411, 205909, 3321, -77753, -29983, -159123, -372457, -381847, -219011, -103709, -45443, -3693, 5461, 161996, 172453, 73894, 152996, 286215, 196696, 234759, 149487, -64664, -16685, 101800, 99134, -14781, 7061, 93540, 55576, -27589, -161496, -67876, -46285, -158961, -90918, 156051, 233469, 327214, 336373, 342261, 122499, -31885, -14282, 48534, -81330, -154494, 14160, 15619, -27013, -123767, -177372, -122219, -76058, -111826, -133730, -77730, 22181, 8276, 28841, -73000, 17895, 99320, 172633, 263701, 228864]
15441B28864p7267j04791l3077L9035o9527l7523j53550l4177M9969O3653R735
15430a18656q8384m7852q6969n0374K8307J07699L4060J34374q0898k04196Q1055
15419b91834K10938k4814O6974J80608m2613l1400p4833m5926M4337L7607P6492
15408A05536J47358p4214k5112l294j91720l9378J07970J36506p7898J0414j37921
15397d1753K772l0345j57274M6505l3295L2974L3427O6648j54787Q9831N5647
15386h9650J48539n7776j86332R8321k4988q566J79469J26513l1481N0228Q1808
15375B86085j60416j65872j36467j26220j2180M2985J12061J90660M9916M0644
15365A21196J57667q4763K3740L277L1752m0073j92910j55528K621J56130J525
$$ y = [228864, 151597, 46806, 13729, 52764, -16763, -54286, -207836, -242013, -192044, -128391, -118656, -207040, -254892, -341861, -392235, -363928, -256229, -222169, -87795, -168693, -372889, -291834, -80896, -105710, -38736, 141872, 99259, 67859, -6974, -52900, -8563, 29044, 105536, 252894, 178680, 153568, 150274, -41446, -80824, 27146, 163652, 85754, 96168, -41753, -38981, -69326, -226600, -180095, -213390, -180416, -146989, -80341, -235128, -145297, -89650, 58889, 1113, -185219, -86898, -111886, -120452, 59017, 185530, 154049, 204277, 286085, 125669, -40203, -176670, -302890, -315070, -272085, -160024, 30636, 80552, 121196, 278863, 194100, 217840, 221117, 252869, 212796, 19886, -135642, -133021, 23109, 24634]
15354B4634j00374j13767M9108O6086p3544J02274R4966N1826j27299q0299J76916
15343G0527j2518j97426Q4367J01445j9553L2277o2996N7622J61436l5445j16555
15332F3181p1116L2115R2587o4365o5545o7364j3607J9855J66146J33213p3103
15321A51997K8512r5561j03961j53846k8194P2318J2807N13O9320j38090j17597
15310c01782R4395J87778K8690P8482J48630r4746q7468q023J79195m9126j83428
15299g403j0432O163K56934j43564l20373O3122L6709j19335K32413k6028k7899
15288e9693k9661j8150p3683p8119L0259P1699j6605j071P9742Q3539J68893r8601
15276E8549j50267n7616M7721J89420J09178k31188j57437J9764j37731Q5514
$$ y = [24634, -75740, -189507, -140399, -74313, -147857, -45583, 49383, 101209, -26090, -106389, 70527, 58009, -139417, -55050, 46395, 26842, 59119, -3877, 53745, 215181, 179736, 63181, -7935, 24180, 116767, 52402, -13143, -80507, -94114, -74259, 91887, 225100, 151997, 180509, 84948, -19013, -172859, -201053, -128735, -115928, -115415, -46095, -184185, -301782, -207387, -19609, 9081, 87563, 236193, 141447, 53979, 45956, 225151, 176025, -7403, -17835, -11672, 245262, 101698, -218675, -155553, -118844, -238179, -5766, -31794, -59693, -89354, -107504, -181187, -259306, -229047, -157348, -173953, -175024, -95282, -11743, 157150, 58549, -91718, -149334, -101613, 87807, 196985, -34203, -191640, -171876, -309607, -224093]
15266b24093K39822J26041n3555j51593q396l6990M0647p2642J73535J78779J07559
15255C19114l01890j96896q0839q6507N731J38710J21296J3648Q8358l3861k33704
15244b46840P1654L8117o2165r8553l8928J55914J11871k1545p2315j250R0852
15233g3188O8899J45097P7093P5330J19868j77976j03183j10033J60180p8628
15223A03459j00129q448j25975q331P3445m1802J4973R4094J24840J5566L7879
15212A79571j00931j15680M6385l483n9100n8192J66924k9232p7827p9959J8770
15201a12754R165j09288j06005l0358J15086l0331j0219K07290J44712r0320j49483
15190a62505k32423p7701J46549K02149J79220Q1392j69702L8598R76J46786n4979
$$ y = [-224093, 15729, 141770, 88215, -63378, -71774, -108764, -68117, -140759, 32776, 211555, 319114, 17224, -179672, -260511, -347018, -341287, -202577, -81281, -67633, 20725, -13136, -246840, -175186, -137069, -199234, -297787, -336715, -180801, -68930, -90475, -162790, -164040, -73188, -4289, 140808, 217901, 293231, 413099, 235123, 131940, 21907, 182087, 103459, 3330, -5118, -131093, -139424, -65979, -107781, -92808, 1286, 126126, 141692, 179571, 78640, -37040, 9345, 5862, -53238, -111430, 55494, 26262, -51565, -131524, -112754, -103589, -212877, -318882, -349240, -234154, -264485, -274704, -67414, 77298, -13022, -162505, -394928, -472629, -326080, -123931, 55289, 136681, -33021, 5577, 6553, 153339, 98360]
15179I8360p550o8232L6021j63115k516r2018J22374Q9162l4892J51r2205m3851
15167a58311R0614M8019J40753m5874J17374N3086k4356j62576o5049j68440j19434
15156b94194l4371J30367Q5113P6659K39052K3033r0549j23126J3834K7728j07636
15145e4090p4129j1393M1365j18534q9161L6557m284K05318K11359k32630L1429
15134e8193j6012p5203p486N6866P6600m5103Q4395K7331J1641L8154k6039N590
15122G2541K2931j3689j92541j31007j83869K22584J01163o8418j49238L4880
15112b84663Q0321J09159J14425q8655R6818j5717J24578l6195j11571N002L9790
15101C3292L6773q6794O8425K28708J93030j29878k14956j8104j05797R93l5521
$$ y = [98360, 90810, 22578, 58599, -104516, -107032, -199050, -76676, 12486, -22406, -22255, -114460, -158311, -67697, -19678, 121075, 75201, 192575, 245661, 221305, 58729, -6320, -174760, -294194, -328565, -198198, -113085, -36426, 202626, 225659, 135110, 11984, 25818, 53546, -54090, -128219, -139612, -98247, -216781, -305942, -269385, -273669, -68351, 143008, -89622, -58193, -74205, -149408, -156894, -100028, -23428, -68531, 15864, 43195, 54836, 92990, 66951, 72541, 95472, 81783, -110758, -241765, -425634, -203050, -101887, -170305, -319543, -284663, -204342, -95183, 19242, -69413, 27405, 11688, 136266, 100071, -11500, -6498, 33292, 70065, -16729, 51696, 280404, 473434, 343556, 128600, 110496, 4699, 5692, -29829]
15090b9829L3077K20019j13032k55710p5773K3821J01750J70101J50364K2140
15080B46928j75485j44128n7410m5361q1918K2103J201J49222O5338J30772p4173
15069C7089N800J67416p8248J1411M5460l7561j03881N9281J00974n8104n2926
15058I6711P721l4020m0853J22042K9736l8222r0318K06369J30734l6925m55619
15047a02644j76111j1799l4501j34660K7241K95314J30389K2468j33901K312J08863
15036g029J29821L5581j45456p6748j47714M7155M7814l4581K5487J31087R5816
15025A01233K1834k8053j5573j74098L0700k9242R1344l1420J38065J80693l2922
15014B52561r4496j58425j54495p4087l8161k7009K7371M2363l5191J31950J10562
$$ y = [-29829, 3248, 223267, 110235, -145475, -221248, -197427, -95677, 74424, 224788, 246928, 71443, -72685, -130095, -175456, -257374, -235271, -234070, -84848, -19510, 111262, 37089, 42889, 210305, 132057, 143468, 188928, 151367, 47486, 106767, 207741, 149637, 96711, 104432, 70412, 29559, 151601, 181337, 143115, 52797, 259166, 389900, 352975, -102644, -278755, -290554, -325055, -459715, -432474, -137160, -6771, 15697, -118204, -115892, -7029, 122792, 158373, 12917, -63831, -211545, -164390, -116576, -151157, -125670, 5417, 101233, 123067, 95014, 79441, -94657, -63957, -93199, -1855, -33275, 104790, 285483, 252561, 158065, -360, -154855, -228942, -267103, -294112, -266741, -224378, -259569, -127619, -17057]
15003a7057l3964l7837r0432P3300o5316j05359K4947M6398J87161K6058j32276
14992a24377P8903J28435M9009q9969j79375P1231J04552J36181L0924M1669m8909
14981A98274o6693j85326r8779J29796J80730J23399K8031o5188p0133k7017n2
14970A47042J03505j19525j95164l1872R1127O6168j24634r8462K1288L5181m4177
14959a49523p4473L1913J7333N7433J0352J33610j0923j10104j3924J61982R4261
14948A47937P3530j29190j1371p7757M1934n9908j11660P0258L6089M6787k07896
14937a81247l4565Q4845N8914l3212q9609O7556J5005k31496k8830q9691P6387
14926c85943K23385K76194N1121n2304N2253K5382n7834q7086r7436N6825l11
$$ y = [-17057, -51021, -88858, -179290, -105990, -171306, -276665, -251718, -205320, -18159, 7899, -124377, -45474, 82961, 131970, 42001, -137374, -66143, 38409, 174590, 205514, 247183, 198274, 131581, -53745, -152524, -22728, 158002, 281401, 309432, 244244, 174111, 147094, 147042, 250547, 131022, -64142, -96014, -4887, 61281, -63353, -161815, -140527, -105346, -149523, -223996, -192083, -174750, -117317, -106965, 26645, 15722, -94382, -108306, 53676, 147937, 221467, 92277, 80906, 3149, 45083, -14825, -126485, -56227, -20138, 26649, -181247, -215812, -130967, -72053, -105265, -194874, -127318, -112313, -343809, -372639, -462330, -385943, -162558, 113636, 164757, 112453, 164706, 190088, 132254, 45168, -52268, 4557, 4246]
14915D246k10338k9945J02458J30107Q3583L2610N6968j9618j81025j6673j32771
14904a80398k06938O5640R7998L0022J55135K35443j0688j65370k55654j82502
14894d17312J28037J25809l2556J24748K52945N6573k21581J2828K39432J3056
14884B81979M0817L9191p4394r9704j44208k53979R2148q3946J88358n402k3857
14873d2997L1957Q592J81228Q9749l9879j91652k26677M187L3o672K15447L0010
14861E3326J5174J15953q676l9308N2790p2438k93503O1211r7935j02493P0189
14850b45710Q8519Q1943J36686m9538r5067j32280j90193P3272J47498N4307J04425
14839b6138k7342r080j0532J49684R1363k15990R6314N8629j61167r3536r9655
$$ y = [4246, -206092, -236037, -133579, -3472, 80111, 112721, 169689, 150071, -30954, -47627, -180398, -387336, -321696, -223698, -193676, -38541, 196902, 186214, 20844, -234810, -417312, -289275, -163466, -196022, -71274, 181671, 238244, 16663, 29491, 268923, 281979, 322796, 361987, 287593, 187889, 43681, -210298, -118150, -202096, -13738, -19140, -42997, -11040, -2448, 178780, 268529, 228650, 36998, -189679, -185492, -185459, -192131, 23316, 53326, 68500, 184453, 175777, 136469, 189259, 116821, -176682, -115471, -213406, -315899, -245710, -157191, -75248, 61438, 11900, -83167, -215447, -405640, -332368, -184870, -130563, -26138, -53480, -62560, -73092, 76592, 167955, -48035, 48279, 106908, -54259, -147795, -247450]
14828b47450J97035M6499p9369K4565j02529n4694q415P9755J49791r011L8534
14817C4711o7942M1325r3322m3391o3987J48210n9892L0178l2098J23146J7908
14806C4846M8374N1351O5756j30540k7245k6807K0878o8937q9436r2100J72772
14795d1088k4524r2089p229L375j38542J26031K08908Q5785K0727J0443M3016
14784A94813k7984q7210j33602q8716N5521j4064J85411J36155K3833j49401j92809
14773i8053N9005J01923L3210R84Q4551J8372j11656L1461l7648m8820k28629
14762a95300n4213J44273K0997K4458j18231j6565k2344J10946N2226r1844N1254
14751i4343m1075L1766o7358J47758J11331j03837K0626n970j1098r8331m5350
$$ y = [-247450, -50415, -3916, -83285, -58720, -161249, -215943, -224358, -144603, 5188, -3823, 34711, -33231, 8094, -85228, -128619, -192606, -44396, -104288, -74110, -106208, 16938, 34846, 83220, 134571, 200327, 69787, 42542, 15735, 36613, -32324, -121760, -213860, -41088, -65612, -157701, -164930, -161555, -300097, -174066, 34842, 120627, 141354, 151797, 194813, 166829, 79619, -53983, -142699, -87178, -101242, 84169, 220324, 244157, 94756, -98053, -39048, 62875, 96085, 97069, 181620, 199992, 88336, 119797, 82149, 33329, -195300, -249513, -105240, -84243, -59785, -178016, -194581, -216925, -105979, -53753, -145597, -94343, -135418, -103652, -171010, -23252, 88079, -15758, 4868, -1102, -12200, -110531, -155881]
14740a55881j21747M1646R7483L1732Q8844k1960k3688J82026M3001n5873k19251
14729a13668M6601L308q4190K4674Q0121n6467R8432j9739o872n6518m5147K6395
14717a03070J08677J94692k15674O651j8229Q3442L7027L7679K00575l4706r0951
14706B06113K4109m7317R0125n1453k11757L0396k5951j62145j03518J15375J38976
14695B953K7687N9098j0645j43322P1392M3973r2852l3807l6289N0009L1162L1098
14683D57J51185J31902j17772q6833m3325q4744J05753j7115K9270j6547q5353
14672c3122k11673j14438K99936J10599R8813p0225o8667j28653P7053J23249
14662H2872R6983m0007Q5235j16312p8376k0958j23680M7316P8052O5518j73922
$$ y = [-155881, -277628, -235982, -138499, -106767, -17923, -39883, -63571, 118455, 161456, 105583, -113668, -67067, -63759, -147949, -123275, -43154, -99621, -1189, -20928, -27800, -84318, -129465, -103070, 5607, 200299, -15375, -8724, -26953, 56489, 93516, 131195, 331770, 297064, 206113, 230222, 182905, 273030, 221577, 9820, 40216, 14265, -147880, -251398, -136023, 2953, 30640, 89738, 79093, -64229, 7163, 51136, -41716, -75523, -111812, -61803, -30641, 457, 151642, 283544, 165772, 78939, 35614, -49130, 56623, 39508, 68778, 52231, -33122, -244795, -359233, -59297, 51302, 150115, 79890, 11223, -117430, -40377, 82872, 179855, 139848, 225083, 108771, 30395, 9437, -114243, -66927, 11125, 76643, -97279]
14651i7279M9237r6343N9832j60039p2286J703L8367Q4090N0250L0977j13856
14640b25347p3683J23867J37152j00934M9632l712k2037m8468J28363R3860k6718
14629C1975q3798l1323J77228o581o1054K6593K609r0958j64104R9757J30967
14618C1311k8561q7432P5787R2475J9280r1683k11352K05173N0762j24595n6988
14607a25823O6142K68241J57813R5464j7370j78973r2975R1532O1092J59758j4847
14596D70054j51329k65739j04179j0715j4772J07860m5981j4301l9684m1739O217
14585a04308N2602n0304N3334N6531r5821j41736Q83m622R941J11645l3645R7774
14573d7726r2778o0089K4965o1890p7778j7422J66425J65569o5074J1810O3114
$$ y = [-97279, -48042, -144385, -84553, -244592, -316878, -315175, -276808, -192718, -142468, -111491, -225347, -299030, -175163, -38011, -138945, -89313, -93025, -115062, -163530, -35167, 58693, 31975, -51823, -83146, 94082, 87501, 26447, 53040, 55649, -35309, -199413, -99656, 31311, 2750, -84682, -8895, 83580, 102860, 11177, -200175, 4998, 55760, -68835, -125823, -59681, 208560, 366373, 461837, 444467, 265494, 172519, 264051, 325143, 484901, 470054, 318725, 52986, -51193, -61908, -76680, 31180, -14801, -29102, -68786, -110525, -104308, -51706, -102010, -48676, 7855, -87966, -229702, -228819, -233441, -223500, -111855, -145500, -47726, -140504, -200593, -175628, -237518, -315296, -332718, -166293, -724, -65798, -53988, 9126]
14562I126j27988k43467O0460J00262M4158R8326J85722L2583n8830P5540j10499
14551F5393j67412M8997J25872K6997p361K8548N9438p6682n8267M9113m8957
14540D5679p1336P7278o854m8136l2727J79412M1150r5247p0193J685m950j74
14528A5587l5514M6263J4360N9357j9451l4641J09901J6274p579l9735j25168
14517c46L4786q843o9722o2400q958J11369N0514J5410j06170j35544K97197J2213
14505A29506P8317J9387j7925j71900p2001Q1080k3984P2473J80801L1113q6629
14494B20238k7337l8009l9126Q0399n5464k15213j74718K9460J95463K5499p1024
14483f9832p0839m8322j2680m0742j68254p7153J3947K1694J08999J29433J4208
$$ y = [9126, -118862, -362329, -301869, -201607, -157449, -59123, 126599, 159182, 100352, 175892, 65393, -102019, -53022, 72850, 99847, 92486, 121034, 180472, 103790, 45523, 94636, 45679, -25657, 51621, 44767, -3369, -36096, 143316, 184466, 89219, 19026, 20711, 15761, 15587, -19927, 26336, 40696, 100053, 80602, 45961, 155862, 172136, 164557, 124822, -346, 34440, 25597, -44125, -106525, -115483, -4114, 46400, 61810, -44360, -179904, 117293, 129506, 207823, 227210, 209285, 37385, -34616, 46464, 22480, 94953, 275754, 306867, 220238, 192901, 154892, 115766, 196165, 140701, -74512, -249230, -219770, -24307, 1192, -69832, -140671, -188993, -201673, -242415, -410669, -487822, -473875, -452181, -343182, -213749, -199541]
14472a99541m8143J08627o7979J8431M2314j20447J77l0437p1264q4394K6565
14461d26091K2122J74060J06391L6561R3505L4198j5165K372P64k7425J69623
14450A70915k4965n7673J011j19493m8412J15627N2396j66092N9675R3338J63621
14439B39948n6726m3539P3604j04523l7443J81675j20393j89450L7436J9347p4536
14428g4600j1363m3806l5819k1743Q0019K47586J63398l8473J2167L2517j38894
14417A70989o5591j12634j67974j36021Q5728j4492J05189M8233L8328j02342
14407a50587o9028K7035J77662J15740L8676m8957j86822j02194J12856n0601
14397a36220N3464j44194M7031p7025J09566o669P1070J32295K04381o2798n2150
$$ y = [-199541, -247684, -139057, -207036, -188605, -146291, -266738, -266561, -296998, -368262, -452656, -426091, -403969, -229909, -123518, -86957, 6548, 40746, 25581, 27953, 28717, 1292, 170915, 145950, 88277, 89288, -30205, -78617, 37010, 89406, -76686, -17011, 76327, 239948, 183222, 139683, 213287, 108764, 71321, 252996, 132603, -56847, -19411, -64, -74600, -85963, -129769, -165588, -187331, -107312, 140274, 303672, 265199, 277366, 309883, 170989, 105398, -7236, -175210, -311231, -225503, -239995, -134806, -86573, -48245, -150587, -219615, -192580, -14918, 100822, 139498, 90541, -96281, -198475, -85619, -136220, -82756, -226950, -179919, -256944, -147378, -154047, -82977, 49318, 253699, 190901, 138751]
14386A38751j8972j24361N0756j0164K1062J8205n9621J6920O913j70744n9452
14375a90707O6365J41607Q5525o2684j81326j9525R4037o0949j0185Q1399J66462
14364A10019J05180j09322p389Q7126p1921o2335J7055j24740j07120m0576r2124
14353b96147K3210J27714J85941Q4539K6773J5386J4454o0180L635M4924j9584
14342A50665j00913k4252L4283r8062J51890j90778n1952J03293j01316j38549
14332b65691j26803Q0617J32016l5849n6785R7133K12330m6986O1194Q4340q7151
14321D8365r9801P3253n8917j79651n2744K57940k8398J4781l4844p201J31106
14310F3889j32245l8021j0312j6130Q2730K499o9573R2890R8949j2069j50046
$$ y = [138751, 119779, -4582, 46174, 36010, 57072, 75277, 15656, 32576, 39489, -131255, -190707, -124342, 17265, 102790, 40106, -141220, -160745, -66708, -127657, -137842, -56443, 110019, 215199, 105877, 98488, 185614, 113693, 51358, 68413, -56327, -163447, -204023, -296147, -272937, -145223, 40718, 125257, 152030, 167416, 181870, 121690, 125325, 170249, 150665, 49752, 25500, 59783, -38279, 113611, -77167, -129119, -25826, -127142, -265691, -392494, -311877, -179861, -215710, -272495, -175362, 36968, -10018, 51176, 135516, 48365, -51436, 21817, -37100, -216751, -269495, -11555, -39953, -25172, -60016, -67217, 63889, -68356, -106377, -116689, -132819, -50089, -47590, -117163, -24273, 74676, 62607, -87439]
14299h7439j27743K8164R9128p2327N4121K394J3839P5488J33742j01225J4849
14288C2991J2018N1743n0710j15900K47117J8357k41901o6836r7041m7437O7049
14277a90550q5322J01968O9271j19966j07722R6798N636J27375q55j95089J44114
14266a54342j13503j35947J10326J07079N9279N9118j37096L6804P342M0436L2541
14255h7963O5495q6777k02471m166O3200j64644J02711M6320J3188n4385N6778
14244b52714J41796J00J60126k9311j47375N2268N1927M2742j49594J82711J62552
14233B15228l1329o3069k06596j65456p3795J73172J46156N830M5826N9880R278
14222A15125K2002O4938j80788j75165J68682k8195P8288o1611k75114L9758K07219
$$ y = [-87439, -215182, -187018, -87890, -160217, -106096, -103702, -89863, -14375, 119367, 18142, 32991, 45009, 96752, 46042, -69858, 177259, 195616, -46285, -113121, -210162, -257599, -190550, -275872, -173904, -104633, -224599, -332321, -235523, -229887, -102512, -103367, -298456, -154342, -267845, -403792, -293466, -186387, -127108, -67990, -205086, -168282, -160940, -120504, -87963, -22468, -109245, -311716, -315882, -252682, -417326, -314615, -268295, -255107, -309492, -252714, -110918, -110818, 49308, 19997, -127378, -75110, -23183, 19559, -130035, 52676, 215228, 183899, 120830, -85766, -251222, -325017, -151845, -5689, 141, 45967, 105847, 115125, 137127, 202065, 21277, -153888, 14794, -13401, 64887, 3276, -271838, -232080, -24861]
14211b4861J05703j06454p7038j17947Q4736P8447L846K56433O5111j31291J60753
14200B97438p758k18877j4363m9432r8904o4243j4837q9010R4875M8909n6194
14189a72396r1901J11918J3612J03589k9888l2003J299K9469n5314K2712O7102
14178c1801Q8159k0443R3585M8728j62719k3339J2316m9037j55607N7740J68151
14167B5733o6586L9585L1045m3918p411n1174O573J04281P5005p9387j47645p735
14155a21634k147n3796O2210m5889J59569Q0988k0901j02846j03367J30345J10136
14144I2668K0618q555r0686j42933j10328K2294J9603n3439O5747J81269J45179
14133A41437j20231p6224K2309M9119O9806r0775j8073q1613K335j9613k2466
$$ y = [-24861, 80842, -25612, -102650, -220597, -135861, -57414, -53568, 202865, 267976, 136685, 297438, 289680, 70803, 56440, 7008, -91896, -156139, -170976, -259986, -165111, -116202, -172396, -264297, -152379, -138767, -35178, -65066, -97069, -95770, -66301, -121615, -98903, -31801, 56358, 35915, 129500, 178228, 15509, -7830, 4486, -44551, -200158, -142418, 25733, -40853, -1268, 29777, -14141, -21552, -72726, -66153, 38128, 113133, 33746, -113899, -121634, -123781, -177577, -115367, -161256, -1687, 79301, 58400, -44446, -147813, -17468, 92668, 113286, 104731, 14045, -128888, -239216, -216922, -197319, -250758, -185011, -3742, 141437, 21206, -55018, -32709, 16410, 86216, -4559, -22632, -104245, -101910, -121523, -143989]
14122a43989Q4987K29879q4037j36980j56745m6856Q4666Q1202P1716l208p7134
14111i6499j39335r6615k2736O8552M8731Q4439K03760Q4006q40M871p6232M8740
14099A10842l0812P8788M0897l7703j363M6519N9447J35132L0375R7695Q0637
14088F10454j98447k75876j21943j09655O576j01575m3913l5827o3632K5387J01630
14077b06821Q7152M3553j217k1968n70o1869R2261K2367o0510R1593L9572j19568
14065i6025O4543J1873j89970K5296L3449Q1878l6978p8686o8904J87634J42933
14054G7043j03189j93452K9822J16602J0254O5147L1312R1266Q4153o06O6332
14043B74684Q9610P3063j27215r3757j48429j5818j33888j28468K16145P005N8846
$$ y = [-143989, -59002, 170877, 86840, -50140, -206885, -253741, -169075, -87873, -16157, -19365, -96499, -235834, -332449, -355185, -286633, -237902, -153463, 50297, 134303, 133463, 138334, 62102, 110842, 80030, 158818, 199715, 162012, 160649, 207168, 266615, 401747, 432122, 529817, 610454, 412007, 136131, 14188, -95467, -88891, -190466, -234379, -270206, -333838, -308451, -206821, -119669, -76116, -77333, -99301, -99871, -161740, -69479, -47112, -107622, -16029, 23543, -96025, -31482, -19609, -209579, -184283, -150834, -68956, -105934, -184620, -253524, -65890, 77043, -26146, -219598, -189776, -73174, -62920, 2227, 33539, 124805, 208958, 208352, 274684, 364294, 437357, 310142, 216385, 67956, 52138, -81750, -210218, 5927, 12932, 71778]
14032G1778L0106q9597M5663r3229K2913j4714j26819N0228J54830R3839M9737
14021A94735j3026m0446M6496J00061j85584k8077J10875J03811P6048J09078
14011D73971j03552j61660l4948m2428R383j70293O839J13641o2103j7903J28458
14000A39405m7163j55519j02744q5806J22090J33136J05745k2575j94462J52322
13990D4429J63903p5620r9856k1678j13782O3785J60550K6994k9885J23692j82257
13979F0275k22593J946L2078m5434J5872J73985N9666P522k4137L9383k5125m2517
13967C0921N1051J74907q5859j25849o8711q323M4038j4763M529j19240j50452
13956b67751p0342J2096K66902P3955p2330M9613k1968K22106j7505o6849P3002
$$ y = [71778, 101884, 12287, 57950, -35279, -12366, -27080, -153899, -103671, 51159, 144998, 194735, 181709, 141263, 187759, 287820, 102236, 74159, 185034, 288845, 364893, 473971, 370419, 208759, 173811, 131383, 140766, -29527, -22688, 90953, 28850, 10947, 139405, 92242, -63277, -166021, -251827, -129737, 3399, 109144, 86569, -107893, 44429, 208332, 132712, 32856, 11178, -102604, -38819, 121731, 148725, 118840, 242532, 60275, -162318, -160372, -128294, -173728, -157856, 16129, 75795, 83317, 59180, 98563, 73438, 30921, 81972, 256879, 171020, 45171, -23540, -31863, 12175, -2588, 1941, -117299, -267751, -338093, -325997, -59095, 14860, -57470, -7857, -29825, 192281, 174776, 107927, 180929]
13945A80929o7921p6118R54j40573J1688O6945Q70J3059p9332J46493J69566j34353
13933I2207k48077j1541q6224L4567K00157p1700K4219K7584p7996J50161p8763
13922d5406l120J30820n0232n0540n5230l7703J00161n0662Q0279J10074k20585
13911i2144K5446M8612J5882J4812j43775O4039P8982j30489L2187N918m4023
13900a24553R9591O8036j39405n5911M1339J64418J01479l9685l1564j86623q5082
13889a87960n7623Q3479J43035J31689J2424j12595L717m1910r4312j04409k5158
13878b49623Q7322J20696J61601J27832j06494q3226r6600J56726L2029J2547
13868A62810J12998q5140M8027N2774j94876J41049J6674j22393j70776j48299
$$ y = [180929, 113008, 36890, 37844, -102729, -91041, -24096, -23226, -10167, -89499, 56994, 226560, 92207, -155870, -167411, -253635, -219068, -18911, -90611, -66392, -38808, -116804, 33357, -45406, -48526, 82294, 32062, -18478, -73708, -111411, -11250, -61912, 18367, 128441, -92144, -66698, -18086, -2204, 12608, -131167, -67128, 11854, -118635, -86448, -80530, -124553, -24962, 43074, -96331, -152242, -110903, 53515, 154994, 115309, 83745, -102878, -187960, -245583, -162104, -19069, 112620, 125044, 12449, 16166, -25744, -120056, -224465, -249623, -162301, -41605, 119996, 247828, 141334, 58108, -38492, 118234, 150263, 162810, 275808, 190668, 238695, 291469, 96593, 237642, 254316, 131923, -38853, -187152]
13858a87152O6973O2463J55681N2524q4597j19197M59L4507p2258o7961J38232
13847b0326J18185m8548l0930J88479O8042q3457k18140j45748N5885J69569m15
13836E2596q3578k7720m9421n0706Q0329N5525J9457J12893L6087m7379r4660
13825C423j25991M147Q4926l9118N2904M0708p2081j01068j58934J94312J50806
13814C4034J26264j84419Q096O2975j16966k3852J17811K76243q661j67890j3560
13803A10075L778K3621N524q9903n0123R631J70576N7737j20449k46552o3428
13792a89513P0985J6983J41729r6739k03846N2114J62351N3176j13757j48754
13782b55271P1708o3346j37937J09958J78536L1123N7365K73940M150j43585j68696
$$ y = [-187152, -120179, -57716, 97965, 150489, 65892, -53305, -52846, -18339, -90597, -158558, -20326, 97859, 49311, 18381, 206860, 274902, 191445, -26695, -172443, -116558, 53011, 52596, -30982, -58702, -108123, -158829, -78500, -22975, -3518, 109375, 145462, 98083, 3423, -122568, -118421, -33495, -72613, -19709, 20999, -51082, -152150, -311084, -116772, 34034, 160298, -24121, -16025, 46950, -70016, -93868, 23943, 300186, 291525, 123635, 110075, 113853, 137474, 142998, 53095, 2972, 12603, 183179, 240916, 120467, -126085, -189513, -118528, -101545, 40184, -56555, -260401, -208287, -45936, 7240, -106517, -255271, -183563, -246909, -384846, -274888, -96352, -65229, -7864, 266076, 270226, 126641, -42055]
13771d2055p5498j45633J5932J36819M3771K38420J02948p3233m5790K3989j90824
13760a1154j96344j67491r5064J74502J19892J22080J47549J32216m3169j27595
13750E5422p707L7607R7047k00850j57424Q321J69597J35226n9176r1293N4970
13739D1740k9115J7304p192R7039K3661j01431k5285l5048j11507p9791p167J4156
13727b02636J12558K71786N1090q8197M4086l4045j07383j28580r0677j44146
$$ y = [-42055, -117553, -263186, -247254, -110435, -66664, 171756, 274704, 201471, 155681, 179670, -11154, -207498, -374989, -470053, -295551, -175659, -53579, 93970, 226186, 183017, 55422, 47715, 85322, 182369, -18481, -175905, -167584, 2013, 137239, 78063, -13230, 41740, 12625, 29929, 22737, 119776, 143437, 42006, 16721, -18327, -129834, -209625, -216792, -202636, -90078, 181708, 232798, 144601, 188687, 154642, 47259, -81321, -171998, -316144]
$$ [...]
##END NTUPLES=NMR SPECTRUM
##END=
