##TITLE=Analysis number 329190
Compound Code cc 11513
Book Reference lab3
Project Code adrs
Chemist Name stores
##JCAMPDX= 6.0         $$ Bruker NMR JCAMP-DX V2.0
##DATA TYPE= NMR SPECTRUM
##DATA CLASS= NTUPLES
##ORIGIN= Bruker BioSpin GmbH
##OWNER= nmr
$$ XWIN-NMR		Version 3.5
$$ Wed Aug  8 11:24:18 2007 GMT Daylight Time (UT+1h)  MAYBRIDGE\nmr@NMR_250MHZ
##.OBSERVE FREQUENCY= 250.131544655141
##.OBSERVE NUCLEUS= ^1H
##.ACQUISITION MODE= SIMULTANEOUS (DQD)
##.ACQUISITION SCHEME= undefined
##.AVERAGES= 16
##.DIGITISER RES= 18
##SPECTROMETER/DATA SYSTEM= dpx250
##.PULSE SEQUENCE= zg30
##.SOLVENT NAME= CDCl3
##.SHIFT REFERENCE= (INTERNAL, CDCl3, 0, 16.522)
##AUDIT TRAIL= $$ (NUMBER, WHEN, WHO, WHERE, WHAT)
$$ ##TITLE= Audit trail, XWIN-NMR		Version 3.5
$$ ##JCAMPDX= 5.01
$$ ##ORIGIN= Bruker BioSpin GmbH
$$ ##OWNER= nmr
$$ C:\u/data/dgb/nmr/ADRS/280/pdata/1/auditp.txt
$$ ##AUDIT TRAIL=  $$ (NUMBER, WHEN, WHO, WHERE, WHAT)
(   1,<2007-08-08 11:23:48.25 +100>,<MAYBRIDGE\nmr>,<NMR_250MHZ>,
      <created by zg, POWCHK disabled, PULCHK disabled
       configuration hash MD5:
       76 6E 9A 78 1E 09 19 81 EC 84 63 8F B0 6A 59 2D
       data hash MD5: 64K
       94 54 50 54 4B B0 09 CD 7F B4 33 E8 9F 36 E4 EA>)
(   2,<2007-08-08 11:24:06.92 +100>,<MAYBRIDGE\nmr>,<NMR_250MHZ>,
      <Start of raw data processing
       ef LB = 0.3 FT_mod = 6 PKNL = 1 SI = 32K 
       data hash MD5: 32K
       23 34 83 F0 E3 F2 2A 8F CB D8 83 8D 24 1F 1D AE>)
(   3,<2007-08-08 11:24:08.60 +100>,<MAYBRIDGE\nmr>,<NMR_250MHZ>,
      <apk 
       data hash MD5: 32K
       CD C9 A2 93 FF 29 F6 AA C5 F0 4D F0 ED BF 5D 6F>)
(   4,<2007-08-08 11:24:09.61 +100>,<MAYBRIDGE\nmr>,<NMR_250MHZ>,
      <abs ABSG = 5 
       data hash MD5: 32K
       18 52 1C 93 5C 7C 8A 0A 8F DC CF C3 36 8F 91 30>)
$$ ##END=
$$ 
$$ hash MD5
$$ 0C 9A 4F E8 EE 86 CF 6E 0B BD EE A3 E1 59 B7 8D
##$RELAX= 
##$RELAX= 
##$RELAX= 
##$RELAX= 
##$RELAX= 
##$RELAX= 
##$RELAX= 
$$ Bruker specific parameters
$$ --------------------------
##$DU= <C:\u>
##$EXPNO= 280
##$NAME= <ADRS>
##$PROCNO= 1
##$TYPE= <nmr>
##$USER= <dgb>
##$AMP= (0..31)
100 100 100 100 100 100 100 100 100 100 100 100 100 100 100 100 100 100 
100 100 100 100 100 100 100 100 100 100 100 100 100 100 
##$AQSEQ= 0
##$AQ_mod= 3
##$AUNM= <au_zg>
##$AUTOPOS= <11 >
##$BF1= 250.13
##$BF2= 250.13
##$BF3= 250.13
##$BF4= 250.13
##$BF5= 500.13
##$BF6= 500.13
##$BF7= 500.13
##$BF8= 500.13
##$BYTORDA= 1
##$CFDGTYP= 0
##$CFRGTYP= 5
##$CHEMSTR= <none>
##$CNST= (0..31)
1 1 145 1 1 1 1 1 1 1 1 1 1 1 1 1 1 1 1 1 1 1 1 1 1 1 1 1 1 1 1 1 
##$CPDPRG= <>
##$CPDPRG1= <>
##$CPDPRG2= <>
##$CPDPRG3= <>
##$CPDPRG4= <mlev>
##$CPDPRG5= <mlev>
##$CPDPRG6= <mlev>
##$CPDPRG7= <mlev>
##$CPDPRG8= <mlev>
##$CPDPRGB= <>
##$CPDPRGT= <>
##$D= (0..31)
0 1 0 0 0 0 0 0 0 0.06 0 0 0 0 0 0 0.0002 0 0 0 0 0 0 0 0 0 0 0 0 0 0 
0 
##$DATE= 1186568620
##$DBL= (0..7)
120 120 120 120 120 120 120 120 
##$DBP= (0..7)
150 150 150 150 150 150 150 150 
##$DBP07= 0
##$DBPNAM0= <>
##$DBPNAM1= <>
$$ [...]
##$SUBNAM7= <"">
##$SUBNAM8= <"">
##$SUBNAM9= <"">
##$SW= 20.6930455092707
##$SWIBOX= (0..15)
0 0 3 0 0 0 0 0 0 0 0 0 0 0 0 0 
##$SW_h= 5175.983436853
##$TD= 65536
##$TD0= 1
##$TE= 297.16
##$TE2= 300
##$TE3= 300
##$TEG= 300
##$TL= (0..7)
0 120 120 120 120 120 120 120 
##$TP= (0..7)
150 150 150 150 150 150 150 150 
##$TP07= 0
##$TPNAME0= <>
##$TPNAME1= <>
##$TPNAME2= <>
##$TPNAME3= <>
##$TPNAME4= <>
##$TPNAME5= <>
##$TPNAME6= <>
##$TPNAME7= <>
##$TPOAL= (0..7)
0.5 0.5 0.5 0.5 0.5 0.5 0.5 0.5 
##$TPOFFS= (0..7)
0 0 0 0 0 0 0 0 
##$TUNHIN= 0
##$TUNHOUT= 0
##$TUNXOUT= 0
##$USERA1= <user>
##$USERA2= <user>
##$USERA3= <user>
##$USERA4= <user>
##$USERA5= <user>
##$V9= 5
##$VALIST= <valist>
##$VCLIST= <CCCCCCCCCCCCCCC>
##$VD= 0
##$VDLIST= <DDDDDDDDDDDDDDD>
##$VPLIST= <PPPPPPPPPPPPPPP>
##$VTLIST= <TTTTTTTTTTTTTTT>
##$WBST= 1024
##$WBSW= 4
##$XGAIN= (0..3)
0 0 0 0 
##$XL= 0
##$YL= 0
##$YMAX_a= 588749
##$YMIN_a= -475015
##$ZGOPTNS= <>
##$ZL1= 120
##$ZL2= 120
##$ZL3= 120
##$ZL4= 120
##$ABSF1= 16.522
##$ABSF2= -4.171173
##$ABSG= 5
##$ABSL= 3
##$ALPHA= 0
##$AQORDER= 0
##$ASSFAC= 0
##$ASSFACI= 0
##$ASSFACX= 0
##$ASSWID= 0
##$AUNMP= <proc_1d>
##$AZFE= 0.1
##$AZFW= 0.1
##$BCFW= 0
##$BC_mod= 0
##$BYTORDP= 0
##$COROFFS= 0
##$CY= 12.5
##$DATMOD= 1
##$DC= 0
##$DFILT= <>
##$DTYPP= 0
##$F1P= 14.0000005364418
##$F2P= -0.99999901652339
##$FCOR= 0.5
##$FTSIZE= 32768
##$FT_mod= 6
##$GAMMA= 0
##$GB= 0
##$INTBC= 1
##$INTSCL= 1
##$ISEN= 128
##$LB= 0.3
##$LEV0= 0
##$LPBIN= 0
##$MAXI= 10000
##$MC2= 0
##$MEAN= 0
##$ME_mod= 0
##$MI= 0
##$NCOEF= 0
##$NC_proc= -3
##$NLEV= 6
##$NOISF1= 0
##$NOISF2= 0
##$NSP= 0
##$NTH_PI= 0
##$NZP= 0
##$OFFSET= 16.522
##$PC= 1
##$PHC0= -47.41668
##$PHC1= 8.539804
##$PH_mod= 1
##$PKNL= yes
##$PPARMOD= 0
##$PSCAL= 4
##$PSIGN= 0
##$REVERSE= no
##$SF= 250.13
##$SI= 32768
##$SIGF1= 0
##$SIGF2= 0
##$SINO= 400
##$SIOLD= 32768
##$SREGLST= <1H.CDCl3>
##$SSB= 0
##$STSI= 32768
##$STSR= 0
##$SW_p= 5175.98343685301
##$SYMM= 0
##$S_DEV= 0
##$TDeff= 65536
##$TDoff= 0
##$TI= <Analysis number 999999
Compound Code 99
Book Reference 9
Project Code 9>
##$TILT= no
##$TM1= 0
##$TM2= 0
##$TOPLEV= 0
##$USERP1= <user>
##$USERP2= <user>
##$USERP3= <user>
##$USERP4= <user>
##$USERP5= <user>
##$WDW= 1
##$XDIM= 32768
##$YMAX_p= 391578962
##$YMIN_p= -53437
$$ End of Bruker specific parameters
$$ ---------------------------------
##NTUPLES= NMR SPECTRUM
##VAR_NAME=  FREQUENCY,     SPECTRUM/REAL,   SPECTRUM/IMAG
##SYMBOL=    X,             R,               I
##VAR_TYPE=  INDEPENDENT,   DEPENDENT,       DEPENDENT
##VAR_FORM=  AFFN,          ASDF,            ASDF
##VAR_DIM=   32768,         32768,           32768
##UNITS=     HZ,            ARBITRARY UNITS, ARBITRARY UNITS
##FACTOR=    0.157963299565203, 1,           1
##FIRST=     4132.6476996994, 0,             0
##LAST=      -1043.33573715361, 0,           0
##MIN=       -1043.33573715361, -53437,      0
##MAX=       4132.6476996994, 391578962,     0
$$ Real data points
##PAGE= N=1
##DATA TABLE= (X++(R..R)), XYDATA
$$ [...]
18822A02457K2111J6022K5613M5777P5940J09834J04957L6817l5358p1648m0720
18811C91802P627O4648Q8079K4523n9475j13115j07182p2655m9016m5664m5588
18800H3984j3729M412m999M142J3157o550j7180l015N318j067j2875n678p304
18787C8616j0997J8287p389q998J2110j958j2108j832J2752Q208m616j627j5979
18774B4469l324J7987K0265J9812Q673L0952N0006L0973k5542l3243k1535p055
18762A12438K254p269j2348j9200r140l734l239k1017j978n947l884J846n085
18749B3697k988L420j4112p215J8391J7256M091Q996P173M343j0565j2938K753
18736D2302k842j4673j1857R442j814o80J290J1196J0320L61R791q756j9713k937
$$ y = [102457, 124568, 140590, 166203, 211980, 287920, 397754, 502711, 539528, 504170, 432522, 391802, 399429, 464077, 552156, 576679, 517204, 404089, 296907, 224252, 175236, 129572, 83984, 70255, 74667, 69668, 73810, 86967, 80417, 63237, 60222, 65540, 64473, 51598, 45920, 38616, 27619, 45906, 38517, 29519, 41629, 39671, 27563, 25731, 38483, 46691, 42075, 40448, 24469, 21145, 39132, 59397, 79209, 87882, 118834, 168840, 199813, 174271, 141028, 119493, 112438, 114692, 107423, 95075, 75875, 66735, 63001, 59762, 38745, 36767, 30820, 26936, 28782, 23697, 20709, 24129, 10017, 2802, 21193, 38449, 42540, 51536, 58709, 63052, 52487, 39549, 42302, 39460, 24787, 12930, 22372, 20558, 19878, 21168, 32364, 42684, 43045, 52836, 44080, 24367, 21430]
18722B1430J3250M624l053K752R387R9n293j1438O643M840M739J2772K1248j2443
18708F9557R75j5545o680p493K0278R034L995J0641J8237J2642K4278L3273p265
18695A65927j0870j3932n107j1398J0062J7741J3168q414j0710l0419k4779q092
18683H3177J1008M841N335J318N534J1184J3354J3760L5162K3762p38j3150p541
18670A87006j5364l03R754L2148K8891K923j7707k7839n731J1381K0602K8196
18658B53957M2783N2929N9059M8229N7743M8581k871l0119l6083m4107o6804p1229
18646C12068n7396m0615k2943l3731k2530j3882q37j3729o662K350Q013N54J4493
18633A25153o33j424j963j537N413l118k6763j2667r196l299J1469k719L362q472
$$ y = [21430, 34680, 39304, 36251, 39003, 48390, 48489, 43196, 31758, 38401, 43241, 47980, 60752, 82000, 69557, 70532, 54987, 48307, 40814, 61092, 70126, 74121, 84762, 102999, 115641, 139919, 173192, 165927, 155057, 141125, 136018, 124620, 134682, 152423, 165591, 157177, 146467, 116048, 91269, 83177, 94185, 99026, 104361, 105679, 111213, 122397, 135751, 149511, 184673, 208435, 207697, 194547, 187006, 171642, 171339, 181093, 213241, 242132, 245055, 227348, 199509, 193778, 205159, 225761, 253957, 296740, 349669, 408728, 456957, 514700, 563281, 560410, 530291, 494208, 450101, 383297, 312068, 254672, 214057, 191114, 157383, 134853, 120971, 120134, 106405, 99743, 102093, 110106, 110660, 125153, 124520, 123096, 121133, 119596, 125009, 121891, 95128, 82461, 73265, 69966, 81435, 78716, 82078, 73606]
18619G3606j2192l723J2694J2879J4766J604J162r628q862k322J032j2804k113
18606F6099j947N720J1656j4578L001J6474K7902L76K188j573N551j1333J72N392
18592A15100j228P344K404R852l451r975O288m327j0462J2610R424K0905J1411
18579A65895r248O355J4742j2625J74M928J7703L7408M2946J5346k0438n6547
18567B06639n3510J5401M8953M0227M2733K964l6867l2999j3822l04J2605M36
18555B32456N306m158q932J4860K0641K6642M4649M7852M6384J4727N055L2961
18543D78443Q1251J91000K88604K93833Q1923j34056j96935j26592J0646J51797
18533A119914K16937J00235j14480k33664k21373j76927j24218p0213k4468J566
$$ y = [73606, 61414, 57691, 70385, 83264, 98030, 99634, 100796, 91168, 82306, 79984, 81016, 68212, 66099, 64152, 69872, 81528, 66950, 69951, 86425, 114327, 114703, 116891, 115318, 120869, 109536, 109708, 115100, 113872, 121216, 123620, 133472, 130021, 120046, 126334, 122007, 111545, 124155, 133579, 154484, 165895, 156647, 163002, 177744, 165119, 165293, 170221, 187924, 225332, 268278, 283624, 263186, 206639, 153129, 168530, 217483, 257710, 300443, 303407, 266540, 233541, 219719, 219415, 232020, 232456, 237762, 233604, 224672, 239532, 260173, 286815, 331464, 379316, 425700, 440427, 445482, 478443, 559694, 750694, 1039298, 1333131, 1415054, 1280998, 1084063, 957471, 968117, 1119914, 1336851, 1437086, 1322606, 1088942, 867569, 690642, 566424, 496211, 471743, 473309]
18523D73309J0428L8943N0306P9458J41030K35426K78962J72976m5440j54494
18513A280904j35175m0641J01851K21525K00520l7655k24312k61984k07774j24079
18503G73180r2009o8507j5019p396r566J4735K557O080J0113N762J9480L0954
18491F70364L0307L4915J2308Q92k066J6408N0203Q4511Q9932J45777K24351K56266
18479A614168J39403m1003j27234q3941L1899J62230K62500J92854K970j08218
18469B045628p0054K4001J36227K41387L59335L80814L37168M33229N68283M62587
18459D918605L77817N33876P66691P62393O88811Q55200J187592J730848K800749
18450A4622582M756653Q237639J4669897K4060849K5196411M508251j6226628
$$ y = [473309, 483737, 522680, 572986, 652444, 793474, 1028900, 1307862, 1480838, 1435398, 1280904, 1145729, 1105088, 1206939, 1428464, 1628984, 1591329, 1367017, 1105033, 897259, 773180, 681171, 612664, 597645, 590249, 580683, 595418, 597975, 604055, 614168, 619930, 639410, 670364, 700671, 735586, 747894, 748786, 746720, 763128, 813331, 897842, 987774, 1133551, 1357902, 1614168, 1753571, 1712568, 1585334, 1501393, 1533292, 1695522, 1958022, 2150876, 2153846, 2045628, 1975574, 1999575, 2135802, 2377189, 2736524, 3117338, 3454506, 3887735, 4456018, 4918605, 5296422, 5830298, 6596989, 7359382, 8048193, 8903393, 10090985, 11821833, 14622582, 19379235, 27616874, 42286771, 66347620, 91544031, 96052282, 79825654]
18443G9825654j8052677r157076L130053J6571542K5345103J1636375j5795892
18436I3503082k5959753k1199636j2990377p151078l966884j982452o19522K46322
18428A9879702J147249K854806O136220J2150017K1824850K8667104J4379663
18421A07039611j2083667k0917620j4233709k045593J1724869K4209049J9671636
18414A13364576p892101k6338048k5328593j7467598j0555943o381633m002640
18407A5398020k631660j743107j243989j104430j030107q27469o50194n42251
18399E624813m68165m00887l01421j76679j70167k66725l60317l42354j85919
18390B952179J8767J38122J319k60546l54243l15086k21590j06282n607L2182
$$ y = [79825654, 61772977, 52615901, 55745954, 72317496, 97662599, 109298974, 93503082, 67543329, 46343693, 33353316, 26202238, 22235354, 20252902, 19633380, 19879702, 21026951, 23881757, 30017977, 42167994, 63992844, 92659948, 107039611, 94955944, 74038324, 59804615, 57759022, 69483891, 93692940, 113364576, 105472475, 79134427, 53805834, 36338236, 25782293, 19400660, 15398020, 12766360, 11023253, 9779264, 8674834, 7644727, 6817258, 6167064, 5624813, 5156648, 4755761, 4454340, 4277661, 4107494, 3840769, 3480452, 3138098, 2952179, 2970946, 3109068, 3110387, 2849841, 2495598, 2180512, 1958922, 1852640, 1847033, 1879215]
18380A879215k6359j09982j73000j76902j30785p8188m8591j5902k3618k8565
18370A067323l8937n5021l4955k5001l4328k6328j1461k685j2295j8306l0667
18359G77339l3536k546L9508L7274L4325P649l0651o3291o6869k3218J8812M1818
18347G36614K5848M808j1132k9756j7067j0824r431J6703M1972N3517Q6716J12833
18335A000801J65373K40143K62212J30920m6079j01529m9157N0293J48645J85075
18325A986697P2587j08716k01143j48505p2743k0919J6210n048o2916j13312j18656
18314A223536n8995J1511M4898k310q7843j07993m4985n653L1075Q2353J41004
18303A226598J88957K70615L28425K22494K3665q5604j4212J35996K52154L02168
$$ y = [1879215, 1852856, 1742874, 1569874, 1392972, 1262187, 1183999, 1135408, 1119506, 1095888, 1067323, 1028386, 973365, 938410, 913409, 879081, 852753, 841292, 838607, 826312, 808006, 777339, 743803, 741257, 780765, 818039, 852364, 860013, 829362, 766071, 699202, 675984, 694796, 736614, 762462, 767270, 756138, 726382, 709315, 698491, 689060, 705763, 747735, 801252, 887968, 1000801, 1166174, 1406317, 1668529, 1799449, 1753370, 1651841, 1602684, 1652977, 1801622, 1986697, 2059284, 1950568, 1749425, 1600920, 1528177, 1507258, 1523468, 1518420, 1455504, 1342192, 1223536, 1164541, 1176052, 1220950, 1218640, 1130797, 1022804, 977819, 972166, 1003241, 1085594, 1226598, 1415555, 1686170, 2014595, 2237089, 2260754, 2175150, 2160938, 2296934, 2549088, 2851256]
18293B851256K24340P465k00763k13870o6894R2270J95020K80638K63600O0942
18283C494004r9552j7902J03962P0013j9232m0363O0792K04441L48536M37543
18273D542242M37057M94181O89365J066542J673304K497255L653904N736031R949680
18264C0739561J7467074K4458091J9200309K176789j4237033j6554526q535407
18257E4714858L091278J4478342J6592053L998042j3261768k1501008j8008272
18250D0103525j1727179o861578m201784k887383k072264j391833p77086l55787
18242I828631p8531P5346J63365L71134Q38921J599917K535134L677566N683326
18233B4694809R898324J7911104K7049509K4350657O238048j4160977k0166623
$$ y = [2851256, 3075596, 3083061, 2882298, 2668428, 2601534, 2693804, 2888824, 3169462, 3433062, 3494004, 3394452, 3376550, 3480512, 3550525, 3531293, 3490930, 3551722, 3756163, 4104699, 4542242, 4979299, 5473480, 6162845, 7229387, 8902691, 11399946, 15053850, 20789881, 30739561, 48206635, 72664726, 91865035, 94041824, 79804791, 63250265, 54714858, 57806136, 72284478, 88876531, 92874573, 79612805, 58111797, 40103525, 28376346, 21514768, 17312984, 14425601, 12353337, 10961504, 10184418, 9828631, 9750100, 9825446, 9988811, 10359945, 11198866, 12798783, 15333917, 19011483, 24694809, 34593133, 52504237, 79553746, 103904403, 110142451, 95981474, 75814851]
18226G5814851j2337515N68840J4015058J9119593P350895j2012220k3909918
18219F8609584k1600191j4648192q755343n396887l682448k680627j958224j367784
18211H519888r62105p27211o36305n46549m72601l40128j22084N1249J3805j57133
18201D620826l22585l71677l51641k77026j49311r1378r4280j76071k13895k43467
18191B329495k69898k56517j97513j42898r7663q1817o4400o3655l3783l9076
18181A082275n9015l7431j9587j8920k7922l1514l5145l1212l6636l0774k5495
18170G28624p545n159j4266N207j8858l2377k8981k1194N058O027j7971j8578
18158E79987k137R208M879o375l1151j8161O60K591J3035J3166J3316J0931k2035
$$ y = [75814851, 63477336, 64046176, 78061234, 97180827, 104531722, 92519502, 68609584, 47009393, 32361201, 23605858, 18208971, 14526523, 11845896, 9887672, 8519888, 7557783, 6830572, 6194267, 5647718, 5175117, 4834989, 4712905, 4764154, 4777959, 4620826, 4298241, 3926564, 3574923, 3297897, 3148586, 3057208, 2962928, 2786857, 2572962, 2329495, 2059597, 1803080, 1605567, 1462669, 1365006, 1283189, 1218789, 1155134, 1121351, 1082275, 1023260, 985829, 966242, 947322, 919400, 887886, 852741, 821529, 784893, 754119, 728624, 721079, 715920, 701654, 706861, 688003, 655626, 626645, 605451, 610509, 616536, 598565, 579987, 577850, 587058, 591937, 585562, 554411, 536250, 536910, 539501, 552536, 565702, 579018, 589949, 567914]
18145E67914j6828k3347j2826O119J4373J7609J3501L136J3554K7157M7472K7649
18133F85483r62j1412N460Q940Q000M0631M509l688J6386M0073L0825J7549J9811
18120H61605N0459N6327J16797J75668K65276M12181N91727R51413J639548L087486
18110H208487O018261R939241P334707m233235q676658p113824m175230k203152
18102E098597j302418q61720o17271m40726l21268k44809j82576j41272j16753
18093H69784r7188r3830p8754n8208m6396m5657m2217l3280j5610j1411l446j3601
18081C30186j7696j5160j3967k361M346N496K419L256j2597k9601j0787J5161
18069B58695J2237N973n244j0875j9975p372L2911N663J5828J1759j1786l7381
$$ y = [567914, 551086, 527739, 514913, 521032, 535405, 553014, 566515, 569651, 583205, 610362, 657834, 685483, 684521, 673109, 678569, 687509, 695509, 736140, 740649, 736961, 753347, 793420, 824245, 841794, 861605, 912064, 968391, 1085188, 1260856, 1526132, 1938313, 2530040, 3481453, 5121001, 8208487, 14226748, 24165989, 31500696, 27267461, 18590803, 11476979, 7301749, 5098597, 3796179, 2934459, 2317188, 1876462, 1555194, 1310385, 1127809, 986537, 869784, 772596, 678766, 600012, 541804, 495408, 449751, 407534, 374254, 358644, 347233, 343787, 330186, 312490, 297330, 283363, 281002, 285348, 290844, 293263, 296519, 283922, 254321, 243534, 258695, 270932, 276905, 271661, 260786, 240811, 233439, 266350, 272013, 287841, 299600, 287814, 250433]
18057B50433k0036m145J0403j1863j0911J56j928j2155j871k893O761J0993J9890
18044B32834j823k1194N490k225j9187m592J0023J4046j56r758p473j1574k740
18031A81671K430J1996J0640M222J862M438J0196J3217J4112j5663m033J1316
18019B46404j617j99k3988j901Q546r931J2099O447j4342r523k51M592N430K256
18005B24022O790K208j0522j3921j4164j8221j1028K0546K2438m905j0268o483
17993A86492j3330q744j3892o113j368J5473q00m301M490m63N993p400N492N590
17979A67119J9044J1341l828j1742J3638J9870L964n330p598N03r439r350j7442
17966A70750j3349l960R337K63n004m738k475L828p951O771R353J4572P35j8063
$$ y = [250433, 230397, 226252, 236655, 224792, 213881, 214037, 212109, 199954, 198083, 195190, 201951, 212944, 232834, 231011, 209817, 215307, 213082, 193895, 189303, 199326, 213372, 213216, 203458, 195985, 184411, 181671, 184101, 196097, 206737, 210959, 212821, 217259, 227455, 240672, 254784, 239121, 235088, 246404, 244787, 244588, 220600, 218699, 227245, 217314, 229413, 235860, 221518, 211995, 211744, 216336, 221766, 224022, 230812, 233020, 222498, 208577, 194413, 176192, 165164, 185710, 208148, 203243, 192975, 186492, 173162, 164418, 150526, 144413, 143045, 158518, 157718, 153417, 157907, 157444, 163437, 156037, 161529, 167119, 186163, 197504, 193676, 181934, 195572, 215442, 219406, 214076, 206478, 206981, 197542, 188192, 170750, 157401, 153441, 162778, 163041, 158037, 153299, 150824, 154652, 146701, 153472, 162825, 177397, 178132, 160069]
17952A60069q799J059R199J4825K919r527p086j7259J085P037L416R948J8087
17939A84973J7752J1669j8375o528m975L543l891K338P996R986j1070p054m528
17926A81836O369J0517n158P731K492l277j1155J6754M5129O7474Q7073J10952
17914E16737J08151K6162o5838r2392m0107K9005R1187J09434O9886j6038l2540
17903G03647l8916q3633r8122p0876k6211O688J0504J6901P925K3062P8363J44402
17891F73734J74027P9006k7581p0798n6086l4184K0695R4418J40935N9295m2603
17880A010858j02900j43023j40787j12325o5259l2378p545L444Q008M139j8851
17869D03381n4342n9737k9304j2702N729J7794J3855J3758J997L832k268l51J6223
$$ y = [160069, 151270, 152329, 161528, 176353, 179272, 169745, 162659, 145400, 146485, 153522, 156938, 166886, 184973, 202725, 214394, 196019, 189491, 184516, 188059, 184168, 186506, 194502, 204488, 193418, 186364, 181836, 188205, 198722, 193564, 201295, 203787, 200510, 189355, 206109, 251238, 318712, 405785, 516737, 624888, 651050, 585212, 492820, 452713, 481718, 572905, 682339, 752225, 736187, 703647, 664731, 581098, 482976, 412100, 385889, 392577, 403081, 419982, 427907, 450969, 529332, 673734, 847761, 926767, 899186, 828388, 772302, 738118, 758813, 853231, 994166, 1053461, 1010858, 907958, 764935, 624148, 511823, 446564, 414186, 406641, 410085, 418093, 422232, 403381, 349039, 289302, 259998, 247296, 253025, 270819, 284674, 298432, 300429, 304261, 301993, 301642, 317865]
17856C17865J6103K595J8538K3425Q413K6987N5658N6496N1560J1919k3207m7151
17844E19201m4673j0346j0333K732L4218M6548L3045j0326k6236l0225l3747j9367
17832D50491m54Q064J0661J9397L8967L2689M6607O9380R8938J13989J16040Q5460
17820A090229P4763J34156K55671L88475M27878L60876K64285K31288L89564O42824
17810D260009O25613K35714j18137l19406l78790l14034j55580n2762m2515m0386
17800C699726n6696j28976j55642p4341n116l965N8440J49192K13604L30711M87999
17789D514936P72374J156403J498081J572281J861774L035838N374845R656811
17781B9443343J7638675K9942648L2186151J556905k5513236k7141308j9008419
$$ y = [317865, 333968, 336563, 355101, 378526, 386939, 413926, 469584, 526080, 577640, 589559, 566352, 519201, 474528, 464182, 453849, 456581, 490799, 537347, 570392, 560066, 533830, 503605, 469858, 450491, 450037, 458101, 468762, 488159, 527126, 559815, 606422, 675802, 774740, 888729, 1004769, 1090229, 1164992, 1299148, 1554819, 1943294, 2371172, 2732048, 2996333, 3227621, 3617185, 4260009, 4885622, 5121336, 5003199, 4683793, 4305003, 3990969, 3835389, 3782627, 3740112, 3699726, 3643030, 3514054, 3358412, 3284071, 3278955, 3274990, 3333430, 3482622, 3696226, 4026937, 4514936, 5287310, 6443713, 7941794, 9514075, 11375849, 14411687, 19786532, 29443343, 47082018, 77024666, 109210817, 110767722, 85254486, 58113178, 39104759]
17774C9104759j0989093o524357m157131k812591j892320j196924o93461l34810
17766A0504072K4077L90302O12972Q57178J402462K468586M344144P571930J3340349
17757D1516072K3394379L1650266J4453405j6923958k4897602j8366657q358801
17750D2467104J23137R054827K0752706K6631941N216811k1129496k4878533j8331443
17742C9907054j0842128o616081m466740l207203k221294j419543q54534n84009
17734I695522l53061k5398J89516M70615R13124J773851L314263N866849J0353854
17725C2199135J8561156K7427738J6698538j3326487k4019201j9861550j2222767
17718B5456562p080981m384371k855641k023695j552936j166505q41689n45144
$$ y = [39104759, 28115666, 21591309, 17434178, 14621587, 12729267, 11532343, 10838882, 10504072, 10528149, 10918451, 11531423, 12388601, 13791063, 16259649, 20603793, 28175723, 41516072, 64910451, 96560717, 111014122, 94090164, 69192562, 50825905, 42467104, 42590241, 51645068, 72397774, 99029715, 104246526, 83117030, 58238497, 39907054, 29064926, 22448845, 17982105, 14774902, 12553608, 11134065, 10279531, 9695522, 9342461, 9317063, 9506579, 9977194, 10890318, 12664169, 15978432, 21845281, 32199135, 50760291, 78188029, 94886567, 81560080, 57540879, 37679329, 25456562, 18375581, 13991210, 11135569, 9111874, 7558938, 6392433, 5550744, 5005600]
17710E005600l05640k63441l36178l64447k68186q2035M8420j6679k37272l31577
17700B848565l05350k49349j96725j35362o9258l2896K6721J04357P4948r0294
17690A975357j80786j47178j10563r3079p7295o3272l4476L743P827j1652N203
17679A273829K0819J7310J1106J0453J4133L2317L7431L5407N2182O6782R4054
17668A665823J20361J34872J86855K22842J93776J12475N9329J20770J95176K75070
17658C287349L23138L59455L85819L99615L60833K70775K28936K71130L86926
17649F273976N80583Q12935R94604J142842J446810K076951L158271M950383Q117728
17640B9555083J3714199K1379346K4994950J7576171M151256k150803P205196
$$ y = [5005600, 4699960, 4436519, 4100341, 3735894, 3467708, 3385673, 3434093, 3417414, 3180142, 2848565, 2543215, 2293866, 2097141, 1961779, 1892521, 1859625, 1886346, 1990703, 2065651, 1975357, 1794571, 1647393, 1536830, 1443751, 1366456, 1303184, 1268708, 1272451, 1280278, 1268626, 1273829, 1294648, 1311958, 1323064, 1333517, 1347650, 1379967, 1417398, 1452805, 1504987, 1571769, 1665823, 1786184, 1921056, 2107911, 2330753, 2524529, 2637004, 2696333, 2817103, 3012279, 3287349, 3610487, 3969942, 4355761, 4755376, 5116209, 5386984, 5615920, 5887050, 6273976, 6854559, 7667494, 8662098, 9804940, 11251750, 13328701, 16486972, 21437355, 29555083, 43269282, 64648628, 89643578, 107219749, 111371005, 109220202, 116425398]
17633A16425398K6524594L6763691K0141047j1939039l2889372k8052160j0474711
17626A16499448J746775j688691j4712801k3905536k2591278j6226503j0397954
17619B8723460o714703m640985l306509k331360j597415j086606q47872q25903
17611G372107q36776o76312l86108j89798k08038m07107n61297m95786l16114
17602C294771j94120j92055k59248k71441k18773j54889j04211j20690j23260
17593A656084j12065j00304p2475m1765l6419m1756m9790l0408m1007n0169k4187
17582A055739l9813o8648p1954m4194k8429j9381j7892k6855l3716k8006k1366
17571F55485k3623j6965k9883k7905j1059L225r817j0762j9298k0533k6189Q330
$$ y = [116425398, 142949992, 179713683, 199854730, 187915691, 155026319, 126974159, 116499448, 118246223, 116557532, 101844731, 77939195, 55347917, 39121414, 28723460, 22008757, 17367772, 14061263, 11729903, 10132488, 9045882, 8198010, 7372107, 6535331, 5859019, 5472911, 5283113, 5075075, 4667968, 4106671, 3610885, 3294771, 3100651, 2908596, 2649348, 2377907, 2159134, 2004245, 1900034, 1779344, 1656084, 1544019, 1443715, 1371240, 1329475, 1293056, 1251300, 1201510, 1171102, 1130095, 1079926, 1055739, 1015926, 947278, 875324, 831130, 802701, 783320, 765428, 738573, 704857, 676851, 655485, 631862, 614897, 585014, 557109, 546050, 549275, 539458, 528696, 509398, 488865, 462676, 471006]
17559D71006K0081l244j1071k0350j4162k027Q314J0324O38p153l906M020J511
17546D53981j3423j5774N619J9257J5335L934j3227l0318p109j8650K043q392
17534C93276j5026k227J0182R444j1594j3309r143m637m410l809o128k938J0710
17521C50391j3364k9306j3758k602n773J0128K156q661J408O884L3280K0925p085
17508C44623M14l463k0228J3550J6326k843q575k1621k5479j5043j1377k8055
17496B38229j7437k2726k7290l502p315m263N260m323k948J717J328R068L724
17483A69522j6981j7193M141J2153J4745M07j2421k529k977J124R062P522J036
17470A67611m421k486k163n094J066j581k994K826j1686k0595l290J2749J7764
$$ y = [471006, 491087, 487843, 476772, 456422, 442260, 440233, 448547, 458871, 459509, 452356, 448450, 452470, 453981, 440558, 424784, 430403, 449660, 464995, 468929, 455702, 425384, 418275, 399625, 401668, 393276, 378250, 376023, 386205, 395649, 384055, 370746, 361603, 356966, 352556, 348747, 342619, 339681, 350391, 337027, 307721, 293963, 291361, 285588, 295716, 297872, 289211, 290619, 297503, 330783, 351708, 344623, 345037, 341574, 321346, 334896, 351222, 348379, 339804, 318183, 292704, 277661, 266284, 238229, 220792, 198066, 170776, 167274, 159959, 155696, 160956, 156633, 153685, 155402, 156730, 165798, 169522, 152541, 135348, 139489, 151642, 166387, 166794, 154373, 151844, 148867, 149991, 159053, 166575, 167611, 163190, 160704, 158541, 153447, 154513, 152932, 149938, 152764, 141078, 120483, 117193, 129942, 147706]
17457A47706K297j2240j1322r051P476J7708O339J3000K0458p717j5933J363J6076
17444A76160J5981K6993L9467L8156j8092m8127m4471k6679P823O130P866j0021
17432A71186j3994m442k554j458p063o634j978J0353Q7j2107j8576j0639K53j61
17418A02273l083J4290j301L982J2144N94J0540O172P691J2069J2405L9320O1467
17405B78563M1744L3519K7662P185K7108O6176Q8830P4873m852o9702p9517n6090
17393D35499k6450j5442l7738m6533m7379l1292l7164l0567J50l002m573l740
17381A51769j443M759R707Q4j5243J708p759j7154m941N406l008k825n559j9374
17367I6127j6964N914Q588r241n885N353l66k509K609m260l144O818R858L582
$$ y = [147706, 150003, 137763, 126441, 117390, 124866, 142574, 148913, 161913, 182371, 174654, 158721, 160084, 176160, 192141, 219134, 258601, 296757, 278665, 230538, 186067, 159388, 167211, 173341, 181207, 171186, 157192, 152750, 150196, 148738, 141675, 135041, 133063, 143416, 143503, 131396, 112820, 102181, 102434, 102273, 99190, 113480, 112179, 116161, 128305, 128899, 139439, 145611, 153302, 165371, 177776, 217096, 278563, 320307, 353826, 381488, 388673, 415781, 481957, 570787, 645660, 640808, 571106, 491589, 435499, 409049, 393607, 355869, 309336, 261957, 230665, 193501, 162934, 163084, 160082, 155509, 151769, 150326, 155085, 164792, 164876, 149633, 151341, 143582, 126428, 121487, 126893, 123885, 121060, 115501, 96127, 79163, 85077, 93665, 84424, 78539, 83892, 83526, 81017, 83626, 79366, 76222, 83040, 92898, 96480]
17353I6480L337Q180j4842k590J3754L100j0099m177P879O471j1161r336j8653
17340F8343L147J0013N783j578L51l61J0830p308j352O349R158p068n613Q850
17326I9544J3402K2769K7517L7838N6921Q3007P4526O3397K6792J4477N2933J46297
17314G19420K05976J45085k059j34897j05572M684J31218J29265p720j48463j83092
17303G53845j34374p8958k5483l0983o6455p7455p4000n9043k0801k0407j7339
17292A48547j3493k3745j0705l097m568r008k1835n637O002J0096Q691K369j2796
17279G0821j5470o63J0039l955M666O294J0294J5599j0284j6308k479j4367j1962
17266D2225m065j683K123J9848J1088K405J0281j5168j2086J250j4779m593J0931
$$ y = [96480, 99817, 107997, 93155, 90565, 104319, 107419, 97320, 93143, 101022, 107493, 96332, 86996, 68343, 71490, 81503, 87286, 85708, 86059, 85698, 96528, 89220, 87868, 94217, 103375, 96307, 90694, 99544, 112946, 135715, 163232, 201070, 257991, 340998, 415524, 478921, 505713, 520190, 573123, 719420, 925396, 1070481, 1068422, 933525, 827953, 832637, 963855, 1093120, 1085400, 936937, 753845, 619471, 540513, 515030, 484047, 417592, 340137, 266137, 207094, 186293, 165886, 148547, 135054, 111309, 100604, 97507, 92939, 83931, 62096, 56459, 62461, 72557, 81248, 83617, 70821, 55351, 54688, 64727, 60772, 65438, 71732, 82026, 97625, 87341, 71033, 68554, 54187, 42225, 38160, 36477, 38600, 58448, 69536, 71941, 82222, 67054, 54968, 56218, 41439, 36846, 47777]
17253D7777N023Q80o388Q901Q375K821J8525P824J5383L2383O4885J17242J49695
17240D73326J04219l7971j16550j14755r4942m3005k0665j0410n228k3305j7929
17229I2785k721q190J1562K2054J751L392R957J4801M353K9251Q0672J40575J29936
17216E30178L3368o2468q8102p9640l5317P127N8405J16625R9204j2459j04552
17205D62369j29188q5823m2545k7951k8064k9218k046o833j3856j5946l687P115
17193H4327m662M555J8617J7321J2526M0852O4846J24470J23803K0728p2995j13795
17181C20593p7434n3090l6212k7353j6088k5435r712M434j5946m822M14L981J996
17168F5326j0778l937j280K939p390j0285N3J5637Q33L558N768j4240j184j5973
$$ y = [47777, 52800, 53680, 47292, 56193, 64568, 67389, 85914, 93738, 109121, 141504, 206389, 323631, 473326, 577545, 539574, 423024, 308269, 213327, 170322, 149657, 139247, 134019, 110714, 92785, 90064, 81874, 93436, 115490, 117241, 120633, 130590, 145391, 149744, 178995, 259667, 400242, 530178, 563546, 501078, 412976, 333336, 298019, 305146, 363551, 480176, 579380, 566921, 462369, 333181, 247358, 204813, 176862, 148798, 119580, 117534, 110701, 96845, 80899, 77212, 84327, 79665, 84220, 102837, 120158, 132684, 173536, 238382, 362852, 486655, 507383, 434388, 320593, 243159, 190069, 153857, 126504, 110416, 84981, 75269, 79703, 63757, 58935, 59349, 63330, 65326, 54548, 50611, 49331, 52270, 44880, 34595, 34648, 50285, 51118, 54676, 60444, 46204, 45020, 29047]
17154B9047k985N185M75K171j2086n413J2366O121m46j828j3790n274j104N295
17140A7734R355J557j002j647m235j5069p670J7862P462o968M640K530Q322j593
17126C1278m360N38r674k07J3961k971O041O247o380o922k899K618k820J1461
17112C5911J4769L478m111n995o946n306q105O391k528L412p720l34L712N759
17098C2387L707k0399k0901K534Q661j572J3775O884k431J5503N474j8361q765
17085A6496q203m729q523P753Q311J4404L460o322N085l06N319n568J1885J5061
17071E4123j3484j1799r12r136Q255J7856o761k2142K401L738j2008J6450R584
17058C6165r237j896K2286Q417P806n166j8358j2979q25O946J8326R316P540J9630
$$ y = [29047, 26062, 31247, 31722, 33893, 21807, 16394, 28760, 34881, 34435, 32607, 18817, 13543, 12439, 17734, 27089, 28646, 27644, 25997, 21762, 6693, -977, 16885, 24347, 17379, 22019, 24549, 32871, 31278, 26918, 27456, 17782, 17575, 31536, 28565, 34606, 40853, 34473, 27551, 24652, 27270, 24450, 35911, 50680, 54158, 50047, 44052, 37106, 31800, 23695, 30086, 27558, 30970, 23250, 22916, 26628, 32387, 36094, 15695, -5206, -2672, 5989, 4417, 18192, 25076, 22645, 38148, 43622, 25261, 16496, 8293, 3564, -4959, 2794, 11105, 25509, 28969, 22647, 27732, 27426, 32745, 27177, 39062, 54123, 40639, 28840, 27928, 18792, 27047, 44903, 38142, 16000, 18401, 22139, 10131, 26581, 36165, 26928, 25032, 47318, 55735, 63541, 58375, 40017, 27038, 26213, 33159, 51485, 60801, 68341, 87971]
17044H7971K7141J9581L3976O9919J06586J19142J04832M3645O115L7412R3996
17033G50316J55167J14032j6040j38724j49938n8845j1510k8367o1990j13269
17023D40832j10530q3737n7382n9705k7663m772K079l325n438j9456q834j0799
17011E1270r852l495M983N09o847k201k888j126r768m713n116K107R218j0453
16997A1628R75J5142J906q83j1584k678j019p538l065J383Q757P242q896J3555
16983B4925O416k1651o857O134Q309O07p202k043J108K1816R755O817k4312j6590
16969G232m446Q992J0131L609l646j4058J561J8847K843L274j941L939K294K804
16955D1435j5665j8990J405L942J339N019q457m466N793J4701m686l414k124N126
$$ y = [87971, 115112, 134693, 168669, 238588, 345174, 464316, 569148, 612793, 618908, 656320, 750316, 905483, 1019515, 1003475, 864751, 714813, 655968, 644458, 616091, 554101, 440832, 330302, 246565, 189183, 129478, 101815, 97043, 99122, 95797, 90359, 70903, 62069, 51270, 41418, 37923, 42906, 43415, 36568, 34367, 31479, 30353, 20585, 15872, 10756, 12863, 22081, 11628, 12603, 27745, 29651, 28768, 17184, 14506, 13487, 5949, 2884, 4267, 13024, 20266, 11370, 24925, 31341, 9690, 2833, 8967, 17276, 17883, 10681, 8638, 9746, 31562, 41317, 48134, 23822, 7232, 2786, 11778, 21909, 25518, 21872, 7814, 9375, 28222, 31065, 34339, 32398, 36337, 38631, 41435, 25770, 6780, 8185, 12127, 13466, 18485, 10028, 5562, 11355, 26056, 21370, 17956, 15832, 20958]
16941B0958j2685l534J2058K494N462j7551r274p864M207J0465M408M460j3581
16928B3N060L904m767O101L066j30l516j853J365P067k25L899o875j8233N45Q905
16912D336J1879Lk678p054J5609J5366j323m759j749j376J776O967o486q460K014
16897B4065k414j2106j9093j5513J7185J3373O220l6m315P324m277j5294j4730
16884a9611L926J0992k881J2073K073l722O655q318J1627J4552J336J0354p896
16871C1160j033p55R523j1305j3950L45n41o11O57K839K520L903k535j780J0897
16856B9334p765k327J26l234n417o42j6444J274N035L859J788L647j524j6323
16842h613j2209M564J1657N322j143N463J0315J3593O699j0346p653l377l604
$$ y = [20958, 8273, 4739, 16797, 19291, 24753, 7202, -2072, -9936, -5729, 4736, 9144, 13604, 23, 5083, 8987, 4220, 10321, 13387, 13257, 9741, 7888, 9253, 16320, 16095, 19994, 13119, -5114, -4569, 4336, 16215, 16218, 13540, 6486, 22095, 37461, 36138, 31379, 29630, 28254, 30030, 36997, 30511, 22051, 24065, 21651, 9545, -9548, -25061, -7876, 5497, 11717, 11681, 7366, 14690, 10413, -4881, -19611, -15685, -4693, -7574, 4499, 6572, 2850, 9505, 1187, 12814, 27366, 28702, 39056, 31160, 30127, 29372, 38895, 27590, 13640, 13985, 13444, 12833, 13490, 16329, 18849, 22752, 20217, 18437, 29334, 21569, 19242, 19368, 16134, 10717, 10075, -6369, -5095, -60, 3799, 5587, 9234, 7710, -8613, -20822, -16258, -4601, 721, -422, 5041, 15356, 28949, 35648, 25302, 17649, 14272, 10668]
16829A0668p766J5768J926J0544O929k1286k6906j2306M539j893K73L927K4179
16816H596J1175Q103L366J846j5059j6142n246J6413j960N543p884r890N028O1
16802C950N458R816J446K347o076r367j1345l321J174J1090J434q634P862n308
16788E26K411P700j3255r9l244L859L412L124j056j885o834m764Q795J2790j0399
16773A081o939k57J1907l389O656j851n341m700n804p304J1923J9415J867l699
16759A3565l61r407J611m87M383o106m646O590J0718m618M427J3009j4345J0772
16745B5105j546j3831K402j4578m082j029L222J1222J4137n729j6212k006m397
16732g322J0491N729K273n48r048K0691J3460j2636j7948r715n303O126Q811j817
$$ y = [10668, 2902, 18670, 20596, 31140, 38069, 16783, -10123, -22429, -17890, -19783, -19510, -15583, 8596, 19771, 27874, 31240, 33086, 18027, 1885, -3361, 13052, 11092, 16635, 8751, -1139, 3889, 3950, 9408, 19224, 20670, 23017, 16941, 7574, -3771, -7092, -5918, 5172, 6606, -2028, 5834, 526, 2937, 10637, -2618, -2717, -5961, -2102, 1310, 4434, 3378, 1493, -5341, -10105, -1310, 11480, 1081, -5858, -6115, 5792, 2403, 9059, 7208, 1867, -2833, -8637, -15941, -4018, 15397, 17264, 13565, 13204, 3797, 5408, 4921, 9304, 3198, -1448, 5142, 15860, 11242, 15669, 28678, 14333, 25105, 23559, 9728, 12130, -2448, -6530, -7559, -4337, 6885, 21022, 15293, -919, -2925, -7322, 3169, 8898, 11171, 10623, 1575, 22266, 35726, 23090, 5142, -4573, -9876, -3750, 5061, 3244]
16718C244o772R772J2337P474j376m717q008L48N698J921j866q810L58O012j2321
16703C294O860N468j6547Q122J5178j2340j1772l449j2677L311K829J2649K77
16690A203j1217j8637J2457K735J2020J3653N062j4236r332P898J1220J089n399
16677H516m509l508O780L502m102J2759m639k0098j2117q990N221K4804K846j2884
16663f419M674P51K372K521K390N188L591P072o48m924k1394r996P608K1107o186
16648G707k466O857J882K665O241K533L87q996r888j0495J384J520l254L087J8143
16633A7307n83r20P60L013k306j67m133o128k1659j0050J0052R642o752j2321
16619b4245J0278P533k409j870k039j0186o292l322J7508J9765K1152N54j3749
$$ y = [3244, -3528, 6244, 18581, 26055, 24679, 19962, 11954, 12302, 18000, 19921, 18055, 9245, 9603, 15615, 3294, 10154, 15622, -925, 7197, 22375, 10035, -1737, -5186, -17863, -14552, -11723, 926, 1203, -10014, -28651, -16194, -13459, -1439, 12214, 17276, 3040, -6292, 1606, 12826, 13915, 8516, 4007, 499, 7279, 10781, 6679, 19438, 14799, -5299, -17416, -26406, -21185, 3619, 6465, -6419, -1745, -994, 1378, 3899, 6289, 11477, 15068, 22140, 21492, 16568, -4826, -14822, -7214, 13893, 7707, 5241, 12098, 13980, 16645, 22886, 25419, 25806, 16810, 6922, -3573, -2189, -669, -3923, -836, 17307, 16724, 15804, 16564, 19577, 17271, 17104, 12971, 6843, -14816, -24866, -14814, -5172, -11924, -24245, -13967, -6434, -8843, -10713, -12752, -22938, -29230, -32552, -15044, 4721, 25873, 26427, 12678]
16606A2678K779j425n992K674m966k564r951j8901J1619J0557j377p977j8288
16593c1134q904n102k004J3567K1676N8l116P527k200r800J5162M65K404J4135
16579A2734j283M86k095j4735J0675J3086j929N093P018L676m699j7449j5161
16566d583O851Q792P706J179P308p164j0136j6371L120K19j4989K346k005o130
16552b3857R13O592J2030m793N639M191k148p016j4012l163J4185J3231J813j7714
16538a4109q137N715q489J3256K9025L074l626j328J489K307o374N474J0830m057
16524B5050K200n269M823o169q416L713P611j014n19Q330p991j4548o579M580
16510E802j1218J50N793M765l549j434O41N622r57J0270j7127L035j0937j3964
$$ y = [12678, 15457, 14032, 8040, 10714, 5748, 3184, -6767, -25668, -14049, -3492, -4869, -12846, -31134, -40038, -45140, -47144, -33577, -11901, -11843, -14959, -7432, -9632, -19432, -4270, -3805, -1401, 12734, 11451, 11937, 9842, -4893, 5782, 18868, 16939, 22032, 29050, 32726, 28027, 10578, -4583, 2268, 11060, 18766, 19945, 27253, 20089, 9953, -6418, -3298, -3079, -18068, -15722, -17727, -23857, -22944, -16352, -4322, -9115, -3476, 715, -1433, -8449, -22461, -25624, -11439, 1792, 3605, -14109, -22246, -16531, -25020, -11764, 17261, 20335, 16709, 15381, 16870, 19177, 12803, 18277, 29107, 25050, 27250, 21981, 26804, 20635, 12219, 15932, 23543, 22529, 22010, 30340, 22349, 7801, 1222, 5802, -5416, -5266, 527, 5292, 1743, 309, 950, 6572, 5615, 15885, -1242, 1793, -9144, -23108]
16496b3108J0980O560p722n135L765M094J1072r73J867j8899O42p66o993P837
16482a6779J8176J171r72P489p598R479O984n679O121Q564J2947j3442m145r029
16468A3287o307k296m431J1065j0479j5214j1013P858k483L511J0603K052J441
16455b406R096J3528r031j1886m443n545l566R51j359q337J4565J2610K096j824
16441D449P073p624r986l81j84J5067j654Q014k479l742n098j3561o081L661J0548
16426a978J1844O333n723j3718j2350J0948J416J9617J1209J495j1063P400K593
16413B8023r887J407k391j1200P777Q693m729p510j840N736K194j5767m150l315
16399f959P226L240Q050r08j3656j493k568n816k172N794J516l405r832J0765
$$ y = [-23108, -12128, -5568, -13290, -18425, -14660, -10566, 506, -467, 1400, -17499, -16857, -17623, -24616, -16779, 1397, 2568, 1596, 9085, 1487, 10966, 17950, 12271, 18392, 26956, 39903, 26461, 22316, 13287, 6980, 4684, 253, 11318, 839, -14375, -25388, -17530, -20013, -16502, -5899, -3847, -2406, 6690, 20218, 11187, -699, -5142, -10687, -14253, -13302, -14661, -22998, -8433, 4177, 6273, 4449, 11522, 3898, -6088, -6469, -6653, 8414, 6760, 14774, 12295, 8553, 3455, -10106, -16187, -12526, -1978, 9866, 16199, 10476, -3242, -15592, -4644, -3228, 16389, 27598, 29093, 18030, 25430, 28023, 18136, 19543, 17152, 5952, 13729, 22422, 17693, 10183, 8343, 14079, 16273, 506, -3644, -6959, 267, 3507, 11557, 10649, -3007, -4500, -7068, -12884, -15056, -9262, -7746, -11151, -20983, -10218]
16385a0218R67p012K48m215P793J3388M553j664m862l971M705o27r809J572J2881
16370C729L500Q489j679J336m929j473n269P722p126j2126J421J8773q185j742
16356B441R89j3381J899r85N738R12m44N080L39Q622R064q111l434M904l948j984
16340G701j0820j9444J830J1560m549J399J400j6627k651O967J1122l777O528
16327i361o486Q908J7230n754r905O461R471l14j241L022p209m954m676n88q941
16312a4337n45m212m491J2266P067n033j5284n3J5528l175M858k389q045r843
16298b7688n987J8553M864l3j2490o838P745L521p321J1017j519P091J1093r280
16284g272j4747o169R691P592q697K898J1934L998k025N536O117J9265P895j5980
$$ y = [-10218, -9251, -16263, -16015, -20230, -12437, 951, 5504, 3840, -1022, -4993, -288, -915, -10724, -9152, 3729, 7229, 15718, 14039, 15375, 10446, 8973, 3704, 11426, 4300, -7826, -6405, 12368, 4183, 2441, 3430, -9951, -8052, -9037, -3299, -2387, -2831, 2249, 2588, 11210, 20274, 12163, 8729, 13633, 9685, 7701, -3119, -22563, -20733, -9173, -13722, -12323, -10923, -27550, -30201, -23234, -12112, -15889, -9361, -15847, -6939, 10291, 4537, -5368, 1093, 10564, 10250, 9009, 12031, 4822, -132, -4808, -5396, -14337, -14882, -19094, -23585, -11319, -4252, -9285, -24569, -24622, -9094, -12269, -7411, -9800, -17845, -27688, -33675, -15122, -10258, -10291, -22781, -29619, -21874, -18353, -25674, -14657, -16176, -9085, 2008, -7272, -22019, -28188, -18497, -10905, -19602, -16704, -4770, -772, -2797, 2739, 8856, 28121, 36016, 20036]
16270B0036k6190m813N930K323j7484j0013J9795O858m384J8569N000j6011j3388
16257a3772q823J3864R986j7333k705J1188O675M01p744r104K669J3631N339o43
16243C629n037J853R70k131j878l890L419R497k878r575J793N583p388O014j1713
16228a1732j84M099J6821l814j1122l343l19J0946p1j8054j1775O686L891L541
16214a4430Q418M611p236q537M282M174R586j1602R724J5787L127N348l405j0099
16200I748j1247l478Q391l315j8940j4142J1984R524J1013L637k929k68j1117
16187a1139m061l652J440J3981l861o549o064k640Q581K0038J0618k05r275j1679
16173d467o58J3764m334o643q307k143j828O818O086o236l36L778J764k661q738
$$ y = [20036, -6154, -10967, -5037, -2714, -20198, -30211, -10416, -3558, -7942, 10627, 15627, -384, -13772, -22595, -8731, 1255, -16078, -18783, -7595, -920, -519, -8263, -17367, -14698, -1067, 4272, 3629, -1408, 445, 1415, -716, -2594, -6484, -3065, 6432, 3554, -6021, -4228, 1355, -6033, -19, -11732, -11916, -7817, 9004, 5190, -5932, -9275, -9594, 1352, 1281, -16773, -28548, -21862, -17971, -14430, -6012, -1401, -8637, -17174, -12892, -8718, 868, -10734, -1010, 14777, 17904, 23252, 19847, 9748, -1499, -4977, 3414, 99, -18841, -32983, -20999, -11475, -462, 3175, 246, -22, -11139, -15200, -18852, -17412, -3431, -7292, -13841, -19905, -22545, -13964, 6074, 16692, 16487, 7212, -4467, -5125, 8639, 4305, -2338, -10645, -12788, -14616, -7798, -1712, -7948, -8284, -4506, -2742, -5403, -14141]
16158a4141J2734J3234Q331q901P93m760p538M535J1191L54P754p532k869Q994
16144B2179P570n680q702Q01n998p606o685l602P132J860q156m435L016J375m756
16129a1687k055J0727J2118j439l824q008M135P614N113j1400j1487J5267J6684
16116B1758j979j7892j2591k866M037n340j232O997j1067j1051n234R550J2850
16103a4060L184P185O798j0155r470p810L343M558R433J3838p288j7579N27n907
16089b3403L051J891n18J0744N938k1687j1807J41q43n469p01J4272J8025J3498
16075C132P52n23k131J100K243N942j1285m658R09j0381n566m043J1127J3172
16061b10M712n066j519o758k638l259J016j409N012l156L019L384P839O217o148
$$ y = [-14141, -1407, 11827, 20158, 11257, 12050, 7290, -248, 4287, 15478, 15832, 23586, 16054, 13185, 22179, 29749, 24069, 15367, 16168, 10170, 2564, -4121, -7723, -591, 1269, -6887, -11322, -8306, -6931, -11687, -13742, -3015, 9103, 7664, 3840, -4168, -33, 7581, 12694, 1294, -10193, 5074, 21758, 19779, 1887, -10704, -13570, -9533, -14873, -16105, -9108, -20175, -31226, -36460, -26910, -14060, -10876, -3691, 3107, -7048, -16518, -24328, -20985, -16427, -6994, 6844, -444, -18023, -17496, -23403, -20352, -18461, -18979, -8235, -2297, -23984, -35791, -35650, -36493, -41962, -42663, -28391, -10366, 3132, 3884, 3361, 1230, 2330, 4573, 10515, -770, -5428, -4519, -14900, -20466, -24509, -13382, -210, 4502, -564, -2083, -8841, -11479, -14738, -13722, -15131, -10119, -13275, -10256, -6872, 967, 7184, 1036]
16046A036p110J621O330P857K282m8J3612n060j3801k417O160k497M574J205m69
16031A3275j1617j0092r52k353J989N521K321Lj0589k524L554R95J5756K813P158
16016A5258p349p520J665J0727L609o145j0271m435N065R995O088j1388p302J3494
16002A1491J794j2634M42Q263J158m438O900o384M29j900L563r931k269r606j975
15987a5097J0059P059j1176Q55J6655Q156k242r968N290j1911r42Q722r264j877
15973e681M664j92j5828K73J7438O831n939J683J902p122P106L402J267Q703r774
15958H733L248L819n743q287j5999J504M671J2281R581j967o033r901N246j0078
15944h925o446R951j3621L400M690m026L769O114k415J67N852K009N080q724j2044
$$ y = [1036, -6074, -4453, 1877, 9734, 12016, 11968, 25580, 20520, 6719, 4302, 10462, 7965, 12539, 13744, 13275, 1658, -8434, -9386, -11739, -9750, -4229, -1908, -1905, -12494, -15018, -11464, -10469, 5287, 8100, 15258, 7909, 389, 2054, 12781, 16390, 10245, -26, -4461, 604, 10599, 16687, 5299, -2003, 11491, 13285, 651, 1093, 9356, 10514, 6076, 12976, 6592, 7021, 5121, 8684, -1247, -3516, -13122, -15097, -5038, 2021, -9155, -8300, 8355, 16511, 14269, 4301, 9591, -2320, -3262, 5460, -3804, -5681, -1017, -1209, -17037, -16764, 674, 7505, 1566, 3249, 5151, -1971, 5135, 8537, 9804, 18507, 8733, 11981, 15800, 10057, 1770, -14229, -12725, -8054, 4227, 13808, 11841, 5808, -4093, 1153, -8925, -15371, -5420, -19041, -15641, -10951, -14977, -11208, -5094, -7509, -7342, -1490, 519, 5599, -3125, -15169]
15929a5169q418k585K511K7521J3399K767r723j2188R9L422j3771p457n50j416
15915b1558m589J0840N6J210J1639K216M327P22j3718j410j0137Q997P759R54
15901b692Q874j1076j2636J1665J3843R464N982j1728j1538P585M126p412r435
15888d978l627N854q979m632m761j707R395J0715p381L158L288q788k3622j948
15874c8013J0142L531J6544M639M019N841p217j680q169r125k906r706L14P734
15860b4052P780k614J0375K823p866j649k680R54M349M960O125Q528n98o635m537
15845d737r347J291Q927j457O005P344Q378Q891j503r780k415j3228r415J5321
15831D275r382j9794J932K619N875J0143j4524k694J756n706p06J1793Q997k797
$$ y = [-15169, -23587, -26172, -23661, 3860, 17259, 20026, 10303, -1885, -1786, 1636, -12135, -19592, -20142, -21558, -26147, -15307, -15251, -14041, -2402, -186, 4141, 4863, -8855, -10265, -20402, -11405, -3646, -2692, 6182, -4894, -17530, -5865, 7978, 17442, 23424, 11696, 158, 7743, 11869, 4457, -4978, -8605, -2751, -11730, -16362, -21123, -22830, -13435, -2720, -10101, -6943, -3655, -12443, -36065, -38013, -27871, -24340, -7796, -3157, 862, 6703, -514, -2194, -10363, -19488, -22394, -32100, -31786, -24052, -16272, -18886, -8511, -5688, -13554, -15203, -17883, -16929, -12580, -7620, -1495, 7033, 6435, -200, -4737, -14084, -12793, -3866, -5323, 682, 8026, 16404, 25295, 23792, 14012, 11597, -1631, -11046, 4275, -5107, -24901, -22969, -20350, -14475, -4332, -18856, -21550, -19794, -25500, -26206, -14413, -5416, -8213]
15817h213q058o30K1595P134m316M510m973p779j3614P461r52o285n310J0702
15803h728J8351J4339j0778p867N215Q635k620n346j0713q685K012n478O649J733
15789c281n694L53K0865Q381q73N59k794m943j2475p023RJ5441k849j2290N636
15774i78J0612p399m527L664P07q510j1011o256n252k315J1441J3680P750J4172
15760A5778j6258n820R849l477j1155J2032M854r782j6358O856R674q483r356
15747b1646k520k52P457R319o947J955R697J1775m175L301o228r057j512j428
15733a0261k554J4812Q811j8436k2368R073J3537m110K669n87j4982J641J3935
15720h820J0486o785j145R839P289l625m766N115j1887m360J362J955r824j2752
$$ y = [-8213, -16271, -16901, 4694, 11828, 7512, 12022, 7049, -730, -14344, -6883, -7835, -14120, -19430, -8728, 9623, 23962, 13184, 5317, 10532, 19167, 16547, 11201, 488, -8197, -6185, -11663, -5014, -3281, -8975, -8622, 12243, 20624, 19751, 20310, 17516, 12573, 98, -6925, -6916, 8525, 5676, -6614, -978, 9634, 2235, -2292, 1372, 2079, -6431, -17442, -23698, -28950, -31265, -19824, -6144, 1606, 15778, -480, -6300, 3549, 72, -11083, 949, 5803, -3979, -20337, -13481, -3807, -12290, -21646, -24166, -24418, -16961, -7642, -14589, -12634, -2937, 8838, 4663, 7964, 1736, -7321, -8833, -10261, -12815, 1997, 10808, -7628, -29996, -20923, -7386, -11496, -8827, -9414, -24396, -22755, -8820, 1666, -5119, -6264, 3575, 10864, 7239, 2473, 7588, -4299, -8659, -7297, -5342, -15166, -27918]
15706b7918R192J8385N913O08k678N5m901j184N520P106l916k463l576k096K752
15691G99O627R526k625q114M237J1695j2560j8221p890q381Q338O058l791J0407
15677c895N069Q000Q57r68J897k0115l200J1691k302r585k219J0850j850o363
15663a2133K85P244k522J286j210J522J854j960J2788l6L308p005q676J541J820
15648a894P884j8890j2851J3064P923j622R712r221o647J271Q017Q3K86P096j187
15633C024o187j0318J517k346J1994J520p69l317m176n733K874J1272Q506j7189
15619i328o288J823R563L625M622j8082j5370J1301J4259N188k343M804l844Q4
15605A4o469r799r349O980K424N234J5081J4585p235j5169j5295O790J9972n485
$$ y = [-27918, -18726, -341, 5572, 6180, 3502, 3557, -1344, -2528, 2992, 10098, 6182, 3719, 143, -1953, 799, 7426, 16952, 14327, 6213, 10450, 22145, 9585, -8636, -16526, -24907, -16569, -10511, -14302, -3895, 1174, 9174, 10031, 9063, 10960, -9155, -12355, -664, -2966, -12551, -14770, -3920, -5770, -12133, -11848, -4604, -7126, -5840, -7050, -5528, -3674, -5634, 7154, 7118, 10426, 3421, -5255, -3714, -1894, 5990, -12900, -25751, -12687, -4764, -6386, 3326, -5895, -12542, -11271, -3254, -3171, -2885, 4211, 3024, -3163, -13481, -11964, -14310, -2316, -796, -1565, -4882, -9058, -14791, -11917, -645, 7861, -9328, -15616, -13793, -4230, -605, 4017, -14065, -29435, -18134, -3875, 1313, -1030, 3774, -70, 14, -6455, -16254, -25603, -18623, -16199, -10965, 4116, 18701, 11466, -3703, -18998, -12208, 7764, 2279]
15591B279R523J3205m894k2444M490J2181m054o953k851K653k644l292M505P465
15577I169N498j3629j5081Q18r38j309K495J2454J059J445j0485j2186N097K090
15563a3503m568P473K7748Q092J496q197r053j2111j1114p153N507L601n21k293
15549a4596O06L652J2166O898j9174j1543Q339P066r474J1762P415n581N798K0732
15535B4066j4163k2742J719J2824J0443k358o306j356l875k669k771R546K208
15522D566o521n568j1142j990o526j570J699N078m690N894O180P212j3747j0434
15508c1559J32R483n9p897J576J1325J61J0347K288J8220J1661j2224j2717o054
15494e317J303m930k521L769M989q711j0452k75N645O563O637R154k970j1634
$$ y = [2279, 11802, 25007, 20113, -2331, 2159, 14340, 10286, 3333, 482, 3135, 491, -2801, 1704, 9169, 14667, 1038, -14043, -13225, -14163, -15472, -12977, -523, 536, 1981, -8504, -20690, -15593, -13503, -18071, -10598, 17150, 25242, 26738, 18541, 9488, -2623, -13737, -20890, -15383, -11782, -12303, -14596, -13990, -10338, 1828, 8726, -10448, -21991, -13652, -6586, -16060, -4298, 3117, -2464, 3334, 24066, 9903, -12839, -11120, 1704, 12147, 9789, 3483, 2127, -1748, -4417, -7188, 2358, 4566, -1955, -7523, -18665, -20655, -27181, -28751, -27052, -21974, -26664, -20770, -14590, -7378, -21125, -31559, -31427, -21944, -22003, -29900, -28324, -16999, -16838, -6491, -4203, 14017, 25678, 13454, 737, -5317, -4014, -8944, -11465, -7696, -2707, -11418, -21870, -22145, -16500, -9937, -3300, 5854, 2884, -8750]
15480h750r508M684J6869O536o741j0013J5632j275j4868M016J1870n78p912Q872
15466H834N041o299n434l20o48K25m990j2344O2L735N63J523l667l634K823P273
15450g257j4560m099J422l334R473J5883P31O643k0409q335o23M953J2290J1709
15436D487J837p362j664l166k1335N57p82o134N744N737J845P079J2400l910l544
15421h211n62J776O450J0090M591k5751j2739O763Q592m99j987K846q511r402
15407b6554J3801N647J916K614m842O273R617P306j4334k7915j670O236K479Q086
15393a1340M92KL707J4034O375j9493l71K628k364K77Q94j1191j580P770N513
15378d647j213q007K786Q269L180Q391J4473j6011j3729j0844N42n983k214l744
$$ y = [-8750, -18258, -13574, 3295, 9831, 3090, -6923, 8709, 7434, -7434, -3418, 8452, 7874, -38, 8834, 13875, 7576, 2142, 1822, 1174, 1399, -3591, -15935, -15873, -12138, -11575, -10052, -13719, -17353, -14530, -7257, -21817, -25916, -24494, -27828, -18355, -2472, -1741, 4902, -15507, -23842, -24465, -19512, -7222, 4487, 6324, -1038, -2702, -5868, -27203, -26646, -27428, -33562, -27818, -22081, -20236, -13157, -757, -4667, -8211, -8773, -6997, -547, 9543, 14134, -11617, -24356, -17593, -9001, -9500, -11487, -8641, -17152, -26554, -12753, -7106, -5190, -2576, -7418, -1145, 8472, 15778, 1444, -26471, -28141, -21905, -19426, -11340, -10848, -10846, -7139, 6895, 13270, -6223, -6594, -3966, -6330, -6053, -5159, -16350, -17930, -10160, -4647, -5860, -13867, -11081, -2812, 368, 8759, 23232, 7221, -6508, -17352, -16810, -22793, -25007, -28751]
15364b8751j6715J827K5098J276K481k391J6238M052j696J969k792n314K847k936
15350d807p402m098J3543J0605N954p424m897N95J923m407J819J591O542l327
15336F210k3576j7956J0714n403P738Q276O466L513n434q419p845l784J5712J2464
15322a324r09l726m315P449M448l459R126J555o810L571j158m474K00p946k4538
15307c2310j8586K7801L3342n699r839M41J861J538l53L292L800n654J3262N01
15293A3397q342q07J211j2204l254Q761M424J3562j4898j5992K625o97j512n17
15279a4243R117o369R820M913j9854q801K116m939J0367O538l607Q611J2356m407
15265A618j876J3787L609q828m78j3373j0637k432P392O256q031k5291j4131R364
$$ y = [-28751, -45466, -43639, -18541, -17265, -14784, -17175, -937, 3115, 1419, 3388, 596, -4718, -1871, -4807, -12209, -16307, -2764, 7841, 13795, 6371, 1474, 2069, 3992, -415, 1404, 2995, 9537, 6210, -17366, -35322, -24608, -30011, -22273, -13997, -7531, -4018, -9452, -17871, -25716, -29500, -13788, -1324, -2233, -5959, -10274, -2825, 1623, -1836, 7290, 8845, 2035, 5606, 4448, -26, 174, -7772, -32310, -50896, -23095, 10247, 4548, -5291, -4850, -2989, -1451, -1804, 1488, 5288, -366, 12896, 13397, 5055, 4248, 5459, -6745, -9999, -1238, 3186, 16748, 1850, -14142, -11517, -12214, -13726, -14243, -5126, -11495, -1675, 3238, -16616, -25417, -23301, -28240, -17873, -11335, -14942, -6331, 6025, 1618, -258, 13529, 17138, 8310, 7832, -5541, -16178, -18610, -11218, -4962, -12993, -38284, -52415, -43051]
15251d3051J3093Q640L892N198J2736J151m534o801k664O230O909j1348k202K0837
15237H086Q361j4566l480j0664J517N629O574J8622J574j0629j579P304J0722
15224B7471r984p303j0826R216J1802j1365K452m140p731L344R825j798l736L363
15210A0590O370P513j536j1068k051j1699M22O311P750l09q386j1843p560J8414
15196B918M163J4745O976n497r957J0405M19j8859r406K0235K088J365M978J833
15182B6406L744j0781p474R828J3076K717O642J5037R609O031r226r81N126l959
15168F5795J0491L4090K8734K4425L8706M2183N9961Q6514Q9759R5695R0827N3924
15156G21104N153o187k408K2021J9134j7873m9304p6686q8911r9309p4018o7451
$$ y = [-43051, -29958, -21318, -17426, -12228, 508, 1659, -2875, -9676, -12340, -6110, 799, -10549, -12751, 8086, 16447, 1881, -1599, -12263, -10746, -5117, 1457, 20079, 21653, 11024, 9445, 16749, 27471, 17487, 10184, -642, 8574, 20376, 9011, 11463, 7323, -408, 2936, 12761, 10963, 7227, 10590, 16960, 24473, 22937, 11869, 9818, -1881, -1459, 4852, 12602, 12293, 3907, -7936, -15496, 2918, 7081, 21826, 28802, 23305, 13348, 23753, 24172, 5313, -4093, 16142, 18230, 19595, 24573, 26406, 30150, 19369, 11895, 21723, 34799, 37516, 44158, 59195, 68804, 74835, 65609, 64628, 69754, 65795, 76286, 110376, 139110, 163535, 202241, 244424, 304385, 390899, 480658, 576353, 667180, 721104, 726257, 720070, 717662, 739683, 758817, 740944, 691640, 614954, 526043, 426734, 352716, 285265]
15144B85265m3387m0310k5865k1497k4260j7998l764n741l112n447k3848M115
15132G4151N322n110P38l805N120r085q866p893N74O192R852l017j0424j0407
15118D3342j2421q815k362M292q195j0908M879J679J0671l867k1907L891J0380
15105A0659k39O943N447l597j3921o901k683N044j740m733N693p105j849J835
15091g147J0737K2J915Q041n379j4975L507J1810J2662j418j3973l367O982J1933
15077B1350j0500o947L232J2177n308K764J8443J2063o009J002n518k670J704
15064C5783o206N641l481j8505m958r533J0627O040L078J6795J244j9334q109
15051I082J3324M06k108r320J407l990Q907L510r541m766J0704k03N042J4302
$$ y = [285265, 241878, 201568, 175703, 154206, 129946, 111948, 108184, 102443, 99331, 93884, 70036, 74151, 79473, 74363, 75101, 71296, 76416, 67331, 58465, 50572, 51146, 57338, 67190, 64173, 53749, 43342, 30921, 22106, 19744, 24036, 15841, 4933, 9812, 11491, 22162, 18295, -3612, 279, 10659, 10420, 17363, 22810, 19213, 5292, -1609, -4292, 752, -988, -5721, -28, -7133, -8982, -7147, 3590, 3612, 5527, 13568, 8189, -6786, -3279, 8531, 21193, 19775, 5802, 2435, 9417, 21350, 10850, 3903, 7135, 19312, 14004, 16768, 35211, 47274, 41265, 42267, 36749, 34079, 35783, 29577, 35218, 31737, 13232, 8274, -1259, 9368, 15408, 18486, 35281, 36525, 17191, 9082, 22406, 22812, 20704, 11384, 12791, 8801, 17708, 21218, 11677, 6911, 17615, 17412, 22454, 36756]
15037C6756p63n689j3013r523R765J375k387j96M322j0887j8384K119J871J189
15023c445L839J872N226l653O672n761M207J0951q443n650M081o577j0180o813
15009a3674j687M800N78O969Q585J0355Q034j35J2002j3685j4068M009j9574j345
14995h836L596P877n87J0066L708j056p260j3372o104O460o520P018K551k3066
14981b5525O995m808j1639K0508Q272M035M163Q194K737r797K296P261o743n171
14967G78l948k623o059J851K919P448Q515J231p22J159j1505n569J5214Q678k833
14952A4534j0339k816q536n905N116J0746m621r527j809r73J2511J0356P103Q67
14938A6707p111l613m456p552l176P619P033o199l231N269K62j0806j2156j086
$$ y = [36756, 35993, 30304, 17291, 7768, 17533, 18908, 16521, 16325, 20647, 9760, -8624, -6505, -4634, -3445, 394, 2266, 7492, 3839, 10511, 4750, 8957, 19908, 11465, 5815, 9896, 3319, -6861, -13674, -15361, -10561, -9983, -3014, 5571, 15926, 23960, 23825, 35827, 22142, 8074, 12083, -7491, -8836, -5240, 2637, 2050, 12116, 15824, 14768, 7508, -5864, -11968, -5508, -12028, -5010, -2459, -25525, -18530, -23338, -34977, -14469, -6197, -2162, 2001, 10195, 12932, 3135, 5431, 12692, 5949, 778, -3170, -5793, -11852, -10001, -7082, 366, 8881, 10112, 9390, 10549, -956, -6525, 8689, 17367, 14534, 4195, 1379, -7157, -13062, -7946, 2800, -1821, -11348, -13157, -14130, -1619, 8737, 15840, 16707, 9596, 5983, 1527, -6025, -9201, -1582, 5451, -748, -3979, 1290, 1552, -9254, -21410, -22496]
14924b2496J2618K865k651j264O464N835N190q914o720L122J5420J5945L945k521
14910B6838j8683k534J1865L529q40j4586l678P860m881r669O315J228n135l725
14896f096J1686p699l366L147p161J0895J1994j9458l189m783l802Q781n950m122
14882a9123o853o321Q868J3680R118J137M763J0697O19j1320j090J8Q106j890
14868A0409j3383j2416o840J0549o845k444R256J2119J055l427N31j093q305r846
14854b0680n051Q221M487M820Q027J2059r682j5175n699l804R961J7952R717r149
14840F004j6332n249j4923n205K689M945o70N987P298J1504n841l53M265K429
14826c452J0036l930n057j4964m150L055j792l783J7370Q161j5078q426J7467
$$ y = [-22496, -9878, -7013, -9664, -10928, -4464, 1371, 6561, -2353, -9073, -5951, 9469, 25414, 29359, 26838, 8155, 5621, 17486, 21015, 20175, 5589, 1911, 9771, 4890, -4779, 1536, 2764, -2371, -6096, 5590, -2109, -5475, -2328, -9489, 1406, 13400, -6058, -9247, -14030, -17832, -9051, -15001, -19123, -25976, -32297, -23429, -9749, -631, 506, 5269, 15966, 16585, 5265, 4175, 4193, 12299, 10409, -2974, -15390, -22230, -11681, -18526, -20970, -11714, 405, 1460, -1967, -1436, -2529, -10834, -20680, -25731, -17510, -13023, -8203, -176, 11883, 2201, -12974, -18673, -22477, -12516, 5436, 15153, 6004, -10328, -15577, -30500, -35705, -33016, -28071, -28741, -22754, -15456, -3952, -9793, -10146, -5881, -3452, 6584, 2654, -2403, -17367, -21517, -18462, -20254, -24037, -6667, 1494, -13584, -22010, -4543]
14813d543N728n4n583l436M444L188O458r130j3338J3192J5748m540j022p985
14799h73j290O720k410J630R133J2480N016m915k1023j0848l089O566N525j980
14785F42o528o638j586J0534O394M439p850o793Q440Q617Q856P379q118o031K599
14770A4356m450j786N665m612n914M803o172P76k949M643j417O227k126O22P73
14755H439N384L507K688m477J0491J533j9656R343O20n107P390p316R026l540
14741A8325l530o373O98J975n66k966j3077Q50P240o999p14K2641J5546j7525
14727A5525j9480j2455L11k660k926R279K037J970j0385j2834K4342J966o066
14714a1376j955R310M248M398O690j325j4830j8589p052O03K655R835J6412l080
$$ y = [-4543, 1185, 1131, -4452, -7888, -3444, -256, 6202, -2928, -16266, -3074, 12674, 8134, 7112, -873, -2163, 4557, 2147, 3777, 12910, 25390, 30406, 25491, 4468, -6380, -9469, -2903, 2622, 642, -5886, -12524, -14110, -3576, 2818, 7257, -593, -7386, 1054, 9671, 18527, 25906, 17788, 11757, 14356, 9906, 8120, 13785, 9173, 3259, 8062, 1890, 2666, -283, 4360, 2943, 9170, 7044, 7666, 8439, 13823, 17330, 20018, 15541, 26032, 27565, 7909, 17252, 17872, 12765, 20155, 12839, 21865, 18325, 14795, 8422, 9120, 11095, 10529, 7563, -5514, -4664, 2576, -4423, -5137, 17504, 33050, 15525, -3955, -16410, -16099, -18759, -21685, -12406, -10369, -8399, -18784, -31618, -7276, -5310, -11376, -13331, -4021, 227, 4625, 11315, 9990, -4840, -23429, -30481, -29878, -27223, -17388, -976, -4056]
14700d056m126J2163n208K822K928j942j313r273p347R189N430j3390K475O471
14686e177j2563j3444N327P054J265o848n352J4344Q356K490n049R014O477q684
14672b790j244q242N348l344J3537j769l047p637n585p297p447O712Q866m997
14658a8936m846k187N015N850J1256J998L658l30o724k354J0756O208K571j0001
14644A934o474j1244q985m93L953J828K408Q814m789j7575P17l82J0411o955k243
14629b9075J1053L980P767r504k123p682L201J1209J0533J6691m269j8357m24
14616g000n134r157k676K917R605Q691L566p86k44O589k316n487R088K5022o450
14601B6228j305J0760J9664J8768P089J3862K7423J7437J6274j3217K766m10j0189
$$ y = [-4056, -8182, 3981, -1227, 1595, 4523, 2581, 1268, -8005, -15352, -6163, -733, -14123, -11648, -5177, -17740, -31184, -25857, -18803, -17538, -24386, -29738, -15394, -7038, -4548, -9597, -583, 5894, -2790, -4034, -12276, -6928, -10272, 3265, 1496, -1551, -9188, -14773, -22070, -29517, -22805, -13939, -18936, -23782, -25969, -20954, -15104, -3848, -1850, 1808, 1478, -5246, -7600, 3156, 9364, 11935, 1934, -4540, -15784, -24769, -25262, -21309, -19481, -17073, -8259, -13048, -30623, -29906, -30288, -19877, -26832, -29075, -18022, -14042, -6275, -15779, -17902, -25584, -22383, -11174, -641, 16050, 11781, -6576, -7000, -12134, -21291, -23967, -21050, -11445, -2754, 812, 26, -218, 6371, 4055, -1432, 7656, 32678, 26228, 24923, 35683, 55347, 74115, 81204, 95066, 122489, 139926, 156200, 142983, 145749, 145339, 135150]
14588A35150r118m861j6315k2602j3449k0470p41L52k73j1288j5790K696l060
14575B0231j6767p400M275J1527J1262p240j2861m224L141j0193l623J1257P484
14562F869M173k591q64o147M680j4272j3112J7922K544l610R873R568K5894L689
14548D4616j7607o277p053q4O326q48o653k902q604j404j1309n999n819O686J7179
14533B48m31K785P900j822j002O554K0377K29j7888j1756n602K804M529P235N194
14518A9354l153o49p340n265k191R527K2462L265j1687K657k192j561K1593K884
14504D7704K321N822K1594J4634P63r055N669K2943M127J4107K3384J9316J2578
14491A85907N369L0826L6976L3086L3874M3785O0905J00548J40132J78430K37812
$$ y = [135150, 126032, 121171, 104856, 82254, 68805, 48335, 47594, 47946, 47673, 36385, 20595, 23291, 20231, 3464, -3936, 339, 11866, 23128, 15888, 3027, -1197, 1944, -8249, -11872, -615, 6869, 11042, 8451, 7587, 1440, 6120, -8152, -21264, -3342, -798, -4408, 5465, 15033, 40927, 44616, 27009, 20732, 13679, 13595, 19921, 19073, 12420, 9518, 914, -490, -11799, -17798, -23617, -16931, 248, -183, 2602, 10502, 8680, 7678, 14232, 34609, 34838, 16950, 5194, -408, 2396, 6925, 14160, 19354, 16201, 15552, 8212, 2947, 756, 10283, 32745, 36010, 24323, 26980, 24788, 23227, 44820, 47704, 50025, 55847, 77441, 92075, 92838, 83783, 89452, 112395, 116522, 130629, 154013, 173329, 185907, 191276, 222102, 259078, 292164, 326038, 369823, 430728, 531276, 671408, 849838, 1087650]
14480A087650K92506L39216L10958K07226Q1181M5313Q2458J77029K64111K77599
14470C165247K11155O0887q8094k32291k72056k34171j32108l1926n3801j61932
14460B230910k66949l39358l18831k56250k09422j61226j19715r0620o0633o1107
14450C46799l2899j6272l1305k4935j4177r905j6449k7700j7389m471k58j2401
14438A38638j5535l865j1864r75M25n166j7853m383o230Q600K768O433j6509k1423
14424E3061j2296k469k335q877o448K0707Q515j4852M016J6131J1998n493j4855
14411D6803k427j370M813K132o266n516K899L681L473j315J1384l369J3186J2202
14397H0310R125M590O176K765J1531J4325J673J4782J6167J9332L9252K8658K4404
$$ y = [1087650, 1380156, 1719372, 2030330, 2237556, 2318737, 2364050, 2446508, 2623537, 2887648, 3165247, 3376402, 3437289, 3349195, 3116904, 2844848, 2610677, 2478569, 2446643, 2392842, 2230910, 1963961, 1624603, 1305772, 1049522, 840100, 678874, 559159, 468539, 407906, 346799, 313900, 297628, 266323, 241388, 227211, 217306, 200857, 173157, 155768, 151297, 151039, 138638, 123103, 119238, 107374, 106399, 106824, 101658, 83805, 79422, 73192, 81792, 84560, 90993, 74484, 53061, 40765, 38296, 35961, 27084, 20636, 41343, 49858, 35006, 39022, 55153, 67151, 61658, 46803, 44376, 43006, 47819, 49951, 43685, 38169, 41068, 44749, 48222, 46907, 58291, 54922, 68108, 80310, 89435, 94025, 100201, 102966, 114497, 128822, 130495, 145277, 161444, 180776, 220028, 248686, 273090]
14384B73090J7498K3242K3868L6076L7906K7730J2728Q272K0144K7177l232n012
14372D99487k366k4555j7119j8110j7382k0012k1495l1928k1788k7592k8929k8391
14360B39820m2590k8799r114j1865j4467j2096j2783K41k3046q041l700n678Q56
14347F8738j868j3290k8149o800K38N05O625j1677j110L223p164o550O509J0210
14333A9440L534j1712L939L203J1176N005l246j9256O74m587N678m111o647J5407
14319A8497l754j1302K012k936L195M872L23M859J909K612n87J3024K430n336
14305B9818m782n299m939r009r893j1601n151J8510R946m50j0411j0828k660N582
14291a1167L659R180R495P109l541o721j6694L491l657r004m606R172J5238R032
$$ y = [273090, 290588, 313830, 337698, 373774, 411680, 439410, 452138, 460410, 480554, 507731, 504499, 499487, 497121, 472566, 455447, 437337, 419955, 399943, 378448, 346520, 324732, 297140, 268211, 239820, 197230, 168431, 159317, 147452, 132985, 120889, 108106, 108347, 85301, 77260, 73560, 67882, 68738, 66870, 53580, 25431, 18631, 18869, 19374, 25999, 14322, 13212, 16435, 9271, 2721, 9230, 19440, 22974, 11262, 15201, 18404, 29580, 34585, 31339, 12083, 12757, 8170, 13848, 9737, 3090, 18497, 14743, 3441, 5453, 2517, 5712, 10584, 10907, 15766, 17675, 20287, 19700, 32724, 35154, 29818, 25036, 19737, 14798, 5789, -4104, -15705, -20856, -2346, 7600, 7150, -3261, -14089, -16749, -11167, -7508, 1672, 11167, 18276, 14735, 8014, -8680, -5189, -8846, -17850, -22456, -13284, 1954, 10986]
14277A0986l563K005m617N031M440M849J0311K899P932K713P305J5466P872K062
14263G5691Q729n069p186j909l969K176Q536K0229r42q546l513J7817J867r412
14249I4499j7715j3557q551j7986j071j939J1658P377K498j1735k2729j3267o828
14236F54o272J6288J0622l273J0120j630j1648Q261o625j0548P650J2270J641
14223B7510j6371j3556J1437N289k059O698o413j313m496j0786n088J991j11J8696
14209A1428J9710K639k4569j0273J4847J1913K741k813k191r622n624K269K358
14196A2813j0777j9727O049K1393r310k644J5004p894l593p36l173m033n056J3994
14182B310J590Q19M304J8367R155L030M974o492k598r88M479J936P267O160J2468
$$ y = [10986, 7423, 9428, 4811, 9842, 14282, 19131, 29442, 32341, 40273, 42986, 50291, 65757, 73629, 75691, 84420, 79351, 72165, 70256, 66287, 68463, 76999, 97228, 96286, 87740, 84227, 102044, 103911, 94499, 76784, 63227, 54676, 36690, 35619, 33680, 45338, 52715, 55213, 43478, 20749, 7482, 654, -5618, 10670, 21292, 18019, 28139, 26509, 14861, 23122, 16497, 5949, 13599, 25869, 27510, 11139, -2417, 9020, 14309, 12250, 18948, 12535, 11222, 6726, -4060, -9148, -7157, -7268, 11428, 31138, 33777, 9208, -1065, 13782, 25695, 28436, 25623, 23432, 13810, 8186, 10455, 12813, 2036, -17691, -11642, 9751, 441, -2203, 12801, 4907, 1314, 578, -2595, -6628, -11684, 2310, 3900, 4719, 9023, 27390, 36545, 39575, 44549, 38057, 35459, 34471, 38950, 40886, 48153, 54313, 66781]
14167F6781J3248m097k480r714j7296l468J7049J7063M798M01J4437K9336K1765
14154A47823n972j0935o50J4364R474J074r642j4553k5723j8451q376j967o512
14141F9954R196J3220N817l129p763q205P081J2837J6515J3500l093N993J5395
14128A47318L9636M8313Q0743J43604K14353L13464K99016M9015j83082j58562
14118I93818j6513J50239K45733M7076k34670l09493k64852j44761q8438p1913
14108C06226n5431l9987l6019k6772k0915m164j1825j4579j1883q027p924k0462
14096D8238j7563P9N274J0988Q681P95J559q642k304j120n700L856K4348K4837
14082I3326K2700M1288N7330N7506L5756J6716j0366j568r165P51P5O360k2619
$$ y = [66781, 80029, 75932, 73452, 63738, 46442, 42974, 60023, 77086, 81884, 82285, 96722, 126058, 147823, 141851, 130916, 130266, 144630, 154104, 155178, 145536, 130983, 105260, 86809, 78433, 76466, 69954, 79150, 92370, 98187, 95058, 87295, 79090, 86171, 99008, 115523, 129023, 125930, 131923, 147318, 186954, 235267, 316010, 459614, 673967, 987431, 1286447, 1335462, 1152380, 993818, 977305, 1127544, 1373277, 1420353, 1185683, 876190, 611338, 466577, 378139, 306226, 250795, 210808, 174789, 148017, 127102, 122938, 111113, 96534, 84651, 76624, 68700, 48238, 30675, 30754, 36028, 47016, 55697, 56492, 58051, 49409, 47105, 45985, 40285, 44141, 68489, 93326, 116026, 157314, 214644, 272150, 307906, 324622, 314256, 312688, 303523, 304274, 304349, 310709, 288090]
14069B88090l9124m1885m7720k9433q558r918l0773k8121r998k1732o902J1996
14057B5922J3486J1471M672j0494j2274r62l74j0150K951j467r221O027J883K139
14043B3609J758J92q932q622J343J0339K703q564L431J0254n019j6917k960R509
14029A2124J5436p619J4350M696j0237p031M655Q265k692l952r545M92K996p480
14015A4458q062Q107m884n515R492Q081J838Q119m834P34j5641q259P484K584
14001A3702j1602L08O921K180N547l704p23k66j052N991n522L668Q274J1732O484
13986D1938m662k105q878o468n132Q803J0526m335n008m598o44m491n813n852
13972C281p728k992M688P574J5626q867k974Q784K812o000l389J075j1535L713
$$ y = [288090, 248966, 207081, 159361, 129928, 121370, 111452, 80679, 52558, 42560, 20828, 13926, 25922, 39408, 50879, 55551, 45057, 32783, 31821, 31447, 21297, 24248, 22781, 13560, 19587, 21470, 23609, 25367, 25559, 16627, 8005, 9348, 19687, 22390, 13826, 17257, 27511, 22492, 5575, 2615, 12124, 27560, 19941, 34291, 38987, 28750, 21719, 26374, 34639, 31947, 27995, 18450, 18942, 21938, 14458, 6396, 14503, 9619, 4104, 13596, 21677, 23515, 31634, 26800, 27534, 11893, 3634, 11118, 13702, 2100, 2408, 9329, 11509, 17056, 13352, 12629, 12363, 11311, 17302, 11780, 15448, 23722, 35454, 41938, 37276, 35171, 26293, 19825, 14693, 23496, 34022, 29687, 24679, 20081, 19437, 14946, 9133, 3281, -4447, -7439, -2751, 4823, 20449, 11582, 8608, 17392, 20204, 14204, 10815, 11890, 355, 4068]
13958D068J348P18R195N956j078J905k840J026l405J5359J3137J4955Q141k603
13944F5882Q618P320m523K596K5150J7904J7079L6554O1769Q9896P0319j2639
13932C85925o7596l6860R636N9296N4877k0401o4234p0055n4115j3763j2558j0784
13920A59368j7965l779j290p907j1756L544r501j1780j1516k2380r075p081q034
13907D0848l879l510j244j1643J936K954N634l824j769k413p2r760M640P579J805
13892B7282J2889J0378N353j8831m761R499o176r00J1196M693l792Q129j0815
13879D4144n276J2037N621K634k93k211q907o074m667o494J5935L244Q088J0655
13865F8436k98L523k47M763J4871J0690L107O242K6323L7676K7825K7143L1129
$$ y = [4068, 5416, 6134, 15329, 21285, 20207, 22112, 19272, 20298, 16893, 32252, 45389, 60344, 68485, 65882, 74500, 81820, 77297, 79893, 105043, 122947, 140026, 176580, 238349, 328245, 398564, 385925, 318329, 281469, 291105, 350401, 405278, 384877, 320643, 250588, 196473, 182710, 170152, 159368, 141403, 137624, 136334, 128427, 116671, 120215, 110714, 98934, 87418, 65038, 55963, 48882, 40848, 36969, 33459, 32215, 20572, 22508, 25462, 31096, 27272, 25503, 23090, 23018, 13258, 17898, 25477, 27282, 40171, 50549, 55902, 37071, 32310, 41809, 35633, 34733, 45929, 50622, 46830, 54959, 44144, 38868, 50905, 56526, 59160, 58867, 56656, 47749, 41675, 37008, 30514, 46449, 49693, 57781, 68436, 68138, 71661, 71414, 76177, 91048, 101738, 104845, 111087, 137410, 175086, 202911, 230054, 261183]
13852B61183K1226J2844K7352M391M723O043o890j4785j6180j6517j4991k5204
13840B43195k8554k3817k9781j2295j1385k1113j5212j160p354n272K33L587L856
13827I4928m097K796j0528q316J5818M923N610J268j4297j2164j7321J811k42
13814F0189j4590j1019J1349O199r591j1104j0490J5953J5808r940M740j1874
13802C5630o003L217L257m872l233p970q078Q892J4361L911O009J3095J7484l351
13788G2349q692q075M148K628p885p243j2278p72K3071K851k3129k4156N723m265
13774A4275L503J7078O342o836j2802o254k3775j8848M60J5037L190k040p443
13761a8113p98N675k355K619J4826O48k142j573p207Q30Q788J764O35J62M256
$$ y = [261183, 282409, 295253, 322605, 326996, 331719, 337762, 330872, 316087, 299907, 283390, 268399, 243195, 214641, 190824, 161043, 148748, 137363, 116250, 101038, 99878, 92524, 87252, 87485, 91072, 94928, 90831, 93627, 83099, 74783, 90601, 95524, 101134, 102402, 88105, 75941, 58620, 60431, 60189, 45599, 34580, 45929, 52128, 42537, 31433, 20943, 36896, 52704, 42764, 47504, 35630, 29627, 32844, 36101, 31229, 27996, 20026, 11948, 20840, 35201, 39112, 45121, 58216, 75700, 72349, 63657, 55582, 59730, 62358, 54473, 47230, 34952, 34180, 57251, 60102, 36973, 12817, 18540, 14275, 17778, 34856, 41198, 34362, 21560, 15306, -8469, -27317, -26857, -11820, -8630, -10670, -18113, -18911, -13236, -15591, -12972, 1854, 2502, 360, -1213, -8420, -7590, 1198, 2962, 3597, 3759, 8015]
13746H015L834K120n991p105O476k458%m51q306m549K688n451m966K828J67L997
13730i152j025m339J212r04p874j2442N14J8172M335J3784L433K187j9J2654k319
13715A8217R980J759k0811k0660J5513J375Q966m456n892J414j0860O779R550
13702A0874O952O806j0522j5912N171P992Q713j4162l706J7392o020p655m171
13689A752Q270n27M985k210J227p927j0874n819J5423K927N327p88O93j0445L729
13674E743M749Q85j1782o949j5889M954N780j0135J2997P527q808N88J7337K6770
13660C3767K09j8262j6400O796m679K383P489j87j3908R44M645J0382L382j2482
13646D079j2327j722j5899J003J3788J1057J1594O2n275j1914o140M958j042R989
$$ y = [8015, 11849, 13969, 7978, 873, 7349, 4891, 4891, 4440, -3866, -8415, -5727, -11178, -16144, -13316, -13149, -9152, -10177, -14516, -13304, -14208, -22082, -34524, -34010, -15838, -11503, 2281, 5714, 7901, 7882, 20536, 18217, 28197, 29956, 9145, -11515, 3998, 5373, 14339, 9883, 3991, 5405, -5455, 1324, 10874, 17826, 24632, 14110, -1802, 3369, 11361, 20074, 5912, 2206, 19598, 13578, 5923, 1752, 10022, 9495, 14480, 12270, 13497, 5570, -5304, -11123, 4300, 7227, 12554, 11766, 12459, 2014, 5743, 10492, 11377, -405, -7354, -23243, -18289, -12509, -22644, -9647, -2120, -10928, -10340, 6997, 33767, 33976, 15714, -686, 6110, 1431, 3814, 11303, 11116, -2792, -1848, 2797, 13179, 16561, 4079, -8248, -9970, -25869, -24866, -11078, -21, 11573, 11635, 6360, -5554, -11694, -6736, -7778, 2211]
13632B211M451o314R86q406l6K097m095j0929R503j122l283m297O205K072N277
13617e680p015k062R418J809l766k215P34P029M456k3786O251J060M748p587q083
13602b4689O669P745J678j3690q136r51P359R745K116r103Q670P877J1421J855
13588H566l368O981N979j4591j4894k251K770J641k198K03k671m541l921N580
13574a6715J3308j4175l062J3204K444M435J758j3029j69n622Q106N441n169q037
13560a7282l35O994j225O224N548M41q001o766j0494r690j5954L138K3634R050
13546a4718K055n156L671O158o77P43j7225r087L087K809o26J507K0201J7188
13532I930J0633R745j3905l369L256P730M522R09Q193J9440q74k900J210J2848
$$ y = [2211, 6662, 348, 1334, -7072, -7108, -5011, -9106, -20035, -10532, -11654, -14937, -19234, -13029, -10957, -5680, -12695, -14757, -5339, -3530, -7296, -9511, -8777, -1748, 2708, -21078, -14827, -13767, -9019, -16606, -24689, -18020, -10275, -8597, -22287, -30423, -31374, -24015, -14270, -12154, -21257, -12587, -4710, 6711, 8566, 5198, 12179, 18158, 3567, -11327, -13578, -10808, -9167, -11365, -11162, -13833, -18374, -22295, -16715, -3407, -17582, -20644, -7440, -4996, -561, 1197, -11832, -12001, -17623, -9517, -4076, -9245, -17282, -17617, -10623, -11848, -5624, -76, 365, -7636, -14402, -24896, -34586, -50540, -47402, -23768, -14718, -12663, -17819, -14148, -7990, -8667, -7924, -25149, -34236, -31149, -28340, -28966, -27459, -7258, 9930, 20563, 30308, 16403, 13034, 16290, 24020, 28542, 29451, 37644, 57084, 56210, 53310, 54520, 67368]
13518F7368J8658P077J2232P78l271J37L602q057j1029j4331k9844j2584j7761
13505A2975o793p820J395O014M942j3443j7039j682J4261L518P241L739R713m595
13491A2426o276n458k146M115Q013p736o070n596m635j131n932J6187J5570M340
13477A5671J4001P741m661j6939n786l949j6607q04m257p937L622j740k060N118
13463a8587J2455O120J0726J3143o377j5185j4160q16r72k879m655P76j933K696
13449a9648j6508Q854K6383J0837r787o745p253K747J0753j4605l781O196J1306
13436a251O650m521P972q453m705l517j594O96J490P926l691J0350J062J540j4209
13421d255j0215L462r00J793P104L711j6284j4105j0664J2002P325J1289j250
$$ y = [67368, 86026, 93103, 105335, 106113, 102842, 102979, 106581, 98524, 87495, 73164, 43320, 30736, 12975, 6182, -1638, -243, 5771, 10713, -2730, -19769, -21451, -7190, -3672, 3569, 7308, 17021, 12426, 6150, 692, -1454, 2661, 10674, 2938, -3132, -8728, -13363, -14494, -20426, -4239, 11331, 15671, 29672, 37413, 32752, 15813, 10027, 6078, -10529, -11333, -15590, -23527, -19905, -21645, -23705, -18587, -6132, -12, 10714, 23857, 17480, 2295, -11865, -12681, -13653, -16532, -21187, -20411, -22344, -19648, -36156, -27302, -919, 9918, 131, -6614, -13867, -11120, -367, -14972, -18753, -12557, -1251, 5399, 878, 8850, 397, -4308, -7825, -9419, -8723, -7233, 693, -2998, 7352, 8414, 9954, -4255, -14470, -11008, -11908, -10115, -3011, 700, -15584, -29689, -40353, -28351, -21026, -9737, -10987]
13408a0987q286O850N508l460O529m868M339j574m257k699k842k812P293n585
13394a6851J4839J5619J13o997K935p229L425J2479l075o305J275L358n851m865
13380B870J0707l399M207N779o908p25P129j6897k970m1k582J4228N869j3641
13366C626J769M682N958j0810n681O03r370O537J520o968j6020k801P809O551
13352a2595P90P814j212m047R244j945r382L938O038L667n088M887N48k067Q999
13337I589o630j5128p461k140L006o648j2299K898J0102N202q747K985P235J2303
13323e733l885R608P775J9798L440M40P575J7258P859q47J403J4912J7349R375
13309A06327K7446K7148L4792N2243O9807R5361J54687K39406L78150N04509M00308
$$ y = [-10987, -19273, -12423, -6915, -10375, -3846, -8714, -4375, -5949, -10206, -12905, -15747, -18559, -11266, -16851, -2012, 13607, 13720, 6723, 9658, 2429, 5854, 18333, 15258, 8953, 10228, 13586, 7735, 2870, 13577, 10178, 14385, 20164, 13256, 12531, 19660, 2763, -207, -248, -2830, 11398, 17267, 3626, 5395, 10077, 16035, 5225, -456, 147, -9223, -2686, -1166, -8134, -24154, -26955, -19146, -12595, -11805, -3991, -5203, -9250, -6, -1951, -11333, -7395, -1357, 2310, -2778, 2109, 2657, 590, 9589, 2959, -12169, -19630, -21770, -18764, -25412, -37711, -34813, -24711, -19509, -28256, -25271, -18036, -5733, -9618, -10, 7765, 27563, 31003, 31443, 39018, 56276, 64135, 63288, 64691, 79603, 96952, 106327, 133773, 160921, 195713, 247956, 317763, 413124, 567811, 807217, 1185367, 1689876, 2090184]
13298B090184J0646k26988j63079N1587K40214J83798j61681m47739m52712l43788
13288G80442j92794j19714j09091p7244n1285j7803j8029l7911l2611k1680N542
13277A07822j1347j0857o287j9719j4933j3354R00J7025L59n078r752o739m474
13264B3566q86j806j4015k512l102R729K459P586P789P430j3426j9654J2931O482
13250B2571J267J092p377J7919K50j9238j1684J761M730J5855l783m924m652N35
13236A4322R802j0439j3416O53P140J0963l48j0757K206L729j7336j8886m593
13223b6960k62k261k197p420J95j065L573p483r328J6177L267Q16J36Q721J195
13208b2896K741J0117n718o135O81J4728N671j653Q098j9618j1186J1165J1228
$$ y = [2090184, 2100830, 1873842, 1710763, 1762350, 2002564, 2186362, 2024681, 1576942, 1124230, 780442, 587648, 467934, 358843, 281599, 230314, 212511, 194482, 156571, 123960, 102280, 107822, 96475, 85618, 79331, 59612, 44679, 31325, 32225, 49250, 49609, 44531, 34779, 28040, 23566, 22680, 20874, 6859, 4347, 1245, 10974, 13433, 21019, 28808, 36238, 22812, 3158, 16089, 22571, 23838, 24930, 17553, 35472, 35722, 16484, 4800, 6561, 11291, 27146, 23363, 18439, 13787, 14322, 24124, 13685, 269, 922, 8062, 19025, 18677, 7920, 10126, 13855, -3481, -22367, -26960, -27222, -29483, -31680, -39100, -38905, -39970, -36397, -43880, -53208, -37031, -33764, -32948, -32812, -24091, -22896, -20155, -10038, -15756, -21891, -21210, -6482, -811, -2464, 5634, -13984, -25170, -14005, -2777]
13195b777P685q58m620k4526n063m3j003P856m111k894j6694M07l358M284j191
13180d6906N229O264J2336J8449n44O93Q935K1108J586j9093j4922K6067K5951
13167D5153K65r814j1398j2352l928K676K690j4361p713r362q80J5759j148L691
13153g22P892O40Q229J0213M31j0862l17p938J120l534o400j6456J782K1095O962
13138A2135o226N276P090O335o683R373J3963J4000K4267K3682J6956J0848M943
13125A35959l729J045J6401M6514L0770j3559l4973l0483j5623P345J8649q657
13113A49659k5593l5296j0557j8666k0489k1526p742j0061o584k660m681n115
13101a9311Q937R347J210M609M426K6864J2308J0734K306j7432n144n123M391
$$ y = [-2777, 4908, 4050, -570, -25096, -30159, -30202, -31205, -23349, -27460, -30354, -47048, -46641, -49999, -45715, -46906, -41677, -35413, -23077, -4628, -5172, -4479, 4456, 25564, 27150, 8057, -6865, 19202, 45153, 45418, 35604, 24206, 11854, 7926, 10602, 13292, -1069, -8782, -18144, -19024, -3265, -4413, -722, 7170, 7810, 16039, 26252, 26683, 15821, 15504, 7566, 8686, 5152, -1248, -17704, -15922, 5173, 12135, 5909, 11185, 18275, 24610, 17927, 27300, 41263, 55263, 79530, 103212, 120168, 131016, 135959, 132230, 133275, 149676, 196190, 226960, 213401, 178428, 147945, 132322, 139667, 158316, 149659, 124066, 88770, 78213, 59547, 39058, 17532, 9790, -271, -6855, -9515, -14196, -19311, -10374, -1027, 183, 4792, 9218, 36082, 48390, 59124, 61430, 43998, 38854, 33731, 38122]
13088C8122R313n172M279l285Q325r22n434k835J3763J2221r691j3953r382L779
13074C9128K786m609k8303j2197J3125n590k8368k3908k50K5346L4032M900r39
13061A5153J932M050j811P168Q318n930Q266P025J3150J2726J3278L7049O9352
13048A89726L6587k4710n8948l8964j7471P444K8579J9998j1534k2251m972q638
13036I4846j2090j9958j0518m196Q80L790M001J4214K9220J5122M41k4919o686
13023H4147R989N887K7392J7j7055o140J0498K2645K0345R900o847l113J6421
13010A74086L6478L6529M7262M9696N8047N2597K2967k2798k8272k6467k0180
12999C79945P995O5560J07841J23639O2155o5707j52028o9679L9100J17619J14211
$$ y = [38122, 47435, 42263, 46542, 43257, 51582, 50660, 45226, 42391, 56154, 68375, 58684, 44731, 35349, 39128, 41914, 37305, 9002, -3195, 9930, 4340, -24028, -47936, -48186, -22840, 11192, 16092, 15153, 17085, 21135, 19324, 26492, 34810, 28880, 37146, 44171, 57321, 70047, 83325, 120374, 189726, 226313, 201603, 142655, 103691, 86220, 93664, 122243, 142241, 130707, 108456, 103484, 94846, 82756, 62798, 52280, 48084, 48964, 52754, 56755, 70969, 100189, 115311, 115752, 90833, 84147, 94136, 100023, 127415, 127432, 110377, 104237, 114735, 137380, 157725, 167625, 160778, 157665, 174086, 210564, 247093, 294355, 344051, 402098, 454695, 477662, 454864, 426592, 400125, 379945, 387940, 453500, 561341, 684980, 747135, 681428, 529400, 459721, 498821, 616440, 730651]
12988G30651j1390j53781j74921r5242k3479P315n386j242L480k0206k2486j307
12976B32006j9606k2339j7989j2851j945j2926r354j878n112k854r015P000K7703
12963A50840L3306J6637Q36Q913k857n06K0655J4747J137m423J641O098l96N753
12949B52381L0085L7844J8877k705L837J9326L7436O1907N8615K6304P382J2781
12937E64070K0288L1885L5305K7119l166J571L0079L8715L6485K6825J1691l710
12925H17157l642K5845K5223N1298K4086R63O602K5799K1525J4596M6739P7181
12913A133372Q6717J01719Q8930J02053J31298J31743J33303J27427J61924K02450
12903B400936J91014J34018J21921J85819K76726L80741M02644L56264L41565
$$ y = [730651, 719261, 565480, 390559, 295317, 271838, 279153, 273767, 272525, 276005, 255799, 233313, 232006, 212400, 190061, 172072, 159221, 157276, 144350, 134996, 133118, 128006, 125152, 116137, 123137, 150840, 184146, 200783, 201619, 210532, 207675, 207169, 227824, 242571, 243708, 239285, 240926, 247024, 246628, 252381, 282466, 320310, 339187, 336482, 340319, 359645, 397081, 458988, 517603, 543907, 551289, 564070, 584358, 616243, 651548, 678667, 675501, 677072, 707151, 745866, 782351, 809176, 820867, 817157, 813515, 839360, 864583, 915881, 939967, 940930, 947532, 973331, 994856, 1009452, 1056191, 1133372, 1220089, 1321808, 1410738, 1512791, 1644089, 1775832, 1909135, 2036562, 2198486, 2400936, 2591950, 2725968, 2847889, 3033708, 3310434, 3691175, 4093819, 4450083, 4791648]
12894D791648M14341N20550O47325P95676R32855J089334J355120J612869J628728
12885A3788446J660674J889022K072346K328488K980036L898556N245554P232169
12877D1095291R972910J4422636K2531841L6976562O0660966Q9055772Q8111337
12870C62827315K3802023l9420056m3954568p278135M0708740N4893643k008187
12863C89570775o9186312q5697925o9275272m6101497k9520847j9667699j3966646
12856E6154577j0189897p317623n274593m160061l656569l329209k835697k089160
12848A7301768j496186j415403j623108j589225j312761r92833p50802n99848
12840G521602n71350n45706m70980l91757l14963k67735k88959l16991k84495
$$ y = [4791648, 5205989, 5726539, 6373864, 7169540, 8102395, 9191729, 10546849, 12159718, 13788446, 15449120, 17338142, 19410488, 21738976, 24719012, 28617568, 33863122, 41095291, 51068201, 65490837, 88022678, 124999240, 185660206, 274715978, 362827315, 386629338, 347209282, 303254714, 295976579, 336685319, 391578962, 389570775, 320384463, 234686538, 165411266, 119309769, 89788922, 70121223, 56154577, 45964680, 38647057, 33372464, 29212403, 25555834, 22226625, 19390928, 17301768, 15805582, 14390179, 12767071, 11177846, 9865085, 8872252, 8121450, 7521602, 6950252, 6404546, 5933566, 5541809, 5226846, 4959111, 4670152, 4353161, 4068666]
12831D068666k31671j59857j47285j64836j58155j28713j01462r3599r4838q8716
12821B699534q7837p5858q5120r5287j06390j06965j02881j02204p4568p2142
12811A790282o4178m9704o7870q6213p1969m2960l2314k9771l3645m7896l7367
12800A226395m3604k8840q584n511k4674m5152k4087J2100J5225K226j3310p962
12788A054222q155p949j9962p848j5038j5328K709M742m2700k3350r784J031n404
12775I07186j9120k3560j6982j1637N401J1079J1333K090k7593k6658j9893n920
12763G85726j5792l1941j1290q287k5098l6266o904j3364j0073k2871p893K66
12751E96213N566M475P785j135k721m422m535L8451O1282Q914m8752o0322l5656
$$ y = [4068666, 3836995, 3677138, 3529853, 3365017, 3206862, 3078149, 2976687, 2883088, 2788250, 2699534, 2611697, 2535839, 2450719, 2355432, 2249042, 2142077, 2039196, 1936992, 1862424, 1790282, 1726104, 1676400, 1608530, 1522317, 1450348, 1407388, 1375074, 1345303, 1311658, 1263762, 1226395, 1182791, 1153951, 1145367, 1139856, 1115182, 1070030, 1045943, 1058043, 1073268, 1075494, 1062184, 1054222, 1046067, 1038118, 1018156, 1010308, 995270, 979942, 982651, 987393, 944693, 921343, 911559, 912590, 907186, 888066, 864506, 847524, 835887, 841288, 852367, 863700, 865790, 838197, 811539, 791646, 785726, 769934, 737993, 726703, 718416, 693318, 657052, 650148, 636784, 626711, 603840, 595947, 596213, 601779, 606254, 614039, 612904, 610183, 605761, 601226, 639677, 700959, 709873, 661121, 600799, 565143]
12738E65143K8377J834n1321p6558m8905l8767m6605k2360j9098k0827o347o503
12726B58063N942L6798K5969R638J4540q546j5650P287J6582R577j5903l7960
12714C06337j8592J7862J0678n359K883j6136j1858J1921J5835J2146k444p469
12702C15804j8003j2744P574L439p215L172k3200l4827j9525j0384Q473L741j0708
12689B05597R22J5286q997R74J8707K3789K0513p557j6652O431J1735p812k768
12676B60168J0920o999k569L790L35m379L798k500J544M231P418r508p411p250
12662B51588r323k1191n179J264r474j5666j2746m551L587j875j9751J12K5518
12649A82313J6540n406j2556j0248R660k523l885K789n485R986J6063R463Q848
$$ y = [565143, 593520, 595354, 544033, 467475, 418570, 379803, 333198, 310838, 291740, 270913, 264566, 258063, 264005, 300803, 326772, 336410, 350950, 342404, 326754, 334041, 350623, 360200, 344297, 306337, 287745, 305607, 316285, 310926, 313809, 297673, 285815, 297736, 313571, 325717, 323273, 315804, 297801, 285057, 292631, 296070, 288855, 292027, 268827, 234000, 214475, 204091, 212564, 216305, 205597, 206519, 221805, 212808, 213782, 232489, 256278, 276791, 269234, 252582, 259013, 270748, 262936, 260168, 271088, 264089, 261520, 265310, 265645, 261266, 265064, 262564, 264108, 268339, 275757, 266249, 258838, 251588, 242265, 221074, 215895, 217159, 207685, 192019, 179273, 174722, 178309, 176434, 156683, 156795, 182313, 198853, 193447, 180891, 170643, 180303, 177780, 173895, 176684, 171199, 181185, 197248, 206711, 215559]
12636B15559j2063j0409P096N316m53o771l820J300N28P893P87k23R492J3182
12622B27414J2457N403J2518J4808L1344M7760Q3941J02247M8984k7866n2586
12611E06424l5360q402K1157M0406L1569n1363r1903p3425n4620l8957o031j918
12599B37577p292k6280j3193j564K737R490L875j2242l0847r709r059j0472k966
12586A30055j751J2553K285J0123N690j1721k135j4720o744j1953j1705J121o425
12573I4673k651J0482N264J178k1070j6914k246J1875K46l671k686L07N886J7494
12559I8167J3834J1737O546q174N022R665P157j1261j386J3185P157n913o887
12546A38849n972j07q585q003r30k633M163l873q218j1361q36j519J1367p002
$$ y = [215559, 203496, 193087, 200183, 205499, 205046, 198275, 194455, 195755, 196283, 204176, 204963, 204740, 214232, 227414, 239871, 245274, 257792, 272600, 303944, 351704, 435645, 537892, 586876, 559010, 506424, 471064, 462662, 483819, 524225, 555794, 504431, 412528, 339103, 284483, 245526, 239495, 237577, 230285, 204005, 190812, 189248, 191985, 201475, 205350, 193108, 162261, 152552, 143493, 133021, 130055, 128304, 140857, 143142, 153265, 158955, 147234, 145099, 130379, 123635, 111682, 99977, 101098, 94673, 92022, 102504, 107768, 108946, 87876, 70962, 68716, 80591, 80837, 77166, 74480, 74787, 80673, 98167, 112001, 123738, 130284, 122110, 127132, 136797, 143954, 132693, 131307, 144492, 151649, 145736, 138849, 132877, 132770, 124185, 116182, 115252, 112619, 116782, 112909, 104691, 93330, 92494, 90975, 102342, 95340]
12532I5340p696q610M070L971j645L310k613M948J069M599L274J4773O107o144
12518A14753j6550q759K933O869L687L84m15o119m229n284N64Q09k238O36j458
12503H5583N482J261K487r024k079p534P658l19j533m906n74P624K677P405L884
12488I8092j0952j5952J0572M385j8451p203l037p951J4135P632j0061N363M069
12475G0641J617k216o615p476R258J5994R246O796M061o30q950k409j0322m349
12461G4646Q798P612j2278R176J0154M551p93K3115J3021M36l209J2813J2531
12448A60573J5644J3899J5811L8764L7378N0906P0522Q8318J59990K53075L91599
12437A296479M88624L65085O628k21184j64306N7749K52751J76249j82777m35748
$$ y = [95340, 87644, 79034, 83104, 87075, 85430, 88740, 86127, 91075, 92144, 96743, 100017, 114790, 120897, 114753, 98203, 89444, 92377, 99246, 102933, 103317, 102902, 96783, 92554, 87270, 87834, 88643, 86405, 87041, 85583, 91065, 92326, 94813, 85789, 83710, 76176, 83834, 83515, 81982, 77076, 76502, 84126, 86803, 94208, 98092, 87140, 71188, 81760, 86145, 67694, 60491, 57454, 49503, 63638, 71270, 61209, 66572, 70641, 72258, 70042, 63427, 55951, 65209, 81203, 90449, 97245, 101306, 100676, 91726, 89317, 78995, 74646, 83444, 91056, 78778, 87954, 98108, 102659, 101866, 124981, 138002, 138438, 135229, 148042, 160573, 176217, 190116, 205927, 244691, 282069, 332975, 403497, 491815, 651805, 904880, 1296479, 1785103, 2150188, 2156816, 1935632, 1771326, 1829075, 2081826, 2258075, 2075298, 1639550]
12427A639550m21181l33612k32109j49861q6636n7393m2355n516j150l0771k7476
12416B51490l0566l2412j4094k157j1679J039l018j7640p093J4986m994j4063
12404A29799j3476j7838j8759P147L162j2739p757K461Q39l276q429K466J11J5032
12390G8743J0646J2034j458q950j6187l862m948j259J922P664r86J3697R328J6730
12376A13114K7858K9895N8392L3167k1125n2529m3759l0412j8944j3278j0689
12365G1690q09k015j0491l297j2315n046j0554J619J5066J588J740M423m651j1572
12351C5376p839L251J0360o370J0856P335K148J3613j4690j0364q6Q492k262J186
12337E1006R145R00P405j2771O616L0857N0341O6416L7802j4082m1251m7921m5822
$$ y = [1639550, 1218369, 884757, 652648, 502787, 416151, 358758, 316403, 310887, 309737, 278966, 251490, 220924, 188512, 174418, 172261, 160582, 161621, 158603, 140963, 133870, 148856, 143862, 129799, 116323, 98485, 79726, 86873, 90035, 77296, 69539, 72000, 72839, 69563, 61134, 63600, 63711, 78743, 89389, 101423, 99965, 91015, 74828, 70966, 66018, 64759, 66681, 74345, 73359, 87056, 96384, 113114, 140972, 170867, 229259, 262426, 241301, 188772, 145013, 114601, 95657, 82379, 71690, 70881, 68866, 58375, 55078, 42763, 37717, 27163, 28782, 43848, 45436, 47176, 51599, 46948, 35376, 27537, 30788, 41148, 34778, 45634, 52969, 55117, 68730, 54040, 43676, 43590, 52082, 49820, 51006, 60151, 61051, 68456, 55685, 62301, 93158, 143499, 209915, 247717, 233635, 192384, 144463, 98641]
12324I8641l1731o340o611j7842R590J7896n962j9159m865J7509o840k19J1801
12311E5868j613J855J0630n941m192L138j1170k5241p210J8015Q100Q325J614
12298E2178j1237j5789p401l64P855J0278N245O161m270n960J5452K6144K8686
12285A06978P451j5239j6596q64j6415n850k45q297q229N026n71M73j995r208
12271C6419K553p235J990n508l552p367J0531o094r443O651P758j1521q397j848
12257D937M977J7293K424p845p175o311O564M492o745l634N537R941M787P01N76
12242C0519j7339P55J0434l837P390J8171k375n567j0812j1206Q266J0023O303
12229D0725J229m592N028P491p363k572Q795j566j456j288l448j9305q288O228
$$ y = [98641, 66910, 60570, 53959, 36117, 45707, 63603, 57641, 38482, 33617, 51126, 44286, 44067, 55868, 54255, 56110, 66740, 60799, 56607, 59745, 48575, 23334, 16124, 34139, 42239, 50564, 52178, 40941, 25152, 17751, 17387, 25242, 35520, 40765, 46926, 42656, 36696, 52148, 78292, 106978, 114429, 99190, 82594, 81730, 65315, 59465, 59220, 50923, 42694, 47720, 47149, 47622, 45627, 36419, 38972, 31737, 33727, 28219, 24667, 17300, 27831, 21737, 12294, 18945, 26703, 15182, 6785, 4937, 9914, 27207, 29631, 21786, 14611, 8300, 14864, 19356, 12611, 8977, 14514, 24455, 29242, 29943, 30519, 13180, 13935, 24369, 20532, 27922, 46093, 43718, 38151, 27339, 16133, 24399, 34422, 40725, 41954, 37362, 42390, 49881, 42518, 39946, 48741, 47175, 45719, 44431, 40983, 21678, 13390, 19618]
12215A9618O779M282o332k402n638J059l693N99Q958Q697R337L687j1150q846
12201B4955j5439q507j62J1532J4340J5517O668l418k365j1590M73N244r085r961
12187A8202J453O469j3948M359J6317J1493o517p146R86J1041R316q614m145L268
12173D2534M795j1828p842q065o327m989J324N096j44j0957O058O890n331L955
12159A5169J244k944j4721O770J4452Q959O524n816n754J7668J670J257m355j2827
12145B7296j2084N059K213k681n244o238O100q2R271l144K881J0355K635r841
12131B6496J4938L509m303J093m837o094k110l786k84j887j671L223J061j6175
12117I173O009k490m408K0522L690p981K710P060j4006K683L560n992j859m774
$$ y = [19618, 26397, 30679, 24347, 21945, 16307, 17366, 13673, 14272, 23230, 31927, 41264, 44951, 33801, 24955, 9516, 1009, 847, 12379, 26719, 42236, 48904, 45486, 43121, 31531, 32004, 37248, 28163, 18202, 19655, 26124, 12176, 16535, 32852, 44345, 37828, 30682, 31668, 42709, 52025, 43411, 39266, 42534, 47329, 35501, 27659, 19594, 13267, 8278, 9602, 14698, 14554, 3597, 9655, 16545, 11214, 15169, 16413, 13469, -1252, 5518, 19970, 28929, 35453, 29637, 23883, 41551, 43221, 44478, 40123, 27296, 15212, 20271, 22484, 19803, 14559, 8321, 14421, 14339, 23610, 20466, 23347, 33702, 36337, 26496, 41434, 44943, 40640, 41733, 36896, 30802, 28692, 24906, 24622, 22735, 21064, 24287, 25348, 9173, 15182, 12692, 8284, 28806, 32496, 24515, 27225, 34285, 20279, 22962, 26522, 20530, 18671, 13897]
12103A3897M280j2905l236J681N000M089L351L095m910m000Q792J2841j1385j7206
12089C384m058P339J9123J6341j7536r471m306J8958K3507J6336Q160j5148j6444
12076D6185r211M509l237j0686q454j038K037p13n52Q848m183j530j0191p350
12062D434p172j0970q66N672J1795N086j2878j115J2109J0372O687n400j195o959
12048I600r707k791J265M867J463n256J1648j219l064N450J1076l272Q185Q478
12034C6723N34j0379o740r989j835J1630P771r252r62o99J4248k343j4801N1K530
12019A6487O320N207J6785r144j2126q087j06k068p594l725k902j429R987n819
12005A786k633j549N291O641M474J2329l712k0369j8769m14J9475J4699J2725
$$ y = [13897, 18177, 5272, 2036, 3717, 8717, 12806, 16157, 19252, 14342, 10342, 19134, 31975, 20590, 3384, -674, 6665, 25788, 42129, 24593, 15122, 10816, 29774, 53281, 69617, 77777, 62629, 46185, 36974, 41483, 38246, 27560, 19106, 18068, 20105, 19392, 18840, 27688, 23505, 21975, 11784, 4434, -2738, -13708, -14574, -8902, 2893, 7979, -4899, -6014, 6095, 16467, 23154, 17754, 16559, 9600, -107, -2898, -1633, 3234, 4697, -559, 11089, 9870, 6806, 12256, 23332, 20060, 28245, 36723, 37257, 26878, 20138, 10149, 8314, 19944, 27715, 18463, 17501, 16802, 31050, 28707, 13906, 13957, 16487, 22807, 28014, 44799, 35655, 23529, 15442, 15336, 13268, 5674, 1949, -953, -2382, 7605, 1786, -847, -2396, 2895, 9536, 14010, 26339, 22627, 2258, -16511, -16925, 2550, 17249, 29974]
11992B9974m411J694j3384m832l543P651J0069J4770j3266j0368k484M439k609
11979A3700j6633j0436k700J6670J4579N392o620P630m210o007k379m069m353
11966E64j811M70j071J0807N831J111Q317O38Q565j1069O990M9j3011J394J1122
11951B8896K378q022r373j0750o497N560K0802N278R18R03n820J1477K1768K567
11937F0085q664j545O142j333j0234r294j3186m753n009l919O57P695R693q895
11923A7440k703n164N622K30j7700j2349N599n047L1961J5827j8624k266j4058
11910a232k002l16P414R724K928l431l164L345p676j233p568J5665J7724j866
11896B8312k3780j2305n331L657M020j019L609o381O82q227N790k663R115J2186
$$ y = [29974, 25563, 27257, 13873, 9041, 5498, 13149, 23218, 37988, 24722, 14354, 11870, 16309, 13700, -2933, -13369, -16069, 601, 15180, 20572, 13952, 21582, 17372, 11365, 8986, 4917, 564, -1247, -777, -1848, 8959, 14790, 15901, 24218, 24856, 33421, 22352, 29342, 29391, 16380, 17774, 28896, 31274, 23252, 13879, 3129, -3368, 2192, 22994, 28272, 29190, 30093, 24273, 35750, 57518, 60085, 51421, 49876, 56018, 54685, 44451, 35157, 21971, 17218, 12209, 8290, 8947, 16642, 26335, 17440, 14737, 9573, 15195, 15425, -2275, -14624, -9025, -14072, 17889, 33716, 15092, 12826, -1232, -3234, -3550, 3864, 13588, 16516, 13085, 9921, 13266, 5590, 4357, -3211, 12454, 30178, 28312, 4532, -7773, -13104, -9447, -5427, -6446, -2837, -9218, -8536, -16763, -10973, -13636, -4521, 7665]
11882G665j771m819K704O817k913k815K869n203q927j709L158N10Q808J0825N83
11867A5782j743J418Q824n120j3055j2695N141Q499p891q688Q13J6481K9911o427
11853C1250j9283q507L725J4935J148k354n081n831j0376n525Q778N945N190l287
11839A0727j5826n458J5290J0473N236j0880j1723q033l763J163O266m690k207
11826a3425J0133j710J4484q273j3292k385o072l906j978q20L667P709J5500J1823
11812A1455M565m904j3228M428J0585o677J09L612j3073O630O370M509k554R170
11798B0997m984N403n461j5990j9683l213J6187J7073q705j4956N818Q818L383
11785D687J03Q88J2429o048j7913J12r46j561R720j408l504l149J927p509J372
$$ y = [7665, 5894, 1075, 3779, 10596, 7683, 4868, 7737, 2534, -6393, -8102, -4944, -4434, 4374, 15199, 15782, 14039, 15457, 24281, 19161, 6106, -6589, -1448, 7051, -840, -9528, -8715, 7766, 37677, 31250, 11967, 3460, 7185, 22120, 23268, 20914, 15833, 10002, -374, -5899, 2879, 8824, 14014, 10727, -5099, -10557, 4733, 15206, 20442, 9562, -2161, -10194, -13957, -12794, -6528, -11218, -13425, -3292, -5002, 9482, 1209, -12083, -14468, -20540, -24446, -26424, -27244, -23577, -15868, -368, 11455, 16020, 11116, -2112, 2316, 12901, 6224, 6333, 9945, -3128, 3502, 9872, 14381, 11827, 20997, 16013, 21416, 15955, -35, -19718, -22931, -6744, 10329, 1624, -13332, -7514, 1304, 4687, 4790, 5678, 18107, 12059, -5854, -5742, -6688, -8249, 1471, 63, -3441, -6590, -4663, -12172, -10800]
11770a0800j212R198j0760J2250J0673j549m426j2250J349N480l901j1772p162
11757b4882m598l407K0229O661q051n632l006M676m478O828J0271k626N260k47
11743c002j0050P44j437J732Q098Q293L256k026M241N107m214n201J074k1142
11729a4527o196N546P211J3594m31j4521j2182P201J6153R554J7424p193j1984
11716I649l383R930n705j8672K407J9423j336K172m647j993M736Q066k338j6863
11702A446l223k288k16q51p11R247J5875J2257k411p567j0272p784M278j991l835
11687A954k558L172M202j3805J850J505l344r676j3454P393K920J2748N250j3536
11673a5379P509P898p278l069M660O198L450n606K742k089k373P296P802J427
$$ y = [-10800, -12012, -2814, -13574, -1324, 9349, 7800, 3374, -8876, -7527, -2047, -5948, -17720, -24882, -29480, -32887, -12658, -5997, -14048, -19680, -22686, -18010, -22488, -15660, -5389, -8015, -2755, -3002, -13052, -12308, -13745, -12013, -3915, 4378, 7634, 5608, 9849, 14956, 10742, 5541, 6615, -14527, -20723, -15177, -7966, 5628, 5197, -9324, -21506, -14305, 1848, 11402, 28826, 21633, 9649, 6266, 16196, 10491, -8181, -5774, 13649, 12313, 14485, 9838, 7845, 12581, 20647, 18309, 1446, -1777, -4065, -4281, -5132, -5843, 3404, 19279, 31536, 29125, 21558, 11286, 3502, 7780, 5789, 1954, -604, 2568, 6770, -7035, -5185, -3680, -7024, -16700, -30154, -22761, -19841, -7093, -1843, -15379, -7870, 28, -7250, -10319, -5659, 539, 3989, -1617, 1125, -964, -3337, 3959, 11761, 13188]
11659A3188o276P598L882r546L56P593k261m710j178l307k0272l966K0601L882
11645E584p535M01N678j01L969M171L502k157O14N249L018l351J21O85o08j3069
11629F171j1686K703O595j4923J984J6929J3396o230P524p763k772j6389k166
11616f627J984J1251j934N271j151l380k882r103o715J4495J9050O031m341j4555
11602G394j3205L00L133l062k149k549J561J024M440M894k6431p922L904Q057
11588b0611K3876J8398r477N202l321o104o289N478j802j888M541K974o439J1960
11574A6498O938j2617j2770J444L061O314R869K2348Q866o256N434R81k1274j5633
11560A3203K876N5J0505q287j8443m231J0963P37L720k791J285j152r392j2703
$$ y = [13188, 6912, 14510, 18392, 8846, 9202, 16795, 14534, 9824, 8646, 5339, -14933, -18899, 1702, 5584, -1951, -1550, 4128, 4027, 7996, 12167, 15669, 13512, 14126, 19375, 22393, 19042, 19163, 19848, 19240, 6171, -5515, -2812, 3783, -11140, -9156, 7773, 21169, 14939, 22463, 14700, 11928, -4461, -6627, -4643, 6608, 4674, 9945, 8794, 5414, 2532, -6571, -13286, 1209, 20259, 26290, 21949, 7394, -5811, -5511, -2378, -5440, -7589, -10138, -8577, -7553, -3113, 1781, -24650, -32572, -28668, -20611, 3265, 21663, 12186, 17388, 14067, 7963, 1674, 7152, 5350, 3462, 8003, 10977, 4538, 16498, 23436, 10819, -1951, -507, 2554, 8868, 18737, 41085, 49951, 43695, 49129, 50110, 28836, 13203, 16079, 16134, 26639, 18352, -91, -4322, 6641, 7378, 11098, 8307, 9592, 8440, -952, -13655]
11546a3655J54R548o761o571R662R555O211j0402m966p323P95J2129l997r80O280
11531c21J4194R90j9506j234O917l496N480k142j00j610M793J715m529o844L417
11516b276J70J7116R547m283M685l06O416k836n358k592k464j722J17r197l179
11501C838r870n442K319N73M587Q28r243k296L132k194o527o557Q32J314J3071
11486a1635J0640L034N443p079J067K520K042k426J2547O21j0668j4408q387J2122
11472d567J8470K033r487o391j3826j764K5459J3190J883k905j4581m533j5768
11459a2787l459K292K22J3190Q664Q115K213j273j3390o78J5465L52q783r246
11445H97R776k104o030j6623j7944O446J5492J1609O865N123n910K1112r6j1902
$$ y = [-13655, -13501, -3953, -10714, -17285, -7623, 1932, 8143, -2259, -7225, -14548, -13753, -1624, -5621, -6601, -321, 13873, 14863, -4643, -5877, 1040, -2456, 3024, 882, 782, -828, 3965, 5680, 1151, -5693, -2276, -2106, 15010, 24557, 20274, 24959, 24653, 31069, 28233, 22875, 20283, 17819, 16097, 16214, 7017, 3838, -6032, -11474, -9155, -8582, -3995, -3167, -12410, -14706, -11574, -13768, -20295, -26852, -26020, -24706, -11635, -995, 2039, 7482, 403, 1470, 3990, 6032, 3606, 16153, 16774, 6106, -8302, -16689, -4567, 13903, 15936, 6449, 58, -13768, -15532, 9927, 23117, 25000, 22095, 7514, 2981, -12787, -16246, -13954, -13732, -542, 8122, 16237, 18450, 17177, 3787, 3109, 18574, 18926, 10143, 897, 10673, 8569, 2539, -14084, -32028, -25582, -10090, 1519, 8384, 13507, 7597, 28709, 28613, 16711]
11431A6711p304q22L522O112J2470m506J0142j330j0438j872l560j3272j9203
11418a3350n068J1251J5146n054J931O779J3400l003j3753p515K370K2987l98
11405B5723p35l04m932o059o941N016Q773n361p912K996p692M338J122l446j3431
11390h845L254J4527l016N866O080L17p910M322R118l168j4061j5854q57M077
11376f150n73m253l839l921J3848J2232R268M921l600m64L685p721O425p066p371
11361E421P102j2329n959n562l354M319J1080Q942k852J65q033r106J989j977
11347a0154k322p286r166Q170J0178k549J021J0529R571J691j0438j191L236M180
11333E470L409k158j012L033Q081j3202M72N018J3831J900j0398n055q786j368
$$ y = [16711, 9407, 8585, 12107, 18219, 30689, 26183, 36325, 34995, 24557, 22685, 19125, 5853, -13350, -18418, -7167, 7979, 2925, 4856, 11635, 25035, 22032, 8279, 764, 3134, 26121, 25723, 24988, 24684, 19752, 13693, 6752, 11768, 20541, 15180, 7268, 10264, 2572, 6910, 8032, 4586, -8845, -5591, 8936, 5920, 11786, 17866, 18183, 10273, 14595, 23713, 20545, 6484, -9370, -10227, -6150, -6723, -10976, -14815, -18736, -4888, 7344, 16612, 21533, 17933, 17469, 21154, 13433, 19858, 12792, 5421, 12523, 194, -5765, -11327, -14681, -10362, 718, 9660, 6808, 6973, -1060, -10166, -8177, -10154, -12476, -19762, -28928, -20758, -10580, -13129, -12108, -1579, 7992, 9683, -755, -1946, 1290, 5470, 8879, 6721, 5709, 8742, 16823, 3621, 4093, 9111, 22942, 24842, 14444, 9389, 603, -765]
11319g65j7173K1077K2911Q35j5445m754p444l005O719L154r131l636O329l548
11305c876l774j1650r058K07K344N378J01K916m784m403K207J162J376l505O560
11290a8799N868Q876j513j0531J0524J8099J0048n129j5857k581n413l542k974
11277a2924p182l60n046M849Q807J4533q251n912j168L538j2930J185O825J0551
11263c485m597k089J724N580k680P15N933K920q059Q53J56l552N514L951j394
11248A490M259J971j0892J961R133K490p893N437m558q140p436l718J0098j327
11234g125k45j0687p296q386J0311j596J2608L572j418N743m907L844J701L459
11220d22M682n899m835N629P561l537j7974j3142M432J3546J073n209J438K786
$$ y = [-765, -17938, 3139, 26050, 26885, 11440, 6686, -758, -3763, 2956, 6110, -3021, -6657, -328, -3876, -7650, -19300, -28358, -28151, -25807, -20429, -20328, -17412, -22196, -26599, -24392, -23230, -21854, -25359, -18799, -12931, -4055, -5568, -16099, -5575, 12524, 22572, 17443, 1586, -995, -6408, -9950, -12924, -20106, -20466, -25512, -20663, -11856, 2677, -5574, -11486, -12654, -9116, -22046, -20861, -14036, -3485, -8082, -10171, -8447, -2867, -5547, -4832, 1101, 4021, -4038, -3185, -3029, -6581, -1067, 2884, 1490, 5749, 7720, -3172, -1211, 7922, 10412, 2519, 7956, 3398, -4742, -12178, -15896, -5798, -7125, -7370, -18057, -25353, -33739, -23428, -25024, -12416, -8844, -10262, -4519, -9426, -5582, -3881, -422, 4260, -1639, -6474, -845, 6716, 3179, -14795, -27937, -23505, -9959, -8886, -14095, -12657, -9871]
11206i871J1563J619j0340o783K414n015k448J690M48N028J2612L295j657k487
11192F8p884N563l32L211K842O104P265K739j3537p314O429M247m08M516M915
11177A8424R762o00n386q406k356J1555p824L06R310J105j6895n274K322j0152
11163d109k593L25k358j873l014N439r475q138M817m73R142N703J4209N191L036
11148A5829K020O85Q077j746j9944j9560k862M331J9655J1759r84r993j2521J783
11134c471k651J0733J1865q258j4868N841K0939R084k486q908n272k37L146l031
11120A2426n262K133o543N45P756l311P122M928k706o336j5083o178J961R057
11106E09l443L317m642o198j1812M496K0239J4259m118k638j952l898j4283N826
$$ y = [-9871, 1692, 3311, -7029, -13812, -11398, -16413, -18861, -17171, -16723, -11695, 917, 4212, 2555, 68, -7816, -2253, -2585, 626, 3468, 9572, 16837, 19576, 6039, -1275, 5154, 9401, 8993, 13509, 18424, 28186, 27586, 22200, 13794, 11438, 22993, 15169, 15475, 24785, 25890, 8995, 3721, 6043, -4109, -6702, -6377, -8735, -10608, -13622, -8183, -17658, -25796, -20979, -21452, -12310, -6607, 7602, 12793, 15829, 17849, 18534, 26611, 24865, 4921, -14639, -17501, -13170, 6485, 18244, 17260, 7267, -5254, -3471, -6122, 4611, 16476, 8218, -6650, -809, 20130, 29214, 26728, 17820, 12548, 12311, 15457, 12426, 7164, 9297, 2754, 3299, 11055, 7744, 14866, 19794, 17088, 10752, -4331, -10509, -8548, 509, -2934, 383, -4259, -10457, -22269, -17773, 2466, 16725, 12607, 9969, 8017, 4119, -10164, -4338]
11092d338J1106m302r025j613M346L583O508m751o927j2428O705L147p305N668
11078i626K211P087Q649N520K999j2789k910J3430o00o737l50M9m337l387o049
11063f840M256Q380O010J0517J3582O467j0664q210k542j512p722n908M759m477
11049F096o155P689M329j49o44j0194R148J461K836L922J8914n06o639n490r116
11034A5502n395L802l153k246L730Q603j35n163o084p207m910K420J5588k725
11020A2627O051P702j0236P73j949O524Q262K333L726r582m155L879K037L098
11006C1090J4755J706j2070K304L311K572l525j1568N027r892m006J621m840k129
10992A4356j253n896j1575l509R867K280K446l742k110n191k593r63o188P63M203
$$ y = [-4338, 6768, 2466, -6559, -8172, -3826, -243, 6265, 1514, -5413, -17841, -11136, -7989, -15294, -9626, -7415, -328, 8321, 13841, 16840, 4051, 1141, 14571, 13971, 7234, 6884, 6933, 2596, -791, -6840, -2584, 5796, 11806, 22323, 35905, 42372, 31708, 23498, 20956, 19444, 11722, 5814, 10573, 6096, -59, 7630, 11959, 11810, 11166, 972, 10120, 11581, 14417, 18339, 37253, 36747, 30108, 24618, 15502, 10107, 13909, 10756, 8510, 12240, 20843, 20708, 15545, 9461, 2254, -2656, -236, 15352, 12627, 18678, 26380, 16144, 16917, 14968, 21492, 29754, 32087, 35813, 26231, 22076, 25955, 27992, 31090, 45845, 47551, 35481, 37785, 41096, 43668, 40143, 28575, 33602, 23710, 19704, 21325, 16485, 14356, 13103, 7207, -4368, -7877, 1990, 4270, 6716, 2974, 864, -4327, -6920, -7883, -14071, -13308, -9105]
10977i105J2723K975M632r034n795J757J171l674R327M872m357R906M970r81M962
10962B4349l247l745j6785j9278r020l453p22L362J6919N100l868j4333r758k528
10948c7007J7759J4969m790j2102P615J1817K667q519N782o918j3645m681k058
10935b9111J0713Q838J1428N449j60k8771j3898J0017N657Q75J1842J0043J694
10922D616j4429P547J927p435j720o809L047J5130l101k918J228M468J232l643
10908h60J965l661q928O98J7559m421n650K795k580P369P82k137k0694j0193j437
10893b9393J0264N077M780q750M599R351k605J7024R999j2730j9688n69l86N388
10879g639J9757J4355r009p078J207M772O515j111Q927M021o649j0389j0777r615
$$ y = [-9105, 3618, 6593, 11225, 2191, -3604, -1847, -676, -4350, 4977, 9849, 5492, 15398, 20368, 19387, 24349, 21102, 17357, 572, -18706, -27726, -31179, -31901, -28539, -11620, -6520, -10388, -24721, -34479, -37007, -19248, -4279, -9069, -21171, -13556, -1739, 928, -7591, -1809, -8727, -22372, -27053, -29111, -18398, -9560, 1868, 7317, 7157, -21614, -35512, -25495, -19838, -18963, -7121, 2922, 4616, -9813, -2266, -339, -7774, -9494, -16303, -13256, 1874, -1227, -4145, -2917, 1551, 2783, -860, 1105, -2556, -11484, -10786, 6773, 2352, -3298, -503, -3083, 4286, 5068, 2931, -17763, -27956, -29393, -19129, -14052, -9272, -18022, -13423, -4072, -6677, 10347, 20346, 7616, -12072, -12641, -13027, -7639, 12118, 26473, 17464, 10386, 11593, 16365, 22880, 21769, 30696, 34717, 28068, 17679, 6902, -2713]
10865b713J7455k332r293K462n2k481o275r839K348M303J151J955J640P431m187
10850A573q598K51n764P765o39o535p657k494O139o519J236M600K504n09m789
10835a9436J027Q240M778M394R308m800L762k697m629n681p625N026l206m047
10821a5586J81n2k356J980O116K8079k767o569j3290k165J4764L135j0809r062
10807h401j932O186q390j2650j2673J7565K0777l409J060k319r056L011r21p405
10793a8557o265m405R849R17q811p642j574N817N563p107L721P545M939O525j575
10778a1060o394K327k11K443k257j2779N222J5303J4775j553j2764j5168k002
10765b4118K90j3518j1401M537K5269P179k355Q924n089j654m775o68J1150R1
$$ y = [-2713, 14742, 12410, 3117, 5579, 5527, 3046, -3229, -13068, -10720, -6417, -5266, -3311, -1671, 5760, 1573, -7025, -6774, -12538, -4773, -5412, -11947, -19604, -22098, -15959, -22478, -21242, -16642, -14138, -14647, -19436, -18409, -10169, -5391, -997, 8311, 3511, 7273, 4576, -53, -5734, -13359, -8333, -11539, -15586, -15405, -15457, -17813, -15833, -9717, 18362, 15595, 9026, -4264, -6429, 8335, 11470, 661, -8401, -10333, -4147, -12537, -25187, -37860, -20295, 482, -2927, -1867, -4186, -13242, -10231, -11152, -18557, -24822, -29227, -19378, -18461, -27272, -34914, -36488, -30671, -25108, -32215, -28494, -20949, -16010, -9485, -11060, -17454, -15127, -15338, -12895, -15152, -27931, -22709, -7406, 7369, 5816, -6948, -22116, -24118, -23828, -37346, -48747, -44210, -18941, -11762, -14117, -5193, -10282, -11936, -16711, -17379, -6229, -6138]
10751f138r247M423J1602N462M648o294k013J8333o418l929q294r001n64J9601
10737A2171J004j1474r010N154J3722p574k1591K625j5501j0150J5176M622k690
10724b3516L852o600m462p808J359J8876Q325J3383K312j901l956J1016O671k4680
10710g129Q073M402r985j0843O826Q134m740P045k967r981p80j632R151J94K203
10695b029M595m827K821Q38k044l820L337K485o029k619R536o957j0295L869o932
10680a8071J0555J1795m364p72k892J3278N152p135j6108p494O13j632m89R348
10666h216O187n775J859o544n500j7879J6941J2272k863o846k103R19J2932O532
10652A916p638m801p838j059j1604L782M581O742L168n323L354R643O177J685
$$ y = [-6138, -15385, -10962, 640, 6102, 10750, 4456, 2443, 20776, 14358, 10429, 2135, -6866, -7430, 12171, 13175, 1701, -7309, -2155, 11567, 3993, -17598, -14973, -30474, -40624, -25448, -20826, -23516, -19664, -26264, -30726, -38534, -37175, -18299, -9974, 3409, 5721, 3820, -136, 10880, 17551, -7129, 944, 5346, -4639, -15482, -8656, -522, -5262, 1783, -1184, -11165, -11945, -13577, -4426, -4232, -2029, 2566, -2261, 560, 1398, -646, -4466, -1129, 1356, -4673, -7292, 2244, -4713, -15008, -11139, -18071, -7516, 4279, -85, -857, -3749, 9529, 14681, 7546, -8562, -16056, -15443, -17075, -17564, -8216, -2029, -7804, -5945, -12489, -17989, -35868, -18927, -6655, -9518, -16364, -18467, -17548, -4616, 1916, -5722, -10523, -18361, -19420, -31024, -27242, -22661, -15919, -12751, -18074, -14720, -5077, 1100, 2785]
10638B785j0965O686J3330n216j708j0254k618p621j2884J3184J0106O125r259
10625h309K094j413j68o18Q813O588p777O480j420j1434l490o716j366N267R13
10610a2556Q576j232p041Q942R061N091K658J2535j2632j9194K871o626r641n845
10596b5033J8072Q464m653J188N345l996O108m904j6348j2227k154P344N790R953
10582g051j571K405o681q669l37j0784L089J4852J1885k232o40j483j811l091
10568a2119k120K935J1541p146K685O175j1988N660J7151j307K333n595j464n699
10554A042r897J7405N799P05j1834R57J662o389j923J5594K0645J6500j0910j9969
10540A9387r284l478P700J9304J3086Q724r122m855j1891j6130m907J1703k479
$$ y = [2785, -8180, -1494, 11836, 6620, 4912, -5342, -7960, -15581, -28465, -15281, -5175, 950, -8309, -6215, -7628, -7796, -8414, 399, 6987, -790, 5690, 4270, -7164, -10654, -17370, -18736, -13469, -12556, -3980, -5212, -12253, -3311, 5750, 10841, 13499, 26034, 13402, -5792, -2921, -9547, -19188, -25033, -6961, 1503, -3150, -1962, 3383, -613, 5495, 591, -15757, -27984, -30138, -22794, -17004, -7051, -8622, -6217, -12898, -21567, -21904, -32688, -29599, -14747, -2862, -5094, -5734, -7217, -9028, -12119, -14239, -11304, 237, -6909, -4224, 1951, -10037, -4377, 12774, 11467, 13800, 8205, 6741, 1042, -8855, 8550, 14349, 15054, 3220, 4177, 5839, -550, -2473, 13121, 33766, 50266, 39356, 19387, 10103, 6625, 14325, 33629, 46715, 55439, 46317, 41462, 29571, 13441, 8534, 20237, 17758]
10527A7758k541P633r18l544l277j1308o875o101K257K142p209J1327J322K337
10513C003J976p759M318K574J606K3160R900o731j0610J5256K4412J5123r790
10500F6438m837N79K238M210M781K1632l189k326k792J7440K8616K1486k59l335
10486A50682J7997L8493M8836M8797O0983J07851J72739K95142N01370Q98068
10476B340958J247252P10687m34545p69421m36305J70763P66946Q01827k58437
10467D139725j038181j022629o96967m05562k58269j55271j04550q9384o3373
10458C05539m1375m6277l7654j3512R276r244k5472l6603j4170n0M962p291j3186
10445G4943j78r338k539m433j0470n947J023M381j1868L61j383n151j0839o873
$$ y = [17758, 15217, 22850, 21932, 18388, 15111, 3803, -3072, -9173, -6916, -4774, -11983, -656, 666, 3003, 4979, -2780, 1538, 4112, 5718, 28878, 38778, 32047, 21437, 36693, 61105, 76228, 66438, 61601, 62180, 64418, 68628, 73409, 95041, 91852, 89526, 86734, 104174, 132790, 154276, 154017, 150682, 168679, 207172, 256008, 304805, 365788, 473639, 646378, 941520, 1442890, 2340958, 3588210, 4298897, 3864352, 3094931, 2658626, 2829389, 3596335, 4398162, 4139725, 3101544, 2078915, 1381948, 976386, 718117, 562846, 458296, 368912, 305539, 264164, 217887, 180233, 166721, 175997, 166753, 141281, 104678, 90508, 90458, 95420, 88129, 74943, 74765, 65427, 62888, 58455, 47985, 42038, 43061, 47442, 35574, 35935, 34552, 29401, 18562, 11689]
10431A1689O940J7673P621j8916j962N015O737o031m424K30R011J99j6382N224
10417B2624L694J528r552N649K109j1609r444J5535R342L629j6499k0602K0961
10404A7365K512r521J489p449M793M590L954j890j9414n731l195k224l976K830
10390a5867R663j674J1773J0355L358j0683l340Q204M584p599j0603k957Q728
10377C942K45J0273k8k940J8423l769k6928o119N531M017k618k008Q372K372K931
10362A1696P221m003q604K79r93q324p49L217M855O93K118l684R878M141o353
10347A1388j477K053j1418m373J5490q735j0470O143Q477L906P326n714O35O527
10333A9758j3218j3841l869J1106J0832M125j2051j4690J6800L184M233L645j2323
$$ y = [11689, 18629, 36302, 43923, 25007, 23045, 28060, 34797, 28766, 24342, 24572, 33583, 33782, 17400, 22624, 26318, 27846, 18294, 23943, 26052, 14443, 4999, 20534, 29876, 33505, 17006, -3596, 17365, 19877, 10356, 11845, 4396, 9189, 13779, 17733, 15843, -3571, -9302, -12497, -14721, -18697, -15867, -6204, -7878, 3895, 14250, 17608, 6925, 3585, 11789, 16373, 8774, -1829, -4786, 3942, 4187, 14460, 14432, 11492, 29915, 26146, -782, -6901, -1370, 2647, 29, -1979, 6393, 8765, 11696, 18917, 14914, 6310, 6589, 5596, -2728, -3477, -260, 4595, 5288, 7406, 3722, 13600, 17741, 11388, 9911, 11964, 546, -3827, 11663, 2928, -7542, -1399, 7078, 10984, 18310, 12596, 13231, 19758, 6540, -7301, -11170, -64, 10768, 14893, 2842, -11848, 4952, 8136, 12369, 16014, 3691]
10320C691j1941K372N415n051P277P091J1359n068j1600j4359N851J2825k985
10307D877M851M445M494L703M858p574j4318l884J402J4079N51n860j201J6484
10293B6907P769n479n892P353l940o274o503p962P192R78J4115O603j8218j8592
10279a943N18J1676K439n187j581j4200j2097P021J6886N940k14P85O090J1009
10265B7142R66l430r132M136J5370j8517j3736J1983K57N743M491L874M453R322
10251D2922n6P091n424k341L368o850k7070m975Q10k765j675o629r33m608P361
10236a774k041J1446J3407J0138L736r406O531o255m38k365j504N514L470m641
10222B5818M278J2128N57J12n741l443L765q862J198L247j5400n537Q386k043
$$ y = [3691, -8250, -5878, -463, -5514, 1763, 8854, 20213, 15145, 3545, -10814, -4963, 7862, 4877, 9728, 14173, 18667, 22370, 27228, 19654, 5336, 1452, 2854, 16933, 17484, 11624, 10423, 26907, 34676, 29197, 23305, 30658, 26718, 20444, 13941, 5979, 13171, 14149, 28264, 34867, 16649, -1943, -1425, 10251, 12690, 7503, 5922, -8278, -20375, -13354, 3532, 9472, 9258, 10043, 16133, 27142, 28108, 24678, 15546, 19682, 35052, 16535, 2799, 14782, 15039, 20782, 25273, 29147, 33600, 42922, 42866, 49957, 44533, 42192, 45560, 38710, 11640, 6665, 7475, 4710, 3035, -3594, -4527, -9135, -1774, -3815, 7631, 21038, 31176, 34912, 25506, 32037, 25782, 25344, 22979, 21475, 26989, 30459, 25818, 30096, 42224, 42781, 42893, 37152, 33709, 37474, 28612, 29810, 33057, 17657, 12120, 20506, 18463]
10208A8463J0036J8159K9215K9604M0523N8632J39291J81361J02700q1235j59569
10197C87180j27294q6599n6243k8951k0405j205j3230r206L061l874q535m544
10185C0155k454k897N755P414l173R335j2679j8897P8K658M814l438j0179J032
10171G524J3550L244N64j7789j2885N394l273j6499O396J1604n767k064m644J750
10157a2895m66L835J5330j910L553m79k188Q168K0439J9957J6516M978j686Q29
10143G3981j2824q256j739q378k1728r766P370m06j707J08J3502M360K3n676j3818
10128A5046q600k006M75r209J4107O368n67J672L421j180n360m579m144J816j998
10113E262J0294J1308j0141r930J2068P90p101P099O404n767j0678J058L046r62
$$ y = [18463, 28499, 46658, 75873, 105477, 146000, 204632, 343923, 525284, 627984, 546749, 387180, 259886, 173287, 117044, 88093, 67688, 66483, 53253, 44047, 47108, 43234, 34699, 30155, 27701, 24804, 30559, 37973, 34800, 44135, 31456, 12559, 12637, 15295, 20109, 16671, 6492, 7524, 21074, 24318, 24882, 7093, -5792, -398, -3671, -20170, -13774, -2170, -7937, -10001, -14645, -12895, -13361, -9526, 5804, 3894, 7447, 6968, 4780, 12948, 33387, 53344, 69860, 74838, 73152, 73981, 61157, 52901, 51162, 42784, 21056, 11290, 18660, 18254, 16547, 16655, 30157, 34517, 34540, 28864, 15046, 6446, 4440, 4915, -4294, 9813, 16181, 15614, 17286, 20707, 19527, 14167, 9588, 5444, 7260, 5262, 15556, 26864, 16723, 6793, 18861, 19651, 12550, 19649, 26053, 20286, 9608, 10666, 13712, 12750]
10099A2750j0746j890M803M994P404l339j5142P546J2366o788J0211J64j784n332
10085A5217P436j476q127j0033k836J0290m23K809k067J399M533Q729J0691M556
10071D0698k910j2457O166J4338N429n002j6626j0660J3021J6467M070j5112m629
10058C2793l155j0379m641Q019o94o953q19k436p592r90J9525J9565o440K077
10044C7880N264K069k0651j9068l057J1651j82N766j935L95L733r38O200J5829
10030D2956Q968m405j1033M245J4678J7100r49n931r764o491O072J5350j301j2285
10016E7210n610J5223J0877j939j8977q84N698o929M789l026j7340J64J7844J1046
10002F8146n08L389j3287n225l767n092k245N225J8134L5513P3530P5705j58o1709
$$ y = [12750, 2004, 114, 4917, 9911, 17315, 13976, -1166, 6380, 18746, 11958, 22169, 22333, 20549, 15217, 22653, 21177, 13050, 3017, 181, 10471, 10048, 12857, 10790, 12189, 16722, 25451, 36142, 40698, 37788, 25331, 31497, 45835, 51264, 46262, 29636, 18976, 31997, 48464, 52534, 37422, 32793, 29638, 19259, 14618, 22637, 21943, 14990, 14171, 11735, 4143, 3153, 22678, 42243, 35803, 37880, 43144, 45213, 24562, 5494, 2437, 14088, 13906, 19672, 17737, 18132, 21865, 20927, 27127, 42956, 51924, 47519, 36486, 40731, 55409, 72509, 71560, 65629, 55865, 49374, 55446, 70796, 69495, 57210, 51600, 66823, 77700, 75761, 56784, 55900, 61598, 54669, 59458, 56432, 39092, 39256, 57100, 68146, 67638, 71027, 57740, 52515, 48748, 43656, 41411, 46636, 64770, 100283, 173813, 249518, 249360, 187651]
9988A87651n5143m1710j8166j1769j3177k1148q994N509R521o962n96J3318n848
9975C2486j0287K772O707k033L503K1378K728l55r87j0365R004K907o329o564
9961D4565o814R864J134O100L358J1730J0460n628P718m751r614J0519L023j4125
9947F7539k2719K561J1071N676j2950j8732J3546J432Q626Q528J5371p195l470
9934F9284J0351O931J8814P142Q043J581J6908J8940J4507P189K3029J4400J4813
9921B31932J2421K7834J0954O981J1494j3750k7972l0432l0411n145M439k1848
9909A76497j6806p294j613r863k6601j2454p157P91j1125l0730j8596J2575R30
9896D8554K100J0222j0409j1626q774J1711m974m980q16M93l417K588Q677r896
$$ y = [187651, 132508, 90798, 72632, 60863, 47686, 26538, 17544, 23053, 32574, 25612, 25016, 38334, 32486, 22199, 24971, 31678, 29645, 33148, 54526, 57254, 56899, 55912, 45547, 54551, 57458, 51129, 44565, 37751, 47615, 48749, 54849, 58207, 69937, 80397, 74769, 82487, 77736, 68122, 78641, 81664, 67539, 44820, 47381, 58452, 64128, 51178, 32446, 45992, 47424, 56050, 64578, 79949, 72754, 69284, 79635, 86566, 105380, 112522, 120565, 122146, 139054, 157994, 172501, 179690, 202719, 217119, 231932, 244353, 272187, 283141, 290122, 301616, 287866, 259894, 229462, 199051, 193906, 198345, 176497, 159691, 152397, 150784, 140921, 114320, 101866, 94709, 95500, 84375, 53645, 35049, 47624, 48554, 50654, 60876, 50467, 38841, 30067, 41778, 36804, 31824, 31008, 31501, 28084, 30672, 39349, 29453]
9882B9453M076Q189j805N036n052p139N643M405Q557L583j4421o043O090K646
9868D3218Q047Q459j0817q555N76k127J2790J5013j2694q898K343Q088j950n157
9854D8336M021N56J827J0762j6605j575n383o061K994K960m372l425N098j2651
9840B6482O807n09M496K4838Q024M074p208p942j0026M977J8570M497k1466m081
9826E1533L235l565o755M477k036R513J888Q291j812l136p235j1511j3942j2235
9812A6710J5532L0022K202j0619j811m498r172N422K368k805j3787n110J4551
9799C9005J6420Q693J8127l017j1690j1399q058J404J714M090P297k57j1415P179
9785E8093N6j081J7201k450m022N535J819j6413r513Q340J4347R255q705O729
$$ y = [29453, 33529, 41718, 39913, 44949, 39897, 32758, 38401, 42806, 51363, 54946, 40525, 34482, 40572, 43218, 51265, 59724, 48907, 40352, 40928, 38801, 51591, 66604, 53910, 45012, 47355, 55443, 53493, 48336, 52357, 52913, 54740, 65502, 48897, 47322, 41939, 35878, 38872, 41832, 37460, 34035, 39133, 26482, 33289, 32780, 37276, 62114, 70138, 74212, 67004, 59062, 49036, 54013, 72583, 77080, 55614, 51533, 54768, 51203, 44448, 48925, 46889, 56402, 58290, 66581, 64769, 61633, 54398, 42887, 28945, 16710, 32242, 62264, 64466, 53847, 52036, 47538, 38366, 43788, 46156, 43351, 29564, 24454, 39005, 55425, 64118, 82245, 79228, 67538, 56139, 48081, 49485, 51199, 55289, 62586, 62329, 50914, 58093, 58149, 57068, 74269, 71819, 67797, 73332, 75151, 58738, 49225, 57565, 71912, 81167, 72462, 79191]
9771G9191J010o969m368L368q254n328l487Q784P451K05R877K2499J5031M685
9757A23695k916j4649l313j1060n913J841p63R29p122j393m410o505j5939l155
9743D9327Q883O883R175P212J2981r91q151n36j624J101j741P93R95J901P754
9728I3962No702N738M953q715o633J393K800j532J28J0661N274k976r307J2135
9713A01184m794l0164j255J7511R699k373p299J5834R478J5178Ln138o826m611
9699A06427J0992J2637J2986J3755j1921o715J968J5479J6527J3383J5741O014
9687B07273J4797J0514J2831m721j0828p922o301k1715k1864j8472K526N675p691
9674A54102k5751k51J3293R808R639K9699L2083K8340L9035L2189K3538K7241
$$ y = [79191, 80201, 73232, 68864, 72232, 63978, 58650, 55163, 63947, 71398, 71603, 81480, 103979, 119010, 123695, 120779, 106130, 102817, 91757, 85844, 87685, 86922, 87851, 80729, 79336, 74926, 68421, 52482, 49327, 58210, 65093, 74268, 81480, 94461, 93470, 85319, 84783, 83159, 84260, 82519, 83312, 84307, 86208, 93962, 93967, 87265, 93003, 97956, 89241, 82608, 84001, 86801, 85269, 85397, 96058, 101332, 98356, 89049, 101184, 96390, 66226, 64971, 82482, 92181, 89808, 82509, 98343, 107821, 122999, 123002, 117864, 111038, 106427, 117419, 130056, 143042, 156797, 144876, 138161, 140129, 155608, 172135, 185518, 201259, 207273, 222070, 232584, 245415, 240694, 229866, 221944, 215643, 193928, 172064, 153592, 156118, 161793, 154102, 128351, 128100, 141393, 151201, 160840, 190539, 222622, 250962, 289997, 322186, 345724, 372965]
9662C72965L0066K0722m795j2389j5655l1347k7740m2286m2390l2201k4113j3294
9650A77543n537j6165j299J3946j852o897r822M003j1646n37j3909M459N588l866
9636A34009O411J431J0262p343j0334J535j4866j3807N207J0504k742j253O577
9623A25591J0462J4130n14J4966L607N188J528k838L546m973O037J5298J4414
9610B06442j197L867O063K087K567j7396k2295j0104l985O028K374j6825Q318
9597A65944L424o322j3112N311O827m076J0229J6536K908j291r445j2859K418
9584A66492J767p530P142J5291j690o893m630n715j114Q385J1657J871r708j767
9570A73558O477O836J0216J5964J2702p738j3083j1932K667M214j6515m411J7852
$$ y = [372965, 403031, 423753, 418958, 406569, 390914, 359567, 331827, 289541, 247151, 214950, 190837, 177543, 172006, 155841, 154542, 168488, 166636, 159739, 149917, 153920, 142274, 141737, 127828, 132287, 137875, 134009, 140420, 141851, 152113, 144770, 134436, 135971, 121105, 107298, 112505, 123009, 120267, 119014, 125591, 136053, 150183, 149669, 164635, 168242, 173430, 174958, 172120, 175666, 170693, 176730, 192028, 206442, 205245, 209112, 215175, 217262, 219829, 202433, 180138, 170034, 166049, 172077, 174451, 157626, 165944, 169368, 163046, 149934, 155245, 162072, 157996, 168225, 184761, 187669, 186378, 176933, 164074, 166492, 168259, 160729, 167871, 183162, 181472, 174579, 169949, 164234, 163120, 171505, 183162, 185033, 175325, 173558, 180035, 186871, 197087, 213051, 225753, 218015, 204932, 193000, 195667, 199881, 183366, 178955, 196807]
9557A96807P891J1208J7389j0153j5130k2230j6303J2381J3176P083K347K2280
9545B26746J0491M409n537M237M251M009j9763j2098Q624N437N141P532J136p244
9531B37371k188m732L647M72M001J2877P301J1896j944j0380p569j4160n59O522
9517B42555J1285L519L878J6804O748L622J211j0137j0178J3940P994J5156J6001
9504C22398K549m646j5360L998Q148L820L707Q697k369J954j175Q951N580j11
9490C46141Q09J531J1666J1038n131L630J7906J1784l03L540N457J5102J0416
9477D33586k253p705l352O041J9916l01J5647Q599j1452p521L026J021q09M069
9463D58512L327R965J4060Q017J2428j2668l485J529O21L72n332k896L75m993
$$ y = [196807, 204698, 215906, 233295, 223142, 208012, 185782, 169479, 181860, 195036, 202119, 204466, 226746, 237237, 241646, 236109, 240346, 244597, 248606, 228843, 216745, 225369, 230806, 235947, 243479, 244615, 237371, 235183, 230451, 234098, 234570, 238571, 251448, 258749, 270645, 268701, 258321, 250752, 236592, 236033, 242555, 253840, 257359, 261237, 278041, 284789, 288411, 289622, 279485, 269307, 283247, 291241, 306397, 322398, 324947, 320301, 304941, 308939, 317087, 320907, 324614, 333311, 330942, 332896, 331721, 340672, 346252, 346141, 346950, 348481, 360147, 371185, 366054, 369684, 387590, 399374, 399071, 402611, 408068, 423170, 433586, 431333, 423628, 420276, 426317, 446233, 445932, 461579, 470178, 458726, 451205, 454231, 455252, 454443, 458512, 461839, 471804, 485864, 493881, 506309, 493641, 490156, 491685, 492306, 492678, 487346, 484450, 484825, 479832]
9449D79832K203P844N139L168J0450J0496J221O286j6621J986J8527R406N346
9436E45283n799J0350K1465K166j1691j510K367J2064O182J0025M139Q694Q235
9423F11970M339q021J1696K7119J0449j1374n910R307J2868J2152R689N893L661
9410F93838J3201J5733J5644J2022O612R485O889K406J2071q53R679J4921K6279
9397H37927J6119J3819M567J1420J8854J2865J2619Q520K0774Q515k178J0688
9385I74509J5063m870r81J1340J3568J3757K4300K6447K4616J2694P054J6995
9373A134492J5779J9633J1804K1216J1586M961J8795L1537M4841L5072J8432J9199
9361A387347K8088K0357J5488J7769K0314K7871K6472L5136K3589J9273J9779
$$ y = [479832, 482035, 489879, 495018, 498186, 508636, 519132, 520353, 526639, 510018, 512004, 530531, 539937, 545283, 539484, 549834, 571299, 573465, 561774, 560264, 562631, 574695, 580877, 590902, 595041, 603735, 611970, 616309, 608288, 619984, 647103, 657552, 646178, 640268, 649575, 662443, 674595, 684284, 690177, 693838, 707039, 722772, 738416, 750438, 757050, 766535, 773424, 775830, 787901, 787048, 796727, 811648, 837927, 854046, 867865, 872432, 883852, 902706, 915571, 928190, 936710, 957484, 965999, 963821, 974509, 989572, 984702, 983721, 995061, 1008629, 1022386, 1046686, 1073133, 1097749, 1110443, 1117497, 1134492, 1150271, 1169904, 1181708, 1202924, 1214510, 1219471, 1238266, 1269803, 1314644, 1349716, 1368148, 1387347, 1415435, 1435792, 1451280, 1469049, 1489363, 1517234, 1543706, 1578842, 1602431, 1621704, 1641483]
9350A641483K9226L2843J6829K6333L0667K8520L6904L2110K6118K8032L6151
9339A965216K5703J1906L0601K3254K3350K3029Q716K3853K7536K8786K6693L4981
9327B253624K3023M3452L9766K8153M2502M8240N3797M0689M4677L4413M0366
9316B692702O2539N9324O1464N8623N9272O8595O6662P0703N5833P5042P0798
9305C401557Q6523P9212N7715P8157R6584J00350R0118J00356J11177R2573R0375
9294D384697J10044J24234J39299J42478J21572J12764J48346J60678J59106J66769
9284E769987J48407J68680J96275J75855J80312K10535K06754K16206K30690K48002
9274G751703K48116K56824K85236K90057K99811L22791L29731L45420L78509M01575
$$ y = [1641483, 1670709, 1703552, 1720381, 1746714, 1777381, 1805901, 1842805, 1874915, 1901033, 1929065, 1965216, 1990919, 2002825, 2033426, 2056680, 2080030, 2103059, 2111775, 2135628, 2163164, 2191950, 2218643, 2253624, 2276647, 2320099, 2359865, 2388018, 2430520, 2478760, 2532557, 2573246, 2617923, 2652336, 2692702, 2755241, 2814565, 2876029, 2934652, 2993924, 3062519, 3129181, 3199884, 3255717, 3330759, 3401557, 3488080, 3567292, 3625007, 3703164, 3799748, 3900098, 3990216, 4090572, 4201749, 4294322, 4384697, 4494741, 4618975, 4758274, 4900752, 5022324, 5135088, 5283434, 5444112, 5603218, 5769987, 5918394, 6087074, 6283349, 6459204, 6639516, 6850051, 7056805, 7273011, 7503701, 7751703, 7999819, 8256643, 8541879, 8831936, 9131747, 9454538, 9784269, 10129689, 10508198, 10909773]
9264A0909773M34758M41316M55581M88014N10264N60760N87316O14778O51707
9255A5654267P04847P41931P78342Q50592R09302R52798J029338J083549J156813
9246B3861779J228937J339474J431943J554385J647531J768447J905946K047428
9238C6785870K194580K366754K529962K708087K906738L114772L327191L545143
9230E9479097L770146L970372M163575M329256M475480M572706M599168M577025
9222I3936825M440080M175176L843004L381567K791054K105956J337987N27131
9214A16538780l06616j112019j887020k579007l146403l632155m009073m272562
9206I5593925m421425m464138m458340m385344m267133m134738l949413l749810
$$ y = [10909773, 11344531, 11785847, 12241428, 12729442, 13239706, 13800466, 14387782, 15002560, 15654267, 16359114, 17101045, 17879387, 18729979, 19639281, 20592079, 21621417, 22704966, 23861779, 25090716, 26430190, 27862133, 29416518, 31064049, 32832496, 34738442, 36785870, 38980450, 41347204, 43877166, 46585253, 49491991, 52606763, 55933954, 59479097, 63249243, 67219615, 71383190, 75712446, 80187926, 84760632, 89359800, 93936825, 98376905, 102552081, 106395085, 109776652, 112567706, 114673662, 116011649, 116538780, 116232164, 115120145, 113233125, 110654118, 107507715, 103875560, 99866487, 95593925, 91172500, 86708362, 82250022, 77864678, 73597545, 69462807, 65513394, 61763584]
9198F1763584l538844l319736l133550k943419k750124k556940k389529k224285
9190C8907157k084585j943555j798357j682688j588935j473295j371097j275844
9182B5688801j185233j109697j042524r84344r23613q76681q35088p60806p13824
9173A7256991o88983o64833o06520n67558n45579n17744m85099m57089m29877
9164A2293709m09982m03105l91890l74819l44401l22064l14249l11559k76730
9155I144910k80308k57487k41001k37338k27773k08430k25046k16040j98942j84199
9145F868346j78997j64495j56506j53007j34309j24674j32705j42702j35417j17667
9135E427867j22774j29747j13902j02360j05722j12189j02013q5162r1675r0523
$$ y = [61763584, 58224740, 54905004, 51771454, 48828035, 46077911, 43520971, 41131442, 38907157, 36822572, 34879017, 33080660, 31397972, 29809037, 28335742, 26964645, 25688801, 24503568, 23393871, 22351347, 21367003, 20443390, 19566709, 18731621, 17970815, 17256991, 16568008, 15903175, 15296655, 14729097, 14183518, 13665774, 13180675, 12723586, 12293709, 11883727, 11480622, 11088732, 10713913, 10369512, 10047448, 9733199, 9421640, 9144910, 8864602, 8607115, 8366114, 8128776, 7901003, 7692573, 7467527, 7251487, 7052545, 6868346, 6689349, 6524854, 6368348, 6215341, 6081032, 5956358, 5823653, 5680951, 5545534, 5427867, 5305093, 5175346, 5061444, 4959084, 4853362, 4741173, 4639160, 4553998, 4462323, 4371800]
9125D371800p1616r8600r2461p6272o6922o7648q0192q2866o7312m5544n5766
9114C566601n5318n1432o7484n1521n9823p6207n8870o8616n1440n0785m7201
9103B927904m1673m7869m3899l6164m7464m5374l9934l1630m7519l3246k7942
9092B485190l4739m6355l0832l0253m1249l6341l0575l5595m6119m5627m0097
9081B067408l0588l3484l0015k2215l0741k8879k4425k3390j5007k1371m2553
9070A764740l4599k4427j7332j6427j3629j6875j3915j9720m2626j8781j1250
9059A535159k8727j8850j2457n743J402j9234k3904k7198k1573j1428J825j6036
9047A353236l2215k6117m561o94j6668q663q277O14r086j9088k6919l0417l1646
$$ y = [4371800, 4300184, 4201584, 4109123, 4032851, 3965929, 3898281, 3818089, 3735223, 3667911, 3622367, 3566601, 3511283, 3459851, 3392367, 3340846, 3281023, 3204816, 3145946, 3077330, 3025890, 2975105, 2927904, 2886231, 2838362, 2794463, 2758299, 2710835, 2665461, 2625527, 2593897, 2546378, 2513132, 2485190, 2450451, 2404096, 2373264, 2343011, 2301762, 2265421, 2234846, 2199251, 2153132, 2107505, 2067408, 2036820, 2003336, 1973321, 1951106, 1920365, 1891486, 1867061, 1843671, 1828664, 1807293, 1764740, 1730141, 1705714, 1688382, 1671955, 1658326, 1641451, 1627536, 1607816, 1565190, 1546409, 1535159, 1506432, 1487582, 1475125, 1469382, 1470784, 1451550, 1427646, 1400448, 1378875, 1367447, 1369272, 1353236, 1321021, 1294904, 1290343, 1289649, 1272981, 1264318, 1256041, 1256655, 1247569, 1228481, 1201562, 1171145, 1139499]
9034A139499j2281O145M363j1116r889k024N920j0805j8930o490j9114k5141O927
9021A047064n437j5015j2411P626n040j9352n495M255j2638j4506j6419j8192
9009I34440q800j0653q557j1854J738j5940j3772k180j954k3590p110R404P331
8996H48503k1664k3682Q481q089r943O262o876j3502r586r309K242j122j040J589
8982G62264j4014l737o138j6268j187N281Q39j5841j927Q624q930Q222j0341m979
8968G01868k639k242r900j2373j7682k392j565o643j2412P301N750p492j5251
8955F24328m851J226n593M087N511l002j067N278j7414l566j6838n860j4029p715
8941E60495J0398j5795k3718J651j232l175j2392m357O429J1235K698R029m578
$$ y = [1139499, 1127218, 1133363, 1137726, 1126610, 1116721, 1114697, 1120617, 1109812, 1090882, 1084392, 1065278, 1040137, 1047064, 1041627, 1026612, 1014201, 1021827, 1016787, 997435, 991940, 996195, 983557, 969051, 952632, 934440, 925640, 914987, 906430, 894576, 896314, 880374, 866602, 864422, 862468, 838878, 831768, 841172, 848503, 826839, 803157, 811638, 803549, 793606, 799868, 792992, 779490, 769904, 760595, 762837, 761715, 760675, 762264, 748250, 744513, 738375, 722107, 720920, 726201, 727040, 711199, 709272, 717896, 708966, 717188, 706847, 701868, 699229, 696987, 687087, 674714, 657032, 654640, 653075, 646432, 634020, 641321, 647071, 639579, 624328, 619477, 620703, 615110, 619197, 624708, 621706, 620639, 625917, 608503, 604937, 588099, 582239, 568210, 560495, 570893, 555098, 531380, 533031, 531799, 528624, 516232, 511875, 518304, 529539, 532237, 541266, 536688]
8928E36688k7586j2522m967p652p265o299p943J420p200R949J1131Q569l086r763
8914D73474K625M479p030N350q135j4002j3340q421j0420q859J3523Q222o581
8901D30885P822J1566q243r006K416M10L734n743n887k711N719Q82j1478k3277
8887C97089l023k6J2285o012j7247l694J2089O961r113n011J860R40m266L446
8873C86278N976R278r092n503k325o279r104r335l009J0227o851n206r096m824
8859C41135r807J194J38O470L612K02M056r475r396m481N613R628j857O222K1755
8844C65009J7332K1047M0548P225l2060m2389k7585j1826n957m496L507p836j3216
8831C09303Q158q308M709m293J0121J1100O655L716l970m764r984q812m397r071
$$ y = [536688, 509102, 496580, 491613, 483961, 476696, 470397, 462454, 463874, 456674, 466623, 477754, 486323, 483237, 473474, 476099, 480578, 473548, 478898, 470763, 456761, 443421, 435000, 424580, 415721, 429244, 437466, 430885, 438707, 450273, 442030, 433024, 435440, 435850, 439584, 433841, 427954, 425243, 430962, 431844, 420366, 397089, 394066, 394040, 406325, 400313, 383066, 379372, 391461, 398422, 389309, 384298, 386158, 387098, 382832, 386278, 392254, 401532, 392440, 386937, 384612, 378333, 369229, 359894, 356885, 367112, 360261, 355055, 345959, 341135, 331328, 332522, 332660, 339130, 342742, 342944, 347000, 337525, 328129, 323648, 329261, 338889, 337032, 343254, 365009, 382341, 403388, 443936, 451161, 419101, 376712, 349127, 337301, 331344, 326848, 330355, 322519, 309303, 317461, 309153, 313862, 309569, 319690, 330790, 337445, 341161, 337191, 332427, 322443, 313631, 309234, 300163]
8817C00163o00j0583P14l138J7242J534n367O963K588n09l077M503M359l608o561
8802C04623J7273K9390L1915M9019R0111N1340k9737q5588o5192l4750k3857j7738
8790C16809q429j7005j2423Q743j028o390J1798m458q956q653N667J395J452j0656
8776B67866k362k660q457p411p740M509J6116J3110l243o427q207K229j977j0261
8762B45085l503J3073k560l217k950J6198M07J7846K6771M7420K059l1701l0527
8749B94401j9045j4622j0898o948M149j8316n602n954K556J942J6381P922j1568
8736B34398p713p838p116r068l170MR195J982n518r747j506j2555n284K311N851
8721A84226K2307p851l645J1566j1347n734j1698j5164J6090P462J3316P842J3709
$$ y = [300163, 299563, 288980, 289694, 286556, 303798, 305332, 299965, 306928, 309516, 309007, 305930, 310433, 314792, 311184, 304623, 321896, 351286, 383201, 432220, 522331, 573671, 543934, 458346, 393154, 358404, 334547, 316809, 308380, 291375, 278952, 287695, 286667, 280277, 292075, 287617, 278661, 270008, 275675, 277070, 278522, 267866, 265504, 262844, 254387, 246976, 239236, 243745, 259861, 272971, 269728, 263301, 255094, 257323, 255346, 245085, 241582, 254655, 252095, 248878, 245928, 262126, 262533, 280379, 307150, 354570, 356629, 324928, 294401, 275356, 260734, 249836, 242888, 247037, 228721, 223119, 217165, 219721, 221663, 238044, 245966, 234398, 226685, 218847, 211731, 202663, 199493, 199497, 208692, 210674, 205156, 195409, 193903, 181348, 176064, 178375, 184226, 206533, 198682, 195037, 206603, 195256, 189522, 177824, 162660, 178750, 186212, 199528, 207370, 221079]
8708B21079j236n264O749L570M634k164j4717j1121J6954k288L559j0590j1227
8695A97938J217N84j835J034q509o123L529k851K492Q35Q431k10n000q889K219
8680A84862m983m54p22m010N361J137j630j05n717p542p055q067L279R639J897
8665A65890O124J9969J64K406l541p048L899J96o952l730J060o482k495M011J2225
8650A85696j068p872P018P578q492J633L548J4637L344o733L942M812K7854M8759
8636B84656N3031K9612r099m2555m0729l5383k9224m354L244Q430P451r893o484
8623B08703r862j5221l42L59j850j333n159l757k455Q270J0096j0437L847n641
8609A75218k952Q16M868K4497J901n605J5405J2026K000j1212m207J0278J4172
$$ y = [221079, 219843, 214579, 221328, 224898, 229532, 227368, 212651, 201530, 218484, 216196, 219755, 209165, 197938, 199155, 199739, 197904, 198938, 190429, 184306, 187835, 184984, 187476, 188311, 196742, 196532, 191532, 182643, 184862, 179879, 179425, 178703, 174693, 180054, 181191, 179561, 179456, 173739, 166197, 159142, 151075, 154354, 163993, 165890, 172014, 191983, 192147, 194553, 191012, 183964, 187863, 188059, 181107, 177377, 178437, 171955, 169460, 173471, 185696, 184628, 176756, 183774, 191352, 182860, 184493, 188041, 202678, 206022, 199289, 203231, 208043, 235897, 284656, 337687, 367299, 358200, 315645, 274916, 239533, 210309, 205955, 209199, 217629, 225080, 215187, 208703, 198841, 183620, 183278, 183637, 181787, 180454, 175295, 171538, 169083, 177353, 187449, 177012, 180859, 175218, 172266, 173082, 177950, 202447, 204348, 198743, 214148, 226174, 228174, 216962, 212755, 223033, 237205]
8596B37205J9626K7472M4894P7073J20151J04423p045q6257j06946q2836l6247
8585C11513l4366j1657r191j9458M50J2129J2220R13k1500j2610M627J0808K1151
8572B65029J2698M878J3572J0464q95J9388J5834K2154K1639J1027J1503J4015
8560D21306K6j625N226l987l7639k5480n580j4260n044k17J0298J7204K6626M5861
8546D32715J5125m7221o0388n9048k9231j2926j2514m628j352l222m685j2888
8534A99737j3440J0128m897j7908n00n794j2521j1552L069o213q349l251J580
8521A30089M071n882J1467R308j1165q340K476K999j0698L891r78J1110J8383
8508A56731M806J15j399K1045Q560k1938p097k789k02L098q400j4395m354Q045
$$ y = [237205, 256831, 284303, 329197, 406270, 526421, 630844, 623799, 537542, 430596, 347760, 311513, 277147, 265490, 256299, 236841, 237291, 249420, 261640, 262553, 241053, 228443, 233070, 243878, 265029, 277727, 282605, 296177, 306641, 305746, 325134, 340968, 363122, 384761, 395788, 407291, 421306, 421332, 419707, 424933, 420946, 383307, 357827, 352247, 337987, 332943, 332726, 343024, 360228, 386854, 432715, 447840, 400619, 340231, 281183, 251952, 239026, 226512, 221884, 220532, 217310, 212625, 199737, 186297, 196425, 191528, 173620, 173120, 167326, 154805, 143253, 146322, 140109, 131760, 128509, 130089, 134160, 128278, 139745, 149053, 137888, 129548, 132024, 135023, 124325, 128216, 127238, 138348, 156731, 161537, 161652, 160253, 181298, 189858, 167920, 160823, 158034, 157832, 160930, 152530, 138135, 133781, 141826]
8494A41826J5247k0826k2720N747J747j525J246J437N322Q54J2590K922l408N66
8480A41025j36j841O363q870o781J2068j027r454r990l556r563p860R257K685
8466A12320j2256j334k59j334L85J1906K533n817P71K572j0119k802M150J0653
8452A11369M325j1226L488j727j2924m504R524P203k797k504L435k775R585K389
8438A12861o287j5315Q177J0576O71j352j1641l397R679l157K873N981k895l342
8424A03432n345n972P734K647j4749r521k99R932N505N356k52l969j1580j308
8410H1611m436m847P751k668Q214M975Q796m477L609o567Q382P117q885j2987
8396H5588j4231j38N207J0720n320L659p96P384j0069l480K733q177Q028l287
$$ y = [141826, 157073, 136247, 113527, 119274, 121021, 119496, 120742, 122179, 127501, 128355, 140945, 143867, 140459, 141025, 140889, 139048, 145411, 136541, 129760, 141828, 140801, 131347, 121357, 117801, 108238, 100378, 109635, 112320, 100064, 98730, 98471, 97137, 97522, 109428, 111961, 106144, 106915, 109487, 99368, 96566, 100716, 111369, 115694, 104468, 107956, 106229, 93305, 88801, 98325, 105528, 102731, 100227, 103662, 100887, 110472, 112861, 106574, 91259, 99436, 110012, 110683, 109331, 97690, 94293, 103972, 100815, 103688, 109669, 106774, 103432, 98087, 92115, 99849, 102496, 87747, 78226, 77927, 87859, 93364, 98720, 98468, 94499, 82919, 81611, 77175, 72328, 80079, 77411, 85625, 90600, 99396, 94919, 98528, 91961, 100343, 107460, 98575, 85588, 71357, 71219, 76426, 87146, 81826, 85485, 84689, 92073, 82004, 78524, 81257, 73080, 81108, 77821]
8382G7821P252K0308Q615j331k670j5570k243m556j1275q654n315K684R573J5239
8368H9878L697j552m378j4278m477K901j002O6R175Q052N475J7816N096O576j116
8353A21929j3236j661m768j1268J2448J392j3310r870k4078O94l585l869R241
8340F0059R225K200l767M448N855K803O90M177n389o751P110K6418P732n651j0509
8325I8650j9031j4665l281L985J2671O295Q303J6273J6067J5720J8706q31k0246
8312A38616k406o1j5995j1349j8702j1182p159O410K361j6425p243o213J2689
8299F3341J3445j0214Q832j248n647J613m860p845J2520l439m934q809K746K3690
8285G9191J4225R360l646j2846j7300p765l311J1297r802O745J3397p177j8810
$$ y = [77821, 85073, 105381, 113996, 112665, 109995, 94425, 92182, 87626, 76351, 67697, 62382, 65066, 74639, 89878, 93575, 92023, 87645, 73367, 68890, 71791, 70789, 70855, 80030, 88082, 93557, 111373, 116469, 123045, 121929, 108693, 107032, 102264, 90996, 103444, 104836, 91526, 81656, 57578, 58272, 54687, 50818, 60059, 69284, 71484, 67717, 72165, 78020, 80823, 81513, 85690, 80301, 73550, 80660, 107078, 114810, 109159, 98650, 79619, 64954, 61673, 65658, 78329, 84624, 92927, 109200, 125267, 140987, 159693, 158862, 138616, 136210, 136149, 120154, 108805, 90103, 78921, 71762, 78172, 80533, 64108, 56865, 50652, 63341, 76786, 66572, 75404, 74156, 68509, 70122, 65262, 57417, 69937, 66498, 61564, 52755, 55501, 79191, 93416, 102776, 99130, 86284, 68984, 61219, 57908, 69205, 59403, 66148, 79545, 72368, 53558]
8272E3558r274J954J5695K4098P195l2696j7888J7718K555J5892j227j3335l290
8259F0955J3442K162k1709j0444R198M423J2299J3221L850j4049q119r81o014
8246E8234l050l254K348M089J1734J749J81p939N135N091K371P247j6493k0198
8232D7245K697K529M617N439j1490n045L507J4232K5931q060j3491j1476N488
8219F2123m357J445l505n362R872J1688J016j8520r203j684K613N416N564m583
8205E2523q720J612J160K8j761J1399Q085l2p028p33O522R334q358j3205p862
8190D2964m795O339j4941J2171O216N871l913L976o981p90L967j1357r597N313
8176C4443J0667n10j031l156R432J6985k953o603l674R807O072n953l451K544
$$ y = [53558, 44284, 46238, 61933, 86031, 93226, 60530, 42642, 60360, 62915, 78807, 77580, 64245, 60955, 74397, 76559, 54850, 44406, 53604, 58027, 70326, 83547, 87397, 73348, 65229, 64248, 58234, 55184, 51930, 54278, 58367, 70101, 71850, 72031, 64092, 69227, 74318, 76689, 83936, 67443, 47245, 49942, 52471, 57088, 62527, 51037, 45992, 49499, 63731, 89662, 81602, 68111, 56635, 62123, 57766, 59211, 55706, 50344, 60216, 71904, 72920, 54400, 45197, 43513, 46126, 51542, 57106, 52523, 43803, 45415, 46575, 46603, 44842, 56241, 64326, 64294, 57266, 56533, 63055, 72389, 64031, 50826, 42964, 38169, 44508, 29567, 41738, 47954, 53825, 49912, 53888, 46907, 46117, 50084, 38727, 29130, 34443, 45110, 44600, 43569, 40413, 49845, 66830, 63877, 57274, 53600, 63407, 69479, 63526, 60075, 62619]
8162F2619O156J473j1546r94q163j0387J1264J9752J165l878J971M069j656k800
8148F9045J440K477N582j867o691k279j744j101q114p967n157l048J2220J9041
8134G1837r017N027n63j4762o800K143j3127q160K37P508R287o734J1630Q156
8120E6662q206m179o080R480P017m891m726k5983j3276K0515J8044K046J3370
8107E9793o636j459J0918J5169l287p138l087N51L507j2581n441N592J312J7274
8093G4487j1375k2685m85k681j929J3342R46K257j034j0252p868j1908l37Q978
8079B9456L778j2717q329L95J757P882M404j623J0922j520l153K104j2139j0956
8065A0261O236R007N468Q659J3919J9584m631j8546l473p486l772J010r39J0378
$$ y = [62619, 68775, 70248, 58702, 57708, 49545, 39158, 50422, 70174, 71339, 67461, 69432, 73501, 71845, 69045, 70485, 72962, 78544, 76677, 69986, 67707, 65963, 64862, 56748, 48781, 43624, 40576, 52796, 71837, 62820, 67847, 67284, 52522, 45722, 47865, 34738, 26578, 26815, 34323, 43610, 36876, 48506, 56662, 48456, 44277, 38197, 47677, 54694, 49803, 45077, 19094, 5818, 26333, 44377, 46423, 59793, 53157, 51698, 62616, 77785, 74498, 67360, 64273, 64824, 68331, 55750, 50309, 55901, 57213, 74487, 63112, 40427, 39942, 37261, 35332, 48674, 49620, 51877, 50843, 40591, 32723, 20815, 20478, 29456, 33234, 20517, 12188, 12583, 14340, 22222, 26626, 25003, 35925, 34405, 31252, 33356, 21217, 10261, 16497, 25504, 30972, 39631, 53550, 73134, 68503, 49957, 46484, 38998, 35226, 36236, 35297, 45675]
8051D5675J33j343j349P838Q314j916M590n14p450M002K118j42J7773m228j1045
8036F2456J3433r641m868J2343K873j2160j0591M273j331o658j0639q970L637
8023C4157O854R844p559P050Q8j318j1852n323k498J0989n60J3335J2565j3199
8009E2573n561Q568j387L042L122j1928k006j09J4936P834m770M29n212j0622
7995D8909r501P407l196l723J5333J9033J0382l732j5878k067K0680j611j1060
7982G0976K268J7171j449p519k1658k3756N210J8284K7372J9990j1313k0955j66
7969G4455R124R298Q444j1727k770J2044M803o790K804l041j5119L465L233K790
7955I1013p643J0710K388m391j5211j6417j2815L705J708J8505q18j25K0856L679
$$ y = [45675, 45808, 44465, 43116, 50954, 59268, 57352, 61942, 61428, 53978, 57980, 60098, 59956, 77729, 73501, 62456, 75889, 66248, 61380, 73723, 76596, 64436, 53845, 58118, 56787, 50129, 39490, 30520, 34157, 41011, 50855, 43296, 50346, 50434, 49116, 37264, 31941, 29443, 40432, 39872, 53207, 65772, 52573, 47012, 55580, 54193, 57235, 60357, 48429, 46423, 46314, 61250, 69084, 64314, 64743, 59531, 48909, 39408, 46815, 43619, 39896, 55229, 74262, 84644, 80912, 65034, 62967, 83647, 82036, 70976, 73244, 90415, 88966, 81447, 59789, 36033, 41243, 59527, 86899, 106889, 95576, 74621, 74455, 83579, 92877, 101321, 89594, 86824, 98868, 103671, 96881, 99685, 96644, 81525, 84990, 88223, 91013, 83370, 94080, 96468, 92077, 76866, 60449, 47634, 51339, 53047, 71552, 70734, 70609, 91465, 95144]
7941I5144j0784N548R879m838L535M462O324j7586j1379q168L598K9515N918M023
7927A15191p029j0058q967n331qJ5237L33j1451l679J0186K714q218p674J538
7913H2784j40k765O681j2199r948n73j035J076j4177r344Q013M587J523M393k100
7898E6776M123q193M378j889N62P753p076J6946J4366j058o60j0700M46Q786L263
7883H7823j332r358j3148p587m254O467J356J0110J7081J0972j5484l1489r189
7870D1968r817o892J0478J2600M778j4436J0447P016o9j130l286o085q886N618
7856D2304R713J3412l394k0897n540J3973J1427J626q229p764K366M418p057L453
7842D9811j6689j6364M035J0867j1653K548J3298M249j985n648m965k321M958
$$ y = [95144, 84360, 89908, 99787, 94949, 98484, 102946, 109270, 91684, 80305, 72137, 75735, 105250, 111168, 115191, 108162, 98104, 89137, 83806, 83798, 99035, 99368, 87917, 84238, 94424, 97138, 88920, 81246, 82784, 82644, 79879, 86560, 74361, 64413, 63840, 62805, 63881, 49704, 40360, 48373, 52960, 54483, 58876, 56776, 60899, 52706, 57084, 55195, 55757, 63510, 56434, 73380, 87746, 86688, 86028, 75328, 75774, 84560, 87823, 86491, 77133, 63985, 56398, 52144, 58611, 59967, 70077, 87158, 98130, 82646, 51157, 41968, 32151, 25259, 35737, 48337, 53115, 38679, 49126, 56142, 56073, 54943, 51657, 45572, 36686, 42304, 52017, 65429, 62035, 41138, 35598, 49571, 60998, 62624, 54395, 46631, 48997, 53415, 46358, 49811, 33122, 16758, 20793, 31660, 20007, 22555, 35853, 40102, 38117, 32469, 27504, 25183, 30141]
7829C0141N444L656l300j8754J748J669N602l517P02J0345O141j1407j281l914
7815B3275j063J1351P642l716n533j2528M21J0590L1225o698k5264P024O477o562
7801C6641k329j1206j2533P710J3664o152N424L82K720k957o385m640J18p227
7787A3230N473J8711N279m7p857O4o17M643N197j80k119l11n562m681r6m772N363
7770C1718J1054n095j4059L586K981j0700M465L638p540O195M929J833m563m325
7756B4117r777j4921J2258J1632j1537o386Q721P505R982N086j247Q722n182j5238
7742B3735P560P832j2137q324O33j2711q283Q73K443R523K3304Q780l831n29R82
7727C9850M886k494j0147j7016j456m315r830L303J5154L162j1107k500J7856
$$ y = [30141, 35585, 39241, 35941, 17187, 18935, 20604, 26206, 22689, 23391, 33736, 39877, 28470, 27189, 23275, 22212, 33563, 41205, 37489, 31956, 19428, 19849, 30439, 61664, 54966, 29702, 36726, 43203, 36641, 34312, 23106, 10573, 18283, 31947, 25795, 31219, 31601, 34321, 31364, 24979, 20339, 20457, 13230, 18703, 37414, 42693, 42646, 34789, 34853, 34236, 38879, 44076, 43896, 41777, 41466, 35904, 31223, 31127, 26355, 31718, 42772, 37677, 23618, 27204, 30185, 19485, 23950, 27588, 20048, 26243, 31172, 33005, 28442, 24117, 14340, -581, 11677, 23309, 11772, 5386, 14107, 21612, 31594, 36680, 35433, 44155, 38973, 23735, 31295, 39127, 26990, 18666, 19299, 6588, -1695, -822, 1621, 11144, 34448, 43228, 39397, 38868, 39850, 44736, 42242, 32095, 15079, 13623, 9308, -522, 2781, 17935, 21097, 9990, 7490, 25346]
7714B5346M061l368k902Q445n223k235q564o596J1065O911j0656j0855J1508J0920
7700B7857j992j0819l238L599n36L96J511p203j744L501R657k590o442P966L17
7685B0240J984M529k822K073N476R509k355r520j3008p209Q854p54O85J011K946
7670B1639j2711K955N614q972M755j0669j313p341l446L627q513j087J7211K1824
7656B3573k792j0039n324M951J4451R109k650r701j99R481J5398l428K277P244
7642E2351l478j7405m231k835q182j2200L83N873M070m073Q121J788J4237l80
7628C4039O883l905p740l387k450j5815k2751J7625J3451K015n314r729l830R481
7614H573K584J0806j3655j6710j3270P835P659R160M267J7691M879K111n843K82
$$ y = [25346, 29407, 26039, 23137, 31582, 26359, 24124, 15560, 8964, 20029, 26940, 16284, 5429, 16937, 27857, 25865, 15046, 11808, 15407, 14871, 15267, 16778, 9575, 7831, 11332, 20989, 18399, 11957, 19923, 20240, 22224, 26753, 23931, 26004, 31480, 40989, 38634, 29114, 16106, 8897, 17751, 16997, 17682, 18693, 21639, 8928, 11883, 17497, 8525, 13280, 2611, 1298, -6043, -9489, -5862, -14375, -15462, 1749, 23573, 20781, 10742, 5418, 10369, 24820, 33929, 31279, 21578, 21379, 30860, 46258, 42830, 45107, 52351, 48873, 31468, 27237, 24402, 16220, 4020, 4403, 10276, 14346, 10273, 18394, 20182, 34419, 34039, 40922, 37017, 29277, 25890, 23440, 7625, -15126, 2499, 15950, 17965, 12651, 2922, -908, 8573, 11157, 21963, 8308, -8402, -21672, -13837, -6178, 2982, 7249, 24940, 29819, 31930, 26087, 26369]
7600B6369J085j1181J3960J3659M350K455j1146j7192k346k172O608J0390P679
7587D2518j4324r317j771O82j710n509J0206L31P2K195r746j4342q730N200K0243
7572A5998O796j4840l224o862p305J0544M106M891P686n076q571m644m697j584
7558f782K916J4568N597P868J9020j2128q521L924j0038q416r855q601J0548J3068
7544A3168R619O213M752j4688j2439p20R93q963L590L314J0350J3138k709J603
7530B7221j1525j6603j3413Q574K6624O988j1395j5462R002j218J50j360l279
7517D304J77L506J3583R566l578j246J1361l186M748N898P057K739j2344p880
7503C4705r666j016l27K291k452j9154M235m467R807K0758l772j7069K779J0769
$$ y = [26369, 27454, 16273, 30233, 43892, 48242, 50697, 39551, 22359, 20013, 17841, 24449, 34839, 42518, 28194, 18877, 17106, 17788, 16078, 10569, 20775, 21106, 21178, 23373, 13627, -715, -9445, -4245, 15998, 22794, 7954, 4730, -2132, -9437, 1107, 5213, 10104, 17790, 12714, 4143, -501, -5198, -6782, -3866, 10702, 16299, 24167, 43187, 31059, 22538, 26462, 16424, 8008, -1847, -10448, 100, 13168, 22787, 29000, 33752, 19064, 6625, 5905, 6898, -2065, 1525, 4839, 15189, 28327, 25618, 27221, 15696, -907, -14320, -5746, 20878, 27866, 16471, 1009, 10011, 8793, 8943, 7583, 4304, 4481, 7987, 21570, 31136, 27558, 26312, 37673, 34487, 39235, 45133, 52190, 54929, 42585, 34705, 25039, 24023, 23696, 25987, 23535, 4381, 8616, 4149, 13956, 34714, 30942, 13873, 16652, 27421]
7489B7421L910P512k197j4189j2312Q016l7k913N427j180L881j947L985K305J1371
7474C9053J7794m511l4436j0626P98J0311O424j2512j4944O092J0547j0694J0204
7461A3500J2154K844k73q263L79q037j4477J025Q210J3544R839M850j2780L88
7447B2903K697q143o637j2173j0790p42j9520K853J6355N604q50O099J5381j834
7433A1203J865n977n863j0642J85J1579N816M185N596N350n005l834j2462j290
7419G06P064L545M64O277J0201J4309j2630j9813P920J2695p347k905O812j8391
7405H907l448J0535j905j41Q999m352j758p304m24R770J652l7M849l029k2263
7390E1o434l896P077J1084J3763k265j2458P538O425m496r933J234J0018R06O541
$$ y = [27421, 31331, 38843, 36646, 22457, 10145, 18161, 18124, 15211, 20638, 19458, 23339, 21392, 25377, 27682, 39053, 56847, 52336, 17900, 7274, 8072, 18383, 24807, 12295, -2649, 3443, 13990, 3296, 13500, 25654, 28498, 28225, 19962, 20341, 12304, -2173, -1148, 7062, 20606, 30445, 35295, 22515, 22903, 25600, 17457, 10820, -1353, -12143, -12885, -32405, -29552, -13197, -7593, -8443, -2344, 13037, 11203, 13068, 7091, 1228, -9414, -9229, 2350, 8166, 12351, 17947, 23297, 18292, 14458, 1996, 706, 7770, 11315, 11779, 18056, 28257, 42566, 29936, 10123, 18043, 30738, 23391, 20486, 27298, 8907, 5459, 15994, 14089, 13948, 22947, 18595, 16837, 9533, 9109, 18879, 20531, 20494, 25343, 22314, 51, -6383, -10279, -3202, 7882, 21645, 19380, 6922, 14460, 20885, 16389, 6456, 7690, 17708, 18614, 25155]
7375B5155J565j2492J983n070K60L462J1311q822j4098Q610L762J00J4289J4795
7361D4810k738p756j3724N065P629j9009j7989l112K1853L731j4552l387O586
7348G407o180j5970o77j573J2573M3J67J0042o359j3423o438R389l720J1393N613
7333B287l720J239K969l443K830L889M439L453j763n767j1853J56K1300K9147
7319D5163O844j3507j6866P28M131M706O964m711j8556k3281k0819Q888J3278
7306g038M227k762q375k92M744O854J004Q525M613L769k583J897j777L670O609
7291B3085j0005k007l31j3186J249J4231L112N256p934k5079o625Q202J3348O594
7277I910k116o501K459r833j675P141R701M122q744j2748j9737O349J4604J5083
$$ y = [25155, 26720, 14228, 16211, 11141, 11401, 14863, 26174, 17352, 3254, 11864, 15626, 15726, 30015, 44810, 42072, 34316, 20592, 25657, 33286, 14277, -3712, -6824, 15029, 18760, 4208, 821, 7407, 1227, -14743, -15420, -16993, -4420, -4377, -4210, 5832, -527, -13950, -20388, -10999, -14719, -3326, 2287, -1433, -194, 2775, -668, 2162, 6051, 10490, 13943, 12180, 6413, -5440, -5284, 16016, 45163, 52007, 38500, 21634, 22362, 26493, 31199, 38163, 33452, 14896, -8385, -29204, -20316, -7038, -2811, -5573, -13948, -14240, -9496, -2642, -1638, 6887, 11500, 15269, 12686, 14583, 12806, 16476, 23085, 13080, 11073, 10742, -2444, -1195, 13036, 16148, 21404, 13470, -11609, -18234, -10032, 3316, 9910, 7794, 1293, 3752, -6081, -7756, -615, 9086, 13208, 4464, -8284, -28021, -21672, -7068, 8015]
7263H015J2033PJ0919k183j1486j7426j0464K81J2395K2176m760M211N591J323
7249C0632j4680n755m390J887O486j410m916k590N245O422j2364j2470M310J4117
7235A0524R006k065j3236N06J3335J5368j6616k5713K843J5839l045p636Q691
7222G801J1568q183l687J858p821J33o755O224M845J309q423l569J7514j3179
7208c65n113P509N01n117j5904L731p201J696K919O892M394K493P811J974r759
7193c539j9009p52J1760J9030P500M724q832q067o021R157n892J0654J4941J1160
7179C6814l0056N320K179j4380K180Q78N20M044k158l687J060K45l346L438M383
7164G434J7756m090l600J555P08j4676O280J4653Q402j4436M073M352l409L073
$$ y = [8015, 20048, 20055, 30974, 28791, 17305, -121, -10585, -10304, 2091, 24267, 19507, 23718, 29309, 30632, 15952, 10197, 5807, 7694, 14180, 12770, 7854, 5264, 10509, 16931, 4567, -7903, -3593, 10524, 19530, 17465, 4229, 4735, 18070, 33438, 16822, -8891, -6048, 9791, 6746, -890, 7801, 19369, 11186, 7499, 9357, 1536, 1669, -5086, 1138, 5983, 7292, -1131, -4700, 12814, -365, -5478, 2031, 2532, -2585, -18489, -14758, -21959, -20263, -17344, -10452, -6058, -3565, 4246, 6220, -3539, -22548, -23300, -11540, 7490, 14990, 19714, 10882, 2815, -3206, 5951, 59, 10713, 25654, 36814, 6758, 12078, 14257, -123, 2057, 2935, 3455, 7499, 5341, 1654, 2714, 2959, -387, 3051, 7434, 25190, 21100, 17500, 19055, 19763, 5087, 11367, 26020, 34422, 19986, 24059, 28411, 25002, 28075]
7150B8075q735m817J6454M67j9454j1522m171R723M603J479r639o724m264J3888
7136E363N437o665j0963J1833R107n740j3767J7908O089R813j1784m173j125M478
7122A5811J634K18r933P71J5575O404l804o485p582O33J1161m869j0097j0156
7108g19J2607L067J4140J4707q345j9130j8049O031N635m660m997O382N257J0293
7094B2219m367o071j130j3025M120J1995L566q188j5078l191Q345P595k760K0537
7080B4567J2991k1714k4077K136J8170P487n146l357p92o344N187o594q67q233
7066f586J1158j0278j2414N11N585N534K703J6749N24N947P55l012N550j3163
7052I563j0401J2628M031M406j4473q547O983l684j334j123n83o846J6577j379
$$ y = [28075, 19340, 14523, 30977, 31444, 11990, 468, -3703, 6020, 10623, 12102, 2463, -4261, -8525, 5363, 10800, 4135, -6828, 5005, 14112, 8372, -5395, 12513, 18602, 28415, 16631, 12458, 11333, 15811, 17445, 17663, 7730, 8501, 24076, 30480, 26676, 20191, 12609, 13242, 24403, 19534, 9437, -719, 11888, 14955, 29095, 43802, 35457, 16327, -1722, 4309, 9944, 5284, 287, 6669, 11926, 22219, 17852, 11781, 10651, -2374, 1746, 13741, 17307, 9119, -5959, -9150, -805, 6790, 4030, 24567, 37558, 15844, -8233, -6097, 12073, 19560, 14414, 11057, 10265, 3921, 9108, 2514, 1647, -6586, 4572, -5706, -18120, -17609, -12024, -6490, -3787, 12962, 13486, 19433, 20188, 17176, 22726, 9563, -838, 11790, 15821, 20227, 5754, -2793, 4190, 506, -828, -1951, -2534, -9380, 7197, 5818]
7038E818j4897J1599P620k67M595l579N096L468J354R660K683j1109j6590m56
7024D995J8669N235l58O782j228j704j5860j0860J559J4686M54n704m218N464
7010A7912j3588j3440j888R131K529j845m532k094Q168K459R868j299K757j2119
6996B019k375l282M86J6394R611q190l903m433r696P501J5313K132k0373j0077
6982h873P533K332n607K190j6232j922p271j90k203Q539Q575J1853L109j4355
6968a2522K478K6061k872L074L050o454o938j4784j3275J432N880m991J4589Q716
6954C444J5924R63j2694r376l513J9390J5479K716j0525q459q528O422j019M914
6940A5138J3235j6692q566j14m467K998o934k816R587K6393R813J243Q527j5292
$$ y = [5818, -9079, 2520, 10140, 9873, 14468, 10889, 15985, 19453, 20807, 30467, 33150, 22041, 5451, 4995, 23664, 28899, 28541, 35323, 34095, 32391, 16531, 5671, 7230, 21916, 22370, 16666, 12448, 17912, 4324, -9116, -11004, -1873, 656, -1189, -5721, -7815, 353, 2812, 12680, 11381, 14138, 2019, -356, -3638, -3152, 13242, 22853, 14663, 10760, 6327, -3369, 4132, 19445, 21577, 1204, -8873, -1340, 992, -4615, -2425, -18657, -20579, -27850, -28040, -30243, -21704, -13129, -1276, 1833, -12522, -10044, 16017, 13145, 16219, 19269, 12815, 5877, -8907, -22182, -20750, -14870, -19861, -5272, 3444, 19368, 20331, 7637, -1739, -5252, 14138, 29617, 32333, 21808, 13349, 4821, 11243, 10224, 15138, 28373, 11681, 3115, 3001, -1466, 1532, -5402, -8218, 1369, 27762, 37575, 38818, 47345, 32053]
6926C2053k7371l637O024J1912L901k739k367j866Q717j737l848j359j1402p928
6912a647k450R85M461m128J084O624j670o343N474K591j0196o765J6577l11r739
6897e453j764n029M949R463r379l068J9289j78p541o757J036o314p251l031J6490
6882d538m328j1395K558J0278O774j939l059O287j1731k539q058M811J8547M684
6868F352O569J093L618n025L350j031n414k446l151q264Q9r10J55J0185r47R191
6852A3414L181r808q37j3470j426K170j057r768J7652O331k564n761L68J6092
6838A4517m176j4538L751N897J7o504N154J830p971k952J3937J9539J0461L358
6824D2320m295k4451q988q155J963J1653K849m827L61L199p660q214j244Q85P778
$$ y = [32053, 4682, 1045, 7069, 18981, 22882, 20143, 17776, 15910, 24627, 22890, 19042, 17683, 6281, -1647, -4097, -3112, 1349, -2779, -1695, 4929, 3259, -3084, 2390, 4981, -5215, -11980, 4597, 4286, -5453, -7217, -12246, -7297, 2166, -7213, -10281, 9008, 8830, 1289, -5468, -4432, -10746, -17997, -21028, -4538, -8866, -20261, -17703, -7425, -651, -2590, -5649, 638, -11093, -13632, -21690, -16879, 1668, 6352, 12921, 14014, 17632, 12607, 15957, 14926, 9512, 7066, 3915, -4349, -4260, -5170, -5015, 5170, 4223, 13414, 16595, 6787, 5950, -7520, -8946, -6776, -7833, -17601, 51, 6382, 3818, -1943, -1575, 14517, 10341, -4197, -446, 5451, 5468, -1036, 4118, 5948, -2023, -4975, 8962, 28501, 38962, 42320, 38025, 13574, 4586, -3569, -1606, 10047, 12896, 8069, 8430, 11629, 3969, -4245, -5489, -4604, 3174]
6809C174P231l754q255l501K412K571J2963r11j168J346o063K480n224J484Q641
6794A3426Q072j3510n576J6559m194P328J0684K581l887j2158j3808k99J2889
6781A8107R673o780K697N716l515J787m784p030r853j0429l713J41j0064K213
6767a5834J5351J1126o055p664K773m115O36K0294L678m978L53J419m527j474
6753A0983k537L180p537J7k068m073m336L286J6153j0351N357n66K912P827q021
6738A0226o005n24p08m56q461q497J4200J4571m503j8437K06K659R157P150N265
6723A5843l158m521n117j151Q09m00j6993r154M479J5280Q812J507j1600o023
6709a1387R431R278L009r544j732Q520J147j1094j747Q88l962o614J0085K3327
$$ y = [3174, 10405, 6651, -1604, -5105, -2693, -122, 12841, 11930, 10762, 12108, 6045, 8525, 3301, 4785, 13426, 21498, 7988, 2412, 18971, 14777, 22105, 32789, 35370, 31483, 19325, 5517, 5218, 18107, 27780, 21000, 23697, 29413, 25898, 27685, 22901, 15871, 6018, -4411, -8124, -7983, -18047, -15834, -483, 10643, 4588, -3076, -303, -4418, -3782, 16512, 20190, 15212, 15565, 16984, 12457, 10983, 8446, 11626, 4089, 4106, 2038, -2035, -6371, -3085, 13068, 2717, 8074, 7508, 10420, 18247, 10226, 4221, 3697, 2989, 2533, -5928, -14425, -225, 14346, 9843, -8594, -8388, -5729, 3428, 10578, 15843, 12685, 8164, 3047, 1896, 2705, 2305, -14688, -23842, -19363, -4083, 4729, 6236, -5364, -11387, -1956, 7322, 10331, 787, -945, 7575, 8722, -2372, -4119, -3231, -7193, -13807, -3722, 19605]
6695A9605l277j7563j492j623N091J70J86N757m11j8535l87J2350P473k408Q1
6680E017K870M529O490K017m856J3808K976j7401k7897oJ0622l109q961K533K207
6665i161o072K909P302N582Q70n287k119o55m109k811l0j2384R533J5166R31J487
6649A152k278p791j377m69L176J5421J4460j573j7325n149O050K831n480j734
6635h6j0453q014j0421J4886J7698j0004o322L820N744m773k905K340r0j2338
6621b0918J3799O844m300p631J3924J380l084o232K832n478L12J7496R014n969
6607A1989n282p059L699O018j7141N233K816K793l66L434m443N806O847K342J12
6592A6798M851M292K180J569r182j6491J0906j719l922p585r116J580j149Q0J4826
$$ y = [19605, 16328, -1235, -2727, -4350, 741, 911, 1097, 6854, 6443, -12092, -12479, -129, 7344, 4936, 5017, 7887, 12416, 18906, 20923, 16067, 29875, 32851, 15450, -12447, -12453, -1831, -4940, -13901, -11368, -9161, -15233, -12324, -5022, 560, 1430, -3857, -5976, -6631, -10740, -13551, -13581, -25965, -16432, -1266, -335, 1152, -1126, -8917, -10294, -10763, -7587, 7834, 22294, 20721, 3396, -1753, 4297, 7128, 1648, -86, -10539, -18553, -28974, -14088, 3610, -6394, -12716, -8896, -3152, -7925, -10830, -8490, -8580, -20918, -7119, -275, -4575, -12206, 1718, 3098, 14, -6218, -3386, -8864, -8552, 8944, 17958, 11989, 6707, -352, 3347, 9365, -7776, -2543, 273, 3066, 2700, 6134, 1691, 7497, 14344, 16686, 16798, 21649, 25941, 28121, 29690, 20508, 4017, 14923, 13204, 9282, 1697, -7419, -5839, -6988, -6908, 7918]
6577G918j1934J0987R921q191j785l02j2894O472J7691p37q501l340J2287J2695
$$ y = [7918, -4016, 6971, 16892, 8701, 6916, 6614, -6280, 192, 17883, 17146, 8645, 5305, 17592, 30287]
$$ [...]
##END NTUPLES=NMR SPECTRUM
##END=
