##TITLE=Analysis number 328779
Compound Code cc 11601
Book Reference lab3
Project Code adrs
Chemist Name stores
##JCAMPDX= 6.0         $$ Bruker NMR JCAMP-DX V2.0
##DATA TYPE= NMR SPECTRUM
##DATA CLASS= NTUPLES
##ORIGIN= Bruker BioSpin GmbH
##OWNER= nmr
$$ XWIN-NMR		Version 3.5
$$ Tue Jul  3 12:49:04 2007 GMT Daylight Time (UT+1h)  MAYBRIDGE\nmr@NMR_250MHZ
##.OBSERVE FREQUENCY= 250.131544655141
##.OBSERVE NUCLEUS= ^1H
##.ACQUISITION MODE= SIMULTANEOUS (DQD)
##.ACQUISITION SCHEME= undefined
##.AVERAGES= 16
##.DIGITISER RES= 18
##SPECTROMETER/DATA SYSTEM= dpx250
##.PULSE SEQUENCE= zg30
##.SOLVENT NAME= DMSO
##.SHIFT REFERENCE= (INTERNAL, DMSO, 0, 16.522)
##AUDIT TRAIL= $$ (NUMBER, WHEN, WHO, WHERE, WHAT)
$$ ##TITLE= Audit trail, XWIN-NMR		Version 3.5
$$ ##JCAMPDX= 5.01
$$ ##ORIGIN= Bruker BioSpin GmbH
$$ ##OWNER= nmr
$$ C:\u/data/dgb/nmr/ADRS/260/pdata/1/auditp.txt
$$ ##AUDIT TRAIL=  $$ (NUMBER, WHEN, WHO, WHERE, WHAT)
(   1,<2007-07-03 12:48:40.15 +100>,<MAYBRIDGE\nmr>,<NMR_250MHZ>,
      <created by zg, POWCHK disabled, PULCHK disabled
       configuration hash MD5:
       76 6E 9A 78 1E 09 19 81 EC 84 63 8F B0 6A 59 2D
       data hash MD5: 64K
       F7 8C BD 74 27 4C 9A 8D 0C 73 0B 02 FC 99 67 22>)
(   2,<2007-07-03 12:48:53.14 +100>,<MAYBRIDGE\nmr>,<NMR_250MHZ>,
      <Start of raw data processing
       ef LB = 0.3 FT_mod = 6 PKNL = 1 SI = 32K 
       data hash MD5: 32K
       23 BD A3 26 57 B6 0A 44 03 48 08 52 9A 41 97 E6>)
(   3,<2007-07-03 12:48:55.69 +100>,<MAYBRIDGE\nmr>,<NMR_250MHZ>,
      <apk 
       data hash MD5: 32K
       FB 21 1E 04 4D 15 D9 E2 3C F2 3C B9 AA D8 AD 8B>)
(   4,<2007-07-03 12:48:56.45 +100>,<MAYBRIDGE\nmr>,<NMR_250MHZ>,
      <abs ABSG = 5 
       data hash MD5: 32K
       98 30 7C C2 C2 50 E7 13 F6 92 E4 E5 2B BA BA 21>)
$$ ##END=
$$ 
$$ hash MD5
$$ 12 84 A7 B6 0F 20 D4 56 D6 07 5A B4 30 28 34 1B
##$RELAX= 
##$RELAX= 
##$RELAX= 
##$RELAX= 
##$RELAX= 
##$RELAX= 
##$RELAX= 
$$ Bruker specific parameters
$$ --------------------------
##$DU= <C:\u>
##$EXPNO= 260
##$NAME= <ADRS>
##$PROCNO= 1
##$TYPE= <nmr>
##$USER= <dgb>
##$AMP= (0..31)
100 100 100 100 100 100 100 100 100 100 100 100 100 100 100 100 100 100 
100 100 100 100 100 100 100 100 100 100 100 100 100 100 
##$AQSEQ= 0
##$AQ_mod= 3
##$AUNM= <au_zg>
##$AUTOPOS= <29 >
##$BF1= 250.13
##$BF2= 250.13
##$BF3= 250.13
##$BF4= 250.13
##$BF5= 500.13
##$BF6= 500.13
##$BF7= 500.13
##$BF8= 500.13
##$BYTORDA= 1
##$CFDGTYP= 0
##$CFRGTYP= 5
##$CHEMSTR= <none>
##$CNST= (0..31)
1 1 145 1 1 1 1 1 1 1 1 1 1 1 1 1 1 1 1 1 1 1 1 1 1 1 1 1 1 1 1 1 
##$CPDPRG= <>
##$CPDPRG1= <>
##$CPDPRG2= <>
##$CPDPRG3= <>
##$CPDPRG4= <mlev>
##$CPDPRG5= <mlev>
##$CPDPRG6= <mlev>
##$CPDPRG7= <mlev>
##$CPDPRG8= <mlev>
##$CPDPRGB= <>
##$CPDPRGT= <>
##$D= (0..31)
0 1 0 0 0 0 0 0 0 0.06 0 0 0 0 0 0 0.0002 0 0 0 0 0 0 0 0 0 0 0 0 0 0 
0 
##$DATE= 1183463319
##$DBL= (0..7)
120 120 120 120 120 120 120 120 
##$DBP= (0..7)
150 150 150 150 150 150 150 150 
##$DBP07= 0
##$DBPNAM0= <>
##$DBPNAM1= <>
$$ [...]
##$SUBNAM7= <"">
##$SUBNAM8= <"">
##$SUBNAM9= <"">
##$SW= 20.6930455092707
##$SWIBOX= (0..15)
0 0 3 0 0 0 0 0 0 0 0 0 0 0 0 0 
##$SW_h= 5175.983436853
##$TD= 65536
##$TD0= 1
##$TE= 296.16
##$TE2= 300
##$TE3= 300
##$TEG= 300
##$TL= (0..7)
0 120 120 120 120 120 120 120 
##$TP= (0..7)
150 150 150 150 150 150 150 150 
##$TP07= 0
##$TPNAME0= <>
##$TPNAME1= <>
##$TPNAME2= <>
##$TPNAME3= <>
##$TPNAME4= <>
##$TPNAME5= <>
##$TPNAME6= <>
##$TPNAME7= <>
##$TPOAL= (0..7)
0.5 0.5 0.5 0.5 0.5 0.5 0.5 0.5 
##$TPOFFS= (0..7)
0 0 0 0 0 0 0 0 
##$TUNHIN= 0
##$TUNHOUT= 0
##$TUNXOUT= 0
##$USERA1= <user>
##$USERA2= <user>
##$USERA3= <user>
##$USERA4= <user>
##$USERA5= <user>
##$V9= 5
##$VALIST= <valist>
##$VCLIST= <CCCCCCCCCCCCCCC>
##$VD= 0
##$VDLIST= <DDDDDDDDDDDDDDD>
##$VPLIST= <PPPPPPPPPPPPPPP>
##$VTLIST= <TTTTTTTTTTTTTTT>
##$WBST= 1024
##$WBSW= 4
##$XGAIN= (0..3)
0 0 0 0 
##$XL= 0
##$YL= 0
##$YMAX_a= 315598
##$YMIN_a= -165339
##$ZGOPTNS= <>
##$ZL1= 120
##$ZL2= 120
##$ZL3= 120
##$ZL4= 120
##$ABSF1= 16.522
##$ABSF2= -4.171173
##$ABSG= 5
##$ABSL= 3
##$ALPHA= 0
##$AQORDER= 0
##$ASSFAC= 0
##$ASSFACI= 0
##$ASSFACX= 0
##$ASSWID= 0
##$AUNMP= <proc_1d>
##$AZFE= 0.1
##$AZFW= 0.1
##$BCFW= 0
##$BC_mod= 0
##$BYTORDP= 0
##$COROFFS= 0
##$CY= 12.5
##$DATMOD= 1
##$DC= 0
##$DFILT= <>
##$DTYPP= 0
##$F1P= 14.0000005364418
##$F2P= -0.99999901652339
##$FCOR= 0.5
##$FTSIZE= 32768
##$FT_mod= 6
##$GAMMA= 0
##$GB= 0
##$INTBC= 1
##$INTSCL= 1
##$ISEN= 128
##$LB= 0.3
##$LEV0= 0
##$LPBIN= 0
##$MAXI= 10000
##$MC2= 0
##$MEAN= 0
##$ME_mod= 0
##$MI= 0
##$NCOEF= 0
##$NC_proc= -6
##$NLEV= 6
##$NOISF1= 0
##$NOISF2= 0
##$NSP= 0
##$NTH_PI= 0
##$NZP= 0
##$OFFSET= 16.522
##$PC= 1
##$PHC0= -42.42767
##$PHC1= -13.80186
##$PH_mod= 1
##$PKNL= yes
##$PPARMOD= 0
##$PSCAL= 4
##$PSIGN= 0
##$REVERSE= no
##$SF= 250.13
##$SI= 32768
##$SIGF1= 0
##$SIGF2= 0
##$SINO= 400
##$SIOLD= 32768
##$SREGLST= <1H.DMSO>
##$SSB= 0
##$STSI= 32768
##$STSR= 0
##$SW_p= 5175.98343685301
##$SYMM= 0
##$S_DEV= 0
##$TDeff= 65536
##$TDoff= 0
##$TI= <Analysis number 999999
Compound Code 99
Book Reference 9
Project Code 9>
##$TILT= no
##$TM1= 0
##$TM2= 0
##$TOPLEV= 0
##$USERP1= <user>
##$USERP2= <user>
##$USERP3= <user>
##$USERP4= <user>
##$USERP5= <user>
##$WDW= 1
##$XDIM= 32768
##$YMAX_p= 489025606
##$YMIN_p= -1336147
$$ End of Bruker specific parameters
$$ ---------------------------------
##NTUPLES= NMR SPECTRUM
##VAR_NAME=  FREQUENCY,     SPECTRUM/REAL,   SPECTRUM/IMAG
##SYMBOL=    X,             R,               I
##VAR_TYPE=  INDEPENDENT,   DEPENDENT,       DEPENDENT
##VAR_FORM=  AFFN,          ASDF,            ASDF
##VAR_DIM=   32768,         32768,           32768
##UNITS=     HZ,            ARBITRARY UNITS, ARBITRARY UNITS
##FACTOR=    0.157963299565203, 1,           1
##FIRST=     4132.6476996994, 0,             0
##LAST=      -1043.33573715361, 0,           0
##MIN=       -1043.33573715361, -1336147,    0
##MAX=       4132.6476996994, 489025606,     0
$$ Real data points
##PAGE= N=1
##DATA TABLE= (X++(R..R)), XYDATA
$$ [...]
15586a92535P7306K1809q8073k59482m7851K56381K82699K83084R074L02973l3871
$$ -192535 -115229 -93420 -181493 -440975 -488826 -232445 50254 333338 342412 645385 611514
15575F11514J00168k21236k95890k72651k07717k4569j0149Q3513M573K25872
$$ 611514 711682 490446 194556 -78095 -285812 -310381 -320530 -237017 -232444 -6572
15565f572K75487L29719K05606O8520m01034J16218j59971m19717J2411j06921
$$ -6572 268915 598634 804240 872760 471726 587944 427973 8256 20667 -86254
15555h6254J34716J45682k09708l8282J24592J97373m06904q9137J5947K15961
$$ -86254 48462 194144 -15564 -53846 70746 268119 -138785 -227922 -211975 3986
15545C986K76360R8748J74548l9746j75500J96232M918o66222l9391K70172j67309
$$ 3986 280346 379094 553642 513896 338396 534628 539546 -126676 -166067 104105 -63204
15534f3204n2964R6314M4952J94688p308k96033K28123J18512l72129l11149K15324
$$ -63204 -116168 -19854 25098 219786 212478 -83555 144568 263080 -109049 -420198 -204874
15523b04874p5454k1814O29060K14788j96828n9989n6827O0348J62723k27042
$$ -204874 -280328 -302142 326918 541706 344878 284889 228062 288410 451133 224091
15513B24091j65735J90064Q914j9649M95573J66368L09568l5440n15771k59827
$$ 224091 58356 248420 257334 237685 733258 899626 1209194 1173754 657983 398156
15503C98156p7603O8935L12675k72732k19205J8163R3762J03884n2936J56691
$$ 398156 320553 389488 702163 429431 210226 228389 322151 426035 373099 529790
15493E29790Q330k82344o38284m5744J91991k9075o1570K79012K32523k59032
$$ 529790 538120 255776 -382508 -428252 -236261 -265336 -326906 -47894 184629 -74403
15483g4403j01476j56647J43234J46657J25523K94543r3225m6164J38692J52867
$$ -74403 -175879 -332526 -189292 -42635 82888 377431 284206 238042 376734 529601
15473E29601r5831k41328J37071j43664p1754K15914j20404R1494Q3220k83230
$$ 529601 433770 192442 329513 185849 114095 330009 209605 301099 384319 101089
15463A01089j36571K64245K80177m7900j52907K156K20937O2935j70244j06090
$$ 101089 -35482 228763 508940 461040 308133 310289 531226 594161 423917 317827
15453C17827k2303L19191l7962l11018L2351p5646J02067j52301l42329M03012
$$ 317827 295524 614715 576753 265735 298086 222440 324507 172206 -170123 232889
15443B32889L01716l42374l81284K0047M12491J03086R5825J65549j66016j17466
$$ 232889 534605 192231 -189053 -169006 243485 346571 442396 607945 441929 324463
15433C24463Q4696L036l81668L31826L63091j62332l89216j83151j77455M83189
$$ 324463 409159 412195 30527 362353 725444 563112 173896 -9255 -186710 296479
15423B96479K90270r4434l46370K99506R2018M5333m77194k23189N8074r903j14556
$$ 296479 586749 492315 145945 445451 537469 582802 105608 -117581 -59507 -69410 -183966
15412a83966J16243J67553P7712Q6458n45264n9057r97K63362M74435L87000k75931
$$ -183966 -67723 99830 177542 264000 -281264 -340321 -341318 -77956 396479 783479 507548
15401E07548m6114J16741O5837k99893l94403k84677o2233M34076M66310K46564
$$ 507548 461434 578175 644012 344119 -50284 -334961 -397194 36882 503192 749756
15391G49756j54157p8838p8329R0382J5235J04326M7474j31113k13046j39965
$$ 749756 595599 516761 438432 528814 544049 648375 695849 564736 351690 211725
15381B11725J97533l85003q0635j56478o8117J64575N40712J21302k47352m86110
$$ 211725 409258 24255 -56380 -212858 -280975 -116400 424312 545614 298262 -187848
15371a87848k80450K87998N53517K37250j93663k00266j17354Q6298o8183o6181
$$ -187848 -468298 -180300 373217 610467 416804 216538 99184 185482 117299 51118
15361E1118K02276Q9340j68349k92284L188K64293j43025p4390N769k50989P3467
$$ 51118 253394 342734 174385 -117899 -114711 149582 6557 -67833 -62064 -313053 -239586
15350b39586N5310P3808O3148o2631J39781m7252m36217o5950J03488K19260J23233
$$ -239586 -184276 -110468 -47320 -109951 29830 -17422 -453639 -519589 -416101 -196841 -73608
15339g3608K09251p3296j96225J9871Q0129M15075K04988j75127l09307m56496
$$ -73608 135643 62347 -133878 -114007 -33878 381197 586185 411058 101751 -354745
15329c54745j70779J46749L68980K29984j27309M08N5649O9719p8168n28954j32431
$$ -354745 -525524 -378775 -9795 220189 92880 93288 148937 218656 140488 -388466 -520897
15318e20897j29498J76119n3572K10201M79551O7679J24906k19101n0479J40752
$$ -520897 -650395 -474276 -527848 -317647 161904 229583 354489 135388 84909 225661
15308B25661L9771m04182K21963n7296p8232M11220L4957K14456K11210l34730
$$ 225661 265432 -138750 83213 25917 -52315 358905 393862 608318 819528 484798
15298D84798m92172L7672M379k6941J93158L65891l53521p58390N5095M73763
$$ 484798 -7374 30298 34677 7736 200894 566785 213264 -545126 -490031 -16268
15288a6268j26365l14859J99767K93504L97801J96786J73732o7255j07520o9031
$$ -16268 -142633 -457492 -257725 35779 433580 630366 804098 736843 629323 560292
15278E60292n08278R5204J12221k7740j09335N022j67971n3832j08371k20025
$$ 560292 52014 147218 259439 231699 122364 127386 -40585 -94417 -202788 -422813
15268d22813l8145N65908K32748j41924k32634l34586n3746J43026L85914J44689
$$ -422813 -460958 104950 337698 195774 -36860 -371446 -425192 -282166 103748 248437
15258B48437j03487k8993k23424j33452O4740J52390J58005O0605J16060M7084
$$ 248437 144950 115957 -107467 -240919 -176179 -23789 134216 194821 310881 357965
15248C57965l06320k65200J08258N0944k3387J78219p9933J16916J13670p8872
$$ 357965 51645 -213555 -105297 -54353 -77740 100479 20546 137462 251132 172260
15238A72260k11526p1323J73062m1267m2817k66038J32236L06815J13553J11093
$$ 172260 -39266 -110589 62473 21206 -21611 -287649 -155413 151402 264955 376048
15228C76048J35101p3044j77221j6502M6432l11871k34298J46643Q3745K05748
$$ 376048 511149 438105 260884 244382 290814 -21057 -255355 -108712 -24967 180781
15218A80781k77702j07200N9585l3208J07577J22737J6181O667P0467k20185j63107
$$ 180781 -96921 -204121 -144536 -177744 -70167 52570 68751 75418 145885 -74300 -237407
15207b37407M46585K11858n9925k77533l21881j50805k42718j41322M14863J81415
$$ -237407 209178 421036 361111 83578 -238303 -389108 -631826 -773148 -358285 -176870
15197a76870J17630L74542L06470r6007k21238k26962N7291M9263K44179M73439
$$ -176870 -59240 315302 621772 525765 304527 77565 134856 184119 428298 901737
15187I01737M3766l71095m8758j18820j15638K26723j34814J00398J09219p5814
$$ 901737 945503 574408 525650 406830 291192 517915 383101 483499 592718 516904
15177E16904l58305j58850o296L09790K04614j71362j37761p3278l7379j61277
$$ 516904 158599 -251 -6547 303243 507857 336495 198734 125456 88077 -73200
15167g3200J99745J45234j43080o9155j10521k68111J437J73218N53684M4608
$$ -73200 126545 271779 128699 59544 -50977 -319088 -317651 -144433 409251 453859
15157D53859k91007k36535L76914j94830j97297K5897n8496j97925k01153K24990
$$ 453859 162852 -73683 303231 108401 -88896 -62999 -121495 -319420 -520573 -295583
15147b95583K9807K76051J28779l34571k55237J65110L3150J79006o8720O5605
$$ -295583 -265776 10275 139054 -195517 -450754 -285644 -252494 -73488 -142208 -76603
15137g6603L0195P904K19555K66234Q9716k5518J65447j10150L3759k7471k66323
$$ -76603 -46408 -38504 181051 447285 537001 511483 676930 566780 600539 573068 306745
15126C06745j54381j6717k68147q4566K09892L16674Q9136p5739o6916k93529
$$ 306745 152364 135647 -132500 -217066 -7174 309500 398636 322897 255981 -37548
15116c7548k10106j3075M6600k65647J25145M526K37741L23694n914L3704j1472
$$ -37548 -247654 -260729 -214129 -479776 -354631 -350105 -112364 211330 205416 239120 227648
15105B27648K07904k60836k60054K2608k09051l57455P7535Q9304K9565K04479
$$ 227648 435552 174716 -85338 -62730 -271781 -629236 -551701 -462397 -432832 -228353
15095b28353j26475k2257K26615K68779j78527k02922k36494J67092J40549o0905
$$ -228353 -354828 -377085 -150470 118309 -60218 -263140 -499634 -332542 -191993 -252898
15085b52898M33561L14084K68771l72902k34374j89549k51291k41325L23501j1961
$$ -252898 180663 494747 763518 390616 156242 -33307 -284598 -525923 -202422 -214383
15075b14383L59435K72837j36663j72222N0577J53114R53k09960k52632J56096
$$ -214383 145052 417889 281226 109004 159581 312695 313648 103688 -148944 7152
15065G152k48568R3025J30232L4341k89105j85874k29279L4439J86325L49026
$$ 7152 -241416 -148391 -18159 16182 -272923 -458797 -688076 -653637 -467312 -118286
15055a18286L24401L2826J7596n8945r2205R4917M876m5557k65932l06328K9801
$$ -118286 206115 238941 256537 197592 105387 200304 205180 159623 -106309 -412637 -382836
15044c82836J89565n8021m8527k44170j49572K75927N50285K01800j19731j23582
$$ -382836 -193271 -251292 -299819 -543989 -693561 -417634 132651 334451 214720 91138
15034I1138l5341l21651j61280L47481j11616J49262L46940q8347L1028l711l65974
$$ 91138 55797 -265854 -427134 -79653 -191269 -42007 304933 216586 247614 243903 -122071
15023a22071M5610N9595L46242J31920k0873l20119o6615j55467l42518K00383
$$ -122071 -76461 -16866 329376 461296 440423 120304 53689 -101778 -444296 -243913
15013b43913J51626K10440k29288K56618L28681R4530j13273j02631M8062j31991
$$ -243913 -92287 118153 -111135 145483 474164 568694 455421 352790 400852 268861
15003B68861L5668J42168K06517n9255M14210m07090o43562j34570Q358J53935
$$ 268861 304529 446697 653214 593959 1008169 601079 -42483 -177053 -168695 -14760
14993a4760M9296l47899R0632j78441j63851L59623L61158N7987r0596J19923
$$ -14760 34536 -313363 -222731 -401172 -565023 -205400 155758 213745 123149 243072
14983B43072j98152m72231j69030K71963J63986J48586l42248J0251Q4826K62900
$$ 243072 44920 -427311 -596341 -324378 -160392 -11806 -354054 -343803 -258977 3923
14973C923L87441k02477j99454l49005m4170k07533R2397R8543K37326J88266
$$ 3923 391364 188887 -10567 -359572 -403742 -611275 -518878 -420335 -183009 5257
14963E257l5398P8166K29206l12407k41597L81973J20765J6927K1387l86530P869
$$ 5257 -30141 48025 277231 -35176 -276773 105200 225965 242892 264279 -122251 -114382
14952a14382J06121M7114Q0468J31136j81224o126J96247k59917l30629K51911
$$ -114382 -8261 38853 119321 250457 69233 63107 259354 -563 -331192 -79281
14942g9281K56562J96940L9176r7326O6428m2885k70122k62433J6954L50041K39692
$$ -79281 177281 374221 413397 316071 382499 339614 69492 -192941 -175987 174054 413746
14931D13746N5717j99887j60991K77571l4116J48153J49744l5616L2839K3041
$$ 413746 469463 269576 108585 386156 352040 500193 649937 614321 647160 670201
14921F70201j95862m06937l02540L45252k64822k02789J07847K6073O3301L19690
$$ 670201 474339 67402 -235138 110114 -154708 -357497 -249650 -223577 -160276 159414
14911A59414r5110q6093P0074J80794J89949L14533k1286k23998r5053R3948J12224
$$ 159414 64304 -21789 48285 229079 419028 733561 712275 488277 393224 487172 599396
14900E99396J80118l5967m15195m21166N4860O2394J13350R3887j24888j66954
$$ 599396 779514 743547 328352 -92814 -37954 24440 137790 231677 106789 -60165
14890f0165R3043k4199o6294j6466P1854j17116j96355P7746M7190J10955n5766
$$ -60165 32878 8679 -57615 -74081 -2227 -119343 -315698 -237952 -190762 -79807 -135573
14879a35573m4152K69188O61r6631l2059M9151K27609j496m96755J70356j63231
$$ -135573 -179725 89463 90124 -6507 -38566 10585 238194 236698 -260057 -89701 -252932
14868b52932J39874j1089R6369K11240J65975K03163L8137j03556l36848j53740
$$ -252932 -113058 -124147 -27778 183462 349437 552600 590737 487181 150333 -3407
14858c407K91011K4559l2288J41873l0185J74151J26076J39504j83921l18779
$$ -3407 287604 312163 279875 421748 391563 565714 691790 831294 647373 328594
14848C28594k59157J7538K3500m16820j199M97718J87575O016j06140L839M11870
$$ 328594 69437 86975 110475 -306345 -307544 190174 377749 383765 277625 281464 693334
14837F93334R8750n6532n19112m72541L84225p9447o2978L59306L20966J539l76306
$$ 693334 792084 735552 216440 -256101 128124 48677 -14301 345005 665971 667510 291204
14826B91204l16700l39460j56468k0736J24514K46754J55862j08894P6506K11988
$$ 291204 -25496 -364956 -521424 -542160 -417646 -170892 -15030 -123924 -47418 164570
14816A64570n5301j92230m8680j16548k9576K09546l160J25666k40932j92035
$$ 164570 109269 -82961 -131641 -248189 -277765 -68219 -71379 54287 -186645 -378680
14806c78680J22794K65537k7585L6718m5953j12016o665j99371M9882j3651l8326
$$ -378680 -255886 9651 -17934 18784 -27169 -139185 -145850 -345221 -295339 -308990 -347316
14795c47316k7640L8152K69670n7051l61587j48683J01259J50160n2643K65455
$$ -347316 -374956 -336804 -67134 -124185 -485772 -634455 -533196 -383036 -435679 -170224
14785a70224K72692P6123J44930o312J08553N7032k11250k11181M0848n1974J14172
$$ -170224 102468 178591 323521 317209 425762 482794 271544 60363 101211 49237 163409
14774A63409N6311j15263K1157P9416p9938n5494J30007J08264q4966q8018J09127
$$ 163409 219720 104457 125614 205030 125092 69598 199605 307869 222903 134885 244012
14763B44012k27057l26235M0308j741Q9233r6818j47760j29954P4664J65682k74824
$$ 244012 16955 -309280 -268972 -270713 -181480 -278298 -426058 -556012 -481348 -315666 -590490
14752e90490L7978L18702N4688K13638j81351J96072l0733o3160K15938p6377
$$ -590490 -552512 -233810 -179122 34516 -146835 49237 18504 -44656 171282 94905
14742I4905q9524L6005J44299o5723k83301m9888k43794O3953N8553M243j10242
$$ 94905 5381 41386 185685 119962 -163339 -213227 -457021 -393068 -334515 -330272 -440514
14731d40514K67231L9319l6948R6528j39735j36733K48817L47938k11518k64861
$$ -440514 -173283 -133964 -170912 -74384 -214119 -350852 -102035 245903 34385 -230476
14721b30476j33090P7525L75103J65715j1414j16612j57387K53N6806L8558L1693
$$ -230476 -363566 -286041 89062 254777 243363 126751 -30636 -30383 26423 64981 96674
14710I6674p2017J06595J11832J87473j15387k48323j70122L8675j98842J88739
$$ 96674 24657 131252 243084 430557 315170 66847 -103275 -64600 -263442 -74703
14700g4703K9101J55541m1293k15400K59565J73744K9628m68694j96675Q6181
$$ -74703 -45602 109939 68646 -146754 112811 286555 316183 -152511 -349186 -263005
14690b63005J49821j10637J62099M83140L6547l34629k09715p031K76546o9040
$$ -263005 -113184 -223821 -61722 421418 457965 123336 -86379 -93410 183136 114096
14680A14096L629J95944j91076j51620j76693k9675j75770j06583L87433K87794
$$ 114096 117725 313669 122593 -29027 -205720 -235395 -411165 -517748 -130315 157479
14670A57479o070l84019q6566K45296K47385j96292O171M51067r5401q2854j4048
$$ 157479 151409 -232610 -319176 -73880 173505 -22787 -16616 434451 339050 256196 242148
14659B42148J70361K71665k05385l14941l34006k85106L2276O56616O7565k14699
$$ 242148 412509 684174 478789 163848 -170158 -455264 -422988 233628 301193 86494
14649H6494j47140K60761P4316m15260l30617k46549J83061L31244J96535j23893
$$ 86494 -60646 200115 274431 -140829 -471446 -717995 -534934 -203690 -7155 -131048
14639a31048q3886j09249L2913Q9428K94627J60344J1122j26476l39999N6070
$$ -131048 -214934 -324183 -291270 -201842 92785 253129 264251 137775 -202224 -146154
14629a46154O2634k65742J57585K16002j70346j06492J84283K49607J40437m05689
$$ -146154 -83520 -349262 -191677 24325 -146021 -252513 -68230 181377 321814 -83875
14619h3875r5696L2989Q0717J22189K31013j72575k10139K242K32422j16680j10608
$$ -83875 -179571 -146582 -65865 56324 287337 114762 -95377 -93135 139287 22607 -88001
14608h8001k25908j8892J02800K53712J06811j81101k06912J00532M2036o0321
$$ -88001 -313909 -332801 -230001 23711 130522 -50579 -257491 -156959 -114923 -175244
14598a75244Q425K48145J23729k3886j57321r7223j34833M83337P0940m76115
$$ -175244 -166819 81326 205055 181169 23848 -73375 -208208 275129 346069 -130046
14588a30046J02782K85840K6540k22669k73955n2395m2231M06869r6132J97267
$$ -130046 -27264 258576 285116 62447 -211508 -263903 -306134 100735 4603 201870
14578B01870Q5164j53296q2998R4142J05142J07664k7664m40418k62010j32417
$$ 201870 287034 133738 50740 144882 250024 357688 330024 -110394 -372404 -504821
14568e04821R1310J34257K24978P1544k74878N1029j60807j0878K67516j14314
$$ -504821 -413511 -279254 -54276 17268 -257610 -206581 -367388 -378266 -110750 -225064
14558b25064r9121k16664J58035K68662k2430J90668Q7497k54499m24058m1558
$$ -225064 -324185 -540849 -382814 -114152 -136582 54086 141583 -112916 -536974 -578532
14548e78532O1286j3634J81031L01920k44603Q8548J02296J76817K64223j51132
$$ -578532 -517246 -530880 -349849 -47929 -292532 -203984 -101688 75129 339352 188220
14538A88220k53366k24476K84059K23539o7051j66125J63647L32891j28113k69858
$$ 188220 -65146 -289622 -5563 217976 150925 -15200 148447 481338 353225 83367
14528H3367j70829j49927K4606q1150n2265L61018K71769J17862K67582o0903
$$ 83367 -87462 -237389 -212783 -293933 -346198 14820 286589 404451 672033 611130
14518F11130K49574k1377l78864j36717M8591k62642j7069K15282J64522j18256
$$ 611130 860704 839327 460463 323746 372337 109695 92626 307908 472430 354174
14508C54174R5469J72949r5607k29630k21274l11902k55386M9928p0487Q4538
$$ 354174 449643 622592 526985 297355 76081 -235821 -491207 -441279 -511766 -427228
14498d27228M02702P2099j83507J51473k16035R6178K10613m7401m5706n5378
$$ -427228 -24526 47573 -135934 15539 -200496 -104318 106295 58894 13188 -42190
14488d2190l21885o0363J17251k23667K16924K29221K18873l08633R2078J55992
$$ -42190 -364075 -424438 -307187 -530854 -313930 -84709 134164 -174469 -82391 73601
14478G3601k33056l7027N2838q065J85827J80276m39422j87556K75457K70186
$$ 73601 -159455 -196482 -143644 -151709 34118 214394 -225028 -412584 -137127 133059
14468A33059K9376k01066j08368K3666j65121J07909N718j97049K02470K65655
$$ 133059 162435 -38631 -146999 -123333 -288454 -180545 -174827 -371876 -169406 96249
14458I6249k1865k0622k51031k45807M0449N6456J42917K41841J94894k12790
$$ 96249 74384 53762 -197269 -443076 -402627 -346171 -203254 38587 233481 20691
14448B0691l56416m3746k9444m0719J37971J57794j11349l13065P4588K60645
$$ 20691 -335725 -379471 -408915 -449634 -311663 -153869 -265218 -578283 -503695 -243050
14438b43050L13142K0793O1890j39537j13537J57903J51640j41372o6457R6507
$$ -243050 70092 90885 152775 13238 -100299 57604 209244 67872 1415 97922
14428I7922j15788j06209K63431L51198j30185q8983k97715M8329p0441K2086
$$ 97922 -17866 -124075 139356 490554 360369 271386 -26329 22000 -48441 -26355
14418b6355J99240k12050K17552n2710L8442j53329J804J19437k26726J61608
$$ -26355 172885 -39165 178387 125677 164119 10790 12594 132031 -94695 66913
14408F6913J91969M25952J26203o10027m63953K35612K74341l14455j90191L00749
$$ 66913 258882 684834 811037 201010 -262943 -27331 247010 -67445 -257636 43113
14398D3113K00357j82142j85169L9059l54257k42077K07076M3718L6571J39691
$$ 43113 243470 61328 -123841 -84782 -439039 -681116 -474040 -430322 -393751 -254060
14388b54060J4979k12611l8106L02336k5605k20259Q8922K47795K10510K02355
$$ -254060 -239081 -451692 -489798 -187462 -213067 -433326 -344404 -96609 113901 316256
14378C16256l54581j2741j64427l2299p6429j16067L00904M3778k29191j32927
$$ 316256 -38325 -51066 -215493 -247792 -324221 -440288 -139384 -95606 -324797 -457724
14368d57724J31968J55015L80266k14597j32045J30701O6841m6881K6409j03879
$$ -457724 -325756 -170741 209525 -5072 -137117 -6416 60425 13544 39953 -63926
14358f3926M0404j84739J66074M9550l79662J2672K04623p9172j1969K04815J73973
$$ -63926 -23522 -208261 -42187 7363 -372299 -359627 -155004 -234176 -246145 -41330 132643
14347A32643l31442J19186k62384k28947K43502p4414P0387K92332M9311J7935
$$ 132643 -198799 -79613 -341997 -570944 -327442 -401856 -331469 -39137 10174 28109
14337B8109l63874Q8562R5426K85358k5817K42106J50562L5496m12763k20299
$$ 28109 -335765 -247203 -151777 133581 107764 349870 500432 535928 123165 -97134
14327i7134o049k09549N2697o2834P8170K39355J05642K27018K39813j83843o5117
$$ -97134 -103183 -312732 -260035 -322869 -244699 -5344 100298 327316 567129 383286 318169
14316C18169K18253J48119j87115n23336l26506K85453J79734J57962l79822L73070
$$ 318169 536422 684541 497426 -25910 -352416 -66963 112771 270733 -109089 263981
14306B63981L86451k44925o98830k28142R9574K13090l2409j99097j11531o4096
$$ 263981 650432 405507 -293323 -521465 -421891 -208801 -241210 -440307 -551838 -615934
14296f15934L52237q5608m9446J04167k43945J35409J95622j26572K53949K26384
$$ -615934 -263697 -349305 -398751 -294584 -538529 -403120 -207498 -334070 -80121 146263
14286A46263p4648K09704K51099k05010j666j00939m52195K49836L89440K19379
$$ 146263 71615 281319 532418 327408 325742 224803 -227392 22444 411884 631263
14276F31263L2080m00117k37631k77128k5352j10949k6457L88951O1142k16429
$$ 631263 663343 263226 25595 -251533 -276885 -387834 -414291 -25340 35802 -180627
14266a80627j94897m8089l1706j61186j1746L08481K84473J36834k57429k94098
$$ -180627 -375524 -423613 -455319 -616505 -628251 -319770 -35297 101537 -155892 -449990
14256d49990j51379M154K73449m3090j29691J31019K99724J85503M9646m2690
$$ -449990 -601369 -597215 -323766 -366856 -496547 -365528 -65804 119699 169345 126655
14246A26655n8614j45296m79435j05855M06420J24661J38489j45885J32031N7249
$$ 126655 68041 -77255 -556690 -662545 -256125 -131464 7025 -138860 -6829 50420
14236E0420Q3201Q72L3489J81126r5616O8867k66555j13758L9681J8429K20135
$$ 50420 133621 134493 167982 349108 253492 322359 55804 -57954 -18273 156 220291
14225B20291J49445j57005o40265l50351l60854K05474K68874q8886N6424K02604
$$ 220291 369736 212731 -427534 -777885 -1138739 -933265 -664391 -753277 -696853 -494249
14215d94249L54833m08070k30851K73101L66102j7496l81602K26675K31135L2869
$$ -494249 -139416 -547486 -778337 -505236 -139134 -156630 -538232 -311557 -80422 -47553
14205d7553l0150j63385K02699K16448p0244l41993J48533N46220J22760J9577
$$ -47553 -77703 -241088 -38389 178059 107815 -234178 -85645 460575 583335 602912
14195F02912k7626j67366k98394j61389K56627M3092L1460j98208k21637j27864
$$ 602912 575286 407920 109526 -51863 204764 247856 279316 81108 -140529 -268393
14185b68393K20682K77750j22331l56342r8917j18764J22522M2645p2877J21433
$$ -268393 -47711 230039 107708 -248634 -347551 -466315 -343793 -301148 -374025 -252592
14175b52592J37385n7539O4814L6276j89709k740k6264n4885K51918K7692J05876
$$ -252592 -115207 -172746 -107932 -71656 -261365 -264105 -290369 -345254 -93336 -65644 40232
14164D0232L2221p5276k55144N45294M87998J73793p51604m73789J75142k21450
$$ 40232 72453 -2823 -257967 287327 775325 949118 197514 -276275 -101133 -322583
14154c22583j79420J19541Q6859L8967J85153m1168r4091K54826j15732l82591
$$ -322583 -502003 -382462 -295603 -256636 -71483 -112651 -206742 48084 -67648 -450239
14144d50239k99134l9646K37366L96290j96360K6335K23804j34356j51361K19273
$$ -450239 -749373 -789019 -551653 -155363 -351723 -325388 -101584 -235940 -387301 -168028
14134a68028P6534j66816q2465J48409J3841K2450K92310J94756j33695l9918
$$ -168028 -91494 -258310 -340775 -192366 -178525 -156075 136235 330991 197296 157378
14124A57378q7516n17995J13076O4663K57269J79331q6724k30402k84893J97691
$$ 157378 69862 -448133 -335057 -270394 -13125 166206 79482 -150920 -435813 -238122
14114b38122L42647K02464j13635k15819k66572K35735J68733J74027M5564o2808
$$ -238122 104525 306989 193354 -22465 -289037 -53302 115431 289458 335022 272214
14104B72214j27057J75326K12232J14719j50915m3898K09427n8112j47707k37701
$$ 272214 145157 320483 532715 647434 496519 452621 662048 603936 456229 218528
14094B18528j88756Q1447k56092j71306K34376n47m6544J71919Q8541p6209R6169
$$ 218528 29772 111219 -144873 -316179 -81803 -82350 -128894 43025 131566 55357 151526
14083A51526J03935N9336M0786j51464m4962J105J41233M5572m75539l8665K17518
$$ 151526 255461 314797 355583 204119 159157 160262 301495 347067 -128472 -167137 50381
14072E0381K94888j00788l78391k7062J53082L01548n6623J3522j53822m28039
$$ 50381 345269 244481 -133910 -160972 -7890 293658 237035 250557 96735 -331304
14062c31304L50249K06693l887k8524j41984q5001J1051k39327k94430j77297
$$ -331304 18945 225638 221751 193227 51243 -33758 -22707 -262034 -556464 -733761
14052g33761L26002L68245l33934k26982M08734L7687K9775M8259J94094J8239
$$ -733761 -407759 -39514 -373448 -600430 -191696 -154009 -124234 -75975 118119 136358
14042A36358J65523m94638j81322L00186J2953R4881J43264q735l85171j5892
$$ 136358 301881 -192757 -374079 -73893 -60940 33941 177205 168470 -216701 -232593
14032b32593P0159m7181O6567j52376l15150r9103N6972L11443o366p8953P8300
$$ -232593 -162434 -209615 -143048 -295424 -610574 -709677 -652705 -341262 -347628 -426581 -348281
14021c48281J28657K90419k13381l84178m26744L44125N36517K04907r3602J3970
$$ -348281 -219624 70795 -142586 -526764 -953508 -609383 -72866 132041 38439 52409
14011E2409j1450j90221j48350k56286K41849K18959j63608j06190Q7833M4913
$$ 52409 40959 -149262 -297612 -553898 -312049 -93090 -256698 -362888 -275055 -230142
14001b30142J21157M5434k95872J5544L7968p504K34288K6109K57933P2268k44815
$$ -230142 -108985 -63551 -359423 -343879 -305911 -313415 -79127 -53018 204915 277183 32368
13990C2368N0327O4137J78129M5881J06274J02247l48978j22699L35527j83674
$$ 32368 82695 146832 324961 370842 477116 579363 230385 107686 443213 259539
13980B59539j58317m35520m27771L61051J67903j35143k13964J66369J38798K55276
$$ 259539 101222 -334298 -762069 -401018 -233115 -368258 -582222 -415853 -277055 -21779
13970b1779K60332K04433o6437j23510j57267q1143j12976K71142j2353k83150
$$ -21779 238553 442986 376549 253039 95772 14629 -98347 172795 160442 -122708
13960a22708Q8215O5788o6534n4453j85885j03810q8870M99858M38728l89887
$$ -122708 -34493 31295 -35239 -89692 -275577 -379387 -468257 31601 470329 80442
13950H0442n21120m2544J96402J50133K19303J91380N4303L1849j14624M3522
$$ 80442 -440678 -483222 -286820 -136687 82616 273996 328299 360148 245524 289046
13940B89046j48849j5716j98698J60862k3091j74108k15979J02020P9745o7352
$$ 289046 140197 124481 -74217 86645 63554 -110554 -326533 -224513 -144768 -212120
13930b12120J27486k07290J47311J50623J4539P3371p3320K16316L51662j50710
$$ -212120 -84634 -291924 -144613 6010 20549 93920 20600 236916 588578 437868
13920D37868j41802m6372M3757j5460l67464n46591L91925L05715j71084m5504
$$ 437868 296066 249694 293451 277991 -89473 -636064 -244139 61576 -109508 -155012
13910a55012m6267r4029n2678M13165J58922n44357j00322R1426J08237O4472
$$ -155012 -201279 -295308 -347986 65179 224101 -320256 -420578 -329152 -220915 -156443
13900a56443l6494N1530q5109j55019J34138K2482K41525K23337m4966o9509J29120
$$ -156443 -192937 -141407 -226516 -381535 -247397 -224915 16610 239947 194981 125472 254592
13889B54592j71705m98979k07810O0422K32643K23417O6754K61073q6921n10100
$$ 254592 82887 -416092 -623902 -563480 -330837 -107420 -40666 220407 133486 -376614
13879c76614q3391J95199N71411Q0393m05486l02417l9565o2466J28809j7611
$$ -376614 -460005 -264806 306605 386998 -18488 -320905 -360470 -422936 -294127 -311738
13869c11738j7950K26383J16057j64833j46479j71383M15395L82952K16161Q6195
$$ -311738 -329688 -103305 12752 -152081 -298560 -469943 -54548 328404 544565 630760
13859F30760q6254m33450o8729L59042K36590M3002l18771J09365q7767n26570
$$ 630760 544506 111056 42327 401369 637959 680961 362190 471555 383788 -142782
13849a42782k93992k6198M49803j3293j44148l42385P0928O7870j31722J44012
$$ -142782 -436774 -462972 -13169 -26462 -170610 -512995 -442067 -374197 -505919 -361907
13839c61907K3320j72503k25151j0599K32814m2438J91985l30297R8563L17963
$$ -361907 -338587 -511090 -736241 -746840 -514026 -556464 -364479 -694776 -596213 -278250
13829b78250J8534k62808j06227M790r0604K36441K22380j4693K01703J38930
$$ -278250 -259716 -522524 -628751 -623961 -714565 -478124 -255744 -270437 -68734 70196
13819G0196m05530P8896O2040J20841K86988k10629n02826J39137N90058J31406
$$ 70196 -335334 -256438 -194398 -73557 213431 2802 -500024 -360887 229171 360577
13809C60577l13635k60393J74413J84499R7560K1979J35947j24l5959k19082n67920
$$ 360577 46942 -213451 -39038 145461 243021 265000 400947 400823 364864 145782 -422138
13798d22138l8886j07455j40790L83791K77254J82143K66633M7795j35746m24559
$$ -422138 -461024 -568479 -709269 -325478 -48224 133919 400552 448347 312601 -111958
13788a11958k20964j66712k40608j96018J79156M607j07450K89288L5728K88249
$$ -111958 -332922 -499634 -740242 -936260 -757104 -752497 -859947 -570659 -534931 -246682
13778b46682L54264L9782j8342j57227J11184j37112m22374L9647K89613O2055
$$ -246682 107582 147364 129022 -28205 82979 -54133 -476507 -436860 -147247 -85192
13768h5192K24622J58013k83314k02976K59446r0164R4045j07056O891J28261
$$ -85192 139430 297443 14129 -188847 70599 -19565 74480 -32576 -25685 102576
13758A02576J09992j76302K051k01740L2230j05600N7114J32731J63258l8313
$$ 102576 212568 36266 38317 -163423 -131193 -236793 -179679 -46948 116310 77997
13748G7997L03040j33591m34751p0917J55146o6968k88245J6184M37456K02833
$$ 77997 381037 247446 -187305 -258222 -103076 -170044 -458289 -442105 -4649 198184
13738A98184r2113k40279p096L7182N1671j19714q1857k6340k3037n4439K76636
$$ 198184 106071 -134208 -141304 -104122 -52451 -172165 -254022 -280362 -303399 -357838 -81202
13727h1202J92466M6558k8310j645N7084J73418J38391o9914k23857j75031k46932
$$ -81202 111264 157822 129512 127867 184951 358369 496760 426846 202989 27958 -218974
13716b18974r6875k18110K03691K1609M1310m1605K69838j14889j1943o3732k38697
$$ -218974 -315849 -533959 -330268 -308659 -267349 -308954 -39116 -154005 -165948 -229680 -468377
13705d68377N7744J05793J61374K4105O0876j47536N5392m13867P4013k5560J18679
$$ -468377 -410633 -304840 -143466 -119361 -58485 -206021 -150629 -564496 -490483 -516043 -397364
13694c97364M03117p9544K84909m1768k03660O556P9703k16664k801L31999Q9752
$$ -397364 5753 -73791 211118 169350 -34310 -27754 51949 -164715 -167516 164483 254235
13683B54235j39637m84315k93571J30388K86011N75790N1262O184k72367o5787
$$ 254235 114598 -369717 -663288 -532900 -246889 328901 380163 386347 113980 48193
13673D8193J12435O01J43259r3957k41549O3020j5484L9684K99045M8299j22040
$$ 48193 160628 161229 304488 210531 -31018 32002 16518 56202 355247 403546 281506
13662B81506J25596k31744J79878k14758J10087K54714L78933K38252l61522m26552
$$ 281506 407102 175358 355236 140478 250565 505279 884212 1122464 760942 334390
13652C34390r7537J684L22293j99848r0893J96648q1942l81406K6526K4984J47196
$$ 334390 236853 238537 560830 360982 270089 466737 384795 3389 29915 54899 202095
13641B02095o0130j42383q0235j24809J73734q3731j87135K02323l29567K87040
$$ 202095 141965 -418 -80653 -205462 -31728 -115459 -302594 -100271 -429838 -142798
13631a42798L32550L20100n5761J546l27092K50162k0709j17022J37376L90140
$$ -142798 189752 509852 454091 455637 128545 378707 357998 240976 378352 768492
13621G68492j76618m73238k42287j49086L15076r3503o7213j53372r4081K54797
$$ 768492 591874 118636 -123651 -272737 42339 -51164 -118377 -271749 -365830 -111033
13611a11033N82575J56044o5739n9184M76687L36184L69539K24888k35280o48833
$$ -111033 471542 627586 561847 502663 979350 1315534 1685073 1909961 1674681 1025848
13601A025848m51426l89966j12863K17170J13896j47361j40748L65229J26844
$$ 1025848 574422 184456 71593 288763 402659 255298 114550 479779 606623
13592F06623l66110j72931K12702n0010j42649j01849k52435o7134N57878L72621
$$ 606623 240513 67582 280284 230274 87625 -14224 -266659 -333793 224085 596706
13582E96706N9127K68048k07211n9506J65426J40541l55106j94198k66536j87621
$$ 596706 655833 923881 716670 657164 822590 963131 608025 413827 147291 -40330
13572d0330l21137K30905J90295j04134l47390j43965J39358K13262K89800K81261
$$ -40330 -361467 -130562 59733 -44401 -391791 -535756 -396398 -183136 106664 387925
13562C87925L14780K71076j65550K16087P6293k34168l55488l77344j75088j32197
$$ 387925 702705 973781 808231 1024318 1100611 866443 510955 133611 -41477 -173674
13552a73674j4573R8650j39898j64744J30808K12287j04009j53461j87564J60037
$$ -173674 -188247 -89597 -229495 -394239 -263431 -51144 -155153 -308614 -496178 -336141
13542c36141q5988l4649J3810L89254M82379R3718m10169n12930j01011L32165
$$ -336141 -422129 -456778 -442968 -53714 428665 522383 112214 -400716 -501727 -169562
13532a69562N42750K2272J3500l35621j20955K8279K21169K72460n7211o12184
$$ -169562 373188 395460 408960 73339 -47616 -19337 201832 474292 417081 -195103
13522a95103R8222K26106J98198J75483Q2317L6323J65778J52202m5210l97120
$$ -195103 -96881 129225 327423 502906 585223 621546 787324 939526 894316 497196
13512D97196m22345Q9450n9800r2012n7286m1206m9193J52675J33067K16969M9993
$$ 497196 74851 164301 104501 12489 -44797 -86003 -135196 17479 150546 367515 417508
13501D17508M0044j08706k85253j04022K30805L9160L1719j02217j26201J74411
$$ 417508 457552 348846 63593 -40429 190376 229536 261255 159038 32837 207248
13491B07248L8560J00976j09377k43835r6627r3710J44558K20243Q9606l58977
$$ 207248 245808 346784 237407 -6428 -103055 -196765 -52207 168036 257642 -101335
13481a01335j47421J03519j35259j26587R1334k58203K50106K05574K96968J16695
$$ -101335 -248756 -145237 -280496 -407083 -315749 -573952 -323846 -118272 178696 295391
13471B95391R2379j36902k21453k37531n1863L50322N0964K17664j8015K62977
$$ 295391 387770 250868 29415 -208116 -259979 90343 141307 358971 340956 603933
13461F03933q4714j76888k78661m06732P9668N8881L5867J37666K12656J0874
$$ 603933 519219 342331 63670 -343062 -263394 -204513 -168646 -30980 181676 192550
13451A92550K12945L6159j32416l54242k35822q2457j27614m2620J76576J31156
$$ 192550 405495 441654 309238 -45004 -280826 -363283 -490897 -533517 -356941 -225785
13441b25785k463K35202l06830j57620M844J76216J70264j49714k99359l5352
$$ -225785 -228248 6954 -299876 -457496 -452652 -276436 -106172 -255886 -555245 -590597
13431e90597L0727p0277n09726j22559K07263M50810M6127r1075O7634q4153p768
$$ -590597 -559870 -630147 -1139873 -1262432 -1055169 -604359 -558232 -649307 -581673 -665826 -673594
13420f73594k3483N01126K69345j08511n15833R6304J65364j66726J1900J29535
$$ -673594 -697077 -195951 73394 -35117 -550950 -454646 -289282 -456008 -444108 -314573
13410c14573n5729m97608O7720M24985K26185K18809j14434k97553j19279j22847
$$ -314573 -370302 -867910 -800190 -375205 -149020 69789 -44645 -342198 -461477 -584324
13400e84324J54583M95266J30974n3364J8277J9426j45537N958L04726l30547
$$ -584324 -429741 65525 196499 143135 161412 180838 35301 41259 345985 15438
13390A5438j54700K37773L32020j35452k40093L98278L12566j90099k09571K1410
$$ 15438 -139262 98511 430531 295079 54986 453264 765830 575731 366160 387570
13380C87570j32187k41083J3936j71075J41751j0970j31096j70796K05420n4610
$$ 387570 255383 14300 28236 -142839 -1088 -12058 -143154 -313950 -108530 -163140
13370a63140R4805K83975j34090m3923M8698j03648n5991J3421l09363M1090L6367
$$ -163140 -68335 215640 81550 37627 86325 -17323 -73314 -59893 -369256 -328166 -291799
13359b91799j62163J95025j47557n0270J31643M7192M1075R0903j410m4910J30200
$$ -291799 -453962 -258937 -406494 -456764 -325121 -277929 -236854 -145951 -147361 -192271 -62071
13348f2071j12461J40730k12682k52950L15303J69739M1378l0522K78371K60818
$$ -62071 -174532 -33802 -246484 -499434 -184131 -14392 26986 -3536 274835 535653
13338E35653N947j41071k56376n0080j03269r9397K75805p7369l79460O3098j35270
$$ 535653 541600 400529 144153 94073 -9196 -108593 167212 89843 -289617 -226519 -361789
13327c61789J32795J6824l34293m48463l27488M49052K11341R3935J79257j54651
$$ -361789 -228994 -212170 -546463 -994926 -1322414 -873362 -662021 -568086 -388829 -543480
13317e43480k21167M88650J50165q4091L3854N5161k97989j64227K41930M8018
$$ -543480 -764647 -275997 -125832 -209923 -176069 -120908 -418897 -583124 -341194 -293176
13307b93176P1095j48656m7537J46291r6488j04330k1716K64675k24507n3372
$$ -293176 -222081 -370737 -418274 -271983 -368471 -472801 -494517 -229842 -454349 -507721
13297e07721Q3089J70372J97394L71151L65318l51079o77537j7382P008M7283
$$ -507721 -424632 -254260 -56866 314285 679603 328524 -349013 -366395 -359387 -312104
13287c12104Q5981K15110L5001J04455k16853L74926K01007j40325p2383l71230
$$ -312104 -226123 -11013 23988 128443 -88410 286516 487523 347198 274815 -96415
13277i6415l84510j18130j03180K06361Q3211R7437K80976L51271p8147J3185
$$ -96415 -480925 -599055 -702235 -495874 -412663 -315226 -34250 317021 238874 252059
13267B52059k21864J73171J05254l10641l47700q4563J03846J23249j60666J04538
$$ 252059 30195 203366 308620 -2021 -349721 -434284 -330438 -207189 -367855 -263317
13257b63317J67810j7457l70297J14974K03037j06443j16652J77982L73308o6151
$$ -263317 -95507 -112964 -483261 -368287 -165250 -271693 -388345 -210363 162945 96794
13247I6794j7305j24220l1068J59806r5085J80954j91029k50723k90113L12861
$$ 96794 79489 -44731 -75799 84007 -11078 169876 -21153 -271876 -561989 -249128
13237b49128r9198m89553j8231M48000J79510R2140J35097N1402J71656K20340
$$ -249128 -348326 -837879 -856110 -408110 -228600 -136460 -1363 50039 221695 442035
13227D42035Q7817j7264j42209n9702k36913l77950k7871K41776k2350k72065
$$ 442035 529852 512588 370379 310677 73764 -304186 -332057 -90281 -112631 -384696
13217c84696j44846R0090M11312k31722j41635j4189j1041O2643K24733K09765
$$ -384696 -529542 -439452 -28140 -259862 -401497 -415686 -426727 -364084 -139351 70414
13207G0414J85261j74732k543m7926n60318j32107L89525K23057L40395k5701
$$ 70414 255675 80943 78400 30474 -529844 -661951 -272426 -49369 291026 265325
13197B65325k14378J1178J41102l04883j64728k81449L65821K71308m72369j0543
$$ 265325 50947 62125 203227 -101656 -266384 -547833 -182012 89296 -383073 -393616
13187c93616P35507K95748j27450k28945K5592k18137j73569L7746k14861j15916
$$ -393616 341891 637639 510189 281244 306836 88699 -84870 -47124 -261985 -377901
13177c77901j73671J43945Q3018J02293K09397j29882J54313K54949q6203J28341
$$ -377901 -551572 -407627 -324609 -222316 -12919 -142801 11512 266461 180258 308599
13167C08599N8123Q7549j84861j07605p2215J9938L3037l39050K7328n6583N1727
$$ 308599 366722 454271 269410 161805 89590 109528 142565 -196485 -169157 -225740 -174013
13156a74013k68601k86980J76924M2990L16001K29k341p6744j87339N3012j84570
$$ -174013 -442614 -729594 -552670 -509680 -193679 -193450 -195791 -272535 -459874 -406862 -591432
13145e91432j89490J87833L4741J74220L71519J8770o6789q7913l90197N2398
$$ -591432 -780922 -593089 -558348 -384128 -12609 6161 -60628 -148541 -538738 -486340
13135d86340J24659P0068K7482n5880K7154J05037K9543q795J45930K42618n8875
$$ -486340 -361681 -291613 -264131 -320011 -292857 -187820 -158277 -167072 -21142 221476 162601
13124A62601j05421k92709m3181m0331l3446J56207o5930K13108Q7573j05842
$$ 162601 57180 -235529 -278710 -319041 -352487 -196280 -262210 -49102 38471 -67371
13114f7371j25526Q2232K44695K0884J7487n9800P9836J19937n743j73359J89117
$$ -67371 -192897 -110665 134030 154914 172401 112601 192437 312374 306631 133272 322389
13103C22389K24113j49874j72807o1674p3649m8463m122Q1322k38333l68773K76089
$$ 322389 546502 396628 223821 162147 88498 40035 35913 117235 -121098 -489871 -213782
13092b13782j45951J4505K8720j98386J17409O340M31110P1758j94701K6205r1461
$$ -213782 -359733 -345228 -316508 -514894 -397485 -391145 39965 111723 -82978 -56773 -148234
13081a48234P2514M7637q034P1647o1392l54631j89005L01693L86748k9866O0946
$$ -148234 -75720 -28083 -36117 35530 -25862 -380493 -569498 -267805 118943 89077 150023
13070A50023k47956j14049J14279q9276k3327j99344L39036k7610k50226K70488
$$ 150023 -97933 -211982 -97703 -186979 -210306 -409650 -70614 -98224 -348450 -77962
13060g7962L4386k22264K18413N5776j49204j59251m8208q0749j24002k34820
$$ -77962 -43576 -265840 -47427 8349 -140855 -300106 -348314 -429063 -553065 -787885
13050g87885J26792L47592J55975J42887J29414J17487J01313j78974j37654m4786
$$ -787885 -661093 -313501 -157526 -14639 114775 232262 333575 154601 16947 -27839
13040b7839K85251O7957k40305q4298k21907M5573j92798P243k07314q9918J06744
$$ -27839 257412 325369 85064 766 -221141 -175568 -368366 -361123 -568437 -658355 -551611
13029e51611K95826P1926k0645j78869j27496j05767j26104J58230L3708M65797
$$ -551611 -255785 -183859 -204504 -383373 -510869 -616636 -742740 -584510 -550802 -85005
13019h5005J13005k9578J4229J73336L51090J20009l66141j96772j29497j66281
$$ -85005 28000 -1578 12651 185987 537077 657086 290945 94173 -35324 -201605
13009b01605L7926o8863j12168J2296L6362O8859J26215j83989n2573n554R3063
$$ -201605 -163679 -232542 -344710 -332414 -296052 -227193 -100978 -284967 -337540 -343094 -250031
12998b50031K193q084J9750M4467M42498J07853k28137k05542j7191n9724j71649
$$ -250031 -247838 -255922 -236172 -191705 250793 358646 130509 -75033 -92224 -151948 -323597
12987c23597l16245j74294L09781J09338K27491K18069L950k10250Q7345R9318
$$ -323597 -639842 -814136 -504355 -395017 -167526 50543 54493 -155757 -68412 30906
12977C0906j67494l18189l040Q9790N6274J88426J52646l07292R5255K06061j97210
$$ 30906 -136588 -454777 -457817 -368027 -311753 -123327 29319 -277973 -182718 23343 -173867
12966a73867j16952L2456K45763j5117J17747K48343J93063N0247k75573l38244
$$ -173867 -290819 -258363 -12600 -27717 90030 338373 531436 581683 306110 -32134
12956c2134o9710J01980K7317j11940m05232n8803J14653J74879L13700O9402
$$ -32134 -101844 136 27453 -84487 -489719 -548522 -433869 -258990 54710 124112
12946A24112O361k41059k35142k3669o852Q0195K5245O2098R5735R8653l31472
$$ 124112 130473 -110586 -345728 -369397 -376249 -296054 -270809 -208711 -112976 -14323 -345795
12935c45795R385n6385M5997m4496k81904J27586j24752J56883L98184n7152k47336
$$ -345795 -336410 -392795 -346798 -391294 -673198 -545612 -670364 -513481 -115297 -172449 -419785
12924d19785j0030j72646L43914M31134k09813Q4856J33037j18813j6999j54047
$$ -419785 -429815 -602461 -258547 172587 -37226 47630 180667 61854 44855 -109192
12914a09192Q7109J61571j94891k3367Q8000j41045k2178k4062M6505n8017n0556
$$ -109192 -22083 139488 -55403 -78770 9230 -131815 -153993 -178055 -131550 -189567 -240123
12903b40123p0807M43855J87143j94583j27432n447j31557k33355J51621J85385
$$ -240123 -310930 132925 320068 125485 -1947 -7394 -138951 -372306 -220685 -35300
12893c5300O9695J60595J02667j91425k14814L04656k42774o6154K07510q9382
$$ -35300 34395 194990 297657 106232 -108582 196074 -46700 -112854 94656 5274
12883E274j29867n4551J10707k08323j54187L5687P6374M07323L10535k21259
$$ 5274 -124593 -179144 -68437 -276760 -430947 -395260 -318886 88437 398972 177713
12873A77713k91702l5765L10764k63474l16097J41187K29034J76228N5165L04699
$$ 177713 -113989 -149754 161010 -102464 -418561 -277374 -48340 127888 183053 487752
12863D87752L89894j24132k51678l2801l2075m02162k26283j21953O9351M04549
$$ 487752 877646 753514 501836 469035 436960 34798 -191485 -313438 -244087 160462
12853A60462J55503n1739Q434L13554m4519k50069j71365j18444j1259J66768
$$ 160462 315965 264226 272660 586214 541695 291626 120261 1817 -9442 157326
12843A57326N1994o8067j92255j57663J26619K61744N367k42603l27166l9829
$$ 157326 209320 141253 -51002 -208665 -82046 179698 185065 -57538 -384704 -424533
12833d24533K48658L51874J6629l20612j98976K0045k00257k28650J87179L40456
$$ -424533 -175875 175999 192628 -127984 -326960 -306915 -507172 -735822 -548643 -208187
12823b08187J28986n4490o382K23469J72074J73723o2793j37836m06613J31097
$$ -208187 -79201 -133691 -140073 83396 255470 429193 366400 228564 -178049 -46952
12813d6952J45241j91051j88972m2496L34124J91329j3101l63410k27037n9737
$$ -46952 98289 -92762 -281734 -324230 9894 201223 188122 -175288 -402325 -462062
12803d62062N6520k7283J35758L2985l86976L3292K69981K44044M58879j00686
$$ -462062 -405542 -432825 -297067 -264082 -651058 -617766 -347785 -103741 355138 254452
12793B54452l18476j27124N2049r5623k24931L02076M47708l40059j50862K47778
$$ 254452 -64024 -191148 -139099 -234722 -459653 -157577 290131 -49928 -200790 46988
12783D6988P5494l17441O6369J29838M17832J60327k37533m3611l58339n3747
$$ 46988 122482 -194959 -128590 1248 419080 579407 341874 298263 -60076 -113823
12773a13823M1849l85520k9261K23720K8528R6953K88041N9426l03481N9474m2126
$$ -113823 -71974 -457494 -486755 -263035 -234507 -137554 150487 209913 -93568 -34094 -76220
12762g6220P8634j9383p4096m7771k20516j82293L98447K15821J20145m9181j30649
$$ -76220 2414 -16969 -91065 -138836 -359352 -541645 -143198 72623 192768 143587 12938
12751A2938j77422J6102K83597J7495j68364R9594K52539K19608k4149j66702
$$ 12938 -164484 -148382 135215 152710 -15654 83940 336479 556087 531938 365236
12741C65236o2205k24033j63871K00069J51705J9570k25501j16629k66920k01450
$$ 365236 303031 78998 -84873 115196 266901 286471 60970 -55659 -322579 -524029
12731e24029K14917K61002R1983l3233K8173Q059N2617J70655J92142k931k85268
$$ -524029 -309112 -48110 43873 10640 38813 46872 99489 270144 462286 459355 174087
12720A74087k17260M54611J96576k71285l27177k2980k01604j9242K58990j11091
$$ 174087 -43173 411438 608014 336729 9552 -13428 -215032 -234274 24716 -86375
12710h6375j09824o7594Q9326K79275m2489l03341L24471j75785k03153j02519
$$ -86375 -196199 -263793 -174467 104808 62319 -241022 83449 -92336 -295489 -398008
12700c98008J68762J85277O6176k91301K28015p6298m75384L2143K75997L05822
$$ -398008 -229246 -43969 22207 -269094 -41079 -117377 -592761 -560618 -284621 21201
12690B1201L52849k27851l39048K59956l3092k52656J22800K58653J41801k29651
$$ 21201 374050 146199 -192849 67107 34015 -218641 -95841 162812 304613 74962
12680G4962k18765l43942J19439j32759L56875O17406k67559k4670K85212j87151
$$ 74962 -143803 -487745 -368306 -501065 -144190 473216 205657 180987 466199 279048
12670B79048j59771m04932l2212K77067J67714L17044K16510l21165j8308n6844
$$ 279048 119277 -285655 -317867 -40800 126914 443958 660468 339303 320995 264151
12660B64151l68228l49243o4994j85135l66K6334R3315j74000K11664K98591L43166
$$ 264151 -104077 -453320 -518314 -703449 -703815 -677481 -584166 -758166 -546502 -247911 95255
12649I5255J12394k40035l71667K8878L27382J18399j03933n0173J29372J88272
$$ 95255 207649 -32386 -404053 -375175 -47793 70606 -33327 -83500 45872 234144
12639B34144l48308l77953j84814O3475N88729M10780j25666k85606j94472J75363
$$ 234144 -114164 -492117 -676931 -613456 -24727 386053 260387 -25219 -219691 -44328
12629d4328N9839N8429P9128K22563N6612m9502j21141N0431l17137j44618J23225
$$ -44328 15511 73940 153068 375631 432243 382741 261600 312031 -5106 -149724 -26499
12618b6499J44591k37217k46065j00132N3820M2554j09885j77163M26776J56703
$$ -26499 118092 -119125 -365190 -465322 -411502 -368948 -478833 -655996 -229220 -72517
12608g2517K2732M0730J39797J84413k32279k42174K11885J78482P1407k51690
$$ -72517 -49785 -9055 130742 315155 82876 -159298 52587 231069 302476 50786
12598E0786k4881Q9244k21881j78269L46771J27443k64071k05414l24366L18262
$$ 50786 25905 115149 -106732 -285001 61770 189213 -74858 -280272 -604638 -286376
12588b86376J41562o3806J33644Q6541Q8957Q9610J26509j59777l2942r7102j55328
$$ -286376 -144814 -208620 -74976 11565 100522 190132 316641 156864 123922 26820 -128508
12577a28508J03344l5159j14637L63759k61389n04123L84783M71823J54296k60506
$$ -128508 -25164 -60323 -174960 188799 -72590 -576713 -191930 279893 434189 173683
12567A73683j53585J55516j16479L34816P1662j74425j1229Q988k24095M17490
$$ 173683 20098 175614 59135 393951 465613 291188 279959 288947 64852 482342
12557D82342M34730J53904p7645k99973l364J58666J8556n76325j18112K87082
$$ 482342 917072 1070976 993331 693358 689994 848660 867216 290891 172779 459861
12547D59861l59924m33284P7966L47069r7141K30263j91222m07010R9552N5477
$$ 459861 99937 -333347 -255381 91688 -5453 224810 33588 -373422 -273870 -218393
12537b18393k58663k0224M16725J12656j42632K11535k4282j21432K59729J95759
$$ -218393 -477056 -497280 -80555 32101 -110531 101004 76722 -44710 215019 410778
12527D10778j55572j77113k50468j86241J11062L23929L18610L2678m40815L04341
$$ 410778 255206 78093 -172375 -358616 -247554 76375 394985 427663 -13152 291189
12517B91189J87495j87787k25852N0259j29953L9500J13047N7068k76341O7532
$$ 291189 478684 290897 65045 115304 -14649 24851 137898 194966 -81375 -13843
12507a3843n7946r0782J35348p965O8606m13018j78906J7321K58459K99176J3095
$$ -13843 -71789 -162571 -27223 -35188 33418 -379600 -558506 -541185 -282726 16450 29545
12496B9545j2036k11688J4246j51387j76339q192R2522J21865M22505j00826K12682
$$ 29545 17509 -194179 -179933 -331320 -507659 -515851 -423329 -301464 121041 20215 232897
12485B32897j34156k22602J67916L15141q4737j55644P4747J23495q392m27127
$$ 232897 98741 -123861 44055 359196 274459 118815 193562 317057 308665 -118462
12475a18462k92967L03923N11777J99011J56299K47200q7497m72411k09280k01714
$$ -118462 -411429 -107506 404271 603282 759581 1006781 919284 446873 237593 35879
12465C5879k73844j69909j6879K30046J80464J27534j68444k01460j74802j2323
$$ 35879 -237965 -407874 -424753 -194707 -14243 113291 -55153 -256613 -431415 -443738
12455d43738L90838K44914m6270j92790O9508J67846P6176k82953l93181n9779
$$ -443738 -52900 192014 145744 -47046 22462 190308 266484 -16469 -409650 -469429
12445d69429K15600M01690K16028M6156J49497k00198k20299o4078J33801L4949
$$ -469429 -253829 147861 363889 410045 559542 359344 139045 74967 208768 243717
12435B43717M9192J01504j27872J74070L2543j52095l35000k33994k17904J90474
$$ 243717 292909 394413 266541 440611 473154 321059 -13941 -247935 -465839 -275365
12425b75365J21967k27807l9743k39776R1259M04020O2288K7709j43087k4150
$$ -275365 -153398 -381205 -420948 -660724 -569465 -165445 -103157 -75448 -218535 -242685
12415b42685n4810k54858L33290L91013m5521m8229L18088K18260j55440p9735
$$ -242685 -297495 -552353 -219063 171950 126429 78200 396288 614548 459108 379373
12405C79373k94522k25255J43314K90427k29298n09462k94264k20591k6644N17700
$$ 379373 84851 -140404 2910 293337 64039 -445423 -739687 -960278 -986922 -469222
12395d69222K7729j45617M97497j125j34236Q840k5678j26999l7K09532J37792
$$ -469222 -441493 -587110 -89613 -90738 -224974 -216134 -241812 -368811 -368848 -159316 -21524
12384b1524N4078M002p3574J0039j89071j41409J36092P8025k32023p4358K15471
$$ -21524 32554 36556 -37018 -26979 -216050 -357459 -221367 -143342 -375365 -449723 -234252
12373b34252R9098L4220Q20K15750K02482N3639k07418J5818k34128j29338K60145
$$ -234252 -135154 -100934 -100114 115636 318118 371757 164339 180157 -53971 -183309 76836
12362G6836j45676q5257N4899J24270j79284l06446j55930j12227K11554K39251
$$ 76836 -68840 -154097 -99198 25072 -154212 -460658 -616588 -728815 -517261 -278010
12352b78010J74836M77315Q3231l6912K58096j56842k03436k97501k39697l9647
$$ -278010 -103174 374141 457372 420460 678556 521714 318278 20777 -218920 -258567
12342b58567L08832J08752n6264J18434K71128k3036m37489K0195k8824M1692
$$ -258567 50265 159017 102753 221187 492315 469279 31790 51985 23161 64853
12332F4853o6064k32755k37922q2200Q7427K26113K78939J47318l30473j39805
$$ 64853 -1211 -233966 -471888 -554088 -466661 -240548 38391 185709 -144764 -284569
12322b84569j65692K6075r270O666O5717J14446n153R5378j20313l41707N03186
$$ -284569 -450261 -424186 -433456 -426790 -361073 -246627 -251780 -156402 -276715 -618422 -115236
12311a15236L68248P135k26513m2624j32161J3715J45046K21561k8369k36736
$$ -115236 253012 260147 33634 -8990 -141151 -127436 17610 239171 210802 -25934
12301b5934j88907j18959K28415L59590K25036n2696m09103m20119J04693K75171
$$ -25934 -214841 -333800 -105385 254205 479241 426545 17442 -402677 -297984 -22813
12291b2813J06007k6495k76109l17340K32228J22304J71375j90232j64138K16360
$$ -22813 83194 56699 -219410 -536750 -304522 -182218 -10843 -201075 -365213 -148853
12281a48853j79183K16408J76394K59638j45933j90791K38845L77596j32540j21001
$$ -148853 -328036 -111628 64766 324404 178471 -12320 226525 604121 471581 350580
12271C50580J98739j88972k40070p0574j46095M78500M962l47354n2142J58569
$$ 350580 549319 360347 120277 49703 -96392 382108 387070 39716 -12426 146143
12261A46143P4417O4718l14321O12R1536m5562J6669l1156L07384n5169J58647
$$ 146143 220560 285278 -29043 -28431 63105 17543 34212 3056 310440 255271 413918
12250D13918j15421j84072j85645p1419J98604j60021j7079M77902J57250k9074
$$ 413918 298497 114425 -71220 -142639 55965 -104056 -121135 356767 514017 484943
12240D84943p7316N7089o4636j82355l17893m0707r3388r9407K39091J57793L29069
$$ 484943 407627 464716 400080 217725 -100168 -140875 -234263 -333670 -94579 63214 392283
12229C92283j65247j65473K14317j25084J72575j23871m95981p4601L50800K15604
$$ 392283 227036 61563 275880 150796 323371 199500 -296481 -371082 -20282 195322
12219A95322m8624k80662j49880J03123K7450J98026P3114Q4449J75012j7650
$$ 195322 146698 -133964 -283844 -180721 -153271 44755 117869 202318 377330 359680
12209C59680k67866n61782k48179M10697K64940J17663j07930k23278L2152J34406
$$ 359680 91814 -469968 -718147 -307450 -42510 75153 -32777 -256055 -223903 -89497
12199h9497l3466m9599J24399N3841j98109k83955l34162j518J50949j83662Q8154
$$ -89497 -122963 -172562 -48163 5678 -192431 -476386 -810548 -812066 -661117 -844779 -756625
12188g56625L00704J74934J97440M473j37403J02156K75262l2186Q0831l3107
$$ -756625 -455921 -280987 -83547 -79074 -216477 -114321 160941 128755 209586 176479
12178A76479k03123j55929l75809k39772J66020M02895R632n01425L339K05920
$$ 176479 -26644 -182573 -558382 -798154 -632134 -229239 -219607 -721032 -717693 -511773
12168e11773K96796Q3240N5762K06839J513l96168Q2430J59225R3681j23474r7179
$$ -511773 -214977 -131737 -75975 130864 132377 -263791 -181361 -22136 71545 -51929 -149108
12157a49108m3859J6196K4748m014j45476J29147r7244K29341K27334K4770j44617
$$ -149108 -192967 -176771 -152023 -156037 -301513 -172366 -269610 -40269 187065 211835 67218
12146F7218j69532j38431p3314m8725l1264K06335k48330K29531N8271K1265J95565
$$ 67218 -102314 -240745 -314059 -362784 -394048 -187713 -436043 -206512 -148241 -126976 68589
12135F8589N6875l56081J34425j53122k47818k5046j71165k1481Q0607L4490j23588
$$ 68589 125464 -230617 -96192 -249314 -497132 -522178 -693343 -714824 -634217 -599727 -723315
12124g23315r6671J58029K83454R1662j9353m17686K98952L71375J08525K748
$$ -723315 -819986 -661957 -378503 -286841 -306194 -723880 -424928 -53553 54972 57720
12114E7720K15400n0429l9567l3463p6879k72721o2926J39696K28117o9183k5145
$$ 57720 273120 222691 183124 149661 72782 -199939 -262865 -123169 104948 35765 10620
12103A0620j43545n4069p7218o6627L65030K6632j50918J63009j53384l50714
$$ 10620 -132925 -186994 -264212 -330839 34191 60823 -90095 72914 -80470 -431184
12093d31184p4232L84282N45327j6211m90521k22268J46441m0034k45338J92238
$$ -431184 -505416 -121134 424193 407982 -82539 -304807 -158366 -198400 -443738 -251500
12083b51500O51168J33223j79511k22307j0714J37400l04430k594k82455L9018
$$ -251500 399668 532891 353380 131073 120359 257759 -46671 -49265 -331720 -292702
12073b92702j77585K23545J18265Q0021P013J57020L47260L3731l80203j61456
$$ -292702 -470287 -246742 -128477 -48456 -41443 115577 462837 496568 116365 -45091
12063d5091K1026O7229j5496K55787K33647k05606l95979j0795K46785Q168j22871
$$ -45091 -24065 43164 27668 283455 517102 311496 -84483 -95278 151507 159675 36804
12052C6804N6214k82266k32322K1430J83245L16009K05319J05805j11402j49692
$$ 36804 93018 -189248 -421570 -400140 -216895 99114 304433 410238 298836 149144
12042A49144j32353K63019j57995p0280o1713j31543J66100K29616q2647m6164
$$ 149144 16791 279810 121815 51535 -10178 -141721 24379 253995 171348 125184
12032A25184j63027j51046Q0934j3016q3401J34061K06667o8650P0089j51661
$$ 125184 -37843 -188889 -107955 -120971 -204372 -70311 136356 67706 137795 -13866
12022a3866L44649p6801k38291l32998R1508l9562K06813k1014j23319k06724
$$ -13866 330783 253982 15691 -317307 -225799 -265361 -58548 -79562 -202881 -409605
12012d09605j48470q518O7858K02439J79716M7132m4019o8815q2610j7187m6770
$$ -409605 -558075 -566593 -498735 -296296 -116580 -69448 -113467 -182282 -264892 -282079 -328849
12001c28849P3563M94582q8661l0800R7101N9321J32803J11362l27801K7999o7828
$$ -328849 -255286 239296 150635 119835 216936 276257 409060 520422 192621 220620 152792
11990A52792M2653P3809K78639n3071r4943J946l29542j23413m199O2697k06219
$$ 152792 195445 269254 547893 494822 399879 401825 72283 -51130 -55329 7368 -198851
11979a98851J82175L9129j527k37866j52371j21983J24939K55317K03294j21693
$$ -198851 -16676 22453 20926 -216940 -369311 -491294 -366355 -111038 92256 -29437
11969b9437r2152K63523K30739R3297l20150l01326J85769m295j22941j17384
$$ -29437 -121589 141934 372673 465970 145820 -155506 30263 25968 -96973 -214357
11959b14357J48484j57137k89897J1085M22779o0441j95439N2314K5807K87413
$$ -214357 -65873 -223010 -512907 -501822 -79043 -139484 -334923 -282609 -256802 30611
11949C0611M3811R0341J48479K04068j00707l77311k38033j66138L97471K80881
$$ 30611 74422 164763 313242 517310 416603 39292 -198741 -364879 32592 313473
11939C13473j26531J6325J34196l73550l1306K43506m8051j61005j54120l65278
$$ 313473 186942 203267 337463 -36087 -67393 176113 128062 -32943 -187063 -552341
11929e52341o2617j65967p3231J18232N49876J66732J84020l6009R613J37113
$$ -552341 -614958 -780925 -854156 -735924 -186048 -19316 164704 128695 138308 275421
11919B75421k56790k22304K10297K64185J13741k07471k07797l33735L62112K07547
$$ 275421 18631 -203673 6624 270809 384550 177079 -30718 -364453 -2341 205206
11909B05206l4107l0945J0609k18096k22349J45391o0021j06180k4051j47833
$$ 205206 171099 140154 150763 -67333 -289682 -144291 -204312 -310492 -334543 -482376
11899d82376r5633Q6456J51355O2741K84062L23184o099k98767j99412j87606
$$ -482376 -578009 -491553 -340198 -277457 6605 329789 323690 24923 -174489 -362095
11889c62095K52017K27323k3285m09212K18444K32523n20736J04170K22425J00581
$$ -362095 -110078 117245 93960 -315252 -96808 135715 -385021 -280851 -58426 42155
11879D2155l8931k66196J84112J39195P3160j40265r8458j45488J25281K13808
$$ 42155 3224 -262972 -78860 60335 133495 -6770 -105228 -250716 -125435 88373
11869H8373J36383L9376k65140j18467j22671J52751p264J61892l90054j25454
$$ 88373 224756 264132 -1008 -119475 -242146 -89395 -96659 65233 -324821 -450275
11859d50275K15291r454J51734N3503l3161J07080J5286k42960L2550O8672J01496
$$ -450275 -234984 -244438 -92704 -39201 -72362 34718 50004 -192956 -160406 -91734 9762
11848I762P2974j24581o0520L00118L09215k21095k45417r53j62633J1824k2226
$$ 9762 82736 -41845 -102365 197753 506968 285873 40456 39503 -123130 -111306 -133532
11837a33532j92192R3431M8039j34035j50702L19643L41394n2420m76574k17626
$$ -133532 -325724 -232293 -184254 -318289 -468991 -149348 192046 139626 -336948 -554574
11827e54574J93102K53732K97739L61990j04392r2685k5291k30178K51424k09591
$$ -554574 -361472 -107740 189999 551989 447597 354912 329621 99443 350867 141276
11817A41276l24046O0566L39079J39462J44799n8454l5180k11981n22746r6064
$$ 141276 -182770 -122204 216875 356337 501136 442682 407502 195521 -327225 -423289
11807d23289j47451O3433L77446K72606K6901o0902J19776O0535J66990k71062
$$ -423289 -570740 -507307 -129861 142745 169646 108744 228520 289055 456045 184983
11797A84983k90930J66544j95274j44720K23156L15324o5053k32821n523K74417
$$ 184983 -105947 60597 -134677 -279397 -56241 259083 194030 -38791 -44314 230103
11787B30103K23760K01085k3488p1426k60835k90534j52593J28461J01140L20472
$$ 230103 453863 654948 631460 560034 299199 8665 -143928 -15467 85673 406145
11777D06145k08991M2246m36674l62626j35299k21963P9360L61128J91130J66011
$$ 406145 197154 239400 -197274 -559900 -695199 -917162 -837802 -476674 -285544 -119533
11767a19533K40231k14070k26663K65207M02478L47822k13853l52439p7428J11090
$$ -119533 120698 -93372 -320035 -54828 347650 695472 481619 129180 51752 162842
11757A62842k97089j6671K74521J47147m81416k74346j270L19653K42808q1205
$$ 162842 -134247 -150918 123603 270750 -210666 -485012 -486282 -166629 76179 -5026
11747e026r7918O1618l09974r3069J30219R8356J76334J86044k03064l14266k46768
$$ -5026 -102944 -41326 -351300 -444369 -314150 -215794 -39460 146584 -56480 -370746 -617514
11736f17514P5760o042L16893Q9881L3311l3385J68119K23648K60650L2162l08013
$$ -617514 -541754 -547796 -230903 -141022 -107711 -141096 27023 250671 511321 543483 235470
11725B35470m82482j86555J67316O9505J80889O7564k30125J20749Q1959L87737
$$ 235470 -247012 -433567 -266251 -196746 -15857 51707 -178418 -57669 24290 412027
11715D12027O3057K3579k11210k73641k5191p7500J71022l6029j61710J47088
$$ 412027 475084 498663 287453 13812 -11379 -88879 82143 46114 -115596 31492
11705C1492Q2413J34397q4026k02238Q9395Q2558O9734j35035K72062M03726k07921
$$ 31492 113905 248302 164276 -37962 51433 133991 203725 68690 340752 744478 536557
11694E36557l04192j04423l88021j17038K72609o7103p2589J41835L05297L7048
$$ 536557 232365 127942 -260079 -377117 -104508 -171611 -244200 -102365 202932 239980
11684B39980J10112j70768k76689j52235j8419O367j38036k32218J20357R9369
$$ 239980 350092 179324 -97365 -249600 -268019 -261652 -399688 -631906 -511549 -412180
11674d12180K4847J29856M06065n9661j83049j06081Q2485j54661o0756j41015
$$ -412180 -387333 -257477 148588 88927 -94122 -200203 -117718 -272379 -333135 -474150
11664d74150J69224L10829J09270l86775l77188q6163M62170L65068R6001O3000
$$ -474150 -304926 5903 115173 -271602 -648790 -734953 -272783 92285 188286 251286
11654B51286k63043r4804l8328J97883j20200J3979J84303J63168m69396j39756
$$ 251286 -11757 -106561 -144889 52994 -67206 -53227 131076 294244 -175152 -314908
11644c14908Q4327J9130J14461q3178n3961L41141L18700k3832l32080j31972
$$ -314908 -230581 -211451 -96990 -180168 -234129 107012 425712 401880 69800 -62172
11634f2172K0485O215M2432m10381j13455J04509J72909M09751M59563n7681J19213
$$ -62172 -41687 -35472 6960 -403421 -516876 -412367 -239458 170293 629856 572175 691388
11623F91388o0884k67569l26497j63742n6976K17541K24240J53444l38513k56872
$$ 691388 630504 362935 36438 -127304 -184280 33261 257501 410945 72432 -184440
11613a84440o3542L05125J65884L90905K48670l89536l04387R4868K20414J11460
$$ -184440 -247982 57143 223027 613932 862602 473066 168679 263547 483961 595421
11603E95421L7511o78433l27988M66028j40517n4224m63195R585O03969L19240
$$ 595421 632932 -45501 -373489 92539 -47978 -102202 -565397 -555812 48157 367397
11593C67397j26065J5179J55952J0261j00989l4175L0614j42877m17901L652n8159
$$ 367397 241332 256511 412463 422724 321735 287560 318174 175297 -242604 -238952 -297111
11582b97111K27553J08948J39419j53126j12536j72160r9669j76454L35526J08963
$$ -297111 -69558 39390 178809 25683 -86853 -259013 -358682 -535136 -199610 -90647
11572i0647k23645j23043n9297l3397J92012J01507j81493k34952m7621J85986
$$ -90647 -314292 -437335 -496632 -530029 -338017 -236510 -418003 -652955 -700576 -514590
11562e14590J89226r7620K61383K70461q3898j1252l6058O4484j14941j70727
$$ -514590 -325364 -422984 -161601 108860 24962 13710 -22348 42136 -72805 -243532
11552b43532n0028M56814J52680M0553m1091m9177k79824K5777J46014K48196
$$ -243532 -293560 163254 315934 356487 315396 266219 -13605 12172 158186 406382
11542D06382n4311j81404r7948l40j49789N1168J78691L1983J79647k66969l72047
$$ 406382 352071 170667 72719 72379 -77410 -26242 152449 184432 364079 97110 -274937
11531b74937J7233p8822o6621L7534K54342K67402j12484k91084j39082r2504
$$ -274937 -257704 -336526 -403147 -365613 -111271 156131 43647 -247437 -386519 -479023
11521d79023K77216J30299R8282p226k94634j52756M08967J81195L3165j47723
$$ -479023 -201807 -71508 26774 19548 -275086 -427842 -18875 162320 195485 47762
11511D7762j33177n8516R0751M4685n2139J49029J77685J84388j32896k5629J61556
$$ 47762 -85415 -143931 -53180 -8495 -60634 88395 266080 450468 317572 291943 453499
11500D53499j38747k98040j30245J25238l1973k19025k59439n9739K5036L59964
$$ 453499 314752 16712 -113533 11705 -20268 -239293 -498732 -558471 -533435 -173471
11490a73471j4572o5842K05740m6755j00007M2941K18189l89712k22590m7865
$$ -173471 -188043 -253885 -48145 -94900 -194907 -151966 66223 -323489 -546079 -593944
11480e93944j36579m0168L0033P1308K77858L18656j8764L4117M3912R238m77352
$$ -593944 -730523 -770691 -740658 -669350 -391492 -72836 -91600 -57483 -13571 -4333 -481685
11469d81685m13848J69758J53560K85833K20180O1607J7377K33712K6439j97189
$$ -481685 -895533 -725775 -572215 -286382 -66202 -4595 12782 246494 272933 75744
11459G5744J42809j45618K0693K16282J34740j29127m63895k97981k27224M38288
$$ 75744 218553 72935 93628 309910 444650 315523 -148372 -446353 -673577 -235289
11449b35289K59296O5875J33454j9875k94300p8662R3948q7475n41556l24306
$$ -235289 24007 89882 223336 203461 -90839 -169501 -75553 -163028 -704584 -1028890
11439a028890K88825K17431K89249N8183j79656J03010Q2098J12131L6994K22820
$$ -1028890 -740065 -522634 -233385 -175202 -354858 -251848 -169750 -57619 -20625 202195
11429B02195N3816K8773k42662L22121l5168J31065o0082n81589j11605Q3369
$$ 202195 256011 284784 42122 364243 329075 460140 400058 -181531 -293136 -209767
11419b09767L9008J23170J70415J09764j41837j73013j71603r6621J45164J43555
$$ -209767 -170759 -47589 122826 232590 90753 -82260 -253863 -350484 -205320 -61765
11409f1765j17205l30546q7921l2855M01684K74076p252m672M38162M45792L10690
$$ -61765 -178970 -509516 -597437 -630292 -228608 45468 38216 33544 471706 917498 1228188
11398A228188k66591o39019l93120R8288j39821P5242J3130o5558L85739n4783
$$ 1228188 961597 322578 -70542 27746 -112075 -36833 -23703 -89261 296478 241695
11388B41695j1957l4481j02738J44904j92377Q6842J67797k39831k77881J97880
$$ 241695 229738 195257 92519 237423 45046 131888 299685 59854 -218027 -20147
11378b0147J46590M6379l6182j01705j55990j79703k23163K01376N63467O1350
$$ -20147 126443 172822 136640 34935 -121055 -300758 -523921 -322545 240922 302272
11368C02272j42972j3588k84981j60268M2046M33323j74843k71268j2704L5346
$$ 302272 159300 145712 -139269 -299537 -257491 175832 989 -270279 -282983 -247637
11358b47637M644J96177K8287j06789j93905L969J92405K56921K13332j36039
$$ -247637 -242993 -46816 -18529 -125318 -319223 -315254 -122849 134072 347404 211365
11348B11365r092k24871l6194J29147q7521j00248j3254k07071O7348M60935L41468
$$ 211365 202273 -22598 -58792 70355 -17166 -117414 -130668 -337739 -270391 190544 532012
11337E32012j72602q7957L294k8838k5194Q540k28292J75747L39038j48352j07447
$$ 532012 359410 271453 274747 245909 220715 229255 963 176710 515748 367396 259949
11326B59949K31875l39407k40036l72141K8341K03907L51603L86055k70763m18388
$$ 259949 491824 152417 -87619 -459760 -431419 -227512 124091 510146 239383 -179005
11316a79005j76588L25533M58488k38216j80433K14211m05396k51694K76598P0241
$$ -179005 -355593 -30060 428428 190212 9779 223990 -181406 -433100 -156502 -86261
11306h6261r5698j58066Q4094M9190K57163j66880M931P0233J14112K09049Q5545
$$ -86261 -181959 -340025 -255931 -206741 50422 -116458 -111527 -41294 72818 281867 367412
11295C67412j257P2891J61164l8322k48932j79414j80798o9610j24368L892O4338
$$ 367412 366155 439046 600210 561888 312956 133542 -47256 -116866 -241234 -237342 -173004
11284a73004k80761J5418K15079L18599R4920m36018k29772Q4872Q4596K08849
$$ -173004 -453765 -438347 -223268 95331 190251 -245767 -475539 -390667 -306071 -97222
11274i7222J99387K06628o329o8774j14217J75789R4096k8596j10182O5495o6164
$$ -97222 102165 308793 302464 233690 119473 295262 389358 360762 250580 316075 249911
11263B49911m6659P033J56206K45397O0353j92403k37763n4517M0506j58814j62352
$$ 249911 203252 210285 366491 611888 672241 479838 242075 187558 228064 69250 -93102
11252i3102L7256O6114l6125j69610J582M7097P2721J49451J95654m0739l7583
$$ -93102 -55846 10268 -25857 -195467 -193885 -146788 -74067 75384 271038 230299 192716
11241A92716N0378k95134m61328k10148r7777M21108J9644j75364J91139J98036
$$ 192716 243094 -52040 -513368 -723516 -821293 -400185 -380541 -555905 -364766 -166730
11231a66730J75889J12986J03567j13180j0549K20876r4359N7922M31400j53972
$$ -166730 9159 122145 225712 112532 101983 322859 228500 286422 717822 563850
11221E63850j8212p8818j77345p9855k0349K9828j15680J5431O5200r3461m4881
$$ 563850 545638 466820 289475 209620 189271 219099 103419 118850 184050 90589 45708
11210D5708J1916j24451J03317J75022k6824l03489p5603M43904J35853J51711
$$ 45708 57624 -66827 36490 211512 184688 -118801 -194404 249500 385353 537064
11200E37064j24378K3380R8675m950j38175j11385j05091K01425k8033l9593m8252
$$ 537064 412686 436066 534741 529791 391616 280231 175140 376565 348532 308939 260687
11189B60687J6230m648k56145l9339J40495j58629j73869N9956P6343K4886Q4551
$$ 260687 276917 272269 16124 -23215 117280 -41349 -215218 -155262 -78919 -54033 30518
11178C0518J50548L0419j62583k49782j16485j6093L33509n7531K15908k323J38146
$$ 30518 181066 211485 48902 -200880 -317365 -333458 51 -57480 158428 156105 294251
11167B94251M75907l9530p6541k18167n1005l4431k59329m19040k877L5561L19059
$$ 294251 770158 730628 654087 435920 384915 350484 91155 -327885 -330762 -295201 23858
11156B3858P2472k19846j14953J88399L49729m500m1500J89552m9110j14986N1517
$$ 23858 96330 -123516 -238469 -50070 299659 295159 253659 443211 394101 279115 330632
11145C30632k98365l21072l6940M34709L07856j56639K22192K20338l66449n3111
$$ 330632 32267 -288805 -325745 108964 416820 260181 482373 702711 336262 283151
11135B83151l0762j89255j30197J88884k1144j89307j45414K84659k528l56770
$$ 283151 252389 63134 -67063 121821 100677 -88630 -234044 50615 48087 -308683
11125c08683k32177J09129L10077L19046l4287k51775r8004J23059J89426p65
$$ -308683 -540860 -431731 -121654 197392 163105 -88670 -186674 -63615 125811 125046
11115A25046p2392j71835M5849K89731j33530k10526K36654K20734j19404k66988
$$ 125046 52654 -119181 -73332 216399 82869 -127657 108997 329731 210327 -56661
11105e6661o34536M9470L36353M65926J72862l1018J64211Q5261L3459j10536
$$ -56661 -691197 -641727 -305374 160552 333414 302396 466607 551868 585327 474791
11095D74791j2920j98277j48859P9141P840j09724N9328M08566J96537k41437
$$ 474791 461871 263594 114735 193876 201716 91992 151320 559886 756423 514986
11085E14986j14014l25769l2692K61455J95556j57920l7925j49976P7955L09390
$$ 514986 400972 75203 42511 303966 499522 341602 303677 153701 231656 541046
11075E41046J34766L3869k18085j74296q7303j01265K5902M7047J29352J59459
$$ 541046 675812 709681 491596 317300 229997 128732 154634 201681 331033 490492
11065D90492m5409k87165j71361l51954J70965L57052K07810j03955k12824k62692
$$ 490492 445083 157918 -13443 -365397 -194432 162620 370430 266475 53651 -209041
11055b09041M9455M66251N45896r39k41081K78794M415K47785J94022k25546l55033
$$ -209041 -159586 306665 852561 851622 610541 889335 893750 1141535 1335557 1110011 754978
11044G54978q2468L57734M12322j33827k95050R6368j63288Q3928O85536J63239
$$ 754978 672510 1030244 1442566 1308739 1013689 1110057 946769 1030697 1716233 1879472
11034A879472k69327J7013J49270K32488M0299j86813l13840j58637j37847J09649
$$ 1879472 1610145 1627158 1776428 2008916 2049215 1862402 1548562 1389925 1252078 1361727
11024A361727N34518L90695J83947K49244N74433J03151l69420n15443l42280
$$ 1361727 1896245 2286940 2470887 2720131 3294564 3397715 3028295 2512852 2170572
11015B170572k39754j88555j81212J96408K25431K84695J2543k39805L4371j32018
$$ 2170572 1930818 1742263 1561051 1757459 1982890 2267585 2280128 2040323 2074694 1942676
11005A942676m06105J7566m89733K6011p2189M9419j64669J24262K50669L34967
$$ 1942676 1536571 1554137 1064404 1090415 1018226 1067645 902976 1027238 1277907 1612874
10995A612874k88576n88485o39266k44983J79879J50231N7863J19760j4726m651
$$ 1612874 1324298 735813 96547 -148436 31443 181674 239537 359297 344571 339920
10985C39920K56840j01832j38276K80558l7420k70467j0674O1269j46902l2874
$$ 339920 596760 494928 356652 637210 599790 329323 318649 379918 233016 200142
10975B00142K83792j3821j11758j30416J3442O1446J67775L4203l5527J31044
$$ 200142 483934 470113 358355 227939 241381 302827 470602 504805 469278 600322
10965F00322r0579j911J18190m4899m00607m50879K00264M00019N2899J91458
$$ 600322 509743 507832 626022 581123 180516 -270363 -70099 329920 382819 574277
10955E74277r6915l65965J49215L79898j2305l11854l32443Q7092L29663R9059
$$ 574277 477362 111397 260612 640510 628205 316351 -16092 71000 400663 499722
10945D99722l03122j73276n8084L64143J60857l6862p6940p6132j28860j94699
$$ 499722 196600 23324 -34760 329383 490240 453378 376438 300306 171446 -23253
10935b3253l4777L29568L23713p7683m16171k05038P5284K0292k20410j48342
$$ -23253 -58030 271538 595251 517568 101397 -103641 -28357 -8065 -228475 -376817
10925c76817L17429L15049n2527J2819k3035j4330L59307Q8833Q9722P0178j60841
$$ -376817 -59388 255661 203134 215953 192918 178588 537895 626728 716450 786628 625787
10914F25787O7609M6403Q0367l06928l33797K09336K11753J41588j54804J62158
$$ 625787 693396 739799 820166 513238 179441 388777 600530 742118 587314 749472
10904G49472J8436q3643k14090n50505k54054O1851L80784N07797l0880k8013
$$ 749472 767908 684265 470175 -80330 -334384 -272533 108251 616048 585168 557155
10894E57155k79018n1171q4756m5998j97975K781r0864R0512K36018J13458k85884
$$ 557155 278137 226966 142210 96212 -101763 -98982 -189846 -99334 136684 250142 -35742
10883c5742k46279L45065K77011K35460j97251j55374j56639n0073p9294L22800
$$ -35742 -282021 63044 340055 575515 378264 222890 66251 16178 -63116 259684
10873B59684J49446K04322J21961m9118n5832m40653m78387K6797L04055L27125
$$ 259684 409130 613452 735413 686295 630463 189810 -288577 -261780 42275 369400
10863C69400Q4926K38733o5291o3287l03165l741j52332j18330L5581L93871o568
$$ 369400 454326 693059 627768 564481 261316 257575 105243 -13087 22494 416365 409797
10852D09797k18587o4936L402l0249L45007M54303J01542Q986k9419n06189l10676
$$ 409797 191210 126274 129676 99427 444434 898737 1000279 1009265 979846 473657 162981
10841A62981J05559m5256n7385L38850J75058K1966J8907P0961N497N1391k14312
$$ 162981 268540 223284 165899 504749 679807 701773 720680 791641 797138 848529 634217
10830F34217k81691k02345J53682M72990K08157j22174m46019k33467p5038K14561
$$ 634217 352526 150181 303863 776853 985010 862836 416817 183350 108312 322873
10820C22873J59384R4083J90992L0678j6742J54690k93392j07815M9437j53078
$$ 322873 482257 576340 767332 798010 781268 935958 642566 534751 584188 431110
10810D31110j11046k84331j5175M83092n3886j22850l3261P7069K18405O219L6411
$$ 431110 320064 35733 20558 503650 449764 326914 293653 370722 589127 595346 631757
10799F31757m9819Q603p8821R431M14105j66312k63379k32662K00167N9348K19186
$$ 631757 581938 590541 511720 521151 935256 768944 505565 272903 473070 532418 751604
10788G51604k26806m41872n182K74588P9420K77008j1124k75289J4811J88782
$$ 751604 524798 82926 77744 352332 431752 708760 697636 422347 437158 625940
10778F25940J45077J66259j48851q8324L04187n3989m48002k28262J89763L00679
$$ 625940 771017 937276 788425 700101 1004288 950299 502297 274035 463798 764477
10768G64477J8744L32994Q2273k4229l58298l57066j49985L31987J55790P1997
$$ 764477 783221 1116215 1198488 1174259 815961 458895 308910 640897 796687 868684
10758H68684J68065j21978k64251j12596m6215L50582L22305m97k6308q5763q6994
$$ 868684 1036749 914771 650520 537924 491709 842291 1164596 1164099 1137791 1052028 965034
10747I65034J92034k39577j81944k27126o4638j74291J31144L32507l11643k42393
$$ 965034 1157068 917491 735547 508421 443783 269492 400636 733143 421500 179107
10737A79107K45080K02430J43042J26827o5263l11415k58342J30988Q5616J41516
$$ 179107 424187 626617 769659 896486 831223 519808 261466 392454 478070 619586
10727F19586L28381o0439k85425j17266L51719J88079J48945q3805r8851J01728
$$ 619586 947967 887528 602103 484837 836556 1024635 1173580 1089775 990924 1092652
10717A092652L19303j76640Q0206m6673j04980N6196o6513l12882J31487K18204
$$ 1092652 1411955 1235315 1315521 1268848 1163868 1220064 1153551 840669 972156 1190360
10707A190360k20451L66M18751k18734j97366j48569J69760L04684j83184j45178
$$ 1190360 969909 970275 1389026 1170292 972926 824357 994117 1298801 1115617 970439
10697I70439q8091L17665J98767j037o301l20289k01371O7021J49147k14793N5936
$$ 970439 882348 1200013 1398780 1397743 1391442 1071153 869782 936803 1085950 871157 927093
10686I27093r1604J38741K1068J23425M12103J49738J52021O1687J12918m7221
$$ 927093 835489 974230 995298 1118723 1530826 1680564 1832585 1894272 2007190 1959969
10676A959969m8950R0374p5576l4898j77538q4073K60853P0710n5664k4538J08539
$$ 1959969 1911019 2001393 1925817 1890919 1713381 1629308 1890161 1960871 1905207 1880669 1989208
10665A989208K73353Q7199K11526J82782k25503q628K29385N9411o4691N10428
$$ 1989208 2262561 2349760 2561286 2744068 2518565 2509937 2739322 2798733 2734042 3244470
10655C244470K58975k23988m40508p0428J08538J52121j63195P2086P03217K93993
$$ 3244470 3503445 3279457 2838949 2768521 2877059 3029180 2865985 2938071 3641288 3935281
10645C935281j37288K82811L06659K93131K27777K91451K11723M18556M52728
$$ 3935281 3797993 4080804 4387463 4680594 4908371 5199822 5411545 5830101 6282829
10636F282829O47905N47124L79005P70497P56568Q97603J054838J071215J665408
$$ 6282829 6930734 7477858 7856863 8627360 9383928 10281531 11336369 12407584 14072992
10627A4072992J821987J963079J778434J690008K799814L919188N867634P899436
$$ 14072992 15894979 17858058 19636492 21326500 24126314 28045502 33913136 41812572
10619D1812572J0232590J4189682J9094268K3122605K4146870J8988656P828188
$$ 41812572 52045162 66234844 85329112 108451717 132598587 151587243 159415431
10612A59415431l375439q811759p911738l030888M118016J3155205K4356682L6050758
$$ 159415431 156039992 147228233 139316495 136285607 140403623 153558828 177915510 213966268
10604B13966268M6389859M9248869L3751759K887352k4096037l3793382k9002256
$$ 213966268 260356127 309604996 343356755 346244107 322148070 288354688 259352432
10597B59352432j6703575j435407J4535561L1320491M8451410O1497294O0161754
$$ 259352432 242648857 241213450 255749011 287069502 335520912 397018206 457179960
10590D57179960L1845646j6193402n3626768o4034072n4328750l7268823k0206053
$$ 457179960 489025606 472832204 419205436 355171364 300842614 263573791 243367738
10583B43367738l674865J1628037K4100636L1962471K9059624Q779599k2908653
$$ 243367738 239692873 251320910 275421546 307384017 336443641 345223240 322314587
10576C22314587m5382613m9700207m1180698k8440124j6720497p397627O52052
$$ 322314587 276931974 227231767 186051069 157610945 140890448 133492821 134144873
10569A34144873N806317Q683890O058632l128361j5097785k3111713k4079942
$$ 134144873 139951190 148635080 154693712 151565351 136467566 113355853 89275911
10562H9275911k0548489j5803726j1771995q104961n594146m142374l088136l014275
$$ 89275911 68727422 52923696 41151701 33046740 27452594 23310220 20222084 17207809
10554A7207809k671077k377010k262831j529866q60429j060227r68554r75797
$$ 17207809 14536732 12159722 9896891 8367025 7506596 6446369 5477815 4502018
10546D502018p65594m71271l35388j04036l48070k95070k23444J0866l21290l11451
$$ 4502018 3736424 3265153 2929765 2825729 2477659 2182589 1959145 1970011 1648721 1337270
10536A337270J86675j88541l90774l88236m4470k16983m53190M5307K32309J15132
$$ 1337270 1523945 1335404 944630 556394 511924 294941 -158249 -112942 119367 234499
10526B34499J79936J0076J60016K5610K00248n7587k01081k0554j85540j21350
$$ 234499 414435 424511 584527 610137 810385 752798 551717 531163 345623 224273
10516B24273j61423K03087K70116k46534j46118j54993j3188r8495p9924K7421
$$ 224273 62850 265937 536053 289519 143401 -11592 -24780 -123275 -203199 -175778
10506a75778j47734K21977p0591n7697L54366j09967j12546J20650M9091o3663
$$ -175778 -323512 -101535 -172126 -229823 124543 14576 -97970 22680 71771 8108
10496H108m10228m77863P3197L50130P4579L95834K6656N2664j40314J29299J22672
$$ 8108 -402120 -879983 -806786 -456656 -382077 13757 40413 93077 -47237 82062 204734
10485B04734n6211J8095o2966L6961j54771J7253K19372J86804j43007n2315J3215
$$ 204734 148523 166618 103652 140613 -14158 3095 222467 409271 266264 213949 227164
10474B27164Q5841N8394j29975n1761p4042j13708Q1390J42317M1465j22802J07803
$$ 227164 313005 371399 241424 189663 115621 1913 83303 225620 267085 144283 252086
10463B52086k25777k21636m1352k4259l4292R1057J59086q4696N2785j19693n0307
$$ 252086 26309 -195327 -236679 -260938 -295230 -204173 -45087 -129783 -76998 -196691 -246998
10452b46998l61063m9532M2377k41440l18123R4805O3109L53488L9826j80826
$$ -246998 -608061 -657593 -615216 -856656 -1174779 -1079974 -1016865 -663377 -623551 -804377
10442h04377K00959j8012K25698p6292r092J85934J37971k02803l45207o30926
$$ -804377 -603418 -621430 -395732 -472024 -481116 -295182 -157211 -360014 -705221 -1336147
10432a336147L1536N47436K62992L1206k2148j26811R369K2648k60143j48272
$$ -1336147 -1304611 -757175 -494183 -462977 -485125 -611936 -602567 -579919 -840062 -988334
10422i88334J33470Q0838K24073K75231L57565K7443r9253k84730l25912k27012
$$ -988334 -854864 -774026 -549953 -274722 82843 110286 11033 -273697 -599609 -826621
10412h26621l01597L01455N53898j09403j40678r4879q4383K90961K48132j24190
$$ -826621 -1128218 -826763 -272865 -382268 -522946 -617825 -702208 -411247 -163115 -287305
10402b87305l6326l7324M6473P9386k73071j38728n556j17178m277K24600O7750
$$ -287305 -323631 -360955 -314482 -235096 -508167 -646895 -652451 -769629 -773906 -549306 -481556
10391d81556R9973M83016O3908k91993k72356K03749K87700J54939O2222l3415
$$ -481556 -381583 101433 165341 -126652 -399008 -195259 92441 247380 309602 276187
10381B76187j33473j84481m1081r478O53524J66741J6104R5174m43028j92127
$$ 276187 142714 -41767 -82848 -92326 561198 727939 744043 839217 396189 204062
10371B04062l71660k38917M8627k80807j94243N1602N12329K77892j28199O7191
$$ 204062 -167598 -406515 -357888 -638695 -832938 -781336 -269007 8885 -119314 -52123
10361e2123K025k71268j46941j72664K63361J69977j45104o2040J9067k5156N7804
$$ -52123 -50098 -321366 -468307 -640971 -377610 -207633 -352737 -414777 -395710 -420866 -363062
10350c63062r1179M89235K19318j58685k85375o34k00457l46895n188m575J83120
$$ -363062 -454241 34994 254312 95627 -189748 -190382 -390839 -737734 -742922 -747497 -564377
10339e64377N20354R8439K96541J45497j79498k80124k26115L9732N2126K49773
$$ -564377 -44023 54416 350957 496454 316956 36832 -189283 -149551 -97425 152348
10329A52348p9843j02757p2370l80751j2766K17104j62340R8765L79196r3652
$$ 152348 72505 -30252 -102622 -483373 -496139 -279035 -441375 -342610 36586 -57066
10319e7066J03474K20100k40406l26904l87219J16493L09486J63956j05576Q7724
$$ -57066 46408 266508 26102 -300802 -688021 -571528 -262042 -98086 -203662 -115938
10309a15938o7841L3351j49805J19490k98153j83706L23193L88291n9311O663
$$ -115938 -183779 -150428 -300233 -180743 -478896 -662602 -339409 48882 -10429 -3766
10299c766m73240k45148Q0048J63042J9867J80281J83787m84756k56928N42739
$$ -3766 -477006 -722154 -642106 -479064 -459197 -278916 -95129 -579885 -836813 -294074
10289b94074M79275M08812q7312j52853l7511k05405m6700J05815K6366O8124
$$ -294074 185201 594013 506701 353848 316337 110932 64232 170047 196413 264537
10279B64537L9501j70774k62773k26102J0108k4653J56607J23568K27364j11527
$$ 264537 304038 133264 -129509 -355611 -345503 -370156 -213549 -89981 137383 25856
10269B5856K5197j92192N6744R5386j45550k25402K89671K20162j19291j01755
$$ 25856 51053 -141139 -84395 10991 -134559 -359961 -70290 149872 30581 -71174
10259g1174j13181n6599l6113n8967J02598K06505J06153j6592k46199L3549P226
$$ -71174 -184355 -240954 -277067 -336034 -233436 -26931 79222 62630 -183569 -150020 -142794
10248a42794k7857l29334m14696J55791K6415L98668l8199k51401K74290K48044
$$ -142794 -170651 -499985 -914681 -758890 -732475 -333807 -372006 -623407 -349117 -101073
10238a01073j61924j40414L39517J76473K78372o4648p3537j68204m83771k93937
$$ -101073 -262997 -403411 -63894 112579 390951 326303 252766 84562 -399209 -693146
10228f93146M04971l8796n6942j07676J7771P449K20635J81317k09008k6646L95916
$$ -693146 -288175 -326971 -383913 -491589 -473818 -466369 -245734 -64417 -273425 -300071 95845
10217I5845k45367k68514Q7715J54942O9242j77773M331J49943K50852o3515l42474
$$ 95845 -149522 -418036 -330321 -175379 -106137 -283910 -279579 -129636 121216 57701 -284773
10206b84773J0476j90157k8848O8156L10216K97817J18832j23457n42012m21482
$$ -284773 -274297 -464454 -493302 -425146 -114930 182887 301719 178262 -363750 -785232
10196g85232J58351K62647l15847K5043K14901J25650J79508j50941p0292K55871
$$ -785232 -626881 -364234 -680081 -655038 -440137 -314487 -134979 -285920 -356212 -100341
10186a00341J81678N4703J26683L3448j6231N4299J38596l3366J56852o589j58124
$$ -100341 81337 136040 262723 296171 279940 334239 472835 439469 596321 589732 431608
10175D31608L16524k67812k62500r8344P26233L18628j38565j3997J06618J91433
$$ 431608 748132 480320 217820 119476 845709 1164337 1025772 1011775 1118393 1309826
10165A309826M33059j50441m69532k62609k10528J49268J76387L39711K77584
$$ 1309826 1742885 1592444 1122912 860303 649775 799043 975430 1315141 1592725
10156A592725K20734J49179k8933J77078n5039l59510l16626k15941J07809R1323
$$ 1592725 1813459 1962638 1933705 2110783 2055744 1696234 1379608 1163667 1271476 1362799
10146A362799J66463j68584k17831J92057L27518l20557l21993P9738l73021r7731
$$ 1362799 1529262 1360678 1142847 1334904 1662422 1341865 1019872 1099610 726589 628858
10136F28858j10338k92918j39382J10070J29024K56372P5992N240l55340k15030
$$ 628858 518520 225602 86220 196290 325314 581686 657678 662918 307578 92548
10126I2548l37048k60372N2497K70008J21566J16832K68636J20274m44436m52796
$$ 92548 -244500 -504872 -452375 -182367 -60801 56031 324667 444941 505 -452291
10116d52291k00374J14409K85726L5480k3551j33032K38289J27886J86273L7711
$$ -452291 -652665 -538256 -252530 -217050 -240601 -373633 -135344 -7458 178815 216526
10106B16526Q4546L9105j11355L4250k08378l55593N3532n9186m9657J32035K00577
$$ 216526 301072 340177 228822 263072 54694 -300899 -247367 -306553 -356210 -224175 -23598
10095b3598J68792l94186m12581o7105J38091j94883l1694K46043K83048L11516
$$ -23598 145194 -248992 -661573 -728678 -590587 -785470 -817164 -571121 -288073 23443
10085B3443O3807j4200k64733m06810J26671J81730j67813j90739M2483K08528
$$ 23443 87250 73050 -191683 -598493 -471822 -290092 -457905 -648644 -606161 -397633
10075c97633O5472j70621p2033n0630K71440j11011l7523o5694K42664L5061l23474
$$ -397633 -332161 -502782 -574815 -625445 -354005 -465016 -502539 -568233 -325569 -290508 -613982
10064f13982l6922K43646R4694J86313l43811k34730L58106j33041Q1484Q9760
$$ -613982 -650904 -407258 -312564 -126251 -470062 -704792 -346686 -479727 -398243 -308483
10054c08483N8437J56800Q7900k8975j75875j86505l12917J71170K21519J40411
$$ -308483 -250046 -93246 -5346 -34321 -210196 -396701 -709618 -538448 -316929 -176518
10044a76518J95788J85412k04153l20174j81459j47736L68185L68751j43322l70396
$$ -176518 19270 204682 529 -319645 -501104 -648840 -280655 88096 -55226 -425622
10034d25622J46275p158k31567k02434j7885l09193j31231L91699L18875K27747
$$ -425622 -279347 -286505 -518072 -720506 -738391 -1047584 -1178815 -787116 -468241 -240494
10024b40494J09594M4883l36236k88835K48873J59189p5788O7763K63816J51946
$$ -240494 -130900 -86017 -422253 -711088 -462215 -303026 -378814 -311051 -47235 104711
10014A04711j54293j63614r0976l22894j06787J46810j10150j13009P8165J11701
$$ 104711 -49582 -213196 -304172 -627066 -733853 -587043 -697193 -810202 -732037 -620336
10004f20336p2990p0986M02216J47809k57545r5460J93791j22017L66302J62135
$$ -620336 -693326 -764312 -362096 -214287 -471832 -567292 -373501 -495518 -129216 32919
9994C2919J06549m15198l00729k2574K17985Q548l07819J35474L07514n8220j21211
$$ 32919 139468 -275730 -576459 -599033 -381048 -372500 -680319 -544845 -237331 -295551 -416762
9983d16762l93788l0386K26124p4129K24572p7113k47984J71633L78057O0547
$$ -416762 -810550 -840936 -614812 -688941 -464369 -541482 -789466 -617833 -239776 -179229
9973a79229k30433m24456j48994J67082J21875K87948M7910k94137j44880L35195
$$ -179229 -409662 -834118 -983112 -816030 -694155 -406207 -358297 -652434 -797314 -462119
9963d62119L39029Q8146j35342k70564k02671N4566M7688p3228j49166M26025
$$ -462119 -123090 -34944 -170286 -440850 -643521 -588955 -541267 -614495 -763661 -337636
9953c37636L68260j8034k2078J827j55936J43673j11692o2369o0105k9405l5031
$$ -337636 30624 12590 -9488 -7661 -163597 -19924 -131616 -193985 -254090 -283495 -318526
9942c18526K54894q7395J64493J40311k47367j66761K10253J76977j41912J06599
$$ -318526 -63632 -151027 13466 153777 -93590 -260351 -50098 126879 -15033 91566
9932I1566K45416j51920k10520M597k61104k81037L5821K67779M2641L06714K57850
$$ 91566 336982 185062 -25458 -20861 -281965 -563002 -527181 -259402 -216761 89953 347803
9921C47803q9578j32844l96890m6054J76775Q2040k06259Q2642K01877J26930
$$ 347803 258225 125381 -271509 -317563 -140788 -58748 -265007 -182365 19512 146442
9911A46442R3428L5407K41992K31372j28113k17409K3577j25803l48857m12615
$$ 146442 239870 275277 517269 748641 620528 403119 426696 300893 -47964 -460579
9901d60579l32491n6740Q0984J09534K75248Q5266j20408k85668l24588k2946
$$ -460579 -793070 -849810 -768826 -659292 -384044 -298778 -419186 -704854 -1029442 -1052388
9891a052388m680q818O3918R6149M585J58548K39606M35813J48943j69631j35937
$$ -1052388 -1057068 -1065886 -1001968 -905819 -901234 -742686 -503080 -67267 81676 -87955 -223892
9880b23892J32072j14470k07792j09170K15470J95381K01199K74173k24381l09670
$$ -223892 -91820 -206290 -414082 -523252 -307782 -112401 88798 362971 138590 -171080
9870a71080J4772k10250j91246j27812K6790K76412L33331J53024O65j92158J33724
$$ -171080 -156308 -366558 -557804 -685616 -658826 -382414 -49083 103941 104606 -87552 46172
9859D6172j17403k40640N3427J98742J36877k12208p5259R3997m1019k8529P2900
$$ 46172 -71231 -311871 -258444 -59702 77175 -135033 -210292 -116295 -157314 -185843 -112943
9848a12943j60778k41001n6838O4771k15666K97933K37448J20432J32464j79078
$$ -112943 -273721 -514722 -571560 -506789 -722455 -424522 -187074 -66642 65822 -113256
9838a13256j74967l43994L2235N4781m855J0474n3364j21267j61460J02815K61852
$$ -113256 -288223 -632217 -599982 -545201 -550056 -539582 -592946 -714213 -875673 -772858 -511006
9827e11006K38763l04436K9175Q8325J2861L96671R6521P5309j19807k99792O4070
$$ -511006 -272243 -576679 -547504 -459179 -446318 -49647 46874 122183 2376 -297416 -233346
9816b33346j64836j07856j30286L57621N0529j74804j28719k17262J1731K34288
$$ -233346 -398182 -506038 -636324 -278703 -228174 -402978 -531697 -748959 -737228 -502940
9806e02940J90037J08840L3476K33910L96879k16086k74141l9861j96155l19660
$$ -502940 -312903 -204063 -170587 63323 460202 244116 -30025 -69886 -266041 -585701
9796e85701J22390M42612K44625k2289k45187m15957k13436N5142K60211r6796
$$ -585701 -463311 -20699 223926 201637 -43550 -459507 -672943 -617801 -357590 -454386
9786d54386k64434J43716J86629l75701J07705J07004N9318J79492J95141Q2522
$$ -454386 -718820 -575104 -388475 -764176 -656471 -549467 -490149 -310657 -115516 -32994
9776c2994l4970k30678j69950L85843M432o6555k29158J56766K81134k70233J80625
$$ -32994 -67964 -298642 -468592 -82749 -78317 -144872 -374030 -217264 63870 -206363 -25738
9765b5738K42257j98078m0747l13755r12p7167k183P8349N8401j01105j77478
$$ -25738 216519 18441 -22306 -336061 -336973 -414140 -416323 -337974 -279573 -380678 -558156
9754e58156J79422P8255O3637j28663J19960J16187K3502J05604j47917J9684
$$ -558156 -378734 -300479 -236842 -365505 -245545 -129358 -105856 -252 -148169 -128485
9744a28485K41m8078L93704K14995q46080k38064r2649r6919L47007L65055k52008
$$ -128485 -128244 -176322 217382 432377 -413703 -651767 -744416 -841335 -494328 -129273 -381281
9733c81281k87397j16181J26663K35911R9950J01467J38629R9334j36242j17282
$$ -381281 -668678 -784859 -658196 -422285 -322335 -220868 -82239 17095 -119147 -236429
9723b36429k15083k84378N8770n0770O2098N86865K82087J05960j36422p8775
$$ -236429 -451512 -735890 -677120 -727890 -665792 -78927 203160 309120 172698 93923
9713I3923j16113k24737j28262R5447k9387j24784k73543j50214K92658L76244
$$ 93923 -22190 -246927 -375189 -279742 -309129 -433913 -707456 -857670 -565012 -188768
9703a88768J86292J77668P7521m30484q4304k33785l47833p4505L04777K29951
$$ -188768 -2476 175192 252713 -177771 -262075 -495860 -843693 -918198 -613421 -383470
9693c83470l33590Q2638K71067j20933O9197K16811M4302j74913J88444J02726
$$ -383470 -717060 -634422 -363355 -484288 -415091 -198280 -153978 -328891 -140447 -37721
9683c7721R5709O5317k85343k44066m3910O8913k5184P5009J86321K2971L03301
$$ -37721 57988 123305 -162038 -406104 -450014 -381101 -406285 -331276 -144955 -121984 181317
9672A81317J22484J84614k96263p6290P4509N7716k5681j6101R0728m1974l3298
$$ 181317 303801 488415 192152 115862 190371 248087 222406 206305 297033 255059 221761
9661B21761n27432M9623J54770L45254J30780m9062K50541P6470Q6059K86127
$$ 221761 -305671 -256048 -101278 243976 374756 325694 576235 652705 738764 1024891
9651A024891Q99228J591502K547936K868751K53490k405412k627616j617990j159305
$$ 1024891 1924119 3515621 6063557 8932308 9185798 6780386 4152770 2534780 1375475
9642A375475q44657k62872m010J18520J0003j54274k94696j24801l0124J21867
$$ 1375475 530818 267946 263936 382456 392459 238185 -56511 -181312 -211436 -89569
9632h9569K94193k6269l63757o4327j88197Q1273L64990R1659r2663P7148R7894
$$ -89569 204624 178355 -185402 -249729 -437926 -356653 8337 99996 7333 84481 182375
9621A82375Q1623j17297k20678j24693k77090m06237J51497M7466K95382j474
$$ 182375 263998 146701 -73977 -198670 -475760 -881997 -730500 -683034 -387652 -389126
9611c89126k41409L2299K36934L02964l87330n21643J79856L92867L97322K30179
$$ -389126 -630535 -598236 -361302 -58338 -445668 -967311 -787455 -394588 2734 232913
9601B32913K93041R6656q7861k23362j82108J4012J48333P2462j75116j31423
$$ 232913 525954 622610 534749 311387 129279 143291 291624 364086 188970 57547
9591E7547k21423l8781L62316m6748O5354R689j02376l21914M04488K49294n9590
$$ 57547 -163876 -202657 159659 112911 178265 187954 85578 -236336 168152 417446 357856
9580C57856K707J68881j10678O1718l19976m76529j19984P8193L12535N2825O0399
$$ 357856 360563 529444 418766 480484 160508 -316021 -436005 -357812 -45277 7548 67947
9569F7947k20008k12930j44921m8131n9730R5966J48999j19372K14717J71494
$$ 67947 -152061 -364991 -509912 -558043 -617773 -521807 -372808 -492180 -277463 -105969
9559a05969J78142J35209j26694l16979N551K12523j24634q8310M5342Q0253M4809
$$ -105969 72173 207382 80688 -236291 -230740 -18217 -142851 -231161 -185819 -105566 -60757
9548f0757j8945k51082l92524j33263K10263p4673k2144J63146J14634k1691j190
$$ -60757 -79702 -330784 -723308 -856571 -646308 -720981 -743125 -579979 -465345 -487036 -488226
9537d88226n3739J96218L96554j00976k65219p1309k01042J26494K3604o9356
$$ -488226 -541965 -345747 50807 -50169 -315388 -386697 -587739 -461245 -437641 -506997
9527e06997k89134Q485L0623K58673M4851j45639o2780K85883M17270q2427O012
$$ -506997 -796131 -787646 -757023 -498350 -453499 -599138 -661918 -376035 41235 -41192 -35180
9516c5180r2472l193J00346J02514k10969k89182l99473R7932L06910M66992K9342
$$ -35180 -127652 -130845 -30499 72015 -138954 -428136 -827609 -729677 -422767 44225 73567
9505G3567k84668k5170q6951N1691j78915K12733K32390k61423k25168L32390
$$ 73567 -211101 -236271 -323222 -271531 -450446 -237713 -5323 -266746 -491914 -159524
9495a59524K1913l7763J08082N4183k52587o1574m06308r4057J98290K30083K25433
$$ -159524 -137611 -175374 -67292 -13109 -265696 -327270 -733578 -827635 -629345 -399262 -173829
9484a73829p2743L3377m036j28160J62263k0528l5001q5002l96792L1105N59493
$$ -173829 -246572 -213195 -217231 -345391 -183128 -203656 -238657 -323659 -720451 -689346 -129853
9473a29853K15621o3801l36163j76110L29323M28483j18315l83666k3401p1131
$$ -129853 85768 21967 -314196 -490306 -160983 267500 149185 -234481 -257882 -329013
9463c29013L50978l4043l38904j12951j4317J48425j18829k16473j16331Q8853
$$ -329013 21965 -12078 -350982 -463933 -478250 -329825 -448654 -665127 -781458 -692605
9453f92605M27944K35499j0057k37201J98789K07476O5607r0605j36393k3370
$$ -692605 -264661 -29162 -39219 -276420 -77631 129845 195452 104847 -31546 -54916
9443e4916J43322L43958J63823o5999Q7009j52080K03224j34869m53112M5238
$$ -54916 88406 432364 596187 530188 617197 465117 668341 533472 80360 125598
9433A25598P6354j20121k6064l30628N7253n5006M48970L07047J50873p8949k00557
$$ 125598 201952 81831 55767 -274861 -217608 -272614 176356 483403 634276 555327 354770
9422C54770p3218q5089k03090k59458O1464M9213P2276J16634j89773L12637K53898
$$ 354770 281552 196463 -6627 -266085 -204621 -155408 -83132 33502 -156271 156366 410264
9411D10264j4394k07543j92007R1045k28939j56295O6640K60848R8686l40038
$$ 410264 395870 188327 -3680 87365 -141574 -297869 -231229 29619 128305 -211733
9401b11733j28487j94123j94719P7202K3915J98530J70488k13688J56486K64735
$$ -211733 -340220 -534343 -729062 -651860 -627945 -429415 -258927 -472615 -316129 -51394
9391e1394n6819O324K9377o6159L02331R9629Q498R845M631J01451k87819k18053
$$ -51394 -108213 -101889 -72512 -138671 163660 263289 271787 281632 286263 387714 99895 -118158
9379a18158q970k2500L76249J32689j4884k69458k26159K15623k27569L0809L06510
$$ -118158 -127128 -149628 226621 359310 344426 74968 -151191 64432 -163137 -132328 174182
9368A74182n6420l13220P1055J73626j02437r2517K14003q522K2883j30298j46197
$$ 174182 117762 -195458 -124403 49223 -53214 -145731 68272 59750 82633 -47665 -193862
9357a93862j15691j01466j48990J60450N4127Q9083K30573l3071q2145N5395k18992
$$ -193862 -309553 -411019 -560009 -399559 -345432 -256349 -25776 -58847 -140992 -85597 -304589
9346c04589J76221J565p9756k10266n7556K15031K51875l80695m23741j08380
$$ -304589 -128368 -126803 -206559 -416825 -474381 -259350 -7475 -388170 -811911 -920291
9336i20291K75081N52862Q2766k54287L7008J25980K6845L01173q3288K39314
$$ -920291 -645210 -92348 -9582 -263869 -226861 -100881 -74036 227137 143849 383163
9326C83163J31274k6752n2840j74895l49924j06110P709Q7094L76142p8256j19518
$$ 383163 514437 487685 434845 259950 -89974 -196084 -188375 -101281 274861 196605 77087
9315G7087j19187J14554o6040j60956O7772J4150L72224K07984l79370q8489J97440
$$ 77087 -42100 72454 6414 -154542 -86770 -72620 299604 507588 128218 39729 237169
9304B37169J60774l00647j38877K07210k11036l89824n33775j4684K21662M1182
$$ 237169 397943 97296 -41581 165629 -45407 -435231 -969006 -983690 -762028 -720846
9294g20846K18316J81884N24011j3546l13039j504n7459J53223j30441k03004
$$ -720846 -502530 -320646 203365 189819 -123220 -124724 -182183 -28960 -159401 -362405
9284c62405O4130J36848j6017l35028O2738L18345r0372o5556k14706J09944Q4442
$$ -362405 -298275 -161427 -177444 -512472 -449734 -131389 -221761 -287317 -502023 -392079 -307637
9273c07637p6690k09346J69864P5974k7370M31218r8917l5432m9540j55660J16028
$$ -307637 -384327 -593673 -423809 -347835 -375205 56013 -42904 -78336 -127876 -283536 -167508
9262a67508j5825K21667K08060j97677j88599k32520L889J56027q7013K51303
$$ -167508 -183333 38334 246394 48717 -139882 -372402 -368513 -212486 -299499 -48196
9252d8196M8872n08073J25649L02821K78699p677K01615j39209l79261J742l8271
$$ -48196 676 -507397 -381748 -78927 199772 192095 393710 254501 -124760 -123018 -161289
9241a61289m0949l6141k52625O0961p0463o1297J13188J31623q677j78582r3555
$$ -161289 -202238 -238379 -491004 -430043 -500506 -561803 -448615 -316992 -325669 -504251 -597806
9230e97806J04053J10538L28627K2713k28126j91902L15361N28317j27125n13757
$$ -597806 -493753 -383215 -54588 -31875 -260001 -451903 -136542 391775 264650 -249107
9220b49107k03870j64132L3822K85104n2764J32961K90574j0068l68776j29274
$$ -249107 -452977 -617109 -583287 -298183 -350947 -217986 72588 62520 -306256 -435530
9210d35530j41246q5486N9360J66225K34348J47481J7738L1620l8804K48561O379
$$ -435530 -576776 -662262 -602902 -436677 -202329 -54848 -37110 -5490 -44294 204267 210646
9199B10646p4492k74783l65431j38618K44305K47678k5221L00633N7150l26210
$$ 210646 136154 -138629 -504060 -642678 -398373 -150695 -175916 124717 181867 -144343
9189a44343l8346J91403l5392Q1067j70814j22782J15618L39233o751j73972L3966
$$ -144343 -182689 8714 -26678 54389 -116425 -239207 -123589 215644 208893 34921 68887
9178F8887J46458j53777J09577k26565K32351m305k13363m3299p2403j17529J13882
$$ 68887 215345 61568 171145 -55420 176931 172626 -40737 -84036 -156439 -273968 -160086
9167a60086j9425J9019J76230m33726j15264K84135J66665L6963Q2054j06090
$$ -160086 -179511 -160492 15738 -417988 -533252 -249117 -82452 -45489 36565 -69525
9157f9525j99827q6067n2457p6813Q6315J96203l06996R0820J62495k76240l19391
$$ -69525 -269352 -355419 -407876 -484689 -398374 -202171 -509167 -418347 -255852 -532092 -851483
9146h51483k2240K65693J01849J33899K84011K26765J77138j76473J55995J44114
$$ -851483 -873723 -608030 -506181 -372282 -88271 138494 315632 139159 295154 439268
9136D39268n06170m75578J33592l31917l3793L07827R7970L1179L0849Q5951K67793
$$ 439268 -66902 -542480 -408888 -740805 -774598 -466771 -368801 -337622 -306773 -220822 46971
9125D6971N3488J09358K5085r2416k72670j32603J90000L00914j3816l7142k64676
$$ 46971 100459 209817 234902 142486 -130184 -262787 -72787 228127 214311 177169 -87507
9114h7507j86775k3367m9063m57723j03296M33263J75855N0084l15280o6755J10771
$$ -87507 -274282 -297649 -346712 -804435 -907731 -474468 -298613 -248529 -563809 -630564 -519793
9103e19793K8009N5012J82156K96930R5757j26088l07170j38578l3364M18260
$$ -519793 -491784 -436772 -254616 42314 138071 11983 -295187 -433765 -467129 -48869
9093d8869R9430l13305p7292Q3073l3310J9190K2502j59932j09043J3642J62277
$$ -48869 50561 -262744 -340036 -256963 -290273 -271083 -248581 -408513 -517556 -503914 -341637
9082c41637J13420j12238J20736J31787j25803l26605k29666K6475J05877j06598
$$ -341637 -228217 -340455 -219719 -87932 -213735 -540340 -770006 -743531 -637654 -744252
9072g44252q4648n7487J03543J53165K31061j7794j48477m4513J35272K18166
$$ -744252 -828900 -886387 -782844 -629679 -398618 -416412 -564889 -609402 -474130 -255964
9062b55964j5011j38273J36477k05914L02714L12307J32334k25042P6663J67881
$$ -255964 -270975 -409248 -272771 -478685 -175971 136336 268670 43628 120291 288172
9052B88172r8590l72055j87561L06285M8919m5135j38713J84940k6711j47927
$$ 288172 189582 -182473 -370034 -63749 -14830 -59965 -198678 -13738 -40449 -188376
9042a88376J20854J12138K9205k4882K52661j60365l27198j5748l9791j65849
$$ -188376 -67522 44616 73821 48939 301600 141235 -185963 -201711 -241502 -407351
9032d07351q2158J17708r0240K86379j63660j97373L04388L79936j7921o2519
$$ -407351 -489509 -371801 -462041 -175662 -339322 -536695 -232307 147629 129708 67189
9022F7189l3911j08881j76073k42364J57589K32521l0074L18308r8875k75583
$$ 67189 33278 -75603 -251676 -494040 -336451 -103930 -134004 184304 85429 -190154
9012a90154p5546n8092j10095j77351J03123L40980K2693J99729J25106k19729
$$ -190154 -265700 -323792 -433887 -611238 -508115 -167135 -144442 55287 180393 -39336
9002c9336p7579O9945p3595L21677j49508k03532J30481J63065k52k72611l27980
$$ -39336 -116915 -46970 -120565 201112 51604 -151928 -21447 141618 141366 -131245 -459225
8991d59225K58082J89479l10728k0714L41473L33364j38562k83027m61499n8660
$$ -459225 -201143 -11664 -322392 -343106 -1633 331731 193169 -89858 -551357 -610017
8981f10017P72229L83478l13994N4160L1096J19983j3303q1816l85968j00522
$$ -610017 162212 545690 231696 285856 316952 436935 423632 341816 -44152 -144674
8971a44674M1364K89684L18436j4446l13635j05161K46307L5401k44479m61479
$$ -144674 -103310 186374 504810 490364 176729 71568 317875 353276 108797 -352682
8961c52682k95081J61105J35173J82908k728J2558k83822L35911J17120j16701
$$ -352682 -647763 -486658 -351485 -168577 -171305 -158747 -442569 -106658 10462 -106239
8951a06239k59893l99567j47400M56077K12714O8801l7623n7376J68028j69310
$$ -106239 -366132 -765699 -913099 -457022 -244308 -175507 -213130 -270506 -102478 -271788
8941b71788N6072K01000k40513m63388n5897j62458J66223N22779J70002O9173
$$ -271788 -215716 -14716 -255229 -718617 -774514 -936972 -770749 -247970 -77968 -8795
8931h795K18045K2704O5103M4451l52599l66544m9640l9397n6422J67758j38793
$$ -8795 209250 231954 297057 341508 -11091 -377635 -427275 -466672 -523094 -355336 -494129
8920d94129l24534k0887L40173L90230r92Q6883J36661L47027m195k63235R576
$$ -494129 -818663 -839550 -499377 -109147 -110139 -23256 113405 460432 456237 193002 202578
8909B02578L91206p1231j54066m2853l1332j61826p3490J19203J49143N183l29041
$$ 202578 593784 522553 368487 325634 294302 132476 58986 178189 327332 332515 3474
8898C474j75131j93224L68778K21492o3766j96227O9398J80708q2968p6761r7555
$$ 3474 -171657 -364881 3897 225389 161623 -34604 34794 215502 132534 55773 -41782
8887d1782P9143O2918k82387k65841l8433q6383l24024J61602K65534l5669k20222
$$ -41782 37361 100279 -182108 -447949 -486382 -572765 -896789 -735187 -469653 -505322 -725544
8876g25544J95166N7065J46994R5328j84611l40553j09870K06246K00742J12939
$$ -725544 -530378 -473313 -326319 -230991 -415602 -756155 -866025 -659779 -459037 -346098
8866c46098K235K00485R216j45024M7496m182k46422K1905j69964r4720Q9819
$$ -346098 -343863 -143378 -134162 -279186 -231690 -235872 -482294 -460389 -630353 -725073 -635254
8855f35254J84383L65078R3077k4078J74339l352n6781l79177Q189K46192n365
$$ -635254 -450871 -85793 7284 -16794 157545 154193 97412 -281765 -273576 -27384 -32749
8844c2749q4224k1016K77633j69946l41930L12689J6355j58758J64639r2389o7235
$$ -32749 -116973 -137989 139644 -30302 -372232 -59543 -43188 -201946 -37307 -129696 -196931
8833a96931P3384K62242n9920K7768P7733J39025P32363J9910m81718l94899m28900
$$ -196931 -123547 138695 78775 106543 184276 323301 1055664 1075574 593856 198957 -229943
8822b29943k04351Q6790J25696k6046j84617j11750M87018M24129k45769J38195
$$ -229943 -434294 -347504 -221808 -247854 -432471 -544221 -57203 366926 121157 259352
8812B59352n4194N660k93942J60308J2439J8577P1850r065J48417N5746k5641
$$ 259352 205158 210818 -83124 77184 89623 108200 180050 170985 319402 375148 349507
8801C49507R7380K68064m12534k36659J89402l95202l04605K37150K39068M5564
$$ 349507 446887 714951 302417 65758 255160 -140042 -444647 -207497 31571 77135
8791G7135J44575j74739l55254j39948M22197N80327P12152K81797L96880N60102
$$ 77135 221710 46971 -308283 -448231 -26034 554293 1266445 1548242 1945122 2505224
8781B505224m20831o51611p49281l45651k52791l0591k8705K18967Q5791n6039
$$ 2505224 2084393 1432782 683501 337850 85059 54468 25763 244730 330521 274482
8771B74482k07869j66960J24474K90367J35900k96608m60886r2227M6859J40591
$$ 274482 66613 -100347 24127 314494 450394 153786 -307100 -399327 -352468 -211877
8761b11877r6907K72566k50284j79131N62127O5758Q6152J18083r3213m64888
$$ -211877 -308784 -36218 -286502 -465633 96494 162252 248404 366487 273274 -191614
8751a91614P3641J96015k1661P2404J66545j72037m8966J55357K0257M7047r2316
$$ -191614 -117973 78042 56381 128785 295330 123293 74327 229684 249941 296988 204672
8740B04672J60777J38128M1329L97355J38494k66428k34797l65015k2163J30640
$$ 204672 365449 503577 544906 942261 1080755 814327 579530 214515 192352 322992
8730C22992j75648j85989n2589j45939J00811J29151k01509k58749K3781J37375
$$ 322992 147344 -38645 -91234 -237173 -136362 -7211 -208720 -467469 -443688 -306313
8720c06313L63581K14967j16506k37826q2779K47695l7816n93725K6549J49210
$$ -306313 57268 272235 155729 -82097 -164876 82819 45003 -548722 -522173 -372963
8710c72963J54021j37875K3093j09878j23746J48976L05752N9427q5451L82486
$$ -372963 -218942 -356817 -333724 -443602 -567348 -418372 -112620 -53193 -138644 243842
8700B43842N31213O7278k44055J32597l69656j66951j69885j64921J92796Q2654
$$ 243842 775055 842333 598278 730875 361219 194268 24383 -140538 52258 134912
8690A34912j28527J44821J54274O7258m84164j66286P1748j5077j234k92813l29993
$$ 134912 6385 151206 305480 372738 -111426 -277712 -205964 -221041 -222275 -515088 -845081
8679h45081L92183L82109K89747N9078k67188l26817l19966J06398M38015k57522
$$ -845081 -452898 -70789 218958 278036 10848 -315969 -635935 -529537 -91522 -349044
8669c49044r9907P1210J5684O9663J7362M6643K728j47715L29737M5650m6397
$$ -349044 -448951 -377741 -362057 -292394 -275032 -228389 -225661 -373376 -43639 2011 -44386
8658d4386J90195j8012r414R2835q3640j65600l6513k18861J38813K28821J86071
$$ -44386 145809 127797 118383 211218 127578 -38022 -74535 -293396 -154583 74238 260309
8647B60309J48352n7054m40151k08242l30313J07202K96114k94847n83040J94433
$$ 260309 408661 351607 -88544 -296786 -627099 -519897 -223783 -518630 -1101670 -907237
8637i07237P13213K06427l71574L01782k57870k20341J05615K7296j61700R9872
$$ -907237 -194024 12403 -359171 -57389 -315259 -535600 -429985 -402689 -564389 -464517
8627d64517o733j30223N91890K8656k58744J00790k17284p3447j17123K24022
$$ -464517 -471250 -601473 -9583 19073 -239671 -138881 -356165 -429612 -546735 -322713
8617c22713K44304j13683j22400K06021L69219k21749l5161j08126L4981K9947
$$ -322713 -78409 -192092 -314492 -108471 260748 38999 3838 -104288 -69307 -39360
8607c9360K72736R7261K9261q8904L1176K7241l6127P2658n8414j37833m8514
$$ -39360 233376 330637 359898 270994 302170 329411 293284 365942 307528 169695 121181
8596A21181j56337j27951J8533K35725k27830K17220m1132O1134k45047q3773
$$ 121181 -35156 -163107 -144574 91151 -136679 80541 39409 100543 -144504 -228277
8586b28277k05077p7821K7070K65363K44763j45240J55589K99886M7923m0693
$$ -228277 -433354 -511175 -484105 -218742 26021 -119219 36370 336256 384179 343486
8576C43486J29558j62069j05846j84585p3400J01156p2708q2008q279K33712K7954
$$ 343486 473044 310975 205129 20544 -52856 48300 -24408 -106416 -114695 119017 146971
8565A46971J10043K99100j35479j87977k20673k18810j40010K650K52306K63911
$$ 146971 257014 556114 420635 232658 11985 -206825 -346835 -344185 -91879 172032
8555A72032j33562j00782k2370O4521L5039m6522k19928M6958J91431L40533n057
$$ 172032 38470 -62312 -84682 -20161 14878 -31644 -251572 -204614 -13183 327350 322293
8544C22293m3054R7518n0909J71477L64492j02697m14962k34479J97843O8526
$$ 322293 279239 376757 325848 497325 861817 759120 344158 109679 307522 376048
8534C76048k34827j49885p6667M7638q805L58832N5365k11907j04396j06472m3921
$$ 376048 141221 -8664 -85331 -37693 -46498 312334 367699 155792 51396 -55076 -98997
8523i8997j75651N4375Q8986k12371j64421k5445K2236N9671M00092J06715J31179
$$ -98997 -274648 -220273 -131287 -343658 -508079 -533524 -511288 -451617 -51525 55190 186369
8512A86369l9289j58889R8972K5850l55109O7962L72486K27365j5337m61234k05777
$$ 186369 147080 -11809 87163 113013 -242096 -174134 198352 425717 410380 -50854 -256631
8501b56631J02014q3200k39861j1856R797K90896q226k69319K33562k35994k43929
$$ -256631 -154617 -237817 -477678 -489534 -479737 -188841 -197067 -466386 -232824 -468818 -712747
8490g12747L85075o6592l9600J15011L29519K65906p1709m44865J47285L32036
$$ -712747 -327672 -394264 -433864 -318853 10666 276572 204863 -240002 -92717 239319
8480B39319J7079l95647j96321k12653j89488j03148K05841M7149L87164N8451
$$ 239319 256398 -139249 -335570 -548223 -737711 -840859 -635018 -587869 -200705 -142254
8470a42254k00060l55759k32449N8520o4612R6758j33532L44372M86740j78793
$$ -142254 -342314 -698073 -930522 -872002 -936614 -839856 -973388 -629016 -142276 -321069
8460c21069j47807K89447N31161m5250l54540n35363N4799L14291L25857q8759
$$ -321069 -468876 -179429 351732 306482 -48058 -583421 -528622 -214331 111526 22767
8450B2767N7907J45305l460K6216k40160j09199o0484j48334J47403R3126K51896
$$ 22767 80674 225979 222519 248735 8575 -100624 -161108 -309442 -162039 -68913 182983
8439A82983J20632J5643m66635r5972l0723J94907M18818j63807j84632r8348
$$ 182983 303615 319258 -147377 -243349 -274072 -79165 339653 175846 -8786 -107134
8429a07134M3497n9942r8328j8554m236j41775j82010J65731L44864J33216m09620
$$ -107134 -63637 -123579 -221907 -240461 -244697 -386472 -568482 -402751 -57887 75329 -334291
8418c34291J03328M71883j69367k2870M0042l6165k3089L752n6482M30748K39715
$$ -334291 -230963 240920 71553 48683 88725 52560 29471 33223 -23259 407489 647204
8407F47204n1173m35358N7742L37704K3904k27051k02643k23801J47373Q6592
$$ 647204 596031 160673 218415 556119 580023 352972 150329 -73472 73901 160493
8397A60493j9641k57424L8589P3006J46167J03410K74873N0614K2568r8971j14828
$$ 160493 140852 -116572 -77983 -4977 141190 244600 519473 570087 592655 493684 378856
8386C78856j40169K26551J15242J17746k16849K0609k59602j26076j47067k52102
$$ 378856 238687 465238 580480 698226 481377 501986 242384 116308 -30759 -282861
8376b82861j71745l7519L75430Q272L5221K3701L37522k48697r2442k3652m7588
$$ -282861 -454606 -492125 -116695 -108423 -73202 -49501 288021 39324 -53118 -76770 -124358
8365a24358k41992J87385P2503j80155O043j79366p424R2763J62706L3298J68720
$$ -124358 -366350 -178965 -106462 -286617 -280574 -459940 -467364 -374601 -211895 -178597 -9877
8354i877q8509K36709n4801J9840K66949K2368r9163J89917j89780Q2026j30635
$$ -9877 -98386 138323 83522 103362 370311 392679 293516 483433 293653 375679 245044
8343B45044k37852k23658K15772M13267L1613n89290l27946J5094J34121N4766
$$ 245044 7192 -216466 -694 412573 444186 -145104 -473050 -457956 -323835 -269069
8333b69069J42572l7992j49134m7211L53272L1295k98301k12832M35834l1368
$$ -269069 -126497 -164489 -313623 -360834 -7562 23733 -274568 -487400 -51566 -82934
8323h2934n3781K56261J82233p4528j59959j21032k6508J46143j34376o0249L6391
$$ -82934 -136715 119546 301779 227251 67292 -53740 -80248 65895 -68481 -128730 -92339
8312i2339K97728J28939N2752j10805l9106k02571j34480j61597m7419j3303j04864
$$ -92339 205389 334328 387080 276275 237169 34598 -99882 -261479 -308898 -322201 -427065
8301d27065l7166K90744k16859l32780K77383L20147J52197q0249J63189L07264
$$ -427065 -464231 -173487 -390346 -723126 -445743 -125596 26601 -53648 109541 416805
8291D16805P865j8558k80092m76380J08477N06190K416K83691p1008p65644j88468
$$ 416805 424670 406112 126020 -350360 -241883 264307 266723 550414 479406 -286238 -474706
8280d74706M48769J98609O4694p1472k07766l49235j96979j83356N9928J12269
$$ -474706 -25937 172672 237366 165894 -41872 -391107 -588086 -771442 -711514 -599245
8270e99245j399L87879L39310K95992J65082J66152j31094l54819j93607R5850
$$ -599245 -600644 -212765 126545 422537 587619 753771 622677 267858 74251 170101
8260A70101L27527l11481k67857m06074P1029J14251m34040J00542L10703Q2046
$$ 170101 497628 186147 -81710 -487784 -416755 -302504 -736544 -636002 -325299 -243253
8250b43253J71227P1313J11027L34208J62q0667k20217N3767m3648j56537J47412
$$ -243253 -72026 -713 110314 444522 444684 364017 143800 197567 153919 -2618 144794
8239A44794n1296j75104J59088k6858j02880K77293J21531j99306M7540j16146
$$ 144794 93498 -81606 77482 50624 -52256 225037 346568 147262 194802 78656
8229G8656M510l41526k79163k3908J52998L29903M55083M4288j24991R8032k88049
$$ 78656 83166 -258360 -537523 -561431 -408433 -78530 376553 420841 295850 393882 105833
8218A05833m01817J7299K69652M01696K54437m77896J43267k25839k06387J1254
$$ 105833 -295984 -278685 -9033 392663 647100 169204 312471 86632 -119755 -108501
8208a08501j73944K7644M0887J40917j37774l64370j94464N5950K53617K15003
$$ -108501 -282445 -254801 -213914 -72997 -210771 -575141 -769605 -713655 -460038 -245035
8198b45035J49430K7430L48242l00012k69206K05190J93517L39035k49596l68934
$$ -245035 -95605 -68175 280067 -19945 -289151 -83961 109556 448591 198995 -169939
8188a69939K9000J30778Q4905k08583Q7700J74863k76037P4991j09298K72358
$$ -169939 -140939 -10161 74744 -133839 -46139 128724 -147313 -72322 -181620 90738
8178I0738K79020k51309k5180L57685J30470j28462j54690J52493N33159r2219
$$ 90738 369758 118449 93269 450954 581424 452962 298272 450765 983924 891705
8168H91705k68468k02504m24410j13718j1947l7205j49366p1798k79237k64143
$$ 891705 623237 420733 -3677 -117395 -129342 -166547 -315913 -387711 -666948 -931091
8158i31091r4751K30024M85810L55356l4945n4220k40099J87739P4195k87067
$$ -931091 -1025842 -795818 -310008 45348 10403 -43817 -283916 -96177 -21982 -309049
8148c09049q9227L9474L01486J69790k19900k11993J42437p6257n4435j98468
$$ -309049 -398276 -358802 -57316 112474 -107426 -319419 -176982 -253239 -307674 -506142
8138e06142K25444K54945n3776k6370m26263j91967K56966L63001K0328L3811
$$ -506142 -280698 -25753 -79529 -105899 -532162 -724129 -467163 -104162 -83834 -50023
8128e0023j87068k11637L22631P0215m4830k07168j40915M64867R9673p831o8326
$$ -50023 -237091 -448728 -126097 -55882 -100712 -307880 -448795 16072 115745 107914 39588
8117C9588j70696N5484j01650J9687k8558K01890J7530Q3976L48349L18858n2484
$$ 39588 -131108 -75624 -177274 -157587 -186145 15745 33275 117251 465600 784458 731974
8106G31974n21770j19393J48102l0886q4762L37849l2629k76817k44444j18564
$$ 731974 210204 90811 238913 208027 123265 461114 428485 151668 -92776 -211340
8096b11340K36373K14925K82125L3645k49069o0285N8515j5112j94486m27390
$$ -211340 25033 239958 522083 555728 306659 246374 304889 289777 95291 -332099
8086c32099K4225Q8300P1311L3699k54905k69592J64607N97068R1014m33935j76501
$$ -332099 -307874 -219574 -148263 -114564 -369469 -639061 -474454 122614 213628 -220307 -396808
8075c96808Q5051N5484l4501n4524K71158n832K43760P6410J09492q9163r6710
$$ -396808 -311757 -256273 -290774 -345298 -74140 -79972 163788 240198 349690 260527 163817
8064A63817J0539P0448L0195R5708J41248r1204m07073q1793P9378j79091k73266
$$ 163817 174356 244804 274999 370707 511955 420751 13678 -68115 11263 -167828 -441094
8053d41094j89967l57808M92787K37635P2014k01632m8154L38229R4277l1781
$$ -441094 -631061 -988869 -496082 -258447 -186433 -388065 -436219 -97990 -3713 -35494
8043c5494k7056m10583N5473K52486o4732O7173j85172j91580K714N4006L59170
$$ -35494 -62550 -473133 -417660 -165174 -229906 -162733 -347905 -539485 -536771 -482765 -123595
8032a23595J50286o6248J86892J83708J92098l93925l60486J2349R0740J03865
$$ -123595 26691 -39557 147335 331043 523141 129216 -231270 -218921 -128181 -24316
8022b4316r1806j90021J20663K01541k36141J19063K59682N8761q1107j8315j05480
$$ -24316 -116122 -306143 -185480 16061 -220080 -101017 158665 217426 136319 118004 12524
8011A2524L46876J8507K19385l0454k36566l85837j02445M52094m19516k34847
$$ 12524 359400 377907 597292 566838 330272 -55565 -158010 294084 -125432 -360279
8001c60279J33709r769K58243L27046j06205j80369j11031L78892j29504j36433
$$ -360279 -226570 -236339 21904 348950 242745 62376 -48655 330237 200733 64300
7991F4300J99543Q2010j13144J85944j61548l85317j6791k23934k97206J60449
$$ 64300 263843 345853 232709 418653 257105 -128212 -145003 -368937 -666143 -505694
7981e05694M81349j05593k41298K44529J25872M2116K88344p8842l55678l23188
$$ -505694 -24345 -129938 -371236 -126707 -835 41281 329625 250783 -104895 -428083
7971d28083M8517K88055q1081j67210n4871p249m0945J84451J99152O5928k74748
$$ -428083 -379566 -91511 -172592 -339802 -394673 -401922 -442867 -258416 -59264 6664 -268084
7960b68084r8608n9091M13261J688P4065J60410k85679l16804R7534M09400k3893
$$ -268084 -366692 -425783 -12522 -10834 63231 223641 -62038 -378842 -281308 128092 104199
7949A04199k84149J7487Q3818j16005K55964N01511j83168k55662m23243k9159
$$ 104199 -179950 -162463 -78645 -194650 61314 562825 379657 123995 -299248 -328407
7939c28407P6259J6191J30421J86515j55676m69452L44013J49225k4824L809K66481
$$ -328407 -252148 -235957 -105536 80979 -74697 -544149 -200136 -50911 -75735 -71926 194555
7928A94555q3399Q9353J47207q8311R5481M3737j81974k52538P616J50571J3925
$$ 194555 111156 200509 347716 259405 354886 398623 216649 -35889 -28273 122298 136223
7917A36223j29881r9340J8378j4855K6105J02497J97761n1923k38387o2778n3004
$$ 136223 6342 -92998 -74620 -89475 -63370 39127 236888 184965 -53422 -116200 -169204
7906a69204k33253L8112L20466O3877K7535K4326j32277K582J04139l58088j06404
$$ -169204 -402457 -364345 -43879 19998 47533 71859 -60418 -57836 46303 -311785 -418189
7895d18189L38123L36836P0526n18211J96203M14123J37303k6634k84970j38604
$$ -418189 -80066 256770 327296 -190915 5288 419411 556714 530080 245110 106506
7885A06506l9057j83368M3136L65061K63499j77286j75429m2657P169k99712l24557
$$ 106506 67449 -115919 -72783 292278 555777 378491 203062 160405 167574 -132138 -456695
7874d56695L22686M09132Q1518K8219N248q7695q864k04710k17387R5703J10704
$$ -456695 -134009 275123 356641 384860 390108 302413 293549 88839 -128548 -32845 77859
7863G7859j6700j51695M410p3968j23821o3543J05563j63715j98195l4075J85784
$$ 77859 61159 -90536 -86126 -160094 -283915 -347458 -241895 -405610 -603805 -637880 -452096
7852d52096N67388J72467l70510l3925M12557j18970P807p5217n8413K17609L34747
$$ -452096 115292 287759 -82751 -116676 295881 176911 184718 109501 51088 268697 603444
7841F03444O219j11184m13499K05745j44012k87942J14604K02999l7966K5906
$$ 603444 609663 498479 84980 290725 146713 -141229 -26625 176374 138408 164314
7831A64314j511O0927r8162L19296O51612j82598m75890l57907p9196J41065l43411
$$ 164314 162803 223730 125568 444864 1096476 913878 437988 80081 885 141950 -201461
7820b01461m07191k49135J08091L45014K1212m9138K13116J3995J60422J30586
$$ -201461 -608652 -857787 -749696 -404682 -383470 -432608 -219492 -205497 -45075 85511
7810H5511K19452p1479l3289k31584L3055J1959N3551J86122K1669m41508o2698
$$ 85511 304963 233484 200195 -31389 1666 13625 67176 253298 274967 -166541 -229239
7799b29239L03843j54222J54885J81816r2646j53988J19471L73573J4537j80805
$$ -229239 74604 -79618 75267 257083 164437 10449 129920 503493 518030 337225
7789C37225k72037L68958j16737j27320n1319J38499J56097k2410j66073k34205
$$ 337225 65188 434146 317409 190089 138770 277269 433366 410956 244883 10678
7779A0678n3375O5738J02735q8421M3268j00103j97913l15647L29722L44678k17498
$$ 10678 -42697 23041 125776 37355 80623 -19480 -217393 -533040 -203318 141360 -76138
7768g6138M7380K27233j91747L34244N4780j43139p6142J49850k24101k59461
$$ -76138 -28758 198475 6728 340972 395752 252613 176471 326321 102220 -157241
7758a57241j62365l33465n3218M93341J50663J85238k18721k88483j21621M5516
$$ -157241 -319606 -653071 -706289 -212948 -62285 122953 -95768 -384251 -505872 -460356
7748d60356O367R6089J55901k18707O3581j55295L4999J44476K50698P2119j1471
$$ -460356 -453989 -357900 -201999 -420706 -357125 -512420 -477421 -332945 -82247 -10128 -21599
7737b1599r5115R5905N4025P2391m4076l1092j55105J8457K36644n4618P770K86275
$$ -21599 -116714 -20809 33216 105607 61531 30439 -124666 -106209 130435 75817 83587 369862
7725C69862J71966k26426l07825j33899l3416l82623n3406K04367Q9794K27128
$$ 369862 541828 315402 7577 -126322 -159738 -542361 -595767 -391400 -301606 -74478
7715g4478n3496k43479j59272n6422K91284q0429j7108L41119Q4457J24441p7522
$$ -74478 -127974 -371453 -530725 -587147 -295863 -376292 -393400 -52281 32176 156617 79095
7704G9095p6772M9358k87287J57902o2758Q514K68961J97204j26583J03534j19817
$$ 79095 2323 51681 -235606 -77704 -140462 -131948 137013 334217 207634 311168 191351
7693A91351p09087J52030L40207k50316l11758m1666K08251J97026K54510j00575
$$ 191351 -517736 -365706 -25499 -275815 -587573 -629239 -420988 -223962 30548 -70027
7683g0027l43116R8883p1867P0917O7450k8945k9303J20019K68127J21865k87248
$$ -70027 -413143 -314260 -386127 -315210 -247760 -276705 -306008 -185989 82138 204003 -83245
7672h3245j8486J03571k2747j55879k16676L26695K30192n24684Q1115J63693
$$ -83245 -101731 1840 -20907 -176786 -393462 -66767 163425 -361259 -280144 -116451
7662a16451P1283j04741k33302l26677L18609N92922Q1539p8689k10967j65454
$$ -116451 -45168 -149909 -383211 -709888 -391279 201643 283182 204493 -6474 -171928
7652a71928R7670L64923l1628J70753l1483p8050P7017J09056m63514l11798L7193
$$ -171928 -74258 290665 259037 429790 398307 320257 397274 506330 42816 -268982 -231789
7641b31789M8319N89496K18120l56521n70074r4952L01777K84215q762k43499
$$ -231789 -183470 406026 624146 267625 -302449 -397401 -95624 188591 179829 -63670
7631f3670O2269J25195K0104m9750q0365k19617O3416k69976J26127K69188L01511
$$ -63670 -1401 123794 143898 94148 13783 -205834 -142418 -412394 -286267 -17079 284432
7620B84432j21143o2368l82670j47871l3002K18445K5932n6740L48497J48873
$$ 284432 163289 100921 -281749 -429620 -462622 -244177 -218245 -274985 73512 222385
7610B22385p3542j65131l04912J45233o7196m2294l90084n9338K31069J20477
$$ 222385 148843 -16288 -321200 -175967 -243163 -285457 -675541 -734879 -503810 -383333
7600c83333M53179K51342k31908l67249R9352P3810J2621K59102K8198N375j70360
$$ -383333 69846 321188 89280 -277969 -178617 -104807 -92186 166916 195114 200489 30129
7589C0129j14387n5380q0116J29074J39970L13762k66265p02253k52492K59121
$$ 30129 -84258 -139638 -219754 -90680 49290 363052 96787 -605466 -857958 -598837
7579e98837K21615J00423j26109j5496J15578j46107J96325j03243K22202r9842
$$ -598837 -377222 -276799 -402908 -418404 -302826 -448933 -252608 -355851 -133649 -233491
7569b33491j71348P1267L50073r0885n07066j26294L13428M03762L85320j08409
$$ -233491 -404839 -333572 16501 -74384 -581450 -707744 -394316 9446 394766 286357
7559B86357l05301J69287L65044n02626l21818J68215J09505J93232N4520j17336
$$ 286357 -18944 150343 515387 12761 -309057 -140842 -31337 161895 216415 99079
7549I9079p6577K11757J03971j50631J33933J9444j57384j40860L7142j48720
$$ 99079 22502 234259 338230 187599 321532 340976 183592 42732 79874 -68846
7539f8846p3676R0097K82681l9667m10892j41770J9277J90420l94682N2306L96380
$$ -68846 -142522 -52425 230256 190589 -220303 -362073 -342796 -152376 -547058 -494752 -98372
7528i8372k07072J59767q5177J31331L34589O7163k21722l33253o1077N17769
$$ -98372 -305444 -145677 -230854 -99523 235066 302229 80507 -252746 -313823 203946
7518B03946j41990O4597K78319k0897k48718m61957J4342M10087P7172L8713n9925
$$ 203946 61956 126553 404872 383975 135257 -326700 -312358 97729 174901 213614 153689
7507A53689k40791J30K82485O2025j65643J21394J55533l2607J57542k3765j02826
$$ 153689 -87102 -86972 195513 257538 91895 213289 368822 336215 493757 469992 367166
7496C67166l1822j96621j56495P2563J24394p1500o9476l1624j09987R7719L22042
$$ 367166 335344 138723 -17772 54791 179185 107685 38209 6585 -103402 -5683 316359
7485C16359p4420J292P610O8960m15083K91517L45191j11689j67449j27277l5340
$$ 316359 241939 243231 250841 319801 -95282 196235 541426 429737 262288 135011 99671
7474I9671J07377p4056k58125k19765R4194K54762K45184j28773N7202q3503q3860
$$ 99671 207048 132992 -125133 -344898 -250704 4058 249242 120469 177671 94168 10308
7463A0308k93440J00913K98320j66819l00364L03125K01092j10656J9911J04518
$$ 10308 -283132 -182219 116101 -50718 -351082 -47957 153135 42479 62390 166908
7453A66908R0066K68443l3931j19397j30417l18439j68213J49253j37306l58649
$$ 166908 256974 525417 491486 372089 241672 -76767 -244980 -95727 -233033 -591682
7443e91682k05694J32049N0252M11718K93730k22378J4367l33067k31903L36077
$$ -591682 -797376 -665327 -615075 -203357 90373 -132005 -117638 -450705 -682608 -346531
7433c46531P2325K91632L19345k83457L3146K74528Q1759n32486k34781K47535
$$ -346531 -274206 17426 336771 53314 86460 360988 442747 -89739 -324520 -76985
7423g6985L3051n2943L24133j9240N3460l5009j76450j10050M2802L621j58530
$$ -76985 -43934 -96877 227256 208016 261476 226467 50017 -60033 -17231 -13610 -172140
7412a72140j31190K69014n2873J58278N0703K0482P4541n0902p3751l6277k78789
$$ -172140 -303330 -34316 -87189 71089 121792 142274 216815 165913 92162 55885 -222904
7401b22904o9088J80052L36907M1269j38066m30753j64880l5659J83099j7742
$$ -222904 -291992 -111940 224967 266236 128170 -302583 -467463 -503122 -320023 -337765
7391c37765k44355K0698J07257J00339R2731N1911N313L56027K25382J21036k40410
$$ -337765 -582120 -561422 -454165 -353826 -261095 -209184 -203871 152156 377538 498574 258164
7380B58164j80910m2501n7996N1581J13828Q341n7674j29083j35747J08141J90776
$$ 258164 77254 34753 -23243 28338 142166 150507 92833 -36250 -171997 -63856 126920
7369A26920q8678l3879j25038R6647j30841j40801j52975L07684P7497P100j479
$$ 126920 38242 4363 -120675 -24028 -154869 -295670 -448645 -140961 -63464 -56364 -57843
7358e7843J5989R3689P0441R3509j63885j65485p9682q541J29191n5470K54121
$$ -57843 -41854 51835 122276 215785 51900 -113585 -193267 -201808 -72617 -128087 126034
7347A26034l2286n5972k5823R6548j58318j74693K23996N5684J28577J48889l03611
$$ 126034 93748 37776 11953 108501 -49817 -224510 -514 55170 183747 332636 29025
7336B9025J45344k0410J17696r4044K46068l3402k7627M0892j19411J16299K89987
$$ 29025 174369 153959 271655 177611 423679 390277 362650 403542 284131 400430 690417
7325F90417k35463m22711m56457J81180n4011J27775J96535j6467m3742k99687
$$ 690417 454954 32243 -424214 -243034 -297045 -169270 27265 10798 -32944 -332631
7315c32631L9955L12662K52489k36057J61518J29066l24485j87648L2006R8064
$$ -332631 -292676 19986 272475 36418 197936 327002 2517 -185131 -153125 -55061
7305e5061J77858r3447k26845j52950N845L10086J90305m9400j79770J02010j11060
$$ -55061 122797 29350 -197495 -350445 -344600 -34514 155791 106391 -73379 28631 -82429
7294h2429J3625K58443J04396J19469p0860J2552k57921j84081k13832j84176
$$ -82429 -68804 189639 294035 413504 342644 355196 97275 -86806 -300638 -484814
7284d84814k86593M5178J80348L42495K53094l5335k14545m6963K7359k06175
$$ -484814 -771407 -726229 -545881 -203386 49708 14373 -200172 -247135 -219776 -425951
7274d25951j63043K1233K73859P03495J51034j22031l22068K2065J67949J21833
$$ -425951 -588994 -567761 -293902 409593 560627 438596 116528 138593 306542 428375
7264D28375k06729n0841j12709m4254J96647Q5085N0788L46096l0559j84699k45971
$$ 428375 221646 170805 58096 13842 210489 295574 346362 692458 661899 477200 231229
7253B31229l56257r1871K66966n1132Q9489l50875l35635k04960J55236o5249
$$ 231229 -125028 -216899 50067 -1065 88424 -262451 -598086 -803046 -647810 -713059
7243g13059j63713K39109m1552L04386K16315k09878R368K44770k09260m6544
$$ -713059 -876772 -637663 -679215 -374829 -158514 -368392 -359024 -114254 -323514 -370058
7233c70058L13809J56163J02642j07659J26477O6816l07086P8734K62991k13236
$$ -370058 -56249 99914 202556 94897 221374 288190 -18896 59838 322829 109593
7223A09593m16283r6379N1302M10047L8514l81488l77664R2091M2073j34411j29116
$$ 109593 -306690 -403069 -351767 58280 96794 -284694 -662358 -570267 -528194 -662605 -791721
7212g91721L24900K43845P3815R2759J97636j41804j49020r3721j46903j6688
$$ -791721 -466821 -222976 -149161 -56402 141234 -570 -149590 -243311 -390214 -406902
7202d06902k4837q3814J39568Q7447N0135j85496K97888J59372M3449r6320j57570
$$ -406902 -431739 -515553 -375985 -288538 -238403 -423899 -126011 33361 76810 -19510 -177080
7191a77080K33751J4933J08211k3081l46599K02616K82057j72263K7431J03656
$$ -177080 56671 71604 179815 156734 -189865 12751 294808 122545 149976 253632
7181B53632m649j06176k44855k43876j35725J10416j35449O5979j10231l01328
$$ 253632 248983 142807 -102048 -345924 -481649 -371233 -506682 -440703 -550934 -852262
7171h52262n3658K75374Q6630J28493L45516j50921J2084N2634j50332j24274
$$ -852262 -905920 -630546 -543916 -415423 -69907 -220828 -208744 -156110 -306442 -430716
7161d30716L86945J11358l53234k15832R2882K55482R0149j45082j87398j04994
$$ -430716 -43771 67587 -285647 -501479 -408597 -153115 -62966 -208048 -395446 -500440
7151e00440M8624K46700M0851M9870J15593N0514O752O7474J05559k66709j2790
$$ -500440 -451816 -205116 -164265 -114395 1198 51712 58464 125938 231497 -35212 -48002
7140d8002K35200J37197m4347q8480O8285k18633k36687N2430k3806R8443J98256
$$ -48002 187198 324395 280048 191568 259853 41220 -195467 -143037 -166843 -68400 129856
7129A29856L64618j73681j88861m2186j27009k59526M8619K52503K71081p9362
$$ 129856 494474 320793 131932 89746 -37263 -296789 -248170 4333 275414 196052
7119A96052l26656N8573J48347J17796K62452L56374l46687l28668j63958k20104
$$ 196052 -130604 -72031 76316 194112 456564 812938 466251 137583 -26375 -246479
7109b46479J09510l2236p1072N4503j24119L282K02239K83670k7929k52469k69854
$$ -246479 -136969 -169205 -240277 -185774 -309893 -306611 -104372 179298 151369 -101100 -370954
7098c70954j11905Q8318k89030n723L90266J27949R4803j6406k28592R9604J4417
$$ -370954 -482859 -394541 -683571 -689294 -299028 -171079 -76276 -92682 -321274 -221670 -207253
7087b07253J5539J20821K69442m3133l2623J45076J98554K34019L9568M7279J5728
$$ -207253 -191714 -70893 198549 155416 122793 267869 466423 700442 740010 787289 803017
7076H03017l51440k19179j8280N8278P4214p0968K6689K9714N3143k9849r6304
$$ 803017 451577 232398 214118 272396 346610 275642 302331 332045 385188 355339 259035
7065B59035J49599j61466k7304q8734N4986j87954j34610J55323N18780L01685
$$ 259035 408634 247168 219864 131130 186116 -1838 -136448 18875 537655 839340
7055H39340l43421l07752p7799L39666M3932j35268J5810p6172j9712k03280k08705
$$ 839340 495919 188167 110368 450034 493966 358698 374508 298336 278624 75344 -133361
7044a33361j41322j7413K22848K44690J57191L5331l58764o9352J10961n4998
$$ -133361 -274683 -292096 -69248 175442 332633 367964 9200 -60152 50809 -4189
7034d189j95507r5162k1292j69421p5460J03347R3676Q6046J30083O0408J54625
$$ -4189 -199696 -294858 -316150 -485571 -561031 -457684 -364008 -277962 -147879 -87471 67154
7023F7154K14558J5765k95659K1551P932j47428j59428K4954P6257j70197J02327
$$ 67154 281712 297477 1818 23369 31301 -116127 -275555 -250601 -174344 -344541 -242214
7012b42214K65859K61246Q426k8438l02592q3506j41627K3872k9673k11875k2897
$$ -242214 23645 284891 293317 264879 -37713 -121219 -262846 -238974 -268647 -480522 -503419
7001e03419J45493N67302r3826L1897j02342j25372j80823J14001J39891k23552
$$ -503419 -357926 209376 115550 147447 45105 -80267 -261090 -147089 -7198 -230750
6991b30750J70498k85250J08379J70943M5433j01951m8656q8450K57341N4840
$$ -230750 -60252 -345502 -237123 -66180 -20747 -122698 -171354 -259804 -2463 52377
6981E2377J58548j30823J14030k94454J24168K01058p2861m6829l70422k87184
$$ 52377 210925 80102 194132 -100322 23846 224904 152043 105214 -265208 -552392
6971e52392L9530k5947J29509J89415J04307q2423k3402o3367j25628j70220j1825
$$ -552392 -512862 -538809 -409300 -219885 -115578 -198001 -221403 -284770 -410398 -580618 -592443
6960e92443P9249K00275K96379k03878K80119J00541j31009M5763O2477P7235
$$ -592443 -513194 -312919 -16540 -220418 59701 160242 29233 74996 137473 214708
6950B14708k41378J54388K00938q5807j14453N0206L66958K36051l91907k35659
$$ 214708 -26670 127718 328656 242849 128396 178602 545560 781611 389704 154045
6940A54045k27966k69213j86368J17501K57959L7382q1005p8621R8879q6609K55649
$$ 154045 -73921 -343134 -529502 -412001 -154042 -116660 -197665 -276286 -177407 -264016 -8367
6929h367q0092J48414k59885R974K96757k53751o6555L03326J72871j10274j93772
$$ -8367 -88459 59955 -199930 -189956 106801 -146950 -213505 89821 262692 152418 -41354
6918d1354P3500j74944K76186J38569l2649j11164k26537J9715J51628q1776j16896
$$ -41354 32146 -142798 133388 271957 239308 128144 -98393 -78678 72950 -8826 -125722
6907a25722P3973l1972q9148J82072j86113j19660j28688K59628N098j6711j14923
$$ -125722 -51749 -83721 -172869 9203 -176910 -296570 -425258 -165630 -160532 -177243 -292166
6896b92166J19882L3786L6936M34760l4434p3264o3201l54255K78784L11793Q2183
$$ -292166 -172284 -138498 -101562 333198 298764 225500 162299 -191956 86828 398621 480804
6885D80804n451j124j81537k64616K1945k17853q8391R8894l3137k72785P0506
$$ 480804 475353 474229 292692 28076 50021 -167832 -256223 -157329 -190466 -463251 -392745
6874c92745j90138P071L66027J23392N15668j94792k43836j17048K9154J15425
$$ -392745 -582883 -575812 -209785 -86393 429275 234483 -9353 -126401 -97247 18178
6864A8178j3300R1387J9442j07458N2223J19458O9607J76757P77J257P2678m44514
$$ 18178 4878 96265 115707 8249 60472 179930 249537 426294 427071 428328 501006 56492
6852E6492j38564j4014J20701L55187J44585k19055j54531N9071L29628q6550
$$ 56492 -82072 -96086 24615 379802 524387 305332 150801 209872 539500 452950
6842D52950q802l598J81081Q6556m21633k41817j29297k84301p2466N598O2601
$$ 452950 444148 440550 621631 708187 286554 44737 -84560 -368861 -441327 -435729 -373128
6831c73128J40816L64343K97702j47153j27520L45157o7933k80831K11971J94039
$$ -373128 -232312 132031 429733 282580 155060 500217 432284 151453 363424 557463
6821E57463j27744m03325j17440O11461J82716o2586l66077L16914K51290j42428
$$ 557463 429719 26394 -91046 520415 703131 640545 274468 591382 842672 700244
6811G00244l00960k89675J11128M0829k24978k5840N0714r6992j30146Q886O4521
$$ 700244 399284 109609 220737 261566 36588 10748 61462 -35530 -165676 -156790 -92269
6800i2269j34496J37988L10121J05362L0872l7063J69737L42520l19535k31392
$$ -92269 -226765 -88777 221344 326706 357578 320515 490252 832772 513237 281845
6790B81845O9857k08011k44068K5279P7724L17334J68984q0192k16453J46222
$$ 281845 351702 143691 -100377 -75098 2626 319960 488944 408752 192299 338521
6780C38521j78795k09750m2507M6688L6933l13384J03799J50222K21206q4378
$$ 338521 159726 -50024 -92531 -45843 -8910 -322294 -218495 -68273 152933 68555
6770F8555J36255K78368k40876j47158J1997J87437P0950J40224l03490o5618
$$ 68555 204810 483178 242302 95144 107141 294578 365528 505752 202262 136644
6760A36644P5966j00922m17126j1065M65671K25408l499m3381j32142J02593K24338
$$ 136644 212610 111688 -305438 -316503 149168 374576 371077 327696 195554 298147 522485
6749E22485l39163M3465j35069J18021R5074q7493l86418l0390K02949p4208K85926
$$ 522485 183322 226787 91718 209739 304813 217320 -169098 -199488 3461 -70747 215179
6738B15179j17099m82444j41795M46879K64780R6790p8651j6488R7633J1193o4637
$$ 215179 98080 -384364 -526159 -79280 185500 282290 203639 187151 284784 295977 231340
6727B31340P9143M8922l5623L83346r3023l26694k71103k20553L8013k2537j57088
$$ 231340 310483 359405 323782 707128 614105 287411 16308 -204245 -166232 -188769 -345857
6716c45857l5735J84749K91574J22677N7004J75543J0282j60984k98808j03760
$$ -345857 -381592 -196843 94731 217408 274412 449955 460237 299253 445 -103315
6706a03315K98447K24898j39065j56856O2089j49322k19646M8038J51203J67237
$$ -103315 195132 420030 280965 124109 186198 36876 -182770 -134732 16471 183708
6696A83708O7895K26419k09867o7635j2154j29915k3062K2719R5872K9603q1916
$$ 183708 251603 478022 268155 200520 188366 58451 35389 58108 153980 183583 101667
6685A01667j6936k01779J1621J06730k86405K17973L29079J30984k80210J5716
$$ 101667 84731 -117048 -105427 1303 -285102 -67129 261950 392934 112724 128440
6675A28440j29484J37759j8606J90686J86408M4096k16015k75039k81562k89394
$$ 128440 -1044 136715 118109 308795 495203 539299 323284 48245 -233317 -522711
6665e22711J10010K19986j3350j17677J97895k69385J35576R0262l6306J37285
$$ -522711 -412701 -192715 -206065 -323742 -125847 -395232 -259656 -169394 -205700 -68415
6655f8415J03324l16711J32508P3127j99249K80168L34075r408j92874n4307j52286
$$ -68415 34909 -281802 -149294 -76167 -275416 4752 338827 329419 136545 82238 -70048
6644g0048l12984j96225L55875J44219M03393M06454j90632l28492j4042r2802
$$ -70048 -383032 -579257 -223382 -79163 324230 730684 540052 211560 197518 104716
6634A04716j46468k04137K03224k44974k62679L40604J66270j21682j35235O0921
$$ 104716 -41752 -245889 -42665 -287639 -550318 -209714 -43444 -165126 -300361 -239440
6624b39440L81803K16533o2797P9121j17634L6737J58622l12222Q5506K58534
$$ -239440 142363 358896 296099 375220 257586 294323 452945 140723 226229 484763
6614D84763L8528M23494J09234k25586r0353J26107j43333m24157m06132J71550
$$ 484763 523291 946785 1056019 830433 740080 866187 722854 298697 -107435 64115
6604F4115j37067l33995q1952K33626l9041j48833K56458J04853q2448m7996k40575
$$ 64115 -72952 -406947 -488899 -255273 -294314 -443147 -186689 -81836 -164284 -212280 -452855
6593d52855L3282L04240q070K39663J42521l86973j74523J1654J11217j01743
$$ -452855 -419573 -115333 -123403 116260 258781 -128192 -302715 -291061 -179844 -281587
6583b81587K16042M04049j97665k19190P8772j23208Q8353P1165r2968J20534
$$ -281587 -65545 338504 140839 -78351 421 -122787 -34434 36731 -56237 64297
6573F4297k40470q0466K06094J36952j46828j1317J72689l0572l54161j00780
$$ 64297 -176173 -256639 -50545 86407 -60421 -71738 100951 70379 -283782 -384562
6563c84562J97385J52071l3800j26117o9584K7767k33395j74092K82714J55342
$$ -384562 -187177 -35106 -68906 -195023 -264607 -236840 -470235 -644327 -361613 -206271
6553b06271K13190k89910J657J80080K85710k0350k54417L93548L886o4082K45766
$$ -206271 6919 -282991 -281334 -101254 184456 164106 -90311 303237 307123 243041 488807
6542D88807K76963j31684l51696k99049n1420J3241R3625j54262Q5287k13306
$$ 488807 765770 634086 282390 -16659 -68079 -54838 38787 -115475 -30188 -243494
6532b43494o6882Q0481L27716J21540j57928j97723r7205J36508q1362K62046
$$ -243494 -310376 -229895 97821 219361 61433 -136290 -233495 -96987 -178349 83697
6522H3697M00116k61636j01862M04168j30144j70077R0342k36914j60275J3811
$$ 83697 483813 222177 120315 524483 394339 224262 314604 77690 -82585 -68774
6512f8774q3593j02493p5739q0245J96191K2109J68237j36234k3563R407k81871
$$ -68774 -152367 -254860 -330599 -410844 -214653 -192544 -24307 -160541 -184104 -174697 -456568
6501d56568j91772p9374K09871K11730j03029m7515k92696J64357K47521N9761
$$ -456568 -648340 -727714 -517843 -306113 -409142 -456657 -749353 -584996 -337475 -277714
6491b77714J5283L065J75801k6029j28387j73080R3969K43013L55083J30598j8348
$$ -277714 -262431 -259366 -83565 -109594 -237981 -411061 -317092 -74079 281004 411602 393254
6480C93254K19804Q6714l47167j30770j71870j0506k04572l02724r6053K84030
$$ 393254 613058 699772 352605 221835 49965 39459 -165113 -467837 -563890 -279860
6470b79860L16360L89686L6854o9454m78540j43512J79451J75258J2941J49009
$$ -279860 36500 426186 463040 393586 -84954 -228466 -49015 126243 139184 288193
6460B88193L59653j30817j683O0106k50109m57419J76372Q7892K11017K36673
$$ 288193 647846 517029 515346 575452 325343 -132076 44296 132188 343205 579878
6450E79878L10345j45j25986J15566n6798l75039J3362L09324o2974m42199m89375
$$ 579878 890223 890078 764092 879658 822860 447821 461183 770507 707533 265334 -224041
6439b24041N946K35854K51449M50624K69230l11673l94887M39348j99393l81887
$$ -224041 -218095 17759 269208 719832 989062 677389 282502 721850 522457 140570
6429A40570j48426j41505k64132K15779L49614k1003R223m50622j66358k28532
$$ 140570 -7856 -149361 -413493 -197714 151900 130897 140120 -310502 -476860 -705392
6419g05392O6518N67497J62995k01925j69873l09165K41331K83610l93685r6766
$$ -705392 -638874 -71377 91618 -110307 -280180 -589345 -348014 -64404 -458089 -554855
6409e54855N00447L92036j85475k80057p3704K80272K83870o5110l10788R3356
$$ -554855 -54408 337628 152153 -127904 -201608 78664 362534 297424 -13364 79992
6399G9992K89258J7463j24823k64713L41109P895K61083L05882j21259j41105
$$ 79992 369250 386713 261890 -2823 338286 346181 607264 913146 791887 650782
6389F50782k70655j65550o2672k46452r9105K93908M12850p4561l04461k85432
$$ 650782 380127 214577 151905 -94547 -193652 100256 513106 438545 134084 -151348
6379a51348j86753m12592j06492K44662O0999K37944J12081k31019K85780k02284
$$ -151348 -338101 -750693 -857185 -612523 -551524 -313580 -201499 -432518 -146738 -349022
6369c49022k50423M14166P6225J34952j36278k5457j42253K06350K61905l95696
$$ -349022 -599445 -185279 -109054 25898 -110380 -135837 -278090 -71740 190165 -205531
6359b05531n4842j30176J12046J48595j52836M2521O28352j66239k98489K40186
$$ -205531 -260373 -390549 -278503 -129908 -282744 -240223 388129 221890 -76599 163587
6349A63587K32304J28950k66401j93649j83848j75793K38973K49836l1250L6789
$$ 163587 395891 524841 258440 64791 -119057 -294850 -55877 193959 162709 199498
6339A99498l75049j90943k90829r5875K88197L48782J21109m4589l91776K10844
$$ 199498 -175551 -366494 -657323 -753198 -465001 -116219 4890 -39699 -431475 -220631
6329b20631K40142J21530k13176K4466K70656k4279k4727K4535K22741J64548
$$ -220631 19511 141041 -72135 -47669 222987 198708 173981 198516 421257 585805
6319E85805k46703j80608M8225K7951j41823N0743L11910j36102k97550J46907
$$ 585805 339102 158494 206719 234670 92847 143590 455500 319398 21848 168755
6309A68755k91847k84655K84578K88313L2110k12252O9933k9743j79617j51529
$$ 168755 -123092 -407747 -123169 165144 197254 -14998 54935 25192 -154425 -305954
6299c05954L6526L31931J74890J17957k28998k57323j32157r2220j13040n9747
$$ -305954 -269428 62503 237393 355350 126352 -130971 -263128 -355348 -468388 -528135
6289e28135K69207L65738J73405k8022j27279k05558j77900L14658r1394M5340
$$ -528135 -258928 106810 280215 252193 124914 -80644 -258544 56114 -35280 10060
6279A0060J82564J91309K0125j85018j13417k15114K30931M6141j87131k38125
$$ 10060 192624 383933 404058 219040 105623 -109491 121440 167581 -19550 -257675
6269b57675L2442K5716l84k1051J20868L1748j00766j18793j02983p287L06127
$$ -257675 -225233 -199517 -199901 -220952 -100084 -68336 -169102 -287895 -390878 -398165 -92038
6258i2038k04259n1451K99316M21836M72193o3320k59522k57540l3996J43397
$$ -92038 -296297 -347748 -48432 373404 845597 782277 522755 265215 231219 374616
6248C74616m2249J84894J39097n4144l86913k49462J74898n0757j97689k50446
$$ 374616 332367 517261 656358 602214 215301 -34161 140737 89980 -107709 -358155
6238c58155O5790N9051J43o9507J1711q2745Q0646J76353J06516M2476o0520q5309
$$ -358155 -292365 -233314 -233171 -302678 -290967 -373712 -293066 -116713 -10197 32279 -28241 -113550
6226a13550K85196L38049m13131l18550j02766l75951P5056J46097J30568N4552
$$ -113550 171646 509695 96564 -221986 -324752 -700703 -625647 -479550 -348982 -294430
6216b94430j21989k4262P6157J42961M785M6453q6595k78949J17233J70203N4119
$$ -294430 -416419 -440681 -364524 -221563 -216778 -170325 -256920 -535869 -418636 -248433 -194314
6205a94314n0540L84618n2563j99605n1808J32108j21509o9889j27780M41042
$$ -194314 -244854 139764 87201 -112404 -164212 -32104 -153613 -223502 -351282 89760
6195H9760J72140k52885r7266J03131K2017L29769O7163k81204o21950n05429
$$ 89760 261900 9015 -88251 14880 36897 366666 433829 152625 -469325 -974754
6185i74754O965J03449K54103K19300P0877n7073P8780Q3206J77707J27232N0185
$$ -974754 -967789 -864340 -610237 -390937 -320060 -377133 -298353 -215147 -37440 89792 139977
6174A39977N8763Q8171k10505k9980N5942K26749j30016n0337j6096j1146o6296
$$ 139977 198740 286911 76406 46426 102368 329117 199101 148764 132668 121522 55226
6163E5226J36679n6472r8371j58202K32507J23208J01567k27791l28059J53821
$$ 55226 191905 135433 37062 -121140 111367 234575 336142 108351 -219708 -65887
6153f5887k63024l13369j45321L1165L13721L15237J49318J1758k25970J62601
$$ -65887 -328911 -642280 -787601 -756436 -442715 -127478 21840 33598 -192372 -29771
6143b9771K54404m1071p1197Q7955o6313j61625J56786Q5838o6882l93638J5846
$$ -29771 224633 183562 112365 200320 134007 -27618 129168 215006 148124 -245514 -229668
6132b29668m4447J5046O1100j76093k50380J45936O42084L42644J09382n5839
$$ -229668 -274115 -259069 -197969 -374062 -624442 -478506 163578 506222 615604 559765
6122E59765j32852j17364o9397L19355j45101k89922J8605J6966L55605J64834
$$ 559765 426913 309549 240152 559507 414406 124484 143089 160055 515660 680494
6112F80494j50826j09697k94691J24492j30891j94477N03027K38493K9221K7939
$$ 680494 529668 419971 125280 249772 118881 -75596 427431 665924 695145 723084
6102G23084m24690M0920K37266k60179m36108L6703j89804q2384Q7434J39937
$$ 723084 298394 339314 576580 316401 -119707 -83004 -272808 -355192 -267758 -127821
6092a27821k15079L34490K1563p81924L03057K11564O1899K41988J10413K26257
$$ -127821 -342900 -8410 13153 -768771 -465714 -254150 -192251 49737 160150 386407
6082C86407K03944o1476m55162l9389O903M9711K02942q3468J67011j81136J08574
$$ 386407 590351 528875 73713 34324 41227 90938 293880 210412 377423 196287 304861
6071C04861m516n8554J63822k42338K59252J77426k41311n2557N5728R9736l99519
$$ 304861 300345 241791 405613 163275 422527 599953 358642 306085 361813 461549 62030
6060F2030j56717J30466L3129k98092j33131K11524O6843J12053N0966p1297l09644
$$ 62030 -94687 35779 68908 -229184 -362315 -150791 -83948 28105 79071 7774 -301870
6049c01870l0507J96337L8268j86043J56794L2320K71347J49951j82675r9718
$$ -301870 -332377 -136040 -97772 -283815 -127021 -94701 176646 326597 143922 44204
6039D4204Q797j41449l9900J66179K00286l70338J36225J98790k02613j07363
$$ 44204 53001 -88448 -128348 37831 238117 -132221 4004 202794 181 -107182
6029a07182O1344l04473k13208O3974j8705J39801K7689J65971K14831n3820J92345
$$ -107182 -45838 -350311 -563519 -499545 -518250 -378449 -350760 -184789 30042 -23778 168567
6018A68567K44290j6691K9545k0620o8320q7137j51767K21570l44428l68609M8583
$$ 168567 412857 396166 425711 405091 336771 249634 97867 319437 -24991 -393600 -345017
6007c45017J87680M18629K08437k15399m6408l3604o1949j19300J01535l8459
$$ -345017 -157337 261292 469729 254330 207922 174318 112369 -6931 94604 56145
5997E6145J4496m55596j36009L85790J09143m8753L41969j1068J16942j48000
$$ 56145 70641 -384955 -520964 -135174 -26031 -74784 267185 256117 373059 225059
5987B25059m56657L7196K32660k4675k61466J10324J24345j83096L0231j76327
$$ 225059 -231598 -194402 38258 13583 -247883 -137559 -13214 -196310 -166079 -342406
5977c42406J36324J86338J55339K09665r0029k70487L25389Q1960j02914Q8894
$$ -342406 -206082 -19744 135595 345260 255231 -15256 310133 392093 289179 378073
5967C78073q8559o61017j42630M67895k0864L83686K46832N4654j49915l48167
$$ 378073 289514 -371503 -514133 -46238 -67102 316584 563416 618070 468155 119988
5957A19988n6052J5501k08198r705J71832j24619J64637J38453o2286R6277l07925
$$ 119988 63936 79437 -128761 -138466 33366 -91253 73384 211837 149551 245828 -62097
5946f2097j04811j15975L09844K50005O7043K23518r0458l60885k11913k23919
$$ -62097 -166908 -282883 26961 276966 344009 567527 477069 116184 -95729 -319648
5936c19648l62887O34163M18420O1248j88279j11845p2915J44141j61795J95710
$$ -319648 -682535 -48372 370048 431296 243017 131172 58257 202398 40603 236313
5926B36313K81520j81130m26488p5955j07891k55254K1347O6740K15530O7729
$$ 236313 517833 336703 -89785 -165740 -273631 -528885 -507538 -440798 -225268 -157539
5916a57539O9789L88105J23653j33477p1996J73811M3976K17050l5657k32448
$$ -157539 -87750 300355 424008 290531 218535 392346 436322 653372 617715 385267
5906C85267k86330k58416j48223j10155J57478m0481l89426J99090M12481j26638
$$ 385267 98937 -159479 -307702 -417857 -260379 -300860 -690286 -491196 -78715 -205353
5896b05353j01001K3786Q1179L88775j59304K8768K7792j76921j0525K82718O0771
$$ -205353 -306354 -282568 -201389 187386 28082 56850 84642 -92279 -102804 179914 240685
5885B40685n6369L9765j23339q4625l24892L69399J83961l3637m4703j47238Q7225
$$ 240685 184316 224081 100742 16117 -308775 60624 244585 210948 166245 19007 106232
5874A06232J81329K19771J19261l97500o4779L29018q0122k36999M6468j86307
$$ 106232 287561 507332 626593 229093 164314 493332 413210 176211 222679 36372
5864C6372k36166j839l7876r6962R2856J53139M30094K5335l07595L2082k9792
$$ 36372 -199794 -201633 -239509 -336471 -243615 -90476 339618 364953 57358 89440 59648
5853E9648p0901P4338K74016J4301r799O6299l69025m89007j79353L85659L39679
$$ 59648 -11253 63085 337101 351402 341603 407902 38877 -450130 -629483 -243824 95855
5842I5855K19877J23729J54825M28606l8686l37074m0134k73312j61223j06140
$$ 95855 315732 439461 594286 1022892 984206 647132 606998 333686 172463 66323
5832F6323J68872J72033J37767J78580k27653j40407j78368k71663O7169J13898
$$ 66323 235195 407228 544995 723575 495922 355515 177147 -94516 -27347 86551
5822H6551L44691m7292l8250j65957k16546l42691L36151O0057K89274R750l02047
$$ 86551 431242 383950 345700 179743 -36803 -379494 -43343 16714 305988 315738 13691
5811A3691J15949o1101O0234k68395j55241m8289J56220Q2888K20722m8423J56347
$$ 13691 129640 68539 128773 -139622 -294863 -343152 -186932 -104044 116678 68255 224602
5800B24602P380l94845j52698J29985K5588L07838L2978m52269Q93L2181k29590
$$ 224602 231982 -162863 -315561 -185576 -159988 147850 180828 -271441 -270548 -238367 -467957
5789d67957J02517L75797J83354k36536K7448l09846K65580M96086o0516l81454
$$ -467957 -365440 10357 193711 -42825 -15377 -325223 -59643 436443 375927 -5527
5779e527j00138N7626K69188J63579j3986j15041J9701j69014j47516J42743L31636
$$ -5527 -105665 -48039 221149 384728 370742 255701 275402 106388 -41128 101615 433251
5768D33251K09492o9185k29881j9050j9645R214J27932l1560k39972m6215j17938
$$ 433251 642743 573558 343677 324627 304982 314196 442128 410568 170596 124381 6443
5757F443m2520L67954K48051j48096j23957m11197q0427n7664j34850L1124K13037
$$ 6443 -36077 331877 579928 431832 307875 -103322 -183749 -241413 -376263 -345139 -132102
5746a32102L9440j57564N96360K27775j52911k76435l3763P3291o260j90621l6284
$$ -132102 -92662 -250226 346134 573909 420998 144563 110800 184091 177831 -12790 -49074
5735d9074K61355J26791O3733j2545r5379j64574L01540K9217K0857k92627m74526
$$ -49074 212281 339072 402805 390260 294881 130307 431847 461064 481921 189294 -285232
5724b85232N4162M16175L09065M2596k95437m50824j12681L8934j67062K5926
$$ -285232 -231070 185105 494170 536766 241329 -209495 -322176 -283242 -450304 -424378
5714d24378K97182K44684M62156j52859k88666k78426R1496j62522J60214O3009
$$ -424378 -127196 117488 579644 426785 138119 -140307 -48811 -211333 -51119 11890
5704A1890M5694J74045K14712r8340l6469l71091M5083J76085k40266l26684j01500
$$ 11890 57584 231629 446341 348001 311532 -59559 -14476 161609 -78657 -405341 -506841
5693e06841M06219J53753j27104j52417j34126M78024J61191j638Q2994k36855
$$ -506841 -100622 53131 -73973 -226390 -360516 117508 278699 277061 360055 123200
5683A23200k08729J48443R2713j80865j97163j49007J37820M34438L40564k79517
$$ 123200 -85529 62914 155627 -25238 -222401 -371408 -233588 200850 541414 261897
5673B61897j83051L2423j31742l99655J04673J00864K02935J2822N5858m35862
$$ 261897 78846 111269 -20473 -420128 -315455 -214591 -11656 1166 57024 -378838
5663c78838l60922J47652K72229L45678r7318O9827o1419l50001r4297N29414
$$ -378838 -739760 -592108 -319879 25799 -71519 -1692 -63111 -413112 -507409 22005
5653B2005L90601R9607n3711M3569J0505j56137m57633k9249k16853j17323J37080
$$ 22005 412606 512213 458502 502071 512576 356439 -101194 -130443 -347296 -464619 -327539
5642c27539r755K60612Q016K61759K94187l00177O1626K14780m21679m45958O6714
$$ -327539 -337294 -76682 -68666 193093 487280 187103 248729 463509 41830 -404128 -337414
5631c37414N53123K38115N4990k59159l43242J5493l8478n194N9174J99079J61923
$$ -337414 215709 453824 508814 249655 -93587 -78094 -116572 -121766 -62592 136487 298410
5620B98410J25052k0631j59440o7307J971o1937q5820o4337k7549j3300J40502
$$ 298410 423462 402831 243391 176084 178055 116118 30298 -34039 -61588 -74888 65614
5609F5614K71519J19792j6814j44741q6713O6496K09505l1312n49125l45345K71328
$$ 65614 337133 456925 440111 295370 208657 275153 484658 453346 -95779 -441124 -169796
5598a69796l08781M7523L76919k7510k21413M0644k31362J26066M64606J1934
$$ -169796 -478577 -431054 -54135 -81645 -303058 -262414 -493776 -367710 96896 108830
5588A08830j84687J36711N8915J96251m2349k65327j00600J14115k20606j782
$$ 108830 -75857 60854 119769 316020 273671 8344 -92256 21859 -198747 -200529
5578b00529O10652J28606l34511k05797k33354J08071k09557j40540J42828P4414
$$ -200529 410123 538729 204218 -1579 -234933 -126862 -336419 -476959 -334131 -259717
5568b59717L50914K48190P9735K1193j46418j5022p0004k94003r8916L59395M0901
$$ -259717 91197 339387 419122 440315 293897 278875 208871 -85132 -184048 175347 216248
5557B16248p5575Q3242k96983j97733L34966M0251j71662L04830J67521M7152
$$ 216248 140673 223915 -73068 -270801 64165 104416 -67246 237584 405105 452257
5547D52257J30058l9242m09852l37517l97839k8589K41357K7556L04655K38162
$$ 452257 582315 543073 133221 -204296 -602135 -630724 -389367 -361811 -57156 181006
5537A81006M4463L88481J80151j33382m07971n1633k85699j05282K41513n9053
$$ 181006 225469 613950 794101 660719 252748 201115 -84584 -189866 51647 -7406
5527g406P8184r2726k65938l25725K68296L76018J96204J79517Q7935l24385n31909
$$ -7406 70778 -21948 -287886 -613611 -345315 30703 226907 406424 494359 169974 -361935
5516c61935J5824K95087n9488K99374J39526r0657p0412K15027k2429k75151O5054
$$ -361935 -346111 -51024 -110512 188862 328388 237731 167319 382346 359917 84766 149820
$$ [...]
##END NTUPLES=NMR SPECTRUM
##END=
