##TITLE=Analysis number 329104
Compound Code cc 11702
Book Reference 513/109/27
Project Code adrs
Chemist Name ronp
##JCAMPDX= 6.0         $$ Bruker NMR JCAMP-DX V2.0
##DATA TYPE= NMR SPECTRUM
##DATA CLASS= NTUPLES
##ORIGIN= Bruker BioSpin GmbH
##OWNER= nmr
$$ XWIN-NMR		Version 3.5
$$ Thu Aug  2 09:06:14 2007 GMT Daylight Time (UT+1h)  MAYBRIDGE\nmr@NMR_250MHZ
##.OBSERVE FREQUENCY= 250.131544655141
##.OBSERVE NUCLEUS= ^1H
##.ACQUISITION MODE= SIMULTANEOUS (DQD)
##.ACQUISITION SCHEME= undefined
##.AVERAGES= 16
##.DIGITISER RES= 18
##SPECTROMETER/DATA SYSTEM= dpx250
##.PULSE SEQUENCE= zg30
##.SOLVENT NAME= CDCl3
##.SHIFT REFERENCE= (INTERNAL, CDCl3, 0, 16.4532)
##AUDIT TRAIL= $$ (NUMBER, WHEN, WHO, WHERE, WHAT)
$$ ##TITLE= Audit trail, XWIN-NMR		Version 3.5
$$ ##JCAMPDX= 5.01
$$ ##ORIGIN= Bruker BioSpin GmbH
$$ ##OWNER= nmr
$$ C:\u/data/dgb/nmr/ADRS/70/pdata/1/auditp.txt
$$ ##AUDIT TRAIL=  $$ (NUMBER, WHEN, WHO, WHERE, WHAT)
(   1,<2007-08-02 09:05:43.70 +100>,<MAYBRIDGE\nmr>,<NMR_250MHZ>,
      <created by zg, POWCHK disabled, PULCHK disabled
       configuration hash MD5:
       76 6E 9A 78 1E 09 19 81 EC 84 63 8F B0 6A 59 2D
       data hash MD5: 64K
       38 0F 91 22 70 62 86 98 6C 24 77 80 F9 E9 3A 3B>)
(   2,<2007-08-02 09:06:02.17 +100>,<MAYBRIDGE\nmr>,<NMR_250MHZ>,
      <Start of raw data processing
       ef LB = 0.3 FT_mod = 6 PKNL = 1 SI = 32K 
       data hash MD5: 32K
       C3 DB ED D3 F7 94 FD 7E EE C8 39 E3 24 7E 4A 03>)
(   3,<2007-08-02 09:06:04.47 +100>,<MAYBRIDGE\nmr>,<NMR_250MHZ>,
      <apk 
       data hash MD5: 32K
       CF 65 80 B5 09 09 15 56 60 4F 61 FA FB 2C 32 0B>)
(   4,<2007-08-02 09:06:05.67 +100>,<MAYBRIDGE\nmr>,<NMR_250MHZ>,
      <abs ABSG = 5 
       data hash MD5: 32K
       34 18 CE 71 E4 00 88 B4 6A 1B A5 E0 1C 3D 15 7D>)
$$ ##END=
$$ 
$$ hash MD5
$$ 6E 8C F3 11 71 27 4C F3 60 C0 C9 E9 16 25 B2 52
##$RELAX= 
##$RELAX= 
##$RELAX= 
##$RELAX= 
##$RELAX= 
##$RELAX= 
##$RELAX= 
$$ Bruker specific parameters
$$ --------------------------
##$DU= <C:\u>
##$EXPNO= 70
##$NAME= <ADRS>
##$PROCNO= 1
##$TYPE= <nmr>
##$USER= <dgb>
##$AMP= (0..31)
100 100 100 100 100 100 100 100 100 100 100 100 100 100 100 100 100 100 
100 100 100 100 100 100 100 100 100 100 100 100 100 100 
##$AQSEQ= 0
##$AQ_mod= 3
##$AUNM= <au_zg>
##$AUTOPOS= <56 >
##$BF1= 250.13
##$BF2= 250.13
##$BF3= 250.13
##$BF4= 250.13
##$BF5= 500.13
##$BF6= 500.13
##$BF7= 500.13
##$BF8= 500.13
##$BYTORDA= 1
##$CFDGTYP= 0
##$CFRGTYP= 5
##$CHEMSTR= <none>
##$CNST= (0..31)
1 1 145 1 1 1 1 1 1 1 1 1 1 1 1 1 1 1 1 1 1 1 1 1 1 1 1 1 1 1 1 1 
##$CPDPRG= <>
##$CPDPRG1= <>
##$CPDPRG2= <>
##$CPDPRG3= <>
##$CPDPRG4= <mlev>
##$CPDPRG5= <mlev>
##$CPDPRG6= <mlev>
##$CPDPRG7= <mlev>
##$CPDPRG8= <mlev>
##$CPDPRGB= <>
##$CPDPRGT= <>
##$D= (0..31)
0 1 0 0 0 0 0 0 0 0.06 0 0 0 0 0 0 0.0002 0 0 0 0 0 0 0 0 0 0 0 0 0 0 
0 
##$DATE= 1186041940
##$DBL= (0..7)
120 120 120 120 120 120 120 120 
##$DBP= (0..7)
150 150 150 150 150 150 150 150 
##$DBP07= 0
##$DBPNAM0= <>
##$DBPNAM1= <>
$$ [...]
##$SUBNAM7= <"">
##$SUBNAM8= <"">
##$SUBNAM9= <"">
##$SW= 20.6930455092707
##$SWIBOX= (0..15)
0 0 3 0 0 0 0 0 0 0 0 0 0 0 0 0 
##$SW_h= 5175.983436853
##$TD= 65536
##$TD0= 1
##$TE= 297.16
##$TE2= 300
##$TE3= 300
##$TEG= 300
##$TL= (0..7)
0 120 120 120 120 120 120 120 
##$TP= (0..7)
150 150 150 150 150 150 150 150 
##$TP07= 0
##$TPNAME0= <>
##$TPNAME1= <>
##$TPNAME2= <>
##$TPNAME3= <>
##$TPNAME4= <>
##$TPNAME5= <>
##$TPNAME6= <>
##$TPNAME7= <>
##$TPOAL= (0..7)
0.5 0.5 0.5 0.5 0.5 0.5 0.5 0.5 
##$TPOFFS= (0..7)
0 0 0 0 0 0 0 0 
##$TUNHIN= 0
##$TUNHOUT= 0
##$TUNXOUT= 0
##$USERA1= <user>
##$USERA2= <user>
##$USERA3= <user>
##$USERA4= <user>
##$USERA5= <user>
##$V9= 5
##$VALIST= <valist>
##$VCLIST= <CCCCCCCCCCCCCCC>
##$VD= 0
##$VDLIST= <DDDDDDDDDDDDDDD>
##$VPLIST= <PPPPPPPPPPPPPPP>
##$VTLIST= <TTTTTTTTTTTTTTT>
##$WBST= 1024
##$WBSW= 4
##$XGAIN= (0..3)
0 0 0 0 
##$XL= 0
##$YL= 0
##$YMAX_a= 300778
##$YMIN_a= -222076
##$ZGOPTNS= <>
##$ZL1= 120
##$ZL2= 120
##$ZL3= 120
##$ZL4= 120
##$ABSF1= 16.45319
##$ABSF2= -4.239983
##$ABSG= 5
##$ABSL= 3
##$ALPHA= 0
##$AQORDER= 0
##$ASSFAC= 0
##$ASSFACI= 0
##$ASSFACX= 0
##$ASSWID= 0
##$AUNMP= <proc_1d>
##$AZFE= 0.1
##$AZFW= 0.1
##$BCFW= 0
##$BC_mod= 0
##$BYTORDP= 0
##$COROFFS= 0
##$CY= 12.5
##$DATMOD= 1
##$DC= 0
##$DFILT= <>
##$DTYPP= 0
##$F1P= 14.0000005364418
##$F2P= -0.99999901652339
##$FCOR= 0.5
##$FTSIZE= 32768
##$FT_mod= 6
##$GAMMA= 0
##$GB= 0
##$INTBC= 1
##$INTSCL= 1
##$ISEN= 128
##$LB= 0.3
##$LEV0= 0
##$LPBIN= 0
##$MAXI= 10000
##$MC2= 0
##$MEAN= 0
##$ME_mod= 0
##$MI= 0
##$NCOEF= 0
##$NC_proc= -4
##$NLEV= 6
##$NOISF1= 0
##$NOISF2= 0
##$NSP= 0
##$NTH_PI= 0
##$NZP= 0
##$OFFSET= 16.45319
##$PC= 1
##$PHC0= -44.06644
##$PHC1= 8.298046
##$PH_mod= 1
##$PKNL= yes
##$PPARMOD= 0
##$PSCAL= 4
##$PSIGN= 0
##$REVERSE= no
##$SF= 250.130017211036
##$SI= 32768
##$SIGF1= 0
##$SIGF2= 0
##$SINO= 400
##$SIOLD= 32768
##$SREGLST= <1H.CDCl3>
##$SSB= 0
##$STSI= 32768
##$STSR= 0
##$SW_p= 5175.98343685301
##$SYMM= 0
##$S_DEV= 0
##$TDeff= 65536
##$TDoff= 0
##$TI= <Analysis number 999999
Compound Code 99
Book Reference 9
Project Code 9>
##$TILT= no
##$TM1= 0
##$TM2= 0
##$TOPLEV= 0
##$USERP1= <user>
##$USERP2= <user>
##$USERP3= <user>
##$USERP4= <user>
##$USERP5= <user>
##$WDW= 1
##$XDIM= 32768
##$YMAX_p= 441068213
##$YMIN_p= -420995
$$ End of Bruker specific parameters
$$ ---------------------------------
##NTUPLES= NMR SPECTRUM
##VAR_NAME=  FREQUENCY,     SPECTRUM/REAL,   SPECTRUM/IMAG
##SYMBOL=    X,             R,               I
##VAR_TYPE=  INDEPENDENT,   DEPENDENT,       DEPENDENT
##VAR_FORM=  AFFN,          ASDF,            ASDF
##VAR_DIM=   32768,         32768,           32768
##UNITS=     HZ,            ARBITRARY UNITS, ARBITRARY UNITS
##FACTOR=    0.157963299565203, 1,           1
##FIRST=     4115.4366603203, 0,             0
##LAST=      -1060.54677653271, 0,           0
##MIN=       -1060.54677653271, -420995,     0
##MAX=       4115.4366603203, 441068213,     0
$$ Real data points
##PAGE= N=1
##DATA TABLE= (X++(R..R)), XYDATA
$$ [...]
26415h9317L6888p8147q2289k9019Q372J23029J06110J02727R691j08410K7410
26404B7045M8045J9850o1327j90415m2372q3288j1670R1758N4751j6253M9840
26393a14036k5605O9371p510M2489L1878Q8776J38362J5547O3850j00942j52090
26382E0090j63775K3081N6214j01410M621J08941L4678n2341O9693O1118q6849
26371D061J3549P1212j06680j3281Q239P5107J08276o0524j20568R9022O1738
26360A40151q4558K6682J14406M4423m0395L697k9519p6384r2641L6442P180q6072
26348c6588L2778R2895n9098j09360N5538L9473M1188n6762O377J0089l504p3620
26336f0594o4765O3852J02908m750q3360j1581o8771j0952l0094K1866K92Q4643
$$ y = [-89317, -52429, -130576, -212865, -241884, -233512, -110483, -4373, 98354, 108045, -365, 27045, 75090, 94940, 33613, -156802, -199174, -282462, -294132, -202374, -147623, -163876, -114036, -139641, -70270, -77780, -35291, -3413, 85363, 223725, 239272, 303122, 202180, 50090, -113685, -90604, -34390, -135800, -131179, -22238, 12440, -39901, 29792, 90910, 4061, 17610, 88822, -17858, -31139, -22900, 52207, 160483, 99959, -20609, 78413, 140151, 55593, 82275, 196681, 241104, 200709, 204406, 174887, 98503, 5862, 42304, 49484, -36588, -3810, 89085, 29987, -79373, -23835, 15638, 56826, 64, 6441, 16530, 13026, -60594, -125359, -61507, 41401, 36651, -46709, -58290, -127061, -138013, -168107, -146241, -145949, -61306]
26324f1306n3287l359J00249J29641o960k3674j4945J0011o052J6550n5309j91049
26312a59490n4122P859J34856R7874N9373p4958q3350j112O062j9202n3797O8386
26300g1621K2248q204k3619N0869L4236K5109l1018r8354K4442R4332N2467K5629
26288I6516o1520j36838n2015Q0518P6209O2884m5010j17970K637O8426M2958
26277A6795k2316j1896N9949N6368M7285j08055j36799o2816M6081J2557J9916
26266h2931r8205j13299J58537J74528Q412l2894K31J0958p0096j8849M3940l3615
26254e3283j8177o040J18709L0411o006j07822q9001L4392O2226N2449j5443L7049
26242C9464p1396N4670q758o0107K8953l2400Q8833N5323j06970L7885l2534p3635
$$ y = [-61306, -114593, -117952, -17703, 111938, 104978, 81304, 66359, 76370, 70318, 86868, 31559, -159490, -213612, -205753, -70897, 26977, 86350, 11392, -71958, -73070, -67008, -86210, -140007, -71621, -49373, -57577, -81196, -30327, 3909, 29018, -2000, -100354, -75912, 18420, 70887, 96516, 34996, -101842, -153857, -73339, 2870, 65754, 20744, -97226, -94589, -26163, 16795, -5521, -17417, 42532, 98900, 146185, 38130, -98669, -161485, -115404, -102847, -82931, -181136, -294435, -135898, 38630, 47042, 14148, 14379, 25337, -44759, -63608, -19668, -53283, -71460, -77500, 41209, 71620, 65614, -42208, -131209, -96817, -34591, 17858, 2415, 39464, -31932, 22738, 13980, -46127, -17174, -49574, 39259, 94582, -12388, 25497, -7037, -80672]
26230h0672M0174q650l4099K6279J8634j02790Q6662L2127j7247M9688j9297o7320
26218g6511m4648p967P3606J09893l1514p6201m7139J35982R7508N1937M1026
26207B25972m8652n8766l003m3405K2724Q4018J6062q2291J993k0883J2704k2132
26195H4341l3849m6606k6709l1984o4312J0660M2363p569l4283P540L9239P1315
26183A0146O8423M3093k7338r5786K0662J07167o6505q6268M7863O9712K2076
26172A13245k5700k4137m5507l1359N5602J020J9104l7963K081L3745O2829M8523
26160A71483M892K7016N1546p4994q4511M372L9998n7164L7970k1606m2738q955
26148D7309j7405j5426J20894M1356j30244r2585j14842M3957M4575K5749R076
$$ y = [-80672, -40498, -49148, -83247, -56968, -38334, -141124, -54462, -22335, -39582, 10106, -9191, -76511, -121159, -129126, -55520, 54373, 22859, -53342, -100481, 35501, 133009, 184946, 225972, 177320, 118554, 115551, 72146, 94870, 178888, 194950, 112659, 114652, 93769, 106473, 84341, 50492, 3886, -22823, -54807, -119119, -108459, -66096, -73665, -107948, -100408, -61169, 10146, 78569, 121662, 94324, -1462, 19200, 126367, 59862, -26406, 21457, 91169, 113245, 87545, 63408, 17901, -13458, 42144, 43164, 62268, 24305, 26386, 60131, 122960, 171483, 176375, 203391, 254937, 179943, 95432, 99804, 139802, 82638, 120608, 99002, 56264, 47309, 29904, 14478, 135372, 176728, 46484, -46101, -160943, -116986, -72411, -46662, -37586]
26137c7586q8511N3638J20252J9564o9854p5411P8204m7352l715j4932q8010J9459
26125a34254K13497M3110q6667L1617n4382k2407K8056J161l2681R0121j19832
26114d2661j24050l325N7898J10703M6430p7309l9948l2947j1848j078L1645N7090
26102b9400J14879O5368m4536p9448R312o528Q4138p8886n0986O2017k0620j5131
26090A0179J418O9456L4922J3207J11225j26504r0388M076K2970L1815L288q4005
26078A659j24354l4989n652O9526N9026m3062J09973Q840q4171J01589R8870m9534
26066A07721j54316M3601J07576o7465o2052j8956p8393J2149O4370o2561K0185
26055h8141N7485Q829K6316P8294J00760m0154j27116J0389n2979n8568l1605
$$ y = [-37586, -126097, -72459, 47793, 67357, -2497, -77908, 296, -47056, -50771, -65703, -153713, -134254, 79243, 122353, 35686, 67303, 12921, -9486, 18570, 19731, -12950, 77171, -42661, -166711, -170036, -112138, -1435, 44995, -32314, -72262, -105209, -117057, -118135, -86490, -29400, 85479, 150847, 106311, 26863, 36175, 29647, 113785, 34899, -16087, 45930, 25310, 10179, 11597, 81053, 115975, 129182, 240407, 113903, 23515, 27591, 50561, 82376, 85664, 1659, -122695, -157684, -163336, -93810, -34784, -77846, 32127, 40967, -43204, 58385, 157255, 107721, -46595, -2994, 104582, 37117, -24935, -43891, -122284, -110135, -45765, -108326, -88141, -30656, -21827, 4489, 82783, 183543, 143389, 16273, 26662, -26317, -84885, -116490]
26044a16490l3093K1479J85005O5733k9276q7313r6345O340K4362Q250o1347k5053
26032a37748J5909O5175o593N104L8419m0309J8358k3361O9368j4536j300j4931
26020b6445k6217K2495r5983m3425l5239L4445J20670O7714o379p7549j12780
26009a78693o3369O122J4545K5585N3235P7512L1048k0271l24m4935L8131O2843
25997A429k6461l0668o749M3899q2254l3016p1028R5575J17165N7258r6789J6691
25985a4948l4216J3295j3340n7496k2836O5040R1002L0884Q4428J07104p9021
25974A69896j39614O3839J5431M3552k6802j09014j35100k7365l2304K5033O0680
25963i1768k0026L0307N9145L9622J6193k0546L9944J312K8367k0122M5989l7320
$$ y = [-116490, -149583, -128104, 56901, 122634, 93358, 6045, -90300, -83960, -59598, -51348, -112695, -137748, -121839, -56664, -63257, -58153, -19734, -60043, -41685, -65046, 4322, -10214, -11514, -26445, -52662, -30167, -126150, -169575, -204814, -170369, -49699, 18015, 11636, -65913, -178693, -242062, -235940, -221395, -195810, -142575, -65063, -34015, -54286, -54610, -99545, -61414, 1429, -25032, -55700, -62449, -18550, -100804, -133820, -204848, -109273, 7892, 65150, -31639, -14948, -49164, -35869, -49209, -106705, -129541, -64501, 26501, 57385, 141813, 248917, 169896, 30282, 94121, 109552, 153104, 126302, 17288, -117812, -145177, -177481, -152448, -91768, -111794, -81487, -22342, 17280, 33473, 12927, 52871, 54183, 82550, 62428, 108417, 71097]
25951G1097j52791m477k1091R4907N4604l3923m5125n1027O4781Q240K7377n041
25939G531n6115j4455L8404O2016Q43m9156j8819n9064k7618P9839N682L9923
25927I011k7767q275K5888N2127M8554l0126l9972r3795j6822k501r9188n746
25915a88612L6839P0474l7603N3591K0172P5078M8991j42426o6316N2858O2178
25904a4776J35410l3843m2130j8800l2094L4378m7861L2169L0999j5385j17037
25893h8970l7279l7286j08774K3414J60456J97998n5639r5323l8657N647L3565
25882d0848R922m8555j15791L3904J10771L4250q1591l6510J1084o597R5410M4127
25870I576n2404o2372l0406P1359J7671j6846j8414j8023J1727O8158J9897l1036
$$ y = [71097, -81694, -86171, -107262, -12355, 42249, 8326, -36799, -87826, -23045, -14805, 12572, 7531, -48584, -63039, -24635, 37381, 38224, -10932, -29751, -88815, -116433, -36594, -30912, 9011, -18756, -27031, -1143, 50984, 99538, 69412, 29440, -64355, -81177, -83678, -182866, -188612, -151773, -81299, -118902, -65311, -45139, 29939, 78930, -63496, -129812, -76954, -14776, 120634, 86791, 44661, 25861, -6233, 28145, -19716, 12453, 43452, 28067, -88970, -126249, -163535, -272309, -248895, -88439, 109559, 53920, -41403, -80060, -74413, -40848, -30926, -79481, -195272, -161368, -50597, -16347, -97938, -134448, -123364, -129961, -34551, 9576, -42828, -105200, -135606, -64247, -46576, -63422, -81836, -99859, -88132, -19974, -77, -31113]
25858c1113L0581M4708Q831l318L1627R997l0370J15210k3376k7039n1631j11234
25846c7127n0886m0630j9201j964O8269m1812n1699P7116P8510K0264k7821m5105
25834g2086O756L7957p5741j5489o5822Q2923Q9819M5961p4501j5656J3044R3008
25822E0173M8694k68J31518p0811l734O427j23759j42418n3290l1035K9057Q2733
25810g6713L9803K5108P4527L0712n0879p3853l4505p342k6836M0892L1128j34468
25798a62426o0468J12086O9932m3872K5376P3745k4535l762n7582o3237P5701
25787e9042j3923k444J41055K4658n9756l9038r9183O7791P0998J8067j311r43
25775D6929O6784L3080o8966m921j5104J8045m945j03805n1971J02410K654j01900
$$ y = [-31113, -532, 44176, 53007, 49689, 81316, 91313, 60943, 176153, 152777, 125738, 74107, -37127, -88013, -128643, -147844, -149808, -81539, -123351, -175050, -97934, -19424, 840, -26981, -72086, -65330, -27373, -103114, -118603, -184425, -101502, -11683, 34278, -40223, -55879, -42835, 50173, 98867, 98599, 230117, 159306, 155572, 161999, 38240, -104178, -157468, -188503, -159446, -76713, -36910, -11802, 62725, 93437, 42558, -31295, -65800, -73142, -99978, -59086, -27958, -162426, -222894, -110808, -40876, -84748, -59372, 14373, -10162, -13924, -71506, -134743, -59042, -72965, -75409, 65646, 90304, 30548, -8490, -107673, -39882, 31116, 49183, 47872, 46929, 113713, 146793, 77827, 72906, 57802, 75847, 70902, -32903, -84874, 17536, 20190, -81710]
25763h1710M6025R9359J7379j9764R080j9233j54913r8001J788O8414L6856J8781
25751g5939J26189j8244L5624n886m5357O804P313p192L1753q3485p9320p29J07887
25738e82M4197p358m678j7465m7754L894M3878j6237m2329L006J719Q8958l9812
25725I437n8120k6619L5556R6181o6883K190J11253k1695k0849Q4750p5360j36768
25713f6927K6880O2470p1679p3051M9069N1601N4805J1588L517K9103m8675M6172
25701G4873l2506j3632J995q7715p1451M8954J8641o7133l7599O0816J32234K8618
25689E6095j5508L9581m5209k8523j4132o7300L1264O2064k8305p0237j02143
25678a82353Q8611J36827M8089k4792j8098O536n6900n8311K813L4147Q3471M263
$$ y = [-81710, -35685, 63674, 81053, 61289, 70369, 51136, -103777, -201778, -199990, -131576, -94720, -75939, 50250, 32006, 67630, 61744, 16387, 23191, 30504, 23312, 55065, -28420, -107740, -108469, -582, 43615, 36257, 31579, 14114, -33640, -29746, 14132, -2105, -44434, -41428, -39709, 49249, 9437, -48683, -75302, -39746, 56435, -10448, -8258, 102995, 81300, 60451, 145201, 69841, -66927, -40047, 22423, -49256, -122307, -73238, -21637, 33168, 44756, 48273, 77376, 28701, 74873, 42367, 28735, 30730, -56985, -128436, -79482, -60841, -127974, -165573, -104757, 27477, 56095, 40587, 80168, 34959, 6436, -7696, -74996, -43732, 18332, -9973, -80210, -182353, -93742, 43085, 91174, 66382, 48284, 54820, -2080, -60391, -57578, -23431, 60040, 64303]
25666F4303k2819r2827J00168O0043k17581j01492J03126P4269K874K4096N0173
25655D4333N2130k3405K5549L461n8828q558m7761k6704l0476J0707o4159N4080
25643f9631m1358P6902m5455l2519K6447N1580m4166q9454p290J4091N6688K636
25631a01529O803R7260J20174J8692m2543q1078P3464l3347O7588j1547q1960
25620C1977k1624J5831J1661L2518l9284L229N4344L3373o5982p5137J1299n8779
25608f6574L243J03649J5354K0151l2604n5239l1162J6697j06918N395M2921J29318
25596D4231O2637r3618j8579m3341M9771Q1053j7040o7174j0291o5600R3098J24541
25584A39688n4543P8565l0493p7638K7222J7239o6648j01594j12112J04694M0951
$$ y = [64303, 41484, -51343, 48825, 108868, -108713, -210205, -107079, -32810, -29936, -5840, 44333, 96463, 73058, 98607, 102068, 43240, 34682, -13079, -39783, -70259, -59552, -123711, -69631, -110989, -34087, -79542, -112061, -85614, -34034, -78200, -167654, -174944, -160853, -104165, -101529, -94726, 2534, 122708, 141400, 98857, 17779, 91243, 57896, 125484, 113937, 31977, 10353, 26184, 37845, 70363, 31079, 34308, 88652, 122025, 56043, -19094, -7795, -66574, -63331, 40318, 55672, 75823, 43219, -12020, -43182, -26485, -133403, -128008, -85087, 44231, 106868, 13250, -5329, -48670, 1101, 82154, 65114, -2060, -12351, -77951, 15147, 139688, 85145, 163710, 133217, 55579, 82801, 100040, 33392, -68202, -180314, -75620, -34669]
25573c4669Q2067N0928O7116J8921j84417J1545R3004o3975m3411J0056K7710
25562C4875K515o2051o2237M5610Q5792L5384N1973J8675O5195J1109O0035j00390
25550A86485K4128O0180j40508j15158P4502P0607m5830l9991N436r6731m9799
25539f6679j0133L6807L1099K5194j6862Q980j2956J2398o0112n4939j5279R3764
25527b8718K3614K0149k4940n396j5043j54017P6187J50729N7054o2227l4581
25516B811L5354l2516J3231j02019l5893k5264n6505J0415N0087M3480J15770
25505A8951K0462m6171L307q881J3122k9354M9561R4013m3016r3185j14191K7485
25493a07897M1786P4868M1644k0033o4428n6607O3236m9331L9818R7028j5628
$$ y = [-34669, 47398, 98326, 165442, 184363, -54, 11491, 104495, 40520, -2891, 7165, 34875, 37390, -24661, -86898, -41288, 44504, 79888, 131861, 150536, 215731, 226840, 286875, 186485, 210613, 270793, 130285, 15127, 89629, 160236, 114406, 74415, 79851, -16880, -66679, -76812, -40005, -8906, 16288, -574, 8406, -4550, 7848, -52264, -107203, -122482, -28718, -5104, 15045, -9895, -15291, -30334, -184351, -108164, 42565, 99619, 37392, 2811, 38165, 5649, 18880, -83139, -119032, -144296, -200801, -190386, -140299, -96819, 18951, 39413, -6758, -3451, -12332, 790, -28564, 20997, 115010, 71994, -21191, -135382, -107897, -66111, 8757, 50401, 30368, -34060, -90667, -27431, -76762, -36944, 60084, 44456]
25482D4456K7384p2415q4749L1529L4183J5564N3232K7563L054o0709l6940j7082
25470c4930L0087P2243j5364r1623M3654k1224n1102p1515P1726J39164J6978
25459H8094p2418q911L7258p7122l710L6802p6125M4921o093j8288n4378k1268
25447a31238l2460q741N3874Q1631l5045J0218J15516L4498j26428R384L2333
25436C542j14277k3955M9697j8227K1725N0817M6412M0357m973k8269p1570P3697
25424B4976J20552o4326k0138k3721p677j311n551j0101k3675o8133K6732R2627
25412D0254M5261O2906k1900L7064J5093N24O2737n8316q285J6487k1791k504
25400A67530o8836o6832j08850O5191J6082P4730m3054k3491l4111O1841p2806
$$ y = [44456, 71840, -575, -85324, -53795, -19612, -4048, 49184, 76747, 79801, 19092, -17848, -34930, -4843, 67400, 52036, -39587, 4067, -17157, -68259, -139774, -68048, 71116, 88094, 15676, 6765, 44023, -33099, -36809, -7, -76132, -31211, -37304, -55592, -109970, -131238, -163698, -172439, -118565, -36934, -71979, -61761, 53755, 88253, -38175, -28791, 3542, -110735, -134690, -84993, -103220, -81495, -30678, 15734, 56091, 51118, 22849, -48721, 24976, 145528, 81202, 61064, 37343, 29666, 28355, 22804, 12703, -10972, -79105, -52373, 40254, 85515, 148421, 126521, 163585, 178678, 179202, 241939, 183623, 175338, 191825, 170034, 167530, 98694, 31862, -76988, -11797, 4285, 79015, 35961, 12470, -21641, 40200, -32606]
25389c2606l368k7871k3662M2266Q342J04797p7171m9794N1001J4671m6663L3236
25377f822K3134j50291q723Q3058O1153K6195M9929J3111j6761k9092l2110J230
25365A4011q1896K3698N1572k7993J1459K8776l1128K8024O5824l06r6572p4413
25353h8944j2665j4628o8521R5885J04487l8292P47L9874o6782J0924N953l1591
25341f3553K0987l2137m6965J67154J8695K4863n5526q4671q9965l7042O8294
25330a09866M9620P2621N9061l5802j12115q5411P4707Q5163m236o1447J392R6042
25318B9729P4482J8060L220K5233j36629j41947N4244j2396j7874J16986K6320
25307C9428M4799k6485l6132n4120K9287k4283m3826q1152O7657J10219O1520
$$ y = [-32606, -35974, -63845, -87507, -45241, -36899, 67898, -9273, -59067, -8066, 6605, -40058, -6822, 16312, -133979, -142702, -59644, 1509, 27704, 77633, 90744, 73983, 44891, 12781, 14011, -67885, -44187, 7385, -20608, -9149, 19627, -11501, 16523, 82347, 82041, -14531, -88944, -101609, -116237, -184758, -88873, 15614, -22678, -21931, 17943, -48839, -37915, -31962, -63553, -42566, -74703, -121668, 45486, 64181, 89044, 33518, -51153, -141118, -178160, -109866, -60246, 12375, 71436, 35634, -76481, -161892, -87185, -2022, -6258, -67705, -66313, 29729, 104211, 122271, 125491, 150724, 14095, -127852, -73608, -86004, -103878, 13108, 39428, 84227, 57742, 21610, -32510, -3223, -27506, -71332, -152484, -84827, 25392, 86912]
25296H6912P8221K2886j0895k608o0218L0453k8313k7478k6494k6044l9619j05331
25284a08528Q267M0085P0984m0782n7571j45596l092J05177k090L3754k863m8167
25272a50422j8470O9001L1794K2147J16340Q7555o8054n9355j4334J8065L4104
25261F8371l6102r5742K7137M5829Q835L8787m9643m9886m2152k0832J10175m0428
25249c5651q2361M8066L9620Q2477Q4553N2890o418j15721j47131P484O9625l1496
25237c4063r129M7475N9625J7723j13995k8848j6247O296Q4612N4437J9822R7199
25225A84907j1681j59577j38449L083j5485J16541L3183r6076R710m9431M0166
25214h3109R1885n6415l0634K5537L4438K3358J1466L8296J393m9801k0640R204
$$ y = [86912, 165133, 188019, 177124, 174516, 114298, 144751, 116438, 88960, 62466, 36422, -3197, -108528, -100261, -60176, 10808, -29974, -87545, -233141, -236233, -131056, -133146, -99392, -102255, -150422, -168892, -99891, -68097, -45950, 70390, 157945, 89891, 30536, 16202, 34267, 68371, 32269, -63473, -36336, 9493, 18328, 57115, 7472, -42414, -84566, -105398, 4777, -35651, -118012, -69946, -30326, 52151, 136704, 189594, 183176, 67455, -79676, -72192, -2567, -34063, -43192, 4283, 63908, 81631, -32364, -61212, -77459, -71163, 13449, 67886, 87708, 184907, 173226, 13649, -124800, -121717, -137202, -20661, 12522, -83554, -73844, -123275, -83109, 8776, -47639, -78273, -52736, -18298, 5060, 16526, 54822, 56215, 6414, -14226, -5022]
25202e022j520L0228K8697K1229o4203L7934l5334j38308J0750K4950l2213N4871
25190f7941p3417O5732O6811m7425l230Q3811M7654K4470m2204n4398l2610L8912
25178F165j0983j01837l1404q5228L6525J55969m259j80414l1604L6480J30805
25167g9785Q3401P9423o2147m745J5336M2139m3786o9772j02194r8577n403J00269
25155a45841Q2508o949M6610M4519r280p2947l6934L5657m0783P3329O8377k5604
25143A2662p5078n2193L5250P2844M903n4525q3144P856P3950k5452m0708J03271
25131b0364K168L6609M9404j1217k622n1336Q6051j2089p6206o0563j6308P5048
25119a425J12054N503q1317j9381j994J8973k1352r5577j1878k6198l1590J6093
$$ y = [-5022, -6542, 23686, 52383, 73612, 9409, 47343, 12009, -126299, -115549, -90599, -122812, -67941, -141358, -75626, -8815, -56240, -59470, 24341, 71995, 96465, 54261, -137, -32747, 6165, -4818, -106655, -138059, -223287, -186762, -30793, -35052, -215466, -247070, -210590, -79785, 3616, 83039, 20892, 16147, 31483, 73622, 29836, -39936, -142130, -240707, -246110, -145841, -63333, -70282, -23672, 20847, 11567, -61380, -98314, -62657, -103440, -30111, 38266, 12662, -62416, -114609, -79359, -6515, -1612, -56137, -139281, -131425, -57475, -82927, -123635, -20364, -18196, 18413, 67817, 56600, 53978, 2642, 88693, 76604, 398, -60165, -76473, -1425, 110629, 116132, 34815, 15434, 13440, 32413, 11061, -84516, -96394, -122592, -154182, -138089]
25107a38089P4649L001k0241o8527j6034k9708L9759l6295k9602o2823P7908J78727
25095b7275k3131R685J22405k6390q3659K9102j20187m8556P8102K6486k1L3653
25083b9786M3696O3185J12884o6283K8820Q336q0978j23107O7550J5451J7497
25072E7265n7290j9690O6352o894l5059J6882n8264l2516P2139K5749q743Q1080
25060A01011o5423M4054K9209N0969Q4552r0026n7877L9895j7875p5665K3558
25049F6382l0045n6129J0533l2506r935M3674n62M9199M9755K504m2190j18676
25037f7996k1962j2005P720R727N5458k5081J642r622p517o2226N1559L0912p623
25024e7014j29283r6788K0477J33908K64o1899j0384Q0465O194Q2337J3657L1022
$$ y = [-138089, -63440, -60439, -80680, -149207, -165241, -194949, -155190, -191485, -221087, -283910, -206002, -27275, -50406, -40721, 81684, 55294, -28365, 737, -119450, -168006, -89904, -63418, -63439, -29786, 13910, 77095, 189979, 123696, 152516, 160852, 79874, -43233, 24317, 39768, 57265, -25, -19715, 46637, 39743, 4684, 21566, -36698, -69214, 2925, 28674, 19931, 101011, 35588, 79642, 108851, 159820, 244372, 154346, 96469, 136364, 118489, 42824, 66382, 36337, -19792, -9259, -41765, -51700, -8026, -8588, 40611, 90366, 92870, 50680, -67996, -89958, -101963, -94243, -84516, -29058, -54139, -52497, -62119, -69636, -131862, -80303, -49391, -57014, -186297, -283085, -262608, -128700, -128436, -190335, -200719, -120254, -114060, -31723, -18066, 12956]
25012A2956K1497K6576P5576O9703m9964k5688p2187M967M956P615n1533j22721
25000i8247Q7193J7803k8588M0852J05165L4637q1951m518O5123o0262p2025J869
24988G051J52997n3624j06990L6805K4446o5497M3449l5049j8435K5979r8039
24977h6907L032J20098m788N3629j43513j8432p4497P099P1652R4059l695n7504
24965c9767M0510M6170L1769n0318J2213l3360k286j8203k2660M9841J855j5110
24953F54m6643K583J03507J3517J30166L8209r6166j17723p556R2122R4393J5932
24941B22995j38254l8408P1291K6547J0497l2253o0631p727Q2807K4478m9808
24930A11534l6402n6467o7304q570k4796l1096M9229m539K4893l670J2540K1469
$$ y = [12956, 34453, 61029, 136605, 206308, 156344, 130656, 58469, 63436, 68392, 76007, 24474, -98247, -11054, 6749, -21839, 19013, 124178, 158815, 76864, 72346, 137469, 77207, 5182, 7051, 160048, 106424, -566, 36239, 60685, -4812, 38637, 3588, -14847, 11132, -86907, -83875, 36223, 31435, 85064, -58449, -76881, -151378, -144279, -72627, 21432, 17737, -39767, 743, 46913, 78682, 28364, 40577, 7217, 4931, -13272, -35932, 13909, 15764, 654, -45989, -43406, 60101, 73618, 203784, 241993, 145827, 28104, 20548, 112670, 207063, 222995, 84741, 46333, 117624, 144171, 154668, 122415, 61784, 54057, 136864, 161342, 111534, 75132, 18665, -48639, -57209, -82005, -113101, -63872, -68411, -43518, -47188, -34648, -13179]
24918a3179M0097l3355J9400J27065L4372j30364r5043J6405l5237n1819J0218
24907a11440k1405N4239m7543P6242O1648R1447k9696q7651J6359R14L5732J3209
24895E2055q0466P3701J1786L0387O026m0192J039m8837n0275L4490M3070m264
24883B8520L205m2318n543k5508m488P4203J18764j7998q0742n7408R018j2445
24871a2740j0843L5475M3133M1129J5882K1039l0092L055j7405j13848k6013L2664
24859a8564N7736q2737q1495Q604R3242J31694o40R271J4118j40607q1672J4810
24847g6240J5898L3291M4572j0151N706N1957l709m5396l4156m1160L5785l1226
24835e4829j3429k9138N2164m4931m7357L5417R9036k2993n7714j2128n5446k0314
$$ y = [-13179, 26918, -6437, 12963, 140028, 174400, 44036, -51007, -34602, -69839, -121658, -111440, -132845, -78606, -126149, -49907, 11741, 103188, 73492, -14159, 2200, 3114, 38846, 52055, -28411, 45290, 57076, 87463, 93489, 53297, 54336, 5499, -44776, -10286, 32784, 28520, 31725, -10593, -16136, -41644, -46132, 28071, 146835, 128837, 48095, -9313, -295, -12740, -23583, 11892, 55025, 96154, 112036, 133075, 102983, 106038, 88633, -25215, -51228, -18564, 39172, -43565, -125060, -116456, -23214, 108480, 107840, 117111, 131229, -9378, -91050, -76240, -60342, -27051, 17521, 7370, 13076, 65033, 61324, 15928, -18228, -59388, -23603, -54829, -68258, -97396, -45232, -90163, -137520, -102103, -3067, -26060, -83774, -95902, -151348, -171662]
24823a71662M2579J63765J8992K7139n128m4943J1869k7806L9745o4218j893J05903
24811I4342M846m1473n9806p0347l9651J31499n443k6134N827J07554Q0092j20433
24799F0873R381K3253m0856o0381j4445N5138N3723k6724J3701j2870l5404q148
24787A7241o7651j1483l2536O5309j217j7966N7942Q7835n5131j5143j987N1576
24775G6789o7660m9118r0465k7162P7740Q5809L5921m3348K6863L7219l7301l3862
24763h575Q3183l27o3153l4426j05240Q466O6437M1421O8248R669q498J19342
24751A76547j8003j38597n937N9498l8380L2333m4956o8152k4702j5649M7207
24740c8791K4737q3444m0848P5193r2663j00755P5175J53240m6380O6573N7749
$$ y = [-171662, -129083, 34682, 53674, 80813, 75685, 30742, 42611, 14805, 54550, -9668, -11561, 94342, 99188, 57715, -2091, -72438, -112089, 19410, 13967, -12167, -6340, 101214, 181306, 60873, 70254, 93507, 52651, -7730, -22175, 32963, 86686, 59962, 73663, 60793, 25389, 17241, -50410, -61893, -94429, -29120, -30337, -48303, 9639, 97474, 42343, 27200, 25213, 76789, 9129, -39989, -130454, -157616, -79876, 5933, 41854, -1494, 25369, 62588, 25287, -8575, 74608, 74281, 11128, -23298, -128538, -120072, -53635, -12214, 56034, 65703, 57205, 176547, 158544, 19947, 14010, 73508, 35128, 67461, 22505, -45647, -70349, -85998, -38791, -14054, -97498, -138346, -63153, -155816, -256571, -181396, -28156, -74536, -7963, 49786]
24729D9786J3558r0565N080j6244m1917M7768L7900L993N872M6592j3504L5515
24717H3834j2428L0765K2450n6500q5446l8829J5756J8002l1495J7089P5229L7085
24705G5512j6952n6263o6163M2431J3973o930j8616k3374R3590j26495J5344J11060
24693C7117j0615n675N8021j1969n8558j03349L9753L9055l2935L8641m2065o419
24681e8998N0327K4117m7175o3794p0327k7568j941Q2684Q3346N3913P7302k7657
24669G4229k4732r303j6297q0062O199o5809N5598j7159n3634M0414R3907K1460
24657B4811k1536L881N5747R7790k3931j03793n4661n2248K5253Q1029m4958M1
24645a2575R6344m042j35966k7796N2635J4021j7012j7733J7594L2332j2313m4999
$$ y = [49786, 63344, -27221, -22141, -38385, -80302, -32534, 5366, 9359, 15231, 61823, 48319, 83834, 71406, 102171, 124621, 68121, -17325, -56154, -40398, -22396, -53891, -36802, 38427, 75512, 58560, 2297, -63866, -21435, -7462, -14392, -33008, -56382, 37208, -89287, -73943, 37117, 26502, 20827, 78848, 66879, 8321, -95028, -55275, -16220, -49155, -10514, -52579, -58998, -8671, 15446, -31729, -95523, -165850, -193418, -195359, -112675, -29329, 24584, 101886, 74229, 49497, 40194, 23897, -56165, -49966, -115775, -60177, -77336, -130970, -90556, 3351, 24811, 3275, 7156, 62903, 160693, 136762, 32969, -21692, -73940, -48687, 32342, -12616, -12575, 83769, 79727, -56239, -84035, -31400, -17379, -34391, -52124, -34530, -2198, -14511, -59510]
24633e9510K5574m2925j4992P3684J8885K0313R956k0522j3354j0194o1681o188
24621h0954K0159N870P3164n7108K0979Q2314R5750n0379n8579k3472M6948M8776
24609A23468R761n603j00238r0629k8972L5235o7162O6741l637n5668n1924J8897
24597a49731K0008k3095m3313J0298j0669m0230J801P7230L2157J37011O1366
24586G2833M3292Q8906l2165j13197p1061K3840n2409O936O936r3071j00514L0084
24574a89590Q3447R5992Q8720O3516p7952m4232O3416k1953n3539P3615J24669
24563B06109j14578o3243o2255j7216O7580O4491j4256J9628K0798M4357L2557
24552A83972q4702o5040m4454M8644N4993j05829n7126P1063J8007r3336q4780
$$ y = [-59510, -33936, -76861, -91853, -18169, 716, 21029, 30985, 10463, -2891, -13085, -74766, -80954, -60795, -54925, 18239, -38869, -17890, 64424, 160174, 109795, 51216, 27744, 74692, 123468, 133229, 127626, 27388, -63241, -92213, -56978, -124140, -57399, -61036, -116704, -168628, -149731, -129723, -152818, -196131, -185833, -196502, -236732, -234931, -157701, -125544, 11467, 72833, 116125, 205031, 172866, 59669, -11392, 12448, -39961, -33025, -26089, -119160, -219674, -189590, -106143, -10151, 78569, 142085, 64133, 19901, 83317, 61364, 7825, 81440, 206109, 91531, 28288, -33967, -51183, 16397, 80888, 66632, 86260, 107058, 151415, 183972, 99270, 34230, -10224, 38420, 93413, -12416, -69542, 1521, 19528, -73808, -158588]
24541a58588L0890P6404J0985l5904L4292J2441k6133M341L1302n3896l2235J05045
24529a056R3324j03397r9076n0498M6624J0689k5771O988J32459l5713m2613K5345
24517d2695m830j4218M834M7411l8798o197m8324j6902j7169K7158P0818J9825
24505a9087J1478Q6502J2570q3204n6058l8636M7210P4370k2080M4321q3802l7058
24493f3474L9268R3472r9371o169Q9338n8288o2893j9736n1467q3931o387P8119
24481a51519m1654M7504J09851n7164k5884N5722J09876J4444J5012K4833p649
24470I3372o1258P1544o4290j52972K2523O8704j573j02618j8111L2534Q2628
24459b9517J41099p1200m5702K4508K5914k3882o0426M0868J7143J4827K6323
$$ y = [-158588, -127698, -51294, -40309, -76213, -41921, -29480, -55613, -51272, -19970, -73866, -106101, -1056, 92268, -11129, -110205, -160703, -114079, -103390, -129161, -122173, 10286, -25427, -68040, -42695, -47525, -61743, -56909, -9498, -48296, -54493, -102817, -119719, -136888, -109730, -38912, -19087, -7609, 78893, 91463, 8259, -47799, -86435, -39225, 35145, 13065, 57386, -26416, -63474, -24206, 69266, -30105, -36274, 53064, -5224, -68117, -87853, -139320, -223251, -229638, -151519, -193173, -145669, -35818, -92982, -118866, -63144, 46732, 61176, 76188, 101021, 93372, 32114, 103658, 39368, -113604, -91081, -22377, -23950, -126568, -144679, -112145, -29517, 111582, 40382, -5320, 19188, 45102, 21220, -39206, 1662, 18805, 33632, 59955]
24448E9955j9561n9416J2535p9584N4154R474J3061l2776n4614l677P2165m7307
24436g5591o5014R4642J35669o9201p345p4712l3109M4526L3077K8724n8440M4582
24424b192J3930m3815o7651R0994l166n4255R1808K6278M780m525N996m5764m3588
24411c1170l8183R0335Q1446q2811l1154L4723n7009o5873J4683j39206k9253
24400b53472R0265J48607M9114M7161J1857p0755j04097j6815J8571M8543k2633
24389e3654K2221L9159R3630L0696p5291j1598P1369q706q2587l0057L4743r8799
24377f8874j5810J10914L5254k426M8987r4045r4834L450O4450K1809Q3324R7019
24365A89218r7908j07505L5725m9051N8931p82k0689R004Q248m636L5056P190
$$ y = [59955, 40394, -19022, -6487, -86071, -31917, -22443, -9382, -42158, -96772, -100449, -28284, -75591, -140605, -45963, 89706, 20505, 13160, -61552, -94661, -50135, -17058, 11666, -46774, -2192, 11738, -32077, -99728, -8734, -11900, -66155, 25653, 51931, 56711, 52186, 58182, 12418, -31170, -69353, 20982, 102428, 19617, -11537, 23186, -33823, -99696, -85013, -224219, -253472, -163207, -14600, 34514, 81675, 93532, 22777, -81320, -98135, -79564, -31021, -53654, -31433, 7726, 101356, 132052, 56761, 45163, 116532, 107826, 25239, -4818, 29925, -68874, -84684, 26230, 61484, 59058, 108045, 14000, -80834, -77384, -12934, 8875, 92199, 189218, 91310, -16195, 19530, -29521, 29410, 28628, 7939, 16943, 25191, 20555, 55611, 62801]
24353F2801k9927m9844m8605J05647J43783Q7223p4909l0870l0492r077p1905
24342E3825K4322l2306j35599K7570R7971Q095P727M4481J02691j9974l3662J6929
24330A62070K1159l5963j05056M976j072K4295P6447p2581k5492P277l7062J7547
24318C6545N6262m3245j00238j04911n3949j43805o7654J45019J22998J4709K4518
24307a13751J2353r0967j0636L5418R6283O6607j3744J2861j1641l0892j0938
24296e9047Q5151O9294q1619k1929o9756r021r1204j796O2659J16528N7280M864
24284F1404L5416k7518j13159o0551J0846J4716l0027J7597J6123J06201Q3019
24273A14067L9157p3453o3658j02790m4872l6837N7351J08556L6522r7805p1169
$$ y = [62801, 32874, -16970, -65575, 40072, 183855, 271078, 196169, 165299, 134807, 125730, 53825, 78147, 45841, -89758, -62188, 35783, 43878, 51605, 96086, 198777, 178803, 145141, 162070, 183229, 147266, 42210, 47186, 46114, 70409, 146856, 74275, 48783, 56060, 18998, 36545, 92807, 49562, -50676, -155587, -209536, -353341, -420995, -275976, -152978, -138269, -113751, -101398, -192365, -203001, -167583, -71300, -4693, -18437, -5576, -17217, -48109, -59047, 26104, 95398, 13779, -8150, -77906, -86927, -178131, -179927, -117268, -740, 56540, 61404, 96820, 69302, -43857, -104408, -93562, -78846, -108873, -91276, -75153, 31048, 114067, 153224, 79771, 16113, -86677, -131549, -168386, -111035, -2479, 34043, -63762, -134931]
24262a34931p169J08907Q6671P1676J7843o4715q5640j9615N2272m628m8520m9223
24250g7072P6439r3057K880J26536J0792m7417p928n642n0978K644L2986M3050
24238A3233j3847L6974O643N1063p6939r6020n0199k4259Q8726Q7793p434q431
24226G303l7970q6572l2894M0728M4340j0393K2880Q6039l2827l1246m9604j0550
24214i0766n820L7102O6012Q801l5347J8191o6295P335m7657r3219O078P7875
24202a17710J6484M4891n403o8950k5507K7591J4332P7234J704p886K3793m1348
24190f0775j3201O060J8306R8995M3611l0469N1188K3311p3298J01699K4932l5211
24178A55148j12470j28849o4576j2607R9025R8693k9744o5774m2547O9262R2135
$$ y = [-134931, -142100, -33193, 53478, 125154, 142997, 78282, -7358, -26973, 25299, 20671, -27849, -77072, -633, -93690, -90810, 35726, 46518, -899, -8827, -14469, -65447, -62803, -29817, 13233, -614, 36360, 43003, 94066, 17127, -78893, -129092, -153351, -64625, 23168, 15734, 7303, -30667, -117239, -150133, -109405, -65065, -75458, -52578, 33461, 634, -30612, -80216, -90766, -96586, -59484, 6528, 15329, -20018, -1827, -68122, -60787, -108444, -201663, -195585, -117710, -101226, -56335, -61738, -130688, -156195, -128604, -114272, -37038, -35334, -43220, -19427, -60775, -73976, -67916, -49610, 49385, 92996, 62527, 113715, 137026, 63728, 165427, 190359, 155148, 42678, -86171, -150747, -163354, -64329, 34364, 4620, -61154, -103701, -34439, 57696]
24167E7696K2965O2154M5907J0299O9514k5847n2162n4971q4398n6094L5025j05421
24155g5333q9834L4487R2886Q9205o8735n6121j5712J9741r7988j5045m5581J67259
24143f0771J31483J12407N5482j12281j06624k6265o4667p3262L8206J0212Q0610
24132a5470M1765p63M8714l2951l6354L9225J0681k6120n112J4354o4480o9064
24120i5575N0231L3333N3373M5080M8026J032k8891j13746r8382P3765N5899k3295
24108H50o193J9062N433p6322P706L7727q190j7157o095K1726O4082K2526P570
24095G2725j9179j5837N778k062l368o4194o2353m7841M9918L2297k0966J5418
24083e9664K3798j7787K8263M1831J0684p0849p3362r1265J66682K0093j684j17435
$$ y = [57696, 80661, 142815, 188722, 199021, 268535, 242688, 190526, 135555, 51157, -4937, 30088, -75333, -165167, -130680, -37794, 51411, -17324, -73445, -89157, -69416, -167404, -182449, -228030, -60771, 70712, 183119, 238601, 126320, 19696, -6569, -71236, -144498, -106292, -96080, -15470, 26295, 25532, 74246, 41295, 4941, 44166, 54847, 28727, 23615, 37969, -26511, -95575, -45344, -12011, 41362, 86442, 134468, 135500, 106609, -7137, -105519, -31754, 24145, 850, -5343, 13719, 19152, -57170, -49464, -11737, -19927, -37084, -43179, -21453, 42629, 65155, 72725, 53546, 37709, 43487, 41425, 38057, -26137, -88490, -136331, -86413, -54116, -75082, -59664, -35866, -53653, -25390, 16441, 27125, -43724, -117086, -208351, -41669, -21576, -23260, -140695]
24071a40695m4425o4306J71631M0248o6639l1813J00804J52533Q2133K6794r4447
24060A31818q8789J5796p9563m1523p7294m3681p0725O68P7726R9694N1952L5503
24048A1582j1909M1452n8744j11985j6287R1779M9739M3145l4967j651K3202m1706
24036a6350k2772j6344J03089J02097o0974j54266P0891P1277j23858j32807R6305
24025h3712J45548l273p5502q02L8948j9051l4384P7101Q8511Q4950j37941l3566
24013D6827Q7025o8643j58829m7204L7772R7010M9159k2574k5812O7175M0491
24002A02397J0281p7445O693N2311L953r4651l7271N0794J0982k9083J2536q2732
23990g1235n6373k319j4303O0641n3464l9378J21051O3843j18916n2804P1314
$$ y = [-140695, -185120, -249426, -77795, -37547, -104186, -135999, -35195, 117338, 199471, 226265, 131818, 43029, 58825, -20738, -62261, -139555, -183236, -253961, -253293, -175567, -75873, -23921, 11582, -327, 41125, -17619, -129604, -145891, -54112, -4373, 38772, 3805, 2154, 25356, -16350, -39122, -55466, 47623, 149720, 88746, -65520, 5371, 76648, -47210, -180017, -83712, 61836, 58563, -16939, -17741, 21207, 2156, -32228, 44873, 133384, 218334, 80393, 46827, 133852, 65209, -93620, -140824, -103052, -6042, 43117, 20543, -5269, 61906, 102397, 112678, 35233, 41926, 94237, 98190, 3539, -33732, 17062, 28044, -1039, 11497, -71235, -127608, -129927, -144230, -83589, -137053, -176431, -55380, 8463, -110453, -163257, -91943]
23979i1943M0601R4437L1881j7657R2744q8398m0860P527K2516J2494k8978j37143
23967a02779o8100R636j0299l8603R328J12031J24446L9187m3272r6598o6586
23956a31609L903P2077L8756l4672l658R7826L921J9509J2036L116l5906M2697
23944H7996L0123J5079O0572m6765J474r7609j26177k3586J8979n7819J9208M8214
23932g0311P9915M9490P6290M9513l3404j04732l1877N0680l6548L6916n6791
23921I141k6800l498Q1244J03913N854m1261k0230R435l3826n0319k5763K0556
23909B8446o1513q8056J652N2099j1872n7613O1851J49449N2928P5505Q142n8535
23897A52483n5438n2150r2749J2755M3911j509P5123R1569o2164l7762j8518q0513
$$ y = [-91943, -51342, 43095, 74976, 57319, 150063, 61665, 20805, 28332, 50848, 63342, 34364, -102779, -170879, -161243, -171542, -210145, -200817, -88786, 35660, 74847, 31575, -65023, -131609, -127706, -55629, -16873, -51545, -55203, 42623, 46544, 66053, 78089, 81205, 45299, 87996, 118119, 133198, 193770, 147005, 148479, 50870, -75307, -98893, -79914, -137733, -118525, -70311, 9604, 59094, 135384, 184897, 151493, 46761, 14884, 65564, 29016, 65932, 9141, -17659, -21157, 60087, 164000, 169854, 128593, 108363, 117798, 83972, 33653, 7890, 28446, -33067, -121123, -119471, -67372, -79244, -136857, -75006, 74443, 127371, 202876, 211018, 152483, 97045, 44895, -47854, -35099, 8812, 7303, 82426, 173995, 111831, 74069, 55551, -24962]
23885b4962j0150N3413J7020l1571j6893m2208O3446J7811J1841q5911n5300M6907
23873e6557j0480K1813l4809p0273M7039J9552n0089Q2100R8304R506l6521o3057
23861d3472j544J3310j7964J23881M1045r9015m7723M0262r4215p0225l966L0721
23849a28905M1023o779o0317M2648P111k2526J29799J26176j4174K2904o9613
23838F7347m2242R4263K638n3545r1049m7165P9686J7200p5306l5650R3288M2968
23826E2433R7766J560m3164n421m6392k6450k3998l0178J9957o813k1135l1752
23814f3587m5936O9470L002j22l5156l7849n7047M9111R1982r862J2380n5930
23802g9544R4544J02039n891M370N055M9712J4628j31393r4803L7263L0034j35819
$$ y = [-24962, -35112, 18301, 35321, 3750, -13143, -55351, 8095, 25906, 37747, -48164, -103464, -56557, -67037, -45224, -80033, -150306, -103267, -83715, -133804, -51704, 46600, 56106, 19585, -43472, -45016, -31706, -49670, 74211, 115256, 16241, -31482, 8780, -85435, -155660, -159626, -128905, -87882, -94661, -154978, -112330, -105219, -127745, 2054, 128230, 114056, 136960, 67347, 25105, 119368, 122006, 68461, -22588, -69753, 9933, 27133, -48173, -83823, 9465, 52433, 150199, 151759, 108595, 103174, 56782, 30332, 6334, -23844, -3887, -10700, -31835, -63587, -109523, -40053, -37051, -37173, -72329, -110178, -167225, -118114, -26132, -35994, -23614, -79544, 15000, 117039, 111148, 115518, 120573, 170285, 184913, 53520, -41283, -4020, 26014, -109805]
23790a09805K4162Q9232m9057j23638O2241J17248M6529l6832J3112P670p3992
23779c3130J7985M0103K0275j08257P4326Q6244m8241m234P7983k0497j8757O3152
23767A46952r7808K0905K3028p2975j8535Q5390o760j23718L6030R4957m0711
23756D6755o915j7474k2023p3039L3147l493p5562K772J02454O8478j16574O3677
23744B203O237j34659p0515p77k8126J3213J53868Q8453N6085M6529J766q7500
23732D6777r6135L6051j5087r2738j4293n9688K3420l9896K7167J8351J8768N6791
23720i0512J62740J60442k5256j42698Q25M4567K2259o8359N6879j8216j62587
23709e9916o5108Q9731N4656m035J6435o4292K5281Q6182l1943n8524m5821m4092
$$ y = [-109805, -85643, 3589, -45468, -169106, -106865, 10383, 56912, 20080, 33192, 40862, -33130, -15145, 24958, 45233, -63024, 11302, 97546, 49305, 45071, 123054, 102557, 83800, 146952, 49144, 70049, 93077, 20102, 1567, 86957, 80197, -43521, -7491, 87466, 46755, 39840, 22366, 343, -72696, -39549, -43042, -118604, -115832, -13378, 55100, -61474, 2203, 8440, -126219, -196734, -197511, -225637, -212424, -58556, 29897, 85982, 132511, 134277, 46777, -49358, -13307, -28394, -121132, -135425, -195113, -171693, -211589, -184422, -166071, -147303, -90512, 72228, 232670, 207414, 64716, 65541, 110108, 132367, 64008, 120887, 102671, -59916, -125024, -35293, 19363, 15328, 31763, -32529, -7248, 78934, 46991, -11533, -57354, -101446]
23697a01446j3702p5773K7851O6865l2117K4182k977m2308N6860P1125m320O0412
23685C4652O5835m2269j52623j8977J58958J9513M4292N7300q3798n8697r9659
23674g5473m821J09887K041n0773K9544q594o9002N060L1646M2075K3169L2162
23662F6921L0298j13518j07310r7421O4198K5634n9561Q1572M7316l5924L6042
23651f1753K6224Q2945k3009l1315j9942k0901m6241n043j5210J2753Q6225J03503
23639H8236M3756j320j08740L8306p163m5621L3176J6933k9224K1542O1759L9261
23627A50901m3412n5816p8532m1452j1554N0696K0914j6750R929R5004Q5732O9146
23615B34806o7509j12726r0201j7521R0127P765r3966m0075l4043j2314n1439
$$ y = [-101446, -115148, -190921, -163070, -96205, -128322, -104140, -107117, -149425, -92565, -21440, -25760, 34652, 100487, 58218, -94405, -113382, 45576, 65089, 109381, 166681, 82883, 24186, -75473, -80294, 29593, 31634, -19139, 10405, 1811, -67191, -62131, -30485, 11590, 34759, 66921, 97219, -16299, -123609, -221030, -156832, -131198, -190759, -109187, -61871, -97795, -61753, -35529, 47416, 24407, -6908, -26850, -47751, -93992, -99035, -114245, -101492, -15267, 88236, 131992, 130672, 21932, 60238, 53075, 7454, 40630, 57563, 28339, 49881, 111640, 150901, 107489, 51673, -26859, -68311, -79865, -29169, -8255, -25005, -15076, 79928, 165660, 234806, 167297, 54571, -35630, -53151, 36976, 44741, -49225, -89300, -123343, -135657, -187096]
23604a87096o2814J3088K9539O9689N3189p231j2943j1583K3961n727P7180r521
23592c0269o5355k1853M6931R264j491K4493Q7236K4965l3236o8037n2071J9M068
23579g5336J04403L8503m1897J7564K6193L3398q6613r1020J3563j1053k986O0361
23567a4920L2691n7706K0990Q1492L4623n0234J0599o6368o5449Q3586K7665p4515
23555c7546n5495n3889N4868K9581J1130N3200P3946Q119O1404L5471q7472m9819
23543D3498j43655l9164o5412M7961Q6774k3199l9295J09992J1868Q6218P6760
23532A52346R536p1746K0984Q8711j15692j42058K7213J09907K3129N667p6859
23521C1138k6042p1484p3121L4776P9723l3113j5636l3343j0741L5600K0007L2575
$$ y = [-187096, -249910, -236822, -207283, -137594, -84405, -91636, -104579, -116162, -92201, -97928, -20748, -30269, -95624, -117477, -70546, -61282, -62773, -38280, 48956, 73921, 40685, -27352, -79423, -79404, -75336, 29067, 67570, 25673, 43237, 69430, 102828, 16215, -74805, -61242, -72295, -75281, -14920, 17771, -39935, -18945, 62547, 97170, 46936, 57535, -8833, -74282, 9304, 36969, -37546, -93041, -146930, -92062, -62481, -51351, 1849, 75795, 83914, 145318, 180789, 93317, 43498, -100157, -139321, -204733, -156772, -69998, -93197, -132492, -22500, -10632, 75586, 152346, 161882, 90136, 111120, 199831, 84139, -57919, -30706, 79201, 102330, 107997, 31138, 5096, -66388, -139509, -104733, -25010, -58123, -73759, -107102, -117843, -82243, -62236, -29661]
23509b9661m7428p252R9840j9816k4063n3443K9886k0252M2605N0450j46098j01681
23497b26913J6404P4792N8067N1922Q7016R907m4094J007K4925p0549l7668O7594
23485A2410O6500Q190m8529n4475N644j2502j0676L1913m2974j00384P9775J23425
23473E8317L8338J00618q07q3617r3839j53048k1086L2088M8873O7682R5768R951
23461I9238L1303l4895L769j00284q2122P0969l781j0173j11792r6575N7180Q3480
23449i3683J03440L1912K8408m3178j09929q2770J5057N2449M9201l983r3119
23438a46195k3196M6521Q1577J20738o409N7805m1426q4253K098p9860m3447J0716
23426a05331N234M5215j060m4483m4272j11549N7551J13707N3385L7165J08993
$$ y = [-29661, -77089, -84341, 15499, -4317, -28380, -81823, -51937, -72189, -29584, 20866, -125232, -226913, -210509, -135717, -77650, -25728, 61288, 71195, 27101, 28108, 53033, -17516, -55184, 12410, 78910, 87100, 38571, -15904, -10260, -22762, -33438, -1525, -44499, -144883, -65108, 58317, 96655, 197273, 196466, 112849, 19010, -134038, -155124, -123036, -74163, -6481, 89287, 99238, 130541, 95646, 99415, -869, -82991, -12022, -15803, -25976, -137768, -234343, -177163, -93683, 9757, 41669, 70077, 26899, -83030, -165800, -150743, -98294, -49093, -53076, -146195, -169391, -122870, -41293, 79445, 73036, 130841, 89415, 5162, 7260, -72600, -116047, -105331, -100097, -54882, -55942, -100425, -144697, -256246, -198695, -84988, -31603, 5562, 114555]
23415A14555j569l9741l7690Q2213j808j63160p9671q652J16453N2628r7694R1486
23403B7350N2573O1735K8015J7842o3223m5537J13901K5882P097P566l7967k8332
23391A66902j27773j76941o3375R4323L5962n5271l6697Q4782L5964K0307J22317
23380A00500J3806j56178K4042R4905j40763m8569O8711J07135J23120Q7531p3945
23369B00295m3428O6971p1016j09m2070j6423J143J04471K5973j47341j27895
23358d9429k6586J21537O3991M0421p6259J0585q0874O0433l6694M1593J01540
23347A70258m1007o8634j00954j13078L4265K4895N7059K9614j5227q876P32N1927
23335B0974k1280p7658K5006Q3594m3460n0265m3783k8771L9827K9703M6597L418
$$ y = [114555, 112986, 73245, 35555, 117768, 115960, -47200, -126871, -135523, -19070, 33558, -64136, 27350, 79923, 141658, 169673, 187515, 124292, 78755, 192656, 218538, 225635, 233201, 195234, 166902, 39129, -137812, -201187, -106864, -70902, -126173, -162870, -78088, -42124, -21817, 100500, 114306, -41872, -17830, 77075, -63688, -112257, -43546, 63589, 186709, 274240, 200295, 156867, 223838, 152822, 152713, 110643, 94220, 95363, 199834, 225807, 78466, -49429, -76015, 45522, 109513, 149934, 73675, 84260, 3386, 63819, 27125, 68718, 170258, 129251, 60617, -40337, -153415, -119150, -94255, -37196, -7582, -22809, -31685, -30953, 20974, -306, -77964, -52958, 30636, -12824, -63089, -106872, -135643, -95816, -66113, -19516, -16098]
23323a6098M6625L012n4881O6880K5935j73585M1264O4416p818Q2920j8609j27950
23311f7889l7770N6765P0307N4331N8714p959j47135j01254J8277J07588M1323
23300D5298p6145m445j5272R285K418j1786m9413m1222J28755N27p0603p4853
23288a57456J523k1811K672L2239N2501L4127K5401K336k4556l5060M9918J4422
23276b3744j1330M1455k4254k7277o6229P6115L5593J8440K926O0083l077l095
23264G5606l4239M6735N9136k9461o6191o3157Q2192J08117l2642l0125q2235
23253C3736R582n1699J8216m4098j13719K8049J07173K2173o180k711j0053K3704
23241A4173J18408N4299j14726q7682m3641K9219O104p4890P7130O6257J2381
$$ y = [-16098, 30527, 33539, -21342, 45538, 71473, -102112, -60848, 3568, -4250, 78670, 60061, -67889, -105659, -48894, 21413, 75744, 134458, 126499, -20636, -121890, -103613, 3975, 45298, -30847, -35292, -50564, -41279, -38861, -50647, -100060, -141282, -12527, -12000, -82603, -157456, -155933, -177744, -175072, -142833, -90332, -56205, -30804, -28468, -53024, -88084, -38166, -23744, -35074, 6381, -17873, -45150, -111379, -35264, 329, 18769, 21695, 81778, 78701, 75606, 41367, 88102, 147238, 117777, 51586, -11571, 70621, 178738, 146096, 115971, 33736, 43318, -8381, 9835, -34263, -147982, -119933, -12760, 9413, 3233, 522, -9531, 14173, 132581, 186880, 72154, -15528, -59169, -29950, -23846, -98736, -21606, 44651, 57032]
23230E7032j5815J7901N0080N624R7650L8673J3167l886J3929m2421k1604o9519
23218A40811o5438m817N5549J26369R2296p5596m9182q4004j09089n5242N6550
23207B8207k4273p7744j06699l8810N0056J06823M8437q42m8166n877k6881J5906
23195g9863K6981N4118N5307k1665j7163j17974M1080K5640R433k5931n3038M2546
23183f0529j8976o5814q7340J8706O0567Q8199m0307Q886P694O9812P0621P6436
23171A27955j6261j2661K5313o6492o7094J3206l7038K8076p1045J01313K6614
23160E1886m522m2260k8874K7622l6812M3863L2376o3958J8216j650N8215P6872
23148A30974R611l9378k9365l7409n8425l9809L3598O9313m9344m0295k7931Q6407
$$ y = [57032, 41217, 59118, 109198, 114822, 212472, 251145, 264312, 260426, 274355, 231934, 210330, 140811, 75373, 70556, 126105, 252474, 344770, 269174, 219992, 135988, 26899, -28343, 28207, 3934, -73810, -180509, -219319, -169263, -62440, -14003, -14845, -63011, -68888, -95769, -79863, -52882, 1236, 56543, 34878, 17715, -100259, -59179, -33539, -24106, -50037, -103075, -60529, -79505, -145319, -232659, -213953, -153386, -65187, -105494, -96608, -88914, -19102, 51519, 127955, 111694, 99033, 124346, 57854, -9240, 3966, -33072, -4996, -76041, 25272, 51886, 47364, 5104, -23770, 3852, -32960, 10903, 43279, -20679, -2463, -4113, 54102, 130974, 140585, 101207, 71842, 34433, -23992, -63801, -30203, 39110, -10234, -50529, -78460, 7947]
23136G947J6908j1918l8837O4522O2957k0751R6999M1819l8663j8142K7934n9553
23124A31222q7050p4356L5166M4784n7659M0733R4858K525j08733N3436P3060
23113A47986j6925k6520K5354m8723L5503o7668l3471j063N558j6813J3646n8750
23101d1886M6583O5791o1082k7918j8369P0588N027q0889l8540P4250J05667k4149
23089G5073r5251k556m3872M9740L8177j05576K4921L0545O4618P7510k1805o3345
23077B8179k9532m153k5145l1501K5032o066n667P696K7908J8280j36074P072
23065a23971M6635J56969J7460j27818J4587L8643j15839n578P8735R5371R221
23054H4415j65366L9675J12405K026n4077j26248k8823R865O0098N9999k9089
$$ y = [7947, 24855, 12937, -25900, 38622, 101579, 80828, 177827, 219646, 180983, 162841, 190775, 131222, 44172, -30184, 4982, 49766, -7893, 32840, 127698, 130223, 21490, 74926, 147986, 131061, 104541, 129895, 81172, 116675, 49007, 15536, 14473, 20031, 3218, 16864, -41886, 4697, 70488, 9406, -18512, -36881, 33707, 38734, -42155, -80695, -6445, 99222, 75073, -20178, -22734, -66606, -16866, 21311, -84265, -59344, -28799, 35819, 113329, 91524, 28179, -1353, -5506, -30651, -62152, -37120, -43186, -48853, -41157, -13249, 5031, -131043, -123971, -77336, 79633, 97093, -30725, -16138, 22505, -93334, -98912, -20177, 75194, 84415, -80951, -41276, 71129, 73155, 19078, -107170, -135993, -126128, -66030, -6031, -35120]
23043c5120k5432J5039R067R633O1462k9890j3322J489O2893K6100n9826j5685
23031F408N768j7154J6315p4579M3402J04191r6812q8538n8304N3270P6491j7251
23019d6793L3213J30552j08274j43202N5584P0081J02111J3392L0010Q433o3582
23008H1525l4299J0157N5905k0102o2188o4753M2876J11197O251r4194j29316
22997i6941K2758O9974l3517l1836M8325J09520J6264N4450N24k7765p3480r173
22985D9103O2397L9828l8799q6634l5675M2303m6111m3113L0879N4714M8280M2606
22973A19778r8378m8632K3485l4348q9291j22489J23057N6724j5305K0775l0724
22962i5348K1063j7862J2923J32904O2423J7156k1234j43303m466P3391J4277
$$ y = [-35120, -60552, -45513, -36446, -26813, 34649, 4759, -8563, -7074, 55819, 81919, 22093, 6408, 12176, -4978, 11337, -63242, -19840, 84351, -12461, -100999, -159303, -106033, -29542, -46793, -13580, 116972, 8698, -134504, -78920, -8839, 93272, 106664, 136674, 145107, 81525, 47226, 57383, 113288, 93186, 30998, -33755, 9121, 120318, 126569, 32375, -96941, -74183, -4209, -37726, -69562, -21237, 88283, 104547, 158997, 159521, 131756, 58276, 49103, 111500, 151328, 112529, 25895, -9780, 32523, -13588, -56701, -25822, 28892, 77172, 119778, 21400, -27232, -3747, -38095, -127386, -249875, -126818, -70094, -85399, -64624, -95348, -74285, -92147, -79224, 53680, 116103, 133259, 112025, -31278, -35744, 37647, 51924]
22951E1924r4691j18779k5432J6327l7640L961J16336R274m1211N893l0491m0956
22939a85485L6346M4641r334o3120n7043P1276O1401J30744Q3314M3751J2104
22928A68595j22304M0278O5053q121L7936K4559j34514j7379K2973J6382J9480
22917A12938m2142p2952m4818j03803J111Q8667P1407R666L2633M0078n6497o2809
22905b6521m6350l3620K232N2103Q4361l2172K1799M0731K4277l1187k1692P0069
22893A04030J47833O6466M7187J43999n0631q4637k1782M7297M0649N1786j52751
22882C39446j35778n831K0723k3681o4611J3583K9494k4889L3997o5798p8313
22871C8342N7413L8400j36115j607j4381M3573P8825R1840n8106j03034N2618
$$ y = [51924, -42767, -161546, -186978, -170651, -208291, -204330, -87994, -78720, -119931, -114038, -144529, -185485, -149139, -104498, -113832, -176952, -233995, -162719, -101318, 29426, 112740, 156491, 168595, 46291, 86569, 151622, 143501, 181437, 205996, 71482, 54103, 77076, 93458, 112938, 70796, -2156, -46974, -150777, -149666, -60999, 10408, 20074, 52707, 92785, 36288, -26521, -72871, -106491, -104259, -52156, 32205, 33, 21832, 62563, 86840, 55653, 33961, 104030, 251863, 318329, 365516, 509515, 458884, 374247, 352465, 399762, 440411, 492197, 339446, 203668, 197837, 218560, 194879, 130268, 143851, 173345, 148456, 182453, 116655, 38342, 95755, 134155, -1960, -3567, -17948, 25625, 104450, 196290, 138184, 35150, 87768]
22860H7768p4019k8030L2376J12694l2114p4364q802n3242K9717O8935n2489J8949
22848B7379K9752n8831k9432k3182J4879q171J08183P7064l9674J0927J3206j4399
22836A07701m2282p4577m8121n1217K9947k4894m3259J33896J55867j2886j7991
22825A12184l732j2693j3889j29389K1526J518m2955J0516R263P164k0033N103
22813e5417q965K6858j22056m3347J0406K0464o9236j7440m2978k5364J34296
22802a92779J19072J5172j6867K215k6334L0827K2405j6729m6472l5804J3374
22791a31920M3045N5645J12932n4376o9185P7244j0395m8900j38941k6558J19205
22780g2204Q4573m9880l8992k922m688R4186n575k6332P4850O5540m7666p4557
$$ y = [87768, 13749, -14281, 18095, 130789, 98675, 24311, 15509, -37733, -8016, 60919, 8430, 27379, 57131, -1700, -31132, -54314, -39435, -47606, 60577, 137641, 97967, 108894, 122100, 107701, 65419, -9158, -57279, -108496, -78549, -103443, -146702, -12806, 143061, 130175, 112184, 108452, 95759, 81870, -47519, -25993, -24475, -67430, -56914, -47651, -40487, -60520, -55417, -64382, -37524, -159580, -202927, -192521, -172057, -241293, -258733, -301711, -327075, -192779, -73707, -58535, -75402, -73187, -99521, -68694, -46289, -63018, -109490, -145294, -131920, -88875, -33230, 79702, 25326, -43859, 33385, 22990, -25910, -164851, -191409, -72204, 12369, -37511, -76503, -79425, -84113, 10073, 4498, -21834, 53016, 118556, 70890, -3667]
22768c667l615J6849L0039k1605j2458N3420l4912k001m5241N1206O8588j9676
22756G6927k7943m1947R605J1599p364j8258l8042j3643r9886N3090J27441O5287
22744I6866J4808k3630l9834k2435K3714J41P3728L014o1401l0315N8147j19307
22732b6504j70159k2385K3704K1654J08516O8306K3381k1191M7635Q0814k6905
22721A06866O829k0815k0586O8446J3662m6597l9712J4636P9268m5079K4701N1970
22709A93589J229o1729j37212j25747k1829R5306k3491Q3058Q7236n1531o6612
22698b7733p037q657o98Q3275o3777p3271N2578J6381n963M6764q6438j06684
22686a81260K7004l5296L2695Q3834J14734J7230m2339k8997J6196Q684P3489
$$ y = [-3667, -7282, 9567, 39606, 18001, 5543, 58963, 24051, 22050, -23191, 28015, 96603, 76927, 48984, 7037, 16642, 28241, 20877, 2619, -35423, -49066, -148952, -95862, 31579, 96866, 111674, 88044, 48210, 25775, 49489, 49630, 123358, 126372, 64971, 34656, 92803, -26504, -196663, -219048, -195344, -173690, -65174, 3132, 26513, 5322, 52957, 133771, 106866, 113695, 92880, 72294, 140740, 154402, 107805, 68093, 82729, 161997, 116918, 141619, 193589, 194818, 133089, -4123, -129870, -151699, -56393, -79884, 3174, 90410, 38879, -27733, -34770, -43427, -44125, 39150, -24627, -97898, -45320, -28939, -34902, 11862, -74576, -181260, -154256, -189552, -156857, -73023, 41711, 58941, 16602, -12395, 3801, 12485, 85974]
22675H5974P516r3788J6138J2476j0252N972o4273l3688K6033P4245r841L7868
22663E4380J7700P345j01348p2207o4410J5761l8398R3188M4889J3443L29l0470
22651e9798Q1859J56862k6442j02141n5869l0411Q0726M566K2767l4815o2241
22640b4937l4192k1520P3762n8907p6192P4637J31089l5754j32114k68J6968P7635
22628i793P4395L3631o4679L9082J02133l8379j65309j8142n9469K5626J41582
22617F0678O961N5558j286r9038N4414O5920l5505o1841N9113L1273j18229K031
22605B0049R7012N823l0004o5519J7498N1614J17486Q719l3126l5547m9486j14601
22593a0082P1614P2615k8923j1214k4110q7809o9343J485K874L8662k8648Q8762
$$ y = [85974, 93490, -298, 15840, 28316, 18064, 24036, -40237, -73925, -47892, 26353, 16512, 54380, 72080, 79425, -21923, -94130, -158540, -142779, -181177, -87989, -43100, -29657, -29328, -59798, 22061, 178923, 152481, 50340, -5529, -35940, 44786, 49352, 72119, 37304, -24937, -59129, -80649, -6887, -65794, -141986, -67349, 63740, 27986, -104128, -104396, -87428, -9793, 64602, 98233, 33554, 72636, 174769, 136390, -28919, -47061, -106530, -80904, 60678, 67639, 123197, 121911, 22873, 77287, 143207, 107702, 45861, 104974, 136247, 18018, 20049, 117061, 122884, 92880, 27361, 44859, 96473, 213959, 222678, 189552, 154005, 104519, -10082, 61532, 134147, 105224, 94010, 69900, -17909, -87252, -85767, -82893, -44231, -72879, 15883]
22581A5883L5120K4153l0892Q1253L2394m1287M0387k2436n9213j3270r4815n630
22569c8353l0449r9418P5183K5426J3233L8201m1510L117j8209J4981K9373j0850
22557c9275j8092P0269N0232M4907n6811j1816J5519k8409J5431J8416j3558L52
22545D7165p5m7282j24534j16031L8517R4528n7819j7960M7987O8345O08M546
22533f2005K9404Q1538m4390k8031l2505j2618J51477R8889n4888n7139j5282
22522E4450L002k4442k8041l9145n1876L8696l7398l1081J15530l887n2110M7356
22510h946M6988O9604J9191P5733L2361j30983o7651N386m574j47695M732K7790
22498g8064j2150l0132K8696k0879K8514J3584p4543L2201R2405p3694n5242L5999
$$ y = [15883, 51003, 75156, 44264, 125517, 157911, 116624, 157011, 134575, 75362, 62092, -32723, -38353, -68802, -168220, -93037, -67611, -54378, -16177, -57687, -54570, -72779, -57798, -28425, -39275, -57367, 12902, 63134, 108041, 51230, 39414, 54933, 26524, 41955, 60371, 46813, 47165, 47090, -192, -124726, -240757, -202240, -107712, -165531, -183491, -135504, -67159, -66551, -62005, -32601, 48937, 4547, -23484, -55989, -68607, 82870, 181759, 126871, 69732, 54450, 57452, 33010, 4969, -34176, -86052, -47356, -84754, -115835, -305, -4192, -56302, -8946, 38042, 107646, 126837, 202570, 234931, 103948, 36297, 41683, 37109, -110586, -105854, -78064, -90214, -120346, -91650, -112529, -84015, -70431, -144974, -112773, -20368, -94062, -149304, -113305]
22486a13305Q6827N5354l8792k6006o3540m7961n062J40881M8454k6069Q1827
22475I2608J2700r283N5336K898m6605o8320L0314n5589n9219j371k4961k3196
22463i4688k0250M4371p119J3253N8057M7182l4716k3073L7685m8014J4378O4574
22451E1640K8449n5403P712K0892q4034J1261R605k6274k4694j7874L9583P930
22439c1207m1021n5926K5639J11077M0294n0646K1109j5997P1685j33852o3680
22428a22525K2843l3703M6494l5792L219J143M8495P4441K998j9804O6290j9597
22416C4502n9048J06563J39514j27888j37174K6019l175M8089j6583n0205o3642
22405a03028j02481M5033P5421P5629R895K3168k4200J1667k722q908K2325M0994
$$ y = [-113305, -26478, 28876, -9916, -35922, -99462, -147423, -152485, -11604, 36850, 10781, 92608, 105308, 96025, 151361, 154259, 107654, 39334, 69648, 14059, -45160, -46531, -71492, -94688, -114938, -70567, -77686, -64433, -6376, 40806, 6090, -16983, 20702, -27312, -12934, 51640, 80089, 24686, 32398, 53290, -30744, -19483, -9878, -36152, -60846, -78720, -39137, -31207, -72228, -128154, -102515, 8562, 48856, -1790, 19319, 3322, 75007, -58845, -122525, -99682, -133385, -86891, -122683, -119464, -118321, -69826, 4615, 7613, -12191, 54099, 34502, -24546, 82017, 221531, 93643, -43531, -17512, -20687, 27402, 10819, -39386, -103028, -205509, -160476, -85055, -9426, 469, 23637, -563, 11104, 8382, -526, 21799, 62793]
22393F2793N6939p2248m9473K5215k8770k1196N6883P2978l9062k9803m999J9762
22381D9019p2070K2118M8958J20928M2410q0763l755o4644J0433m7368n1438M8542
22369B2370P2355j01294j44506p748J79883R7375k2260n1644l9825N4506k9607
22358B9605j30988k5827k0230N3225L1686j6797M471M8315R190k01810K9307O3861
22346a25992N3741N4981J4341L4302R1537n3453o3446l5402m0097j4346L5948
22335d7886M0437o4936Q8J1864M7498M5765M5842O2006o6483j09926q1453K0764
22323i6420N9654j5100M2223L8627K6057O1345J07595l3999p7774o0940o615j11855
22311f7202n473j7511L3996j05108k5435R4826Q4165R2921n0074k5225r7288j6309
$$ y = [62793, 119732, 47484, -1989, 23226, -5544, -26740, 30143, 103121, 64059, 34256, 29257, 49019, -23051, -933, 48025, 168953, 211363, 130600, 126845, 62201, 72634, 25266, -26172, 22370, 94725, -6569, -151075, -158823, 21060, 118435, 96175, 44531, 4706, 59212, 29605, -101383, -127210, -147440, -94215, -62529, -79326, -74855, -26540, -17350, -219160, -189853, -125992, -72251, -17270, -2929, 31373, 122910, 69457, 6011, -29391, -69488, -83834, -47886, -7449, -72385, -72297, -60433, -12935, 32830, 78672, 140678, 74195, -35731, -117184, -96420, -36766, -51866, -9643, 28984, 55041, 116386, 223981, 189982, 112208, 51268, 44653, -67202, -72675, -90186, -56190, -161298, -186733, -91907, -7742, 85179, 35105, 9880, -87408, -103717]
22299a03717p0769P8493L9008N5503k6056m0646j4277m0513q6913p255J38630
22288g8512Q5962j599j012Q643N6558n1191K0327K7353j01363Q158k4092K9982
22276b0786J1629j01661J27961J04270q0331q4683M9169Q5650R086J9661M643
22265A24608l8504M4677l5426k7024J1139r0298j8817l0138J83406o125j38533
22254b1035j00517k245M3425j3249j03706o1089J3241O432J03726J46473N7048
22243F8504P7306j9004l8772m6712n4612R711n9357l1976j06790N174J50551J2127
22231c3850M503J4759K7795L7305R3807n0956j65957q7880Q7261K4909q2342j5822
22219a46468N0980P0128L0388N1417L5521r729j1139k9867m9765m5361j95N7849
$$ y = [-103717, -174486, -95993, -56985, -1482, -27538, -68184, -82461, -122974, -209887, -217142, -78512, 7450, 5851, 4839, 13482, 70040, 18849, 39176, 66529, -34834, -26676, -50768, -20786, -9157, -110818, 17143, 121413, 41082, -43601, 5568, 91218, 100304, 119965, 124608, 86104, 130781, 95355, 68331, 79470, -10828, -29645, -59783, 123623, 117498, -21035, -121552, -123797, -80372, -93621, -197327, -258416, -245175, -238743, -135017, 11456, 68504, 145810, 126806, 88034, 41322, -13290, -3579, -62936, -94912, -201702, -196528, -45977, -33850, -29347, -14588, 13207, 50512, 144319, 93363, -72594, -160474, -73213, -48304, -130646, -146468, -95488, -25360, 5028, 56445, 91966, 82237, 71098, 41231, -8534, -53895, -54090, 3759]
22207C759j2484M3176O4507p9193l2482J8430n5888N6295n2213j4107R0552P1866
22195A02218k9211l5767m3107l3839M8948N8342j0598k6859R2262o7758j3126
22184D1505M946J12302k0005n9996O836j3534J963l1065l3199m5815j06116q6759
22172b28937M271K1565N4104J93481N9841R0773l1442R524k7432o3406m8130j06703
22160g2491Q2034K485r3630K8619P9654M0037K9270l0084n4735j10890p5434N7520
22148a17645M9421N5584m2763j24089R6928P1641m9368N2928k6139k7570p604
22137f8676m80J57141n3567m5510j0358o6101O3612O7074L6260r5756l5953P2132
22125A9818j0451J6557N9522n3706k139n6019o7861n4434N8508K9392j6285K7343
$$ y = [3759, -8725, 34451, 98958, 19765, -12717, 5713, -50175, 6120, -46093, -60200, 30352, 102218, 73007, 37240, -5867, -39706, 9242, 67584, 56986, 30127, 122389, 54631, 41505, 46451, 158753, 138748, 78752, 85588, 72054, 74017, 42952, 9753, -36062, -142178, -228937, -224666, -203101, -148997, 44484, 104325, 195098, 163656, 173180, 145748, 82342, 34212, -72491, 9543, 12028, -81602, -52983, 26671, 66708, 95978, 65894, 11159, -99731, -175165, -117645, -68224, -12640, -55403, -179492, -82564, -10923, -60291, -7363, -33502, -61072, -68676, -69156, 87985, 34418, -11092, -21450, -87551, -23939, 43135, 79395, -16361, -52314, 19818, 9367, 25924, 85446, 31740, 29601, -26418, -94279, -148713, -90205, -60813, -77098, -49755]
22113d9755P6560k371J7293l1963m1627j5315K9961L2976k0036Q740k4959P796
22101a2700K5326N6166o4529j9484L8913p8972J3497k6963j02480J38439K6000
22090f787n116j9620N2483R0499K8409k3905m2253J07392P5289L27n2707o3148
22078A40863r356p373m2708k4157k8746K6110p3268j14543P7729R2954n0531K0400
22066G374O9751q6121k0881M751q449o394M7888K8783O2909Q5806m7124j41543
22054c250K3039L5662n7674l6561K3457j1365K16R1655J4489M8806L9606J6822
22042A84902n9558N8930k6398J7241J65208l7390r4752n5973L0526k3967j05745
22031E3024j36720q7672j310Q8501J48288Q418j64133n6204P4863P0090m1932
$$ y = [-49755, 26805, 24434, 41727, 9764, -31863, -47178, -17217, 15759, -4277, 4463, -20496, -12700, 12626, 68792, 4263, -15221, 23692, -55280, -41783, -68746, -171226, -32787, -6787, -11903, -31523, 20960, 111459, 139868, 115963, 73710, 181102, 256391, 256718, 204011, 140863, 131507, 124134, 81426, 57269, 28523, 54633, -18635, -133178, -55449, 37505, -13026, 7374, 77125, -8996, -29877, -25126, -33575, -39969, 7919, 36702, 99611, 185417, 138293, -3250, 19789, 55451, -2223, -38784, -15327, -26692, -26476, 65179, 79668, 128474, 168080, 184902, 125344, 184274, 157876, 175117, 340325, 302935, 208183, 152210, 182736, 158769, 53024, -83696, -171368, -172678, -84177, 64111, 72529, -91604, -147808, -72945, -2855, -44787]
22020d4787l9494o4241l5256J17730R2221q0122q0985L7509K7087m268L0206J7137
22008b7263J9028q2653q1683j7908P6819L2168M6460K618m2079o8568R7769R6843
21996E1551M6968L7519J8540L1627K4475o6754j09280q0305K9131J3105j07451
21985a10874j6267m0165L430M5137R8615J02840J14241o6698k2022P8852j5690
21974A71399j4185j03846p2610q6041J0010O6568O3706J5386J20836j7300r1271
21963F2652o1283K1798Q7884N7899j37400j52343K6866M5820k4218r0485O4496
21952i8314J14060J0208l7312M704k689n2370k8885L649o620L6345L4799j7098
21940c9523Q8077J3990L6203k4931J0612K2522m7922n6993l3896M2740J6066j6937
$$ y = [-44787, -84281, -148522, -183778, -66048, 26173, -53949, -134934, -97425, -70338, -74606, -44400, -27263, -8235, -90888, -172571, -190479, -113660, -81492, -35032, -32414, -74493, -143061, -45292, 51551, 98519, 136038, 154578, 186205, 210680, 143926, 34646, -45659, -16528, -3423, -110874, -127141, -167306, -163876, -118739, -20124, 82716, 196957, 130259, 108237, 187089, 171399, 157214, 53368, -19242, -105283, -95273, -28705, 35001, 50387, 171223, 153923, 62652, 1369, 23167, 111051, 168950, 31550, -120793, -93927, -48107, -72325, -162810, -98314, 15746, 25954, -11358, -6654, -9343, -61713, -90598, -86949, -93569, -57224, -22425, -39523, 48554, 62544, 98747, 73816, 84428, 106950, 59028, 2035, -31861, 10879, 26945, 10008]
21928A0008Q0132l4207M1883p0714l9072l7189L0676o7392j0467L9899L201J01685
21916D8443M5198j1077K4332o7190p2277L9669M9446m7124l6245l5704K4344K2496
21904a5689K0908O2931M9904j43452K06L0102P6668p3960m0946l1970M2365l7600
21892f0533m923J10314O9670L7068j9579N562n1036o4043j7272r1672m3261L1185
21880i8520J0926P598N5533R96K0662J27459n000j05483q3468M6294r605K3743
21868h865L6809L8553K3847k0350M9495Q7676k9825n653o907j08822n458L5362
21856H5862l7013P696K2192p6139J9648J6903p7100P4912Q574j30372J70673O5541
21844A51377L4296m1521J1256o7598j57767K8899R5724q994N1377R350j5037k4153
$$ y = [10008, 90140, 55933, 97816, 27102, -11970, -49159, -18483, -85875, -96342, -56443, -53242, 48443, 93641, 82564, 106896, 39706, -32571, 7098, 56544, 9420, -26825, -62529, -38185, -15689, 5219, 68150, 118054, -25398, -25192, 4910, 81578, 7618, -33328, -65298, -22933, -60533, -65456, 44858, 114528, 151596, 132017, 137579, 86543, 22500, 5228, -86444, -129705, -98520, -87594, -79996, -24463, -23467, -2805, 124654, 119654, 14171, -69297, -23003, -32608, -8865, 27944, 66497, 90344, 69994, 119489, 207165, 177340, 171687, 164780, 55958, 50500, 85862, 48849, 56545, 78737, 2598, 22246, 39149, -37951, 36961, 45535, -84837, 85836, 151377, 185673, 144152, 155408, 87810, -69957, -41058, 54666, 45672, 97049, 106399, 91362, 67209]
21832F7209Q615l8518m0516j12P8139l461l6004n0289m8544M9716K5136K3208
21820C4579q6288j11238N2193M8168J15769R2072N3808Q6678j160j11456q3696
21809H9429Q1263k7513k7953j67190j05690L2222J14774J15453O5007J5484O8875
21798B54161J4360l8045j74744p2609j6675M9669J3683M2537j1487N6812M7232
21787A64894J6000K9645l2875n003J1344l7836K8784l1647L5792L421j3032m4827
21775A24660p3906j8824L3115L3879k5499l9311n7390L0007K5504P3924p2444
21764C3715l4734M145J11348J5882M862n2161j57231K2929O9662m6548p3555m1784
21752a43470M8625L2578m9884j0927n5713P9808L9553N8983O9594Q003j8111q004
$$ y = [67209, 75824, 37306, -3210, -3322, 74817, 71356, 35352, -14937, -63481, -13765, 11371, 34579, -51709, -162947, -110754, -62586, 53183, 145255, 199063, 285741, 284581, 173125, 89429, 170692, 143179, 115226, -51964, -157654, -125432, -10658, 104795, 169802, 185286, 254161, 268521, 230476, 55732, -16877, -33552, 16117, 29800, 72337, 60850, 117662, 164894, 180894, 210539, 177664, 172661, 184005, 146169, 174953, 143306, 179098, 182519, 169487, 124660, 50754, 31930, 65045, 98924, 73425, 34114, -23276, 6731, 32235, 106159, 33715, -1019, 3126, 114474, 130356, 135218, 83057, -74174, -51245, 18417, -28131, -101686, -143470, -94845, -62267, -112151, -123078, -178791, -98983, -59430, -447, 69147, 77150, 59039, 51035]
21740E1035l0490L6535n7291J3374L1532O2363N8064J7593q990j4492k5209k839
21728A31185M9847p1192l5717q0067L2221K1089l9792l3775N3440J04990L651
21717A35880p2035M725M0727M410N9618k9250p1951o6640J2126P8959N4481j1540
21705A39510k3540N8890m9018n1173n4924K4978O6523p8717j206L5257n7243P7249
21693H6586K8721L5138L5072K2755k8209m7373J5865p5141l5082Q9936m735k2635
21681A00898r742R1592l2694k1881N4008r0303j54792j55364k4072p015k6390
21670b75755K2409Q345M1701J44955J20404o5070L7275p2748k481l8116R699L7428
21658c1954m8467j3720N6742L4973p748l3532J9353N7197j7784r681J21427k0491
$$ y = [51035, 20545, 57080, -211, 13163, 44695, 107058, 165122, 182715, 173725, 159233, 134024, 131185, 181032, 109840, 74123, -5944, 26277, 47366, 7574, -26201, 27239, 132229, 135880, 63845, 68570, 109297, 113707, 173325, 144075, 72124, 5484, 17610, 96569, 151050, 139510, 115970, 174860, 125842, 74669, 19745, 44723, 111246, 32529, 31323, 66580, 9337, 86586, 115307, 150445, 185517, 208272, 180063, 132690, 148555, 73414, 38332, 128268, 123533, 100898, 91156, 182748, 150054, 128173, 182181, 91878, -62914, -218278, -242350, -249365, -275755, -253346, -245001, -203300, -58345, 62059, -3011, 34264, -38484, -40965, -79081, -69382, -31954, -80421, -94141, -37399, -2426, -10174, -43706, -24353, 32844, 15060, 5379, 126806, 106315]
21646A06315j24020M9753Q0840P218q4185j12751q1474O6218J71166q1771K0285
21635A7594J43602j85p2474O3422J0603j5162l3018o8480p352Q2053l6227j9120
21623F5256o1633j7123m7628j1946k6026N119Q6809J2356O5718J75309P2682j12064
21611B06829J0935r6683p9287j7848J18720N2477l1217j11471K1766L0268k5203
21600G9286Q2436N6864J51q5503p1095m7674j44452n0508N8387J09244O6226p9289
21588b5927m4366k8245j1941M7976Q2860L4140J9731o3410l9470N8636j4987J2703
21576B7700O8734m9285j59992L7136J47049J12144K6841j24062j1824M5120Q8243
21565B07804Q4409o4569j40485j53586m9552n827K0224J07099P9914j4846k332
$$ y = [106315, -17705, 32048, 112888, 120106, 35921, -76830, -158304, -92086, 79080, -2691, 17594, 161196, 161011, 88537, 151959, 162562, 147400, 114382, 45902, 38550, 120603, 84376, 65256, 3623, -13500, -61128, -73074, -99100, -93981, -7172, 5184, 70902, 246211, 318893, 206829, 217764, 121081, 41794, 23946, 142666, 195143, 163926, 52455, 74221, 104489, 79286, 161722, 218586, 218737, 133234, 62139, 14465, -129987, -180495, -122108, -12864, 53362, -25927, -70293, -98538, -110479, -62503, 20357, 54497, 74228, 10818, -28652, 29984, 14997, 27700, 96434, 47149, -112843, -75707, 71342, 183486, 210327, 86265, 74441, 119561, 207804, 292213, 227644, 87159, -66427, -115979, -121806, -101582, 5517, 85431, 70585, 68253]
21554F8253l2981L8395P7945J4468l3393m7290N4435l4090p5811k6386K3727k5811
21542A461k9988M6254O299j7447L3979l6930J6179m2731K0313J16350K9465k398
21530A40806P7928M4556j20795p0894J3515O9540J5732N9013K1643l6824n0824
21519A63396L4430k7174l3810o6134r9517J9304R5597N2455l1196l3047M458J4901
21507I3663J37681j26842q7029o5304k5172m0445P4413Q3113J7831k7157k5190
21496I562o1485O1671O8664J08065L9796M6187j28832j25827l3205k3500J7599
21485b1305P0130l6334M508L3803o4525J24957L8591k3451j7587L3259J0870r802
21473A43114M3251N9735o0093l4231L6791N5468p0506r0890k7741K4623J07456
$$ y = [68253, 35272, 73667, 151612, 166080, 132687, 85397, 139832, 105742, 29931, 3545, 27272, 1461, -28527, 17727, 24026, 6579, 40558, 3628, 19807, -22924, -2611, 113739, 143204, 140806, 218734, 263290, 142495, 71601, 85116, 154656, 170388, 229401, 251044, 214220, 163396, 197826, 170652, 136842, 70708, -28809, -9505, 86092, 138547, 107351, 74304, 78762, 93663, 231344, 104502, 17473, -47831, -73003, -113448, -39035, 44078, 61909, 34752, 9562, -51923, 9748, 78412, 186477, 226273, 272460, 143628, 17801, -15404, -38904, -21305, 48825, 12491, 16999, 50802, -13723, 111234, 149825, 126374, 108787, 142046, 152916, 143114, 186365, 246100, 186007, 151776, 188567, 244035, 173529, 82639, 54898, 79521, 186977]
21462A86977J5124J7903L4004p738l7517k9858n1692O6242M6923N2278L8179O7178
21450C98003R4361J11150J76196J23758J52028J30393J0879o1449k9101N7519
21440A163737J7068j914O5576Q0505r9087j63955m7787J12230P6998O5396j3678
21429A255089n2563j54164q2188m8802q2456l7155l685q0032m2694n8989p7355
21418E35006k1297J1480J0379K9007K4154M261O6947l84K9159M1142n0652N6284
21406G35486q6201q7712J9865k0770k6788q525N964N5943P0804J13796O0713k2984
21394H09591l6908M045O7714j39104k53605p8763j4220K1595q1871k6142k3027
21383B49305M2952L4129L1535j8322m5060j01725N023m5321p3903n7781L7602
$$ y = [186977, 202101, 220004, 254008, 246270, 208753, 178895, 127203, 193445, 240368, 292646, 330825, 398003, 492364, 603514, 779710, 903468, 1055496, 1185889, 1196768, 1135319, 1106218, 1163737, 1180805, 1178891, 1244467, 1324972, 1225885, 1061930, 1014143, 1126373, 1203371, 1268767, 1255089, 1202526, 1048362, 966174, 917372, 834916, 797761, 794076, 714044, 671350, 612361, 535006, 513709, 525189, 535568, 564575, 588729, 592990, 659937, 659553, 688712, 729854, 679202, 735486, 649285, 561573, 581438, 560668, 533880, 525355, 531319, 587262, 658066, 771862, 832575, 809591, 772683, 776728, 844442, 705338, 451733, 372970, 358750, 380345, 298474, 272332, 249305, 292257, 326386, 357921, 339599, 294539, 192814, 197837, 152516, 78613, 20832, 58434]
21372E8434j975k9046M3692Q9258o5944o705j2084r1029N9841M6633J8397O9190
21360A78662P4711J8894L3878o5320r7536q3406L724N1353O1591Q786j767l2331
21348A51239P822l3863P3613m0876m4018n0017j352L915M6836J07047n4209m1489
21336A24648M5009j4990K2573k3765j33859m2319P8446N8595q2295j15448J67612
21325H4207R6619J1614n6098p2175R8794l9787r3471N4038N2723J48633j0612
21314B74485j35033o1942l8178j5376J7067J56306J2393j53280j2488M2325k4989
21303F1290O5797l9812r2840N5695k0085n7044L1263P4352J33581J81525n7547
21292C36175n4081q9518j14023P8735M9014j26672N245p0262J00368P0236j80092
$$ y = [58434, 56459, 27413, 71105, 160363, 94419, 87714, 75630, -15399, 44442, 91075, 109472, 178662, 253373, 272267, 306145, 240825, 143289, 59883, 63607, 114960, 176551, 185337, 183570, 151239, 159061, 125198, 198811, 157935, 113917, 63900, 62548, 66463, 113299, 220346, 166137, 124648, 169657, 154667, 177240, 153475, 19616, -22703, 55743, 114338, 32043, -83405, 84207, 180826, 192440, 136342, 64167, 162961, 123174, 29703, 83741, 136464, 285097, 274485, 139452, 77510, 39332, 23956, 41023, 197329, 209722, 56442, 43954, 86279, 61290, 127087, 87275, -5565, 50130, 30045, -26999, 4264, 78616, 212197, 393722, 336175, 282094, 192576, 78553, 157288, 206302, 79630, 84875, 14613, 114981, 185217, 5125]
21281E125l3276N9543P8919j4088j03879l0853M3167N9760J03507J1573j01941
21270G7557k463J34381N6304j28063j12830p1285r8096O5237P1625N7477R3928
21259A43772L9595K6010o7073o5333J8572P2894P981n5002k2482o3186M7587k7025
21247E6310J8829O2027L1949J0589O0534M5602l9957l2456k9834L3866m4126J341
21235A74674J23224J7507O856k9155r2329o7519M2538k9880j21614P4713k4293
21224G4722l1486j12396j8214J31966Q6652K4885q6882N7011n346o0040L5683
21213I6555L3456l6221J01107K5685j7089j21757K0762J2885l921Q1109L0735
21202B23306o8183l7880l9818L9186l3566p1106O9484L1558J2104N1560n0014
$$ y = [5125, -28151, 31392, 110311, 96223, -7656, -38509, 4658, 64418, 167925, 179498, 77557, 75094, 209475, 265779, 137716, 24886, -46399, -144495, -79258, -7633, 49844, 143772, 183367, 209377, 142304, 76971, 95543, 168437, 176418, 121416, 98934, 35748, 83335, 56310, 75139, 137166, 169115, 179704, 240238, 285840, 245883, 213427, 183593, 217459, 173333, 174674, 297898, 315405, 322261, 293106, 200777, 133258, 175796, 145916, 24302, 99015, 74722, 43236, -69160, -87374, 44592, 131244, 156129, 69247, 126258, 120912, 60872, 96555, 130011, 93790, 194897, 220582, 203493, 81736, 102498, 115383, 111462, 192571, 223306, 155123, 117243, 77425, 116611, 83045, 11939, 81423, 112981, 125085, 176645, 126631]
21191A26631l0538J01732J56233L3355j34295r6249m1300M6254R1598n1551m2671
21180A59199j00021j07720N1689J11077j2330M152J42803P2219k3184o7450o0447
21169A69987m6626q2978K5405M3958P8164Q7444j7758r6089P3329R8956p281j96847
21157A29664j7424R9309O3998L3373k3243j0181p1872o1554n653P6633L5747j7600
21145B31197p3550j135J7588M0678J02352M9537K9810M8891R424L884j14284m6383
21133B98009P6012m0164m1106k6234j11816N11J9856Q9261J09064l5394L5799
21122C73798M5193J13591Q7389K2028L8455K1679k2316j04045l4066k2276r9096
21111D20334j1841n445M7674m9070p8377l4928N7097L5854l4214l5193O655L578
$$ y = [126631, 96093, 197825, 354058, 387413, 253118, 156869, 115569, 161823, 253421, 201870, 159199, 59178, -48542, 3147, 114224, 101894, 106046, 248849, 321068, 297884, 230434, 169987, 123361, 40383, 65788, 109746, 187910, 275354, 257596, 161507, 234836, 333792, 326511, 129664, 112240, 211549, 275547, 308920, 285677, 275496, 203624, 142070, 136417, 213050, 248797, 231197, 157647, 156512, 174100, 214778, 317130, 366667, 396477, 445368, 454792, 458676, 344392, 298009, 374021, 333857, 292751, 266517, 154701, 155212, 175068, 264329, 373393, 337999, 373798, 418991, 532582, 619971, 641999, 680454, 702133, 679817, 575772, 541706, 519430, 420334, 408493, 403048, 450722, 401652, 323275, 288347, 345444, 381298, 347084, 311891, 318546, 322124]
21099C22124j3281O0373N2563M164n3198O0655P6893P442O498q4138j01957l4730
21087C03408n8344P776k7197k8307K1380n739j02511L1910O8458R8544K3992j01661
21075B31709m4539k9583o4284K9088K3491J25130k1588q9468M0301j7749K9444
21064B11952k328j309O4367J11222m0852K0655M2466k28624J829J7717j3712p7762
21052A05621o354O1297L6539O6242L7586Q2744L6458M991K7389Q3515M7050q930
21040E74148J7461n1475r2683l0201N9938q6282q0271N3062K3595M5674l8699
21029C94267K6353M6618n6216N2036K705J03866p4457L4988L0207m0966J7341
21018E36742K443r7344N1416j3225l0007k2691K1986k1315O2797K3763O0057J4608
$$ y = [322124, 308843, 369216, 421779, 425943, 372745, 433400, 510293, 517735, 524233, 440095, 338138, 303408, 245064, 252840, 225643, 197336, 218716, 212977, 110466, 142376, 210834, 309378, 333370, 231709, 187170, 157587, 93303, 122391, 145882, 271012, 249424, 159956, 200257, 182508, 211952, 209624, 208315, 272682, 383904, 343052, 363707, 406173, 177549, 179378, 197095, 183383, 105621, 99267, 160564, 197103, 263345, 300931, 383675, 420133, 425124, 452513, 536028, 583078, 574148, 591609, 540134, 447451, 417250, 477188, 390906, 310635, 363697, 387292, 432966, 394267, 420620, 467238, 411022, 463058, 465763, 569629, 495172, 530160, 560367, 519401, 536742, 539185, 441841, 493257, 480032, 450025, 427334, 449320, 428005, 490802, 514565, 574622, 589230]
21006E89230J7101k9665k7045l3499m1432l6420P7829N8232m6906J0168p1010
20995D66583J1937J06117K6435M6375n9241O610R7988R3468q4614r8081J4755
20984F28332k0045j5345j6433J23450J79128J95916J92159Q8083m4903j6091o383
20973A287868l9349p9268J8595K0522M5648K16667P3938O7687j7207J8997M9152
20962A663250Q0209n0431o6822K0207M7358p0256j93J10738j6198N6300J00279
20951A874441m6924J9965J68434K2931r6061O893J93624K7099K5761J27527J23808
20940B447498J5978j47315j22776o6151q9549K1226P9178J23378N7396O7962R1953
20929B478778n9627K8509K2722k5591P9231M8012q871j9988L6575J80772O3989
$$ y = [589230, 606331, 576666, 549621, 516122, 474690, 438270, 516099, 574331, 527425, 537593, 466583, 478520, 584637, 611072, 657447, 598206, 604816, 702804, 796272, 711658, 613577, 628332, 608287, 592942, 576509, 699959, 879087, 1075003, 1267162, 1355245, 1310342, 1294251, 1287868, 1248519, 1169251, 1187846, 1208368, 1254016, 1470683, 1544621, 1612308, 1595101, 1614098, 1663250, 1743459, 1693028, 1626206, 1646413, 1693771, 1623515, 1623322, 1734060, 1717862, 1774162, 1874441, 1827517, 1847482, 2015916, 2038847, 1942786, 1949679, 2143303, 2170402, 2196163, 2323690, 2447498, 2463476, 2316161, 2193385, 2127234, 2037685, 2058911, 2138089, 2261467, 2318863, 2386825, 2478778, 2419151, 2447660, 2470382, 2444791, 2524022, 2572034, 2563163, 2543175, 2579750, 2760522, 2824511]
20918B824511j5058J28679J76041J41318K69301L36289J32922K31597L23168L88332
20908D937100M60215L59702M53021N07397N24286N92012P33009O61004O10785
20899I838531O28960P32723Q05131Q31629R25067J317364J688753K202394K754154
20890B1724706L282609L956311M986281O232057P644837Q561683R261790R513955
20882G5164229R492014J0265287J2215348J2240644O164578j377291j085078K070192
20874A25149923N85062j584970K146538R321366J4775349J7834892J9789074K4212434
20866B12229668L0288119L3267499K9493773K7658783K9443424K3010364J1841572
20859C97233202J0671800J8276471J4886740j4520186n8611167q0595377o9203867
$$ y = [2824511, 2809453, 2938132, 3114173, 3255491, 3524792, 3861081, 3994003, 4225600, 4548768, 4937100, 5397315, 5757017, 6210038, 6717435, 7241721, 7833733, 8566742, 9227746, 9838531, 10467491, 11200214, 12005345, 12836974, 13762041, 15079405, 16768158, 18970552, 21724706, 25007315, 28963626, 33949907, 40181964, 47826801, 56388484, 65650274, 75164229, 84656243, 94921530, 107136878, 119377522, 125542100, 124164809, 123079731, 125149923, 125734985, 124150015, 126296553, 135617919, 150393268, 168228160, 188017234, 212229668, 242517787, 275785286, 305279059, 332937842, 362381266, 385391630, 397233202, 407905002, 426181473, 441068213, 426548027, 367936860, 287341483, 218137616]
20852B18137616m7429708l0617913j9838416j3560799r842860p346810n426022
20845H4075088m258297m019785m633259n056677n275631n452690n097256m828314
20837D5453179m419491l780905l289957k752825k285235k116947j862553j458336
20829B3486930j311465j253361j196459j210610j148053j193289j162489j020757
20821A3990447r75626r47487o98548o47749o32125n61163m02339n69717n50466
20812H005227l66281m50436o90679o44916n66198m98571m08406l35984k27445
20803C816311k08898k24794j57999k70969k47734j44955j11255q7093m1667j53886
20793B167061k33115j47949j61097j85915l0548J0004j2243n7042j37875k01152
$$ y = [218137616, 170707908, 140089995, 120251579, 106690780, 96847920, 89501110, 84075088, 79816791, 75797006, 71163747, 66107070, 60831439, 55378749, 50281493, 45453179, 41033688, 37252783, 33962826, 31210001, 28924766, 26807819, 24945266, 23486930, 22175465, 20922104, 19725645, 18515035, 17366982, 16173693, 15011204, 13990447, 13014821, 12067334, 11368786, 10721037, 10088912, 9527749, 9125410, 8555693, 8005227, 7638946, 7188510, 6497831, 5852915, 5286717, 4788146, 4379740, 4043756, 3816311, 3607413, 3382619, 3224620, 2953651, 2705917, 2560962, 2449707, 2362614, 2320947, 2167061, 1933946, 1785997, 1624900, 1438985, 1408437, 1418441, 1406198, 1349156, 1211281, 1010129]
20783A010129j41179L9549O8858l0418m9177o8166j72786l9081R169m1765o9779
20772E15354L7763K1647m105j58191q1668M4290J03961L770J2057l396J7335l3816
20760D75001n7299N7239J16696J43339K4946J0829P3815J357l2522r4008n7115
20749F62278N5368O0168L1586Q5635K4459n7593j4832m52L3446l1492J38663R8197
20737A085431n6531m0999J01459J77421R414J3253J3510P7755j61086j19246L8597
20726A138978l4654n5600r4330m2590M8571P566O4436O1014q3068j00169p4289
20715H35865M4485k6134j57215l8192O0406M0533j9099j41934n9357Q7878p237
20704F19999p9862l5n1879k3406N0109K5233l9562q4485L2253K1888j13169r4193
$$ y = [1010129, 868950, 908499, 977357, 946939, 897762, 829596, 656810, 617729, 626898, 585133, 515354, 553117, 574764, 570659, 412468, 330800, 375090, 479051, 482821, 494878, 491482, 508817, 475001, 417702, 474941, 591637, 734976, 759922, 770751, 844566, 845923, 813401, 719393, 662278, 717646, 777814, 809400, 895035, 919494, 861901, 847069, 846617, 880063, 848571, 987234, 1085431, 1028900, 987901, 1089360, 1266781, 1276195, 1289448, 1302958, 1380713, 1219627, 1100381, 1138978, 1104324, 1048724, 954394, 911804, 960375, 967941, 1032377, 1093391, 1010323, 910154, 835865, 880350, 854216, 697001, 658809, 719215, 759748, 740649, 598715, 539358, 627236, 619999, 540137, 540102, 488223, 464817, 514926, 540159, 500597, 416112, 448365, 470253, 357084, 262891]
20692B62891L6808O8034M3253K9952p2050r8329P7163J6021q9736l2905n4197
20681A86905k3915M7816K0535k3631l7752k5601J01378K3047J2583r0281J2013
20670B03097N7721k6275j4949M530j5794o2876Q841Q9741J37816o3328o1379l1202
20658B25943l8909j5613o0035k4995J6917m2989M8476R678l9567j1451K4237n4265
20646C7427k626Q4511p7932j5355j9933l3872J50672N8428L1719j16589j8783
20635G7667L5962k7728l6969j6601q747L8022J21023K5998j28534n1471O851J10913
20623A46386N3762R3579j5568k3751M5611k2850O7508l2363j19630K3852J2218
20612B28754J1030p2910n2643N0228M0142N1369q119m3753L101J3710M0961J0298
$$ y = [262891, 299699, 367733, 410986, 440938, 368888, 270559, 347722, 363743, 274007, 241102, 186905, 162990, 210806, 231341, 207710, 169958, 144357, 245735, 268782, 281365, 191084, 203097, 260818, 234543, 219594, 224124, 208330, 145454, 154295, 244036, 381852, 318524, 257145, 225943, 187034, 171421, 111386, 86391, 103308, 60319, 108795, 118473, 78906, 67455, 91692, 37427, 34801, 119312, 41380, 26025, 6092, -27780, 122892, 181320, 213039, 96450, 77667, 113629, 85901, 48932, 32331, 23584, 61606, 182629, 208627, 80093, 28622, 35473, 146386, 200148, 293727, 278159, 254408, 300019, 277169, 344677, 312314, 192684, 216536, 228754, 239784, 166874, 114231, 164459, 204601, 255970, 247851, 204098, 207199, 220909, 261870, 272168]
20600B72168n0856j30826j78117R0916J58891L8350n5323j5939j43792M4570O1552
20589I1594L2488j6384o494l1315o6912n8923K4121L9325R9358J7281m433o814
20577A12892Q371J48747r8800j2142L9243q4833l2429k653n029Q2368N6225j5137
20565A96823j02929K8677k058n1277J301j7026m9717P2870O4692q4127l9987J14927
20553A32169j00365l9351q97M427J9610M7260n933j10470M1281j1224o210k8697
20541e8400K6361L6323q7535k6753M4849k5463P8610P32r6930J2579J08734M7285
20529F0392p2732r5658m2752n3480o3037M5637R1530j0938m1660J16840J4755
20518e1103j088o5731p832l6532m1943o9099L6803L9479R4452O9955R7691O5599
$$ y = [272168, 221312, 90486, -87631, 3285, 162176, 200526, 145203, 129264, -14528, 30042, 91594, 124082, 107698, 101204, 69889, 2977, -55946, -31825, 7500, 106858, 124139, 119706, 112892, 121263, 270010, 171210, 159068, 198311, 113478, 81049, 78396, 73367, 155735, 211960, 196823, 93894, 122571, 120513, 69236, 70537, 53511, 3794, 76664, 141356, 57229, 17242, 132169, 31804, -7547, -8444, -4017, 15593, 62853, 56920, -53550, -12269, -23493, -29703, -58400, -32039, 4284, -83251, -110004, -65155, -90618, -12008, -11276, -108206, -95627, 13107, 60392, -12340, -107998, -150750, -204230, -267267, -221630, -130100, -141038, -182698, -65858, -51103, -52191, -117922, -125754, -162286, -204229, -273328, -236525, -197046, -102594, -32639, 65052, 130651]
20506A30651N7652l9128m0352j55943M1893O7072L2775n3957j52793L0541M2762
20495c8827n0516j808J06690l337K4216K5393q5298j3976l2679M9718N4179j10677
20483g6922r7978K9635j3134M3756J58550N109J7027j8060l1157Q532N1709j3881
20471F3186j4500N2985p2000m299L7517N8279j8495O794o952j4152m7833q6R4754
20458A35198J0394O8511n8569j01646j3295l713k7264Q2196k7825l4222j4904
20447A4861k9144k4236M3843M2445R7086J6633r0303M7671r38k9258O967j9836
20435G5791J1943M7435L026m7440N8604Q1798K7711Q6701R8541K971r991l927
20423D33163l7885M1217O4203j4565k5709l6713l5960j03116o594N4846P432L1573
$$ y = [130651, 188303, 149175, 108823, -47120, -5227, 61845, 94620, 40663, -112130, -81589, -38827, -89343, -91151, 15539, 12202, 36418, 61811, -23487, -37463, -70142, -20424, 33755, -76922, -174900, -145265, -158399, -114643, 43907, 49016, 66043, 47983, 16826, 25358, 77067, 63186, 48686, 101671, 29671, 25372, 62889, 121168, 102673, 109467, 102515, 88363, 40530, 40444, 135198, 145592, 214103, 155534, 53888, 40593, 36880, 9616, 91812, 63987, 29765, 14861, -14283, -38519, 5324, 47769, 144855, 161488, 71185, 118856, 117918, 88660, 95627, 75791, 87734, 135169, 138195, 90755, 149359, 231157, 258868, 345569, 444110, 447081, 437090, 433163, 395278, 436495, 500698, 486133, 460424, 423711, 387751, 284635, 278041, 332887, 340319, 371892]
20411C71892J1198r562j8450m4254q6345n1135n045l508l9992L5062J00216K5714
20399B85791j49277p6999P0914m652j2750m0391o6856m8500o588J2138N4758L9461
20387E7049q7938K6537L7314J40125M4083o3634j8850K4404M5519n8505q3029
20376F3075j3127P149k175R2765J93070N5960j5499Q921N4388l3736L3139P5429
20364E19359p0048l49k6497O619p8757k5131N014n5030r5639R6665K21747K5740
20352E23693j8500P2265O0490k9574m3801l6113M6200O4591K04037m8106j5570
20341G79612m8275k9343k26k0525k5867p9260l7774j1087K7689L2669p1736j5085
20329E00792m5707l4582K299j5132j9973q9076o2990n2791l7049P3224R728O2046
$$ y = [371892, 383090, 373528, 355078, 310824, 224479, 173344, 168299, 164791, 124799, 159861, 260077, 285791, 136514, 59515, 130429, 125777, 113027, 72636, 5780, -42720, -49308, -37170, 17588, 57049, -30889, -4352, 32962, 173087, 217170, 153536, 134686, 159090, 204609, 146104, 63075, 49948, 57097, 54922, 147687, 340757, 396717, 381218, 390139, 444527, 410791, 443930, 519359, 449311, 448962, 422465, 429084, 350327, 325196, 330210, 275180, 179541, 276206, 497953, 523693, 505193, 577458, 637948, 608374, 564573, 528460, 574660, 639251, 843288, 795182, 779612, 731337, 701994, 701768, 681243, 655376, 576116, 538342, 527255, 554944, 587613, 515877, 500792, 455085, 420503, 422802, 407670, 387697, 298621, 235631, 182840, 145791, 219015, 228743, 290789]
20317B90789N4236l9224m6370r5850k0678n4725L737J23987P7103k3110L1943
20306C01838n5009o5593j28646l8701J6238L8317J33720J02605j21052j95681
20296a1964m6076P0048R5493R4351o276J7658N4006R0256o266q5858N8431N4465
20284C78268J4067J37764K22229J41266M6601M1625J09798K05319J6813K2262
20274A336012o6653j74323J1918m2069k121J62269O4980L1794J6767j20213q4331
20263A134030K665n2294j03583j48853j37205p0924j63432r4808l5148m8882L3187
20252C14753o5392J4222P6040K1730M1669P166n9229L7314J0885r3872j5754j28110
20240A61422o9271p344L649k9188R7434O7052q070m6237L1984m8918j24001k0246
$$ y = [290789, 345025, 305801, 259431, 163581, 142903, 88178, 91915, 215902, 293005, 269895, 301838, 246829, 181236, 52590, 13889, 30127, 68444, 202164, 304769, 183717, -11964, -58040, 12008, 107501, 201852, 195576, 213234, 267240, 357496, 351230, 265372, 323803, 378268, 392335, 530099, 752328, 893594, 940195, 981820, 1091618, 1296937, 1313750, 1336012, 1269359, 1095036, 1106954, 1064885, 1062764, 1225033, 1290013, 1321807, 1338574, 1218361, 1134030, 1136695, 1084401, 980818, 831965, 694760, 623836, 460404, 365596, 330448, 281566, 314753, 249361, 263583, 339623, 361353, 403022, 410188, 350959, 388273, 399158, 305286, 289532, 161422, 92151, 84807, 88456, 59268, 156702, 223754, 215684, 169447, 201431, 152513, 28512, 8266]
20228H266J55107R3421m7715j50932l9910M5154J35369J26407j823n723r0974
20217B26647n6426L8995j08627q3111Q545J6300k7102L7039J04735k1199K2794
20206A58590l3409l7424L7414K98J04673M2068O4923J8854n0108o0570Q503P3764
20194C27576J08349J10463M7724N5740j06676j05306j24082k1916l4585j9416
20184B37871j5538k1658n8366J6907k6592q0244J07267Q9601j62729j26356N1155
20173A1318J4428l560K4168L6734K3312k6477P9235O9621l4542r0444l9209L5102
20161I9686N6552k6047J21807J06388L4927j93515k60968J3584J26226L9282N3333
20150A71255k4971n4170O4859J09344J1594o6611J05549J4227J09090K30864J22532
$$ y = [8266, 163373, 256794, 209079, 58147, 18237, 63391, 198760, 325167, 323344, 317621, 226647, 170221, 209216, 100589, 17478, 26023, 42323, 15221, 52260, 156995, 135796, 158590, 125181, 87757, 125171, 125469, 230142, 272210, 337133, 355987, 305879, 245309, 253812, 327576, 435925, 546388, 594112, 649852, 543176, 437870, 313788, 291872, 257287, 237871, 222333, 200675, 142309, 159216, 132624, 52380, 159647, 249248, 86519, -39837, 11318, 25746, 22186, 46354, 83088, 106400, 79923, 159158, 228779, 194237, 103793, 64584, 99686, 156238, 130191, 251998, 358386, 393313, 199798, -61170, -47586, 78640, 117922, 171255, 146284, 92114, 156973, 266317, 277911, 211300, 316849, 331076, 440166, 671030, 793562]
20139G93562P219Q2508j6034j27272p0325l6643j34371j11409m7363j8453o7177
20128B54242n3178j21045J8262M655N2010N8065l9714K9535K5281m8201q5473
20117I4439m4894k7883j0961k9007J9812P6464P0424k9343j01340m5005N4287
20106B6993O8056Q3321p457O763j37406o0179Q3385k4948n1123M5953O1488J7094
20094A11940K2267P791J3594N9829O2405m6199N599l0592o6318K0662k2537p6076
20082F2365J8518L6787o8808j25498N974J31791N3402n9433J4639J1330K1294
20071A02361j5727q0385J0128J06338K1190O1885L755J05796P182p6144q8027
20060A58352q6617K7562O332K5216m1622K8769J11150K2670m1176r3946q884N9857
$$ y = [793562, 800781, 883289, 867255, 739983, 669658, 633015, 498644, 387235, 339872, 321419, 254242, 201064, 80019, 98281, 102936, 154946, 213011, 173297, 202832, 228113, 179912, 94439, 49545, 21662, 10701, -18306, 1506, 77970, 148394, 119051, 17711, -27294, 26993, 95049, 178370, 170913, 177676, 40270, -19909, 63476, 38528, -12595, 33358, 94846, 111940, 134207, 141998, 155592, 215421, 277826, 231627, 237226, 206634, 140316, 160978, 138441, 62365, 80883, 117670, 48862, -76636, -70662, 61129, 114531, 55098, 69737, 81067, 102361, 86634, 6249, 16377, 122715, 143905, 205790, 209545, 315341, 322523, 246379, 158352, 71735, 99297, 105629, 130845, 89223, 117992, 229142, 251812, 210636, 116690, 107806, 167663]
20048A67663Q0199k5232l4353O2324N6313N5471j32763m5445J1526m6419m316
20037A44968k9532l3032Q9072j7008r8857J6477R5162M9498J9377J4526l05p8589
20025A71757k6940l4161J39521N6587J2900m0337M5533n545j12063p2707N9258
20014A93803N3401l5410o7364J0968J7246M4096n1917l4698M9422J1040O0469
20003B51056O0486J2216J158R0867J0490r857p501m3543L6678q449J04244k3036
19991D74809p3831n1221p4965J0657O3674J26840L9132n3669M7401J21758j35100
19980D95485n1016J3820O4794O3770j8844J9049r732P641K6575l7954j5258K0988
19968E79318k5761m8173Q0692N4243k0137q7280j9584N981q647o8137k8290n6722
$$ y = [167663, 247862, 222630, 188277, 250601, 306914, 362385, 229622, 184177, 195703, 149284, 144968, 115436, 82404, 171476, 154468, 55611, 72088, 167250, 216748, 236125, 250651, 250346, 171757, 144817, 110656, 250177, 306764, 319664, 279327, 324860, 319315, 207252, 134545, 193803, 247204, 211794, 144430, 155398, 172644, 216740, 164823, 130125, 179547, 190587, 251056, 311542, 323758, 324916, 415783, 426273, 416416, 408915, 365372, 402050, 393601, 497845, 474809, 400978, 349757, 274792, 285449, 349123, 475963, 515095, 461426, 508827, 630585, 495485, 444469, 458289, 523083, 586853, 568009, 587058, 577326, 584967, 611542, 573588, 558330, 579318, 553557, 505384, 586076, 640319, 620182, 532902, 513318, 519299, 510652, 442515, 414225, 357503]
19956C57503k7728j8307R6476N4969m5444J48319J23334N0071r151m5375M8799
19945G33466J6612q623J18299J08233j42543L2646J8635P4724J25436m5267o7257
19934I64361J06081J78682L3966M1902j8977J9531N4486O3523j1746P2590J47054
19923A651453K06704J42861J22552J69003J65918K05887K60332L53688L96431
19914C674829N13437P38379Q77051J013562J247747J419764J892695K716884L434980
19905A7529328L977055M276875M170531L726610L344440L997151M951672L764185
19897D9737847j430494n667153o382922m490322j684948O39168K063140K642475
19889C5426791K705736K164273J685392K341358L218248N28998o316635r678007
$$ y = [357503, 329775, 311468, 407944, 462913, 417469, 565788, 689122, 739193, 730042, 684667, 733466, 750078, 741455, 859754, 967987, 825444, 858090, 876725, 951449, 1076885, 1031618, 964361, 1070442, 1249124, 1283090, 1324992, 1306015, 1325546, 1380032, 1443555, 1431809, 1504399, 1651453, 1858157, 2001018, 2123570, 2292573, 2458491, 2664378, 2924710, 3278398, 3674829, 4188266, 4926645, 5803696, 6817258, 8065005, 9484769, 11377464, 14094348, 17529328, 21506383, 25783258, 29953789, 33680399, 37024839, 41021990, 45973662, 49737847, 48307353, 42640200, 36257278, 31766956, 30082008, 30721176, 32784316, 35426791, 38132527, 40296800, 41982192, 44323550, 47541798, 48070796, 41754161, 32076154]
19881C2076154p969958n097133l142528k027325j468914j095044p70818m85020
19873A0019414k15573k13019j84745k73095m88165n14947m21960m29215l18904
19864F959791o4541k7570L5061J61705L99432M16646O10268Q98622J212997J529090
19854A2131501J763435K092354K716000L744872N093603O227805O885951O639709
19846D7295230N978725N178754N850568P792320P404837J43702q473612j0911041
19838F0259483q185373k944897J235447L403635L816165L290481K503965K484068
19830F5862974M239814O139696K765789q192137j5575034j4268450r622808n937900
19822B5411944l901113k699639k052611j464606j106495p84212n83053m89201
$$ y = [32076154, 24106196, 19009063, 15866535, 13839210, 12370296, 11275252, 10504434, 10019414, 9803841, 9590822, 9406077, 9132982, 8644817, 8129870, 7707910, 7278695, 6959791, 6895250, 6867680, 6902741, 7064446, 7463878, 7880524, 8490792, 9389414, 10602411, 12131501, 13894936, 15987290, 18703290, 22448162, 27541765, 33769570, 40655521, 47295230, 53273955, 58452709, 64303277, 72095597, 79500434, 79644136, 71170524, 60259483, 52074110, 49129213, 50364660, 53768295, 57584460, 60874941, 63378906, 65862974, 70102788, 76242484, 79008273, 70816136, 55241102, 40972652, 31349844, 25411944, 21510831, 18811192, 16758581, 15293975, 14187480, 13403268, 12820215, 12331014]
19814A2331014n22662p44151p65956p97826q45252q81196q13204o92190n43176
19805E725401m04418m40891m60290l87586j69560j68446k42280k24397j77578
19796C049955k28096k65098k16491k25405k24377r3112l9268j33440j65527j08957
19786A350184m7965K8420o6459j20155l0041Q6289p4118p4225j2862Q24K5162
19775A065054o5667n0619m3950q5486q3535k7883j5835L0599J4977N77L0115K8452
19763G96799K7219q920j56223q3865n3196O37J5494J24904j5032m9237p7902P3960
19751E94638J38626M1516m5745m4707k8596p2077K3520N1743m0504J9909N0870
19740F89193k0742k06721k3385N4011j2905M5330R7356J0719j7022K9328m7579
$$ y = [12331014, 11808352, 11064201, 10298245, 9500419, 8655167, 7773971, 6960767, 6268577, 5725401, 5320983, 4880092, 4419802, 4032216, 3862656, 3694210, 3451930, 3227533, 3049955, 2821859, 2556761, 2340270, 2114865, 1890488, 1797376, 1758108, 1624668, 1459141, 1350184, 1302219, 1330639, 1264180, 1144025, 1113984, 1200273, 1126155, 1051930, 1039068, 1039892, 1065054, 999387, 948768, 904818, 819332, 735797, 707914, 692079, 722678, 737655, 738232, 768347, 796799, 824018, 815098, 658875, 575010, 521814, 522451, 537945, 662849, 647817, 598580, 520678, 594638, 733264, 774780, 729035, 684328, 655732, 583655, 607175, 658918, 618414, 638323, 689193, 668451, 461730, 438345, 492356, 479451, 524781, 622137, 632856, 615834, 645162, 597583]
19729E97583n1888m8686k7330Q8667J02402R0484J6236N0206o1441J5236R9407
19718H70876R8047L0360J8576k6694j5892O372n215J0222J28851M8900j9960J18483
19706A262926q878O385M8546N3862J46648J25321O2933J9199k8813L4860J44680
19695A867669K07455J26110K23627J66450K29499J20783l6785J06554J64577J63160
19685C339099J52986L25640L44192M91995N00249N75894P94714J095300J428112
19676I048181J911948K446052K840515L394078M455756N855935P404973Q987339
19668D6344777J0196842J0999480J1167478J0812022J1302249J2708147J1078762
19661A24609757J460255q743262q828110o718448j4013042k1114390j7677418
$$ y = [597583, 545695, 497009, 469679, 558346, 660748, 751232, 767468, 817674, 756233, 771469, 870876, 968923, 999283, 1017859, 991165, 975273, 981645, 976430, 986652, 1115503, 1164403, 1144443, 1262926, 1254048, 1260433, 1308979, 1362841, 1509489, 1634810, 1697743, 1716942, 1688129, 1722989, 1867669, 2075124, 2201234, 2424861, 2591311, 2820810, 2941593, 2904808, 3011362, 3175939, 3339099, 3492085, 3817725, 4161917, 4653912, 5154161, 5730055, 6524769, 7620069, 9048181, 10960129, 13406181, 16246696, 19640774, 24096530, 29952465, 37357438, 46344777, 56541619, 67541099, 78708577, 89520599, 100822848, 113530995, 124609757, 126070012, 117326750, 108498640, 101780192, 87767150, 66652760, 48975342]
19654D8975342j1107167o665067m279485k923214j999182j324657j042164q10572
19646A8823834p49297q78305j026736j080356r83046j031574j170068j116087
19638A0788365p94057o61524o15198m87228n75131m51582k46735j37862k64449
19629F554599k19644j93102r9560j12089K938M4586K55475L53433O64283J060101
19619H311020J241856J507330J935599K498955L189206M263245N198444O076511
19611C4222166O676520O895725O568754O504520P374518P520798L358161m117025
19603G5004137o661276m808637p372277j2516239j1667970p479607m459998k983828
19595A7054305k003775j452761j000673o17217n22938n83894m66838n01537p01959
$$ y = [48975342, 37868175, 31203108, 26923623, 24000409, 22001227, 20676570, 19634406, 18823834, 18074537, 17196232, 16169496, 15089140, 14106094, 13074520, 11904452, 10788365, 9994308, 9332784, 8717586, 8230358, 7655227, 7203645, 6956910, 6819048, 6554599, 6334955, 6141853, 6042293, 5930204, 5933142, 5977728, 6233203, 6586636, 7250919, 8311020, 9552876, 11060206, 12995805, 15494760, 18683966, 22947211, 28145655, 34222166, 40898686, 47794411, 54363165, 60867685, 68242203, 75763001, 79121162, 75004137, 68342861, 63534224, 56161947, 43645708, 31977738, 24498131, 20038133, 17054305, 15050530, 13597769, 12597096, 11979879, 11456941, 10873047, 10406209, 9904672, 9202713]
19586I202713q08117p61449o98632o93535o71245n48181l77229k42462k66042
19577D135821k48787k91140k59341l24218k73480k25760j44637j94876k77495
19568A896087j37260j17288o8240r9150j83316j54696m4112m6791r7829j31094
19558H16311q7732L5267p2186K1953m2094j20211o9662P8134m91j170M3070j07837
19546D93352q0070L8160J02219P0800M842l7493k3172k7521L5237o3805M7937
19535E60486M5093k4723j13829k4056j2526j12477r2459N4361R6101q3541o2929
19524B29501O535J8269j2037o560j3761M9161J3476J06419r212j25026j7009K1366
19512B61122o1004J11916Q2046j91208j38637J11055K4891j8862j4258N8191J09
$$ y = [9202713, 8394596, 7633147, 6934515, 6240980, 5569735, 5021554, 4644325, 4401863, 4135821, 3887034, 3595894, 3336553, 3012335, 2738855, 2513095, 2368458, 2173582, 1896087, 1758827, 1641539, 1573299, 1474149, 1290833, 1136137, 1092025, 1045234, 947405, 816311, 728579, 763846, 691660, 713613, 671519, 551308, 481646, 559780, 559289, 558119, 601189, 493352, 413282, 451442, 553661, 624461, 629303, 591810, 568638, 541117, 576354, 512549, 560486, 605579, 580856, 467027, 442971, 430445, 317968, 225509, 279870, 375971, 292430, 229501, 236036, 254305, 242268, 235708, 221947, 271108, 284584, 391003, 381791, 256765, 239756, 261122, 200118, 312034, 394080, 202872, 64235, 175290, 200181, 181319, 167061, 225252, 225361]
19501B25361j10556k8501K7852M8815M7326j5090j4535o819O8001L9123r6837
19490A84140k9919J13941Q4269o1471o7519L6627P2544p7121K1591K4113M6457
19479C47652o8068l9819m852N6009N8648j06886p0682q066k7340N7003o116M1791
19467B29274n3363p2132L0834N8580k52M218O7471L2246P3155q5173j38645k7028
19455A19185L5485R6115J7388j65677j50727J45J23648L5499l9401l4319J04019
19444A41360l9013m2637k8176L1428O7047k4559p2922p7437J00752J39391j6799
19433A78435j5483J6162l518r4967p6654O0014M6944j29330p1521O3657q401L7133
19421B471R3139J16202p773M0515K5813L7176o2013k3089l3609L978m0818r8310
$$ y = [225361, 114805, 86304, 114156, 162971, 210297, 195207, 180672, 173853, 241854, 280977, 184140, 154221, 268162, 352431, 290960, 223441, 260068, 332612, 255491, 277082, 301195, 347652, 279584, 239765, 234913, 290922, 349570, 242684, 172002, 163936, 136596, 193599, 187483, 229274, 175911, 103779, 134613, 193193, 192941, 197159, 264630, 296876, 370031, 284858, 146213, 119185, 154670, 250785, 268173, 102496, -48231, -48086, 75562, 111061, 71660, 37341, 141360, 102347, 59710, 31534, 62962, 130009, 105450, 32528, -44909, 55843, 195234, 178435, 162952, 179114, 175596, 80629, 3975, 63989, 110933, -18397, -89918, -26261, -34662, 2471, 95610, 211812, 204039, 244554, 270367, 307543, 245530, 222441, 188832, 192810, 151992, 53682]
19409E3682m2004J8214O5848j0996o134l969N247p7025J7076o2553m6579L7890
19397e1303J27506J26357O750j01918l5592n694m3920L9921K4082j20439n9801
19386i4051N5741K9484q2861j18168O1904M0552P1479J8207n6995O107K8370p2643
19374a12874O84J20413J88469J0086j02196J0509M7448L9161M9176Q9438O2857
19363D03171P7396o2903n5106K7793m5586j11060M288j49172o5912J24229J59014
19352C06152R5539N5655l7825k9477k8623m0949k6452p3002M5986m6157m0025
19341A80822j34050q3233J8047j2821L3109o7198P8012N1707n8287K4309j2517
19330A7900j1356n1139J6435l689m7902M6779P9320n1546N9894M5296o5902r2962
$$ y = [53682, 11678, 29892, 95740, 84744, 78610, 74641, 79888, 2863, 19939, -42614, -89193, -51303, 76203, 202560, 209310, 107392, 71800, 66106, 22186, 62107, 86189, -34250, -94051, -38310, -8826, -91687, -209855, -147951, -107399, -35920, -17713, -74708, -68601, -40231, -112874, -112190, 8223, 196692, 206778, 104582, 115091, 162539, 201700, 250876, 340314, 403171, 480567, 417664, 362558, 390351, 344765, 233705, 237993, 88821, 22909, 147138, 306152, 401691, 457346, 419521, 390044, 361421, 320472, 294020, 221018, 267004, 220847, 180822, 46772, -36461, -18414, -31235, 1874, -65324, 12688, 64395, 6108, 30417, 17900, 6544, -44595, -28160, -31849, -79751, -32972, 46348, -5198, 54696, 99992, 34090, -58872]
19318e8872l0839J02605N5803O120N2460m2221J0101K9504L0994j2207K1500O4336
19306B29284K5659R1608k0729n017j42943j12246J5397K2243k0152M9718J43707
19295B76529J08135q946k2588m1496p4831j08085m8605l9910Q0561N6919j11724
19284F5959j14997M5420q745o838q6259O9225j9881o1924M9915l1410n2050R6978
19272e4607N2825k5848l2209J5166Q6025J800K680m5665o3734K9242j6701O9607
19260A8581J14843j7156p8129m5610n6554J15482P0887r3093q9927O244M8651
19249e781r581L4994Q546l8107K7290N3369q990l5725R3742r2468K9622K0334
19237G7245Q4732k7809j17705k8317J47752M3208r2938n2244o9831j3223p2491
$$ y = [-58872, -89711, 12894, 68697, 74817, 127277, 85056, 95157, 124661, 155655, 143448, 164948, 229284, 254943, 346551, 325822, 320805, 177862, 65616, 81013, 103256, 83104, 132822, 276529, 384664, 375718, 353130, 311634, 236803, 128718, 80113, 40203, 120764, 177683, 65959, -49038, -3618, -12363, -19201, -105460, -36235, -56116, -118040, -68125, -99535, -151585, -54607, -1782, -27630, -59839, -44673, 41352, 43152, 45832, 167, -63567, -34325, -51026, 18581, 133424, 116268, 38139, -7471, -64025, 51457, 122344, 29251, -60676, -54432, -5781, -15362, 19632, 28178, -9929, 17361, 70730, 61740, 26015, 119757, 27289, 56911, 77245, 161977, 134168, 16463, -11854, 135898, 179106, 86168, 33924, -35907, -49130, -121621]
19226a21621k9932m8464o2352J05901M0332r7386p3161j6134N4813N6933l4436
19215b25507J4858n3407L0654J44891N5478q0874n4188j8741J36922j1963j27365
19204a89242n2612L2183R138P3748N7691p926m2893M1396N9754L006J9988Q9082
19192I3313K6857k570M0198l5017q5557j14657K1319j4246o2852r4371O9551R8129
19180e9903j4868L2021Q6379L643j05752j303l8552q8749k9934O1679O0033K0911
19168g4395l9024n13p474l6276k5481K8672Q0262O2l0245q3706L6833P2994J21057
19155D2766J282n4829j28405l9817M0768P9158J22669l772o5169N9190J19925
19144A73766J8278K7419K9621K856J03870K0377o5266K8331L7631L6699O397N7505
$$ y = [-121621, -151553, -200017, -262369, -156468, -116136, -213522, -286683, -302817, -248004, -191071, -225507, -210649, -264056, -233402, -88511, -33033, -113907, -168095, -186836, -49914, -61877, -189242, -241854, -209671, -200533, -126785, -69094, -77020, -119913, -78517, -18763, -15757, 4231, 93313, 120170, 117600, 157798, 122781, 37224, -77433, -56114, -70360, -133212, -227583, -158032, -59903, -74771, -42750, 43629, 47272, -58480, -59783, -98335, -187084, -217018, -155339, -95306, -74395, -113419, -113932, -121406, -157682, -183163, -154491, -74229, -74167, -104412, -188118, -151285, -78291, 42766, 44048, -10781, -139186, -179003, -138235, -59077, 63592, 59820, -5349, 53841, 173766, 192044, 219463, 249084, 251940, 355810, 376187, 310921, 339252, 376883, 413582, 419979, 477484]
19132D77484L6519k5024j8021r4259k31090q4736p485m4295M4384K5535m2033
19121C6979m2078N8701R3684K777q6453J4270l5698J0285O6765K7157J1936j47375
19109A0950j32021j13288P087J04174Q7080p188M2853o0657J7530P5856j4517
19098A7859j9834L4880L1637L88q4772L3756j3630j43313L8712K6548K9098P4091
19086B5420N5497J11268L7001M4363Q8190R5679O5584M7120Q8363m0946k1168
19075E96371j12086j14678k6396j0785j71431n3912j35432r6176N0119m998M0792
19064c8612l6266K7938P0980R1646L2393M2p6771M040K0483k2619j0962J1768
19052G4060k5095J9402k955j09274q7873M5022J01817J02252K0471N9619j34779
$$ y = [477484, 514003, 488979, 470958, 376699, 145609, 60873, 53388, 9093, 53477, 79012, 36979, -5099, 53602, 147286, 150063, 63610, 77880, 42182, 52467, 119232, 146389, 158325, 10950, -121071, -234359, -227272, -123098, -36018, -43206, -353, -61010, -43480, 32376, 17859, -1975, 32905, 64542, 64930, -19842, 13914, 284, -143029, -104317, -77769, -48671, 25420, 80917, 192185, 229186, 273549, 361739, 457418, 523002, 570122, 658485, 617539, 596371, 484285, 369607, 343211, 332426, 160995, 107083, -28349, -124525, -74406, -79404, -38612, -74878, -46940, 24040, 115686, 148079, 148121, 71350, 75390, 95873, 73254, 62292, 74060, 48965, 68367, 65412, -43862, -131735, -86713, 15104, 117356, 137827, 197446, 62667]
19041F2667o3238M0182j244l2584p6090o288l2735K7525M9392K1491j4163J5741
19029i344L1850P196m1598k739K526k5349K8389K6942o1288q7841O5722K6825
19017c8709J8500J03275m1203o3786o5086N0139r1665P205l2169J4739Q6593K4432
19005b7735r156m9673k9560O3961M8406k5570N8848k3435l5718N1614n1475J2681
18993a6812n4258m2336L0946K4158L8041J0914J5709q5302k0260L7392R2161n6028
18981b5675n3138q0406M5933k3241o2386N7038J8102K2436P7037J22459K3554
18970A21713p5016K8154R439l7276k17468o3252J20526N8715j4755O7822J47889
18959A46491l4753j39724l8870j4537p3650J5637O1125J06415P1927J59J1186
$$ y = [62667, -571, 39611, 38367, 5783, -70307, -76595, -109330, -81805, -32413, -10922, -25085, -9344, 22506, 29702, -11896, -14635, -12109, -37458, -9069, 17873, -43415, -131256, -65534, -38709, -20209, 83066, 41863, -21923, -87009, -36870, -128535, -121330, -153499, -138760, -52167, -27735, -36891, -86564, -116124, -52163, -3757, -29327, 29521, 6086, -29632, 21982, -29493, -16812, -71070, -113406, -82460, -58302, -20261, -9347, 6362, -78940, -99200, -61808, 30353, -25675, -78813, -159219, -113286, -136527, -198913, -141875, -123773, -101337, -24300, 98159, 121713, 46697, 74851, 84290, 47014, -170454, -233706, -113180, -54465, -69220, -1398, 146491, 111738, -27986, -66856, -81393, -155043, -139406, -78281, 28134, 100061, 100220, 111406]
18948A11406p4698L558O1743K6488j1503j166j14227n5355n1243j5455J8451k5860
18936a27861P0330K9166J2733n6759q5414K8932Q0731J5625k1604n6063m3005
18925a53189J18596r867m1054o699P1198p018n6192Q503J03606O2298N22n2264
18913C8440m9363J4007j5327L0794l0105K1289k034N820l8706j03911K9793J22301
18901B2998J11961m6888l2427p5534j7121K5966o27k4274n1217M3276R1426j04564
18889e7025j81330K436J15261P4841m9716M8566K8882O242k6646J2874j0131p0547
18877a06293m6576Q1171J1350p2014q2995M6006R0699k2941l3603O2762j5925
18866h8359M240K5112l3600k5930P6453J6660p0021O5891m9604m8674M9403Q0212
$$ y = [111406, 36708, 40266, 102009, 128497, 116994, 115828, 1601, -53754, -104997, -120452, -102001, -127861, -57531, -28365, -15632, -72391, -157805, -128873, -48142, -32517, -54121, -110184, -153189, -34593, -44460, -85514, -92213, -21015, -28033, -84225, -75722, 27884, 90182, 90704, 38440, -10923, 3084, -12243, 18551, -11554, 9735, 7701, 13521, -25185, -129096, -99303, 22998, 134959, 88071, 55644, -19890, -37011, -11045, -11672, -35946, -87163, -43887, 47539, -57025, -238355, -235919, -120658, -45817, -95533, -46967, -18085, -11843, -38489, -25615, -35746, -106293, -152869, -71698, -60348, -132362, -215357, -169351, -78652, -101593, -135196, -72434, -88359, -84119, -59007, -92607, -118537, -42084, -25424, -95445, -29554, -79158, -127832, -78429, 1783]
18854A783r453n7595J7539M1895k6103M6608j3039K840j3409j47257K4579J4903
18842a16709Q926l3686k907M4771k0183k5216O137Q5215p3590m0936K1832P180
18830a39166J12253O7953J8221j62195k12541l7062O1533R2968j3419Q675N8720
18819a44060N9335J07415j29196n306K9065r406L0422n4318j2489J29976j841
18808d03r3086j1960P6815R0032J33764j0596n9654l5342k7072P571N1487J8213
18796A39769j02905n3802k1881K050q09n2217k5643m4864L655P439k171Q4487
18784f6892l856n4314J32667R3629O303p1172M1293J5981K6910q080K3920m814
18772A31575J3775K9786k29j0091L8509R6258l0488o815J49204M7936j34855k01292
$$ y = [1783, -7670, -65265, -47726, -5831, -31934, 14674, 1635, 4475, -8934, -156191, -131612, -116709, -107783, -141469, -144376, -99605, -119788, -145004, -138867, -53652, -127242, -168178, -146346, -139166, -26913, 41040, 59261, -102934, -315475, -352537, -291004, -198036, -211455, -202780, -144060, -84725, 22690, -106506, -111812, -82747, -92153, -61731, -116049, -128538, 1438, -403, -93489, -105449, -28634, 61398, 195162, 184566, 124912, 89570, 62498, 70069, 121556, 139769, 36864, -16938, -38819, -36769, -37578, -89795, -115438, -160302, -156647, -149208, -151379, -66892, -70748, -125062, 7605, 101234, 107537, 36365, 77658, 93639, 120549, 112469, 136389, 131575, 145350, 175136, 174907, 164816, 203325, 299583, 269095, 262280, 411484, 459420, 324565, 123273]
18760A23273j29269N4566R2404j5450K2139o9078k4286l9950P0300j06702m075
18749b6128O3906m25p125l4115M235J10460j8760o6174j07080K0151P6945J6826
18737C2716o6060l1464J6723q1602l0007M3206P7065o0212r0577J00414J3673
18726g6125k161R9344K1621R015q6002n1097K9731j3808P2422n9313l7522M6224
18714d7671J1438l7550j07899m5692R2110P8611j0305J816k4737J6935r3634p9497
18702b46075n4657k6191J24194P6206O554l3764r042K164L8615J14331l3532l7441
18690g8638J12516k063L2627L6257j22875L3364J3499J6566o1970k2980r723N5582
18678B162J19o2487j05331l0622O9857P9356k175K4371M3515l7857l6908p011
$$ y = [123273, -5996, 48570, 140974, 125524, 147663, 78585, 54299, 14349, 84649, -22053, -26128, 37778, 37353, 30228, -3887, 348, 110808, 92048, 25874, -81206, -61055, 15890, 32716, -33344, -64808, -48085, -129687, -159694, -116488, -39423, -99635, -190212, -89798, -76125, -78286, 21058, 42679, 51694, -34308, -85405, -55674, -69482, 2940, -56373, -93895, -47671, -36233, -73783, -181682, -227374, -135264, -56653, -66958, -65142, -89879, -72944, -166578, -246075, -300732, -326923, -202729, -126523, -119969, -153733, -162775, -160611, -121996, -7665, -41197, -78638, 33878, 31815, 64442, 100699, -22176, 11188, 24687, 41253, -20717, -43697, -53420, 2162, 2281, -60206, -165537, -196159, -126302, -46946, -49121, -24750, 18765, -19092, -56000, -63011]
18666f3011K1847j4701l0929p6577l4550N1376p2876p6077R261O6729M8215p308
18654a78601k989O2817Q2825M8209N5733K9384k4078j25113r8878K0851O5878
18643f3962n1088j3923N1205R1290n6888j02243M9776Q2974n4654R0253o0278
18632c7538o9546P9536N4644O5905o9198p7179L4938L9987L2401l5432r4641k6486
18620a02609M3325l2726k6990m3610l534O7573J3494j4252j0495p5731K5704p612
18608a67463j6682Q2151K7415J5292Q7453N0317m6273j9336j2103j18059m9723
18597a67011L7602O5464r636J8492O3793K4217M7081r5416o3453j0102J03803
18586A4834J33171j9057o7541L8994n1587o0244J08732l4499L6201r7347K0470
$$ y = [-63011, -41164, -55865, -86794, -163371, -197921, -146545, -219421, -295498, -286237, -219508, -171293, -178601, -181590, -118773, -35948, 12261, 67994, 97378, 73300, -51813, -150691, -129840, -63962, -115050, -128973, -77768, 13522, -43366, -145609, -95833, -12859, -67513, 22740, -37538, -107084, -27548, 27096, 93001, 23803, -53376, -18438, 21549, 53950, 18518, -76123, -102609, -59284, -92010, -119000, -162610, -166144, -98571, -85077, -99329, -109824, -185555, -159851, -167463, -184145, -101994, -74579, -59287, 28166, 78483, 32210, 12874, 771, -117288, -167011, -129409, -63945, -73581, -55089, 8704, 32921, 80002, -15414, -78867, -88969, 14834, 148005, 128948, 61407, 100401, 48814, -11430, 97302, 62803, 99004, 1657, 22127]
18575B2127P7300m1729J2323M680o3358j49607p9025M0986O3692L8759J398l4243
18563a06697M6335o7966r6141L8564J79021j8895j25148r591L1665J1289n4333
18552a71897J9488O4868L9130J5823K6169J00050p9851p8343q9182M2631m8870
18541a59984J5841J31506j0640o4764p1188k5000K444L7659j10317j36765j6122
18530d07330J64658O1248Q5126p5663J3864O9857J18288J3280m2971l3824k4772
18519e8239q4227l3596j7169O762N1235Q2763R8818P569L4630k6771q6051N61
18507b3715j8918j858n4264L8147Q8068O2430j693K9736R697l762M5469l5799
18495A33538p2321k268K155O0637n4964j1916l3252k1805m9225j09772k1822O0616
$$ y = [22127, 99427, 57698, 70021, 74701, 11343, -138264, -217289, -176303, -112611, -73852, -72454, -106697, -60362, -128328, -224469, -185905, -6884, -25779, -150927, -160518, -128853, -117564, -171897, -152409, -87541, -48411, -32588, -6419, 93631, 13780, -64563, -153745, -111114, -159984, -144143, -12637, -23277, -88041, -159229, -184229, -181785, -144126, -254443, -391208, -407330, -242672, -181424, -96298, -171961, -158097, -88240, 30048, 43328, 357, -33467, -58239, -142466, -176062, -193231, -186469, -135234, -52471, 46347, 53916, 88546, 61775, -24276, -23715, -42633, -44491, -98755, -60608, 27460, 89890, 88197, 117933, 127630, 123868, 169337, 133538, 61217, 58949, 61104, 121741, 66777, 54861, 21609, -196, -49421, -159193, -181015, -120399]
18483a20399L5900m1528M6221O3744P7803l7477j05438L3319J03721m9993r2217
18472h6344m8210K6480L9736J01301l993k6697P1962M5038j926N2886q9872k6332
18460E4029j5443k1164L3527l1207K7130j9728n000o554J2784l0705P4196n2360
18448A9505p6521m4268K1585L8388L6704J9226q2088N5216O0432l909m4145k948
18436b823K2468l3051o8964L6989O943q3330J01473P7047j9569p6143j52576P2742
18424a18794m4507j1299J19077n5311p5375J12467K4531K0816q289n1192j0030
18413i7906R0720p349k6317K7205L9751J38J4176Q798j1627J08321L391j16742
18401C2559j8127M0085l8872L9610J12912K1683o9485q717J07481j5939n8413
$$ y = [-120399, -84499, -126027, -79806, -16062, 61741, 24264, -81174, -47855, 55866, 5873, -86344, -134554, -108074, -68338, 32963, 28970, 2273, 74235, 119273, 117347, 170233, 80361, 54029, 38586, 17422, 50949, 19742, 46872, 27144, 22144, 15590, 28374, -2331, 71865, 19505, -57016, -101284, -79699, -41311, -4607, 14619, -67469, -12253, 48179, 44270, 125, -2823, 19645, -13406, -82370, -45381, -38438, -121768, -20295, 56752, 37183, -38960, -191536, -118794, -163301, -174600, -55523, -110834, -186209, -73742, -49211, -28395, -36684, -87876, -97906, -7186, -14535, -40852, -13647, 26104, 26242, 40418, 49216, 37589, 145910, 149301, 32559, 14432, 54517, 15645, 55255, 168167, 189850, 120365, 111648, 219129, 203190, 144777]
18390A44777j45490j8120j441l0922o6898M6363J09742R4211m8446k0243p2609
18379i076j8902o7404J5766P3466k0603p50K0770J19201O4341L285J3448m3364
18367A50178J614m6549O4426k8173L0312P6404j6075o2718j24973J1431K432L4596
18355I2905q7047k2053k7469K5481P9584R9990J0205k6131N6224M6727j0341j13703
18343A24372q9918p7208N3382l019j4744l843J09842K5829l7146l9760j08335
18332f0548P2028M5479j45353J7757J6621m812L6149j27650Q3080Q277L4454O5218
18320D0700o04R5139N2614n4845m1912J22054J07278q6495p9771n312N9676J9212
18308B27734o1735o9953l9420Q2424Q1463l7328l8876j784M1832j0069j4412n8165
$$ y = [144777, -713, -18833, -20274, -51196, -118094, -71731, 38011, 132222, 83776, 63533, -9076, -27978, -95382, -79616, -6150, -26753, -27503, -6733, 112468, 176809, 180094, 193542, 150178, 151792, 105243, 169669, 141496, 171808, 248212, 232137, 169419, 44446, 55877, 58309, 92905, 5858, -16195, -43664, -18183, 61401, 161391, 171596, 145465, 201689, 248416, 238075, 124372, 34454, -42754, 10628, 7609, -7135, -10978, 98864, 124693, 87547, 47787, -60548, 11480, 56959, -88394, -70637, -54016, -58828, -22679, -150329, -67249, -58972, -24518, 40700, 40096, 135235, 187849, 133004, 91092, 213146, 320424, 233929, 154158, 148846, 208522, 227734, 165999, 96046, 56626, 139050, 220513, 183185, 144309, 142525, 184357, 174288, 159876, 101711]
18296A01711k2598l5231j6033m0793q5840K9475Q4634O4706J51080Q5749j02666
18285B14194o2099J9223j1567j01937j09272j6599Q0783L6029n7376K5283Q2662
18274I9324l4067j5388N8713j6472Q999m7516N9683K0709K6415p2107l3079O6350
18262A21564l6915k3927L1844p9025n7863K0996j7386j8313L7083q681J15811
18251H5188K4555j1854m1874m2440K0978J4576J5204J05503p1215j29655L584
18240b7450K4655L0743M7997n2038m1669K3557O4807m1978p6776N5147J5177Q3880
18228A06052l096n0936N2317K0883J0055J3394p3619L6744m8081n5826Q9506L6489
18216A33882l4662L3626l7129p3674J0049P4971j0689p5980O5924J15501P671
$$ y = [101711, 79113, 43882, 27849, -12944, -98784, -69309, 15325, 80031, 231111, 316860, 214194, 152095, 171318, 159751, 57814, -51458, -68057, 12726, 48755, -8621, 16662, 99324, 65257, 49869, 108582, 92110, 101109, 53593, 113276, 133985, 160400, 88293, 55214, 121564, 84649, 60722, 92566, 13541, -44322, -23326, -40712, -59025, -21942, -30623, 85188, 109743, 97889, 56015, 13575, 34553, 49129, 64333, 169836, 98621, -31034, -27450, -2795, 27948, 75945, 23907, -17762, 5795, 70602, 28624, -48152, 6995, 22172, 106052, 102956, 52020, 104337, 125220, 135275, 148669, 75050, 111794, 63713, 7887, 97393, 133882, 99220, 132846, 95717, 22043, 32092, 107063, 96374, 20394, 86318, 201819, 209490]
18205B09490K4072m0066j16820k048P4004N2841J10490j0348j24494J4668P3670
18194B65459N7295J7217j6437o2862N5750l903n959j31569k4688O7882m999j30799
18182H2387j5665P0845M7724M4413R638l0342j3864j806j0318k8944K0080m5150
18170A28998m249N8487Q1467J1152P7977R2544M7482l6023o0907j5782j46234
18159B34912L618Q4982N2665J22146P0635r7255p8769m0783N1816N733M7775L1158
18147D88633L9717k0792J05296P1421O4954M2652l7815K560J08161Q2066J42964
18136A089817N8632Q0561J83270L3019N5561J38890J00247N8592Q5174K71017
18126B154780L48524L56982N23034O96861R77353J454397J965576K269946K436810
$$ y = [209490, 233562, 193496, 76676, 74628, 148632, 201473, 311963, 301615, 177121, 191789, 265459, 322754, 339971, 323534, 260672, 316422, 312519, 306560, 174991, 150303, 218185, 213186, 82387, 66722, 137567, 185291, 229704, 239342, 209000, 195136, 193330, 183012, 154068, 174148, 128998, 124749, 183236, 264703, 275855, 353832, 446376, 493858, 457835, 396928, 381146, 234912, 238530, 323512, 376177, 498323, 568958, 471703, 392934, 352151, 403967, 409700, 457475, 488633, 528350, 507558, 612854, 684275, 749229, 791881, 754066, 756626, 864787, 946853, 1089817, 1148449, 1229010, 1412280, 1445299, 1500860, 1639750, 1739997, 1798589, 1883763, 2154780, 2503304, 2860286, 3383320, 4080181, 5057534, 6511931, 8477507, 10747453, 13184263]
18117A3184263K809197L686429N195351P485461R416890R900146R232093P685879
18109F8595709M824726N024624J0362331J4203909Q13484k5944922k7076185j5960755
18101C4842921q824997n146825l134927j966532j456263j061235o87579l92811
18093A2171752j62321j87266m98572q39241r19761r31663r21337p69897p56092
18084F185602n67686m01417n04613m24483m06693l67922l31665l21190k38094
18075B621839j15989j53503k36706j98169k7333r5333j66299q2842o5632r5537
18065A384496J5137j209j54195j28008o4630j07065p0581m2925J703N4590l6753
18054H50560j64m8648p9806L053R1385O0927M499o2811o0071p0480j7407n0576
$$ y = [13184263, 15993460, 19679889, 24875240, 32360701, 41777591, 51677737, 60909830, 68595709, 73420435, 78445059, 88807390, 103011299, 103824783, 77879861, 50803676, 34842921, 26017924, 20871099, 17736172, 15769640, 14313377, 13252142, 12564563, 12171752, 12009431, 11822165, 11323593, 10484352, 9564591, 8632928, 7711591, 6941694, 6185602, 5617916, 5216499, 4711886, 4287403, 3880710, 3512788, 3181123, 2859933, 2621839, 2505850, 2352347, 2115641, 1917472, 1890139, 1794806, 1628507, 1545665, 1480033, 1384496, 1399633, 1398424, 1244229, 1116221, 1051591, 944526, 873945, 831020, 832723, 887313, 850560, 850396, 801748, 721942, 724995, 816380, 877307, 881806, 818995, 758924, 688444, 671037, 620461]
18042F20461q6379l7511o7556n6370n4484O588N3163J4780o689p4529l8028p807
18030B65639J4198n201k9108n8360o6848n3361j7260M8610R5051N8407m6782J12892
18018C17877P7814p6711j05113n6634l4466P1081n2026j17467o1007J37709J52477
18007B53534j14093j16468o0701P4019O8559O7484r0492k0698J21506M6915k0719
17996B08846m6326R0994N2635O9221J27232M3820J27021N9861o1030P0935J41738
17985H84947N0659J39333J50162M32r8771r4260q8997j8401o3950M6582q6013
17974H21723j40467j43409j7214k7528m0501o5119l5480j6881l5714n417m2726
17963B51267L051N9829N0600R4327k6539j24479M1384L2930j5110q5900m0696
$$ y = [620461, 534082, 496571, 429015, 372645, 318161, 324749, 377912, 392692, 386003, 311474, 273446, 265639, 279837, 274636, 245528, 187168, 120320, 66959, 49699, 98309, 193360, 251767, 204985, 317877, 395691, 318980, 213867, 157233, 122767, 193848, 141822, 24355, -36652, 101057, 253534, 139441, 22973, -37728, 36291, 104850, 172334, 81842, 61144, 182650, 229565, 208846, 162520, 253514, 306149, 375370, 502602, 546422, 673443, 733304, 672274, 743209, 884947, 935606, 1074939, 1225101, 1225533, 1126762, 1032502, 943505, 925104, 861154, 907736, 821723, 681256, 537847, 520633, 493105, 452604, 387485, 352005, 335124, 299410, 293993, 251267, 254318, 314147, 364747, 459074, 432535, 308056, 349440, 382370, 367260, 281360, 240664]
17952B40664p3507o037O2233K20215L0138k6003m9598k7994l2863J2139O7776
17941D17163O7929K7785K6459J8021j7078r0180K1730L7577O3832N2578j7917
17930F07899L4508m1084o3441m0350j01473j04824j17355n748l3932n6364o2532
17919A5304L0501J3749l4696P7147J092Q0664N9974P7848o8056j28469p9040R2832
17907A38850J17843L3166n0645N0094L7011q1197q1512J3017k4991j9882P6635
17896B08389J18236l0755j44833j01364j4347k7859R427N4910O1614q017j8048
17885A07353K1060J0366K5645M583J3421j60841j25279J6920J5786j5150L2019
17874e4117L5651J51570R0071K3488o3945r5313j16826J411J01411M6941q1097
$$ y = [240664, 167157, 161120, 223353, 443568, 473706, 447703, 398105, 370111, 337248, 349387, 417163, 485092, 512877, 539336, 557357, 540279, 450099, 471829, 509406, 573238, 625816, 607899, 642407, 601323, 537882, 497532, 396059, 291235, 173880, 168132, 134200, 77836, 15304, 45805, 59554, 24858, 102005, 103097, 183761, 243735, 321583, 253527, 125058, 46018, 138850, 256693, 289859, 239214, 289308, 326319, 245122, 163610, 176627, 151636, 131754, 208389, 326625, 295870, 151037, 49673, 35326, 7467, 16894, 71804, 133418, 125401, 107353, 128413, 138779, 164424, 169007, 182428, 21587, -103692, -86772, -70986, -86136, -54117, -18466, 133104, 223175, 246663, 182718, 87405, -29421, -28010, 73401, 120342, 39245]
17863C9245l0181J5190k1158q157O205P4310m589n9608O2075L6055J7208l8622
17851H7973o0249K6486p0511m0869P743o87o5493n4817r003L5600R6599K0638
17839b6590m7375q9001K5537J7408q2954n7532J6568O2625N6073Q3521n9440m0139
17827a41299O5625P3636n876L0850K9076M8194j09857Q073Q845j1203o3139N599
17815f1476J24807J21045M0258j08773r4993p4817j3215J00125l1625j18106K7623
17804h9147l911J634O8894O7821L3077O0625o2735q5654j166j50808Q099J70091
17792A6820M40l6173j1228m1179K6415J9315O1386P6266m8802o6710M99n9209
17780f2160o7896O3897k988l8893O8489K7628j02514n9096M2650Q8147r1469O612
$$ y = [39245, 9064, 24254, 3096, -5061, 1144, 75454, 70865, 11257, 73332, 109387, 126595, 87973, 27724, 54210, -16301, -57170, -49427, -50114, -115607, -170424, -179427, -143827, -47228, -26590, -73965, -162966, -137429, -120021, -202975, -260507, -243939, -181314, -125241, -41720, -101160, -141299, -75674, -2038, -7914, 22936, 52012, 100206, -9651, -1578, 7267, -3936, -67075, -61476, 63331, 184376, 224634, 115861, 20868, -53949, -67164, 32961, 1336, -116770, -89147, -93058, -91424, -22530, 45291, 78368, 138993, 76258, -9396, -10562, -161370, -153271, 16820, 17260, -18913, -30141, -71320, -44905, -25590, 35796, 112062, 63260, -3450, -2951, -62160, -130056, -66159, -69147, -108040, -39551, -11923, -114437, -173533, -130883, -42736, -134205, -127593]
17768a27593J17711l3402o2420N5316K1353O2259j9859o085j26210r5448J8885
17757a95493O4018J26701J28516j09714r3970J4656M9084p5999n0882J02728n8116
17746i8471N6864K1174M7770J1435j3806J4456o898q3111K2417J9531l0078J3814
17734b4903j6488k4593K4809j11093M6483O3813j1604K1260K4415K987m6084p2805
17722a23803M3941k1718O909k9501M9335L864r3620K0655J37119m3866J05520
17711E4835P4135J7229r0751j12188M3038l3682K7433o2105K419O5235l7441o5422
17699a17265m0157M8991J0556K8859J50628n5203N1796k614L2883m5750m3220
17688A9504r1795j3838Q9983Q9686r4794r4916m641K0241r0283r6284O6549J00580
$$ y = [-127593, -9882, -43284, -105704, -50388, -29035, 33224, 13365, 7280, -118930, -214378, -195493, -131475, -4774, 123742, 14028, -79942, -65286, -16202, -92201, -143083, -40355, -98471, -41607, -20433, 27337, 38772, 24966, 39422, 32524, -50587, -28170, -8639, -38717, -24903, -41391, -65984, -41175, -152268, -105785, -41972, -53576, -32316, -7901, -4914, -50998, -123803, -79862, -101580, -94671, -124172, -74837, -70973, -164593, -143938, -6819, -50685, 54835, 128970, 146199, 55448, -56740, -13702, -47384, -19951, -82056, -79637, -14402, -51843, -117265, -157422, -108431, -97875, -69016, 81612, 26409, 78205, 75591, 108474, 62724, 19504, -72291, -86129, 3854, 93540, -1254, -96170, -100811, -80570, -170853, -267137, -200588, -100008]
17676a00008j2262O7394R4502m737j08588m1767j29328k248l60J01136n4472j459
17664a92197j3091J41893O1998m1886L2044K4613L9418K3434R0272k2366j04110
17653D0022p4731N7883P536k6794j03814o0322p4433J00059J3320J735R1797K6137
17641a605q2455M4376p529q0404j2191Q4543J26618j5098j1141n3525L5824O9064
17629I6477n2845n8894o6585J1842q7359O110R567R543J27834O8983L5406l214
17617I6865j31970o3612J076L1218Q9908q540o8990o7814J27102J8050q0963o2431
17605a20101n7246R380O5808N3957l379K5976j7846L1547o6561N9427N1133J9590
17593E1685j23314K2832J01904j156j18321j8360n758P2009O5552k5446L4710
$$ y = [-100008, -112270, -44876, 49626, 44889, -63699, -105466, -234794, -237042, -237402, -136266, -190738, -192197, -205288, -63395, -1397, -43283, -11239, 13374, 52792, 76226, 166498, 144132, 40022, -34709, 23174, 30710, 3916, -99898, -160220, -234653, -134594, -121274, -119539, -27742, -1605, -84060, -39684, -47213, -127617, -139808, -55265, 71353, 56255, 45114, -8411, 27413, 96477, 43632, -15262, -81847, -70005, -157364, -151254, -141687, -132144, -4310, 64673, 100079, 96865, -35105, -98717, -97641, -66423, 23485, 14945, -54045, -121859, 5243, 23293, -57670, -120101, -177347, -167967, -102159, -48202, -51581, -25605, -43451, -11904, -78465, -19038, 32095, 51685, -71629, -48797, 53107, 51951, -66370, -84730, -90488, -18479, 47073, 21627, 56337]
17582E6337k4503n1625k5578m146M6306J3620K7626R5508q9680m0533o8049J6629
17570d8088p195o2356k0739p5468p786Q7460O337j9866o197L8015q5218j9336
17558b20437K5310O6730p3969k0603M4200O0538J03770o330O9098k0131J949k8759
17546A366n9950n5895P8222m7698o4847j3230J27724O3130l7822P781J6377l3083
17534a7925m130k0043m8979P7445k1107M03l0077J0183k2810M8123Q6560k8884
17522B8759k5462q567p3809k4198r474Q5146l2353j25883L230J67907P8252l0357
17510C3191J0423n011m7153K9891j73759n8824J13285l164M4902K2438m390R640
17498b8531j11652j19959J03996m3834N5817P3679O9043j3715O516J5257M277
$$ y = [56337, 31834, -19791, -45369, -49515, -3209, 10411, 38037, 133545, 43865, 3332, -64717, -48088, -55283, -117639, -138378, -213846, -221632, -134172, -127835, -147701, -153898, -115883, -201101, -220437, -195127, -128397, -202366, -222969, -178769, -118231, -14461, -20791, 48307, 28176, 30125, 1366, -58584, -114479, -36257, -83955, -148802, -162032, -34308, 28822, -9000, -1219, 15158, -17925, -22055, -42098, -91077, -13632, -34739, -34336, -64413, -54230, -77040, -28917, 57643, 28759, 3297, -5270, -79079, -103277, -112751, -27605, -59958, -185841, -182611, -14704, 63548, 33191, 43614, 38603, -8550, 21341, -152418, -211242, -97957, -101121, -56219, -33781, -38171, -28531, -140183, -260142, -156146, -199980, -144163, -70484, -1441, -15156, -8640, 6617, 10894]
17487A0894l668L975N1057q1856k8396p8189J3004O4822P7171J20523j8535k01626
17475g0824k4718N868O3711J17130K9988n7438p8503m4789P8975k1426P7859n2765
17463B3068j60952K512J965Q456q134J30753O8373r8957K3253P8011J0953k706
17451G6595Q666L9277O2564l3256j8149P3648J19121J05091O1709j81870M264
17440C17660P1182M1116k239q5335j35702l6880n7942j3961n5985j15135r4767
17429a67988O6459O1887n6972m752L8508K1728q49o3840K8039J7221p7394M3188
17417i4765M7873o3744j33005m232J07485Q7895O0160P3781M428o8371j19559
17406a02054k9405K6609o456l749J14094L7374j4370L2574l9986r7435o2238M3179
$$ y = [10894, 7226, 11201, 62258, -19598, -47994, -126183, -113179, -48357, 28814, 149337, 130802, -70824, -95542, -89674, -25963, 91167, 121155, 63717, -14786, -59575, 19400, -2026, 75833, 23068, -137884, -135372, -133407, -124951, -133085, -2332, 66041, -32916, -9663, 68348, 79301, 76595, 85261, 124538, 187102, 153846, 135697, 209345, 328466, 433557, 495266, 313396, 317660, 388842, 429958, 427719, 342384, 206682, 169802, 111860, 97899, 41914, -73221, -167988, -101529, -39642, -96614, -101366, -62858, -41130, -41979, -105819, -77780, -60559, -137953, -94765, -46892, -110636, -243641, -247873, -140388, -52493, 7667, 81448, 85876, 17505, -102054, -131459, -104850, -111306, -115055, -961, 36413, 22043, 54617, 14631, -82804, -145042, -101863]
17394a01863N0460l3436M9873L5791R5150N0915j3785m2953r9038l200M4894j5000
17382A7808M5518L2656k1690k4905m770K0227J5412j3723j03261j08999M5172
17371a00555M0770q0132L9213Q2387J0392j5k5777m4006K6390O1187l3840j68827
17359a92813k5896K5785J18460J1049k9569P2137K6382P8126L125o1865J8227
17348D3148n7268O7243N7456k6938l1650o210j37573j2974J01287K1638r0657
17337g2498k7283k4039N7635m852k3996p530L6939M8166O692n5821P4931J15937
17325A24281n5133p8024M7296O4186J06807k8936j11002J0403L1178N1072l8502
17314A23626k7302j4513j13771N0420J3046M4374k9631k4163J2326J7162o9286
$$ y = [-101863, -51403, -84839, -34966, 825, 95975, 146890, 133105, 90152, -8886, -12086, 32808, 17808, 63326, 95982, 74292, 49387, 44617, 64844, 80256, 66533, -36728, -145727, -100555, -59785, -139917, -100704, -18317, -7925, -7940, -33717, -77723, -51333, 9854, -23986, -192813, -218709, -192924, -74464, -63415, -92984, -20847, 5535, 83661, 86786, 24921, 43148, -14120, 53123, 110579, 83641, 51991, 45781, -91792, -104766, -3479, 18159, -72498, -99781, -123820, -66185, -71037, -95033, -102563, -65624, -17458, -10766, -66587, 8344, 124281, 69148, -8876, 38420, 102606, 209413, 180477, 69475, 79878, 111056, 162128, 123626, 96324, 81811, -31960, 18460, 31506, 75880, 46249, 22086, 34412, 51574, -17712]
17303a7712p7919m6982K7720k2023m1864R242j06584O9980N7263j2714m8723l4980
17291b45296O7345J08954J9929o5627j27700Q9092R9601Q687j9195o4143J6521
17280a11832N4172J2161q1045r757J10930l0230O5956M2105o6528j13108k7641
17269a54817J3709J1894l1223M7222R915J2364p6450M9031q43J09311O0675K9835
17257H0623o9384M6820o0886k3728L3497j8254R839K8710M8736q0603m5937j9758
17245g0325n1587O1783Q4189M6558j21619p9164r6814J6465m983N398J2396k082
17233a99785J55819O0964n8697j6774k2n4919k3792p8094K9198k852O1362M0184
17221h7408K54j1815N5197J7249M6050K3145p865l3537L4085p1183J27185K9372
$$ y = [-17712, -95631, -142613, -114893, -136916, -178780, -169538, -276122, -206142, -148879, -161593, -210316, -245296, -177951, -68997, -49068, -114695, -242395, -153303, -53702, -45015, -64210, -128353, -111832, -57660, -45499, -126544, -136301, -25371, -55601, 10355, 52460, -14068, -127176, -154817, -141108, -129214, -160437, -113215, -103300, -90936, -167386, -118355, -119198, -9887, 50788, 80623, 11239, 58059, -2827, -26555, 6942, -11312, -1473, 27237, 75973, -4630, -50567, -70325, -121912, -60129, 24060, 70618, -51001, -130165, -226979, -210514, -215497, -210099, -197703, -199785, -43966, 16998, -41699, -58473, -58495, -113414, -137206, -215300, -186102, -188954, -127592, -87408, -87154, -98969, -43772, -26523, 19527, 42672, 34807, 1270, 35355, -35828, 91357, 120729]
17209A20729j03998p3636o3801p6894r6632J51014J83889J01422n1650j29709
17199c9266k0059p9061l9691M1767L5674J8091l9699L0654l2263P7979K18775
17188A72901N0981m8318m9781j70669m1100Q0395O7134n4296j0752Q1587o085
17177G1997q5290L3268j8521l4575P762n4938j9468J30978m4869o7418n288J2972
17165g3390N9079J5420r1965l840l160O6480l105n8584N5531j3399K5237l1135
17153e6831n5999n17M9565o397J05351J30132m5882j43940m1994n586N1710N0797
17141C0409n3437m6805R81j0946l9575Q4695N4332r5217k9118j10890j2243k857
17129b30671P2258J757L1183M1177Q3553M7105M52M607j6478L7895K2048j0611
$$ y = [120729, 16731, -56905, -120706, -197600, -294232, -143218, 40671, 142093, 90443, -39266, -59325, -138386, -178077, -136310, -100636, -82545, -122244, -91590, -123853, -45874, 172901, 223882, 175564, 125783, -44886, -85986, -5591, 61543, 7247, -3505, 78082, 71997, -13293, 19975, 1454, -33121, -25359, -80297, -99765, 31213, -13656, -81074, -86362, -73390, -14311, 1109, -90856, -94696, -97856, -31376, -34481, -93065, -37534, -50933, -25696, -56831, -112830, -113347, -63782, -70179, 35172, 165304, 119422, -24518, -66512, -72098, -20388, 30409, -23028, -69833, -68852, -79798, -119373, -34678, 19654, -75563, -104681, -215571, -227814, -230671, -158413, -156656, -125473, -84296, -743, 46362, 46814, 51421, 34943, 72838, 94886, 84275]
17117H4275p7039p3383l8378k4407O1185J24002L5913o2541m550n6514O570q4454
17105a09321j41633N237J02292L1802k771l2548m9320K370P9917J11051K3492
17094B0568M143R857m2307P6177J2726k7575J6120M3561q3524q0276M8883q8872
17082i0519j9290J11448l0457K041K7778L7313J0402O7698n6514r6636j25560
17071a62296K1171M1309j20929O0030O5686J45019K2878k9641m0823M8819K5733
17060G6956p6344K3658P0650j10266q1529J3409k5481q3095L8600l8312P9289
17049a12465M2288n5504n4896k5943J8105n2595L7879J11402Q2926k0921K6876
17038b848K5472k8602O0171P6355p6523L9148N721p923l801k9010l3161N0288
$$ y = [84275, 7236, -66147, -104525, -128932, -67747, 56255, 92168, 29627, 25077, -31437, -24867, -109321, -250954, -245717, -143425, -111623, -114394, -146942, -196262, -193892, -113975, -2924, 20568, 24711, 34568, -7739, 68438, 81164, 53589, 69709, 113270, 29746, -50530, -1647, -90519, -109809, 1639, -28818, -26777, 1001, 38314, 48716, 116414, 59900, -36736, -162296, -141125, -99816, -220745, -160715, -95029, 49990, 72868, 43227, 2404, 51223, 76956, 612, 24270, 94920, -15346, -96875, -83466, -108947, -192042, -153442, -191754, -112465, -70177, -125681, -180577, -206520, -188415, -241010, -203131, -91729, -8803, -29724, -2848, 22624, -5978, 54193, 130548, 54025, 93173, 98894, 90971, 87170, 58160, 24999, 75287]
17026G5287M3450J4394l6250j2581N7933j17845r6057k4839J3691o3m7599j9888
17014a50367J6563O3587P5939J46n347Q0913M991l2756q2047k6074p2668R685
17002a17435m1728j2968J14254J1281l5230P3398l8800j46768o9973J50655J04336
16991h978N1349k25o0902M4961j3056m2118N1082J5494o6278k5189q306k7771
16979h9937K9783K6560R8877p6757q2998L3677K5527j1426j57562K8129J05139
16968g0988K9953N7969j6532j04194M6865O1387J5659q9389p8496n4868M1841
16957a60793j705K7326K5301J08449R6956l131o5706p2201p6242L867k5579K4624
16945a18834n2023l9802J28815J02748l3552j02162O8383R5681P3168q1171o5546
$$ y = [75287, 118737, 133131, 96881, 84300, 142233, 24388, -71669, -96508, -82817, -82880, -130479, -150367, -133804, -70217, 5722, 5868, 521, 81434, 86425, 53669, -28378, -54452, -127120, -117435, -159163, -172131, -57877, -46596, -81826, -8428, -47228, -193996, -263969, -113314, -8978, 42371, 42146, -18756, 26205, 13149, -28969, 22113, 37607, -28671, -53860, -62166, -89937, -60154, -33594, 65283, -11474, -94472, -60795, -35268, -46694, -204256, -176127, -70988, -41035, 16934, 402, -103792, -56927, 4460, 20119, -69270, -147766, -202634, -160793, -162498, -135172, -109871, -1422, 95534, 92403, 26697, -45504, -121746, -117879, -143458, -118834, -170857, -210659, -81844, 20904, -12648, -114810, -46427, 49254, 122422, 41251, -24295]
16934b4295j21632l5076J13198M7896K0110j2557J8946O0890o6251m6686k1021
16923f6478k5353l1764N7937l1639q093J06395L0944l7916K8897L8625J3614L4988
16911A10157p412r0715R7491j1116k7590N0189j24441j18881j593K1661j7124
16900a19374J4294l5638j13459N4094J83017M6806r4900k0091N5436k7716k1546
16889g9077Q6815P1091l3504j3449Q8111n1512o2395m9095J29L2903k8087n9693
16877i7763l8268L40J11328M4719m5773m0548k0177O4389O1423k9439J2164j9329
16865C066n2953m0418N183l4087r5857m9183O4771J21288J43051l1791j05351
16854g2281O4830j2036l9489r6988o5642J6202L802Q573M948O4953j4703m5508
$$ y = [-24295, -145927, -181003, -67805, -19909, 201, -12356, 6590, 67480, 1229, -45457, -66478, -91831, -123595, -65658, -97297, -105390, 1005, 31949, -5967, 22930, 61555, 75169, 110157, 102745, 12030, 109521, 98405, 70815, 121004, -3437, -122318, -123911, -102250, -119374, -105080, -140718, -254177, -200083, -17066, 29740, -65160, -85251, -29815, -57531, -79077, 7738, 78829, 45325, 31876, 119987, 68475, 6080, -43015, -42886, -9983, -38070, -97763, -136031, -135691, -24363, 20356, -25417, -65965, -86142, -21753, 39670, 10231, 22395, 3066, -49887, -90305, -85122, -119209, -215066, -264249, -199478, -78190, 64861, 33070, -72281, -7451, -19487, -58976, -155964, -221606, -205404, -201602, -193029, -188081, -123128, -137831, -183339]
16842a83339J03789J50397K7573j0160L4859j48567p6142O5292L2774l1306N4743
16831A9913j2717o4262j28352L2526L1848M2796M4603k335j56738N905M1100j924
16819a47637J60504Q8018j14215j0596K5937J3589K6963K7675N7639L9502o0792
16808A06587m0305k8300p9584k7197P999J4415J17136L1479k7375m7253L1760
16797E9362J3608J4375j208q3792o1106J48995Q0j31195n1983R4924L169o0648
16785e5419q954M5614L5838p1523R5735Q6335M9493k7012O401n9398p3512j8286
16773E312o5585k6698j3417P1217J24297P302j52860M8358N306j5552O4881k4005
16761B8556n8722K3350K693l3069n2473j6213p56J31249M8082j13414L030M2159
$$ y = [-183339, -79550, 70847, 98420, 88260, 123119, -25448, -101590, -36298, -3524, -34830, 19913, 7196, -57066, -185418, -152892, -121044, -78248, -33645, -35980, -192718, -186813, -145713, -147637, 12867, 100885, -13330, -23926, 2011, 15600, 42563, 70238, 127877, 167379, 106587, 66282, 37982, -41602, -68799, -60800, -46385, 70751, 102230, 74855, 27602, 59362, 72970, 87345, 86137, 2345, -58761, 90234, 90314, -40881, -92864, 2060, 5229, -55419, -64373, -18759, 17079, -54444, 41291, 127626, 177119, 150107, 156508, 97110, 23598, 5312, -60273, -86971, -100388, -29171, 95126, 102428, -50432, -2074, 3232, -12320, 52561, 28556, -30166, -6816, -4123, -37192, -89665, -105878, -106634, 24615, 72697, -40717, -37687, 4472]
16749D472Q9669O1646j5077m5001o7578k6858l1619n7716k9715l3951L6713r090
16737a24105M5451J54145K155q3276q6349K7802J04649L4739N121j8035n9464
16726B833o0390o1690Q6667P9857k7731J7967K3189N7808J5416j3599k9490r6163
16714e326r5118P3121J11545j6214m6446R0436O2651K7866m5860o2838j00750
16703f933r6250P861K7130J8965P7693L5089j04050o3016j1272p411l8967q346
16691a69507j2637P4279K8932O266O6481M1662n3140k9964k3911J7469N4740L4738
16679C5408j6969N600n6503M93k4944L0450P7157Q5938o297j6592p098q3912l0251
16666g520O6827l204j0641K7087R9487J6000j34433j26656L7560M6042j16578
$$ y = [4472, 94141, 155787, 140710, 95709, 28131, 1273, -30346, -88062, -117777, -151728, -115015, -124105, -78654, 75491, 77646, -5630, -91979, -64177, 40472, 75211, 80332, 62297, 2833, -57557, -119247, -32580, 47277, 19546, 37513, 60702, 118510, 133926, 120327, 90837, -5326, -100444, -27323, 84222, 68008, 21562, 111998, 174649, 202515, 156655, 93817, -6933, -103183, -95322, -68192, -49227, 28466, 63555, -40495, -103511, -114783, -122194, -161161, -169507, -182144, -107865, -78933, -72667, -6186, 35476, -17664, -47628, -71539, -54070, 670, 35408, 18439, 24039, -32464, -31971, -56915, -26465, 50692, 136630, 130333, 113741, 106643, 22731, -7520, 59307, 56103, 45462, 72549, 172036, 188036, 53603, -73053, -35493, 10549, -106029]
16655a06029j02047K7132P5962P7047m7696m361O0723N3946k0949j6124m1737
16644d4133n9173N9314k7724P437o516K8052P9870O1092j8566m7934J2149j6726
16632B7142j38608K0047L080o613P8935K5343o5082m7986J37000Q9778k4967n2722
16620D5347L0703l4397j04959k4133J8948Q1836J8517j15019p5757n6229M2336
16609a72807L1142R7045P6373r6008M7286l6719n0326l0336Q0086J3660l0752
16598g1356j2362J7376P766k8405Q5035N6751O0234o2560j00771n6603K6718M9411
16586b8766l4385m2226j50051j1193Q1123K1840l0790l3844M8347M0048J33142
16575f755J50946k1551o6128k9231N9114k5621J9006K2807j2412L0299k5789n6656
$$ y = [-106029, -208076, -180944, -104982, -27935, -75631, -79992, -19269, 34677, 13728, -2396, -44133, -103306, -43992, -71716, -64279, -70795, -42743, 37127, 98219, 79653, 31719, 43868, 27142, -111466, -91419, -88339, -94952, -16017, 9326, -55756, -103742, 33258, 123036, 98069, 45347, 76050, 41653, -63306, -87439, -68491, 13345, 31862, -83157, -158914, -215143, -172807, -141665, -44620, 31753, -64255, -16969, -53688, -104014, -134350, -54264, -40604, -71356, -83718, -66342, -58576, -86981, -1946, 54805, 115039, 52479, -48292, -104895, -78177, -28766, -63151, -105377, -255428, -266621, -185498, -163658, -194448, -228292, -179945, -139897, -6755, 144191, 122640, 56512, 27281, 86395, 60774, 79780, 102587, 90175, 120474, 94685, 38029]
16563C8029o1593l0341L74m9093L6245K9039J10662n211J07454O6129J9689l0523
16551B30860o9620q0477p9648n3819M32o1862N6723M0335L0075M7962P1485q157
16539A24289j23129j45347K1585M7642Q0191M896j40264J7699R5257o955j77400
16528b01536j61342J1412J66267J98107J15672K3124k0567P7769q6095r4105K288
16517C0994L4139K5776m6597J12448k9924k8897j97330r4725j2601J99843J50130
16506A43256q504j07994K6433J28084r1829r3032K6450j5824j5210j3389n1475
16495g3034O368k3193J6713n9297j07150p991R4844L5422L1814P4774J14016N9022
16483A62308l9054p3128n4419M5616N3929q5782k7097o2725J14255L7197l7186
$$ y = [38029, -23564, -53905, -53531, -102624, -66379, -37340, 73322, 68111, 175565, 241694, 261383, 230860, 161240, 80763, 1115, -52704, -52272, -114134, -57411, -17076, 12999, 60961, 132446, 124289, 1160, -144187, -122602, -74960, 5231, 10127, -130137, -112438, -17181, -24136, -201536, -362878, -351466, -185199, 12908, 128580, 151704, 131137, 208906, 122811, 28706, 30994, 65133, 90909, 44312, 156760, 126836, 97939, -99391, -194116, -206717, -6874, 143256, 134752, 26758, 53191, 181275, 89446, -3586, 22864, 7040, -8170, -21559, -73034, -66666, -89859, -73146, -132443, -239593, -247584, -152740, -117318, -85504, -10730, 103286, 162308, 123254, 50126, -4293, 41323, 95252, 9470, -17627, -80352, 33903, 71100, 33914]
16472C3914j4429k0565q418p3580l9847J06856O3841k9303p7338o755M6795q007
16460b6836j9825l6214l4680M2327m0139l5500J63P1552l2801K3668R8778J35043
16448A45536o0582l1810M591r504n8662j16534J27714J51804m7730n7178J5086
16437F2731L3183N795n7983k9005j9474m1217L7009l1077l6160M8007O5399L5840
16425G3048k2253q8897q7892L6387m8511M5438l131L0732J9581q2064m1177O6963
16413a01776n9901L262k3830l517N5968j5337j8783M5570M3405p8927J1257N1373
16401i1236O1903M2212K9411k4266l9573l5919j17231n585O2214R3743M7485J0544
16389C3702n2757j499o3415o3740N6076M9165O3537l789P4340R5714o5817j35582
$$ y = [33914, 19485, -1080, -9498, -83078, -122925, -16069, 47772, 18469, -58869, -65624, -18829, -26836, -46661, -82875, -117555, -75228, -115367, -150867, -150704, -79152, -111953, -88285, 10493, 145536, 84954, 53144, 57735, 48231, -10431, -126965, 749, 152553, 104823, 47645, 62731, 95914, 101709, 43726, 14721, -4753, -45970, -8961, -40038, -76198, -28191, 37208, 73048, 50795, -38102, -125994, -89607, -138118, -92680, -95811, -65079, -45498, -127562, -168739, -101776, -161677, -158415, -182245, -185762, -129794, -145131, -163914, -118344, -74939, -153866, -142609, -91236, -29333, 12879, 42290, 18024, -21549, -57468, -174699, -180284, -118070, -24327, 23158, 33702, -19055, -20554, -83969, -147709, -91633, -42468, 21069, 17280, 91620, 187334, 121517, -14065]
16377a4065o1688O9777P0501J1472j3168m662O274p1867J8682Q1037J3817l1847
16365G4263k0872L6886J3431j42791j31755J9448P7095l0403j11484K2168Q4808
16354a09206j06132n7882K4597R4182K7321l3639L8246P7388P9097m0607q8014
16343i4649q8746M1949O5048J27594Q32m4608J5390o701n5703l5999K6901L9916
16331h776m5546r0123n4818L2169M99K430N0997Q085J16995O4293M4048q6024
16319C4229j5822j8367j621R8311M2980L376j6057m7763l1575k0432p0513m7480
16307i0734L6545j4094P2297N5671p1665k5897l8052P7870P799k9173J0712M2680
16295C3959j8986J8010J3933k6376Q929l4359o4071j7220J0085l698n6175K352
$$ y = [-14065, -75753, -5976, 64525, 75997, 62829, 58167, 64441, -7426, 11256, 92293, 106110, 74263, 53391, 90277, 103708, -39083, -170838, -151390, -74295, -104698, -216182, -194014, -109206, -215338, -273220, -248623, -154441, -127120, -160759, -122513, -45125, 33972, -6635, -94649, -183395, -141446, -76398, 51196, 52028, 7420, 22810, 16109, -39594, -75593, -48692, -8776, -54322, -144445, -199263, -167094, -166595, -164165, -113168, -105083, 11912, 76205, 120253, 34229, 18407, 40, -1581, 96730, 139710, 143086, 127029, 79266, 47691, 27259, -43254, -90734, -54189, -68283, 4014, 59685, -11980, -37877, -75929, 1941, 9740, -19433, -8721, 33959, 14973, 32983, 46916, 20540, 29469, -4890, -68961, -86181, -76096, -79794, -135969, -133617]
16283a33617L0968j561N4856L0282k2095m3425K8701M9262K0325K31J9162p6335
16271d3246n3915O7033M0364L9171L1470m167r824J26974N736q1811r1745l4500
16259h460K0547Q5565k7886j88881j7030j2991J028M5640O9216J29297J8098j40184
16247b6041J249o5194n4444p8243M420M7964N8640Q7706J3728N3921J6729m8923
16235A1512L1159M2007m3554K2574j05325j2509j07219p9195J77599J11130L6524
16224H4703p3583o0123k6432o7098O0873N1750J9665K7001J2687o7894j08700
16213a47151p2671L0582j6628l8588N9524J09227J8391n9611J20941K6813K4740
16202E5569L8812J920l3841J933L8132M9088j12827P160K0336p7079p2477r3920
$$ y = [-133617, -102649, -104210, -49354, -19072, -41167, -84592, -55891, -6629, 13696, 13927, 33089, -43246, -97161, -30128, 10236, 49407, 80877, 76710, 66886, 193860, 199596, 117785, 26040, -8460, 12087, 97652, 69766, -119115, -136145, -149136, -148108, -102468, -33252, 96045, 114143, -26041, -24792, -89986, -144430, -222673, -218253, -170289, -111649, -23943, -10215, 43706, 60435, 11512, 42671, 84678, 41124, 63698, -41627, -54136, -161355, -240550, -62951, 48179, 84703, 11120, -49003, -75435, -142533, -81660, -29910, -10245, 16756, 29443, -38451, -147151, -219822, -189240, -205868, -244456, -184932, -75705, -57314, -116925, 4016, 30829, 55569, 94381, 96301, 62460, 64393, 102525, 151613, 38786, 45946, 66282, -10797, -83274, -177194]
16190a77194P9583P1539o9572j8588K7826m0684P3436k35n980M7533j4119q9216
16178a15671o143o2459M9051J69360k0963p0660O2209k7065j14287l0773J40354
16167b7047p0415j6015J27422L3908j4766n6966M0753J24853O269j11289j06664
16156f9957O211P977m7280l2253K0593R4232m5430k2450J06399N1104M6452n4316
16144F1282j22624M7109K4336m101j01643L0258R5288J0595o2627o3586Q4169
16133a544Q2502j08197p3820N5963J6193p1400k6073M3479m521Q9821O0940k1651
16121D1692n663L8709K891k5456Q85q135j8931j4688n8623J5426N965j2246j05214
16108a43388m1022J44502J35130O1148l792k4192m0230K3857J3128j10365l1557
$$ y = [-177194, -97611, -26072, -95644, -114232, -86406, -127090, -53654, -53889, -59869, -12336, -26455, -115671, -121814, -184273, -135222, 34138, 13175, -57485, 4724, -22341, -136628, -167401, -27047, -97462, -113477, 13945, 47853, 33087, -23879, 16874, 141727, 147996, 36707, -69957, -63746, -55769, -103049, -135302, -114709, -20477, -65907, -88357, 18042, 69146, 115598, 61282, -61342, -14233, 10103, 6002, -95641, -65383, 29905, 40500, -22127, -85713, -1544, 80958, -27239, -101059, -45096, -28903, -100303, -126376, -82897, -87418, 2403, 63343, 41692, 36029, 74738, 77629, 52173, 53058, 44923, 25992, 11304, -47319, -31893, -25928, -38174, -143388, -184410, -39908, 95222, 156370, 152578, 128386, 88156, 112013, 125141, 14776, -16781]
16097a6781p8747j7875R0882j1791j9837q418l1917r280k765n1683l1635K1993
16085a67854J29326L1613K8448m7736j09551N2289Q1994N7588k9043k8926l6121
16074c7973o158Q9742J07502L0280j49776m9504o1978N2176n7974j14603n7462
16063b55728J14040M9114p317j30965n6014K010R2927R1591N7364L1837K9262
16052A8121J3494r2350o1442q1971J6720J43984R1214j4556L1131r6979L96n481
16040c7719L3661K7908M1992N2348l148j00240j2217J98648K7576j11272m7720
16029F9817o9362o5100n1897J8312J7606J8260R2222j5365r8417N1273Q1596q7442
16017c8497l2425O7827r749O4085m2442n1049L8189K2057J07998R1483m8762l1121
$$ y = [-16781, -95528, -113403, -22521, -34312, -54149, -62567, -94484, -103764, -106529, -158212, -189847, -167854, -38528, -6915, 21533, -26203, -135754, -83465, -1471, 56117, 27074, -1852, -37973, -44131, 45611, 153113, 183393, 33617, -15887, -77865, -25689, -83663, -198266, -255728, -141688, -92574, -99891, -230856, -286870, -284860, -191933, -100342, -42978, -11141, 18121, 31615, -60735, -122177, -204148, -187428, -43444, 47770, 33214, 64345, -32634, -32238, -37719, -4058, 23850, 65842, 118190, 115042, 14802, 2585, 201233, 228809, 117537, 69817, 455, -64645, -116542, -98230, -80624, -62364, 29858, 14493, -83924, -32651, 48945, -38497, -70922, -3095, -12844, 51241, 8799, -42250, -4061, 17996, 125994, 217477, 168715, 137594]
16005A37594n4437l4017o7401J5073j6648j1253M6549j16146n7200M833M6901
15994a06152J00547P4367n6385o9170J699R1331L6877q0256m881L4873O149J2337
15982D1336m1892k0440l0834J0549j11500j09140K9636M9014J22315L936l6689
15971i3709l8339P1236P6882l4617L8519J8418J24478m4105l5975n9766o4802
15960d1780q5877J8236J13311m1458N8125M3503L580j40592p5427K1727R3717
15949c2935O6524k2286j3476P2721m0250n5660l4071l141O222j02j16268R4362
15937g8360J08051l181j30541m5783M2026J1229N2083R2719P4129J8285n9177
15926H1480n5694k3918M9080l2288j25668K0245J3595O2206k0463m931J01171
$$ y = [137594, 83157, 49140, -18261, -3188, -19836, -31089, 15460, -100686, -157886, -153053, -106152, -5605, 68762, 12377, -56793, -55094, 36237, 73114, -7142, -12023, 22850, 28999, 41336, -556, -20996, -51830, -41281, -152781, -261921, -232285, -183271, -60956, -57020, -93709, -132048, -60812, 16070, -18547, 19972, 38390, 162868, 118763, 82788, 23022, -41780, -127657, -109421, 3890, -37568, 20557, 64060, 67640, -72952, -148379, -126652, -32935, 33589, 11303, -2173, 70548, 30298, -25362, -59433, -62574, -56352, -56454, -172722, -78360, 29691, 26510, -104031, -149814, -107788, -96559, -44476, 48243, 122372, 140657, 81480, 25786, 1868, 50948, 18660, -107008, -86763, -73168, -10962, -31425, -36356, 64815]
15915F4815M7059k1710l8671q230Q441J44980N3675q0016l7418p0769j11813o3618
15903a13275L7509l3664r6277R5177J439k8227j4363K9579k7841Q1788O6465Q6835
15891H5145K0328l7479L6135N5401n3780q1203n6860O7574L7260M9235j4775J8360
15879A25341L6724q6900o2270o4516m3180M2399R324M6775m8761O2767N4303j40239
15867f8233l7594L2935m3084M114N2451N7700P9104L2138j6260n0943P9541j2413
15855A09456o3621j23767L6813L6105N6590n3949N6342P0209Q0395p9355K0283
15844A45501k14080n3848P9867K2528K1547M578m4698J5083M072P2820O1994n2564
15832F2800l6960k7493R0398j3613n5995O9110j0837j6609l4849K4914L0796k3193
$$ y = [64815, 111874, 90164, 51493, 43263, 51704, 196684, 250359, 170343, 132925, 62156, -49657, -113275, -75766, -109430, -205707, -110530, -109091, -137318, -151681, -122102, -149943, -68155, -1690, 85145, 105473, 67994, 104129, 159530, 105750, 24547, -32313, 35261, 72521, 121756, 106981, 125341, 162065, 75165, 12895, -51621, -94801, -52402, -43078, 3697, -45064, 17703, 72006, -68233, -105827, -72892, -115976, -111862, -59411, -1711, 77393, 109531, 93271, 42328, 121869, 109456, 45835, -77932, -41119, -5014, 51576, -2373, 53969, 124178, 204573, 125218, 145501, -68579, -122427, -42560, -20032, 1515, 6093, -38605, -23522, -19450, 53370, 115364, 62800, 25840, -1653, 88745, 75132, 19137, 88247, 77410, 60801, 25952, 50866, 81662, 58469]
15820E8469K0155j3530j47990j06692l4940N4405o5399Q9743N6956L1451K5024
15809c2348K1250l2713L4978m2577J09877P4601P329j42342r2119J1655J0022
15798g2387O1096J06200r0517k5300L0194o7218p007j7864J9764N2615J1128Q4790
15786H5494K7484n3584o6163j9905l6462k2507Q114Q899Q3203L983j1029j17087
15774a09560M4719Q8626L7712o377J8534K1066K0114j9749n6893q1464j04301
15763a47573k1582J22197J13538J7457k0972j44275q9172Q5490J06400N6932r7501
15752a9061n2646L3200R8615M668q2798m1175l0721p4650o496J48977J2451o9976
15740g9612l5630N5549P3763O087K1418n6192k6599J9645n325n7781j3850N6004
$$ y = [58469, 78624, 65094, -82896, -189588, -224528, -170123, -235522, -145779, -88823, -57372, -32348, -11098, -43811, -8833, -51410, 58467, 133068, 140397, -1945, -94064, -82409, -72387, -11291, 94909, 4392, -20908, 9286, -57932, -64939, -82803, -63039, -10424, 704, 85494, 112978, 59394, -6769, -26674, -63136, -85643, -77529, -68630, 14573, 18556, 7527, -109560, -64841, 23785, 61497, 55120, 73654, 94720, 114834, 95085, 38192, -43272, -147573, -169155, -46958, 66580, 84037, 63065, -81210, -170382, -84892, 21508, 78440, -19061, -71707, -38507, 60108, 64776, -18022, -59197, -89918, -164568, -171064, -22087, -9636, -79612, -115242, -59693, 14070, 20157, 41575, -14617, -41216, -21571, -26896, -84677, -98527, -42523]
15728d2523M9385N6117q0954n1668J7347O2105P7920K3558j8712k6618o8542l5292
15716c7877M8393K0977k9846r1471k2688o4142o3873K8662J34505n4699n1296
15705a83355R7092P4925o028L6585N4435p294j45187P9563R014m9072Q7727M3236
15693I1641j48816m9615M1109O048K4940Q169Q2638O4183l6468j45742j4665M687
15681g1891k100N4971O650j2644L1794j04114l7837k6916o6737J0076L5937m9406
15669b32217M0090m1068Q587R9973J32206O7029Q3058j3376m4459K9396r379K5996
15657A45836q4845r2989L0281j35808L7260O9736R8429r667n4555K4946K8406
15646E7030l7782j9621N4545N4299l4005o110P434Q5023o1173l6892m047m9988
$$ y = [-42523, 6862, 62979, -17975, -69643, -52296, 9809, 87729, 111287, 92575, 65957, -2585, -37877, 10516, 31493, 1647, -89824, -112512, -176654, -240527, -211865, -77360, -132059, -183355, -86263, -11338, -17366, 19219, 73654, 66360, -78827, 736, 9750, -39322, 48405, 91641, -57175, -106790, -65681, -59633, -34693, -26524, 56114, 120297, 83829, -61913, -76578, -71891, -73991, -19020, -12370, -25014, 6780, -97334, -135171, -162087, -228824, -218748, -182811, -232217, -192127, -233195, -224608, -124635, 7571, 74600, 157658, 144282, 99823, 129219, 119840, 145836, 60991, -31998, -1717, -137525, -100265, -30529, 67900, 58233, 3678, 28624, 57030, 19248, -373, 54172, 108471, 74466, 68356, 75790, 160813, 99640, 62748, 58701, 8713]
15634H713j2137n0081L0133k8482n9619K938J04666Q1878k8358q8454R5046N9068
15622A15311n4718q0205j56161n381J08123j6631j57877k2257N7509J74499R3666
15611E5878K5954O1720n8240q1257l1173j74452P354J37319J62890k1490r5478
15600a0975K2396O6669k5432m5916L7485j2202m343j3030j9100o0568l8497q447
15588a11960l3039J18514Q7536j2129J3732M5583O1374r6167r6497l4028J2392
15577d4689P9339Q0841n0737q3318j03961J2531M1936R10L0958M8944J7538n3983
15565b3691j0006R6443L5363L0091n977m3413j02724o3956L0255J04324J62825
15554B09534K8562q4764n2247r5482L5294n3572n5468K0641L8338P3202J04674
$$ y = [8713, -3424, -53505, -23372, -51854, -111473, -108535, -3869, 78009, 49651, -38803, 56243, 115311, 60593, -19612, -175773, -181154, -73031, -89662, -247539, -269796, -212287, -37788, 55878, 81832, 143552, 85312, 4055, -27118, -201570, -194216, -56897, 105993, 84503, -10975, 11421, 78090, 52658, 6742, 44227, 32025, 27682, 14652, -4448, -65016, -103513, -111960, -144999, -26485, 61051, 48922, 62654, 108237, 169611, 73444, -23053, -57081, -44689, 34650, 115491, 64754, -18564, -122525, -109994, -68058, -67148, -36190, 12754, 30292, -23691, -33697, 62746, 98109, 128200, 122223, 78810, -23914, -87870, -57615, 46709, 209534, 238096, 153332, 101085, 5603, 40897, -12675, -68143, -47502, -9164, 64038, 168712]
15543A68712j5931J0061j13459r953M0763l6352q7368l7615n1414j28296J00016
15532a60836J69486j596q4186q4726k1577R7228L3215N990M2206j487l3984l1066
15520g1333j1928k4165K3054J2111J5395N8343R2021n9151j10317q4477P658J14091
15508c8698K16741P2835p6567j18310q6731m8128J6650K2994L3128Q881K3039
15497B5834N726O3912o4708j08429j15281p1402N0850P4254R3032K1154m1620
15486f6678l279M7496Q5698O3666k13m0223r0353j14969l393N5243R4155q0126
15474e2976l6180M1718N8013m6857k4025P2007N6074m5048L5391O2497l1146k6320
15462F3148N549p8347O3930j8431q2344n6819M7563P6178O2470O892k7863j4765
$$ y = [168712, 152781, 162842, 49383, 39430, 80193, 43841, -43527, -81142, -132556, -260852, -160836, 8650, 7054, -77132, -161858, -183435, -86207, -52992, -47002, -4796, -6283, -40267, -71333, -83261, -107426, -84372, -72261, -56866, 1477, 93498, 34347, -75970, -160447, -152789, -38698, 178043, 250878, 174311, 56001, -30730, -78858, -62208, -39214, -6086, 2795, 25834, 31560, 95472, 30764, -77665, -192946, -264348, -213498, -139244, -46212, -25058, -66678, -69957, -22461, 63237, 126903, 126690, 86467, -3886, -118855, -122248, -67005, 27150, -52976, -89156, -47438, 10575, -36282, -60307, 11700, 67774, 22726, 58117, 120614, 89468, 63148, 68697, -9650, 54280, 35849, -46495, -103314, -55751, 20427, 82897, 89789, 61926, 47161]
$$ [...]
##END NTUPLES=NMR SPECTRUM
##END=
