##TITLE=Analysis number 328912
Compound Code cc 11714
Book Reference lab3
Project Code adrs
Chemist Name stores
##JCAMPDX= 6.0         $$ Bruker NMR JCAMP-DX V2.0
##DATA TYPE= NMR SPECTRUM
##DATA CLASS= NTUPLES
##ORIGIN= Bruker BioSpin GmbH
##OWNER= nmr
$$ XWIN-NMR		Version 3.5
$$ Mon Jul 16 10:08:17 2007 GMT Daylight Time (UT+1h)  MAYBRIDGE\nmr@NMR_250MHZ
##.OBSERVE FREQUENCY= 250.131544655141
##.OBSERVE NUCLEUS= ^1H
##.ACQUISITION MODE= SIMULTANEOUS (DQD)
##.ACQUISITION SCHEME= undefined
##.AVERAGES= 16
##.DIGITISER RES= 18
##SPECTROMETER/DATA SYSTEM= dpx250
##.PULSE SEQUENCE= zg30
##.SOLVENT NAME= DMSO
##.SHIFT REFERENCE= (INTERNAL, DMSO, 0, 16.522)
##AUDIT TRAIL= $$ (NUMBER, WHEN, WHO, WHERE, WHAT)
$$ ##TITLE= Audit trail, XWIN-NMR		Version 3.5
$$ ##JCAMPDX= 5.01
$$ ##ORIGIN= Bruker BioSpin GmbH
$$ ##OWNER= nmr
$$ C:\u/data/dgb/nmr/ADRS/1000/pdata/1/auditp.txt
$$ ##AUDIT TRAIL=  $$ (NUMBER, WHEN, WHO, WHERE, WHAT)
(   1,<2007-07-16 10:07:55.01 +100>,<MAYBRIDGE\nmr>,<NMR_250MHZ>,
      <created by zg, POWCHK disabled, PULCHK disabled
       configuration hash MD5:
       76 6E 9A 78 1E 09 19 81 EC 84 63 8F B0 6A 59 2D
       data hash MD5: 64K
       7F B0 11 FD 8C 98 36 18 43 65 ED 61 E8 4B 5A 0F>)
(   2,<2007-07-16 10:08:07.12 +100>,<MAYBRIDGE\nmr>,<NMR_250MHZ>,
      <Start of raw data processing
       ef LB = 0.3 FT_mod = 6 PKNL = 1 SI = 32K 
       data hash MD5: 32K
       F2 21 AB 93 EE 83 DF 36 4B AC B1 76 39 EF 1D 92>)
(   3,<2007-07-16 10:08:08.83 +100>,<MAYBRIDGE\nmr>,<NMR_250MHZ>,
      <apk 
       data hash MD5: 32K
       B7 3A 77 74 E5 FB 6A 8A 13 21 4D 94 37 48 7B 4B>)
(   4,<2007-07-16 10:08:09.67 +100>,<MAYBRIDGE\nmr>,<NMR_250MHZ>,
      <abs ABSG = 5 
       data hash MD5: 32K
       EE EF E4 A8 56 ED 9B 7A 20 03 0F B6 2D 51 E0 18>)
$$ ##END=
$$ 
$$ hash MD5
$$ 5D 5E 01 B0 70 22 E8 FF 92 11 77 B6 81 2E 77 93
##$RELAX= 
##$RELAX= 
##$RELAX= 
##$RELAX= 
##$RELAX= 
##$RELAX= 
##$RELAX= 
$$ Bruker specific parameters
$$ --------------------------
##$DU= <C:\u>
##$EXPNO= 1000
##$NAME= <ADRS>
##$PROCNO= 1
##$TYPE= <nmr>
##$USER= <dgb>
##$AMP= (0..31)
100 100 100 100 100 100 100 100 100 100 100 100 100 100 100 100 100 100 
100 100 100 100 100 100 100 100 100 100 100 100 100 100 
##$AQSEQ= 0
##$AQ_mod= 3
##$AUNM= <au_zg>
##$AUTOPOS= <8 >
##$BF1= 250.13
##$BF2= 250.13
##$BF3= 250.13
##$BF4= 250.13
##$BF5= 500.13
##$BF6= 500.13
##$BF7= 500.13
##$BF8= 500.13
##$BYTORDA= 1
##$CFDGTYP= 0
##$CFRGTYP= 5
##$CHEMSTR= <none>
##$CNST= (0..31)
1 1 145 1 1 1 1 1 1 1 1 1 1 1 1 1 1 1 1 1 1 1 1 1 1 1 1 1 1 1 1 1 
##$CPDPRG= <>
##$CPDPRG1= <>
##$CPDPRG2= <>
##$CPDPRG3= <>
##$CPDPRG4= <mlev>
##$CPDPRG5= <mlev>
##$CPDPRG6= <mlev>
##$CPDPRG7= <mlev>
##$CPDPRG8= <mlev>
##$CPDPRGB= <>
##$CPDPRGT= <>
##$D= (0..31)
0 1 0 0 0 0 0 0 0 0.06 0 0 0 0 0 0 0.0002 0 0 0 0 0 0 0 0 0 0 0 0 0 0 
0 
##$DATE= 1184576874
##$DBL= (0..7)
120 120 120 120 120 120 120 120 
##$DBP= (0..7)
150 150 150 150 150 150 150 150 
##$DBP07= 0
##$DBPNAM0= <>
##$DBPNAM1= <>
$$ [...]
##$SUBNAM7= <"">
##$SUBNAM8= <"">
##$SUBNAM9= <"">
##$SW= 20.6930455092707
##$SWIBOX= (0..15)
0 0 3 0 0 0 0 0 0 0 0 0 0 0 0 0 
##$SW_h= 5175.983436853
##$TD= 65536
##$TD0= 1
##$TE= 297.16
##$TE2= 300
##$TE3= 300
##$TEG= 300
##$TL= (0..7)
0 120 120 120 120 120 120 120 
##$TP= (0..7)
150 150 150 150 150 150 150 150 
##$TP07= 0
##$TPNAME0= <>
##$TPNAME1= <>
##$TPNAME2= <>
##$TPNAME3= <>
##$TPNAME4= <>
##$TPNAME5= <>
##$TPNAME6= <>
##$TPNAME7= <>
##$TPOAL= (0..7)
0.5 0.5 0.5 0.5 0.5 0.5 0.5 0.5 
##$TPOFFS= (0..7)
0 0 0 0 0 0 0 0 
##$TUNHIN= 0
##$TUNHOUT= 0
##$TUNXOUT= 0
##$USERA1= <user>
##$USERA2= <user>
##$USERA3= <user>
##$USERA4= <user>
##$USERA5= <user>
##$V9= 5
##$VALIST= <valist>
##$VCLIST= <CCCCCCCCCCCCCCC>
##$VD= 0
##$VDLIST= <DDDDDDDDDDDDDDD>
##$VPLIST= <PPPPPPPPPPPPPPP>
##$VTLIST= <TTTTTTTTTTTTTTT>
##$WBST= 1024
##$WBSW= 4
##$XGAIN= (0..3)
0 0 0 0 
##$XL= 0
##$YL= 0
##$YMAX_a= 347859
##$YMIN_a= -378865
##$ZGOPTNS= <>
##$ZL1= 120
##$ZL2= 120
##$ZL3= 120
##$ZL4= 120
##$ABSF1= 16.522
##$ABSF2= -4.171173
##$ABSG= 5
##$ABSL= 3
##$ALPHA= 0
##$AQORDER= 0
##$ASSFAC= 0
##$ASSFACI= 0
##$ASSFACX= 0
##$ASSWID= 0
##$AUNMP= <proc_1d>
##$AZFE= 0.1
##$AZFW= 0.1
##$BCFW= 0
##$BC_mod= 0
##$BYTORDP= 0
##$COROFFS= 0
##$CY= 12.5
##$DATMOD= 1
##$DC= 0
##$DFILT= <>
##$DTYPP= 0
##$F1P= 14.0000005364418
##$F2P= -0.99999901652339
##$FCOR= 0.5
##$FTSIZE= 32768
##$FT_mod= 6
##$GAMMA= 0
##$GB= 0
##$INTBC= 1
##$INTSCL= 1
##$ISEN= 128
##$LB= 0.3
##$LEV0= 0
##$LPBIN= 0
##$MAXI= 10000
##$MC2= 0
##$MEAN= 0
##$ME_mod= 0
##$MI= 0
##$NCOEF= 0
##$NC_proc= -4
##$NLEV= 6
##$NOISF1= 0
##$NOISF2= 0
##$NSP= 0
##$NTH_PI= 0
##$NZP= 0
##$OFFSET= 16.522
##$PC= 1
##$PHC0= -63.15153
##$PHC1= 8.059979
##$PH_mod= 1
##$PKNL= yes
##$PPARMOD= 0
##$PSCAL= 4
##$PSIGN= 0
##$REVERSE= no
##$SF= 250.13
##$SI= 32768
##$SIGF1= 0
##$SIGF2= 0
##$SINO= 400
##$SIOLD= 32768
##$SREGLST= <1H.DMSO>
##$SSB= 0
##$STSI= 32768
##$STSR= 0
##$SW_p= 5175.98343685301
##$SYMM= 0
##$S_DEV= 0
##$TDeff= 65536
##$TDoff= 0
##$TI= <Analysis number 999999
Compound Code 99
Book Reference 9
Project Code 9>
##$TILT= no
##$TM1= 0
##$TM2= 0
##$TOPLEV= 0
##$USERP1= <user>
##$USERP2= <user>
##$USERP3= <user>
##$USERP4= <user>
##$USERP5= <user>
##$WDW= 1
##$XDIM= 32768
##$YMAX_p= 548885669
##$YMIN_p= -132993
$$ End of Bruker specific parameters
$$ ---------------------------------
##NTUPLES= NMR SPECTRUM
##VAR_NAME=  FREQUENCY,     SPECTRUM/REAL,   SPECTRUM/IMAG
##SYMBOL=    X,             R,               I
##VAR_TYPE=  INDEPENDENT,   DEPENDENT,       DEPENDENT
##VAR_FORM=  AFFN,          ASDF,            ASDF
##VAR_DIM=   32768,         32768,           32768
##UNITS=     HZ,            ARBITRARY UNITS, ARBITRARY UNITS
##FACTOR=    0.157963299565203, 1,           1
##FIRST=     4132.6476996994, 0,             0
##LAST=      -1043.33573715361, 0,           0
##MIN=       -1043.33573715361, -132993,     0
##MAX=       4132.6476996994, 548885669,     0
$$ Real data points
##PAGE= N=1
##DATA TABLE= (X++(R..R)), XYDATA
$$ [...]
16362H86004N2113k643j2853K8004K4711L9284Q730k034J0309K8753K3596j6187
$$ 886004 938117 935474 922621 950625 975336 1014620 1023350 1021316 1031625 1060378 1083974 1067787
16350A067787L793L8034j4487j029L3384J2863K1897O0472N4128K7056L2346L2039
$$ 1067787 1071580 1109614 1095127 1094098 1127482 1140345 1162242 1222714 1276842 1303898 1336244 1368283
16338A368283J0937r321K2494M6123Q2325o035k2604N9209J3370K0582L7342O7207
$$ 1368283 1379220 1369899 1392393 1438516 1520841 1514806 1492202 1551411 1564781 1585363 1622705 1689912
16326A689912L2126M2546P1268O6092N7754N8897J871L4639O9617M9869N4240
$$ 1689912 1722038 1764584 1835852 1901944 1959698 2018595 2020466 2055105 2124722 2174591 2228831
16315B228831M8196K5371N0366P3650O7474O5820R5128Q6204Q3233O3079P2218
$$ 2228831 2277027 2302398 2352764 2426414 2493888 2559708 2654836 2741040 2824273 2887352 2959570
16304B959570O8399P0185J02047Q1588J24154J16977J03149R1393J08451J08908
$$ 2959570 3027969 3098154 3200201 3281789 3405943 3522920 3626069 3717462 3825913 3934821
16294C934821J37489J25350J51039J73246J32800J74207J80265J99155J75829
$$ 3934821 4072310 4197660 4348699 4521945 4654745 4828952 5009217 5208372 5384201
16285E384201K02777K11844K01897K79637L04003K66546L18810L01132L19979
$$ 5384201 5586978 5798822 6000719 6280356 6584359 6850905 7169715 7470847 7790826
16276G790826L63302M17592M60050M66075N03126N35009N61040O03478O95607
$$ 7790826 8154128 8571720 9031770 9497845 10000971 10535980 11097020 11700498 12396105
16267A2396105O98729P17006Q02188R38993R99554J073756J193005J279474J366822
$$ 12396105 13094834 13811840 14614028 15553021 16552575 17626331 18819336 20098810 21465632
16258B1465632J476925J620940J728789J916298K064108K242650K414472K649495
$$ 21465632 22942557 24563497 26292286 28208584 30272692 32515342 34929814 37579309
16250C7579309K828922K986946L155424L284511L367523L412327L341180L136078
$$ 37579309 40408231 43395177 46550601 49835112 53202635 56614962 59956142 63092220
16242F3092220K807668K404732J887112J251713O18866j45659q40721j514324
$$ 63092220 65899888 68304620 70191732 71443445 72062311 71916652 71075931 69561607
16234F9561607k085497k495538k880480l068813l196109l247194l192606l059339
$$ 69561607 67476110 64980572 62100092 59031279 55835170 52587976 49395370 46336031
16226D6336031k887166k765385k577336k385260k202502k023042j835335j738790
$$ 46336031 43448865 40683480 38106144 35720884 33518382 31495340 29660005 27921215
16218B7921215j648395j538379j424345j356071j302363j172931j107942j090909
$$ 27921215 26272820 24734441 23310096 21954025 20651662 19478731 18370789 17279880
16210A7279880r83312q88924q98877q44039p35475o93586o80956o41249n56775
$$ 17279880 16296568 15407644 14508767 13664728 12929253 12235667 11554711 10913462 10356687
16201A0356687n02775m94842m68757m78778m00694l39647l37046l15119l17815
$$ 10356687 9853912 9359070 8890313 8411535 8010841 7671194 7334148 7019029 6701214
16192F701214k79991k44208k39243k31539k42116k13228j94946j79951j88058
$$ 6701214 6421223 6177015 5937772 5706233 5464117 5250889 5055943 4875992 4687934
16183D687934j47864j67797j79531j55691j61237r7322j02653j55768j27442p5663
$$ 4687934 4540070 4372273 4192742 4037051 3875814 3778492 3675839 3520071 3392629 3316966
16173C316966r8820q6214j17622j13569o8465o6364q8293q3326n5048j9773o3656
$$ 3316966 3218146 3131932 3014310 2900741 2832276 2765912 2677619 2594293 2539245 2519472 2455816
16162B455816n8743r8184o6651p3355l2801r3641p0723l7389j9039n0929m2560
$$ 2455816 2397073 2298889 2232238 2158883 2126082 2032441 1961718 1924329 1905290 1854361 1811801
16151A811801k7650k5413k4950r243l6727j03285p179K4799m0612r0246l7611
$$ 1811801 1784151 1758738 1733788 1724545 1687818 1584533 1577354 1602153 1561541 1471295 1433684
16140A433684m1144p0012l2078q067L5908j7740k5589k8110n1348k4892r565j9896
$$ 1433684 1392540 1322528 1290450 1282383 1318291 1300551 1274962 1246852 1195504 1170612 1161047 1141151
16128A141151J5515p15k618j9957n2065m2554k7611k248j0843L5286J084m2331
$$ 1141151 1156666 1155951 1153333 1133376 1081311 1038757 1011146 1008898 998055 1033341 1034425 992094
16116I92094k144k189k3517n998k468l7197K2286l555k6193j7032j9037l1807
$$ 992094 989950 987761 964244 958246 955778 918581 940867 937312 911119 894087 875050 843243
16104H43243k2988J2125j5483o2929k3793N37L404k9697l5423J1591p371m8885
$$ 843243 820255 832380 816897 753968 730175 730712 734116 704419 668996 680587 673216 624331
16092F24331l5098J784k109k2733O370j862j4967M4032q114n2383k1942n17L3488
$$ 624331 589233 591017 588908 566175 572545 570683 555716 599748 591634 539251 517309 516792 550280
16079E50280J1280l1991k0618J7939q552k2941N6348J8225j3029n0779o6547k4980
$$ 550280 561560 529569 508951 526890 518338 495397 551745 569970 556941 506162 439615 414635
16067D14635j8418Q681K1912J1888P179J9375k0048m0797j0019m667l0727K5607
$$ 414635 396217 404898 426810 438698 445877 465252 445204 404407 394388 389721 358994 384601
16055C84601L1800L211m6335m1406j9876K9143J7574j5908n911k0729j3164j2814
$$ 384601 416401 419612 373277 331871 311995 341138 358712 342804 336893 316164 303000 290186
16043B90186L1668o596J250L2723L4865j2445J3658j0274k9811k2442l48k3122
$$ 290186 321854 315258 316508 349231 384096 371651 385309 375035 345224 322782 322434 299312
16031B99312m50m964k5737j6499M9461K4078K814Q027O690j650m1413m6591J0108
$$ 299312 298862 293898 268161 251662 301123 325201 328015 336042 342732 341082 299669 253078 263186
16018B63186L8192J0265n0807j9197M0017J355Q243j1009n575l8563j5824p527
$$ 263186 301378 311643 260836 241639 281656 283011 291254 280245 274670 236107 220283 212756
16006B12756J5072l157L7774n808k0417j4250O503j775O790L2190o277k0744l58
$$ 212756 227828 224671 262445 256637 236220 221970 228473 226698 233488 265678 259401 238657 238299
15993B38299m0036j2381J5647m458j2793J2015J0170K8868J971J8531j7470Q548
$$ 238299 198263 185882 201529 197071 184278 196293 206463 235331 237302 255833 238363 246911
15981B46911q074j0293j6878R938P916l9505j2713K8223K7491n416N049K5993
$$ 246911 238837 228544 211666 221604 229520 190015 177302 205525 233016 227600 232649 258642
15969B58642L0260P4427P4282Q3455P6679M8520L3142m5456p8512n6569q1065
$$ 258642 288902 363329 437611 521066 597745 646265 679407 633951 555439 498870 417805
15958D17805n9931k862m4500l1649l2966j8635J3035J4024j7668m7049l8494o642
$$ 417805 357874 355012 310512 278863 245897 227262 240297 254321 236653 189604 151110 144468
15946A44468K699n15L308L0874j5329k6701j9987N053J1980J9407M2724M6722
$$ 144468 147167 146652 149960 180834 165505 138804 118817 123870 135850 155257 197981 244703
15934B44703J56k2611m0088p0315k3061k7208r9K9049j1326N856J5063K8236n68
$$ 244703 244859 222248 182160 111845 88784 61576 61477 90526 79200 85056 100119 128355 127787
15921A27787j0106J132k3632k5505P574L3484j9979o603K2366j5060j7647L3880
$$ 127787 117681 118813 95181 69676 77250 110734 90755 84152 106518 91458 73811 107691
15909A07691K1104l4500k8610N561M4938L0662K7655P874J0188p222k6456n5379
$$ 107691 128795 94295 65685 71246 116184 146846 174501 182375 192563 185341 158885 103506
15897A03506k9037R49K6021q827L0373M0321o237j5363l1206J4639o103M751k837
$$ 103506 74469 75418 101439 92612 122985 163306 157069 141706 110500 125139 119036 123787 120950
15884A20950l6703q523j484r040k2519L4838N5766K8795l3417J6620p886m0335
$$ 120950 84247 75724 74240 65200 42681 77519 133285 162080 128663 145283 137397 97062
15872I7062k9817K224r411j3700j0832L5800J2718o481j9516n049o685M858j4422
$$ 97062 67245 69469 60058 46358 35526 71326 84044 77563 58047 52998 46313 51171 36749
15859C6749L1067P685K4457M5299k4500J7827K8766m0916o2408l0133l935L002
$$ 36749 67816 75501 99958 145257 120757 138584 167350 126434 64026 33893 29958 32960
15847C2960M0217L0513K8199J8092l6213l7401R953O219J5358j4831j5257q994
$$ 32960 73177 103690 131889 149981 113768 76367 86320 92539 107897 93066 77809 68815
15835F8815K4028L6181k8046K5001N246k6703j0271P273j2919J0980P645J4433
$$ 68815 92843 129024 100978 125979 131225 104522 94251 101524 88605 99585 107230 121663
15823A21663K158M313j6393q572j3232n09K633j3061J7897K3788l1965J0549p184
$$ 121663 123821 128134 111741 103169 89937 89428 92061 79000 96897 120685 88720 99269 92085
15810I2085j8723q123K9090L6210r789K655K035j7038J1534k4219j8874L4598
$$ 92085 73362 65239 94329 130539 120750 123405 125440 108402 119936 95717 76843 111441
15798A11441L1199O804n319j5634R547J5208K4606O181R653l3926j0073J6798
$$ 111441 142640 149444 144125 128491 138038 153246 177852 184033 193686 159760 149687 166485
15786A66485L3003J511l4151j183L9802r171k278Q253l6519K4163K1084j5126
$$ 166485 199488 200999 166848 165665 205467 196296 194018 202271 165752 189915 210999 195873
15774A95873L223k3536N667m69M6233j6772l4318m6660l9938P414M2994M8798
$$ 195873 199096 175560 181227 180758 226991 210219 175901 129241 89303 96717 139711 188509
15762A88509o278k8649j6902j6331j4948k8407j3561J1462J2850L2001J5801j8179
$$ 188509 182231 153582 136680 120349 105401 76994 63433 74895 87745 119746 135547 117368
15750A17368k8948k7808k6568J667K5723l6712j3719K8189J4281K1580j5064N900
$$ 117368 88420 60612 34044 35711 61434 24722 11003 39192 53473 75053 59989 65889
15738F5889P380K206o4724k6394K8152Q697P022L169K376L208J276k9661k401
$$ 65889 73269 75475 10751 -15643 12509 21206 28228 31397 33773 36981 38257 8596 6195
15725F195N9178M394j8905j3680J880j636J5229j5694L6630J8445k8876n4193
$$ 6195 65373 69767 50862 37182 39062 37426 52655 36961 73591 92036 63160 8967
15713H967O352P4690j4609m6088l9410j1897j8109j3113M7511J4391l630j9174
$$ 8967 15319 90009 75400 29312 -10098 -21995 -40104 -53217 -5706 8685 5055 -14119
15701a4119Q984M7099N9280J5489K5463M512n1593k7764O593k4548r369M286J3813
$$ -14119 -5135 41964 101244 116733 142196 146708 95115 67351 73944 49396 40027 44313 58126
15688E8126j559K2541J2885k2668n0046j9186J2799K9846l1830l0352L0194K4745
$$ 58126 56567 79108 91993 69325 19279 93 12892 42738 10908 -19444 10750 35495
15676C5495O209l6759l4507N740J6916K3454K5943q067j6062q732Q887j1454j5606
$$ 35495 41704 4945 -29562 -23822 -6906 16548 42491 34424 18362 9630 18517 7063 -8543
15663h543j285M8643j6662m821J9179J870m1576m3105L8634J9891K5029O501J7924
$$ -8543 -9828 38815 22153 17332 36511 38381 -3195 -46300 -7666 12225 37254 43755 61679
15650F1679J3469j8696p793J3703J6678K80k9704n86k628j4565L6036k2574Q982
$$ 61679 75148 56452 48659 62362 79040 79320 49616 49030 46402 31837 67873 45299 54281
15637E4281k0034n4194j4478M230Q257P022M7593l892p637J825J1362J9079l8301
$$ 54281 34247 -19947 -34425 -30195 -21938 -14916 32677 28785 21148 22973 34335 53414 15113
15624A5113k6519K0690n103j1954k2187K6880j3637m9862Q245P792O791R072N865
$$ 15113 -11406 9284 4181 -7773 -29960 -3080 -16717 -66579 -58334 -50542 -43751 -34679 -28814
15611b8814J1287M4539k3851N248J5649k8285j0084J5953k3415j1360k1648j7123
$$ -28814 -17527 27012 3161 8409 24058 -4227 -14311 1642 -21773 -33133 -54781 -71904
15599g1904r747p292K5290K8856l0214o013N8102L7890K8572l3683m0830R283
$$ -71904 -81651 -88943 -63653 -34797 -65011 -71024 -12922 24968 53540 19857 -20973 -11690
15587a1690M112l9924j0261K5355L9440J2774O550j39J1542p427j5917j4538K5792
$$ -11690 -7578 -47502 -57763 -32408 7032 19806 26356 26217 37759 30332 14415 -123 25669
15574B5669P916l583J1938m413r979q602J6493K3554L0548k7536k0736O315L6325
$$ 25669 33585 30002 41940 37527 27548 18946 35439 58993 89541 62005 41269 47584 83909
15561H3909Q324P212N6857j872m9863l9477q228l1133m569L9022k89j5682m8491
$$ 83909 92233 99445 156302 154430 104567 65090 56862 25729 21160 60182 59893 44211 -4280
15548d280m4671J7523J6457Q269J7760L6345J403k3186j9029R103L3680k3394
$$ -4280 -48951 -31428 -14971 -6702 11058 47403 48806 25620 6591 15694 49374 25980
15536B5980Q002m855n889O429j0671J950K6230j578K8971l393n6541n0564K0130
$$ 25980 33982 29127 23238 29667 18996 20946 47176 45598 74569 71176 14635 -35929 -15799
15523a5799L7616O988K6412L3077O10l7124j7826J3710K3089l9961l7838j3921
$$ -15799 21817 28805 55217 88294 88904 51780 33954 47664 70753 30792 -7046 -20967
15511b0967L2003q07J0079k6390m078r570J5033J7327r482l5751L5270j1749j065
$$ -20967 11036 10229 20308 -6082 -10160 -19730 -4697 12630 3148 -32603 2667 -9082 -10147
15498a0147O15l6878K501K3581R56j0837m734k0490M509o741L4764M0861J0057
$$ -10147 -9532 -46410 -43909 -20328 -19372 -30209 -34943 -55433 -50924 -57665 -22901 17960 28017
15485B8017n625j4748k8012J1716P06k2806K8856O253l0751m4756L1676K753l922
$$ 28017 22392 7644 -20368 -8652 -7946 -30752 -1896 4357 -26394 -71150 -39474 -36721 -40643
15472d0643M8103j7027m1481k1147J2463N0361K8705j245k8930k8209j6571K0189
$$ -40643 7460 -9567 -51048 -72195 -59732 -9371 19334 18089 -10841 -39050 -55621 -35432
15460c5432J1238j541l613j388j137J8458L1695J0306k3408k9882l0534N0758
$$ -35432 -24194 -25735 -29348 -30736 -31873 -13415 18280 28586 5178 -24704 -55238 -4480
15448d480r294j1868K2966K4767j4338k4900q815k1623r645L379O401K1038Q726
$$ -4480 -13774 -25642 -2676 22091 7753 -17147 -25962 -47585 -57230 -53851 -47450 -26412 -17686
15435a7686k4440J2489J6329L8173O740j7399k659L6936O422l2544j8017j0337
$$ -17686 -42126 -29637 -13308 24865 31605 14206 11547 48483 54905 22361 4344 -5993
15423e993J1779J6504K5178J6190k2621j9977r347P326m386j5746k4932J7517
$$ -5993 5786 22290 47468 63658 41037 21060 11713 19039 14653 -1093 -26025 -8508
15411h508k5269l653J4937M8894J7323j4245M161M5383K299l0449k7414n7061
$$ -8508 -33777 -37430 -22493 26401 43724 29479 33640 79023 81322 50873 23459 -33602
15399c3602k5598N3707J3818R316Q030M613J1373j1223K2798M3115l058J1738
$$ -33602 -59200 -5493 8325 17641 25671 30284 41657 30434 53232 96347 93289 105027
15387A05027r100P98j744P187J4719k338q815k0348q751M168J1355j7347o511
$$ 105027 95927 96725 94981 102168 116887 114549 105734 85386 76635 80803 92158 74811 68300
15374F8300M360J3651J779j9173K0145m5026k9593n687J772o825k0608K1495J1210
$$ 68300 72660 86311 88090 68917 89062 44036 14443 8756 10528 3703 -16905 4590 15800
15361A5800K769J4356M006K1875K6826K3902P835K746O166l911m2125j5713P702
$$ 15800 18569 32925 36931 58806 85632 109534 117369 120115 126281 122370 80245 64532 72234
15348G2234n911j6341o095m9231k6229k383k4046J1191J6797R149l2352J8202
$$ 72234 66323 49982 43887 -5344 -31573 -33956 -58002 -46811 -30014 -20865 -53217 -35015
15336c5015M24P38K6702J7311J4293m464k3394j6684J3899k3908j2873J9809K1715
$$ -35015 -34591 -33853 -7151 10160 24453 19989 -3405 -20089 -6190 -30098 -42971 -23162 -1447
15323a447K9915j2185k4606k2048j5453L1289L815K029J645o995m841N261K9793
$$ -1447 28468 16283 -8323 -30371 -45824 -14535 -10720 -8691 -7046 -14041 -18882 -13621 16172
15310A6172M896l4822k8748J8079J053J125j0498K7827k3333l674j22O72n237
$$ 16172 21068 -13754 -42502 -24423 -23370 -22245 -32743 -4916 -28249 -31923 -32045 -31373 -36610
15297c6610l9842j4331L5353J0422j7482K3763K3532k3960n0280j3222K1176J9662
$$ -36610 -76452 -90783 -55430 -45008 -62490 -38727 -15195 -39155 -89435 -102657 -81481 -61819
15285f1819L5796J8720J0841J8402l5975j0487O297p281L2243q915o660j4442
$$ -61819 -26023 -7303 3538 21940 -14035 -24522 -18225 -25506 6737 -2178 -8838 -23280
15273b3280p654L2994J4494k7979K3496J2730J0034n5438J870K5975P272o315
$$ -23280 -30934 2060 16554 -11425 12071 24801 34835 -20603 -18733 7242 14514 8199
15261H199o692O048O5J2576J0108m6724j1789L9725K1025k9097n46o995l7255
$$ 8199 1507 7555 7620 20196 30304 -16420 -28209 11516 32541 3444 2898 -4097 -41352
15248d1352J0021L9557r937j4333o348K3322L240p065r698k1842j1169j228n413
$$ -41352 -31331 8226 -1711 -16044 -22392 930 4170 -2895 -12593 -34435 -45604 -46832 -52245
15235e2245k0258K7058J3381k9775J9913J0505j2358J3713n60P763K2780l2422
$$ -52245 -72503 -45445 -32064 -61839 -41926 -31421 -43779 -30066 -30626 -22863 -83 -32505
15223c2505l7244k5372J0970N0135m0j515l3096j0362j8545K1085J7374J8163
$$ -32505 -69749 -95121 -84151 -34016 -34056 -35571 -68667 -79029 -97574 -76489 -59115 -40952
15211d0952K4019N981p774p591J5980j4484l9116K7164K0780J6125o998p035K736
$$ -40952 -16933 -10952 -18726 -26317 -10337 -24821 -63937 -36773 -15993 132 -6866 -13901 -11165
15198a1165L739j2884j4787j7340m2787l5393J1765M4852L2084J1998L274l0989
$$ -11165 -7426 -20310 -35097 -52437 -95224 -130617 -118852 -74000 -41916 -29918 -26644 -57633
15186e7633j3046M3598K9868l385j8047L7117L7039l7399q192m6994j7883M266
$$ -57633 -70679 -27081 2787 -598 -18645 18472 55511 18112 9920 -37074 -54957 -50691
15174e0691N038j6349M154J8725K9750o022j8986r923k6158r15J2586J7496k309
$$ -50691 -45653 -62002 -57848 -39123 -9373 -15395 -34381 -44304 -70462 -71377 -58791 -41295 -43604
15161d3604j7392J363n182L4938J1547k6038R707q081Q714J0502J5183L0123l2530
$$ -43604 -60996 -59633 -64815 -29877 -18330 -44368 -34661 -42742 -34028 -23526 -8343 21780 -10750
15148a0750k1105j0607p037K6074O1265l199M690M353j4629m5876p016J2193Q366
$$ -10750 -31855 -42462 -49499 -23425 37840 34641 39331 43684 29055 -16821 -23837 -11644 -3278
15135c278J7537k1738m7212o171j4397M7095L2062L902k4638j8976q56j3576p62
$$ -3278 14259 -7479 -54691 -60862 -75259 -28164 3898 7800 -16838 -35814 -36670 -50246 -51008
15122e1008k524N123K8083k2594k9863q898K4506J7526j9243M483K3192L3819
$$ -51008 -53532 -48409 -20326 -42920 -72783 -81681 -57175 -39649 -58892 -54409 -31217 2602
15110B602K1052L2315j3547l7391m4962n058k01l523L12J0813N245J4999M5255
$$ 2602 23654 55969 42422 5031 -39931 -44989 -45190 -48713 -48401 -37588 -32343 -17344 27911
15097B7911J9642l554k8685k7938l3163q734J1275J7584l2638J217P3043J5259
$$ 27911 47553 43999 15314 -12624 -45787 -54521 -43246 -25662 -58300 -57083 15960 31219
15085C1219k2999p822l8592l0038j9099J9918P917K0935K4187O398l334j9804
$$ 31219 8220 398 -38194 -68232 -87331 -67413 -59496 -38561 -14374 -7976 -11310 -31114
15073c1114J652L3077p386l0694l5364M201N3040N304m751j0169k9197k0420K419
$$ -31114 -29462 3615 -3771 -34465 -69829 -65628 -12588 -7284 -12035 -22204 -51401 -71821 -69402
15060f9402j1402J7184k3310j3657K7462N2532K6441j9j6879j5709k5153K5595
$$ -69402 -80804 -63620 -86930 -100587 -73125 -20593 5848 5829 -11050 -26759 -51912 -26317
15048b6317l755k5419j7925k2147J7267K1380L5090l331l7179K3522P3241k3460
$$ -26317 -30072 -55491 -73416 -95563 -78296 -56916 -21826 -25157 -62336 -38814 34427 10967
15036A0967o3724o078J2701j640K0369j924q346k686j5403j4938l2796k1233K7957
$$ 10967 -52757 -58835 -46134 -47774 -27405 -29329 -37675 -40361 -55764 -70702 -103498 -124731 -96774
15023i6774L1022N2096L789l1353j6373K040j6932l2053K0650L4777J9554j1565
$$ -96774 -65752 -13656 -9867 -41220 -57593 -55553 -72485 -104538 -83888 -49111 -29557 -41122
15011d1122j7954p440L5632N5901j2701j1911j5600k6666J8411J7194O262p896
$$ -41122 -59076 -66516 -30884 25017 12316 405 -15195 -41861 -23450 -6256 6 -7890
14999g890j005K2747P1l1603j530p171l4257N715N822k6564J7383J7103J3671
$$ -7890 -8895 13852 13923 -17680 -19210 -26381 -60638 -54923 -49101 -75665 -58282 -41179 -27508
14986b7508j3739q695j1690Q04j9383K8846J2493K9600J4825r858k9347m999J0537
$$ -27508 -41247 -49942 -61632 -60828 -80211 -51365 -38872 -9272 5553 -4305 -33652 -38651 -28114
14973b8114J2937J4328q262J6865j1416O485k794J9473J809j6759n718J0021L729
$$ -28114 -15177 -849 -9111 7754 -3662 2823 29 19502 21311 4552 -1166 8855 12584
14960A2584o4J9141K1469k1224m0240P424j960m3046r497O523k516r94J2221K1492
$$ 12584 12520 31661 53130 31906 -8334 -910 -2870 -45916 -55413 -48890 -51406 -52400 -40179 -18687
14946a8687K6283j1721K860m5607l0351L4348l00L543K6702K2855l949l9279m0061
$$ -18687 7596 -4125 -1265 -46872 -77223 -42875 -43175 -39632 -12930 9925 5976 -33303 -73364
14933g3364k4596L245m011L4329J25m390M258k7191j750J9078N3286L832j7873
$$ -73364 -97960 -94715 -98726 -64397 -64272 -68662 -64404 -91595 -93345 -74267 -20981 -17149 -35022
14920c5022k1592j200K9637J3818q420o68P938J7310J9543J7800l5907L546p968
$$ -35022 -56614 -57814 -28177 -14359 -22779 -23447 -15509 1801 21344 39144 3237 6783 -1185
14907a185k3355j3840j721m5141q679K7961O223K0991J5538m731k2771J4861N5392
$$ -1185 -24540 -38380 -40101 -85242 -93921 -65960 -59737 -38746 -23208 -27939 -50710 -35849 19543
14894A9543K0033l0574l6937n51j6471l682N087O307R132M3907l3180J3878L9804
$$ 19543 39576 9002 -27935 -28486 -44957 -48639 -43552 -37245 -28113 15794 -17386 -3508 36296
14881C6296N24j9905q5k736K2064j969k7642r460k9364m321J4694J0489j2186
$$ 36296 36820 16915 16830 14094 36158 34189 6547 -2913 -32277 -36598 -21904 -11415 -23601
14868b3601N0346L330k0718J4856l0026k9555k1008j9546j6218K2848M3713N915
$$ -23601 26745 30075 9357 24213 -5813 -35368 -56376 -75922 -92140 -69292 -25579 -19664
14856a9664J5724j1110K872K8874q201k6127P794M3102L4867P757k4237j7890
$$ -19664 -3940 -15050 -12178 16696 8495 -17632 -9838 33264 68131 75888 51651 33761
14844C3761l038j3918l515k8022k0410K3163L9437J6813M639m9234n0548l2008
$$ 33761 30723 16805 13290 -14732 -35142 -11979 27458 44271 48910 -324 -50872 -82880
14832h2880j907J9332L5979q506r336J6612P415K3163j4016r544J72L449P810
$$ -82880 -84787 -65455 -29476 -37982 -47318 -30706 -23291 -128 -14144 -23688 -23516 -20067 -12257
14819a2257j9163R71M2515J8134j5474K617j6169m732j3001O582p767k7166l228
$$ -12257 -31420 -30449 12066 30200 14726 17343 1174 -3558 -16559 -9977 -17744 -44910 -48138
14806d8138N0765k365o981k4129L081J2152O145m122q505J167l1161o22J6453
$$ -48138 2627 262 -6719 -30848 -27767 -15615 -9470 -13592 -22097 -20930 -52091 -52713 -36260
14793c6260K0229j2445O581j8243J1365j2712m3117M569K3062K8383L4146j5318
$$ -36260 -16031 -28476 -21895 -40138 -28773 -41485 -84602 -80033 -56971 -28588 5558 -9760
14781i760K2949k3207l2519K3812o79n209L212n185j1661N013k8145L1386j0482
$$ -9760 13189 -10018 -42537 -18725 -19404 -24613 -21401 -26586 -38247 -33234 -61379 -29993 -40475
14768d0475k143J4823K4340j08j6992L795J4863J7252j8237k5997j6608O327Q666
$$ -40475 -42618 -27795 -3455 -3563 -20555 -16760 -1897 15355 -2882 -28879 -45487 -39160 -30494
14755c0494q713k4517N349L3845L2168j6849j3813L467k4328j3757J1421j5018
$$ -30494 -39207 -63724 -58375 -24530 7638 -9211 -23024 -19557 -43885 -57642 -46221 -61239
14743f1239J7613j488K2316J76J438j2912k5067N148L8605p992l9806J9202j0289
$$ -61239 -43626 -45114 -22798 -22622 -21184 -34096 -59163 -54015 -15410 -23402 -63208 -44006 -54295
14730e4295j4650J3944K0028r527P956K44N305L282K4590l419k784O549n199j1572
$$ -54295 -68945 -55001 -34973 -44500 -36544 -36300 -30995 -27713 -3123 -6542 -9326 -2777 -7976 -19548
14716a9548r673K9278J695j6392k6355k4868L7179M2480j7216J794l7971l1542
$$ -19548 -29221 57 1752 -14640 -40995 -65863 -28684 13796 -3420 -1626 -39597 -71139
14704g1139n10K0535J1692l757m338J368J7119L4823J824J8914J385p261k7694
$$ -71139 -71649 -51114 -39422 -43179 -47517 -46149 -29030 5793 7617 26531 27916 20655 -7039
14691g039j329J3730k5322l4101J5872J135N918J010j539k0773j7322K0643P837
$$ -7039 -8368 5362 -19960 -54061 -38189 -37054 -31136 -30126 -31665 -52438 -69760 -49117 -41280
14678d1280J3982l3566k63J1751l419j1067l8099M8624O4250J1261j8902k4610
$$ -41280 -27298 -60864 -61127 -49376 -52795 -63862 -101961 -53337 10913 22174 3272 -21338
14666b1338j2985J469p874k7586L9393J6527k6013O795L8755j1965L262J2771
$$ -21338 -34323 -32854 -40728 -68314 -28921 -12394 -38407 -31612 7143 -4822 -1560 11211
14654A1211j921j166j2348l6354L9380K3141m8549k8020O1483K0071k4572k362
$$ 11211 9290 8124 -4224 -40578 -1198 21943 -26606 -54626 6857 26928 2356 -6
14642fj4435k141J9235k488l1624j8952j9428L1940L3351L0521K723j6093k622
$$ -6 -14441 -16582 2653 165 -31459 -50411 -69839 -37899 -4548 25973 28696 12603 9981
14629I981k220m418J631M2082p0664m4330N4263l422l0843l0920J454K4620M8524
$$ 9981 7761 3343 4974 47056 -23608 -67938 -13675 -17097 -47940 -78860 -77406 -52786 -4262
14616d262K5352N943l2088l8666J476J0222J273k4361L8123K5303m5749J6017
$$ -4262 21090 27033 -5055 -43721 -42245 -32023 -30750 -55111 -16988 8315 -37434 -21417
14604b1417J5851P120j2465j5314k832Q880k2512j3132R879l392j4664N096J9885
$$ -21417 -5566 1554 -10911 -26225 -29057 -20177 -42689 -55821 -45942 -49334 -63998 -58902 -39017
14591c9017J2122K1838K0797p352J315K0809j7906l9968k8438O151l3891K8837
$$ -39017 -26895 -5057 15740 8388 9703 30512 12606 -27362 -55800 -49649 -83540 -54703
14579e4703M5200j6724m582K2490k0495K4225j8121O344J1026M8754L123k6268
$$ -54703 -9503 -26227 -30809 -8319 -28814 -4589 -22710 -16366 -5340 43414 46537 20269
14567B0269J0574k5944j692K4257J2788j0989k4935o4005o483L5790l950J6904
$$ 20269 30843 4899 3207 27464 40252 29263 4328 -59677 -66160 -30370 -34320 -17416
14555a7416N9052m0404l1528k5726K6440O6783J3847J5704k5330k8958k0258k1783
$$ -17416 41636 1232 -30296 -56022 -29582 37201 51048 66752 41422 12464 -7794 -29577
14543b9577k4013k501j6752K5626N858n967k2893J3350j3573P32Q751M0203m268
$$ -29577 -53590 -56091 -72843 -47217 -41359 -47326 -70219 -56869 -70442 -69710 -60959 -20756 -25024
14530b5024k6780L5205J2545l9047m6513l000K7193P375k5374K1401M6484K9598
$$ -25024 -51804 -16599 -4054 -43101 -89614 -92614 -65421 -58046 -83420 -62019 -15535 14063
14518A4063j4956k2445K2925L8572M6198K910m0538n9043R99k0311j6955o964
$$ 14063 -893 -23338 -413 38159 84357 87267 46729 -12314 -11315 -31626 -48581 -55545
14506e5545R82K9309k3190K1233O2654m42m5466k2154J4586J5717J508j9891l3690
$$ -55545 -54563 -25254 -48444 -27211 35443 35001 -10465 -32619 -18033 -2316 -808 -20699 -54389
14493e4389m724J1566J0663M1437l631j1014j0397n34j0712k0883k997k4426j6157
$$ -54389 -59113 -47547 -36884 4553 922 -10092 -20489 -21023 -31735 -52618 -55615 -80041 -96198
14480i6198k4068K1230K3217L238N602N5695M602k2522K3543j7304j1283J5742
$$ -96198 -120266 -99036 -75819 -72581 -66979 -11284 -6682 -29204 -5661 -22965 -34248 -18506
14468a8506N880j1380O477M633k6594p655K7813K5231j8008n4737o178K5631K0319
$$ -18506 -12626 -24006 -17529 -12896 -39490 -47145 -19332 5899 -12109 -66846 -73024 -47393 -27074
14455b7074j344J8791O792l812J2534p442m7231r336K2341L4294J2334L3376m8119
$$ -27074 -28418 -9627 -2835 -6647 5887 -1555 -48786 -58122 -35781 -1487 10847 44223 -3896
14442c896m2349L2262J7557P396k4067k9450j9343j5213l191K1723O2278L8259
$$ -3896 -46245 -13983 3574 10970 -13097 -42547 -61890 -77103 -80294 -58571 3707 41966
14430D1966m0104k9582K6j026K4419K0699J0527k1546l3888j1891j034K5400L0077
$$ 41966 1862 -27720 -27694 -28720 -4301 16398 26925 5379 -28509 -40400 -41434 -16034 14043
14417A4043l2708k745j5366J1607L459K0954P36k0643k8662j9473L7845K4665
$$ 14043 -18665 -21410 -36776 -25169 -21710 -756 -20 -20663 -49325 -68798 -30953 -6288
14405f288n2785k3209j1850O000L7278J4310l23l590P436M7012K1960j2009l894
$$ -6288 -59073 -82282 -94132 -88132 -50854 -36544 -36867 -40457 -33021 13991 35951 23942 20048
14392B0048l3563q031n1806j6632K0957K5136K053o664R86J6151m000j5175K6856
$$ 20048 -13515 -21546 -73352 -89984 -69027 -43891 -41838 -48502 -47516 -31365 -35365 -50540 -23684
14379b3684O812j2928p847L3829l2381j3471M0477k7849J078K8434J2224p965
$$ -23684 -16872 -29800 -37647 -3818 -36199 -49670 -9193 -37042 -35964 -7530 4694 -3271
14367c271k4314j0286P382m912j4668K8118M6481j3701n0880j723R170J404L824
$$ -3271 -27585 -37871 -30489 -35401 -50069 -21951 24530 10829 -40051 -41774 -32604 -31200 -27376
14354b7376k6552l7641N558J7691o226Q621N7218K9758k0369k5684L366R110k70
$$ -27376 -53928 -91569 -86011 -68320 -74546 -65925 -8707 21051 682 -25002 -21636 -12526 -12796
14341a2796J2791K346l5438q958j2125J5332J1351M5542k314l0691k1764J2182
$$ -12796 -5 2341 -33097 -42055 -54180 -38848 -27497 18045 15731 -14960 -36724 -24542
14329b4542k3186L6963J6099r876k5276j9162J8925j0497j0068J4923Q484J4047
$$ -24542 -47728 -10765 5334 -4542 -29818 -48980 -30055 -40552 -50620 -35697 -27213 -13166
14317a3166j5809K3178K9472k443m3620k2497Q1j65k204J2989P321j9250k1619
$$ -13166 -28975 -5797 23675 21232 -22388 -44885 -44804 -44969 -47173 -34184 -26863 -46113 -67732
14304f7732O3816K5020n652J1356l8621N070K6346k4294l4305K7168K4227K5375
$$ -67732 -3916 21104 15452 26808 -11813 -6743 19603 -4691 -38996 -11828 12399 37774
14292C7774k5520o846K8719m536m3407k7422J9015l0491K3118L9273J1610l3181
$$ 37774 12254 5408 34127 29591 -13816 -41238 -22223 -52714 -29596 9677 21287 -11894
14280a1894l011K4386p394k5775R064J8346m2007k0404K9049J6031N324J0838
$$ -11894 -14905 9481 2087 -23688 -14624 3722 -38285 -58689 -29640 -13609 -8285 2553
14268B553n7049J6863k0343j3995p151J2941L3564K7453m93M8120K1307k9090
$$ 2553 -54496 -37633 -57976 -71971 -79122 -66181 -32617 -5164 -5657 42463 63770 34680
14256C4680l3981k6686J4082L1664K215P21J6406p392j3180l1487l6434P296L3628
$$ 34680 699 -25987 -11905 19759 21974 22695 39101 31709 18529 -12958 -49392 -42096 -8468
14243h468k871k3178k0657o964k5875M2094K7446n995l308n708j1869o1936J5065
$$ -8468 -11339 -34517 -55174 -62138 -88013 -45919 -18473 -24468 -27776 -33484 -45353 -107289 -92224
14230i2224K1051K2370K9515J2265K0800q927O644j1538K5796j6196J634J6837
$$ -92224 -71173 -48803 -19288 -7023 13777 4850 11494 -44 25752 9556 11190 28027
14218B8027K3171k2156j8242n879l702L7013k0505k2491l3702k2937l247R480
$$ 28027 51198 29042 10800 4921 1219 38232 17727 -4764 -38466 -61403 -64650 -55170
14206e5170J1406J2031J572J5534j1476m3408o967K4887m55K9430L6221j0972
$$ -55170 -43764 -31733 -30161 -14627 -26103 -69511 -76478 -51591 -52046 -22616 13605 2633
14194B633l1905j0496O571N572J7349k0840l0378K6308K2970L2072o121J489m823
$$ 2633 -29272 -39768 -33197 -27625 -10276 -31116 -61494 -35186 -12216 19856 13735 15224 10401
14181A0401n1909l0082L1360J5952j4630l0881m766M1708O2609R462l3076k6003
$$ 10401 -41508 -71590 -40230 -24278 -38908 -69789 -74555 -32847 29762 39224 6148 -19855
14169a9855K5103K0452J5776o467j3570j8133p027o645O662j5725N1J232J2197
$$ -19855 5248 25700 41476 35009 21439 3306 -3721 -10366 -3704 -19429 -19378 -18146 -5949
14156e949R767l505J1058l0017k3492N90o780k1078J5511J5268J1409l7128j9619
$$ -5949 3818 313 11371 -18646 -42138 -41548 -48328 -69406 -53895 -38627 -27218 -64346 -83965
14143h3965K5723M0394p776j3193P156k5418j497M485l3089J8399N7317K355j7165
$$ -83965 -58242 -17848 -25624 -38817 -31661 -57079 -58576 -54091 -87180 -68781 -11464 -9109 -26274
14130b6274J7620k0690J0155J0142J205l096L862m641o26K9897o941l0406o303
$$ -26274 -8654 -29344 -19189 -9047 -7842 -10938 -7076 -11717 -12343 17554 10613 -19793 -26096
14117b6096J7425K4654K2521k4909L533K946k3216J094M0336J3935k9980k4966
$$ -26096 -8671 15983 38504 13595 17128 20074 -3142 -2048 38288 52223 22243 -2723
14105b723N552k3484K4056K325k1797k219n83N079m4110j8435K6152K3346M2294
$$ -2723 2829 -20655 3401 5726 -16071 -18290 -18873 -13794 -57904 -76339 -50187 -26841 15453
14092A5453J6077j3581O091j4971m3571k7144N342J7908J0180p222J5776K3891
$$ 15453 31530 17949 24040 9069 -34502 -61646 -56304 -38396 -28216 -35438 -19662 4229
14080D229j850m375r837r157k9409q667J9229K36N8666K4036P131k0559P812l0792
$$ 4229 2379 -1996 -11833 -20990 -50399 -59066 -39837 -39601 19065 43101 50232 29673 37485 6693
14066F693m6778m2489M109N8659K6035l497o209o369J7782J6141k4493l0902N398
$$ 6693 -40085 -82574 -78465 -19806 6229 2732 -3477 -9846 7936 24077 -416 -31318 -25920
14053b5920N9981k0360j5102J4955j7754l948j3223L506J102M777J8566n613j7787
$$ -25920 34061 13701 -1401 13554 -4200 -8148 -21371 -17865 -16763 -11986 6580 967 -16820
14040a6820k2323J9637q415J7626j8511k7127J6874J2712r580L407K3955k3978
$$ -16820 -39143 -19506 -27921 -10295 -28806 -55933 -39059 -26347 -35927 -32520 -8565 -32543
14028c2543l918j0117K9728J1624j1308K2359r502J663K0222k3913n231l5087
$$ -32543 -36461 -46578 -16850 -5226 -16534 5825 -3677 -2014 18208 -5705 -10936 -46023
14016d6023j4662J9653J1095J4166M23J9274M639m6485k1360L4320M9822l346
$$ -46023 -60685 -41032 -29937 -15771 -15348 3926 8565 -37920 -59280 -24960 24862 21516
14004B1516l5139m70j0641j7622l791J1244K5121J7388p283j6593j2059r035j3613
$$ 21516 -13623 -14093 -24734 -42356 -46147 -34903 -9782 7606 323 -16270 -28329 -37364 -50977
13991e0977J4937L83J0515K0780k0563j563j0924j5340L040R301r646Q698l3846
$$ -50977 -36040 -35657 -25142 -4362 -24925 -26488 -37412 -52752 -49712 -40411 -50057 -41359 -75205
13978g5205J1226L0490J6422J2799m583k5315m89j097L6106K6716o11l5675m331
$$ -75205 -63979 -33489 -17067 -4268 -8851 -34166 -34655 -35752 354 27070 26459 -9216 -13547
13965a3547O041j9693R928k0101L1355J6306k2791O408J5995j3094k5540j6990
$$ -13547 -7506 -27199 -17271 -37372 -6017 10289 -12502 -6094 9901 -3193 -28733 -45723
13953d5723j2533k696N348N3420j0450J6480k58k0512Q395J7896K9824O7l4884
$$ -45723 -58256 -60952 -55604 -2184 -12634 3846 3588 -16924 -8529 9367 39191 39258 4374
13940D374k689J0606N332j6863k8757l283m104O944k4325N722N1410M0973K097
$$ 4374 1685 12291 17623 760 -27997 -31280 -35384 -28440 -52765 -47043 4367 45340 47437
13927D7437k4246m2447q321K4925r906J5858J0791j7062m1508k3414L377R143
$$ 47437 23191 -19256 -27577 -2652 -12558 3300 14091 -2971 -44479 -67893 -64516 -55373
13915e5373K3570K4526j3887j0943R458n786p321k5820q571K1715m308J0553M2576
$$ -55373 -31803 -7277 -21164 -32107 -22649 -28435 -35756 -61576 -70147 -48432 -52740 -42187 389
13902C89j1972n395k4541J9807k603m478L3508N896r07R390j574J0155l6949j2125
$$ 389 -11583 -16978 -41519 -21712 -24315 -28793 4715 10611 9704 19094 17520 27675 -9274 -21399
13888b1399l957k0882N1214K1398j1515k7509j3151Q259Q558O521J2665K3975
$$ -21399 -25356 -46238 4976 26374 14859 -12650 -25801 -17542 -8984 -2463 10202 34177
13876C4177K902J5356q214l3214l0306J4909p64J9035O902l7171l9629J8744j8911
$$ 34177 37079 52435 44221 11007 -19299 -4390 -5154 13881 20783 -16388 -56017 -37273 -56184
13863e6184J9031J6610O034J1107j5729k1436K865L6774K8991j9486k4082K0304
$$ -56184 -37153 -20543 -14509 -3402 -19131 -40567 -37702 -928 28063 8577 -15505 4799
13851D799j5702l8483m508P2119M8967j9194k8055k1725j7228J3352j1132k7183
$$ 4799 -10903 -49386 -53894 18225 67192 47998 19943 -1782 -19010 -5658 -16790 -43973
13839d3973l0626p894M880L0899L5481J144j3313K0776j6341n4048l2692k7286
$$ -43973 -74599 -82493 -77613 -46714 -11233 -10089 -23402 -2626 -18967 -73015 -105707 -132993
13827a32993R959K6003K8008K2178K9744j478K4711J1413k4603j3022K94k3462
$$ -132993 -123034 -97031 -69023 -46845 -17101 -18579 6132 17545 -7058 -20080 -19786 -43248
13815d3248k2729j7809k739M0223L1166Q706j9132l4404k2462J3919L3568K6949
$$ -43248 -65977 -83786 -86525 -46302 -15136 -6430 -25562 -59966 -82428 -68509 -34941 -7992
13803g992l1856j983P764j1267Q523J3597K9400k958l2745M0784N753k554o782
$$ -7992 -39848 -41831 -34067 -45334 -36811 -23214 6186 3228 -29517 11267 17020 14466 7684
13790G684q070n730J9957P04l9575p523j277j6164j254q292N071L0666M8056j249
$$ 7684 -386 -6116 13841 14545 -25030 -32553 -33830 -49994 -51248 -59540 -54469 -23803 24253 23004
13776B3004o6240j2243J6427R528j3597K0205J3410j5978k0899J8581k3921R677
$$ 23004 -43236 -55479 -39052 -29524 -43121 -22916 -9506 -25484 -46383 -27802 -51723 -42046
13764d2046L114J2589K9391M677J3436l2436k7882j2954R849K9698K851l543j0866
$$ -42046 -38932 -26343 3048 7725 21161 -11275 -39157 -52111 -42262 -12564 -9713 -13256 -24122
13751b4122L3437L3128p740k5904J0042K930J1578k8528k9537r222M9027J5241
$$ -24122 9315 42443 34703 8799 18841 21771 33349 4821 -24716 -33938 15089 30330
13739C0330k8432L599Q599P994m375R459j6201n31K5942l842J1751L209m7526
$$ 30330 1898 5497 14096 22090 17715 27174 10973 10442 36384 32542 44293 47502 -24
13726b4k9880j3669l7915L7740L3300j1177L325l138J6492P260j6057k770K683
$$ -24 -29904 -43573 -81488 -43748 -10448 -21625 -18300 -21438 -4946 2314 -13743 -16513 -13830
13713a3830q629j8261r34L3696J3634n287m390j6564j375k753k0510q986J278
$$ -13830 -22459 -40720 -41654 -7958 5676 389 -4001 -20565 -21940 -24693 -45203 -54189 -52911
13700e2911q693o848l2378o849L8968J5529j21K4762J9513J4242L8687j6132J3022
$$ -52911 -61604 -68452 -100830 -107679 -68711 -53182 -53303 -28541 -9028 5214 43901 27769 40791
13687D0791J9397k0625n7100r038Q711O946n866k9870j5283L0137J428q679R361
$$ 40791 60188 39563 -17537 -26575 -17864 -10918 -16784 -46654 -61937 -31800 -30372 -39051 -29690
13674b9690k740J3195j0646k2112K5957O0344k971j3702j8890j7836Q285p652
$$ -29690 -32430 -19235 -29881 -51993 -26036 34308 31337 17635 -1255 -19091 -10806 -18458
13662a8458j9830L1064J4328P86K9396J200n4968m8187N587N070p336k0314j6720
$$ -18458 -38288 -7224 7104 7890 37286 38486 -16482 -64669 -59082 -54012 -61348 -81662 -98382
13649i8382l335K4241L6123J3296j2283K1938O76j8033N394M5483j4633j0513
$$ -98382 -101717 -77476 -41353 -28057 -40340 -18402 -17726 -35759 -30365 15118 485 -10028
13637a0028K1631l120j2287m553n0260J1889N2095m277p445k3693l645N785Q430
$$ -10028 11603 8483 -3804 -8357 -58617 -46728 5367 1090 -6355 -30048 -33693 -27908 -19478
13624a9478P881m0930j6503K8528J5577L4976J3887l026l732j8821k2053J2779
$$ -19478 -11597 -52527 -69030 -40502 -24925 10051 23938 20912 17180 -1641 -23694 -10915
13612a0915K856J9064L0208K2835p523n3219n9113J9256K1608M5242j9730k0929
$$ -10915 -8059 11005 41213 64048 56525 3306 -55807 -36551 -14943 30299 10569 -10360
13600a0360J7216R247K6635K0890k3416k350j6705k9190J5630Q007Q483k8679
$$ -10360 6856 16103 42738 63628 40212 37862 21157 -8033 7597 15604 24087 -4592
13588d592J57k7220l1256L434K5717j6951M497L2192k2078j5016J8709j4618L355
$$ -4592 -4435 -31655 -62911 -59477 -33760 -50711 -46214 -14022 -36100 -51116 -32407 -47025 -43670
13575d3670J4697n13J5029L0476m8202j8255L2101J3765n1813K9158K5815k3378
$$ -43670 -28973 -29486 -14457 16019 -32183 -50438 -18337 -4572 -56385 -27227 -1412 -24790
13563b4790J7770M0008N953O472o762j5659R562M181j8290j6641j1735k9165K525
$$ -24790 -7020 32988 38941 45413 38651 22992 32554 36735 18445 1804 -9931 -39096 -36571
13550c6571K6942L1445k658l8876J3697J9590j8435j5961l5075M315P42j8350
$$ -36571 -9629 21816 19158 -19718 -6021 13569 -4866 -20827 -55902 -51587 -50845 -69195
13538f9195L5907N5630j4582j9727r04N423L478l8553K8151K0052m1239k7944
$$ -69195 -33288 22342 7760 -11967 -12871 -7448 -3970 -42523 -14372 5680 -35559 -63503
13526f3503L0239l492j6433O272n452L8506M4681k0631j5001j2175L0428R266
$$ -63503 -33264 -36756 -53189 -46917 -52369 -13863 30818 10187 -4814 -16989 13439 22705
13514B2705l0885l6245J0557O1613M2164m9588o5185J9501M6297N7319P336k5656
$$ 22705 -8180 -44425 -33868 27745 69909 20321 -44864 -25363 20934 78253 85589 59933
13502E9933j9476k6034K145K043n550K2964k2834k9521l1658l0869J9426K2522
$$ 59933 40457 14423 16568 18611 13061 36025 13191 -16330 -47988 -78857 -59431 -36909
13490c6909K2520N380k9818l4792K1061L6075o107j0479J1925j3754l2680L411
$$ -36909 -14389 -9009 -38827 -73619 -52558 -16483 -22590 -33069 -21144 -34898 -67578 -64167
13478f4167N919M3626J8180k674j8714j4624J0472L0901p06m0174M950P992j4127
$$ -64167 -58248 -14622 3558 884 -17830 -32454 -21982 8919 8213 -31961 -27011 -19019 -33146
13465c3146N009M9228m800n0938l344J4671m455O574J4446O686q265k6825Q075
$$ -33146 -28137 21091 16291 -34647 -37991 -23320 -27775 -21201 -6755 -69 -8334 -35159 -27084
13452b7084J2711M423k583j2902M926k288K4271P424l0901k1185J4040P766Q612
$$ -27084 -14373 -9950 -12533 -25435 -20509 -22797 1474 8898 -22003 -43188 -29148 -21382 -12770
13439a2770O628K5283J3931k6811k6114K580k3346k0306O278K5935j3951J9344
$$ -12770 -6142 19141 33072 6261 -19853 -17273 -40619 -60925 -54647 -28712 -42663 -23319
13427b3319K1805j2826l629n428l6342n3937K0319p432k2L149j1664K6602N0591
$$ -23319 -1514 -14340 -17969 -23397 -59739 -113676 -93357 -100789 -100811 -97662 -109326 -82724 -32133
13414c2133K2653j1234j290N115K2179j3867k5109j530J960m021j6436M299L4748
$$ -32133 -9480 -20714 -22004 -16889 5290 -8577 -33686 -35216 -33256 -37277 -53713 -49414 -14666
13401a4666J182J5380P829K6951k1026j2404j5867k9872j4504k7701K2177p7j8388
$$ -14666 -13484 1896 9725 36676 15650 3246 -12621 -42493 -56997 -84698 -62521 -62598 -80986
13388h0986m476K0704L5312o36K7523m7954l6780L0335M196p447j5882K0214q304
$$ -80986 -85462 -64758 -29446 -30082 -2559 -50513 -87293 -56958 -52762 -60209 -76091 -55877 -64181
13375f4181k793L2583k0880l2328L3828O8862j7291j3974K2094k599L5444P353
$$ -64181 -66974 -34391 -55271 -87599 -53771 15091 -2200 -16174 5920 3321 38765 46118
13363D6118k4847L472r496l2190O451j8378l8238l7001M7015L05M0483O6548J9457
$$ 46118 21271 24743 15247 -16943 -10492 -28870 -67108 -104109 -57094 -56789 -16306 50242 69699
13350F9699m1544K152k6163k040O840L0191r546n1087k0248M0673k200j4367O650
$$ 69699 28155 30307 4144 2104 8944 39135 29589 -21498 -41746 -1073 -3273 -17640 -10990
13337a0990m1789o728J1852J6989J8536j3859J998j9858K2579l822M328L5123
$$ -10990 -52779 -59507 -47655 -30666 -12130 -25989 -23991 -43849 -21270 -25092 -20764 14359
13325A4359j0157k6305J4487K2376J6998N613l4186q775K305j424O103J693L2579
$$ 14359 4202 -22103 -7616 14760 31758 37371 3185 -5590 -3285 -4709 1394 3087 35666
13312C5666k158k9679j8694R903l118q87l2128k355J7604K2704N1321k7796n0998
$$ 35666 33508 3829 -14865 -4962 -8080 -8967 -41095 -43450 -25846 -3142 48179 20383 -30615
13299c0615k5866j5614k2449l573j370J052M1709L5654K9518m6980j6082j3849
$$ -30615 -56481 -72095 -94544 -98117 -99487 -98435 -56726 -21072 8446 -38534 -54616 -68465
13287f8465O062K3271o296K1286K7889l239k8188j3585M7851K4431j0937k3286
$$ -68465 -62403 -39132 -45428 -24142 3747 508 -27680 -41265 6586 31017 20080 -3206
13275c206J6587l1473j7408K202j661j693l6030j4735j7159m890j5956J2394N2458
$$ -3206 13381 -18092 -35500 -33298 -34959 -36652 -72682 -87417 -104576 -109466 -125422 -113028 -60570
13262f0570J8836J6418L0142l1080m5851J2932K7802Q55N177K2502J7328n482
$$ -60570 -41734 -25316 4826 -26254 -72105 -59173 -31371 -30516 -25339 -2837 14491 9009
13250I009K9146K9356k1029k8950p994r531j6867j0369J5996k2653K3653J8609
$$ 9009 38155 67511 46482 17532 9538 7 -16860 -27229 -11233 -33886 -10233 8376
13238H376j5632o671K6088K7384K0928o1326m6898j3876K2312k6173n943N5190
$$ 8376 -7256 -13927 12161 39545 60473 -853 -47751 -61627 -39315 -65488 -71431 -16241
13226a6241N434k0969R754j1877K3047K0915L525n265R55n1470m2465K2567K7354
$$ -16241 -10807 -31776 -22022 -33899 -10852 10063 13588 8323 9278 -42192 -84657 -62090 -34736
13213c4736r630J1880K2996k1695j6403L5928L1654n093O120j8459J2240k1861
$$ -34736 -44366 -32486 -9490 -31185 -47588 -11660 19994 14901 21021 2562 14802 -7059
13201g059K6914m607j5167j1983M3330L5830Q667J8767j490l1626o9181l1687
$$ -7059 19855 15248 81 -11902 31428 67258 75925 94692 93202 61576 -7605 -39292
13189c9292J4214k0451M2039L4915l4439k5904J203L2293n588k0477n659l7713
$$ -39292 -25078 -45529 -3490 31425 -3014 -28918 -27715 4578 -1010 -21487 -27146 -64859
13177f4859m5448q367L7415L2542J6285j562k6382m1207J5202M8090M0663k013
$$ -64859 -110307 -118674 -81259 -48717 -32432 -33994 -60376 -101583 -86381 -38291 2372 359
13165C59j6745k5605J5652L3696K78k9225q026K0868P373k4975q852o925M777
$$ 359 -16386 -41991 -26339 7357 7635 -21590 -29616 -8748 -1375 -26350 -35202 -42127 -37350
13152c7350L3125l125q746j2270K9573L4545J9725j634l9072k1246R706J4695
$$ -37350 -4225 -7350 -16096 -28366 1207 35752 55477 53843 14771 -6475 3231 17926
13140A7926Q828K558N640m4840l0177j7518M521n598K2213K970J2018j9482l4472
$$ 17926 26754 29312 34952 -9888 -40065 -57583 -53062 -58660 -36447 -33477 -21459 -40941 -75413
13127g5413L3609L6586K252k0372l538J2305J8931k0776k5449L7003m479n6159
$$ -75413 -41804 -5218 -2966 -23338 -26876 -14571 4360 -16416 -41865 -4862 -9341 -65500
13115f5500m252N143j1638J2894J2671j0480p93M0686l8251l0039J7728M3840
$$ -65500 -69752 -64609 -76247 -63353 -50682 -61162 -61955 -21269 -59520 -89559 -71831 -27991
13103b7991K6281j045J822j2316j9247m403j2273J2366K207k0169K1716j2904
$$ -27991 -1710 -2755 -933 -13249 -32496 -36899 -49172 -36806 -34599 -54768 -33052 -45956
13091d5956n785K1325Q917J7983L3455K6077J613J0963j7438j2944k8124M404
$$ -45956 -51741 -30416 -21499 -3516 29939 56016 57629 68592 51154 38210 10086 14490
13079A4490j4252j1922J9179R054J6975n637j056k985k8323K5276K6867o295l9502
$$ 14490 238 -11684 7495 16549 33524 27887 26831 23846 -4477 20799 47666 41371 1869
13066A869J0662j1404J8278p384j8349n735J8587L5165n304n823k2687n2902k3182
$$ 1869 12531 1127 19405 12021 -6328 -12063 6524 41689 36385 30562 7875 -45027 -68209
13053f8209N610K5529j6253l5387k45N57n503K7802K0118J5720K4306J904m103
$$ -68209 -62599 -37070 -53323 -88710 -88955 -88398 -93901 -66099 -45981 -30261 -5955 -4051 -8154
13040h154j1372k318J2974j1923j3826n96J6768L8680p942k7449k082J7452M390
$$ -8154 -19526 -21844 -8870 -20793 -34619 -35215 -18447 20233 12291 -15158 -17240 212 4602
13027D602j7642K9004N9353j164l5415j1729J1912L1700K5008k0988m8061l3428
$$ 4602 -13040 15964 75317 74153 38738 27009 38921 70621 95629 74641 26580 -6848
13015f848J633J0798J3270j057K0605K890m3224k1031K9000M4928J0035k0018
$$ -6848 -5215 5583 18853 17796 38401 41291 -1933 -22964 6036 50964 60999 40981
13003D0981m3491j3493J5698j9258K6182j8607L34j4435J8667P893q476J914p332
$$ 40981 -2510 -16003 -305 -19563 6619 -11988 -11654 -26089 -7422 471 -8005 -6091 -13423
12990a3423P930j962P752k248o1483j9445O0615J5185r162J0303N1930M7527R020
$$ -13423 -5493 -7455 297 -1951 -63434 -82879 -22264 -7079 -16241 -5938 45992 93519 102539
12977A02539j3316j4934j7592l3920l8975M338K0378J188P203J8199o93j841j9658
$$ 102539 89223 74289 56697 22777 -16198 -11860 8518 9706 16909 35108 34415 32574 12916
12964A2916m7630J1564K2438K7987J5053n0941j1101n2919j6291Q049J437J9934
$$ 12916 -34714 -23150 -712 27275 42328 -8613 -19714 -72633 -88924 -80875 -79438 -59504
12952e9504j5488m186J1770J7293p547K1410K3215k6073J1513M2445J5174j8506
$$ -59504 -74992 -79178 -67408 -50115 -57662 -36252 -13037 -39110 -27597 14848 30022 11516
12940A1516p580j2816k0176P204L4346L8119k7268k2790j0564L668m3663m1432
$$ 11516 3936 -8880 -29056 -21852 12494 50613 23345 555 -10009 -6341 -50004 -91436
12928i1436J1079j3803l002L7521K6528K1787j1271k2942Q065j2717J6450L7760
$$ -91436 -80357 -94160 -97162 -59641 -33113 -11326 -22597 -45539 -37474 -50191 -33741 4019
12916D019L697k4341J1314L3500M189l4345L2372l0481r977N637J0309J7966k5811
$$ 4019 7716 -16625 -5311 28189 32378 -1967 30405 -76 -10053 -4416 5893 23859 -1952
12903a952j7215K856j0997J1628K8060K1787N287j0901l439j5286k3055L3579
$$ -1952 -19167 -16311 -27308 -15680 12380 34167 39454 28553 25114 9828 -13227 20352
12891B0352K4264m896m8269m1960N0036P0236j9147m5365l934j2650j2252K5749
$$ 20352 44616 39720 -8549 -50509 -473 69763 50616 5251 1317 -11333 -23585 2164
12879B164K6865J6495N866J1343k1679j9690j6272l3741j4330M029K4457J0803
$$ 2164 29029 45524 51390 62733 41054 21364 5092 -28649 -42979 -38950 -14493 -3690
12867c690J0320k7027j4192j2461J3166P892j3087k3438K8940M3907J2961l0J2653
$$ -3690 6630 -20397 -34589 -47050 -33884 -25992 -39079 -62517 -33577 10330 23291 23261 35914
12854C5914j1674m5675R29M2586J8493l419K222N45l0053k6472l806j5414J2071
$$ 35914 24240 -21435 -20506 22080 40573 37154 39376 39921 9868 -16604 -20410 -35824 -23753
12841b3753M7433K7072J1510l345l4406l0192N595L9146J6184l1193m6058J2010
$$ -23753 23680 50752 62262 58917 24511 -5681 -86 39060 55244 24051 -22007 -9997
12829i997M2082L717o503m3019j5445j73O3344J5174k9006j6905j0577m782k012
$$ -9997 32085 35802 29299 -13720 -29165 -29338 34006 49180 20174 3269 -7308 -12090 -14102
12816a4102R673J7216r369N301N866j74K0971K385j6858m504k0058k93K7365J28
$$ -14102 -4429 12787 3418 8719 14585 14411 35382 37767 20909 16405 -3653 -3946 23419 23547
12802B3547k1268J579j8886M138N745k0437K2011L1701K2574Q992l5337o8565
$$ 23547 2279 3858 -15028 -10890 -5145 -25582 -3571 28130 50704 59696 24359 -44206
12790d4206k5966k483j1483K7242j767M6648J6730Q297j4122Q77p764k4085m0432
$$ -44206 -70172 -72655 -84138 -56896 -58663 -12015 4715 13012 -1110 -233 -7997 -32082 -72514
12777g2514j0790K1064j652j9137M3708j99k3868k3957n19j8140L1717L4784N6490
$$ -72514 -83304 -62240 -63892 -83029 -39321 -39520 -63388 -87345 -87864 -106004 -74287 -39503 16987
12764A6987j7125m986K9939K0719n721n776m4267j0414j1787R243q564J5028L4054
$$ 16987 -138 -5124 24815 45534 39813 34037 -10230 -20644 -32431 -23188 -31752 -16724 17330
12751A7330k0588l0629r899J8644m38K0017q209j5986j2335N46M971l009m2558
$$ 17330 -3258 -33887 -43786 -25142 -25580 -5563 -13772 -29758 -42093 -41547 -36576 -39585 -82143
12738h2143L0068J1721l273j0202P792J1822K0830j0856j2931J1354o017J5498
$$ -82143 -52075 -40354 -43627 -53829 -46037 -34215 -13385 -24241 -37172 -25818 -31835 -16337
12726a6337M4078M8239L9078m3765l0523l9762J676j8823n702l5393j9490k2782
$$ -16337 27741 75980 115058 71293 40770 1008 2684 -16139 -21841 -57234 -76724 -99506
12714i9506L2611M9360L9321K1140j5908m4759N947n045L1762p458l7009J5261
$$ -99506 -66895 -17535 21786 42926 27018 -17741 -11794 -16839 14923 7465 -29544 -14283
12702a4283J2659j4584J5890j7112k0382L8986j73R788K622m2932k3710O4056
$$ -14283 -1624 -16208 -318 -17430 -37812 1174 1001 10789 13411 -29521 -53231 10825
12690A0825L2049K3029k2681k2530J356M856j9475o33j6929J0772r19q500j8947
$$ 10825 42874 65903 43222 20692 22048 26904 7429 6796 -10133 639 -280 -8780 -27727
12677b7727m7258l7824J0113N2181k1785m388L4463L7264L6171k7420l0738N544
$$ -27727 -74985 -112809 -102696 -50515 -72300 -76688 -42225 -4961 31210 3790 -26948 -21404
12665b1404j2351P921K4394k6038L42k549m1484k9935J3824M4354K1433K3359
$$ -21404 -33755 -25834 -1440 -27478 -27136 -29685 -71169 -101104 -87280 -42926 -21493 1866
12653A866K9304Q304J7174k5924m8343l0891J3502l260M524J7450J1392j4303
$$ 1866 31170 39474 56648 30724 -17619 -48510 -35008 -38268 -33744 -16294 -4902 -19205
12641a9205l0954R931L7485K5394j329j9921k7847l2879k0814o630J0724K7750
$$ -19205 -50159 -40228 -2743 22651 21322 1401 -26446 -59325 -80139 -86769 -76045 -48295
12629d8295Q126q285j6972o081L8683M2077j5567N188K79k0806J1391M4132P335
$$ -48295 -40169 -48454 -65426 -71507 -32824 9253 -6314 -1126 -847 -21653 -10262 33870 41205
12616D1205l2845l3688k190j0268K6030O461j6549m369j9604p90J1700J1925l832
$$ 41205 8360 -25328 -27518 -37786 -11756 -5295 -21844 -26213 -45817 -46607 -34907 -22982 -26814
12603b6814R487o59j8884J4873M7656o252l4738j616M1535J7333m1940m5530L8050
$$ -26814 -17327 -17986 -36870 -21997 25659 19407 -15331 -16947 24588 41921 -19 -45549 -7499
12590g499j5065l1635K5653J1365j5765M342K1773K0613r178m6920J0301R20j0258
$$ -7499 -22564 -54199 -28546 -17181 -32946 -28604 -6831 13782 4604 -42316 -32015 -31095 -41353
12577d1353k5572M7492J1841l2607J6900L666q17r79j9626L7298j2341j9864k2546
$$ -41353 -66925 -19433 -7592 -40199 -23299 -19633 -20450 -21429 -41055 -3757 -16098 -35962 -58508
12564e8508N2475P847O365M6415o213q922r450R34L0712k7594n7650K2825M3582
$$ -58508 -6033 1814 8179 54594 48381 39459 30009 30943 61655 34061 -23589 -764 42818
12551D2818l1536l5276j3986k496L757J7144K4308O793k3744n421L1384o244K1979
$$ 42818 11282 -23994 -37980 -40476 -36719 -19575 4733 11526 -12218 -17639 13745 7501 29480
12538B9480J7564M375q745M562k1967l3648m979l675m685k087J9130L783l693
$$ 29480 47044 51419 42674 47236 25269 -8379 -13358 -17033 -21718 -23805 -4675 -892 -4585
12525d585p846k417p591L728P120j6667l9084l5806l825L1241K4768J8402L0806
$$ -4585 -12431 -14848 -22439 -18711 -11591 -28258 -67342 -103148 -106973 -75732 -50964 -32562 -1756
12512a756J0443j2747j1367j583J5284l6728j2913L8826N365j8550N1578j0675
$$ -1756 8687 -4060 -15427 -17010 -1726 -38454 -51367 -12541 -7176 -25726 25852 15177
12500A5177j2419j8576J1332M366P797k4920K0886K6879J5856L29j8622k8366
$$ 15177 2758 -15818 -4486 -120 7677 -17243 3643 30522 46378 46707 28085 -281
12488b81J4668N767k7332j6431J5262J5498j5823Q385L9985K8348o561p103m5544
$$ -281 14387 20154 -7178 -23609 -8347 7151 -8672 -287 39698 68046 61485 54382 8838
12475H838k8788J2654q848o282P309K0004K5201J3858k4065k2097j6459J0015
$$ 8838 -19950 -7296 -16144 -22426 -15117 4887 30088 43946 19881 -2216 -18675 -8660
12463h660R621J1037K4510K4515J4565j1786q563J0852R821m2394m0848j462K4914
$$ -8660 961 11998 36508 61023 75588 63802 55239 66091 75912 33518 -7330 -8792 16122
12450A6122Q491L3152J5141k3957l7471n094J5295R540K65N808N5508P925l2518
$$ 16122 24613 57765 72906 48949 11478 6384 21679 31219 31484 37292 92800 100725 68207
12437F8207m7395l3236k7322j1257K3564J1770N10j6833J7790J0830j2503J802
$$ 68207 20812 -12424 -39746 -51003 -27439 -15669 -15159 -31992 -14202 -3372 -15875 -14073
12425a4073R437L032L3444k2002n652L8959L3131o177n806k4236j1507p613J476
$$ -14073 -4636 -1604 31840 9838 4186 43145 76276 70099 64293 40057 28550 20937 22413
12412B2413j834J076l4875j4617o710m595K0031l753j2484k036j8980J0511J5813
$$ 22413 20579 21655 -13220 -27837 -34547 -39142 -19111 -22864 -35348 -37384 -56364 -45853 -30040
12399c0040r635j5216J3735k4444j2268p345L8631M5222J7622J7499m7925k5668
$$ -30040 -39675 -54891 -41156 -65600 -77868 -85213 -46582 -1360 16262 33761 -14164 -39832
12387c9832J9066J6766k951j4618K2513M3783K8452l2145l3110m761j76j289K880
$$ -39832 -20766 -4000 -6951 -21569 944 44727 73179 41034 7924 3163 2987 1698 4578
12374D578j0488J2990k5990M366O968R590K702L2363K1664m811k9556j6107J7035
$$ 4578 -5910 7080 -18910 -14544 -7576 2014 4716 37079 58743 53932 24376 8269 25304
12361B5304k060r784r153L7840K6968o629j0535P397J2761K036N910J5301q831
$$ 25304 23244 13460 4307 42147 69115 62486 51951 59348 72109 74145 80055 95356 86525
12348H6525j9932j1087k9035L4850j1136K3685M1727M524n4359m8458m4423k8212
$$ 86525 66593 55506 26471 61321 50185 73870 115597 120121 65762 17304 -27119 -55331
12336e5331M3249L6274J0024O198k1919m3383m691m110j1254j4459O339L8694
$$ -55331 -12082 24192 34216 40414 18495 -24888 -29579 -33689 -44943 -59402 -53063 -14369
12324a4369M8163J6783J1155l3254l1688j4722p676L2015L9515K5433P455k2531
$$ -14369 33794 50577 61732 28478 -3210 -17932 -25608 6407 45922 71355 78810 56279
12312E6279l7663m6257L442K6672n147k3151K0947K3007J2801j1103o139k1947
$$ 56279 18616 -27641 -24199 2473 -2674 -25825 -4878 18129 30930 19827 13688 -8259
12300h259r027J0050J9075O480J6995j6384k296K2910k666K7202O699j2880k2195
$$ -8259 -17286 -7236 11839 18319 35314 18930 16634 39544 36878 64080 70779 57899 35704
12287C5704J9701n641M418j8437J1789J279L4406M253j3193j4494j874l6084L3067
$$ 35704 55405 49764 54182 35745 47534 48813 83219 87472 74279 59785 57911 21827 54894
12274E4894J1681k0489J3097j1234j8909k3473j9784j5712l2120J5618Q275L7418
$$ 54894 66575 46086 59183 47949 29040 5567 -14217 -29929 -62049 -46431 -38156 -738
12262g38k0747k1656J6158J0132K4827O4153p207K8219j6682l5510k2502k4557
$$ -738 -21485 -43141 -26983 -16851 7976 72129 64922 93141 76459 40949 18447 -6110
12250f110P383K697L497j1310L6263k5207l2207m665K6486J0189J7028k4829n7883
$$ -6110 1273 3970 7467 -3843 32420 7213 -24994 -29659 -3173 7016 24044 -785 -58668
12237e8668L758M9470K9301L9477r509k8638J1237n38k6243j3347J1103j5378
$$ -58668 -54910 -5440 23861 63338 53829 25191 36428 35890 9647 -3700 7403 -7975
12225g975J1870K0999p393Q153K0904M117j6673q675J4206O358p167K7281K7261
$$ -7975 3895 24894 17501 25654 46558 50675 34002 25327 39533 45891 38724 66005 93266
12212I3266P254m4007J2353k306L6640j5022n3917k1529J7819m854L262k3473
$$ 93266 100520 56513 68866 66560 103200 88178 34261 12732 30551 25697 28959 5486
12200E486k6595K2931N0633p785P7N037K700Q198K0941K1884l860q846J2837N067
$$ 5486 -21109 1822 52455 44670 44747 49784 52484 60682 81623 103507 99647 90801 103638 108705
12186A08705k4773l549K8628n768M5460L6257n279m743j746P507K5942n669K6267
$$ 108705 83932 80383 109011 103243 148703 184960 179681 174938 173192 180699 206641 200972 227239
12173B27239K217k2730m2656K400k1105o980L1939J385l3145N338j5950K2143
$$ 227239 229456 206726 164070 166470 145365 138385 170324 171709 138564 143902 127952 150095
12161A50095j647m5470m0695J3552K4749K262k6526j1332L2736o114l0059Q600
$$ 150095 148448 102978 62283 75835 100584 102846 76320 64988 97724 91610 61551 70151
12149G0151J2140M550P449k8541K4412L0812K275k7276p84l358j5217O936K5965
$$ 70151 82291 86841 94290 65749 90161 120973 123248 95972 95188 91830 76613 83549 109514
12136A09514L194m1646m0454K5239M5028O452p168l3502J1989L7614M1970O226
$$ 109514 112708 71062 30608 55847 100875 107327 100159 66657 78646 116260 158230 164456
12124A64456n6191j7705p614j8799J3892K0486l3274L557R064P473K2774o802
$$ 164456 108265 90560 82946 64147 78039 98525 65251 68808 77872 85345 108119 101317
12112A01317j9414K4828J2287J9030j2466R263J4829L5521l339r028j1530k1664
$$ 101317 81903 106731 119018 138048 125582 134845 149674 185195 181856 172828 161298 139634
12100A39634J7892k6121N740J4788J5881K5j6183L1908J5341r584k419J7642L7596
$$ 139634 157526 131405 137145 151933 167814 167839 151656 183564 198905 189321 186902 204544 242140
12087B42140J2093l0135k5635L7167K0248K118J9617o523l9589o798m305L2356
$$ 242140 254233 224098 198463 235630 255878 257996 277613 271090 231501 224703 220398 252754
12075B52754N824n221m0014r819k4403J1253K9526k3760L756J0634j2971j0800
$$ 252754 258578 253357 213343 203524 179121 190374 219900 196140 199896 210530 197559 186759
12063A86759J0578L7011M3192r398J929J5671J9361J4703M4276j0480j3089N8871
$$ 186759 197337 234348 277540 268142 270071 285742 305103 319806 364082 353602 340513 399384
12051C99384k4185j2741R990N4367l0371j57K3473j4189J5320o858j9884l918
$$ 399384 375199 362458 372448 426815 396444 396287 419760 405571 420891 414033 394149 390231
12039C90231k7448J0427L378J9742O94r480J1557L4890Q193k2817j1831J8708
$$ 390231 362783 373210 376588 396330 397024 387544 399101 433991 442184 419367 407536 426244
12027D26244N789j8241L2440P3476N287n0363J2915N7498J8694m483J3962p441
$$ 426244 432033 413792 446232 519708 524995 474632 487547 545045 563739 559256 573218 565777
12015E65777J3342M9j0335L9948m601K269N3340J6607m261O4949M8721m685j2875
$$ 565777 579119 579168 568833 608781 604180 606449 659789 676396 672135 737084 785805 781120 768245
12002G68245M3174L7564N9485M0618K1085K60K9838L175M1095J6404K3435K035
$$ 768245 811419 848983 908468 949086 970171 970431 1000269 1003444 1044539 1060943 1084378 1086413
11990A086413O3598L4443K5112J8584J9216O4960M2769O7352K9088P4467J32670
$$ 1086413 1150011 1184454 1209566 1228150 1247366 1312326 1355095 1422447 1451535 1526002 1658672
11979A658672O9743L3987K8375N5316R0425M6399O8316Q8286Q3016O2286J24007
$$ 1658672 1728415 1762402 1790777 1846093 1936518 1982917 2051233 2139519 2222535 2284821 2408828
11968B408828J22769J06560J50558J67981J70857K20281J61696J37383K01625
$$ 2408828 2531597 2638157 2788715 2956696 3127553 3347834 3509530 3646913 3848538
11959C848538K37941K49494K46639K82612L40484L45351L79812M05379M58358
$$ 3848538 4086479 4335973 4582612 4865224 5205708 5551059 5930871 6336250 6794608
11950F794608M78700N38209O52187P06698Q02786R27412J032294J139235J314862
$$ 6794608 7273308 7811517 8463704 9170402 9973188 10900600 11932894 13072129 14386991
11941A4386991J555696J786876K045877K375903K747902L222807L759404M314492
$$ 14386991 15942687 17729563 19775440 22151343 24899245 28122052 31881456 36195948
11933C6195948M970844N659774O246829O637287O735463O385207N337873L684100
$$ 36195948 41166792 46826566 53073395 59710682 66446145 72831352 78169225 81853325
11925H1853325J434106r86331l210608m912509n970004o411826o389667o033813
$$ 81853325 83287431 82301100 79090492 74177983 68207979 61796153 55406486 49372673
11917D9372673n537659m911889m340432l808360l306410k881205k490834k134447
$$ 49372673 43835014 38923125 34582693 30774333 27467923 24586718 22095884 19961437
11909A9961437j853363j626116j373131j220002j097888r60727q48887p23028
$$ 19961437 18108074 16481958 15108827 13888825 12790937 11830210 10981323 10258295
11901A0258295o97238o34384n34446m72957l96476m04929l61241l39007l09256
$$ 10258295 9561057 8926673 8392227 7919270 7522794 7117865 6756624 6417617 6108361
11892F108361k44081k14075k58956k56970k32840k47865k43727j86467j67781
$$ 6108361 5864280 5650205 5391249 5134279 4901439 4653574 4409847 4223380 4055599
11883D055599j57723j62351j61158j56865j77700j77234j14725j70807j35320
$$ 4055599 3897876 3735525 3574367 3417502 3239802 3062568 2947843 2777036 2641716
11874B641716r2902j30498q5998r9945q6410p4438q8029n8350r0486r5952p7743
$$ 2641716 2548814 2418316 2332318 2232373 2145963 2071525 1983496 1925146 1834660 1738708 1660965
11863A660965p4288o4841p4241o8462m9768k5068k4310q992j2169l6780m8876
$$ 1660965 1586677 1521836 1447595 1379133 1329365 1304297 1279987 1270995 1258826 1222046 1173170
11852A173170n6271k0327j0121j2931k8375l6956m4042p2225j144k3743Q780k6775
$$ 1173170 1116899 1096572 1086451 1073520 1045145 1008189 964147 891922 890778 867035 875815 849040
11840H49040m5223m4686l2217j9728r796k1169J6800K2462j4018l5533m4652o3730
$$ 849040 803817 759131 726914 707186 697390 676221 693021 715483 701465 665932 621280 557550
11828E57550R322R944J4037n431j6995j6699M426L9622m0049n4624l7837K4393
$$ 557550 566872 576816 590853 585422 568427 551728 556154 595776 555727 501103 463266 487659
11816D87659K1349O301n9328k1147J6681J1109k9490o518p865k0709P453l976
$$ 487659 509008 515309 455981 434834 451515 462624 433134 426616 418751 398042 405495 401519
11804D01519J8226j156o6406k917M5112J9990K939J4493P623j7512J5226m5915
$$ 401519 419745 418589 352183 349266 394378 414368 417307 431800 439423 421911 437137 391222
11792C91222k5885J6731J5827j5830M1265n186l9688m2079l1162J6169j2803l7004
$$ 391222 365337 382068 397895 382065 423330 418144 378456 336377 305215 321384 308581 271577
11780B71577l6279l850J9801J7043j689q461M9700q972p1242K735L8407m067j4695
$$ 271577 235298 231448 251249 268292 266603 258142 307842 298870 227628 230363 268770 264703 250008
11767B50008P85J715N486m518J329m4738o229m403k3916k0194J6531J8038l2559
$$ 250008 250793 252508 257994 253476 254805 210067 203838 199435 175519 155325 171856 189894 157335
11754A57335K2009K9943l0061l822k3419m982M1825L978O483k9060l9221j9637
$$ 157335 179344 209287 179226 175404 151985 147003 188828 192806 199289 170229 131008 111371
11742A11371k7374m0667q14J0371M1819N3266K2979j6284j1729J7583L816q968
$$ 111371 83997 43330 42516 52887 94706 147972 170951 154667 142938 160521 164337 155369
11730A55369k7719K50M17r106R357j6061j3536K7572M1308j155j289R642l807
$$ 155369 127650 127900 128317 119211 128568 112507 98971 126543 167851 166696 165407 175049 171242
11717A71242k1364p325k996j7267k3989J3532Q386k2871J6827j888n938j4435
$$ 171242 149878 142553 139557 122290 98301 111833 120219 97348 114175 112287 106349 91914
11705I1914J3439J1223Q171J4935k7350l7137k4294k302K1055J8178j5762p455
$$ 91914 105353 116576 124747 139682 112332 75195 50901 48599 69654 87832 72070 64615
11693F4615K7697J8584R123l4450L0747K6157N282l9958l3645j1660M3133L4697
$$ 64615 92312 110896 120019 85569 116316 142473 147755 107797 74152 62492 105625 140322
11681A40322o170j194R150k0593j7439p752j6699J3550P037J1722R860m830L143
$$ 140322 134152 132958 142108 121515 104076 96324 79625 93175 100212 111934 121794 116964 120107
11668A20107j4714k9271O720J5154K8247J2539j2543j1096L5192k9863m6920k7116
$$ 120107 105393 76122 82842 97996 126243 138782 126239 115143 150335 120472 73552 46436
11656D6436J0136r985K373J9338K9509j6065o0443p419P6153J7548j8665k2577
$$ 46436 56572 46587 48960 68298 97807 81742 21299 13880 90033 107581 88916 66339
11644F6339m983P276K7100K5431j1809k9065j2912r042m430J0758J5245j223r991
$$ 66339 61356 68632 95732 121163 109354 80289 67377 58335 53905 64663 79908 78685 68694
11631F8694J1691l4748l1668L1860M4066J1773J5873j1193l3654k1827J334Q500
$$ 68694 80385 45637 13969 45829 89895 101668 117541 106348 72694 50867 52201 60701
11619F0701N2871J4759m292O462j2079l435J8590k557k2414l2504k3169N943P837
$$ 60701 113572 128331 124039 130501 118422 114987 133577 131020 108606 76102 52933 58876 66713
11606F6713R599k7382J12k7298R352J4481J5017j158l2750l8150J5442M6043m95
$$ 66713 76312 48930 49042 21744 31096 45577 60594 59436 26686 -11464 3978 50021 49526
11593D9526L1728L0245L50m8583j3267m2627j7520L3712J2737J5854J13k699O740
$$ 49526 81254 111499 111849 63266 49999 7372 -10148 23564 36301 52155 52268 49569 56309
11580E6309Q450J2814j4667J5072J8213L676j8747l1598J796J4829K2581j7670
$$ 56309 64759 77573 62906 77978 96191 99867 81120 49522 51318 66147 88728 71058
11568G1058m0255k5585Q544J3246j1219J554J3937j6264k0807l1588L7999L5540
$$ 71058 30803 5218 13762 27008 15789 17343 31280 15016 -5791 -37379 620 36160
11556C6160M932k0200J7912q731j6408J7603K7834l1528k2715L0404L2890j280
$$ 36160 41092 20892 38804 30073 13665 31268 59102 27574 4859 35263 68153 66873
11544F6873l1209K0592K2346k2216l7350M477k326j2329K4427J8622J5160n049
$$ 66873 35664 56256 78602 56386 19036 23513 21187 8858 33285 51907 67067 62018
11532F2018L3983q393m0897j9368J4080k3861j8413M209j5131J9137K3250P10
$$ 62018 96001 87608 46711 27343 41423 17562 -851 3358 -11773 7364 30614 31324
11520C1324j4571n795J9169K4941n160K0728J5134Q325j304J7504J8788l6358
$$ 31324 16753 10958 30127 55068 49908 70636 85770 94095 92791 110295 129083 92725
11508I2725l8548N50l5193n117l9862R821K2423J3566R943L488l1146J1358k0570
$$ 92725 54177 54727 19534 14417 -25445 -15624 6799 20365 30308 33796 2650 14008 -6562
11495f562J3402L4234K8002J5524l1830j9449j2750O275j8456j8546q73M5773
$$ -6562 6840 41074 69076 84600 52770 33321 20571 26846 8390 -10156 -11029 34744
11483C4744j2370j5292o106j9737Q913J1769k524J2772n776Q164K4393k9112n1273
$$ 34744 22374 7082 976 -18761 -9848 1921 -603 12169 6393 14557 38950 9838 -41435
11470d1435K358j271L5890j189j0182j0387K4648N9649J2187k4177j607L3668
$$ -41435 -39077 -40348 -4458 -5647 -15829 -26216 -1568 58081 70268 46091 44484 78152
11458G8152j9475J523k6845j1357l0023p534K817n585l246j0690j6884n808K1288
$$ 78152 58677 60200 33355 21998 -8025 -15559 -12742 -18327 -21573 -32263 -49147 -54955 -33667
11445c3667K0053K2415L671j4728N2700J6782L701K480p641J0931l6357j6123
$$ -33667 -13614 8801 12472 -2256 50444 67226 70927 73407 65766 76697 40340 24217
11433B4217l741l1603k2204K4258M580p491M685L8073K4345j4297j7540j5957
$$ 24217 20476 -11127 -33331 -9073 -4493 -11984 -7299 30774 55119 40822 23282 7325
11421G325M224k032M1720J7936J3347j701j3793o6003k8854K2765R057q94j5366
$$ 7325 11549 9517 51237 69173 82520 80819 67026 1023 -27831 -5066 3991 3097 -12269
11408a2269K6749M2011J2342j2230m5888m359L0225j3291o2899J5236L07J667
$$ -12269 14480 56491 68833 56603 10715 6356 36581 23290 -39609 -24373 -24066 -22399
11396b2399K0242J0821n086O213M1536L0131j7887j8929l5872o615l848j7407
$$ -22399 -2157 8664 3578 9791 51327 81458 63571 44642 8770 2155 -1693 -19100
11384a9100K3955M707m370k1769J1618Q58j5240L9617J1013k5339L79K530k5231
$$ -19100 4855 9562 5192 -16577 -4959 -4101 -19341 20276 31289 5950 6329 8859 -16372
11371a6372L1691N3933l9666j0409K3218J7307J3970j6991k667M090J6086j5728
$$ -16372 15319 69252 29586 19177 42395 59702 73672 56681 54014 58104 74190 58462
11359E8462l3837N536M4881q790j9420j5573O444j1108n059K1171K4187J0269
$$ 58462 24625 30161 75042 66252 46832 31259 37703 26595 21536 42707 66894 77163
11347G7163j890m1508l9135k9501L8979L2347l7283k0425J335q40K2213l613k2510
$$ 77163 75273 33765 -5370 -34871 4108 36455 -828 -21253 -19918 -20758 1455 -2158 -24668
11334b4668J5219J0093J1191N1669O1126k9424l0580l0045m5634j383K8507k0199
$$ -24668 -9449 644 11835 63504 124630 95206 64626 34581 -11053 -12436 16071 -4128
11322d128J4348k547p545l3136R530K5854L0331j665k3537m6535K9027q958k9690
$$ -4128 10220 7673 128 -33008 -23478 2376 32707 31042 7505 -39030 -10003 -18961 -48651
11309d8651L1707K0081j0492J9484L5627k7818j6873j3328J518n923K0699k6177
$$ -48651 -16944 3137 -7355 12129 47756 19938 3065 -10263 -8745 -14668 6031 -20146
11297b0146j1277Q969K3110J7911j5098M6276k8890l3201j4345L7062J0675K1561
$$ -20146 -31423 -22454 656 18567 3469 49745 20855 -12346 -26691 10371 21046 42607
11285D2607r126l2237j7533N671J8812K8319r518Q183j3270l4733J8610K2696
$$ 42607 33481 1244 -16289 -10618 8194 36513 26995 35178 21908 -12825 5785 28481
11273B8481J8251Kk1829k6647K504N495j942k2402l6799l2487Q850M1206M0376
$$ 28481 46732 46734 24905 -1742 762 6257 4315 -18087 -54886 -87373 -78523 -37317 3059
11260C059K1690J2337l868Q586J2852l3844l4582J0050J489J7619j9903l1370
$$ 3059 24749 37086 33218 41804 54656 20812 -13770 -3720 -2231 15388 -4515 -35885
11248c5885K857O846L9023J2735l1602k9987q137r19L9438M3650n0481j7501J0608
$$ -35885 -33028 -26182 12841 25576 -6026 -36013 -44150 -45069 -5631 38019 -12462 -29963 -19355
11235a9355L8169l482L9484K6480j9825j882o034n4917l5273J8310K5018N268
$$ -19355 18814 15332 54816 81296 61471 59589 53555 -1362 -36635 -18325 6693 11961
11223A1961j5985P968j976L167j1917j8518P73J8640J1795J0833m9593j1662J1162
$$ 11961 -4024 3944 1968 5135 -6782 -25300 -24527 -5887 5908 16741 -32852 -44514 -33352
11210c3352j3368L6208K3726k368O425P311j0146K2823N098R349K5693r193o882
$$ -33352 -46720 -10512 13214 10846 17271 24582 14436 37259 42357 51706 77399 68206 61324
11197F1324j3487M112K3449k3210j2036K3184n892K1846m287m5632j2924j3293
$$ 61324 47837 51949 75398 52188 40152 63336 57444 79290 75003 29371 16447 3154
11185C154n757K2644p294j7246o192J7585K8914k3893J316L6160P282m6866n4314
$$ 3154 -2603 20041 12747 -4499 -10691 6894 35808 11915 13231 49391 56673 9807 -44507
11172d4507J4302J7665k787j7278r512m8856K4928M3079M460k8111k9382L7758
$$ -44507 -30205 -12540 -15327 -32605 -42117 -90973 -66045 -22966 -18506 -46617 -75999 -38241
11160c8241k9103r456N3852J1374K4328M0914J94j3067j7571j7229m4626l7566
$$ -38241 -67344 -76800 -22948 -11574 12754 53668 53862 40795 23224 5995 -38631 -76197
11148g6197k953L4004N994l824J905J1865j6195k9798j4268O1404M6093Q402J7448
$$ -76197 -79150 -45146 -39152 -42976 -41071 -29206 -45401 -75199 -89467 -28063 18030 26432 43880
11135D3880k7797l8562o69J8602o175m7847J5805K6725L3017k511l5480j0995
$$ 43880 16083 -22479 -23148 -4546 -10721 -58568 -42763 -16038 16979 14468 -21012 -32007
11123c2007l936J8029J0933J8519O702n120K0018J2168P279r367l3954K823K1332
$$ -32007 -35943 -17914 -6981 11538 18240 13120 33138 45306 52585 43218 9264 12087 33419
11110C3419l9961m2505K7646J2660K3082k0524N207K6543j931N025J2792J3316
$$ 33419 -6542 -49047 -21401 -8741 14341 -6183 -976 25567 23636 28661 41453 54769
11098E4769Q587k9106k4201M3684N305l6902k575J7174m749j0940Q191Q762J7370
$$ 54769 63356 34250 10049 53733 59038 22136 19561 36735 31986 21046 29237 37999 55369
11085E5369q707L2911K510j4790k5628J8609J9882l9476l432l996L2398K945K4864
$$ 55369 46662 79573 82083 67293 41665 60274 80156 40680 37248 33252 65650 68595 93459
11072I3459M700j1710J7828K8464J6444J6797l5284m0245r329N9953N2969L9637
$$ 93459 98159 86449 104277 132741 149185 165982 130698 90453 81124 141077 194046 233683
11060B33683J1438l3654j4678m132q261J1325k5097J7224O9295Q6823J11638N3920
$$ 233683 245121 211467 196789 192657 184396 195721 170624 187848 257143 343966 455604 509524
11048E09524P0482R6644J53266J59399J09043k336n7712k4923m574J7969N5798
$$ 509524 580006 676650 829916 989315 1098358 1096022 1038310 1013387 1008813 1026782 1082580
11037A082580Q1973J68651K66743K99470K92986J87001p262j99610k56791j77795
$$ 1082580 1164553 1333204 1599947 1899417 2192403 2379404 2372142 2172532 1915741 1737946
11027A737946r3800n2055R2228K20372L67887M61860M57183K12007j90502m43490
$$ 1737946 1644146 1592091 1684319 1904691 2272578 2734438 3191621 3403628 3213126 2769636
11017B769636m04928l32232k34599j48239p399J15968J74192K51346K11704J1252
$$ 2769636 2364708 2032476 1797877 1649638 1642239 1758207 1932399 2183745 2395449 2406701
11007B406701k21100l52309l31825k32815j89548j07414r6323J1565P7171N4820
$$ 2406701 2185601 1833292 1501467 1268652 1079104 971690 875367 886932 964103 1018923
10997A018923N5197k7880q1751j28108j78668j83283j04143k9854n8297n5099
$$ 1018923 1074120 1046240 964489 836381 657713 474430 370287 340433 282136 227037
10987B27037l506n237m3639k8890j4874j0726K1057j0533p349l7244q501L575
$$ 227037 223531 218294 174655 145765 130891 120165 141222 130689 123340 86096 77595 81170
10975H1170k409j5178l1396Q524j441j449J8648J1553n6382k8228L4421K6742
$$ 81170 78761 63583 32187 40711 39270 37821 56469 68022 11640 -16588 17833 44575
10963D4575K5329k671m5436M788J8805K0023k5883m346j1717J5134M3478K2135
$$ 44575 69904 67233 21797 26585 45390 65413 39530 35184 23467 38601 82079 104214
10951A04214Q623k1432m658k029j9091q934J1408O382j6694m5425j7057J0267
$$ 104214 112837 91405 86747 84718 65627 56693 68101 74483 57789 12364 -4693 5574
10939E574L0461O51m2995j4276K7015L2204P050R571j5537J8788J4053L987L145
$$ 5574 36035 36686 -6309 -20585 6430 38634 45684 55255 39718 58506 72559 76546 79691
10926G9691m5081n7243j6108J9951J6980J0898O989n509k9757m8425K3536J3214
$$ 79691 34610 -22633 -38741 -18790 -1810 9088 16077 10568 -19189 -67614 -44078 -30864
10914c0864j8025J7013J6273P843O8j4200p153J8733j5159m8703k1684K5732L1054
$$ -30864 -48889 -31876 -15603 -7760 -7692 -21892 -29045 -10312 -25471 -74174 -95858 -70126 -39072
10901c9072K2429j5185l502p534j3218L9017J5615k1603j2383j7841j6993K1405
$$ -39072 -16643 -31828 -35330 -42864 -56082 -17065 -1450 -23053 -35436 -53277 -70270 -48865
10889d8865L6244L3873P174r823M1050Q019J659k98k080N690k5248m8519L4307
$$ -48865 -12621 21252 28426 18603 59653 67672 69331 69033 66953 72643 47395 -1124 33183
10876C3183K3068J3754J7760K4251K6975J9656k4704Q470K8620L1978k2814k5732
$$ 33183 56251 70005 87765 112016 138991 158647 133943 142413 171033 203011 180197 154465
10864A54465j5133J0622N5516O7539O1388L0038L8142M9745L6062n074m9132l5922
$$ 154465 139332 149954 205470 273009 334397 364435 402577 452322 488384 483310 434178 398256
10852C98256k8053k6929Q879J3357K7452M7954K7965O8830L6441j2527n5949n4722
$$ 398256 370203 343274 352153 365510 392962 440916 468881 537711 574152 561625 505676 450954
10840D50954o7702m8355K4794P1164o097Q653J1767J0058J3125J6413n1461n6783
$$ 450954 383252 334897 359691 430855 424758 433411 445178 455236 468361 484774 433313 376530
10828C76530l5259m3921l2738J8789j1710l8113j4521J6185k2291l9682R94j5386
$$ 376530 341271 297350 264612 283401 271691 233578 219057 235242 212951 173269 174263 158877
10816A58877k457k1954k7229K287L6481p2477l5119j0507J2921k998j8832K5416
$$ 158877 156420 134466 107237 109524 146005 73528 38409 27902 40823 37825 18993 44409
10804D4409J3226K6070K6735L528k1627K1255j0018j4432l8863j3507n597J392
$$ 44409 57635 83705 110440 113968 92341 113596 103578 89146 50283 36776 31179 32571
10792C2571K4332L4964J7933J4951l0771p65P422k4346k2256O811K2930K5363
$$ 32571 56903 91867 109800 124751 93980 93215 100637 76291 54035 60846 83776 109139
10780A09139K7479K4942L8479J4264m2695k2422l4498k2021L5411L6995O285j5347
$$ 109139 136618 161560 200039 214303 171608 149186 114688 92667 128078 165073 171358 156011
10768A56011J4086J658m6175k7179O967J1557l216O235n008P167K6253K6019k357
$$ 156011 170097 171755 125580 98401 105368 116925 113709 119944 114936 122103 148356 174375 172018
10755A72018j2637P608J6179j8803j8358l380J7548m0070k5830K6272P5K1577
$$ 172018 159381 166989 183168 164365 146007 142627 160175 120105 94275 120547 120622 142199
10743A42199M5520J5852M519L9364o67l0340K2332J2815O163k6498K13j422K3621
$$ 142199 187719 203571 208090 247454 246787 216447 238779 251594 257757 231259 231472 230050 253671
10730B53671M2352O0385O9682L3194k3508j1015j779j3261n397l1017j3995M4982
$$ 253671 296023 356408 426090 459284 435776 424761 422982 409721 404324 373307 359312 404294
10718D04294Q7717R6965Q7823K9615m2281n5814o9509j5966J6510j57N724P427
$$ 404294 492011 588976 676799 706414 664133 608319 538810 522844 539354 539197 544921 552348
10706E52348M1225N4823J5602o930l9329r168J4474j5201l795m946J7988N236
$$ 552348 593573 648396 663998 657068 617739 608571 623045 607844 604049 599103 617091 622327
10694F22327k463j4434k087j3388O8089O3748O610j0366k5029m7037K991P374
$$ 622327 619864 605430 603343 589955 658044 721792 728402 718036 693007 645970 648961 656335
10682F56335K4061m878J502M0364Q402J1329J4486N4483K6768L806M3641L5779
$$ 656335 680396 675518 677020 717384 725786 737115 751601 806084 832852 836658 880299 916078
10670I16078L6050P5110M7691N68l349P0390N3862L1197p538K6785P1834M2607
$$ 916078 952128 1027238 1074929 1075497 1072148 1142538 1196400 1227597 1220059 1246844 1318678 1361285
10658A361285Q442P7722P1277R8521J18677J06171J69541J83013K88737L74477
$$ 1361285 1369727 1447449 1518726 1617247 1735924 1842095 2011636 2194649 2483386 2857863
10648B857863N29638L59117n8348j05102P458J03200J90573K78250L68432N27444
$$ 2857863 3387501 3746618 3688270 3583168 3590626 3693826 3884399 4162649 4531081 5058525
10638E058525P41432J070887J538945K256338L179195M432625N833704O047102
$$ 5058525 5799957 6870844 8409789 10666127 13845322 18277947 24111651 30158753
10630C0158753L013028j345316l214849k596439j181096L45041K029811M018369
$$ 30158753 33171781 31826465 28611616 26015177 24834081 25179122 27208933 31227302
10622C1227302O566213R896671J4225952J8003372J7946009J7407876K1214222
$$ 31227302 37793515 47690186 61916138 79919510 97865519 115273395 136487617
10615A36487617K4299914J9417997O504445n959512j0811554q108988r19191Q549420
$$ 136487617 160787531 180205528 186709973 180750461 169938907 161829919 160910728 169460148
10607A69460148J8441548K7373882L7650242M9679028N4118813L6738909n89681
$$ 169460148 187901696 215275578 252925820 302604848 356723661 393462570 392872889
10600C92872889l2244368m1745691l4332246j9767261k850589J5458365L5212275
$$ 392872889 360628521 318882830 284550584 264783323 261932734 277391099 312603374
10593C12603374N5351589P1202669P1032189L8695848j8641945o2118992p2225396
$$ 312603374 367954963 439157632 510189821 548885669 530243724 468124732 395899336
10586C95899336o0679582m2040286k2891610m569275J2874459K8580453L9256813
$$ 395899336 335219754 293179468 270287858 265718583 278593042 307173495 346430308
10579C46430308L7000399J2559439k6136210n2907293n6552771m6349816l2491955
$$ 346430308 383430707 395990146 369853936 316946643 260393872 214044056 181552101
10572A81552101j9582310q595915N78373P609313J1143902Q523178k257842j7005264
$$ 181552101 161969791 153373876 153952249 161561562 172705464 181228642 178970800 161965536
10564A61965536k6807727k8027052k4011883j8669502j3834042j0160348p501560
$$ 161965536 135157809 107130757 83118874 64449372 50615330 40454982 32953422
10557C2953422n521495m130924l154696k488425k042990j706359j510091j341938
$$ 32953422 27431927 23301003 20146307 17657882 15614892 13908533 12398442 11056504
10549A1056504j122855r60671p77436o68070n78961m86049m04020l35320l12656
$$ 11056504 9933649 8972978 8195542 7527472 6948511 6462462 6058442 5723122 5410466
10540E410466l03270l20891l13514k37340j92825j79237k01839j12552p6282j36359
$$ 5410466 5107196 4786305 4472791 4235451 4042626 3863389 3661550 3548998 3472716 3336357
10530C336357j23479j14056j39165j26848r1488q2789j00557j02626p2952o0385
$$ 3336357 3212878 3098822 2959657 2832809 2741321 2658532 2557975 2455349 2382397 2322012
10520B322012n9868o9049m3974j14623q6554m8814m5537p2936p2328o2812k3703
$$ 2322012 2262144 2193095 2149121 2034498 1947944 1899130 1853593 1780657 1708329 1645517 1621814
10509A621814P858k3531k2033n649l1782m6136l4576m8389m7991j6280Q76k4528
$$ 1621814 1629672 1606141 1584108 1578459 1546677 1500541 1465965 1417576 1369585 1353305 1354181 1329653
10497A329653k7094l6821n2462j2196j0422Q85n851j8584j8594J246J605M2496
$$ 1329653 1302559 1265738 1213276 1201080 1190658 1191543 1185692 1167108 1148514 1149760 1151365 1193861
10485A193861j0342l3362j9202k4734k0329L7202L9369K1614L5527K2954q251
$$ 1193861 1183519 1150157 1130955 1106221 1085892 1123094 1162463 1184077 1219604 1242558 1234307
10474A234307J2878k6886l5743l8438k8645k0967r78P0118N7895j01O3517J0210
$$ 1234307 1247185 1220299 1184556 1146118 1117473 1096506 1095528 1165646 1223541 1223440 1286957 1297167
10462A297167k3149J1630j5026n1138m8480o6083o2708m3480R939M2501O1983
$$ 1297167 1274018 1285648 1270622 1219484 1171004 1104921 1042213 998733 1008672 1051173 1113156
10451A113156n102O516l986n0131m6168m6090m6121k8923o2460j8056k0916J5778
$$ 1113156 1108054 1114570 1110584 1060453 1014285 968195 922074 893151 830691 812635 791719 807497
10439H07497J0207J2246j5057m3757m0990q5075l8835q999j1050L2362K3184n0123
$$ 807497 817704 829950 814893 771136 730146 645071 606236 597237 586187 618549 641733 591610
10427E91610k7754l8741k3183l5231K1598j9879j1517l348K4132K584k6683l5075
$$ 591610 563856 525115 501932 466701 488299 468420 456903 453555 477687 480271 453588 418513
10415D18513O014r49R350K5199j5545Q921K2507k3202o259K0643k3717j9545o418
$$ 418513 424527 423578 432928 458127 442582 451503 474010 450808 444549 465192 441475 421930 415512
10402D15512j0890N16K2228J1490J842J3900j7212k4614J9157N779j793m7800
$$ 415512 404622 405138 427366 438856 440698 454598 437386 412772 431929 437708 435915 388115
10390C88115J0711J8176j8786k1331m238J5002J0385K0173p731o630j3613l7443
$$ 388115 398826 417002 398216 376885 372647 387649 398034 418207 410476 403846 390233 352790
10378C52790o273J9500L5378l30k8829L890m467J1131K268K2026j3146l8670l3592
$$ 352790 346517 366017 401395 401065 372236 376126 371659 382790 385058 407084 393938 355268 321676
10365C21676M814J515Q377P513p895m747j6758l538J129K2732l0256J4253j6895
$$ 321676 326490 328005 336382 343895 336000 331253 314495 310957 312086 334818 304562 318815 301920
10352C01920m1425k540J0251J5013o949j1194k2561k5491l500N8366J4829j6409
$$ 301920 260495 257955 268206 283219 276270 265076 242515 217024 213524 271890 286719 270310
10340B70310k3891k0456L4127L1411k6577n5464n2116J5997R41m530L1024L1748
$$ 270310 246419 225963 260090 291501 264924 209460 157344 173341 174282 169752 200776 232524
10328B32524J0330K1971j7276O720Q110l8524o7081k0624K1721L3354M6112L1830
$$ 232524 242854 264825 247549 254269 262379 223855 156774 136150 157871 191225 237337 269167
10316B69167k3937K5644k1612l9397k3053L4117r049k1893l5223p963J5981L5108
$$ 269167 245230 270874 249262 209865 186812 220929 211880 189987 154764 146801 162782 197890
10304A97890K4436J5158L0596p777l057j6304J1628j9732K2142m64j0287o809
$$ 197890 222326 237484 268080 260303 257246 240942 252570 232838 254980 254516 244229 237420
10292B37420l713j1443k4902j3857j2120q261m577K350l5333k5746K2026N5992
$$ 237420 233707 222264 197362 183505 171385 163124 158547 160897 125564 99818 121844 177836
10280A77836P318r666L88q044K4904L6020J1820J817l7938j7319J0885J3922k2905
$$ 177836 185154 175488 175876 167832 192736 228756 240576 242393 204455 187136 198021 211943 189038
10267A89038l0404j1504J196O887k1032N484l8177K2122r213K4076P1923K2824
$$ 189038 158634 147130 148326 155213 134181 139665 101488 123610 114397 138473 210396 233220
10255B33220n1830o2276K875R576J8062R304l2514q671q392j7934k5486r348K3608
$$ 233220 181390 119114 121989 131565 149627 158931 126417 117746 109354 91420 65934 56586 80194
10242H0194K5513O468J327k0846O717l2014k1968O884K4956J7412J9437J3982
$$ 80194 105707 112175 113502 92656 99373 67359 45391 52275 77231 94643 114080 128062
10230A28062k8929k9106k5331J2789K9760K8649J7684m7144n0807M2161M368M0045
$$ 128062 99133 70027 44696 57485 87245 115894 133578 86434 35627 77788 82156 122201
10218A22201R690k9856L1155M3312m2845m0628j823m4955Q999K6398o784K0475
$$ 122201 131891 102035 133190 176502 133657 93029 91206 46251 55250 81648 74864 95339
10206I5339j0937k1265J5359M0911L5461m5292m426K350M3411N1272O410P976
$$ 95339 84402 63137 78496 119407 154868 109576 105150 107500 150911 202183 208593 216569
10194B16569J8906j53O305j9516j399r870k8202K6490J7321O0656M8581Q7174
$$ 216569 235475 235322 241627 222111 220712 210842 182640 209130 226451 287107 335688 422862
10182D22862J19504J30488J49475J40854J35774P1421l3007o4915m2955j8607
$$ 422862 542366 672854 822329 963183 1098957 1170378 1137371 1072456 1029501 1010894
10172A010894o17N1228J20308J97607K91064L10738L09961J36280q0855j99514
$$ 1010894 1010277 1061505 1181813 1379420 1670484 1981222 2291183 2427463 2346608 2147094
10162B147094k45631k01631p9118O6000J44430J98684L40372M83527L87497J12011
$$ 2147094 1901463 1699832 1620714 1686714 1831144 2029828 2370200 2853727 3241224 3353235
10152C353235k61362m49210m46410l24989k04595r4970N383J13646J94107K84065
$$ 3353235 3091873 2642663 2196253 1871264 1666669 1571699 1577082 1690728 1884835 2168900
10142B168900K23807k4110k53492l50219l07620k51844j47647o9818j8966J5145
$$ 2168900 2392707 2368597 2115105 1764886 1457266 1205422 1057775 987957 968991 984136
10132I84136N2041O4233L3638n3108j62208k08016j55457p6776r3260o4517n1558
$$ 984136 1036177 1100410 1134048 1080940 918732 710716 555259 478483 385223 320706 269148
10121B69148m3284l192N151n2931n6411j9981N824J8291K1079L324k7605k0884
$$ 269148 225864 222672 227823 174892 118481 98500 104324 122615 143694 147018 119413 98529
10109I8529L471l1828j2683K1991M5475N952j9325q222J3147l4703j7890J5583
$$ 98529 102000 70172 57489 79480 124955 130907 111582 103360 116507 81804 63914 79497
10097G9497L4186J2179j5486j1267J3891k6309M145L5259j5527j7052O911j9170
$$ 79497 113683 125862 110376 99109 113000 86691 90836 126095 110568 93516 100427 81257
10085H1257l2390q94j0774L832n59q558J4189k3237M156K0308J4940o524r792
$$ 81257 48867 47973 37199 41031 40472 31914 46103 22866 27022 47330 62270 55746 45954
10072D5954J5108J3487K117k417j1356n888k5069q752l636N0397K3592l2985j6448
$$ 45954 61062 74549 76666 74249 62893 57005 31936 23184 19548 69945 93537 60552 44104
10059D4104N624k2594J0592J2705N6186P6R952j9844m1066J5157J3833L3006J744
$$ 44104 49728 27134 37726 50431 106617 106693 116645 96801 55735 70892 84725 117731 119475
10046A19475k2268k6888k944k0245N053K4207K3124J2536M4486L3305K0038K0448
$$ 119475 97207 70319 67375 47130 52183 76390 99514 112050 156536 189841 209879 230327
10034B30327M5996L540k9297p5433n1303j5473l8685Q654K97l1492j7191P2006
$$ 230327 276323 279863 250566 175133 123830 108357 69672 78326 78623 47131 29940 101946
10022A01946J7982o437j9239k0786o670M412J3192q155P767k161j9438k1159L358
$$ 101946 119928 113491 94252 73466 66796 71208 84400 76245 84012 81851 62413 41254 44612
10009D4612m581J7630M24r134q680L0339J652j8045m2665l8228q670M5190j7134
$$ 44612 40031 57661 58085 48951 40271 70610 72262 54217 11552 -26676 -35346 9844 -7290
9996g290J2202N1947K812k9863j9180J2689K5673M328J5634m057m2238J2403j7408
$$ -7290 4912 56859 59671 29808 10628 23317 48990 53318 68952 64895 22657 35060 17652
9983A7652R18J7716K1706j0510k2608J64J4821K3111o030k0072n0815m4061P265
$$ 17652 18570 36286 57992 47482 24874 25038 39859 62970 56940 36868 -13947 -58008 -50743
9970e0743L6068N2332N4255j6878o7470m0203j235K7094K9764P684j4445L082
$$ -50743 -14675 37657 91912 75034 7564 -32639 -33874 -6780 22984 30668 16223 19305
9958A9305j8461R429K606k8512O2j5672R854j7671j2444J9335J2430J1551K9554
$$ 19305 844 10273 12879 -15633 -15571 -31243 -21389 -39060 -51504 -32169 -19739 -8188 21366
9945B1366L7359L9709N028m8269j8243J6187L2531J0722l6255k6695J043R446
$$ 21366 58725 98434 103462 55193 36950 53137 85668 96390 60135 33440 34483 43929
9933D3929L89K7313N1617k374J5128N8741L6625j1878l9741q0146k0959J8072
$$ 43929 44318 71631 123248 120874 136002 194743 231368 219490 179749 99603 78644 96716
9921I6716J698k9747j4639K442o75l2620r829j3249r726R151J6080j4620R918
$$ 96716 98414 68667 54028 56470 55795 23175 13346 97 -9629 -478 15602 982 10900
9908A0900J533K9782M0598K7847k2147k3885l0820m8301J5268r611l1423L1853
$$ 10900 12433 42215 82813 110660 88513 64628 33808 -14493 775 -8836 -40259 -8406
9896h406K5015J9423J2214O552n410r281M6731J2843j8887J5751J0397j4501k53
$$ -8406 16609 36032 48246 54798 49388 40107 86838 99681 80794 96545 106942 92441 92188
9883I2188K9280K0600Q342J3665k1407j9043l7066j0966j6463m1773Q392r1K5606
$$ 92188 121468 142068 150410 164075 142668 123625 86559 75593 59130 17357 25749 25658 51264
9870E1264L9376J6566n67J0188N417q925k1774p27K059j750j3291J6028M8710
$$ 51264 90640 107206 106639 116827 122244 113319 91545 90818 92877 91127 77836 93864 142574
9857A42574M2165k224o5135l8636k8137j9301N002O1784J5558R674l4243j9576
$$ 142574 184739 182515 117380 78744 50607 31306 36308 98092 113650 123324 89081 69505
9845F9505l4917m8693m733K3209m969j7842o095K9110j6534j7434k601K6777r585
$$ 69505 34588 -14105 -18838 4371 -598 -18440 -24535 4575 -11959 -29393 -31994 -5217 -14802
9832a4802Q955L0841m446N571j0281l6094M920J0259K4089K0135k0178M0403l0844
$$ -14802 -5847 24994 20548 26119 15838 -20256 -15336 -5077 19012 39147 18969 59372 28528
9819B8528l1355L1432j6830K3830O125k815P313j3446L9254J3963j1898j7710
$$ 28528 -2827 28605 11775 35605 41730 38915 46228 32782 72036 85999 74101 56391
9807E6391J2931L1595J944k6593j4882M047K4573O474j1264j0720l1468J7716
$$ 56391 69322 100917 102861 76268 61386 65433 90006 96480 85216 74496 43028 60744
9795F0744j7783j7120j5528j3298k6640K8203O866K9942J6215P245j1998l415
$$ 60744 42961 25841 10313 -2985 -29625 -1422 5444 35386 51601 58846 46848 43433
9783D3433n081j1380j1327n087L5091Q0050P9533J56453J26961M6230p3394j64184
$$ 43433 38352 26972 15645 10558 45649 125699 205232 361685 488646 534876 461482 297298
9771B97298j03941o3434l8992n1298l8725j0106n771J2197M46J2616k0243k5087
$$ 297298 193357 129923 90931 39633 908 -9198 -14969 -2772 -2326 10290 -9953 -35040
9759c5040N792K8393L5560r496n1078J1336J6089J1334Q713J4394j3532J4535
$$ -35040 -29248 -855 34705 25209 -25869 -14533 1556 12890 21603 35997 22465 37000
9747C7000P392k1561k7067k927m882P82L6554M354n698L6713J4913l0002k6496
$$ 37000 44392 22831 -4236 -7163 -12045 -11263 25291 29645 23947 60660 75573 45571 19075
9734A9075k1968J1422j3284k730o871O628j3394k5119J7111K1501p777K2289R464
$$ 19075 -2893 8529 -4755 -7485 -14356 -7728 -21122 -46241 -29130 -7629 -15406 6883 16347
9721A6347k31r563l0825J1019J8377J4586L3093o616m1736r353K1902j2041n584
$$ 16347 16116 6553 -24272 -13253 5124 19710 52803 46187 4451 -4902 17000 4959 -625
9708f25K0560n532j0336k5945k2970L0483K3777P454J6152J3208K7247l7673l702
$$ -625 19935 14403 4067 -21878 -44848 -14365 9412 16866 33018 46226 73473 35800 32098
9695C2098K7295r347k4783l4087k0300k9468Q274L1105K8654K3555J3825k7576
$$ 32098 59393 50046 25263 -8824 -29124 -58592 -50318 -19213 9441 32996 46821 19245
9683A9245N3472K3932l3745o245j6885L09K9667r17k1813k254j168j8284k2443
$$ 19245 72717 96649 62904 56659 39774 40083 69750 68833 47020 44766 43598 25314 2871
9670B871O302k3088K3170J2890j339k1146r28j0022j0740J1716L0725o601L986
$$ 2871 9173 -13915 9255 22145 20806 -340 -1268 -11290 -22030 -10314 20411 13810 17796
9657A7796K4149m922k3268l3294j7960l679m305L8806o817J2356o58P453p694
$$ 17796 41945 37023 13755 -19539 -37499 -41178 -45483 -6677 -13494 -1138 -1796 5657 -2037
9644b037J7783L9829l076j2669j1079J4861N624n89p231N936L5371j7397n783
$$ -2037 15746 55575 52499 39830 28751 43612 49236 48647 41416 47352 82723 65326 59543
9631E9543p875n4342j8315J7980k808L6853J351R503q066j2429N941Q277r200
$$ 59543 51668 -2674 -20989 -3009 -5817 31036 32387 41890 33824 21395 27336 35613 26413
9618B6413k4536M099M022o155k8641o631J1408j1554P381J1036k3336k1657K4654
$$ 26413 1877 5976 9998 3843 -24798 -31429 -20021 -31575 -24194 -13158 -36494 -58151 -33497
9605c3497K0141L9985M1693k8035k7121r912p237K2804M14K9673K4945K990m0478
$$ -33497 -13356 26629 68322 40287 13166 3254 -3983 18821 19235 48908 73853 76843 36365
9592C6365k0065N930L0971k0737m0957q345K3963K5503J0050K137m954K344J339
$$ 36365 16300 22230 53201 32464 -8493 -16838 7125 32628 42678 44815 39861 42205 43544
9579D3544k0605q417j613J9254L9323k9331K344j0390j1222K6283j8301J8911
$$ 43544 22939 14522 12909 32163 71486 42155 44499 34109 22887 49170 30869 49780
9567D9780o78n880k86M408N843r763q053M873k2805j7115j1800K4972J3115j5701
$$ 49780 49102 43222 42936 47344 53187 43424 35371 40244 17439 324 -11476 13496 26611 10910
9553A0910j0479K8888M3933N0591J9064L2301L4534L1057J8649j8156K2372N2552
$$ 10910 431 29319 73252 123843 142907 175208 209742 240799 259448 241292 263664 316216
9541C16216N6607R5095J21133J89829J72097K47131L24553L15360K50597J42619
$$ 316216 372823 467918 589051 778880 950977 1198108 1522661 1838021 2088618 2231237
9531B231237J9439j46675k65141k76347k59138k86429k18030j28886r0128o8649
$$ 2231237 2250676 2104001 1838860 1562513 1303375 1016946 798916 670030 579902 511253
9521E11253n9962n9578n1109m2290q1252l4779m596k1471n1995j4783J6507K2863
$$ 511253 451291 391713 340604 298314 217062 182283 177687 156216 104221 89438 105945 128808
9509A28808l384k6441l2523j8261J5177L8762N273m3090Q268o247k1893j9954
$$ 128808 125424 98983 66460 48199 63376 102138 107411 64321 72589 66342 44449 24495
9497B4495K6876K7999J920k9983k1761p272r014l917K9612K4314J558k619M737
$$ 24495 51371 79370 81290 51307 29546 22274 13260 9343 38955 63269 64827 62208 66945
9484F6945q377m6291l8063J227J5233J2809m682L4243k942k4226J3449p548P380
$$ 66945 58568 12277 -25786 -24559 -9326 3483 -1199 33044 30102 5876 19325 11777 19157
9471A9157R576l4167k8102J1872M2455K7571L744N95J0759r123m2991j2392L371
$$ 19157 28733 -5434 -33536 -21664 20791 48362 52106 52701 63460 54337 11346 -1046 2325
9458B325p510l2644l6924j827K6995N2687j0437L047L1498q988r965j5984m804
$$ 2325 -5185 -37829 -74753 -76580 -49585 3102 -7335 -4288 27210 18222 8257 -7727 -12531
9445a2531J0734j0704K679M144L4212K9407j5043l094L0317J6169o8502m6661
$$ -12531 -1797 -12501 -9822 -5678 28534 57941 42898 39804 70121 86290 17788 -28873
9433b8873J0911O94J5006O061k4101O811L3358k2020m4764M6500K7779k0533j4861
$$ -28873 -17962 -17268 -2262 3799 -20302 -13491 19867 -2153 -46917 -417 27362 6829 -8032
9420h032Q305K2069j2061M360m9560j4070K8892N653k6416k4691k969O148Q552
$$ -8032 273 22342 10281 14641 -34919 -48989 -20097 -14444 -40860 -65551 -68520 -62372 -53820
9407e3820P660O3764M3913N554j8583j669j3990k6920l987J3040O639j8500n9853
$$ -53820 -46160 17604 61517 67071 48488 46819 32829 5909 1922 14962 21601 3101 -56752
9394e6752j8252J8179J7608L213R838M2465K8924J608M677J7148j982K080J8040
$$ -56752 -75004 -56825 -39217 -36004 -26166 16299 45223 46831 51508 68656 66674 68754 86794
9381H6794P238l1471m1956k5764J3815J213L130l877r314J7311O117l6146j1955
$$ 86794 94032 62561 20605 -5159 8656 9869 12999 9122 -192 17119 23236 -12910 -24865
9368b4865j7734j380J0930K2553O110R676M183k0357p524J364K8930K3705j2921
$$ -24865 -42599 -43979 -33049 -10496 -4386 5290 9473 -10884 -18408 -17044 11886 35591 22670
9355B2670j1574j6146k3968k8712j8310K2568J9680O886J2493m6958j0057M9805
$$ 22670 11096 -5050 -29018 -57730 -76040 -53472 -33792 -26906 -14413 -61371 -71428 -21623
9343b1623J1955K2157L1779l3300J1096J9265L1636J3510n728q730j4092n080
$$ -21623 -9668 12489 44268 10968 22064 41329 72965 86475 80747 72017 57925 52845
9331E2845N643l44J3489j7717l9752j4026N155j0461k1410j4175k677J1786M4992
$$ 52845 58488 58144 71633 53916 14164 138 5293 -5168 -26578 -40753 -43430 -31644 13348
9318A3348q693k3502J0761j6382K8635j3226N3332K7621l8495P154J6785k0807
$$ 13348 4655 -18847 -8086 -24468 4167 -9059 44273 71894 33399 40553 57338 36531
9306C6531j8352j1529K7892j580J5140j3901m5597l4619L9764L8601j5744m118
$$ 36531 18179 6650 34542 32962 48102 34201 -11396 -46015 -6251 32350 16606 12488
9294A2488Q459j3923l3376R412J6437Q143R2K0495J4355l655o283j136k332k6429
$$ 12488 20947 7024 -26352 -16940 -503 7640 7732 28227 42582 38927 32644 31508 29176 2747
9280B747Q496N104K06j4048o018L2644n593l5331j0198O641J7873j776K879k9863
$$ 2747 11243 16347 16553 2505 -3513 29131 23538 -11793 -21991 -15350 2523 747 3626 -26237
9266b6237k571O2785O1997k5921J2733L4905n0895l2912J7220J1953K1104N207
$$ -26237 -28808 33977 95974 70053 82786 117691 66796 33884 51104 63057 84161 89368
9254H9368l123j8275N072K7181p414n874j5552j0781k6994l3243J5922J5143j3679
$$ 89368 86245 67970 73042 100223 92809 86935 71383 60602 33608 365 16287 31430 17751
9241A7751R611j0210k0795j4968m170J3634K1515K3848m760J0306l764J4094m799
$$ 17751 27362 17152 -3643 -18611 -22781 -9147 12368 36216 31456 41762 37998 52092 47293
9228D7293O91l5583m0478K8694j0164l3229N4105M6291R202l2791j8223m324k324
$$ 47293 47984 12401 -28077 617 -9547 -42776 11329 57620 66822 34031 15808 11484 9160
9215I160m972J4257K2588L2976K1617k1267o0254l1033L1237N3364P72m9195n279
$$ 9160 4188 18445 41033 74009 95626 74359 14105 -16928 14309 67673 68445 19250 13971
9202A3971j0639M3102M6080l5525o024J0863n316m35l1540k0229m654Q063m683
$$ 13971 3332 46434 92514 56989 50965 61828 56512 56077 24537 4308 -346 7717 3034
9189C034O963J7891J6835j6784J5928n333m3995m810R141k6717j1460K1922P631
$$ 3034 9997 27888 44723 27939 43867 38534 -5461 -10271 -1130 -27847 -39307 -17385 -9754
9176i754N5523K6401k9435J384j4695l0615J4289k0112k1783M0886J4957k0204
$$ -9754 45769 72170 42735 44119 29424 -1191 13098 -7014 -28797 12089 27046 6842
9164F842k5262j9091J9605Q546n597m832J3213L652k2008j5822L073k4410j057
$$ 6842 -18420 -37511 -17906 -9360 -14957 -19789 -6576 -2924 -24932 -40754 -37681 -62091 -63148
9151f3148L365K1963M8001K1274k665k4320r773q044J930K9091J7681J3992n3531
$$ -63148 -59783 -37820 10181 31455 28790 4470 -5303 -13347 -11417 17674 35355 49347 -4184
9138d184K2544L7493m948l6623P9K9135L6065Q766l1307m2318Q475L1680j5801
$$ -4184 18360 55853 50905 14282 14361 43496 79561 88327 57020 14702 23177 54857 39056
9125C9056r630J9411K4978l6530o344J9612L5197r703J7184j1673j3360r308k0982
$$ 39056 29426 48837 73815 37285 30941 50553 85750 76047 93231 81558 68198 58890 37908
9112C7908K4091J2142p8J4857k0664l0855j6813L782J2291j3202j9272l789L757
$$ 37908 61999 74141 74063 88920 68256 37401 20588 24370 36661 23459 4187 398 4155
9099D155L3990J1936J3895k935p571k5499j4779J7147K8152l1775k6207k5857
$$ 4155 38145 50081 63976 61041 53470 27971 13192 30339 58491 26716 509 -25348
9087b5348j0007n371K5027K5453l40J7272J0270l2884J2137L7091q020j5642R651
$$ -25348 -35355 -40726 -15699 9754 9414 26686 36956 4072 16209 53300 45280 29638 39289
9074C9289j0900J7861K6835J0672k0959k7142n929k19l7987J3709J7555k6125
$$ 39289 28389 46250 73085 83757 62798 35656 29727 29508 -8479 5230 22785 -3340
9062c340j5155L1918m4889l0046M0401L2508j0928L038R23K2702K6246j8285r282
$$ -3340 -18495 13423 -31466 -61512 -21111 11397 469 3507 4430 27132 53378 35093 25811
9049B5811J369J4111j9510j0826K1444k2478o902p505m483J141j476K598P867
$$ 25811 27180 41291 21781 10955 32399 9921 3019 -4486 -8969 -7828 -9304 -6706 1161
9036A161q468J981l9753J4172J0568Q015k9583m746L2075M103j8559k3492M405
$$ 1161 -7307 -5326 -45079 -30907 -20339 -12324 -41907 -46653 -14578 -10475 -29034 -52526 -48121
9023d8121N536J7646L2120L1747k9204j022K1056k4142j5388p120P134J647q227
$$ -48121 -42585 -24939 7181 38928 9724 8702 29758 5616 -9772 -16892 -9758 -8111 -16338
9010a6338j8248j8829P06L7846l407j3447k4991L2203J2551N359L7005n742n0022
$$ -16338 -34586 -53415 -52709 -14863 -18270 -31717 -56708 -24505 -11954 -6595 30410 24668 -25354
8997b5354J7003K6795n8778o215J2687L1165k3268p433O055l711k3487L6547l2065
$$ -25354 -8351 18444 -40334 -46549 -33862 -2697 -25965 -33398 -27343 -31054 -54541 -17994 -50059
8984e0059L0711M6630k6380j2527j3985j4578l946K4376J3371L839j0991j3894
$$ -50059 -19348 27282 902 -11625 -25610 -40188 -44134 -19758 -6387 -2548 -13539 -27433
8972b7433K0651J2482j5432m970K0630J2334P2542L227o402j701o141K9669J991
$$ -27433 -6782 5700 -9732 -14702 5928 18262 90804 94031 87629 85928 79787 109456 111447
8959A11447m2092m8980p250L4144j8133l4929j1356K5282N479r736k811J4595
$$ 111447 69355 20375 13125 47269 29136 -5793 -17149 8133 13612 3876 1065 15660
8947A5660L1579J6069k148o043j5472J911J3842Q572j4326l7226l0305l7889K7526
$$ 15660 47239 63308 61160 55117 39645 41556 55398 63970 49644 12418 -17887 -55776 -28250
8934b8250K5393L632L1765j3760l0630j7091j5589j5027K2801R877L3314M1729
$$ -28250 -2857 775 32540 18780 -11850 -28941 -44530 -59557 -36756 -26879 6435 48164
8922D8164J1777k040K8413J1215l6484k9373m652n61J9603J4589k1221J4048k6780
$$ 48164 59941 57901 86314 97529 61045 31672 27020 26459 46062 60651 39430 53478 26698
8909B6698K850q791P106K4304l480m4731j1162p390J8512K0913j115j9731k0225
$$ 26698 29548 20757 27863 52167 48687 3956 -7206 -14596 3916 24829 23714 3983 -16242
8896a6242J5939k5271m218J1168K8265k2520K622J0232P974q587k4540Q296M222
$$ -16242 -303 -25574 -29792 -18624 9641 -12879 -10257 -25 7949 -638 -25178 -16882 -12660
8883a2660n7506L3538q460k1895K6867J3676J6475M5698J0990p870j5360L9535
$$ -12660 -70166 -36628 -45088 -66983 -40116 -26440 -9965 35733 46723 38853 23493 63028
8871F3028j7099j549K590r693j4028j0703k6274k6932L3716Q848J45l0998j1796
$$ 63028 45929 44380 46970 37277 23249 12546 -13728 -40660 -6944 1904 2049 -28949 -40745
8858d0745j3183J268N983M115L1121n035o055N274P037J0902j244j1425J0348
$$ -40745 -53928 -52660 -46677 -42562 -11441 -16476 -22531 -17257 -10220 682 -562 -11987 -1639
8845a639Q035N944j6228j6923J431K7571R808j675m2731J1620L1578K7488l514
$$ -1639 6396 12340 -3888 -20811 -19380 8191 17999 16324 -26407 -14787 16791 44279 40765
8832D0765R878l1862J9917J085k4375J5677k8858m3068k2700J7069J8962K0579
$$ 40765 50643 18781 38698 39783 15408 31085 2227 -40841 -63541 -46472 -27510 -6931
8820f931o988k2828K296L3341N133l574M730N664K5360P843j6851o223j4856k2698
$$ -6931 -13919 -36747 -34451 -1110 4023 449 5179 10843 36203 44046 27195 20972 6116 -16582
8806a6582o717o157K1967K3272J4596K5995k0430j6701k6492N3581J8399j306
$$ -16582 -23299 -29456 -7489 15783 30379 56374 35944 19243 -7249 46332 64731 63425
8794F3425J325M783R725l6922m2154m1330N661J4484q676j0163K4361N529k2411
$$ 63425 64750 69533 79258 42336 182 -41148 -35487 -21003 -29679 -39842 -15481 -9952 -32363
8781c2363N8142K6992o111q792j6741L55K8931k5517m0264m5146K6668K2782M2370
$$ -32363 25779 52771 46660 37868 21127 21482 50413 24896 -15368 -60514 -33846 -11064 31306
8768C1306q108J5138J1770k6655j7004j6373J6306J1927l7124j330L6819L1324
$$ 31306 23198 38336 50106 23451 6447 -9926 6380 18307 -18817 -20147 16672 47996
8756D7996P49k7556m9162P207K8655r559j7956j0579M400M232J4124L8482K0272
$$ 47996 48745 21189 -27973 -20766 7889 -1670 -19626 -30205 -25805 -21573 -7449 31033 51305
8743E1305l2070l6258K3599j4227l9080K9510K553j1242K4015P17K7654J8120
$$ 51305 19235 -17023 6576 -7651 -46731 -17221 -14668 -25910 -1895 -1178 26476 44596
8731D4596m0071L15J8912K7604J0854j6363J4869l2018k7097j1133Q441j1920
$$ 44596 4525 4840 23752 51356 62210 45847 60716 28698 1601 -9532 -1091 -13011
8719a3011o3612l409J6216l350K0537j1596j0599J1182J7395R279j4583L0510
$$ -13011 -76623 -80032 -63816 -67166 -46629 -58225 -68824 -57642 -40247 -30968 -45551 -15041
8707a5041o005l597R426L4491L1362o26l3392j8138l613J3675M425j9122J6893
$$ -15041 -21046 -24643 -15217 19274 50636 50010 16618 -1520 -5133 8542 12967 -6155 10738
8694A0738J2041j1753j0606M184J0896m2413k8830q037K6848L2947M0096Q951
$$ 10738 22779 11026 420 4604 15500 -26913 -55743 -63780 -36932 -3985 36111 45062
8682D5062m7961l2119K8711M9533P201j8506L5848M234k6900l6167K5086N1095
$$ 45062 -2899 -35018 -6307 43226 50427 31921 67769 72003 45103 8936 34022 85117
8670H5117k282j7297j5333o761J5255l0067Q340j4684l9370k6158J5994L5132
$$ 85117 82835 65538 50205 43444 58699 28632 36972 22288 -17082 -43240 -27246 7886
8658G886L1363K7567m197k0978j4871K3228K317J5004k8229J6125J7486j8974
$$ 7886 39249 66816 62619 41641 26770 49998 52315 67319 39090 55215 72701 53727
8646E3727l7182R144K3915n575l1756K5471j6377J546n126j8095J717L3188K5137
$$ 53727 16545 25689 49604 44029 12273 37744 21367 22913 17787 -308 1409 34597 59734
8633E9734k8890n7281l8255J5990M3845L8037j6585r775J8632k561J7077J8377
$$ 59734 30844 -26437 -64692 -48702 -4857 33180 16595 6820 25452 22891 39968 58345
8621E8345l540L3659M6263o528n1438l3052M265j9395j3611r201J4934K1975K7300
$$ 58345 54805 88464 134727 128199 76761 43709 47974 28579 14968 5767 20701 42676 69976
8608F9976j7304j8152O308k9918l2893M5846j4148m2035R690l529j525K5617J5695
$$ 69976 52672 34520 40828 10910 -21983 23863 9715 -32320 -22630 -26159 -27684 -2067 13628
8595A3628J3932q950K3805o362l0465o61K1191J9714R340J3026j8695J7453j8412
$$ 13628 27560 18610 42415 36053 5588 4927 26118 45832 55172 68198 49503 66956 48544
8582D8544l5502j3756L0067L326l2411p800K5023M321K186K3840n0760k5867K4998
$$ 48544 13042 -714 29353 32679 268 -7532 17491 21812 23998 47838 -2922 -28789 -3791
8569c791M0956P984M2805K1249j7385M820j8726m6767k1469m960J8572J7230j542
$$ -3791 37165 45149 87954 109203 91818 96638 77912 31145 9676 4716 23288 40518 38976
8556C8976l0143k0266p034M1540M8083k849p840j9299l5309O939L5796k7529O30
$$ 38976 8833 -11433 -18467 23073 71156 68307 60467 41168 5859 12798 48594 21065 21695
8543B1695k907M408K5590j8296j7873k5710L9212j1344j7863R626K3630M916l3202
$$ 21695 18788 23196 48786 30490 12617 -13093 26119 14775 -3088 6538 30168 35084 1882
8530A882l982J1145N198M1480O3422K4458k027o8078o5796J038k4052M33M3650
$$ 1882 -2100 9045 14243 55723 119145 143603 141576 73498 7702 8740 -15312 -14879 28771
8517B8771P625J2528m3990m8523K7842L4283N437m462l2340j9524L3995l0006
$$ 28771 36396 48924 4934 -43589 -15747 18536 23973 19511 -12829 -32353 1642 -28364
8505b8364Q248K7539O58l0910K0600J5835n089n3536Q444J9674l52J5613L1451
$$ -28364 -20116 7423 8081 -22829 -2229 13606 8517 -45019 -36575 -16901 -17253 -1640 29811
8492B9811L8761l0318k2628J6615J0414M3353K1434k2258l358O0303O3515R7708
$$ 29811 68572 38254 15626 32241 42655 86008 107442 85184 81826 142129 205644 303352
8480C03352M9240q0125j20420n2205k2796o882k3641q897j1734J8129K4213J1603
$$ 303352 352592 272467 152047 99842 77046 70164 46523 37626 25892 44021 68234 79837
8468G9837J0257L1774r449m9283r06j7320l2449j2738O012k122L5793J1309j2115
$$ 79837 90094 121868 112419 63136 62230 44910 12461 -277 5735 3613 39406 50715 38600
8455C8600m189J2957J1339j1226k0590K4546l509R906Q185J1873K0623J7611J8931
$$ 38600 34411 47368 58707 47481 26891 51437 47928 57834 66019 77892 98515 116126 135057
8442A35057J7228J453m8225N214L0081J2583K9567R2169j9468m9272k8713o7279
$$ 135057 152285 153738 105513 110727 140808 153391 182958 275127 255659 206387 177674 110395
8430A10395k3687P182j747j1999n3957J3727k332J4781m26K1480Q858r117q547
$$ 110395 86708 93890 92143 80144 26187 39914 37582 52363 51937 73417 82275 73158 64611
8417F4611l1902j3596j1439M0837Q226l2238k545J5519o556j0343k9959L3220
$$ 64611 32709 19113 7674 48511 56737 24499 21954 37473 30917 20574 -9385 23835
8405B3835J5190L072M0918J4757n6667k0079o555K360R423L530m6717M5620K4225
$$ 23835 39025 42097 83015 97772 41105 21026 14471 16831 26254 29784 -16933 28687 52912
8392E2912k2649P756K6300K0370j3459K0803j3160j9501j6462j0768R958J684
$$ 52912 30263 38019 64319 84689 71230 92033 78873 59372 42910 32142 42100 43784
8380D3784Q650l2074o534K9695N9319L3606m0447l7860m8781k0838j0439J2924
$$ 43784 52434 20360 13826 43521 102840 136446 95999 58139 9358 -11480 -21919 -8995
8368h995L6793L7354k0737l613l367o72K8223k7516j6016o336Q540l554K9397
$$ -8995 27798 65152 44415 40802 37435 36763 64986 37470 21454 15118 23658 20104 49501
8355D9501K0143j4653j2152K850L709M905j4133j6815l088K4339N966j6949P103
$$ 49501 69644 54991 42839 45689 49398 54303 40170 23355 20267 44606 50572 33623 40726
8342D0726L0722M0289p855k1293l3098m3850K1762L7707K829j0857j1545j9143
$$ 40726 71448 111737 103882 82589 49491 5641 27403 65110 67939 57082 45537 26394
8330B6394J4725j2671m5935Q491J9650k5168J538j3114k508J4208k7533j973L3648
$$ 26394 41119 28448 -17487 -8996 10654 -14514 -12976 -26090 -28598 -14390 -41923 -43896 -10248
8317a0248J2348N089k3574j4232J2618J861l0099K0276K7186n323k3422q691j4099
$$ -10248 2100 7189 -16385 -30617 -17999 -16138 -46237 -25961 1225 -4098 -27520 -36211 -50310
8304e0310N1688K1546j1022J7092J3174L4474L6730Q0435M603p3251p0200l0065
$$ -50310 1378 22924 11902 28994 42168 76642 113372 193807 198410 125159 54959 24894
8292B4894k6673L066J1483j9404p496K8624J9604M5n1937r180J8000J5198j3921
$$ 24894 -1779 1287 12770 -6634 -14130 14494 34098 34143 -17794 -26974 -8974 6224 -7697
8279g697j3858j957J6007R393J4754J1898K409j4756k2661j1659K4498R311n3022
$$ -7697 -21555 -23512 -7505 1888 16642 28540 30949 16193 -6468 -18127 6371 15682 -37340
8266c7340k1937N695K965J8508K2991J5398J5389n71l505j6865Q92P709K4313
$$ -37340 -59277 -53582 -50617 -32109 -9118 6280 21669 21098 17593 728 1620 9329 33642
8253C3642J3547k27J1493M510l534k9364J6253O8921J1241k0302m4853j3145j9291
$$ 33642 47189 46962 58455 62965 59431 30067 46320 115241 126482 106180 61327 48182 28891
8240B8891j1961M5893R165J3270L9347K4570l755k2541j3021r454k7259k3189
$$ 28891 16930 62823 71988 85258 124605 149175 145420 122879 109858 100404 73145 49956
8228D9956m1367N771K0403l412K085o543l6166l1616j7174K7280M1239M4951K1048
$$ 49956 8589 14360 34763 31351 33436 26893 -9273 -40889 -58063 -30783 10456 55407 76455
8215G6455l0173j3247m848r358R916q504l2702j2425J9734K1621j9595J6449J5589
$$ 76455 46282 33035 28187 18829 28745 20241 -12461 -24886 -5152 16469 -3126 13323 28912
8202B8912j4812n060P912L33l935j2805M0285N037M4012K5825M8624K7829J5905
$$ 28912 14100 9040 16952 17285 13350 545 40830 45867 89879 115704 164328 192157 208062
8189B08062J2643l0867m9080k997l1608j6616m8671l3548K5348J3588j8718k0592
$$ 208062 220705 189838 140758 137761 106153 89537 40866 7318 32666 46254 27536 6944
8177F944j4074K4562J6660J256J4515m6800k34L8468J4744n633l8363l8755J594
$$ 6944 -7130 17432 34092 35348 49863 3063 2829 41297 56041 50408 12045 -26710 -25116
8164b5116M0403J2993j8006n524J1813J6452k9967j9766K7027L3337O775j0374
$$ -25116 15287 28280 10274 4750 16563 33015 3048 -16718 10309 43646 50421 40047
8152D0047o472k0306j9743k6789O569L8465J9963j2338L7128M9901N1235J5709
$$ 40047 33575 13269 -6474 -33263 -26694 11771 31734 19396 56524 106425 157660 173369
8140A73369k2326k4125K0624n6476j00o091l4236l0349N893r650L5223K7320j5702
$$ 173369 151043 126918 147542 91066 90966 84875 50639 20290 26183 16533 51756 79076 63374
8127F3374l3425j0365J6476K032k0211k2803j3192J1322L2087R856j8973K6353
$$ 63374 29949 19584 36060 38092 17881 -4922 -18114 -6792 25295 35151 16178 42531
8115D2531K236k3351J9042J702l1336J4131L2860o421m4896j5111N912J1012K3641
$$ 42531 44767 21416 40458 42160 10824 24955 57815 51394 6498 -8613 -2701 8311 31952
8102C1952q347j3036J3493j6752Q737J7826R081P890j8623k6282N723M5192K4639
$$ 31952 23605 10569 24062 7310 16047 33873 42954 50844 32221 5939 11662 56854 81493
8089H1493J4092m7786l4623O855K7136Q190l5636l8434j505L985Q168M6343L7863
$$ 81493 95585 47799 13176 20031 47167 55357 19721 -18713 -20218 -16233 -8065 38278 76141
8076G6141K6423m157k8056k555l389l7651l5869l982O6327k334n288j3174J7915
$$ 76141 102564 98407 70351 67796 64407 26756 -9113 -13095 53232 50898 45610 32436 50351
8063E0351k319j696Q954j2227J7279j4690m2675K437k1205l927K6932K4553m797
$$ 50351 48032 46336 55290 43063 60342 45652 2977 5414 -15791 -19718 7214 31767 26970
8050B6970J4539J2426k5497k8146j5599J2004L5870N3952J8154j2165l901k8336
$$ 26970 41509 53935 28438 292 -15307 -3303 32567 86519 104673 92508 88607 60271
8038F0271l4732m7105j2864J2029K3555n962K0491Q010j0348j3009R326N149J4213
$$ 60271 25539 -21566 -34430 -22401 1154 -4808 15683 23693 13345 336 9662 14811 29024
8025B9024J515m0986j8796K7145M929k743K3750J9979J491R336R73j3275j9608
$$ 29024 30539 -10447 -29243 -2098 2831 88 23838 43817 45308 54644 55617 42342 22734
8012B2734k4102j2849r50J8562j0479q49L311P022J1349k7251K7425M929M510
$$ 22734 -1368 -14217 -15167 3395 -7084 -7933 -4622 2400 13749 -13502 13923 18852 23362
7999B3362l698l814m0400j3242J7222K2877Q226J6107K3106K4509L731p155P998
$$ 23362 19664 15850 -24550 -37792 -20570 2307 10533 26640 49746 74255 77986 70831 78829
7986G8829L727K1421J1705j7323l6302J8794j7629k4010r321l9663R089k7669
$$ 78829 82556 103977 115682 98359 62057 80851 63222 39212 29891 -9772 -683 -28352
7974b8352N3468J0853n547k1202O717O568M6660J2255j5351k6901l7186m941L7375
$$ -28352 25116 35969 30422 9220 15937 22505 69165 81420 66069 39168 1982 -2959 34416
7961C4416l320j4318o3655j8933K1178J8239J7008L3877N693l6769j8810L2434
$$ 34416 31096 16778 -46877 -65810 -44632 -26393 -9385 24492 30185 -6584 -25394 7040
7949G040M0056j7289Q145K2090o3825k0900K3331j1914L494l1685J3288K5220
$$ 7040 47096 29807 37952 60042 -3783 -24683 -1352 -13266 -9772 -41457 -28169 -2949
7937b949L3506k8748k8661K0680O5999L6127R155k4215j3435l4169j0352k0802
$$ -2949 30557 1809 -26852 -6172 59827 95954 105109 80894 67459 33290 22938 2136
7925B136r324L3456M7487J8241m2002j291M3k7029k0757k595j6246j3009O309
$$ 2136 -7188 26268 73755 91996 49994 48703 48746 21717 960 -1635 -17881 -30890 -24581
7912b4581K5150O574K8431l2199k5222j7744P7892M7515L8534m3280n5144j8808
$$ -24581 569 7143 35574 3375 -21847 -39591 38301 85816 124350 81070 25926 7118
7900G118j0743j0221j3066n539J9452M097l3220J5836N7395K9195k6439j1483
$$ 7118 -3625 -13846 -26912 -32451 -12999 -8902 -42122 -26286 31109 60304 33865 22382
7888B2382J1015j157j6128k99k5936j0387m731k1940q549J9235M3931P344Q136
$$ 22382 33397 32240 16112 15813 -10123 -20510 -25241 -47181 -55730 -36495 7436 14780 22916
7875B2916k1663k32K3477K2906q102k0155k3716q522m756M0870N6591M934j352
$$ 22916 1253 1021 24498 47404 39302 19147 -4569 -13091 -17847 23023 79614 84548 83196
7862H3196k4922k3801k8828j2730l4827N612k2614o888K8569J6926O280n410L9833
$$ 83196 58274 34473 5645 -7085 -41912 -36300 -58914 -65802 -37233 -20307 -14027 -19437 20396
7849B0396N253j0493j993l2795l2485M7908L8005K8133j011n9919n7735J8098
$$ 20396 25649 15156 13163 -19632 -52117 -4209 33796 61929 60918 999 -56736 -38638
7837c8638L9694j855j0871J0728J2848k8588L509J293K6037K9662j5218l8708
$$ -38638 1056 -799 -11670 -942 11906 -16682 -13173 -11880 14157 43819 28601 -10107
7825a0107L54M5284J5565j4075l6098q67n879J0587J4181O416o121J1163K9178
$$ -10107 -9753 35531 51096 37021 923 56 -5823 4764 18945 25361 19240 30403 59581
7812E9581K4724j7272o050Q919K2005K5615k1090k6101j8995n4612j5838l966
$$ 59581 84305 67033 60983 69902 91907 117522 96432 70331 51336 -3276 -19114 -23080
7800b3080J9748J6108Q165Q311j1581j0263L32N80l554l6481M9786K8486l3554
$$ -23080 -3332 12776 20941 29252 17671 7408 7740 8320 4766 -31715 18071 46557 13003
7787A3003J1951j3822r758K4587Q974l1931r931Q124O323k3608J8263j4312N1
$$ 13003 24954 11132 1374 25961 34935 3004 -6927 1197 7520 -16088 2175 -12137 -12086
7774a2086J4893r704J6052O475K6581j4846O245L5656l2759k114k9384l366K8462
$$ -12086 2807 -6897 9155 15630 42211 27365 33610 69266 36507 34393 5009 1643 30105
7761C0105q723k277r674K2729L5745k3185l4729k6675O764k5897Q095J8472o660
$$ 30105 21382 19105 9431 32160 67905 44720 9991 -16684 -9920 -35817 -27722 -9250 -15910
7748a5910j3378j9763M046K624j1457J234q552J2531j2279J1033K980K6526K5655
$$ -15910 -29288 -49051 -45005 -42381 -53838 -52604 -61156 -48625 -60904 -49871 -46891 -20365 5290
7735E290J114J7213k3201m5503J4322J2260j4456O455j2081M3202L296k8668M4401
$$ 5290 6404 23617 416 -45087 -30765 -18505 -32961 -26506 -38587 4615 7911 -20757 23644
7722B3644L5058p670l4340k5344L8484K016j4055m7977k798L362p412J2580l445
$$ 23644 58702 51032 16692 -8652 29832 31848 17793 -30184 -32982 -29620 -37032 -24452 -27897
7709b7897l0710K0490L0744l1311j5606j2299r258j3335K1630l691M4591O438
$$ -27897 -58607 -38117 -7373 -38684 -54290 -66589 -75847 -89182 -67552 -71243 -26652 -20214
7697b0214J5396K7985J5398N498j9007o02j6408k9509k5878P338m673j774K7260
$$ -20214 -4818 23167 38565 44063 25056 24454 8046 -21463 -47341 -40003 -44676 -46450 -19190
7684a9190K2438K0120l249j9741r557O149K5634k4104l9283k8678L3866O539k9380
$$ -19190 3248 23368 20119 378 -9179 -3030 22604 -1500 -40783 -69461 -35595 -29056 -58436
7671e8436k412K5080k3195k38K1798M9982N6602k3245o3190k3295q438M5737L972
$$ -58436 -60848 -35768 -58963 -59201 -37403 12579 69181 45936 -17254 -40549 -48987 -3250 722
7658G22J3193n8508k9156K215J8855J5343j3664j4416J1129K7270R99K0951m549
$$ 722 13915 -44593 -73749 -71534 -52679 -37336 -51000 -65416 -54287 -27017 -26018 -5067 -9616
7645i616J2961R572j3844j3471M1198j3107k9807K8132j1598k5683l894j4679
$$ -9616 3345 12917 -927 -14398 26800 13693 -16114 12018 420 -25263 -29157 -43836
7633d3836o798P1440K5087j8573l8110k5335l2530L7822M2349n0899r793j2567
$$ -43836 -50634 20806 45893 27320 -10790 -36125 -68655 -30833 11516 -39383 -49176 -61743
7621f1743L0981K3813n673R81k3891q867p227M0882j2642j2259K6018p527O969
$$ -61743 -30762 -6949 -12622 -11641 -35532 -44399 -51626 -10744 -23386 -35645 -9627 -17154 -10185
7608a0185K0850K085K5293M059l3291k3392k033M5697k688k0m59k572K5620j0964
$$ -10185 10665 12750 38043 42102 8811 -14581 -16614 29083 26395 26375 25916 23344 48964 38000
7594C8000k3467l123k189J077K7816J8692k8022J2519K2852j0901m3754J457J0793
$$ 38000 14533 11410 9221 10298 38114 56806 28784 41303 64155 53254 9500 10957 21750
7581B1750J772K2292M889j2981k2866n0126q942K3789p083P306n1984j2232J8773
$$ 21750 23522 45814 50703 37722 14856 -35270 -44212 -20423 -27506 -20200 -72184 -84416 -65643
7568f5643M037M3214J5359j5996O419J5831j296j3143O758r790k9233j4447N7377
$$ -65643 -61606 -18392 -3033 -19029 -12610 3221 1925 -11218 -4460 -14250 -43483 -57930 -553
7555e53K0922N002k7576k4558L2281Q096m421q595K8680j2097q283K8949m617
$$ -553 20369 25371 -2205 -26763 5518 13614 9193 598 29278 17181 8898 37847 33230
7542C3230j270Q338k6127j9125J8097o084k0724l2608M0630r768l0047J0193j7726
$$ 33230 31960 40298 14171 -4954 13143 7059 -13665 -46273 -5643 -15411 -45458 -35265 -52991
7529e2991k0855K1882M0956l185P655M4214O222k5470j7848l0184K5928L5115
$$ -52991 -73846 -51964 -11008 -14193 -6538 37676 43898 18428 580 -29604 -3676 31439
7517C1439J8386j1407k1783l573j0898j5296K9293R632l446j6660n677q736J9985
$$ 31439 49825 38418 16635 13062 2164 -13132 16161 25793 22347 5687 10 -8726 11259
7504A1259J1264j9661k3882m2173j5955L9178N2843L3994J949k3677k8267L577
$$ 11259 22523 2862 -21020 -63193 -79148 -39970 12873 46867 48816 25139 -3128 449
7492D49k0111J394J5149M5655J7211l0308m5600k5373l09Q057r827j135J1360
$$ 449 -19662 -18268 -3119 42536 59747 29439 -16161 -41534 -41843 -33786 -43613 -44748 -33388
7479c3388K4948J9307J6810j2150K5214j3826k4860M497J8899K3859p224k5620
$$ -33388 -8440 10867 27677 15527 40741 26915 2055 6552 25451 49310 42086 16466
7467A6466l7713J4498J9854J586K517J1119K3445J3816j057k3064l8284R836M841
$$ 16466 -21247 -6749 13105 14691 17208 28327 51772 65588 64531 41467 3183 13019 17860
7454A7860m6539K5919J1575Q568n553l4604L856j8018M0N2114P697J542L210k6296
$$ 17860 -28679 -2760 8815 17383 11830 -22774 -18918 -36936 -36896 15218 22915 24457 27667 1371
7440A371m9140L0003L3953J277k967k161M809o539q663Q011j0218k6793O845K635
$$ 1371 -47769 -17766 16187 17464 14497 12336 17145 10606 1943 9954 -264 -27057 -20212 -17577
7426a7577J0209j444L4756K7652l1230l3240J5830j4236j1491P144J9291Q319
$$ -17577 -7368 -8812 25944 53596 22366 -10874 4956 -9280 -20771 -13627 5664 13983
7414A3983m829N219J4106j048p301j8376M159p117j5341q195L7135m903l6431
$$ 13983 9154 14373 28479 27431 20130 1754 5913 -1204 -16545 -24740 12395 7492 -28939
7401b8939L8443K0078j6048l5411j4856j0919R208j0147j712L6804m6508j2250
$$ -28939 9504 29582 13534 -21877 -36733 -47652 -38444 -48591 -50303 -13499 -60007 -72257
7389g2257J0194P082K5460j757K5638K2418j0085k721N77l7870l9540j8311l0644
$$ -72257 -62063 -54981 -29521 -31278 -5640 16778 6693 3972 4549 -33321 -72861 -91172 -121816
7376a21816r774K9984k722J2226O2471J1751J2634J1137j8625n590N511Q708j048
$$ -121816 -131590 -101606 -104328 -92102 -29631 -17880 -5246 5891 -12734 -18324 -12813 -4105 -5153
7363e153j2138j5820N948R05J8050M5615N980k5470r388j3022J5677K7587J9824
$$ -5153 -17291 -33111 -27163 -26258 -8208 37407 43387 17917 8529 -4493 11184 38771 58595
7350E8595m4356M809K8254n064j0454j6483j8290J0292j0331l0623L7354J4716
$$ 58595 14239 19048 47302 42238 31784 15301 -2989 7303 -3028 -33651 3703 18419
7338A8419l1796j811m833l3579J4657p063k219J2835K5545j1643l3340n163K9127
$$ 18419 -13377 -15188 -20021 -53600 -38943 -46006 -48225 -35390 -9845 -21488 -54828 -59991 -30864
7325c0864J4814l693Q333j8013j2521k4421O2838L3376j8576k7003p966O346M0464
$$ -30864 -16050 -19743 -11410 -29423 -41944 -66365 -3527 29849 11273 -15730 -23696 -17350 23114
7312B3114J0800j2797j5011M781q353k0572j8911k8360l0675K9262L8964L4510
$$ 23114 33914 21117 6106 10887 2534 -18038 -36949 -65309 -95984 -66722 -27758 6752
7300F752K8321L948p862j8217j1793M3725K5793l906k3283k5866l085K1867J5063
$$ 6752 35073 39021 31159 12942 1149 44874 70667 66761 43478 17612 14527 36394 51457
7287E1457k6682j7260n101Q172l3781l6544P270K1082J7014j6240l8443j0184
$$ 51457 24775 7515 2414 10586 -23195 -59739 -52469 -31387 -14373 -30613 -69056 -79240
7275g9240L3222J8178j1203j8945l252L6319P341j8364l7782p741J6936L4867
$$ -79240 -46018 -27840 -39043 -57988 -61240 -24921 -17580 -35944 -73726 -81467 -64531 -29664
7263b9664L4109Q146j7094k2648K2803M7025j0113k0510l0675l0873k4281J9138
$$ -29664 4445 12591 -4503 -27151 -4348 42677 32564 12054 -18621 -49494 -73775 -54637
7251e4637J8649k0739M0660L5561M4556o498l5845j8563j3076k6077q587J6511
$$ -54637 -35988 -56727 -16067 19494 64050 57552 21707 3144 -9932 -36009 -44596 -28085
7239b8085K8773j4245j6505J8956Q566J7996j0978J3862K9512k135l3367J1994
$$ -28085 688 -13557 -30062 -11106 -2540 15456 4478 18340 47852 45717 12350 24344
7227B4344J4695k138Q154P61k8227M173k6426j6139J7612L5105J3725l4296j9538
$$ 24344 39039 36901 45055 45816 17589 21762 -4664 -20803 -3191 31914 45639 11343 -8195
7214h195M259k1325k8513j8241K5030K401K1209k655J7130K2955R276k1481N833
$$ -8195 -3936 -25261 -53774 -72015 -46985 -44584 -23375 -26030 -8900 14055 23331 1850 7683
7201G683L8071j3939j3508n536k7456o0276K0526L1109M3039R300j6257L5565
$$ 7683 45754 31815 18307 12771 -14685 -74961 -54435 -23326 19713 29013 12756 48321
7189D8321k535j8461j8625j4928j0077k6105J62J1242J1126J3660R436l6431j5000
$$ 48321 45786 27325 8700 -6228 -16305 -42410 -42248 -31006 -19880 -6220 3216 -33215 -48215
7176d8215K303J3226l0655k8788P117L7930m269k7591L1182K2778l2962l6147
$$ -48215 -45912 -32686 -63341 -92129 -85012 -47082 -51351 -78942 -47760 -24982 -57944 -94091
7164i4091N1850N8166j5863k5364p023k052J1934k1061m2727J698K2336M3634
$$ -94091 -42241 15925 62 -25302 -32325 -34377 -22443 -43504 -86231 -84533 -62197 -18563
7152a8563Q797j0991k3234M637J4124m371O030R159L267j1186K2618R767m1686
$$ -18563 -9766 -20757 -43991 -39354 -25230 -29601 -23571 -14412 -11145 -22331 287 10054 -31632
7139c1632R240l082j7606m6667N268L7222J3569n7162j1580J7674n701K2000Q737
$$ -31632 -22392 -25474 -43080 -89747 -84479 -47257 -33688 -90850 -102430 -84756 -90457 -68457 -59720
7126e9720K3959L9093K1676N005l0657m365k8981k4268m564J2256K0987R915J6934
$$ -59720 -35761 3332 25008 30013 -644 -5009 -33990 -58258 -62822 -50566 -29579 -19664 -2730
7113b730K5994n506k095q871k3110J9760P498m082j1018r724O00K3233J2218j2874
$$ -2730 23264 17758 15663 6792 -16318 3442 10940 6858 -4160 -13884 -13284 9949 22167 9293
7099I293q512J3388N985k2960J402L4005m602j5177k6220p23J1141j001l515J2405
$$ 9293 781 14169 20154 -2806 -1404 32601 27999 12822 -13398 -14121 -2980 -3981 -7496 4909
7085D909j1294l5626L1923J4411k5750K2755K3957m903N76n050J4104l2437n9165
$$ 4909 -6385 -42011 -10088 4323 -21427 1328 25285 20382 20958 15908 30012 -2425 -61590
7072f1590J1635J9275O826j1941L5009K2363K4338L7810j2413n373l5418o7959
$$ -61590 -49955 -30680 -23854 -35795 -786 21577 45915 83725 71312 65939 30521 -37438
7060c7438Q835J9606J8298N7832N484K201m3333m7367j6118K7248O088l521K0298
$$ -37438 -28603 -8997 9301 67133 72617 74818 31485 -15882 -32000 -4752 1336 -2185 18113
7047A8113K0405k0187J3386L513k2185p864L7914o473K958K8496k4301m0389J3432
$$ 18113 38518 18331 31717 35230 13045 5181 43095 36622 39580 68076 43775 3386 16818
7034A6818K6605K0k9455k5905M643J4717j9106M370R746L3530l3469j7327J7201
$$ 16818 43423 43443 13988 -11917 -7274 7443 -11663 -7293 2453 35983 2514 -14813 2388
7021B388j2415K5051K1392l270j6363J9754K6407J1352k6291l7217j7718l4235
$$ 2388 -10027 15024 36416 33146 16783 36537 62944 74296 48005 10788 -6930 -41165
7009d1165j8288L0841L6139J116Q297j4867J6039J2866R661k6154k2453J4514
$$ -41165 -59453 -28612 7527 8643 16940 2073 18112 30978 40639 14485 -7968 6546
6997F546p976j0982k917J7988j113k2907K0231L0930k433o6959m8131J8405j9935
$$ 6546 -1430 -12412 -15329 2659 1546 -21361 -1130 29800 27367 -39592 -87723 -69318 -89253
6984h9253J9474K4777M0337K7520L506N719j9040k1429j0134j5506N477N7968
$$ -89253 -69779 -45002 -4665 22855 26361 32080 13040 -8389 -18523 -34029 -28552 29416
6972B9416J0895k4045J6770j39l558M136j0576R37l247N690J4270j5365N418M717
$$ 29416 40311 16266 33036 32897 29339 33475 22899 23836 20589 26279 40549 25184 30602 35319
6958C5319K1250l6169o8266j3926K6541K7015k6320K5082J615q020j5525L7970
$$ 35319 56569 20400 -47866 -61792 -35251 -8236 -34556 -9474 -7859 -15879 -31404 6566
6946F566L5284n1983k1831K7371l922l2598j9074J0505M5992J4091K7677j0772
$$ 6566 41850 -10133 -31964 -4593 -8515 -41113 -60187 -49682 -3690 10401 38078 27306
6934B7306m987k9304O201j7075l6471L289L3842Q138j6451k0371L4358J8776j8784
$$ 27306 22319 -6985 -784 -17859 -54330 -51041 -17199 -9061 -25512 -45883 -11525 7251 -11533
6921a1533j9760J019n5l574J0904p640M985l51j1898j4499J370L6599n877P872
$$ -11533 -31293 -30274 -30329 -33903 -22999 -30639 -25654 -26005 -37903 -52402 -51032 -14433 -20310 -12438
6907a2438K2223N368n750P051M77k7282j6155M248q141K791P235j384K7580J0973
$$ -12438 9785 15153 9403 16454 16931 -10351 -26506 -22258 -30399 -27608 -20373 -21757 5823 16796
6893A6796k6985l0609j3247O941l286R142L9460J6681J9068k6836k5224k9909
$$ 16796 -10189 -40798 -54045 -47104 -50390 -41248 -1788 14893 33961 7125 -18099 -48008
6881d8008L472j0040k1520M868Q181L9111k665n025J3285J624N285k5823k1946
$$ -48008 -44536 -54576 -76096 -71228 -63047 -23936 -26601 -31626 -18341 -16717 -11432 -37255 -59201
6868e9201J1716L009N997j2208Q492K6430L574M6672L6325j1033n917q011l2944
$$ -59201 -47485 -44476 -38479 -50687 -42195 -15765 -12191 34481 70806 59773 53856 45845 12901
6855A2901l3438L081l2949j7503j5311J3521K7182q597R366M016K0290J7507j4256
$$ 12901 -20537 -17456 -50405 -67908 -83219 -69698 -42516 -51113 -41747 -37731 -17441 66 -14190
6842a4190k1342K130J9675p327P407j7723o434j1218P9L7473J2512l1159L2085
$$ -14190 -35532 -33402 -13727 -21054 -13647 -31370 -37804 -49022 -48943 -11470 1042 -30117 1968
6829A968k1704l4581M3352N5924K3911P548j149k4559l1712o098l6828q358J0060
$$ 1968 -19736 -54317 -10965 44959 68870 76418 75269 50710 18998 12900 -23928 -32286 -22226
6816b2226j6057j4368m340N9726K9073l0616k1357j9496j0813k4805L154L401
$$ -22226 -38283 -52651 -56991 2735 31808 1192 -20165 -39661 -50474 -75279 -72125 -68724
6804f8724k967K9637J1998L3592L595L391m483M742j4127L854k6258k4650n588
$$ -68724 -71691 -42054 -30056 3536 7131 10522 6039 10781 -3346 508 -25750 -50400 -55988
6791e5988j1233K3017O8427L2068n3143K7187M379m4098q902n789j1741O079K5838
$$ -55988 -67221 -44204 24223 56291 3148 30335 34714 -9384 -18286 -24075 -35816 -29737 -3899
6778c899m819J2017O875j8328k228J0316K7652j0202O05q029l2430O322j4495
$$ -3899 -8718 3299 10174 -8154 -10382 -66 27586 17384 17989 9960 -22470 -16148 -30643
6765c0643O813K839K4423o074m2616J969L6682L834k4591K1886L0014j8692k0860
$$ -30643 -23830 -20991 3432 -2642 -45258 -43289 -6607 -2773 -27364 -5478 24536 5844 -15016
6752a5016k4272j1761J6373k3242j7693j6999K8588O563K7171J0404K8986N337
$$ -15016 -39288 -51049 -34676 -57918 -75611 -92610 -64022 -57459 -30288 -19884 9102 14439
6740A4439k8064m8043k7894L0727L3225P931J4082K772K6j7674k4345P281M0553
$$ 14439 -13625 -61668 -89562 -58835 -25610 -17679 -3597 -825 -799 -18473 -42818 -35537 5016
6727E016n96k0619j5270m183m450K0642N5765j1550l3796l7211J3389L2931k1858
$$ 5016 4420 -16199 -31469 -35652 -40102 -19460 36305 24755 -9041 -46252 -32863 68 -21790
6714b1790q127K1711n921L877q079m0216j1780N0488J7456l9802J4380K1848j6241
$$ -21790 -29917 -8206 -14127 -10250 -18329 -58545 -70325 -19837 -2381 -42183 -27803 -5955 -22196
6701b2196j5763K5476J9689J0809k0809q570K3996K2349M1722j0626m4824k4854
$$ -22196 -37959 -12483 7206 18015 -2794 -11364 12632 34981 76703 66077 21253 -3601
6689c601j4006m5643K6383L9201N9398o955o4771l6165L5001L6396Q931L909l253
$$ -3601 -17607 -63250 -36867 2334 61732 54777 -9994 -46159 -11158 25238 34169 38078 34825
6676C4825J3330P758k5441K173p83j1677k461J2335j6745J1004k5253n0305L948
$$ 34825 48155 55913 30472 32645 31862 20185 17724 30059 13314 24318 -935 -51240 -47292
6663d7292K2268J5942R381J6594K8590k8670K2571J91m3177l7545J1569K6953
$$ -47292 -25024 -9082 299 16893 45483 16813 39384 39575 -3602 -41147 -29578 -2625
6651b625j8284K159j9278l2683O061K5078J5660J9991J376k3366l5510J3869K508
$$ -2625 -20909 -18750 -38028 -70711 -64650 -39572 -23912 -3921 -2545 -25911 -61421 -47552 -45044
6638d5044J7144K5190N1934m5710k8211l4783J7900L2254R922J2817l7999j248
$$ -45044 -27900 -2710 49224 3514 -24697 -59480 -41580 -9326 596 13413 -24586 -25834
6626b5834L1674j2166L301J1960j4388o938L0019k213l1975j0975j8450r231L3029
$$ -25834 5840 -6326 -3025 8935 -5453 -12391 17628 15415 -16560 -27535 -45985 -55216 -22187
6613b2187P372k7354Q485M6659l916J3309m205k863R259l160J636k4043k890J8645
$$ -22187 -14815 -42169 -33684 12975 9059 22368 18163 15300 24559 21399 23035 -1008 -3898 14747
6599A4747j8690k2541j6214K2748M4016J0243k3482n2317J0047N231j7895Q603
$$ 14747 -3943 -26484 -42698 -19950 24066 34309 10827 -41490 -31443 -26212 -44107 -35504
6587c5504P832j0763K2792J5981L617j53m7094k6583L2126K3154L0828n492j6418
$$ -35504 -27672 -38435 -15643 338 3955 3802 -43292 -69875 -37749 -14595 16233 10741 -5677
6574e677P307J1938k1998k180j6738j6864K7173K7231J913L5419J45L755K5064
$$ -5677 1630 13568 -8430 -10610 -27348 -44212 -17039 10192 12105 47524 47669 51424 76488
6561G6488k7536q396l1686M24O674n735j1345k109r769j2389j1024L6207J7071
$$ 76488 48952 40556 8870 9294 15968 10233 -1112 -3221 -12990 -25379 -36403 -196 16875
6548A6875O103p429m3997q081K1417K3676r114j2466k2603n560J6801J3443N784
$$ 16875 22978 15549 -28448 -36529 -15112 8564 -550 -13016 -35619 -41179 -24378 -10935 -5151
6535e151J5143j5016L9565J8260j7601j9490K0852q169j2981j8897k0259k248
$$ -5151 9992 -5024 34541 52801 35200 15710 36562 28393 15412 -3485 -23744 -25992
6523b5992J350K0725l313l848O220j3790L3723M509j1145j7773r517Q087k8762
$$ -25992 -24642 -3917 -7230 -11078 -4858 -18648 15075 19584 8439 -9334 -18851 -10764 -39526
6510c9526m2478J0775J773L9743L7392K1471K9746K425K5981p355q7966j0041
$$ -39526 -82004 -71229 -69456 -29713 7679 29150 58896 61321 87302 79947 -8019 -18060
6498a8060K0865k816j3979l270n181J2114o741L4525j0055j6175j2983L572Q498
$$ -18060 2805 -11 -13990 -17260 -22441 -10327 -17068 17457 7402 -8773 -21756 -18184 -9686
6485i686K2354J0310k06o1092k5382j2488k4652K1940R965J5193K8428n053m392
$$ -9686 12668 22978 22772 -38320 -63702 -76190 -100842 -78902 -68937 -53744 -25316 -30369 -34761
6472c4761J570k8313J0027K4353N703M849K2212n428j2693q897l4551j3420J5285
$$ -34761 -33191 -61504 -51477 -27124 -21421 -16572 5640 212 -12481 -21378 -55929 -69349 -54064
6459e4064k073o62K0651m400j4507O192J6178j2150L954O179J2764N1614J2747
$$ -54064 -56137 -56799 -36148 -40548 -55055 -48863 -32685 -44835 -40881 -34702 -21938 29676 42423
6446D2423j832p227N765l9718m3373j5321N817J1705K5156R889M0543j7847k8304
$$ 42423 40591 33364 39129 -589 -43962 -59283 -53466 -41761 -16605 -6716 33827 15980 -12324
6433a2324M563j4337J31K9555K9523J9304j3851p059k8409l6437L1075Q005L8669
$$ -12324 -7761 -22098 -21967 7588 37111 56415 42564 35505 7096 -29341 1734 9739 48408
6420D8408K6749l8646m7867k0116q614p34j1213m142n0700J7601M7833L565j265
$$ 48408 75157 36511 -11356 -31472 -40086 -40820 -52033 -56175 -106875 -89274 -41441 -37876 -39141
6407c9141j4392l726K471o799Q824L705N458J024L4980M304J631P736k581k8666
$$ -39141 -53533 -57259 -54788 -61587 -52763 -49058 -43600 -42576 -7596 -3292 -1661 6075 3494 -25172
6393b5172J0461M574j9388j1365L959j6352j3299L7663K1597j7482K4477P004
$$ -25172 -14711 -10137 -29525 -40890 -36931 -53283 -66582 -28919 -7322 -24804 -327 6677
6381F677K0661l3857l4306K0430L8282J2918J0467K410n2696k8580J4835R251
$$ 6677 27338 -6519 -40825 -20395 17887 30805 41272 43682 -9014 -37594 -22759 -13508
6369a3508J1971j5866j9059k0465K4235L4772L0153J0989r55N544K3450j7726
$$ -13508 -1537 -17403 -36462 -56927 -32692 2080 32233 43222 42267 47811 71261 53535
6357E3535k2847O255N038Q442l2212j6879L6550J9799R971N510l1383m2349j6377
$$ 53535 30688 36943 41981 50423 18211 1332 37882 57681 67652 73162 41779 -570 -16947
6344a6947K711J4796L6717l4244j9822K0410N615N553k3023q816j9976k8071p560
$$ -16947 -14236 560 37277 3033 -16789 3621 9236 14789 -8234 -17050 -37026 -65097 -72657
6331g2657L0722M1756J592J6362m307j8362j5601j486k1361J4589k5204j0464
$$ -72657 -41935 -179 1413 17775 13468 -4894 -20495 -21981 -43342 -28753 -53957 -64421
6319f4421J5356M660k1609J3570J9820r701k4902q655J2400j8273n161R347L9537
$$ -64421 -49065 -44405 -66014 -52444 -32624 -42325 -67227 -75882 -63482 -81755 -86916 -77569 -38032
6306c8032M2207L0634J9828j55O787l1755n1599q883K5698J5264J300k4823p67
$$ -38032 4175 34809 54637 54482 61269 29514 -22085 -30968 -5270 9994 11294 -13529 -14296
6293a4296o573K109r414J8949L0613l0286j5625K868l4338j7572M0835M6306k2621
$$ -14296 -20869 -18760 -28174 -9225 21388 -8898 -24523 -21655 -55993 -73565 -32730 13576 -9045
6280i045l8139m8237K5907L7488J4981P648p36J7495Q123k4393O939K0187J0738
$$ -9045 -47184 -95421 -69514 -32026 -17045 -9397 -10133 7362 15485 -8908 -1969 18218 28956
6267B8956q023m1408k9159J6982k1015J0774J2535j6893J3233L3915J1218j5739
$$ 28956 20933 -20475 -49634 -32652 -53667 -42893 -30358 -47251 -34018 -103 11115 -4624
6255d624k2510l053k8831j3696M1393J1363p914J5188P783K101k4545j0348K2022
$$ -4624 -27134 -30187 -59018 -72714 -31321 -19958 -27872 -12684 -4901 -2800 -27345 -37693 -15671
6242a5671l918L9013j6970o929N485o933l903J8682J7204j3131l0017k394J4217
$$ -15671 -19589 19424 2454 -4475 1010 -5923 -9826 8856 26060 12929 -17088 -19482 -5265
6229e265j6989P311j563k5924j7055L4012J2529J8757j3740k7004L0871L4914
$$ -5265 -22254 -14943 -16506 -42430 -59485 -25473 -12944 5813 -7927 -34931 -4060 30854
6217C0854L2084K319l4869q795P512m141k7152j9924k5108K830L4502N820k031
$$ 30854 62938 65257 30388 21593 29105 24964 -2188 -22112 -47220 -44390 -9888 -4068 -6099
6204f099j3011m0031n007R514N6576J4367l000p372j624k3422j7663K8443L822
$$ -6099 -19110 -59141 -64148 -54634 1942 16309 13309 5937 4313 -19109 -36772 -8329 -4507
6191d507J686O0236k104k6428j6518l1210K69K207k0386l6082k7529K0988K128
$$ -4507 -2821 57415 55311 28883 12365 -18845 -18576 -16369 -36755 -72837 -100366 -79378 -77250
6178g7250K2963M5892K4924q167K2290P262K193l0642J4135j6200P798J5654P499
$$ -77250 -54287 -8395 16529 8362 30652 37914 40107 9465 23600 7400 15198 30852 38351
6165C8351k5648k342N02K4093J6430n156k2152j6827p505J9288n6273n4839L7328
$$ 38351 12703 10361 10863 34956 51386 46230 24078 7251 -254 19034 -37239 -92078 -54750
6152e4750P5566K6666r658m3890j7577K8494K804m3120k5170k467N5930J3741
$$ -54750 20816 47482 37824 -6066 -23643 4851 7655 -35465 -60635 -63102 -7172 6569
6140F569k1235j1410J0945K324l875J6413K1322j0660m2915k590M154J372J3177
$$ 6569 -14666 -26076 -15131 -12807 -16682 -269 21053 10393 -32522 -35112 -30958 -29586 -16409
6127a6409j0901k195m092R883m23l581n49K3873L357M1004K3369m8896j9140P00
$$ -16409 -27310 -29505 -33597 -23714 -24137 -27718 -28267 -4394 -1037 39967 63336 14440 -4700 -4000
6113d000Q839M2430l5915k6982P207k1553j1978J3431M1434J1335n5875k2144
$$ -4000 4839 47269 11354 -15628 -8421 -29974 -41952 -28521 12913 24248 -31627 -53771
6101e3771J8048K4986L8132l5219l3891J9529K664O445q61j4509J0442l71k241
$$ -53771 -35723 -10737 27395 -7824 -41715 -22186 -19522 -13077 -13938 -28447 -18005 -18376 -20617
6088b0617k3159j5364J0152o685J9288O4567j0679j7359k8812j3911o326j5779
$$ -20617 -43776 -59140 -48988 -55673 -36385 28182 17503 144 -28668 -42579 -48905 -64684
6076f4684Q376K0570J3006L528j9649J9097J4696L9402J0289j5619o5309k8824
$$ -64684 -56308 -35738 -22732 -19204 -38853 -19756 -5060 34342 44631 29012 -36297 -65121
6064f5121L1157o181n1543n530M8266K1852p59L4116l919J7081J5520L056N2859
$$ -65121 -33964 -40145 -91688 -97218 -48952 -27100 -27859 6257 2338 19419 34939 37995 90854
6051I0854k771q902j5606m5731n566K567J9996j7872j2981K7486q635l0181q968
$$ 90854 88083 79181 63575 17844 12278 14845 34841 16969 3988 31474 22839 -7342 -16310
6038a6310P162J8717J2047J3867k1440p312r10l2260j0938j4211j6188J3085L8751
$$ -16310 -9148 9569 21616 35483 14043 6731 5821 -26439 -37377 -51588 -67776 -54691 -15940
6025a5940M5936j1222l5977n581R218j92p657j0878J5753R640K5515m829l6335
$$ -15940 29996 18774 -17203 -22784 -13566 -13758 -21415 -32293 -16540 -6900 18615 13786 -22549
6012b2549j3297Q520M8694j3429o1182k838L2050M4341O683o939J9015J6957j2308
$$ -22549 -35846 -27326 21368 7939 -53243 -56081 -24031 20310 26993 20054 39069 56026 43718
5999D3718l6062M930K1564k3383K6758l5484k6063K6902n446J3064O615k8095
$$ 43718 7656 12586 34150 10767 37525 2041 -24022 2880 -2566 10498 17113 -10982
5987a0982k1585N498L1972L2152j3313j7899q894N757k4069j0406k955J9742J2947
$$ -10982 -32567 -27069 4903 37055 23742 5843 -3051 2706 -21363 -31769 -34724 -14982 -2035
5974b035l5450k2547n431O2874J8616Q792L1940l1384k3038l850k6979K2050p120
$$ -2035 -37485 -60032 -65463 -2589 16027 24819 56759 25375 2337 -1513 -28492 -6442 -13562
5961a3562k1251j3030L0696J6600m906K885k0215j3670K2860K2962j555M001j549
$$ -13562 -34813 -47843 -17147 -547 -5453 -2568 -22783 -36453 -13593 9369 7814 11815 10266
5948A0266n474j421Q13k9762J3975J609J3221J1510j5845l3409j7097J5713m666
$$ 10266 4792 3371 4184 -25578 -11603 -9994 3227 14737 -1108 -34517 -51614 -35901 -40567
5935d0567j2901P150p195J0131J0752k3098J0172K5122J81K2864Q110k8956j8015
$$ -40567 -53468 -46318 -53513 -43382 -32630 -55728 -45556 -20434 -20253 2611 10721 -18235 -36250
5922c6250j8294M261K2900L1843L1123J3367j2536k6372p205K8221j2465j0375
$$ -36250 -54544 -50283 -27383 4460 35583 48950 36414 10042 2837 31058 18593 8218
5910H218K7321J5032q834k6514n2701k7447P424R144K2826N2621M186k0499l8661
$$ 8218 35539 50571 41737 15223 -37478 -64925 -57501 -48357 -25531 27090 31276 10777 -27884
5897b7884m3107k7949J7396N6242K4684r759n331k1067M862R988q552o630K012
$$ -27884 -70991 -98940 -81544 -25302 -618 -10377 -15708 -36775 -31913 -21925 -30477 -37107 -35095
5884c5095K8299J5682m5604j5092L749L5070L8095J8864j2785k2326M356o851
$$ -35095 -6796 8886 -36718 -51810 -48061 -12991 25104 43968 31183 8857 13213 6362
5872F362q641R711K6268j409k325j2416p266J3669J1061l8968N95J8629k0616
$$ 6362 -2279 7432 33700 32291 29966 17550 10284 23953 35014 -3954 -3359 15270 -5346
5859e346n5978J4444p603J2923L8539K8565J3547K9053j5612l1838j95j8726K1843
$$ -5346 -61324 -46880 -54483 -41560 -3021 25544 39091 68144 52532 20694 20499 1773 23616
5846B3616K0910J0671o387k1824m8923k3807N397J6910L371k4867N602K4514k4526
$$ 23616 44526 55197 48810 26986 -21937 -45744 -40347 -23437 -20066 -44933 -39331 -14817 -39343
5833c9343l9224L7868L4174l3268k8177K4744j9981M905N2237j1818J3944R155
$$ -39343 -78567 -40699 -6525 -39793 -67970 -43226 -63207 -58302 -6065 -17883 -3939 5216
5821E216j3368K8247k5650m7718l2530p662N48N0585L7055L4814K141j9101N241
$$ 5216 -8152 20095 -5555 -53273 -85803 -93465 -92917 -42332 -5277 29537 31678 12577 17818
5808A7818k4808n762J1472k980J066L705k558p052J7563l4216J7699j0404j389
$$ 17818 -6990 -12752 -1280 -4260 -3194 511 -2047 -9099 8464 -25752 -8053 -18457 -19846
5795a9846j0059K0211Q721L697J8876k4326k581k3968k8756J1478J8136P333J3907
$$ -19846 -29905 -9694 -973 2724 21600 -2726 -5307 -29275 -58031 -46553 -28417 -21084 -7177
5782g177Q820l417k7312l7718J4367K0823j3878J8297O0650p569J0608k3359m4507
$$ -7177 1643 -1774 -29086 -66804 -52437 -31614 -45492 -27195 33455 25886 36494 13135 -31372
5769c1372m1403o342M3384L9815M361K3526P913k4935k0513l7188L484J9583J7387
$$ -31372 -72775 -79117 -35733 4082 8443 31969 39882 14947 -5566 -42754 -39270 -19687 -2300
5756b300J7132l1264m7771J8244N3316l020k8512n835L9997L2278L6963k2685
$$ -2300 14832 -16432 -64203 -45959 7357 4337 -24175 -30010 9987 42265 79228 56543
5744E6543l5831n142o4598m8100n883K8357O518q846J1011N859K4247N7238j2035
$$ 56543 20712 15570 -49028 -97128 -103011 -74654 -68136 -76982 -65971 -60112 -35865 21373 9338
5731I338k4038K0309o547P53J0936R024N950k6387n2203O928L5436J2512P049
$$ 9338 -14700 5609 -938 -185 10751 19775 25725 -662 -52865 -45937 -10501 2011 9060
5718I060j0807j3683k1483l8836J3740K9099R746L9989K349n623N2356J434l2410
$$ 9060 -1747 -15430 -36913 -75749 -62009 -32910 -23164 16825 19174 13551 65907 67341 34931
5705C4931n618j699j128k2385l0937q862L5711J4409j5219j0554Q178J2643j2733
$$ 34931 29313 27614 26486 4101 -26836 -35698 13 14422 -797 -11351 -3173 9470 -3263
5692c263n267K7945j1576j7498P541K3825P915m523j8898J416J119K274j606J7554
$$ -3263 -8530 19415 7839 -9659 -2118 21707 29622 25099 6201 7617 8736 11010 9404 26958
5678B6958k7538j3833K7927n56j7630j8757k358n275J3438J4719R4k1747j9244
$$ 26958 -580 -14413 13514 12958 -4672 -23429 -25787 -31062 -17624 -2905 -2811 -24558 -43802
5665d3802k0651o346M581K0817Q908J3634k6622M238K0278J6583K6068j4610m6999
$$ -43802 -64453 -70799 -66218 -45401 -36493 -22859 -49481 -45243 -24965 -8382 17686 3076 -43923
5652d3923n625k867J941K3124L9675K2265L879L542l5346n2144J801K5561k4225
$$ -43923 -49548 -52415 -50474 -27350 12325 34590 38469 42011 6665 -45479 -43678 -18117 -42342
5639d2342m6175p714N1808M3948j4515n072l8681p469M1660O880J8299J050L490
$$ -42342 -88517 -96231 -44423 -475 -14990 -20062 -58743 -66212 -24552 -17672 627 1677 5167
5626E167K971L005l6689j3843O846m4074j3285L5434K5200o972j4122J0767J4049
$$ 5167 8138 11143 -25546 -39389 -32543 -76617 -89902 -54468 -29268 -36240 -50362 -39595 -25546
5613b5546k525l4586J5329n170L2568L1292m067k4571p309n0271M162L9331J6358
$$ -25546 -28071 -62657 -47328 -52498 -19930 11362 7295 -17276 -24585 -74856 -70694 -31363 -15005
5600a5005L2630j1257j311L6648j7636j9758J1810J137J1380J2064n415K2168
$$ -15005 17625 6368 5057 41705 24069 4311 16121 17258 28638 40702 35287 57455
5588E7455M395l9788m4814m377J0810L0042O773r169J66j968J8002L965k0599
$$ 57455 61850 22062 -22752 -27129 -16319 13723 20496 11327 11493 9525 27527 31492 10893
5575A0893J5362r170K5971j2417J2421k2072m0736o115K3897p16j6424j5366J7410
$$ 10893 26255 17085 43056 30639 43060 20988 -19748 -25863 -1966 -2682 -19106 -34472 -17062
5562a7062J0575J7619L2114j3312n2841l3852K705L566J0449o827j7957K0799
$$ -17062 -6487 11132 43246 29934 -22907 -56759 -54054 -50488 -40039 -46866 -64823 -44024
5550d4024J0019R122j8015K6981K2616m0009l8474J6028N6725K2241k3291K891
$$ -44024 -34005 -24883 -42898 -15917 6699 -33310 -71784 -55756 969 23210 -81 2810
5538B810j9424J2501L029N737q111j8072l767o071j103j3601J6807L3775K5620
$$ 2810 -16614 -4113 -1084 4653 -3458 -21530 -25297 -31368 -32471 -46072 -29265 4510 30130
5525C0130K025k2503k1348j0587L9704j2539J1713J940l0145K4743K8650k5634
$$ 30130 32155 9652 -11696 -22283 17421 4882 16595 18535 -11610 13133 41783 16149
5513A6149l5768j9193K0736J6274M006k3768m3375L821J2906J9907l0185j5828
$$ 16149 -19619 -38812 -18076 -1802 2204 -21564 -64939 -61118 -48212 -28305 -58490 -74318
5501g4318O20K0959J3434P474M2876p441j2005J6670M561K3348j6930N91k8460
$$ -74318 -73698 -52739 -39305 -31831 11045 3604 -8401 8269 12830 36178 19248 19839 -8621
5488h621j5110J3183K4580n446j778Q652J9016k5668j1430r940k8454K554O1086
$$ -8621 -23731 -10548 14032 8586 6808 15460 34476 8808 -2622 -12562 -41016 -38462 22624
5475B2624L043k4985M7263K5176m6101J7246n95L2880j9974k6628k6638K763K250
$$ 22624 25667 682 47945 73121 27020 44266 43671 76551 56577 29949 3311 6074 8324
5462H324J4556k669l0652j2397J4654J5648l1544r823M100k395K3286N896P099
$$ 8324 22880 20211 -10441 -22838 -8184 7464 -24080 -33903 -29803 -32198 -8912 -3016 4083
5449D083l940O099P377j2135M866M800R395K0178L920l7618l8565L134K6126L065
$$ 4083 143 6242 13619 1484 6350 11150 20545 40723 44643 7025 -31540 -28406 -2280 785
5435G85j2290m3792j8731j9441L245L6006J5144k4749l1954L3024J1779K5658
$$ 785 -11505 -55297 -74028 -93469 -90224 -54218 -39074 -63823 -95777 -62753 -50974 -25316
5423b5316M6967J1901k6380l9835K456m586K705K2923J5243j8093J9497N561J0603
$$ -25316 21651 33552 7172 -32663 -30207 -34793 -32088 -9165 6078 -12015 7482 13043 23646
5410B3646j6244J0852L75j9395J4715N53J7122j3802j6626J6372j3566j6279Q95
$$ 23646 7402 18254 18629 -766 13949 14502 31624 17822 1196 17568 4002 -12277 -11382
5397a1382P514j256l274j458R920k1785m420K3554j274m917k8790P896K8351j5135
$$ -11382 -3868 -5124 -8398 -9856 64 -21721 -26141 -2587 -3861 -8778 -37568 -29672 -1321 -16456
5383a6456k6214J3494J1446j4489j2318J2355M7395K957R169M269L653j6854L724
$$ -16456 -42670 -29176 -17730 -32219 -44537 -32182 15213 18170 27339 31608 35261 18407 22131
5370B2131R992m0657k5341p174l547p411K3152L6859j8902m3376k4442N3570L4937
$$ 22131 32123 -8534 -33875 -41049 -44596 -52007 -28855 8004 -10898 -54274 -78716 -25146 9791
5357I791r82k4949L8599M853l2457j9472j8617K7740M9538N2821M244j2083p409
$$ 9791 8809 -16140 22459 27312 -5145 -24617 -43234 -15494 34044 86865 91109 79026 71617
5344G1617J9718j4857m2867O723k8902k5828r169J3096K2879J5228j0256R439
$$ 71617 91335 76478 33611 40334 11432 -14396 -23565 -10469 12410 27638 17382 26821
5332B6821j7553k3004j4551r97L6376k9102m65M524P620K5084L2232k56k5593
$$ 26821 9268 -13736 -28287 -29284 7092 -22010 -22475 -17951 -10331 14753 46985 46729 21136
5319B1136o550m421k3123k5989L3990k8644Q117M9695l2405p0306j7197L1874
$$ 21136 14586 10165 -12958 -38947 -4957 -33601 -25484 24211 -8194 -78500 -95697 -63823
5307f3823K7907L3930K5924k0518l5681O044M539J1908j0109q723j5117k624N6566
$$ -63823 -35916 -1986 23938 3420 -32261 -26217 -21678 -9770 -19879 -28602 -43719 -46343 10223
5294A0223K9604k293l3001k0708K1077m700N455K7949K5207M2650K439l7222J0827
$$ 10223 39827 37534 4533 -16175 4902 202 5657 33606 58813 101463 103902 66680 77507
5281G7507l7156p1648j0893J0777J2631K8475k6583P151J7536K8587o494n7824
$$ 77507 40351 -31297 -42190 -31413 -18782 9693 -16890 -9739 7797 36384 29890 -27934
5269b7934J109K0100j0362k1802l904J3042j2969n287l901j5010l8141L4304L6306
$$ -27934 -26825 -6725 -17087 -38889 -42793 -29751 -42720 -48007 -51908 -66918 -105059 -70755 -34449
5256c4449N6320L5730j5280k965l6045J8402K3738K2704r103p1737j4612O600
$$ -34449 21871 57601 42321 39356 3311 21713 45451 68155 59052 -12685 -27297 -20697
5244b0697J2652R054L7831O363q63n9432l3425Q936J9454O442K9275r621J2139
$$ -20697 -8045 1009 38840 45203 44340 -15092 -48517 -39581 -20127 -13685 15590 5969 18108
5231A8108L039k7931l6512K4762O8463J4251o2613l7426J9955J1096J0646J1473
$$ 18108 21147 -6784 -43296 -18534 49929 64180 1567 -35859 -15904 -4808 5838 17311
5219A7311M636K807K739K1294O872j702m5443k1755L3434J3964n5510j638L211
$$ 17311 21947 24754 27493 48787 55659 53957 8514 -13241 20193 34157 -21353 -22991 -19780
5206a9780M1433M0913p697J967J601j9297K0271j9139P60j3132k8121N655J9312
$$ -19780 21653 62566 54869 56836 58437 39140 59411 40272 41032 27900 -221 5434 24746
5193B4746l1404k5668K8792L6567j8354l4112l1801L6484j9777k8614j7139K3834
$$ 24746 -6658 -32326 -3534 33033 14679 -19433 -51234 -14750 -34527 -63141 -80280 -56446
5181e6446L5110J8341n051N821J5059j5575l0174l8593J1316Q4015k3810n7562
$$ -56446 -21336 -2995 -8046 -2225 12834 -2741 -32915 -71508 -60192 23823 13 -57549
5169e7549J5148L5116N835L872J0433j380m3227m3438K9821L6742J5228J313m094
$$ -57549 -42401 -7285 -1450 2422 12855 11475 -31752 -75190 -45369 -8627 6601 7914 3820
5156C820J5142L5201m886k6419j7502J609K2200J3201p063k9260k4124k1058K8050
$$ 3820 18962 54163 49277 22858 5356 6965 29165 42366 35303 6043 -18081 -39139 -11089
5143a1089j7740o8415J2920M6907j4252N954L0770L599K4085J3603k1701k0377
$$ -11089 -28829 -97244 -84324 -37417 -51669 -45715 -14945 -11346 12739 26342 4641 -15736
5131a5736r440q328M3348L2178o65j32P076m844m1335J0643J5759j5431j2429
$$ -15736 -25176 -33504 9844 42022 41357 41225 48301 43457 2122 12765 28524 13093 664
5118F64J5092L978O239l901K5881k4636j9027l3897k9866k2701O255L5895l3899
$$ 664 15756 19734 25973 22072 47953 23317 4290 -29607 -59473 -82174 -75919 -40024 -73923
5105g3923q111L1727M3942L898j3979J5928l558N554M410J1634l271l5097j1627
$$ -73923 -82034 -50307 -6365 -2467 -16446 -518 -4076 1478 5888 17522 14251 -20846 -32473
5092c2473L2925N042K0638N901L702J2002p825p280j3334j9365K6670L2906j3431
$$ -32473 452 5494 26132 32033 35735 47737 39912 32632 19298 -67 26603 59509 46078
5079D6078l2099l831K2628J648n0582j1532J2425J2011j1221K7205L6807p691
$$ 46078 13979 10148 32776 34424 -16158 -27690 -15265 -3254 -14475 12730 49537 41846
5067D1846j0646m609j4406j7888L709k4995k9048K2297J5455k4144K899K7371
$$ 41846 31200 26591 12185 -5703 -1994 -26989 -56037 -33740 -18285 -42429 -39530 -12159
5055a2159p686m69o42L6419j7359j5218j4207K8137L1021K928L6448K8424k5221
$$ -12159 -19845 -20314 -20956 15463 -1896 -17114 -31321 -3184 27837 30765 67213 95637 70416
5042G0416o3908J0352N2847k0582k1978k7529k3884J4972P1667P145n4854m8288
$$ 70416 6508 16860 69707 49125 27147 -382 -24266 -9294 62373 69518 14664 -33624
5030c3624k2961K8218P069J7j9689K9023n862k3749R702m578j1334o226M1408
$$ -33624 -56585 -28367 -21298 -21281 -40970 -11947 -17809 -41558 -31856 -36434 -47768 -53994 -12586
5017a2586J4863o358j8377K4292Q267J4883M3720K4609K44k6737j5016O52l7308
$$ -12586 2277 -4081 -22458 1834 10101 24984 68704 93313 93557 66820 51804 52456 15148
5004A5148o0459m3680n969K5957N4909K8541m3545j3951j1839L427r796j2418
$$ 15148 -45311 -88991 -94960 -69003 -14094 14447 -29098 -43049 -54888 -51461 -61257 -73675
4992g3675M0233L0920J0110r759J9107K192J7163P914l8255j3831K4777L4559
$$ -73675 -33442 -2522 7588 -2171 16936 19128 36291 44205 5950 -7881 16896 51455
4980E1455k9722p798J5063K4447P894l6677j2833o680k0385m870p908N924j542
$$ 51455 21733 13935 28998 53445 61339 24662 11829 5149 -15236 -20106 -28014 -22090 -23632
4967b3632j20j2864J712k3732r571K3831L5834o969n589K7554N5064J3756r836
$$ -23632 -23752 -36616 -34904 -58636 -68207 -44376 -8542 -15511 -21100 6454 61518 75274 65438
4954F5438l2175n0977q1311L7761L2919J457P693M9003k913L378k0977m0867j7113
$$ 65438 33263 -17714 -99025 -61264 -28345 -26888 -19195 29808 26895 30273 9296 -31571 -48684
4941d8684K9447J3421J0470l0150l7448K8818Q313p82N4530J0494m609j9901P612
$$ -48684 -19237 -5816 4654 -25496 -62944 -34126 -25813 -26595 27935 38429 33820 13919 21531
4928B1531Q57p934k5729r198J2449j5201k017J4816k5606j6379r581K7870q678
$$ 21531 22388 14454 -11275 -20473 -8024 -23225 -25242 -10426 -36032 -52411 -61992 -34122 -42800
4915d2800j9319j028l829r716J3006K0198j040k2546j1291J1450L6965L6253l606
$$ -42800 -62119 -63147 -66976 -76692 -63686 -43488 -44528 -67074 -78365 -66915 -29950 6303 2697
4902B697p358M062l145K2537K380j4359m8805p90K099K6454K4013j0872l346J9168
$$ 2697 -4661 -599 -3744 18793 21173 6814 -41991 -42781 -40682 -14228 9785 -1087 -4433 14735
4888A4735j4652J0504Q801k1659j7633J292L488L4029J3911l0247k8326j9410
$$ 14735 83 10587 19388 -2271 -19904 -18612 -15124 18905 32816 2569 -25757 -45167
4876d5167J560J5094k1573p017L545N654J1524L2323P838J019j1772k6238N083
$$ -45167 -43607 -28513 -50086 -57103 -53558 -47904 -36380 -4057 3781 4800 -6972 -33210 -28127
4863b8127K2206K9023j3998q77j5522r11K2554n079K0610j5147o688j2349j1162
$$ -28127 -5921 23102 9104 8227 -7295 -8206 14348 9269 29879 14732 8044 -4305 -15467
4850a5467K3817J3572m1648k6272r915K8512J0401j4167k2343J6854K5773L7861
$$ -15467 8350 21922 -19726 -45998 -55913 -27401 -17000 -31167 -53510 -36656 -10883 26978
4838B6978j9256l0842k1110j9679J1182J1917k8010l392J0683Q775J2325K2919
$$ 26978 7722 -23120 -44230 -63909 -52727 -40810 -68820 -72212 -61529 -52754 -40429 -17510
4826a7510L7326o122j4107j3363K8474j7354k9508K594q619J4944J3087j5101
$$ -17510 19816 13694 -413 -13776 14698 -2656 -32164 -29570 -38189 -23245 -10158 -25259
4814b5259j9820J7098M7552K9798j270q89p0806o3681J3886L3981M1230n603j1885
$$ -25259 -45079 -27981 19571 49369 48099 47210 -23596 -87277 -73391 -39410 1820 -3783 -15668
4801a5668L2159j3559o9033p234N7600K7843l8784n108J6335J8155j4522j9278
$$ -15668 16491 2932 -66101 -73335 -15735 12108 -26676 -31784 -15449 2706 -11816 -31094
4789c1094K3788K2009K2521j539p148j5841l081J5565j5739J174r643l8861q294
$$ -31094 -7306 14703 37224 35685 28537 12696 9615 25180 9441 10615 972 -37889 -46183
4776d6183J6353r346J6781K5596l9363J2686j2904M204K3681l3676J543l660K859
$$ -46183 -29830 -39176 -22395 3201 -36162 -23476 -36380 -32176 -8495 -42171 -40628 -44288 -41429
4763d1429L1762M3839j6829n7427o256M369J3417J3030L799m985L5662K5276L847
$$ -41429 -9667 34172 17343 -40084 -46340 -41971 -28554 -15524 -11725 -16710 18952 44228 48075
4750D8075K025l3711m1993l5844M080N378M802N728K4695j2298n383R214K9785
$$ 48075 50100 16389 -25604 -61448 -57368 -51990 -47188 -41460 -16765 -29063 -34446 -25232 4553
4737D553O261j0637j1910K684O307j7817J1240K3030J8030l943J2575N178k0845
$$ 4553 10814 177 -11733 -9049 -2742 -20559 -9319 13711 31741 27798 40373 45551 24706
4724B4706o752j450r83r052M358O446l1677j1302K2672j277l6048Q859P831J6467
$$ 24706 17954 16504 15521 6469 10827 17273 -14404 -25706 -3034 -4311 -40359 -31500 -23669 -7202
4710g202K3444L1723J8757j2129k3801N080n536Q357p979k518M5809J5193N203
$$ -7202 16242 47965 66722 54593 30792 35872 30336 38693 30714 28196 74005 89198 94401
4697I4401M57j9867k1274n1795l6130k559Q672M624l659J3552R24K4386R565l8477
$$ 94401 94858 74991 53717 1922 -34208 -36767 -28095 -23471 -27130 -13578 -12654 11732 21297 -17180
4683a7180k2372K0183L8101k1133l2707K2046J2517J2944j9430P863n2920l2843
$$ -17180 -39552 -19369 18732 -2401 -35108 -13062 -545 12399 -7031 832 -52088 -84931
4671h4931L1458k010L0665j9187j1032J0774J4493J8767M6915j1670P467J8887
$$ -84931 -53473 -55483 -24818 -44005 -55037 -44263 -29770 -11003 35912 24242 31709 50596
4659E0596M9448l4646o3831O317j5304P643N51L7010K1056j0772k219J763k7245
$$ 50596 100044 65398 1567 7884 -7420 223 774 37784 58840 48068 45849 47612 20367
4646B0367q836l889K967J7001P50M769l0004k697L283k5800l9866K4261K0547
$$ 20367 11531 7642 10609 27610 28360 33129 3125 428 3711 -22089 -61955 -37694 -17147
4633a7147J7076R394k3251j2749l722k7526K2890r080K526O7754L6193j494j3592
$$ -17147 -71 9323 -13928 -26677 -30399 -57925 -35035 -44115 -41589 26165 62358 60864 47272
4620D7272k7070R731n1354k6835K4119K5426L264j9977k5093p445K8301J7981
$$ 47272 20202 29933 -21421 -48256 -24137 1289 4553 -15424 -40517 -47962 -19661 -1680
4608a680j1437k346j1807P251K6229k599P644L198j4498j4406j5531K8586J2915
$$ -1680 -13117 -15463 -27270 -20019 6210 3611 11255 14453 -45 -14451 -29982 -1396 11519
4595A1519p126j7854K6849M0088n099J2522M7093Q836J7139q133m9943l0081j9666
$$ 11519 4393 -13461 13388 53476 48377 60899 107992 116828 133967 125834 75891 45810 26144
4582B6144k1198n012K121K7162N597m5834j8346K7807L1837l2744k7881O954o672
$$ 26144 4946 -66 2055 29217 34814 -11020 -29366 -1559 30278 -2466 -30347 -23393 -30065
$$ [...]
##END NTUPLES=NMR SPECTRUM
##END=
