##TITLE=Analysis number 329528
Compound Code cc 12001
Project Code adrs
Chemist Name stores
##JCAMPDX= 6.0         $$ Bruker NMR JCAMP-DX V2.0
##DATA TYPE= NMR SPECTRUM
##DATA CLASS= NTUPLES
##ORIGIN= Bruker BioSpin GmbH
##OWNER= nmr
$$ XWIN-NMR		Version 3.5
$$ Tue Sep 11 10:49:12 2007 GMT Daylight Time (UT+1h)  MAYBRIDGE\nmr@NMR_250MHZ
##.OBSERVE FREQUENCY= 250.131544655141
##.OBSERVE NUCLEUS= ^1H
##.ACQUISITION MODE= SIMULTANEOUS (DQD)
##.ACQUISITION SCHEME= undefined
##.AVERAGES= 16
##.DIGITISER RES= 18
##SPECTROMETER/DATA SYSTEM= dpx250
##.PULSE SEQUENCE= zg30
##.SOLVENT NAME= DMSO
##.SHIFT REFERENCE= (INTERNAL, DMSO, 0, 16.522)
##AUDIT TRAIL= $$ (NUMBER, WHEN, WHO, WHERE, WHAT)
$$ ##TITLE= Audit trail, XWIN-NMR		Version 3.5
$$ ##JCAMPDX= 5.01
$$ ##ORIGIN= Bruker BioSpin GmbH
$$ ##OWNER= nmr
$$ C:\u/data/dgb/nmr/ADRS/530/pdata/1/auditp.txt
$$ ##AUDIT TRAIL=  $$ (NUMBER, WHEN, WHO, WHERE, WHAT)
(   1,<2007-09-11 10:48:44.77 +100>,<MAYBRIDGE\nmr>,<NMR_250MHZ>,
      <created by zg, POWCHK disabled, PULCHK disabled
       configuration hash MD5:
       76 6E 9A 78 1E 09 19 81 EC 84 63 8F B0 6A 59 2D
       data hash MD5: 64K
       A9 27 A6 3C AF 14 8E 7D 8A F3 F9 32 8E 1E 1E 9C>)
(   2,<2007-09-11 10:49:00.50 +100>,<MAYBRIDGE\nmr>,<NMR_250MHZ>,
      <Start of raw data processing
       ef LB = 0.3 FT_mod = 6 PKNL = 1 SI = 32K 
       data hash MD5: 32K
       88 83 48 1F DE 39 59 F2 2C F8 21 E0 1D FF B8 E4>)
(   3,<2007-09-11 10:49:03.13 +100>,<MAYBRIDGE\nmr>,<NMR_250MHZ>,
      <apk 
       data hash MD5: 32K
       6C D1 27 69 27 F9 3C 95 22 9E EF 8B 27 7B 74 0C>)
(   4,<2007-09-11 10:49:04.00 +100>,<MAYBRIDGE\nmr>,<NMR_250MHZ>,
      <abs ABSG = 5 
       data hash MD5: 32K
       74 D8 55 2D 0F 3A 92 F2 A2 F9 AE 6E 74 7C D5 47>)
$$ ##END=
$$ 
$$ hash MD5
$$ 8B 2C 1B 96 B2 F8 E1 E2 16 5F 87 07 3A 17 64 3F
##$RELAX= 
##$RELAX= 
##$RELAX= 
##$RELAX= 
##$RELAX= 
##$RELAX= 
##$RELAX= 
$$ Bruker specific parameters
$$ --------------------------
##$DU= <C:\u>
##$EXPNO= 530
##$NAME= <ADRS>
##$PROCNO= 1
##$TYPE= <nmr>
##$USER= <dgb>
##$AMP= (0..31)
100 100 100 100 100 100 100 100 100 100 100 100 100 100 100 100 100 100 
100 100 100 100 100 100 100 100 100 100 100 100 100 100 
##$AQSEQ= 0
##$AQ_mod= 3
##$AUNM= <au_zg>
##$AUTOPOS= <12 >
##$BF1= 250.13
##$BF2= 250.13
##$BF3= 250.13
##$BF4= 250.13
##$BF5= 500.13
##$BF6= 500.13
##$BF7= 500.13
##$BF8= 500.13
##$BYTORDA= 1
##$CFDGTYP= 0
##$CFRGTYP= 5
##$CHEMSTR= <none>
##$CNST= (0..31)
1 1 145 1 1 1 1 1 1 1 1 1 1 1 1 1 1 1 1 1 1 1 1 1 1 1 1 1 1 1 1 1 
##$CPDPRG= <>
##$CPDPRG1= <>
##$CPDPRG2= <>
##$CPDPRG3= <>
##$CPDPRG4= <mlev>
##$CPDPRG5= <mlev>
##$CPDPRG6= <mlev>
##$CPDPRG7= <mlev>
##$CPDPRG8= <mlev>
##$CPDPRGB= <>
##$CPDPRGT= <>
##$D= (0..31)
0 1 0 0 0 0 0 0 0 0.06 0 0 0 0 0 0 0.0002 0 0 0 0 0 0 0 0 0 0 0 0 0 0 
0 
##$DATE= 1189504123
##$DBL= (0..7)
120 120 120 120 120 120 120 120 
##$DBP= (0..7)
150 150 150 150 150 150 150 150 
##$DBP07= 0
##$DBPNAM0= <>
##$DBPNAM1= <>
##$DBPNAM2= <>
##$DBPNAM3= <>
$$ [...]
##$SUBNAM7= <"">
##$SUBNAM8= <"">
##$SUBNAM9= <"">
##$SW= 20.6930455092707
##$SWIBOX= (0..15)
0 0 3 0 0 0 0 0 0 0 0 0 0 0 0 0 
##$SW_h= 5175.983436853
##$TD= 65536
##$TD0= 1
##$TE= 298.16
##$TE2= 300
##$TE3= 300
##$TEG= 300
##$TL= (0..7)
0 120 120 120 120 120 120 120 
##$TP= (0..7)
150 150 150 150 150 150 150 150 
##$TP07= 0
##$TPNAME0= <>
##$TPNAME1= <>
##$TPNAME2= <>
##$TPNAME3= <>
##$TPNAME4= <>
##$TPNAME5= <>
##$TPNAME6= <>
##$TPNAME7= <>
##$TPOAL= (0..7)
0.5 0.5 0.5 0.5 0.5 0.5 0.5 0.5 
##$TPOFFS= (0..7)
0 0 0 0 0 0 0 0 
##$TUNHIN= 0
##$TUNHOUT= 0
##$TUNXOUT= 0
##$USERA1= <user>
##$USERA2= <user>
##$USERA3= <user>
##$USERA4= <user>
##$USERA5= <user>
##$V9= 5
##$VALIST= <valist>
##$VCLIST= <CCCCCCCCCCCCCCC>
##$VD= 0
##$VDLIST= <DDDDDDDDDDDDDDD>
##$VPLIST= <PPPPPPPPPPPPPPP>
##$VTLIST= <TTTTTTTTTTTTTTT>
##$WBST= 1024
##$WBSW= 4
##$XGAIN= (0..3)
0 0 0 0 
##$XL= 0
##$YL= 0
##$YMAX_a= 311939
##$YMIN_a= -311311
##$ZGOPTNS= <>
##$ZL1= 120
##$ZL2= 120
##$ZL3= 120
##$ZL4= 120
##$ABSF1= 16.522
##$ABSF2= -4.171173
##$ABSG= 5
##$ABSL= 3
##$ALPHA= 0
##$AQORDER= 0
##$ASSFAC= 0
##$ASSFACI= 0
##$ASSFACX= 0
##$ASSWID= 0
##$AUNMP= <proc_1d>
##$AZFE= 0.1
##$AZFW= 0.1
##$BCFW= 0
##$BC_mod= 0
##$BYTORDP= 0
##$COROFFS= 0
##$CY= 12.5
##$DATMOD= 1
##$DC= 0
##$DFILT= <>
##$DTYPP= 0
##$F1P= 14.0000005364418
##$F2P= -0.99999901652339
##$FCOR= 0.5
##$FTSIZE= 32768
##$FT_mod= 6
##$GAMMA= 0
##$GB= 0
##$INTBC= 1
##$INTSCL= 1
##$ISEN= 128
##$LB= 0.3
##$LEV0= 0
##$LPBIN= 0
##$MAXI= 10000
##$MC2= 0
##$MEAN= 0
##$ME_mod= 0
##$MI= 0
##$NCOEF= 0
##$NC_proc= -6
##$NLEV= 6
##$NOISF1= 0
##$NOISF2= 0
##$NSP= 0
##$NTH_PI= 0
##$NZP= 0
##$OFFSET= 16.522
##$PC= 1
##$PHC0= -116.2445
##$PHC1= 100.8836
##$PH_mod= 1
##$PKNL= yes
##$PPARMOD= 0
##$PSCAL= 4
##$PSIGN= 0
##$REVERSE= no
##$SF= 250.13
##$SI= 32768
##$SIGF1= 0
##$SIGF2= 0
##$SINO= 400
##$SIOLD= 32768
##$SREGLST= <1H.DMSO>
##$SSB= 0
##$STSI= 32768
##$STSR= 0
##$SW_p= 5175.98343685301
##$SYMM= 0
##$S_DEV= 0
##$TDeff= 65536
##$TDoff= 0
##$TI= <Analysis number 999999
Compound Code 99
Book Reference 9
Project Code 9>
##$TILT= no
##$TM1= 0
##$TM2= 0
##$TOPLEV= 0
##$USERP1= <user>
##$USERP2= <user>
##$USERP3= <user>
##$USERP4= <user>
##$USERP5= <user>
##$WDW= 1
##$XDIM= 32768
##$YMAX_p= 516343612
##$YMIN_p= -22311571
$$ End of Bruker specific parameters
$$ ---------------------------------
##NTUPLES= NMR SPECTRUM
##VAR_NAME=  FREQUENCY,     SPECTRUM/REAL,   SPECTRUM/IMAG
##SYMBOL=    X,             R,               I
##VAR_TYPE=  INDEPENDENT,   DEPENDENT,       DEPENDENT
##VAR_FORM=  AFFN,          ASDF,            ASDF
##VAR_DIM=   32768,         32768,           32768
##UNITS=     HZ,            ARBITRARY UNITS, ARBITRARY UNITS
##FACTOR=    0.157963299565203, 1,           1
##FIRST=     4132.6476996994, 0,             0
##LAST=      -1043.33573715361, 0,           0
##MIN=       -1043.33573715361, -22311571,   0
##MAX=       4132.6476996994, 516343612,     0
$$ Real data points
##PAGE= N=1
##DATA TABLE= (X++(R..R)), XYDATA
$$ [...]
24268h8688l68978P5044p02J06699R5689J8135P7477J52347n4880P2256j47474
$$ -88688 -457666 -382622 -383324 -276625 -180936 -162801 -85324 67023 12143 84399 -63075
24257f3075m5096K12157K30360p1821j69095j62824O9038q6533k2576L2863J81402
$$ -63075 -108171 103986 334346 262525 93430 -69394 -356 -86889 -109465 -76602 104800
24246A04800L1436j83086Q2559K46626l7908j86876K9141N263J81625k04544j28910
$$ 104800 136236 -46850 35709 282335 244427 57551 86692 91955 273580 69036 -59874
24235e9874J00111J43477N7761k2029j00460j52077j76060l507M28511J25595
$$ -59874 40237 183714 241475 219446 118986 -33091 -209151 -212658 215853 341448
24225C41448m1329R3544J1005p7639l29170O982K98653q0609j97004J43774k4731
$$ 341448 300119 393663 404668 327029 -2141 4841 303494 222885 25881 169655 144924
24214A44924J303J01677M9594k18210k27065k16227P2097L03114k4797L2874J72707
$$ 144924 146227 247904 297498 79288 -147777 -364004 -291907 11207 -13590 19284 191991
24203A91991k9028k92567Q88J45053R4147P533K5780Q262k42427k5347l2610N3626
$$ 191991 162963 -129604 -128716 16337 110484 118017 143797 152059 -90368 -115715 -148325 -94699
24191i4699r0525j4017J71861L4812L6057J37707j20631r0223N1213L08636L0427
$$ -94699 -185224 -199241 -27380 7432 43489 181196 60565 -29658 21555 330191 360618
24180C60618j21921o8851p5881p584j30895j91215J73893J92770J25215l7595
$$ 360618 238697 169846 93965 86381 -44514 -235729 -61836 130934 256149 218554
24170B18554l41963j20254R810K30323J40498r4279j12791J65910P5696P0396
$$ 218554 -123409 -243663 -233853 -3530 136968 42689 -70102 95808 171504 241900
24160B41900R6407k0540k64749k52863J80182J06759l4488j12041J46615J6400
$$ 241900 338307 317767 53018 -199845 -19663 87096 52608 -59433 87182 103582
24150A03582l7731n3742l42680o5383J13549K84232P5502k31481l9913J86137
$$ 103582 65851 12109 -330571 -395954 -282405 1827 77329 -154152 -194065 -7928
24140g928M0613L23726k1745q5552j43894P4390j28889j84494J49184m3351q9186
$$ -7928 32685 356411 334666 249114 105220 179610 50721 -133773 15411 -27940 -117126
24129a17126k39368k33064J70399o7082p1010J79011J46710K85987j36639j17194
$$ -117126 -356494 -589558 -419159 -486241 -557251 -378240 -231530 54457 -82182 -199376
24119a99376J55386J45642J6679J45659k19016k85452J6459P4865J10247l3893
$$ -199376 -43990 101652 118331 263990 44974 -240478 -224019 -149154 -38907 -72800
24109g2800j93477j66495M5664K19465J06620j20969m8226J48700M0036k594J84041
$$ -72800 -266277 -432772 -387108 -167643 -61023 -181992 -230218 -81518 -41482 -44076 139965
24098A39965P6345k9142n4926j06050k22189k03099j5151L9433J12578K28954
$$ 139965 216310 187168 132242 26192 -195997 -399096 -414247 -374814 -262236 -33282
24088c3282K7450k2985J93423J02507J26782m6188k37768q4339k39842k9011J49236
$$ -33282 -5832 -28817 164606 267113 393895 347707 109939 25600 -214242 -243253 -94017
24077i4017j19190J3360J4510j2358J00370K10701M9812n6188j74093k13751j51082
$$ -94017 -213207 -199847 -185337 -197695 -97325 113376 163188 107000 -67093 -280844 -431926
24066d31926J08291M8560N9618J38276J26668j31615O8125L1692j25472L2079
$$ -431926 -323635 -275075 -215457 -77181 49487 -82128 -14003 17689 -107783 -75704
24056g5704J45700J23295k40535n5485O1492J24348R1531L0425j9238j47251K0168
$$ -75704 69996 193291 -47244 -102729 -41237 83111 174642 205067 185829 38578 58746
24045E8746R3128J32381j27324j65107j1500Q1265j04066q2256j53307k9992K88130
$$ 58746 151874 284255 156931 -8176 -19676 61589 -42477 -124733 -278040 -308032 -19902
24034a9902o4936k49013J60168Q4027J53244K71176L66327j77911j72339q4974
$$ -19902 -84838 -333851 -173683 -89656 63588 334764 701091 523180 350841 265867
24024B65867p6131J23011J00447p8382l45779m0333P047r9506q4922j43342J3826
$$ 265867 189736 312747 413194 334812 -10967 -51300 -44253 -143759 -228681 -372023 -358197
24013c58197J25438Q5203L69260K6698o3979q6864J45798J37006j26509j00743
$$ -358197 -232759 -147556 221704 248402 184423 97559 243357 380363 253854 153111
24003A53111l96197K5615K56681J39304m7769o4563J51613n0801l900o0293l126
$$ 153111 -243086 -217471 39210 178514 130745 66182 217795 166994 163094 102801 99675
23992I9675K80926p8571k64991r0672J78999m644O1415J7288M5930j00112j03739
$$ 99675 380601 302030 37039 -53633 125366 120722 182137 199425 245355 145243 41504
23981D1504J19537L7163J00452J13416r0448P2836j39760j43958K883R1024L1147
$$ 41504 161041 198204 298656 412072 321624 394460 254700 110742 113625 204649 235796
23970B35796k18348j27006P0977k44023p951L60706k02575j5368K27448q6653
$$ 235796 17448 -109558 -38581 -282604 -290555 70151 -132424 -147792 79656 -6997
23960f997k7804J68934n0862l40949L9305K01985J22260j02818j00013J44816
$$ -6997 -34801 134133 83271 -257678 -218373 -16388 105872 3054 -96959 47857
23950D7857k47124k10280j33446L8553P4545J79064J40830j4292O134J30755Q217
$$ 47857 -199267 -409547 -542993 -504440 -429895 -250831 -110001 -124293 -118159 12596 20813
23939B0813q9636j11745K12526K63314N493n3846q9401k33399j23919J20823P9081
$$ 20813 -68823 -180568 31958 295272 300765 246919 157518 -75881 -199800 -78977 104
23928A04O5218J06430R5242k19926j07240J65926J97562j43245k07088m0622J22049
$$ 104 65322 171752 266994 47068 -60172 105754 303316 160071 -47017 -87639 34410
23917C4410J29033L0276M0774m7485j49630k01402j09228J70141L74692K76307
$$ 34410 163443 193719 234493 187008 37378 -164024 -273252 -103111 271581 547888
23907E47888k30577q3857k45898j89430J91479K52041k1008l20660N22K25519
$$ 547888 317311 233454 -12444 -201874 -10395 241646 220638 -100022 -99500 126019
23897A26019k24155J14531K35295L9999p8397q2039M9660J62021r5751k67349
$$ 126019 -98136 16395 251690 291689 213292 131253 180913 342934 247183 -20166
23887b0166m7326O3978M7796J40509k5453k9355Q4006o9967r7943L8344J9836
$$ -20166 -67492 -3514 44282 184791 159338 129983 213989 144022 46079 84423 104259
23876A04259K1676n4082J20951q4642j36845O7991J79052k62625p138P4152l6670
$$ 104259 125935 71853 192804 108162 -28683 39308 218360 -44265 -51403 22749 -13921
23865a3921r2497k16354o6529K48880Q3954Q021M1540n4079R4393J57380l3779
$$ -13921 -106418 -322772 -389301 -140421 -56467 -48446 -6906 -60985 33408 190788 157009
23854A57009j78725j32324J15183K16704m7543j59065j66321j00662j24906J53259
$$ 157009 -21716 -154040 -38857 177847 130304 -28761 -195082 -295744 -420650 -267391
23844b67391P5253q2762J46399O7977L688K57756M1202j80349j44972n5763P5787
$$ -267391 -192138 -274900 -128501 -60524 -56836 200920 242122 61773 -83199 -138962 -63175
23833f3175N9818O9555o9177N2204R0021P8907j51712N5198p8430k8655p2551
$$ -63175 -3357 66198 -2979 49225 139246 218153 66441 121639 43209 14554 -57997
23822e7997O884o0373j94409m4529J93054R9624p695K2415L34M3974p3289o2841
$$ -57997 -51113 -111486 -305895 -350424 -157370 -57746 -65441 -43026 -42692 1282 -72007 -134848
23810a34848J19064k426j23549K06752J21401K32622j12146j76218n5931q7271
$$ -134848 -15784 -18210 -141759 64993 186394 419016 306870 130652 74721 -12550
23800a2550M6803j60445M2357j0184j10276R1418K38153J8175j51724j99391j24047
$$ -12550 34253 -126192 -83835 -94019 -204295 -112877 125276 143451 -8273 -207664 -331711
23789c31711j32532K88813K42881n3510j63303J2586L5699J42366P2812J35016
$$ -331711 -464243 -175430 67451 13941 -149362 -136776 -101077 41289 114101 249117
23779B49117K40643j12383j08667m5041k01667j2797l85905j9490J32221l4287
$$ 249117 489760 377377 268710 223669 22002 9205 -376700 -396190 -263969 -298256
23769b98256j71023M8962o556P9185M7390M30891L3910J0m7254R444j2343J62186
$$ -298256 -469279 -420317 -426873 -347688 -300298 130593 164503 164513 117259 126703 114360 276546
23757B76546K1317k61748j92819K02995J19100j29244J28971q5456k66981M7769
$$ 276546 297863 36115 -156704 46291 165391 36147 165118 79662 -187319 -139550
23747a39550K72354P6973J7722L0570J34537j12236j39206j52572J64741R3339
$$ -139550 132804 209777 227499 258069 392606 280370 141164 -11408 153333 246672
23737B46672qj43089M6609l2847K87089j86135j18123J45436J43677k2893k52918
$$ 246672 246664 103575 150184 117337 404426 218291 100168 245604 389281 366388 113470
23726A13470k9613o6023j6812M5918j83050J13645J43649R1381q5870j15765j54162
$$ 113470 83857 17834 1022 46940 -136110 -22465 121184 212565 126695 10930 -143232
23715a43232J66690O857K0684J71687m5445j77506q8899r4329J36092K80881J07
$$ -143232 23458 30315 50999 222686 177241 -265 -89164 -183493 -47401 233480 233587
23704B33587k58459o8017L61q0142k6279l12132l35997m2264K89573L07364L90063
$$ 233587 -24872 -92889 -92528 -172670 -198949 -511081 -847078 -889342 -599769 -292405 97658
23693I7658J26761n3509O321l631j34974k26752J56508K00408n8600P7979r9285
$$ 97658 224419 170910 177231 173600 38626 -188126 -31618 168790 110190 188169 88884
23682H8884n2222M7387j23029j16859j62686K26070J17588l0675j49541j51j60213
$$ 88884 36662 84049 -38980 -155839 -318525 -92455 25133 -5542 -155083 -155234 -315447
23671c15447P1656K23956J05147k1586P6514Q5573J01039n9472j29157l70902
$$ -315447 -243791 -19835 85312 63726 140240 225813 326852 267380 138223 -232679
23661b32679j04648L35408N2793J11245j25599j9272j85436n6259K13237k5783
$$ -232679 -337327 -1919 50874 162119 36520 17248 -168188 -224447 -11210 -36993
23651c6993j12907j17221L4605m3624J33418q5030k30252L988K40411K15980O7634
$$ -36993 -149900 -267121 -232516 -276140 -142722 -227752 -458004 -454016 -213605 2375 70009
23640G0009j01034K15587r3734k02938l9564o8804l3121O2657J28411N8344L0171
$$ 70009 -31025 184562 90828 -112110 -151674 -220478 -253599 -190942 -62531 -4187 25984
23629B5984r907O2626l8355k86761O6098J79563L23189J45885o5795K73340J81883
$$ 25984 16077 78703 40348 -246413 -180315 -752 322437 468322 402527 675867 857750
23618H57750q7154l07800l10736l9065J47808N1571p7493j11675J17241n2513
$$ 857750 770596 462796 152060 112995 260803 312374 234881 123206 240447 187934
23608A87934k46091j85840k6467R7869k140J78726P7729J76665K0165O335L244
$$ 187934 -58157 -243997 -270464 -172595 -174735 3991 81720 258385 278550 284885 288129
23597B88129O8085o0446j22522q7406j85390l0589m1636J08737j45935R8478O5537
$$ 288129 356214 295768 173246 85840 -99550 -130139 -171775 -63038 -208973 -110495 -44958
23586d4958j44094J5692K2904P017J6601l1412q1960j48343J69557n2916L594
$$ -44958 -189052 -173360 -150456 -143439 -126838 -158250 -240210 -388553 -218996 -271912 -268318
23575b68318j4738N8979K72017J39938J4079j1458k46993M8243r5058o2002J33020
$$ -268318 -283056 -224077 47940 187878 201957 190499 -56494 -8251 -103309 -165311 -32291
23564c2291P2432j29211r8027j04913Q634j9204J12298K06775J82508K96420M2552
$$ -32291 40141 -89070 -187097 -292010 -283376 -302580 -190282 16493 199001 495421 537973
23553E37973m15112m82315k4037J76788J77366m7408q1799J56402J68766L6848
$$ 537973 122861 -359454 -383491 -206703 -29337 -76745 -158544 -2142 166624 203472
23543B03472k39289m3250J14081r0609M9959j04570k57741k0814K22670K64605
$$ 203472 -35817 -79067 35014 -55595 -5636 -110206 -367947 -388761 -166091 98514
23533I8514j2440j64654Q8479o8682n5232J4153J01801l4220j04861m2248J21295
$$ 98514 86074 -78580 9899 -58783 -114015 -99862 1939 -32281 -137142 -179390 -58095
23522e8095j75435k0684J45896j88050R2079M3326M5078K979M7915J23899K67438
$$ -58095 -233530 -254214 -108318 -296368 -204289 -160963 -115885 -112906 -64991 58908 326346
23511C26346L9884j51395j27332m3707K9837j4515o3989k19206o2800J9105P4812
$$ 326346 366230 214835 87503 43796 73633 59118 -4871 -224077 -286877 -267772 -192960
23500a92960r2072J60185J60762j50564j81632j4565j79979n3872J61396J85968
$$ -192960 -285032 -124847 35915 -114649 -296281 -310846 -490825 -544697 -383301 -197333
23490a97333r4765j63223j39713O9317O8778K94865J70786J00773j81935j13333
$$ -197333 -292098 -455321 -595034 -525717 -456939 -162074 8712 109485 -72450 -185783
23480a85783K2141l2023k21126r6290P1705R2874K0983J69098R3588J39825k2322
$$ -185783 -163642 -195665 -416791 -513081 -441376 -348502 -327519 -158421 -64833 74992 52670
23469E2670l0929K1572Q1251l82131k13004J149k1819J88214K26673O0925p5365
$$ 52670 21741 43313 124564 -257567 -470571 -469422 -491241 -303027 -76354 -15429 -90794
23458i0794O7096j26277J41804N2371Q6922J97024q6834L3943j19659m18602L8778
$$ -90794 -23698 -149975 -8171 44200 131122 328146 241312 275255 155596 -263006 -224228
23447b24228j02473j19784J3029Q3791K13690L4528j34195q6516O0938J33123
$$ -224228 -326701 -446485 -433456 -349665 -135975 -101447 -235642 -322158 -261220 -128097
23437a28097J08168n6208j18679p9655q0831m9780K63139M9174n0895K51440K80605
$$ -128097 -19929 -76137 -194816 -274471 -355302 -405082 -141943 -92769 -143664 107776 388381
23426C88381J38371j44772k11465l30573M9821J53231j1250K27817o8225p1995
$$ 388381 526752 381980 170515 -160058 -110237 42994 31744 259561 191336 119341
23416A19341j23329R815j60059k554l0124K1574J17348Q3609L8782L6147j82430
$$ 119341 -3988 5827 -154232 -156786 -186910 -165336 -47988 35621 74403 110550 -71880
23405g1880j22264r4462o2647n5409n3870n7727J3213K71018L45051m3806k6196
$$ -71880 -194144 -288606 -351253 -406662 -460532 -518259 -505046 -234028 111023 67217 41021
23394D1021j39125j72901j66404n1876J62176K01688l6710j53961O6646R4023
$$ 41021 -98104 -271005 -437409 -489285 -327109 -125421 -162131 -316092 -249446 -155423
23384a55423J13173m4561L8414J06283k29016j06704M4246K16001R3102J20860
$$ -155423 -42250 -86811 -48397 57886 -171130 -277834 -233588 -17587 75515 196375
23374A96375j46241m3428O6339J05797m0020J0259k1186j03323l89211j34305
$$ 196375 50134 6706 73045 178842 138822 149081 127895 24572 -364639 -498944
23364d98944O5378J26096J89197Q689J16077k8752k758R9147K22405L0861k13295
$$ -498944 -433566 -307470 -118273 -109584 6493 -22259 -25017 74130 296535 327396 114101
23353A14101J810L311j10851n8012j61048M2067P2137N2748Q5489k1355j124j51439
$$ 114101 115911 119222 8371 -49641 -210689 -168622 -96485 -43737 41752 20397 19273 -132166
23341a32166K71402J00658j47583R1839Q0833K7573j23328J30914K09549j15775
$$ -132166 139236 239894 92311 184150 264983 292556 169228 300142 509691 393916
23331C93916j7344M5049j30154j77563l85097k37350J46154K18593J47024Q9205
$$ 393916 376572 421621 291467 113904 -271193 -508543 -362389 -143796 3228 92433
23321I2433R5661q745j50410J12944K41942J92279K552j3415k21891k57244P3773
$$ 92433 188094 179349 28939 141883 383825 576104 578656 565241 343350 86106 159879
23310A59879R4242j87516k51015k27432K50253K4994o1751J22831M11020K28635
$$ 159879 254121 66605 -184410 -411842 -161589 -136595 -198346 -75515 335505 564140
23300E64140j50579l37364Q6301j6650R89Q1832n8971p9755K49385J40902j75154
$$ 564140 413561 76197 162498 145848 146837 228669 169698 89943 339328 480230 305076
23289C05076l9194j35503j62847K9385k1263q5110k43576J26194L57013N865j8204
$$ 305076 265882 130379 -32468 -3083 -24346 -109456 -353032 -226838 130175 136040 117836
23278A17836k01027J49260J27426o0201q6424k14801K29535J81119j74094j88752
$$ 117836 -83191 66069 193495 133294 46870 -167931 61604 242723 68629 -120123
23268a20123j9962k78267j81073R2370J78361J77042j30363N0472Q1402K40678
$$ -120123 -140085 -418352 -599425 -507055 -328694 -151652 -282015 -231543 -150141 90537
23258I0537K03141J01620k9959N5403Q5816M0143j92596K0162K6167k96166m00136
$$ 90537 293678 395298 365339 420742 506558 546701 354105 374267 400434 104268 -295868
23247b95868K13789J43783L589J0351k93267j92897P6289M8288j53331O7229K96407
$$ -295868 -82079 61704 65293 75644 -217623 -410520 -334231 -285943 -439274 -372045 -75638
23236g5638J10044k4357L7924K1586o5443K0909m220p9232J0158J90723J82546
$$ -75638 34406 10049 47973 69559 4116 25025 20805 -58427 -48269 142454 325000
23225C25000K7229k07661j18008N4555J73818K14060l72808l09647J14445Q3267
$$ 325000 352229 144568 26560 81115 254933 468993 96185 -213462 -99017 -15750
23215a5750j46478Q7116j06670j52706k8998q7091Q7020R320L21060O2105l2301
$$ -15750 -162228 -75112 -181782 -334488 -363486 -450577 -363557 -354237 -33177 28928 -3373
23204c373P6504J31472J17737K9186j64866Q0226K5952j95321k60904O6275J00185
$$ -3373 73131 204603 322340 351526 186660 266886 292838 97517 -163387 -97112 3073
23193C073J41223q4329p0169J6706j02299r1048J19545M3488K26003p2554l85512
$$ 3073 144296 59967 -10202 6504 -95795 -186843 -67298 -23810 202193 129639 -255873
23182b55873k9782J85260n9751j04330J49134j03990l539K71338K0098J74206
$$ -255873 -285655 -100395 -160146 -264476 -115342 -219332 -222871 48467 68565 242771
23172B42771r6262j99611r5311N9506K53019K39186l8577k08912k50902r0866
$$ 242771 146509 -53102 -148413 -88907 164112 403298 364721 155809 -95093 -185959
23162a85959J65999R9180L8260k77284j55642J72613K86211j0211k85035j66822
$$ -185959 -19960 79220 117480 -159804 -315446 -142833 143378 133167 -151868 -318690
23152c18690q0465K06048K09879Q1818P1657J98813k4107k43386L3858K15753
$$ -318690 -399155 -193107 16772 98590 170247 369060 344953 101567 135425 351178
23142C51178q9214l05638j20508j5186O0228R0885J28323P2750j35018l9760J830
$$ 351178 261964 -43674 -164182 -179368 -119140 -28255 100068 172818 37800 -1960 -130
23131a30p8090j3923K16487r3046k75712n5401r6297k30131K13240L49293J4035
$$ -130 -78220 -92143 124344 31298 -244414 -299815 -396112 -626243 -413003 -63710 -49675
23120d9675j87428m2359R3577O1146k3751O1805J55844j43308M1982r1990N1762
$$ -49675 -237103 -279462 -185885 -124739 -148490 -86685 69159 -74149 -32167 -124157 -72395
23109g2395j51574M3515j84568q0753O1420j36959j71424J52630K18495J34935
$$ -72395 -223969 -180454 -365022 -445775 -384355 -521314 -692738 -540108 -321613 -186678
23099a86678j88863O5945N5422P1306L01248M8031J6079q7979m69872l6111J80543
$$ -186678 -375541 -309596 -254174 -182868 118380 166411 182490 94511 -375361 -411472 -230929
23088b30929K09512K10255j38671k64103p4444L0723J03859J95957L0752J29477
$$ -230929 -21417 188838 50167 -213936 -288380 -257657 -153798 42159 72911 202388
23078B02388O0988n9270r7313r6668j96235j89873J82133K91870J18101J66598
$$ 202388 263376 204106 106793 10125 -186110 -375983 -193850 98020 216121 382719
23068C82719m6430j18382k56021j14860p5237N5674K3017K5616J47896K2749m8601
$$ 382719 336289 217907 -38114 -152974 -228211 -172537 -149520 -123904 23992 46741 -1860
23057a860M6452r9763K08579K80083m7148p3876j01266l947n2558k01862j05074
$$ -1860 44592 -55171 153408 433491 386343 312467 211201 207254 154696 -47166 -152240
23046a52240J16515Q8756j26206r4352J97981r2988R349O2459j45045j45964J49685
$$ -152240 -35725 53031 -73175 -167527 30454 -62534 -53185 9274 -135771 -281735 -132050
23035a32050J65794j72824M3044K27705K34233J42131k70848k00515l44977k538
$$ -132050 33744 -139080 -96036 131669 365902 508033 237185 36670 -308307 -310845
23025c10845O5706n53j52764k34232k6772K48571K43120J27808j3143K17747j38926
$$ -310845 -245139 -245692 -398456 -632688 -659460 -410889 -167769 -39961 -53104 164643 25717
23014B5717o6071p5229m5779K2473j3291K91653J0698j00721q1433j24726J47306
$$ 25717 -40354 -115583 -161362 -138889 -152180 139473 150171 49450 -31983 -156709 -9403
23003i403K02242M1351j82640l5734l5959p804J37657J68230J59558R0871j96732
$$ -9403 192839 234190 51550 15816 -20143 -27947 109710 277940 437498 528369 331637
22992C31637l3223k2622k55710O5477R4625j08613j26036l9929j3209M6108L2998
$$ 331637 298414 275792 20082 85559 180184 71571 -54465 -94394 -107603 -61495 -28497
22981b8497Q0287L8507J99103j1719k831m3365o247j53437J62667J08875r6274
$$ -28497 51790 90297 289400 277681 274850 231485 225238 71801 234468 343343 247069
22970B47069l28994r7283J27818J70219K23848N8573o8723K8121r3759o4556l2355
$$ 247069 -81925 -179208 -51390 118829 342677 401250 332527 360648 266889 202333 169978
22959A69978p6261Q7747o5942n2392m4806l8595p169p5638P5671p3100k45451
$$ 169978 93717 181464 115522 63130 18324 -20271 -27440 -103078 -27407 -100507 -345958
22948c45958N8750K23497L2924k46574n9458N0286k3675J34249Q3753n0055l4097
$$ -345958 -287208 -63711 -30787 -277361 -336819 -286533 -310208 -175959 -92206 -142261 -176358
22937a76358J3515n2032m5363Q2255l3715J02315Q229k1824m9139K25311L1040
$$ -176358 -162843 -214875 -260238 -177983 -211698 -109383 -101154 -122978 -172117 53194 84234
22926H4234p4422J73355J31419m1710j94520q4220j2405j4668R1096K5540k42250
$$ 84234 9812 183167 314586 272876 78356 -5864 -18269 -32937 58159 83699 -158551
22915a58551j94048K1739R858j84091J72331O1293j46469O7115L22281J15491
$$ -158551 -352599 -330860 -321002 -505093 -332762 -271469 -417938 -350823 -28542 86949
22905H6949r7215n9764o464Q5940J9223k51891O7437k0253J74600J49000l3823
$$ 86949 -10266 -70030 -76494 9446 28669 -223222 -155785 -176038 -1438 147562 113739
22894A13739r4710J40021j34067j09548P0104j23395j16483L65673K79953P0686
$$ 113739 19029 159050 24983 -84565 -14461 -137856 -254339 111334 391287 461973
22884D61973j38887J07659k73370j53447Q9738k29555o8672L6212R286M8501J59029
$$ 461973 323086 430745 157375 3928 93666 -135889 -204561 -168349 -159063 -110562 48467
22873D8467J83636P1800j95950J03809J12427K7507l8281P8204p7221k53720Q5068
$$ 48467 232103 303903 107953 211762 324189 351696 313415 391619 314398 60678 145746
22862A45746J06190p8747j21736J24329J04629J03043N2616j73878l78591m0698
$$ 145746 251936 173189 51453 175782 280411 383454 436070 262192 -116399 -157097
22852a57097K14745j43535j32454J12539j36470j00194K67553J88647p6024j12646
$$ -157097 57648 -85887 -218341 -105802 -242272 -342466 -74913 113734 37710 -74936
22842g4936k4079J39245m9421k5388J11380p408J01660N5503j99475j48545K32454
$$ -74936 -99015 40230 -9191 -34579 76801 69393 171053 226556 27081 -121464 110990
22831A10990K69228N9259k67081p1493P056j47476J15572r1566j6259q6763p6476
$$ 110990 380218 439477 172396 100903 107959 -39517 76055 -15511 -31770 -118533 -195009
22820a95009o8071q938J8072Q7006J58439Q1476j84029k09503r8431P1316K4895
$$ -195009 -263080 -272018 -253946 -166940 -8501 72975 -111054 -320557 -418988 -347672 -322777
22809c22777L70417K90664p8172r7585l00334k15726r1852n2750J87774j1275
$$ -322777 47640 338304 260132 162547 -137787 -353513 -445365 -498115 -310341 -321616
22799c21616L52941J32449q3288J44225J7949J4502J48051R9097o5804j18163
$$ -321616 31325 163774 80486 224711 242660 257162 405213 504310 438506 320343
22789C20343K6629j74673k25414j36348K40079J45036j75456p9409P7862P6051
$$ 320343 346972 172299 -53115 -189463 50616 195652 20196 -59213 18649 94700
22779I4700r0068n30J05148r8512J64487o8142k8156K15760j07071k62364M2162
$$ 94700 4632 4102 109250 10738 175225 107083 78927 294687 187616 -74748 -32586
22768c2586Q5748J31740O4706N6798j74306l43030m0550j12818j85291R6381J44499
$$ -32586 53162 184902 249608 306406 132100 -210930 -251480 -364298 -549589 -453208 -308709
22757c08709K3888K5366p2747l6431J71645J59629M8278j249N2852j79122j17703
$$ -308709 -284821 -259455 -332202 -368633 -196988 -37359 10919 9670 62522 -116600 -234303
22746b34303J98905J94578O0517k38434j09342Q6938K55481m5332l15163p7084
$$ -234303 -35398 159180 219697 -18737 -128079 -41141 214340 169008 -146155 -223239
22736b23239J62705K14008k71684n328J61725n0481L018J43682N8744K98083j56719
$$ -223239 -60534 153474 -118210 -123538 38187 -12294 -9276 134406 193150 491233 334514
22725C34514j21918R4004k45299j07086k35715J15675L55804J4724j43204J70999
$$ 334514 212596 306600 61301 -45785 -281500 -165825 189979 204703 61499 232498
22715B32498J27894k04814j05096j60350j08137P5094K54739L3366M7998r5346
$$ 232498 360392 155578 50482 -109868 -218005 -142911 111828 145194 193192 97846
22705I7846j02816m0974J1644j7884j90720p7608Q6286J49040n7350J61517q7033
$$ 97846 -4970 -45944 -34300 -52184 -242904 -320512 -234226 -85186 -142536 18981 -68052
22694f8052j48762J44542J14748m1810K67169r0497p4717K518j18412j28672J07955
$$ -68052 -216814 -72272 42476 666 267835 177338 102621 105139 -13273 -141945 -33990
22683c3990j5707j32414K23216J76198K42258m3890l43687q5743R9536p777K82093
$$ -33990 -49697 -182111 41105 217303 459561 415671 71984 -13759 85777 78000 360093
22672C60093J00960j31162k23753j44335m1378J57676J84917K3276j61614J1167
$$ 360093 461053 329891 106138 -38197 -79575 78101 263018 286294 124680 135847
22662A35847p4744Q527j15258J24830P4371j07613k7905J18942j97941k05803
$$ 135847 61103 69630 -45628 79202 153573 45960 18055 136997 -60944 -266747
22652b66747j32467J10986K18739M6610k04926q2940J93714K52026K90105P8430
$$ -266747 -399214 -288228 -69489 -22879 -227805 -310745 -117031 134995 425100 503530
22642E03530k32575k77096m3191J94306Q3361p6284k24628j79396N022k5371L1918
$$ 503530 270955 -6141 -49332 144974 228335 152051 -72577 -251973 -246951 -272322 -240404
22631b40404N9743K2473J01405J98906j10609j32891J37429K7694J10217Q985
$$ -240404 -180661 -158188 -56783 142123 31514 -101377 36052 63746 173963 182948
22621A82948L6050k7399p6322K2738j78465k66743q0133Q1823O4635M6224J88429
$$ 182948 218998 191599 115277 138015 -40450 -307193 -387326 -305503 -240868 -194644 -6215
22610f215O7389r3067p3030j01731m4879J57915J96902K7147k1715K49455L0431
$$ -6215 61174 -31893 -104923 -206654 -251533 -93618 103284 130431 108716 358171 388602
22599C88602k4317M8966n9207l50559k14443J43544n426o8494J41539J48778J00251
$$ 388602 364285 413251 354044 3485 -210958 -67414 -72840 -141334 205 148983 249234
22588B49234j24508J43332L0121j41305O3043k68058j82906J39819r6880O5416
$$ 249234 124726 268058 298179 156874 219917 -48141 -231047 -91228 -188108 -122692
22578a22692q3217j38846Q5180J97170Q458j13598o8483K62136K80006l3983O2967
$$ -122692 -205909 -344755 -259575 -62405 -53947 -167545 -236028 26108 306114 272131 335098
22567C35098l14545k22810L1624M1468j79762p0389L33585j68760j7283K1133
$$ 335098 20553 -202257 -170633 -129165 -308927 -379316 -45731 -214491 -231774 -210641
22557b10641n8596L75230L1951j53372J86932P331k4264j19544p628j03987k70830
$$ -210641 -269237 105993 137944 -15428 171504 178835 154571 35027 27399 -76588 -347418
22546c47418N0889J37237K30298K43336K06407q7683k23819j87871J93482J24119
$$ -347418 -296529 -159292 71006 314342 520749 433066 209247 21376 214858 338977
22536C38977n9503j06268j53817K9758J04368n1174q7986R426r0052J47879q4537
$$ 338977 279474 173206 19389 49147 153515 102341 14355 23781 -66271 81608 -2929
22525b929P755K00201K53212L9358k51512m6927j36236O379k51588j58184J02554
$$ -2929 4826 205027 458239 497597 246085 199158 62922 69301 -182287 -340471 -237917
22514b37917K63153K32662o2995L8024L9654q1896o6614j81484m2135j4772J43691
$$ -237917 25236 257898 194903 232927 272581 190685 124071 -57413 -99548 -114320 29371
22503B9371K44132k20587l21316K56414j04221K894N2777J8954n5238n6261P7774
$$ 29371 273503 52916 -268400 -11986 -116207 -113313 -60536 -41582 -96820 -153081 -75307
22492g5307K28667J33206Q5020J78569j5536r2293j50377j99835N5846J00725
$$ -75307 153360 286566 371586 550155 534619 442326 291949 92114 147960 248685
22482B48685K69986J80362k87836l60004k58162n0461K1100J22480J21058K7963
$$ 248685 518671 699033 411197 51193 -206969 -257430 -236330 -113850 7208 35171
22472C5171P5291J13449M4415k08559k60780J8527L22393J13217n8723o0337j62592
$$ 35171 110462 223911 268326 59767 -201013 -182486 139907 253124 194401 134064 -28528
22461b8528P9933J73943J00965j08538j68473j88693M5838J8552J59077R0704
$$ -28528 51405 225348 326313 217775 49302 -139391 -93553 -75001 84076 174780
22451A74780o230k52071k62073J32451l5291K4696K00819K16291n2518J30607
$$ 174780 168550 -83521 -345594 -213143 -248434 -223738 -22919 193372 140854 271461
22441B71461J8069p2511j39998L9142J22869p154J17291l6673m1515k31363O2979
$$ 271461 289530 217019 77021 116163 239032 231878 349169 312496 270981 39618 102597
22430A02597J19339l15390l15542O1600J75716m888k8346J40317m0350N4328K61491
$$ 102597 221936 -93454 -408996 -347396 -171680 -176568 -204914 -64597 -104947 -50619 210872
22419B10872m126k47845P9827o9225p7462R8764J93205j42707j3856j46554j22047
$$ 210872 206746 -41099 38728 -30497 -107959 -9195 184010 41303 27447 -119107 -241154
22408b41154L8112Q2291J70138J86907k3081K15360j77648m07499L1697J64168
$$ -241154 -203042 -120751 49387 236294 213213 428573 250925 -156574 -124877 39291
22398C9291J71210J7607l56497l15533P9626L5029J54385M6548k5016j03860j795
$$ 39291 210501 228108 -128389 -443922 -364296 -329267 -174882 -128334 -153350 -257210 -259005
22387b59005j6369J30842M2919j63496r9224J53389N9707J19818J02134j36872
$$ -259005 -275374 -144532 -101613 -265109 -364333 -210944 -151237 -31419 70715 -66157
22377f6157M5897J77559K3662J06518L3397k2885M60j01752L3188p2222n4065
$$ -66157 -20260 157299 180961 287479 320876 297991 298451 196699 229887 157665 103600
22366A03600j9021J93981J3290l651j19199j70404l2783O353j17752N2640k16872
$$ 103600 84579 278560 291850 288199 169000 -1404 -34187 -27834 -145586 -92946 -309818
22355c09818J82599L68151p0620N0566J24783j30247n6148l0002j56874P735L31096
$$ -309818 -127219 240932 170312 220878 345661 215414 159266 129264 -27610 -19875 311221
22344C11221J15203k91122k24582J30226j2646p7355j29685l579J22567k2254
$$ 311221 426424 135302 -89280 40946 28300 -49055 -178740 -182319 -59752 -82006
22334h2006j81395M0484J1091k40935r1479j9329K91132J65133m3701j00036L2859
$$ -82006 -263401 -222917 -211826 -452761 -544240 -563569 -272437 -107304 -151005 -251041 -218182
22323b18182p990j41328J56786J61582Q0787j4572p8542J54j7141j49964R793
$$ -218182 -226172 -367500 -210714 -49132 31655 17083 -61459 -61305 -78446 -228410 -218617
22312b18617J26220J74855J13738l49972m3804J33521N2551n9837Q3267J97366
$$ -218617 -92397 82458 196196 -153776 -197580 -64059 -11508 -71345 11922 209288
22302B09288K22037m2432j47603n1648J1400j96942o2991l3813N4176J45239J27039
$$ 209288 431325 388893 241290 189642 201042 4100 -58891 -92704 -38528 106711 233750
22291B33750Q7271k13742l5541J02635J62086J17040k91762j54610j39681k6564
$$ 233750 321021 107279 71738 174373 336459 453499 161737 7127 -132554 -159118
22281a59118K9059k78020j34999m6943K31479J20541k1034K29598J1138k66434
$$ -159118 -130059 -408079 -543078 -590021 -358542 -238001 -259035 -29437 -18299 -284733
22271b84733J35237K95958p0836j00563J51236J04724k55472k42643K23107n2976
$$ -284733 -149496 146462 75626 -24937 126299 231023 -24449 -267092 -43985 -96961
22261i6961K0758j03625q6047J54304J92536k7854K4459J01391j83525k93984
$$ -96961 -76203 -179828 -265875 -111571 80965 53111 77570 178961 -4564 -298548
22251b98548J14556K11339K76597L2825n4763j56076l7375j04796O5330J16093
$$ -298548 -183992 27347 303944 336769 282006 125930 88555 -16241 49089 165182
22241A65182k69226j08304K2888K80272K61085j33211r2120k47312k46951j2636
$$ 165182 -104044 -212348 -189460 90812 351897 218686 126566 -120746 -367697 -380333
22231c80333J22564J51543N9872O192J29952K67872J56797j74616j30610j68637
$$ -380333 -257769 -106226 -46354 -40162 89790 357662 514459 339843 209233 40596
22221D0596k97366j37867j37102N8020K18057K00884J81988p7884L9818J49092
$$ 40596 -256770 -394637 -531739 -473719 -255662 -54778 127210 49326 89144 238236
22211B38236K9363l5810n2357L5365J88852Q447l06334j01691r7613P1926n504
$$ 238236 267599 231789 179432 214797 403649 412096 105762 4071 -93542 -21616 -27120
22200b7120Q5225p7374k8781p2326J31475N914l8554j61571J24657J98643M4633
$$ -27120 58105 -19269 -48050 -120376 11099 17013 -21541 -183112 -58455 140188 184821
22189A84821m3757J20946k04508j90182Q9429J44962J06993j8163J16119k3331
$$ 184821 141064 262010 57502 -132680 -43251 101711 208704 190541 306660 283329
22179B83329K3468J85164l6662o9602j95305M2784j71366n5171o2342J53771J73916
$$ 283329 306797 491961 455299 385697 190392 233176 61810 6639 -55703 98068 271984
22168B71984r5313l63315j14176K02971L50534r9811l77229m3179o7422J89406
$$ 271984 176671 -186644 -300820 -97849 252685 152874 -224355 -267534 -334956 -145550
22158a45550K59018r2420j75765n5162k3424K41609J13404K00594Q5435r1786
$$ -145550 113468 21048 -154717 -209879 -233303 8306 121710 322304 407739 315953
22148C15953j33579M7526l0751r4154P9244J18888M7409j45070k11232J7843j04814
$$ 315953 182374 229900 199149 104995 184239 303127 350536 205466 -5766 12077 -92737
22137i2737l9954O6544l523p2731j28712N0766J15281J38186J91684j73152n07765
$$ -92737 -132691 -66147 -69670 -142401 -271113 -220347 -105066 33120 224804 51652 -456113
22126d56113Q1788K98890k7537n7236k2480K9445p1843j95131J56024J78071K04590
$$ -456113 -374325 -75435 -102972 -160208 -182688 -153243 -225086 -420217 -264193 -86122 118468
22115A18468K1043p7892k9616r8970o5067J96925K7078j04598J7306J12213K025
$$ 118468 139511 61619 32003 -66967 -132034 64891 91969 -12629 4677 116890 118915
22104A18915M0555j5877M8997N1158j03873l20757J16901K67398k10137j82314
$$ 118915 159470 143593 192590 243748 139875 -180882 -63981 203417 -6720 -189034
22094a89034O4396J50884q578J13521L6425p7430j24758J10972K11391j02520
$$ -189034 -124638 26246 17668 131189 167614 90184 -34574 76398 287789 185269
22084A85269k10481O8725Q0474Q2539Q4039l42023l44273L6493K40032J68167
$$ 185269 -25212 43513 123987 206526 290565 -51458 -395731 -359238 -119206 48961
22074D8961K5732J07756K50437Q3408k07020k07552j17237N7971J83056J30277
$$ 48961 74693 182449 432886 516294 309274 101722 -15515 42456 225512 355789
22064C55789Q5642k7865j02689l39904J13611J12963j3926q7681j68937q3410
$$ 355789 441431 413566 310877 -29027 84584 197547 183621 95940 -72997 -156407
22054a56407n2531j47148M6661J01102L4331J84405q3963q0729o1684J24919J24085
$$ -156407 -208938 -356086 -309425 -208323 -173992 10413 -73550 -154279 -215963 -91044 33041
22043C3041J61961P6683J64584J92605j44388n9758m0600j84118j28165L7552
$$ 33041 195002 271685 436269 628874 484486 424728 384128 200010 71845 109397
22033A09397J25071n6901k66238j05718j22662k0664J40896J75037n0152N9715
$$ 109397 234468 177567 -88671 -194389 -317051 -337715 -196819 -21782 -71934 -12219
22023a2219J23154p6731J8642j21935j58218M6807K12304l9339k87859o6396J76560
$$ -12219 110935 34204 52846 -69089 -227307 -180500 31804 -7535 -295394 -361790 -185230
22012a85230K05913L341n2433J2201j4689L3642k66633p158p1897K58510J28583
$$ -185230 20683 24024 -28409 -16208 -30897 2745 -263888 -271046 -342943 -84433 44150
22001D4150j8091K00109k8215l66471k1590K38883K66114N0323j48867p7643j64852
$$ 44150 26059 226168 197953 -168518 -190108 48775 314889 365212 216345 138702 -26150
21990b6150j57708p653j35338O3077J51713K53504Q9917o9362k46283j12436o7014
$$ -26150 -183858 -191511 -326849 -263772 -112059 141445 231362 162000 -84283 -196719 -263733
21979b63733K33250K14739l1992J32767J26219N5361k96437j38446j02997J05506
$$ -263733 -30483 184256 152264 285031 411250 466611 170174 31728 -71269 34237
21969C4237K62058O314j44798m7869q0993K1625J8766K8800j68647K884K28090
$$ 34237 296295 302609 157811 109942 28949 50574 69340 98140 -70507 -67623 160467
21958A60467r0078P3172j29599k08402k45023R4425K22838J31131K2011J41013
$$ 160467 70389 143561 13962 -194440 -439463 -345038 -122200 8931 30942 171955
21948A71955R4399k09259k66270K9477J34224j85231L6122J49197J80151q8502
$$ 171955 266354 57095 -209175 -179698 -45474 -230705 -194583 -45386 134765 46263
21938D6263j53138j1347m3905j15629l4419P4725K51971N6310J26975L48734k23602
$$ 46263 -106875 -118222 -162127 -277756 -312175 -237450 14521 70831 197806 546540 322938
21927C22938j80739M2909j7089k22898R8597J51985j5195m1724r6107J11354k38673
$$ 322938 142199 185108 168019 -54879 43718 195703 180508 138784 42677 154031 -84642
21916h4642k48925J98552P221j02500K6608Q9517K24208k2795k2512J37065j2613
$$ -84642 -333567 -135015 -127794 -230294 -203686 -114169 110039 87244 64732 201797 189184
21905A89184j42884P644L9089k3405m6463O1233J01703j86427j98241n4084O1362
$$ 189184 46300 53944 93033 69628 23165 84398 186101 -326 -198567 -252651 -191289
21894a91289O4606J0423k06396k7176K7353K85869J58952j54595j68762J73088
$$ -191289 -126683 -116260 -322656 -349832 -322479 -36610 122342 -32253 -201015 -27927
21884b7927O1625L8964q2744O6292J39613Q2024q8590q6354K78082N8899l71139
$$ -27927 33698 72662 -10082 56210 195823 277847 189257 102903 380985 439884 68745
21873F8745l25333L9727K16338j6595p8950o6443J5171J60630P2547J9929l722
$$ 68745 -256588 -216861 -523 -17118 -96068 -162511 -147340 13290 85837 105766 102044
21862A02044o1397j02297O9090J21910J3181j98236N7885j89358k68317K01360
$$ 102044 40647 -61650 7440 129350 142531 -55705 2180 -187178 -455495 -254135
21852b54135O2389r7009k845J19964J95977k05518k1144O373n1569O109j30642
$$ -254135 -191746 -288755 -291600 -171636 24341 -181177 -202321 -195948 -247517 -241408 -372050
21841c72050O0478R574J75801L534J6205Q5538K3857K9910p651M6691J762l6050
$$ -372050 -311572 -301998 -126197 -122663 -106458 -20920 2937 32847 25196 71887 73649 37599
21829C7599k1608P3701Q5426O1289o4265J45911N6984j57323k10230m4508L1104
$$ 37599 15991 89692 175118 236407 172142 318053 375037 217714 7484 -37024 -5920
21818e920j1181O606J7354J23833j8986O8964N1683j36492n6406Q4041j81615
$$ -5920 -17101 -10495 6859 130692 111706 180670 232353 95861 39455 123496 -58119
21807e8119r3205Q7957J30550Q5215N6951M3002l6948L4608Q3349k00405j29390
$$ -58119 -151324 -63367 67183 152398 209349 252351 215403 250011 333360 132955 3565
21796C565l7153p9093J4759J7428J83173J68293Q1927K9965K24685J9912p3402
$$ 3565 -33588 -112681 -97922 -80494 102679 270972 352899 382864 607549 627461 554059
21785E54059l11787k34094k46435j42589J03503K35739J91635l8695j28903o2081
$$ 554059 242272 8178 -238257 -380846 -277343 -41604 150031 111336 -17567 -79648
21775g9648O971M01517J82111J33343o2178q8940o8870l481j35713j92931R603
$$ -79648 -72677 328840 510951 644294 582116 493176 424306 420825 285112 92181 101784
21764A01784j09101j54880J79257L7661k9847q188K50401j68297r7139J66963
$$ 101784 -7317 -162197 17060 54721 24874 16686 267087 98790 1651 168614
21754A68614K48021r4290j31802K1425q7175P2975j33306k25068Q4812K06486
$$ 168614 416635 322345 190543 211968 124793 197768 64462 -160606 -75794 130692
21744A30692J21030R9007L10909q1720k69973k02553J90251P4084n8691r6008
$$ 130692 251722 350729 661638 579918 309945 107392 297643 371727 313036 217028
21734B17028J40383J64235l07220k58875m3295N3608j11959J12348J7146J5299
$$ 217028 357411 521646 214426 -44449 -87744 -34136 -146095 -33747 -16601 -1302
21724a302J95119j64671j26490M6066J9398o0473J68523J00116j0363R4900j22310
$$ -1302 193817 29146 -97344 -51278 -31880 -92353 76170 176286 165923 260823 138513
21713A38513m2641j47497m3475L5477M4845O7691n844o7675J7733K9124l2137
$$ 138513 95872 -51625 -95100 -59623 -14778 52913 47069 -20606 -2873 26251 -5886
21702e886j03744l4977j62116L3102J13698J98322J09664m589j00327m8079J85235
$$ -5886 -109630 -144607 -306723 -273621 -159923 38399 148063 143474 43147 -4932 180303
21691A80303J15196R5652j21772M104j03155l09754j42022J55029K07045q2514
$$ 180303 295499 391151 269379 273483 170328 -139426 -281448 -126419 80626 -1888
21681a888m5965O0302l8046j26254J1149K71177K08269K614K7858P3437M8754
$$ -1888 -47853 12449 -25597 -151851 -140702 130475 338744 341358 369216 442653 491407
21670D91407j26716k74266K354K3115N4978l6386m257p1256p1622J44812J1430
$$ 491407 364691 90425 92779 115894 170872 134486 130229 58973 -12649 132163 143593
21659A43593j65883n0613L5902O5265J91742M2860R5304n6446L9592L6436k33593
$$ 143593 -22290 -72903 -37001 28264 220006 262866 358170 301724 341316 377752 144159
21648A44159l20199J8105O525J47412K34207m0741M2654J59977K7777j5472k15116
$$ 144159 -176040 -157935 -151410 -3998 230209 189468 232122 392099 419876 404404 189288
21637A89288j98195K0098K13835j0168j05271m4844m951o6818j21826j55236O2863
$$ 189288 -8907 11191 225026 214858 109587 64743 59792 -7026 -128852 -284088 -221225
21626b21225j58339j36071M365J34645J31843j15012L8757N4632Q7663K13213
$$ -221225 -379564 -515635 -511270 -376625 -244782 -359794 -321037 -266405 -178742 34471
21616C4471N4836J0721j44926j53987j4641R1142n6327J23307J40285r6470k73884
$$ 34471 89307 100028 -44898 -198885 -213526 -122384 -178711 -55404 84881 -11589 -285473
21605b85473m6816Q3816Q9938J55693J43345Q6037l28228j1888j7119P614O8964
$$ -285473 -332289 -248473 -158535 -2842 140503 226540 -101688 -113576 -130695 -123081 -54117
21594e4117n5532k33000k46664K16324K23938J19139n1708P5396R4717J00113
$$ -54117 -109649 -342649 -589313 -372989 -149051 -29912 -81620 -6224 88493 188606
21584A88606P2010j48926k91066K155n7261J05021R2315j03426r7297O1040R385
$$ 188606 260616 111690 -179376 -177221 -234482 -129461 -37146 -140572 -237869 -176829 -167444
21573a67444J61285J32105K37151P3054r4688o2389j5287K2438q2816k04748j95117
$$ -167444 -6159 125946 363097 436151 341463 279074 263787 286225 203409 -1339 -196456
21562a96456J94516L55455K33397j07513m1864J7801j82532m10K3661J55608n8448
$$ -196456 -1940 353515 586912 479399 437535 455336 272804 272394 296055 451663 393215
21551C93215Q3944R1142k24035j43620J64586J54495K8448m19756l00636P2046
$$ 393215 477159 568301 344266 200646 365232 519727 548175 128419 -172217 -100171
21541a00171O9513J56482J48210k33352l101J73973p1896q5931J52175J19062
$$ -100171 -30658 125824 274034 40682 37581 211554 139658 53727 205902 324964
21531C24964o0378R0393o0216p4457j79224j0230l4631j47862j10478m2513K01936
$$ 324964 264586 354979 294763 220306 41082 30852 -3779 -151641 -262119 -304632 -102696
21520a02696K06965k6650M8147K4026M3368l37368r3598n5874J8499J63955K00556
$$ -102696 104269 77619 125766 149792 193160 -144208 -237806 -293680 -275181 -111226 89330
21509H9330K12213L0793q9349J17772m1956j97346k05219j40426j7495L7472j86574
$$ 89330 301543 332336 242987 360759 318803 121457 -83762 -224188 -241683 -204211 -390785
21498c90785J22620J72413J82436j5724P3695M8498j09366k38578M5731L61364
$$ -390785 -268165 -95752 86684 70960 144655 193153 83787 -154791 -109060 252304
21488B52304P9105k24815M758j41225j72678k00803N5349Q7691K44542O6600k73774
$$ 252304 331409 106594 111352 -29873 -202551 -403354 -348005 -260314 -15772 50828 -222946
21477b22946k42902K05534K16309Q8272o1162J10353K12350Q3558p4783L5783
$$ -222946 -465848 -260314 -44005 44267 -16895 93458 305808 389366 314583 350366
21467C50366m5240l16231J7638L9969O842j92980J42278L53451J94235n0093l09537
$$ 350366 305126 -11105 6533 46502 53344 -139636 2642 356093 550328 500235 190698
21456A90698j62960k37430k00944O2906M8186N1094j19196R6268J38297n244k7721
$$ 190698 27738 -209692 -410636 -347730 -299544 -248450 -367646 -271378 -133081 -138325 -166046
21445a66046J03400K21529k6357K0023M26738J7418k99998k57111j53543P7863
$$ -166046 -62646 158883 132526 152549 579287 596705 296707 39596 -113947 -36084
21435c6084J61052m1590k15923j15705J42371M6430p0698J33217q6098J27932
$$ -36084 124968 83378 -132545 -248250 -105879 -59449 -130147 3070 -83028 44904
21425D4904k359j93925K73285K22272j55301P951L9486j24263j36927K51799p5461
$$ 44904 42545 -151380 121905 344177 188876 196827 236313 112050 -24877 226922 151461
21414A51461m8276J35555k68500l02543J24180L18702J36149m8677p2313Q5798
$$ 151461 103185 238740 -29760 -332303 -208123 110579 246728 198051 125738 211536
21404B11536l3711j68865k36405R0679j25144J07837J66169j7109K0559R0448
$$ 211536 177825 8960 -227445 -136766 -261910 -154073 12096 -5013 15546 105994
21394A05994K2261J19218o8413q8814K7240K51324P4801k5417q4587j34894K3709
$$ 105994 128255 247473 179060 90246 117486 368810 443611 418194 333607 198713 222422
21383B22422q9309J31230j5115j88979j46851J57483J18096p6178K20J7199Q1992
$$ 222422 133113 264343 249228 60249 -86602 70881 188977 112799 113019 130218 212210
21372B12210n4975k30772J26220J40766R3274n5940m8518m978m1074j78788j9771
$$ 212210 157235 -73537 52683 193449 286723 230783 182265 177287 136213 -42575 -62346
21361f2346J57204N4239R8840m1062l3046M4321K7582r3527k04181j30465J96499
$$ -62346 94858 149097 247937 206875 173829 218150 245732 152205 -51976 -182441 14058
21350A4058q0562k03445L0205q6961j36989J38416J49405J6893N6185j16557j06322
$$ 14058 -66504 -269949 -239744 -326705 -463694 -325278 -175873 -158980 -102795 -219352 -325674
21339c25674q4223J41782J8925j22975J28432K01878L49519K96826m2863n7106
$$ -325674 -409897 -268115 -249190 -372165 -243733 -41855 307664 604490 561627 504521
21329E04521j21539q2118p34r050O2484p952j5967q2939n9619m4336j58172j3030
$$ 504521 382982 300864 300130 291080 353564 345612 329645 246706 187087 142751 -15421 -28451
21317b8451J13972L11205K39404j4660o6801p3767J01821l24492j24932K6863
$$ -28451 85521 396726 636130 621470 554669 480902 582723 258231 133299 160162
21307A60162N0015l8889P6705n7140k37377O7375K8837j2791J3017j55077q7105
$$ 160162 210177 171288 247993 190853 -46524 20851 49688 36897 49914 -105163 -192268
21296a92268k8680J09989J73482R0021j33522M6274K36280L5819j95959m6927
$$ -192268 -220948 -110959 62523 152544 19022 65296 301576 337395 141436 94509
21286I4509K7449J99259r3515k87382j43434K09906J54799k93258k43031J74165
$$ 94509 121958 321217 227702 -59680 -203114 6792 161591 -131667 -374698 -200533
21276b00533L04953L34213j72772l77603K8646K2802R613K68542M0596j69537
$$ -200533 104420 438633 265861 -111742 -83096 -60294 -50681 217861 258457 88920
21266H8920p3985J54320l6073o3713R9934J27635J14121P7888k9602k16552p9287
$$ 88920 14935 169255 133182 69469 169403 297038 411159 489047 459445 242893 163606
21255A63606J37756M3509j73360j05007l3939J0715q4562K42235J05637k10510
$$ 163606 301362 344871 171511 66504 32565 43280 -41282 200953 306590 96080
21245I6080m8154j22702r4971J93688J21367K0290J10209O8521Q3648J35352k0058
$$ 96080 47926 -74776 -169747 23941 145308 165598 275807 344328 427976 563328 543270
21234E43270j09709j38643l9698l14906j37452k16713p3257J21194J55852K17684
$$ 543270 433561 294918 255220 -59686 -197138 -413851 -487108 -365914 -210062 7622
21224G622P9387K36024J494r7228j62514k16205J83368L14627j8439k34569Q2113
$$ 7622 87009 323033 324527 227299 64785 -151420 31948 346575 328136 93567 175680
21213A75680M8283j35416Q4616J13145j28087o7507k63319J4832J14844K28867
$$ 175680 223963 88547 173163 286308 158221 90714 -172605 -157773 -42929 185938
21203A85938m0339r0719n8944Q4579J05894k2668M8849J30059k08369j74652O6094
$$ 185938 145599 54880 -4064 80515 186409 163741 212590 342649 134280 -40372 25722
21192B5722L3621k7124n0398J50785j9425k7735P5294J74906J6221j62842M0681
$$ 25722 59343 32219 -18179 132606 113181 85446 160740 335646 351867 189025 229706
21181B29706r4530L01767K31146j50839j35638q0489j81300J04032K76391j39150
$$ 229706 135176 436943 668089 517250 381612 301123 119823 223855 500246 361096
21171C61096k34720l6253Q4435O3158j25678n9112m9130M4794L6152m8204j52615
$$ 361096 126376 90123 174558 237716 112038 52926 3796 48590 84742 36538 -116077
21160a16077J90620R9389j09263j53629Q3400l5023p8654R419J2073p1336L64366
$$ -116077 74543 173932 64669 -88960 -5560 -40583 -119237 -109818 -97745 -169081 195285
21149A95285K83865K1665k23310k03352J9148J4051K00866J00540j80424P3549
$$ 195285 479150 500815 277505 74153 93301 107352 308218 408758 228334 301883
21139C01883j6524j08732N0105N0011j81935J4432K82402J30009k49220k03446
$$ 301883 285359 176627 226732 276743 94808 109240 391642 521651 272431 68985
21129F8985j40945l0516j06552l0971K43838J21908j8946L3794J69112N715k14787
$$ 68985 -71960 -102476 -209028 -239999 3839 125747 106801 140595 309707 315422 100635
21118A00635j97279j00656J97689K44489O8821k47134k44807K09887l4825j29454
$$ 100635 -96644 -197300 389 244878 313699 66565 -178242 31645 -3180 -132634
21108a32634J37904J18206j6347P893J09521r483Q589k3901j49625n6667j38233
$$ -132634 5270 123476 107129 115022 224543 215060 223649 199748 50123 -6544 -144777
21097a44777j02462J45893K26443j64350k6621P4983p8023l6570O1963R6671N4555
$$ -144777 -247239 -101346 125097 -39253 -65874 9109 -68914 -105484 -43521 53150 107705
21086A07705j53250O2615L746O2160o541n7993O8892J6345N7141k71311R5536
$$ 107705 -45545 17070 20816 82976 76435 18442 87334 103679 160820 -110491 -14955
21075a4955K45951P4153k03626p9382j31357P2987j24595N4610K4853j30322j76663
$$ -14955 230996 305149 101523 22141 -109216 -36229 -160824 -106214 -81361 -211683 -388346
21064c88346O3818K42242n3306J39038N124l46667K1875K68549K1970J18750M268
$$ -388346 -324528 -82286 -135592 3446 8570 -338097 -316222 -47673 -25703 93047 97315
21053I7315j84021m8570R6505J43230L5339l2577j63722o2760R1999j36426j16244
$$ 97315 -86706 -135276 -38771 104459 139798 107221 -56501 -119261 -27262 -163688 -279932
21042b79932L07146J63068k4908j49953K5343K50757k2999j98896j76386K4674
$$ -279932 27214 190282 165374 15421 40764 291521 268522 69626 -106760 -82086
21032h2086O1526L9393k52398k95555L83510L61234n8673K1142p4659k26078p4552
$$ -82086 -20560 18833 -233565 -529120 -145610 215624 156951 178093 103434 -122644 -197196
21021a97196J9742J11132J06772R0111j88269j70826J41420J60318q0034J21812
$$ -197196 -177454 -66322 40450 130561 -57708 -228534 -87114 73204 -6830 114982
21011A14982Q2264k6735N5866N6238o807j03525j07509n7087L3095j84399p6713
$$ 114982 197246 170511 226377 282615 275808 172283 64774 7687 40782 -143617 -220330
21000b20330n6192j00214R2135J15646J15752N6917K2483J02732j1418k9027j14777
$$ -220330 -276522 -376736 -284601 -168955 -53203 3714 26197 128929 117511 88484 -26293
20989b6293L6320M8316k2681J65231m3944r2713q2197J91891J96739j91689k84494
$$ -26293 10027 58343 35662 200893 156949 64236 -17961 173930 370669 178980 -105514
20978a05514M0975M3920o1739m3923J60004J84170j6412k11671j28799o0701N7326
$$ -105514 -64539 -20619 -82358 -126281 33723 217893 201481 -10190 -138989 -199690 -142364
20967a42364K01759K51130p4667j56896M6551p3566L67756J05839k27483j23558
$$ -142364 59395 310525 235858 78962 125513 51947 419703 525542 298059 174501
20957A74501j18929j83529n8745n9364j63161l3958K54461K5012j83265K03587
$$ 174501 55572 -127957 -186702 -246066 -409227 -443185 -188724 -163712 -346977 -143390
20947a43390K47936o478J37930Q3348k27461k54564n1538K98386J71290j25245
$$ -143390 104546 98068 235998 319346 91885 -162679 -214217 84169 255459 130214
20937A30214K4569P4490j58173k08991L1220J0519J2322j05060Q9748J86478J33921
$$ 130214 154783 229273 71100 -137891 -106671 -96152 -83830 -188890 -99142 87336 221257
20926B21257J41085j1821j17565m6358j64406J54204J06632m3060p2039K69964
$$ 221257 362342 350521 232956 186598 22192 176396 283028 239968 167929 437893
20916D37893j91k27599n5650o5736j92566k5718J77971J9081n6392J08333J9639
$$ 437893 437702 210103 154453 88717 -103849 -129567 48404 67485 11093 119426 139065
20905A39065k06764m3423K40963J53200k2923P5740K6433J6674k15407j31105
$$ 139065 -67699 -111122 129841 283041 260118 335858 362291 378965 163558 32453
20895C2453J24102M8775R564m5362l8716k7114q2357o1227J45870L25280M8841
$$ 32453 156555 205330 214894 169532 130816 103702 21345 -39882 105988 431268 480109
20884D80109J7320J14602k9221q0138p2326J7521p41q9617k80786o5378L8959
$$ 480109 497429 612031 582810 502672 430346 447867 447126 357509 76723 11345 50304
20873E0304J09801r6151k9078p800K1395n9684k1104J05080N4085p2252j07490
$$ 50304 160105 63954 34876 27076 48471 -11213 -32317 72763 126848 54596 -52894
20862e2894J79911l6841k22366o4719K73868K56250l3878j98120J3054l2223j53364
$$ -52894 127017 90176 -132190 -196909 76959 333209 299331 101211 114265 82042 -71322
20851g1322J4997O7083k71950Q3006K7058p2757L47498N0153j57880p4209M4062
$$ -71322 -56325 10758 -261192 -178186 -151128 -223885 123613 173766 15886 -58323 -14261
20840a4261j5202J9837J24399O4027O3723m2110J8956k64082n9460J01535n6823
$$ -14261 -29463 -9626 114773 178800 242523 200413 219369 -44713 -104173 -2638 -59461
20829e9461J75088L7851Q7737j5629l08209l2568K84152m4335k19500p6580J68768
$$ -59461 115627 153478 241215 225586 -82623 -115191 168961 124626 -94874 -171454 -2686
20818b686L216l4785L8033o7023r0608K08542L12921K9619q0239j24568p9014
$$ -2686 530 -34255 3778 -63245 -153853 54689 367610 397229 316990 192422 113408
20807A13408q1123O4242j9704k19863n307K67700l9022p5110K8669p1514J35096
$$ 113408 32285 96527 76823 -143040 -148347 119353 80331 5221 33890 -37624 97472
20796I7472K28183J05764J2042k75109j47590R0091L09987j23943l51949N8140
$$ 97472 325655 431419 443461 168352 20762 110853 420840 296897 -55052 3088
20786C088J60897j85000j1431K10787k48804k53496l0572J72722L03450L39104
$$ 3088 163985 -21015 -32446 178341 -70463 -323959 -354531 -181809 121641 460745
20776D60745K12146j85304q0847J66052k59425q7490Q3286j41140K5601N1006
$$ 460745 672891 487587 406740 572792 313367 225877 309163 168023 193624 244630
20766B44630k00882J5400n6086p1621P7982q3566p991M12250K27748k18303p2629
$$ 244630 43748 59148 3062 -68559 9423 -74143 -82134 330116 557864 339561 266932
20755B66932j04480k2500R3372j25502k37735j1219J81393O4752J02740O7148
$$ 266932 162452 139952 233324 107822 -129913 -141132 40261 105013 207753 274901
20745B74901o0132J01050J56013j02693m6188M5482j4773k6452m8161J5647o0493
$$ 274901 214769 315819 471832 369139 322951 368433 353660 327208 279047 294694 234201
20734B34201K05848j2211j27882j01641L2890k3968k45795N1505R7369P821P4507
$$ 234201 440049 427838 299956 198315 231205 207237 -38558 12947 110316 118137 192644
20723A92644L0230K8946Q122l5148j687J78304k31999j84094j11230p4763J08731
$$ 192644 222874 251820 259942 224794 223107 401411 169412 -14682 -125912 -200675 -91944
20712i1944K09187Q2094o1997K1517o2525k05919q1464j7882r1711K01400J27400
$$ -91944 117243 199337 137340 158857 96332 -109587 -191051 -208933 -300644 -99244 28156
20701B8156K90941J95412r4111j31418q5396r5991M5922j00776j61356j37241
$$ 28156 319097 514509 420398 288980 203584 107593 153515 52739 -108617 -245858
20691b45858J81221J40456J35325j84071k42335r4677R1017J74642o5139p6015
$$ -245858 -64637 75819 211144 27073 -215262 -309939 -218922 -44280 -109419 -185434
20681a85434j48100Q475R7231k78521L02872K70312j89597p2673r1187n550J13897
$$ -185434 -333534 -325059 -227828 -506349 -203477 66835 -122762 -195435 -286622 -292172 -178275
20670a78275M0848J13240J0010k666J12222N5434m3656p7856Q2588N7081K189
$$ -178275 -137427 -24187 -14177 -16843 95379 150813 107157 29301 111889 168970 171159
20659A71159J19988P3943r4669q9770o8847l55687K8509K23537K45850j27480
$$ 171159 291147 365090 270421 180651 111804 -243883 -215374 8163 254013 126533
20649A26533r2775L96828K0015l16012l4444J89607p1886l21Q2970Q007j4170
$$ 126533 33758 430586 450601 134589 100145 289752 217866 217545 300515 308522 294352
20638B94352j28570O5596k2702j5517O8628P1923o3285P1713R8777J3651N7658
$$ 294352 165782 231378 208676 193159 261787 333710 270425 342138 440915 454566 512224
20627E12224O0534j89805j14708k66621p30J28383K57749J10352k28527p2728
$$ 512224 572758 382953 268245 1624 894 129277 387026 497378 268851 196123
20617A96123k2937K2395J2061J1185k8506J36976J67573K2916j82995K2660q8750
$$ 196123 173186 195581 207642 218827 190321 327297 494870 517786 334791 357451 268701
20606B68701k70242R6625P5018k36555l7718J82318Q9109K5791P5952K743J75156
$$ 268701 -1541 95084 170102 -66453 -104171 78147 167256 193047 268999 271742 446898
20595D46898m0803n8945M445r2028P1332n472P7328J20314j19136j1102m8687
$$ 446898 406095 347150 351595 259567 330899 325427 402755 523069 403933 392831 344144
20584C44144N4640n7191j51977R1378J9897j2047J06532J7229J35726p0646l23476
$$ 344144 398784 341593 189616 280994 300891 288844 395376 412605 548331 477685 154209
20573A54209j55934R1411j45969p68J9222j52001L32615K74425j78216p9170J03278
$$ 154209 -1725 89686 -56283 -57051 -37829 -189830 142785 417210 238994 159824 263102
20562B63102Q0961o5692k29540j46118J69191J23057n0957J15334Q0169Q1132
$$ 263102 344063 278371 48831 -97287 71904 194961 144004 259338 339507 420639
20552D20639j9165j64487J58710o926k4992J16529p834j97068k26895k9743n4286
$$ 420639 401474 236987 395697 388771 363779 480308 472474 275406 48511 18768 -35518
20541c5518J05960J19167M3192N6649m8473J44021K34869K30693j19920l36499
$$ -35518 70442 189609 232801 289450 240977 384998 619867 850560 730640 394141
20531C94141Q7949J16411r3507k17443j31995J69010n5767o6457q8305o0818j10603
$$ 394141 482090 598501 504994 287551 155556 324566 268799 202342 114037 53219 -57384
20520e7384o9369O8855m9921K52019J59650l14390k11891J06260L00144M0658
$$ -57384 -126753 -57898 -107819 144200 303850 -10540 -222431 -116171 183973 224631
20510B24631R7228O0286J42067O9455p3420N303N3778N801k05056k69555j2286
$$ 224631 321859 382145 524212 593667 520247 525550 579328 585129 380073 110518 98232
20499I8232k1253p7294l0643K5093J18258J67394Q2585q9448J16010R3272k7072
$$ 98232 76979 -315 -30958 -5865 112393 279787 362372 272924 388934 482206 455134
20488D55134k28208K69069L9041k74380j46238L4395J51087N0365j29662J34668
$$ 455134 226926 495995 535036 260656 114418 148813 299900 350265 220603 355271
20478C55271p28q0991p2777J82417J37714j1798j9242k73738k73417r1870J43900
$$ 355271 354543 273552 200775 383192 520906 509108 489866 216128 -57289 -149159 -5259
20467e259J73624K25878k0644j49072k46394j38328L1304K21486J51248N5187
$$ -5259 168365 394243 373599 224527 -21867 -160195 -128891 92595 243843 299030
20457B99030l0250P394r0463K0738J36039k9770O2623Q7055j96192k15534k13342
$$ 299030 268780 276174 185711 206449 342488 312718 375341 462396 266204 50670 -162672
20446a62672N317L81302K01077J24284O8602N3308j53573j60338j96801R8610
$$ -162672 -157355 223947 425024 549308 617910 671218 517645 357307 160506 259116
20436B59116P249r5857M41695o0241l22217N7147J56513m2842p9698N1549Q6590
$$ 259116 266365 170508 612203 551962 229745 286892 443405 400563 320865 372414 459004
20425D59004j87445l93407q9264Q7539O3858p1931J0579K63079R6481j50795r0716
$$ 459004 271559 -121848 -211112 -123573 -59715 -131646 -121067 142012 238493 87698 -3018
20414c018K07198J48365k5407K6050q4016J44300L8295o1568R3129Q2615k8118
$$ -3018 204180 352545 327138 353188 269172 413472 451767 390199 483328 565943 537825
20403E37825l73319j87255J68092K28950J94016r9463M1953r7885p7511O6287
$$ 537825 164506 -22749 145343 374293 568309 468846 510799 412914 335403 401690
20393D01690J49529L0612k1185j04327n6166k48231J36327K71644J48329k24957
$$ 401690 551219 581831 560646 456319 400153 151922 288249 559893 708222 483265
20383D83265L4964o231Q4164L6863n7198k40699k21701J9491J86636O3935j9561
$$ 483265 518229 511998 596162 633025 575827 335128 113427 132918 319554 383489 363928
20372C63928J1824j7613O9057K51213l5967k04523r8794J20939l5625k21887k10270
$$ 363928 375752 358139 427196 678409 642442 437919 339125 460064 424439 202552 -7718
20361g718M8140Q8912O3676K580J75936j16830k18688n7467L26921K24116j87178
$$ -7718 40422 129334 193010 195590 371526 254696 36008 -21459 305462 529578 342400
20350C42400K208M3296l7808L9073L6230l7698M8068k01675L84o474K1611J07331
$$ 342400 344608 387904 350096 389169 425399 387701 435769 234094 234478 228004 249615 356946
20338C56946K68483K21944P3493j43072k31915k47227J46229k7437n540r9049
$$ 356946 625429 847373 920866 777794 545879 298652 444881 417444 411904 312855
20328C12855j17071r5581P3598J00965L57808R9974l36940k11736P2404P3235
$$ 312855 195784 100203 173801 274766 632574 732548 395608 183872 256276 329511
20318C29511j04136K13092J45012K0252J43369k81062j79556l2969J14592K15270
$$ 329511 225375 438467 583479 603731 747100 466038 286482 253513 368105 583375
20308E83375l8748p3177K61688r07j77638l35155k29007R6406J10945j71519O4988
$$ 583375 544627 471450 733138 732231 554593 219438 -9569 86837 197782 26263 91251
20297I1251J64730J97422j25911k27760q6004J90658J03366j6124O0380M4081
$$ 91251 255981 453403 327492 99732 13728 204386 307752 291628 352008 396089
20287C96089J5776q0307K72548k2635R861J03153k20518n1355J32775l9615k02056
$$ 396089 411865 331558 604106 581471 591332 694485 473967 422612 555387 515772 313716
20276C13716R465m9360K20762L71305j06044j06969J04115J77625k57451l66864
$$ 313716 323181 273821 494583 865888 759844 652875 756990 934615 677164 310300
20266C10300L365J25321K70134J92751m9079k94170L9335j51091k17355J94148
$$ 310300 313665 438986 709120 901871 852792 558622 597957 446866 229511 423659
20256D23659L42795L375l18813j50000l2263R7463r5639M7435O6460J8288k39842
$$ 423659 766454 769829 451016 301016 268753 366216 270577 318012 384472 402760 162918
20245A62918j34439Q655L0296j80040K42067M90638J43333Q7583K41398q1094
$$ 162918 28479 37134 67430 -112610 129457 620095 763428 851011 1092409 1011315
20235A011315k86450j41488r0407j02682k22402j20291k39988r1108M10490J25072
$$ 1011315 724865 583377 492970 390288 167886 47595 -192393 -283501 126989 252061
20225B52061J16703J38394O5698k28058j30637P3388K23538K8549M119k03509
$$ 252061 368764 507158 572856 344798 214161 287549 511087 539636 543755 340246
20215C40246j55591k607j14287j13648P4540L11282K87840P6928p0236k60141
$$ 340246 184655 182048 67761 -45887 28653 339935 627775 704703 634467 374326
20205C74326j66157Q0824j7940O5609J27539r14J38769O5926J30063j23603k7166
$$ 374326 208169 288993 271053 336662 464201 463287 602056 667982 798045 674442 647276
20194F47276k7020J75074K8256r4393j1963O0109q5743k04969k11190J06812j8319
$$ 647276 620256 795330 823586 729193 717230 777339 691596 486627 275437 382249 363930
20183C63930j067k4299p1574L58578j90035o2393n1602k45963l64570M5602K36450
$$ 363930 362863 338564 266990 625568 435533 373140 321538 75575 -288995 -243393 -6943
20172f943L30141K3288N1177K29499N7208k43236k61920J81830J80361J40931
$$ -6943 323198 346486 397663 627162 684370 441134 179214 361044 541405 682336
20162F82336K90462P9255j43900k93475j33027k53016P1683K3941m0674K25818
$$ 682336 972798 1052053 908153 614678 481651 228635 300318 324259 283585 509403
20152E09403J47485J90099l8834k07107m5952k32839L0865J48549k7526p9677
$$ 509403 656888 846987 808153 601046 555094 322255 353120 501669 474143 394466
20142C94466o0398l0369J3305q7313O3030M2798k20366k94187j74042J29077J92047
$$ 394466 334068 303699 317004 229691 292721 335519 115153 -179034 -353076 -223999 -31952
20131c1952L4755Q3764K85419K47117K10692j70084k01738j92011l6834k1966
$$ -31952 2803 86567 371986 619103 829795 659711 457973 265962 229128 207162
20121B07162J48918Q4658M2863O0575K27655q2194j87304j44436K0965J86540
$$ 207162 356080 440738 483601 544176 771831 689637 502333 357897 378862 565402
20111E65402J00448O813K12423r9589l34971k5541J0542m0750O8393P2523r8744
$$ 565402 665850 672663 885086 785497 450526 424985 435527 394777 463170 535693 436949
20100D36949Q2387J21938j01571K19038j6545n4511k4998l0407m7167J6695j19110
$$ 436949 519336 641274 539703 758741 742196 687685 662687 632280 585113 601808 482698
20089D82698r9569O4854j8597L2708j24816J45624N1707Q639q9875j15650j44453
$$ 482698 383129 447983 429386 462094 337278 482902 534609 543248 453373 337723 193270
20078A93270J8206n6301P4939J61341J11586J46130l9907j84738j1587j36844
$$ 193270 211476 155175 230114 391455 503041 649171 609264 424526 412939 276095
20068B76095L2531Q5172J38249P6965K7284l0623k6827J06937R660j995j68431
$$ 276095 308626 393798 532047 609012 636296 605673 578846 685783 695443 693448 525017
20057E25017k87212N8401Q3793k00046p6514l1661R4369N0238J25619L66311L19845
$$ 525017 237805 296206 379999 179953 103439 71778 166147 216385 342004 708315 1028160
20046A028160k86632p4025J66393Q3267j65770j30084q8992Q9595j64427P4020
$$ 1028160 741528 667503 833896 917163 751393 621309 532317 621912 457485 531505
20036E31505K16095K9266j88051q8536K22923N2260L899J7372k4446k4820o788
$$ 531505 747600 776866 588815 500279 723202 775462 779361 796733 772287 747467 740679
20025G40679O5410M4013O829J67208m8275k74193j76126j95076J28440J29825
$$ 740679 806089 850102 856931 1024139 975864 701671 525545 330469 458909 588734
20015E88734j35255k15804m9280Q2946L3340m8202J1801J403O4931N1558J26014
$$ 588734 453479 237675 188395 271341 304681 256479 268280 269683 334614 386172 512186
20004E12186k7601n3941Q6362j665m6961n8051q8630k1248K29880K20961l6974
$$ 512186 484585 430644 517006 515341 468380 410329 321699 300451 530331 751292 714318
19993G14318p1330L037k2014m7454K25819j9801o0588j26344k02120N9786Q2030
$$ 714318 642988 646025 624011 576557 802376 782575 721987 595643 393523 453309 535339
19982E35339O8133j25191J17353j29645m8132K03022r0204j83483M8154j1820
$$ 535339 603472 478281 595634 465989 417857 620879 530675 347192 395346 383526
19972C83526j43146J77413K17651N5468L6584J0529R1999r4256m3148l6453K03057
$$ 383526 240380 417793 635444 690912 727496 738025 830024 735768 692620 656167 859224
19961H59224k4798j84747n6454J8149j20813l7809J40233N7951J28081n8693m6587
$$ 859224 834426 649679 593225 611374 490561 452752 592985 650936 779017 720324 673737
19950F73737L35241j09177k83044j91441J82449J78791M5264N0696Q4206l5734
$$ 673737 1008978 899801 616757 425316 607765 786556 831820 882516 966722 930988
19940I30988k50389o8585J9623n4259k8770L7121Q1005M5926M6897j32045p0907
$$ 930988 680599 612014 631637 577378 548608 585729 666734 712660 759557 627512 556605
19929E56605o5562l06513p3823J77767J54453j12571M7710K22998l0252j63156
$$ 556605 491043 184530 110707 288474 442927 330356 378066 601064 570812 407656
19919D07656J0862K54603N22j93569l6551P6866o399j79015J25299L2844R7301
$$ 407656 418518 673121 673643 480074 443523 520389 513990 334975 460274 493118 590419
19908E90419P8322J7317j01490p7281j53951J24944J88224o0207k5131J41227
$$ 590419 668741 686058 584568 507287 353336 478280 666504 606297 581166 722393
19898G22393p2268j37651l00342J49309J21822J34620N084J89005K0143j1391
$$ 722393 650125 512474 212132 361441 483263 617883 622967 811972 832115 820724
19888H20724M8407j53504k32412p8096K48737j4446j46588j8529R7863J39540
$$ 820724 869131 715627 483215 405119 653856 639410 492822 474293 572156 711696
19878G11696J5357j72901j56708M4817p2176J96081R4693M7846J33220r6024j11004
$$ 711696 727053 554152 397444 442261 370085 566166 660859 708705 841925 745901 634897
19867F34897o245M3243J68461J18003J02428j57158l30460r4402O1795K9186K33103
$$ 634897 628652 671895 840356 958359 1060787 903629 573169 478767 540562 569748 802851
19856H02851J18525k3403J1327k33033O1498K4434K72684J33128j23351l52988
$$ 802851 921376 897973 909300 676267 737765 762199 1034883 1168011 1044660 691672
19846F91672p7671O0299J26986n3138J05171J31440j6493j17541r0432N7732l3992
$$ 691672 614001 674300 801286 748148 853319 984759 968266 850725 760293 818025 784033
19835G84033J31686M0004j95021j68873J05361j7839j18261K29304K88886j3961
$$ 784033 915719 955723 760702 591829 697190 679351 561090 790394 1079280 1065319
19825A065319l24685r1967J89845K5699J25840L2600j75353J56726J23407J90707
$$ 1065319 740634 648667 838512 864211 990051 1022651 847298 1004024 1127431 1318138
19815A318138J76920K2321k60955j90069j26911K18962k030O3840j54719M6312
$$ 1318138 1495058 1517379 1256424 1066355 939444 1158406 1156376 1220216 1065497 1111809
19805A111809K70048J35676M0911m208J5158R0693J83717k5199j94221j95463
$$ 1111809 1381857 1517533 1558444 1554236 1569394 1660087 1843804 1818605 1624384 1428921
19795A428921J01588J28429J24156K03731Q9559J63542j16801r9240j87033k01575
$$ 1428921 1530509 1658938 1783094 1986825 2076384 2239926 2123125 2023885 1836852 1635277
19785A635277l6708P201J67960P9201J81405L3525O7016R1232O1506n2780L5224
$$ 1635277 1598569 1605770 1773730 1852931 2034336 2067861 2134877 2226109 2287615 2234835 2270059
19774B270059l9838k42065l24382k03091J1377M0577M5905k16977j73187M0023
$$ 2270059 2230221 1988156 1663774 1460683 1472060 1512637 1558542 1341565 1168378 1208401
19764A208401J30823r6971r9501k7460j25762K54295J51956P9336p6499N4058
$$ 1208401 1339224 1242253 1142752 1115292 989530 1243825 1395781 1475117 1398618 1452676
19754A452676l2598J31703n1223L4063N0408J50014J49665J33988M2016k63508
$$ 1452676 1420078 1551781 1500558 1534621 1585029 1735043 1884708 2018696 2060712 1797204
19744A797204p2353J45198l2164J07336K02169j85730M7290Q6035K91198L04518
$$ 1797204 1724851 1870049 1837885 1945221 2147390 1961660 2008950 2094985 2386183 2690701
19734B690701N3695r9997l63602j55365J32139j62174k74472j3398N5339K64527
$$ 2690701 2744396 2644399 2280797 2125432 2257571 2095397 1820925 1807527 1862866 2127393
19724B127393Q0415j67035k87582m4926n0661n1071j33184k23068j76434J42312
$$ 2127393 2207808 2040773 1753191 1708265 1657604 1606533 1473349 1250281 1073847 1216159
19714A216159M73502o9365k89165K6254N1405r0751j65338k1636M5702J19168
$$ 1216159 1689661 1620296 1331131 1357385 1408790 1318039 1152701 1131065 1176767 1295935
19704A295935r5933k86422k1738r4827L00933N3044j76517N974J4250j05187Q8061
$$ 1295935 1200002 913580 891842 797015 1097948 1150992 974475 980449 994699 889512 977573
19693I77573L5214L5208J9314k06547o7443J1228J05184Q9078j55202J02671K28837
$$ 977573 1012787 1047995 1067309 860762 793319 804547 909731 998809 843607 946278 1175115
19682A175115l9142k17399k0278J25739K9870O990m8189k02978R9559J83734l720
$$ 1175115 1135973 918574 898296 1024035 1053905 1060895 1012706 809728 909287 1093021 1089301
19671A089301m874J36513N5627j34619O7701k06468k37698k11441Q8595J56049
$$ 1089301 1084427 1220940 1276567 1141948 1209649 1003181 765483 554042 642637 798686
19661G98686p718J83672K17680j46143j13228j0637J54874K30307j43300j09372
$$ 798686 790968 974640 1192320 1046177 932949 922312 1077186 1307493 1164193 1054821
19651A054821k4896K6520j27156K4660k698p7556L12291K07425N066m37084K8772
$$ 1054821 1029925 1056445 929289 953949 951251 873695 1185986 1393411 1398477 961393 990165
19640I90165P4772j38969j0669O8216R5717J23642J2756j25049P7495K47195J40625
$$ 990165 1064937 925968 915299 983515 1079232 1202874 1215630 1090581 1168076 1415271 1555896
19629A555896m9984j75206r971K2567N1529r7985M2513J64333j4071J24344K63052
$$ 1555896 1505912 1330706 1320735 1343302 1394831 1296846 1339359 1503692 1489621 1613965 1877017
19618A877017j39946o5606q2309j91630n829L9685p3510k23020j5537J53589L07082
$$ 1877017 1737071 1671465 1589156 1397526 1391697 1431382 1357872 1134852 1119315 1272904 1579986
19607A579986K05581m826o3638j43643j27796k63989K2356j07220L4136K33293
$$ 1579986 1785567 1780741 1717103 1573460 1445664 1181675 1204031 1096811 1130947 1364240
19597A364240L23046k9701j19987j10812l5167N3325j15122j07828Q1336l0252
$$ 1364240 1687286 1657585 1537598 1426786 1391619 1444944 1329822 1221994 1303330 1273078
19587A273078l8982K03923j65570N1552L8906o0482J77401K0459j08264l6053
$$ 1273078 1234096 1438019 1272449 1324001 1362907 1302425 1479826 1500285 1392021 1355968
19577A355968J5727q584N8052P4870K03638Q8129j01608j25579M7998Q115j64410
$$ 1355968 1371695 1363111 1421163 1496033 1699671 1787800 1686192 1560613 1608611 1616726 1452316
19566A452316n9666K98212O7954j44296j67155k7618K22679J29750J82259K00583
$$ 1452316 1392650 1690862 1758816 1614520 1447365 1419747 1642426 1772176 1954435 2155018
19556B155018O0081m0880l12149l49322J48581P5949j63247P7959J41091J6744
$$ 2155018 2215099 2174219 1862070 1512748 1661329 1737278 1574031 1651990 1793081 1809825
19546A809825n0072L3988J25537n4140k25785l5220l0882J2452o6608j75178L8057
$$ 1809825 1759753 1793741 1919278 1865138 1639353 1604133 1573251 1585703 1519095 1343917 1381974
19535A381974J01091k3674M0884L01334P6404n717j24733R2776K79669J49870
$$ 1381974 1483065 1459391 1500275 1801609 1878013 1872296 1747563 1840339 2120008 2269878
19525B269878j25096j12958M5033M09356J75176o339j59653n9451J19440l3494
$$ 2269878 2144782 2031824 2076857 2486213 2661389 2655050 2495397 2435946 2555386 2521892
19515B521892k17540j89204J35968L42189L525m1629K1593m2198L7285o0626j14783
$$ 2521892 2304352 2115148 2251116 2593305 2596830 2555201 2576794 2534596 2571881 2511255 2396472
19504B396472K41126J69004K36270J99716j38080k05693l05285K13480K878p5620
$$ 2396472 2637598 2806602 3042872 3242588 3104508 2898815 2593530 2807010 2809888 2734268
19494B734268M8672L9727r0793m1629J22506j92386j57574J35188k28397k22943
$$ 2734268 2782940 2822667 2731874 2690245 2812751 2620365 2462791 2597979 2369582 2146639
19484B146639J25810K51890M02999j53891k84561j91687p823L1735J07683q3912
$$ 2146639 2272449 2524339 2927338 2773447 2488886 2297199 2289376 2321111 2428794 2344882
19474B344882J37368R7703k29004o7287j18372K3036L23470N5926K4724j01977
$$ 2344882 2482250 2579953 2350949 2283662 2165290 2188326 2511796 2567722 2592446 2490469
19464B490469J12596K13640K3822N9242K05845m2297Q9608J56663Q2909p9409
$$ 2490469 2603065 2816705 2840527 2899769 3105614 3063317 3152925 3309588 3392497 3313088
19454C313088r0766J56159K22887P2402l6909J34682J28874K16820J32267j73957
$$ 3313088 3222322 3378481 3601368 3673770 3636861 3771543 3900417 4117237 4249504 4075547
19444D075547Q4654p1046j27650k12606k40090j11081k4628J05798K01339K23937
$$ 4075547 4160201 4089155 3961505 3748899 3508809 3397728 3373100 3478898 3680237 3904174
19434C904174K2717j75119k76608j21190j58135j10511l37699j45202j67653J32740
$$ 3904174 3926891 3751772 3475164 3353974 3195839 3085328 2747629 2602427 2434774 2567514
19424B567514K33025J36105L7851J66703n4950p6890j08583j74009p4514j307
$$ 2567514 2800539 2936644 2974495 3141198 3086248 3009358 2900775 2726766 2652252 2650945
19414B650945M207j60934o3751R1998K07055K24790j84374j82519R8316K4174
$$ 2650945 2655152 2494218 2430467 2522465 2729520 2954310 2769936 2587417 2685733 2709907
19404B709907j69518k08171k70985j2463L43368M20806L37911Q3577P2709M122
$$ 2709907 2540389 2332218 2061233 2048770 2392138 2812944 3150855 3234432 3307141 3311263
19394C311263r1450k53288j05570j3218n2517k6327P0780M49376O7498Q3647K13030
$$ 3311263 3219813 2966525 2860955 2847737 2795220 2768893 2839673 3289049 3356547 3440194 3653224
19383C653224M9735J42395J23368J23972j49995J11408Q6643m5992N9841M5196
$$ 3653224 3702959 3845354 3968722 4092694 3942699 4054107 4140750 4094758 4154599 4199795
19373D199795K4423K06814J89440J11109k5692J67084L53619J31786J00554k7666
$$ 4199795 4224218 4431032 4620472 4731581 4705889 4872973 5226592 5358378 5458932 5431266
19363E431266j17235k11400J22928J90062J61232M1361k39215r3640N8554J43334
$$ 5431266 5314031 5102631 5225559 5415621 5576853 5618214 5378999 5285359 5343913 5487247
19353E487247p7770j8883m3852J3430k1042N2250k54956n5245N71085J26278N8229
$$ 5487247 5409477 5390594 5346742 5360172 5339130 5391380 5136424 5081179 5652264 5778542 5836771
19342E836771J07716J37908J61812K43917K38259J94335L48940L95451K10738
$$ 5836771 5944487 6082395 6244207 6488124 6726383 6920718 7269658 7665109 7875847
19333G875847j55013Q6416M07534Q7782J51049M02466M90248L31862J96987J68163
$$ 7875847 7720834 7807250 8214784 8302566 8453615 8856081 9346329 9678191 9875178 10043341
19323A0043341J27933J77085K40984K85644L76225M79761M93771L24851L27607
$$ 10043341 10171274 10348359 10589343 10874987 11251212 11730973 12224744 12549595 12877202
19314A2877202M06142O48745O60021R44218P26758O06092M55419N96505R61347
$$ 12877202 13283344 13932089 14592110 15536328 16263086 16869178 17324597 17921102 18882449
19305A8882449J368943J241775J117515J338167J386551J717790J993619J796447
$$ 18882449 20251392 21493167 22610682 23948849 25335400 27053190 29046809 30843256
19297C0843256J943133K217752K258889K289797K967766L739797M189640M631244
$$ 30843256 32786389 35004141 37263030 39552827 42520593 46260390 50450030 55081274
19289E5081274M929961N286629N878252P235769Q737568R225290P814440N558666
$$ 55081274 60011235 65297864 71176116 78411885 87149453 96374743 104189183 109747849
19281A09747849N178188Q178838J3212855J6872075J8283950J9944459K6088967
$$ 109747849 114926037 123104875 136317730 153189805 171473755 191418214 217507181
19274B17507181L6347320M6832203M6754830K4889544j0307372l5060478l4896317
$$ 217507181 253854501 300686704 347441534 372331078 362023706 326963228 292066911
19267B92066911l2364174l8643517m1518533l1663605j8055841p239563j5040
$$ 292066911 259702737 221059220 179540687 147877082 129821241 122581678 122566638
19260A22566638L774704J901351n380598j4426086j8651913j6549158j1800095
$$ 122566638 126341342 128242693 122862095 108436009 89784096 73234938 61434843
19253F1434843p283720m447407k152595p60544K57669J091441J609459J957455
$$ 61434843 54151123 49703716 47551121 46790577 47048246 48139687 49749146 51706601
19245E1706601K277089K460769K969347L489495L666351M316364N636689P621637
$$ 51706601 53983690 56444459 59413806 62903301 66569652 70886016 76522705 84144342
19237H4144342R184245J0262663J0941263J1813941J3923298J7274193K0124575
$$ 84144342 93328587 103591250 114532513 126346454 140269752 157543945 177668520
19230A77668520K0124402J4661036O434508J697555M606920J1503821J9412136
$$ 177668520 197792922 212453958 218888466 220586021 225192941 236696762 256108898
19223B56108898K8094203L5848581M3343893M9385444M5601694L2300539J2923692
$$ 256108898 284203101 320051682 363395575 412781019 458382713 490683252 503606944
19216E03606944j5432777n7221880r5595258r6955726o8481292m1642803k4659204
$$ 503606944 488174167 430952287 335357029 238401303 169920011 128277208 103618004
19209A03618004j4444732p575484k654423N00851l38206n084195j1127841j4227123
$$ 103618004 89173272 81597788 78943365 79444216 79106010 74021815 62893974 48666851
19201D8666851j2290880q431332n287723l437047k745414j845585j269284q35793
$$ 48666851 36375971 27944639 22656916 19219869 16474455 14628870 13359586 12523793
19193A2523793l37767n78057o25208q89273j253113j314074q77666o37469n64286
$$ 12523793 12186026 11607969 10982761 10093488 8840375 7526301 6648635 6011166 5446880
19184E446880n26323k75887m967k58500l76579j08769k16910J4806j29047k02647
$$ 5446880 4920557 4644670 4639703 4381203 4004624 3895855 3678945 3693751 3564704 3362057
19174C362057q8404j20944q5829j02830M0575K70927J9056P7381K50638N0077
$$ 3362057 3273653 3152709 3066880 2964050 3004625 3275552 3294608 3371989 3622627 3672704
19164C672704K9666j35728m07637m09189k14576j76002j43374J34963k2589p1641
$$ 3672704 3702370 3566642 3159005 2749816 2535240 2359238 2215864 2350827 2328238 2256597
19154B256597n6240J56603O9210J21726J70073j00860j11773N5317K02531q3836
$$ 2256597 2200357 2356960 2426170 2547896 2717969 2617109 2505336 2560653 2763184 2679348
19144B679348k72343L4621J83056K23466L09664L63855L15821j37623l19254k12533
$$ 2679348 2407005 2441626 2624682 2848148 3157812 3521667 3837488 3699865 3380611 3168078
19134C168078k36146l86215j35932o0866k51590l1450p5457k56633k20145j34542
$$ 3168078 2931932 2545717 2409785 2348919 2097329 2065879 1990422 1733789 1513644 1379102
19124A379102j05414l6272O0121L5843j43641q8178J54551J01104J26361j74835
$$ 1379102 1273688 1237416 1297537 1333380 1189739 1101561 1256112 1357216 1483577 1308742
19114A308742j56642K19414J68351L15417L15737m2368K7217k2022j91277O8495
$$ 1308742 1152100 1371514 1539865 1855282 2171019 2128651 2155868 2133846 1942569 2011064
19104B011064n9897k256K20540q8336j31548K69380k75043M5346Q9003m2544K8030
$$ 2011064 1951167 1948911 2169451 2081115 1949567 2218947 1943904 1989250 2078253 2035709 2063739
19093B063739J3859J42412M793p2173J78854J20496K92757J09607J67437N898
$$ 2063739 2077598 2220010 2224803 2152630 2331484 2451980 2744737 2854344 3021781 3027679
19083C027679J8187o7478J85096J5075L8489m0922j48134n9450J0814J6071N8582
$$ 3027679 3045866 2978388 3163484 3178559 3217048 3176126 3027992 2968542 2979356 2995427 3054009
19072C054009J14423p2001N1630p2520p8760N9773P7554R9732o383P5368J28719
$$ 3054009 3168432 3096431 3148061 3075541 2996781 3056554 3134108 3233840 3227457 3302825 3431544
19061C431544M7639K00080M44456L61897n338j24390j24585K08786J23084J28951
$$ 3431544 3479183 3679263 4123719 4485616 4480278 4355888 4231303 4440089 4563173 4692124
19051D692124J45961J26441R7875J65411K17317K99572M15951L34695L51947J97819
$$ 4692124 4838085 4964526 5062401 5227812 5445129 5744701 6160652 6495347 6847294 7045113
19041G045113M66896M82956M87536L47035K87415L24093M30332L53673N05719
$$ 7045113 7512009 7994965 8482501 8829536 9116951 9441044 9871376 10225049 10730768
19032A0730768M99470K16938N83106O55953N80345N49866O15970O90728R59294
$$ 10730768 11230238 11447176 12030282 12686235 13266580 13816446 14432416 15123144 16082438
19023A6082438R64334J224800J115414J133848J040460J067574J345598J779157
$$ 16082438 17046772 18271572 19386986 20520834 21561294 22628868 23974466 25753623
19015B5753623J834968K193622K426306K714322K749607L079175L184052L377083
$$ 25753623 27588591 29782213 32208519 34922841 37672448 40751623 43935675 47312758
19007D7312758L914712M524303N268022N986255O870020P360753P635921Q807752
$$ 47312758 51227470 55751773 61019795 67006050 73876070 81236823 88872744 97680496
18999I7680496J0490712J2605201J3993425J4099713J1400633R016839J0725230
$$ 97680496 108171208 120776409 134769834 148869547 160270180 169287019 180012249
18992A80012249J6732639K2913146K6106280K9949686L7857490M9722118O1386957
$$ 180012249 196744888 219658034 245764314 275714000 313571490 363293608 424680565
18985D24680565N9255152L2407895j1055392m7397110o1978395o5887806o6431186
$$ 424680565 483935717 516343612 505288220 457891110 395912715 330024909 263593723
18978B63593723n5013452l6480454k0953404j0328067k731030K463904L584034
$$ 263593723 208580271 172099817 151146413 140818346 138087316 140551220 144135254
18971A44135254j245774j0366305j9057653k1511653j7958740j2513490p867550
$$ 144135254 142889480 132523175 113465522 91953869 73995129 61481639 53614089
18964E3614089n071497l390490j879725j024274l59305N17487J019786J216492
$$ 53614089 48542592 45152102 43272377 42248103 41888798 42406285 43426071 44642563
18956D4642563J589022J751506K149814L122281M083171M980046O060972P042946
$$ 44642563 46231585 47983091 50132905 53255186 57338357 62318403 68379375 75422321
18948G5422321Q256881Q621466R764995J1884848J5256657J7388472J5604730
$$ 75422321 83679202 92300668 102065663 113950511 129207168 146595640 162200370
18941A62200370R840496L258220N27776L206928J0678143J9609583K6880075L0803044
$$ 162200370 172040866 175299086 175826862 179033790 189711933 209321516 236201591 267004635
18933B67004635K7536203J7995887Q994039N479305o307240l4306444o1999740
$$ 267004635 294540838 312536725 321530764 327010069 320702829 286396385 224396645
18926B24396645o4328439m6304797k8393703j7186224j0407771o047283k918959
$$ 224396645 160068206 113763409 85369706 68183482 57775711 51728428 48809469
18919D8809469o00029J87154j295336m425904p153416p717581n947401m225725
$$ 48809469 48209440 48396594 47101258 42675354 35521938 27804357 21856956 17631231
18911A7631231k788869k073263j420306r38294p92520p67763j030918p38305q92155
$$ 17631231 14842362 12769099 11348793 10410499 9617979 8850216 7819298 7080993 6188838
18902F188838r40110n22492m50066o01971l77857J0457k39978k80130L4207k60379
$$ 6188838 5248728 4726236 4276170 3674199 3296342 3306799 3066821 2786691 2820898 2560519
18892B560519j28865j87628l21122j25475J31163J71245M21403J05283j13354
$$ 2560519 2431654 2244026 1922904 1797429 1928592 2099837 2521240 2626523 2513169
18883B513169J7753M53375L95644M23576J34124j78811m7123j4523j65559k43943
$$ 2513169 2530922 2984297 3379941 3803517 3937641 3758830 3711707 3697184 3531625 3287682
18873C287682k11115l08050j0133O4574K9119K3807L0093O6099K0663J92605K80350
$$ 3287682 3076567 2768517 2758384 2822958 2852077 2875884 2905977 2972076 2992739 3185344 3465694
18862C465694m8362j94592j53521Q4339M74957L56551K00463M49259Q2380k27736
$$ 3465694 3417332 3222740 3069219 3153558 3628515 3985066 4185529 4634788 4717168 4489432
18852D489432k51813o1558Q0693L5960n9467Q0924M8644j80222M9053J54291J40487
$$ 4489432 4237619 4176061 4256754 4292714 4233247 4314171 4362815 4182593 4231646 4385937 4526424
18841D526424N2251J77330M33976K60896j6907J93357L67853M33537N42459M13002
$$ 4526424 4578675 4756005 5189981 5450877 5433970 5627327 5995180 6428717 6971176 7384178
18831G384178M47116P4915J71534M78721O18704N10450O89988O73359M08366K36754
$$ 7384178 7831294 7906209 8077743 8556464 9175168 9685618 10375606 11048965 11457331 11694085
18821A1694085L47647K01571M94569O48465O48735R39285Q54965Q72211J010851
$$ 11694085 12041732 12243303 12737872 13386337 14035072 14974357 15829322 16701533 17712384
18812A7712384J229433J438379J147443J091176J245868J690536J522855J958413
$$ 17712384 18941817 20380196 21527639 22618815 23864683 25555219 27078074 29036487
18804B9036487K178629K382591K706377L129433K978352L306540L528664M199240
$$ 29036487 31215116 33597707 36304084 39433517 42411869 45718409 49247073 53446313
18796E3446313M973354N559107O485055Q258890R117474Q858907R388240J1813081
$$ 53446313 58419667 63978774 70463829 78722719 87840193 96699100 106087340 117900421
18788A17900421J6557881K3000890K7376739K3699000J1733041r14482M30127
$$ 117900421 134458302 157459192 184835931 208534931 220267972 219353490 219783617
18781B19783617J5272545L5315202N1506035M6672946J3976159k7389447m1217671
$$ 219783617 235056162 270371364 321877399 368550345 382526504 355137057 313919386
18774C13919386j7857553J4145816L2203292K0944264j4308130m7417687m8343127
$$ 313919386 296061833 310207649 342410941 363355205 349047075 301629388 253286261
18767B53286261k5979068l332904J3486144K1103875J8142483L965166j2314704
$$ 253286261 227307193 223974289 237460433 258564308 276706791 280671957 268357253
18760B68357253k4573477k3986815r063263J0310665K7274614K9564686P868212
$$ 268357253 243783776 219796961 210733698 221044363 248318977 277883663 285751875
18753B85751875k8380594n3323334m7468132k8962102j3442864k235926N662309
$$ 285751875 257371281 204047947 156579815 127617713 114174849 111938923 117601232
18746A17601232R920807J0135531R773260J3861068K4770140L9813391M5895397
$$ 117601232 127522039 137657570 147430830 161291898 186062038 225875429 271770826
18739B71770826K5832577j6531370n3035319n2388149k8860788p324162M391464
$$ 271770826 297603403 281072033 228036714 175648565 146787777 139463615 143855079
18732A43855079J665098j3391816k9783618l2297476k2798801j3519314q058126
$$ 143855079 145520177 132128361 102344743 70047267 47248466 33729152 25671026
18725B5671026n192364l532527k514248j952399j350479j251826j533772j355733
$$ 25671026 20478662 16946135 14431887 12479488 11129009 9877183 8343411 6987678
18717F987678q78178n68114l32583l24969n40275n05689k81803k56352j30846
$$ 6987678 6109500 5541386 5208803 4883834 4343559 3837870 3556067 3299715 3168869
18708C168869j34930m87032k23612K7754n6335k60729j59926j78703m84934j03204
$$ 3168869 3033939 2546907 2323295 2351049 2294714 2033985 1874059 1695356 1210422 1107218
18698A107218J23672k49637q5198L7215k01738j89069k39177j30865j08196L2239
$$ 1107218 1230890 981253 896055 933270 731532 542463 303286 172421 64225 96464
18688I6464J5556n6864p2358q3323j70402n1886k95742p6896k07820j43691k44426
$$ 96464 112020 55156 -17202 -100525 -270927 -322813 -618555 -695451 -903271 -1046962 -1291388
18677a291388l34522j1076J45335K5256R6212l13R7697J68591P7532n3637J34751
$$ -1291388 -1625910 -1636986 -1491651 -1466395 -1370183 -1370496 -1272799 -1104208 -1026676 -1080313 -945562
18666i45562m3526k7262O4127O0584J34855J76868j24443R5374K47933n9202q9963
$$ -945562 -989088 -1016350 -952223 -891639 -756784 -579916 -704359 -608985 -361052 -420254 -510217
18655e10217k24636j69297j05125O1832M9791P1170m6766j84354j43894J6112
$$ -510217 -734853 -904150 -1009275 -947443 -897652 -826482 -873248 -1057602 -1201496 -1185384
18645a185384K96451K3494j3065j11654k2870O809K6521L48999j9239j84432p3436
$$ -1185384 -888933 -865439 -878504 -990158 -1013028 -1006219 -979698 -630699 -649938 -834370 -907806
18634i07806p3738J26562P5371r39R6899k30690r9758r2379P6802J78594p0432
$$ -907806 -981544 -854982 -779611 -780550 -683651 -914341 -1014099 -1106478 -1029676 -851082 -921514
18623i21514L283J6602J91354j2105L1176r980N350r4188j79005j4459j82567
$$ -921514 -918231 -901629 -710275 -722380 -691204 -701184 -695834 -790022 -969027 -983486 -1166053
18612a166053m528Q2790J11151J6413R3925N4803P566n694j79586L236K0574k14286
$$ -1166053 -1170581 -1087791 -976640 -960227 -866302 -811499 -803933 -809627 -989213 -985977 -965403 -1179689
18600a179689L4824l1707j91447n7269k9604K28408R0928k022O4832j05187l8407
$$ -1179689 -1144865 -1176572 -1368019 -1425288 -1454892 -1226484 -1135556 -1137578 -1072746 -1177933 -1216340
18589a216340o7179k7050J73126L00417O7502j52233j56110j79980Q6625L04579
$$ -1216340 -1283519 -1310569 -1137443 -837026 -769524 -921757 -1077867 -1257847 -1171222 -866643
18579h66643N8107K67046J61670J58886K9347J3739m3146o4965J97513K63712
$$ -866643 -808536 -541490 -379820 -220934 -191587 -177848 -220994 -285959 -88446 175266
18569A75266K06763J56617k2985L149j72337j5312j557N5913M9004j47085J8718
$$ 175266 382029 538646 515661 518810 346473 331161 329604 385517 434521 287436 306154
18558C06154K71865l79260r0570N2958j84866j5881M4653j82031m7769K51023
$$ 306154 578019 198759 108189 161147 -23719 -39600 5053 -176978 -224747 26276
18548B6276L57890J71693J07265k7574n5269j55210j39519j06227j7043N2373
$$ 26276 384166 555859 663124 635550 580281 425071 285552 179325 162282 214655
18538B14655k3447L36020K89277m3240l6591q5199l06504k80831k27179k68502
$$ 214655 191208 527228 816505 773265 736674 651475 344971 64140 -163039 -431541
18528d31541p2296K24157J59602p6184j96450O6429J76056J5210m8279k13399
$$ -431541 -503837 -279680 -120078 -196262 -392712 -326283 -150227 -135017 -183296 -396695
18518c96695o5723L5993l8450P5161M9062q0396j02231m1762k16439j84762L2887
$$ -396695 -462418 -426425 -464875 -389714 -340652 -421048 -523279 -565041 -781480 -966242 -933355
18507i33355Q3172J66681Q7780l5253j36449P6855L52589M69059J41602o6702
$$ -933355 -850183 -683502 -595722 -630975 -767424 -690569 -337980 131079 272681 205979
18497B05979r9719N3160J236J67468J14787L684l4581K89073L89870Q4604J78070
$$ 205979 106260 159420 160656 328124 442911 446595 412014 701087 1090957 1175561 1353631
18486A353631J45742q6596j42915j54568R6769N4979r4606k32529r664P182J1284
$$ 1353631 1499373 1412777 1269862 1115294 1212063 1267042 1172436 939907 930243 937425 948709
18475I48709n4985R0475L46990M9900p9454M8520L8570J76201j40819J34839L03572
$$ 948709 893724 984199 1331189 1381089 1301635 1350155 1388725 1564926 1424107 1558946 1862518
18464A862518k56490j91261j48838N84k01597l75872k56688p234j94416j70331
$$ 1862518 1606028 1414767 1265929 1266513 1064916 689044 432356 425122 230706 60375
18454F0375l5248j02446m8851j09440j43196k64670p9370J58949M0076j66446
$$ 60375 25127 -77319 -126170 -235610 -378806 -643476 -722846 -563897 -523821 -690267
18444f90267M2968r8243R2068J00895Q7988J32555J19920l3354J65623k3422j721
$$ -690267 -647299 -745542 -653474 -552579 -464591 -332036 -212116 -245470 -79847 -103269 -104990
18433a04990L2871Q2676K12936l7022j78725K03270L63427J13460r1551p157o2206
$$ -104990 -72119 10557 223493 186471 7746 211016 574443 687903 596352 589195 526989
18422E26989l81355j32699K36712o881n4134j29803J10057q0624n0986K01206
$$ 526989 145634 12935 249647 242766 188632 58829 168886 88262 37276 238482
18412B38482k0646j00548o3835l39908o8626l3796p9696r9004k70148P3515L03697
$$ 238482 217836 117288 53453 -286455 -355081 -388877 -468573 -567577 -837725 -764210 -460513
18401d60513J41231R8174j22386j57084r4747o4706r4941K21119k0989l18891
$$ -460513 -319282 -221108 -343494 -500578 -595325 -660031 -754972 -533853 -554842 -873733
18391h73733O0774L49169k91337J50326K58825O4978Q102K7170Q6458j11525q1583
$$ -873733 -812959 -463790 -755127 -604801 -345976 -280998 -272896 -245726 -159268 -270793 -352376
18380c52376J29611K58316J89529j36182J4390K42892j29000k31572j69845J3577
$$ -352376 -222765 35551 225080 88898 103288 346180 217180 -14392 -184237 -170660
18370a70660p4534j24397k57586m2561n2921j71115J78914R2396K7942j47319
$$ -170660 -245194 -369591 -627177 -669738 -722659 -893774 -714860 -622464 -594522 -741841
18360g41841J264J9186p5412m828j71523j37510L4761K5449Q1452J99113M6455
$$ -741841 -740577 -721391 -796803 -801631 -973154 -1110664 -1075903 -1050454 -969002 -769889 -723434
18349g23434Q0017j90196o2213m7919k6033j88871J62521J98749J03516j43240
$$ -723434 -643417 -833613 -895826 -943745 -969778 -1158649 -996128 -797379 -693863 -837103
18339h37103q886j43439K1179K3635k02758J32034K25142J02461j29559m9129
$$ -837103 -845989 -989428 -968249 -944614 -1147372 -1015338 -790196 -687735 -817294 -866423
18329h66423K75812J72357N9968j221q3024j87982k29901j10846q9327K28175
$$ -866423 -590611 -418254 -358286 -359507 -442531 -630513 -860414 -971260 -1060587 -832412
18319h32412J95239O2408k9578l6640l04206j70246j30918J22819M661J2864J01922
$$ -832412 -637173 -574765 -604343 -640983 -945189 -1115435 -1246353 -1123534 -1118873 -1106009 -1004087
18308a004087r7211n9644J87743M4356J52983j2679J42770J28910n8018J6302
$$ -1004087 -1101298 -1160942 -973199 -928843 -775860 -788539 -645769 -516859 -574877 -558575
18298e58575m5443j18231r0095J6750J63530k45781q6158K47287K54903o07l30699
$$ -558575 -604018 -722249 -812344 -795594 -632064 -877845 -964003 -716716 -461813 -462420 -793119
18287g93119k06612k2704j00528M0071j4743l6727K1144J45667R247J28201L78546
$$ -793119 -999731 -1022435 -1122963 -1082892 -1097635 -1134362 -1113218 -967551 -958304 -830103 -451557
18276d51557K6020R7410m0020q6977J09854j68999p178K21910J47819k35514j49005
$$ -451557 -425537 -328127 -368147 -455124 -345270 -514269 -521447 -299537 -151718 -387232 -536237
18265e36237j59295J33581n6660l9030J93475L7220j48387M3046J0481j10909
$$ -536237 -695532 -561951 -618611 -657641 -464166 -426946 -575333 -532287 -521806 -632715
18255f32715J11453K49853J5036J23932J85905M6603k87747j00142K12035N8432
$$ -632715 -521262 -271409 -256373 -132441 53464 100067 -187680 -287822 -75787 -17355
18245a7355R8820O617p8207j63523K020O9816j36613J64606k51129j23143J55633
$$ -17355 81465 88082 9875 -153648 -151628 -81812 -218425 -53819 -304948 -428091 -272458
18234b72458O5376J39755N41504J54100O8107K2532k84006j12721J0831L593j10858
$$ -272458 -207082 -67327 474177 628277 696384 718916 434910 322189 333020 336613 225755
18223B25755p4571n336r4341j69812k12698j01655Q5285m31423k9316q9157k52443
$$ 225755 151184 145848 51507 -118305 -331003 -432658 -347373 -778796 -808112 -897269 -1149712
18212a149712N3858K06800o4628j19738N5824L8941M5001J49292M665k02980M4243
$$ -1149712 -1095854 -889054 -953682 -1073420 -1017596 -978655 -933654 -784362 -779697 -982677 -938434
18201i38434J99420J77197j49508J85262M7109O4191P2926j07181O6049r8744
$$ -938434 -739014 -561817 -711325 -526063 -478954 -414763 -341837 -449018 -382969 -481713
18191d81713j23493n4696J03249j20958k09205Q225K84159R0188M886q7186j57903
$$ -481713 -605206 -659902 -556653 -677611 -886816 -878591 -594432 -504244 -499358 -586544 -744447
18180g44447L03863K17460J97544O8037j44486k09287o4884J12939J72441J39248
$$ -744447 -440584 -223124 -25580 42457 -102029 -311316 -376200 -263261 -90820 48428
18170D8428K494M2882q184Q9810k2416l19068j13017R3867N981J23937J96120
$$ 48428 50922 93804 85620 175430 153014 -166054 -279071 -185204 -179223 -55286 140834
18159A40834k51586o5059P0672K02990j15472l823p4690m3189j65972J75756J19517
$$ 140834 -110752 -175811 -105139 97851 -17621 -21444 -96134 -139323 -305295 -129539 -10022
18148a0022m3154l192j66444k76078K08116K22812J80847L43819K59266J4571
$$ -10022 -53176 -56368 -222812 -498890 -290774 -67962 112885 456704 715970 730541
18138G30541j52270j9684q3139j23031j88181o8996n448j93610j79595J28106
$$ 730541 578271 558587 475448 352417 164236 95240 89792 -103818 -283413 -155307
18128a55307J86930j89536k84737J7573O3635M4762N9556k51713j2832K71229
$$ -155307 31623 -157913 -442650 -425077 -361442 -316680 -257124 -508837 -521669 -250440
18118b50440K446L8098L92759O9623J01767L9330J80683J08814j51288j33449
$$ -250440 -247994 -209896 182863 252486 354253 393583 574266 683080 531792 398343
18108C98343j71623M62333K59097l04985J37803J6728j43610j0795m9841J28907
$$ 398343 226720 689053 948150 643165 780968 797696 654086 643291 593450 722357
18098G22357k0427J43176J58026Q3196J46458n5012j56281r7936L8375J48350
$$ 722357 701930 845106 1003132 1086328 1232786 1177774 1021493 923557 961932 1110282
18088A110282K51832J38070L9704R4882M5516n5550K64480L84749L16050M27050
$$ 1110282 1362114 1500184 1539888 1634770 1680286 1624736 1889216 2273965 2590015 3017065
18078C017065L67944L49403R9216J12309L27309M55632M03931P30622P46974K87524
$$ 3017065 3385009 3734412 3833628 3945937 4273246 4728878 5132809 5863431 6610405 6897929
18068F897929L71403L55916O33101N45996R70411J196855J046382J202581J108331
$$ 6897929 7269332 7625248 8258349 8804345 9774756 10971611 12017993 13220574 14328905
18059A4328905R00498J078988J390573J480944J603268J614696J552065J497356
$$ 14328905 15229403 16308391 17698964 19179908 20783176 22397872 23949937 25447293
18051B5447293K354323L201233M442637O544743R127153J1641900J1798792R075349
$$ 25447293 27801616 31002849 35445486 41990229 51117382 62759282 74558074 83633423
18043H3633423R135772J4808467K5138413L6079107L1893637M753558l2907649
$$ 83633423 92769195 107577662 132716075 168795182 200688819 205442377 172534728
18036A72534728n0129939l6763744k0602603j1051809n853144k779119j336841
$$ 172534728 122404789 85641045 65038442 53986633 48133489 45354370 44017529
18029D4017529j47266R23029J564044L176928N058706P297207R958831J1295878
$$ 44017529 43870263 44793292 46357336 49534264 54592970 61890177 71849008 83144886
18021H3144886J0465097R649288J3149135K0592963L0759894L3601186J8093838
$$ 83144886 93609983 103259271 116408406 137001369 167761263 201362449 219456287
18014B19456287r741571l1271238k9473599j5595368j288294J2617004K3938773
$$ 219456287 209714716 178443478 148969879 133374511 132086217 144703221 168641994
18007A68641994K0817977j037173l0472882m3342479l2969163j9422357j1446115
$$ 168641994 189459971 188422798 157949916 114607437 81638274 62215917 50769802
18000E0769802p011054m017782k304951j163757l27991Q40741K040442L388663
$$ 50769802 43758748 39740966 37436015 36272258 35944267 36785008 38825450 42214113
17992D2214113N495007Q024924R320768P755195O431561R297758J6870357K7029985
$$ 42214113 47709120 55734044 65054812 72810007 79241568 88539326 105409683 132439668
17984A32439668K9754669J1682448k1097425m5466810l9146540k3120492j3028722
$$ 132439668 162194337 173876785 152779360 107312550 68166010 45045518 32016796
17977C2016796p755559m891396l633705k726733j756215j322607j510977p76222
$$ 32016796 24261237 19369841 15736136 13009403 11253188 9930581 8419604 7643382
17969G643382o80915n05396k58100m54281m30135j38201o7873m2920l92753l51365
$$ 7643382 6962467 6457071 6198971 5744690 5314555 5176354 5108481 5065561 4672808 4321443
17959D321443n18390j35956Q561o9085l4040j58283m00591j88841j64650k66475
$$ 4321443 3803053 3667097 3675658 3606573 3572533 3414250 3013659 2824818 2660168 2393693
17949B393693j32786k72752j33889l11426r4158k75326l9751L8370m9801J72228
$$ 2393693 2260907 1988155 1854266 1542840 1448682 1173356 1133605 1171975 1122174 1294402
17939A294402J29080J18058j1607q0159J7562j73952k07352k10440j2333J82173
$$ 1294402 1423482 1541540 1529933 1449774 1467336 1293384 1086032 875592 863259 1045432
17929A045432j36116j78858K42574j16991l26412j9856o7398J03112J65408j94565
$$ 1045432 909316 730458 973032 856041 529629 509773 442375 545487 710895 516330
17919E16330j43924K2345j36818o5496J99662Q2605J04423j79048j96854m5136
$$ 516330 372406 394751 257933 192437 392099 474704 579127 400079 203225 158089
17909A58089N126N5855l850k48122j88885J29260J83723K23306n9719o7229J38660
$$ 158089 163215 219070 215220 -32902 -221787 -92527 91196 314502 254783 187554 326214
17898C26214k4599q7749k9026J25315J32121j6060j15285j87895j1409L369J66916
$$ 326214 301615 213866 184840 310155 442276 426216 310931 123036 111627 114996 281912
17887B81912J42678J29803o9843j17744k25121J08675N4198q2827j35311k24680
$$ 281912 424590 554393 484550 366806 141685 250360 304558 221731 86420 -138260
17877a38260j73854P347O3230J80468m8502N2510J23319M7029j7743q6184K03801
$$ -138260 -312114 -304767 -241537 -61069 -109571 -57061 66258 113287 95544 9360 213161
17866B13161N263l4076j95293k09496K08263J33693j86133p1024J65583R6457
$$ 213161 218424 184348 -10945 -220441 -12178 121515 -64618 -135642 29941 126398
17856A26398m7524l663k98097j50867M37299R9358j03371j58419j8276j16487
$$ 126398 78874 75211 -222886 -373753 63546 162904 59533 -98886 -117162 -233649
17846b33649o8129J3470J67626K01807K9278J66864M1011k03059j11371J38773
$$ -233649 -301778 -288308 -120682 81125 110403 277267 318278 115219 3848 142621
17836A42621J77568J83358J32113l2036k31545j99055j25790K75018K12255J40796
$$ 142621 320189 503547 635660 603624 372079 173024 47234 322252 534507 675303
17826F75303K14028J02056Q1798j11073l55808j86179j59394j29774L011J36429
$$ 675303 889331 991387 1073185 962112 606304 420125 260731 130957 133968 270397
17816B70397J30688K64562k26460N4366o3632m3903J68633j68099j44255K60530
$$ 270397 401085 665647 439187 493553 429921 386018 554651 386552 242297 502827
17806E02827L01209K36453n4936j58698k82091j35834k21783j49777j19561R1006
$$ 502827 804036 1040489 985553 826855 544764 408930 187147 37370 -82191 8815
17796H815J50154j48648q6465J44502J12769j95309q0379o1310m1193K629P3056
$$ 8815 158969 10321 -76144 68358 181127 -14182 -94561 -155871 -197064 -194435 -121379
17785a21379K07094J91030j6347k97613j8424j12782j2149m4144o5774j52223
$$ -121379 85715 276745 260398 -37215 -55639 -168421 -180570 -224714 -290488 -442711
17775d42711R3178O3220m7984L3292J47987j09111p3564P2854j71338j01674n9267
$$ -442711 -349533 -286313 -334297 -301005 -153018 -262129 -335693 -262839 -434177 -535851 -595118
17764e95118m23l2484j10332R3029K55354J23289k3935j07014P7097j5787r4645
$$ -595118 -595541 -628025 -738357 -645328 -389974 -266685 -290620 -397634 -320537 -336324 -430969
17753d30969j01297J06866J80919j9975J5943K24151J82896j06676j02898j86270
$$ -430969 -532266 -425400 -244481 -264456 -248513 -24362 158534 51858 -51040 -237310
17743b37310O4122J41988K56123J47512Q3022Q2852q2748j44318J43605L86519
$$ -237310 -173188 -31200 224923 372435 455457 538309 455561 311243 454848 841367
17733H41367R0844j20259R7421L6641k4286j59844j14057k65766l88548p3460
$$ 841367 932211 811952 909373 946014 921728 761884 647827 382061 -6487 -79947
17723g9947J61077K64138K39029L2195j35560p3734k6882J1423O7948l4071J5852
$$ -79947 81130 345268 584297 616492 480932 407198 380316 391739 459687 425616 441468
17712D41468K54265J20452j25364L994n9776m3095j4876M3291k9331m9774j4305
$$ 441468 695733 816185 690821 694815 635039 591944 577068 620359 591028 541254 526949
17701E26949j704k19402k31199N1193L66139K06451K8990k62950j43247K04297
$$ 526949 525245 305843 74644 125837 491976 698427 727417 464467 321220 525517
17691E25517L65371M3721k32219k38156k9343K89108J08929j67993l73443k02177
$$ 525517 890888 934609 702390 464234 434891 723999 832928 664935 291492 89315
17681H9315m4155p5443r0903n8726o2586J357M4420J71127K6994k7322O1931p8886
$$ 89315 45160 -30283 -121186 -179912 -242498 -241141 -196721 -25594 1400 -25922 36009 -42877
17669d2877j32183l4832J49531p5911k3140M19620L03118k29263o3774N2145j79283
$$ -42877 -175060 -209892 -60361 -136272 -159412 260208 563326 334063 270289 322434 143151
17658A43151l80967k36568L8631N2123K1455J97281j05121k39K16690P5885l9189
$$ 143151 -237816 -474384 -435753 -383630 -362175 -164894 -270015 -270254 -53564 22321 -16868
17647a6868r4003k66496J15542R9814L0117j70939j03994M260j29351j32404j62657
$$ -16868 -110871 -377367 -261825 -162011 -131894 -302833 -406827 -402567 -531918 -664322 -826979
17636h26979J42447J30221N5223k7591N4460J11446j76228j6996j81458J21246
$$ -826979 -684532 -554311 -499088 -526679 -472219 -360773 -537001 -553997 -735455 -614209
17626f14209O0547j42388j35990J27131Q6139q1581q1394N0798N0999R1476J49466
$$ -614209 -553662 -696050 -832040 -704909 -618770 -700351 -781745 -730947 -679948 -588472 -439006
17615d39006j825j55180o9593R4234K50923j50062l45863j35180K56887J33886
$$ -439006 -440831 -596011 -665604 -571370 -320447 -470509 -816372 -951552 -694665 -560779
17605e60779R5466p1539K73524J11552Q5060k80514l04150K8814L69726O9310
$$ -560779 -465313 -536852 -263328 -151776 -66716 -347230 -651380 -622566 -252840 -183530
17595a83530k24874J3046P517K7513J3754j61993n539P7933m246m5596m7624P431
$$ -183530 -408404 -395358 -387841 -360328 -346574 -508567 -514106 -436173 -440419 -486015 -533639 -526208
17583e26208o5256M3287P9461n811L4206l16J81667O1334k2065R4115K1348j32727
$$ -526208 -591464 -548177 -468716 -474527 -440321 -440637 -258970 -197636 -219701 -125586 -104238 -236965
17571b36965J20089N8093R7297M582M3463P0039k92454j5058K06560n0607j12562
$$ -236965 -116876 -58783 38514 43096 86559 156598 -135856 -150914 55646 5039 -107523
17560a07523k1724p5493O8895j30370k04798J2644R8151J52221j7551p0538J8748
$$ -107523 -129247 -204740 -135845 -266215 -471013 -458369 -360218 -207997 -225548 -296086 -277338
17549b77338K7255j19041J23600j90362j94738J72638N0627j73298L5242j1630
$$ -277338 -250083 -369124 -245524 -435886 -630624 -457986 -407359 -580657 -545415 -557045
17539e57045M5950L5871l2505N5353J02780J09122m7906Q9172j23002k53934K20357
$$ -557045 -511095 -475224 -507729 -452376 -349596 -240474 -288380 -199208 -322210 -576144 -355787
17528c55787K51121J42379j15933j56522k09175j11367J47316J0684p4475K18723
$$ -355787 -104666 37713 -78220 -234742 -443917 -555284 -407968 -397284 -471759 -253036
17518b53036p95k19313R9360J75231J13391j15129k0100K80946R7529q1167j18917
$$ -253036 -253831 -473144 -373784 -198553 -85162 -200291 -220391 60555 158084 76917 -42000
17507d2000N363K63075p0457j66285P1295K2764L8492J40419j14829l67637k39127
$$ -42000 -36637 226438 155981 -10304 60991 83755 122247 262666 147837 -219800 -458927
17496d58927J8398L08121J13457j28892J56443K21718J04554p9748j36743k35472
$$ -458927 -440529 -132408 -18951 -147843 8600 230318 334872 255124 118381 -117091
17486a17091J45785Q9875n8611q6638Q0175Q3456K66420R4259j67561j24876k1722
$$ -117091 28694 118569 59958 -26680 53495 136951 403371 497630 330069 205193 183471
17475A83471K0147J56352J75683J22381j50845K3327P7222k64347J15761J50813
$$ 183471 203618 359970 535653 658034 507189 530516 607738 343391 459152 609965
17465F09965J5717j03494m43034k80047Q5816m1813j62120j33715O5141k5967
$$ 609965 625682 522188 79154 -200893 -115077 -156890 -319010 -452725 -387584 -413551
17455d13551m272J09976K60398M0014r7595L4719J29646M2853J3997K65140J0665
$$ -413551 -417823 -307847 -47449 -7435 -105030 -70311 59335 102188 116185 381325 391990
17444C91990m6434j57813j99935j25941j50072l0987m7768j10933m0894P2814
$$ 391990 345556 187743 -12192 -138133 -288205 -319192 -366960 -477893 -518787 -445973
17434d45973K7955L72621N9656k50595j50748j31812k42068J09895J62594J45861
$$ -445973 -418018 -45397 14259 -236336 -387084 -518896 -760964 -651069 -488475 -342614
17424c42614J50309j17667l03115j97928J30589J80742J14948l5564o512n4877
$$ -342614 -192305 -309972 -613087 -811015 -680426 -499684 -384736 -420300 -426812 -481689
17414d81689j29363J94339J83457O7012J01747m906l0390m2242L5771m0502q8506
$$ -481689 -611052 -416713 -233256 -166244 -64497 -69403 -99793 -142035 -106264 -146766 -235272
17403b35272k00295O3009j06937M7299J16920J09045N0799P5284j10492n7300
$$ -235272 -435567 -372558 -479495 -432196 -315276 -206231 -155432 -80148 -190640 -247940
17393b47940l296j34798r602M3933j90952k5044J80226o7853O4969m1230q7430
$$ -247940 -251236 -386034 -395636 -351703 -542655 -567699 -387473 -455326 -390357 -431587 -519017
17382e19017J79098M0737J07408J7013J47998o416j34113L3530m6650J38650j18859
$$ -519017 -339919 -299182 -191774 -174761 -26763 -33179 -167292 -133762 -180412 -41762 -160621
17371a60621k07096m5058Q5143p8181j49208J62447J64257m9930p1997n0428J01851
$$ -160621 -367717 -412775 -327632 -405813 -555021 -392574 -228317 -278247 -350244 -400672 -298821
17360b98821Q0913J17349R0859k67773o8632P1983k24147j37523L81944J00698
$$ -298821 -217908 -100559 -9700 -277473 -346105 -274122 -498269 -635792 -253848 -153150
17350a53150j88578k43793j7297K58662L65604J27519k93431O4313J30223j89843
$$ -153150 -341728 -585521 -602818 -344156 21448 148967 -144464 -80151 50072 -139771
17340a39771q3394j42884r8458P529l7285R8359l8203o1350K65477J93179j89854
$$ -139771 -223165 -366049 -464507 -456978 -494263 -395904 -434107 -495457 -229980 -36801 -226655
17329b26655k49590j30380J7187l7028j04556K29312J26452l605R479q1794N153
$$ -226655 -476245 -606625 -589438 -626466 -731022 -501710 -375258 -378863 -369384 -451178 -446025
17318d46025K03620K33340J30650j6627R4437j51517l09815j07870R5056L2213
$$ -446025 -242405 -9065 121585 104958 199395 47878 -261937 -369807 -274751 -242538
17308b42538K13302M673p2734j02749J40902q6353j36492l22316k26759M3093
$$ -242538 -29236 -24563 -97297 -200046 -59144 -145497 -281989 -604305 -831064 -787971
17298g87971m897J53510K59264K67560J16986R1269L7994J44484K4168r2992j92668
$$ -787971 -792868 -639358 -380094 -112534 4452 95721 133715 278199 302367 209375 16707
17287A6707k57301p3009l6864j34844P8787Q252J92965o6904N0169k45253k64838
$$ 16707 -240594 -313603 -350467 -485311 -406524 -398272 -205307 -272211 -222042 -467295 -732133
17276g32133M9986J95520N7585J19658p693J60996Q2954k27682k07774R6131J85268
$$ -732133 -682147 -486627 -429042 -309384 -317077 -156081 -73127 -300809 -508583 -412452 -227184
17265b27184J15746O1739k23298q3825K15935K34124K5620j43676p581m6080j6026
$$ -227184 -111438 -49699 -272997 -356822 -140887 93237 118857 -24819 -32400 -78480 -94506
17254i4506j3564J66082K17078r8651j47729j749r6157J7680p7912K3206k84375
$$ -94506 -108070 58012 275090 176439 28710 26961 -69196 -51516 -129428 -106222 -390597
17243c90597j36509j22028K42198L6266j88761M4358O4771j18956O3871J26302
$$ -390597 -527106 -649134 -406936 -370670 -559431 -515073 -450302 -569258 -505387 -379085
17233c79085J87488J39047j83136j08781K29057n346r92o1577J84757O2867P8613
$$ -379085 -191597 -52550 -235686 -344467 -115410 -120756 -121748 -183325 1432 64299 142912
17222A42912j54043l13840q9780J56171K22040L02720k13571k03858K3247M589
$$ 142912 -11131 -324971 -414751 -258580 -36540 266180 52609 -151249 -128002 -123413
17212a23413J13961J49408K23430m3150l00091r2353j6053k48081k14566J83289
$$ -123413 -9452 139956 363386 320236 20145 -72208 -88261 -336342 -550908 -367619
17202c67619J03508n3818l8444M8831L35249r4766r0414N9589R3771Q1669P1258
$$ -367619 -264111 -317929 -356373 -307542 27707 -67059 -157473 -97884 -4113 77556 148814
17191A48814l95479l3230q797N785O4331J13326J00822o7533p7382j16506M1988
$$ 148814 -246665 -279895 -288692 -282907 -218576 -105250 -4428 -71961 -149343 -265849 -223861
17180b23861k3360j29084o4726L6255m0708j23999p2336N7346J69901Q6776J19825
$$ -223861 -247221 -376305 -441031 -404776 -445484 -569483 -641819 -584473 -414572 -327796 -207971
17169b07971K31722r7761p5762J47510J44705k78569j78708k143J85758r566J30770
$$ -207971 23751 -74010 -149772 -2262 142443 -136126 -314834 -316977 -131219 -140785 -10015
17158a0015P3124j54723j75916j89788j05457j35297K58260J287J59088K06983
$$ -10015 63109 -91614 -267530 -457318 -562775 -698072 -439812 -438525 -279437 -72454
17148g2454n7971j15495j28390l140l5367J2663j29172R2609o9097O0357J51962
$$ -72454 -130425 -245920 -374310 -377450 -412817 -400154 -529326 -436717 -505814 -445457 -293495
17137b93495K22389L8652j37337k96303j01703j6831n0993J92020K3812P2829
$$ -293495 -71106 -32454 -169791 -466094 -567797 -584628 -635621 -443601 -419789 -346960
17127c46960J49545j68528o9008R445l7410J5950K63718J41752O8095N1281l8839
$$ -346960 -197415 -365943 -434951 -425506 -462916 -446966 -183248 -41496 26599 77880 39041
17116C9041N6985M6517l36777j8381K27321J12397r4700k60773q3337j7946j7185
$$ 39041 96026 142543 -194234 -212615 14706 127103 32403 -228370 -311707 -329653 -346838
17105c46838K1793J52421K11097R7729o3944k67493k22391j33808J60408M16542
$$ -346838 -325045 -172624 38473 136202 72258 -195235 -417626 -551434 -391026 25516
17095B5516R1312j32643m01575j6387K52555Q6434R9389j37486M4623J63589k26838
$$ 25516 116828 -15815 -417390 -433777 -181222 -94788 4601 -132885 -88262 75327 -151511
17084a51511K13474L7496q0561r5357l6283o1503k95286j88380J7199M8221J60890
$$ -151511 61963 99459 18898 -76459 -112742 -174245 -469531 -657911 -640712 -592491 -431601
17073d31601J05277r5664l0330J43170J74351O5094J16490Q8654L1328j78030
$$ -431601 -326324 -421988 -452318 -309148 -134797 -69703 46787 135441 166769 -11261
17063a1261k66594j16415J03300r6490k54444K1283J24141J85183J13176O4918
$$ -11261 -277855 -394270 -290970 -387460 -641904 -620621 -496480 -311297 -198121 -133203
17053a33203r8115m2601K4633j56318R7365m773k11136n4462R9961k8696j3436
$$ -133203 -231318 -273919 -249286 -405604 -308239 -313012 -524148 -578610 -478649 -507345 -520781
17042e20781K24497M5507j54086L6611J84523K08369o5393o4433p696N8618j35641
$$ -520781 -296284 -250777 -404863 -368252 -183729 24640 -40753 -105186 -112882 -54264 -189905
17031a89905k10101k69768J98099L17564j10527k35926n9016J78689n6602Q6196
$$ -189905 -400006 -669774 -471675 -154111 -264638 -500564 -559580 -380891 -437493 -351297
17021c51297N0507j38058m3344p2440L23459Q1145k64706J59084R1647K13599
$$ -351297 -300790 -438848 -482192 -554632 -231173 -150028 -414734 -255650 -164003 49596
17011D9596j58188k26975K59186K11810k86809k98235p4110j2526j2609P4857
$$ 49596 -108592 -335567 -76381 135429 -151380 -449615 -523725 -536251 -548860 -474003
17001d74003N8958J35639L5120J19518O0733j17319m0974L8586M8508q2435j13338
$$ -474003 -415045 -279406 -244286 -124768 -64035 -181354 -222328 -183742 -135234 -217669 -331007
16990c31007k9223N349j1314l27270k4643K5640j29345j3675q3537J18321L62388
$$ -331007 -360230 -354881 -366195 -693465 -718108 -692468 -821813 -835488 -919025 -800704 -438316
16979d38316L00759j67585k79263N7560J67186K99725m8343l3484j22548J19838
$$ -438316 -137557 -305142 -584405 -526845 -359659 -59934 -108277 -141761 -264309 -144471
16969a44471j11513m0689j45173R4842q1426Q3550K1699M4076j99981O0582J45351
$$ -144471 -255984 -296673 -441846 -347004 -428430 -344880 -323181 -279105 -479086 -418504 -273153
16958b73153r3867m4963j09991J2522K04508p7390q1406J10233R410p9470J38144
$$ -273153 -367020 -411983 -521974 -509452 -304944 -382334 -463740 -353507 -344097 -423567 -285423
16947b85423J34339L9706N0726K29666o4819k03643k39560k08108Q8423J63802
$$ -285423 -151084 -111378 -60652 169014 104195 -99448 -339008 -547116 -458693 -294891
16937b94891R4529J7807k86272r2458J43149k12233k92715L90285J8024m3009
$$ -294891 -200362 -182555 -468827 -561285 -418136 -630369 -923084 -532799 -514775 -557784
16927e57784K7673N4320J96066m0946j28282J24651L3739J8439j64352o3082P9517
$$ -557784 -530111 -475791 -279725 -320671 -448953 -324302 -290563 -272124 -436476 -499558 -420041
16916d20041K03510K31902m0588q4381j0780j8191r7316Q2149k36677L1308J54490
$$ -420041 -216531 15371 -25217 -109598 -120378 -138569 -235885 -153736 -390413 -359105 -204615
16905b04615o859r6707j85996P2018K30916J83048j2981k62967o1736o1428K37219
$$ -204615 -211474 -308181 -494177 -422159 -191243 -8195 -21176 -284143 -345879 -407307 -170088
16894a70088L06892m5021j83026p8259r9987m9746J2764O8794J02407N445r5273
$$ -170088 136804 91783 -91243 -169502 -269489 -319235 -306471 -237677 -135270 -129825 -225098
16883b25098O5579n9634q5250k35240p3642N8480r085L63347j86579r8685l0323
$$ -225098 -159519 -219153 -304403 -539643 -613285 -554805 -563890 -200543 -387122 -485807 -516130
16872e16130j7494q3896j24334M1820O4432R8899K76074j09384k73166j71851
$$ -516130 -533624 -617520 -741854 -700034 -635602 -536703 -260629 -370013 -643179 -815030
16862h15030J01561K04727P3111Q2765J55056r1094l1042J48684J29482m6221
$$ -815030 -713469 -508742 -435631 -352866 -197810 -288904 -319946 -171262 -41780 -88001
16852h8001j19734l7114j0286j59599j8745L5986j7688k76529n0643J17512P6353
$$ -88001 -207735 -244849 -255135 -414734 -433479 -397493 -415181 -691710 -742353 -624841 -548488
16841e48488K19322J9109K8261n2826n7069J33339k2681n9331j12409j01170P2091
$$ -548488 -329166 -310057 -281796 -334622 -391691 -258352 -281033 -340364 -452773 -553943 -481852
16830d81852J75408J64236l352k42916J60373j2069N9300N5303M1302p7568J41926
$$ -481852 -306444 -142208 -145560 -388476 -228103 -240172 -180872 -125569 -84267 -161835 -19909
16819a9909J7700O3393l1585j87634k80547j71498K8064j98095J84070L76057
$$ -19909 -2209 61184 29599 -158035 -438582 -610080 -582016 -780111 -596041 -219984
16809b19984l7144j03610o3090j6837K11286K04057l7580j9936k3609M6869j78095
$$ -219984 -257128 -360738 -423828 -440665 -229379 -25322 -62902 -82838 -106447 -59578 -237673
16798b37673p1356N2007j54474r4320J4194R0487J73752J3052o4684l24822j41227
$$ -237673 -309029 -257022 -411496 -505816 -491622 -401135 -227383 -214331 -279015 -603837 -745064
16787g45064K59962j0595l9215j5947J56504J39592Q0124J18656P7338l1361j50590
$$ -745064 -485102 -495697 -534912 -550859 -394355 -254763 -174639 -55983 21355 -10006 -160596
16776a60596j05017Q6200k49381j48516J55480j2176O3016P0399q2449K18036
$$ -160596 -265613 -179413 -428794 -577310 -421830 -434006 -370990 -300591 -383040 -165004
16766a65004O4721j27830o3952j6693J26701R5939o4645M1678p5159p7801L0414
$$ -165004 -100283 -228113 -292065 -308758 -182057 -86118 -150763 -109085 -184244 -262045 -231631
16755b31631J06089J25128m6368k17181P4167j9588K69766J94029r6729q5062
$$ -231631 -125542 -414 -46782 -263963 -189796 -209384 60382 254411 157682 72620
16745G2620r3665j34143l3046P3834j84296Q6707J43810j29465K070j3525l1575
$$ 72620 -21045 -155188 -188234 -114400 -298696 -211989 -68179 -197644 -195574 -209099 -240674
16734b40674N5956o0361k66238p6859L41135m4243l17925L36865J02570j07341
$$ -240674 -184718 -245079 -511317 -588176 -247041 -291284 -609209 -272344 -169774 -277115
16724b77115k09684L4902L5185L03075l1649j62444L2022m6225j31613R1628l144
$$ -277115 -486799 -451897 -416712 -113637 -145286 -307730 -275708 -321933 -453546 -361918 -365062
16713c65062k2952j9432P1550J3108Q8718K60881Q514k05845j58667K5813M0212
$$ -365062 -388014 -407446 -335896 -322788 -234070 26811 35325 -170520 -329187 -303374 -263162
16702b63162j52928m915N0038k8418j46374j36980K34226L17945J94411j5247
$$ -263162 -416090 -421005 -370967 -399385 -545759 -682739 -448513 -130568 63843 48596
16692D8596l8007j05964k55371K0350J5597k42044n2989Q5995j42470M6154L0715
$$ 48596 10589 -95375 -350746 -330396 -314799 -556843 -609832 -523837 -666307 -620153 -589438
16681e89438j05954K11341J59968J28548K2025k0922K06400M2501k4937r8552
$$ -589438 -695392 -484051 -324083 -195535 -173510 -194432 11968 54469 29532 -69020
16671f9020q814M7040m1382L1526o4123m6525j37399K22850p7689n9305R0382
$$ -69020 -77834 -30794 -72176 -40650 -104773 -151298 -288697 -65847 -143536 -202841 -112459
16660a12459j40985j77598k14905L06860M46146r1187p9870j04830n7860j54010
$$ -112459 -253444 -431042 -645947 -339087 107059 15872 -63998 -168828 -226688 -380698
16650c80698P2761L2298J8613p6828n9661K1482o9131l9548r5521n0989R938N0159
$$ -380698 -307937 -275639 -257026 -333854 -393515 -372033 -441164 -480712 -576233 -627222 -617284 -567125
16638e67125J93946Q0251m3342J74614O7281K1999k5906k0980N1369Q440O1289
$$ -567125 -373179 -292928 -336270 -161656 -94375 -72376 -98282 -119262 -67893 -59453 1836
16627A836j83710j84777j13158j43377P3095K27712J31782j83781Q9342L14952
$$ 1836 -181874 -366651 -479809 -623186 -550091 -322379 -190597 -374378 -285036 29916
16617B9916O0252Q3775k11830k46556J08646J82561o5310K3086r278p0413j3979
$$ 29916 90168 173943 -37887 -284443 -175797 6764 -58546 -35460 -44738 -115151 -129130
16606a29130k4843j74763j78687M4029J62350k5478j780J33194R5694j13757r8302
$$ -129130 -153973 -328736 -507423 -463394 -301044 -326522 -328302 -195108 -99414 -213171 -311473
16595c11473O7439N5151j4172J03624M6285N6101R4908N3413K6672l37405l83174
$$ -311473 -244034 -188883 -203055 -99431 -53146 2955 97863 151276 177948 -159457 -542631
16584e42631m7402q6407K8051J06953J70157j23755N0202J95593P0668m1018j09766
$$ -542631 -590033 -676440 -648389 -541436 -371279 -495034 -444832 -249239 -178571 -219589 -329355
16573c29355j69306K1101r0659l8067K3605J18297J80495k9252J26889J39273
$$ -329355 -498661 -477560 -568219 -606286 -582681 -464384 -283889 -313141 -186252 -46979
16563d6979m8344k36681k39570J13636K88173n438k17756K68644J85640j23994
$$ -46979 -95323 -332004 -571574 -457938 -169765 -175203 -392959 -124315 61325 -62669
16553f2669j07606N145K7408p1179j90048l1856P3832L9462n4161P1114k8659
$$ -62669 -170275 -165130 -137722 -208901 -398949 -430805 -356973 -317511 -371672 -300558 -329217
16542c29217j9904J49238K5411p3959L73199J53089k06088k18334R5574k8582
$$ -329217 -349121 -199883 -174472 -248431 124768 277857 71769 -146565 -50991 -79573
16532g9573J7756k14943n2912M549p8656P2946J4666R4717R4064o3672j13816
$$ -79573 -61817 -276760 -329672 -325123 -403779 -330833 -316167 -221450 -127386 -191058 -304874
16521c04874J0793K95800J41123l0648P8867k00131k50171j26854J60535J2319
$$ -304874 -294081 1719 142842 112194 191061 -9070 -259241 -386095 -225560 -213241
16511b13241r0569m405J26578O2757l8382j19389j47180K734R810j21181j01769
$$ -213241 -303810 -308215 -181637 -118880 -157262 -276651 -423831 -421097 -411287 -532468 -634237
16500f34237j50167R8851J12579K87582Q8822q2652j2674J48434L8168l8219n1073
$$ -634237 -784404 -685553 -572974 -285392 -196570 -279222 -291896 -143462 -105294 -143513 -194586
16489a94586K55228M4501j5507j38590q0033n4067j49296M7568q9452j15564j97470
$$ -194586 60642 105143 89636 -48954 -128987 -183054 -332350 -284782 -374234 -489798 -687268
16478f87268K9220K13444M61574N3934j05001n9744L5667j7902k60588k13690
$$ -687268 -658048 -444604 16970 70904 -34097 -93841 -58174 -76076 -336664 -550354
16468e50354J54190L3573j11552K5592L8114K2310J70783Q5462n0178r590o5817
$$ -550354 -396164 -362591 -474143 -448551 -410437 -388127 -217344 -131882 -182060 -191650 -257467
16457b57467j44595M4284R6191j16780n1377J4662O5027r4062m2362M9217O4994
$$ -257467 -402062 -357778 -261587 -378367 -429744 -415082 -350055 -444117 -486479 -437262 -372268
16446c72268Q6361N3699Q6228o2783j30570q4820j37488J36227J37310r9564j65833
$$ -372268 -285907 -232208 -145980 -208763 -339333 -424153 -561641 -425414 -288104 -387668 -553501
16435e53501J62786L6374j74949j08528N5551n4383J05114N4341q1950r1925J55238
$$ -553501 -390715 -354341 -529290 -637818 -582267 -636650 -531536 -477195 -559145 -651070 -495832
16424d95832K20671o7406k9149J05096K77649J48230r9229k61088N1253j6039
$$ -495832 -275161 -342567 -371716 -266620 11029 159259 60030 -201058 -149805 -165844
16414a65844M4843J44564j85642l33067J8888N5715J30702J70093l0420J27341
$$ -165844 -121001 23563 -162079 -495146 -476258 -420543 -289841 -119748 -150168 -22827
16404b2827j3833j82080o79J28200J1616J61951j89216j14857j3j9944k4378k72266
$$ -22827 -36660 -218740 -219419 -91219 -79603 82348 -106868 -221725 -221738 -241682 -266060 -538326
16392e38326M2215J48117j7963K2434j4340k87343n6315P3948K46324J60508L5851
$$ -538326 -496111 -347994 -365957 -343523 -357863 -645206 -701521 -627573 -381249 -220741 -184890
16381a84890N5436q649j00548l5612p111J89666M9326l7822m668k0499j78326
$$ -184890 -129454 -138103 -238651 -274263 -281374 -91708 -42382 -80204 -84872 -105371 -283697
16370b83697l53808l8581L06251K37337R4266j25596j08441m9390k4116L9124
$$ -283697 -637505 -676086 -369835 -132498 -38232 -163828 -272269 -321659 -345775 -306651
16360c06651O5318P8936r9174J05557R6748J3033N211j60586k43029j2950l200
$$ -306651 -241333 -162397 -261571 -156014 -59266 -46233 -41022 -201608 -444637 -457587 -460787
16349d60787Q0880J06879o0987k4681j16330n5192J02590J8101K53036Q7861j87234
$$ -460787 -379907 -273028 -334015 -358696 -475026 -530218 -427628 -409527 -156491 -68630 -255864
16338b55864k43834k2871p0862J18722K45497J33846j2057q8093r2130k0159r2011
$$ -255864 -499698 -522569 -593431 -474709 -229212 -95366 -107423 -195516 -287646 -307805 -399816
16327c99816J42701J19529M0319p881j61097p306J70282J51081J19944k46687
$$ -399816 -257115 -137586 -97267 -105148 -266245 -273551 -103269 47812 167756 -78931
16317g8931n74829o0748J74030p7048N3333J03680m8197M717M17086K47078O4219
$$ -78931 -653760 -714508 -540478 -617526 -564193 -460513 -508710 -503993 -86907 160171 224390
16306B24390q8963l8085k99730l43988P2527K62189j213P7179P4932j85850j70465
$$ 224390 135427 97342 -202388 -546376 -473849 -211660 -212873 -135694 -60762 -246612 -417077
16295d17077k78206J8680M6672P8884J4561P8673J78374J36737j67487j73762
$$ -417077 -695283 -676603 -629931 -551047 -536486 -457813 -279439 -142702 -310189 -483951
16285d83951l6718J25349J26632N7952N7103R7827j17915J43836P6519k11011
$$ -483951 -520669 -395320 -268688 -210736 -153633 -55806 -173721 -29885 46634 -164377
16275a64377k7800r8282r9140l3519J16972j130K5570K96048N5862k71837K5417
$$ -164377 -192177 -290459 -389599 -423118 -306146 -307276 -281706 14342 70204 -201633 -176216
16264a76216k6759J66778j14487j3600q0749K31797j40600j43659l3869J4530
$$ -176216 -202975 -36197 -150684 -164284 -245033 -13236 -153836 -297495 -331364 -316834
16254c16834K55307L13768n3155p2339k59050l23394n4243J0650N8720O7508J44816
$$ -316834 -61527 252241 199086 126747 -132303 -455697 -509940 -499290 -440570 -373062 -228246
16243b28246J20167l0327q5526r6442K77842J38328J16919j88426j47391P253
$$ -228246 -108079 -138406 -223932 -320374 -42532 95796 212715 24289 -123102 -115849
16233a15849j72790k2326J29938J23623k2960q0974k03415j3714L57778J98575
$$ -115849 -288639 -310965 -181027 -57404 -80364 -161338 -364753 -378467 -20689 177886
16223A77886l0241J1695p5729j51969J28616O9994n3314k82158q6243K92822l59
$$ 177886 147645 159340 83611 -68358 60258 130252 76938 -205220 -291463 1359 1000
16212A000j60537l8878R3431j28969k0494k7673j8988j03630M328O8062J17160
$$ 1000 -159537 -198415 -104984 -233953 -254447 -282120 -301108 -404738 -400410 -332348 -215188
16201b15188p9336o1551J64184k2447J48498Q8865j49798m8413J39804j90778
$$ -215188 -294524 -356075 -191891 -214338 -65840 23025 -126773 -175186 -35382 -226160
16191b26160j2314R7466j55280p787K49178Q4790k33078k75603K19442K38996
$$ -226160 -238474 -141008 -296288 -304075 -54897 29893 -203185 -478788 -259346 -20350
16181b0350k72531l80318j9522J28748J55806K69727J36211Q9690j03378j44260
$$ -20350 -292881 -673199 -692721 -563973 -408167 -138440 -2229 87461 -15917 -160177
16171a60177j14702j0095j5529J15544K0056m3341m6571J8869J72143J77354k0965
$$ -160177 -274879 -284974 -300503 -184959 -164903 -208244 -254815 -235946 -63803 113551 92586
16160I2586j09257J10405j58500j32189j30480P7388o8527M0359J46907N506K11927
$$ 92586 -16671 93734 -64766 -196955 -327435 -250047 -318574 -278215 -131308 -125802 86125
16149H6125L2302j03808r524k13140j68592L068K04013k479j3764o7557J32556
$$ 86125 118427 14619 5095 -208045 -376637 -373569 -169556 -172035 -185799 -253356 -120800
16138a20800K90242J94963j64867o6891l58224j38895N8553Q8224j10899J14513
$$ -120800 169442 364405 199538 132647 -225577 -364472 -305919 -217695 -328594 -214081
16128b14081n4278L7511Q890L4063j39757n7288L30498J50236j82986p3228K46390
$$ -214081 -268359 -230848 -221958 -187895 -327652 -384940 -54442 95794 -87192 -160420 85970
16117H5970J34517j42315k05133o6306J24013J09208Q489k81474P9428K42305
$$ 85970 220487 78172 -126961 -193267 -69254 39954 48443 -233031 -153603 88702
16107H8702J01223k26714m97043R692J44558R9812J191P3286K9698J73318J32051
$$ 88702 189925 -36789 -533832 -524140 -379582 -279770 -278579 -205293 -175595 -2277 129774
16096A29774j38958j03497O5849K19840k08098l0257j1941P8770n6183l2711j54349
$$ 129774 -9184 -112681 -46832 173008 -35090 -65347 -77288 1482 -54701 -87412 -241761
16085b41761q1398r9707N2825l9829j1203K36440j20015j02492j7155m5651N7694
$$ -241761 -323159 -422866 -370041 -409870 -421073 -184633 -304648 -407140 -424295 -469946 -412252
16074d12252M2111K49320O5363N1480n739O7413o116P028J64713q0879k46660
$$ -412252 -370141 -120821 -55458 -3978 -9717 57696 51580 58608 223321 142442 -104218
16063a04218j70154J65236O9097j45310j03857L06646K21756j59491l9860J4191
$$ -104218 -274372 -109136 -40039 -185349 -289206 17440 239196 79705 39845 54036
16053E4036K04470r2970J3586O8115P2149P0018k46345j61483k56555q6054L24210
$$ 54036 258506 165536 179122 247237 319386 389404 143059 -18424 -274979 -361033 -36823
16042c6823P6483m6616j3798P8204p3199j58501n3978Q2967L0215q9577J0993
$$ -36823 39660 -6956 -20754 57450 -15749 -174250 -228228 -145261 -115046 -204623 -193630
16031a93630J21721k8050k3125k6513N5908R1184N3623j71415R119Q3034k16812
$$ -193630 -71909 -99959 -123084 -149597 -93689 -2505 51118 -120297 -111178 -28144 -244956
16020b44956l2642K26901P6780j6138J96358k7626R5341J07371j67396j71488
$$ -244956 -277598 -50697 26083 9945 206303 178677 274018 381389 213993 42505
16010D2505k7909J9455l47952k58235j5956K66177K4638J06142j7335j42298R4926
$$ 42505 14596 34051 -313901 -572136 -588092 -321915 -297277 -191135 -208470 -350768 -255842
15999b55842L166J64522L12570j21097j04688P3794k09522M7566J40075Q1362
$$ -255842 -252676 -88154 224416 103319 -1369 72425 -137097 -89531 50544 131906
15989A31906k20269j50291J56139o3185q6783m5039N6316K03295J38586J29079
$$ 131906 -88363 -238654 -82515 -145700 -232483 -277522 -221206 -17911 120675 249754
15979B49754M6916n0103l9365O8656k30244m4269L7367L0725o1053n3694k3597
$$ 249754 296670 246567 207202 275858 45614 1345 38712 69437 8384 -45310 -68907
15968f8907m9826M39513J78123k09570l62032J16365K57536k4296N9920j35288
$$ -68907 -118733 320780 498903 289333 -72699 43666 301202 276906 336826 201538
15958B01538l65197n6002J6354J88860P260M9066R7997j07654j37400J56168J63705
$$ 201538 -163659 -219661 -203307 -14447 -7187 41879 139876 32222 -105178 50990 214695
15947B14695K48233j41527j69267K51288J14685k28644l11013J03198K2218J8372
$$ 214695 462928 321401 152134 403422 518107 289463 -21550 81648 103866 122238
15937A22238J62935Q4035j48870k12168o1601j08702q3356J3361K21464n2341
$$ 122238 285173 369208 220338 8170 -53431 -162133 -245489 -232128 -10664 -63005
15927f3005r6032P9984p4703J09997M0452j31387O544K06992K66915q1490k26512
$$ -63005 -159037 -79053 -153756 -43759 -3307 -134694 -128150 78842 345757 264267 37755
15916C7755j00145O9959R7960j77034K5604J91779j86958L9512J54998j06957
$$ 37755 -62390 7569 105529 -71505 -45901 145878 -41080 -1568 153430 46473
15906D6473j28641J21271J02271l5228O273l7987m6959M3142k10284m32623j33139
$$ 46473 -82168 39103 141374 106146 112419 74432 27473 70615 -139669 -572292 -705431
15895g05431K59895J42428k01010J29212M00688J51317k03709m3810p8557J49927
$$ -705431 -445536 -303108 -504118 -374906 25782 177099 -26610 -70420 -148977 950
15885I50J29588K4734P6673j65786j27800j22730j01264K04157K73818j8029n7935
$$ 950 130538 155272 231945 66159 -61641 -184371 -285635 -81478 192340 174311 116376
15874A16376j86801J48364l9946k61895o2625L46891K39911r9949j1049j05213
$$ 116376 -70425 77939 37993 -223902 -286527 60364 300275 200326 189277 84064
15864H4064j78483L1711j51267q1341K56644j6544j9158K41188O563J24153L0146
$$ 84064 -94419 -62708 -213975 -295316 -38672 -55216 -74374 166814 173377 297530 327676
15853C27676j43123l0169m2032j11769j39582j08996O6529j7283m937R9389J09160
$$ 327676 184553 154384 112352 583 -138999 -247995 -181466 -198749 -203686 -104297 4863
15842D863O124r8346J74887m6721o3592p8428j00584M8176Q1832O6552j31108
$$ 4863 10987 -87359 87528 40807 -22785 -101213 -201797 -153621 -71789 -5237 -136345
15831a36345k4074J1516J27063j12898k49678n5710Q5016J75506L19555j10299
$$ -136345 -160419 -148903 -21840 -134738 -384416 -440126 -355110 -179604 139951 29652
15821B9652o8350K55056r7274J94224p2728k25590k43334k2958J4492L623K27106
$$ 29652 -38698 216358 119084 313308 240580 14990 -228344 -251302 -236810 -233187 -6081
15810f081J79761N666K28439k39609k06206j56016J45393J14982k2638R7818l1329
$$ -6081 173680 179346 407785 168176 -38030 -194046 -48653 66329 43691 141509 110180
15799A10180P2663n581p7471q758M0860O241j78303j0561k91338P9289K69911
$$ 110180 182843 177262 99791 91033 131893 138134 -40169 -50730 -342068 -262779 7132
15788G132j07864j31679l1053l94j03716m7435K02263l4451M0666J28083o5867
$$ 7132 -100732 -232411 -263464 -263858 -367574 -415009 -212746 -247197 -206531 -78448 -144315
15777a44315r355k81989p8324J90246K60810m6836j96047r6489J74968L4822L8217
$$ -144315 -153670 -435659 -513983 -323737 -62927 -109763 -305810 -402299 -227331 -192509 -154292
15766a54292J86441j00872j29704J88934J86502R5930j85171j16321k8724O6182
$$ -154292 32149 -68723 -198427 -9493 177009 272939 87768 -28553 -57277 8905
15756H905L0084k37655j36261J69676L84651J58305o6284m0809p0014K2003P269
$$ 8905 38989 -198666 -334927 -165251 219400 377705 311421 270612 200598 222601 229870
15745B29870Q9295k14452Q4422K10786r4546j83621k97752J53406K83590Q9337
$$ 229870 319165 104713 189135 399921 305375 121754 -175998 -22592 260998 350335
15735C50335j46870p4045N2164l6916j9516r9030K0990r4894N9409r701k40227
$$ 350335 203465 129420 181584 144668 125152 26122 47112 -47782 11627 1926 -238301
15724b38301j6840L7759L10609L33100N5858J01130r7329j91303j85777j1441
$$ -238301 -255141 -217382 93227 426327 482185 583315 485986 294683 108906 97465
15714I7465j62874j24993O1080J14916P0490M2200p2396p2770m0133l9950r6111
$$ 97465 -65409 -190402 -129322 -14406 56084 98284 25888 -46882 -87015 -126965 -223076
15703b23076m7489l7408J27956K49453R7660j75607J05754J04501J05276J17966
$$ -223076 -270565 -307973 -180017 69436 167096 -8511 97243 201744 307020 424986
15693D24986l9331j58714k54054j951l0593q6251m6438K25615Q6497j25153M7713
$$ 424986 385655 226941 -27113 -29064 -59657 -145908 -192346 33269 119766 -5387 42326
15682D2326J85386K80804J04723j21972o6918N4317k15194o8290M0213j40181
$$ 42326 227712 508516 613239 491267 424349 478666 263472 195182 235395 95214
15672I5214J98942m6915j77912R3471L40061J01089k58989n1156J19204J76286
$$ 95214 294156 247241 69329 162800 502861 603950 344961 293805 413009 589295
15662E89295J6783k88079n6635n7398M5573J37767k17587n8106o3047J81038J72374
$$ 589295 606078 317999 261364 203966 249539 387306 169719 111613 48566 229604 401978
15651D01978L29599j38417k81720j39032j3369r3345j70215J12807J84140k9241
$$ 401978 731577 593160 311440 172408 159039 65694 -104521 8286 192426 163185
15641A63185j08480j95838o1834J16279K0658L31649Q7962n6721O0771L228K10872
$$ 163185 54705 -141133 -202967 -86688 -66030 265619 353581 296860 357631 360859 571731
15630E71731L9121j93614k34951Q0492K00395j24801j06732K61862q1984j20958
$$ 571731 610852 417238 182287 262779 463174 338373 231641 493503 411519 290561
15620B90561J21024k74647N1105J61299o4407n7167k2364k16925l47559J93382
$$ 290561 411585 136938 188043 349342 284935 227768 205404 -11521 -359080 -165698
15610a65698J86874K38174K55076J67173j56283j21590l03117j70649o2447J6500
$$ -165698 21176 259350 514426 681599 525316 403726 100609 -70040 -132487 -115987
15600a15987k6927J20136j91330j08177J67654M92827J00734n6630n3186j29763
$$ -115987 -142914 -22778 -214108 -322285 -154631 338196 438930 382300 329114 199351
15590A99351j87833O4672N2565L1537K20555m8950k78295o8027M5372k8263J50636
$$ 199351 11518 76190 128755 160292 380847 331897 53602 -14425 30947 2684 153320
15579A53320J11081j37116j60521J08723Q858j61980J47027j49150J26959J40049
$$ 153320 264401 127285 -33236 75487 84345 -77635 69392 -79758 47201 187250
15569A87250p6165j74427j2798J30484R5358q7753J7374M6532K0164r4764l18432
$$ 187250 111085 -63342 -76140 54344 149702 61949 79323 125855 146019 51255 -267177
15558b67177l02157K13937L60046K11724M1376J90233R8937K3839j19297j45486
$$ -267177 -569334 -355397 4649 216373 257749 447982 546919 570758 451461 305975
15548C05975k4770j16209k5389J81358j6509l6173j32803k0077P7872j34043l27230
$$ 305975 281205 164996 139607 320965 304456 268283 135480 115403 193275 59232 -267998
15537b67998Q0035K48453J15763k9683o6182j83375k29662K17782N6201n8495
$$ -267998 -187963 60490 176253 146570 80388 -102987 -332649 -114867 -58666 -117161
15527a17161L7677M28507j08569N0275l4551j84973J37269K0536k58396J00976
$$ -117161 -79484 349023 240454 290729 256178 71205 208474 229010 -29386 71590
15517G1590K52881p2997q1521N4443J26048q0789j6377J85797n2233k14100k75280
$$ 71590 324471 251474 169953 224396 350444 269655 253278 439075 386842 172742 -102538
15506a02538O9072K47926K17669q7330j04221N7233j37618K8766K28778J74624
$$ -102538 -33466 214460 432129 344799 240578 297811 160193 188959 417737 592361
15496E92361j5360m4971K12395J20327j46693j04224r697j74468R571j02750n9439
$$ 592361 577001 532030 744425 864752 718059 613835 604138 429670 439241 336491 277052
15485B77052J20662P085p7901J34670J2238j48462p0151M1718o7240J04761J72308
$$ 277052 397714 404799 326898 461568 473806 325344 255193 296911 229671 334432 506740
15474E06740j08759k58081p3299j76334Q4900P2831m5032l9900n586M0921J11552
$$ 506740 397981 139900 66601 -109733 -24833 47998 2966 -36934 -42520 -1599 109953
15463A09953K54921j90073J26546J34959J6843o2601Q4954J8236j06692Q5296
$$ 109953 364874 174801 301347 436306 453149 390548 475502 493738 387046 472342
15453D72342J02005R3090k7987k32474J09953j34574k2337J40903j26293k86024
$$ 472342 574347 667437 639450 406976 516929 382355 360018 500921 374628 88604
15443H8604n0388R5495m3172J35300L60276j20225O4599R2447o5299J83810j92392
$$ 88604 38216 133711 90539 225839 586115 465890 530489 622936 557637 741447 549055
15432E49055j54930J71659p0860k4438n1743l02039j94667J90848K2368q4548
$$ 549055 394125 565784 494924 470486 418743 116704 -77963 112885 135253 50705
15422E0705j6648K97238J20852j88162p8479J42438Q8596P8225j50215N2007k4968
$$ 50705 34057 331295 452147 263985 185506 327944 416540 494765 344550 396557 371589
15411C71589K59734O399j69601o3377j77557m5037m1254K73670J66951R5847p8046
$$ 371589 631323 637722 468121 404744 227187 182150 140896 414566 581517 677364 599318
15400E99318k65733j00368N645l7323k04376p2808J48252K13836J37343r044k24387
$$ 599318 333585 233217 238862 201539 -2837 -75645 72607 286443 423786 414742 190355
15389A90355K4023O097l7180O4449J36572N8458R8547K37669P7538p8500l51160
$$ 190355 214378 220475 183295 247744 384316 442774 541321 778990 856528 778028 426868
15378D26868l46128K11809Q6059j65459j1194N5644o0917o3968J34853K23284
$$ 426868 80740 292549 378608 213149 201955 257599 196682 132714 267567 490851
15368D90851K8723j08045J63642J94040j07318k12088j85962l12237o3405J83142
$$ 490851 519574 411529 575171 769211 661893 449805 263843 -48394 -111799 71343
15358G1343L2112J97001J82769J30807k16914k40498k2954J42541K7012K0862
$$ 71343 103455 300456 483225 614032 397118 156620 133666 276207 303219 324081
15348C24081J52598k4511m6982o0429Q6652J40375J0511j22360K23787k346n1461
$$ 324081 476679 452168 405186 344757 431409 571784 582295 459935 683722 681376 629915
15337F29915k5981J4976M8488K903k055j61360j19770j31503r2543J66395L8866
$$ 629915 603934 618910 667398 670301 668246 506886 387116 255613 163070 329465 368331
15326C68331N2216j07598j37294J54091J05697O6606J3597j46204p2212Q2273
$$ 368331 420547 312949 175655 329746 435443 502049 515646 369442 297230 379503
15316C79503O0975J2594j45942N4703R9301k0217j85145k68576k5331L3454K63167
$$ 379503 440478 453072 307130 361833 461134 440917 255772 -12804 -38135 -4681 258486
15305B58486J58288J87730J52724l09470j76747q4246O9645M4304k52594Q4962
$$ 258486 416774 604504 757228 447758 271011 186765 256410 300714 48120 133082
15295A33082J77061K8458j7308J86012R2910J23826l8083j21124M7728L69546
$$ 133082 310143 338601 321293 507305 600215 724041 685958 564834 612562 982108
15285I82108m3863k37485k26398j50981m4634K04096Q4662j32413J7007O8880
$$ 982108 938245 700760 474362 323381 278747 482843 567505 435092 452099 520979
15275E20979J34536Q7115j02725o7592j00009k14338Q5685J32832R4215J34295
$$ 520979 655515 742630 639905 572313 472304 257966 343651 476483 570698 704993
15265G04993k8378j18000j26899j751L7067P6185R4273l70328k35140K20518J39004
$$ 704993 676615 558615 431716 429965 467032 543217 637490 267162 32022 252540 391544
15254C91544L00875n9404k08675q9325Q0872k3251m9390m909j86593n326J2973
$$ 391544 692419 633015 424340 335015 415887 392636 343246 338337 151744 146418 159391
15243A59391L6909J82347R3180L18320J93792k46480k38756K423J05927K3535
$$ 159391 196300 378647 471827 790147 983939 737459 498703 501126 607053 630588
15233F30588M0513m2587j84646q7088N8637O6387N6356k7435o9674R8383K43396
$$ 630588 671101 628514 443868 356780 415417 481804 538160 510725 441051 539434 782830
15222G82830l2250n6527j65535K37416j26835j00585j5677L6508m5862k76822
$$ 782830 750580 694053 528518 765934 639099 538514 522837 559345 513483 236661
15212B36661p3110J52914O2875j50268J03916M0667k72P9872J01993m5268P3735
$$ 236661 163551 316465 379340 229072 332988 373655 373383 453255 555248 509980 583715
15201E83715L51699Q5308J80227j47205k87871j66690m7108q2746j78121O0171
$$ 583715 935414 1020722 1200949 1053744 765873 599183 552075 469329 291208 351379
15191C51379J00552K5264K41234J86419J48371p5936k14145j64842p6148k4366
$$ 351379 451931 477195 718429 904848 1053219 977283 763138 598296 522148 497782
15181D97782l2814j40200J24446Q089o7235J20280L20730L1450j15853k3727l25574
$$ 497782 464968 324768 449214 457303 390068 510348 831078 862528 746675 722948 397374
15170C97374k96872J56286Q2453K11655J31687j17229K74175q010j72387n2622
$$ 397374 100502 256788 339241 550896 682583 565354 839529 831519 659132 606510
15160F06510p8437K4480k13620j37017L87245K54303k25649j52080j2496o5560
$$ 606510 528073 552553 338933 201916 589161 843464 617815 465735 453239 387679
15150C87679q1585K63230J53203J77343j23176k56391M1455J97826N3974k2245
$$ 387679 306094 569324 722527 899870 776694 520303 561758 759584 813558 791313
15140G91313j89875J62655j47841q8333M2172k0000K61553R9206o785m9813r0558
$$ 791313 601438 764093 616252 527919 570091 550091 811644 910850 904065 854252 763694
15129G63694n3610K8193j36640j20887p5833L0663L14203N2780J08738k25660
$$ 763694 710084 738277 601637 480750 404917 435580 749783 802563 911301 685641
15119F85641j401J31164O5035J4907j96804j30J72736k08870m2455L5712k26384
$$ 685641 684240 815404 880439 895346 698542 698412 871148 662278 619823 655535 429151
15108D29151K6293J32645L9538L7942k9221L0389j71560J55194j444j22355j31215
$$ 429151 455444 588089 627627 665569 636348 666737 495177 650371 648927 526572 395357
15097C95357j3321j2142R7759l1822K38783P0537J20468k2398j73087P6883r3492
$$ 395357 382036 369894 467653 435831 674614 745151 865619 843221 670134 747017 653525
15086F53525j53591L024N4872J2034l7396L8555l1831m2182K6018J13840R5854
$$ 653525 499934 502958 557830 569864 532468 571023 539192 497010 523028 636868 732722
15075G32722l3366j00801l3192J38802J45395r3509k24071J09393m4602P4028
$$ 732722 699356 598555 565363 704165 849560 756051 531980 641373 596771 670799
15065F70799J45560j33790j97087J7738J93728n067N4835k6784J29531Q0636k2181
$$ 670799 816359 682569 485482 503220 696948 691881 746716 719932 849463 930099 907918
15054I07918K7677k7549J98534J68841j97831l32483j40835j7721J61146L8612
$$ 907918 935595 908046 1106580 1275421 1077590 745107 604272 586551 747697 786309
15044G86309j52527n7586J28642q2151j18146J78102J84038j63791j75868m6178
$$ 786309 633782 576196 704838 622687 504541 682643 866681 702890 527022 480844
15034D80844R5715K66400n0522N4951K86425K37469j98868k00529J55372k3190
$$ 480844 576559 842959 792437 847388 1133813 1371282 1172414 971885 1127257 1104067
15024A104067j67527p9435k45603J34265L08286j09801k41317N3441J53709n0584
$$ 1104067 936540 857105 611502 745767 1054053 944252 702935 756376 910085 859501
15014H59501k0527r0038k19313J71044K27045J86286J08180j19796j44947J03742
$$ 859501 838974 748936 529623 700667 927712 1113998 1222178 1102382 957435 1061177
15004A061177n9761Q5380R3872p8031l2934L9034J51751j29694j26058J14118
$$ 1061177 1001416 1086796 1180668 1102637 1069703 1108737 1260488 1130794 1004736 1118854
14994A118854O6041j38298K7937J83352j64713l14571J0295r2646j73714J32543
$$ 1118854 1184895 1046597 1074534 1257886 1093173 778602 788897 696251 522537 655080
14984F55080J20836P5266Q0270j47441l2502k8492p8005O8961J61443J1429k77081
$$ 655080 775916 851182 931452 784011 751509 723017 645012 713973 875416 886845 609764
14973F09764r2385R4716M2517P3887L55063J20001r6199j41060J24735K17239
$$ 609764 517379 612095 654612 728499 1083562 1203563 1107364 966304 1091039 1308278
14963A308278O32L346l4207j7749j05995q0998j29007K81598J63013k7841P3361
$$ 1308278 1308910 1312256 1278049 1260300 1154305 1073307 944300 1225898 1388911 1361070 1434431
14952A434431j85725k66343j60557m4872J96582j31874o4996J21986K96914N1085
$$ 1434431 1248706 982363 821806 776934 973516 841642 776646 898632 1195546 1246631
14942A246631j21310N0174N0113j00043o1983n8232J08206j37167j17429J23375
$$ 1246631 1125321 1175495 1225608 1125565 1063582 1005350 1113556 976389 858960 982335
14932I82335Q0871L1386M7653m1694j57638r7387O7362K65588N2325L6287o9989
$$ 982335 1063206 1094592 1142245 1100551 942913 845526 912888 1178476 1230801 1267088 1197099
14921A197099j80138K53j21177k2883J34043m2088j51615N8695K32121J07439
$$ 1197099 1016961 1017214 896037 873154 1007197 965109 813494 872189 1104310 1211749
14911A211749p5383m930l7647K55581k34760j08218Q4514L3036p6627L15314n9987
$$ 1211749 1136366 1131436 1093789 1349370 1114610 1006392 1090906 1123942 1047315 1362629 1302642
14900A302642k94069k91572M6505J37137j0534m2064o2523P2311J06927l0540
$$ 1302642 1008573 717001 763506 900643 890109 848045 785522 857833 964760 934220
14890I34220J21971m430L6367J4430j63560L5229k4783j46071k5999L7122q1869
$$ 934220 1056191 1051761 1088128 1102558 938998 974227 949444 803373 777374 814496 732627
14879G32627j06905J0368K41487M45492J985j24431J08532J6785l16013k45003
$$ 732627 625722 636090 877577 1323069 1325054 1200623 1309155 1325940 1009927 764924
14869G64924J7737J67494J00098j71756P6109J23424n0815l0144K57846j8153
$$ 764924 782661 950155 1050253 878497 954606 1078030 1027215 997071 1254917 1236764
14859A236764j10139J42997j17284l00545l03388J93291L52612J47686j96967
$$ 1236764 1126625 1269622 1152338 851793 548405 741696 1094308 1241994 1045027
14850A045027l07173J20114J69320J56708M060J95411P4817M2651j65257j90457
$$ 1045027 737854 857968 1027288 1183996 1188056 1383467 1458284 1500935 1335678 1145221
14840A145221p4293j12619K56405M739J1894j60523K07512K17365L8693j62000
$$ 1145221 1070928 958309 1214714 1219453 1231347 1070824 1278336 1495701 1534394 1372394
14830A372394j69560J51003J92465k1400K1096j48527k43278J44740N186J76653
$$ 1372394 1202834 1353837 1546302 1524902 1545998 1397471 1154193 1298933 1304119 1480772
14820A480772R3457j5307J18731j57780q0205q4951j08096J50576J30668n1708
$$ 1480772 1574229 1558922 1677653 1519873 1439668 1354717 1246621 1397197 1527865 1476157
14810A476157l44126j24095Q3001k58784L46593N53579O5726k30900p5459J44583
$$ 1476157 1132031 1007936 1090937 832153 1178746 1732325 1798051 1567151 1491692 1636275
14800A636275j22818j42334O3991R8636L2807j1699q0310j68298j75659K3775
$$ 1636275 1513457 1371123 1435114 1533750 1566557 1554858 1474548 1306250 1130591 1154366
14790A154366N1415Q9947r6347j90252K2146J42993j33268J37975J23167k7352
$$ 1154366 1205781 1295728 1199381 1009129 1031275 1174268 1041000 1178975 1302142 1274790
14780A274790k07251K16773K51184q2205J33989J96303J62176j01414l21012j26497
$$ 1274790 1067539 1284312 1535496 1453291 1587280 1783583 1945759 1844345 1523333 1396836
14770A396836O4666K04180n7994p4512j11458k43006p9888O7800J46476J06510
$$ 1396836 1461502 1665682 1607688 1533176 1421718 1178712 1098824 1166624 1313100 1419610
14760A419610q5445q2704j67262J60464l4514j77835J2691K51701j9575k04352
$$ 1419610 1334165 1251461 1084199 1244663 1210149 1032314 1045005 1296706 1277131 1072779
14750A072779J8555K78709j24753j22714J38498J08208J81476q0468j56004r8570
$$ 1072779 1091334 1370043 1245290 1122576 1261074 1369282 1550758 1470290 1314286 1215716
14740A215716O9788q9624J26898R1814q1887j52464J44430J56289O899j3172J68622
$$ 1215716 1285504 1195880 1322778 1414592 1332705 1180241 1324671 1480960 1487859 1474687 1643309
14729A643309n0312M2961O1170K3931j85288k2042o0504k98333j26755K47817
$$ 1643309 1592997 1635958 1697128 1721059 1535771 1513729 1453225 1154892 1028137 1275954
14719A275954L27987J6529j50125Q6949L98120K28194k82247j50256K3569j83349
$$ 1275954 1603941 1620470 1470345 1557294 1955414 2183608 1901361 1751105 1774674 1591325
14709A591325N5697k4486Q8933j8635M1866J50013K9165j34268k2768J45740J26942
$$ 1591325 1647022 1622536 1711469 1692834 1734700 1884713 1913878 1779610 1756842 1902582 2029524
14698B029524k58756j38506j20259N6732j75479j66312J85876J47669p5889j4396
$$ 2029524 1770768 1632262 1512003 1568735 1393256 1226944 1412820 1560489 1484600 1470204
14688A470204K44306K57590r9112j65564p3859j37187M4497J3347J29590L2270
$$ 1470204 1714510 1972100 1872988 1707424 1633565 1496378 1540875 1554222 1683812 1716082
14678A716082J47820J6429p4833j46874k8205J22414J33949P674K58534k9543
$$ 1716082 1863902 1880331 1805498 1658624 1630419 1752833 1886782 1894456 2152990 2123447
14668B123447j66640k00662J10182J53016k0749j26748K40345J03546r2428N8659
$$ 2123447 1956807 1756145 1866327 2019343 1998594 1871846 2112191 2215737 2123309 2181968
14658B181968j85990j15702j26509J00358j0067J0059M7050j00679p355J19596
$$ 2181968 1995978 1880276 1753767 1854125 1844058 1854117 1901167 1800488 1793133 1912729
14648A912729R8242K00260j89616j98508p7036m1572M1230M2227j14393j39054
$$ 1912729 2010971 2211231 2021615 1823107 1746071 1704499 1745729 1787956 1673563 1534509
14638A534509j72498J36243R7519J67124k0353m1840k27840j0989Q9463L19160
$$ 1534509 1362011 1498254 1595773 1762897 1742544 1700704 1472864 1461875 1551338 1870498
14628A870498K30917p0775J16569l1429j06223n8188k19209k8816J78022K41569
$$ 1870498 2101415 2030640 2147209 2115780 2009557 1951369 1732160 1703344 1881366 2122935
14618B122935K4401k07019j57377J09771n9197j87104j07567r4854J73964J09055
$$ 2122935 2147336 1940317 1782940 1892711 1833514 1646410 1538843 1443989 1617953 1727008
14608A727008P9233l4044j70556m9226k4888N0336L75n2170j957J65885J5052
$$ 1727008 1806241 1772197 1601641 1552415 1527527 1577863 1578238 1526068 1524111 1689996 1705048
14597A705048J39772j19841p1661j7967r0620j41758O9198J40093Q3370l517N080
$$ 1705048 1844820 1724979 1653318 1635351 1544731 1402973 1472171 1612264 1695634 1692117 1697197
14586A697197K09731o0793J56063r1655k8178J27399j65936l336J69731J18969
$$ 1697197 1906928 1846135 2002198 1910543 1882365 2009764 1843828 1840492 2010223 2129192
14576B129192P3748q5419k66315j94179r6454N6124L4609J28881J22943K33344
$$ 2129192 2202940 2117521 1851206 1657027 1560573 1616697 1651306 1780187 1903130 2136474
14566B136474l2837j68899k48981p6635j26740P3609J32543j00915N60q9987L5072
$$ 2136474 2103637 1934738 1685757 1609122 1482382 1555991 1688534 1587619 1588179 1498192 1533264
14555A533264L28921O7709j19232k6608j10379j03367M9619J61538O7550L49830
$$ 1533264 1862185 1929894 1810662 1784054 1673675 1570308 1619927 1781465 1849015 2198845
14545B198845j56562l04142J89406K2082l37270j03816J64706K77350J24320K21887
$$ 2198845 2042283 1738141 1927547 1949629 1612359 1508543 1673249 1950599 2074919 2296806
14535B296806j21932l73309r0173K67583O5086j88229m5993J02870n9881K7152
$$ 2296806 2174874 1801565 1711392 1978975 2044061 1855832 1809839 1912709 1852828 1879980
14525A879980p7111Q4569J7988j3608j3601j21395j01327k5511Q1555M2539J21373
$$ 1879980 1802869 1887438 1905426 1891818 1878217 1756822 1655495 1629984 1711539 1754078 1875451
14514A875451L1919o9840m1348L1640j8167J79231L38870J58316q0609R2206J936
$$ 1875451 1907370 1837530 1796182 1827822 1809655 1988886 2327756 2486072 2405463 2497669 2499605
14503B499605j34971k0348k13752k63282L0070m5280K61450n0126R4881J26546
$$ 2499605 2364634 2344286 2130534 1867252 1897322 1852042 2113492 2063366 2158247 2284793
14493B284793p7534j79376l4806j39001j69011N1324j0404J47642j96995J58461
$$ 2284793 2207259 2027883 1993077 1854076 1685065 1736389 1725985 1873627 1676632 1835093
14483A835093k524j11175O0306L00977L8854J07696L5362j24053J66359J38829
$$ 1835093 1832569 1721394 1781700 2082677 2121531 2229227 2264589 2140536 2306895 2445724
14473B445724j02969l9799P7134j58376m5512J25784K68294J7517j40662m6126
$$ 2445724 2342755 2302956 2380090 2221714 2176202 2301986 2570280 2587797 2447135 2401009
14463B401009M0242q8162R8692l55205l19601K20985K91513k05537k22297K10995
$$ 2401009 2441251 2353089 2451781 2096576 1776975 1997960 2289473 2083936 1861639 2072634
14453B072634Q9428k31654k51597j6177L65341J59714P215K01273L1409m7365
$$ 2072634 2162062 1930408 1678811 1662634 2027975 2187689 2194904 2396177 2427586 2380221
14443B380221k15507k86953J20874L99733K32534p9054o747j69077j68821J61170
$$ 2380221 2164714 1877761 1998635 2398368 2630902 2551848 2545101 2376024 2207203 2368373
14433B368373N3067r6397j32680M8794N9332J22698J35438J0591m0158J397m9805
$$ 2368373 2421440 2325043 2192363 2241157 2300489 2423187 2558625 2569216 2529058 2530455 2480650
14422B480650j74579j31746K43818M432o1458L6737N3070L01433J65064l46472
$$ 2480650 2306071 2174325 2418143 2422575 2361117 2397854 2450924 2752357 2917421 2570949
14412B570949l23290k53335J04053Q9634J05452n233k20410N0657L74023N5237
$$ 2570949 2247659 1994324 2098377 2188011 2293463 2288230 2067820 2118477 2492500 2547737
14402B547737r1830j00043L6254K48361j43065j98938k94521k4990J92065J46744
$$ 2547737 2455907 2355864 2392118 2640479 2497414 2298476 2003955 1978965 2171030 2317774
14392B317774L37899j69120k04021j9859N2605L56883K40660j90567j21822j42367
$$ 2317774 2655673 2486553 2282532 2262673 2315278 2672161 2912821 2722254 2600432 2458065
14382B458065J17982N6059m2447p9382o6447j68165m1004O0512J39087n7048j932
$$ 2458065 2576047 2632106 2589659 2510277 2443830 2275665 2234661 2295173 2434260 2377212 2375280
14371B375280j1495r7102L8380j00655O8080K12438K64293Q5138N1119j65343
$$ 2375280 2363785 2266683 2305063 2204408 2272488 2484926 2749219 2834357 2885476 2720133
14361B720133l1408n5927M500p4576o1358l06813k1781M7954R4114J7531O8648
$$ 2720133 2688725 2632798 2637298 2562722 2501364 2194551 2172770 2220724 2314838 2332369 2401017
14350B401017J27574K30711j12538k54740Q0129J82481N7776K2601r2723o0732
$$ 2401017 2528591 2759302 2646764 2392024 2472153 2654634 2712410 2735011 2642288 2581556
14340B581556m379k38275k4317J15974k1338M821j10054J41045K0341J4825K01679
$$ 2581556 2577177 2338902 2314585 2430559 2409221 2414042 2303988 2445033 2465374 2480199 2681878
14329B681878M1231P0600J8978J0224q5192l59911J10362K12994J08229Q9972
$$ 2681878 2723109 2793709 2812687 2822911 2737719 2377808 2488170 2701164 2809393 2899365
14319B899365P1977n6748Q512j42425k36203k17468Q5568J17998j52340k5708
$$ 2899365 2971342 2914594 2923106 2780681 2544478 2327010 2412578 2530576 2378236 2352528
14309B352528K0376o4922p486K39671J25199J08158J07647J19562o0422j88871
$$ 2352528 2372904 2307982 2300496 2540167 2665366 2773524 2881171 3000733 2940311 2751440
14299B751440j7477L1511J08484J29184j290J87477J42077o0455j01940j17195
$$ 2751440 2733963 2765474 2873958 3003142 3001852 3189329 3331406 3270951 3169011 3051816
$$ [...]
##END NTUPLES=NMR SPECTRUM
##END=
