##TITLE=Analysis number 328932
Compound Code cc 12201
Book Reference lab3
Project Code adrs
Chemist Name stores
##JCAMPDX= 6.0         $$ Bruker NMR JCAMP-DX V2.0
##DATA TYPE= NMR SPECTRUM
##DATA CLASS= NTUPLES
##ORIGIN= Bruker BioSpin GmbH
##OWNER= nmr
$$ XWIN-NMR		Version 3.5
$$ Tue Jul 17 11:58:55 2007 GMT Daylight Time (UT+1h)  MAYBRIDGE\nmr@NMR_250MHZ
##.OBSERVE FREQUENCY= 250.131544655141
##.OBSERVE NUCLEUS= ^1H
##.ACQUISITION MODE= SIMULTANEOUS (DQD)
##.ACQUISITION SCHEME= undefined
##.AVERAGES= 16
##.DIGITISER RES= 18
##SPECTROMETER/DATA SYSTEM= dpx250
##.PULSE SEQUENCE= zg30
##.SOLVENT NAME= DMSO
##.SHIFT REFERENCE= (INTERNAL, DMSO, 0, 16.522)
##AUDIT TRAIL= $$ (NUMBER, WHEN, WHO, WHERE, WHAT)
$$ ##TITLE= Audit trail, XWIN-NMR		Version 3.5
$$ ##JCAMPDX= 5.01
$$ ##ORIGIN= Bruker BioSpin GmbH
$$ ##OWNER= nmr
$$ C:\u/data/dgb/nmr/ADRS/1130/pdata/1/auditp.txt
$$ ##AUDIT TRAIL=  $$ (NUMBER, WHEN, WHO, WHERE, WHAT)
(   1,<2007-07-17 11:58:36.15 +100>,<MAYBRIDGE\nmr>,<NMR_250MHZ>,
      <created by zg, POWCHK disabled, PULCHK disabled
       configuration hash MD5:
       76 6E 9A 78 1E 09 19 81 EC 84 63 8F B0 6A 59 2D
       data hash MD5: 64K
       50 C9 87 3D BD 35 29 D5 51 C3 26 CF 50 D1 FA 80>)
(   2,<2007-07-17 11:58:47.04 +100>,<MAYBRIDGE\nmr>,<NMR_250MHZ>,
      <Start of raw data processing
       ef LB = 0.3 FT_mod = 6 PKNL = 1 SI = 32K 
       data hash MD5: 32K
       9E FA 62 EA D7 56 BE 2C 50 11 53 9E E7 B0 8D 6A>)
(   3,<2007-07-17 11:58:48.76 +100>,<MAYBRIDGE\nmr>,<NMR_250MHZ>,
      <apk 
       data hash MD5: 32K
       9C AB 92 B1 B3 A0 86 0D D7 F5 2C 42 7B 96 31 7F>)
(   4,<2007-07-17 11:58:49.48 +100>,<MAYBRIDGE\nmr>,<NMR_250MHZ>,
      <abs ABSG = 5 
       data hash MD5: 32K
       1F 96 5D 32 B3 B0 6E 8E A3 71 65 C6 42 FA 85 4E>)
$$ ##END=
$$ 
$$ hash MD5
$$ 09 1D E7 69 BB 1C 77 98 12 8B 40 A5 ED DA 8A F9
##$RELAX= 
##$RELAX= 
##$RELAX= 
##$RELAX= 
##$RELAX= 
##$RELAX= 
##$RELAX= 
$$ Bruker specific parameters
$$ --------------------------
##$DU= <C:\u>
##$EXPNO= 1130
##$NAME= <ADRS>
##$PROCNO= 1
##$TYPE= <nmr>
##$USER= <dgb>
##$AMP= (0..31)
100 100 100 100 100 100 100 100 100 100 100 100 100 100 100 100 100 100 
100 100 100 100 100 100 100 100 100 100 100 100 100 100 
##$AQSEQ= 0
##$AQ_mod= 3
##$AUNM= <au_zg>
##$AUTOPOS= <25 >
##$BF1= 250.13
##$BF2= 250.13
##$BF3= 250.13
##$BF4= 250.13
##$BF5= 500.13
##$BF6= 500.13
##$BF7= 500.13
##$BF8= 500.13
##$BYTORDA= 1
##$CFDGTYP= 0
##$CFRGTYP= 5
##$CHEMSTR= <none>
##$CNST= (0..31)
1 1 145 1 1 1 1 1 1 1 1 1 1 1 1 1 1 1 1 1 1 1 1 1 1 1 1 1 1 1 1 1 
##$CPDPRG= <>
##$CPDPRG1= <>
##$CPDPRG2= <>
##$CPDPRG3= <>
##$CPDPRG4= <mlev>
##$CPDPRG5= <mlev>
##$CPDPRG6= <mlev>
##$CPDPRG7= <mlev>
##$CPDPRG8= <mlev>
##$CPDPRGB= <>
##$CPDPRGT= <>
##$D= (0..31)
0 1 0 0 0 0 0 0 0 0.06 0 0 0 0 0 0 0.0002 0 0 0 0 0 0 0 0 0 0 0 0 0 0 
0 
##$DATE= 1184669915
##$DBL= (0..7)
120 120 120 120 120 120 120 120 
##$DBP= (0..7)
150 150 150 150 150 150 150 150 
##$DBP07= 0
##$DBPNAM0= <>
##$DBPNAM1= <>
$$ [...]
##$SUBNAM7= <"">
##$SUBNAM8= <"">
##$SUBNAM9= <"">
##$SW= 20.6930455092707
##$SWIBOX= (0..15)
0 0 3 0 0 0 0 0 0 0 0 0 0 0 0 0 
##$SW_h= 5175.983436853
##$TD= 65536
##$TD0= 1
##$TE= 296.16
##$TE2= 300
##$TE3= 300
##$TEG= 300
##$TL= (0..7)
0 120 120 120 120 120 120 120 
##$TP= (0..7)
150 150 150 150 150 150 150 150 
##$TP07= 0
##$TPNAME0= <>
##$TPNAME1= <>
##$TPNAME2= <>
##$TPNAME3= <>
##$TPNAME4= <>
##$TPNAME5= <>
##$TPNAME6= <>
##$TPNAME7= <>
##$TPOAL= (0..7)
0.5 0.5 0.5 0.5 0.5 0.5 0.5 0.5 
##$TPOFFS= (0..7)
0 0 0 0 0 0 0 0 
##$TUNHIN= 0
##$TUNHOUT= 0
##$TUNXOUT= 0
##$USERA1= <user>
##$USERA2= <user>
##$USERA3= <user>
##$USERA4= <user>
##$USERA5= <user>
##$V9= 5
##$VALIST= <valist>
##$VCLIST= <CCCCCCCCCCCCCCC>
##$VD= 0
##$VDLIST= <DDDDDDDDDDDDDDD>
##$VPLIST= <PPPPPPPPPPPPPPP>
##$VTLIST= <TTTTTTTTTTTTTTT>
##$WBST= 1024
##$WBSW= 4
##$XGAIN= (0..3)
0 0 0 0 
##$XL= 0
##$YL= 0
##$YMAX_a= 373341
##$YMIN_a= -252817
##$ZGOPTNS= <>
##$ZL1= 120
##$ZL2= 120
##$ZL3= 120
##$ZL4= 120
##$ABSF1= 16.522
##$ABSF2= -4.171173
##$ABSG= 5
##$ABSL= 3
##$ALPHA= 0
##$AQORDER= 0
##$ASSFAC= 0
##$ASSFACI= 0
##$ASSFACX= 0
##$ASSWID= 0
##$AUNMP= <proc_1d>
##$AZFE= 0.1
##$AZFW= 0.1
##$BCFW= 0
##$BC_mod= 0
##$BYTORDP= 0
##$COROFFS= 0
##$CY= 12.5
##$DATMOD= 1
##$DC= 0
##$DFILT= <>
##$DTYPP= 0
##$F1P= 14.0000005364418
##$F2P= -0.99999901652339
##$FCOR= 0.5
##$FTSIZE= 32768
##$FT_mod= 6
##$GAMMA= 0
##$GB= 0
##$INTBC= 1
##$INTSCL= 1
##$ISEN= 128
##$LB= 0.3
##$LEV0= 0
##$LPBIN= 0
##$MAXI= 10000
##$MC2= 0
##$MEAN= 0
##$ME_mod= 0
##$MI= 0
##$NCOEF= 0
##$NC_proc= -5
##$NLEV= 6
##$NOISF1= 0
##$NOISF2= 0
##$NSP= 0
##$NTH_PI= 0
##$NZP= 0
##$OFFSET= 16.522
##$PC= 1
##$PHC0= -66.21566
##$PHC1= 17.30998
##$PH_mod= 1
##$PKNL= yes
##$PPARMOD= 0
##$PSCAL= 4
##$PSIGN= 0
##$REVERSE= no
##$SF= 250.13
##$SI= 32768
##$SIGF1= 0
##$SIGF2= 0
##$SINO= 400
##$SIOLD= 32768
##$SREGLST= <1H.DMSO>
##$SSB= 0
##$STSI= 32768
##$STSR= 0
##$SW_p= 5175.98343685301
##$SYMM= 0
##$S_DEV= 0
##$TDeff= 65536
##$TDoff= 0
##$TI= <Analysis number 999999
Compound Code 99
Book Reference 9
Project Code 9>
##$TILT= no
##$TM1= 0
##$TM2= 0
##$TOPLEV= 0
##$USERP1= <user>
##$USERP2= <user>
##$USERP3= <user>
##$USERP4= <user>
##$USERP5= <user>
##$WDW= 1
##$XDIM= 32768
##$YMAX_p= 493830957
##$YMIN_p= -544074
$$ End of Bruker specific parameters
$$ ---------------------------------
##NTUPLES= NMR SPECTRUM
##VAR_NAME=  FREQUENCY,     SPECTRUM/REAL,   SPECTRUM/IMAG
##SYMBOL=    X,             R,               I
##VAR_TYPE=  INDEPENDENT,   DEPENDENT,       DEPENDENT
##VAR_FORM=  AFFN,          ASDF,            ASDF
##VAR_DIM=   32768,         32768,           32768
##UNITS=     HZ,            ARBITRARY UNITS, ARBITRARY UNITS
##FACTOR=    0.157963299565203, 1,           1
##FIRST=     4132.6476996994, 0,             0
##LAST=      -1043.33573715361, 0,           0
##MIN=       -1043.33573715361, -544074,     0
##MAX=       4132.6476996994, 493830957,     0
$$ Real data points
##PAGE= N=1
##DATA TABLE= (X++(R..R)), XYDATA
$$ [...]
28864 223930 199615 276235 280982 306772 153963 116930 273267 401393 341892 300584 310545
28853 310545 346593 362155 372213 379277 298368 197029 293220 390470 379594 341102 283534
28842 283534 313076 227205 249225 312241 360447 468256 411564 289139 306248 329277 331540
28831 331540 238983 156907 201939 369672 525912 525517 422115 389129 380751 409029 428324
28820 428324 379593 334231 308593 218484 162171 273871 260272 226058 225415 246727 329222 318344
28808 318344 280468 322770 419291 523881 406618 334519 343207 416475 457722 412479 339202
28797 339202 232275 196209 321863 308422 259319 212208 289028 394756 338802 303591 331012
28786 331012 352081 362021 359052 373374 375695 334547 374906 412779 459258 541781 464902 290227
28774 290227 308078 303758 266311 251954 197354 249093 339756 519967 526528 417755 418288 377701
28762 377701 412073 485156 429260 344616 370756 433329 378976 363120 280437 256473 281119
28751 281119 365619 320439 341211 451623 481843 440284 458267 438069 352177 249756 261911
28740 261911 352848 369101 270662 272161 336455 419372 464362 454210 438014 447426 479942 512433
28728 512433 614227 572634 444025 339895 356482 486109 509637 560217 621296 671423 594086
28717 594086 596062 524170 571730 597622 607845 617957 509026 431022 508363 450574 393270
28706 393270 317074 344428 482159 414149 249865 301856 423268 465135 493305 348526 356090
28695 356090 409594 437585 503419 505497 402385 478668 564021 563444 501778 445766 495892 567613
28683 567613 624657 517141 481634 412303 374196 259627 264159 309544 368912 414442 393938
28672 393938 471903 385330 276311 283217 325980 550921 645690 590555 497387 384228 241172
28661 241172 143376 166932 252979 251628 251505 169154 178604 257236 286686 339959 388351 286414
28649 286414 206668 289077 410478 558055 627010 622823 521993 602649 595455 481549 343597
28638 343597 234942 340258 452833 493814 573945 461149 473495 568853 553644 482348 497722
28627 497722 481652 442572 432605 469606 514992 564551 518912 592582 651357 547777 422659
28616 422659 486596 580874 683909 690763 695959 633959 488517 432340 593165 794089 703430
28605 703430 638734 562131 533776 570120 548512 416864 443119 530710 493145 614220 620188
28594 620188 637892 565886 475871 515213 619961 642199 697946 669329 543455 522325 513747
28583 513747 554375 589041 550439 496730 480937 589413 725647 816546 851360 879428 735144
28572 735144 678414 696165 673374 664375 661899 685024 682425 636780 704434 707996 749257 746218
28560 746218 676720 727922 743411 691790 782473 769254 779728 654970 646004 664360 684286
28549 684286 635936 670322 677168 568833 599296 627697 691845 723739 623564 631588 696936
28538 696936 681938 717305 716076 730621 624861 575051 652284 704202 733377 731599 836888
28527 836888 859762 894162 910836 724013 630041 595912 595481 655954 869427 828649 861071
28516 861071 786222 640591 672533 733018 765444 752157 835133 786991 761435 728928 729203 777694
28504 777694 834729 926010 890748 827732 729163 723920 783518 819762 819186 782129 684867 848849
28492 848849 924285 973491 938720 823780 792231 747604 784767 929653 1055931 1144216 1045576
28481 1045576 1027746 1100571 1098562 916206 879086 992842 1043783 1000185 895150 977223 1108697
28470 1108697 1161334 1126147 1231333 1169763 995209 911836 884348 888833 938470 897733 981626
28459 981626 990064 942440 958261 970138 1016202 1081771 1021903 980502 941840 944425 948977 911719
28447 911719 812384 802344 753813 869895 946498 957792 1089619 1149381 1174131 1202770 1204200
28436 1204200 1144946 1154792 1073592 985366 972075 969048 980923 1025384 1087268 1071193 1037177 930003
28424 930003 854159 1002504 1060950 1077637 1132175 1112270 1112703 1166758 1285578 1285211 1270972 1279590
28412 1279590 1185836 1111137 1106634 1178998 1089646 1103446 1082072 1206068 1232765 1144275 1146722
28401 1146722 1056812 1035396 1146182 1257618 1245496 1263571 1201538 1138216 1064561 1169866 1159568
28390 1159568 1134594 1099598 1205817 1402198 1434535 1365601 1423051 1446273 1280254 1244013 1365490
28379 1365490 1406073 1448940 1432621 1414769 1405561 1423380 1459775 1462051 1435373 1426582 1333357 1298607
28367 1298607 1256404 1230711 1176750 1156977 1270400 1325181 1325648 1257855 1153187 1358456 1479583
28356 1479583 1565679 1653811 1594636 1471264 1363522 1450332 1489762 1451120 1374747 1389518 1376374
28345 1376374 1329247 1321810 1431737 1422367 1367576 1311783 1356214 1404470 1394441 1477474 1597428
28334 1597428 1595691 1641925 1631123 1515841 1506326 1528577 1465098 1454831 1553066 1555431 1378540
28323 1378540 1380286 1536059 1690115 1648242 1716137 1813902 1811120 1754608 1697878 1649532 1692022
28312 1692022 1751747 1857037 2038034 1995130 1931026 1885708 1842740 1767168 1779292 1872218 1881923
28301 1881923 1792331 1873894 1944909 1925473 1857092 1847700 1882942 1932160 1927223 1863610 1779772 1875557
28289 1875557 2047694 2059271 2081494 2038086 2045193 1973335 1899327 1924414 1982589 2076738 2209162
28278 2209162 2199249 2103378 2104974 2078164 2018279 1995132 1957383 2027732 2084171 1991342 2074286 2219493
28266 2219493 2324303 2376528 2267783 2315806 2303814 2311069 2251266 2184179 2206204 2339727 2461801
28255 2461801 2430705 2480282 2559678 2518315 2427063 2285469 2394914 2637920 2601860 2478468
28245 2478468 2508650 2612054 2634277 2701305 2726758 2740148 2773408 2755836 2783492 2816863 2822679
28234 2822679 2807338 2855988 2829344 2788466 2838008 2914383 2932233 3111278 3105905 3048394 3061902
28223 3061902 3081089 3159029 3206731 3283986 3152093 3110475 3021301 3114425 3289895 3310502 3326370
28212 3326370 3354048 3261127 3235917 3267427 3229769 3215336 3232256 3279209 3393387 3447176 3410724
28201 3410724 3382668 3401341 3419594 3441178 3514291 3574618 3567604 3581850 3572679 3607280 3736942
28190 3736942 3748228 3842317 3776607 3704658 3763784 3918001 3970074 4040475 4044057 3968474 3995763
28179 3995763 4154300 4318799 4328033 4330743 4270733 4284473 4257578 4169845 4218074 4263447 4265272
28168 4265272 4350621 4490794 4542858 4581385 4619688 4539085 4572832 4603808 4652559 4603587 4655018
28157 4655018 4856098 4874898 4897102 4838056 4866757 5013727 5110593 5272839 5322565 5273162 5329226
28146 5329226 5347596 5457900 5513848 5540950 5583206 5560117 5636135 5773513 5850489 5925127 5972479
28135 5972479 5953402 5945415 5875055 5956914 5999334 5993628 6039079 6228848 6398409 6501443 6591127
28124 6591127 6757596 6805764 6866551 6916310 6873995 6994729 7032864 7142893 7190847 7328050
28114 7328050 7438880 7545098 7545469 7521935 7541367 7582079 7762903 7986989 8004118 8013883 8128992
28103 8128992 8213023 8287575 8394433 8510191 8542244 8563360 8737826 8845659 8914903 9006769
28093 9006769 8899162 8967764 9139000 9121691 9301621 9611675 9677514 9938042 10049440 10087792
28083 10087792 10124398 10124766 10170088 10243614 10384801 10495325 10634348 10742947 10940621 11086021
28073 11086021 11227100 11481177 11600060 11676467 11817623 11890595 12026644 12191778 12192657 12355911
28063 12355911 12444737 12736293 12933976 12982144 13110073 13354744 13523165 13615588 13669708 13820689
28053 13820689 14101381 14258628 14385124 14568860 14718364 14847740 15004283 15303148 15494115
28044 15494115 15650190 15853382 15982246 16118231 16179480 16408016 16514014 16606951 16916406 17142394
28034 17142394 17353820 17489295 17679644 17942054 18164958 18366178 18617591 18915896 19100898
28025 19100898 19216798 19326323 19466527 19588966 19728370 19978030 20189862 20415193 20582110
28016 20582110 20705870 20971632 21220230 21562514 21782698 21894510 21997897 22025269 22305693
28007 22305693 22544619 22786765 22958516 23173587 23380555 23414006 23441187 23619010 23802540 24005187
27997 24005187 24050919 24123145 24322051 24563351 24788148 24854497 24914312 25083224 25286087 25277922
27987 25277922 25205140 25330898 25503423 25618227 25827496 25849269 25850769 25840214 25874219 25997978
27977 25997978 26056377 26044169 26081397 26109980 26084796 26052313 25988067 25920897 25922270 25835662 25767944
27966 25767944 25677720 25778708 25773207 25641475 25534138 25436962 25390023 25337641 25228286 25076538
27956 25076538 24838728 24673280 24465322 24284595 24264353 24179690 24023948 23951710 23701786 23531095
27946 23531095 23352043 23252983 23026570 22922177 22808750 22601022 22359843 22211560 22018588
27937 22018588 21728261 21477359 21307961 21319970 21113287 20737014 20528576 20434623 20259289 19992557
27927 19992557 19690649 19598335 19577362 19302945 18997546 18825697 18688401 18496649 18229324 18017376
27917 18017376 17888105 17695428 17374115 17066692 16890685 16710736 16589064 16288686 16135671
27908 16135671 15994668 15755135 15556898 15268223 15015452 14890331 14757788 14633026 14435132
27899 14435132 14244545 14045074 13848966 13743224 13570687 13289434 13085416 12981975 12914539
27890 12914539 12765857 12577789 12373923 12157102 12027713 11940898 11811193 11550796 11331154
27881 11331154 11345192 11224191 11001900 10864635 10746318 10532450 10478073 10320157 10219705 10039968
27871 10039968 9886199 9786968 9686911 9535550 9377825 9337018 9398807 9402501 9304532 9121751
27861 9121751 8970250 8735850 8565015 8418366 8300748 8175272 8057070 8042182 7862175 7782967
27851 7782967 7657199 7681289 7683183 7575693 7482038 7406258 7358556 7255900 7129953 7069428 7003308
27840 7003308 6873278 6861727 6813218 6754562 6705988 6678252 6568783 6418815 6376683 6245633
27830 6245633 6211012 6156558 6110431 6003216 5927556 5901227 5970490 5824457 5613146 5633359 5641051
27819 5641051 5542578 5484000 5402912 5281808 5307507 5295663 5272521 5328506 5134429 5020730 5005933
27808 5005933 5030793 4858726 4637378 4611662 4634489 4617299 4532812 4382363 4259582 4200675
27798 4200675 4170872 4194585 4196647 4350460 4252106 4172597 4223615 4231302 4190934 4112757 4065542
27787 4065542 4049191 3978598 3932404 3931520 3863587 3760122 3780917 3740448 3594752 3539217 3569478
27776 3569478 3497340 3555361 3514024 3373148 3294001 3127188 3195791 3333014 3265674 3071430
27766 3071430 2983453 3051141 3021300 3124895 3041190 2974057 2882382 2925334 2992934 3014025 3016112
27755 3016112 2950703 2922106 3004524 2978087 2870396 2934751 2858394 2882789 2876786 2769815 2677070
27744 2677070 2552130 2519591 2600684 2652230 2713777 2587326 2450823 2466497 2398018 2462798 2534992
27733 2534992 2582982 2623573 2558789 2490238 2501350 2365594 2305984 2357523 2422274 2357681 2272365
27722 2272365 2176732 2217291 2131111 2099216 2031106 1960854 1985602 2027662 2091528 2183068 2342421
27711 2342421 2388202 2205321 2095746 1886084 1696077 1699910 1820291 1883843 1877135 1949036 2031069
27700 2031069 2037036 1962199 1864755 1746917 1679345 1700297 1770013 1744325 1734340 1689465 1655132
27689 1655132 1667496 1620079 1642506 1717560 1720082 1663718 1545013 1592540 1630932 1601687 1508247
27678 1508247 1612690 1662916 1640397 1618478 1557027 1588094 1589835 1522206 1460143 1461860 1452085 1408952
27666 1408952 1353084 1313595 1258988 1368732 1405786 1420321 1430088 1433609 1422349 1267136 1203770
27655 1203770 1261084 1236302 1326638 1365910 1366528 1316170 1302785 1130146 1016083 1090405 1252710
27644 1252710 1334952 1203396 1206896 1190589 1156174 1137930 1167574 1259774 1299596 1229081 1233714
27633 1233714 1257990 1265148 1213687 1141723 1175624 1064534 993372 1001937 957487 981065 995980
27622 995980 1002508 970473 1006342 916919 827633 901315 1019232 1027747 1009927 1003304 1121079 1130506
27610 1130506 1083800 975510 962216 1062600 1007949 1027862 985547 1192022 1261538 1176304 1020944
27599 1020944 926562 927593 934120 969359 977631 949368 803285 701445 688107 642879 660145
27588 660145 690441 836641 800291 832716 800108 888743 1027954 923720 872016 900627 1009445
27577 1009445 1077501 1001188 926453 820094 826803 1033518 1073379 970766 941803 795588 772720
27566 772720 653715 766101 936378 936079 795461 783414 828243 714870 563821 572246 699038
27555 699038 749415 778284 788183 814337 775889 698515 707957 673093 554140 470479 503478 570283
27543 570283 553790 518090 636789 692426 720768 669841 524829 473486 525149 616489 736444
27532 736444 799296 795912 786480 699273 466575 501922 620430 714838 785377 601538 695661
27521 695661 636953 560799 631258 620181 502242 446093 479213 594377 554734 566515 563997
27510 563997 538202 677361 653795 869937 972297 929796 765331 586506 563924 579982
27500 579982 541369 535067 558007 640751 651930 649914 616824 515545 637139 663296 659881 540973
27488 540973 545826 632841 666787 602447 642140 698062 599383 466510 490958 404483 355219
27477 355219 230689 194643 225754 312002 502258 622170 612457 568418 415642 309647 364422
27466 364422 414730 433511 413256 383942 384760 452517 324682 92831 33522 157813 171225
27455 171225 186917 315153 417571 532789 482567 362624 317011 392104 347972 323135 382475
27444 382475 471105 471623 361215 327307 311522 222477 152346 100984 114024 172818 271148 351815
27432 351815 437317 312485 316202 364756 489505 504870 540768 601305 607593 578398 522512
27421 522512 527836 510878 435809 439204 515992 509668 413320 262415 224377 251795 396223 367116
27409 367116 361948 338280 339459 470715 553956 588100 578858 515367 461597 427829 428611 442699
27397 442699 241572 107984 117395 197010 237119 313081 289128 127103 114002 147830 236083
27386 236083 349649 299981 264185 313828 247257 226660 190686 294148 336704 241047 235639
27375 235639 313354 359281 347628 445819 432987 295851 304685 377667 445101 356087 163715
27364 163715 232683 303790 246014 314177 481791 593617 470349 307473 258156 357927 449466
27353 449466 359124 223453 141057 147857 86873 174007 188514 294489 327230 277379 348994
27342 348994 416826 352340 352051 409845 492875 335542 125723 128364 114978 24680 125495
27331 125495 129241 113202 114693 124621 140837 147603 101392 99131 213145 162050 55812 -104
27319 -104 111953 166961 109245 120612 125593 68743 85062 8189 -33827 -39910 91513 107019
27307 107019 63827 99573 113095 6388 -16249 -13943 -62361 -2005 181931 200935 221921
27296 221921 250081 214267 133057 55939 8430 48740 124323 191234 194490 134051 143185 130381
27284 130381 131865 213240 140712 124524 191278 323690 337006 231637 212212 332479 263007
27273 263007 207526 170301 299751 393606 339291 289971 274820 340439 201071 176738 144604
27262 144604 133543 97457 103533 180622 264581 278505 208779 -21537 -33012 23296 -52321
27251 -52321 -23620 122386 174491 220879 176213 148302 116839 229786 351443 226424 202958
27240 202958 227574 202752 214593 206648 192805 207053 261489 292813 144021 73550 39143
27229 39143 113115 83474 74595 134464 315791 286166 214456 139254 117135 132509 139811 166423
27217 166423 108539 79427 140960 157061 62859 46268 2491 -41695 -107736 -102183 36061
27206 36061 17070 -55247 -9442 87313 88208 137266 153339 334825 386545 335369 330956 262956
27194 262956 279191 295093 258892 205910 277495 347724 257944 116218 154660 150984 174730
27183 174730 217911 225339 88662 32725 -4438 -17856 -30067 -26596 -28989 -36181 -38029 21198
27171 21198 15353 49173 74432 -5938 -24408 30375 81420 71660 88975 159702 152668 102588
27159 102588 16464 144027 211657 198245 135569 49025 28497 148941 124807 93202 91919
27148 91919 162280 244646 183870 75889 25697 -33214 -101863 -495 153233 183852 109274
27137 109274 70724 163874 163109 51079 55766 114435 99315 120892 22427 63799 171583 118941
27125 118941 97099 198597 278453 194384 71851 95448 191604 220023 187540 109452 137129
27114 137129 201158 163899 119434 179371 241824 259705 319433 327149 223889 133419 115488
27103 115488 76860 117834 160469 35351 -95579 -173453 -119117 -7957 26826 -4149 82274
27092 82274 192074 195618 153664 133817 131224 112987 115798 191015 176028 122579 172651 118873
27080 118873 56360 -153995 -194192 -28761 20306 46188 33481 17511 -25292 -37215 -25554
27069 -25554 -4374 14161 45408 41154 32381 46084 136553 119274 177885 210072 174310 120050
27057 120050 65959 55511 63668 83590 82974 198891 112283 46739 80508 14910 37559 9870
27045 9870 48035 51943 19803 51635 98291 118853 -22179 -81734 16460 44602 47137 -92861
27033 -92861 -120291 -157425 -207674 -120046 -71523 -37302 -11372 -29940 25706 134721 156833
27022 156833 155546 146348 82900 99399 65537 -29760 -34649 163283 196177 153448 81221 -2917
27010 -2917 -32552 15118 101902 123151 119932 86534 98098 9049 -39075 -72386 -164846 -206173
26998 -206173 -114664 14840 20558 62326 102760 141947 157626 207395 244982 292552 301953 274611
26986 274611 259615 81381 -12301 -34073 -102303 -58304 72627 166718 191116 163143 56090
26975 56090 -2947 -29427 -18381 90026 159193 197262 184190 166868 157835 139937 99738 -7242
26963 -7242 -28036 -17089 52205 -18415 -32349 -72641 -109091 -66994 127270 112724 -23481
26952 -23481 34740 136264 119883 214796 174048 79060 61663 79788 254934 303064 320521
26941 320521 263908 218867 95632 122309 189435 201332 208607 248409 341063 502885 503282 317755
26929 317755 182552 190074 8212 481 -32490 -150925 -184400 -57464 18979 4790 -1942
26918 -1942 34450 -33677 -44325 -40743 58833 22640 40027 61699 -27880 -44102 -15701 -24580
26906 -24580 44826 163287 163999 150234 153680 172441 190097 154577 117562 66967 -3823 -52933
26894 -52933 -171981 -189013 -171018 -88960 -52388 35854 43004 -31787 -106994 -79631 -6280 26137
26882 26137 74876 90400 -56068 -99585 -55130 -158646 -208118 -158446 1004 -1690 -130723
26871 -130723 -72920 -67584 -89216 -21847 -64417 -44805 35977 35797 16565 8981 -30797 71624
26859 71624 51018 47415 19461 -24911 -131876 -141729 -109832 39355 -13277 -111332 -173429 -52569
26847 -52569 -18512 -15352 -77045 -49326 -92757 -126320 -87585 -119092 -133059 -132302 -58559 17699
26835 17699 8687 49117 -14669 -36561 -16576 10160 19232 52839 -84648 -132701 77047 117930
26823 117930 -4976 -50426 1456 -105125 -143901 -168881 -73986 -121464 -168381 -165657 -32443
26812 -32443 62209 -17242 -80961 -36367 -10321 -3643 -22245 -53384 -106765 -164556 -102733 27651
26800 27651 20648 -104611 -159570 -65647 -51720 -12868 61519 161705 189524 57440 -55397
26789 -55397 -129458 -136251 -81241 -4315 20392 -58764 -224654 -234404 -263857 -255011 -296592 -159541
26777 -159541 -69438 -165222 -163491 -135054 -112632 57353 170443 81835 63632 27091 86856
26766 86856 -2602 -45803 -46081 -161783 -81885 26489 -185131 -230735 -167159 -86265 -25658
26755 -25658 53760 31237 -114682 -214142 -234951 -193003 -55240 -86612 -208836 -183718 -124152
26744 -124152 -149214 -173405 -147192 -147959 -176928 -107147 -112161 -46681 -42953 -88499 -6335 110568
26732 110568 126537 9154 22055 -127581 -225449 -211667 -133300 -125146 -100720 -149391 -69596
26721 -69596 -32461 4158 42901 20006 -14828 89332 70910 25747 211897 163395 -33637
26710 -33637 -40413 -16771 88374 182336 164035 175644 162453 273730 204187 113879 -49087
26699 -49087 -91928 -17595 9717 58994 74679 53281 -39763 -77584 22576 41308 28406
26688 28406 73433 25322 60665 76849 -22858 -13666 -34329 -74133 -86921 -83476 4913 9552
26676 9552 -113653 -174111 -115465 -96032 -143438 -133919 -21559 67996 10464 -38778 -416 -51096
26664 -51096 -90638 74253 60613 -136461 -174554 -157347 -104390 -113578 -123983 -205851 -234401
26653 -234401 -173178 -46779 -25392 31988 -19242 -16591 -10135 -18522 -121387 -150673 -209958 -152908
26641 -152908 -174940 -215115 -185863 -114998 17514 -7179 -19660 -5512 -14394 46769 129259
26630 129259 97625 -1127 -75655 -17600 -15701 -73946 -139993 -177192 -83304 -62337 -63141 11802
26618 11802 45125 195 -50368 -1371 -51697 -70357 -85234 -75694 -29681 6489 -104022 -171832
26606 -171832 -43078 44605 -56557 -208280 -289244 -236486 -45596 -48203 -65097 -169190 -149062
26595 -149062 16573 -23188 30310 34258 -18876 -17315 -43391 -55323 -27586 14443 -3719 6110
26583 6110 68851 7254 -123271 -102161 -181534 -297040 -176808 -42458 47073 37026 68853
26572 68853 104919 29263 -28532 -44353 -169632 -78085 33934 20192 57121 112735 37640
26561 37640 7715 97715 138753 169936 33359 30161 -35551 -5145 16204 126369 50282
26550 50282 89660 91351 108287 -25413 -88473 -8550 -1768 2065 4181 -17014 -49469 -104729
26538 -104729 -135813 -160298 -254992 -259182 -228078 -100444 1485 -116330 -344669 -337315 -44268
26527 -44268 162513 178095 84141 35556 -61247 -98362 -119013 -120112 -86340 49492 70854
26516 70854 70308 64100 85865 54898 78731 80127 49411 62139 -49689 -19246 39506 -32236
26504 -32236 -41247 -103869 -215343 -224284 -138951 -92996 -114103 -220742 -195662 -5933 -99355
26493 -99355 -72355 37942 9754 32697 -37840 -134803 -54366 81823 -3717 -52024 41560
26482 41560 63562 19482 25735 -90188 -103427 541 44297 16799 -115303 -165328 -224655
26471 -224655 -145789 -32159 1631 -38146 -109759 -60367 -45153 50795 5449 -78267 -120234
26460 -120234 -80562 -29152 -60176 -96182 -69721 5838 -57420 -147403 -184786 -72261 71836
26449 71836 89735 -19999 -17879 22197 39543 116862 105480 115560 112572 -10574 -112183
26438 -112183 -100203 -80045 -37181 -182870 -226449 -273374 -230571 -138003 -61274 -72284 -26334
26427 -26334 -27737 -60617 13070 12665 3842 -92523 -80129 33390 79695 58586 -6248 -32159
26415 -32159 -83289 -51702 11550 47448 26664 -151577 -152691 -100727 16343 -43709 -90526
26404 -90526 -84666 -47306 -26123 -43546 -13617 38196 -58839 -14115 110509 126246 82128 -75809
26392 -75809 -133145 -161295 -155098 -187132 -208198 -116513 18949 -3526 -192282 -133817 133508
26381 133508 29621 -150723 -95715 -110797 -102609 -150163 -275021 -228111 -139553 22896 10446
26370 10446 -94573 -187251 -140386 -109000 -187504 -259819 -176265 -115844 -148473 -99563 80792
26359 80792 152416 69510 -28341 -76183 -103158 -130832 -109179 -67545 -90049 -31133 99111
26348 99111 163020 84874 14034 106537 63503 15433 34470 -1163 38979 -53334 -27491 -95242
26336 -95242 -36406 -17127 -39533 -121934 -92963 -60974 77902 192332 68869 -80394 -21536
26325 -21536 -14467 38891 -53329 -197554 -166642 -121492 -153536 -157612 -58950 38160 65505 28807
26313 28807 59121 83214 116871 201426 223401 209577 187133 75782 5925 -63624 -136139
26302 -136139 -255404 -263070 -162642 -118777 -33310 15966 4326 91710 174533 139342 -92702
26291 -92702 -117352 -99095 -154431 -218524 -217263 -102908 -33884 34646 89495 47605 779 -75869
26279 -75869 -119638 -97141 773 -80668 -184176 -164545 -103728 1775 84045 -7168 -10106
26268 -10106 -25583 -126774 -100457 -113973 -132270 -77270 -81265 -165169 -157429 -96549 -72328 -40471
26256 -40471 6424 37070 -42524 -111739 -146054 -156140 -187354 -131972 16440 -16713 -25126 13512
26244 13512 -14779 39463 14396 -30004 -131974 -167228 -106110 -105836 -128755 -155467 -186388 -168011
26232 -168011 -163311 -150836 -26610 -14589 -28254 -80646 -106930 -183644 -150517 -31846 40027
26221 40027 -57022 -89900 -78709 -157163 -195796 -83467 -115643 -167048 -163866 -127238 -131228 -91134
26209 -91134 -9287 101051 95947 121743 63656 19836 14364 24208 -19093 -21082 -87260 -113368
26197 -113368 -89224 -90474 -127465 -221894 -292210 -287366 -290898 -221020 -229333 -146075 -124222 -276968
26185 -276968 -259824 -7130 160529 120104 46335 -40429 -72460 -74228 61523 81929 -16436
26174 -16436 38576 137819 74983 137251 244500 221024 97791 47989 74849 32164 54453
26163 54453 106898 114556 162267 95557 37419 64394 103004 42290 -74022 -135824 -88756 -112986
26151 -112986 -131712 19691 107656 124530 55151 39790 21061 49499 23758 17398 93247
26140 93247 163336 142671 39630 -17542 31774 210848 239592 162444 10452 -108242 -63001
26129 -63001 -79239 -184791 -103574 -21359 -116690 -68655 36863 130109 105249 32277 -49588
26118 -49588 -27829 -31086 -147077 -150051 -59447 1712 -149145 -162964 -3479 -100435 -146457
26107 -146457 -103893 44064 96382 158779 32498 -104081 -229911 -259336 -181590 -50609
26097 -50609 -20142 -44712 -52300 -53585 -63448 -89053 -160976 -236090 -169695 -197473 -162668 -132191
26085 -132191 -178311 -201241 -188977 -185695 -222946 -130569 -19240 12423 85576 66323 45259
26074 45259 66014 14265 877 -103715 -29886 -45974 63577 5864 -84863 -87929 -57316
26063 -57316 -23089 28683 16706 15511 95390 68412 3732 -49303 -74239 -782 -74789 -32109
26051 -32109 -50718 -57446 -79626 -107540 -12623 -163 -110439 -178070 -102257 -75560 -102164 -104893
26039 -104893 -57686 -33733 103224 176611 91143 96370 171985 97011 -749 -3726 12553 -38189
26027 -38189 -27199 -101201 -179634 -159528 -182262 -171239 -92188 17869 -37461 -69244 -153843
26016 -153843 -95819 -110931 -99895 39736 2467 -50180 -56233 -38569 -90129 -109587 -118197 -153883
26004 -153883 -87766 -47720 -69075 3351 127572 68148 -105587 -135990 -89975 -95221 -105795
25993 -105795 -181178 -262722 -212998 -159766 -81123 60070 90062 -18294 -55869 -97579 -71433
25982 -71433 141692 225907 79373 -65850 -63433 -73631 8670 67103 20358 -15265 -7585
25971 -7585 -29595 -121394 -64959 -51690 -67287 -133790 -54811 96704 131829 86435 4644 -42266
25959 -42266 10175 42337 -14503 -35742 -59658 -187747 -265825 -172292 -487 -77714 -166953
25948 -166953 4268 30521 -91923 -86124 32945 26348 27200 47660 53033 102852 86753 29188
25936 29188 -115534 -281955 -281374 -129662 -106140 -37864 -72238 -101197 -77839 -77773 -151474 -248508
25924 -248508 -332696 -373110 -194029 -85005 -51687 -69427 -70444 -46227 30009 -14859 -46852
25913 -46852 -118911 -180148 -162617 -148847 -120848 -71697 51982 151384 74828 5756 32698
25902 32698 -64345 -8423 168648 203570 233173 163409 57999 135726 150276 71484 45151
25891 45151 63282 62967 67432 6218 -59143 -46569 -24685 -100251 -118162 -244096 -325398 -218350
25879 -218350 -79237 20347 36715 96332 91144 101839 81767 54159 40420 -56141 -76431
25868 -76431 -120014 -82699 -107422 -220543 -275036 -238328 -255328 -307313 -289047 -234015 -186021
25857 -186021 -114547 -15937 -2287 22074 80138 -17762 -62951 -7802 21124 29542 -3242 33449
25845 33449 -29344 -4167 -74872 -107077 -110701 -224944 -225472 -98554 86595 116498 152008 163319
25833 163319 62035 1713 -59327 -164573 -63210 -5973 -43559 -132024 -148057 -83020 4595
25822 4595 -10167 67670 117981 146871 129770 43715 -28582 -39247 -15003 -40915 -53626 -100888
25810 -100888 -50866 18790 37088 32288 9251 70674 26095 -74601 -29029 -19115 26957 -3205
25798 -3205 -91708 -94902 -63735 -42846 -68193 -237018 -207272 -99584 -35717 -168049 -222004
25787 -222004 -177640 -171113 -119127 -29358 57594 -28777 -172961 -125823 -57415 131062 170788
25776 170788 42048 -1122 63654 132484 76782 59734 34961 -15341 -122330 -168047 -167785
25765 -167785 -155293 -140809 -87190 -30444 -63778 -84879 -187129 -116372 -35933 84038 2917
25754 2917 -21008 48623 65110 41229 100265 -3273 -208200 -244036 -141605 -31137 36854
25743 36854 62720 136007 138589 89490 49478 184978 217302 209637 201740 222568 268039 209150
25731 209150 144537 110260 48897 93128 170306 155570 49462 -100849 -166230 -10372 -28244
25720 -28244 -134519 -88558 -1172 -37840 -74594 -21899 -20133 -117012 -227650 -165535 -122699
25709 -122699 -112179 13775 45422 -9953 3907 497 -43508 -139088 -21508 94375 95446
25698 95446 30658 15837 -85250 -62682 66597 90258 5628 -119595 -75141 -68494 -64387
25687 -64387 -13299 4066 -10935 -89169 26725 85269 10167 -478 -57556 -63171 -44027 -128680
25675 -128680 -107070 -155211 -194303 -261386 -219756 -143955 12579 82533 171176 82272 -27900
25664 -27900 -112916 -155306 -47294 -72007 -28145 -74439 -105906 -72795 -62223 -74208 -97027
25653 -97027 -84108 -116809 -72140 7957 22156 4605 37072 -6493 1088 53219 81271 147326
25641 147326 91145 12349 -87075 -131203 -25831 72838 108496 113606 5139 25319 29734
25630 29734 -26377 11909 -62985 -170316 -150260 -105020 -108922 -243725 -228751 -214327 -238288
25619 -238288 -197135 -226734 -192636 -207876 -72829 150798 154304 80086 -1855 -48773 -75800
25608 -75800 108 -37359 -43136 -57115 -79287 -81903 -42038 1113 -20384 -79833 -116684 -153149
25596 -153149 -135366 -82471 -12944 -25778 -22379 -58304 -28414 -38127 -59967 2607 39829 -15493
25584 -15493 -33828 -171601 -162458 -98988 -189092 -287250 -330333 -328816 -267123 -216038 -254949 -257797
25572 -257797 -196507 -218996 -156476 -79048 -78428 -79202 -154023 -86144 -16862 9615 -22704 -123306
25560 -123306 -150025 -58811 -66957 -100890 -103752 -93608 -66586 -134097 -143169 -56125 73034 73738
25548 73738 -101591 -116982 -48660 36400 -12853 -37490 -73499 -95232 -35017 -6527 54036
25537 54036 133709 129296 58072 110029 172482 289235 283164 153685 183312 170652 149045 138963
25525 138963 104094 16360 -46329 -39868 -27532 -1278 -166684 -261723 -187054 -67495 -19672
25514 -19672 -128501 -125221 -93925 -38756 18589 9840 40484 16290 13142 9163 -85568 -23614
25502 -23614 136251 201654 123070 49185 2539 -39035 71777 82850 21324 -19106 -34421
25491 -34421 76399 34063 -84829 11705 27138 52656 85611 100887 197209 225685 188161
25480 188161 83341 38630 54514 101225 112538 82724 -868 25462 52196 33654 65462
25469 65462 94198 77197 149959 85752 96105 59381 -137228 -143887 -49941 -145624 -118973 -95919
25457 -95919 45102 119582 -269 35000 -98784 -214686 -201091 -168820 -70204 55249 20878
25446 20878 5668 -27689 -41472 -52891 -86225 -181628 -235140 -274011 -102057 -30550 -15272
25435 -15272 -12706 22393 -17193 -32915 -14168 9759 -35919 -15248 36418 3225 -48539 -135653
25423 -135653 -175659 -112629 -98321 -104108 -4686 118983 106571 7132 -39792 -134844 -161875
25412 -161875 -190931 -155098 -51258 53505 151567 175252 102937 36609 -147921 -162331 -53753
25401 -53753 -57806 -81110 -140194 -80963 -10245 -37499 -45423 -80870 -62849 -81301 4024 -1989
25389 -1989 -13803 27623 24908 -78530 -86338 76863 79250 71563 85368 10793 -137583 -157213
25377 -157213 -224069 -171258 -252246 -307122 -156239 15820 110325 140181 80300 -17610 -13977
25366 -13977 44485 24629 -74748 -94191 38217 20086 -15376 101986 51832 -75514 -207796
25355 -207796 -232670 -90052 -59064 5271 -39845 -62357 3507 101981 14931 -74401 -101047
25344 -101047 -85374 -184137 -131566 8800 -26395 -55277 -186165 -195967 -106943 -156935 -239354
25333 -239354 -187366 -171358 -160313 -71181 -41057 -86707 -5616 120644 125041 -86362 -125482
25322 -125482 -190818 -181817 -189562 -295397 -244168 -56733 8234 -98696 -175747 -129836 -62128
25311 -62128 -111255 -196218 -198534 -128323 -190477 -238634 -240295 -212740 -160975 -167074 -129531 -99620
25299 -99620 7393 -37196 -108533 -112129 -91189 46633 141077 37220 -34693 13865 25917
25288 25917 -18402 -69408 -132604 -183773 -115905 -5224 83571 -2913 7821 38303 48022 27565
25276 27565 -75541 -28665 -51928 -108904 -170396 -15026 -158460 -279330 -206156 -54231 -6502
25265 -6502 -117303 -78937 -46588 -115218 -56414 -6538 -9693 -38227 -50986 -44985 -111755 -124511
25253 -124511 -90871 -108799 -112720 -106692 17099 59299 -62992 -85147 -9541 102411 83645
25242 83645 -127783 -309670 -205429 -96601 -21122 -6031 -14028 38757 -62694 -140404 -108224
25231 -108224 -7039 43338 -7578 3045 52478 130265 93734 52688 103443 119617 142016
25220 142016 153428 133638 53510 9986 29071 80359 -78031 -120158 -52410 -43881 -167378
25209 -167378 -73835 28278 72444 170656 147198 44139 -46632 -1819 -44581 -147229 1227
25198 1227 221207 201294 109847 30978 -69228 -135365 -124511 -1118 49685 -30898 -78030
25187 -78030 -39184 -19482 -135768 -133446 -117501 -128255 2191 145694 126245 78195 95697
25176 95697 124974 4637 -91854 -84959 -93156 -77984 -72961 122670 112249 9253 -116438
25165 -116438 -63207 52339 21192 -150785 -202422 -181127 -324170 -397475 -255995 -100353
25155 -100353 -66415 -76008 -32906 17324 -5531 -60392 -49850 -100666 -190340 -149504 -92622 -277413
25143 -277413 -353616 -264539 -203960 -206327 -102447 18803 85497 77080 14296 -84146 -30733
25132 -30733 89227 8093 -143699 -129481 -121446 -139637 -80464 -41605 -12030 -18045 -3994 23801
25120 23801 25999 -628 144066 172206 255184 215814 98106 19145 -9800 52718 169623
25109 169623 128284 141885 158195 118857 118561 124175 129038 36814 46401 73246 157683 83218
25097 83218 45926 61933 148060 111661 71179 -68450 -67643 -116265 -94008 -111656 -113596 -21098
25085 -21098 82003 -20707 -133490 -174121 -30513 91262 19730 24894 29925 -31302 -38425
25074 -38425 -78590 -117315 -137776 -45402 42284 64678 47920 48317 38599 -19706 42188 27209
25062 27209 14073 31293 -10239 -126454 -114497 24283 3334 13095 50094 66832 78757
25051 78757 36530 -74911 -156975 -148118 -76818 51272 221866 162795 43207 43568 -31688
25040 -31688 -50984 61866 124363 46389 -63678 -155708 -163297 7124 116289 192767 166177
25029 166177 19815 -56514 -366 -117293 -220968 -77855 51487 60589 -105206 -230885
25019 -230885 -241556 -141325 -197631 -107978 -15061 48007 -38738 -113779 -75922 -52410 -130099
25008 -130099 -179218 -56965 186295 233036 170541 175495 102622 1448 1198 36048 48039
24997 48039 98842 -55647 -111737 -65219 -27520 -23488 23702 76998 66909 2370 9873 -74695
24985 -74695 -191692 -240903 -200175 -167370 -172371 -284447 -268645 -143904 -82613 -97480 -174981
24974 -174981 -202479 -163858 -157776 -117091 -4225 -45828 -111189 -111748 4904 14400 -5515 -48042
24962 -48042 -106548 -130393 -44958 44509 81255 51489 4381 21665 10241 -141141 -128012
24951 -128012 -77811 -132118 -217428 -179300 -113792 -60302 -19186 -24455 4159 -17428 -15472 -36475
24939 -36475 51125 26405 66960 -13460 57388 110595 92132 -8325 -12776 -411 26511 75459
24927 75459 56997 46591 -20442 -12490 -40280 -30280 -26718 -41665 -21326 -89536 -3930 60079
24915 60079 -27993 -48229 -38623 -49597 -76281 -186540 -168567 -165370 -259197 -178100 -156258 -107822
24903 -107822 -69114 -131599 -127078 -89719 -117604 -65725 58277 117100 152933 141432 108811
24892 108811 18022 91158 108650 21284 -5969 20888 44033 -14089 34195 9587 -91958
24881 -91958 -54933 -8034 -54418 -95071 -79481 -5413 58673 69175 10558 -20238 46619 67416
24869 67416 19606 -12362 -7419 36385 45498 22862 -17697 -154480 -141375 -71773 -2971 14586
24857 14586 35451 71468 95259 144506 136437 103842 15581 -20201 -26669 -29485 -8773 26633
24845 26633 -48989 -58086 10666 -102239 -181139 -167603 -169103 -114063 -43578 -97229 -265916 -307298
24833 -307298 -76666 -78338 -122430 -111217 -73198 43183 126175 170422 165826 217451 138099
24822 138099 93466 191910 223498 55452 -74495 -48823 63292 18088 -7211 -46207 -36838
24811 -36838 12187 128048 97600 5923 -52863 -25544 45526 -21915 48936 109831 174196
24800 174196 50980 20440 4574 11036 23955 3210 15508 54777 96730 89456 -2081 -61448
24788 -61448 -55137 -17498 -24944 -674 -24239 -128321 -127391 -86529 -74166 -44271 -47505 17232
24776 17232 50696 140487 -30728 -197769 -162885 -165838 -152515 -102980 -102902 -18155 147608 162745
24764 162745 11722 -72025 -41829 -110285 -64668 -82065 -120686 -170174 -162184 -117171 -94208
24753 -94208 -89599 -181925 -153712 -111979 -43982 -7929 7500 70165 116073 -3227 -24250 18062
24741 18062 109315 144455 210423 227109 88959 -61485 7338 57342 -89260 -106928 -161720
24730 -161720 -170246 -93524 -45512 -59053 -65588 -51718 -62579 -77685 -16446 69580 29561 -84566
24718 -84566 -14455 66546 273387 185009 -20223 -62501 12466 98168 -14767 -141023 14009
24707 14009 87877 140011 92060 31835 45697 -11111 -110789 -17856 3084 -87978 -91882 -58396
24695 -58396 32495 96616 40661 25778 -13651 108178 112028 16639 9168 -27992 -20621 -14959
24683 -14959 37705 -68475 -125311 -181830 -227587 -251286 -219723 -222626 -170568 -95274 -110195 11984
24671 11984 133124 125325 150322 222408 86513 54656 97104 30477 -17067 -46643 -100390
24660 -100390 -135418 -104965 -116781 -60564 16525 37477 -71868 -128055 -145249 -159522 -61703
24649 -61703 -87557 -122594 -149898 28792 35968 -23418 -69970 -48025 -103953 -154222 -186523 -238836
24637 -238836 -170106 -12695 76187 117966 -54604 -25511 -3734 -66755 -154192 -203611 -27671
24626 -27671 -9086 -101908 -137597 -118660 -53930 22872 -79331 -135339 -130780 -79685 -19 15653
24614 15653 -54987 -95745 -77948 -62016 -132260 -56141 69837 14636 34051 101361 -686
24603 -686 -38142 -53245 -121811 -199289 -114753 -55545 -49483 -3840 -86533 -95288 -157967 -265461
24591 -265461 -175817 -33256 -13246 -78743 -49636 -92795 -154449 -110863 -184688 -122336 91
24580 91 52565 110635 63471 754 -99982 -153226 -133724 30606 103574 73153 78979 -8664
24568 -8664 -103600 -109335 -76052 -44262 -13565 -71949 -34434 75235 130223 -1202 -62496 -136301
24556 -136301 -257115 -129718 -105723 -52611 -44242 50470 44846 23285 -814 -101154 -51075
24545 -51075 -97746 -60631 -44052 -137959 -122987 -80268 -77645 -21642 51971 125560 88786 151637
24533 151637 121867 48955 131132 56936 117761 237692 166190 122680 185278 141446 121185
24522 121185 91279 91193 53732 140928 207699 104472 -15423 -96875 -170322 -177121 -191462 -226709
24510 -226709 -272242 -227111 -185794 -231115 -190940 -121051 37824 54257 45234 3036 -41852
24499 -41852 -82136 -101239 -128880 -100623 32669 71805 -41092 -76752 -123517 -130774 36417
24488 36417 68246 62652 15382 -66802 -135453 -21717 71498 170283 270088 245474 251348 121786
24476 121786 -11150 19566 67972 55654 65478 52956 -30871 -56056 -23164 -54405 -43551
24465 -43551 -57597 -92189 -81621 -73974 -38354 -68271 -55046 -120358 3665 20064 -85120
24454 -85120 54689 18017 -60020 -110424 -64349 11787 122998 15897 -138460 -52848 98830
24443 98830 88890 103683 31499 -169429 -156660 -103636 -38669 67576 15045 -22128 17643
24432 17643 90927 151339 30676 -7129 -12468 -28160 -66954 -133880 -89929 -48452 -16080 1110
24420 1110 -4107 -30533 -18659 -19444 -56298 50286 40295 -41753 -31245 -9051 62769 75961
24408 75961 108021 180430 181256 -13328 10155 167650 110935 25566 -40796 -23860 -117862 -151013
24396 -151013 15890 151055 48202 101482 155799 8203 -89008 -140357 -167815 -70105 -101122
24385 -101122 -127817 -82466 481 76055 29953 19667 -3395 26475 59659 2860 -13612
24374 -13612 -40499 -35189 -102777 -225425 -95449 -74416 -48866 13574 62507 65292 -4462 18301
24362 18301 -11533 -59605 -126718 -237023 -229633 -142623 -57738 2109 99860 110087 91123 111293
24350 111293 154413 57024 -153418 -133744 -86601 -48722 49564 145241 240385 128005 -13772
24339 -13772 -143325 -177780 -213890 -149202 -145679 -116218 -115959 -48197 -49401 -104314 -30073 74448
24327 74448 45454 137245 109790 -14688 -65148 -78258 14226 -16891 -59200 6298 162668
24316 162668 179019 93328 72110 51519 128361 4697 -27790 -95147 -48098 88704 60774
24305 60774 31088 157480 124587 -8203 -129715 -298653 -295019 -222976 -236661 -204602 -255005
24294 -255005 -206226 -110942 -15857 88878 153943 95189 -4450 -152719 -157839 -111424 -154543
24283 -154543 -19648 -23368 -88371 -91773 -82055 -98170 -201400 -353143 -359474 -206193 -64754
24272 -64754 32840 -68306 -120183 -145999 -82626 106471 143510 129242 75124 -60498 -138425
24261 -138425 -154850 -151823 -173970 -189884 -71610 -90031 -22541 1622 -70959 -141347 -191577
24250 -191577 -104753 -40439 -3398 61987 131798 95115 4264 -16003 60340 103436 101678 -3722
24238 -3722 -47776 -76121 -147345 -64632 -43039 -39246 -1195 -18927 -181937 -229956 -160870 -136703
24226 -136703 -92646 -103377 -66175 -54725 -85505 -134859 -191751 -219157 -231099 -214351 -70956
24215 -70956 -44695 -27602 -30979 -42402 -84516 -145116 -141517 -123927 -85384 1989 128989 91722
24203 91722 -117160 117451 298189 154227 -895 -48055 -65602 -154897 -211095 -22643
24193 -22643 137192 89803 10653 -159603 -178761 -185304 -148954 -175125 -206956 -176345 -92710
24182 -92710 -40295 -114320 -117273 -72541 -46613 -141010 -116854 -42549 52431 -9191 -49766 -165772
24170 -165772 -201316 -33196 39635 22646 -84511 -156060 50092 140483 125477 61410 69470
24159 69470 131615 116536 67307 64834 -74253 -83409 -36118 -63663 24144 38371 -21310 -15601
24147 -15601 -62836 -36136 -155969 -142409 -178534 -198265 -172696 -171245 -270496 -253875 -142412
24136 -142412 -133999 -214259 -195040 -131996 -112225 -27605 51254 47756 -79810 -158506 -58083
24125 -58083 -1953 50769 21400 -102849 -113089 -187335 -163210 -204555 -146344 50673 45092
24114 45092 52254 -28798 -173294 -259659 -281665 -250984 -191494 -112861 -74293 -108548 -171794 -138616
24102 -138616 -130363 -205806 -137432 -86111 -66384 16612 87295 70400 123656 110540 144490 71164
24090 71164 -120469 -49461 90256 255644 153397 44091 -105607 -189173 -230558 -150362
24080 -150362 -235377 -196661 -142534 -81404 -160319 -150270 -138951 -117146 -157614 -207633 -183300
24069 -183300 -53717 38961 39673 -40414 -48418 22447 123966 43582 7261 86320 186173 210971
24057 210971 73499 -37295 -96438 -52344 -6024 92524 72315 -60038 -153153 -203483 -264642
24046 -264642 -278738 -227366 -199823 -107579 -72660 44673 109240 43218 -7852 -49178 -71945
24035 -71945 -218762 -144799 -158972 -201140 -299732 -393973 -286215 -184444 -75991 -18436 -116123
24024 -116123 -251355 -237650 -169256 -268678 -310265 -196335 -131578 -89623 -56187 -89048 -81952
24013 -81952 -35616 -87264 -186402 -232916 -140594 -74106 -106603 -68275 -30075 -81178 -100156 -126265
24001 -126265 -180895 -137574 -68980 -101014 -49284 40374 245800 289815 231503 144740 5367
23990 5367 54623 103489 197791 210348 343800 300100 213871 73473 -5031 73474 61554
23979 61554 135263 193135 142506 19636 -37144 -35022 -8989 68453 86137 58216 77267 103152
23967 103152 78250 73485 105701 7975 57848 103517 65123 53786 40339 46810 156379 183810
23955 183810 178848 -5354 -86501 -119338 -141172 -23542 -11537 48880 150584 151327 135967
23944 135967 181767 153850 -39092 -190520 -119592 -59590 76995 90326 85151 207855 138166
23933 138166 33029 91785 197751 140755 95548 99597 235818 129706 82514 13317 -137710
23922 -137710 -41926 45914 114708 170262 173957 104404 -20197 -46489 35813 91975 24407
23911 24407 1605 77267 74382 77711 61974 -120410 -156747 -92452 -43246 12416 77732 135517
23899 135517 107560 61978 140210 68112 -9715 -68713 -55872 40909 -40875 -155226 -293227
23888 -293227 -219032 -266842 -246973 -175663 -94722 -95670 -124614 -110225 -39870 119288 88942 81229
23876 81229 -37393 -80828 5803 29277 -118230 -182172 -206350 -202390 -189464 -180634 -225346 -282806
23864 -282806 -155779 3285 47013 38562 32433 25601 -3062 59016 30005 -7952 -4396 -19475
23852 -19475 12180 107125 1767 -157454 -174839 -186904 -224242 -150494 -135265 -142979 -156408
23841 -156408 -75186 97856 194228 59881 -55684 -66952 -119971 -159918 -95633 -50433 -102134
23830 -102134 -8500 92769 158418 124565 128292 165419 111920 122696 165679 256066 107897
23819 107897 -44738 -60518 -61614 -105137 -115142 -52284 28475 82399 19746 -166335 -123481
23808 -123481 21015 134858 209071 153763 72611 -30166 -18840 -75489 -73801 -42757 -93518
23797 -93518 -63702 -149629 -153926 -18786 126000 204401 189845 100100 100898 71506 35897 43894
23785 43894 95750 183954 123115 130012 45555 -32658 -63833 11591 -4269 23954 66228 54442
23773 54442 -44889 -32163 22456 51311 23891 -159091 -19774 7184 -12554 -53553 -4168
23762 -4168 -71995 -139510 -85492 -104683 -167233 -169338 -143472 -112384 -8873 26864 -3943 -67112
23750 -67112 -13199 36177 185527 89609 18238 -49688 -149201 -64761 -99092 -144584 -143708 -174853
23738 -174853 -59909 -34189 -88285 -111019 -24056 113807 107168 14062 -16794 -3575 -6904
23727 -6904 142666 97885 -26576 35859 -26071 -23234 -47187 -80987 -116352 -137903 -72893 559
23715 559 273 -1534 31040 89435 236007 182861 57655 60668 141534 -1817 -32203 59844
23703 59844 43721 40459 74467 37825 29865 -87696 -100457 -96488 -36641 -15097 -129200 -182024
23691 -182024 -99991 -50790 -148167 -150756 -192056 -191038 -234214 -183584 -133828 -100933 -91455 -169010
23679 -169010 -176617 -209512 -223818 -220874 -202348 -187799 -216207 -279600 -162391 -20071 74646
23668 74646 67086 -42896 -129980 -32430 51234 -115896 -167979 63222 54186 -55797 -152481
23657 -152481 -208540 -132594 -24510 12033 79946 130299 101707 81701 63950 57199 66167 32973
23645 32973 81195 109548 107081 153767 139428 40714 30334 49875 -11814 -42284 30272 114703
23633 114703 104472 125760 128835 80587 27676 -43077 -36358 90574 40173 -170620 -49976
23622 -49976 51311 79195 78283 38227 36015 451 -84360 -115819 -62958 -32286 -64071 -47743
23610 -47743 76450 59815 61123 -78620 -102535 13111 8171 25597 28969 -20781 31022 92806
23598 92806 27937 -55432 -90369 -19491 -64021 -125765 -115593 35624 54540 -75273 -79645
23587 -79645 -76373 4217 4483 78015 34261 -121950 -241254 -241118 -291190 -324207 -283333 -197744
23575 -197744 -156074 -66289 -1988 -40676 -135358 -201222 -122666 -109107 -190662 -273820 -240987
23564 -240987 -139133 -127596 -180656 -265878 -242377 -131300 -65751 -36080 -46899 -149873 -98449
23553 -98449 -1806 -250 -7496 10963 54243 117856 194263 203174 154182 139578 76830 34555
23541 34555 97482 54213 -10652 -62122 829 73635 197325 206901 71826 8162 161027
23530 161027 138022 57891 -39275 -48456 51436 186346 207019 63378 44531 42751 -6131
23519 -6131 2727 13648 -114509 -123278 -25342 13066 36759 -12133 -123408 -94756 24341 -548
23507 -548 -50515 -25430 34313 153118 117113 39163 -20788 -154822 -118453 -35045 7264 76235
23495 76235 5119 -113427 -199961 -110284 -88137 -90666 -112688 -103448 -27167 12276 98932 58014
23483 58014 7481 14867 43315 151669 184598 39772 64791 107102 832 -26115 13704
23472 13704 61550 18364 10157 -87131 -96900 -86231 -23405 43619 45039 -20044 -119872 -182485
23460 -182485 -196141 -89652 -49792 71395 223837 322532 271201 98092 107019 52004 -24033
23449 -24033 -48625 42881 218005 252557 97995 42263 166661 209090 219322 199100 86143
23438 86143 -3828 -11663 -17832 77137 -42730 -37945 -53023 -67262 -19321 -33727 -41462 -135391
23426 -135391 -209777 -252241 -176916 -162107 -225857 -10142 124164 -30847 -84457 24447 84066
23415 84066 -54766 -106078 -43558 -162984 -167847 64149 174328 113375 14819 -53960 25867
23404 25867 16248 -15090 -45489 9326 -55229 -156016 -94863 -59752 69617 153068 109698
23393 109698 26329 -15888 -10670 35896 64304 88942 61870 -18900 -91433 -24784 -27742 32957
23381 32957 94678 7423 -7841 -87227 -74551 -11998 57336 123146 141453 99500 162557 242682
23369 242682 213164 192160 134057 99700 73535 11423 9316 -72811 -152773 -171482 -181482 -88546
23357 -88546 -56279 -26931 -7196 28978 -108975 -221219 -86964 -4390 -1030 -3033 -144235
23346 -144235 -162614 -76371 55209 126917 115386 4480 -104434 -16654 -5994 -27433 -981
23335 -981 37331 -20928 -139809 -179753 -78001 -86946 -30922 -63370 17408 130341 64433 -13471
23323 -13471 19443 26860 117824 8802 -95079 -66705 -24445 126808 154752 -114307 -244471
23312 -244471 -189111 -144572 -143231 -156756 -123806 -106640 -93324 -142337 -48514 24251 -104595
23301 -104595 -122627 -69060 9927 -93423 -122700 -137282 -136188 -112080 -69898 -29526 -18736
23290 -18736 -86109 -152440 -185301 -91983 -122216 -172686 -164092 -157472 -134344 -62348 47422 22841
23278 22841 77278 60761 68806 83574 -29531 -114684 -186172 -162226 -101027 -9552 17386 55519
23266 55519 39457 37574 52096 8246 71909 182058 73310 -68956 -31023 24147 9670
23255 9670 64094 137689 78220 20812 11991 -44294 -107149 -117466 -172588 -157499 -79895 -48964
23243 -48964 -51734 -124433 -115353 -123407 -62032 -94221 -148302 -72313 -29769 -165652 -136762 -16817
23231 -16817 106887 209923 248903 263676 243375 215630 174314 90074 128795 43982 -76042
23220 -76042 -121254 -126608 -130130 -58348 20690 18557 38557 -68334 -114334 -146487 -63411 -161328
23208 -161328 -190431 -97687 -9246 37205 4003 -16236 -29466 -65102 -165097 -271378 -210696
23197 -210696 -232517 -261115 -221924 -124003 -144545 -158632 -215047 -60254 42233 60314 -133631
23186 -133631 -233005 -181340 -131405 -38781 61515 110234 200453 52582 -84819 -83939 -91473
23175 -91473 -29375 40692 17 -37273 74582 72654 3243 -865 -73984 40866 125676 78891
23163 78891 57918 -100608 -154504 -96862 -147244 -174823 -214479 -247724 -263215 -126414 -7990
23152 -7990 -69147 -171678 -224427 -193281 -104151 -82434 13619 153354 106718 27752 55583
23141 55583 21573 42626 18830 93523 83015 81776 -7159 -16686 50183 90527 25838 47795
23129 47795 90166 86890 -297 -39113 -7433 4587 -34649 88123 -10893 -117512 -65542
23118 -65542 49538 28097 76817 101281 60034 37216 29349 42211 93474 49072 23612 -127672
23106 -127672 -80284 -6998 -32165 -78097 88349 101200 19976 46019 176172 137953 70140
23095 70140 33079 10292 -69841 -42635 -80877 -24112 85319 107488 -67561 -137811 -99310
23084 -99310 70530 83143 33503 -49609 -74008 -176833 -98028 -10997 32239 111275 30492
23073 30492 -9373 -42089 -156963 -159051 -134143 18952 119262 -15081 58148 -65901 4195
23062 4195 -93114 -166064 -101355 45881 126255 23083 -102744 -101236 -30590 53003 108058
23051 108058 45164 -12209 -108743 -95203 49102 110476 122462 2461 10493 -130994 -134120
23040 -134120 -10888 -29452 32831 107149 60276 -72522 -235648 -325951 -212544 -7670
23030 -7670 31461 -52460 86026 218743 282614 208476 11428 -85206 43898 -3881 48736
23019 48736 40 -37766 80606 203807 164581 58911 68473 46103 46769 122060 36262 -44986
23007 -44986 -30143 70185 -4634 -134851 -181575 -209672 -188057 -103769 -95784 -99466 -67075 -83929
22995 -83929 -94745 -91584 -72115 -29496 46617 113746 94006 156740 220622 134808 40793 -11775
22983 -11775 -71479 -32454 -38370 71109 31460 20272 60681 79766 -16106 -132715 -138523 -76756
22971 -76756 -32026 -45463 -36392 15307 10726 -33941 -91433 -67632 4915 80755 120168 102168
22959 102168 74675 25552 -12200 -7893 -123869 -211744 -222308 -165895 -132387 -158645 -88891
22948 -88891 14627 82211 80287 34690 6756 -68461 -89304 -184206 -264305 -260211 -288090 -226412
22936 -226412 -181949 -118314 -14103 80782 158657 303071 309301 269893 201857 110234 99850
22925 99850 32762 -84563 -183869 -204120 -115166 25899 49729 60137 89553 177551 178405 161894
22913 161894 129108 155434 194157 146148 74635 -41793 -28565 -46945 -138636 -160279 -134125
22902 -134125 -19103 11748 41858 -7944 -108579 -99457 -73508 -97186 -154175 -96521 -93000
22891 -93000 -5422 81372 164889 94315 -13316 -70140 -88045 -35176 6521 185220 229558
22880 229558 204872 193600 248310 198734 92787 -48018 15459 141178 212888 277961 199953
22869 199953 64504 93347 84157 60631 -94319 -179056 -76642 92086 137388 86618 129296
22858 129296 119823 122235 142019 87125 -44946 -190354 -147457 -60954 -86375 -104526 -40815
22847 -40815 -147410 -187703 -105606 -62535 -77466 -29645 18933 104389 6836 -11491 -41948
22836 -41948 26998 80487 10158 14899 63226 -5810 51460 108530 40384 3438 138812 53433
22824 53433 44527 2142 -58553 -36491 122201 101929 44139 -14098 -37298 -33083 -42391 22500
22812 22500 -42275 -56159 134228 300960 272341 218855 165677 181871 69446 153077 171619
22801 171619 101657 -76164 -107007 -147935 -123166 -35992 24956 -26255 39062 68357 99463
22790 99463 143793 148332 54755 36735 16377 2545 64448 -2304 54221 -1615 -205269 -210233
22778 -210233 -148439 -31980 61288 179656 254954 158285 98229 93741 135492 96551 58911
22767 58911 7496 -116506 -57928 -50426 -44380 -82788 -60751 -72000 -150064 -256305 -161591 -43671
22755 -43671 -97077 -95683 25889 24369 35159 23312 51942 78581 -33446 -69632 -32889 69744
22743 69744 102728 136983 165869 149643 140574 227920 108829 18037 59291 -27473 -33715 -78164
22731 -78164 -63999 -434 35815 -31403 -42316 -139777 -146016 -102584 7861 13232 -48633 -60083
22719 -60083 -30205 -99968 -55643 153850 257231 230198 148317 140708 104405 87329 211741
22708 211741 108072 -7177 6614 98764 72612 94312 207472 168444 82692 6527 38601
22697 38601 101302 116565 62616 -41287 -139568 -184340 -271314 -335037 -369684 -210434 -104642
22686 -104642 -26489 -99910 -157698 -149391 -53609 99166 123255 107226 36995 29267 92365 156296
22674 156296 116279 84653 5703 15832 172636 223990 124570 31453 22140 34136 108755
22663 108755 105593 23050 2143 -96440 -102453 -40028 29385 -20717 -22622 -154451 -95448 -29414
22651 -29414 52966 25127 21386 27354 -4074 -49755 -39344 66992 103121 8201 -71687 -87720
22639 -87720 -85390 -106933 -41342 7587 -4677 -31040 101222 96715 97436 45877 72105 75270
22627 75270 64924 -38600 320 14054 57347 12602 -110830 29126 64205 33424 844
22616 844 -178201 -236842 -208339 -100279 -182645 -224322 -76889 25239 37831 100534 40608
22605 40608 24926 117834 169825 107330 85111 13050 -49400 -13522 -32560 -45670 34295 58322
22593 58322 62016 62142 -3849 8778 71221 152741 29417 22189 77689 -47725 -64528 -20925
22581 -20925 50385 93389 108639 49774 -14221 -25154 -29522 41924 51171 99697 135919 43548
22569 43548 -87466 -202053 -125075 -178783 -219548 -193223 -162385 -167927 -168652 -156868 -173112 -210518
22557 -210518 -144162 -73857 -8316 17258 -77842 -121111 -66917 -110200 -77362 49825 -69153
22546 -69153 -207063 -170778 -64000 -102364 -163147 -142218 -98373 -154744 -89638 14429 3760
22535 3760 33258 33923 -52233 -139951 -104782 -55932 21767 90809 24831 3751 34941 34407 -56271
22522 -56271 -171039 -258575 -249089 -246554 -129151 -18061 -82309 -155484 -303447 -253019 -248181
22511 -248181 -106197 -49641 -99578 -75582 -77306 -122112 -157600 -189860 -107590 -123537 -139491
22500 -139491 -151126 -133278 -63462 -22256 -39655 -25731 -36925 -31949 -66900 -7874 102549
22489 102549 16779 -102026 -154588 2177 99717 32605 76113 14543 4538 34410 134010
22478 134010 51609 28096 38304 127373 134885 112639 109780 102467 59443 -7290 -46017 -114004
22466 -114004 -54323 -110203 -59840 2445 20242 9736 52816 54406 67008 222539 158499
22455 158499 63020 -11073 -37621 16921 53282 38898 77024 35815 -47577 -31914 42626
22444 42626 76751 22645 -52606 -78351 -74848 -44560 102143 79480 -22303 -44421 -19387
22433 -19387 28731 3399 33959 87813 137069 84631 58632 87823 38900 67253 168444
22422 168444 218789 121733 8212 -102805 34119 67663 207558 305851 299070 315833 274240
22411 274240 306800 246241 -23214 -85267 -63585 -97851 -113056 68251 151735 100751 56762
22400 56762 47510 -6031 32382 9895 14259 23437 -92531 -72605 -75687 6352 56253 -13137
22388 -13137 14486 91280 109650 41746 -22168 71136 -58687 -225592 -203826 -46780 -34721
22377 -34721 20151 23425 -1302 -3273 1941 11404 -30250 -4142 -106710 -76517 -84832 -77166 -59066
22364 -59066 -30128 -16398 32710 71599 106150 82068 44862 -29654 -66151 -35327 18927 33144
22352 33144 -5574 125961 162176 19477 -9547 -6877 -15242 -141363 -161942 -62848 -37784
22341 -37784 -93713 -42753 18961 -59639 -184814 -273670 -245281 -134878 -163315 -178311 -163099
22330 -163099 -171466 -99542 -84071 -107482 -172178 -29113 59259 31607 54369 79810 188015
22319 188015 142539 -23632 -139129 -180875 -131094 -60923 -23205 -69617 -152600 -82666 14447
22308 14447 17446 -85607 -211415 -241163 -12415 106220 36875 109452 17739 -29322 20867
22297 20867 -53776 -127241 -28874 84188 23754 -52398 -102174 -137126 -104598 -145363 -162211
22286 -162211 -64794 42501 88047 46377 -13874 -8985 -26471 -41884 31833 1803 67694
22275 67694 136838 87185 -28167 -92876 -303676 -300779 -221097 -166058 -163776 -79805 -18440 -3031
22263 -3031 -19768 -21478 78031 78370 24969 -82695 -100570 -179545 -190746 -72011 -47145 -101947
22251 -101947 -131962 -83838 -77616 -49189 -65846 -111122 -95623 -51518 -40688 -54895 -42658 -5962
22239 -5962 63978 111397 100539 122735 69881 -8192 3601 -14655 52787 83000 36297 -75971
22227 -75971 -10047 66179 5494 -153569 -318397 -324636 -125378 -40982 -33392 -44476 -42406 31699
22215 31699 155089 56169 -37640 -186238 -178117 -78187 -98570 -217672 -193853 -166944 -108528
22204 -108528 -67956 69920 203017 146704 -26007 -139453 -250510 -208968 -86993 -44378
22194 -44378 -80729 -109193 -99825 -107645 -119033 -151465 -82132 -99484 -86084 -115147 -111607 -19490
22182 -19490 -133081 -204260 -154073 -79647 -58449 -95474 -111123 -96400 -40947 -78710 93023
22171 93023 116814 158686 185830 177300 131390 138129 51580 76049 46952 -25315 531 -17431
22159 -17431 -13007 -44573 -98685 -143853 -141647 -211038 -172472 -206386 -92881 -25656 -51795 -1555
22147 -1555 -34719 -91739 -100442 12691 130204 204861 146848 98114 30944 103199 41087 -33917
22135 -33917 -7733 56355 106035 130142 187760 215965 114283 80220 33641 -8156 -66118
22124 -66118 -65663 -35736 -220739 -179959 -203975 -187811 -169904 -103785 -116722 -64480 -16329 16797
22112 16797 -18477 -21398 50140 24264 70702 49934 -17126 -61865 -111087 -145359 -225561 -229737
22100 -229737 -150941 -35210 -10420 -30930 -130297 -146889 -142615 -195024 -194642 -209719 -235138 -33576
22088 -33576 15849 -110390 -160220 -8606 104565 52747 -69258 -162342 -132778 -80058 2941
22077 2941 22003 60214 114264 17274 -90393 -51824 63285 142479 119493 6665 -52954
22066 -52954 18158 -20555 -58727 -44207 -67628 -109742 -114965 -153592 -114479 -28936 50434 113183
22054 113183 83005 123480 133299 135353 130867 60027 -34685 -106425 -67022 29195 111563 44036
22042 44036 27160 39651 -87527 -114687 -138388 -272664 -323503 -185218 -71451 -14906 32822
22031 32822 106594 147194 153695 186876 152328 35423 15072 42487 170667 184160 170055
22020 170055 87073 -54237 -59346 -126475 -150090 -75019 -90202 -116164 59143 229869 262679
22009 262679 259715 250523 80323 -23551 -37933 -104267 -50247 43132 68716 68513 188311 166029
21997 166029 166589 74110 -93355 -68702 -53446 -110392 11012 37995 -12985 56209 177031
21986 177031 263120 250918 123266 37438 3058 19931 54857 33836 63116 27661 163
21975 163 59991 -32378 -97502 -50036 -46114 -98137 -176964 -79529 49617 82100 68337 -23879
21963 -23879 -54192 4146 57545 8723 11530 56339 94342 63550 116124 170972 143339 70599
21951 70599 67517 48879 -80974 -88240 -92467 -53407 72544 132978 107544 81208 108366 44372
21939 44372 -180862 -258245 -157327 -65661 -20138 90575 80097 164371 287694 292421 176013
21928 176013 56507 4176 -20429 -21360 14358 60471 156429 60278 -36827 -25216 38144 -20739
21916 -20739 -39265 73663 59874 1901 1116 -18677 -131262 -173810 -104708 -53770 -1183 13886
21904 13886 -87884 -40678 20555 -5283 -131292 -111318 -1175 65246 -44013 -140413 -54202
21893 -54202 -33358 100330 204004 154725 69339 72223 124941 50364 -77936 -138053 -122349
21882 -122349 -68272 5015 -113082 -181721 -75440 -120115 -61031 -33734 -127348 -139309 -137483
21871 -137483 -77184 31913 25015 -30239 35246 144147 140281 95716 -27172 -34064 -642
21860 -642 -8552 130187 90919 -10210 34301 43415 44754 115550 142014 62119 46880 49432
21848 49432 99416 132629 86654 30662 -45268 60082 134234 45153 26368 358 -55741
21837 -55741 -62109 -103078 -156606 -64907 39994 106202 22173 -126714 -255177 -253271 -192495
21826 -192495 -225930 -279070 -197550 -125015 -50711 -31155 -51366 -84683 62840 66030 60856 67779
21814 67779 112007 43932 -101359 -31981 52160 -21167 -66675 -42398 4793 15425 -15599
21803 -15599 27707 1134 14952 -1461 13699 -45987 -91983 -93690 -57597 89 102249 170847
21791 170847 25298 19288 54292 53358 12720 28987 -91614 -95537 -57320 -22399 -32826 41135
21779 41135 234559 317040 390185 279996 114635 9631 -136838 -125321 -38718 67282
21769 67282 51914 66883 130084 133321 64180 22872 -12537 -147546 -123464 -63922 -20199 -56767
21757 -56767 -95920 40780 48553 -43833 -151841 -63115 -38689 -2031 11208 -2249 -57672
21746 -57672 -125510 -59583 5372 -34522 -79490 -110594 -173507 -115507 -66786 -22873 71363 6579
21734 6579 -73369 -71533 32612 126071 165155 155628 221394 135644 11064 11715 35180 -8448
21722 -8448 -60946 -56624 -114188 -156159 -200510 -151068 -99683 -28716 49850 11510 -50492 -254237
21710 -254237 -417470 -323634 -312398 -324047 -148302 -34374 -13177 -95054 -158655 -158264 -89990
21699 -89990 -8863 -46368 -43827 -24432 3085 -12707 -42012 13849 91267 77861 23761 235
21687 235 -67212 -18985 18426 -45275 -88484 -116426 -116941 -61495 -97808 -139629 24181 36594
21675 36594 -41845 -3044 -40331 -11158 -32992 -80676 -58894 -161972 -192314 -170550 -115699
21664 -115699 -67759 -24468 -76186 -104178 -95551 -14467 -63664 -100164 -53783 -87864 -71376 61153
21652 61153 141594 830 -153855 -220592 -194442 -139252 -22907 416 -130789 -54907 -34059
21641 -34059 7634 34330 88009 129851 176161 156527 135212 19278 -52039 38198 114808
21630 114808 196085 169762 197500 107351 26212 -55386 -71921 -6474 -23802 -39942 -88813
21619 -88813 -44989 5827 -33479 -116679 -123852 -90501 -169230 -151377 -182821 -261446 -314954 -176941
21607 -176941 -120739 -122253 -14077 51191 30507 -71395 -178493 -62106 -110106 -242529 -167277
21596 -167277 -56422 85812 51767 -53506 -18421 66234 17017 -48732 33471 48730 60137
21585 60137 153506 95874 64442 19871 -3807 -65594 -68030 -17808 -37886 -44804 -106847 -223811
21573 -223811 -206340 -103809 -33231 29058 31931 -3045 6867 3891 133688 92178 111224 138998
21561 138998 207022 180917 117097 46303 59170 -1267 -19501 -57653 -80309 -48442 2222
21550 2222 5927 -17374 -71111 28706 36937 59526 47494 23464 -6001 -44786 -49139 3586
21538 3586 32935 62630 170959 25405 -25641 -11620 68961 16464 -38808 20763 20523 2654
21526 2654 -9076 33366 72161 42489 114972 94875 126709 142785 243106 274603 235479 233639
21514 233639 277102 248417 144761 4527 -19104 -215 -8112 75956 80857 84742 30138 -130065
21502 -130065 -214242 -236405 -114514 78868 115067 78986 1194 33565 95472 64420 -25794
21491 -25794 -15007 -57686 11931 33413 -2898 -7542 -78123 33731 135529 159920 77427
21480 77427 -3273 -165805 -93893 69284 81708 -25834 -79599 -167582 -138169 -99405 -133675
21469 -133675 -143912 -80914 12453 18073 95543 214321 199081 2529 -83944 -65230 45095
21458 45095 6789 -103448 -89471 71355 134706 118211 -50209 -130439 -117728 -153646 -150388
21447 -150388 12076 -10063 -16009 -2587 121532 33763 -129175 -51393 -33978 -132490 -66451
21436 -66451 -22054 -145450 -172921 -45710 -6492 53062 5310 -6568 75015 -32140 -59026
21425 -59026 94133 80201 -2694 -25488 -142255 -165704 -72749 -33801 14055 59359 119839
21414 119839 111284 129380 -29230 -74537 36963 170842 122083 48218 39032 20035 -30665
21403 -30665 -52627 -114669 -105256 -110193 -171887 -219405 -238335 -171287 -113328 -48296 59686 134158
21391 134158 204325 108060 -21114 -7459 129260 113891 71766 22494 -88458 -123471 -216553
21380 -216553 -216787 -153904 -68290 -157729 -149678 -105614 -192663 -162106 34303 96190 -68349 -161019
21368 -161019 -104364 -98390 -63821 -94538 -227119 -153366 -122548 -118484 -58306 -10311 -22495 16335
21356 16335 -7733 -62545 -142092 -100685 -89267 -159000 -107007 -54628 -39646 -97219 -50433 -83293
21344 -83293 -240663 -282448 -80391 71902 86599 -26351 -158809 -196407 -115013 -98238 -37827
21333 -37827 -37124 42141 51016 -26593 -54432 -95427 -62233 -127441 -160449 -118712 -170341 -155643
21321 -155643 -71789 -135479 -107593 46669 204483 195561 24876 -130658 -118425 -38261 -71516
21310 -71516 -58121 -6677 76463 74763 53979 127139 -9220 -192766 -130712 -137341 -158019 -63404
21298 -63404 -20059 61684 84931 -49147 -108239 -74120 -37388 112940 151621 156618 44830
21287 44830 45882 21029 -16926 -70816 -9125 3819 58333 -5346 -5003 82807 151894 132763
21275 132763 152515 134418 47285 -69000 -65986 19727 -31330 -140872 -190292 -169003 -63495
21264 -63495 17566 663 -3499 57381 -2947 -2395 -38442 -23841 12083 11033 42630 61143
21252 61143 -6979 -71416 -64233 -73354 -106348 5744 -13591 -158367 -157577 -150305 -140603 -115653
21240 -115653 -163418 -312230 -259564 -166603 -28527 5149 50712 54208 14718 -25310 -80611
21229 -80611 -53996 -124490 -121700 -129990 -58946 17907 132608 121756 171539 166633 203602 63172
21217 63172 -68582 -42951 -104517 -73552 -76390 -62644 -85544 -120757 -156644 -164015 -110878 -89188
21205 -89188 -87083 -99470 -80742 -11975 -32317 104533 92155 13449 -13878 -51508 -21183 -83925
21193 -83925 -194474 -196164 -77264 7427 -12575 28010 -32950 80666 50782 8495 55598
21182 55598 114177 202066 183322 128982 67450 101187 112335 165647 87511 -8341 27667 18736
21170 18736 -15 -207528 -295178 -163011 -115596 -115875 -138531 -16052 140007 33289 30994
21159 30994 -3630 -124713 -124208 -32841 -95153 -205878 -206524 -96898 -4178 -39581 -23808 33016
21147 33016 55660 109126 45321 -40103 -18714 9321 153840 231520 64079 -117302 -252407
21136 -252407 -29516 189314 135766 40620 18864 -5051 26018 29147 100101 157699 172876
21125 172876 136254 -25812 48592 56129 67443 66681 82251 103317 16970 -65489 -164888 -172981
21113 -172981 -141439 -50282 -97430 -130808 65 87091 111215 116355 22277 -12638 5385
21102 5385 -39406 -7157 -52386 -124941 -67049 -14523 -34878 3252 141659 36925 15092
21091 15092 77399 58118 48451 136678 201793 169524 82591 130983 198622 74461 31764 94094
21079 94094 169060 110359 31640 19019 94879 51790 109762 86581 83914 96278 -8898 -26461
21067 -26461 89836 218833 281174 199327 142807 60915 84606 -15509 -98557 -111634 -140824
21056 -140824 -113252 -152834 -172321 -93203 -37149 2647 71022 80499 31288 49676 -23744 -14406
21044 -14406 -66816 -87458 83402 128075 92120 82673 -39386 39084 29982 -106669 -148079
21033 -148079 -77208 13837 -29590 -93904 -64700 79485 132312 95262 118388 30970 -62060
21022 -62060 -41789 110217 167473 83500 -56473 -66461 -2961 75721 108661 3617 -29338
21011 -29338 -43838 -81379 -54372 -107455 -129225 -62674 -77129 3458 6603 13778 68932 14306
20999 14306 -74950 -89167 -191241 -175008 -35142 59233 64531 13248 17077 -93549 -97013 -31426
20987 -31426 -80587 -146745 -273088 -199916 -119250 -112846 -80147 16318 61846 35453 44706 -34768
20975 -34768 67874 48675 97335 25220 49121 49141 -61895 -124992 -143879 -82926 -37149 10311
20963 10311 -12937 -33367 -42924 59387 223182 144723 44157 24812 -22600 -81762 -58518
20952 -58518 -72356 -42198 19327 -20220 -152825 -115301 -78189 -65402 -76046 -109746 30360
20941 30360 149334 103521 91090 81597 117550 71888 18679 -98163 -181922 -116503 54643
20930 54643 117500 94118 63824 17477 98411 112605 92729 103285 125339 127685 122489 -2390
20918 -2390 32879 103792 89242 56068 -24256 -55062 17333 38648 52656 -1680 -109597 -98112
20906 -98112 -163039 -91608 5854 -29654 115473 166756 89960 111022 130814 115209 42961
20895 42961 -76117 -13679 17354 64791 10941 -62069 -119282 -14193 229201 137676 26947
20884 26947 83787 103406 47052 20333 -1440 10802 12008 48498 65666 34085 -23321 -14483
20872 -14483 -41363 -43845 -33035 56479 49090 13267 -35546 86361 70091 -26906 16184 -147700
20860 -147700 -241908 -140732 665 110153 113031 229080 133405 40799 84975 129272 62794
20849 62794 83426 94909 89267 -88834 17477 156771 169475 205445 205796 45243 13292
20838 13292 60734 3512 -62563 -41683 -91584 -71765 30962 85377 -16318 -1221 -177372
20827 -177372 -109344 122409 210459 115431 91873 46824 13684 79549 -27421 -132256 -26967
20816 -26967 -15797 -28892 -58194 10305 98023 4192 -166314 -236727 -184238 -110912 -107758 -135879
20804 -135879 -167801 -140076 -141187 -104618 -1830 117229 61054 148266 281162 224046 43380
20793 43380 -100781 -154852 -165592 -66976 -57325 -91633 -20889 -74090 26089 100338 8023
20782 8023 -90584 -103277 66142 41190 -73200 -57605 52088 67916 104627 153693 82183
20771 82183 -16439 -3286 -69519 -46968 -85497 -54493 -64779 -85961 36704 72524 26723
20760 26723 -45252 -26289 17686 -11848 -59934 -35569 -26572 -118019 -32156 16758 68865 115113
20748 115113 155953 65051 149573 178412 132925 177863 208030 156042 109274 52483 124706
20737 124706 183782 77978 -75632 -100383 -74748 -143791 -82264 -40796 6841 -50365 -51139
20726 -51139 -80419 -46043 26341 -6483 -60338 -130621 -65821 27358 37916 11356 9510 150717
20714 150717 299541 343678 446369 268869 30797 4260 105825 142948 170149 108825
20704 108825 55807 108120 116060 125607 81868 153022 274380 355343 310499 189317 135670
20693 135670 221777 207403 161472 148032 208449 123641 -15402 95025 195449 213943 196323
20682 196323 178882 138322 193763 253750 155020 117233 117156 188384 96798 51108 63616 -32496
20670 -32496 49899 92584 138159 116594 61980 -28241 -69643 -53926 -45549 -45967 -12790 83173
20658 83173 185326 276595 266591 262199 236289 251779 184922 160128 158515 223544 244637 179119
20646 179119 170852 167236 146683 81393 60612 157774 264319 272052 215819 125400 180325 258885
20634 258885 229251 111116 48598 83020 282553 225867 186005 178822 168865 123746 89812
20623 89812 186420 199292 173919 88281 131005 255691 211324 99027 39060 -75842 -134428
20612 -134428 -155194 -98089 20245 53659 14717 -36443 -5108 52951 117121 -112 -45237
20601 -45237 -145009 -115118 -153271 -709 56068 13381 55734 129361 76431 101737 134833
20590 134833 246650 220525 136766 82587 62882 118868 48771 81468 252078 147171 -45249
20579 -45249 6072 -41086 -28437 127463 154514 110912 16140 -43457 -43259 -30360 29215 68703
20567 68703 75641 131039 152197 195925 69883 36515 46490 122107 170811 81595 146257 50278
20555 50278 -35078 -71555 22401 24257 -5580 53497 71289 141913 210662 232018 200026 182375
20543 182375 143062 169017 160250 93747 39731 68868 131034 117119 184390 99431 -6077
20532 -6077 120949 215868 220469 249531 226099 276529 253723 299103 223261 118846 71988 55292
20520 55292 90826 114867 278715 288403 175898 58387 142636 31278 -37253 10747 81402
20509 81402 116457 145694 135528 144260 115544 102351 118659 8180 -44728 39776 59336 94195
20497 94195 215204 134071 20930 -3594 35725 -29810 19193 36938 -63711 -149590 -114594
20486 -114594 -84674 -87546 -65036 -2530 135580 213641 229265 171618 49327 102057 190207
20475 190207 155793 8294 34281 7789 41512 -786 105331 107951 76642 74160 130934
20464 130934 -7172 -85766 -68302 1831 10186 90593 157971 123710 17599 -43299 -3415
20453 -3415 176933 258845 213176 190365 29390 -34803 -63021 29352 112759 82829 29165
20442 29165 3008 16645 15252 -41933 -93206 -78723 -36278 111941 169796 106768 169062 226389
20430 226389 265268 224975 98619 172577 238177 216848 152573 46683 113044 239895 217271
20419 217271 147272 190304 228688 107042 138435 236051 164207 145316 55251 -29126 44647
20408 44647 219714 241976 121379 108916 166913 232832 195613 100621 -20821 18372 82260
20397 82260 96932 81339 51028 48996 37494 -25895 -123472 -23255 177293 305809 216759
20386 216759 94591 -100671 -147327 52263 207686 116845 167153 81963 104693 129949 75701
20375 75701 56803 -27081 -99707 6241 40754 14647 -89304 -1700 192792 114784 110010
20364 110010 59383 1793 -46786 -15827 35435 -45502 -42762 100075 94837 80761 33193 89699
20352 89699 176738 159481 52170 78093 133411 147311 98105 88908 225556 373419 358992
20341 358992 384667 365457 275434 279744 221753 248413 223717 178094 218233 205713 190278 174213
20329 174213 231146 217516 185233 153829 89204 109645 132246 172857 98342 110356 343543
20318 343543 556565 600249 602357 767458 875339 845715 1010026 1404650 2045482 2958234
20308 2958234 4211097 5470279 6046649 6017059 5255357 3860730 2597566 1711703 1136662
20299 1136662 733730 603362 553323 516843 389475 332869 385104 306870 198141 228525
20289 228525 248259 184075 224401 252749 236001 228046 236256 247647 237304 314128 277558 209629
20277 209629 134516 166055 193701 144443 60197 56540 115075 99630 151289 36390 41342 22827
20265 22827 -2162 -14631 72813 102893 42723 3705 104277 221513 212504 -48509 -151165
20254 -151165 -102844 -31677 4449 39591 113002 153343 148274 145311 271598 327144 169981
20243 169981 99573 89917 -16143 62946 136153 202472 47134 -138484 -110038 -28907 128028
20232 128028 138239 54169 57283 153264 213590 203940 136213 81591 37473 -3772 -32455 -90209
20220 -90209 -100366 -22748 61234 965 -15504 -87124 -248740 -173980 -70721 -8087 7136
20209 7136 -29960 -110116 -105991 -56985 23975 -47599 34762 99141 120605 176772 112653 83365
20197 83365 190650 213207 135016 94508 -50799 -120058 -48923 -102332 -132384 25967 47120
20186 47120 18969 22497 1946 8058 53636 45922 6301 -28936 -48703 -51631 -64478 26874
20174 26874 32829 143147 304210 261055 187450 240063 246230 210252 153527 269752 273820 225642
20162 225642 205967 153760 184000 186565 195208 240382 199736 219806 200924 125051 88738 93270
20150 93270 44009 -8697 95436 102661 124501 168370 126417 115895 253064 274587 167540
20139 167540 180677 285757 357332 395767 489364 573481 564184 466770 463181 740046 1033831
20128 1033831 1250913 1162826 1116239 1237824 1293734 1224543 1084477 920146 836650 976285
20118 976285 1187932 1445935 1590815 1701305 1582098 1197319 830572 730810 622576 471025
20108 471025 308498 160923 230412 299306 362496 263499 150802 126180 324099 436706
20098 436706 370009 239360 140728 129552 274402 263526 215943 349539 430762 330560 315522
20087 315522 461941 539122 500274 581868 751072 942607 1100090 1062728 1028385 870127
20077 870127 783931 885209 1079165 1410422 1497498 1259864 1221622 1371001 1505977 1553254
20067 1553254 1491496 1361163 1369480 1290319 1096170 919259 717375 535788 472387 458822
20057 458822 387523 241475 127069 145188 184511 180319 146733 91947 118786 122084 51290
20046 51290 97312 113717 184617 273311 311382 327751 299308 366206 439420 479002 409988 447122
20034 447122 546091 706528 945359 1155900 1404721 1797895 2136284 2334307 2387548 2416126
20024 2416126 2451364 2422660 2366560 2216291 1843155 1488761 1212437 959290 731370 521791
20014 521791 470090 460887 386831 286511 223306 103108 156902 167589 74764 91526 229230
20003 229230 164589 56640 83260 67715 75988 3987 -65254 147357 289942 195412 222372
19992 222372 262023 211719 238528 217263 281413 346699 251841 158422 11712 62113 46631
19981 46631 -6223 100326 121508 138844 180877 248151 335668 322590 256412 212667 221400 321551
19969 321551 232206 170384 111970 174988 233903 108278 25878 97471 118384 31542 -3704
19958 -3704 87833 205309 266376 363298 368294 307242 385827 317671 372623 360050 327391 287265
19946 287265 239049 253836 93994 101596 181751 213244 279415 319550 158898 93709 145377
19935 145377 70199 3996 -41507 -3314 3501 -19478 26296 131809 218357 148157 169630
19924 169630 264773 428233 461549 552747 701699 812773 769129 832245 792892 678828 775375
19913 775375 845621 715162 628884 767995 859386 937941 994311 1020648 1022982 894542 850938
19902 850938 865867 755570 581500 488056 309759 249536 282124 282307 302088 372459 400154
19891 400154 363729 383349 520669 633160 555710 460099 524094 652031 695525 687096 729669
19880 729669 744093 690911 573727 530184 306877 312452 381562 562986 772672 810620 787939
19869 787939 703664 758129 758420 788770 825605 801606 895430 955743 999330 1096742 1128443 1039453
19857 1039453 1045860 1007944 910398 1034470 1034924 935702 943052 956841 888175 892976 1003653 1057160
19845 1057160 1087103 1054548 929442 886719 848254 825437 873517 860494 789670 727262 757665
19834 757665 726905 656411 561729 450487 347130 329450 323113 368148 376953 382055 396967 438248
19822 438248 394298 310363 200780 334985 494769 457763 437996 308287 266002 370061
19812 370061 584564 568950 384090 346141 425096 570121 705044 822510 973874 1056498
19802 1056498 1143022 1192027 1114321 1117539 1143248 1040738 894196 889833 935043 930922 887232
19791 887232 926982 941944 969153 950799 885815 884024 662715 530132 445303 490105 546282
19780 546282 452813 495000 468044 456183 442862 493854 531391 482055 460103 317481 282294
19769 282294 346951 371633 459686 430485 404818 289052 220008 276235 326584 341589 413105
19758 413105 550001 503435 480893 495793 537371 552289 525776 502984 523632 455157 370827
19747 370827 234683 253322 372682 375579 382772 384457 416666 524368 498548 404707 413594 508404
19735 508404 658094 733274 625479 566399 559107 629534 734735 733414 567715 425699 308682
19724 308682 300888 405629 345145 303701 352543 381023 269022 227160 244207 375165 393363
19713 393363 246004 282087 345407 417715 540235 503018 461357 366618 277690 284406 367465
19702 367465 413636 325135 163151 362112 404312 433494 396916 225862 244102 346049 349573
19691 349573 374764 372247 321955 312331 403728 305523 118171 279759 305167 312073 390716 531645
19679 531645 457124 427337 466988 402027 377732 469336 404062 323152 247121 265596 344464
19668 344464 340016 346085 344112 411796 494398 443462 383390 414997 435634 489307 599507 626677
19656 626677 642478 684611 597314 467045 393536 449177 512073 526910 570728 575433 431608
19645 431608 447706 507858 550437 510945 510299 501858 537044 613138 691147 614490 620362 742033
19633 742033 809568 842073 1049992 1135074 1062384 987460 786834 698592 775339 678669 772338
19622 772338 875942 702840 701622 797103 812951 779133 731180 691903 910062 1105567 1076096
19611 1076096 1029919 973480 1158443 1293135 1208827 1142419 1141497 1178058 1206831 1223731 1104452
19600 1104452 1084956 1178418 1218891 1236887 1195678 1049171 1051515 887971 855560 1012659 1112616
19589 1112616 1140543 1136228 1095450 1012610 1043434 1170112 1157663 1052126 978859 1025780 1060613
19578 1060613 1061501 1100999 1137327 1107424 1142644 1160810 1282512 1142568 995889 1086482 1038844
19567 1038844 1121448 1231020 1171828 1098620 1161031 1201047 1313249 1275914 1220797 1281117 1426248
19556 1426248 1476430 1517960 1519356 1700686 1675909 1676736 1699240 1661809 1549644 1533859 1684145
19545 1684145 1834671 1898284 1866122 1884363 1888855 1969825 2052894 2130814 2139822 2100594 2100482 2275446
19533 2275446 2433594 2550884 2801986 2839989 2837319 2765705 2837339 2998844 3160016 3330292
19523 3330292 3449884 3620440 3877799 4007079 4274733 4696309 5319493 6019434 6787934
19514 6787934 7444497 7815341 7988654 8279350 8921479 9377980 9656824 9803826 10053765
19505 10053765 10626371 11458991 12759305 14690615 16822902 18906005 20837493 23183608
19497 23183608 26022038 29708076 34235280 39581181 46271055 55932128 71207572 96301741
19489 96301741 137570057 203270562 295726959 388638857 447076878 466673619 458721537
19482 458721537 463882910 489749052 493830957 453650475 363203937 257818408 176960975
19475 176960975 123420597 89324362 67653685 53659998 44282209 37719907 32886040
19468 32886040 28965918 25517518 22636679 20575449 19097859 17704678 16159788 14478772
19460 14478772 12769605 11401686 10680021 10218115 9816571 9510795 9279693 9193251 9214628
19451 9214628 9434824 9603777 9554847 9336574 8829276 8304323 7989764 7696530 7256434 6668597
19441 6668597 6239699 5738479 5145184 4849342 4662163 4631057 4807276 4851373 4823412 4687962
19431 4687962 4566024 4447483 4403364 4439738 4558458 4697353 4830261 5031022 5318853 5591341
19421 5591341 5825003 6028098 6256468 6520069 6970034 7507999 7884082 8265690 8740475
19412 8740475 9500528 10466829 11806031 13719902 16410410 20506254 26759764 36036628
19404 36036628 49031381 64368886 76341052 82708748 90747307 105976601 125764655
19397 125764655 134545825 125530698 115452922 115765444 127403940 142857231 153452825
19390 153452825 157032899 152466036 140493145 129970504 127054531 123888609 112882396
19383 112882396 94113084 72740774 55210210 42758458 34168570 28395068 24323944
19376 24323944 21277880 19067944 17334009 16060112 15193420 14551282 14381427 14543416 14707071
19367 14707071 15012977 15487737 16222138 17239213 18610401 20314892 22501518 26112915
19359 26112915 31891680 40574237 52446553 65380150 72047589 71560884 72556944 79969515
19351 79969515 94606868 111062824 124746596 140096421 150136959 153059172 164950409
19344 164950409 190592197 221708228 247637411 263374418 276738633 288254592 280978829
19337 280978829 259267795 243269035 233759457 227638363 216848078 204637264 196498221
19330 196498221 181720182 160313299 133049941 107279780 91110440 85501526 88674527
19323 88674527 94201369 93380412 86613631 73641783 57741021 44701026 35579020 29594996
19315 29594996 25693506 23000169 20984061 19490162 18380692 17344122 16565205 16145308
19307 16145308 15950485 16183041 16675986 17336604 18340431 19639084 21377590 23766908 26547659
19298 26547659 29720210 34234473 41754004 54133539 73320538 101183537 135261249
19291 135261249 167216754 188756593 189075158 169833727 141794069 117480603 105319479
19284 105319479 106166548 118166897 134924001 146425895 150596802 145806021 138288616 133193367
19276 133193367 125474220 112517443 91909134 69177670 51099525 38450921 29802131
19269 29802131 23888550 19774816 16668053 14315987 12502406 11020871 9842455 8942899
19261 8942899 8200564 7788070 7301341 6959700 6657033 6328813 6098640 5793806 5308740
19252 5308740 4834281 4527988 4121037 3772275 3515967 3256593 3031834 2907820 2799885
19243 2799885 2769466 2862390 2783601 2620922 2589075 2671596 2783106 3002939 3568025 4377910
19233 4377910 5393107 6173667 6037601 5161280 4166227 3305574 2708420 2283887 2092496
19224 2092496 1945903 1742946 1555126 1271502 1213041 1324985 1390172 1358769 1345855 1357545
19214 1357545 1247493 1168094 1075106 1040161 1056713 1095982 1141059 1220251 1135248 1170297 1279584
19203 1279584 1282906 1239984 1354518 1534486 1658304 1685370 1665917 1516774 1317105 1230329
19193 1230329 1221381 1096811 885533 775034 745215 738825 722539 681425 745945 906225 989095
19182 989095 972998 834744 716761 726843 644282 635788 713757 665094 711988 794431 825273
19171 825273 905898 872987 796545 764257 761613 729785 731515 597032 588927 699500 690469 676469
19159 676469 555940 584773 547575 607736 595027 519672 585537 606532 624992 619431 631256
19148 631256 725590 689560 629380 541203 394871 500071 694664 792303 748936 592656 401256
19137 401256 275056 295424 388311 413569 446564 536331 521278 598297 679094 495164 292144
19126 292144 340457 536222 650006 677969 638059 585032 627598 639647 495807 386558 416971
19115 416971 363927 341092 412816 312016 202020 344810 383515 402930 375817 308023 209601
19104 209601 279035 348188 353734 322626 311048 330074 465280 557841 548968 541527 470266 613323
19092 613323 663088 590741 650962 674028 581062 529029 701185 783476 810281 916424 900438
19081 900438 845519 936578 912231 805439 787631 723536 535905 549115 679628 672403 577454
19070 577454 505488 533438 454882 441002 422312 447988 363825 258844 72181 87787 268847
19059 268847 227954 190859 393764 417921 343370 251905 242638 168219 186484 310008 312003
19048 312003 122881 160003 286618 297555 357591 499864 590091 543470 585980 683504 816438
19037 816438 869865 830608 936813 973074 895354 926799 918439 996458 1065243 975712 1062296
19026 1062296 1094815 1039718 980775 849062 803616 703615 564287 599854 572543 373549
19016 373549 319529 441445 429173 429424 462902 394359 292060 266584 352024 417344 462507
19005 462507 513274 565586 555885 487985 507055 467964 592488 688127 730642 726525 851988
18994 851988 806710 788311 908623 1012387 963274 783839 641852 609982 665804 684429 576484
18983 576484 459504 589920 757849 760672 750387 666826 628371 647399 553442 335052 306844
18972 306844 429844 458408 343035 383162 420713 409090 298422 268020 297830 320277 364423
18961 364423 407819 471550 591151 769929 849980 871922 1030617 1082388 1041356 997516 997039
18950 997039 1047043 1210390 1334205 1199900 1264279 1385450 1369751 1390852 1495719 1627907
18940 1627907 1844250 2060571 2324234 2533709 2602400 2664664 2677784 2569894 2675399 2627806
18930 2627806 2501801 2349652 2095473 1847962 1705335 1509637 1257946 920649 789514
18921 789514 645593 528291 486449 396715 344392 291844 340284 396703 434544 450878 375972
18910 375972 407956 467352 449007 574251 618359 683729 725237 799802 736542 621150 606027
18899 606027 761715 882200 879586 903915 1050201 1275942 1382255 1426247 1339328 1165096
18889 1165096 866695 557392 476337 331168 278320 253093 326866 331320 319978 368091 459110
18878 459110 614433 693199 654688 744764 771090 787558 841698 969999 1115179 1140868 1076085
18867 1076085 1020360 878033 811975 839104 881781 898700 830744 748604 618667 483808 408246
18856 408246 348147 325230 303543 330311 360633 377224 306305 289055 348785 332923 377798
18845 377798 477535 445386 377980 270014 204636 219120 186460 221105 278039 360197 566496
18834 566496 577509 491721 617493 662023 631588 613705 657091 693061 869841 1032037 1210315
18823 1210315 1370219 1469881 1552953 1788144 1842342 1712426 1673161 1728363 1744514 1711996 1630788
18812 1630788 1592946 1562207 1426414 1198618 1048334 898293 851349 892815 803720 674611
18802 674611 787038 965970 874425 769257 678180 651926 619636 676857 600753 448838 443939
18791 443939 457014 446672 463353 557618 514314 402978 462769 524993 593684 652480 599955
18780 599955 536219 581477 819223 923038 1008410 1076594 1109716 1121618 999305 928152 886655
18769 886655 866127 807125 752943 729967 849258 952872 1023797 1096842 1069571 1063080 1052795
18758 1052795 909595 756518 644976 627155 726361 727197 593911 437964 332075 341436 414234
18747 414234 388798 260801 280620 419093 476258 487954 472813 551674 550795 508933 354854
18736 354854 275505 263286 297004 383182 464298 560504 559607 574806 500898 407925 260303 246072
18724 246072 300732 326214 331855 391925 505336 484253 479017 397958 417783 532818 554452
18713 554452 458265 454146 495077 459311 485330 508110 442410 433707 375558 386492 356185 388810
18701 388810 409791 358066 305804 327319 349388 291220 354568 413058 437992 549433 567782
18690 567782 570538 566065 427787 301445 263730 359754 432742 552535 355767 241894 419114
18679 419114 543252 562208 605467 547448 660288 725110 572294 492293 452950 447910 419724
18668 419724 447184 536255 722217 812121 740764 584853 517299 596155 689244 661610 538310
18657 538310 571730 596966 475289 454068 582375 684660 774835 768983 719808 815269 856524
18646 856524 867956 914492 912957 920841 860677 787154 759956 713171 730235 786686 824042 816552
18634 816552 856508 876351 849804 811936 905734 991672 955857 1041260 1068637 1057886 972620
18623 972620 970018 967835 1023452 1150019 1214797 1296327 1421505 1385827 1458802 1464935 1460285 1510321
18611 1510321 1507920 1750032 2091985 2052464 1973900 1971411 2082371 2287571 2423049 2716390
18601 2716390 2820500 2884886 2872879 2990403 3110013 3251990 3421798 3544248 3796869 3933966
18591 3933966 3981911 4206880 4641789 5196902 5884343 6796738 8083512 10008734 13075143
18582 13075143 17965405 25572295 36761834 51010772 61077011 58274951 47590494
18575 47590494 37921896 32139705 30484989 33116188 40784083 54026015 71223955 81583065
18567 81583065 73320238 55463451 39996989 29177151 22190458 17660850 14832823 13155223
18559 13155223 11999748 11177233 10560186 10256612 9954127 9610413 9504685 9705915 9903245
18550 9903245 10067096 10217325 10509691 10905358 11413323 12164967 13216114 14774078 16982056
18541 16982056 19974808 24145178 30443430 39942222 54668615 77547300 110783904 151615299
18533 151615299 181149570 177009841 149412616 119469810 97256122 86158310 86374039
18526 86374039 97507910 118914373 144880879 158694751 147065051 123217871 105216499
18519 105216499 97001902 91068371 78255730 61904923 48415481 38553091 31539359
18512 31539359 26884056 23833722 22089032 21061070 19949997 19095437 18502417 17985242
18504 17985242 17521304 17205153 17326799 17771685 18653098 19870746 21756109 24078919 27066997
18495 27066997 30998867 36146456 43252415 53584657 69138277 93838415 134033104
18488 134033104 194866143 275564335 345128848 343435814 277711618 206756731 155144449
18481 155144449 123566141 108246251 106009345 116672812 143204390 189303025 255958100
18474 255958100 324080860 338834288 283379431 207306324 145811469 104050768 77501732
18467 77501732 60987058 50223604 42500191 36818961 32586365 29161593 26310231 23826819
18459 23826819 21713098 20055243 18996211 18610263 18564758 18674709 19093442 19730608 20301138
18450 20301138 20507973 20796879 21608389 23438703 26606586 31784929 39949157 52311934
18442 52311934 69887981 91157020 107421218 117076420 131401824 150829267 157252443
18435 157252443 140034057 116004607 99504911 94861296 103339529 125465743 157401899
18428 157401899 181249279 170461602 133298619 96314562 68805458 50173493 38026313
18421 38026313 30255701 25098248 21465528 18875540 16933924 15392840 14028343 12794158
18413 12794158 12020106 11421595 10923414 10373193 9856375 9596499 9642805 9762960 9883840
18404 9883840 9937713 9924249 9724616 9632369 9835648 10570058 12008365 14375621 18395609
18395 18395609 24981398 35072982 49381865 65555835 71083917 60296323 46397150
18388 46397150 36848998 32447820 32934569 38125528 47599174 56527340 54451696 42565420
18380 42565420 30598744 21793529 15799368 11930257 9448742 7891670 6866995 6078370
18372 6078370 5567230 5189482 4987471 4890433 4805124 4687564 4362039 3855687 3398457 3146193
18362 3146193 3062043 3079722 2922571 2841402 2788880 2665216 2448801 2159313 1887754 1722123
18352 1722123 1752665 1824792 1844524 1981676 1969226 1861895 1838485 1823147 1713204 1682728 1702725
18341 1702725 1557921 1382632 1380554 1403776 1384230 1335304 1369424 1550244 1580014 1470826 1235079
18330 1235079 1082085 1023136 1008143 952536 1024284 1139866 1280005 1520626 1761578 1807150
18320 1807150 1672053 1435213 1310120 1233669 1113522 953836 823960 733127 810576 810630 771500
18309 771500 812310 825749 813804 767994 806048 900333 970094 1048026 1079236 1317405 1459436
18298 1459436 1445393 1259983 1129018 961819 771086 797539 1008252 1024862 802386 789423
18288 789423 855647 802786 718798 702336 603853 570169 616494 620259 692337 856387 1038349
18277 1038349 1179448 1223803 1269630 1356983 1156592 922685 791984 684834 720607 675053
18267 675053 735682 781448 726418 742529 739151 823303 779178 708954 660249 629665 538612 564565
18255 564565 586251 633974 705841 735057 702793 588580 552710 499582 495864 459095 456685 384496
18243 384496 361486 426756 549169 663388 716227 671091 644153 681388 599776 624897 757028
18232 757028 754519 753349 700073 700868 758525 760094 733241 722928 739157 739662 785874 675881 522967
18219 522967 507086 635647 600440 515478 635887 683276 707024 693167 529812 447598 389138
18208 389138 354834 350886 431522 529042 652628 551778 627270 695969 654874 540702 514763
18197 514763 499607 497953 476206 439510 487605 585946 634572 600756 499632 538008 617914
18186 617914 587986 473951 447932 462705 518035 595598 712084 671840 552514 540721 525632
18175 525632 598346 554375 438436 425665 430100 353326 219699 283274 309548 322254 366899
18164 366899 388003 455899 456527 413288 549312 490481 335747 275688 225456 330327 344278
18153 344278 392307 481037 471010 505687 577504 474174 357616 313758 268395 195844 173699
18142 173699 286872 305832 215561 219235 316546 269186 275366 410405 519865 514691 409434
18131 409434 347591 339664 341752 269744 229800 326759 393423 310036 349662 419292 464635 412683
18119 412683 355194 385830 327861 399568 430986 457864 470904 386537 275343 322630 378944
18108 378944 366395 385418 341417 370994 454999 353028 196996 220908 268032 239364 185195
18097 185195 237366 173426 206027 238898 248357 283270 254170 210920 163358 235945 330997 496645
18085 496645 570530 322398 152939 146670 287402 300362 224485 229725 263248 80225 86793
18074 86793 49256 173681 309445 350202 328289 320131 233361 245512 295153 423940 594389
18063 594389 614580 526475 494635 500603 564388 535745 576545 624450 644523 662833 761633 660140
18051 660140 597957 721828 670337 579383 575851 673656 681248 623789 537742 460660 396865 402114
18039 402114 461992 371790 478785 424446 291839 269434 283783 240133 231362 330380 389757
18028 389757 311974 228658 219804 251971 317917 390245 353863 361338 339001 367990 407249 361939
18016 361939 315789 418080 548850 599109 598653 648348 677967 623098 705664 902960 1014520
18005 1014520 988348 1079734 1130212 1071844 1052969 1087806 1058749 784697 643413 586394 520684
17994 520684 423307 383934 418888 370589 348075 413048 340370 178833 159629 239626 305590
17983 305590 294045 418294 490341 518983 585961 688577 600449 557704 664304 602992 645088
17972 645088 756755 780304 807149 764071 660135 575243 475097 454685 445842 416354 478908
17961 478908 594136 722140 704953 689906 679740 628161 682102 799261 754352 711862 677259
17950 677259 674758 537506 440999 338032 456535 538612 472725 424990 389453 422726 434789
17939 434789 428600 435820 597173 625272 602290 711101 805138 906513 869069 811583 794609
17928 794609 911739 1055184 1074180 1003491 1008191 960038 814309 799111 859729 805609 602817
17917 602817 576054 592716 484549 383578 312799 296676 417792 543857 548164 442464 385922
17906 385922 351089 362161 358567 344820 314525 308230 286968 164040 163266 190527 203181 139194
17894 139194 177764 237905 327480 270975 227128 269188 348600 371191 237606 188629 232104
17883 232104 366228 526046 603829 601405 515345 441312 386131 372712 394643 392240 286666
17872 286666 184648 112449 99968 27658 -25834 -2674 98675 180688 182856 172801 130473
17861 130473 116216 79717 25867 74219 56666 578 20651 49210 24307 84250 133844
17850 133844 71866 100562 123984 128723 180237 288428 344296 264904 217477 215340 82191
17839 82191 204366 267564 232793 114683 14671 -16789 -18670 3641 50470 71224 51922
17828 51922 18246 32736 147385 122407 131929 -9556 -31029 -126443 -276806 -168633 -43935
17817 -43935 74111 29491 -27917 43737 151854 156609 151095 211182 148580 74650 77083 38275
17805 38275 37545 -646 -80824 -106830 -81463 -3781 3132 -66099 16592 -24014 -62322 -90936
17793 -90936 12114 64762 13926 80505 159903 123936 67597 142645 130318 139052 59528 183014
17781 183014 108341 60256 128663 137120 105515 18502 31356 -15654 9163 -55702 -35426 -1558
17769 -1558 124100 50632 -6288 -27888 6251 -36601 -17275 36182 21858 -50857 -150823 -213022
17757 -213022 -202327 -242810 -212665 -194871 -212852 -147474 -89936 19917 8007 51904 104436
17746 104436 88210 47674 95926 34377 -55490 81078 181353 110110 52282 63922 -1244
17735 -1244 9854 98948 54997 82334 69485 65375 84944 114656 38597 -53168 -45537 -98836
17723 -98836 -164867 -139197 -107065 -103568 -70770 -78038 -110431 -107519 -9723 35517 104033 7702
17711 7702 -50265 -104332 -115220 -65198 12861 38013 4802 -61132 15512 199577 257504 259703
17699 259703 199389 86173 -11002 -91234 -60593 -109329 -118846 6321 102979 -21395 -133358
17688 -133358 -109879 -87476 46773 133184 35460 -18482 -83082 -98326 -62209 -95114 -141317
17677 -141317 -196161 -83270 17412 -85690 -87074 -27426 51958 200358 277662 304733 169879
17666 169879 16304 -99502 -164976 -105673 -31745 -111989 -45309 -68389 -84424 -35011 -65770
17655 -65770 -64633 -5049 -654 -14239 -50270 -23014 82660 209788 178864 63797 -88462
17644 -88462 -84564 11140 23604 14340 92735 117851 155647 106133 -31966 59790 135293 99647
17632 99647 154922 61328 60513 59099 19371 -10975 -64242 -91994 -104268 -68192 50957 91513
17620 91513 131075 187894 77222 -49300 -8193 116760 194570 107589 152406 155100 195093
17609 195093 96343 43708 20973 76270 68057 47796 -31599 11265 65766 78934 34812 -53851
17597 -53851 -78759 -59011 -166939 -165515 -118946 -21027 91934 6338 -33360 -155905 -247790
17586 -247790 -86962 -23279 28378 11605 47547 70048 141280 31278 -41705 -53530 -23185
17575 -23185 38330 -42920 9066 23410 12318 -29756 -17051 -42910 -126060 -163164 -242534 -289749
17563 -289749 -250842 -194280 -187637 -118160 -126828 -129644 -63435 -48814 -169955 -118607 -73813 -52805
17551 -52805 49106 161785 116351 47469 -134396 -185537 -166776 -76172 -8164 -54616 -166419
17540 -166419 -177519 -72728 3922 -32301 -112620 -115958 11521 91514 195745 255431 291849
17529 291849 163211 83753 135253 189740 183252 168032 158633 132024 71662 8231 -112107
17518 -112107 -201358 -169315 -127896 -152627 -108811 -128091 -145950 -145956 -111109 -54380 -7716 -18668
17506 -18668 -10948 41880 -22864 -111801 -172812 -188860 -125371 50781 84568 -33760 -118814
17495 -118814 -11466 89333 52435 49037 -25097 -180380 -293760 -236750 -142548 -142170 -64061
17484 -64061 27667 2549 4537 40297 44832 147251 125942 3309 25247 114690 173852 96090
17472 96090 -59398 -239288 -241453 -198878 -137761 -96320 -176493 -173057 -155770 -182296 -92698 -68176
17460 -68176 78130 84805 28499 75570 93644 6298 48765 27724 7399 -115427 -151618
17449 -151618 -75033 -178876 -184201 -18642 62526 26947 -35370 -77775 17587 111168 16311
17438 16311 -53476 -37122 -12890 36067 51098 -15362 -94971 -102710 -52280 -61945 -67330 -78422
17426 -78422 -87404 -138998 -187017 -187202 -74374 -31050 -44131 -64363 -66026 -181513 -213265 -130221
17414 -130221 -87487 -14827 10510 8598 64905 109957 92432 84909 -37790 -41205 -48799 -139183
17402 -139183 -162328 -145429 -103190 -136480 -202560 -76338 58151 -21286 -68451 65462 139403
17391 139403 96549 91800 133594 80646 -98740 -141540 -82111 -53920 -1299 -8861 -160395
17380 -160395 -202618 -151153 -218181 -206000 -117399 -49430 -68435 -72350 -74584 -82818 -84107 -169051
17368 -169051 -144396 -104949 -21431 55257 6900 -124421 -226386 -272820 -207643 -137284 -107183
17357 -107183 -86575 -89933 -200753 -224581 -73090 -81816 -76523 -67446 22499 81546 112972 140623
17345 140623 155263 8471 -72604 -108192 -96521 -159689 -190972 -123285 -84012 32301 30078
17334 30078 -50212 -156655 -137840 33265 182118 245229 77014 -142647 -138993 -133435 -193869
17323 -193869 -130745 -181117 -75967 95848 115283 -40990 -105612 -148737 -127735 -159252 -124929
17312 -124929 -103480 -52368 17721 106095 198135 251688 110024 146466 196902 58462 -3887
17301 -3887 -28753 -72691 45390 98853 17910 6962 21850 56945 139330 182224 102676 -48490
17289 -48490 -154263 -116554 -18420 76435 28029 -55373 -84846 -166438 -275812 -200998 -201705 -165691
17277 -165691 -16755 56053 -2200 -83706 -131251 77 29703 -28473 98200 209220 131442
17266 131442 138145 76263 57735 77037 18096 -26591 -35489 -100609 -117410 38337 118700 64726
17254 64726 -96420 -187694 -171187 -268089 -332019 -312473 -98391 1425 -74645 -167935 -185947
17243 -185947 -127733 -91599 -51314 24674 28150 41171 47437 -46798 -251261 -268989 -265420 -227837
17231 -227837 -209755 -123784 101918 107900 -30280 -124165 -115443 -91456 -113673 -111690 -134435 -100498
17219 -100498 -101876 -48172 7998 78623 20709 -19525 -124127 -94173 -35738 -85912 -118120
17208 -118120 -142666 -212992 -138329 -84496 -75790 -70314 -118188 -52499 114401 205378 106591 3373
17196 3373 60998 90542 -10733 -23346 37111 1025 -17894 -3266 9744 -21831 -13597 -130958
17184 -130958 -167144 1651 72228 107779 157261 138074 106332 196320 149526 -2613 41486
17173 41486 148512 147082 83834 38282 -43763 -115637 -253819 -208616 -178718 -16637 102943
17162 102943 156481 155221 -10863 -8409 27461 -11530 -40541 -58338 -132244 -145514 -129208 -93814
17150 -93814 -136733 -153351 -114779 -25421 -59635 -86364 -13255 -10663 -52903 -144537 -220108 -225689
17138 -225689 -71762 -155736 -150943 -116384 -57127 -6142 -20496 -31856 -10766 30861 96165
17127 96165 47047 42614 63636 83677 97028 20149 35942 94810 10281 26354 240072 206219
17115 206219 170893 122399 120439 55825 8913 -36250 -164751 -140445 -11004 14244 58771
17104 58771 -15066 -93968 -223708 -226070 -211298 -131849 -107528 -139719 -62675 14750 32527 82127
17092 82127 133742 101847 57345 -22073 -23393 13307 158052 73661 -23199 -32329 -54385 15856
17080 15856 -138127 -91730 15680 47274 6179 84754 -37369 -192555 -178830 -75098 1931
17069 1931 50738 -112359 -166182 -129964 -190692 -242005 -192803 -155412 -81167 -91159 -168576 -207260
17057 -207260 -185721 -41222 -39679 -181318 -189130 -206933 -74389 -108917 -150007 -200158 -195349
17046 -195349 -211564 -327563 -226516 -194576 -215196 -179558 -57921 -10742 -67715 57004 87260
17035 87260 -64023 -171711 -151014 -52818 18383 53287 51233 -29896 -24120 -74278 -121659 -15091
17023 -15091 -41773 -89837 6507 151567 155171 107931 40689 61688 73624 87252 181534 200282
17011 200282 205307 172376 116920 133114 7356 -99869 -74377 -47476 -73034 -49513 5600
17000 5600 4913 -87149 -110693 -155045 -243346 -306665 -297858 -218269 -245491 -285010 -166475 -180089
16988 -180089 -270922 -251635 -171757 -157712 -125482 -32481 -40692 -162829 -107490 -105198 -104467 -3062
16976 -3062 90850 83303 3255 -57454 -123558 -118369 -44933 16707 -45428 -10056 56011 69962
16964 69962 58898 -33011 498 -13224 16242 -31075 -112774 -73260 2326 -20143 29597 -2518
16952 -2518 101 80823 22508 -90916 -180096 -147883 -121571 -209824 -278576 -136933 -59150 -4103
16940 -4103 62709 77729 -2317 -112921 -163534 -145797 -210177 -154844 -23750 -13427 -105320
16929 -105320 -55757 -59283 -154770 -219387 -204283 -154369 -153086 -65202 -63044 21946 98906 -2323
16917 -2323 -122742 -147591 -95583 -41454 9401 -21081 -34733 70688 102207 187960 218250
16906 218250 111057 3602 -18652 -3217 30679 105412 32807 13885 82409 14570 -32553
16895 -32553 -25236 62293 56417 96750 36252 6921 -1872 76489 55349 -28727 -61369 -76900
16883 -76900 -142863 -223828 -152035 -137146 -198435 -229829 -288195 -194436 -68125 -5574 38572
16872 38572 52265 -56658 -185357 5822 203972 128912 34949 -23333 -99200 -48015 82260
16861 82260 162020 165063 130978 110520 100370 -42969 -218499 -292633 -179039 -115610 -198086
16850 -198086 -187432 -61960 9639 65977 19625 -79011 -123853 -127150 -139769 -153267 -183556
16839 -183556 -158505 -141566 -122178 6606 23289 38568 114421 58725 -83292 -146867 -52370
16828 -52370 -45901 -18443 -67132 -136957 -191107 -242878 -233501 -247460 -188331 -3107 34630 14971
16816 14971 10801 4018 63188 12627 -30899 -52570 -109198 -114218 -70147 -105897 -127825 -75981
16804 -75981 75396 88455 27074 84781 171162 146697 174696 175953 173216 116078 127005 72267
16792 72267 -66120 -161799 -87102 -6642 -69099 -86597 -48550 -120803 -240934 -169597 3735
16781 3735 112112 67113 -51855 -67827 -58438 -12666 -64279 -49205 -112802 -105630 -137290 -208908
16769 -208908 -198226 -80768 3589 -7830 -12862 -70354 -86205 -107686 -110654 -140488 -206795 -161984
16757 -161984 61314 -46608 -192129 -106647 29288 -29748 -122844 -99201 -85003 -84704 -12406
16746 -12406 321 72035 22744 59622 100721 37679 -207428 -300120 -211320 -114946 -123130 -72900
16734 -72900 -22899 -97176 -133969 -132907 -152562 -177457 -222421 -84400 -8260 18713 -39388 -146994
16722 -146994 -166418 -120044 -157737 -105789 -41392 -33039 10704 19175 -67308 -50340 8246 36088
16710 36088 -83954 -167514 -120549 -120938 -60150 16698 137410 138501 10131 -45089 -52229 -77244
16698 -77244 -190692 -186099 -131385 -165003 -214961 -158231 -167245 -202947 -143284 -159152 -301026 -262440
16686 -262440 -241841 -210771 -133898 -194563 -146831 -99755 -40241 -36211 -16881 50534 -2444 -103064
16674 -103064 -145052 -112050 -183577 -192883 -103332 -59788 37405 -117500 -188376 -280416 -313960
16663 -313960 -65466 105783 136496 124705 -53190 -84317 -13718 -10310 -122801 -27996 -50582
16652 -50582 -118383 -62260 -31514 42777 38575 13383 97511 81274 41802 91975 46210 -15363
16640 -15363 50831 48909 -37765 7895 62058 5573 114289 46861 -25036 -24397 -116787 -135620
16628 -135620 -75036 -95873 -177175 -132216 29400 24146 16399 5649 55562 57976 13669 -21394
16616 -21394 -51769 -73107 -128533 -19641 -52286 -146594 -174798 -166197 -164545 -155872 -84574 -74740
16604 -74740 -20941 -20976 -19471 -19217 -144245 -124588 -18529 19912 -40286 -169779 -132692 -205494
16592 -205494 -173881 -108393 -92799 -135518 -56492 18499 53122 -407 -76801 -34364 -22358
16581 -22358 -41254 -95781 -74120 -131807 -198773 -221189 -218947 -87613 53133 129703 84008
16570 84008 76053 32011 27498 14438 -112281 -189485 -266096 -212278 -177782 -230768 -183085 -144392
16558 -144392 -90908 -2584 -11536 -92400 -135209 -38453 35270 -65883 -90186 -56567 -82040
16547 -82040 -78560 -104020 -188341 -146726 -88391 -53310 -55391 2586 -78040 -201017 -347027 -395892
16535 -395892 -319280 -165965 -144840 -150322 -233416 -253457 -208779 -132538 -45298 -72020 -36147
16524 -36147 22224 -50085 -166393 -249839 -270178 -292967 -286344 -216896 -82473 8899 60925
16513 60925 -35537 -62940 56430 18642 -22030 -35911 -12549 -56866 -178237 -112565 -78967
16502 -78967 -42091 13403 -164955 -134950 -226108 -198298 -53093 -7550 -122781 -165200 -116894
16491 -116894 -77464 -73628 -134614 -198000 -186156 -317993 -244265 -195660 -159270 -8231 7460
16480 7460 20981 25563 17571 65061 196028 116368 52212 -106185 -119250 -142366 -158521 -63413
16468 -63413 -15631 -10078 -143291 -149166 -127684 -61152 -100502 -67809 1024 56209 57213 -39742
16456 -39742 -58499 -58814 -66472 -132623 -144505 -140675 -135628 -106643 -120933 -102284 -184272 -207314 -204819
16443 -204819 -219663 -267081 -215035 -133642 -137697 11218 72809 85299 -27378 -83457 -94917
16432 -94917 -41084 -6163 66107 48703 33215 -85034 -105590 -179604 -167519 -166542 -70798 -69835
16420 -69835 -143997 -93195 16562 -44375 2127 79887 48582 -34725 -179661 -285811 -204559
16409 -204559 -103527 -65681 -12042 30816 19532 -72400 -98778 -34052 35616 -36326 -156252
16398 -156252 -170245 -159107 -187385 -47312 69889 84188 25678 -78894 -41281 -33216 -40038
16387 -40038 -26783 3352 51934 25462 20487 5203 1312 67183 -24233 -125362 -174008 -79730
16375 -79730 -116005 -19502 20852 -73314 -135185 -63729 -36732 -18297 17621 -299 -149094
16364 -149094 -144729 -203324 -232335 -126273 -6151 -47471 -28631 -147678 -286310 -321107 -232788
16353 -232788 -168060 -113360 -79962 -174456 -161367 -211539 -190992 -220235 -104856 -140943 -248713
16342 -248713 -269974 -161485 -69348 -81802 -52993 -23894 -54354 -91022 -60005 -1383 58971
16331 58971 -17862 -35403 83124 127571 80834 19986 -75507 -73194 -51159 -109426 -111200 -61351
16319 -61351 -27590 -115513 -156868 -199049 -188626 83173 320991 351289 269505 184229 138766
16308 138766 177280 191962 126853 27107 -23485 -117865 -217753 -153071 -100743 -138303 -135612 -81901
16296 -81901 -53779 -40471 -29507 -64670 -59788 -71444 -96213 -8240 127781 114091 36175 -22205
16284 -22205 22793 76684 -36932 -92855 23265 -8200 -70980 25976 114248 145474 40593
16273 40593 43424 -63260 -188989 -151827 -152479 -98809 -47086 -81086 -78078 -87094 -62339 -12024
16261 -12024 -24236 -20724 -33711 -136540 40306 142748 122135 69974 34171 73163 -45913
16250 -45913 -179015 -178892 -91438 -20979 22105 94968 110702 17350 12466 3046 3770 -66475 -162040
16237 -162040 -229790 -165977 -70996 -77936 -63642 -36331 -34364 -148583 -173529 -154377 45496
16226 45496 187765 197323 177172 51585 -40524 -78773 -92963 -118676 -27718 74692 107182
16215 107182 136789 6451 -66477 -89699 -95132 -106239 -51629 -47636 -14163 8505 134295
16204 134295 109591 111 -3582 7557 32919 -1498 -21745 -40127 -50527 -104728 -148864
16193 -148864 -207853 -120969 -44445 -143646 -148769 -171822 -113886 -17475 -19817 -105593 -142412 -28834
16181 -28834 -131761 -235988 -159376 42402 68523 -89983 -92153 -65846 -34109 -12522 16804
16170 16804 70470 -39047 -106287 -80202 51706 172033 217596 225904 77271 -8058 -173891
16159 -173891 -211146 -258864 -297757 -132741 -13636 -8044 -2402 -143662 20537 64957 106760
16148 106760 148790 118188 52834 41328 -59797 -106827 -234747 -249073 -174899 -110270 -81210
16137 -81210 -21862 46100 -8302 -87919 -177048 -282076 -263994 -250040 -211908 -178638 -157342
16126 -157342 -144564 -199855 -248432 -224239 -297078 -281208 -216072 -216277 -134766 -38689 -1847 -92139
16114 -92139 -100120 -54466 -23878 -35774 -114619 -194529 -150386 39281 55604 -68199 -9084
16103 -9084 5862 25017 23526 -183110 -319305 -331838 -274320 -160186 -32888 30183 75942
16092 75942 132606 50212 -10647 -14520 -52577 -81531 4248 22440 16295 -70156 -153221 -117436
16080 -117436 -160834 -194762 -224235 -212233 -225707 -156171 -137469 -109772 -10683 153490 219210
16069 219210 81766 -94872 -123400 -150271 -141414 -69452 -61517 -104267 -208246 -203074 -141272
16058 -141272 -186149 -163627 -161466 -151321 -113909 -171935 -166377 -234858 -148354 -174193 -150388 -42809
16046 -42809 -924 59600 50795 -25041 -47577 -14895 3421 -10772 -58608 -52417 10020 23018
16034 23018 -21979 -36559 -21692 -49689 -181963 -195459 -105985 -155531 -241141 -240148 -178543 -200686
16022 -200686 -252080 -291490 -275331 -216395 -225840 -181298 -143427 -148624 -55819 -20307 -39332 -154853
16010 -154853 -133920 -35404 36726 752 18198 103578 34178 13327 -33957 -119491 -244796
15999 -244796 -168221 -157865 -145101 -166114 -257221 -319167 -331110 -247591 -182637 -325766 -239584
15988 -239584 -229472 -116697 -112186 -218994 -256854 -131185 -14016 614 -37387 34727 50703
15977 50703 109893 51389 9146 45528 20425 50864 34210 45546 47366 7067 -78344 -89406
15965 -89406 -23494 16910 -26448 -37755 7932 -29406 -172429 -201782 -69964 -59689 -159892
15954 -159892 -121156 -27544 -6826 -120450 -268624 -289039 -204278 -87207 -75444 -44927 9152
15943 9152 24923 18797 14707 -106655 -149218 -141793 -111501 17981 37881 56639 49876 22951
15931 22951 24174 118103 132341 85231 49300 90313 7389 -137557 -253575 -425256 -407604
15920 -407604 -317411 -156731 -74528 90254 143681 18009 -569 31295 83875 -45747 -114708
15909 -114708 -76907 -57157 -12795 3275 32254 -48671 -164953 -181669 -251818 -277900 -263771
15898 -263771 -234574 -224160 -203652 -125650 -85099 21234 105861 134155 34382 -87982 -162373
15887 -162373 -197522 -93106 -71438 -112678 -46853 -83704 -145057 -51115 4904 60215 53684
15876 53684 -57009 -179771 -165887 -45211 29641 -7022 -199500 -168116 -112124 -164002 -214854
15865 -214854 -79546 48733 148423 138934 121094 71677 88308 84021 127530 144938 103022
15854 103022 13729 42632 66898 111476 72719 34676 71580 9977 -122089 -66836 -111962
15843 -111962 -150033 -154072 -262226 -218821 -54792 69627 95630 65425 1350 -84844 -100663
15832 -100663 -79471 24774 -50555 -41977 -94518 -14537 -2296 -162366 -296338 -272419 -180122
15821 -180122 -162262 -148054 -80796 -111927 -164637 -72230 -62063 -161904 -190434 -105285 -72518
15810 -72518 9123 53599 -25186 16962 73976 -38529 79501 137880 53936 -18200 -36932
15799 -36932 -38857 5487 481 66118 56986 -49508 -49987 25786 79962 -58138 -53815 60491
15787 60491 100573 50302 62347 39191 16718 -20896 46574 111206 50287 34061 145712
15776 145712 147064 59349 2201 65234 32956 40662 6156 1478 -1732 -122374 -299813 -366151
15764 -366151 -228752 -62738 -18976 -17195 -6425 -87534 -5773 35465 31470 -63375 -171145
15753 -171145 -284220 -200213 -81924 -171363 -51497 -147963 -325553 -331264 -245780 -252515 -155883
15742 -155883 -9016 53295 89054 210759 306579 160668 -10503 -22584 -56361 -98303 -48347
15731 -48347 -70770 -33534 -33417 -26417 -87089 -137680 -91474 -91638 -173820 -200390 -216702 -188125 -131258
15718 -131258 -149661 -107865 -151416 -198831 -138484 -176355 -156712 -147540 -153861 -104161 13672 133417
15706 133417 146083 -27052 -66179 -8452 65566 -18809 -102070 -142478 -94109 -130777 -170177
15695 -170177 -155329 -157710 -59359 -42072 -41065 8463 -98268 -60349 -70076 -71012 -89414 -116119
15683 -116119 -169500 -126185 -46208 -108445 -134686 -27699 50436 7194 -45144 26383 33387
15672 33387 53402 -44303 -43800 -79911 -90392 -59975 -56590 -58667 -39148 -33094 -60225 -47588 -100654
15659 -100654 -4972 110202 174456 77897 -20551 27902 57812 59260 -48350 -42810 -59343
15648 -59343 -50435 28784 -3256 -103862 -146535 -74358 -20365 -10675 -128090 -46565 113390
15637 113390 132112 126180 87274 63267 57036 11247 2177 21448 -122150 -205967 -167333 -223516
15625 -223516 -207143 -182597 -33495 -50896 -144896 -160095 -64201 -144195 -135630 -50124 -68437
15614 -68437 -76471 -15131 108587 68858 92820 153102 83806 7641 2439 27233 -27098 11091
15602 11091 37000 85524 39979 -14825 -26560 10374 24054 -55629 -7216 49947 44129 32012
15590 32012 -36739 -28853 -4016 -25299 -66538 -61561 -34900 -77179 -58128 -78148 -54806 -42058
15578 -42058 -65638 90951 125101 -4572 41770 63816 -26970 -21831 -75857 -129261 16295
15567 16295 54396 -30280 -67610 14320 24406 41095 140602 92209 133930 185742 92167 11934
15555 11934 -81197 -162982 -182453 -173722 -165915 -65494 -156758 -185875 2661 24444 73 -49379
15543 -49379 -175992 -237022 -150408 8863 79454 87294 60804 81239 200827 174134 127611
15532 127611 32896 90634 162146 52394 -11751 -42552 -107617 -184553 -156247 -68394 22593
15521 22593 49059 112894 41799 32671 -38140 -63644 -111556 -31629 -90709 -211328 -97337
15510 -97337 48430 20703 31241 2805 -24862 -74454 -137832 -140115 -118372 -217730 -353994
15499 -353994 -336527 -366114 -287092 -151634 -141042 -216271 -187798 -89657 40280 140086 -13643
15488 -13643 -78930 -91897 -72141 40402 -88499 -149463 -10145 -18949 -99893 -105308 -123880
15477 -123880 -68157 -75188 -123397 -40123 -53186 -88630 -154858 -60897 -84359 -44097 73264
15466 73264 152519 148589 98809 -29061 -67295 71388 193800 143866 -44914 -151292 -159619
15455 -159619 -84076 24693 -16963 -42486 -151600 -133605 -3813 10652 52490 174274 230962
15444 230962 198562 179717 155684 36078 -12331 3137 53013 90204 134826 -27749 -60660
15433 -60660 44451 78783 -24932 12597 5218 5630 -49534 -76188 -41187 47454 88132 93863
15421 93863 -43244 -50321 -63485 -179378 -246346 -142662 -23462 -219036 -282327 -245056 -177541
15410 -177541 -144895 -115278 -58425 -28771 -58303 -86452 -113747 -85673 -91459 -135442 -198507 -142577
15398 -142577 1860 -26752 -123604 -46439 -94925 -131017 -126242 -73946 -107362 -61227 -4204
15387 -4204 62236 73965 44220 81387 -7168 -99173 -175358 -187393 -174007 -135257 17670 2514
15375 2514 -114839 -151163 -156082 -178501 -97627 -9287 -87491 -38078 -95460 -89867 -134724 -53145
15363 -53145 -30192 -6293 -55527 13208 -36087 -34008 -113382 -113865 -64425 -31712 -90822 -61818
15351 -61818 -127295 -153577 -121228 -82285 -151123 -181984 -76447 98950 75266 17404 38106
15340 38106 82416 26714 47650 -22124 46648 109952 36669 73960 102299 -106731 -149869
15329 -149869 -116497 11268 43113 -12699 26689 125848 81534 -39597 -172684 -210524 -172894
15318 -172894 -127970 -95049 -97771 -73283 -8385 -90490 -116620 -85799 -107037 -172594 -154080 -89656
15306 -89656 -76418 -49942 30553 61227 43017 33268 -64628 79649 205285 123802 22336
15295 22336 -123967 -165449 -105201 -49604 -29794 49962 99202 85744 22946 98193 83617
15284 83617 -48825 -105075 -84452 -105997 -152925 -80742 23931 -2604 62007 45358 72499
15273 72499 -24061 -101541 -139500 -109491 5275 -111808 -154060 -170814 -189834 -106972 -50312
15262 -50312 76227 183949 141725 159684 99678 112327 161495 158235 169660 99180 162773
15251 162773 213125 66400 35658 5960 18812 -40691 -118167 -120039 -156844 -149102 65604
15240 65604 154966 25211 -34296 -84008 -121689 -233521 -201521 -146390 -32109 93943 17166
15229 17166 -141421 -102555 -52580 49377 32335 51603 80405 -14036 -100711 -67283 -43001
15218 -43001 -34154 -72278 -141328 -126100 -132325 -146210 -142232 -120577 -147476 -1033 49560 -36944
15206 -36944 -8982 -41867 -132035 -150514 -12862 -6191 37851 117184 -7215 1945 31321 -67328
15194 -67328 -244807 -182385 -128595 -80267 -85994 -52888 -154250 -148058 -177372 -198129 -193077 -159865
15182 -159865 -110087 -86485 -58441 49307 130141 59390 -115181 -129178 -73431 -3422 -49626
15171 -49626 -86248 -122492 -199210 -287947 -206498 -87726 -62850 -116146 -191516 -167715 -74749
15160 -74749 -20067 -91623 -158231 -148563 -2037 65577 54434 73555 -64925 -109694 16728
15149 16728 42419 -11224 -113530 -110435 -51970 -122852 -118931 -107524 -123156 -154694 -165618 -161007
15137 -161007 -206439 -182354 -190642 -182648 -7241 -5363 -30663 -120010 -220055 -247200 -263649 -167221
15125 -167221 -125502 -130572 -53240 70510 49218 49230 -105091 -235083 -155568 -122717 -124680 -167924
15113 -167924 -59833 -57614 -1499 50582 38982 -36792 -125016 -180983 -128202 -195779 -218854
15102 -218854 -127091 -118882 -180846 -201998 -166440 -124619 -94791 -111165 -101324 -215770 -352534
15091 -352534 -307481 -128429 12118 129481 62833 -112831 -118125 -57194 -60112 -86322 41954
15080 41954 70980 96336 40486 51104 150781 46063 65285 77663 -52223 -71275 -112642
15069 -112642 -189193 -141971 -36860 22330 117110 102015 94316 -28274 -72089 -75585 -1913
15058 -1913 87923 164580 41522 15141 48365 3713 11669 35601 81566 18973 18901 127325
15046 127325 145869 145147 88738 53606 26952 -8848 -29986 21892 -20669 -38263 5958 -24170
15034 -24170 73987 146156 66458 3725 -71427 -110649 -56678 86645 113576 57975 11048
15023 11048 72056 194594 206354 194205 86084 -36779 -68354 -103099 -114334 -57002 11629
15012 11629 -126874 -218106 -140163 -234060 -257351 -228818 -167053 -137524 -128588 -172875 -235653 -139101
15000 -139101 -38769 46102 -78720 -24010 -38640 -99663 -95254 13162 -14496 -26095 20921
14989 20921 -12143 -11467 28836 -52979 -137055 -252280 -169215 -183871 -202846 -198094 -166960 -134084
14977 -134084 -214264 -226090 -142026 -55915 29507 59087 -13071 -124653 -13659 120724 79879
14966 79879 67298 86971 25399 -28967 57208 49538 25921 -29433 -91933 -163445 -200047 -224982
14954 -224982 -16857 -31787 -35353 28873 64925 145611 21167 -30000 -49301 -112308 -171286
14943 -171286 -250465 -296053 -206365 -218994 -247538 -186581 -229878 -256908 -73745 81766 34367
14932 34367 12914 -73875 -134811 703 30138 25691 -49544 -3894 21196 -93669 -148945
14921 -148945 -242117 -233084 -266398 -193005 -147328 -44129 72295 -54022 -104195 -76704 -64869
14910 -64869 -43784 -33964 -22727 52151 223953 176211 -43318 -101594 -9708 23342 -70536
14899 -70536 -149370 -89210 -122551 -102915 51496 37711 -38893 -137893 -216571 -339954 -322405
14888 -322405 -223573 -167789 -40871 31931 -44657 -71088 -63410 -111702 -95276 -130313 -85561
14877 -85561 -143014 -207670 -172568 -135336 -196651 -119686 -45298 -69062 21478 51402 -22666 -131774
14865 -131774 -194624 -173859 61964 55769 -43482 -192415 -224715 -247608 -245593 -216185 -154707
14854 -154707 -89159 27910 -4258 -176893 -260342 -322590 -256925 -168668 -152364 -112945 -101937
14843 -101937 -119574 -128311 -208750 -160740 -181213 -134504 -4750 27162 52198 71924 -68298
14832 -68298 -134160 -39477 50602 170366 180423 117036 209541 159946 55006 -18065 54656
14821 54656 69586 110512 54361 -17927 18843 82113 83670 -41540 -77133 -26555 106744
14810 106744 10044 -167548 -285314 -180314 -128339 -101269 -108538 -110922 -61861 -58202 -62522 28048
14798 28048 -71612 -57112 -103141 -54582 51428 207459 75838 -7722 27924 62190 8361
14787 8361 -42534 55036 -48379 -75814 -11138 24421 -50970 -68748 -65440 -73509 -135753 -56980
14775 -56980 -139187 -140564 -98241 -242382 -373972 -318070 -253109 -88677 117038 171970 84769
14764 84769 25103 27681 -1046 2805 51422 67267 55949 -11704 -43852 -133513 -242645 -149413
14752 -149413 -63679 128084 71161 18675 -93646 -243807 -179439 -176171 -252400 -194730 -134351
14741 -134351 -43112 2033 14515 -82567 -280152 -177735 -155505 -208764 -163548 -80005 -13478
14730 -13478 -23769 38568 196614 277609 190788 82804 22865 -123253 -254180 -197532 -308424
14719 -308424 -293245 -221261 -166755 -132294 -135781 -86944 -19311 -136804 -205903 -168186 -258566
14708 -258566 -295182 -291754 -210136 -62064 44780 95537 167141 57287 24392 47866 -69781
14697 -69781 -153338 -167257 -19612 2383 -189031 -95056 -39264 18188 68632 64814 -22117
14686 -22117 -105451 -122928 -151217 -179886 -111207 -212546 -209459 -69755 -22448 -11917 -68705
14675 -68705 -70041 43459 32616 42756 -50939 -99946 -87709 -71332 -105204 -118815 -72264 68398
14663 68398 190340 78827 23410 65654 17762 14407 87412 36248 -80608 -106028 -107801
14652 -107801 18829 82231 46201 40761 50961 63915 146634 281261 244423 93351 -62660
14641 -62660 -166879 -167623 -160339 -116033 -68089 44980 93509 34542 82801 134019 171310 128793
14629 128793 19202 25015 -75589 -121943 -88514 -14521 57137 10040 -68842 -124366 -228341
14618 -228341 -164492 -137343 -46131 -43316 -64347 43219 -10970 63246 44672 75298 87498
14607 87498 11866 -151840 -146967 -176437 -181857 -123555 -117836 -18001 110248 12922 -8150 61603
14595 61603 78077 -59838 -95996 11084 74359 -55731 -141882 -9290 96102 135119 103924
14584 103924 149859 154710 105293 110886 73384 102723 180749 166888 201971 258773 204136 30795
14572 30795 -27040 -62199 8164 -6321 13752 108832 81835 67156 54388 82955 136296 149754
14560 149754 58693 -96162 -262565 -131632 20267 -29135 -52067 -84091 -52767 -18399 41076
14549 41076 -37057 -132837 -129651 -13229 -77360 -56465 -4102 -16840 -65372 -40041 -91881 -116763
14537 -116763 70203 73967 25670 85568 31802 -197871 -171408 -15393 66050 206402 144893
14526 144893 89738 98226 74678 121829 -16800 -20630 -13464 81886 92681 -1496 -53641 15948
14514 15948 -44520 -235 15831 5301 -38118 -35192 -64278 36506 83985 24879 -151319
14503 -151319 -207386 -99876 83203 83975 243354 275462 182035 58718 78143 136122 122311
14492 122311 24601 21727 35820 -103551 -71788 20318 -57410 -85454 -18634 30593 77933
14481 77933 63443 -79512 -169952 -143632 -13124 95559 17842 -71063 -40241 -14002 -103419
14470 -103419 -71136 -27826 -4440 -56842 -39033 -43711 -98892 -196307 -124959 -159972 -197987 -91868
14458 -91868 -167185 -191950 -132418 21688 -2557 -72700 -98443 -145691 -137644 -89114 58897
14447 58897 81182 -75230 -225458 -190599 -168173 -254877 -236146 -132091 -66524 -187503 -171781
14436 -171781 -148732 -142697 -268063 -246548 -152410 -124166 -62564 -88580 -30097 412 34726
14425 34726 16915 53229 51604 -18329 -103288 -195067 -155572 -28004 55431 153722 34330
14414 34330 29193 67880 78935 61552 101174 71886 61899 -41643 -10542 -56339 -113857 -25582
14402 -25582 -69049 -178003 -151493 -77289 -59354 -130820 -116300 -17757 93567 60776 200441
14391 200441 198678 68298 19257 106590 186964 63614 -66952 -90981 -106131 -241562 -300406
14380 -300406 -264381 -279025 -312175 -257984 -173871 -217849 -165403 -108348 -214427 -251355 -205399
14369 -205399 -62565 48638 -26339 -84678 -171972 -197438 -128168 -91616 -66456 -38026 -91308
14358 -91308 -22724 -46503 -48454 -103658 -84116 -114079 -165927 -202588 -194286 -122447 -55419 -236690
14346 -236690 -226363 -178571 -115292 -37791 -51576 -108285 -94131 35748 46277 -16496 29162
14335 29162 156388 138948 110776 113939 130873 143360 264425 277075 129531 -69720 -229967
14324 -229967 -222420 -233756 -230262 -133312 -134329 -17660 88817 63068 482 37092 21032 -12959
14312 -12959 -22566 16834 14449 38949 -59024 -124107 -174610 -169142 -165752 -105013 -64886 -11606
14300 -11606 74563 -34254 -91572 30809 -97551 -119783 -117091 -67179 -92448 -84218 -82072 -150855
14288 -150855 -142175 -131600 -129342 -104698 -49528 10748 33316 4099 -44731 -56728 -60366 -184120
14276 -184120 -122073 -165846 -91614 -26489 34582 96507 149984 121588 103555 94578 101370 19216
14264 19216 -97816 -197306 -67311 -109439 -44329 43237 40220 -53536 -178596 -139539 -18905
14253 -18905 25650 -11071 -65470 -62978 -86904 -164738 -125364 -52088 -46923 -66245 -139635 -1755
14241 -1755 -41456 -196031 -173563 -96856 -85403 -191375 -287727 -319213 -283550 -103314 -163638
14230 -163638 -163963 -80603 -30704 9691 -25375 30230 15367 -106057 -130256 -131761 -156281 -70071
14218 -70071 -40028 -138510 -146423 -123053 -11315 -49680 -83967 -65516 -111976 -68606 42154
14207 42154 -14489 -63637 -45420 -4219 -59767 -156682 -97573 -42303 -4519 138303 132163 12679
14195 12679 -39202 -111734 -78302 -93845 -47061 -86568 -153182 -197407 -64217 -28257 -67133
14184 -67133 -171965 -183655 -122722 -129127 -135228 -43139 -45118 -66803 -171975 -105756 -108317 -85924
14172 -85924 -161782 -37131 138149 80595 -32765 -5454 -25474 -13330 -21536 -101286 -88068
14161 -88068 -87386 -100576 -89818 -106144 -262074 -192605 -40723 12297 96466 129084 211563 164061
14149 164061 83817 -49204 -161292 -167472 -173151 -135253 -185345 -135076 -92667 -100221 -48058 -82842
14137 -82842 -33230 49984 70184 92760 84601 17314 -51918 -92384 -51883 70430 24694 -89318
14125 -89318 -82952 9878 -31623 -143611 -32905 12624 -64414 -11312 7281 78112 168842
14114 168842 204534 102353 -10051 15701 -16806 -134882 -152195 -132845 -17886 75051 51992
14103 51992 48450 -10903 -1697 17115 -29574 -8993 -96850 -140909 -144409 -32393 67547 18255
14091 18255 12099 22621 -144803 -225976 -54578 24476 57667 107152 130729 167811 162846 67266
14079 67266 33962 -2938 -35750 -21548 -11057 58164 88220 -28716 -82429 -175547 -156840
14068 -156840 -82138 -23959 3325 -163986 -223325 -179572 -157049 -64417 -77121 -157460 -132284
14057 -132284 30642 -97918 -74293 -31814 -8952 108451 35777 -119551 -236456 -181694
14047 -181694 -110643 81079 148334 176484 91764 -72046 -112119 7025 9010 -78582 -69708
14036 -69708 -146662 -234964 -228757 -306920 -175388 -72495 -111267 -147414 -133054 -179127 -262573
14025 -262573 -186998 -35406 -47965 -161981 -141757 -66326 -41406 43922 -14941 -84572 -20583
14014 -20583 128187 128508 -8298 -70100 -3915 113149 121870 65968 140807 215738 142289 205935
14002 205935 163516 -57711 -151165 -111502 -54315 32554 111493 67308 47818 74206 56123
13991 56123 -84805 -82832 -44354 100278 174806 171537 56563 -50106 -97263 -126429 -50770
13980 -50770 -5466 33102 -766 22339 -67645 -53690 -32919 116536 229394 318612 277001
13969 277001 174740 192677 148797 108255 169101 240866 238350 93190 54859 13047 -149970
13958 -149970 -123090 -9636 137749 156536 133031 51516 94954 94828 108768 176184 167018 93234
13946 93234 114301 17645 23062 20028 -67081 -153751 -99579 -144051 -179204 -165924 -181504 -204742
13934 -204742 -185280 -169143 -132324 -193601 -265095 -256840 -237763 -198401 -72459 -96742 -86766 -86955
13922 -86955 -180484 -103295 -55495 -23586 -75844 -116972 -92873 -159477 -135795 -159902 -225130 -192292
13910 -192292 -128921 -121324 -39664 47912 -28758 -98492 -159282 -82036 -39018 -79928 12334 -33356
13898 -33356 -37382 26729 52810 129998 124521 59730 -38521 26412 15396 12441 16120 11268 58320
13885 58320 93078 160092 164894 210233 259903 196813 172256 160787 133450 115448 133263 -9155
13873 -9155 442 90607 116422 21891 -1780 72376 97328 24320 -100868 -128763 -138307 -204720
13861 -204720 -154191 -72254 -58023 -76678 -16569 -33384 -39720 -143675 -170031 -89822 -96525 -61958
13849 -61958 -119946 -61604 68752 126407 90235 110915 145168 127188 118275 61546 30223 136435
13837 136435 53348 -142841 -167850 -101302 4200 59002 94335 118129 210598 247095 192108
13826 192108 162972 131685 210654 204272 225186 183438 132756 111000 20330 -2514 12765 565
13814 565 -157415 -116666 -116089 -137373 -93944 66394 105934 -49140 8302 95552 62221 49690
13802 49690 78090 94857 116045 161685 184188 137453 21655 11735 -96180 -143683 -207623
13791 -207623 -99138 -12804 -7163 59392 61200 10133 30946 -39597 -127647 -190887 -133575 35211
13779 35211 -10067 -48138 8918 -86307 -187792 -190765 -101490 -128525 -205797 -278428 -172124
13768 -172124 -158000 -115369 -169954 -162838 -44547 32629 -78357 -158190 -107292 -66304 -50752
13757 -50752 -163927 -151606 -66056 -46572 34836 79744 82698 -24371 -98440 -36179 -2626
13746 -2626 136786 144240 115767 129067 28532 -8821 -67617 -209133 -108595 -86809 -141616
13735 -141616 -205507 -200800 -170671 -129967 -100163 -85837 -47397 -37805 -57196 -132508 -147125 -101593
13723 -101593 -31473 14456 -110020 -97578 -54260 -25927 -44231 35691 25732 -77409 -54001
13712 -54001 -61373 3935 -58322 -186016 -108339 -49162 -65022 -103408 -91593 -79587 23260
13701 23260 -6868 -159088 -75557 94743 165263 135178 142052 91751 -34507 -29739 -82373
13690 -82373 -114358 -142555 -92533 -51315 -70432 -99650 -160521 -221590 -133978 -39629 76933
13679 76933 101900 168359 188770 165542 129413 136838 90217 -45819 -86214 -25714 -53171 9349
13667 9349 66030 96164 127426 164261 170751 141956 174129 62115 106765 -9207 -25543 -17186
13655 -17186 -122008 -50902 133128 207435 232416 107351 11583 75826 -32200 -123755 -29369
13644 -29369 82469 15593 -5712 9575 90668 141743 75622 19648 -91467 -136694 -239228
13633 -239228 -234911 -153870 -60031 75031 186983 178825 168450 118437 2067 -112211 -34514
13622 -34514 95321 134144 153569 80941 6882 62474 -52787 -66664 -20502 10634 48461
13611 48461 43482 33359 -85888 -50538 46729 5999 -103728 -150192 -85483 -103027 -98321 -8143
13599 -8143 143083 169283 181553 229558 199464 51770 -45958 54502 143842 165099 10615
13588 10615 -11873 107229 156434 69967 61230 33943 -25372 -71407 -125142 -180722 -158127 -68895
13576 -68895 -4457 23485 79938 62080 -39727 -75508 -17157 77789 16882 -61623 -13113
13565 -13113 30205 5008 44026 156209 30818 -57272 -93714 -117987 -160874 -223706 -237924
13554 -237924 -99883 -48263 -64516 -159950 -258544 -164910 -123399 -158188 -121310 -64529 65231
13543 65231 32122 -50392 -78369 -117648 -28235 -77796 19625 125818 40060 -57207 -107976
13532 -107976 -27318 62628 89922 126272 62797 72957 53244 68970 30453 757 -49835
13521 -49835 -101250 -166211 -191881 -163895 -283719 -419845 -296154 -89542 -52082 -100948 -33982
13510 -33982 25525 63905 158275 170172 198501 38808 11277 22180 26696 19699 43077 110100
13498 110100 65549 58154 54149 50013 3825 -18550 -105242 -110420 -119194 -135714 -74479 56033
13486 56033 67721 84732 88722 26541 -1503 24562 101953 21731 37475 54187 36587 -71649
13474 -71649 -120626 -26450 -5652 104637 124250 178206 233516 200014 262728 253599 108483
13463 108483 -49142 46718 88243 135647 218750 276264 217319 152670 96059 157687 67249
13452 67249 -76714 -68524 -35255 -20098 -20391 -29591 -66121 9883 46010 13311 -100700 -74083
13440 -74083 -151894 -144677 -69058 -18691 -28452 7294 -17123 -4439 -106610 -143941 -114499 -114777
13428 -114777 -107572 -98195 -62097 36871 121492 87733 42917 142411 133066 163672 148608 125338
13416 125338 134865 129112 85408 206944 243227 201053 185092 148833 26271 -161332 -102414
13405 -102414 -73806 -173876 -38750 66934 98810 64790 49007 42834 80907 74593 58127
13394 58127 68019 31670 6125 58375 140191 141426 169713 159430 62373 65914 101632 123281
13382 123281 166383 128627 34329 -75201 -169096 -80144 -91385 -73087 -92626 -83448 -111028
13371 -111028 -23185 -22537 -78309 -72399 -36792 130375 253030 240700 223937 170027 3807
13360 3807 -105499 -109043 -48924 -19256 -4327 -22454 -48153 -192486 -287624 -280172 -77952 56284
13348 56284 15051 103148 72344 -55395 -6892 8824 -37213 -85449 -104256 -206754 -213324
13337 -213324 -92598 15352 91798 -33482 -89294 -31311 -57030 -21714 -37502 -108240 -91947
13326 -91947 -94996 -103023 -47239 11169 1203 35966 82760 126806 106057 42720 63184 20590
13314 20590 -44086 -77882 -58630 -88109 -151797 -147283 -56096 19372 -47131 34215 86232 102232
13302 102232 120429 121981 130312 58681 -11623 152226 268242 205638 122866 77709 100753
13291 100753 116480 165843 133844 180285 147416 46950 48571 104695 162750 251767 297029
13280 297029 309343 174742 114972 97460 130921 92649 51586 8935 -64358 67285 120750
13269 120750 118855 20051 -62391 -118282 -100618 -107249 -165728 -92611 76734 36916 -124322
13258 -124322 -150021 -120125 -46953 -21573 1415 -75972 18214 19284 -37828 -80716 -67368 43698
13246 43698 21577 68469 118722 133557 75199 56421 99964 205537 228120 80386 22909
13235 22909 47706 64129 -84718 -110541 -97454 -147825 -125164 -138232 47629 16237 10257
13224 10257 118168 1175 -120761 22477 -33133 57656 198548 198961 144960 126313 79429
13213 79429 3730 -5916 -93801 -140608 -77139 -48052 -113715 -37325 56347 97710 94203 79609
13201 79609 8234 -18502 111807 95075 59091 126378 68600 9009 4711 45009 30082 151146
13189 151146 82562 18928 32957 62874 83608 117039 107928 59135 139681 87083 24304 -2417
13177 -2417 -16028 -97405 -97279 -117243 8545 169681 51162 9421 -59872 -208676 -184978
13166 -184978 -6772 78222 6524 -3907 -18802 59381 68653 40580 180041 223269 161108
13155 161108 32088 -26047 -26003 25056 -66830 -153236 -170768 -26589 -19060 -28411 -106163 -45214
13143 -45214 48177 22179 144123 220542 245692 178102 156077 156841 98002 45806 -5363 -32837
13131 -32837 8036 24323 -60668 -136652 -189981 -65703 -66980 40112 -88341 -45775 -16981
13120 -16981 -8938 -102431 -231585 -233294 -274718 -258568 -61688 35923 92617 63976 46710 31516
13108 31516 -2288 -93054 -100896 -87498 -175758 -57180 83569 118476 -23875 53635 102234
13097 102234 44006 -31170 -51475 -625 81692 100237 139212 133928 31696 -39390 -53428
13086 -53428 -101606 -120728 -160813 -287914 -189889 -156780 -118765 -13135 -66036 -251 20060
13075 20060 73709 65677 48747 -123389 -101200 -21737 11135 61062 138699 249083 226496
13064 226496 194290 93612 4970 -13258 -25392 74510 86379 95813 110847 35594 23170
13053 23170 -2030 25559 33176 104306 164618 128013 32207 -2806 -114993 -135409 -197233 -146742
13041 -146742 -11632 52969 205235 131975 116361 169743 148676 56729 87388 141556 180725
13030 180725 216719 156773 126783 118424 46725 -41757 -146014 -11677 -7777 -153902 -174974
13019 -174974 -5034 42817 84407 160401 126869 136718 169437 83024 3911 -89872 -48846
13008 -48846 -53675 -11448 148448 141452 71041 48794 -28744 -39294 268 -107259 -150128 -155374
12996 -155374 -80755 -105583 -64954 33 102280 94858 116941 42991 15469 98236 97578 -2401
12984 -2401 8188 186222 255063 169116 93348 123255 306776 254927 134426 184892 230254
12973 230254 243096 303218 420938 383369 135300 55282 -19182 -53970 32350 33855 93865
12962 93865 90431 38632 30367 120933 114656 83685 -10486 50501 87218 182992 180380 140391
12950 140391 125175 117617 29719 46833 27929 128898 224828 68249 90640 104292 90742
12939 90742 115969 75656 15858 154761 288597 182015 109353 103040 223453 249016 98531
12928 98531 108317 233411 204251 179571 123018 128596 132995 196270 230859 141203 168440 106474
12916 106474 83833 138748 173220 198172 109389 -38526 -10228 36740 1996 38625 110503
12905 110503 118132 57745 -16149 -23218 -49105 14891 24379 69722 -3183 -8939 120844 70282
12893 70282 76309 19887 -57819 -134758 -74671 8564 99425 102643 151013 281862 340447 253683
12881 253683 198514 70459 32790 19840 35978 89573 156234 212928 237808 243488 280341
12870 280341 271266 271419 277864 367072 390782 323637 343630 404596 268861 196326 190550 198264
12858 198264 158787 135718 70276 30381 62692 35397 81345 -30502 -112233 21619 165788
12847 165788 163544 47324 129157 237548 203310 138854 87236 -15343 -26925 -65604 -98355
12836 -98355 -21838 53070 26069 -89141 27905 172924 263834 101430 24638 -5192 83971
12825 83971 148320 53452 8198 21714 71025 4277 38702 46867 -134520 -74169 77238
12814 77238 36808 28762 112824 263104 369776 337143 152726 204801 227176 334366 361588
12803 361588 348498 227318 56263 23676 156825 246328 253113 299110 466004 436591 366583
12792 366583 286400 201184 153252 255798 368491 330232 311452 211680 99904 85504 177881
12781 177881 318253 439664 401144 286196 207958 149183 151546 193653 -33 155435 271017
12770 271017 145693 124363 54985 -60263 12066 130902 149301 106167 95390 214800 371024
12759 371024 347927 210530 188327 263233 231695 184492 108944 182686 156046 230258 264935
12748 264935 217968 121776 118059 157190 245528 224969 185565 229748 230130 196688 307705 349959
12736 349959 275558 162438 131397 118643 149855 155652 108111 95462 160580 259213 212203
12725 212203 138264 206727 194079 272705 262534 254353 367178 393841 342120 144820 67763
12714 67763 77354 57309 125885 131969 79697 150540 208219 161465 172757 258681 250011 282345
12702 282345 337306 196243 177467 142795 244029 132865 70217 147322 196920 153807 200273
12691 200273 315140 314234 223616 202741 215909 244479 225073 176706 210413 184916 271830 371805
12679 371805 451301 352177 344148 353081 240498 230938 275338 295597 325108 254867 334793 320388
12667 320388 322386 341322 337194 333992 279205 266145 253576 282698 358603 408024 546578 536689
12655 536689 456610 322755 213234 184892 216781 351585 445517 334563 170831 162321 171029
12644 171029 234490 239803 237579 103331 66204 116625 152358 134240 124121 155433 240649 298394
12632 298394 289600 389170 428024 360007 369223 294745 192868 213790 207226 178741 252412 334324
12620 334324 240474 112181 199362 370677 381556 341175 300837 235107 264265 295624 363055
12609 363055 286430 131655 53556 54568 246647 303712 228124 305597 252378 199640 248138
12598 248138 322040 171819 90836 69019 123419 178071 322684 427656 380403 457152 484757
12587 484757 410518 369693 370942 339808 355173 451231 545002 476746 461089 459429 482327 432867
12575 432867 366205 447365 439776 438957 312922 300754 360365 332622 360917 327209 357825 400786
12563 400786 382582 374602 333813 253745 282667 354751 329165 332344 351868 382783 342026 314680
12551 314680 344922 320415 367498 456653 472196 416057 320967 344736 439585 413968 521380
12540 521380 545415 533559 487572 403483 431592 489097 439921 431005 312862 260695 316487
12529 316487 416567 427381 408435 316410 358216 404707 396228 466865 427730 314890 235027
12518 235027 194487 225679 384540 376416 351837 298555 353791 442340 503267 412025 463260
12507 463260 584113 548597 422716 298045 247048 281068 309012 285131 396011 447368 458338
12496 458338 429628 449399 470926 481864 488123 576315 594140 592769 564894 554848 456141 414470
12484 414470 535676 738262 730504 641307 594997 487411 429106 443836 427666 451888 524362
12473 524362 588281 579093 576228 489593 460955 514247 539633 641989 772998 683968 482699
12462 482699 411899 513667 666892 652341 568881 525300 546810 467616 331159 369607 308587
12451 308587 264166 261593 338967 406775 436661 385470 359815 327783 426997 530508 559416
12440 559416 585407 567324 608501 622677 564578 621813 550189 568342 547973 512511 692392
12429 692392 706160 587112 500738 481831 385830 500946 517697 529376 492967 576670 593505
12418 593505 614389 655856 753058 732479 732507 746370 754577 726823 593159 558927 644337 705541
12406 705541 651024 596992 768466 830260 752997 694947 619729 565769 578981 593082 530677
12395 530677 586122 714510 631999 663149 701250 643734 663543 759914 688284 641091 524081
12384 524081 556614 679783 716800 804351 849357 815356 834756 844395 824183 679635 673862
12373 673862 784786 819927 769920 746224 785335 781923 739962 824197 871463 992003 1152403
12362 1152403 1255492 1350278 1260055 1172093 1098559 1180433 1246417 1172701 1247236 1279559 1276514
12351 1276514 1227182 1140217 1051691 991872 949816 1067862 1160755 1106977 1126286 1110372 1009774
12340 1009774 1120464 1202326 1249788 1310136 1268518 1117245 1051962 1085713 1208697 1176649 1195896
12329 1195896 1254078 1325405 1507293 1618159 1560310 1559398 1541981 1694548 1896098 1911627 1825148
12318 1825148 1702631 1507468 1506533 1551308 1457243 1402034 1439079 1511179 1384780 1300683 1356781
12307 1356781 1355357 1402105 1388584 1390818 1381334 1374472 1384331 1340363 1274322 1236448 1179546 1279063
12295 1279063 1324906 1490304 1508936 1293969 1228826 1363198 1490933 1663150 1688164 1778870
12285 1778870 1847251 1730742 1685255 1636630 1700378 1644242 1657488 1708152 1689708 1658836 1628326
12274 1628326 1462242 1378167 1434746 1509526 1557882 1566753 1525218 1527779 1475629 1463831 1546792
12263 1546792 1537120 1496240 1518764 1413397 1273947 1230211 1277341 1439761 1713186 1796648 1783131
12252 1783131 1760820 1625801 1559928 1627843 1619511 1578854 1609160 1674275 1767675 1768355 1641613
12241 1641613 1573754 1721221 1983447 1959524 1958085 2060695 1978923 2006739 2021185 2040583 1975910
12230 1975910 1903268 2005281 2016815 2003008 1904076 1918667 1971427 2026216 2137577 2028236 1834313
12219 1834313 1822236 1888767 1936605 2043314 2052574 2041356 2085601 2108078 2101567 2172121 2289158
12208 2289158 2247795 2180033 2206892 2347696 2347194 2338471 2418380 2363144 2254016 2317733 2419613
12197 2419613 2395406 2334228 2406020 2389627 2382534 2435561 2445193 2453417 2536211 2588062 2582365 2640366
12185 2640366 2696885 2671957 2757850 2763233 2780300 2855814 2830879 2846875 2918793 2909889 2812185 2886467
12173 2886467 2857130 2774216 2789870 2891642 2951583 2917121 2882102 3017202 3173879 3229827 3179058
12162 3179058 3092515 3207018 3297106 3145534 3217691 3334786 3378377 3368184 3331400 3353003 3491315
12151 3491315 3591978 3638278 3582924 3544021 3602430 3651260 3688065 3738336 3797071 3851872 3825381
12140 3825381 3906285 4065155 4008556 3925457 3940562 3927961 3995779 4168171 4302585 4260561 4324913
12129 4324913 4297344 4265291 4305929 4399142 4386653 4383266 4429701 4428723 4428187 4528308 4689507 4764816
12117 4764816 4815638 4837298 4853776 4980278 5002564 5038220 5131414 5230242 5282340 5432874 5460005
12106 5460005 5406628 5560638 5696793 5720665 5762938 5850735 5897773 5818934 5668007 5860121
12096 5860121 5985775 6066202 6069849 6018023 6007413 6084690 6235834 6513302 6754689 6887080
12086 6887080 6800938 6806484 6862662 7040839 7176885 7334407 7329261 7367288 7411760 7338152 7398139
12075 7398139 7578549 7704112 7812309 7875826 8019057 8067049 8021307 8113207 8251368 8432565
12065 8432565 8543535 8601382 8728893 8817652 8792861 8964264 9103978 9177736 9358362 9460843
12055 9460843 9548144 9689767 9761165 9780644 9867366 10119948 10292947 10499734 10685361 10753047
12045 10753047 10766613 10894433 11033767 11099996 11199334 11273094 11399409 11666098 11935237 12062589
12035 12062589 12093166 12274859 12562972 12750928 12817502 12929432 13063491 13265147 13498909 13499240
12025 13499240 13495676 13664814 13966665 14278621 14396602 14587634 14715475 14873300 15033490 15269433
12015 15269433 15472398 15576795 15684439 15786327 16075597 16353631 16631327 16995499 17287661
12006 17287661 17367132 17483216 17711267 17900149 17999789 18093161 18324033 18585855 18729443 18917897
11996 18917897 19158809 19521095 19798669 20000476 20090751 20250261 20491245 20702214 20939810
11987 20939810 21111150 21365532 21513467 21554080 21756228 22056342 22290238 22534823 22780013
11978 22780013 22905764 22989616 23167263 23295850 23398960 23573436 23785403 23931102 24068828
11969 24068828 24225793 24437979 24628455 24686151 24784926 24901011 25034946 25233583 25309172 25353331
11959 25353331 25513873 25636587 25772080 25772202 25822842 25846750 25956284 25988253 25979282 26027644 26082211
11948 26082211 26087753 26121035 26107227 26125399 26121320 26131044 26083173 25982170 25959826 25977251 25921350
11937 25921350 25771512 25762615 25724026 25553497 25347209 25362925 25203895 25063368 25004097 24900780
11927 24900780 24665583 24495355 24503371 24473837 24218706 24036311 23959940 23806340 23557295 23325514
11917 23325514 23030018 22774812 22607711 22549100 22432613 22288788 22199808 22103259 21993456 21728207
11907 21728207 21502080 21294683 21011779 20706862 20539741 20381638 20163611 19925000 19665513
11898 19665513 19493677 19350961 19297005 19172801 18872531 18568407 18351451 18169728 17977388
11889 17977388 17764640 17681032 17497572 17287011 17167130 17074114 16803076 16510822 16430324 16321815
11879 16321815 16260650 15937477 15629910 15397704 15197351 15064818 14894723 14812060 14692648 14487548
11869 14487548 14279169 14072283 13902957 13818124 13693083 13608541 13405271 13238900 13136637 12921629
11859 12921629 12830870 12689954 12515144 12301664 12194708 12113081 11854066 11552504 11320077 11109518
11849 11109518 11020504 11086243 11197148 11117460 10878282 10709483 10555638 10519402 10408390 10220528
11839 10220528 10215184 10158080 9949322 9860242 9747674 9676881 9543577 9427300 9217146 9081621
11829 9081621 9009229 8902164 8788298 8726998 8666005 8626982 8531347 8323092 8277370 8241331 8225733
11818 8225733 8209523 8197274 8086297 7970275 7718577 7602911 7520137 7408365 7293817 7192579
11808 7192579 7185614 7131499 7045345 6973597 6970890 6848191 6784272 6835119 6744741 6492276 6370018
11797 6370018 6254660 6154043 6193732 6084460 6000247 6079880 6122854 6129846 6106875 5909664 5778154
11786 5778154 5723494 5737228 5710814 5734205 5721471 5676107 5566886 5477055 5501915 5360656 5322401
11775 5322401 5261836 5178462 5083076 4986175 5019386 4956661 5002059 5046844 4977674 4859321 4821121
11764 4821121 4718559 4708231 4730102 4659249 4576426 4485751 4378853 4420831 4451113 4429674 4321771
11753 4321771 4280691 4232084 4133794 4139583 4096291 4106771 4068870 4057701 4097551 4035830 3947133
11742 3947133 3968585 3873149 3895190 3839606 3719603 3732349 3622846 3616931 3636403 3622164 3515548
11731 3515548 3565518 3648570 3561821 3434903 3401637 3384625 3516620 3546276 3367187 3378649 3344377
11720 3344377 3236751 3183009 3233034 3303504 3339492 3290146 3205363 3129189 3117069 3130449 3146300
11709 3146300 3107563 3033455 3059501 3019372 2945665 3004922 2954950 2890189 2870119 2958969 2889700
11698 2889700 2766050 2688605 2833189 2810612 2683459 2768778 2786471 2754782 2698366 2608504 2559137
11687 2559137 2501689 2553825 2543084 2554245 2558487 2521143 2448367 2441072 2314074 2310239 2404707 2518235
11675 2518235 2497773 2322383 2306872 2314703 2343104 2387980 2457541 2443979 2349585 2304362 2209727
11664 2209727 2288852 2279733 2245043 2185576 2182060 2182926 2179156 2314320 2407909 2520342 2518133 2518849
11652 2518849 2647748 2898657 3417862 4092851 4991583 5624801 5435108 4659331 3903134
11643 3903134 3284050 2769381 2519983 2439923 2293021 2072459 2072752 1980631 1958471 1914217 1900556
11632 1900556 2010638 2131224 2046182 1893117 1838324 1806304 1810073 1751737 1804851 1828310 1752543
11621 1752543 1715510 1822049 1803299 1696617 1774147 1680641 1667290 1636049 1540629 1461629 1422972
11610 1422972 1502854 1554875 1565532 1605012 1633688 1621812 1577897 1618813 1653473 1672466 1654179
11599 1654179 1668769 1681422 1645809 1576569 1502377 1558521 1556479 1499566 1402271 1386155 1428895
11588 1428895 1439862 1464482 1455110 1461715 1489056 1400088 1400475 1273907 1248521 1213468 1311755 1303384
11576 1303384 1362232 1438339 1344155 1189097 1203788 1276074 1315314 1362783 1342527 1362790 1425363
11565 1425363 1457666 1346016 1280124 1318061 1177531 1073644 1079297 1183504 1125577 1108362 1040940
11554 1040940 999070 922747 924789 1029191 1063838 1125317 1183851 1269329 1270728 1282771 1372731
11543 1372731 1346404 1269715 1204853 1017834 860203 824501 879201 999996 1017294 901756
11533 901756 939666 946546 1025448 1153622 1188313 1125702 1129892 1116076 1074430 1084257 1012092 1074230
11521 1074230 1030240 973632 998479 1048134 1072715 975406 971884 970646 972283 854120 874525 1037969
11509 1037969 1046983 1074694 1063402 870128 806695 806463 820010 929490 850976 812404 911295
11498 911295 957786 951268 957426 1090050 1039640 1027858 1049140 1000312 973021 933465 999939 926246
11486 926246 843339 993715 1094530 1133644 1150064 998373 969845 957307 879055 815682 803339
11475 803339 758161 656564 643461 763476 874995 747618 760877 910602 914062 962122 1019717
11464 1019717 1023867 964238 857854 740070 739025 875105 910137 964656 1054899 955556 982024
11453 982024 1034538 970883 842625 726091 709393 765735 831832 790452 812472 782181 672262
11442 672262 672896 722968 764564 788817 780658 816661 857101 812658 750478 655438 621678 646754
11430 646754 796966 684531 558259 561626 575816 586510 597244 685614 643791 550283 462937
11419 462937 395239 372410 479055 589153 675497 657269 692727 686786 834973 908763 905837
11408 905837 821297 823684 877880 850427 841760 736712 632171 573872 620190 636063 577264
11397 577264 599727 486403 483368 607018 626110 560510 501654 450340 586544 589159 514589
11386 514589 578927 551448 526715 467929 489888 451841 394220 398994 530573 503696 453173
11375 453173 463062 412805 446686 450538 406704 458823 537667 632250 747887 677454 518166
11364 518166 601308 605779 519341 560878 624647 571617 624308 705900 596155 372244 366873
11353 366873 496859 552351 484958 428000 552588 592733 653616 562738 570514 574953 512286
11342 512286 500274 509769 452124 424317 475959 403237 371908 304650 284018 371614 297436 226501
11330 226501 261583 370243 341005 386406 535224 501566 411923 487729 484005 434540 360892
11319 360892 367374 424036 370659 269107 120214 109694 215475 413573 415314 478740 445559
11308 445559 452280 454569 436150 485154 428348 370336 328495 282279 264979 335053 279279 177676
11296 177676 169727 276473 313331 356081 331967 460996 461662 438827 522643 607939 514676 495702
11284 495702 458588 394657 383597 397044 219992 240696 323206 350107 344512 354386 354032 358702
11272 358702 376814 472105 583953 500109 456741 339840 217535 159504 144977 216408 345062
11261 345062 357622 202176 76709 111161 131088 244343 282964 230327 174934 191604 207042
11250 207042 261008 277552 360041 305439 226951 313109 262848 322475 381690 273420 192379
11239 192379 220776 260163 220813 338379 331989 437007 488753 367711 291288 253422 234555
11228 234555 168499 191120 236992 303019 387643 477779 389235 385984 417274 403000 367082 350646
11216 350646 342636 408137 390795 295869 166800 130196 254120 305224 249919 232090 314349
11205 314349 249202 270694 216894 310624 352891 293421 330070 309051 269984 194049 188129 220225
11193 220225 425251 487937 414997 259746 237385 270410 132946 31460 109037 227796
11183 227796 376082 224367 100982 150373 183924 216143 325887 283491 253416 222938 100152
11172 100152 31178 28272 -42626 -7521 -10147 3156 78660 60655 113076 143386 131012 210311
11160 210311 219684 184310 239130 239736 255767 246299 263815 242810 278254 235380 146182 70560
11148 70560 33295 11869 96559 98711 42999 31209 116143 125087 100023 125380 164262 229602
11136 229602 175761 148717 166906 177660 139122 59052 -15820 13581 26410 112847 204857
11125 204857 278134 149630 2646 -30771 13869 6088 24962 11296 -74598 -3459 122006
11114 122006 104239 40422 143252 135311 133849 201168 270551 251191 242642 280509 199173 159719
11102 159719 236744 255121 183672 136015 141639 159173 84957 11726 138434 209463 127738
11091 127738 182581 145910 158355 26246 59903 58577 8321 19178 126160 233801 143180
11080 143180 91663 73136 10897 75019 52434 10107 42502 52353 58286 190934 312546
11069 312546 334755 455325 604600 888632 949816 721216 465201 387250 356604 260488
11059 260488 331911 215945 92871 57744 86215 144266 131248 123015 72339 -62746 -76915
11048 -76915 -114880 -108188 7129 161438 330879 417414 445134 532763 612273 642321 584596
11037 584596 464939 452444 486486 447066 667225 794884 756192 722762 680200 597362 514477
11026 514477 530586 567210 569373 706928 876933 997912 1038727 955988 764577 585961 539341
11015 539341 465608 479015 531808 552619 562172 729242 949638 947327 826113 691265 532706
11004 532706 397293 322411 341451 350155 290976 325329 337868 405292 531349 476581 278427
10993 278427 163478 154533 188980 61939 -3392 31255 -718 -18889 -49168 -38276 -79967
10982 -79967 -129201 -61475 -25889 49820 125979 151873 130206 44484 79166 143122 248206
10971 248206 247564 254026 103610 -57153 -44952 109549 138323 38741 153058 301442 167142
10960 167142 76249 109232 61637 38029 66179 53399 107690 112455 -26786 -156595 -268348
10949 -268348 -103717 543 23113 -33229 -70061 -74418 -336 -37671 1037 -58945 -35441
10938 -35441 138262 232645 202789 195179 338780 413982 560241 955352 1391756 1886360 2518964
10927 2518964 3172522 3530107 3186446 2401024 1652346 1184725 899790 690781 628166 590267
10917 590267 593252 694400 734300 626388 485130 328007 191049 212464 135251 17267
10907 17267 -62129 61508 74275 28595 -71633 -98544 -163707 -70922 15288 78502 127801
10896 127801 26670 72105 152898 165304 147636 42184 77108 127493 287488 203055 19440
10885 19440 -24230 41538 93750 97490 103610 40190 -59134 -69278 -64018 42411 154201 73038
10873 73038 136634 95554 -4785 -2049 109209 189283 191656 74436 113555 70383 39180
10862 39180 20628 -158609 -227768 -193468 -141123 -152845 -297450 -288381 -209046 -151261 -14230
10851 -14230 55705 89303 95636 77592 26657 -13994 -14827 52765 58329 -22671 7833 -1766 -52486
10838 -52486 -212444 -217546 -136295 -109333 -197676 -228434 -290865 -279710 -155505 -88682 -83146 -38884
10826 -38884 -38039 -14654 73205 -50561 -154679 -298157 -301322 -243406 -258801 -199328 -304020
10815 -304020 -253318 -130820 -79292 -184272 -288884 -264384 -243302 -247715 -256017 -163527 -179661
10804 -179661 -153625 -160787 -207743 -251658 -271570 -225176 -219534 -194989 -67903 -34852 -61871 -71537
10792 -71537 8368 -42734 -84288 -102957 -144798 -261016 -323291 -268915 -246180 -192607 -75004
10781 -75004 -5851 807 8943 -207408 -268884 -117571 -77037 -114202 -196486 -122917 -157325 -208422
10769 -208422 -231102 -95118 -7658 -24361 -138838 -143650 -72400 -46202 -121461 -182229 -107848
10758 -107848 -191785 -214156 -294782 -277467 -115944 -88355 -123553 -177280 -194822 -229417 -331981
10747 -331981 -501577 -544074 -428508 -415683 -501402 -446950 -453345 -436062 -387079 -265533 -147297
10736 -147297 -153662 -224990 -135742 -84125 -93915 -42715 -121902 -230312 -172025 -162533 -156622 -204448
10724 -204448 -231376 -195243 -192137 -185257 -101222 -144404 -242103 -198196 -129723 -76791 -172674 -196872
10712 -196872 -158481 -111236 -80114 -216095 -277940 -251443 -205955 -116828 -96136 -36134 -25221
10701 -25221 -83508 -130736 -193819 -159304 -116507 -142397 -178014 -106945 7536 -70744 -258540
10690 -258540 -309946 -421136 -352586 -319788 -394542 -363805 -356736 -385408 -294903 -348455 -333081
10679 -333081 -290176 -286958 -177910 -112263 -56820 -92853 -214481 -173802 -59833 -77205 -124613
10668 -124613 -158624 -191764 -186949 -179770 -304720 -475692 -531557 -492006 -470797 -509166 -535837
10657 -535837 -502377 -445095 -366194 -312883 -252331 -206953 -152330 -35299 -38899 -99501 -133836
10646 -133836 -190437 -347393 -335570 -196632 -261788 -372418 -240739 -96034 66447 33105
10636 33105 113930 291436 405027 563187 663639 998071 1394185 1640299 1870691 2215454
10626 2215454 2695533 3225330 3911220 4905166 6255245 8161344 10717706 14215616 19093155
10617 19093155 25515798 33592673 42255378 49442365 52999035 52571742 49959468 47202695
10609 47202695 45866687 46847288 50810622 58562601 70717035 86900022 104591979 117907452
10601 117907452 121205706 114588430 103479540 93441293 86962652 85291958 89084935 98813903
10593 98813903 114755708 135841147 157652045 171579322 169862750 154234820 133409589
10586 133409589 114465513 100491191 92059312 89265331 92037841 99697495 110983752
10579 110983752 122084007 126948959 121295161 106895560 90095642 75426454 64486760
10572 64486760 57351136 53753472 53210068 54943634 57905475 60313986 59707635 55200892
10564 55200892 47574197 39065401 31435896 25154161 20388080 16874569 14290830 12353261
10556 12353261 10810630 9481578 8566891 7819948 7179017 6532214 5906956 5438537 5090226
10547 5090226 4874867 4642591 4520161 4269556 4077759 3891143 3696852 3458513 3382201 3234501
10537 3234501 3033523 2903827 2933814 2865049 2822339 2685230 2544159 2389438 2276133 2173526
10527 2173526 2161243 2161610 2242597 2107894 1913570 1797602 1824455 1790315 1699328 1708005 1839244
10516 1839244 1756663 1687853 1698553 1728717 1696443 1695173 1710100 1740424 1677243 1540697 1542788
10505 1542788 1514926 1534182 1422840 1289786 1351759 1341836 1332892 1368352 1348580 1315848 1350847
10494 1350847 1332200 1342461 1332102 1345724 1397155 1446218 1353272 1366138 1302682 1183054 1074598
10483 1074598 1067063 1101892 1187859 1109925 1073907 1201335 1229633 1242020 1185356 1160454 1153140
10472 1153140 1176778 1297170 1291414 1251562 1285125 1356314 1421465 1525436 1498531 1405286 1233724
10461 1233724 1077250 1071619 1119243 1125377 1180854 1205853 1194098 1018720 861095 812204 867013
10450 867013 900157 902503 899355 915404 891437 799783 672077 673153 742760 759713 853975 869651
10438 869651 768414 747677 867501 921507 875217 816620 758048 736246 720386 722422 719551
10427 719551 708899 687888 761676 787424 744810 738685 622519 504535 425861 529692 711837
10416 711837 757756 812209 837567 761472 836588 983077 919574 708480 730206 646279 530933
10405 530933 474162 467366 480214 575795 633595 512617 487637 522641 521492 450554 460014 587206
10393 587206 534747 452558 396056 449116 409477 359796 425197 383104 254626 231826 381423
10382 381423 396377 418026 417625 426452 510652 566070 634584 525942 314515 375281 567971
10371 567971 610780 583549 538678 537436 614540 598873 572902 569906 634435 493358 366028
10360 366028 482407 569786 539392 490377 493778 517415 506974 545491 482693 463195 530208
$$ [...]
##END NTUPLES=NMR SPECTRUM
##END=
