##TITLE=Analysis number 329059
Compound Code cc 12313
Book Reference b 244732
Project Code adrs
Chemist Name stores
##JCAMPDX= 6.0         $$ Bruker NMR JCAMP-DX V2.0
##DATA TYPE= NMR SPECTRUM
##DATA CLASS= NTUPLES
##ORIGIN= Bruker BioSpin GmbH
##OWNER= nmr
$$ XWIN-NMR		Version 3.5
$$ Fri Jul 27 11:25:22 2007 GMT Daylight Time (UT+1h)  MAYBRIDGE\nmr@NMR_250MHZ
##.OBSERVE FREQUENCY= 250.131544655141
##.OBSERVE NUCLEUS= ^1H
##.ACQUISITION MODE= SIMULTANEOUS (DQD)
##.ACQUISITION SCHEME= undefined
##.AVERAGES= 16
##.DIGITISER RES= 18
##SPECTROMETER/DATA SYSTEM= dpx250
##.PULSE SEQUENCE= zg30
##.SOLVENT NAME= DMSO
##.SHIFT REFERENCE= (INTERNAL, DMSO, 0, 16.522)
##AUDIT TRAIL= $$ (NUMBER, WHEN, WHO, WHERE, WHAT)
$$ ##TITLE= Audit trail, XWIN-NMR		Version 3.5
$$ ##JCAMPDX= 5.01
$$ ##ORIGIN= Bruker BioSpin GmbH
$$ ##OWNER= nmr
$$ C:\u/data/dgb/nmr/ADRS/1570/pdata/1/auditp.txt
$$ ##AUDIT TRAIL=  $$ (NUMBER, WHEN, WHO, WHERE, WHAT)
(   1,<2007-07-27 11:24:57.00 +100>,<MAYBRIDGE\nmr>,<NMR_250MHZ>,
      <created by zg, POWCHK disabled, PULCHK disabled
       configuration hash MD5:
       76 6E 9A 78 1E 09 19 81 EC 84 63 8F B0 6A 59 2D
       data hash MD5: 64K
       F3 93 20 9E 8A C8 64 13 2A 9A 0D 64 23 A6 D1 DB>)
(   2,<2007-07-27 11:25:11.87 +100>,<MAYBRIDGE\nmr>,<NMR_250MHZ>,
      <Start of raw data processing
       ef LB = 0.3 FT_mod = 6 PKNL = 1 SI = 32K 
       data hash MD5: 32K
       B5 0E EE F1 E4 46 A0 F2 EB 63 AD ED 4E 7C 74 60>)
(   3,<2007-07-27 11:25:13.47 +100>,<MAYBRIDGE\nmr>,<NMR_250MHZ>,
      <apk 
       data hash MD5: 32K
       6D E9 2D 7D 30 BC B3 4E E1 40 A8 A7 80 54 2A EF>)
(   4,<2007-07-27 11:25:14.25 +100>,<MAYBRIDGE\nmr>,<NMR_250MHZ>,
      <abs ABSG = 5 
       data hash MD5: 32K
       EE C2 86 C8 12 18 14 4B A2 2C 16 15 49 BA CC F1>)
$$ ##END=
$$ 
$$ hash MD5
$$ CE E3 67 07 85 4F 9D 98 44 12 0F FB 91 AE F9 5F
##$RELAX= 
##$RELAX= 
##$RELAX= 
##$RELAX= 
##$RELAX= 
##$RELAX= 
##$RELAX= 
$$ Bruker specific parameters
$$ --------------------------
##$DU= <C:\u>
##$EXPNO= 1570
##$NAME= <ADRS>
##$PROCNO= 1
##$TYPE= <nmr>
##$USER= <dgb>
##$AMP= (0..31)
100 100 100 100 100 100 100 100 100 100 100 100 100 100 100 100 100 100 
100 100 100 100 100 100 100 100 100 100 100 100 100 100 
##$AQSEQ= 0
##$AQ_mod= 3
##$AUNM= <au_zg>
##$AUTOPOS= <6 >
##$BF1= 250.13
##$BF2= 250.13
##$BF3= 250.13
##$BF4= 250.13
##$BF5= 500.13
##$BF6= 500.13
##$BF7= 500.13
##$BF8= 500.13
##$BYTORDA= 1
##$CFDGTYP= 0
##$CFRGTYP= 5
##$CHEMSTR= <none>
##$CNST= (0..31)
1 1 145 1 1 1 1 1 1 1 1 1 1 1 1 1 1 1 1 1 1 1 1 1 1 1 1 1 1 1 1 1 
##$CPDPRG= <>
##$CPDPRG1= <>
##$CPDPRG2= <>
##$CPDPRG3= <>
##$CPDPRG4= <mlev>
##$CPDPRG5= <mlev>
##$CPDPRG6= <mlev>
##$CPDPRG7= <mlev>
##$CPDPRG8= <mlev>
##$CPDPRGB= <>
##$CPDPRGT= <>
##$D= (0..31)
0 1 0 0 0 0 0 0 0 0.06 0 0 0 0 0 0 0.0002 0 0 0 0 0 0 0 0 0 0 0 0 0 0 
0 
##$DATE= 1185531895
##$DBL= (0..7)
120 120 120 120 120 120 120 120 
##$DBP= (0..7)
150 150 150 150 150 150 150 150 
##$DBP07= 0
##$DBPNAM0= <>
##$DBPNAM1= <>
$$ [...]
##$SUBNAM7= <"">
##$SUBNAM8= <"">
##$SUBNAM9= <"">
##$SW= 20.6930455092707
##$SWIBOX= (0..15)
0 0 3 0 0 0 0 0 0 0 0 0 0 0 0 0 
##$SW_h= 5175.983436853
##$TD= 65536
##$TD0= 1
##$TE= 297.16
##$TE2= 300
##$TE3= 300
##$TEG= 300
##$TL= (0..7)
0 120 120 120 120 120 120 120 
##$TP= (0..7)
150 150 150 150 150 150 150 150 
##$TP07= 0
##$TPNAME0= <>
##$TPNAME1= <>
##$TPNAME2= <>
##$TPNAME3= <>
##$TPNAME4= <>
##$TPNAME5= <>
##$TPNAME6= <>
##$TPNAME7= <>
##$TPOAL= (0..7)
0.5 0.5 0.5 0.5 0.5 0.5 0.5 0.5 
##$TPOFFS= (0..7)
0 0 0 0 0 0 0 0 
##$TUNHIN= 0
##$TUNHOUT= 0
##$TUNXOUT= 0
##$USERA1= <user>
##$USERA2= <user>
##$USERA3= <user>
##$USERA4= <user>
##$USERA5= <user>
##$V9= 5
##$VALIST= <valist>
##$VCLIST= <CCCCCCCCCCCCCCC>
##$VD= 0
##$VDLIST= <DDDDDDDDDDDDDDD>
##$VPLIST= <PPPPPPPPPPPPPPP>
##$VTLIST= <TTTTTTTTTTTTTTT>
##$WBST= 1024
##$WBSW= 4
##$XGAIN= (0..3)
0 0 0 0 
##$XL= 0
##$YL= 0
##$YMAX_a= 333422
##$YMIN_a= -174683
##$ZGOPTNS= <>
##$ZL1= 120
##$ZL2= 120
##$ZL3= 120
##$ZL4= 120
##$ABSF1= 16.522
##$ABSF2= -4.171173
##$ABSG= 5
##$ABSL= 3
##$ALPHA= 0
##$AQORDER= 0
##$ASSFAC= 0
##$ASSFACI= 0
##$ASSFACX= 0
##$ASSWID= 0
##$AUNMP= <proc_1d>
##$AZFE= 0.1
##$AZFW= 0.1
##$BCFW= 0
##$BC_mod= 0
##$BYTORDP= 0
##$COROFFS= 0
##$CY= 12.5
##$DATMOD= 1
##$DC= 0
##$DFILT= <>
##$DTYPP= 0
##$F1P= 14.0000005364418
##$F2P= -0.99999901652339
##$FCOR= 0.5
##$FTSIZE= 32768
##$FT_mod= 6
##$GAMMA= 0
##$GB= 0
##$INTBC= 1
##$INTSCL= 1
##$ISEN= 128
##$LB= 0.3
##$LEV0= 0
##$LPBIN= 0
##$MAXI= 10000
##$MC2= 0
##$MEAN= 0
##$ME_mod= 0
##$MI= 0
##$NCOEF= 0
##$NC_proc= -6
##$NLEV= 6
##$NOISF1= 0
##$NOISF2= 0
##$NSP= 0
##$NTH_PI= 0
##$NZP= 0
##$OFFSET= 16.522
##$PC= 1
##$PHC0= -60.6286
##$PHC1= 6.522822
##$PH_mod= 1
##$PKNL= yes
##$PPARMOD= 0
##$PSCAL= 4
##$PSIGN= 0
##$REVERSE= no
##$SF= 250.13
##$SI= 32768
##$SIGF1= 0
##$SIGF2= 0
##$SINO= 400
##$SIOLD= 32768
##$SREGLST= <1H.DMSO>
##$SSB= 0
##$STSI= 32768
##$STSR= 0
##$SW_p= 5175.98343685301
##$SYMM= 0
##$S_DEV= 0
##$TDeff= 65536
##$TDoff= 0
##$TI= <Analysis number 999999
Compound Code 99
Book Reference 9
Project Code 9>
##$TILT= no
##$TM1= 0
##$TM2= 0
##$TOPLEV= 0
##$USERP1= <user>
##$USERP2= <user>
##$USERP3= <user>
##$USERP4= <user>
##$USERP5= <user>
##$WDW= 1
##$XDIM= 32768
##$YMAX_p= 513215408
##$YMIN_p= -1035704
$$ End of Bruker specific parameters
$$ ---------------------------------
##NTUPLES= NMR SPECTRUM
##VAR_NAME=  FREQUENCY,     SPECTRUM/REAL,   SPECTRUM/IMAG
##SYMBOL=    X,             R,               I
##VAR_TYPE=  INDEPENDENT,   DEPENDENT,       DEPENDENT
##VAR_FORM=  AFFN,          ASDF,            ASDF
##VAR_DIM=   32768,         32768,           32768
##UNITS=     HZ,            ARBITRARY UNITS, ARBITRARY UNITS
##FACTOR=    0.157963299565203, 1,           1
##FIRST=     4132.6476996994, 0,             0
##LAST=      -1043.33573715361, 0,           0
##MIN=       -1043.33573715361, -1035704,    0
##MAX=       4132.6476996994, 513215408,     0
$$ Real data points
##PAGE= N=1
##DATA TABLE= (X++(R..R)), XYDATA
$$ [...]
$$ plain form
16998 -273635 -134386 -229370 -306881 -74514 -11184 62025 188409 257972 256966 296004 362388
16987 362388 360383 174549 291275 519325 533367 362997 473264 498587 309663 411239
16977 411239 667918 583624 392219 302173 309898 230056 100119 122892 76798 135389 419422
16966 419422 452361 269894 208566 262908 72558 94163 149731 159821 26121 178936 246554
16955 246554 334435 338401 331298 312216 52984 75445 72932 136958 275006 130750 -61273
16944 -61273 -166609 11808 42232 222668 277193 112800 -34131 -220936 -260467 -281348
16934 -281348 -51882 294445 419556 199222 288413 356883 30106 -412512 -277545 14481
16924 14481 226892 172052 172626 152308 199589 342589 337587 327097 268140 214489 195364 113836
$$ packed form
16998b73635J39249r4984p7511K32367O3330P3209J26384O9563j006L9038O6384
16987C62388k005j85834J16726K28050J4042j70370J10267K5323j88924J01576
16977D11239K56679q4294j91405r0046P725p9842j29937K2773m6094N8591K84033
16966D19422L2939j82467o1328N4342j90350K1605N5568J0090j33700J52815O7618
16955B46554Q7881L966p103j9082k59232K2461k513O4026J38048j44256j92023
16944f1273j05336J78417L0424J80436N4525j64393j46931j86805l9531k0881
16934b81348K29466L46327J25111k20334Q9191O8470l26777m42618J34967K92026
16924A4481K12411n4840N74k0318M7281J43000n002j0490n8957n3651j9125q1528
$$ plain form
16912 113836 183538 272244 357962 549132 314293 149089 213045 285747 -113498 -189298 25923
16901 25923 349221 518077 415213 83544 -210316 -204796 35837 285509 366153 191718
16891 191718 -2852 -50958 117739 57454 160746 33251 -14967 -119241 -200293 -153603
16881 -153603 -118515 18473 -5857 88366 88940 2251 161181 199725 362619 175736 65755
16870 65755 182752 237764 438195 462074 405546 364806 555461 577056 542895 471384 289506
16859 289506 199719 300298 342071 331856 173839 69629 -56925 88895 87689 87416 36183
16848 36183 94027 122116 112542 127569 339339 328369 161084 149695 199570 116484 183607
16837 183607 297050 322243 169835 15794 -134567 -27572 77189 337464 335550 44300
$$ packed form
16912A13836O9702Q8706Q5718J91170k34839j65204O3956P2702l99245p5800K15221
16901B5923L23298J68856j02864l31669k93860N520K40633K49672Q0644j74435
16891A91718j94570m8106J68697o0285J03292j27495m8218j04274q1052M6690
16881a53603L5088J36988k4330R4223N74q6689J58930L8544J62894j86883j09981
16870F5755J16997N5012K00431K3879n6528m0740J90655K1595l4161p1511j81878
16859B89506q9787J00579M1773j0215j58017j04210j26554J45820j206k73n1233
16848C6183N7844K8089r574J5027K11770j0970j67285j1389M9875q3086O7123
16837A83607J13443K5193j52408j54041j50361J06995J04761K60275j914k91250
$$ plain form
16827 44300 -109437 -362010 -313371 21791 30251 59242 229266 211785 221497 251214 335200
16816 335200 431512 253362 160969 306819 418736 253905 -30918 13437 251981 -61350
16806 -61350 -194255 -54828 164494 190170 308517 195470 14343 11017 8880 44756 101107
16795 101107 -17365 -214393 -116334 -122166 -195333 -48860 161635 175196 165252 142341 -1568
16784 -1568 -176965 165565 112841 -9692 -76454 -257535 -283954 -259045 -196342 74426 6479
16773 6479 158615 249831 236242 200686 -16114 20014 54971 29662 41615 129947 196512
16762 196512 25367 7899 213991 481152 566863 495279 515390 569704 377954 253962
16752 253962 215722 23504 -221035 -338143 -460401 -405254 -406343 -200966 159656 336863
$$ packed form
16827D4300j53737k52573M8639L35162Q460K8991J70024j7481R712K9717Q3986
16816C35200R6312j78150r2393J45850J11917j64831k84823M4355K38544l13331
16806f1350j32905J39427K19322K5676J18347j13047j81127l326k137L5876N6351
16795A01107j18472j97028R8059n832p3167J46473K10495J3561r944k2911j43909
16784a568j75397L42530n2724j22533o6762j81081k6419K4909O2703K70768o7947
16773F479J52136R1216j3589l5556k16800L6128L4957k5309J1953Q8332O6565
16762A96512j71145j7468K06092K67161Q5711p1584K0111N4314j91750j23992
16752B53962l8240j92218k44539j17108j22258N5147j089K05377L60622J77207
$$ plain form
16742 336863 224808 58224 -14491 -34032 119102 104931 99102 195078 270896 156807 26496
16731 26496 -120161 -164762 -171555 -396207 -322486 -328558 -132792 -184601 -89762 -127934 -209278
16720 -209278 -121693 -2519 72316 370142 555113 696176 378926 113784 -67342 148717
16710 148717 345174 353125 273283 46916 -38196 -32892 76702 -57764 -143848 24147 129850
16699 129850 199227 33045 -114109 -69914 148167 217130 182081 327470 352220 306511 240510
16688 240510 41831 -42869 -242265 -269636 -285880 -70777 213651 108256 -226153 -92625
16678 -92625 -142302 -146056 -100662 -191303 -76876 -125975 -266577 -376445 -333272 -187264 -206974
16667 -206974 -160336 -179224 -170039 -227174 -53986 40709 117035 122478 64739 51588 -54688
$$ packed form
16742C36863j12055j66584p2715j9541J53134j4171n829R5976P5818j14089j30311
16731B6496j46657m4601o793k24652P3721o072J95766n1809R4839l8172q1344
16720b09278Q7585J19174P4835K97826J84971J41063l17250k65142j81126K16059
16710A48717J96457P951p9842k26367q5112N304J09594j34466q6084J67995J05703
16699A29850O9377j66182j47154M4195K18081O8963l5049J45389K4750m5709o6001
16688B40510j98679q4700j99396k7371j6244K15103K84428j05395l34409J33528
16678i2625m9677l754M5394r0641J14427m9099j40602j09868M3173J46008j9710
16667b06974M6638j8888R185n7135J73188R4695P6326N443n7739j3151j06276
$$ plain form
16656 -54688 -291784 -245147 -327549 -424999 -482776 -523385 -448534 -227668 -32889 24654 12364
16645 12364 -97116 -180651 -240682 -212026 -86321 -183559 -214760 -98560 75003 10468 -164407
16634 -164407 -259116 -608600 -508057 -204039 106180 277349 27837 -89733 -3077 181900
16624 181900 108122 -81522 -139853 117861 216834 174356 261941 81578 -254456 -352069 -342820
16613 -342820 -80105 -136390 -248580 -307618 -108399 -8631 -54879 -166552 -60090 -77253
16603 -77253 -147825 -198968 -316276 -130783 -23180 -207569 -213050 -75958 -105214 -190785 -282837
16592 -282837 -278427 -100931 -116883 133292 122409 -186987 -140650 11694 27437 -3874 78410
16581 78410 128821 -90083 -95857 -54034 -221877 -9114 94200 37775 -10786 -120558 -216055
$$ packed form
16656e4688k37096M6637q2402r7450n7777m0609P4851K20866J94779N7543j2290
16645A2364j09480q3535o0031K8656J25705r7238l1201J16200J73563o4535j74875
16634a64407r4709l49484J00543L04018L10219J71169k49512j17570Q6656J84977
16624A81900p3778j89644n8331K57714R8973m2478Q7585j80363l36034r7613R249
16613c42820K62715n6285j12190n9038J99219R9768m6248j11673J06462j7163
16603g7253p0572n1143j17308J85493J07603j84389n481J37092k9256q5571r2052
16592b82837M410J77496j5952K50175j0883l09396M6337J52344J5743l1311Q2284
16581G8410N0411k18904n774M1823j67843K12763J03314n6425m8561j09772r5497
$$ plain form
16570 -216055 -163483 63872 -2803 -36911 55565 -44511 -354935 -380687 -262973 -222579 -84674
16559 -84674 84252 262018 237532 130239 138989 49971 -121258 -44355 115337 203746 204363
16548 204363 112468 155025 309944 261340 117504 240750 378506 296852 152028 219913
16538 219913 272397 -102782 -115190 -128745 -68537 -4552 -148998 -92362 -29571 150687 150729
16527 150729 -143357 -84358 27657 193860 279246 120983 -162346 -323844 -145553 -72689
16517 -72689 -71472 -3543 182079 216994 239608 208330 27441 27961 -144667 -333767 -135849
16506 -135849 -71604 -11220 185242 151641 -12033 -56181 -64733 11086 -131576 -166222 -374117
16495 -374117 -391998 -254549 -63400 -74110 44854 -12889 -305429 -679173 -605991 -430503
$$ packed form
16570b16055N2572K27355o6675l4108R2476j00076l10424k5752J17714M0394J37905
16559h4674J68926J77766k4486j07293Q750q9018j71229P6903J59692Q8409O17
16548B04363r1895M2557J54919m8604j43836J23246J37756q1654j44824O7885
16538B19913N2484l75179j2408j3555O0208O3985j44446N6636O2791J80258M2
16527A50729k94086N8999J12015J66203Q5386j58263k83329j61498J78291P2864
16517g2689J217O7929J85622L4915K2614l1278j80889N20j72628j89100J97918
16506a35849O4245O0384J96462l3601j63674m4148q552P5819j42662l4646k07895
16495c74117j7881J37449J91149j0710J18964n7743k92540l73744P3182J75488
$$ plain form
16485 -430503 -249292 -123733 20314 -13361 23528 47051 202453 392155 380979 101896
16475 101896 -273059 -337052 -328296 -174550 -61319 176835 130205 101455 43400 164811 105953
16464 105953 -21213 37990 -91087 -276141 -158468 -235167 -229967 -188481 -122081 -31954 -29832
16453 -29832 -66852 111064 4258 -50650 87761 124306 93464 134280 340261 263880 244572
16442 244572 331748 336839 200223 49435 -99220 -59454 19589 -17623 -244131 -190187 -231650
16431 -231650 -1365 206342 174038 114470 109994 -158977 -181429 -111527 -227901 44692 290578
16420 290578 192076 196665 303474 375833 315992 169022 149915 138202 191549 124353 84503
16409 84503 131231 -106279 -30271 -144205 -300611 -291989 -100165 -140441 -103416 -142747 -223226
$$ packed form
16485d30503J81211J25559J44047l3675L6889K3523J55402J89702j1176k79083
16475A01896l74955o3993Q756J53746J13231K38154m6630k8750n8055J21411n8858
16464A05953j27166N9203j29077j85054J17673p6699N200M1486O6400R0127K122
16453b9832l7020J77916j06806n4908J38411L6545l0842M0816K05981p6381j9308
16442B44572Q7176N091j36616j50788j48655L9766P9043l7212k26508N3944m1463
16431b31650K30285K07707l2304n9568m476k68971k2452O9902j16374K72593K45886
16420B90578r8502M589J06809P2359n9841j46970j9107j1713N3347o7196l9850
16409H4503M6728k37510P6008j13934j56406Q622J91824m0276L7025l9331q0479
$$ plain form
16398 -223226 -40170 654 -7198 24298 -8366 -140601 -134018 -274282 -263484 -193665 -346915
16387 -346915 -232966 -123375 -268046 14525 237320 27662 18781 -37913 -76798 -225717
16377 -225717 -294862 -354544 -286128 -195652 -169507 174816 363770 169616 -28527 -128160 -200670
16366 -200670 -103259 -26662 -9015 -11048 -83837 22123 -109503 -198991 -38487 -69692 30459
16355 30459 145009 362584 153409 -206766 -336572 -55670 62602 65756 30268 -184431
16345 -184431 -281400 -293251 -292940 -217078 -76673 -13570 22757 138908 182256 227567 118208
16334 118208 280868 210470 -44675 -248075 -155054 151170 -134503 -452178 -173907 281535
16324 281535 257172 193548 174075 151920 168445 154120 156928 44224 27233 50807 116214
$$ packed form
16398b23226J83056M0824p852L1496l2664j32235O583j40264J0798O9819j53250
16387c46915J13949J09591j44671K82571K22795k09658q881n6694l8885j48919
16377b25717o9145n9682O8416R0476K6145L44323J88954j94154j98143r9633p2510
16366b00670R7411P6597J7647k033p2789J05960j31626q9488J60504l1205J00151
16355C0459J14550K17575k09175l60175j29806K80902J18272L154l5488k14699
16345a84431r6969j1851L11P5862J40405O3103L6327J16151M3348M5311j09359
16334A18208J62660p0398k55145k03400R3021L06224k85673l17675K78271M55442
16324B81535k4363o3624j9473k2155J6525j4325K808j12704j6991K3574O5407
$$ plain form
16313 116214 43748 94171 236184 272709 294661 60803 -40866 38641 113232 286166 274598
16302 274598 -33310 -31043 -35154 -221346 -46084 31472 160896 97367 105558 86928 43763
16291 43763 -25281 -204897 -437217 -521982 -417250 -228557 -169470 -133160 -241562 -183518 9018
16280 9018 118453 -9756 45321 295355 324461 109762 56945 -79864 -141712 -139939 84944
16269 84944 130163 -180314 -217928 -247893 -229529 -226339 -114277 -31593 -73202 -210320 -243077
16258 -243077 -369209 -443593 -159546 -30090 -266530 -455237 -243420 46660 91332 -156644
16248 -156644 -367614 -138493 2382 28862 120256 311713 563089 650934 546199 354151
16238 354151 76981 -76073 -192780 -236563 -84689 -198043 -200928 -113980 -248344 -165774
$$ packed form
16313A16214p2466N0423J42013L6525K1952k33858j01669P9507P4591J72934j1568
16302B74598l07908K267m111j86192J75262P7556J29424o3529Q191j8630m3165
16291D3763o9044j79616k32320q4765J04732J88693N9087L6310j08402N8044J92536
16280I018J09435j28209N5077K50034K9106k14699n2817j36809o1848J773K24883
16269H4944M5219l10477l7614k9965J8364L190J12062Q2684m1609j37118l2757
16258b43077j26132p4384K84047J29456k36440j88707K11817K90080M4672k47976
16248a56644k10970K29121J40875K6480R1394J91457K51376Q7845j04735j92048
16238C54151k77170j53054j16707m3783J51874j13354k885Q6948j34364Q2570
$$ plain form
16228 -165774 -216440 -117402 -14499 74864 56213 -56903 172392 441726 282878 104388
16218 104388 169066 190124 149194 -32015 -106752 -104268 42376 -213517 -340989 -210878 -239440
16207 -239440 -31874 -67429 -114644 -249964 -299049 -322888 -303498 -256277 -418306 -565194 -471674
16196 -471674 -344716 -297748 -189776 -67825 -119689 39358 77626 78480 -121000 -327836 -300644
16185 -300644 -144685 -98886 -78849 -68365 101726 122496 -95197 -98265 -73399 -100372 175830
16174 175830 247612 26140 -133463 225485 360112 310272 355139 114093 -66541 38359
16164 38359 35399 198161 366829 2631 -254478 -318040 -62004 -42270 175543 210047 52659
16153 52659 101659 130427 176575 112895 35177 -178407 -304414 -198291 -205616 -1511 194406
$$ packed form
16228a65774n0666R9038J02903Q9363j8651j13116K29295K69334j58848j78490
16218A04388O4678K1058m0930j81209p4737K484J46644k55893j27472J30111k8562
16207b39440K07566l5555m7215j35320m9085k3839J9390M7221j62029j46888R3520
16196d71674J26958M6968J07972J21951n1864J59047L8268Q54j99480k06836K7192
16185c00644J55959M5799K0037J0484J70091K0770k17693l068K4866k6973K76202
16174A75830P1782k21472j59603L58948J34627m9840M4867k41046j80634J04900
16164C8359k960J62762J68668l64198k57109o3562K56036J9734K17813L4504j57388
16153E2659M9000K8768M6148o3680p7718k13584j26007J06123p325K04105J95917
$$ plain form
16142 194406 68459 -63974 -241503 -227685 -269843 -167215 -226353 -315921 -258776 -71231
16132 -71231 110982 52772 -15130 -11284 193198 276645 -13102 -195920 -109062 -75617 61204
16121 61204 27719 142824 32717 -45046 139853 46807 -192235 -257660 -273984 -306902 -55711
16110 -55711 268665 191424 -70501 -192309 -297613 -303541 -168511 -135632 78344 117445 -35678
16099 -35678 -31946 271791 349630 340832 187383 185948 279529 100209 200441 30669 -287006
16088 -287006 -456767 -519232 -573146 -567203 -551212 -432937 -373106 -257746 -6557 78626 -81313
16077 -81313 8097 181886 407728 606061 400633 257410 141913 -27239 -43485 -11592
16067 -11592 40767 -36386 33654 128544 105213 138777 12808 1558 30137 -190504 -215044
$$ packed form
16142A94406j25947j32433j77529J3818m2158J02628n9138q9568N7145J87545
16132g1231J82213n8210o7902L846K04482Q3447k89747j82818Q6858L3445J36821
16121F1204l3485J15105j10107p7763J84899r3046k39042o5425j6324l2918K51191
16110e5711L24376p7241k61925j21808j05304n928J35030L2879K13976L9101j53123
16099c5678L732L03737P7839q798j53449j435R3581j79320J00232j69772l17675
16088b87006j69761o2465n3914N943J5991J18275N9831J15360K51189Q5183j59939
16077h1313Q9410J73789K25842J98333k05428j43223j15497j69152j6246L1893
16067a1592N2359p7153P0040R4890k3331L3564j25969j1250K8579k20641k4540
$$ plain form
16056 -215044 -242769 -160470 -32903 52869 -25798 -158773 -16295 80194 6459 -221247 -243825
16045 -243825 -336929 -427769 -237386 44011 208688 -147545 -221932 98452 12229 -166371
16035 -166371 -22073 48855 -178455 -293876 -79022 593 209240 231861 150350 144497 67088
16024 67088 -83879 -270873 -218296 -233690 -95515 30243 -60397 -53685 57093 -26922 -233359
16013 -233359 -142138 143376 101241 -215283 -341932 -173351 -262695 -287213 -59395 19286
16003 19286 75812 69308 -138566 -180979 -138433 -336147 -454143 -480269 -200303 -151147 -207294
15992 -207294 -199595 -179040 -288720 -223058 -367171 -305471 -342063 -173727 48555 207409 384547
15981 384547 456219 87559 -9435 -34997 -114547 -116885 -224540 -209410 5976 165739 167409
$$ packed form
16056b15044k7725Q2299J27567Q5772p8667j32975J42478R6489p3735k27706k2578
16045b43825r3104r0840J90383K81397J64677l56233p4387L20384q6223j78600
16035a66371J44298P0928k27310j15421K14854P9615K08647K2621q1511n853p7409
16024F7088j50967j86994N2577j5394J38175J25758r0640O712J10778q4015k06437
16013b33359R1221K85514m2135l16524j26649J68581q9344k4518K27818P8681
16003A9286N6526o504k07874m2413M2546j97714j17996k6126K79966M9156n6147
15992b07294P699K0555j09680O5662j44113O1700l6592J68336K22282J58854J77138
15981C84547P1672l68660r6994k5562p9550k338j07655J5130K15386J59763J670
$$ plain form
15970 167409 106682 119366 -249033 -271692 172924 359651 117920 177963 206407 169234 119296
15959 119296 -11996 -179114 -169883 -212622 -211743 -265112 -128597 -195626 -388712 -299116 -342488
15948 -342488 -374455 -309108 -316904 -65348 21941 -168129 -176088 -55463 -132395 -280778 -294809
15937 -294809 -64672 -43260 -170014 -144156 -25611 182700 160724 123003 290600 410614
15927 410614 268100 -33784 -70528 -13641 -97072 -173739 24188 -13589 -261582 -176753 -132862
15916 -132862 -243742 -119933 -188768 -92858 -107610 -218166 -36278 172279 209390 192482
15906 192482 92096 -30313 -184030 -150438 263374 340071 -82042 -388621 -454249 -287044
15896 -287044 -232601 -143848 41620 171201 334560 366891 414543 182462 -114116 -79860
$$ packed form
15970A67409o0727J2684l68399k2659M44616J86727k41731O0043K8444l7173m9938
15959A19296j31292j67118R231m2739Q79n3369J36515o7029j93086Q9596m3372
15948c42488l1967O5347p796K51556Q7289j90070p959J20625p6932j48383j4031
15937b94809K30137K1412j26754K5858J18545K08311k1976l7721J67597J20014
15927D10614j42514l01884l6744N6887q3431p6667J97927l7777k47993Q4829M3891
15916a32862j10880J23809o8835R5910j4752j10556J81888K08557L7111j6908
15906A92482j00386j22409j53717L3592M13812P6697m22113l06579o5628J67205
15896b87044N4443Q8753J85468J29581J63359L2331M7652k32081k96578L4256
$$ plain form
15886 -79860 -125982 -125552 -228247 -309421 -165960 -34180 -135213 -102584 -325062 -278126 -168198
15875 -168198 -186347 56080 35853 -16658 32610 154527 263665 215543 32001 70214 -15517
15864 -15517 -249066 -264077 -86939 -90543 -266150 -269348 -240638 -366855 -245824 -150146 -276054
15853 -276054 -321852 -252726 -312361 -308108 -236487 -237918 -215414 -350716 -319345 -67938 -114156
15842 -114156 -90610 41205 -206528 -341848 -295618 -83984 309415 546974 490585 292787
15832 292787 181293 229590 313135 351115 341149 7249 -295645 -491011 -404768 -453699 -231071
15821 -231071 -289261 -363287 -325006 -276697 -279313 -485630 -372742 -265301 -238551 -278485 -85153
15810 -85153 84598 107470 53709 29841 -608 -258814 -286556 -197920 -367979 -585898 -868792
$$ packed form
15886g9860m6122M30j02695q1174J43461J31780j01033L2629k22478M6936J09928
15875a68198j8149K42427k0227n2511M9268J21917J09138m8122j83542L8213q5731
15864a5517k33549j5011J77138l604j75607l198K8710j26217J21031R5678j25908
15853b76054m5798O9126n9635M253P1621j431K2504j35302L1371K51407m6218
15842a14156K3546J31815k47733j35320M6230K11634L93399K37559n6389j97798
15832B92787j11494M8297Q3545L7980r966l33900l02894j95366Q6243m8931K22628
15821b31071n8190p4026L8281M8309k616k06317J12888J07441K6750l9934J93332
15810h5153J69751K2872n3761k3868l0449k58206k7742Q8636j70059k17919k82894
$$ plain form
15799 -868792 -669617 -385320 -261575 -318442 -463051 -495124 -360704 -278777 -361365 -444626
15789 -444626 -122333 30363 -73055 -183433 -179765 -127931 42080 121628 147954 185105 162618
15778 162618 127143 269214 370184 275053 150351 195478 238162 260983 123514 -27993
15768 -27993 -10946 329665 323717 192896 91971 180460 105882 56315 -181333 -93768 -192321
15757 -192321 -250684 -3779 101413 77123 -44439 -92039 -249948 -290682 -65861 -61570 -383659
15746 -383659 -532267 -301842 -127364 -339693 -293478 -207169 -179430 -56496 -289988 -379325
15736 -379325 -227750 -249624 -370637 -439837 -315943 -212907 -168009 -336822 -378650 -250211
15726 -250211 60251 11049 -127872 64086 -65307 -140122 -179576 -315814 -363606 -455749
$$ packed form
15799h68792J99175K84297J23745n6867j44609l2073J34420Q1927q2588q3261
15789d44626L22293J52696j03418j10378L668N1834J70011P9548K6326L7151k2487
15778A62618l5475J42071J00970r5131j24702M5127M2684K2821j37469j51507
15768b7993J7047L40611n948j30821j00925Q8489p4578m9567k37648Q7565r8553
15757a92321n8363K46905J05192k4290j21562m7600j57909m0734K24821M291l22089
15746c83659j48608K30425J74478k12329M6215Q6309K7739J22934k33492q9337
15736c79325J51575k1874j21013o9200J23894J03036M4898j68813m1828J28439
15726b50211L10462m9202j38921J91958j29393p4815l9454j36238m7792r2143
$$ plain form
15716 -455749 -436067 -355481 -94136 -134758 -287089 -150058 -232750 -362638 -424421 -492822 -275622
15705 -275622 -259051 -189271 -119918 -116762 -7882 -150859 -300548 120072 223331 53549
15695 53549 -63778 2195 63702 -17625 -183013 -95125 -29007 -3861 61017 -60655 -188438
15684 -188438 -21438 207298 62597 -12786 231055 385993 168613 -123019 -334322 -512704
15674 -512704 -496682 -461498 -390755 -298478 -150539 -72181 75607 -166524 -151753 138717 286478
15663 286478 127298 55577 -147370 -69766 68176 153734 99889 125327 79654 34772 98990
15652 98990 224234 293718 30435 -330318 -477119 -333346 -300591 -249055 -31598 110120
15642 110120 143383 256062 230790 225977 57041 74974 -116071 -190715 -127875 -135584 -181178
$$ packed form
15716d55749J9682Q0586K61345m0622j52331J37031q2692j29888o1783o8401K17200
15705b75622J6571O9780O9353L156J08880j42977j49689M20620J03259j69782
15695E3549j17327O5973O1507q1327j65388Q7888O6118K5146O4878j21672j27783
15684a88438J67000K28736j44701p5383K43841J54938k17380k91632k11303j78382
15674e12704J6022L5184P0743R2277J47939P8358J47788k42131J4771K90470J47761
15663B86478j59180p1721k02947P7604J37942Q5558n3845K5438m5673m4882O4218
15652I8990J25244O9484k63283l60753j46801J43773L2755N1536K17457J41718
15642A10120L3263J12679k5272m813j68936J7933j91045p4644O2840p709m5594
$$ plain form
15631 -181178 -199376 -246672 -52246 -40239 -185301 -24095 -104796 -297402 -307427 -391143 -448306
15620 -448306 -241413 70197 -27096 -390734 -248840 -68498 -54773 -153153 59231 -118738
15610 -118738 -222738 -12389 -94393 -301109 -122770 -100561 -218373 -172420 -178150 -188538 -203378
15599 -203378 -160155 -108648 103223 80624 294819 238678 50607 -224255 -468213 -659672
15589 -659672 -673487 -529417 -308591 -64570 -82373 -268665 -81101 396276 513456 365255
15579 365255 100700 -39500 126428 17864 -139136 -337109 -330729 -400121 -270215 -172948
15569 -172948 -107571 129940 49362 -93569 -235448 -342833 -470286 -350141 -52903 157065
15559 157065 77896 38587 173246 -21113 -287439 -280156 -46617 -40553 -4909 98347 7221
$$ packed form
15631a81178j8198m7296J94426J2007j45062J61206q0701j92606j0025q3716n7163
15620d48306K06893L11610r7293l63638J41894J80342J3725r8380K12384j77969
15610a18738j04000K10349q2004k06716J78339K2209j17812M5953n730j0388j4840
15599b03378M3223N1507K11871k2599K14195n6141j88071k74862k43958j91459
15589f59672j3815J44070K20826K44021j7803j86292J87564M77377J17180j48201
15579C65255k64555j40200J65928j08564j57000j97973O380o9392J29906R7267
15569a72948O5377K37511q0578j42931j41879j07385j27453J20145K97238K09968
15559A57065p9169l9309J34659j94359k66326P283K33539O064L5644J03256r1126
$$ plain form
15548 7221 -203872 -160921 -167526 -105375 -54744 -22981 65663 40978 154974 852 -100234
15537 -100234 -118846 132386 116330 -74403 -108091 45715 278528 76936 -78152 -76169
15527 -76169 -178697 -339603 -82856 -201282 -430801 -370322 -152028 187006 80750 -116912
15517 -116912 -271964 -508979 -348602 -47796 179243 148759 -68705 -176616 -100470 -176008
15507 -176008 -140419 37511 -176594 -426622 -411424 -356202 -321590 -193222 -497780 -400116
15497 -400116 -218230 -188732 91027 51837 -188791 -621456 -733402 -752632 -702524 -478703
15487 -478703 -343837 -184982 -474763 -445692 -469296 -540500 -668131 -671869 -250238 -16649
15477 -16649 -318559 -376344 2846 97588 -50077 -88754 -125075 -272554 -308574 -277838 -268253
$$ packed form
15548G221k11093M2951o605O2151N0631L1763Q8644k4685J13996j54122j01086
15537a00234j8612K51232j6056j90733l3688J53806K32813k01592j55088J983
15527g6169j02528j60906K56747j18426k29519O0479K18294L39034j06256j97662
15517a16912j55052k37015J60377L00806K27039l0484k17464j07911P6146p5538
15507a76008L5589J77930k14105k50028J5198N5222L4612J28368l04558R7664
15497d00116J81886K9498K79759l9190k40628m32665j11946j9230N0108K23821
15487d78703J34866J58855k89781K9071k3604p1204j27631l738M21631K33589
15477a6649l01910n7785L79190R4742j47665l8677l6321j47479l6020L0736R585
$$ plain form
15466 -268253 -7949 -208936 -387827 -406499 -195419 -91482 -201161 -158718 -244740 -14963
15456 -14963 28781 -55017 -217975 -108516 -34405 -76314 -207906 -163951 173919 240580 100976
15445 100976 36119 -7874 -78496 -318708 -443053 -336055 -263356 -160974 -323174 -381178
15435 -381178 -246482 69367 312565 245900 97853 -143085 143554 196946 -20868 -53456
15425 -53456 144013 57333 -52499 -287528 -522697 -530274 -521366 -390123 -525255 -577807 -329492
15414 -329492 -177993 -108430 -46510 -129605 -406677 -365295 -317301 -213621 -236827 -433779 -424783
15403 -424783 -418017 -267591 -359271 -484299 -79909 -54229 -24132 -31292 81343 -65577 -117463
15392 -117463 -101376 40125 75184 34963 -269840 -284010 -20026 29183 69158 77143 -17526
$$ packed form
15466b68253K60304k00987j78891j8672K11080J03937j09679M2443q6022K29777
15456a4963M3744q3798j62958J09459P4111m1909j31592M3955L37870O6661j39604
15445A00976o4857m3993p0622k40212j24345J06998P2699J02382j62200n8004
15435c81178J34696L15849K43198o6665j48047k40938K86639N3392k17814l2588
15425e3456J97469q6680j09832k35029k35169p577Q908J31243j35132n2552K48315
15414c29492J51499O9563O1920q3095k77072M1382M7994J03680k3206j96952Q996
15403d24783O766J50426r1680j25028M04390K5680L0097p160J12635j46920n1886
15392a17463J6087J41501L5059m0221l04803j4170K63984M9209L9975P985r4669
$$ plain form
15381 -17526 -174685 -475895 -511134 -261839 -132340 -31811 -48970 -120148 115797 304372
15371 304372 331189 204372 106744 39794 11863 36003 171026 209185 194037 45603 136623
15360 136623 125845 12020 -79221 -226049 -366288 -369192 -148208 -42822 -25784 23391 -79453
15349 -79453 -133514 -193477 -180733 -200456 33961 136100 -49196 -32656 -36210 -308762 -235257
15338 -235257 3980 63652 32116 161501 -108961 -281554 -157542 -178810 -299440 -273125
15328 -273125 -303270 -235798 -316408 -122630 40537 99598 -165773 -36899 129799 77280
15318 77280 -182783 -190159 -76377 -216933 -124362 -104502 -140697 -102181 113341 141660 14211
15307 14211 14382 -90717 9396 332945 496420 309086 -72196 -159694 61809 -14707 -182483
$$ packed form
15381a7526j57159l01210l5239K49295J29499J00529j7159p1178K35945J88575
15371C04372K6817j26817r7628o6950k7931K4140J35023L8159j5148j48434R1020
15360A36623j0778j13825r1241j46828j40239k904K20984J05386J7038M9175j02844
15349g9453n4061n9963J2744j9723K34417J02139j85296J6540l554k72552P3505
15338b35257K39237N9672l1536J29385k70462j72593J24012k1268j20630K6315
15328b73125l0145O7472q0610J93778J63167N9061k65371J28874J66698n2519
15318G7280k60063p376J13782j40556R2571J9860l6195L8516K15522K8319j27449
15307A4211J71j05099J00113L23549J63475j87334l81282q7498K21503p6516j67776
$$ plain form
15296 -182483 -354405 -332848 -33615 1053 35088 79307 80417 -127249 -57653 108821 31735
15285 31735 -104594 -253377 -213673 -86450 -174365 -221627 -147109 -19754 24435 2562 101478
15274 101478 331917 103069 -215938 -161897 -10333 -65681 25811 -16731 -206791 -344117
15264 -344117 -148204 -94762 106338 310194 428718 274500 278212 -15122 -20290 7616 -20699
15253 -20699 -206777 -281869 -397188 -435383 -273325 -293067 -171813 -134183 -75994 102676 254810
15242 254810 258674 326529 357057 298583 180080 201543 148843 86510 81755 -147050 -236131
15231 -236131 -240633 -255564 -238053 -215693 -267687 -303242 -305341 -85152 168033 192671 38482
15220 38482 -15261 -4362 -265200 -167915 -102040 -219361 -162749 -64514 -23322 -101179 124
$$ packed form
15296a82483j71922K1557K99233L4668L4035M4219J110k07666O9596J66474p7086
15285C1735j36329j48783L9704J27223q7915m7262P4518J27355M4189k1873R8916
15274A01478K30439k28848l19007N4041J51564n5348R1492m2542j90060j37326
15264c44117J95913N3442K01100K03856J18524j54218L712k93334n168K7906k8315
15253b0699j86078p5092j15319l8195J62058j9742J21254L7630N8189J78670J52134
15242B54810L864O7855L0528n8474j18503K1463n2700o2333m755k28805q9081
15231b36131m502j4931J7511K2360n1994l5555k099K20189K53185K4638j54189
15220C8482n3743J0899k60838R7285O5875j17321N6612R8235M1192p7857J01303
$$ plain form
15209 124 178808 465597 347885 90487 51581 -83192 -110537 -115940 -220811 -101302 48212
15198 48212 97189 69295 -98903 -70882 -165385 -256538 -234227 -169868 -19075 162455 66895
15187 66895 -73535 -11149 -7598 -155028 -470702 -529164 -233488 34758 114686 88325 -78918
15176 -78918 -98264 122482 271302 214974 119525 33648 -11532 -332067 -379166 -166736 -157642
15165 -157642 -203640 -15949 85536 175622 300918 117903 -122195 -392270 -369982 -77129
15155 -77129 175808 42739 -161946 -375953 -355696 -275148 -214232 -209432 -65500 141610 188661
15144 188661 320204 246233 88691 111110 166922 63915 90616 -4913 190798 362083
15134 362083 292922 125369 76 77953 37670 140409 388994 257800 4136 -256323
$$ packed form
15209A24J78684K86789j17712k57398l8906j34773k7345n403j04871J19509J49514
15198D8212M8977k7894j68198K8021r4503r1153K2311O4359J50793J81530r5560
15187F6895j40430O2386L551j47430l15674n8462K95676K68246P9928k6361j67243
15176g8918j9346K20746J48820n6328r5449q5877m5180l20535m7099K12430R094
15165a57642m5998J87691J01485R0086J25296j83015k40098k70075K2288K92853
15155g7129K52937j33069k04685k14007K0257Q0548O0916M800J43932K07110M7051
15144A88661J31543p3971j57542K2419N5812j03007K6701r5529J95711J71285
15134C62083o9161j67553j25293P7877m0283J02739K48585j31194k53664k60459
$$ plain form
15124 -256323 -362508 -197095 -67391 -216383 -80399 -27415 -99051 5998 1053 -138195
15114 -138195 -224154 -165242 -1116 176080 460470 685269 457724 282920 165760 157982
15104 157982 44762 20713 -88507 -38875 -214073 -347986 -256006 -92698 -36891 56265
15094 56265 151078 162148 35872 20090 -23649 -48679 -244335 -305241 -307295 -460763 -355842
15083 -355842 -284179 -275819 -200929 -256805 -154270 99521 7032 -164160 28663 132627 337159
15072 337159 164220 -223754 -186855 -67758 -67028 -106426 -266385 -348163 -147468 -92675 97866
15061 97866 -126728 -357732 -194733 18336 133130 -53731 -22711 172770 97414 -5705
15051 -5705 -336693 -410480 -442321 -419774 -220204 -137196 -188308 -239252 -102724 -27103 29121
$$ packed form
15124b56323j06185J65413J29704j48992J35984N2984p1636J05049m945j39248
15114a38195q5959N8912J64126J77196K84390K24799k27545j74804j17160p778
15104A57982j13220k4049j09220M9632j75198j33913R1980J63308N5807R3156
15094E6265R4813J1070j26276j5782m3739k5030j95656o0906k054j53468J04921
15083c55842P1663Q360P4890n5876J02535K53791r2489j71192J92823J03964K04532
15072C37159j72939l87974L6899J19097P30l9398j59959q1778K00695N4793J90541
15061I7866k24594k31004J62999K13069J14794j86861L1020J95481p5356j03119
15051e705l30988p3787l1841K2547J99570Q3008n1112n0944J36528P5621N6224
$$ plain form
15040 29121 -3455 -101506 -80484 64733 163363 190071 105496 -15013 -16304 30643 -98445
15029 -98445 14128 317757 378229 -68572 -247496 -204257 -247656 -212316 -372512 -528967
15019 -528967 -580735 -405022 -514588 -397537 -164742 56370 -149219 -336770 -315385 -267827
15009 -267827 -125973 -212689 -49267 88800 -34433 -92468 -184159 -234264 -177698 -70746
14999 -70746 3591 76944 10109 -69496 -220543 -288105 -417441 -380599 -231830 -123877 -185361
14988 -185361 -274505 -225912 -116413 -20280 -51352 -132984 -251812 -8376 78299 27093 191999
14977 191999 152219 94678 -13851 -65995 -89055 -255745 -73126 17266 285943 270252 60470
14966 60470 161865 253974 -18140 -134389 37833 -82578 -363828 -662147 -685741 -420406
$$ packed form
15040B9121l2576r8051K1022J45217R8630K6708q4575j20509j291M6947j29088
15029i8445J12573L03629O0472m46801j78924M3239m3399L5340j60196j56455
15019e28967n1768J75713j09566J17051K32795K21112k05589j87551K1385M7558
15009b67827J41854q6716J63422J38067j23233n8035r1691n0105N6566J06952
14999g0746P4337P3353o6835p9605j51047o7562j29336L6842J48769J07953o1484
14988a85361q9144M8593J09499R6133l1072q1632j18828K43436Q6675n1206J64906
14977A91999l9780n7541j08529n2144k3060j66690J82619R0392K68677j5691k09782
14966F0470J01395R2109k72114j16249J72222j20411k81250k98319k3594K65335
$$ plain form
14956 -420406 -66366 -11103 -189365 -1899 24445 -148922 -95542 -140082 -230505 -119202
14946 -119202 -34705 -129611 -137873 29038 -49696 -160324 -65291 -22314 84787 106850 42892
14935 42892 45009 -147634 -197814 -243454 -103150 23024 -135601 -144396 -54823 53991 56198
14924 56198 -93107 -162878 -257119 -320739 -238291 -88636 -189999 -53342 78128 416261
14914 416261 365721 61305 -75632 -300082 -435407 -49857 242425 307820 322255 175661
14904 175661 -36478 -71666 -49532 -49508 133852 388267 341226 157815 -56352 -395035 -379983
14893 -379983 -114769 -23034 -48068 -35411 -171355 -241300 -273663 -205145 -295162 -270378 -459121
14882 -459121 -677154 -587744 -339518 -232965 -172457 -75853 -319544 -368736 -541658 -460945
$$ packed form
14956d20406L54040N5263j78262J87466K6344j73367N3380m4540r0423J11303
14946a19202Q4497r4906q262J66911p8734j10628R5033M2977J07101K2063o3958
14935D2892K117j92643n0180m5640J40304J26174j58625q795Q9573J08814K207
14924E6198j49305o9771r4241o3620Q2448J49655j01363J36657J31470L38133
14914D16261n0540l04416j36937k24450j35325L85550K92282O5395J4435j46594
14904A75661k12139l5188K2134K4J83360K54415m7041j83411k14167l38683J5052
14893c79983K65214R1735k5034J2657j35944o9945l2363O8518r0017K4784j88743
14882d59121k18033Q9410K48226J06553O0508R6604k43691m9192j72922Q0713
$$ plain form
14872 -460945 -389976 -425901 -419791 -490358 -410346 -250791 -234110 -392186 -386481 -228079 -293332
14861 -293332 -228159 37407 34414 -112111 -108045 236891 437092 345445 156769 230447 273835
14850 273835 4550 98954 131930 185046 247537 14157 -69164 -180943 -469786 -573020
14840 -573020 -310661 -60572 -57982 49981 117330 232311 199564 196262 185844 175083 230158
14829 230158 415928 472611 425926 323863 322626 126556 110902 -128903 -334414 -308736 -251642
14818 -251642 -214117 -383651 -277728 -170711 -273973 -419691 -83372 14216 82819 68861
14808 68861 22894 55425 -112237 -194897 37584 119422 30305 125124 -53191 -163411 -179590
14797 -179590 -32332 179626 126347 -8065 -92758 -193675 -72789 -185763 -232420 -226650
$$ packed form
14872d60945P0969l5925O110p0567Q0012J59555J6681j58076N705J58402o5253
14861b93332O5173K65566k993j46525M066L44936K00201r1647j88676P3678M3388
14850B73835k69285R4404L2976N3116O2491k33380q3321j11779k88843j03234
14840e73020K62359K50089K590J07963O7349J14981l2747l302j0418j0761N5075
14829B30158J85770N6683m6685j02063j237j96070j5654k39805k05511K5678N7094
14818b51642L7525j69534J05923J07017j03262j45718L36319R7588O8603j3958
14808F8861m5967L2531j67662q2660K32481Q1838q9117R4819j78315j10220j6179
14797a79590J47258K11958n3279j34412q4693j00917J20886j12974m6657N770
$$ plain form
14787 -226650 -107965 23746 -115642 -277061 -22280 161249 297740 248153 100821 387235
14777 387235 183906 -36981 -56405 -537 -261567 -189825 -195633 -183517 17604 -19859 -185617
14766 -185617 -197058 -352489 -184599 12602 -232118 23563 171556 3831 -180483 -124168
14756 -124168 -360260 -297428 -218621 -244061 -395358 -43228 147326 78609 -10044 -104673 -288521
14745 -288521 -355342 -275053 -11464 111804 128886 42581 -29584 -192510 -334826 -287865 -258544
14734 -258544 -350813 -410575 -457072 -343157 -240843 -151902 -129884 -208045 -257463 -209946 -95872
14723 -95872 -193233 -430933 -480413 -292565 -177601 -83359 26689 -167031 -236913 -101180
14713 -101180 -35113 -174348 -474008 -424822 -287318 -230353 -152144 -120685 -149230 -197936 -59557
$$ packed form
14787b26650J18685J31711j39388j61419K54781J83529J36491m9587j47332K86414
14777C87235k03329k20887j9424N5868k61030P1742n808J2116K01121l7463j65758
14766a85617j1441j55431J67890J97201k44720K55681J47993j67725j84314N6315
14756a24168k36092O2832P8807k5440j51297L52130J90554o8717q8653r4629j83848
14745b88521o6821Q0289K63589J23268J7082q6305p2165j62926j42316M6961K9321
14734b58544r2269n9762m6497J13915J02314Q8941K2018p8161m9418M7517J14074
14723i5872r7361k37700m9480J87848J14964R4242J10048j93720o9882J35733
14713a01180O6067j39235k99660M9186J37504N6965P8209L1459k8545m8706J38379
$$ plain form
14702 -59557 -40815 -218304 -214942 -361529 -482839 -310363 169842 295786 279030 55228
14692 55228 140801 146902 25851 230349 142866 148737 55303 -58017 -46049 -166094 -487120
14681 -487120 -374274 -270429 -366286 -519507 -375716 -256445 -229086 -52848 -187012 -259426
14671 -259426 -378897 -512645 -405601 -396403 -284107 -7369 84349 7205 -114541 -82518
14661 -82518 26096 37971 -62628 -102771 -75021 -170813 -44964 6661 -66468 -83888 -74071
14650 -74071 4054 199315 283959 53946 -107250 -69181 -215349 -571326 -638793 -857996
14640 -857996 -726643 -581226 -615997 -513038 -420001 -291252 -244800 -75690 -145950 -100335
14630 -100335 14531 77427 45851 -26405 -102656 -182174 -283976 -440687 -351173 -302234 -291475
$$ packed form
14702e9557J8742j77489L362j46587j21310J72476M80205J25944j6756k23802
14692E5228Q5573O101j21051K04498q7483N871r3434j13320J1968j20045l21026
14681d87120J12846J03845r5857j53221J43791J19271K7359J76238j34164p2414
14671b59426j19471j33748J07044R198J12296K76738R1718p7144j21746L2023
14661h2518J08614J1875j00599m0143K7750r5792J25849N1625p3129j7420R817
14650g4071P8125J95261Q4644k30013j61196L8069j46168l55977o7467k19203
14640h57996J31353J45417l4771J02959R3037J28749M6452J69110p0260M5615
14630a00335J14866O2896l1576p2256p6251p9518j01802j56711Q9514M8939J0759
$$ plain form
14619 -291475 34117 33169 -31557 147371 172277 192371 186593 -61363 -136903 -58839 -34234
14608 -34234 -167856 -343051 -156729 -39128 -106395 -129796 73383 249189 247207 214260 -134286
14597 -134286 -377895 -351571 -341912 -328296 -64337 48306 -94545 -67225 -169381 -222931 -256309
14586 -256309 -172473 16207 222079 89987 -125695 -17891 77522 28779 9858 17464 -65022
14575 -65022 -255984 -431135 -537297 -448467 -157239 180581 295316 155033 131347 169548
14565 169548 222383 421496 247977 60997 131621 35376 -55953 6094 326359 498885
14555 498885 513015 278554 63408 5759 22586 -156962 -341635 -276500 -189 193053
14545 193053 237059 276538 186116 -78769 -47390 89202 -60004 -135279 -119038 -60240 76578
$$ packed form
14619b91475L25592r48o4726J78928K4906K0094n778k47956p5540P8064K4605
14608c4234j33622j75195J86322J17601o7267k3401K03179J75806j982l2947l48546
14597a34286k43609K6324R659J3616K63959J12643j42851K7320j02156n3550l3378
14586b56309Q3836J88680K05872j32092k15682J07804R5413m8743j8921P606q2486
14575f5022j90962j75151j06162Q8830K91228L37820J14735j40283k3686L8201
14565A69548N2835J99113j73519j86980P0624r6245r1329O2047L20265J72526
14555D98885J4130k34461k15146n7649J6827j79548j84673O5135K76311J93242
14545A93053M4006L9479r0422k64885L1379J36592j49206p5275J6241N8798J36818
$$ plain form
14534 76578 -98687 -259716 -323987 -164818 -18527 131617 248654 195357 -37689 135381
14524 135381 234306 396922 304402 75937 -22593 179859 220780 -60264 -184220 -55537
14514 -55537 -10817 -4019 112100 336907 413244 418470 232376 15744 -151981 -207925 -248208
14503 -248208 -272333 -33945 163474 204176 -18721 -285833 -205481 -132877 -192640 -247004 -170920
14492 -170920 -265471 -246869 -72344 -113888 -551835 -723550 -650623 -398540 -110686 -68912
14482 -68912 -50733 -128564 -39188 -46460 -102841 -170330 -322702 -161306 -80651 -5567 -123908
14471 -123908 -339067 -377310 -383275 -396750 -300609 -193361 -294150 -278934 -84919 -23675 97412
14460 97412 42173 -61537 -169996 -63703 -77987 -325034 -416167 -434733 -283962 -185603 -180379
$$ packed form
14534G6578j75265j61029o4271J59169J46291J50144J17037n3297k33046J73070
14524A35381R8925J62616r2520k28465r8530K02452M0921k81044j23956J28683
14514e5537M4720O798J16119K24807P6337N226j86094k16632j67725n5944m0283
14503b48208k4125K38388J97419M0702k22897k67112Q0352P2604n9763n4364P6084
14492a70920r4551J8602J74525m1544m37947j71715P2927K52083K87854M1774
14482f8912J8179p7831Q9376p272n6381o7489j52372J61396Q0655P5084j18341
14471a23908k15159l8243n965j3475R6141J07248j00789J5216J94015O1244J21087
14460I7412n5239j03710j08459J06293j4284k47047r1133j8566J50771R8359N224
$$ plain form
14449 -180379 -78491 -76252 -94344 -51558 -462658 -705960 -508285 -440132 -251934 102871
14439 102871 -98103 -307579 -355633 -350985 -291299 -475127 -510391 -394233 -544171 -213242
14429 -213242 22280 101362 118139 -142672 -149007 -32959 -6603 -139992 -260198 -225274 96153
14418 96153 308989 168279 -89549 -231361 -188869 -223524 -157254 -309721 -480886 -460859
14408 -460859 -309735 -211648 -341461 -248226 21742 124947 45144 96998 256019 273901
14398 273901 41449 -87308 -75766 -78849 -231276 -116872 79419 33033 54235 154270
14388 154270 10330 -47697 73102 110401 28877 94846 134393 -102324 -302402 -160669
14378 -160669 15662 94890 66787 -68970 -140838 -294136 -180881 -279073 -332252 -399190 -88554
$$ packed form
14449a80379J01888K239j8092M2786m11100k43302J97675O8153J88198L54805
14439A02871k00974k09476m8054M648N9686j83828l5264J16158j49938L30929
14429b13242K35522P9082J6777k60811o335J16048K6356j33389j20206L4924L21427
14418I6153K12836j40710k57828j41812M2492l4655O6270j52467j71165K0027
14408d60859J51124R8087j29813R3235K69968J03205p9803N1854J59021J7882
14398B73901k32452j28757J1542l083j52427J14404J96291m6386K1202J00035
14388A54270j43940n8027J20799L7299q1524O5969L9547k36717k00078J41733
14378a60669J76331P9228k8103j35757p1868j53298J13255r8192n3179o6938L10636
$$ plain form
14367 -88554 47108 -10960 15853 -115326 -353602 -581429 -403873 -141152 -156745 -344330
14357 -344330 -515476 -369796 -229972 -441140 -577932 -216576 -101262 -190416 -180772 -269792
14347 -269792 -403325 -304898 -85137 -93867 -233852 -320293 -455829 -524768 -416995 -341046 -375580
14336 -375580 -208873 -327050 -217819 -182761 -61727 92747 -88894 -414568 -532742 -417515
14326 -417515 -242078 -207198 -36599 -175709 -366264 -177367 -104654 -119256 -221763 -442509
14316 -442509 -453958 -447056 -258071 -1046 -4454 -117425 -170249 -277137 -95160 53410 104676
14305 104676 327163 426967 384879 -11642 -193185 -247605 -306615 -225503 -156218 -239346 -167053
14294 -167053 89202 346201 268249 218342 87061 71974 237945 152950 75300 61815 -83224
$$ packed form
14367h8554J35662n8068K6813j31179k38276k27827J77556K62721j5593j87585
14357c44330j71146J45680J39824k11168j36792L61356J15314q9154R644q9020
14347b69792j33533R8427K19761q730j39985q6441j35536o8939J07773P5949l4534
14336c75580J66707j18177J09231L5058J21034J54474j81641l25674j18174J15227
14326d17515J75437L4880J70599j39110j90555J88897P2713j4602j02507k20746
14316d42509j1449O902J88985K57025l408j12971n2824j06888J81977J48570N1266
14305A04676K22487R9804m2088l96521j81543n4420n9010Q1112O9285q3128P2293
14294a67053K56255K56999p7952m9907j31281j5087J65971q4995p7650j3485j45039
$$ plain form
14283 -83224 -84950 -75730 90637 195305 268775 -31794 -155750 -160560 -108931 -19391 44389
14272 44389 284859 287573 486882 484501 271889 -44677 73881 63758 233830 287067 285120
14261 285120 506543 698184 486619 187050 77960 168621 77712 143064 182303 140313
14251 140313 118034 92773 75318 -172167 -61026 83509 245274 334806 291156 171408
14241 171408 25692 66222 42150 197731 252041 170749 85629 90823 28155 5362 9371
14230 9371 41170 -29652 -53590 -97279 130854 267055 128411 37434 24196 60139 149306
14219 149306 -32762 -205241 -163604 -32684 8479 -64300 -135082 65007 12814 -171512
14209 -171512 -212440 -359043 -444444 -251498 -263535 -176980 132275 109599 -130782 -396712
$$ packed form
14283h3224j726R220J66367J04668P3470l00569j23956m810N1629Q9540O3780
14272D4389K40470K714J99309k381k12612l16566J18558j0123J70072N3237j947
14261B85120K21423J91641k11565k99569j09090R0661r0909O5352L9239m1990
14251A40313k2279k5261j7455k47485J11141J44535J61765Q9532m3650j19748
14241A71408j45716M0530k4072J55581N4310q1292q5120N194o2668k2793M009
14230I371L1799p0822k3938m3689K28133J36201j38644r0977j3238L5943Q9167
14219A49306j82068j72479M1637J30920M1163p2779p0782K00089n2193j84326
14209a71512m0928j46603q5401J92946j2037Q6555L09255k2676k40381k65930
$$ plain form
14199 -396712 -365683 -204329 -69972 -212641 -229742 -306298 -243665 -104946 -113798 -64980 -113297
14188 -113297 -268957 -230468 -175885 -318735 -450780 -517480 -368545 -425574 -267124 -246180
14178 -246180 -401849 -312454 -142648 -277229 -273341 -155874 279 234089 268874 -3658
14168 -3658 -98939 -92336 29126 155646 82922 -94633 -141001 -313099 -272703 -34544 196373
14157 196373 271407 240929 149277 19385 -128502 -222084 -160088 35454 -185534 -146430 -150499
14146 -150499 -47528 -165320 -146963 -472722 -587906 -547727 -299403 -6958 194371 354210
14136 354210 311303 26875 -204507 -307355 -71651 6051 -298893 -409427 -129327 -180933
14126 -180933 -112686 -114232 -220113 -232630 -53281 -120242 513 -58921 -401402 -208108 36790
$$ packed form
14199c96712L1029J61354J34357j42669j7101p6556O2633J38719q852M8818m8317
14188a13297j55660L8489N4583j42850j32045o6700J48935n7029J58450K0944
14178b46180j55669Q9395J69806j34581L888J17467J56153K33810L4785k72532
14168c658r5281O603J21462J26520p2724j77555m6368j72098M0396K38159K30917
14157A96373P5034l0478r1652j29892j47887r3582O1996J95542k20988L9104m069
14146a50499J02971j17792J8357l25759j15184M0179K48324K92445K01329J59839
14136C54210m2907k84428k31382j02848K35704P7702l04944j10534K80100n1606
14126a80933O8247j546j05881j2517J79349o6961J20755n9434l42481J93294K44898
$$ plain form
14115 36790 195005 119788 -186699 -405672 -275938 -55167 105358 122733 -12446 -83778
14105 -83778 -231943 -100253 140665 133414 54896 -125120 -78329 101806 312737 238168 -89701
14094 -89701 -287475 108713 260759 83876 -57543 -152955 -211765 -168603 -156061 45549
14084 45549 43237 -128575 66786 -947 -187240 -25527 -126041 -213558 -91794 22093
14074 22093 32759 225278 233901 158452 17485 -95183 -56656 -97222 55586 217742 135862
14063 135862 -46593 -22052 113998 182248 195456 168125 -136977 -289690 -307336 -208338 -315007
14052 -315007 -351311 -152919 27363 121739 164830 9689 -220300 -231021 -50467 78667
14042 78667 210028 300412 365385 399042 418424 603148 408690 -65370 -185479 -216883 -270326
$$ packed form
14115C6790J58215p5217l06487k18973J29734K20771J60525J7375j35179p1332
14105h3778j48165J31690K40918p251p8518j80016M6791J80135K10931p4569l27869
14094h9701j97774L96188J52046j76883j41419r5412n8810M3162J2542K01610
14084D5549k312j71812J95361o7733j86293J61713j00514q7517J21764J13887
14074B2093J0666J92519Q623p5449j40967j12668L8527m0566J52808J62156q1880
14063A35862j82455K4541J36050O8250J3208k7331l05102j52713j7646R8998j06669
14052c15007l6304J98392J80282R4376M3091j55141k29989j0721J80554J29134
14042G8667J31361R0384O4973L3657J9382J84724j94458m74060j20109l1404n3443
$$ plain form
14031 -270326 -113560 -26404 -226907 -253155 -313545 -320482 -359946 -288555 -138967 -141161 -324721
14020 -324721 -126496 -63607 -294450 -491951 -515591 -213573 -198129 -117227 22551 159044
14010 159044 16313 36650 71227 16082 -147610 -82031 -197776 -153590 -90401 -89088 -205759
13999 -205759 -94804 -552 39392 80020 158613 402366 301693 152263 139240 86634 144856
13988 144856 110808 130810 87152 314777 334837 228580 177277 142522 -148209 -264123 -352648
13977 -352648 -410725 -182660 -234318 -242653 -45870 85696 -63168 -69011 194690 251125 81578
13966 81578 106447 234135 190644 117210 155097 -9433 -132095 -320037 -254191 -124860 -110403
13955 -110403 -217710 -26392 95793 201596 222567 219025 207749 93376 -100641 -106609 149778
$$ packed form
14031b70326J56766Q7156k00503k6248o0390o937l9464P1391J49588k194j83560
14020c24721J98225O2889k30843j97501k3640L02018J5444Q0902J39778J36493
14010A59044j42731K0337L4577n5145j63692O5579j15745M4186O3189J313j16671
13999b05759J10955R4252L9944M0628P8593K43753j00673j49430j3023n2606N8222
13988A44856l4048K0002m3658K27625K0060j06257n1303l4755k90731j15914q8525
13977c52648n8077K28065n1658q335J96783J31566j48864n843K63701N6435j69547
13966H1578K4869J27688m3491p3434L7887j64530j22662j87942O5846J29331J4457
13955a10403j07307J91318J22185J05803K0971l542j1276j14373j94017n968K56387
$$ plain form
13944 149778 317763 121083 66282 113802 206019 6875 4460 74569 44924 405411 554975
13933 554975 464875 577691 640322 376490 297788 364978 261558 18767 -104076 138489
13923 138489 452098 302649 183060 420977 552850 702660 567777 543739 482402 522413
13913 522413 730203 1037411 1023378 1109979 1304682 1180260 1192350 1282491 1354600 1510044
13903 1510044 1502747 1553545 1564032 1600912 1602814 1641359 1865252 2165845 2318791 2516604 2343156
13892 2343156 2216056 2220357 2195709 2422353 2524430 2449479 2549826 2675555 2572557 2536070
13882 2536070 2747475 3114259 3116879 3100026 2903086 3004124 3045735 3002840 3190245 3176320
13872 3176320 3159140 3248158 3205538 3220329 3315497 3478612 3608557 3480100 3545352 3752361
$$ packed form
13944A49778J67985j96680n4801M7520R2217j99144k415P0109k9645L60487J49564
13933E54975r0100J12816O2631k63832p8702O7190j03420k42791j22843K42565
13923A38489L13609j49449j19589K37917J31873J49810j34883k4038o1337M0011
13913E22413K07790L07208j4033Q6601J94703j24422J2090R0141P2109J55444
13903A510044p297N0798J0487L6880J902L8545K23893L00593J52946J97813j73448
13892B343156j27100M301k4648K26644J02077p4951J00347J25729j02998l6487
13882B536070K11405L66784K620j6853j96940J01038M1611m2895J87405j3925
13872C176320j7180Q9018m2620J4791R5168J63115J29945j28457O5252K07009
$$ plain form
13862 3752361 3691079 3634581 3551137 3482886 3512238 3449927 3281573 3294935 3504633 3656598 3777984
13851 3777984 3789233 3594345 3372973 3579196 3560944 3313834 3079451 3007946 2939573 2618392
13841 2618392 2564348 2818946 3008434 3125616 2952800 2988119 2884133 2765846 2647876 2586431
13831 2586431 2595504 2503249 2257696 2139096 2091269 2115848 2249707 2338408 2275977 2005594 1809630
13820 1809630 1829563 1682998 1485556 1223152 1333015 1203423 1190022 1371754 1448284 1093999
13810 1093999 987380 1150723 1061363 740607 651412 829737 702902 645909 509396 469053
13800 469053 599856 652113 534706 440816 307960 450807 369110 405987 412890 346715 521202
13789 521202 654315 567758 442927 527228 592437 425383 318548 423802 348407 220573
$$ packed form
13862C752361o1282n6498q3444o8251K9352o2311j68354J3362K09698J51965J21386
13851C777984J1249j94888k21372K06223j8252k47110k34383p1505o8373l21181
13841B618392n4044K54598J89488J17182j72816L5319j03986j18287j17970o1445
13831B586431R073r2255k45553j18600m7827K4579J33859Q8701o2431k70383j95964
13820A809630J9933j46565j97442k62404J09863j29592j3401J81732P6530l54285
13810A093999j06619J63343q9360l20756q9195J78325j26835n6993j36513m0343
13800D69053J30803N2257j17407r3890j32856J42847q1697L6877O903o6175J74487
13789E21202J33113q6557j24831Q4301O5209j67054j06835J05254p5395j27834
$$ plain form
13779 220573 327000 357947 447243 777593 654783 315198 216713 204693 371008 298961
13769 298961 237786 341354 480030 201964 193517 359473 476172 271545 126576 337765
13759 337765 537472 484759 343368 75099 -167860 -380617 -323810 -254508 -378724 -350973
13749 -350973 -65910 97047 99634 160186 254660 404581 488711 166019 360000 523288
13739 523288 653563 679916 709734 753641 529358 462281 571397 575372 476861 286211 147449
13728 147449 234810 144008 117908 89087 -24165 67493 14506 107540 98416 7372 142062
13717 142062 175488 428235 522259 348544 77548 -52498 24966 232783 99791 -44220
13707 -44220 163508 277481 114296 91794 119203 -91420 -138966 8895 -175 222405 193646
$$ packed form
13779B20573J06427L0947Q9296L30350j22810l39585r8485j2020J66315p2047
13769B98961o1175J03568J38676k78066q447J65956J16699k04627j44969K11189
13759C37765J99707n2713j41391k68269k42959k12757N6807O9302j24216K7751
13749c50973K85063J62957K587O0552R4474J49921Q4130l22692J93981J63288
13739E23288J30275K6353K9818M3907k24283o7077J09116L975r8511j90650j38762
13728A47449Q7361r0802k6100k8821j13252R1658n2987R3034r124r1044J34690
13717A42062L3426K52747R4024j73715k70996j30046P7464K07817j32992j44011
13707d4220K07728J13973j63185k2502K7409k10623m7546J47861r070K22580k8759
$$ plain form
13696 193646 -32770 -215013 -175694 -103405 -63420 29998 187923 313418 221648 48994
13686 48994 116431 160786 130715 -188008 -211949 -129246 -75211 -21265 140778 263500 261332
13675 261332 99476 33949 -82351 93698 111801 246980 118069 23066 -103493 -393272
13665 -393272 -295574 -55088 -44725 36345 305582 276734 331018 337212 320038 162946 28862
13654 28862 -11999 -41109 177065 205162 5816 -82875 -46296 -156402 -253315 -145450 125623
13643 125623 81399 -313852 -390114 -239082 -207174 -33182 76099 50184 60201 228579
13633 228579 148393 125748 82578 118421 53842 36518 37629 85765 2827 -266576 -172270
13622 -172270 -224004 -122800 -230594 -269911 -266104 -223434 -30040 -5077 133482 131626 114657
$$ packed form
13696A93646k26416j82243L9319P2289L9985R3418J57925J25495r1770j72654
13686D8994O7437M4355l0071l18723k3941Q2703N4035N3946J62043J22722k168
13675B61332j61856o5527j16300J76049J8103J35179j28911r5003j26559k89779
13665c93272R7698K40486J0363Q1070K69237k8848N4284O194j7174j57092j34084
13654B8862m0861k9110K18174K8097j99346q8691L6579j10106r6913J07865K71073
13643A25623m4224l95251p6262J51032L1908J73992J09281k5915J0017J68378
13633B28579q0186k2645m3170L5843o4579j7324J111M8136q2938k69403R4306
13622a72270n1734J01204j07794l9317L807M2670J93394K4963J38559j856j6969
$$ plain form
13611 114657 139027 -46319 -207420 -81576 61642 162782 91358 334258 511206 520230
13601 520230 567571 203458 -52103 -88562 35602 185301 285323 439648 508760 300175
13591 300175 218513 174123 180380 186372 -21857 -73380 60508 130585 288634 448237 402306
13580 402306 367210 433015 352867 408808 457696 358345 417060 554893 543808 529452 546936
13569 546936 504506 332684 213741 248789 229714 209918 254160 497312 469956 537435 635982
13558 635982 800905 885701 817055 769782 782213 878431 997853 917372 715033 618670 656882
13547 656882 740030 960718 1270649 1102992 730717 716609 883491 1196193 1303608 1286164
13537 1286164 1449028 1804718 1862664 1895401 2046014 2118799 2273532 2212864 2303649 2784237
$$ packed form
13611A14657K4370j85346j61101J25844J43218J01140p1424K42900J76948R024
13601E20230M7341l64113k55561l6459J24164J49699J00022J54325O9112k08585
13591C00175q1662m4390O257N992k08229n1523J33888P0077J58049J59603m5931
13580D02306l5096O5805q0148N5941M8888r9351N8715J37833j1085j4356J7484
13569E46936m2430j71822j18943L5048j9075j9796M4242K43152k7356O7479R8547
13558F35982J64923Q4796o8646m7273J2431R6218J19422q0481k02339r6363L8212
13547F56882Q3148K20688L09931j67657l72275j4108J66882L12702J07415j7444
13537A286164J62864L55690N7946L2737J50613P2785J54733o0668R0785M80588
$$ plain form
13527 2784237 3093732 3160680 3390875 3772794 3917288 3970180 4153124 4428335 4973298 5310228
13517 5310228 5491100 6147404 6542166 6858832 7351742 7948421 8574726 9072824 9481124
13508 9481124 10061132 10716808 11699504 12709583 13608819 14590916 15569551 16531900 17782512
13499 17782512 19196766 20751325 22267437 23813710 25498545 27127215 28690409 30423024
13491 30423024 32195204 34087981 36154404 38408869 40352910 42334851 44184161 46271191
13483 46271191 48523847 50645940 52630270 54832465 56949093 59257487 61605180 64064578
13475 64064578 66504046 68967002 71546362 74462281 77578318 80358191 83459453 86939429
13467 86939429 90590105 94187595 97982181 101824967 106112119 110540277 115134043 119691803
$$ packed form
13527B784237L09495O6948K30195L81919J44494N2892J82944K75211N44963L36930
13517E310228J80872O56304L94762L16666M92910N96679O26305M98098M08300
13508I481124N80008O55676R82696J010079Q99236R82097R78635R62349J250612
13499A7782512J414254J554559J516112J546273J684835J628670J563194J732615
13491C0423024J772180J892777K066423K254465J944041J981941J849310K087030
13483D6271191K252656K122093J984330K202195K116628K308394K347693K459398
13475F4064578K439468K462956K579360K915919L116037K779873L101262L479976
13467H6939429L650676L597490L794586L842786M287152M428158M593766M557760
$$ plain form
13459 119691803 124161601 128732052 133317532 138016805 142528643 146857866 151015180 155003127
13451 155003127 158932305 162286788 165194380 167760781 169897230 171592548 172873238 173965735
13443 173965735 174538070 174831659 175139619 175345381 175217535 175243853 175045915 174772669 174540766
13434 174540766 174235036 174021128 173999065 173986792 174315409 174908327 175196766 175596018 176083306
13425 176083306 176467698 176938210 176895624 176722989 176296606 175778985 174914687 173938941 172638831
13416 172638831 170787866 168414124 165758632 162538040 158778060 154734112 150661687 146205029
13408 146205029 141913952 137581061 132904665 128323363 123847439 119464740 115038621 110734431
13400 110734431 106547834 102510464 98733863 95017408 91509439 88343380 85382147 82553898
$$ packed form
13459A19691803M469798M570451M585480M699273M511838M329223M157314L987947
13451A55003127L929178L354483K907592K566401K136449J695318J280690J092497
13443A73965735N72335K93589L07960K05762j27846K6318j97938k73246k31903
13434A74540766l05730k13908k2063j2273L28617N92918K88439L99252M87288
13425A76083306L84392M70512m2586j72635m26383n17621q64298r75746j300110
13416A72638831j850965k373742k655492l220592l759980m043948m072425m456658
13408A46205029m291077m332891m676396m581302m475924m382699m426119m304190
13400A10734431m186597m037370l776601l716455l507969l166059k961233k828249
$$ plain form
13392 82553898 79780167 77054792 74421566 71942387 69768111 67634948 65055123 62820935
13384 62820935 60855597 58728194 56557606 54459416 52182059 50000251 47667392 45605432
13376 45605432 43623688 41636017 39678983 37579379 35602578 33902247 32359157 30846863
13368 30846863 29078828 27339735 25982955 24498554 23105078 21710543 20426813 19454486
13360 19454486 18649279 17813477 16818181 16090758 15446502 14537949 13588106 12904838 12219787
13351 12219787 11471715 11118433 10765632 10215354 9623453 9232685 9075880 8635883 8359119
13342 8359119 7982539 7435714 7295306 7132046 7012980 6775350 6426659 6135655 5643978
13333 5643978 5357434 5165888 5206889 5065836 4828905 4855974 4870895 4878719 4747153 4541106
$$ packed form
13392H2553898k773731k725375k633226k479179k174276k133163k579825k234188
13384F2820935j965338k127403k170588k098190k277357k181808k332859k061960
13376D5605432j981744j987671j957034k099604j976801j700331j543090j512294
13368C0846863j768035j739093j356780j484401j393476j394535j283730r72327
13360A9454486q05207q35802r95296p27423o44256r08553r49843o83268o85051
13351A2219787p48072l53282l52801n50278n91901l90768j56805m39997k76764
13342H359119l76580n46825j40408j63260j19066k37630l48691k91004m91677
13333E643978k86544j91546M1001j41053k36931K7069J4921P824j31566k06047
$$ plain form
13323 4541106 4538213 4436681 4425656 4248908 3953639 3972716 4143850 4115800 4022518 3566518
13313 3566518 3427352 3364027 3296668 3074436 2942164 2985244 3148113 3018688 2778527 2736385
13303 2736385 2750600 2825631 2930569 3048341 3069261 2931164 2614060 2688715 2816936 2695053
13293 2695053 2571375 2481136 2615027 2674102 2530984 2537622 2617165 2509247 2161498 2022081
13283 2022081 1814993 1649828 1652208 1743357 1973997 1899758 1713680 1654912 1589551 1808546
13273 1808546 1946234 2036503 2113475 1911937 1657381 1534783 1415799 1494704 1653852 1683461
13263 1683461 1646705 1435965 1212484 1209211 1415248 1477304 1500285 1352895 1172185 1338712
13253 1338712 1571461 1677563 1740536 1648631 1576025 1219792 1143503 1222605 1113265 873215
$$ packed form
13323D541106k893j01532j1025j76748k95269J9077J71134k8050r3282m56000
13313C566518j39166o3325o7359k22232j32272M3080J62869j29425k40161m2142
13303B736385J4215P5031J04938J17772K0920j38097l17104P4655J28221j21883
13293B695053j23678r0239J33891N9075j43118O638P9543j07918l47749j39417
13283B022081k07088j65165K380R1149K30640p4239j86078n8768o5361K18995
13273A808546J37688R0269P6972k01538k54556j22598j18984P8905J59148K9609
13263A683461l6756k10740k23481l273K06037O2056K2981j47390j80710J66527
13253A338712K32749J06102O2973r1905p2606l56233p6289P9102j09340k40050
$$ plain form
13243 873215 791820 986260 1059053 1019635 1055373 1006857 1289351 1283395 1118840 1214705 1210070
13232 1210070 1185772 1090980 1108001 1303026 1390145 1317563 1191709 1248033 1024985 663964
13222 663964 490457 419591 715121 1120847 1196577 1109132 1097680 1148359 1082582 1085037 1010265
13211 1010265 1059696 859554 894736 1043334 1178778 1251857 1274200 1269801 1336915 1356607 1192519
13200 1192519 1198699 1342306 1327025 983834 939495 1164745 917273 765143 786694 660222
13190 660222 643863 563592 661223 876322 945543 839402 887936 850837 818796 713781 605611
13179 605611 587020 625405 589007 617789 690248 665385 627033 660267 757354 721330 505682
13168 505682 462458 307052 111183 116619 194617 46495 147415 82110 149570 18934 287653
$$ packed form
13243H73215q1395J94440P2793l9418L5738m8516K82494n956j64555R5865m635
13232A210070k4298r4792J7021J95025Q7119p2582j25854N6324k23048l61021
13222F63964j73507p0866K95530M05726P5730q7445j1452N0679o5777K455p4772
13211A010265M9431k00142L5182J48598J35444P3079K2343m399O7114J9692j64088
13200A192519O180J43607j5281l43191m4339K25250k47472j52130K1551j26472
13190F60222j6359q0271R7631K15099O9221j06141M8534l7099l2041j05015j08170
13179F05611j8591L8385l6398K8782P2459k4863l8352L3234R7087l6024k15648
13168E05682m3224j55406j95869N436P7998j48122J00920o5305O7460j30636K68719
$$ plain form
13157 287653 561214 744182 711480 623135 546321 593434 653952 680931 521350 538360 663614
13146 663614 833269 798615 857045 679193 567570 702439 794875 803878 634220 597417 605691
13135 605691 738940 756466 642439 755356 598968 717790 536524 542613 728850 709322
13125 709322 635666 473139 364748 518179 666144 639788 506222 634235 740224 618090
13115 618090 282122 352771 541356 425936 541926 642652 730746 689182 439420 440114 678133
13104 678133 578099 413013 575182 621830 759184 654612 743798 889834 966733 998947
13094 998947 926597 735921 475871 489637 489190 441206 516787 450014 393035 431264 498098
13083 498098 352828 139220 210815 467812 459009 386518 542903 716690 610010 440149
$$ packed form
13157B87653K73561J82968l2702q8345p6814M7113O0518K6979j59581J7010J25254
13146F63614J69655l4654N8430j77852j11623J34869R2436R003j69658l6803Q274
13135F05691J33249J7526j14027J12917j56388J18822j81266O089J86237j9528
13125G09322p3656j62527j08391J53431J47965k6356j33566J28013J05989j22134
13115F18090l35968P0649J88585j15420J15990J00726Q8094m1564k49762O94K38019
13104F78133j00034j65086J62169M6648J37354j04572Q9186J46036P6899L2214
13094I98947p2350j90676k60050J3766m47m7984P5581o6773n6979L8229O6834
13083D98098j45270k13608P1595K56997q803p2491J56385J73787j06680j69861
$$ plain form
13073 440149 531525 668213 667764 483775 677858 623669 532594 547730 574827 680809 658480
13062 658480 773266 775234 811898 682991 450032 408999 501597 679691 498145 588434 653916
13051 653916 519387 640807 705479 493441 364087 236248 223604 345963 476032 416430
13041 416430 437174 430991 762545 708965 787099 838505 689481 668281 751200 752834 547195
13030 547195 444591 518912 886137 956937 973292 980569 861809 760887 900079 1046226
13020 1046226 922392 790463 784223 968406 950739 632585 531437 546852 477281 477556 426210
13009 426210 583955 662943 599252 667319 800917 707236 763421 787202 788018 808832 771441
12998 771441 852811 914718 1001591 1020503 1217580 1416982 1472997 1472144 1178267 1026229 1180487
$$ packed form
13073D40149R1376J36688m49j83989J94083n4189r1075J5136K7097J05982k2329
13062F58480J14786J968L6664j28907k32959m1033R2598J78094j81546R0289O5482
13051F53916j34529J21420O4672k12038j29354j27839j2644J22359J30069n9602
13041D16430K0744o183L31554n3580P8134N1406j49024k1200Q2919J634k05639
13030E47195j02604P4321L67225P0800J6355P277j18760j00922J39192J46147
13020A046226j23834j31929o240J84183j7667l18154j01148J5415o9571K75n1346
13009D26210J57745P8988o3691O8067J33598r3681N6185K3781Q16K0814l7391
12998G71441Q1370O1907Q6873J8912J97077J99402N6015q53k93877j52038J54258
$$ plain form
12987 1180487 1470075 1596123 1527903 1400280 1068849 1085467 1111722 989450 911023 1019965
12977 1019965 1203531 1207808 1101336 941755 889605 1027524 874963 761050 703773 821612
12967 821612 1167426 1288950 1213384 1200311 1095768 1050771 1025347 1136232 1109985 983000
12957 983000 1176650 1193431 1197794 1067355 1149954 1093368 1242981 1098731 974006 939547 496489
12946 496489 295107 542450 990908 1238069 1104577 1023260 973529 1053547 1158113 1080767
12936 1080767 1080470 952383 870505 638217 458809 303634 113684 -70774 225972 782771
12926 782771 1083801 1206768 1040636 862535 718888 767537 536645 512128 414247 295592
12916 295592 279783 162547 82171 243899 290242 164751 96539 153615 257087 350872 435099
$$ packed form
12987A180487K89588J26048o8220j27623l31431J6618K6255j22272p8427J08942
12977A019965J83566M277j06472j59581n2150J37919j52561j13913n7277J17839
12967H21612L45814J21524p5566j3073j04543m4997k5424J10885k6247j26985
12957I83000J93650J6781M363j30439Q2599n6586J49613j44250j24725l4459m43058
12946D96489k01382K47343M48458K47161j33492q1317m9731Q0018J04566p7346
12936A080767k97j28087q1878k32288j79408j55175j89950j84458K96746N56799
12926G82771L01030J22967j66132j78101j43647M8649k30892k4517r7881j18655
12916B95592j5809j17236q0376J61728M6343j25491o8212N7076J03472R3785Q4227
$$ plain form
12905 435099 247952 100609 33872 253589 469379 346786 182486 190597 1740 -52486
12895 -52486 -29205 69504 233226 454476 329303 142788 120419 95523 240812 213690 119897
12884 119897 284273 390513 616761 604526 693808 568926 520682 356409 160252 372856
12874 372856 327353 372975 316436 405384 224962 97640 -106224 -2681 86779 91699 108836
12863 108836 105171 324554 512917 371508 238823 506410 442199 377506 489182 517352
12853 517352 581391 419295 136697 19946 123197 218397 287824 163228 70572 -6836
12843 -6836 53957 208239 84785 115007 181022 180294 -12044 -141371 -247241 -226989 -1530
12832 -1530 158180 249120 102006 19925 83522 69601 -9217 -66277 -141061 -6607 226728
$$ packed form
12905D35099j87147j47343o6737K19717K15790j22593j64300Q111j88857n4226
12895e2486K3281R8709J63722K21250j25173j86515k2369k4896J45289k7122r3793
12884A19897J64376J06240K26248j2235Q9282j24882m8244j64273j96157K12604
12874C72856m5503M5622n6539Q8948j80422j27322k03864J03543Q9460M920J7137
12863A08836l665K19383J88363j41409j32685K67587o4211o4693J11676K8170
12853E17352O4039j62096k82598j16751J03251R5200O9427j24596r2656p7408
12843f836O0793J54282j23454L0222O6015p28j92338j29327j05870K0252K25459
12832a530J59710R0940j47114q2081O3597j3921p8818n7060p4784J34454K33335
$$ plain form
12821 226728 125388 180420 428739 646878 574457 514581 393421 550295 590053 360499
12811 360499 61453 109440 118242 -107926 111079 248820 380941 576339 612012 630320
12801 630320 679150 834999 501395 355777 464287 219895 95510 -79772 -154916 -263384
12791 -263384 -377504 -292791 -141152 -24141 -163620 -258892 -227553 -173221 -382518 -170455
12781 -170455 75393 69477 45104 143479 118914 131157 368813 660026 448713 279691 289035
12770 289035 383818 336296 769021 914669 824747 628676 453467 422301 271808 183102
12760 183102 311471 305604 293050 511375 722168 421948 315847 434912 531730 470920
12750 470920 472507 666369 553647 548467 674082 1002062 1105649 968482 763362 649808
$$ packed form
12821B26728j01340N5032K48319K18139p2421n9876j21160J56874L9758k29554
12811C60499k99046M7987Q802k26168K19005J37741J32121J95398L5673J8308
12801F30320M8830J55849l33604j45618J08510k44392j24385j75282p5144j08468
12791b63384j14120Q4713J51639J17011j39479r5272L1339N4332k09297K12063
12781a70455K45848n916k4373R8375k4565J2243K37656K91213k11313j69022R344
12770B89035R4783m7522M32725J45648q9922j96071j75209l1166j50493q8706
12760A83102J28369n867j2554K18325K10793l00220j06101J19065R6818o0810
12750D70920J587J93862j12722n180J25615L27980J03587j37167k05120j13554
$$ plain form
12740 649808 652965 757990 945540 1095491 1078169 1156014 1169210 1007715 1002395 1336664 1473114
12729 1473114 1250619 1175476 1128634 1222104 1225288 987976 929674 1079179 1105945 1050603 1102242
12718 1102242 1107814 1074526 1089609 1198625 1016015 805438 988729 1133072 1234930 1205714
12708 1205714 1152931 1330005 1359309 1358084 1164427 1142845 1177101 1342060 1241392 1208799 1391297
12697 1391297 1553308 1569163 1569247 1483698 1307301 1254141 1109666 1176272 1070675 1426899 1755289
12686 1755289 1813612 1697133 1678025 1657175 1436830 1235926 950138 1181368 1446681 1387470
12676 1387470 1230989 1136020 1225883 1476120 1577797 1491026 1546434 1339681 1212425 1121141
12666 1121141 1160854 1466725 1592965 1654354 1515014 1376632 1603991 1564814 1364038 1407625
$$ packed form
12740F49808L157J05025J87550J49951j7322P7845J3196j61495n320L34269J36450
12729A473114k22495p5143m6842R3470L184k37312n8302J49505K6766n5342N1639
12718A102242N572l3288J5083J09016j82610k10577J83291J44343J01858k9216
12708A205714n2783J77074K9304j225j93657k1582L4256J64959j00668l2593J82498
12697A391297J62011J5855Q4q5549j76397n3160j44475O6606j05597L56224L28390
12686A755289N8323j16479j9108k0850k20345k00904k85788K31230K65313n9211
12676A387470j56481r4969Q9863K50237J01677q6771N5408k06753j27256r1284
12666A121141L9713L05871J26240O1389j39340j38382K27359l9177k00776M3587
$$ plain form
12656 1407625 1412153 1320044 1276838 1442782 1521061 1483173 1714769 1564127 1401370 1276808
12646 1276808 1270075 1218828 974843 902417 981511 911159 890606 857408 813207 1064857 1102538
12635 1102538 1006055 1101026 1185275 1242885 1333506 1289502 1381686 1533197 1520769 1512454 1490764
12624 1490764 1440778 1462104 1358852 1263689 1076355 999047 953043 653495 498193 564153
12614 564153 821086 689873 436000 448900 473662 675572 538055 206975 269962 426004
12604 426004 643026 778740 609545 417401 435524 656029 791303 842718 1159330 1330536
12594 1330536 1252877 1080141 722350 617255 497109 437045 583684 461348 259665 90677
12584 90677 44776 -24742 17080 6460 16995 128856 436280 490019 473031 496563 363296
$$ packed form
12656A407625M528r2109m3206J65944P8279l7888K31596j50642j62757j24562
12646A276808o733n1247k43985p2426P9094p0352k0553l3198m4201K51650L7681
12635A102538r6483R4971Q4249N7610R0621m4004R2184J51511j2428q315k1690
12624A490764m9986K1326j03252r5163j87334p7308m6004k99548j55302O5960
12614E64153K56933j31213k53873J2900K4762K01910j37517l31080O2987J56042
12604D26004K17022J35714j69195j92144J8123K20505J35274N1415L16612J71206
12594A330536p7659j72736l57791j05095j20146o0064J46639j22336k01683j68988
12584I0677m5901o9518M1822j0620J0535J11861L07424N3739j6988K3532j33267
$$ plain form
12573 363296 76165 -56074 -79733 -64352 -6004 123312 134458 111325 -65140 -131294 -76022
12562 -76022 199313 214642 110930 -43275 3592 -46719 -20310 -50615 -322590 -306199 -114818
12551 -114818 -76938 -100838 -43601 19411 -121092 -95512 82953 172306 75022 151177 137819
12540 137819 101438 117898 286004 230521 253031 229356 141098 -168755 -399926 -385071 -366033
12529 -366033 -284420 -269822 -126046 9335 -3247 -297311 -245491 -63289 202726 545571
12519 545571 502109 276964 173248 73548 44921 243816 443204 204169 115168 -108375
12509 -108375 -48112 34057 98579 81445 -70805 -21158 123085 120402 -58570 -238717 -245159
12498 -245159 -110976 -174564 -40802 158064 24 5461 158426 173646 228177 284836 225403
$$ packed form
12573C63296k87131j32239k3659J5381N8348J29316J1146k3133j76465o6154N5272
12562g6022K75335J5329j03712j54205M6867n0311K6409l0305k71975J6391J91381
12551a14818L7880k3900N7237O3012j40503K5580J78465Q9353r7284P6155j3358
12540A37819l6381J6460J68106n5483K2510k3675q8258l09853k31171J4855J9038
12529c66033Q1613J4598J43776J35381j2582k94064N1820J82202K66015L42845
12519E45571m3462k25145j03716r9700k8627J98895J99388k39035q9001k23543
12509a08375O0263Q2169O4522j7134j52250M9647J44243k683j78972j80147o442
12498b45159J34183o3588J33762J98866j58040N437J52965J5220N4531N6659n9433
$$ plain form
12487 225403 234339 284481 473062 290547 105704 117719 117090 241752 192958 84030 61925
12476 61925 455677 402609 160685 -75322 -315487 -248814 -215642 -165683 -15768 120215
12466 120215 221195 269317 422524 524882 394989 114992 -93828 157404 155375 413159
12456 413159 396833 223669 111013 -23643 -120045 305227 600893 265092 67493 81291
12446 81291 245365 69942 -63744 -33336 -99117 -105339 -11633 131704 385819 215648 -20946
12435 -20946 -94761 28301 18230 1039 -25725 125500 324051 397488 478809 232814 119971
12424 119971 137132 68169 146181 168445 254682 394356 267901 9429 -104537 -64323 30208
12413 30208 -57137 30842 292825 490922 320744 78368 122590 269346 129229 -38959
$$ packed form
12487B25403Q936N0142J88581j82515j84843J2015o29J24662m8794j08928k2105
12476F1925L93752n3068k41924k36007k40165O6673L3172M9959J49915J35983
12466A20215J00980M8122J53207J02358j29893k79997k08820K51232k029K57784
12456D13159j6326j73164j12656j34656r6402M25272K95666l35801j97599J3798
12446H1291J64074j75423j33686L0408o5781o222R3706J43337K54115j70171k36594
12435b0946p3815J23062j0071j7191k6764J51225J98551P3437Q1321k45995j12843
12424A19971J7161o8963P8012K2264Q6237J39674j26455k58472j13966M0214R4531
12413C0208q7345Q7979K61983J98097j70178k42376M4222J46756j40117j68188
$$ plain form
12403 -38959 -62232 -106512 118105 199953 86633 156674 246290 325221 261722 222078 303826
12392 303826 206364 75251 145309 166037 178128 322637 411553 245789 157838 107572 205606
12381 205606 190714 96755 182774 313958 177900 197721 112297 135331 160667 213138 133010
12370 133010 -110233 52143 113653 8896 -123503 -111332 -81158 192333 245214 127848
12360 127848 159755 169036 -32838 -177713 69268 236121 356812 226759 -78142 -70702
12350 -70702 130529 417916 494691 432016 465246 579015 634729 575136 425817 445872 615181
12339 615181 637438 555458 832625 1022111 1200025 1795025 2437698 2907031 3351320 3491489
12329 3491489 3087185 2412325 2162628 1840261 1449874 1073021 908893 828594 653822 584620
$$ packed form
12403c8959k3273m4280K24617Q1848j13320P0041Q9616P8931o3499l9644Q1748
12392C03826r7462j31113P0058K0728J2091J44509Q8916j65764q7951n0266R8034
12381B05606j4892r3959Q6019J31184j36058J9821q5424K3034K5336N2471q0128
12370A33010k43243J62376O1510j04757j32399J2171L0174K73491N2881j17366
12360A27848L1907R281k01874j44875K46981J66853J20691j30053l04901P440
12350g0702K01231K87387P6775o2675L3230J13769N5714n9593j49319K0055J69309
12339F15181K2257q1980K77167J89486J77914N95000O42673M69333M44289J40169
12329C491489m04304o74860k49697l22367l90387l76853j64128q0299j74772o9202
$$ plain form
12319 584620 559662 494738 426739 328445 361279 416790 477617 348956 137848 235443 316752
12308 316752 358902 375657 345036 514508 622732 472850 614957 674727 603852 664784 945262
12297 945262 1086576 945537 868913 798715 755223 713346 925569 1200278 1185407 1190167 1474274
12286 1474274 1715616 2232158 2728800 2908234 2532529 2146536 1797445 1405400 953097
12277 953097 820597 605873 439310 379790 491030 763797 548297 521241 524666 525285 564815
12266 564815 627790 867037 1082343 1452329 2037875 2603960 3385933 4460989 5414795 5736354
12256 5736354 5602267 4970508 4013277 2902434 2160153 1876502 1734590 1418994 1166261
12247 1166261 943247 880124 771179 538847 331342 512064 769170 681454 683704 612009
$$ packed form
12319E84620k4958o4924o7999r8294L2834N5511O0827j28661k11108R7595Q1309
12308C16752M2150J6755l0621J69472J08224j49882J42107N9770p0875O0932K80478
12297I45262J41314j41039p6624p0198m3492m1877K12223K74709j4871M760K84107
12286A474274K41342N16542M96642J79434l75705l85993l49091l92045m52303
12277I53097j32500k14724j66563n9520J11240K72767k15500k7056L425O19L9530
12266E64815O2975K39247K15306L69986N85546N66085P81973J075056R53806L21559
12256E736354j34087o31759r57231j110843p42281k83651j41912l15596k52733
12247A166261k23014o3123j08945k32332k07505J80722K57106q7716K250p1695
$$ plain form
12237 612009 519515 641151 709227 722809 671408 638510 505857 517139 485302 463765 657414
12226 657414 816957 963055 928156 807665 891332 1013471 1286489 1210617 1274223 1725171
12216 1725171 1849794 2208379 2782751 3424685 4093596 4559119 4735092 4501631 3955473
12207 3955473 3529944 2807788 2119998 1790597 1517053 1294532 895941 539369 515493 511299
12197 511299 509937 502861 549935 544790 627758 806294 668903 515528 570488 493330 349702
12186 349702 455909 266342 307669 297775 195328 304779 403485 544282 653788 846784
12176 846784 654421 626348 687362 754145 620690 623600 606019 716418 791546 642536 390208
12165 390208 401470 642510 659683 396081 419318 420108 440446 567364 433700 298630 545635
$$ packed form
12237F12009r2494J21636O8076J3582n1401l2898j32653J1282l1837k1537J93649
12226F57414J59543J46098l4899j20491Q3667J22139K73018p5872O3606M50948
12216A725171J24623L58585N74372O41934O68911M65523J75973k33461n46158
12207C955473m25529p22156o87790l29401k73544k22521l98591l56572k3876m194
12197E11299j362p076M7074n145Q2968J78536j37391j53375N4960p7158j43628
12186C49702J06207j89567M1327r894j02447J09451R8706J40797J09506J92996
12176H46784j92363k8073O1014O6783j33455K910j7581J10399P5128j49010k52328
12165C90208J1262K41040J7173k63602K3237P90K0338J26918j33664j35070K47005
$$ plain form
12154 545635 681182 663268 681306 353282 206618 258026 523823 466050 448493 377133 158799
12143 158799 204359 203968 195394 400555 486874 344876 405444 417418 317726 398013 567599
12132 567599 772294 800066 1018283 853707 785039 844143 921894 970979 714507 519718
12122 519718 675589 958639 921099 978411 1068129 990295 1012615 1324887 1477377 1545207 1570218
12111 1570218 1370121 1214750 1319864 1365904 1190778 1160180 1359321 1390092 1635221 1777220
12101 1777220 1721206 1514393 1549717 1832867 2261192 2843500 3727165 4352389 4682362 4858134
12091 4858134 5140272 5234076 5081987 4651054 4320171 3751743 2712493 1770195 1552206
12082 1552206 1558429 1462305 1269174 1195933 1156846 1182446 1131205 1274231 1358496 1508527 1484323
$$ packed form
12154E45635J35547j7914J8038l28024j46664N1408K65797n7773j7557p1360k18334
12143A58799M5560l91q574K05161Q6319j41998O0568J1974r9692Q0287J69586
12132E67599K04695K7772K18217j64576o8668N9104P7751M9085k56472j94789
12122E19718J55871K83050l7540N7312Q9718p7834K2320L12272J52490O7830K5011
12111A570218k00097j55371J05114M6040j75126l0598J99141L0771K45129J41999
12101A777220n6014k06813L5324K83150M28325N82308Q83665O25224L29973J75772
12091D858134K82138R3804j52089m30933l30883n68428j039250r42298k17989
12082A552206O223r6124j93131p3241l9087K5600n1241J43026Q4265J50031k4204
$$ plain form
12071 1484323 1530475 1809978 1872373 2083377 2192553 2386145 2368322 2200949 2416490 2570182
12061 2570182 2995630 3383057 3961347 4636063 4957489 5391843 5786642 6083258 6289629
12052 6289629 6118471 5866284 5395256 4841364 4307544 3818739 3541485 3435892 3377704 3178256
12042 3178256 3134601 3073227 3085729 2982015 3075457 3305836 3370429 3263284 3297152 3583038
12032 3583038 3696013 3693881 3939199 4112528 4325151 4498179 4654077 4844495 5119714 5485150
12022 5485150 5948389 6510319 7080384 7636517 7812057 8224557 8480025 8491027 8798509 8917738
12012 8917738 8758408 8783965 8957553 9155185 9439813 9846774 10414939 10955144 11492583 12037284
12002 12037284 12682239 13096751 13557414 14308688 15408725 16475621 17363228 18570780 19798247
$$ packed form
12071A484323M6152K79503O2395K11004J09176J93592j7823j67373K15541J53692
12061B570182M25448L87427N78290O74716L21426M34354L94799K96616K06371
12052F289629j71158k52187m71028n53892n33820m88805k77254j05593n8188j99448
12042C178256m3655o1374J2502j03714R3442K30379O4593j07145L3868K85886
12032C583038J12975k132K45318J73329K12623J73028J55898J90418K75219L65436
12022E485150M63239N61930N70065N56133J75540M12500K55468J1002L07482J19229
12012H917738j59330K5557J73588J97632K84628M06961N68165N40205N37439N44701
12002A2037284O44955M14512M60663P51274J100037J066896Q87607J207552J227467
$$ plain form
11993 19798247 20956726 22301616 24153866 26274861 28422555 31013275 34027579 37197127
11985 37197127 40787542 45102002 49540258 54660470 60893884 67823866 75304495 83970374
11977 83970374 94543316 107068597 122349869 140588788 162909175 189560460 221314722
11970 221314722 258107969 300085051 346199024 393777212 439543737 478154118 504053570
11963 504053570 513215408 503928192 477738727 439046325 393231026 345873391 300775856
11956 300775856 260104289 224532394 194594971 169412466 148029465 130463097 115474223
11949 115474223 102493936 91342978 82010078 73870056 67083633 61073792 55779674 51199831
11941 51199831 47317223 43834710 40528703 37565553 35104563 32876715 30508552 28593833
$$ packed form
11993A9798247J158479J344890J852250K120995K147694K590720L014304L169548
11985C7197127L590415M314460M438256N120212O233414O929982P480629Q665879
11977H3970374J0572942J2525281J5281272J8238919K2320387K6651285L1754262
11970B21314722L6793247M1977082M6113973M7578188M5766525L8610381K5899452
11963E04053570R161838r287216k6189465l8692402m5815299m7357635m5097535
11956C00775856m0671567l5571895k9937423k5182505k1383001j7566368j4988874
11949A15474223j2980287j1150958r332900q140022o786423o009841n294118m579843
11941E1199831l882608l482513l306007k963150k460990k227848k368163j914719
$$ plain form
11933 28593833 26992349 25716086 24244250 22773779 21802107 20966807 19831358 18640510
11925 18640510 17848777 17105347 16607724 15845456 15017021 14305204 13751934 13263449 12915391
11916 12915391 12310886 12100804 11460777 10977704 10446188 9768635 9485802 9411003 9378708 9261082
11906 9261082 8815572 8286093 7948393 8007557 7943175 7861333 8000997 7677604 7080627 6775687
11896 6775687 6689321 6510547 6271872 6092487 5745072 5579343 5722365 5663900 5314773 5206281
11886 5206281 5366074 5289788 5171929 5082898 4977595 4704008 4256377 4160391 4371117 4337275
11876 4337275 4048628 3932859 3893743 3747742 3676147 3559751 3532028 3707483 3837725 3628450
11866 3628450 3484460 3736929 3857636 3845909 3881209 3930070 3660726 3292939 3076312 3049548
$$ packed form
11933B8593833j601484j276263j471836j470471r71672q35300j135449j190848
11925A8640510p91733p43430m97623p62268q28435p11817n53270m88485l48058
11916A2915391o04505k10082o40027m83073n31516o77553k82833p4799l2295j17626
11906I261082m45510n29479l37700N9164o4382q1842J39664l23393n96977l04940
11896F775687q6366j78774k38675j79385l47415j65729J43022n8465l49127j08492
11886E206281J59793p6286j17859q9031j05303k73587m47631r5986K10726l3842
11876D337275k88647j15769l9116j46001p1595j16396k7723J75455J30242k09275
11866C628450j43990K52469J20707j1727L5300M8861k69344l67787k16627k6764
$$ plain form
11856 3049548 2996064 2987247 2887219 2969306 3296355 3465595 3296982 3189271 3182409 3062056
11846 3062056 3377951 3639994 3830749 3881594 4045728 3971414 3791967 3710912 3722486 3474294
11836 3474294 3247265 3135216 2908829 2864533 2919844 2712053 2167641 2006735 2119296 2226567
11826 2226567 2290814 2312047 1972797 2048541 1992439 2085566 2054425 2156611 2244359 2001156 1849478
11815 1849478 1931217 1879051 1856378 1807563 1458042 1308258 1501673 1862571 1875307 1814352
11805 1814352 1485228 1310847 1638575 1612237 1682291 1651201 1729062 1687001 1503238 1340900
11795 1340900 1428660 1221886 1236996 1306491 1213630 1355863 1507778 1598692 1682341 1786944
11785 1786944 1662483 1337490 1461932 1399348 1561033 1623821 1753593 1687035 1541784 1550577
$$ packed form
11856C049548n3484q817j00028Q2087L27049J69240j68613j07711o862j20353
11846C062056L15895K62043J90755N0845J64134p4314j79447q1055J1574k48192
11836C474294k27029j12049k26387m4296N5311k07791n44412j60906J12561J07271
11826B226567O4247K1233l39250P5744n6102R3127l1141J02186Q7748k43203j51678
11815A849478Q1739n2166k2673m8815l49521j49784J93415L60898J2736o0955
11805A814352l29124j74381L27728k6338P0054l1090P7861m2061j83763j62338
11795A340900Q7760k06774J5110O9495r2861J42233J51915R0914Q3649J04603
11785A786944j24461l24993J24442o2584J61685O2788J29772o6558j45251Q793
$$ plain form
11775 1550577 1261330 1094974 1142952 1212781 1187974 1111554 1048435 1127554 1210781 1151274 1342737
11764 1342737 1470828 1477062 1480304 1420736 1342435 1117533 1052135 1068881 956167 874390 974782
11753 974782 970005 657575 608333 787635 855274 792087 797114 637442 796842 856456 801495
11742 801495 812396 843580 920767 1004307 992093 952933 818797 874796 949888 806739 826226
11731 826226 993329 744041 640748 770444 957176 1160981 1160318 971917 1006588 1120405
11721 1120405 1240365 918538 712343 720616 699989 667053 882781 1150478 1023741 1193636
11711 1193636 1325057 1230816 1013642 709339 711934 792905 801690 967727 1011433 903349 969344
11700 969344 1051964 1126834 1024269 894015 821661 771025 673140 870852 800705 738887 598125
$$ packed form
11775A550577k89247j66356M7978O9829k4807p6420o3119P9119Q3227n9507J91463
11764A342737J28091O234L242n9568p8301k24902o5398J6746j12714q1777J00392
11753I74782m777l12430m9242J79302O7639o3187N027j59672J59400N9614n4961
11742H01495J0901L1184P7187Q3540j2214l9160j34136N5999P5092j43149J9487
11731H26226J67103k49288j03293J29696J86732K03805o63j88401L4671J13817
11721A120405J19960l21827k06195Q273k0627l2936K15728K67697j26737J69895
11711A193636J31421r4241k17174l04303K595Q0971Q785J66037M3706j08084O5995
11700I69344Q2620P4870j02565j30254p2354n0636r7885J97712p0147o1818j40762
$$ plain form
11689 598125 647125 730406 895100 740659 600523 697634 625767 769740 800572 822670 886349
11678 886349 856467 876005 785307 944146 1029168 917352 836176 957775 1182138 1110796 1209470
11667 1209470 1195445 1174617 973930 1040601 906835 800090 834261 1068724 1204424 1154468
11657 1154468 1113654 1017780 998494 992540 785414 618705 587472 608789 985288 1208760 1228354
11646 1228354 978418 878481 820061 956965 835161 837407 1009080 927425 829427 874505 745412
11635 745412 784794 1051695 1199077 1006539 1075734 932461 747713 595847 611061 940740
11625 940740 1156484 1087176 1263164 1493287 1309888 1303821 1171879 1152566 1297530 1340831
11615 1340831 1279588 945388 1004562 947201 917933 702184 594713 561954 775274 1118044
$$ packed form
11689E98125M9000Q3281J64694j54441j40136R7111p1867J43973L0832K2098O3679
11678H86349k9882J9538r0698J58839Q5022j11816q1176J21599K24363p1342R8674
11667A209470j4025k0828k00687O6671j33766j06745L4171K34463J35700m9956
11657A154468m0814r5874j9286n954k07126j66709l1233K1317L76499K23472J9594
11646A228354k49936r9937n8420J36904j21804K246J71673q1655r7998M5078j29093
11635G45412L9382K66901J47382j92538O9195j43273j84748j51866J5214L29679
11625I40740K15744o9308J75988K30123j83399o067j31942j9313J44964M3301
11615A340831o1243l34200N9174n7361k9268k15749j07471l2759K13320L42770
$$ plain form
11605 1118044 1322343 1438825 1571860 1610732 1467650 1228325 835576 886760 996097 1024922
11595 1024922 822444 663995 685175 920312 932465 1119407 1151965 1058421 1109238 1068277
11585 1068277 1028951 1262026 1408904 1349668 1305996 1366126 1363119 1194077 858059 744649
11575 744649 713052 1052134 1346824 1430116 1394520 1387856 1414533 1777735 1998919 1881968 1741893
11564 1741893 1596928 1396860 1136839 1257739 1388788 1590072 1473171 1555037 1477157 1317662
11554 1317662 1359701 1490954 1280697 1010862 998789 1099025 1223757 1211437 1480894 1595591
11544 1595591 1687825 1638695 1605593 1653108 1627518 1659575 1792920 1733785 1610446 1642665 1774727
11533 1774727 1877255 1679153 1432905 1690787 1848762 1741008 1638648 1610643 1449547 1409810
$$ packed form
11605A118044K04299J16482J33035L8872j43082k39325l92749N1184J09337K8825
11595A024922k02478j58449K1180K35137J2153J86942L2558r3544N0817m0961
11585A068277l9326K33075J46878n9236m3672O0130l007j69042l36018j13410
11575G44649l1597L39082K94690Q3292l5596o664K6677L63202K21184j16951j40075
11564A741893j44965k00068k60021J20900J31049K01284j16901Q1866p7880j59495
11554A317662M2039J31253k10257k69835j2073J00236J24732j2320K69457J14697
11544A595591R2234m9130l3102M7515k5590L2057J33345n9135j23339L2219J32062
11533A774727J02528j98102k46248K57882J57975j07754j02360k8005j61096l9737
$$ plain form
11523 1409810 1409590 1370258 1353630 1306358 1254551 1243999 1284127 1399082 1389716 1346032 1215486
11512 1215486 1183805 1238302 1419738 1400943 1269993 1065718 939222 857877 905073 982975
11502 982975 1149899 1212865 1095637 1078481 1092630 1154565 1431641 1461814 1443198 1346057 1089167
11491 1089167 1075992 1208306 1419502 1274379 1064114 1130982 1168507 958166 864949 825536
11481 825536 743569 711961 828685 891744 670601 631351 742203 685659 719015 807000 834606
11470 834606 1060602 1133838 912898 729524 805575 660136 405126 511644 533740 585917
11460 585917 421190 216281 264323 478136 217283 225181 319527 612786 628823 567850 568786
11449 568786 497477 376978 526517 591647 353215 231660 483385 607648 739443 589915
$$ packed form
11523A409810k20l9332j6628m7272n1807j0552M0128J14955r366m3684j30546
11512A215486l1681N4497J81436j8795j30950k04275j26496q1345M7196P7902
11502I82975J66924O2966j17228j7156J4149O1935K77076L0173j8616r7141k56890
11491A089167j3175J32314K11196j45123k10265O6868L7525k10341r3217l9413
11481H25536q1967l1608J16724O3059k21143l9250J10852n6544L3356Q7985K7606
11470H34606K25996P3236k20940j83374P6051j45439k55010J06518K2096N2177
11460E85917j64727k04909M8042K13813k60853P898R4346K93259J6037o0973R36
11449E68786p1309j20499J49539O5130k38432j21555K51725J24263J31795j49528
$$ plain form
11439 589915 506458 327643 429952 594371 665453 647763 772898 731993 813939 837208 619469
11428 619469 470993 742162 943933 1089762 1061483 725245 680291 725249 624345 692932
11418 692932 873222 674827 739460 976950 801548 646515 998046 1038896 1135672 1129974
11408 1129974 1250363 1172001 1054827 1108452 1127417 1235843 1261748 1112807 894044 1072245
11398 1072245 1176747 1070699 863085 690659 597462 816265 890631 1161057 1333877 1472793
11388 1472793 1435516 1384739 1299254 1311520 1247997 1254510 1129649 1169704 1113894 1109553 1008534
11377 1008534 877201 956127 1042004 1018066 1013926 1089358 1160831 1050666 1042632 1107220 1124744
11366 1124744 1137929 1271454 1289571 1340557 1404825 1491424 1129539 848566 903855 1160401
$$ packed form
11439E89915q3457j78815J02309J64419P1082j7690J25135m0905Q1946K3269k17739
11428F19469j48476K71169K01771J45829k8279l36238m4954M4958j00904O8587
11418F92932J80290j98395O4633K37490j75402j55033L51531M0850R6776n698
11408A129974J20389p8362j17174N3625J8965J08426K5905j48941k18763J78201
11398A072245J04502j06048k07614j72426r3197K18803P4366K70426J72820J38916
11388A472793l7277n0777q5485J2266o3523O513j24861M0055n5810m341j01019
11377A008534j31333P8926Q5877k3938m140P5432P1473j10165q034O4588J7524
11366A124744J3185J33525J8117N0986O4268Q6599l61885k80973N5289K56546
$$ plain form
11356 1160401 1203907 1002027 1031545 1131902 1283335 1371837 1336775 1236396 1147460 939873
11346 939873 963138 1086924 1176245 1239616 1249482 1142471 1063638 1340650 1638476 1513257 1324515
11335 1324515 1334413 1321674 1354626 1511287 1403757 1350007 1248067 1143320 1292958 1276227
11325 1276227 1377491 1536304 1514660 1314053 1102925 1056377 1080688 1314786 1186099 1073152
11315 1073152 922457 1056471 1137960 1011196 992271 1008688 824820 777166 764662 764501 791384
11304 791384 904046 992428 1148507 1248261 1238884 1055685 926112 794135 838683 986763
11294 986763 801759 792677 792471 712509 899839 1132822 1074061 848139 484847 395524 478712
11283 478712 747001 761620 660618 415842 202439 314168 461100 810245 986685 874102
$$ packed form
11356A160401M3506k01880K9518J00357J51433Q8502l5062j00379q8936k07587
11346I39873K3265J23786Q9321O3371R866j07011p8833K77012K97826j25219j88742
11335A324515R898j2739L2952J56661j07530n3750j01940j04747J49638j6731
11325A276227J01264J58813k1644k00607k11128m6548K4311K34098j28687j12947
11315A073152j50695J34014Q1489j26764j8925J6417j83868m7654j2504j61K6883
11304G91384J12662Q8382J56079R9754r377j83199j29573j31977M4548J48080
11294I86763j85004r082k06p9962J87330K32983n8761k25922l63292q9323Q3188
11283D78712K68289J4619j01002k44776k13403J11729J46932L49145J76440j12583
$$ plain form
11273 874102 725886 564025 540261 526864 514942 530567 337248 151248 206193 343859
11263 343859 363289 118367 16539 213879 478052 474153 303580 86166 140994 384251
11253 384251 439366 384899 265257 295372 358442 613357 639694 436877 462664 455727 518761
11242 518761 565949 466162 318299 470582 638103 505407 422578 269493 250497 459948
11232 459948 583301 600200 313298 86234 -32989 290192 565015 641597 349243 120971
11222 120971 171592 364973 556534 438220 245099 203284 404837 569755 601792 466053
11212 466053 341417 244592 252375 353530 349794 454765 593607 663987 596869 911098 995860
11201 995860 905706 707141 773994 870206 621171 352428 80561 -94676 181252 184702
$$ packed form
11273H74102j48216j61861k3764j3397j1922J5625j93319j86000N4945J37666
11263C43859J9430k44922j01828J97340K64173l899j70573k17414N4828K43257
11253C84251N5115n4467j19642L0115O3070K54915K6337k02817K5787o937O3034
11242E18761M7188r9787j47863J52283J67521j32696q2829j53085j8996K09451
11232D59948J23353J6899k86902k27064j19223L23181K74823P6582k92354k28272
11222A20971N0621J93381J91561j18314j93121m1815K01553J64918L2037j35739
11212D66053j24636r6825P783J01155l736J04971J38842P0380o7118L14229Q4762
11201I95860r0154j98565O6853R6212k49035k68743k71867j75237K75928L450
$$ plain form
11191 184702 -38472 -208180 38010 125011 48821 11217 -63910 -71905 -112479 -176672 -121282
11180 -121282 -198986 -302815 19760 155172 210084 190602 133782 177078 148597 83646 248266
11169 248266 479661 369102 92343 122978 180385 78919 14214 -197843 -354088 -282726
11159 -282726 -44771 -45183 -221583 -212568 -182562 -116420 328059 407930 198148 230586 139339
11148 139339 98616 207451 189448 151405 295712 352538 581830 341961 140781 98940
11138 98940 37394 102654 186565 108504 -65586 -230270 -199035 -199257 41813 33750 -153257
11127 -153257 -285598 -400901 -332956 -145721 -130574 -269931 -222613 69212 -79200 -249340
11117 -249340 -75936 -68630 -22567 48247 5486 -84751 -106465 -139541 4425 35448 52755
$$ packed form
11191A84702k23174j69708K46190Q7001p6190l7604p5127p995m0574o4193N5390
11180a21282p7704j03829L22575J35412N4912j9482n6820M3296k8481o4951J64620
11169B48266K31395j10559k76759L0635N7407j01466o4705k12057j56245P1362
11159b82726K37955m12j76400R015L0006O6142M44479P9871k09782L2438r1247
11148A39339m0723J08835j8003l8043J44307N6826K29292k39869k01180m1841
11138I8940o1546O5260Q3911p8061j74090j64684L1235k22K41070q063j87007
11127a53257j32341j15303O7945J87235J5147j39357M7318K91825j48412j70140
11117b49340J73404P306M6063P0814m2761r0237k1714l3076J43966L1023J7307
$$ plain form
11106 52755 -88580 -298336 -282275 -119336 42568 70930 121694 224832 163268 273021
11096 273021 418682 396706 161222 -138061 -214127 -192755 -95501 132954 231253 232751 64118
11085 64118 -24817 -130686 5382 142562 49372 -69931 -23236 -159346 -113837 -188829 -11860
11074 -11860 97258 2998 -249159 -380792 -242035 22902 321270 458752 491415 383527
11064 383527 451447 379366 212473 35920 -46510 -39994 -177013 -322577 -189109 -84264
11054 -84264 -107 61562 -34484 -221417 -491666 -337215 135863 499350 821709 957939
11044 957939 1004333 917792 783985 805750 1029974 964511 824012 873056 1177247 1235643 1333479
11033 1333479 1592153 1818425 1724833 1518051 1197268 994115 977378 973547 814546 968598
$$ packed form
11106E2755j41335k09756J6061J62939J61904K8362N0764J03138o1564J09753
11096B73021J45661k1976k35484k99283p6066K1372R7254K28455R8299J498j68633
11085F4118q8935j05869J36068J37180r3190j19303M6695j36110M5509p4992J76969
11074a1860J09118r4260k52157j31633J38757K64937K98368J37482L2663j07888
11064C83527O7920p2081j66893j76553q2430O516j37019j45564J33468J04845
11054h4264Q4157O1669r6046j86933k70249J54451M73078L63487L22359J36230
11044I57939M6394q6541j33807K1765K24224o5463j40499M9044L04191N8396R7836
11033A333479K58674K26272r3592k06782l20783k03153j6737l831j59001J54052
$$ plain form
11023 968598 1053205 1228992 1355083 1473742 1409058 1253259 1009559 752406 683029 778861
11013 778861 796622 818574 885579 1088327 1401167 1612480 1620283 1467026 1168604 1034590
11003 1034590 759976 605196 364507 393779 464822 458712 482093 510255 465588 251028 112327
10992 112327 -146779 -221621 -243463 -193380 -382374 -310933 -267441 -87495 196807 296184 171305
10981 171305 36478 -101619 -128921 -115816 -42287 93924 232815 -27365 -246193 -128183
10971 -128183 27374 66773 57128 -143818 -307110 -287089 -252274 -262958 -165892 -275372 -55917
10960 -55917 -15805 -107481 -182811 -85206 -96535 -90508 120609 262734 368571 459452 481330
10949 481330 361188 283371 196433 153191 326238 155254 -79477 -306219 -338451 -199087
$$ packed form
11023I68598Q4607J75787J26091J18659o4684j55799k43700k57153o9377R5832
11013G78861J7761K1952O7005K02748L12840K11313P803j53257k98422j34014
11003A034590k74614j54780k40689K9272P1043o110K3381K8162m4667k14560j38701
10992A12327k59106p4842k1842N0083j88994P1441M3492J79946K84302R9377j24879
10981A71305j34827j38097k7302J3105P3529J36211J38891k60180k18828J18010
10971a28183J55557L9399r645k00946j63292K0021L4815j0684R7066j09480K19455
10960e5917M0112r1676p5330R7605j1329O027K11117J42125J05837R0881K1878
10949D81330j20142p7817q6938m3242J73047j70984k34731k26742l2232J39364
$$ plain form
10939 -199087 -50075 -47700 -13745 -249411 -188942 -333106 -419210 -234763 -145861 -636 -60548
10928 -60548 -54031 67563 -118411 -400891 -258449 -308796 -314948 -155405 -64215 -135648 -113716
10917 -113716 70349 62701 -22241 -3089 74425 258504 199313 1926 -39841 -26500 124001
10906 124001 -47684 -333974 -467915 -289777 -115960 18323 138089 123488 18584 211496
10896 211496 124880 -24368 -108938 -71551 8596 -122417 -40658 93936 27632 -77118 43235
10885 43235 -25925 49646 -353 -73923 -18553 46510 207770 222094 -211752 -359061 -481950
10874 -481950 -186850 -73150 -77936 24630 -80907 -406780 -374676 -275977 -251547 -61011
10864 -61011 -212167 -365219 -398953 -276145 -287499 -150309 -37871 50824 101627 89737 1889
$$ packed form
10939a99087J49012K375L3955k35666O0469j44164q6104J84447Q8902J45225n9912
10928f0548O517J21594j85974k82480J42442n0347o152J59543R1190p1433K1932
10917a13716J84065p648q4942J9152P7514J84079n9191j97387m1767J3341J50501
10906A24001j71685k86290j33941J78138J73817J34283J19766j4601j04904J92912
10896B11496q6616j49248q4570L7387Q0147j31013Q1759J34594o6304j04750J20353
10885D3235o9160P5571m9999p3570N5370O5063J61260J4324m33846j47309j22889
10874d81950K95100J13700m786J02566j05537l25873L2104R8699K4430J90536
10864f1011j51156j53052l3734J22808j1354J37190J12438Q8695N0803j1890q7848
$$ plain form
10853 1889 -149781 5054 152924 61857 -20503 -31162 17643 183091 28095 -30378 -181189
10842 -181189 -187422 -98855 -54607 85396 43162 43437 -23105 -142687 -279918 -98637 -12734
10831 -12734 13652 -39477 -146427 -2101 162214 69062 -77290 -226574 -246291 -163572 -269079
10820 -269079 -222561 -211931 -304770 -194644 20628 358441 246610 -125193 -218304 -335128
10810 -335128 -174701 -212226 -206278 -100518 -177778 -56236 -7162 -141185 -80047 -72389 -13272
10799 -13272 -26898 -129454 -84411 251490 438039 374212 135903 118855 -88351 -64405 147123
10788 147123 233723 212734 -41995 -120174 -305206 -316142 -143305 -233997 -265803 -191284 -168180
10777 -168180 -203189 -175253 -333586 -224255 -61500 291452 509584 527704 289601 64500
$$ packed form
10853A889j51670J54835J47870r1067q2360j0659M8805J65448j54996n8473j50811
10842a81189o233Q8567M4248J40003m2234K75o6542j19582j37231J81281Q5903
10831a2734K6386n3129j06950J44326J64315r3152j46352j49284j9717Q2719j05507
10820b69079M6518J0630r2839J10126K15272L37813j11831l71803r3111j16824
10810c35128J60427l7525N948J05760p7260J21542M9074j34023O1138P658N9117
10799a3272j3626j02556M5043L35901J86549o3827k38309j7048k07206K3946K11528
10788A47123Q6600k0989k54729p8179j85032j0936J72837r0692l1806P4519K3104
10777a68180l5009K7936j58333J09331J62755L52952K18132J8120k38103k25101
$$ plain form
10767 64500 71009 -17166 12806 -28250 -28899 -256134 -237081 190838 100587 -333910 -493740
10756 -493740 -306271 -263615 -161548 3803 20952 12163 -175674 -77003 188460 365133
10746 365133 242172 116750 347707 574245 369815 164341 19052 -56115 -55527 -125425
10736 -125425 -112991 -198909 -242319 -117874 -186374 -262211 -134031 -18243 43400 -28888 -149491
10725 -149491 -191756 -248787 -177750 -301260 -275738 -486533 -395078 -299300 -124859 -296973 -556806
10714 -556806 -750644 -759680 -756146 -781404 -762489 -731829 -641346 -635551 -575905 -634842 -627610 -690731
10702 -690731 -659936 -732108 -791290 -712555 -808305 -767650 -718248 -589874 -455374 -405147 -444378
10691 -444378 -688057 -624183 -493180 -291321 -192510 -363424 -520276 -505970 -534530 -340936
$$ packed form
10767F4500O509q8175K9972m1056o49k27235J9053M27919r0251m34497j59830
10756d93740J87469M2656J02067J65351J7149q789j87837R8671K65463J76673
10746C65133j22961j25422K30957K26538k04430k05474j45289p5167N88o9898
10736a25425J2434q5918m3410J24445o8500p5837J28180J15788O1643p2288j20603
10725a49491m2265n7031P1037j23510K5522k10795R1455R5778J74441j72114k59833
10714e56806j93838r036L534k5258J8915L0660R0483N795N9646n8937P232o3121
10702f90731L0795p2172n9182P8735r5750M0655M9402J28374J34500N0227l9231
10691d44378k43679O3874J31003K01859R8811j70914j56852J4306k8560J93594
$$ plain form
10681 -340936 -338088 -325424 -447917 -684555 -841892 -963840 -906467 -613016 -491327 -599355
10671 -599355 -583592 -558834 -464849 -447377 -692739 -732841 -732008 -548204 -238505 -172718 -343250
10660 -343250 -326145 -535255 -729493 -687524 -626993 -408814 -252966 -200159 -483790 -572659
10650 -572659 -396498 -301712 -240399 -242394 -43342 294283 106163 152170 332004 510263
10640 510263 613785 648622 734170 1124077 1261764 1293091 1772546 2093666 2556698 3174797
10630 3174797 3678973 4234942 4959582 5769288 6523776 7476753 8821363 10480771 13177555
10621 13177555 17121235 22368094 29440671 39517249 53063757 69832381 87553560
10614 87553560 100949745 105840994 102389697 95243333 88787179 85898796 88401550 97523967
$$ packed form
10681c40936K848J2664j22493k36638j57337j21948N7373K93451J21689j08028
10671e99355J5763K4758R3985J7472k45362m0102Q33J83804L09699O5787j70532
10660c43250J7105k09110j94238M1969O0531K18179J55848N2807k83631q8869
10650e72659J76161R4786O1313j995J99052L37625j88120M6007J79834J78259
10640E10263J03522L4837Q5548L89907J37687L1327M79455L21120M63032O18099
10630C174797N04176N55969P24640Q09706P54488R52977J344610J659408K696784
10621A3177555L943680N246859P072577J0076578J3546508J6768624J7721179
10614H7553560J3396185M891249l451297p146364o456154k888383K502754R122417
$$ plain form
10606 97523967 114903822 141838402 177109252 213496668 237685257 239000472 220482689
10599 220482689 194775327 173209465 160952145 159452940 169703855 192466830 228613690
10592 228613690 274980679 319977519 343683016 332558550 294310103 248215547 209057563
10585 209057563 182789440 169054954 167164095 176502640 195406631 220855292 243595665
10578 243595665 250019558 233102928 199891716 163775794 134013472 113441894 101731777
10571 101731777 97176081 98179912 103357517 110436442 115453804 113535363 102777900 86095144
10563 86095144 68496630 53399771 41992702 33738718 27882739 23552184 20093869 17633838
10555 17633838 15876146 14414597 13295836 12192225 11155957 10322505 9472474 8837540
$$ packed form
10606I7523967J7379855K6934580L5270850L6387416K4188589J315215j8517783
10599B20482689k5707362k1565862j2257320j499205J0250915K2762975L6146860
10592B28613690M6366989M4996840K3705497j1124466l8248447m6094556l9157984
10585B09057563k6268123j3734486j890859R338545J8903991K5448661K2740373
10578B43595665O423893j6916630l3211212l6115922k9762322k0571578j1710117
10571A01731777m555696J003831N177605P078925N017362j918441j0757463j6682756
10563H6095144j7598514j5096859j1407069q253984n855979m330555l458315k460031
10555A7633838j757692j461549j118761j103611j036268q33452q50031o34934
$$ plain form
10547 8837540 7952090 7174230 6931949 6731811 6308238 5935503 5309413 4758104 4370491
10538 4370491 4289137 4087313 4009239 4246669 4184497 4182381 3959450 3775150 3729571 3742290 3735199
10527 3735199 3745555 3668297 3297138 3067460 2935784 3111280 3238601 2896111 2790328 2790214
10517 2790214 2791879 2658120 2434164 2228445 2182278 2240675 2198419 2196094 2215122 2082765 1977951
10506 1977951 1943767 1983368 2041305 1726211 1832103 1956497 1982163 1905655 2110605 2121255
10496 2121255 2007937 2011867 1770041 1607297 1644713 1750221 1763658 1822807 1641064 1769076
10486 1769076 2023600 1994564 1703516 1510677 1566962 1838953 1933788 1746455 1929155 1849421
10476 1849421 1815921 1801574 1840278 1919210 1820657 1810310 1886535 1954397 1961631 2057973 2341060
$$ packed form
10547H837540q85450p77860k42281k00138m23573l72735o26090n51309l87613
10538D370491q1354k01824p8074K37430o2172k116k22931j84300m5579J2719p091
10527C735199J0356p7258l71159k29678j31676J75496J27321l42490j05783j14
10517B790214J665j33759k23956k05719m6167N8397m2256k325J9028j32357j04814
10506A977951l4184L9601N7937l15094J05892J24394K5666p6508K04950J0650
10496B121255j13318L930k41826j62744L7416J05508J3437N9149j81743J28012
10486A769076K54524k9036k91048j92839N6285K71991R4835j87333J82700p9734
10476A849421l3500j4347L8704P8932r8553j0347P6225O7862P234R6342K83087
$$ plain form
10465 2341060 2359431 2133098 1875485 1544532 1401147 1366731 1503930 1709574 1816679 1835367
10455 1835367 1513635 1193995 1325409 1238219 999337 947305 1002146 1023825 1136015 1112941
10445 1112941 1279791 1445671 1606510 1820106 2168809 2359294 2455533 2299357 1845251 1580111
10435 1580111 1496598 1595871 1903041 2218320 2365294 1798737 1284315 1071421 845531 879623
10425 879623 838848 851963 866211 689040 626470 688263 767943 535832 463024 701547 647402
10414 647402 542502 611113 642768 591633 681718 770017 808504 1162042 925832 713277 640159
10403 640159 527056 558651 594234 495915 681627 1004065 1111671 1238429 1229006 882289
10393 882289 575096 382701 544350 689188 486872 445534 540005 616342 631580 596590
$$ packed form
10465B341060J8371k26333k57613l30953j43385l4416J37199K05644J07105J8688
10455A835367l21732l19640J31414q7190k38882n2032N4841K1679J12190k3074
10445A112941J66850J65880J60839K13596L48703J90485R6239j56176m54106k65140
10435A580111q3513R9273L07170L15279J46974n66557n14422k12894k25890L4092
10425H79623m0775J3115J4248j77171o2570O1793P9680k32111p2808K38523n4145
10414F47402j04900O8611L1655n1135R0085Q8299L8487L53538k36210k12555p3118
10403F40159j13103L1595L5583r8319J85712L22438J07606J26758r423l46717
10393H82289l07193j92395J61649J44838k02316m1338R4471P6337J5238l4990
$$ plain form
10383 596590 610425 834133 640070 336814 384555 480993 522494 467716 548492 325812 292233
10372 292233 480034 455357 357034 350572 538998 436263 237161 494340 577608 379921
10362 379921 345226 362481 409133 441623 313084 131594 15124 250899 421165 489719
10352 489719 431557 552870 365313 328535 470215 615889 608224 359325 154831 305083
10342 305083 486364 567548 543934 471917 400370 487188 462377 365133 413152 536502 436226
10331 436226 518951 548444 696653 587859 477843 594667 633706 674915 698914 610105 421791
10320 421791 386885 451241 604265 737500 648711 456687 481095 360999 160568 333913
10310 333913 408475 370424 460166 364638 385206 541627 772087 806585 758754 671448 525688
$$ packed form
10383E96590J3835K23708j94063l03256M7741R6438M1501n4778Q0776k22680l3579
10372B92233J87801k4677r8323o462J88426j02735j99102K57179Q3268j97687
10362C79921l4695J7255M6652L2490j28539j81490j16470K35775J70266O8554
10352D89719n8162J21313j87557l6778J41680J45674p665k48899k04494J50252
10342C05083J81281Q1184k3614p2017p1547Q6818k4811r7244M8019J23350j00276
10331D36226Q2725K9493J48209j08794j10016J16824L9039M1209K3999q8809j88314
10320D21791l4906O4356J53024J33235q8789j92024K4408j20096k00431J73345
10310C33913P4562l8051Q9742r5528K0568J56421K30460L4498m7831q7306j45760
$$ plain form
10299 525688 338782 346713 496266 511689 558474 451878 322162 418346 564592 731070
10289 731070 665904 714383 723441 550770 522232 761397 827438 444743 295504 365174 405647
10278 405647 358015 170963 220779 441188 361828 624514 911362 1142018 1147507 1070277 830369
10267 830369 674362 701343 504416 399163 515036 485572 269756 77131 -91038 -168132
10257 -168132 256137 582244 469537 391713 482668 354257 88659 -97357 -79267 101939
10247 101939 248230 316031 651750 725227 555890 366428 278356 258348 241151 229406 52557
10236 52557 42247 20206 24880 -77719 -62871 20606 115951 283662 373292 352514 408624
10225 408624 406813 597429 524845 462111 594157 538541 511283 556988 552466 376762 359618
$$ packed form
10299E25688j86906P931J49553J5423M6785j06596j29716R6184J46246J66478
10289G31070o5166M8479R058j72671k8538K39165O6041l82695j49239O9670M0473
10278D05647m7632j87052M9816K20409p9360K62686K86848K30656N489p7230k39908
10267H30369j56007K6981j96927j05253J15873k9464k15816j92625j68169p7094
10257a68132M24269L26107j12707p7824R0955j28411k65598j86016J8090J81206
10247A01939J46291O7801L35719P3477j69337j89462q8072k0008j7197j1745j76849
10236E2557j0310k2041M674j02599J4848Q3477R5345J67711Q9630k0778N6110
10225D08624j811J90616p2584o2734J32046n5616k7258M5705m522j75704j7144
$$ plain form
10214 359618 308678 324695 479820 467712 467067 501867 442413 264312 185508 249970 170588
10203 170588 71834 389917 254649 15305 61717 108133 25545 41792 -89514 -229399
10193 -229399 -186576 -168815 24176 167461 345229 506877 388561 311872 3761 -142601
10183 -142601 137630 382691 466575 559553 626083 758202 944020 806207 638039 388967
10173 388967 216106 377132 462097 478817 828282 1128408 1344760 1483109 1626588 1830306
10163 1830306 1997959 1850494 1726742 1446373 1511963 1489368 1754085 2303548 2359941 2317680
10153 2317680 2289365 2230716 2159566 1783014 1535123 1160081 1006570 1104154 1189952 1200888
10143 1200888 1119306 1082170 1179014 1294962 1095850 974073 937630 779551 580125 584946
$$ packed form
10214C59618n0940J6017J55125j2108o45L4800n9454j78101p8804O4462p9382
10203A70588r8754L18083j35268k39344M6412M6416q2588J6247j31306j39885
10193b29399M2823J7761J92991J43285J77768J61648j18316p6689l08111j46362
10183a42601K80231K45061Q3884R2978O6530J32119J85818j37813j68168k49072
10173C88967j72861J61026Q4965J6720L49465L00126K16352J38349J43479K03718
10163A830306J67653j47465j23752k80369O5590k2595K64717N49463N6393m2261
10153B317680k8315n8649p1150l76552k47891l75042j53511R7584Q5798J0936
10143A200888q1582l7136R6844J15948j99112j21777l6443j58079j99426M821
$$ plain form
10133 584946 704900 755561 759914 880648 865894 644025 385580 149812 286286 445414
10123 445414 567634 443814 438028 441329 381638 381472 319510 462226 648412 466192 303944
10112 303944 55897 17184 161785 38844 118187 160632 -43033 -160348 20595 -128348
10102 -128348 -21480 187164 208413 260956 224596 415663 495818 40258 -15922 -76594 36772
10091 36772 251033 304877 305585 148043 -25343 -97718 -38591 86660 -63537 138503 673635
10080 673635 794987 612273 584949 443996 236590 116148 86470 -37193 -146301 -83137
10070 -83137 -79652 58598 24025 140382 544107 608745 326782 -74277 16123 241735 332152
10059 332152 322934 340417 393513 410409 320049 211273 23070 21396 -25895 -206355 -179708
$$ packed form
10133E84946J19954N0661M353J20734j4754k21869k58445k35768J36474J59128
10123D45414J22220j23820n786L301n9691j66o1962J42716J86186j82220j62248
10112C03944k48047l8713J44601j22941P9343M2445k03665j17315J80943j48943
10102a28348J06868K08644K1249N2543l6360J91067Q0155m55560n6180o0672J13366
10091C6772K14261N3844P08j57542j73386p2375N9127J25251j50197K02040N35132
10080F73635J21352j82714k7324j40953k07406j20442k9678j23663j09108O3164
10070h3137L485J38250l4573J16357M03725O4638k81963m01059R0400K25612R0417
10059C32152r218J7483N3096J6896r0360j08776j88203j674m7291j80460K6647
$$ plain form
10048 -179708 43084 50339 12959 27371 -109002 -191223 85298 109221 192965 87082 -48665
10037 -48665 160207 160594 30037 94384 106513 260739 388866 502334 333785 129479 -238606
10026 -238606 -232070 48596 291162 75365 119053 22545 200587 109484 164441 128044 106735
10015 106735 -44943 48524 255545 324574 335167 337023 248042 197838 153277 312328 269368
10004 269368 138755 145115 127909 186176 64521 130918 34538 -66518 86806 353023 153421
9993 153421 -67129 -39287 -100262 11981 297149 208225 13743 -54986 -12612 4764 254907
9982 254907 362253 204380 83926 8089 38629 56397 -16966 -11835 -146764 20584 36624
9971 36624 171081 497897 218599 -104765 22117 227184 391062 441488 457930 375249
$$ packed form
10048a79708K22792P255l7380J4412j36373q2221K76521K3923Q3744j05883j35747
10037d8665K08872L87j30557O4347J2129J54226J28127J13468j68549k04306l68085
10026b38606O536K80666K42566k15797M3688r6508J78042r1103N4957l6397k1309
10015A06735j51678R3467K07021O9029J0593J856q8981n0204m4561J59051m2960
10004B69368j30613O360j7206N8267j21655O6397r6380j01056J53324K66217j99602
9993A53421k20550K7842o0975J12243K85168q8924j94482o8729M2374J7376K50143
9982B54907J07346j57873j20454p5837L0540J7768p3363N131j34929J67348J6040
9971C6624J34457L26816k79298l23364J26882K05067J63878N0426J6442q2681
$$ plain form
9961 375249 346240 171149 40946 50540 94628 229907 87497 -200074 -180678 -156061 -45301
9950 -45301 79555 192358 74713 172242 159012 138588 193670 238405 368826 142805 273653
9939 273653 291348 251925 339443 238753 428508 696199 571988 395219 253784 245122 266218
9928 266218 -26833 21241 301638 673255 524209 248220 76515 -51821 -76584 -75836 45633
9917 45633 120594 36188 -216833 -234350 68530 259738 118735 65915 -100298 -82327 472298
9906 472298 644193 483635 499287 312665 66324 90815 -3951 -155113 -135280 -36940 177931
9895 177931 385083 566808 589273 314058 -63524 -117020 79552 282139 595033 534744
9885 534744 509282 388214 509156 513834 385057 381205 320238 298425 222174 382834 490596
$$ packed form
9961C75249k9009j75091j30203R594M4088J35279j42410k87571J9396K4617J10760
9950d5301J24856J12803j17645R7529j3230k0424N5082M4735J30421k26021J30848
9939B73653J7695l9423Q7518j00690J89755K67691j24211j76769j41435q662K1096
9928B66218k93051M8074K80397L71617j49046k75989j71705j28336k4763P48J21469
9917D5633P4961q4406k53021j7517L02880J91208j41003n2820j66213J7971N54625
9906D72298J71895j60558J5652j86622k46341K4491r4766j51162J9833R8340K14871
9895A77931K07152J81725K2465k75215l77582n3496J96572K02587L12894o0289
9885E34744k5462j21068J20942M678j28777l852o0967k1813p6251J60660J07762
$$ plain form
9874 490596 425314 163849 149132 176974 204999 191212 347147 432920 257498 104478 96452
9863 96452 217170 358550 274719 187937 267024 389157 257538 -71436 -87047 -81996 -113630
9852 -113630 -241781 -269594 -338894 -819 181741 85883 125809 254506 267524 145391 116038
9841 116038 -121742 -236830 -259952 -18026 143740 265584 261549 321774 386344 509935 496119
9830 496119 447339 412801 291782 248389 196866 104572 -237848 -372873 16115 333389 436425
9819 436425 563974 497601 378273 287946 -26281 -120015 120904 398384 540687 156407
9809 156407 -226010 -356326 -416541 -417601 -187140 -100694 240273 381335 500135 391222
9799 391222 90807 -120413 -339972 -443830 -345242 -271794 -67472 -109819 -302139 -64328
$$ packed form
9874D90596o5282k61465j4717K7842K8025j3787J55935Q5773j75422j53020q026
9863I6452J20718J41380q3831q6782P9087J22133j31619l28974j5611N051l1634
9852a13630j28151k7813o9300L38075J82560r5858L9926J28697J3018j22133k9353
9841A16038k37780j15088k3122K41926J61766J21844m035O0225O4570J23591j3816
9830D96119m8780l4538j21019m3393n1523r2294l42420j35025L88988L17274J03036
9819D36425J27549o6373j19328r0327l14227r3734K40919K77480J42303l84280
9809A56407l82417j30316o0215j060K30461Q6446L40967J41062J18800j08913
9799C91222l00415k11220k19559j03858R8588P3448K04322m2347j92320K37811
$$ plain form
9789 -64328 67917 139174 133422 -49813 -120976 -214058 -241724 -442846 -688160 -369914 -123189
9778 -123189 144665 228396 255032 328227 254070 274749 235449 31772 164217 182751 286269
9767 286269 410169 240096 414611 525459 334808 178402 148578 -70060 -162793 -14505
9757 -14505 107503 283633 266276 182247 -49763 -152271 11341 181771 186045 147827 19689
9746 19689 -54151 -105950 -232308 -370461 -353824 -484725 -297872 -140170 -337093 -265933 -400358
9735 -400358 -157862 -113635 -134403 -56876 -59021 -47579 -176841 -102280 53212 218671 93557
9724 93557 51763 17641 680 -1745 94485 102722 188648 246838 167543 225004 232611 -15398
9712 -15398 -140716 -149783 -23601 156314 303914 166571 28542 65871 32166 -7985 293346
$$ packed form
9789f4328J32245P1257n752j83235p1163r3082k7666k01122k45314L18246K46725
9778a23189K67854Q3731K6636P3195p4157K0679l9300k03677J32445J8534J03518
9767B86269J23900j70073J74515J10848j90651j56406k9824k18638r2733J48288
9757a4505J22008J76130j7357q4029k32010j02508J63612J70430M274l8218j28138
9746A9689p3840n1799j26358j38153J6637j30901J86853J57702j96923P1160j34425
9735d00358K42496M4227k0768P7527k145J1442j29262P4561J55492J65459j25114
9724I3557m1794l4122j6961k425R6230Q237Q5926N8190p9295N7461P607k48009
9712a5398j25318r067J26182J79915J47600j37343j38029L7329l3705m0151L01331
$$ plain form
9701 293346 594935 383328 345033 299507 259216 431401 446769 272759 171155 44621
9691 44621 -81485 -52937 -57287 -228691 -446947 -296149 -88706 16948 283361 86942
9681 86942 31793 191448 142355 -81553 -181850 -37587 11118 185089 513370 571992 482799
9670 482799 217679 234694 127984 -24756 191721 256518 109932 92877 76221 136681 111606
9659 111606 31266 13449 202522 718079 1731853 3100849 3504962 2813755 1704282 1054352
9649 1054352 543169 74853 220547 269780 178242 225484 124534 -30301 -167707 -15064
9639 -15064 140652 220897 286868 384518 250768 343303 643337 517859 387446 226686 126806
9628 126806 137016 83143 168941 119403 -105099 -108204 72763 -28011 -267339 -419446 -416003
$$ packed form
9701B93346L01589k11607l8295m5526m0291J72185J5368j74010j01604j26534
9691D4621j26106K8548m350j71404k18256J50798K07443J05654K66413j96419
9681H6942n5149J59655m9093k23908j00297J44263M8705J73971L28281N8622q9193
9670D82799k65120J7015j06710j52740K16477O4797j46586j7055j6656O0460k5075
9659A11606q0340j7817J89073N15557J013774J368996M04113o91207j109473o49930
9649A054352n11183m68316J45694M9233r1538M7242j00950j54835j37406J52643
9639a5064J55716Q0245O5971R7650j33750R2535L00034j25478j30413j60760r9880
9628A26806J0210n3873Q5798m9538k24502l105J80967j00774k39328j52107L443
$$ plain form
9617 -416003 -231421 -256330 -163628 67715 208036 116091 97107 -3850 78511 170994 302469
9606 302469 235287 -30543 -199031 149392 231428 301650 190040 -113399 -298128 -246746
9596 -246746 -256853 -182788 -19113 -101952 -217594 -425295 -407017 -355442 -228468 -54852 42995
9585 42995 66357 92418 201376 130495 85272 40697 140267 74037 -36378 -203130 -242041
9574 -242041 -179373 -41023 48468 -12137 -73934 17078 260721 571171 670310 436937 294758
9563 294758 248924 139308 115538 108147 196566 428192 587893 529585 318664 228970 109171
9552 109171 72579 129825 -32905 136415 453948 494370 184331 113744 223343 -48477
9542 -48477 -145353 -135304 -227282 -68586 25232 1750 -183609 -273844 -181894 129692 217797
$$ packed form
9617d16003J84582k4909R2702K31343J40321r1945j8984j00957Q2361R2483J31475
9606C02469o7182k65830j68488L48423Q2036P0222j11610l03439j84729N1382
9596b46746j0107P4065J63675q2839j15642k07701J8278N1575J26974J73616R7847
9585D2995K3362K6061J08958p0881m5223m4575R9570o6230j10415j66752l8911
9574b42041O2668J38350Q9491o0605o1797R1012K43643L10450R9139k33373j42179
9563B94758m5834j09616k3770p391Q8419K31626J59701n8308k10921q9694j19799
9552A09171l6592N7246j62730J69320L17533M0422l10039p0587J09599k71820
9542d8477r6876J0049r1978J58696R3818k3482j85359r0235R1950L11586Q8105
$$ plain form
9531 217797 80542 154506 266711 259644 119996 142046 -107214 -76226 -105352 -276251 -160778
9520 -160778 -3408 316869 260769 143749 20526 170202 332816 356230 334899 197781
9510 197781 294850 473268 414325 251345 165023 137015 126360 171600 200697 141239 212499
9499 212499 351739 369589 250391 19744 47354 225378 149263 261263 293203 -42902
9489 -42902 -295185 -387777 -256475 12250 8961 -78802 13659 -103786 -154191 -60096 -204983
9478 -204983 -464929 -366322 -51370 12631 -47232 -273781 -472058 -423132 -437575 -334445 -461471
9467 -461471 -521675 -140085 -114391 -308878 -312921 -104242 -146463 -94524 -60972 6274 -175313
9456 -175313 -290824 46492 -82252 -138058 -222445 -50630 339848 307689 53617 -239117
$$ packed form
9531B17797j37255P3964J12205p067j39648K2050k49260L0988k9126j70899J15473
9520a60778J57370L20277n6100j17020j23223J49676J62614K3414k1331j37118
9510A97781R7069J78418n8943j62980q6322k8008j0655M5240K9097n9458P1260
9499B12499J39240J7850j19198k30647K7610J78024p6115J12000L1940l36105
9489d2902k52283r2592J31302K68725l289q7763R2461j17445n0405R4095j44887
9478b04983k59946R8607L14952O4001n9863k26549j98277M8926j4443J03130j27026
9467d61471o0204L81590K5694j94487m043K08679m2221N1939L3552O7246j81587
9456a75313j15511L37316j28744n5806q4387J71815L90478l2159k54072k92734
$$ plain form
9446 -239117 -209644 -54163 92150 111789 -8419 -1327 -196337 -113810 48025 213369 345551
9435 345551 211125 -12630 -29769 156655 223809 260802 -29691 -221915 -127344 -15890
9425 -15890 -81294 -104954 9936 206078 287618 389016 629528 343604 -111782 -202940 144825
9414 144825 134952 224070 193266 144683 -172934 -284390 -134447 81416 288610 428370 350988
9403 350988 360072 161819 7565 -82227 -128087 72808 -82684 -314538 -635231 -578471 -322067
9392 -322067 -246805 -325087 -147394 9738 -250532 -405738 -414388 -107114 154247 -51794
9382 -51794 -110054 154050 137842 215721 45786 -29441 203331 116392 95858 84041 107497
9371 107497 121459 97240 200978 186845 -21895 -401891 -394631 -288658 -106263 31960 16894
$$ packed form
9446b39117K9473J55481J46313J9639j20208P092j95010Q2527J61835J65344J32182
9435C45551j34426k23755j7139J86424O7154L6993k90493j92224R4571J11454
9425a5890o5404k3660J14890J96142Q1540J01398K40512k85924m55386r1158L47765
9414A44825r873Q9118l0804m8583l17617j11456J49943K15863K07194J39760p7382
9403C50988R084j98253j54254q9792m5860K00895j55492k31854l20693N6760K56404
9392c22067P5262p8282J77693J57132k60270j55206q650L07274K61361k06041
9382e1794n8260K64104j6208P7879j69935p5227K32772q6939k0534j1817K3456
9371A07497J3962k4219J03738j4133k08740l79996P260J05973J82395J38223j5066
$$ plain form
9360 16894 96694 273459 230377 226049 386464 356745 333791 187057 -18385 -233174 -98017
9349 -98017 94870 118706 -87142 24518 348907 373770 498035 330260 110846 124267
9339 124267 232496 384319 435910 384180 367330 363343 318438 210092 13199 109467 -23717
9328 -23717 112880 251118 172539 173782 168218 263874 134051 -27330 49704 -11101 25196
9317 25196 -161395 -190160 -95677 78033 288397 -16442 -294622 -393211 -452534 -425894 -155526
9306 -155526 -275045 -344202 -173070 8786 -23809 148092 240720 215306 207755 131415 95466
9295 95466 93269 139232 243686 131840 -40836 -166117 -192946 -177765 -111194 -81947 132044
9284 132044 164959 -18726 -215245 -304876 -309879 -511120 -432713 -183416 137149 159343 131418
$$ packed form
9360A6894P9800J76765m3082m328J60415k9719k2954j46734k05442k14789J35157
9349i8017J92887K3836k05848J11660L24389K4863J24265j67775k19414J3421
9339A24267J08229J51823N1591n1730j6850l987m4905j08346j96893R6268j33184
9328b3717J36597J38238p8579J243n564R5656j29823j61381P7034o0805L6297
9317B5196j86591k8765R4483J73710K10364l04839k78180r8589n9323K6640K70368
9306a55526j19519o9157J71132J81856l2595J71901R2628k5414p551p6340l5949
9295I5466k197M5963J04454j11846j72676j25281k6829J5181O6571K9247K13991
9284A32044L2915j83685j96519q9631n003k01241P8407K49297L20565K2194k7925
$$ plain form
9273 131418 40888 -86248 -284916 -499292 -244990 -200938 -199401 -206357 -286114 -27769 -108608
9262 -108608 7772 210827 228915 18990 -16038 45277 148226 309869 198204 266117
9252 266117 161085 54367 92154 149019 234151 391809 381990 184304 -10096 -184051 -235693
9241 -235693 -98937 -85433 -38010 113255 265189 222447 58048 33263 -167836 -512093
9231 -512093 -305952 -203250 -251438 -193926 -182907 -175131 141092 154696 309979 266811 103536
9220 103536 230565 325394 343072 193277 181659 205388 123309 191792 168685 182134 278315
9209 278315 153691 19629 -52230 42120 61345 88185 48961 11517 46936 175612 239967
9198 239967 342422 224332 -124208 -68909 73138 235883 293837 295903 369285 376141 243981
$$ packed form
9273A31418r0530j27136j98668k14376K54302M4052J537o956p9757K58345q0839
9262a08608J16380K03055J8088k09925l5028O1315J02949J61643j11665O7913
9252B66117j05032j06718L7787N6865Q5132J57658r819j97686j94400j73955n1642
9241b35693J36756J3504M7423J51265J51934m2742j64399k4785k01099l44257
9231e12093K06141J02702m8188N7512J1019P776L16223J3604J55283m3168j63275
9220A03536J27029R4829J7678j49795j1618K3729q2079O8483k3107J3449R6181
9209B78315j24624j34062p1859R4350J9225K6840l9224l7444L5419J28676O4355
9198B39967J02455j18090l48540N5299J42047J62745N7954K066P3382O856j32160
$$ plain form
9187 243981 193494 140893 -52070 -396363 -386722 -194990 -169522 -396073 -358197 -131865 -229351
9176 -229351 -475697 -319114 102341 399388 452951 306828 127397 143641 210335 139512
9166 139512 -11122 -113945 -72720 57885 198967 85762 -116929 76115 414232 370559
9156 370559 117581 -36737 -56761 19620 234857 537729 560851 304187 288359 419107
9146 419107 509928 253299 3360 48025 26602 -128614 -314929 -287649 -193384 -39327 247568
9135 247568 194830 -139653 -233272 102959 367678 367613 329951 372030 379569 323450 265810 30717
9123 30717 -101919 -331876 -261041 -202376 -43935 15586 131902 38826 -94764 -56087 140759
9112 140759 277152 374275 516397 396901 281047 309147 58501 -232558 -313589 -197820
$$ packed form
9187B43981n0487n2601j92963l44293R641J91732K5468k26551L7876K26332r7486
9176b29351k46346J56583M21455K97047N3563j46123j79431J6244O6694p0823
9166A39512j50634j02823M1225J30605J41082j13205k02691J93044L38117m3673
9156C70559k52978j54318k0024P6381K15237L02872K3122k56664j5828J30748
9146D19107R0821k56629k49939M4665k1423j55216j86315K7280R4265J54057K86895
9135B47568n2738l34483r3619L36231K64719o5l7662M2079P539n6119n7640k35093
9123C0717j32636k29957P0835N8665J58441N9521J16316r3076j33590L8677J96846
9112A40759J36393R7123J42122j19496j15854K8100k50646k91059q1031J15769
$$ plain form
9102 -197820 -261232 -243508 45777 95444 -897 -35809 -90526 99099 4320 -42505 192805
9091 192805 310097 152571 150282 99116 -182530 -312575 -343470 -82280 33534 -85477
9081 -85477 -104942 -112329 -110064 -103075 -44505 41255 31694 30131 72842 -110871 -400353 -382524
9069 -382524 -223487 -215790 -242533 -165531 -220539 -260816 -336099 -448701 -203566 145628 370071
9058 370071 292697 309631 386066 492828 494277 258133 141291 107494 88545 -73738 133719
9047 133719 339681 497025 300887 -5924 -225509 -153122 187170 426707 346682 -53135
9037 -53135 -273434 -134659 -137608 -373458 -388531 -194745 -151645 -143816 -228365 -77911 95436
9026 95436 289264 316415 257939 231299 67919 38806 127955 78458 41859 22126 -88006
$$ packed form
9102a97820o3412J7724K89285M9667r6341l4912n4717J89625r4779m6825K35310
9091A92805J17292j57526k289n1166k81646j30045l0895K61190J15814j19011
9081h5477j9465p387K265O989N8570Q5760r561j563M2711j83713k89482J7829
9069c82524J59037P697k6743P7002n5008m0277p5283j12602K45135L49194K24443
9058C70071p7374J6934P6435J06762J449k36144j16842l3797j8949j62283K07457
9047A33719K05962J57344j96138l06811k19585P2387L40292K39537q0025l99817
9037e3135k20299J38775k949k35850j5073J93786M3100P829q4549J50454J73347
9026I5436J93828K7151n8476k6640j63380k9113Q9149m9497l6599j9733j10132
$$ plain form
9015 -88006 -66981 -120206 109613 110986 -122307 -24840 226609 191777 149666 -20338 58256
9004 58256 215672 42681 60172 191956 286886 498093 308955 113269 198367 125811 134529
8993 134529 170577 44428 -43459 46742 -58920 -218916 -283608 -164085 -125664 -33237 50736
8982 50736 69444 183783 148376 8012 -54577 -20452 151323 284531 87403 193833 226971
8971 226971 294373 351544 199914 -14292 -49119 33199 107969 -21937 6319 -20550 -110820
8960 -110820 -153422 -318234 -246235 -76258 -166671 -134742 128172 344109 240289 241282 293279
8949 293279 270568 172358 137895 280370 235155 247862 10647 225638 235436 -16776 -247331
8938 -247331 -252511 -48517 -118121 54829 -130420 16632 174746 78982 74210 92892 110452
$$ packed form
9015h8006K1025n3225K29819J373k33293R7467K51449l4832m2111j70004P8594
9004E8256J57416j72991J7491J31784R4930K11207j89138j95686Q5098p2556Q718
8993A34529L6048j26149q7887R0201j05662j59996o4692J19523L8421R2427Q3973
8982E0736J8708J14339l5407j40364o2589L4125J71775J33208j97128J06430L3138
8971B26971O7402N7171j51630k14206l4827Q2318P4770j29906K8256k6869r0270
8960a10820m2602j64812P1999J69977r0413L1929K62914K15937j03820R93N1997
8949B93279k2711r8210l4463J42475m5215J2707k37215K14991R798k52212k30555
8938b47331n180K03994o9604J72950j85249J47052J58114r5764m772J8682J7560
$$ plain form
8927 110452 111590 97394 -112852 -42722 -2037 46892 4292 -87888 -63508 -150857 -80467 -46026
8915 -46026 148718 156227 -27284 10078 -90773 -215743 -211284 -345558 -398189 -503177 -537922
8904 -537922 -330927 -302475 97673 -5244 -522147 -538354 -318153 -119032 -47911 -1590
8894 -1590 183557 415847 197963 -255203 -282892 -203604 -210923 -211754 -255580 -141573 -248999
8883 -248999 -545489 -499922 -316270 -285665 -183711 119941 383599 320643 180946 -15301
8873 -15301 -65407 -32348 146981 472255 318501 171076 268423 297491 247915 363484 464241
8862 464241 311392 277888 68599 55916 123327 26806 -41934 -48851 3021 9327 -35382 -1498
8850 -1498 118164 27275 -46219 168186 292122 231470 2566 34237 176480 274485 206436
$$ packed form
8927A10452J138j4196k10246P0130M0685M8929m2600r2180K4380q7349P0390L4441
8915d6026J94744P509j83511L7362j00851j24970M459j34274n2631j04988l4745
8904e37922K06995K8452M00148j02917n16903j6207K20201J99121P1121M6321
8894a590J85147K32290k17884m53166k7689P9288p319q31m3826J14007j07426
8883b48999k96490M5567J83652L0605J01954L03652K63658o2956j39697j96247
8873a5301n0106L3059J79329L25274j53754j47425R7347K9068m9576J15569J00757
8862D64241j52849l3504k09289j2683O7411r6521o8740o917N1872O306m4709L3884
8850a498J19662r0889p3494K14405J23936o0652k28904L1671J42243R8005o8049
$$ plain form
8839 206436 255769 134542 -65342 125490 39467 -98894 -17295 -176764 12469 260092
8829 260092 273403 132713 -26318 -186766 -234091 -57744 61565 70726 99700 174396 223477
8818 223477 325749 374408 262835 244617 86232 190936 234129 25352 -214311 -226398
8808 -226398 45057 281765 185778 152713 357490 620943 693946 383685 374440 371857 302485
8797 302485 44733 110196 190660 292481 275992 -63211 -110861 81413 -39751 -229607
8787 -229607 -225733 -325867 -307287 -155919 -61426 44115 -82474 -92089 63871 77023 -75257
8776 -75257 57403 155247 63909 13979 183619 19005 70198 187920 375132 212344 184929
8765 184929 164385 439892 430415 486996 325666 241840 -90637 -368674 -262937 -141863 136617
$$ packed form
8839B06436M9333j21227j99884J90832q6023j38361Q1599j59469J89233K47623
8829B60092J3311j40690j59031j60448m7325J76347J19309R161K8974P4696M9081
8818B23477J02272M8659j11573j8218j58385J04704M3193k08777k39663j2087
8808b26398K71455K36708r5987l3065K04777K63453P3003l10261r245k583o9372
8797C02485k57752O5463Q0464J01821j6489l39203m7650J92274j21164j89856
8787b29607L874j00134J8580J51368R4493J05541j26589r615J55960J3152j52280
8776g5257J32660R7844r1338m9930J69640j64614N1193J17722J87212j62788k7415
8765A84929k0544K75507r477N6581j61330q3826l32477k78037J05737J21074K78480
$$ plain form
8754 136617 373435 324975 122747 121959 153582 44650 -117058 -270752 -294522 -158962 -91209
8743 -91209 49383 128163 242423 361086 307608 223359 144023 56167 234652 360376 306445
8732 306445 23791 -20039 74027 -109988 -135268 -118108 -101338 31819 250016 201338 104350
8721 104350 56495 142290 161901 148090 97412 152978 203287 184120 151496 212184 455586
8710 455586 562527 305716 248899 178854 217495 348797 245328 154692 76161 161997 112444
8699 112444 59092 32464 68568 229378 362703 179436 107749 -26318 66875 151050 14972
8688 14972 -198954 -202378 -255535 8247 267703 156782 41455 -94043 -114684 -198527 -289375
8677 -289375 -425843 -371054 -147546 82840 107449 -81030 -146972 -136696 100677 379264
$$ packed form
8754A36617K36818m8460k02228p88L1623j08932j61708j53694k3770J35560O7753
8743i1209J40592P8780J14260J18663n3478q4249p9336q7856J78485J25724n3931
8732C06445k82654m3830R4066j84015k5280J7160J6770J33157K18197m8678r6988
8721A04350m7855Q5795J9611j3811n0678N5566N0309j9167l2624O0688K43402
8710D55586J06941k56811n6817p0045L8641J31302j03469r0636p8531Q5836m9553
8699A12444n3352k6628L6104J60810J33325j83267p1687j34067R3193Q4175j36078
8688A4972k13926l424n3157K63782K59456j10921j15327j35498k0641q3843r0848
8677b89375j36468N4789K23508K30386K4609j88479o5942J0276K37373K78587
$$ plain form
8667 379264 429556 307937 309383 450589 537707 371959 344298 424640 196259 19772 97236
8656 97236 111020 67854 26854 121923 24635 151894 285086 218009 51839 -33464 -40121
8645 -40121 -422 147866 118951 146839 159282 -19954 -167231 -117256 69961 243766 224630
8634 224630 84156 113558 390305 509180 320782 9745 -89022 -157354 -28327 54365
8624 54365 222197 -101408 -186822 -203927 -263034 -180934 -263853 -173320 200054 304526 158580
8613 158580 91361 31627 41977 173976 261127 160335 140576 -23486 -9593 96556 93933
8602 93933 290290 265509 204106 196614 176815 330645 181739 53097 51981 -7433 -211642
8591 -211642 -239341 -137100 123114 165619 60821 269959 460532 299210 281237 387219
$$ packed form
8667C79264N0292j21619J446J41206Q7118j65748k7661Q0342k28381j76487P7464
8656I7236J3784m3166m1000R5069r7288J27259J33192o7077j66170q5303o657
8645d0121L9699J48288k8915K7888J2443j79236j47277M9975J87217J73805j9136
8634B24630j40474K9402K76747J18875j88398l11037r8767o8332J29027Q2692
8624E4365J67832l23605q5414j7105n9107Q2100q2919R0533L73374J04472j45946
8613A58580o7219n9734J0350J31999Q7151j00792j9759j64062J3893J06149k623
8602I3933J96357k4781o1403p492j9799J53830j48906j28642j116n9414k04209
8591b11642k7699J02241K60214M2505j04798K09138J90573j61322j7973J05982
$$ plain form
8581 387219 314004 111863 -188182 -170924 -107501 -165828 -153014 -242192 -29092 -63062 -56866
8570 -56866 -219651 -380620 -371309 -135279 -55446 109543 198490 269418 34357 -126908 -214639
8559 -214639 -180672 -217578 -67060 205785 38591 104220 217276 -43818 -149972 66873
8549 66873 114234 299059 364595 213848 -5748 -197256 -204946 -114137 70224 -77603 -51968
8538 -51968 86894 91368 60419 109875 -50952 29744 216761 397277 661767 697834 522816
8527 522816 211012 118006 102371 165054 197392 105668 -63856 -62389 -221183 -114971 -148872
8516 -148872 -239926 -68390 153464 359585 300694 64755 125454 201949 331323 400354 317044
8505 317044 232687 300187 390952 249954 46902 20792 38408 122508 -15848 22360 -211779
$$ packed form
8581C87219p3215k02141l00045J7258O3423n8327J2814q9178K13100l3970O196
8570e6866j62785j60969R311K36030P9833J64989Q8947P0928k35061j61265q7731
8559b14639L3967l6906J50518K72845j67194O5629J13056k61094j06154K16845
8549F6873M7361J84825O5536j50747k19596j91508p690R0809J84361j47827K5635
8538e1968J38862M474l0949M9456j60827Q0696J87017J80516K64490L6067j75018
8527E22816l11804r3006j5635O2683L2338r1724j69524J467j58794J06212l3901
8516a48872r1054J71536K21854K06121n8891k35939O0699P6495J29374O9031q3310
8505C17044q4357O7500R0765j40998k03052k6110J7616Q4100j38356L8208k34139
$$ plain form
8494 -211779 -321124 -54252 233430 215863 245582 231742 121076 305742 368630 16109
8484 16109 -297200 -398340 -122952 -27116 27379 -261695 -221640 -173671 -82594 -14473 -84025
8473 -84025 6148 147474 361051 344249 235610 -50146 -350279 -216241 75065 61893
8463 61893 -19353 -295557 -308624 -399942 -388499 -139156 338735 222125 261063 370897 369213
8452 369213 311100 232572 103453 -97056 -27133 224172 495203 572436 400441 266469
8442 266469 98609 135725 -108688 -346169 -260803 -16301 168756 323641 209403 -40832
8432 -40832 60951 -22090 -26571 -163048 -92527 112496 279602 414633 439894 226016 108928
8421 108928 110208 201454 192297 296290 476523 655094 651430 347514 222443 179469 60480
$$ packed form
8494b11779j09345K66872K87682j7567K9719j3840j10666J84666O2888l52521
8484A6109l13309j01140K75388R5836N4495k89074M0055M7969R1077O8121o9552
8473h4025R0173J41326K13577j6802j08639k85756l00133J34038K91306j3172
8463F1893q1246k76204j3067r1318J1443K49343M77891j16610L8938J09834j684
8452C69213n8113p8528j29119k00509O9923K51305K71031P7233j71995j33972
8442B66469j67860L7116k44413k37481Q5366K44502J85057J54885j14238k50235
8432d0832J01783q3041m481j36477P0521K05023J67106J35031K5261k13878j17088
8421A08928J280R1246r157J03993J80233J78571l664l03916j25071m2974j18989
$$ plain form
8410 60480 -68687 -130728 -196494 -156539 -15554 256675 430512 394709 167806 59544 39987
8399 39987 -127618 73149 95465 139930 150352 62432 32250 152579 280810 288017 146354
8388 146354 135182 248507 475949 455379 240275 -27336 -21772 181382 402406 326330 209184
8377 209184 34681 -168799 -195878 -310150 -375835 -263503 8895 154116 292953 308434
8367 308434 109591 17161 32516 105052 146831 69657 -18810 14543 -26464 -153002 -194432
8356 -194432 104230 -112119 -246552 26118 77583 -18668 -247265 -429860 -366289 -30605
8346 -30605 53628 49526 2566 423317 837463 1046171 974992 594228 594857 493485 422405
8335 422405 265180 67837 342841 444008 117294 45632 174276 346571 338487 69096
$$ packed form
8410F0480j29167o2041o5766L9955J40985K72229J73837l5803k26903j08262j9557
8399C9987j67605K00767K2316M4465J0422q7920l0182J20329J28231P207j41663
8388A46354j1172J13325K27442k0570k15104k67611N564K03154K21024p6076j17146
8377B09184j74503k03480k7079j14272o5685J12332K72398J45221J38837J5481
8367C08434j98843r2430J5355P2536M1779p7174q8467L3353m1007j26538m1430
8356a94432K98662k16349j34433K72670N1465r6251k28597j82595O3571L35684
8346c0605Q4233m102m6960M20751M14146K08708p1179l80764O29j01372p1080
8335D22405j57225j97343K75004J01167l26714p1662J28644J72295q084k69391
$$ plain form
8325 69096 159971 219525 26216 -128024 -134693 48368 160217 251656 194602 113506 104446
8314 104446 95926 37685 -176074 -256487 -324188 -360538 -289898 -288746 -79829 -9319 -62827 -145140
8302 -145140 -155340 34492 216716 621276 1040586 1577315 1549947 1215262 756329 383688
8292 383688 93729 -24252 -43443 -32444 -60397 2493 -24730 -137204 -127702 -78008 -60575
8281 -60575 3412 -28184 -128489 -78537 115166 417490 313307 149825 32384 61869 -33419
8270 -33419 74413 164761 108908 -90647 -222915 -146194 -75521 87230 357169 183019 -152213
8259 -152213 -207346 -59431 -3494 -889 71140 363793 565051 688305 714437 796532 678750
8248 678750 239588 184712 198819 266942 271801 173925 158443 109761 226251 36392 -38615
$$ packed form
8325F9096R0875N9554j93309j54240o669J83061J11849R1439n7054q1096r060
8314A04446q520n8241k13759q0413o7701l6350P0640J152K08917P0510n3508q2313
8302a45140j0200J89832J82224M04560M19310N36729k7368l34685m58933l72641
8292C83688k89959j17981j9191J0999k7953O2890k7223j12474R502M9694J7433
8281f0575O3987l1596j00305M9952J93703L02324j04183j63482j17441K9485r5288
8270c3419J07832R0348n5853j99555j32268P6721P0673J62751K69939j74150l35232
8259a52213n5133J47915N5937K605P2029K92653K01258J23254K6132Q2095j17782
8248F78750m39162n4876J4107O8123M859r7876j5482m8682J16490j89859p5007
$$ plain form
8237 -38615 -151422 -320422 -436435 -250401 -3990 169721 136709 -221942 -4723 71538
8227 71538 -89678 -155284 -61292 -90626 -24172 -43581 87973 -43703 -277528 -314491 -399334
8216 -399334 -521813 -398925 -253472 -270829 -223172 -296924 -240131 -71121 26838 98973 222826
8205 222826 316262 65680 -301106 -470172 -354383 -312635 -370142 -108321 109791 -1037
8195 -1037 -57977 -110911 -7943 -85632 -232968 -532927 -504790 -376844 -360041 -73427 77332
8184 77332 33285 65015 241235 113480 128123 189007 -291 -148019 -244362 -70430 102054
8173 102054 49126 72139 59958 -275392 -315460 -171758 -66526 99522 99840 -187017 -92635
8162 -92635 43744 -117601 -150790 -48656 -2743 68022 159112 -8534 -116326 -153400 -402093
$$ packed form
8237c8615j12807j69000j16013J86034K46411J73711l3012l58651K17219P6261
8227G1538j61216o5606R3992k9334O6454j9409J31554j31676k33825l6963q4843
8216c99334j22479J22888J45453j7357M7657p3752N6793J69010R7959P2135J23853
8205B22826R3436k50582l66786j69066J15789M1748n7507K61821K18112j10828
8195a037n6940n2934J02968p7689j47336k99959K8137J27946J6803K86614J50759
8184G7332m4047L1730J76220j27755J4643O0884j89298j47728r6343J73932J72484
8173A02054n2928K3013j2181l35350m0068J43702J05232J66048L18k86857R4382
8162i2635J36379j61345l3189J02134M5913P0765R1090j67646j07792l7074k48693
$$ plain form
8151 -402093 -530385 -538294 -348491 -211619 -4728 1250 -1920 73647 -164317 -280920 -224190
8140 -224190 7530 4260 315433 365552 251355 235188 310162 241405 95602 99067 136915
8129 136915 77478 131421 139567 180703 32575 -369088 -440955 -538694 -359920 -288662 -391182
8118 -391182 -463505 -469247 -404588 -146582 49695 5305 221491 307883 423465 315304 259454
8107 259454 203022 14501 -311498 -363568 -394426 -390607 -300941 -541299 -732349 -480911 -140138
8096 -140138 -170317 -399248 -201823 -191107 -361752 -222238 -92939 -65688 -139735 -166058 -166757
8085 -166757 -114424 27250 103721 134053 -128685 -214881 -341206 -345488 -233006 -51645 199137
8074 199137 262239 201598 67623 -29929 -13154 -98110 -99701 -185483 -407643 -149606 234480
$$ packed form
8151d02093j28292p909J89803J36872K06891N978l170P5567k37964j16603N6730
8140b24190K31720l270L11173N0119j14197j6167P4974o8757j45803L465L7848
8129A36915n9437N3943Q146M1136j48128m01663p1867r7739J78774P1258j02520
8118c91182p2323n742O4659K58006J96277m4390K16186Q6392J15582j08161n5850
8107B59454n6432j88521l25999n2070l0858L819Q9666k40358j91050K51438L40773
8096a40138l0179k28931J97425J0716j70645J39514J29299K7251p4047k6323o99
8085a66757N2333J41674P6471L0332k62738q6196j26325m282J12482J81361K50782
8074A99137O3102o0641j33975r7552J6775q4956j591q5782k22160K58037L84086
$$ plain form
8063 234480 251243 236600 74439 -285198 -555061 -597367 -511573 -298069 -576737 -527069 -99365
8052 -99365 43946 156465 -42107 -280320 -389706 -338755 -294533 -323484 -108208 -119430 -129201
8041 -129201 -78868 -111172 -96420 41264 21673 -385062 -431383 -421554 -225488 -51702 -264390
8030 -264390 -499168 -393959 -282581 -339468 -84297 -52646 -185899 -303329 -252114 -245832 -332223
8019 -332223 -332756 -234609 -106338 224265 419443 469746 368511 238217 113925 287691 461908
8008 461908 269786 -29761 -56073 -110246 -199679 -194454 -212406 -279857 -403187 -331115 41220
7997 41220 169306 144274 31006 -169235 -118718 -61474 13460 162781 269447 178068 81512
7986 81512 47659 83177 93687 -110241 53144 138121 80811 49944 127151 74137 -61136
$$ packed form
8063B34480J6763j4643j62161l59637k69863m2306Q5794K13504k78668M9668M27704
8052i9365J43311J12519j98572k38213j09386N0951M4222k8951K15276j1222r771
8041a29201N0333l2304J4752J37684j9591m06735m6321R829J96066J73786k12688
8030b64390k34778J05209J11378n6887K55171L1651j33253j17430N1215O282q6391
8019c32223n33R8147J28271L30603J95178N0303j01235j30294j24292J73766J74217
8008D61908j92122k99547k6312n4173q9433N225j7952o7451j23330P2072L72335
7997D1220J28086k5032j13268k00241N0517N7244P4934J49321J06666r1379r6556
7986H1512l3853L5518J0510k03928J63385Q4977n7310l0867P7207n3014j35273
$$ plain form
7975 -61136 -395818 -598604 -554487 -419416 -233001 -97172 77915 66990 -125438 -73492
7965 -73492 250484 327757 -27420 -127897 -197285 -155835 -253454 -262057 -314264 -35069 -164205
7954 -164205 -366039 -400528 -205713 188347 199335 -92453 -24814 149155 110977 -266929
7944 -266929 -83058 84433 104957 254701 319401 289168 336861 247205 203981 177241 62648
7933 62648 -297649 -155138 -22493 -51032 20018 99410 180589 69036 -21145 -29094 -7634
7922 -7634 -141058 -94953 -71477 -222058 -142903 10264 56622 -224498 -305623 -354875 -440162
7911 -440162 -507867 -509184 -374432 -176606 -306193 -356526 -367880 -98172 -136134 -43048 12131
7900 12131 83392 33548 179366 102003 113581 50014 -159544 -254592 -184714 -221498 -295782
$$ packed form
7975f1136l34682k02786M4117J35071J86415J35829J75087j0925j92428N1946
7965g3492L23976P7273l55177j00477o9388M1450r7619q603n2207K79195j29136
7954a64205k01834l4489J94815L94060J0988k91788O7639J73969l8178l77906
7944b66929J83871J67491K0524J49744O4700l0233M7693q9656m3224k6740j14593
7933F2648l60297J42511J32645k8539P1050P9392Q1179j11553r0181p949K1460
7922g634j33424M6105K3476j50581P9155J53167M6358k81120q1125m9252q5287
7911d40162o7705j317J34752J97826j29587n0333j1354K69708l7962R3086N5179
7900A2131P1261m9844J45818p7363J1578o3567k09558r5048O9878l6784p4284
$$ plain form
7889 -295782 -310052 -292398 -227786 12546 378375 575975 493629 245831 67695 94343 168524
7878 168524 323379 414274 458311 243517 -28130 -222372 -258550 -523 304771 459323
7868 459323 266888 5348 180155 52474 14840 119125 202370 143245 35934 -223798
7858 -223798 -372876 -279485 -230431 -174164 -221390 -164543 -75000 230135 60618 12380 39194
7847 39194 -656 -5485 -46722 -213185 -147391 147665 167566 205642 84170 -56695 -183090
7836 -183090 -164227 77758 31244 224433 293857 161365 150900 28038 70077 179869 -27313
7825 -27313 -313700 -102171 -25716 -93623 -21159 -134579 -136771 239947 308282 281496 435737
7814 435737 351556 -40291 -289499 -301814 -106499 -180351 -54073 -53228 60435 144062 27067
$$ packed form
7889b95782j4270J7654O4612K40332L65829J97600q2346k47798j78136K6648P4181
7878A68524J54855R0895M4037k14794k71647j94242l6178K58027L05294J54552
7868D59323j92435k61540J74807j27681l7634J04285Q3245n9125j07311k59732
7858b23798j49078R3391M9054N6267m7226N6847Q9543L05135j69517m8238K6814
7847C9194l9850m829m1237j66463O5794K95056J9901L8076j21472j40865j26395
7836a83090J8863K41985m6514J93189O9424j32492j0465j22862M2039J09792k07182
7825b7313k86387K11529P6455o7907P2464j13420k192L76718O8335k6786J54241
7814D35737q4181l91847k49208j2315J95315p3852J26278Q45J13663Q3627j16995
$$ plain form
7803 27067 77712 143075 153360 129336 218629 295176 -69518 -161983 -35183 265017 520515
7792 520515 231245 125891 134873 271467 189152 86578 128281 -41728 -88299 -95484 127382
7781 127382 521514 543182 524907 352606 361049 327453 198031 227861 145287 -97624 -121829
7770 -121829 -4935 249418 438187 592375 661036 548692 389183 263898 166593 315135
7760 315135 385917 448506 419917 194290 -84793 -228379 -101851 58200 141828 -89363
7750 -89363 -191816 -531967 -356506 77844 178478 130538 -10596 56948 115367 -31756
7740 -31756 205058 232823 232084 188270 81958 161141 14541 -120693 -201951 7519 23236
7729 23236 -70903 -308680 -482489 -368514 -80572 100094 228686 393209 75587 -223946
$$ packed form
7803B7067N0645O5363J0285k4024Q9293P6547l64694r2465J26800L00200K55498
7792E20515k89270j05354Q982J36594q2315j02574M1703j70009m6571p185K22866
7781A27382L94132K1668j8275j72301Q443l3596j29422K9830q2574k42911k4205
7770a21829J16894K54353J88769J54188O8661j12344j59509j25285r7305J48542
7760C15135P0782O2589k8589k25627k79083j43586J26528J60051Q3628k31191
7750h9363j02453l40151J75461M34350J00634m7940j41134O7544N8419j47123
7740c1756K36814K7765p39m3814j06312P9183j46600j35234q1258K09470J5717
7729B3236r4139k37777j73809J13975K87942J80666J28592J64523l17622k99533
$$ plain form
7719 -223946 -195638 -52707 -18657 -142291 -142225 -118316 99979 253984 319195 185955 3326
7708 3326 -149357 -240759 -309475 -345610 -82978 -1273 -226882 -315890 -126769 -174674 -250791
7697 -250791 -312085 -238160 -324553 -363045 -232876 -147556 18173 -47998 -266725 -299661 -139542
7686 -139542 -3523 90841 -92652 -244566 -273349 -356448 -347464 -179363 -1307 44573 1763
7675 1763 -93536 -107018 61529 -142522 -202768 54366 124767 1394 -30096 54361 -374718
7664 -374718 -452085 -424410 -354223 -58313 -176826 -59941 -58048 -146426 13085 -68210 -55602
7653 -55602 133218 133366 9679 58206 216535 314173 339472 264779 243823 217425 -171399
7642 -171399 -410924 -297288 -20354 68563 6207 -172544 -110715 -132505 -136370 -14047 -125176
$$ packed form
7719b23946K8308J42931L4050j23634O6K3909K18295J54005O5211j33240j82629
7708C326j52683r1402o8716l6135K62632Q1705k25609q9008J89121m7905p6117
7697b50791o1294P3925q6393l8492J30169Q5320J65729o6171k18727l2936J60119
7686a39542J36019R4364j83493j51914k8783q3099Q984J68101J78056M5880m2810
7675A763r5299j3482J68547k04051o0246K57134P0401j23373l1490Q4457m29079
7664c74718p7367K7675P0187K95910j18513J16885J893q8378J59511q1295J2608
7653e5602J88820J48j23687M8527J58329R7638K5299p4693k0956k6398l88824
7642a71399k39525J13636K76934Q8917o2356j78751O1829k1790l865J22323j11129
$$ plain form
7631 -125176 -216503 -157741 -197132 -197678 -414695 -399088 -89625 12653 11096 102463 13036 131954
7619 131954 -10686 -266025 -320600 -340028 -243096 -47968 -76554 -236801 -318210 -175531 -41271
7608 -41271 96995 96235 176247 119454 38653 136026 108843 3367 -92783 -454072 -577465
7597 -577465 -208881 -147480 -98272 -66909 115846 -99266 -100241 63649 405786 309217 294544
7586 294544 203221 147963 -140985 -359366 -302909 -289614 -195702 -106537 57391 20048 238548
7575 238548 247266 -89194 -110448 -71147 -276916 -318650 -352917 -357206 -303649 45899 148054
7564 148054 -38978 -328668 -354697 -346972 -239954 -195645 -270778 -207635 182387 255529 116503
7553 116503 28306 -5040 -89488 -328431 -496174 -417397 -179598 -198452 -194970 -52472 60095
$$ packed form
7631a25176r1327N8762l9391n46k17017J5607L09463J02278j557R1367q9427J18918
7619A31954j42640k55339n4575j9428R6932J95128k8586j60247q1409J42679J34260
7608d1271J38266p60Q0012n6793q0801R7373k7183j05476r6150l61289j23393
7597e77465L68584O1401M9208L1363J82755k15112r75J63890L42137r6569j4673
7586B94544r1323n5258k88948k18381N6457J3295R3912Q9165J63928l7343K18500
7575B38548Q718l36460k1254L9301k05769m1734l4267m289N3557L49548J02155
7564A48054j87032k89690k6029P725J07018M4309p5133O3143L90022P3142j39026
7553A16503q8197l3346q4448k38943j67743P8777K37799j8854L482J42498J12567
$$ plain form
7542 60095 104389 -12510 172809 53332 -217494 -493260 -442492 -113314 30854 -52889
7532 -52889 -389172 -506063 -283525 -86277 -150245 -163069 56333 -53511 -352177 -375637
7522 -375637 -285652 -133909 -157553 -124775 -174689 -185023 69586 2617 -311954 -476172 -302813
7511 -302813 -58560 -260920 -389524 -209087 23242 93083 63789 31161 27417 -161354 -288928
7500 -288928 -142422 -144845 -138169 -126113 -239784 -195604 89599 22432 188034 67871 -374593
7489 -374593 -372033 -372305 -381101 -343815 -288281 -99077 -288424 -388156 -122138 -126853 -24233 125748
7477 125748 200433 150382 -27308 -96193 -269782 -245048 -147012 -77643 -170499 -183065 -256286
7466 -256286 -186731 -158321 100110 277124 7297 -23633 46528 144707 138761 64076 36078
$$ packed form
7542F0095M4294j16899J85319j19477k70826k75766N0768L29178J44168q3743
7532e2889l36283j16891K22538J97248o3968j2824K19402j09844k98666k3460
7522c75637Q9985J51743k3644L2778m9914j0334K54609o6969l14571j64218J73359
7511c02813K44253k02360j28604J80437K32329O9841k9294l2628l744j88771j27574
7500b88928J46506k423O676J2056j13671M4180K85203o7167J65602j20163m42464
7489c74593K560k72q796L7286N5534J89204j89347r9732K66018m715J02620J49981
7477A25748P4685n0051j77690o8885j73589K4734R8036O9369r2856j2566p3221
7466b56286O9555K8410K58431J77014k69827l0930P0161R8179n946p4685k7998
$$ plain form
7455 36078 -3810 -63145 -137389 -332571 -325038 -128954 -172944 66168 215668 203127 211409
7444 211409 232861 6224 4007 -51099 -305340 -631668 -417559 -100791 -162797 -24053 146764
7433 146764 349365 219508 -529 -114450 130187 168682 76852 52300 11595 -17853 -91505
7422 -91505 17843 183403 25775 -199954 -245516 -375922 -177171 -101558 42672 -33433
7412 -33433 -326085 -324376 -179969 -219012 -382952 -345395 -230372 -221934 -292526 -435790 -185810
7401 -185810 -72832 -32651 46167 125961 56232 -70032 -11196 79785 18468 -219918 -268391
7390 -268391 -213136 -197642 -92076 9489 16089 115846 10243 -121033 -116183 -197678 -175660
7379 -175660 -179112 61184 234158 164169 49683 6314 4080 -1795 200420 380984 205434
$$ packed form
7455C6078l9888n9335p4244j95182P533J96084m3990K39112J49500j2541Q282
7444B11409K1452k26637k217n5106k54241l26328K14109L16768o2006J38744J70817
7433A46764K02601j29857k20037j13921K44637L8495r1830k4552m0705k9448p3652
7422i1505J09348J65560j57628k25729m5562j30406J98751P5613J44230p6105
7412c3433k92652J709J44407l9043j63940L7557J15023Q438p0592j43264K49980
7401a85810J12978M0181P8818P9794o9729j26264N8836R0981o1317k38386m8473
7390b68391N5255J5494J05566J01565O600R9757j05603j31276M850q1495K2018
7379a75660l452K40296J72974o9989j14486m3369k234n875K02215J80564j75550
$$ plain form
7368 205434 -196067 -384108 -349146 -301819 -474192 -440363 -297421 -291025 -356716 -260718 -205132
7357 -205132 -114691 -115644 -137972 -209275 -222461 -128446 -61874 -198351 -237828 114182 9475
7346 9475 90229 -8400 -236540 -331160 -286464 -171075 -99970 -64606 -117324 -199891 -319193
7335 -319193 -350705 -358387 -23060 216351 286185 255602 222251 239400 -47613 -298571 -335527
7324 -335527 -372442 -361516 -38154 276033 426505 405736 253396 -51888 21861 67911 -173730
7313 -173730 -215445 -218136 -208163 18074 48607 -292323 -349366 -298118 -416118 -265956 -23898
7302 -23898 -18698 -201705 -26860 102307 29226 108250 199058 211799 -146481 -327089 -228702
7291 -228702 -287565 17054 278053 228168 189864 -35679 12365 115478 299005 269428 294975
$$ packed form
7368B05434m01501j88041L4962M7327j72373L3829J42942O396o5691R5998N5586
7357b05132R0441r53k2328p1303j3186R4015O6572j36477l9477L52010j04707
7346I475Q0754r8629k28140r4620M4696J15389P1105L5364n2718q2567j19302
7335c19193l1512p682L35327K39411O9834l0583l3351J7149k87013k50958l6956
7324c35527l6915J0926L23362L14187J50472k0769j52340l05284P3749M6050k41641
7313a73730m1715k691R973K26237L0533l40930n7043N1248j18000J50162K42058
7302b3898N200j83007J74845J29167p3081P9024R0808J2741l58280j80608R8387
7291b28702n8863L04619K60999m9885l8304k25543M8044J03113J83527k9577K5547
$$ plain form
7280 294975 370002 68502 681 -63792 -63109 -117030 -142657 -79105 96465 -109702 -412576
7269 -412576 -200235 -19943 -29291 5320 185852 290760 254846 -38934 -278386 -109219
7259 -109219 -56276 -215958 -406332 -400486 -270890 -32642 -109633 -89141 -95233 -194213 -215624
7248 -215624 -86610 61641 -21052 -119273 -7267 -81246 -316864 -300052 -106217 83278
7238 83278 105116 -20999 -145064 14121 234511 404296 389993 475007 351854 52294
7228 52294 37445 9785 -161168 -97046 -36250 34003 286703 92790 -297138 -438563 -375546
7217 -375546 -369429 -406036 -466008 -536554 -421202 -182347 -28126 -83732 -260511 -370233 -282253
7206 -282253 -184587 -229 -13109 -175121 -455081 -514065 -415753 -341707 -71887 -123700 -56791
$$ packed form
7280B94975P5027l01500o7821o4473O83n3921k5627O3552J75570k06167l02874
7269d12576K12341J80292r348L4611J80532J04908l5914k93780k39452J69167
7259a09219N2943j59682j90374N846J29596K38248p6991K0492o092r8980k1411
7248b15624J29014J48251q2693r8221J12006p3979k35618J6812J93835J89495
7238H3278K1838j26115j24065J59185K20390J69785j4303Q5014j23153k99560
7228E2294j4849k7660j70953O4122O0796P0253K52700j93913l89928j41425O3017
7217c75546O117l6607n9972p0546J15352K38855J54221n5606j76779j09722Q7980
7206b82253R7666J84358j2880j62012k79960n8984R8312P4046K69820n1813O6909
$$ plain form
7195 -56791 -94229 -303569 -243805 24329 -110892 -374040 -537037 -612468 -380819 -223135
7185 -223135 -384680 -562453 -284782 -157295 -96026 -45029 -10879 -15710 44704 176512 -83224
7174 -83224 -221252 -341923 -220180 -9927 117517 -123206 -59815 30964 -139244 -157185
7164 -157185 -128789 -208213 -82172 -17270 170011 150083 426443 595398 526192 228619 132796
7153 132796 273030 234776 95569 -179454 -207723 -225245 12827 227088 65246 -157172
7143 -157172 -330182 -463398 -538697 -486662 -299349 -209472 -169176 -195782 -342581 -478885 -365397
7132 -365397 -376252 -315522 -292713 -354765 -285925 -202797 -185842 -88022 86446 -70443 -49964
7121 -49964 61617 -43123 -49349 -190660 -282712 -319971 -400877 -27554 161208 52863 -299870
$$ packed form
7195e6791l7438k09340N9764K68134j35221k63148j62997p5431K31649J57684
7185b23135j61545j77773K77671J27487O1269N0997L4150m831O0414J31808k59736
7174h3224j38028j20671J21743K10253J27444k40723O3391R0779j70208j7941
7164a57185K8396p9424J26041O4902J87281j9928K76360J68955o9206k97573r5823
7153A32796J40234l8254j39207k75023k8269j7522K38072K14261j61842k22418
7143a57172j73010j33216p5299N2035J87313Q9877M0296k6606j46799j36304J13488
7132c65397j0855O0730K2809o2052O8840Q3128J6955R7820J74468j56889K0479
7121d9964J11581j04740o226j41311r2052l7259q0906L73323J88762j08345l52733
$$ plain form
7110 -299870 -518952 -569025 -496460 -367513 -665023 -823797 -466191 -358480 -417256 -297692
7100 -297692 -299838 -267492 -409636 -595503 -632391 -389395 -131489 -77641 100877 150803 92030
7089 92030 -4390 -127847 36705 35072 -74253 6653 -63227 31196 20713 -50789 -88089
7078 -88089 140333 254775 -29364 18232 -57028 -318388 -410485 -385780 -232768 -80309 -54556
7067 -54556 -71013 54428 122133 -147582 14455 125059 59960 -68231 -258916 -223296 -88661
7056 -88661 -257115 -135837 156698 224678 83253 35927 3026 70456 -91902 -301442 -284460
7045 -284460 -413137 -323016 -238037 -30922 449 -140291 -353763 -345321 -299475 -251257 -195626
7034 -195626 -397443 -485279 -507120 -310784 -145269 49623 158328 149337 124577 211603 313189
$$ packed form
7110b99870k19082n0073P2565J28947k97510j58774L57606J07711n8776J19564
7100b97692k146L2346j42144j85867l6888K42996K57906N3848J78518M9926n8773
7089I2030r6420j23457J64552j633j09325Q0906o9880R4423j0483p1502l7300
7078h8089K28422J14442k84139M7596p5260k61360r2097K4705J53012J52459K5753
7067e4556j6457J25441O7705k69715J62037J10604o5099j28191j90685L5620J34635
7056h8661j68454J21278K92535O7980j41425m7326l2901O7430j62358k09540J6982
7045b84460j28677R0121Q4979K07115L1371j40740k13472Q442M5846M8218N5631
7034a95626k01817q7836k1841J96336J65515J94892J08705q991k4760Q7026J01586
$$ plain form
7023 313189 69819 34818 113433 212692 264121 40018 -175306 -58803 29793 -94945 -129374
7012 -129374 -151422 -121677 -209279 -155281 -165310 -86925 28141 152340 -13366 -212209 -255572
7001 -255572 -101638 34243 -219889 -340824 -251820 -198710 -273520 -191529 -259579 -219213 -197016
6990 -197016 -269514 -474759 -246705 -130235 38341 66171 -132031 -78234 -81824 -73956 30658
6979 30658 151691 214849 50191 36911 116487 93454 120445 186035 94202 44292 80433
6968 80433 -51334 -253583 -489563 -486254 -338639 -439581 -448924 -523248 -672466 -522544 -156954
6957 -156954 -38261 75782 72267 101022 191911 327719 357330 453967 324457 346711 250598
6946 250598 290935 114731 -168575 -181200 -110681 -125551 -102738 -92316 52345 41233 -56833
$$ packed form
7023C13189k43370l5001P8615R9259N1429k24103k15324J16503Q8596j24738l4429
7012a29374k2048K9745q7602N3998j0029P8385J15066J24199j65706j98843m3363
7001b55572J53934J35881k54132j20935Q9004N3110p4810Q1991o8050M0366K2197
6990a97016p2498k05245K28054J16470J68576K7830j98202N3797l590P868J04614
6979C0658J21033O3158j64658j3280P9576k3033K6991O5590r1833m9910L6141
6968H0433j31767k02249k35980L309J47615j00942r343p4324j49218J49922L65590
6957a56954J18693J14043l515K8755R0889J35808K9611R6637j29510K2254r6113
6946B50598M0337j76204k83306j2625P0519j4870K2813J0422J44661j1112r8066
$$ plain form
6935 -56833 152966 323942 229646 187717 130191 -83573 -176013 -49160 73775 115202 133619
6924 133619 271679 404120 358441 118764 -123720 -70386 -46860 128786 31258 59005 178406
6913 178406 113435 32950 9681 120558 71480 -150200 -221643 -10642 67890 -105300 -182571
6902 -182571 -38267 -11876 -81154 -119755 -68311 -329151 -238186 -290384 -80850 268031 47537
6891 47537 31172 24109 89347 -61281 -165190 -223369 -359945 -429380 -150559 -65918 -158067
6880 -158067 -141921 -58209 -11053 -181926 -24886 130096 165554 -3097 28293 85449 329963
6869 329963 368223 271201 148481 220840 222301 85161 10330 -80717 92426 127347 185104
6858 185104 -1083 -183560 -317452 -251879 -322734 -127005 129282 153530 -1951 75830
$$ packed form
6935e6833K09799J70976r4296m1929n7526k13764r2440J26853J22935M1427J8417
6924A33619J38060J32441m5679k39677k42484N3334K3526J75646r7528K7747J19401
6913A78406o4971q0485k3269J10877m9078k21680p1443K11001P8532j73190p7271
6902a82571J44304K6391o9278l8601N1444k60840R0965n2198K09534L48881k20494
6891D7537j6365p063O5238j50628j03909n8179j36576o9435K78821Q4641r2149
6880a58067J6146Q3712M7156j70873J57040J54982L5458j68651L1390N7156K44514
6869C29963L8260r7022j22720P2359J461j37140p4831r1047J73143L4921N7757
6858A85104j86187j82477j33892O5573p0855J95729K56287K4248j55481P7781
$$ plain form
6848 75830 134747 201351 467 -127179 -186141 -130937 61823 205089 119370 -290178 -453066
$$ packed form
6848G5830N8917O6604k00884j27646n8962N5204J92760J43266q5719m09548j62888
$$ [...]
##END NTUPLES=NMR SPECTRUM
##END=
