##TITLE=Analysis number 328892
Compound Code cc 12401
Book Reference a lab3
Project Code adrs
Chemist Name stores
##JCAMPDX= 6.0         $$ Bruker NMR JCAMP-DX V2.0
##DATA TYPE= NMR SPECTRUM
##DATA CLASS= NTUPLES
##ORIGIN= Bruker BioSpin GmbH
##OWNER= nmr
$$ XWIN-NMR		Version 3.5
$$ Fri Jul 13 09:38:50 2007 GMT Daylight Time (UT+1h)  MAYBRIDGE\nmr@NMR_250MHZ
##.OBSERVE FREQUENCY= 250.131544655141
##.OBSERVE NUCLEUS= ^1H
##.ACQUISITION MODE= SIMULTANEOUS (DQD)
##.ACQUISITION SCHEME= undefined
##.AVERAGES= 16
##.DIGITISER RES= 18
##SPECTROMETER/DATA SYSTEM= dpx250
##.PULSE SEQUENCE= zg30
##.SOLVENT NAME= DMSO
##.SHIFT REFERENCE= (INTERNAL, DMSO, 0, 16.522)
##AUDIT TRAIL= $$ (NUMBER, WHEN, WHO, WHERE, WHAT)
$$ ##TITLE= Audit trail, XWIN-NMR		Version 3.5
$$ ##JCAMPDX= 5.01
$$ ##ORIGIN= Bruker BioSpin GmbH
$$ ##OWNER= nmr
$$ C:\u/data/dgb/nmr/ADRS/910/pdata/1/auditp.txt
$$ ##AUDIT TRAIL=  $$ (NUMBER, WHEN, WHO, WHERE, WHAT)
(   1,<2007-07-13 09:38:20.01 +100>,<MAYBRIDGE\nmr>,<NMR_250MHZ>,
      <created by zg, POWCHK disabled, PULCHK disabled
       configuration hash MD5:
       76 6E 9A 78 1E 09 19 81 EC 84 63 8F B0 6A 59 2D
       data hash MD5: 64K
       02 27 29 3D 62 F0 43 62 B9 FB B8 D5 F1 08 A0 C8>)
(   2,<2007-07-13 09:38:33.87 +100>,<MAYBRIDGE\nmr>,<NMR_250MHZ>,
      <Start of raw data processing
       ef LB = 0.3 FT_mod = 6 PKNL = 1 SI = 32K 
       data hash MD5: 32K
       7F 9D B1 D4 FE 87 51 4B 86 22 DD BC 1B 1F 2B 8C>)
(   3,<2007-07-13 09:38:35.89 +100>,<MAYBRIDGE\nmr>,<NMR_250MHZ>,
      <apk 
       data hash MD5: 32K
       3E D9 77 4B 36 2A 6D 79 65 7F 2E 01 40 A6 DE AE>)
(   4,<2007-07-13 09:38:38.08 +100>,<MAYBRIDGE\nmr>,<NMR_250MHZ>,
      <abs ABSG = 5 
       data hash MD5: 32K
       02 A7 BC 99 F8 99 74 43 14 B1 5A C0 82 8B 4E D2>)
$$ ##END=
$$ 
$$ hash MD5
$$ CC 89 5D BA C5 26 29 DF 1D A4 EE AE 0F 8C 8A D0
##$RELAX= 
##$RELAX= 
##$RELAX= 
##$RELAX= 
##$RELAX= 
##$RELAX= 
##$RELAX= 
$$ Bruker specific parameters
$$ --------------------------
##$DU= <C:\u>
##$EXPNO= 910
##$NAME= <ADRS>
##$PROCNO= 1
##$TYPE= <nmr>
##$USER= <dgb>
##$AMP= (0..31)
100 100 100 100 100 100 100 100 100 100 100 100 100 100 100 100 100 100 
100 100 100 100 100 100 100 100 100 100 100 100 100 100 
##$AQSEQ= 0
##$AQ_mod= 3
##$AUNM= <au_zg>
##$AUTOPOS= <9 >
##$BF1= 250.13
##$BF2= 250.13
##$BF3= 250.13
##$BF4= 250.13
##$BF5= 500.13
##$BF6= 500.13
##$BF7= 500.13
##$BF8= 500.13
##$BYTORDA= 1
##$CFDGTYP= 0
##$CFRGTYP= 5
##$CHEMSTR= <none>
##$CNST= (0..31)
1 1 145 1 1 1 1 1 1 1 1 1 1 1 1 1 1 1 1 1 1 1 1 1 1 1 1 1 1 1 1 1 
##$CPDPRG= <>
##$CPDPRG1= <>
##$CPDPRG2= <>
##$CPDPRG3= <>
##$CPDPRG4= <mlev>
##$CPDPRG5= <mlev>
##$CPDPRG6= <mlev>
##$CPDPRG7= <mlev>
##$CPDPRG8= <mlev>
##$CPDPRGB= <>
##$CPDPRGT= <>
##$D= (0..31)
0 1 0 0 0 0 0 0 0 0.06 0 0 0 0 0 0 0.0002 0 0 0 0 0 0 0 0 0 0 0 0 0 0 
0 
##$DATE= 1184315898
##$DBL= (0..7)
120 120 120 120 120 120 120 120 
##$DBP= (0..7)
150 150 150 150 150 150 150 150 
##$DBP07= 0
##$DBPNAM0= <>
##$DBPNAM1= <>
$$ [...]
##$SUBNAM7= <"">
##$SUBNAM8= <"">
##$SUBNAM9= <"">
##$SW= 20.6930455092707
##$SWIBOX= (0..15)
0 0 3 0 0 0 0 0 0 0 0 0 0 0 0 0 
##$SW_h= 5175.983436853
##$TD= 65536
##$TD0= 1
##$TE= 296.16
##$TE2= 300
##$TE3= 300
##$TEG= 300
##$TL= (0..7)
0 120 120 120 120 120 120 120 
##$TP= (0..7)
150 150 150 150 150 150 150 150 
##$TP07= 0
##$TPNAME0= <>
##$TPNAME1= <>
##$TPNAME2= <>
##$TPNAME3= <>
##$TPNAME4= <>
##$TPNAME5= <>
##$TPNAME6= <>
##$TPNAME7= <>
##$TPOAL= (0..7)
0.5 0.5 0.5 0.5 0.5 0.5 0.5 0.5 
##$TPOFFS= (0..7)
0 0 0 0 0 0 0 0 
##$TUNHIN= 0
##$TUNHOUT= 0
##$TUNXOUT= 0
##$USERA1= <user>
##$USERA2= <user>
##$USERA3= <user>
##$USERA4= <user>
##$USERA5= <user>
##$V9= 5
##$VALIST= <valist>
##$VCLIST= <CCCCCCCCCCCCCCC>
##$VD= 0
##$VDLIST= <DDDDDDDDDDDDDDD>
##$VPLIST= <PPPPPPPPPPPPPPP>
##$VTLIST= <TTTTTTTTTTTTTTT>
##$WBST= 1024
##$WBSW= 4
##$XGAIN= (0..3)
0 0 0 0 
##$XL= 0
##$YL= 0
##$YMAX_a= 306038
##$YMIN_a= -249855
##$ZGOPTNS= <>
##$ZL1= 120
##$ZL2= 120
##$ZL3= 120
##$ZL4= 120
##$ABSF1= 16.522
##$ABSF2= -4.171173
##$ABSG= 5
##$ABSL= 3
##$ALPHA= 0
##$AQORDER= 0
##$ASSFAC= 0
##$ASSFACI= 0
##$ASSFACX= 0
##$ASSWID= 0
##$AUNMP= <proc_1d>
##$AZFE= 0.1
##$AZFW= 0.1
##$BCFW= 0
##$BC_mod= 0
##$BYTORDP= 0
##$COROFFS= 0
##$CY= 12.5
##$DATMOD= 1
##$DC= 0
##$DFILT= <>
##$DTYPP= 0
##$F1P= 14.0000005364418
##$F2P= -0.99999901652339
##$FCOR= 0.5
##$FTSIZE= 32768
##$FT_mod= 6
##$GAMMA= 0
##$GB= 0
##$INTBC= 1
##$INTSCL= 1
##$ISEN= 128
##$LB= 0.3
##$LEV0= 0
##$LPBIN= 0
##$MAXI= 10000
##$MC2= 0
##$MEAN= 0
##$ME_mod= 0
##$MI= 0
##$NCOEF= 0
##$NC_proc= -6
##$NLEV= 6
##$NOISF1= 0
##$NOISF2= 0
##$NSP= 0
##$NTH_PI= 0
##$NZP= 0
##$OFFSET= 16.522
##$PC= 1
##$PHC0= -50.15925
##$PHC1= -19.05665
##$PH_mod= 1
##$PKNL= yes
##$PPARMOD= 0
##$PSCAL= 4
##$PSIGN= 0
##$REVERSE= no
##$SF= 250.13
##$SI= 32768
##$SIGF1= 0
##$SIGF2= 0
##$SINO= 400
##$SIOLD= 32768
##$SREGLST= <1H.DMSO>
##$SSB= 0
##$STSI= 32768
##$STSR= 0
##$SW_p= 5175.98343685301
##$SYMM= 0
##$S_DEV= 0
##$TDeff= 65536
##$TDoff= 0
##$TI= <Analysis number 999999
Compound Code 99
Book Reference 9
Project Code 9>
##$TILT= no
##$TM1= 0
##$TM2= 0
##$TOPLEV= 0
##$USERP1= <user>
##$USERP2= <user>
##$USERP3= <user>
##$USERP4= <user>
##$USERP5= <user>
##$WDW= 1
##$XDIM= 32768
##$YMAX_p= 417631949
##$YMIN_p= -2377067
$$ End of Bruker specific parameters
$$ ---------------------------------
##NTUPLES= NMR SPECTRUM
##VAR_NAME=  FREQUENCY,     SPECTRUM/REAL,   SPECTRUM/IMAG
##SYMBOL=    X,             R,               I
##VAR_TYPE=  INDEPENDENT,   DEPENDENT,       DEPENDENT
##VAR_FORM=  AFFN,          ASDF,            ASDF
##VAR_DIM=   32768,         32768,           32768
##UNITS=     HZ,            ARBITRARY UNITS, ARBITRARY UNITS
##FACTOR=    0.157963299565203, 1,           1
##FIRST=     4132.6476996994, 0,             0
##LAST=      -1043.33573715361, 0,           0
##MIN=       -1043.33573715361, -2377067,    0
##MAX=       4132.6476996994, 417631949,     0
$$ Real data points
##PAGE= N=1
##DATA TABLE= (X++(R..R)), XYDATA
$$ [...]
23580B08366Q1168j72112j78847p5579O0244k7183k5422J48754K9179k6811m8108
$$ 208366 289534 117422 -61425 -137004 -76760 -103943 -129365 19389 48568 21757 -26351
23569b6351L9926N3321m8945o6010K6431M6561J37076K0500q6152j30414j35357
$$ -26351 13575 66896 17951 -48059 -21628 24933 162009 182509 96357 -34057 -169414
23558a69414j7942K9613J18196j5659m3269n3257L5146J27724o0325j10952p6327
$$ -169414 -187356 -157743 -39547 -55206 -98475 -151732 -116586 11138 -49187 -160139 -236466
23547b36466R4097K32629Q4558o0013j22356m8924l4639L6512L3266l9427K0058
$$ -236466 -142369 90260 174818 114805 -7551 -56475 -91114 -54602 -21336 -60763 -40705
23536d0705N0963K2283n5454m5611j5255J1537K0063J10893P7762j32637j36859
$$ -40705 10258 32541 -22913 -68524 -83779 -72242 -52179 58714 136476 3839 -133020
23525a33020p5064J54836R8924o6166n8704J81284n322k08153M2148J12968m7426
$$ -133020 -208084 -53248 45676 -20490 -79194 102090 96768 -111385 -69237 43731 -3695
23514c695k0021N0843j6032J02757P0378j25647j3546J06104L8016K0592n9897
$$ -3695 -23716 27127 11095 113852 184230 58583 45037 151141 189157 209749 149852
23503A49852q1934k2896M2918J0039o7635r3752M912k8165p3256M9214N8505p8602
$$ 149852 67918 45022 87940 97979 30344 -63408 -58496 -86661 -159917 -110703 -52198 -130800
23491a30800J1836J2514O8618l5152p6137r6335K6091J91639J26467K4983l0280
$$ -130800 -118964 -106450 -37832 -72984 -149121 -245456 -219365 -27726 98741 123724 93444
23480I3444L2894K0596j29768j75982p3596J03760O6943J8020J3128M737l7609
$$ 93444 126338 146934 17166 -158816 -232412 -128652 -61709 -43689 -30561 -25824 -63433
23469f3433O9378j02865m9613N5250J8789p2080j0033O5595P6512J8868j21704
$$ -63433 5945 -96920 -146533 -91283 -72494 -144574 -154607 -89012 -12500 6368 -115336
23458a15336N1464L9231p7583L3644O5350m541J9176M1449j6552n5890j6504M6823
$$ -115336 -63872 -24641 -102224 -68580 -3230 -7771 11405 52854 36302 -19588 -36092 10731
23446A0731K3447J56M095M4387J4283l8256p2760q5942q0230J5848k7044k1109
$$ 10731 34178 34334 38429 82816 97099 58843 -13917 -99859 -180089 -164241 -191285 -212394
23434b12394r116j4099l4293R1774L6261l1694o6652Q641O0944N4516l6838m2617
$$ -212394 -221510 -235609 -269902 -178128 -141867 -173561 -240213 -231572 -170628 -116112 -152950 -195567
23422a95567j25060R564R9675M7657O379m0246Q2526R0528o5838o8558N7560M5465
$$ -195567 -320627 -311063 -211388 -163731 -157352 -197598 -115072 -24544 -90382 -158940 -101380 -55915
23410e5915L1718o770o043j30464p6705L9201P5824L2797q1278J2433Q0664L1607
$$ -55915 -24197 -30967 -37010 -167474 -244179 -204978 -129154 -96357 -177635 -165202 -84538 -52931
23398e2931r2838O472O3230M1892L5583n2200l0056Q8002Q1387o3800j14771m2504
$$ -52931 -145769 -139297 -76067 -34175 1408 -50792 -80848 7154 88541 24741 -90030 -132534
23386a32534o0689j7338J9591K7980L3673N6010J2815K1936r1145j12693m750
$$ -132534 -193223 -210561 -190970 -162990 -129317 -73307 -60492 -38556 -129701 -242394 -247144
23375b47144N1512O907M8848k8270o996R410m0903J16810l223J3292j7130p12
$$ -247144 -195632 -188725 -139877 -168147 -175143 -165733 -206636 -89826 -93049 -79757 -96887 -97599
23363i7599J21732k8452q7207j68103j2645J82663J66373l3207n9768j5852Q6045
$$ -97599 24133 -4319 -91526 -259629 -272274 -89611 76762 43555 -16213 -32065 53980
23352E3980J1026j6762r4531L2000Q4015M2602m5201p9950J5745N2832m3476K1485
$$ 53980 65006 48244 -46287 -14287 69728 112330 67129 -12821 2924 55756 12280 33765
23340C3765l4386n2773n4236Q950o7729J32155K03220N60q2952l9107k4350J0204
$$ 33765 -621 -53394 -107630 -98680 -166409 -34254 168966 169526 86574 47467 23117 33321
23328C3321J24545q5635n4714J0577k7302m1353P4447J036j6648o3428j01666
$$ 33321 157866 72231 17517 28094 792 -40561 33886 34922 18274 -45154 -146820
23317a46820Q7259m3953q2398o6430j12804K2087R1408J06151j12871N3706q7962
$$ -146820 -59561 -103514 -185912 -252342 -365146 -343059 -251651 -145500 -258371 -204665 -292627
23306b92627o3092M4675Q0717N0140k8974O544K2592n2925L3058n8864k8498L8075
$$ -292627 -355719 -311044 -230327 -180187 -209161 -202617 -180025 -232950 -199892 -258756 -287254 -249179
23294b49179o8251k199M3881o7669J0795J68120P249n6170J6502P3352o0525O448
$$ -249179 -317430 -319629 -275748 -343417 -332622 -164502 -157253 -213423 -196921 -123569 -184094 -177646
23282a77646K4847L0310J29238M1110k5387j48104r3904N2606R527Q2604J06422
$$ -177646 -152799 -122489 6749 47859 22472 -125632 -219536 -166930 -157403 -74799 31623
23271C1623q6664j33868p9860k6992P8282R8143J06919N4950j4339L1993l9588
$$ 31623 -55041 -188909 -268769 -295761 -217479 -119336 -12417 42533 28194 60187 20599
23260B0599j30870m2380O410n482M4141n7846m2039L1587N6880O5797l4061p6804
$$ 20599 -110271 -152651 -146241 -151723 -107582 -165428 -207467 -175880 -119000 -53203 -87264 -164068
23248a64068J9925J26518K1240n9156j4321n0479k0402m5748j7510j7069m4756
$$ -164068 -144143 -17625 3615 -55541 -69862 -120341 -140743 -186491 -204001 -221070 -265826
23237b65826J14788N5651l9818M926J01098R9713o450j2686p5232j22379l2805
$$ -265826 -151038 -95387 -135205 -130279 -29181 70532 64082 51396 -23836 -146215 -179020
23226a79020M0528m3630N173r9186O2087J6867M1576k1702j615M5910J01657Q4080
$$ -179020 -138492 -182122 -176949 -276135 -214048 -197181 -155605 -177307 -178922 -133012 -31355 52725
23214E2725o0535l3473l9727o3224L7017L6255L9452N9782M6030M9866o6345j0440
$$ 52725 -7810 -41283 -81010 -144234 -107217 -70962 -31510 28272 74302 124168 57823 47383
23202D7383O23m0007r9565K927M3784j2327P019O9760P8432k4317Q0034k91m7333
$$ 47383 48006 7999 -91566 -88639 -44855 -57182 -50163 19597 98029 73712 153746 153455 106122
23189A06122m2931P4450L077r1447j14473n7871K8365m4613l6571K340k8055j6197
$$ 106122 63191 137641 140718 49271 -65202 -123073 -94708 -139321 -175892 -173552 -201607 -217804
23177b17804M7391R613j0107j4389j8828J1163O053j7082r8493J17394P6455N0910
$$ -217804 -170413 -160800 -170907 -185296 -204124 -192961 -186908 -203990 -302483 -185089 -108634 -57724
23165e7724j03770j14026J21951Q6144L0603o4929p3205l5524j01571l9895J2172
$$ -57724 -161494 -275520 -153569 -67425 -36822 -101751 -174956 -210480 -312051 -351946 -339774
23154c39774R8397m13P2901k9726L5626J39370q2197o6209K5939K6914P9277k2831
$$ -339774 -241377 -241790 -168889 -198615 -162989 -23619 -105816 -172025 -146086 -119172 -39895 -62726
23142f2726r7164Q763M7243q8301q9017J8103k4729J00050J30661m4337q0168
$$ -62726 -159890 -151127 -103884 -192185 -281202 -263099 -287828 -187778 -57117 -101454 -181622
23131a81622Q876J09681k304L3953p6558j04088N1731N6415Q555J7595j6572J5503
$$ -181622 -172746 -63065 -65369 -31416 -107974 -212062 -160331 -103916 -95361 -77766 -94338 -78835
23119g8835M8589o8287N0167M0805n4733N6244n2868o9046l7375q7212J14872
$$ -78835 -30246 -98533 -48366 -7561 -62294 -6050 -58918 -127964 -165339 -252551 -137679
23108a37679J99159J27742j17221j67573O8796p7226j23627J1125M6959O1702
$$ -137679 61480 189222 72001 -95572 -26776 -104002 -227629 -216504 -169545 -107843
23098a07843K2485n0909l9509R8144n9483l9450q7622j0463K8142O029j06602
$$ -107843 -85358 -136267 -175776 -77632 -137115 -176565 -264187 -274650 -246508 -240479 -347081
23087c47081L4380J0281J06909L8376L8023L7202r1022p4174M4298q6845o065
$$ -347081 -312701 -302420 -195511 -157135 -119112 -81910 -172932 -247106 -202808 -289653 -295718
23076b95718k1833L5162O2079K2981K5828l0707L6368k6228m3065K5204L5555
$$ -295718 -317551 -282389 -220310 -197329 -171501 -202208 -165840 -192068 -235133 -209929 -174374
23065a74374p0583p7078j3638l0770J2554N6321O8479k5697R876N6074R8086J14228
$$ -174374 -244957 -322035 -335673 -366443 -353889 -297568 -229089 -254786 -244910 -188836 -90750 23478
23053B3478k164j46817o5682J3847l0628j9679r49J14483N6775k9023j01281r8424
$$ 23478 21314 -125503 -191185 -177338 -207966 -227645 -228594 -114111 -57336 -86359 -187640 -286064
23041b86064l5079P3617J41842q5213l6934k0002l936J5533O3529R2142p306k2712
$$ -286064 -321143 -247526 -105684 -190897 -227831 -247833 -251769 -236236 -172707 -80565 -87871 -110583
23029a10583L6110M1781j23808j07426R7527N586M175O2816K3359K2670o4950
$$ -110583 -74473 -32692 -156500 -263926 -166399 -160813 -156638 -93822 -70463 -47793 -112743
23018a12743M4507l1134K2776k5722M1228J10322K8488n0293o3874k5594r7745
$$ -112743 -68236 -99370 -76594 -102316 -61088 49234 77722 27429 -36445 -62039 -159784
23007a59784P8127J5302K6866P670K5509N4167k07292n5812l6160q494n875P1552
$$ -159784 -81657 -66355 -39489 -31819 -6310 47857 -159435 -215247 -251407 -259901 -265776 -194224
22995a94224j922k0312j035N7765j6466p9342r1557m1376L3905J11588J07559
$$ -194224 -196146 -216458 -217493 -159728 -176194 -255536 -347093 -388469 -354564 -242976 -135417
22984a35417J22188j9431r3237k7142j5781r0793n7354o2356K3305M4958J04950
$$ -135417 -13229 -32660 -125897 -153039 -168820 -259613 -316967 -379323 -356018 -311060 -206110
22973b06110J00456J1598j03994j571j9035o2110o6823J16690Q9596P927j26837
$$ -206110 -105654 -94056 -198050 -199621 -218656 -280766 -347589 -230899 -141303 -133376 -260213
22962b60213J4799R1030m4898p5875O5699Q1006j2224o2094n9848P3325M0814
$$ -260213 -245414 -154384 -199282 -275157 -209458 -128452 -140676 -202770 -262618 -189293 -148479
22951a48479K9002k5507M9600J19716j46194j13944P7846R5441N811j17924L3154
$$ -148479 -119477 -144984 -95384 24332 -121862 -235806 -157960 -62519 -56708 -174632 -141478
22940a41478l3395q9973m3509O9396k5348L4099M843K3906j4249k4529n4160o2778
$$ -141478 -174873 -264846 -308355 -238959 -264307 -230208 -225365 -201459 -215708 -240237 -294397 -357175
22928c57175m8742L7836J22588O1567J0207p7371k123J8812M4557M8991O3491
$$ -357175 -405917 -368081 -245493 -183926 -173719 -251090 -253213 -234401 -189844 -140853 -77362
22917g7362j4922M3964K2803p9779l5915m7053p6267j05769l5212O3309p0606
$$ -77362 -92284 -48320 -25517 -105296 -141211 -188264 -264531 -370300 -405512 -342203 -412809
22906d12809K5576J34306m0817K6156n5893k3846J23613j9077M0190L3142P9437
$$ -412809 -387233 -252927 -293744 -267588 -323481 -347327 -223714 -242791 -202601 -169459 -90022
22895i0022o8182r6128j7029m8413o947R2577L4209n3192J0880L6647k2838Q1100
$$ -90022 -158204 -254332 -271361 -319774 -326721 -234144 -199935 -253127 -242247 -205600 -228438 -147338
22883a47338L949p383N5226m0571m6811J7098k4771q1402q6685j6392N5877K6009
$$ -147338 -143389 -150772 -95546 -136117 -182928 -165830 -190601 -272003 -358688 -375080 -319203 -293194
22871b93194j4802k3349L5848Q8328N234J2944Q3247J8356j9202K5641j0273o1995
$$ -293194 -307996 -331345 -295497 -207169 -201935 -188991 -105744 -87388 -106590 -80949 -91222 -153217
22859a53217K7915k8229j36830j08113M3658O9653m5671r0209R3321J80489k4259
$$ -153217 -125302 -153531 -290361 -398474 -354816 -285163 -330834 -421043 -327722 -147233 -171492
22848a71492j10390J4764J0056j4239l6189K4357J1413L2033j8774J2991l3043
$$ -171492 -281882 -267118 -257062 -271301 -307490 -283133 -271720 -239687 -258461 -245470 -278513
22837b78513l9043L7596L9560J1728J06324l3269K6268J37698J029j15096j23609
$$ -278513 -317556 -279960 -240400 -228672 -122348 -155617 -129349 8349 9378 -105718 -229327
22826b29327J9953l7962j5685M7531K9185P0962N261q2811n7716L6910M0378k2344
$$ -229327 -209374 -247336 -263021 -215490 -186305 -115343 -110082 -192893 -250609 -213699 -173321 -195665
22814a95665J13165P528l2696j61770m1676K7308N4702J4539J4393p5907J0880
$$ -195665 -82500 -74972 -107668 -269438 -311114 -283806 -229104 -214565 -200172 -276079 -265199
22803b65199R245K7911M766J7906N0849n7013k3020O4325m4619L1011j6328q3417
$$ -265199 -255954 -228043 -223277 -205371 -154522 -211535 -234555 -170230 -214849 -183838 -200166 -283583
22791b83583J902M6125M2629J47080N2740m4036n5181j0237j5118p7793p0947
$$ -283583 -281681 -235556 -192927 -45847 6893 -37143 -92324 -102561 -117679 -195472 -266419
22780b66419K8766k3936L3572J9140J13745o0152J365p0395l5238N1161P5740
$$ -266419 -237653 -261589 -228017 -208877 -95132 -155284 -153919 -224314 -259552 -208391 -132651
22769a32651O2888j4198m8605p3873o8522O4848Q6438k4560J8246l9363N5451
$$ -132651 -69763 -83961 -132566 -206439 -274961 -210113 -123675 -148235 -129989 -169352 -113901
22758a13901l8136j7667K4519j02629m5863J0053j7121N8312K611m1803q645r437
$$ -113901 -152037 -169704 -145185 -247814 -293677 -283624 -300745 -242433 -239822 -281625 -290270 -299707
22746b99707P0116rq8890J50545R0202l0903l5528p8829j4799J7298J19818l7610
$$ -299707 -229591 -229600 -318490 -167945 -77743 -108646 -144174 -223003 -237802 -220504 -100686 -138296
22734a38296j29267j35148j9471J46077J6563n1591N2251J5004M0689j24756l5834
$$ -138296 -267563 -402711 -422182 -276105 -259542 -311133 -258882 -243878 -203189 -327945 -363779
22723c63779M3440j04003M459p747Q8088J34713K4360j40761l3154J9757N5297
$$ -363779 -320339 -424342 -419883 -427630 -339542 -204829 -180469 -321230 -354384 -334627 -279330
22712b79330J35877m6828j05759k0214Q5419n8031J9058P8459l0964q1257L0248
$$ -279330 -143453 -190281 -296040 -316254 -230835 -288866 -269808 -191349 -222313 -303570 -273322
22701b73322O6054l3374j24018p2159J01837K1142o7964k574J8544O4564q0135
$$ -273322 -207268 -240642 -364660 -436819 -334982 -313840 -381804 -384378 -365834 -301270 -381405
22690c81405M562R2243n1710R1033O9574L5349K3405N0634j51984l8941Q4353
$$ -381405 -376843 -284600 -336310 -245277 -175703 -140354 -116949 -66315 -218299 -257240 -172887
22679a72887J9373Q4206k5162j10255N531L7430p9503K196N8431J2080k6201l197
$$ -172887 -153514 -69308 -94470 -204725 -199194 -161764 -241267 -239071 -180640 -168560 -194761 -197958
22667a97958o3898K5344m3034o0991k5343Q9666m1710j55639o0789O4229R8375
$$ -197958 -261856 -236512 -279546 -340537 -365880 -276214 -317924 -473563 -534352 -470123 -371748
22656c71748L9376j1947L9586L7620r968r9999j4420N3897J02986M1791J7025
$$ -371748 -332372 -344319 -304733 -267113 -277081 -377080 -391500 -337603 -234617 -192826 -175801
22645a75801k2131n3829J8249P3214j1995J9743p7980K2111m7193j3637l987R451
$$ -175801 -197932 -251761 -233512 -160298 -172293 -152550 -230530 -208419 -255612 -269249 -273236 -263785
22633b63785N1914m0786j25400o2060J7121M5288L2995m8842R3478N1549j50146
$$ -263785 -211871 -252657 -378057 -440117 -422996 -377708 -344713 -393555 -300077 -248528 -398674
22622c98674o7119J6879J07400l535j2435l3276P280J9138K593J01310J1550O1505
$$ -398674 -465793 -448914 -341514 -345049 -357484 -390760 -383480 -364342 -361749 -260439 -248889 -187384
22610a87384J6433J8494Q8169r3978j09659o1840Q8437J17418J07146m1001j8299
$$ -187384 -170951 -152457 -64288 -158266 -267925 -329765 -241328 -123910 -16764 -57765 -76064
22599g6064l0892j30785o0341J27471k1530R811j24101j03907K3847J03373N7830
$$ -76064 -106956 -237741 -298082 -170611 -192141 -182330 -306431 -410338 -386491 -283118 -225288
22588b25288K146J29044k9557j01986l0083k170q249r0472p2931R2867J05464
$$ -225288 -223142 -94098 -123655 -225641 -255724 -257894 -266143 -356615 -429546 -336679 -231215
22577b31215r3604O8251J34633j5383N6006o670m3097j33760q9426n6449m1287
$$ -231215 -324819 -256568 -121935 -137318 -81312 -87982 -131079 -264839 -354265 -410714 -452001
22566d52001O766l3108J07447K2934o136P049K1586O990M0048N8881J13918J7394
$$ -452001 -445235 -478343 -370896 -347962 -354098 -347049 -325463 -318473 -278425 -219544 -105626 -88232
22554h8232M014j03327j29049J9714p8578o5668j23738Q894J04013L81Q6797M2184
$$ -88232 -84218 -187545 -316594 -296880 -375458 -441126 -564864 -555970 -451957 -451576 -364779 -322595
22542c22595R8445P7452n5247j8052M5599o3570L7821Q2057M4518j44707j15331
$$ -322595 -224150 -146698 -201945 -219997 -174398 -237968 -200147 -118090 -73572 -218279 -333610
22531c33610q6156m1482Q0019K5404k3396n8284J38170J03214j35208q7116k1130
$$ -333610 -419766 -461248 -381229 -355825 -379221 -437505 -299335 -196121 -331329 -418445 -439575
22520d39575L5915K1739m3539P0734l0096l4490o419o5217q441Q2559O3026J12345
$$ -439575 -403660 -381921 -425460 -354726 -384822 -419312 -425731 -490948 -499389 -416830 -353804 -241459
22508b41459p9594j40797N0402Q281J33417J79163M407j28309k2862m6978k2988
$$ -241459 -321053 -461850 -411448 -403167 -269750 -90587 -86180 -214489 -237351 -284329 -307317
22497c07317k071L0216J19261m8854n642P0641L1640J9440J1787j3968m2447P176
$$ -307317 -309388 -279172 -159911 -208765 -214407 -143766 -112126 -92686 -80899 -94867 -137314 -130138
22485a30138R6943P4692n5606j32133j39918l5351N1234Q8679p280k2935M383
$$ -130138 -33195 41497 -14109 -146242 -286160 -321511 -270277 -181598 -188878 -211813 -207430
22474b07430Q5123K2064m0903k5221p9602K0568M5504n4802n2369o1902r469O512
$$ -207430 -122307 -100243 -141146 -166367 -245969 -225401 -179897 -234699 -287068 -348970 -358439 -351927
22462c51927j2432K0508J6105m1169k1939P0529M3711P4834J32866K3194j35931
$$ -351927 -364359 -343851 -327746 -368915 -390854 -320325 -276614 -201780 -68914 -45720 -181651
22451a81651j7939Q4022K2052j26904r4791j4732J31331L3523m9218N979J6872
$$ -181651 -199590 -115568 -93516 -220420 -315211 -329943 -198612 -165089 -214307 -208328 -191456
22440a91456K3017L2204O0069o7872m8308K485r9054m8582K5963J74589Q2504
$$ -191456 -168439 -136235 -76166 -144038 -192346 -189861 -288915 -337497 -311534 -136945 -54441
22429e4441j01416j07833o612Q5532L4036j04138m3108J2136l7K3055Q026J1546
$$ -54441 -155857 -263690 -270302 -184770 -150734 -254872 -297980 -285844 -285881 -262826 -254800 -243254
22417b43254K3115M6278l1900P6326k7299N430L4482q1703n9859O2472M8478r2912
$$ -243254 -220139 -173861 -205761 -129435 -156734 -151304 -116822 -198525 -258384 -195912 -147434 -240346
22405b40346M3612O174n4619r3402M5276O351L855k4747R4400m0601p6718j86294
$$ -240346 -196734 -190560 -245179 -338581 -293305 -286954 -283099 -307846 -213446 -254047 -330765 -517059
22393e17059J8704N7640J14374P6395p81K4353k0765q5417N6078L5846q8702j030
$$ -517059 -498355 -440715 -326341 -249946 -250727 -226374 -247139 -332556 -276478 -240632 -329334 -330364
22381c30364K111r2632k2311O3423O0286R8765Q7198J6380k5450j188j31564j00305
$$ -330364 -328253 -420885 -443196 -379773 -319487 -220722 -133524 -117144 -142594 -143782 -275346 -375651
22369c75651k0368K9309k152j0159j7910j0588O7513N5590k6150l3800N0113J34722
$$ -375651 -396019 -366710 -368862 -379021 -396931 -407519 -340006 -284416 -310566 -344366 -294253 -159531
22357a59531K7818Q724n648m1738Q5r3817l809P9882m7783L5494Q9142J750j54336
$$ -159531 -131713 -122989 -128637 -170375 -170290 -264107 -267916 -188034 -235817 -200323 -111181 -109431 -263767
22344b63767j31649J27055Q0176N5571N9020J8269L3550n6876m0804l5487k6084
$$ -263767 -395416 -268361 -188185 -132614 -73594 -55325 -21775 -78651 -119455 -154942 -181026
22333a81026j09312k5231N2431Q4464j5658o472P5186J1292K677J20528l7879
$$ -181026 -290338 -315569 -263138 -178674 -194332 -200804 -125618 -114326 -111649 8879 -29000
22322b9000j9895m5470j7454o4057p0128q7188J1436J13270K8913J26760J13335
$$ -29000 -48895 -94365 -111819 -175876 -246004 -333192 -321756 -208486 -179573 -52813 60522
22311F0522M3694k8107j87902n0974J0520j31248K7126J27573M9989q5764q4270
$$ 60522 104216 76109 -111793 -162767 -152247 -283495 -256369 -128796 -78807 -164571 -248841
22300b48841R6525m5228p1768K6944P9074K6220r0244k7733Q2019J08237r107
$$ -248841 -152316 -197544 -269312 -242368 -163294 -137074 -227318 -255051 -173032 -64795 -73902
22289g3902N652P089o0027K5168R3239n1330n6451R676J2526k7366m7964k9446
$$ -73902 -68250 -61161 -121188 -96020 -2781 -54111 -110562 -100886 -88360 -115726 -163690 -193136
22277a93136M5434n8987M6352J48135J6027J4587M1279n4845o423m4805m708l5741
$$ -193136 -147702 -206689 -160337 -12202 3825 18412 59691 4846 -1577 -46382 -51090 -86831
22265h6831l841m859p3256l087Q4930j3886k8041k3472k4160N1237j4355j508
$$ -86831 -90672 -95531 -168787 -171874 -86944 -100830 -128871 -152343 -176503 -125266 -139621 -141129
22253a41129n945o3525J04751R8291N177m9104l1831l0563K8469j5364j39817
$$ -141129 -147074 -210599 -105848 -7557 -2380 -51484 -83315 -113878 -85409 -100773 -240590
22242b40590K9053j4210O1416k3944m690J2893j4484Q5861K9954j02885P6306
$$ -240590 -211537 -225747 -164331 -188275 -192965 -180072 -194556 -108695 -78741 -181626 -105320
22231a05320J24448j32495l6338j7649j02590J18578M7575M2468K4600q7853k8367
$$ -105320 19128 -113367 -149705 -167354 -269944 -151366 -103791 -61323 -36723 -124576 -152943
22220a52943M1750Q2970p6227r5048m3666N8063M9310R2402N7151k3022o4344
$$ -152943 -111193 -28223 -104450 -199498 -243164 -185101 -135791 -43389 13762 -9260 -73604
22209g3604k7256Q6267l9175j52256Q2452l5211l3135J16756k305j4956o1478
$$ -73604 -100860 -14593 -53768 -206024 -123572 -158783 -191918 -75162 -77467 -92423 -153901
22198a53901q6528l1948O2847L3214L703M1863K5074J4105j883r4458o7224J0967
$$ -153901 -240429 -272377 -209530 -176316 -172613 -130750 -105676 -91571 -93454 -187912 -255136 -244169
22186b44169l1480j76177J799R284P4511J9089J16526J13020L7595o0184j47293
$$ -244169 -275649 -451826 -450027 -440743 -366232 -347143 -230617 -117597 -80002 -140186 -287479
22175b87479j8329J07730Q0423k7981o4091J6454L7547q688j40698j12670o1309
$$ -287479 -305808 -198078 -117655 -145636 -209727 -193273 -155726 -164414 -305112 -417782 -479091
22164d79091P2662R2317j859K1797J36474J31567o3677j30946r5041L6268N6172
$$ -479091 -406429 -314112 -315971 -294174 -157700 -26133 -89810 -220756 -315797 -279529 -223357
22153b23357R590M1179n679l662q7649P4M2171K4519J5533q5624n1597r4134M014
$$ -223357 -213767 -172588 -178267 -181929 -269578 -269504 -227333 -202814 -187281 -272905 -324502 -418636 -414622
22140d14622N6073O4120K2906k2401K091O9295R4501o105l9696r4499Q602J08964
$$ -414622 -358549 -294429 -271523 -293924 -291833 -222538 -128037 -134142 -173838 -268337 -259735 -150771
22128a50771p5625j2449L6620K7101l3935o1548m2474N2305L9561n9692r336j12389
$$ -150771 -226396 -238845 -202225 -175124 -209059 -270607 -313081 -260776 -221215 -280907 -290243 -402632
22116d02632J6314q5245r3134l953m2701J06357J50007J3858N9564J41205P6571
$$ -402632 -386318 -471563 -564697 -568650 -611351 -504994 -354987 -341129 -281565 -140360 -63789
22105f3789L201m5341l4298P931l6728n6800m6197j15513P4239J04773N7695P1236
$$ -63789 -60588 -105929 -140227 -132296 -169024 -225824 -272021 -387534 -313295 -208522 -150827 -79591
22093g9591Q32l290P1551p0534N894M4242o2864n8852n9983m3797l0349O0343
$$ -79591 -78759 -82049 -10498 -81032 -75138 -30896 -93760 -152612 -212595 -256392 -286741 -226398
22081b26398M4508j5084J351M7193j9336n7507J65522l5059p0345l1430j30957
$$ -226398 -181890 -196974 -195623 -148430 -167766 -225273 -59751 -94810 -165155 -196585 -327542
22070c27542j35217K9005J7425N3712R069m206L9583J02066M9162p2361q7380
$$ -327542 -462759 -433754 -416329 -362617 -353548 -357754 -318171 -216105 -166943 -239304 -326684
22059c26684m4958J4317J15302k4802r1613p1905P5075K6456P0156K0788n4154
$$ -326684 -371642 -357325 -242023 -266825 -358438 -430343 -355268 -328812 -258656 -237868 -292022
22048b92022N695j1749o9286K4234J42821O6606J01807l0947p5101j1647n961
$$ -292022 -286327 -298076 -367362 -343128 -200307 -133701 -31894 -62841 -137942 -149589 -155550
22037a55550l2048j3765o9971O1915O2456J7701j44132K7844k3589r3602M4012
$$ -155550 -187598 -201363 -271334 -209419 -146963 -129262 -273394 -245550 -269139 -362741 -318729
22026c18729J12581J2944j29839m6602J38925K4797m1613j543j7005P5044N9603
$$ -318729 -206148 -193204 -323043 -369645 -230720 -205923 -247536 -249079 -266084 -191040 -131437
22015a31437m3999j8224l4493p018R299n5001L2085K2329N3276q3306m3898n9135
$$ -131437 -175436 -193660 -228153 -235171 -225872 -280873 -248788 -226459 -173183 -256489 -300387 -359522
22003c59522k1987O8266j4712N0584M9615o5577k920j9811j3515L048O5225J0280
$$ -359522 -381509 -313243 -327955 -277371 -227756 -293333 -296253 -316064 -329579 -326531 -261306 -251026
21991b51026o5768K0566M4562k7921Q2670M2523k2589p820J7221L3783J997k5351
$$ -251026 -316794 -296228 -251666 -279587 -196917 -154394 -176983 -184803 -167582 -133799 -131802 -157153
21979a57153N0448N8255L882J8067k2328q4420j17251N362n6279o7863J38533
$$ -157153 -106705 -48450 -44568 -26501 -48829 -133249 -250500 -245138 -301417 -369280 -230747
21968b30747P293j14703O3949O6520J2443J2651R0113j3872j17890j19772P5083
$$ -230747 -223454 -338157 -274208 -207688 -195245 -182594 -92481 -106353 -224243 -344015 -268932
21957b68932J53361n9514o9164r4051o5500N7374j4004J19095l414J0529j545
$$ -268932 -115571 -175085 -244249 -338300 -403800 -346426 -360430 -241335 -244749 -234220 -235765
21946b35765o8806n4712Q0347N1559r9014n2410N410O6126K2190k17325n8270
$$ -235765 -304571 -359283 -278936 -227377 -326391 -378801 -373391 -307265 -285075 -502400 -560670
21935e60670J36951M5822j97Q6505O3190N0508o1512p7675K6078j9931n4791P2276
$$ -560670 -423719 -377897 -378094 -291589 -228399 -177891 -239403 -317078 -291000 -310931 -365722 -293446
21923b93446L6986j10662J06363N5402m3155R4322N7869q6118p7615K6584N9444
$$ -293446 -256460 -367122 -260759 -205357 -248512 -154190 -96321 -182439 -260054 -233470 -174026
21912a74026j09094j4087J19057m5757k1358l7153K8764K5298J0434J2775n9080
$$ -174026 -283120 -297207 -178150 -223907 -245265 -282418 -253654 -228356 -217922 -205147 -264227
21901b64227L4580m4201j20397j8120j013J04370R7957L0421j6001l9007j1950
$$ -264227 -229647 -273848 -394245 -412365 -413378 -309008 -211051 -180630 -196631 -235638 -247588
21890b47588K8930n1971J2597L9993n0996p9782k0696L5916K5362N3325M5022
$$ -247588 -218658 -270629 -258032 -218039 -269035 -348817 -369513 -333597 -308235 -254910 -209888
21879b09888P16L8851N7503n5968j39408j53162L4912J01750k0752K7985L0790
$$ -209888 -209172 -170321 -112818 -168786 -308194 -461356 -426444 -324694 -345446 -317461 -286671
21868b86671n9339J4554R273O3785J59799o744K111p5218j22025j32284r1646
$$ -286671 -346010 -331456 -322183 -258398 -98599 -105343 -103232 -178450 -300475 -432759 -524405
21857e24405M6944J77574O8331j3106m1759o5769k7587J22481M3174q2404K2532
$$ -524405 -477461 -299887 -231556 -244662 -286421 -352190 -379777 -257296 -214122 -296526 -273994
21846b73994j1752K4912j6219p6569j5639j952K9847m1087k1200P6959l0406K705
$$ -273994 -285746 -260834 -277053 -353622 -369261 -371213 -341366 -382453 -403653 -326694 -357100 -354395
21834c54395n5435K4748J14716j0315o0634j1793J12178K2247K1895n0380l1206
$$ -354395 -409830 -385082 -270366 -280681 -341315 -353108 -240930 -218683 -196788 -247168 -278374
21823b78374P2424J1211K9448k6432O0826K3861J01204P8712o4820j83932q9251
$$ -278374 -205950 -194739 -165291 -191723 -130897 -107036 -5832 72880 8060 -175872 -265123
21812b65123P0868K6417p625p1975n1200M4374M286p216k1178o4814L5869k1342
$$ -265123 -194255 -167838 -175463 -247438 -298638 -254264 -249978 -257194 -278372 -343186 -307317 -328659
21800c28659n3021L0601p19q6344k2262j7317N6548R8764P4799N5918o5531o1284
$$ -328659 -381680 -351079 -351798 -438142 -460404 -477721 -421173 -322409 -247610 -191692 -257223 -318507
21788c18507k9543M256m2261K786O6763J17439O4543o830L3434l7729j03773n5208
$$ -318507 -348050 -343794 -386055 -383269 -316506 -199067 -134524 -141354 -107920 -145649 -249422 -304630
21776c04630J1421K4621k6058K809m4162l274n2639Q1134P2790q99r00p9812j7181
$$ -304630 -293209 -268588 -294646 -291837 -335999 -339273 -391912 -310778 -237988 -238887 -239787 -319599 -336780
21763c36780N4583M435k4937K6639J67614J30932l7147j52162j12671p0921N3924
$$ -336780 -282197 -277762 -302699 -276060 -108446 22486 -14661 -166823 -279494 -350415 -296491
21752b96491m7541l1099J75741K2096N1163Q8800K0881j39240j21319j8718K0915
$$ -296491 -344032 -375131 -199390 -177294 -126131 -37331 -16450 -155690 -277009 -295727 -274812
21741b74812j0780j9849N699M4162J10512N7425l9184r5733M0248R0128r270m617
$$ -274812 -285592 -305441 -299742 -255580 -145068 -87643 -126827 -222560 -182312 -92184 -101454 -106071
21729a06071L0185j03067j80485k7537J6890O8718J15380M7348o6136m2138l7794
$$ -106071 -75886 -178953 -359438 -386975 -370085 -301367 -185987 -138639 -204775 -246913 -284707
21718b84707K5838N3931k948n999K1972M3622r0411M4276J35744j4445j48642
$$ -284707 -258869 -204938 -207886 -213885 -191913 -148291 -238702 -194426 -58682 -73127 -221769
21707b21769j08127p009l7275j985P7618n5990m0977K1843J67733J29405j22847
$$ -221769 -329896 -336905 -374180 -376165 -298547 -354537 -395514 -373671 -205938 -76533 -199380
21696a99380q5730M3259j4906j29213r5146J5920J05883J5625j6828L2277M5981
$$ -199380 -285110 -241851 -256757 -385970 -481116 -465196 -359313 -343688 -360516 -328239 -282258
21685b82258O3324k9967j05499k4671L7231Q3974K0104p8593l1904P9483J37089
$$ -282258 -218934 -248901 -354400 -379071 -341840 -257866 -237762 -316355 -348259 -268776 -131687
21674a31687K2685j11983o3073L528n244o6681M5010M9527O6773J5111j21797
$$ -131687 -109002 -220985 -284058 -280530 -285774 -352455 -307445 -257918 -191145 -176034 -297831
21663b97831Q500J7297n1065J403O4708J01612Q229q8407o2337p4848k002j363
$$ -297831 -289331 -272034 -323099 -321696 -256988 -155376 -147147 -235554 -297891 -372739 -374741 -376104
21651c76104n8236o8460N043J46530L3583j29907n9249J10189R3834J23242J23847
$$ -376104 -434340 -502800 -497757 -351227 -317644 -447551 -506800 -396611 -302777 -179535 -55688
21640e5688L2417j15800j01256L2262J40442q8076j96364p7693K6319L8223J9605
$$ -55688 -23271 -139071 -240327 -208065 -67623 -155699 -352063 -429756 -403437 -365214 -345609
21629c45609p1567n7418P8212M3801l3429o7584K9563K6883O6860O4759J33J0534
$$ -345609 -417176 -474594 -396382 -352581 -386010 -453594 -424031 -397148 -330288 -265529 -265396 -254862
21617b54862K2884o590j05490P6714J21196R2015o4311k7641Q3690k9668J5166
$$ -254862 -231978 -238568 -344058 -267344 -146148 -54133 -118444 -146085 -62395 -92063 -76897
21606g6897n233p7862q688r6768k5805K770L9021O618L6339Q2259k6658r5453
$$ -76897 -82130 -159992 -168680 -265448 -291253 -288483 -249462 -242844 -206505 -124246 -150904 -246357
21594b46357j2685o76l7739o4522j2578N5644Q9758k7990j11473P8484l7199p401
$$ -246357 -259042 -259718 -297457 -361979 -374557 -318913 -229155 -257145 -368618 -290134 -327333 -334734
21582c34734m6974J9395N9849j2602M9460K1077L7679k5670j0110r2235j41182
$$ -334734 -381708 -362313 -302464 -315066 -265606 -244529 -206850 -232520 -242630 -334865 -476047
21571d76047l860J26675P8491N3435p2362m7123j21921j06109J17315N842r3127
$$ -476047 -479907 -353232 -274741 -221306 -293668 -340791 -462712 -568821 -451506 -445664 -538791
21560e38791J05287J06337N8349l4439K5625K6711o2826j10733K9213J12791J323
$$ -538791 -433504 -327167 -268818 -303257 -277632 -250921 -313747 -424480 -395267 -282476 -281153
21549b81153r4369j5947K7944J12555j0292K0657J23264M9859m6587j8874j3825
$$ -281153 -375522 -391469 -363525 -250970 -261262 -240605 -117341 -67482 -114069 -132943 -146768
21538a46768j43047L5165O6544p5529n0920l9459L6926m2151r4274R7946J18619
$$ -146768 -289815 -254650 -188106 -263635 -314555 -354014 -317088 -359239 -453513 -355567 -236948
21527b36948J61263J9140j1006l3346J0834j5857L1112k7554q0739r162K1611
$$ -236948 -75685 -56545 -67551 -100897 -90063 -105920 -74808 -102362 -183101 -192263 -170652
21516a70652L8699j4507k199N4030m6922j06011p3479p5485k4519N7151Q8211
$$ -170652 -131953 -146460 -148659 -94629 -141551 -247562 -321041 -396526 -421045 -363894 -275683
21505b75683J4279P7800J8070M0274k4661l4591P721m9626m9266O1154K3523o0590
$$ -275683 -261404 -183604 -165534 -125260 -149921 -184512 -176791 -226417 -275683 -214529 -191006 -251596
21493b51596q7108N0635M1605M7994o3743P1318m1897j36410l7988J15625j345
$$ -251596 -338704 -288069 -246464 -198470 -262213 -190895 -232792 -369202 -407190 -291565 -292910
21482b92910J3034M6929J59904o561j46111r5080K64L9088N1710j31102L571M6032
$$ -292910 -279876 -232947 -73043 -79604 -225715 -320795 -320531 -281443 -229733 -360835 -357264 -311232
21470c11232o9088k5321P1311O4586o5936m2981J7487r7520j4503M7884K4158
$$ -311232 -380320 -405641 -334330 -269744 -335680 -378661 -361174 -458694 -473197 -425313 -401155
21459d01155j5266L47Q4083k4439p6218N8942J01487J6536r3080k2153k2732J40515
$$ -401155 -416421 -416074 -331991 -356430 -432648 -373706 -272219 -255683 -348763 -370916 -393648 -253133
21447b53133J10708P0175j04305j3032n6438j842n7317q6696J3285K8024n527
$$ -253133 -142425 -72250 -176555 -189587 -246025 -247867 -305184 -391880 -378595 -350571 -356098
21436c56098o1924J28943J1178j5838o8282M327Q184R3141n543r0743J8168N2542
$$ -356098 -418022 -289079 -277901 -293739 -362021 -357694 -349510 -256369 -261912 -352655 -334487 -281945
21424b81945k080k2409N5612O3037M1034p8008n9915k9003O8197L0769P9150q5957
$$ -281945 -284025 -306434 -250822 -187785 -146751 -224759 -284674 -313677 -245480 -214711 -135561 -221518
21412b21518o3583N0032J24876K5279K0627j15452q7173K8303Q0386p0186k7341
$$ -221518 -285101 -235069 -110193 -84914 -64287 -179739 -266912 -238609 -158223 -228409 -255750
21401b55750n1283M7823L6671R1988j4834o4604o8086R2609O6515j27666l752
$$ -255750 -307033 -259210 -222539 -130551 -145385 -209989 -278075 -185466 -118951 -246617 -250369
21390b50369k0764m0275l2836n8546N0805P9561J27008K6085j02379j18495k8869
$$ -250369 -271133 -311408 -344244 -402790 -351985 -272424 -145416 -119331 -221710 -340205 -369074
21379c69074n8359N1031Q1402J21899o1022q5613R100J2115M31j0393j9189K2701
$$ -369074 -427433 -376402 -295000 -173101 -234123 -319736 -310636 -298521 -298090 -308483 -327672 -304971
21367c04971N5671k0882q774K9025n4799j12919M5576J84301R4192n7000j05929
$$ -304971 -249300 -270182 -278956 -249931 -304730 -417649 -372073 -187772 -93580 -150580 -256509
21356b56509m0691J8070o0724j66593j8494M3972J16397N3989M5466J43137m913
$$ -256509 -297200 -279130 -339854 -506447 -524941 -480969 -364572 -310583 -265117 -121980 -126893
21345a26893j17068J8k5059j08062j07577L7934J27269N9462J2093L1100J4300
$$ -126893 -243961 -243943 -269002 -377064 -484641 -446707 -319438 -259976 -247883 -216783 -202483
21334b02483R2534j7279j24382r7618L4166L1056j1857o2142J725N8215M0634
$$ -202483 -109949 -127228 -251610 -349228 -315062 -284006 -295863 -358005 -356280 -298065 -257431
21323b57431J07205O6197r2736q5140J40377O4250j6742j00724q4565J73K8316
$$ -257431 -150226 -84029 -176765 -261905 -121528 -57278 -74020 -174744 -259309 -259136 -230820
21312b30820m5849m894O9441O9896q332j30373P407J1484k5825O8664J4872P0405
$$ -230820 -276669 -281563 -212122 -142226 -150558 -280931 -273524 -262040 -287865 -219201 -204329 -133924
21300a33924J38085K0510k01261m0138Q245K6581j9982n5408n5252L5115j152
$$ -133924 4161 24671 -176590 -216728 -208483 -181902 -201884 -257292 -312544 -277429 -278581
21289b78581K7284l847j0744k1028O0685J8224p6633J5936m3583n6151m2719Q3263
$$ -278581 -251297 -255144 -265888 -286916 -226231 -208007 -284640 -268704 -312287 -368438 -411157 -327894
21277c27894R5193Q1192L7565p5995P910o103o7634j9682Q053j6098o022M3535
$$ -327894 -232701 -151509 -113944 -189939 -182029 -188132 -255766 -275448 -267395 -283493 -289515 -245980
21265b45980N0810m9705K3169m3339L5073R4720l0177m7509K3392j6132K64p4246
$$ -245980 -195170 -244875 -221706 -265045 -229972 -135252 -165429 -212938 -189546 -205678 -205414 -279660
21253b79660j7061J19924n7870q7538q3895M381o5302J320l2390K6462K08069
$$ -279660 -296721 -176797 -234667 -322205 -406100 -401719 -467021 -465701 -498091 -471629 -263560
21242b63560P819p5833M0196n6755l8598Q5058l3906q275J05810j0033j6462O011
$$ -263560 -255741 -331574 -291378 -348133 -386731 -301673 -335579 -343854 -238044 -248077 -264539 -258528
21230b58528P512N5173P305o4298l4641m8021k3393M6286L9391r6519l7748r6919
$$ -258528 -251016 -195843 -188538 -252836 -287477 -335498 -358891 -312605 -273214 -369733 -407481 -504400
21218e04400N810N7829K9834L8474J04403L0987j06956m3613P8160L4062l9575
$$ -504400 -498590 -440761 -410927 -372453 -268050 -237063 -344019 -387632 -309472 -275410 -314985
21207c14985n4823n4280M1304O3539M2420n8327N9157R8130m1895J7291J6270
$$ -314985 -369808 -424088 -382784 -319245 -276825 -335152 -275995 -177865 -219760 -202469 -186199
21196a86199O366j06012l5917P5775J3688o9002Q043n2922m841L885l2550m1292
$$ -186199 -179833 -285845 -321762 -245987 -232299 -301301 -293258 -346180 -351021 -347136 -379686 -420978
21184d20978O4631O7736K1341O877J26714L4746n4053l2894k6181M4362q0689
$$ -420978 -356347 -288611 -267270 -260393 -133679 -98933 -152986 -185880 -212061 -167699 -248388
21173b48388n8343N0907N9149J61M4529K37j19889k7507n707j9868j082r71j4766
$$ -248388 -306731 -255824 -196675 -196514 -151985 -151748 -271637 -299144 -304851 -324719 -325801 -326772 -341538
21160c41538J9683m00p0367Q5888J39651L3595m4654m453O2597O003l1883J8861
$$ -341538 -321855 -322255 -392622 -306734 -167083 -133488 -178142 -182595 -119998 -113995 -145878 -127017
21148a27017j2088k9305o370K5075r3948J3067K4969R9992m485q5714r5023N5360
$$ -127017 -139105 -168410 -174780 -149705 -243653 -230586 -205617 -105625 -110110 -195824 -290847 -235487
21136b35487O7497q2148O677k6305l893n938M3597J4230j2861R3115P1868R138
$$ -235487 -167990 -250138 -243461 -269766 -273659 -279597 -236000 -221770 -234631 -141516 -69648 -60510
21124f0510j23904r0574K33767O3072j42018j72596J20684m8840q994P5910K4145
$$ -60510 -184414 -274988 -41221 21851 -120167 -292763 -172079 -220919 -229913 -154003 -129858
21113a29858j21186j02555k3608O153r4370n4996P4880J27340J19371k5762k3927
$$ -129858 -251044 -353599 -377207 -371054 -465424 -520420 -445540 -318200 -198829 -224591 -248518
21102b48518M261j5127R3502P1068j38435j3237k317N4663p0165m7489k5539q0512
$$ -248518 -244257 -259384 -165882 -94814 -233249 -246486 -248803 -194140 -264305 -311794 -337333 -417845
21090d17845R865L824J02901N9210M9290l9365j22218o0350j00518O0443K0121
$$ -417845 -407980 -404156 -301255 -242045 -192755 -232120 -354338 -414688 -515206 -454763 -434642
21079d34642m2245R6477J28358k1867q1312k3903N3108R1851P0140K8321j34847
$$ -434642 -476887 -380410 -252052 -273919 -355231 -379134 -326026 -234175 -164035 -135714 -270561
21068b70561j22942N828P4828m487O8647P7217M5973L9263p9919j01431n036L4974
$$ -270561 -393503 -387675 -312847 -317334 -248687 -171470 -125497 -86234 -166153 -267584 -272620 -237646
21056b37646M7732k9475j7679J2740k8878l9852K6984k8347k0615o1511j6240
$$ -237646 -189914 -219389 -237068 -224328 -253206 -293058 -266074 -294421 -315036 -376547 -392787
21045c92787o1526P180K9483P7346n7275M5508P726K0175l3043Q874Q655N8455
$$ -392787 -454313 -447133 -417650 -340304 -397579 -352071 -344345 -324170 -357213 -348339 -339684 -281229
21033b81229J38107J10831J29905p1693j82101n8370K6953l4157O3305l7458k0290
$$ -281229 -143122 -32291 97614 25921 -156180 -214550 -187597 -221754 -158449 -195907 -216197
21022b16197r507k3764O4211j8396p1264M4352L2820m4984n284j7785M6337r4451
$$ -216197 -225704 -249468 -185257 -203653 -274917 -230565 -197745 -242729 -248013 -265798 -219461 -313912
21010c13912p7867n4880j212j090n310O2234L1135M06o0996q753k031j5420n1428
$$ -313912 -391779 -446659 -447871 -448961 -454271 -392037 -360902 -360496 -421492 -430245 -432276 -447696 -499124
20997d99124J2882m0797K9281J45532o1662k063k1438P8184R4454o5619j44838
$$ -499124 -486242 -527039 -497758 -352226 -413888 -415951 -437389 -359205 -264751 -330370 -475208
20986d75208j5378R1928J1610L1186J39188L997M6388p5070n4019L7972r7722
$$ -475208 -490586 -398658 -387048 -355862 -216674 -212677 -166289 -241359 -295378 -257406 -355128
20975c55128L6511k0697k4269J06187K6428n5156m8200O0455j144j50987p1068
$$ -355128 -318617 -339314 -363583 -257396 -230968 -286124 -334324 -273869 -275013 -426000 -497068
20964d97068O2810K0263m7587J7006K2277O4722M838K2664l443L6225j521o911
$$ -497068 -434258 -413995 -461582 -444576 -422299 -357577 -352739 -330075 -333518 -297293 -298814 -305725
20952c05725Q5597K0155l5414r215N4003K7418j70047m3494L9416p2135Q0834
$$ -305725 -220128 -199973 -235387 -244602 -190599 -163181 -333228 -376722 -337306 -409441 -328607
20941c28607R7613P1226L4910m0072l1145J0546n0704k8246j9940m3446m1515
$$ -328607 -230994 -159768 -124858 -164930 -196075 -185529 -236233 -264479 -284419 -327865 -369380
20930c69380n5882N5264J06418j04737K0203P2905N0734J5118M2881m4186n0042
$$ -369380 -425262 -369998 -263580 -368317 -348114 -275209 -224475 -209357 -166476 -210662 -260704
20919b60704o7424l5672o6336J2466L0750k0074o7045M0000K662q8957p9457L1007
$$ -260704 -328128 -363800 -430136 -417670 -386920 -406994 -474039 -434039 -431377 -520334 -599791 -568784
20907e68784P4291L5663l0270P0632N6143O8854J02849r9460J949N3122J4164
$$ -568784 -494493 -458830 -489100 -418468 -362325 -293471 -190622 -290082 -288133 -235011 -220847
20896b20847J65513o9464o5882j9109j39771j34973J37610R9898p5053r0939m8948
$$ -220847 -55334 -124798 -190680 -209789 -349560 -484533 -346923 -247025 -322078 -413017 -461965
20885d61965L2583l9132k7580P3679M5854M3027n5810M3830M2448K157K9044J4904
$$ -461965 -429382 -468514 -496094 -422415 -376561 -333534 -389344 -345514 -303066 -300909 -271865 -256961
20873b56961j5497l5957R5076J58574J715q3259p3791p0898J8309K4290J61353
$$ -256961 -272458 -308415 -213339 -54765 -53050 -136309 -210100 -280998 -262689 -238399 -77046
20862g7046K4652j76359J0907K0050j85202O1153O9863M5664j45461j74767J693
$$ -77046 -52394 -228753 -217846 -197796 -382998 -321845 -251982 -206318 -351779 -526546 -524853
20851e24853J56561R7488O117j3916J2624K3334o8807l6072l274J76742P2170
$$ -524853 -368292 -270804 -264687 -278603 -265979 -242645 -311452 -347524 -350798 -174056 -101886
20840a01886j10579m0637n3314l1991q6663K3321K5299k5304J36306J18786k139
$$ -101886 -212465 -253102 -306416 -338407 -425070 -401749 -376450 -401754 -265448 -146662 -148801
20829a48801M689p4084K4679K2943n113N2407J4270L6223k2343j08409j76615
$$ -148801 -144112 -218196 -193517 -170574 -175687 -123280 -109010 -72787 -95130 -203539 -380154
20818c80154j99186J6565J09424J58853N2003p4272m1031Q029N6082J8025J07391
$$ -380154 -579340 -562775 -453351 -294498 -242495 -316767 -357798 -349769 -293687 -275662 -168271
20807a68271K8515l1219k4112l5540j01636j1892p004n7286N3563j0385m8083
$$ -168271 -139756 -170975 -195087 -230627 -332263 -344155 -351159 -408445 -354882 -365267 -413350
20796d13350M4376N7318R3909k8751j31967O976J06735R2339m1979r4593M787
$$ -413350 -368974 -311656 -217747 -246498 -378465 -371489 -264754 -172415 -214394 -308987 -304200
20785c04200N6384j6724j18185j14136J8720J03356Q8554M7763J1272q1120m3801
$$ -304200 -247816 -264540 -382725 -496861 -478141 -374785 -286231 -238468 -227196 -308316 -352117
20774c52117K2074k459j048J79619P366r915p3848p4422K4051J00958Q2309p2146
$$ -352117 -330043 -332502 -333550 -153931 -146565 -156480 -230328 -304750 -280699 -179741 -97432 -169578
20762a69578k1669o1957j09914k2449Q7754K5161k6046p6381n4080N5118J31508
$$ -169578 -191247 -253204 -363118 -385567 -297813 -272652 -298698 -375079 -429159 -374041 -242533
20751b42533M4887J6055r7833q3883o5950O7210M1583R1429K7809m8511k6665
$$ -242533 -197646 -181591 -279424 -363307 -429257 -362047 -320464 -229035 -201226 -249737 -276402
20740b76402J08644J6746j15268r4352N1554N4142J2380p2202M0528M3693O2814
$$ -276402 -167758 -151012 -266280 -360632 -309078 -254936 -242556 -314758 -274230 -230537 -167723
20729a67723K1320R043j05610n4630l3133l8395j3179M0258m1910K950n1988L39
$$ -167723 -146403 -137360 -242970 -297600 -330733 -369128 -382307 -342049 -383959 -381009 -432997 -432658
20717d32658L9675M4159m1380j9801J15831l4114N5927K9685j34175J502L3594
$$ -432658 -392983 -348824 -390204 -410005 -294174 -328288 -272361 -242676 -376851 -375349 -341755
20706c41755j8232J5054K4713M797M2352k9743l2337K2808J46777q7688j36159
$$ -341755 -359987 -344933 -320220 -315423 -273071 -302814 -335151 -312343 -165566 -253254 -389413
20695c89413k5916J4515L0184o5066j19413J61081Q2936J3794K3201j4017m8483
$$ -389413 -415329 -400814 -370630 -435696 -555109 -394028 -311092 -297298 -274097 -288114 -336597
20684c36597j4971J38838q091q0872o3320J52231P8873m2841j15651p9358M0448
$$ -336597 -351568 -212730 -220821 -301693 -365013 -212782 -133909 -176750 -292401 -371759 -331311
20673c31311o952p7145n3452J48627l549k0968n0674m9938J1867L4896Q4833j5592
$$ -331311 -338263 -415408 -468860 -320233 -323782 -344750 -395424 -445362 -433495 -398599 -313766 -329358
20661c29358k1285O0940j3035K1277P3439o6150j09713J71022J17543q8167o7107
$$ -329358 -350643 -289703 -302738 -281461 -208022 -274172 -383885 -212863 -95320 -183487 -250594
20650b50594l4653L2747O960k6532n1511n6400K872N5664L3952N7938N5825K6275
$$ -250594 -285247 -252500 -245540 -272072 -323583 -379983 -377111 -321447 -287495 -229557 -173732 -147457
20638a47457n7958N340J7367K6371L3384k2498j28934j00493J14705L3586j11870
$$ -147457 -205415 -200075 -182708 -156337 -122953 -145451 -274385 -374878 -260173 -226587 -338457
20627c38457n2712L7382M6953N1687n8234r8437o3486l7393k6382J00146J66646
$$ -338457 -391169 -353787 -306834 -255147 -313381 -411818 -475304 -512697 -539079 -438933 -272287
20616b72287O4859k9232o1442q0495K7485j7733l9066J58205M0767j17926l6458
$$ -272287 -207428 -236660 -298102 -378597 -351112 -368845 -407911 -249706 -208939 -326865 -363323
20605c63323j06899r6896J12259M6809p6805Q5153Q6970J32281p5493m2375j32226
$$ -363323 -470222 -567118 -454859 -408050 -484855 -399702 -312732 -180451 -255944 -298319 -430545
20594d30545p3603n8651j27048M0493J15625J72628L3809j15246M9366P7581J4616
$$ -430545 -504148 -562799 -689847 -649354 -533729 -361101 -327292 -442538 -393172 -315591 -300975
20583c00975p5244J6439J1823L1030J9760K1215Q7380j0529r9953r6043P0512
$$ -300975 -376219 -359780 -347957 -316927 -297167 -275952 -188572 -199101 -299054 -395097 -324585
20572c24585J25462M4113n0246L6103J2423J1515P2260q5080J5375m3384r030
$$ -324585 -199123 -155010 -205256 -169153 -156730 -145215 -72955 -158035 -142660 -186044 -195074
20561a95074j3147o838r742j10J4294K8759N8975n644k4968m7745j8486o2052
$$ -195074 -208221 -215059 -224801 -224911 -210617 -181858 -122883 -128527 -153495 -201240 -219726 -281778
20549b81778K4175q8720N4605k3391n1546L0493k0661J6422J07218J1931l3111
$$ -281778 -257603 -346323 -291718 -315109 -366655 -336162 -356823 -340401 -233183 -221252 -254363
20538b54363m5216j25801j40215Q1572J5993N982O6215J61066J19213q464j1388
$$ -254363 -299579 -425380 -565595 -484023 -468030 -462048 -395833 -234767 -115554 -124018 -135406
20527a35406n5457L9969m7634N8870N828k8590m656p5507j2169p0242j13439N2983
$$ -135406 -190863 -150894 -198528 -139658 -133830 -162420 -167076 -242583 -254752 -324994 -438433 -385450
20515c85450k402J0084R9952p9927j55149r2468P3574R0285J7658l5318j9452
$$ -385450 -387852 -377768 -277816 -357743 -512892 -605360 -531786 -441501 -423843 -459161 -478613
20504d78613P5023J9940O0480j09526j6450P1304l6364j9970o4939l5932p8957
$$ -478613 -403590 -383650 -323170 -432696 -449146 -377842 -414206 -434176 -499115 -535047 -614004
20493f14004Q2298J01520N1300K64440P3208j47192j77155q6684l0525j3267L457
$$ -614004 -531706 -430186 -378886 -114446 -41238 -188430 -365585 -452269 -482794 -496061 -492604
20482d92604N1367N2225J6820J03625Q507k5711m1134o7310r0119N7610O7010
$$ -492604 -441237 -389012 -372192 -268567 -260060 -285771 -326905 -394215 -484334 -426724 -359714
20471c59714L7398R7459o7166j03096L3174R8905O2436J0145K536L1303o1884
$$ -359714 -322316 -224857 -292023 -395119 -361945 -263040 -200604 -190459 -187923 -156620 -218504
20460b18504p7437N5504j48664q9444r2044Q2783J05593J01376k9896k9882j4667
$$ -218504 -295941 -240437 -389101 -478545 -570589 -487806 -382213 -280837 -310733 -340615 -355282
20449c55282j5817k8775N5973j6334p7056l7022mR963P0496J9251P2042j3196
$$ -355282 -371099 -399874 -343901 -360235 -437291 -474313 -474317 -464354 -393858 -374607 -302565 -315761
20437c15761m1564m6045k6130o4428L9688l4441K2946J74780N7955j344n8955
$$ -315761 -357325 -403370 -429500 -493928 -454240 -488681 -465735 -290955 -233000 -234344 -293299
20426b93299N9273O0385K3508q5415k6990l7427k06042o4148J33656J28816M2234
$$ -293299 -234026 -173641 -150133 -235548 -262538 -299965 -506007 -570155 -436499 -307683 -265449
20415b65449j7753k6211k047Q1587O6278q9222n1385K2558J971p0426r414L5014
$$ -265449 -283202 -309413 -311460 -229873 -163595 -252817 -304202 -281644 -279673 -350099 -359513 -324499
20403c24499j1344m4424K753J8532O675L869K1876j410P3579N1278m0133p9710
$$ -324499 -335843 -380267 -377514 -358982 -352307 -348438 -326562 -327972 -254393 -203115 -243248 -322958
20391c22958n3936j5594o3666J426P4769M5142K582N8737N146k548L048n4868
$$ -322958 -376894 -392488 -456154 -454728 -379959 -334817 -332235 -273498 -268352 -270900 -267852 -322720
20379c22720k681J604L9240J0031j25955o8861L841M4677K0737M5522M6801n1446
$$ -322720 -325401 -323797 -284557 -274526 -400481 -469342 -465501 -420824 -400087 -354565 -307764 -359210
20367c59210j37746l9015o920J7494Q574j422P5723Q3909J0737j2090n0243M2573
$$ -359210 -496956 -535971 -542891 -525397 -516823 -518245 -442522 -358613 -347876 -359966 -410209 -367636
20355c67636r8888j25032J49020L5554l3905k186n161M4355N1779M2243O4963
$$ -367636 -466524 -591556 -442536 -406982 -440887 -443073 -448234 -403879 -352100 -309857 -244894
20344b44894J8851o2415j1558r0507M3651P8941M1429p3793l6646P3174j3932
$$ -244894 -226043 -288458 -300016 -390523 -346872 -267931 -226502 -300295 -336941 -263767 -277699
20333b77699j41201k1211l1117J48264J35494j28614K1885j8135K681J6933q3928
$$ -277699 -418900 -440111 -471228 -322964 -187470 -316084 -294199 -312334 -309653 -292720 -376648
20322c76648o5934o8945K6277J12735K0956J0493L3146q5648r5180M2926J31602
$$ -376648 -442582 -511527 -485250 -372515 -351559 -341066 -307920 -393568 -488748 -445822 -314220
20311c14220R3895l8826J1254p3671p4485O6696L5631k0204M3951m1891j06613
$$ -314220 -220325 -259151 -247897 -321568 -396053 -329357 -293726 -313930 -269979 -311870 -418483
20300d18483j424R8462L297j21257N4184L8963K8246K09935J57100k2780j80574
$$ -418483 -419907 -321445 -318148 -439405 -385221 -346258 -318012 -108077 49023 26243 -154331
20289a54331o5102r4613j5827J7240p4961n1404r6652K254J08894M1625N7871
$$ -154331 -219433 -314046 -329873 -312633 -387594 -438998 -535650 -533396 -424502 -382877 -325006
20278c25006R648j8455l6747M4445P5564j8251l6427o66M5065q7998j00065N0975
$$ -325006 -315358 -333813 -370560 -326115 -250551 -268802 -305229 -305895 -260830 -348828 -448893 -397918
20266c97918J6501m1071n5405N633N6497l0267N9152J6602j9106K059N5433O9107
$$ -397918 -381417 -422488 -477893 -472260 -415763 -446030 -386878 -370276 -389382 -387323 -331890 -262783
20254b62783m8211k477J0946j8167o866L3890j21530j24562Q2982J10476L6453
$$ -262783 -310994 -313471 -302525 -320692 -327558 -293668 -415198 -539760 -456778 -346302 -309849
20243c09849q7529l0454O8230L6636P1407j7172k5060m8003j00955O0669O3547
$$ -309849 -397378 -427832 -359602 -322966 -251559 -268731 -293791 -341794 -442749 -382080 -318533
20232c18533L8716M2903M7512Q2483K9889K7891j47242m7646M8651n6367r9830
$$ -318533 -279817 -236914 -189402 -106919 -77030 -49139 -196381 -244027 -195376 -251743 -351573
20221c51573N0049K747k9967O724p8020k7594N4927J3762L3171N2548o8292J9974
$$ -351573 -301524 -298777 -328744 -322020 -400040 -427634 -372707 -358945 -325774 -273226 -341518 -321544
20209c21544m4029k2777K8876k0497p3159O3506J13404J4786Q8347j4660j793
$$ -321544 -365573 -388350 -359474 -379971 -453130 -389624 -276220 -261434 -173087 -187747 -189540
20198a89540l4046l6737M9367l0972j2614o8408j78175l9613J39275J04861M4330
$$ -189540 -223586 -260323 -210956 -241928 -254542 -322950 -501125 -540738 -401463 -296602 -252272
20187b52272Q5553j18266j07380K414Q4637J24343N6124l8588r5713n6132m2277
$$ -252272 -166719 -284985 -392365 -389951 -305314 -180971 -124847 -163435 -259148 -315280 -357557
20176c57557J4663J15872Q7312M0501n4695q8868j00121q906l005n6194J2744
$$ -357557 -342894 -227022 -139710 -99209 -153904 -242772 -342893 -351799 -354804 -410998 -398254
20165c98254P5359M6572j8416o8248q2764k2997L4412M2818p3429Q5018K8849
$$ -398254 -322895 -276323 -294739 -362987 -445751 -468748 -434336 -391518 -464947 -379929 -351080
20154c51080o2521Q4480P0025J735j6677r7349N840J11699n8758q8924o1594J7975
$$ -351080 -413601 -329121 -259096 -257361 -274038 -371387 -365547 -253848 -312606 -401530 -463124 -445149
20142d45149L4985j9048J559o2208M5030J73919N8632P009q7161m1047p2990M4985
$$ -445149 -410164 -429212 -427653 -489861 -444831 -270912 -212280 -205271 -292432 -333479 -406469 -361484
20130c61484r429p4643J0261p995M7676N1289N981K6576p637O5473L7311K795
$$ -361484 -370913 -445556 -435295 -443290 -395614 -344325 -338344 -311768 -319405 -253932 -216621 -213826
20118b13826m9973m3237O8460q1013p1618l7316K2200Q1538L5791Q1287K8591
$$ -213826 -263799 -307036 -238576 -319589 -391207 -428523 -406323 -324785 -288994 -207707 -179116
20107a79116P9041O73p0823j13013o6193O9590K998k1269N474L8845P688M6728
$$ -179116 -100075 -99402 -170225 -283238 -349431 -279841 -276843 -298112 -292638 -253793 -246105 -199377
20095a99377K6967l8593k0517j23539j40570J6340P2426K7307k5282k6706J2695
$$ -199377 -172410 -211003 -231520 -355059 -495629 -479289 -406863 -379556 -404838 -431544 -418849
20084d18849K7286j3243n9263J7985j2858j0214L3600O806o587L013Q5874N4541
$$ -418849 -391563 -404806 -464069 -446084 -458942 -469156 -435556 -428750 -435337 -432324 -346450 -291909
20072b91909k1972M8304O4663r600j30743q9912J5333L2237k8295L9903K003j6789
$$ -291909 -313881 -265577 -200914 -210514 -341257 -431169 -415836 -383599 -411894 -371991 -369988 -386777
20060c86777n3119M7521L0865P2369K6230J78000P7619j05446j16784j18697p8135
$$ -386777 -439896 -392375 -361510 -289141 -262911 -84911 -7292 -112738 -229522 -348219 -426354
20049d26354m8090O3739K0634j27905M2251Q9396J34593n8622j2606K2768r5335
$$ -426354 -474444 -410705 -390071 -517976 -475725 -386329 -251736 -310358 -322964 -300196 -395531
20038c95531j7538K4510p1362j00978J5037J05811J1362j4467p6909r1192J0648
$$ -395531 -413069 -388559 -459921 -560899 -545862 -440051 -428689 -443156 -520065 -611257 -600609
20027f00609J58578P3781O4135L9808j1423j2546P41l8750K0515k8274n2422J7751
$$ -600609 -442031 -368250 -304115 -264307 -275730 -288276 -287535 -326285 -305770 -334044 -386466 -368715
20015c68715L4848L9557L5093k4772k6997Q6722l8680m5222k4696j28546l0067
$$ -368715 -333867 -294310 -259217 -283989 -310986 -224264 -262944 -308166 -332862 -461408 -491475
20004d91475N6348J1150Q8766J28612M4499m0091j14612j6481K6389j0804l3714
$$ -491475 -435127 -423977 -335211 -206599 -162100 -202191 -316803 -333284 -306895 -317699 -351413
19993c51413J3500k9036k4979k8426J78769J01539l4219m8734R176O548R781o1768
$$ -351413 -337913 -366949 -391928 -420354 -241585 -140046 -174265 -222999 -213823 -207275 -197494 -259262
19981b59262m8435L4105m339m225J08025M2941n6928P466j3184K6419K312j28755
$$ -259262 -307697 -273592 -277931 -282156 -174131 -131190 -188118 -180652 -193836 -167417 -165105 -293860
19969b93860l7850q0210o8849K217J38017N9519L401k2222J2753K2885k5574q4641
$$ -293860 -331710 -411920 -480769 -478552 -340535 -281016 -277615 -299837 -287084 -264199 -289773 -374414
19957c74414L5084J00292L1985j41838j34424N473L6162J8706k865Q584R2687
$$ -374414 -339330 -239038 -207053 -348891 -483315 -477842 -441680 -422974 -425839 -417255 -324568
19946c24568J18018L7595j761P461J9769K1962n8560j06548j03840N7429L9212
$$ -324568 -206550 -168955 -170716 -163255 -143486 -121524 -180084 -286632 -390472 -333043 -293831
19935b93831O5393O0656o3633n1702Q0599O9182r4513n2335j08904J2563J45912
$$ -293831 -228438 -167782 -231415 -283117 -202518 -133336 -227849 -280184 -389088 -376525 -230613
19924b30613K6605n8533R6651L6020j48344o8555J45268L9398n2100J26281L4800
$$ -230613 -204008 -262541 -165890 -129870 -278214 -346769 -201501 -162103 -214203 -87922 -53122
19913e3122k18n8323j01886j23144l4611J8028k7794J18312J33098K5634l185
$$ -53122 -53340 -111663 -213549 -336693 -371304 -353276 -381070 -262758 -129660 -104026 -107211
19902a07211l3441q4554p4178n8365M0844J15389P1927j31701p2599J33837Q9680
$$ -107211 -140652 -225206 -299384 -357749 -316905 -201516 -129589 -261290 -333889 -200052 -110372
19891a10372Q5082p8303q7565q8203m7522O9495J2169l7855P0152R8695K5300
$$ -110372 -25290 -103593 -191158 -279361 -326883 -257388 -245219 -283074 -212922 -114227 -88927
19880h8927o4115j22268m6181m894R3956J5425j9352M456j27642o81r111m1978
$$ -88927 -153042 -275310 -321491 -326385 -232429 -217004 -236356 -231900 -359542 -360223 -369334 -411312
19868d11312J01043J18245k6248j51094j4196N8110k2705L7679l3143l2826J929
$$ -411312 -310269 -192024 -218272 -369366 -383562 -325452 -348157 -310478 -343621 -376447 -374518
19857c74518N6383R7644j6096n0466p3424K6072J11906K1426p5670M6712P8014
$$ -374518 -318135 -220491 -236587 -287053 -360477 -334405 -222499 -201073 -276743 -230031 -152017
19846a52017M2970j2268j23640m4450j33926j5556l1963K3005m1521J02976J55929
$$ -152017 -109047 -121315 -244955 -289405 -423331 -438887 -470850 -447845 -489366 -386390 -230461
19835b30461J07069o1825k2921N5887O5556r3296n3343o0128q8024M9920o8234
$$ -230461 -123392 -185217 -208138 -152251 -86695 -179991 -233334 -293462 -381486 -331566 -399800
19824c99800l990J16766l968m2021K0534r678J5770P6358M2363L5345j3088O5807
$$ -399800 -403790 -287024 -290992 -333013 -312479 -322157 -306387 -230029 -187666 -152321 -165409 -99602
19812i9602Q7493j03152p8575p689k7176O2211j1965O840J02023j35726j30066
$$ -99602 -12109 -115261 -193836 -201525 -228701 -166490 -178455 -171615 -69592 -205318 -335384
19801c35384L9426O654M5079M6933j9573k2742M5750m0800o6364n5438k54K8531
$$ -335384 -295958 -289304 -244225 -197292 -216865 -239607 -193857 -234657 -301021 -356459 -356713 -328182
19789c28182p8353N79O2164j3900j17902r5550k3959J41873R4677r387J935M0393
$$ -328182 -406535 -405956 -343792 -357692 -475594 -571144 -595103 -453230 -358553 -367940 -366005 -325612
19777c25612p9513M2710O1771k7612J4302K5426n3789k3582R2424q1030p9877
$$ -325612 -405125 -362415 -300644 -328256 -313954 -288528 -342317 -365899 -273475 -354505 -434382
19766d34382P6244O8620j49635j07037k5059J3388J31945R3311j4533m9651Q328
$$ -434382 -358138 -289518 -439153 -546190 -571249 -557861 -425916 -332605 -347138 -396789 -388461
19755c88461P143l0297J9447M7662Q1402j1124R0662J04257l6787o4337m8586
$$ -388461 -381318 -411615 -392168 -344506 -263104 -274228 -183566 -79309 -116096 -180433 -229019
19744b29019m5472o9369M9922N7897Q477p9714K1311J32453M8517r8163l5151
$$ -229019 -274491 -343860 -293938 -236041 -227564 -307278 -285967 -153514 -104997 -203160 -238311
19733b38311n0767l2645J9899R9790J4132m8851L286j7817N836K8575M4640M3409
$$ -238311 -289078 -321723 -301824 -202034 -187902 -236753 -233467 -251284 -245448 -216873 -172233 -128824
19721a28824J7991k05598l064J3241k4650j1333p4489n6558M0100J15121P0109
$$ -128824 -110833 -316431 -319495 -306254 -330904 -342237 -416726 -473284 -433184 -318063 -247954
19710b47954J18056p4478k0919N9073P9527l0330j38767j06314K5689M3828L0225
$$ -247954 -129898 -204376 -225295 -166222 -86695 -117025 -255792 -362106 -336417 -292589 -262364
19699b62364J21276o17k27322j42546r566J07653K8961P1493O4060o3843j0478
$$ -262364 -141088 -141705 -369027 -511573 -521139 -413486 -384525 -313032 -248972 -312815 -323293
19688c23293J19071K3605L8032o3019j25836m1354k3701J448M2321m5417P0781
$$ -323293 -204222 -180617 -142585 -205604 -331440 -372794 -396495 -395047 -352726 -398143 -327362
19677c27362Q3806j4702q026J4764m9494r5332O4642O0892J20038j10718j702
$$ -327362 -243556 -258258 -266284 -251520 -301014 -396346 -331704 -270812 -150774 -261492 -263194
19666b63194j2818q4613J3155N2129M2862l6491j7889j2080p1446m3316J06906
$$ -263194 -276012 -360625 -347470 -295341 -252479 -288970 -306859 -318939 -390385 -433701 -326795
19655c26795L2965J9325o9362j7404J66359J00229L048q5135L1960n9819m2945
$$ -326795 -293830 -274505 -343867 -361271 -194912 -94683 -91635 -176770 -144810 -204629 -247574
19644b47574P1108l3857j03531o5713k7123L0115J12383P4084N4904m71N8197
$$ -247574 -176466 -210323 -313854 -379567 -406690 -376575 -264192 -190108 -135204 -135675 -77478
19633g7478k2442n8979l838m8326r8770j51967j0903P2444Q9728R6139J8591l4253
$$ -77478 -99920 -158899 -162737 -211063 -309833 -461800 -472703 -400259 -310531 -214392 -195801 -230054
19621b30054J4762l040m4346J1856J31921J2802K846j31643m8221o2348J3179
$$ -230054 -215292 -218332 -262678 -250822 -118901 -106099 -103253 -234896 -283117 -345465 -332286
19610c32286P2088r689q2770j8001R7512j04255j349P7242K4702R9410L4765p4471
$$ -332286 -260198 -269887 -352657 -370658 -273146 -377401 -378750 -301508 -276806 -177396 -142631 -217102
19598b17102j38542N3707j4436j6613P8426M6329q0109j7365j8476n2111K0065
$$ -217102 -355644 -301937 -316373 -332986 -254560 -208231 -288340 -305705 -324181 -376292 -356227
19587c56227P0365L1784o883m5688M8287K195l1868j7577m100J8465m526m4272
$$ -356227 -285862 -254078 -260961 -306649 -258362 -256167 -288035 -305612 -309712 -291247 -295773 -340045
19575c40045j7996J4846j7789l5156J36270Q7467P2317M2433j77389n7093j8564
$$ -340045 -358041 -343195 -360984 -396140 -259870 -172403 -100086 -57653 -235042 -292135 -310699
19564c10699j27530j12858R6178P7969L8666j35399n1338p2173O7310N4513K026
$$ -310699 -438229 -551087 -454909 -376940 -338274 -473673 -525011 -597184 -529874 -475361 -473335
19553d73335l5540Q9346J25753P0482m7801o2140m9250m5974M1362N3979l3879
$$ -473335 -508875 -419529 -293776 -223294 -271095 -333235 -382485 -428459 -387097 -333118 -366997
19542c66997M5896o6549j17207K0289J26367Q2066j33826k3919J05334J0865j0503
$$ -366997 -321101 -387650 -504857 -484568 -358201 -276135 -409961 -433880 -328546 -317681 -328184
19531c28184J62588N9835j07432J2842L2811Q414n2771k9114j0783r9181k4159
$$ -328184 -165596 -105761 -213193 -200351 -167540 -159126 -211897 -241011 -251794 -350975 -375134
19520c75134n9041o9378K824N3168N0605R9787N1301J3197n7583k03072r068K03188
$$ -375134 -434175 -503553 -500729 -447561 -396956 -297169 -245868 -232671 -290254 -493326 -502394 -299206
19508b99206L7476l7321l2900O8358l8108l1173l1156m0375N1967r260K9367O3
$$ -299206 -261730 -299051 -331951 -263593 -301701 -332874 -364030 -404405 -352438 -361698 -332331 -332268
19496c32268l088l5872J7138L194J0413P6823R9121o2664m7969q818l1942r7406
$$ -332268 -335356 -371228 -354090 -350896 -340483 -263660 -164539 -227203 -275172 -283990 -315932 -413338
19484d13338n8760K3518k5038k6190j8668J2552J61284R7247Q2034l8035p2171
$$ -413338 -472098 -448580 -473618 -499808 -518476 -505924 -344640 -247393 -165359 -203394 -275565
19473b75565P7852M9434j9306j6720r0510j16659j10428K7826P3647K0181K383
$$ -275565 -197713 -148279 -167585 -184305 -274815 -391474 -501902 -474076 -400429 -380248 -377865
19462c77865J2048n3226L3974K3917M5Q1826m563n6960L0371M346N519m7043L0710
$$ -377865 -365817 -419043 -385069 -361152 -361107 -279281 -283844 -340804 -310433 -306087 -300568 -347611 -316901
19449c16901r8648m6422p516o3448R2594J40479O8821J7248j8548J5964o499q0407
$$ -316901 -415549 -461971 -469487 -532935 -440341 -299862 -231041 -213793 -232341 -216377 -222876 -303283
19437c03283k4305r2404n034L3151M3675R7501L6119l5084o5438r0538L6860J3915
$$ -303283 -327588 -419992 -425026 -391875 -348200 -250699 -214580 -249664 -315102 -405640 -368780 -354865
19425c54865K0485O154L8175M8346j12795j24105n645Q8055J54988j3828o4127
$$ -354865 -334380 -328226 -290051 -241705 -354500 -478605 -484250 -396195 -241207 -255035 -319162
19414c19162m986R0545K4560J4345N162J4517j9846r8394L7025j4721M7336m1537
$$ -319162 -324148 -233603 -209043 -194698 -189536 -175019 -194865 -293259 -256234 -270955 -223619 -265156
19402b65156o2913P2771l7672j1485J7431m8673J4643R165J6812N5852L4286j0861
$$ -265156 -328069 -255298 -292970 -304455 -287024 -335697 -321054 -311889 -295077 -239225 -204939 -215800
19390b15800J7672M9290j13339l848l8979q8337K1034J29557m0553r0531J24640
$$ -215800 -198128 -148838 -262177 -266025 -305004 -393341 -372307 -242750 -283303 -373834 -249194
19379b49194k3979m4417m0397j01584j1557P1954K9267l8243j9553j3617K1129
$$ -249194 -273173 -317590 -357987 -459571 -471128 -399174 -369907 -408150 -427703 -441320 -420191
19368d20191O8224l8729j0986J29860r504L8121L2446J08201l9945r4684l7265
$$ -420191 -351967 -390696 -401682 -271822 -281326 -243205 -210759 -102558 -142503 -237187 -274452
19357b74452J37473q5786j38300l9420o3372m0319J05494J08034m5557P8969L7102
$$ -274452 -136979 -222765 -361065 -400485 -463857 -504176 -398682 -290648 -336205 -257236 -220134
19346b20134j1128l3479M1345L3211j4625n5887N5442J4747k1546n2596o7261
$$ -220134 -231262 -264741 -223396 -190185 -204810 -260697 -205255 -190508 -212054 -264650 -331911
19335c31911N7554P7814O7512O0791j24456l9561O8603J9416O7568n6799j37535
$$ -331911 -274357 -196543 -129031 -68240 -192696 -232257 -163654 -144238 -76670 -133469 -271004
19324b71004r9049r6481q9523O4727K42926J13194k4576m4539p7102J1174p399
$$ -271004 -370053 -466534 -556057 -491330 -248404 -135210 -159786 -204325 -281427 -270253 -277652
19313b77652J5680R5936L3596j344J4399m300k2210k85M9003j00399j1288L3968
$$ -277652 -261972 -166036 -132440 -133784 -119385 -123685 -145895 -146180 -97177 -197576 -208864 -174896
19301a74896K4187r4751k5649q037o5760n8749L518J03106K5633j08664M0701
$$ -174896 -150709 -245460 -271109 -279146 -344906 -403655 -400137 -297031 -271398 -380062 -339361
19290c39361Q9085q5884m0659L3761J72746R2954r976K5522Q4517R1299k1282
$$ -339361 -250276 -336160 -376819 -343058 -170312 -77358 -87334 -61812 22705 114004 92722
19279I2722n4108o3222J8613M5755J09246J66401J9542m4346R1940P7410L0351
$$ 92722 38614 -24608 -5995 39760 149006 315407 334949 290603 382543 459953 490304
19268D90304l9499R5436Q572Q4382j6940N7309m0672L1687Q9098r4995o0733R1215
$$ 490304 450805 546241 554813 639195 622255 679564 638892 670579 759677 664682 603949 695164
19256F95164O9220L617o7173P56P3477M5896k7891n0721l6998j20166L7592n0686
$$ 695164 764384 768001 700828 701584 775061 820957 793066 742345 705347 585181 622773 572087
19244E72087r1934m0968O1N6359M6345L3251K5883P3696N7007l9141K2066L2747
$$ 572087 480153 439185 439246 495605 541950 575201 601084 674780 731787 692646 714712 747459
19232G47459M0429P8099o8155r9818l8633n630K9011j37030q0187L0137n4033
$$ 747459 787888 865987 797832 698014 659381 653751 682762 545732 465545 495682 441649
19221D41649j01999J01365N6576J3380l0520P0263Q3859J15503Q9106o083j76448
$$ 441649 339650 441015 497591 510971 480451 550714 634573 750076 839182 833099 656651
19210F56651o5797J290n2557n1634J7966Q3820K1333k05935r3508n8334n5059
$$ 656651 590854 592144 539587 487953 505919 589739 611072 405137 311629 253295 198236
19199A98236j1658N7217j1912m1465q7415q3525j7599j3141l9064m9143L9223
$$ 198236 186578 243795 231883 190418 103003 19478 1879 -11262 -50326 -99469 -60246
19188f0246J12853o530l9207M590j70868n986N574K3641M5935p1881J15335M9339
$$ -60246 52607 46077 6870 11460 -159408 -165394 -159820 -136179 -90244 -162125 -46790 2549
19176B549j04726p8257J1197J22953N614k3583j96k0871L1667M678r1178k3563
$$ 2549 -102177 -180434 -169237 -46284 -40670 -64253 -64449 -85320 -53653 -48975 -140153 -163716
19164a63716j7456Q6451m8431m0136m0699q1J195o7451o6170l4224J13923J08998
$$ -163716 -181172 -94721 -143152 -183288 -223987 -224068 -222873 -290324 -356494 -390718 -276795 -167797
19152a67797j7884m1533M2635J46630J5911L0705O810K8031Q7963l1799j5203
$$ -167797 -185681 -227214 -184579 -37949 -22038 8667 15477 43508 131471 99672 84469
19141H4469n7594j38450n5742k4445N2671p916j8137L331k845o3770o4058m5733
$$ 84469 26875 -111575 -167317 -191762 -139091 -147007 -165144 -161813 -164658 -228428 -292486 -338219
19129c38219n548n2077N7690M1976L2377q8664m0049Q372N7860M789K6360o458
$$ -338219 -343767 -395844 -338154 -296178 -263801 -352465 -392514 -384142 -326282 -321493 -295133 -301591
19117c01591l7295j6998k4275J19031R3348J5773M4301j14279l0817j8719L8266
$$ -301591 -338886 -355884 -380159 -261128 -167780 -152007 -107706 -221985 -252802 -271521 -233255
19106b33255m4647l6244l053M5044Q806Q680n8311l5339Q8722J21706N4649l209
$$ -233255 -277902 -314146 -317199 -272155 -263349 -254669 -312980 -348319 -259597 -137891 -83242 -86451
19094h6451p5624m7928K3563r300k5382o3655m438l5181j4818M6948M5220j38866
$$ -86451 -162075 -210003 -186440 -195740 -221122 -284777 -289215 -324396 -339214 -292266 -247046 -385912
19082c85912M7670K10775L4995m2438l0814o9971L3499L6968m5638p344M8469
$$ -385912 -338242 -127467 -92472 -134910 -165724 -235695 -202196 -165228 -210866 -218210 -169741
19071a69741J7388Q2951l8290q5038k5418K6266M8605N2664l0553m370j7458P8714
$$ -169741 -152353 -69402 -107692 -192730 -218148 -191882 -143277 -90613 -121166 -125536 -142994 -64280
19059f4280Q4184k3303j15423l8075K9013O4083K593j8869K3828j01853n8056
$$ -64280 19904 -3399 -118822 -156897 -127884 -63801 -61208 -80077 -56249 -158102 -216158
19048b16158l841P0415M2414l4047n8709j8078q4721L9349j3861N4254J1776o1916
$$ -216158 -219999 -149584 -107170 -141217 -199926 -218004 -302725 -263376 -277237 -222983 -211207 -273123
19036b73123M9737o9889j1265m9228P3919R9031m3694p8012r5560r1583K2207
$$ -273123 -223386 -293275 -304540 -353768 -279849 -180818 -224512 -302524 -398084 -489667 -467460
19025d67460R7309M4972O5569M182O6962L195P8247O4598O224k5345n7695N9010
$$ -467460 -370151 -325179 -259610 -255428 -188466 -185271 -107024 -42426 -36202 -61547 -119242 -60232
19013f0232n3293P300J49243J18210L584j19054M0981J19845J97109j4283n3898
$$ -60232 -113525 -106225 43018 161228 164812 45758 86739 206584 403693 389410 335512
19002C35512J38289q173j27353j1529p2966K9560O4882Q3697J3970O0660Q0451
$$ 335512 473801 465628 338275 326746 253780 283340 348222 431919 445889 506549 587000
18991E87000p394l3064j07307j79379m0060J66908P3058O2984n8397n4084O2412
$$ 587000 579606 546542 439235 259856 219796 386704 459762 522746 464349 410265 472677
18980D72677J05009K7761Q325J7181j667q3931n6022R5459N6071r2887p1421O9911
$$ 472677 577686 605447 613772 630953 629286 545355 489333 584792 640863 547976 476555 546466
18968E46466K2538K6849P0322j7018L4873J04618j01041j85956k5255O4844N4794
$$ 546466 569004 595853 666175 649157 684030 788648 687607 501651 476396 541240 596034
18957E96034J02875K06502K02919Q2898J08466M0057j1734M3863l5045p9722Q3947
$$ 596034 698909 905411 1108330 1191228 1299694 1339751 1328017 1371880 1336835 1257113 1341060
18946A341060J27773m9794k30984J3961M9096j84696k1626M9071L1176J6067j57710
$$ 1341060 1468833 1419039 1188055 1202016 1251112 1066416 1044790 1093861 1125037 1141104 983394
18935I83394j95021o6698j05726j18976r936K7344O3603N809m02k0502J03049
$$ 983394 788373 721675 615949 496973 487037 514381 577984 583793 583391 562889 665938
18924F65938K0807J0984j5468j01005K074P9517K1462o6990q9026j11621k2030
$$ 665938 686745 697729 682261 581256 583330 662847 684309 617319 528293 416672 394642
18913C94642J06099J42830j4076j8502P2486j1557m1223L1569M7399O335J22993
$$ 394642 500741 643571 629495 610993 683479 671922 630699 662268 709667 716002 838995
18902H38995Q8256k9615J4004Q0500Q6276L7678J3492N1658l470p7754n2389j84424
$$ 838995 927251 897636 911640 992140 1078416 1116094 1129586 1181244 1177774 1100020 1047631 863207
18890H63207p8628J10717j24939p8521Q793j26972j18064p7330k5865j13081Q623
$$ 863207 784579 895296 770357 691836 700629 573657 455593 378263 352398 239317 247940
18879B47940J53849l621n3217R235O0085k0648K2801M4205m471N5283M5311j9614
$$ 247940 401789 398168 344951 354186 414271 393623 416424 460629 456158 511441 556752 537138
18867E37138o4327k4851r7053O3414J31736K2782K1242m3366j00470m9219J9645
$$ 537138 472811 447960 350907 414321 546057 568839 590081 546715 446245 397026 416671
18856D16671K8280j3792L6321J6791p9783K0589O7481K3973M9662P0640m5282
$$ 416671 444951 431159 467480 484271 404488 425077 492558 516531 566193 636833 591551
18845E91551j0639O3344J23889P8102n723R6839M7132j5794j29089m712J24581
$$ 591551 580912 644256 768145 846247 840524 937363 984495 968701 839612 834900 959481
18834I59481J33868P7470P3819J3887J4886J3164l7745q1131m8805O8839L771
$$ 959481 1093349 1170819 1244638 1258525 1273411 1286575 1248830 1167699 1118894 1187733 1191504
18823A191504K9438J02917R0022J7729J75301J00625M780J58565K08693N0733
$$ 1191504 1220942 1323859 1413881 1431610 1606911 1707536 1712316 1870881 2079574 2130307
18813B130307R9474L42381K77965L73179M84233N54722N18226N95304L93599M30308
$$ 2130307 2229781 2572162 2850127 3223306 3707539 4262261 4780487 5375791 5769390 6199698
18803F199698N82946N55431P57487J053119J103872J136337J301127J181999Q17422
$$ 6199698 6782644 7338075 8095562 9148681 10252553 11388890 12690017 13872016 14689438
18794A4689438N45593J80626K0996N7075M04170O64444O83529O43087P85281J214733
$$ 14689438 15235031 15415657 15436653 15493728 15897898 16562342 17245871 17888958 18674239 19888972
18784A9888972J542892J982865K358547K744584K905655L226728L687693M445466
$$ 19888972 21431864 23414729 25773276 28517860 31423515 34650243 38337936 42783402
18776D2783402N654919P146696Q736436J0358334J2464478J4674018J5605157
$$ 42783402 48438321 55585017 64321453 74679787 87144265 101818283 117423440
18769A17423440J3349152P497583j6715n669061q209286p882100n195162j641726
$$ 117423440 130772592 138270175 138253460 132584399 124375113 116493013 111297851 109656125
18761A09656125J825712L861508L715360K462721J499859J503231K326931L200156
$$ 109656125 111481837 115343345 119058705 121521426 123021285 124524516 126851447 130051603
18753A30051603M038451N337827P017380Q379313Q298824O193114L236161J021693
$$ 130051603 134090054 139427881 146445261 154824574 163123398 169316512 172552673 173574366
18745A73574366K68802j2599j316506m084137o741211p516218n547577j563636
$$ 173574366 173843168 173830569 172514063 168429926 161688715 154172497 148624920 147061284
18737A47061284L098932N929301N207886R82099l488956n842234m737920q72960
$$ 147061284 150160216 156089517 161297403 162279502 158790546 152948312 148210392 147337432
18729A47337432M439325R447995J2252016J2009404Q108449K415809k909405o611710
$$ 147337432 151776757 161224752 173476768 185486172 193594621 196010430 193101025 186489315
18721A86489315p695024o487554m149982k112614k199010m236318n786658m758948
$$ 186489315 178794291 172306737 168156755 166044141 163845131 159608813 153822155 149063207
18713A49063207j022270M512982J0660039J5514933J6704336J2367878K507708
$$ 149063207 148040937 152553919 163213958 178728891 195433227 207801105 210308813
18706B10308813q821344j7228896k0736776k0440942j8591091j6343353j4048265
$$ 210308813 201487469 184258573 163521797 143080855 124489764 108146411 94098146
18699I4098146j1844378r401031p219572n558403m383396l665261l197268k910673
$$ 94098146 82253768 72852737 65633165 60074762 55691366 52026105 48828837 45918164
18691D5918164k477193k042547j736720j660292j802187j529291q65642l71655
$$ 45918164 43440971 41398424 39661704 38001412 36199225 34669934 33804292 33432637
18683C3432637R5839J5283m69183j230146j702006j958179j997957k012914j861130
$$ 33432637 33528476 33543759 33074576 31844430 30142424 28184245 26186288 24173374 22312244
18674B2312244j692640j498181j170286j257380j523348j442612j373251j227335
$$ 22312244 20619604 19121423 17951137 16693757 15170409 13727797 12354546 11127211
18666A1127211j115512q84483p68958n95149m61190l66370l21348k88213k73471
$$ 11127211 10011699 9127216 8358258 7763109 7301919 6935549 6614201 6325988 6052517
18657F052517l08124k61988j26914n8762j30416k79397j85066j59783j4784j55695
$$ 6052517 5744393 5482405 5355491 5296729 5166313 4886916 4701850 4542067 4527283 4371588
18647D371588j40247j16925j25671k02140p2033k6593K5003j26268l6715m1193
$$ 4371588 4231341 4114416 3988745 3786605 3714572 3687979 3712982 3586714 3549999 3508806
18637C508806j60603o3830J35578q202k02667j09971j06048n888K0168N191L8753
$$ 3508806 3348203 3284373 3419951 3411749 3209082 3099111 2993063 2987175 3007343 3012534 3051287
18626C051287m9818k9625p9067m8446j17554j20962j87091J02220l3170j11939
$$ 3051287 3001469 2971844 2892777 2844331 2726777 2605815 2418724 2520944 2487774 2375835
18616B375835o7075n3957p701j499L6373K7524N6287J27584N0801Q1473Q6965
$$ 2375835 2308760 2254803 2247102 2245603 2281976 2309500 2365787 2493371 2544172 2625645 2712610
18605B712610N1314K8261l3823j13274j59259r1935R431O4102q588R4659M7364
$$ 2712610 2763924 2792185 2758362 2645088 2485829 2393894 2403325 2467427 2458839 2553498 2600862
18594B600862J40365N7180o71J04473K5645j5687L9679l8467j36235j04783m1109
$$ 2600862 2741227 2798407 2797736 2902209 2927854 2912167 2951846 2913379 2777144 2672361 2631252
18583B631252k5050N3375l8880p295M1498J8545m9072J8213K6391k4317k8495
$$ 2631252 2606202 2659577 2620697 2613402 2654900 2673445 2624373 2642586 2668977 2644660 2616165
18572B616165q7699p3447O3547j04902j19831k024J8127J3564M2494p9460K1499
$$ 2616165 2528466 2455019 2518566 2413664 2293833 2291809 2309936 2323500 2365994 2286534 2308033
18561B308033L6696j48243j49090j14517N1657O6716J13864K4025p933l8787k9052
$$ 2308033 2344729 2196486 2047396 1932879 1984536 2051252 2165116 2189141 2181208 2142421 2113369
18550B113369L4878m5258q7100R7412K03443J43176p909J29189K29125K19183
$$ 2113369 2148247 2102989 2015889 2113301 2316744 2459920 2452011 2581200 2810325 3029508
18540C029508J23513M5471m9617q0020q1044j22310L7868P7377K9806M3963K09469
$$ 3029508 3153021 3198492 3148875 3068855 2987811 2865501 2903369 2980746 3010552 3054515 3263984
18529C263984L38311L09830O12473Q15936R15671P50710L46910j63037n46793
$$ 3263984 3602295 3912125 4524598 5340534 6256205 7006915 7353825 7190788 6643995
18520F643995n56414l13499J7386J43038K47721L11166K10485K6915k09461m08155
$$ 6643995 6087581 5774082 5791468 5934506 6182227 6493393 6703878 6730793 6521332 6113177
18510F113177l40485k84656r9659J5371R6932J20976L26331L43982L01143L64587
$$ 6113177 5772692 5488036 5388377 5403748 5500680 5621656 5947987 6291969 6593112 6957699
18500F957699N15282O15397P80651J066256J184548J463390J664740J691866J795729
$$ 6957699 7472981 8088378 8869029 9935285 11119833 12583223 14247963 15939829 17735558
18491A7735558K067831K382895K631431L210060L766180M439828N152938N336243
$$ 17735558 19803389 22186284 24817715 28027775 31793955 36233783 41386721 46722964
18483D6722964M293013K239843O78142J74750P50320J748319K910475L759971
$$ 46722964 51015977 53255820 53933962 54108712 54859032 56607351 59517826 63277797
18475F3277797M999058P049417R969313J2903376J4438569J3343419R369695M806008
$$ 63277797 68276855 75326272 85295585 98198961 112637530 125980949 135350644 140156652
18467A40156652L097992M643158P603447J2143683J9493227L0355859M2730630
$$ 140156652 143254644 147897802 155501249 167644932 187138159 217494018 260224648
18460B60224648N2432862N2694347L8697011J3331141j3357449l2598383m0328025
$$ 260224648 312657510 365351857 404048868 417380009 404022560 371424177 331096152
18453C31096152l6672718k5757026j3567188l875613J678763M013598N260931
$$ 331096152 294423434 268666408 255099220 251223607 252902370 256915968 262176899
18446B62176899P529078R040067P501924M567169M870646J1300872K2204721L2265054
$$ 262176899 269705977 278746044 286247968 290815137 295685783 306986655 329191376 361456430
18438C61456430L4443630K1731889l519707k7101674l6002548l0471348j9095179
$$ 361456430 395900060 417631949 414112242 387010568 351008020 320536672 301441493
18431C01441493q779055l278959l155588o751167j2611905j7993498j9395728
$$ 301441493 292662438 289383479 286227891 279476724 266864819 248871321 229475593
18424B29475593j5105196o781565M190911J6730986K9474866M0520561M3123900
$$ 229475593 214370397 207588832 211779743 228510729 257985595 298506156 341630056
18417C41630056K6856130r848841m4749048n6500228m8724743l4923960k2460147
$$ 341630056 368486186 358637345 313888297 257388069 208663326 173739366 151279219
18410A51279219j3238920p569581m984759m289381n489934q930720j2480419j3223259
$$ 151279219 138040299 130470718 125485959 121196578 115706644 106775924 94295505 81072246
18402H1072246j1449795q857850o467644m434088l237076k409493j709631j007272
$$ 81072246 69622451 60764601 54296957 49862869 46625793 44216300 42506669 41499397
18394D1499397l62274K12588P4304r65565k420635l637249l695607l242471k650205
$$ 41499397 41137123 41349711 41424015 40458450 38037815 34400566 30704959 27462488 24812283
18385B4812283k075084j776843j672409j420420j258642r71573q63454q51400
$$ 24812283 22737199 20960356 19287947 17867527 16608885 15637312 14773858 13922458
18377A3922458r13649r20007o70099o35641n35013m17357l75707l23639k58838
$$ 13922458 13008809 12088802 11418703 10783062 10248049 9830692 9454985 9131346 8872508
18368H872508j93969r68R7052n9448Q2312K81723J18355j8435j16478k96955l96424
$$ 8872508 8678539 8677571 8774623 8715175 8797487 9079210 9197565 9179130 9062652 8765697 8369273
18357H369273l72011l21997j66920j1255m2149l7112R0311Q0788p370p3264k05756
$$ 8369273 7997262 7675265 7508345 7497090 7454941 7417829 7508140 7588928 7581558 7508294 7302538
18346G302538k83008m53491m19097l22109l93553k72455j25019j55991o1883j51208
$$ 7302538 7019530 6566039 6146942 5824833 5431280 5158825 5033806 4877815 4815932 4664724
18336D664724k04365l6886j04047j31878r3615q0387j70297J37312R2017n1622
$$ 4664724 4460359 4423473 4319426 4187548 4093933 4013546 3843249 3980561 4072578 4020956
18326D020956l5056j6389L1447M4982j29329N7649M4003j01308p4112n3346j52435
$$ 4020956 3985900 3969511 4000958 4045940 3916611 3974260 4018263 3916955 3842843 3789497 3637062
18315C637062p6027J2418n5480q1108l52j59236j28076k1093r6724q176n480o7420
$$ 3637062 3561035 3573453 3517973 3436865 3436513 3277277 3149201 3128108 3031384 3023208 3017728 2950308
18303B950308j38526o8259l0916j5355R1899j4977o4504m9822R838n8739n1621
$$ 2950308 2811782 2743523 2712607 2697252 2789151 2774174 2709670 2659848 2669686 2610947 2559326
18292B559326p0069r9007J3387l7781j9892r71o4358j6764j0229j6396q0767L3932
$$ 2559326 2489257 2390250 2403637 2365856 2345964 2344993 2280635 2263871 2253642 2237246 2156479 2190411
18280B190411j9594K539N748m7207j04082P0953k6679k8040n85O4802R9235J07214
$$ 2190411 2170817 2173356 2179104 2131897 2027815 2098768 2072089 2044049 2043464 2108266 2207501 2314715
18268B314715J15110K0315L0226L7549J1104O4390J21654O4894K0770J41009J99585
$$ 2314715 2429825 2450140 2480366 2517915 2529019 2593409 2715063 2779957 2800727 2941736 3141321
18257C141321P9992J7319k2771k2231l1484j06196P0658j7328j84470o0410r9403
$$ 3141321 3221313 3238632 3215861 3193630 3162146 3055950 3126608 3109280 2924810 2864400 2764997
18246B764997j20436n0219n0591m6338o5939r1383l8071j21003k4836J3342Q219
$$ 2764997 2644561 2594342 2543751 2497413 2431474 2340091 2302020 2181017 2156181 2169523 2177742
18235B177742J462M8022M3034k1683j5682M0636n4266j32185j470n7708N584J1169
$$ 2177742 2179204 2227226 2270260 2248577 2232895 2273531 2219265 2087080 2085610 2027902 2033486 2044655
18223B044655l3770j66624k4049m7973j6416N8414L5285j04162J5580L3411P7868
$$ 2044655 2010885 1844261 1820212 1772239 1755823 1814237 1849522 1745360 1760940 1794351 1872219
18212A872219L5338p6904o7397m3361M9259r9726p514j9334O383k6867o9889J8055
$$ 1872219 1907557 1830653 1763256 1719895 1769154 1669428 1661914 1642580 1648963 1622096 1552207 1570262
18200A570262O8493m4041n1957r3916j991n014J2042M2978M4584r5225L9447j0692
$$ 1570262 1638755 1594714 1542757 1448841 1446850 1441836 1453878 1496856 1541440 1446215 1485662 1474970
18188A474970l6882j32383j1992k1205J3664r5348L8913K8503r5994o8599m9359
$$ 1474970 1438088 1305705 1293713 1272508 1286172 1190824 1229737 1258240 1162246 1093647 1044288
18177A044288N4753r1380l889n0869r2892n0315n9637J10342M3631j6665R79m543
$$ 1044288 1099041 1007661 1003772 952903 860011 809696 750059 860401 904032 887367 888346 883803
18165H83803o3145n1563N5054j4926o1522r178N3280N0645K9818n7542p1333M392
$$ 883803 820658 769095 824149 809223 747701 738523 791803 842448 872266 814724 743391 747783
18153G47783o842o879l0472Q04M4304Q2268j270J0923K1179p023R733n8999j26023
$$ 747783 740941 734062 703590 704394 748698 830966 829696 840619 861798 854775 864508 805509 679486
18140F79486n3205l4180N4310l4564l4312l1074Q6472J35121M2780o2153K6979
$$ 679486 626281 592101 646411 611847 577535 546461 632933 768054 810834 748681 775660
18129G75660N5681r7523O8372O0116k3981j01272o9274o1812J5788Q769p6969
$$ 775660 831341 733818 802190 862306 838325 737053 667779 605967 621755 630524 553555
18118E53555p5578n3521O2433J03920N6972M9566q7775k10337l9503J12478L1073
$$ 553555 477977 424456 486889 590809 647781 697347 609572 399235 359732 472210 503283
18107E03283k8305o2528Q703O6645J42767o082l8457k3096l8473l2354L4276J6479
$$ 503283 474978 412450 421153 487798 630565 624483 586026 562930 524457 492103 526379 542858
18095E42858p6067n1611K8191P3175m8365P6432J7561L163j4841K3742l5389L0590
$$ 542858 466791 415180 443371 516546 468181 544613 562174 565337 550496 574238 538849 569439
18083E69439Q0j59970m0879J6094L4566J4696Q3372N5423j4370L5045J26466n8965
$$ 569439 569519 409549 368670 384764 419330 434026 517398 572821 558451 593496 719962 660997
18071F60997o7591O4427J548j16401K2210l3207n0339N4571M2893J1529R0353
$$ 660997 593406 657833 659381 542980 565190 531983 481644 536215 579108 590637 680990
18060F80990p1006p1324l2165M5394l7418o079k0361R4359J15700q944j11141
$$ 680990 609984 538660 506495 551889 514471 508392 488031 582390 698090 689146 578005
18049E78005j03296p5880n1800r7202j6935J35696o81P4466J05714p7719L6924
$$ 578005 474709 398829 347029 249827 232892 368588 367907 442373 548087 470368 507292
18038E07292K7700p3076r3292m1303k294N9311J18245o1241j23894L3813J8326
$$ 507292 534992 461916 368624 327321 325027 384338 502583 441342 317448 351261 369587
18027C69587L6268M8827M481K5596Q0737o6811j35621o7147K2730k2352J8258
$$ 369587 405855 454682 459163 484759 565496 498685 363064 295917 318647 296295 314553
18016C14553L3812n573L7757L0715p0629j2697Q8776J0665P2525N5382k739r1056
$$ 314553 348365 342792 380549 411264 340635 327938 416714 427379 499904 555286 552547 461491
18004D61491o9950O5000L8436K6192Q9987m559j25593P9684k6425K3720L72o3875
$$ 461491 391541 456541 494977 521169 611156 606597 481004 560688 534263 557983 558355 494480
17992D94480j0197J43379J05814P4569o896K2968k4880P4869R7705R7816J67328
$$ 494480 484283 627662 733476 808045 801149 824117 799237 874106 971811 1069627 1236955
17981A236955L6415p9590r9238J5343M4757J68347J1158j85782j49066O7840L1154
$$ 1236955 1273370 1193780 1094542 1109885 1154642 1322989 1334147 1148365 999299 1067139 1098293
17970A098293o8509M6254l3717K1579M0625K8097L0683L0466l1984O0641L8300
$$ 1098293 1029784 1076038 1042321 1063900 1104525 1132622 1163305 1193771 1161787 1222428 1260728
17959A260728k0532p9397R3522Q6476L2931K1558J2634m1295J1168k9787l9360
$$ 1260728 1240196 1160799 1254321 1340797 1373728 1395286 1407920 1366625 1377793 1348006 1308646
17948A308646p921M6829o5890j7121L8810N9170P6829j9534J9613N4336J41458
$$ 1308646 1300725 1347554 1281664 1264543 1303353 1362523 1439352 1419818 1439431 1493767 1635225
17937A635225J90403Q8227J51273N3686j600K3799M0782N1365J14225O6334l5111
$$ 1635225 1825628 1913855 2065128 2118814 2117214 2141013 2181795 2233160 2347385 2413719 2378608
17926B378608p4772r0765K9444k6647k7944o5241j68204k16952j84153j66514
$$ 2378608 2303836 2213071 2242515 2215868 2187924 2122683 1954479 1737527 1553374 1386860
17916A386860j05404m7680J44079Q0790j15035j49461m7253J0015J2869j0574
$$ 1386860 1281456 1233776 1377855 1458645 1343610 1194149 1146896 1156911 1169780 1159206
17906A159206l6444j06924j20763k881j0444J01070l0717J9688o1183p3640k8991
$$ 1159206 1122762 1015838 895075 892194 881750 982820 952103 971791 910608 836968 807977
17895H07977k428k2985q914O9533J33993O8720j81893j9343L9648k2366L8202
$$ 807977 805549 782564 773650 843183 977176 1045896 864003 844660 884308 861942 900144
17884I00144J72196n1139j1627j2543r3238j08643J5216M7752J2396M9078O3730
$$ 900144 1072340 1021201 1009574 997031 903793 795150 810366 858118 870514 919592 983322
17873I83322K6039N5380p1250l4796p9736q1278P900j35984j21518k365l0840
$$ 983322 1009361 1064741 993491 958695 878959 797681 805581 669597 548079 545714 514874
17862E14874k9210N2421l3156n9123p9699O6191O9734l9793p1435j232p8331m6935
$$ 514874 485664 538085 504929 445806 366107 432298 502032 462239 390804 389572 311241 264306
17850B64306l1525m47P7455m7768j14876n9136P1064R5775R561P2930O9301N8064
$$ 264306 232781 232334 309789 262021 147145 88009 159073 254848 264409 337339 406640 464704
17838D64704n9252j41509l2314J27644J3713q3634j57318m2926O5667L0805M5008
$$ 464704 405452 263943 231629 359273 372986 289352 132034 89108 154775 185580 230588
17827B30588M3001l9331m1542r1928M8507M5210k3931k2172N5253O1742o0894
$$ 230588 273589 234258 192716 100788 149295 194505 170574 148402 203655 265397 204503
17816B04503K594Q8630L8712K9081k5060k8798n3457j2393l2502j6923j24608
$$ 204503 207097 295727 334439 363520 338460 309662 256205 243812 211310 194387 69779
17805F9779o2498N0875R8083k1792k2613k5089K0991J18183P2788m4023O1076
$$ 69779 7281 58156 156239 134447 111834 86745 107736 225919 298707 254684 315760
17794C15760k6539o3310j20921J0697K2467J35349J2091M0028Q9790J6271n1872
$$ 315760 289221 225911 104990 115687 138154 273503 285594 325622 415412 431683 379811
17783C79811M0853K2299J8475j18555j26929Q2945n137n159q7960q2708J0110
$$ 379811 420664 442963 461438 342883 215954 298899 293762 288603 200643 117935 128045
17772A28045J6511R2179K3759l5629K7664l1084j3559J786l1917k0886o1837l1820
$$ 128045 144556 236735 260494 224865 252529 221445 207886 209672 177755 156869 95032 63212
17760F3212o7578K8175K0633n7850O1693P8933J6594M1211l330j1217J14783J7994
$$ 63212 -4366 23809 44442 -13408 48285 127218 143812 185023 181693 170476 285259 303253
17748C03253l9547M6660N332j43418o44J54098J6363J0302k1149j02581l3270
$$ 303253 263706 310366 315698 172280 171636 325734 342097 352399 331250 228669 195399
17737A95399P828k7906L355n8424p287N334r630J3706K5048o3979K4327j954L4157
$$ 195399 203227 175321 178676 120252 112965 118299 108669 122375 147423 83444 107771 105817 139974
17724A39974N6275j9715N4K3159J3834r3440m6193K9877n3244k1912O1730m3390
$$ 139974 196249 176534 176588 199747 213581 120141 73948 103825 50581 28669 90399 47009
17712D7009K5512O6255K1942l547q0783l264n1410J03835L4509q9631n4722m5129
$$ 47009 72521 138776 160718 157171 76388 73124 21714 125549 160058 70427 15705 -29424
17700b9424L5463O8200l5287j53822k6732J55617K7501l8714J46631J02003J5437
$$ -29424 6039 74239 38952 -114870 -141602 14015 41516 2802 149433 251436 266873
17689B66873N8495j6401q4098j43132n1471M9198k1301J414k8127J40353N0682
$$ 266873 325368 308967 224869 81737 30266 79464 58163 59577 31450 171803 222485
17678B22485l3547k2511Q5336L9930r301j4989J15885m616j01638q2195N3420
$$ 222485 188938 166427 251763 291693 282392 267403 383288 378672 277034 194839 248259
17667B48259M2689o1178p7671K0311k2220J47499R5871j04668r2098Q073K345
$$ 248259 290948 229770 152099 172410 150190 297689 393560 288892 196794 204867 207212
17656B07212K9627J3897p1428L9690J03751r3257j41239k8020J08416Q1428q4070
$$ 207212 236839 250736 179308 218998 322749 229492 88253 60233 168649 250077 166007
17645A66007j1576O3613K9513l4925J2125L347m0206p1330r4743p114J5237O5605
$$ 166007 154431 218044 247557 212632 224757 228104 187898 116568 21825 14711 29948 95553
17633I5553L8508M2014r2163o7467Q9229L1354J9390J3390J36829J6940j34653
$$ 95553 134061 176075 83912 16445 105674 137028 156418 169808 306637 323577 188924
17622A88924l3961L2722N7806j4973N0257M650l802K9818l1410j09820j03703
$$ 188924 154963 187685 245491 230518 280775 285425 281623 311441 280031 170211 66508
17611F6508j5755P9753p499L3985q0620P5977O6928L3878o8867r2553N4085P7395
$$ 66508 50753 130506 123007 156992 76372 152349 219277 253155 184288 91735 145820 223215
17599B23215j06063r1549j0172J41410j6431J1124r740j3471r1579Q4294o7730
$$ 223215 117152 25603 15431 156841 140410 151534 141794 128323 36744 121038 53308
17588E3308j31561L4644Q8168L2181O408L7594m862j6576P3772J06819r4601j76242
$$ 53308 -78253 -43609 44559 76740 83148 120742 115880 99304 173076 279895 185294 9052
17576I052j02J5805m4329o2340j0447O7195K2007L8826k6358O0147J21018L4062
$$ 9052 8950 24755 -19574 -81914 -92361 -25166 -3159 35667 9309 69456 190474 224536
17564B24536J02499P9o1195j62648j05515j793J84112N8012k8487m0430n1565
$$ 224536 327035 327114 265919 103271 -2244 -4037 180075 238087 209600 169170 117605
17553A17605J71924Q735J8619r161O784n3024j0432l4127p9754P2777O3268j041
$$ 117605 289529 298264 316883 307722 314506 261482 251050 216923 137169 209946 273214 272173
17541B72173m9184j02319k394n0769J26114k7312r7139m280R312R6591O1942J0015
$$ 272173 222989 120670 118276 67507 193621 166309 69170 64890 74202 170793 232735 242750
17529B42750m7909p8207k3684p242n7406q1908m7753J38751J3847l0511Q6442
$$ 242750 194841 116634 92950 85708 28302 -53606 -101359 37392 51239 20728 107170
17518A07170Q1267K6255J5456o5372p0785K1778N5766L6193l941n7974j688L6320
$$ 107170 188437 214692 230148 164776 93991 115769 171535 207728 203787 145813 144125 180445
17506A80445P045j09845N5312O0200M5605N0694j433n7585l9907M3936K0670M4897
$$ 180445 187490 77645 132957 193157 238762 289456 288023 230438 190531 234467 255137 300034
17494C00034l120n2727m0597o6720L4644j4880r9901o1043n9929L4434P9298J3748
$$ 300034 296914 244187 203590 136870 171514 156634 56733 -4310 -64239 -29805 49493 63241
17482F3241o2069N4155J09115L6951l1322O1209n991R692m5537k4285k0987J2069
$$ 63241 1172 55327 164442 201393 170071 231280 225289 234981 189444 165159 144172 156241
17470A56241K4281j7873n7796O0386M0990k469j20748K728k8120m3868O9141K0208
$$ 156241 180522 162649 104853 165239 206229 203760 83012 85740 57620 13752 82893 103101
17458A03101o6212l7074L5909R8372N8030K1680j3176j30109j12531j764J0933
$$ 103101 36889 -185 35724 134096 192126 213806 200630 70521 -42010 -43774 -32841
17447c2841K8144K9193l9075K7585O6313N3720n6409q4798o538j6416l7834J00506
$$ -32841 -4697 24496 -14579 13006 79319 133039 76630 -8168 -14706 -31122 -68956 31550
17435C1550J9713M887k6889p6943Q5574J23868N2216n345n2568Q5515N1564N9181
$$ 31550 51263 56150 29261 -47682 37892 161760 213976 208631 156063 241578 293142 352323
17423C52323q0104j6350K8570K6149o0559j66789j20624j824K681j34193r1053
$$ 352323 272219 255869 284439 310588 250029 83240 -37384 -39208 -36527 -170720 -261773
17412b61773O7271Q0857J18368M1965j13670J6981N9052O9401O6721j07411m1602
$$ -261773 -194502 -113645 4723 46688 -66982 -50001 9051 78452 145173 37762 -3840
17401c840K3170K3447P8013p7268K549n9886k4714j3977k0585L5164K0706Q1228
$$ -3840 19330 42777 120790 43522 46071 -13815 -38529 -52506 -73091 -37927 -17221 64007
17389F4007M9893P8198N1663n6823j51677k3326M1401JN9042J08841k0441N8331
$$ 64007 113900 192098 243761 186938 35261 11935 53336 53337 112379 221220 200779 259110
17377B59110j8851l7319j2276r3386p3320J4768J18643J08765n539m4990N2536
$$ 259110 240259 202940 190664 97278 23958 38726 157369 266134 260595 215605 268141
17366B68141M8261p8960j82391j29777Q4365J14291J06709j1893K7350o6710j18889
$$ 268141 316402 237442 55051 -74726 9639 123930 230639 218746 246096 179386 60497
17355F0497l5836J4277K2588J53410N0915p1013j5276l6298j954R907j98522k4364
$$ 60497 24661 38938 61526 214936 265851 194838 179562 143264 141310 151217 -47305 -71669
17343g1669j7747K635O211K7357R1834k1069J9811j1438R5598J6801o1050r393
$$ -71669 -89416 -86781 -80570 -53213 38621 17552 37363 25925 121523 138324 77274 67881
17331F7881l4615p7567k1329J12459O9650n2680L603J7084k7972O8010P3802k0862
$$ 67881 33266 -44301 -65630 46829 116479 63799 67402 84486 56514 124524 198326 177464
17319A77464m1825n9291M2295J06254m1794j69685n4382Q5649K4996j7604J16340
$$ 177464 135639 76348 118643 224897 183103 13418 -40964 44685 69681 52077 168417
17308A68417R8086J0292o2823j2684K340j01525J1938l9799l6075Q1047O0135
$$ 168417 266503 276795 213972 201288 203628 102103 114041 74242 38167 119214 179349
17297A79349j11086J04860M1876k9417p4192J19351J24058j28129M5023J97p3110
$$ 179349 68263 173123 214999 185582 111390 230741 354799 226670 271693 271890 198780
17286A98780l8106o3362p338Q2857P1368J17542j6837j16272K9291k1562j11861
$$ 198780 160674 97312 89974 172831 244199 361741 344904 228632 257923 236361 124500
17275A24500m8920R1238j6104n3149K6172O575j11394l6846K5084j83J68262K9792
$$ 124500 75580 166818 150714 97565 123737 130312 18918 -17928 7156 6973 175235 205027
17263B05027l4882n1310k0558J0394J12503M1815p1533j04942j16310N6994J27705
$$ 205027 170145 118835 98277 108671 221174 262989 191456 86514 -29796 27198 154903
17252A54903l7375p1216Q2228J65427O5056k16732o1691k6849k4951m3075M5279
$$ 154903 117528 46312 128540 293967 359023 142291 80600 53751 28800 -14275 31004
17241C1004Q4039M4654R4416J01928p533n8605k9665p0554p1283J985P95p401
$$ 31004 115043 159697 254113 356041 348508 289903 260238 189684 118401 120386 121181 113780
17229A13780l6792K9177K2453k6734p9034K1094N2641O0672O7574k8072o5055
$$ 113780 76988 106165 128618 101884 22850 43944 96585 157257 224831 196759 131704
17218A31704m3701k4853M8185O871k7054O454k6604M8898J20655J3174j2523k7648
$$ 131704 88003 63150 111335 118206 91152 97606 71002 119900 240555 253729 241206 213558
17206B13558k5631q3394L233O9120n2392p448o5001j47610q0522O7157O3788N2774
$$ 213558 187927 104533 107766 176886 124494 117046 52045 -95565 -176087 -108930 -45142 7632
17194G632J0262R7460Q7688m9674p707j60132O0040J45635J6438n3831j7735o654
$$ 7632 17894 115354 203042 153368 145661 -14471 45569 191204 207642 153811 136076 129422
17182A29422J8249o1948O6331R4959M8744M67l1986l1717j31865l2683L9025N6569
$$ 129422 147671 85723 152054 247013 295757 296224 264238 232521 100656 67973 106998 163567
17170A63567l9102M3958K678o1994K9772O130O7260K1409m5831o9780M0238j7035
$$ 163567 124465 168423 171101 109107 138879 145009 212269 233678 187847 118067 158305 141270
17158A41270o12J8914j05032k4103j3851N9856N0671j4465l3338p4833n2295K7387
$$ 141270 140658 159572 54540 30437 16586 76442 127113 112648 79310 4477 -47818 -20431
17146b0431k1365O6382J31077Q8182Q375r5862l4613J209n2800j15810m9632Q1207
$$ -20431 -41796 24586 155663 243845 252220 156358 121745 122954 70154 -45656 -95288 -14081
17134a4081M4755K5150j6275k2870J24374R5112n940r4052p6188l8695l2422L390
$$ -14081 30674 55824 39549 16679 141053 236165 230225 136173 59985 21290 -11132 -7742
17122g742N2064M4408n375Q5037p573k5739J2201J9245L0562m6152o0601n5210
$$ -7742 44322 88730 83355 168392 160819 135080 147281 166526 197088 150936 90335 35125
17110C5125O2513j0361K8890J3230m1964J33926l8268L2844o131l5460n1249R6920
$$ 35125 97638 87277 116167 129397 87433 221359 183091 215935 209804 174344 123095 220015
17098B20015j7011k8009o4051l3734J14563J12075K7405o6349q4875N2114m1790
$$ 220015 203004 174995 110944 77210 191773 303848 331253 264904 180029 232143 190353
17087A90353J4279K4005j04471J2317j3337o2886j8996o3454j7530K3482P2014
$$ 190353 204632 228637 124166 136483 123146 60260 41264 -22190 -39720 -16238 55776
17076E5776n7122r747P0373M5804p7999l5577K8242Q086L4265R3898o3072l4805
$$ 55776 -1346 -11093 59280 105084 27085 -8492 19750 27836 62101 155999 92927 58122
17064E8122n768K5444p9851m3630L7789J6154P6207Q921P359j0266L712K2150
$$ 58122 52354 77798 -2053 -45683 -7894 8260 84467 93388 100747 90481 94193 116343
17052A16343K0327M6271k4461o2814m6718q5459L718R6756L0668M5378K6908l4989
$$ 116343 136670 182941 158480 95666 48948 -36511 -32793 63963 94631 140009 166917 131928
17040A31928q3487L6331Q9531J0053p5000q1506o9609j12138q3083J29780J18804
$$ 131928 48441 84772 174303 184356 109356 27850 -41759 -153897 -236980 -107200 11604
17029A1604L0272K2169o943l5330M1812N4089j6985J617K8506L2115O5247k7043
$$ 11604 41876 64045 57102 21772 63584 117673 100688 102305 130811 162926 228173 201130
17017B01130j90553j17988K9716P3665O6780Q0235k1390M9610O6233N1150K8421
$$ 201130 10577 -107411 -77695 -4030 62750 142985 121595 171205 237438 288588 317009
17006C17009K3030M3210P527q5961p4404o8149P954L2074k4794o7792N422j6943
$$ 317009 340039 383249 390776 304815 230411 162262 170216 202290 177496 109704 115126 98183
16994I8183O6553M9606j7274l0326j0409l9732m2438M092p0238l1759P2946R511
$$ 98183 164736 214342 197068 166742 156333 116601 74163 78255 8017 -23742 49204 58715
16982E8715k2300r3744m2935O4805J12504J15537O9237n8238l2053L4301K1313
$$ 58715 36415 -57329 -100264 -35459 77045 192582 261819 203581 171528 205829 227142
16971B27142N3915O3681N0797o9536p2242j1593n1407N7281M6462k1741K7877
$$ 227142 281057 344738 395535 325999 253757 242164 190757 248038 294500 272759 300636
16960C00636o5453l8762r5503J1794K9412O9713L9604L7503o4731J7046n7993
$$ 300636 235183 196421 100918 112712 142124 211837 251441 288944 224213 241259 183266
16949A83266J11805R8724j37624l7747q7505p8146L1414J38073p334p7304k2179
$$ 183266 295071 393795 256171 218424 130919 52773 84187 222260 214926 137622 115443
16938A15443P0545k612K8172J2223q3670r3512K0029K1327m3626p141l7673n450
$$ 115443 185988 183376 211548 223771 140101 46589 66618 87945 44319 37178 -495 -5945
16926e945R7739J00606M4804j0551n8463j1477K1357R0378j57710j95603Q3270
$$ -5945 91794 192400 237204 226653 168190 156713 178070 268448 110738 -84865 -1595
16915a595m6079R2567J16256j7042o1156j09277K8723M1126J4911J4451O1396
$$ -1595 -47674 44893 161149 144107 82951 -26326 2397 43523 58434 72885 134281
16904A34281P3881o0770q6487L3861J32939L9378r0883m3775M836J0466j45864
$$ 134281 208162 147392 60905 94766 227705 267083 176200 132425 137261 147727 1863
16893A863n6121R4025J36743K4658J6397k5457n6679L9396J19231j34878r1757
$$ 1863 -54258 39767 176510 201168 217565 192108 135429 174825 294056 159178 67421
16882F7421n0854r7292n5101L1720J47122J13204j17984p5041J18747N1417n7239
$$ 67421 16567 -80725 -135826 -104106 43016 156220 38236 -36805 81942 133359 76120
16871G6120J8265k7713K9488k8618n5629J20902N0176o7532j5911M6359j9136
$$ 76120 94385 66672 96160 67542 11913 132815 182991 115459 99548 145907 126771
16860A26771m8303n68M1391N5805J1212K7865j1128k3545j06801r223L2004K2389
$$ 126771 78468 77900 119291 175096 186308 214173 203045 179500 72699 63476 95480 117869
16848A17869l4251j09617j7280o5501N5566M6825Q7432L8525m269Q718K069L4196
$$ 117869 83618 -25999 -43279 -108780 -53214 -6389 81043 119568 115299 124017 126086 160282
16836A60282N8769m1832m0190L099L8410J15783j681k5164q3342j1862P1966O2874
$$ 160282 219051 177219 137029 140128 178538 294321 292640 267476 184134 172272 244238 307112
16824C07112M0590K6117l580k9851m7804M1246q5210j43005l5857J01702k2295
$$ 307112 347702 373819 370239 340388 292584 333830 248620 105615 69758 171460 149165
16813A49165r5862j20367j8417P4404k2066l0875o9825J0148O2779O298J72282
$$ 149165 53303 -67064 -85481 -11077 -33143 -64018 -133843 -123695 -60916 -54618 117664
16802A17664R7529l3533n9237n714L6382L7108o6104j5249l8592k7231L638J1267
$$ 117664 215193 181660 122423 116709 153091 190199 124095 108846 70254 43023 46661 57928
16790E7928P3519n182q7823J9274L7436j1421q5871J8260M65q4484O2869J36770
$$ 57928 131447 126265 38442 57716 95152 83731 -2140 16120 16585 -67899 -5030 131740
16778A31740K5884o5972k2078J04569L018l0774M3908O5278j7142p8576J4783
$$ 131740 157624 91652 69574 174143 177161 146387 190295 255573 238431 159855 174638
16767A74638j7663K0309Q9806m6057K2819O1712J6892N1464j20371j01867m0528
$$ 174638 156975 177284 267090 221033 243852 305564 322456 373920 253549 151682 111154
16756A11154N4002O2064j8153k892k2363J229j07662r454L9370J105J2521L5975
$$ 111154 165156 227220 209067 206175 183812 185041 77379 67925 107295 108400 120921 156896
16744A56896l3972p6351k6834N7820K2876n5220M5843J03019o2554k3513m3324
$$ 156896 122924 46573 19739 77559 100435 45215 91058 194077 131523 108010 64686
16733F4686M5384K1669P9051Q194q4456q0136r3746j4003O558J6162k1046P4781
$$ 64686 110070 131739 210790 218984 134528 54392 -39354 -53357 -46799 -30637 -51683 23098
16721B3098k937q1377J2103O5823R8678N3715n0559J1739Q6466Q1979K4437j02776
$$ 23098 20161 -61216 -49113 16710 115388 169103 118544 130283 216749 298728 323165 220389
16709B20389m8959o9920J6399R4926O951K4021n9922j3886k8029L3728n2274K28855
$$ 220389 171430 101510 117909 212835 219786 243807 183885 169999 141970 175698 123424 352279
16697C52279J9840j38954K9569j21688j28099r9459K386P3867K2459P5171N6120
$$ 352279 372119 233165 262734 141046 12947 -86512 -84126 -10259 12200 87371 143491
16686A43491R5554K7656J31150N5786j01454q1586Q3336R913q5408p0467k2163
$$ 143491 239045 266701 397851 453637 352183 270597 353933 363846 278438 207971 185808
16675A85808Q2429m7876q5515M3730R987l721k0375J7365M0320R854K15M3630
$$ 185808 268237 220361 134846 178576 188563 184842 164467 181832 222152 232006 232221 275851
16663B75851J4587j11373j29954l6228P686j1489J22073J17088k0649j06136j07883
$$ 275851 290438 179065 49111 12883 20569 9080 131153 248241 227592 121456 13573
16652A3573J27945L5802l7991K974l8765M3981j7949o5493k3779J3557J4453Q6299
$$ 13573 141518 177320 139329 142303 103538 147519 129570 64077 40298 53855 68308 154607
16640A54607K7318n6355m8035p265P7454N7307K9298M6465P7341J1465r9609K0092
$$ 154607 181925 125570 77535 70270 147724 205031 234329 280794 358135 369600 269991 290083
16628B90083Q143p736l4195k0210r1023j38117m902P7079m6417l194J2986q6692
$$ 290083 298226 290490 256295 236085 145062 6945 2043 79122 32705 29511 42497 -44195
16616d4195m6967Q3259J39929N2226p296M908l6132N285j05906k3447O6380L4177
$$ -44195 -91162 -7903 132026 184252 176956 181864 145732 151017 45111 21664 88044 122221
16604A22221l8110K1215N2321M0990j03801l9576P3562P2797j7294q3089j10685
$$ 122221 84111 105326 157647 198637 94836 55260 128822 201619 184325 101236 -9449
16593i449p1972P9659J34549Q4515L7969o7842L6816j7652n3665o2733O4222j8899
$$ -9449 -81421 -1762 132787 217302 255271 187429 224245 206593 152928 90195 154417 135518
16581A35518J1277j08053o6845J41031J06907K4122Q6174K4211m4998q703j53112
$$ 135518 146795 38742 -28103 112928 219835 243957 330131 354342 309344 300641 147529
16570A47529n6623J24444L1575J3819L1762l8268L1614R7704j6555j31791m2118
$$ 147529 90906 215350 246925 260744 292506 254238 285852 383556 367001 235210 193092
16559A93092K9072K0660J50673q0844j31462o2099j1978L7838M4487j29206o927
$$ 193092 222164 242824 393497 312653 181191 119092 107114 144952 189439 60233 53306
16548E3306J36186M263j1338N6033K7342m2279K0052K2804m6766l0034n6545J4826
$$ 53306 189492 193755 182417 238450 265792 223513 243565 266369 219603 189569 133024 147850
16536A47850L4806N044p46J192rM9167m7962j9039Q2955M6038j05845L8739M4110
$$ 147850 182656 187700 186954 188146 188137 237304 189342 170303 253258 299296 193451 232190 276300
16523B76300l9482O1020l3660K4943K7434P2386N9449m5911r9802j12445N3126
$$ 276300 236818 297838 264178 289121 316555 388941 448390 402479 302677 190232 243358
16512B43358M679K8483K9590j05455j3635r734j090j9255N6632O3596k2549n6909
$$ 243358 248037 276520 306110 200655 187020 177286 176196 156941 213573 277169 254620 197711
16500A97711j07501l646J42953P5997j6861m0079M6370J3087M654o9077p0158
$$ 197711 90210 86564 229517 305514 288653 248574 294944 308031 312685 243608 173450
16489A73450k2379m7643J2104R2278p64O8807L0390j30362j53159K3428J39799
$$ 173450 151071 103428 115532 207810 207046 275853 306243 175881 22722 46150 185949
16478A85949N2797m0490j7182R8238k6022q206l2665K8925m3738l6550j9751j9291
$$ 185949 238746 198256 181074 279312 253290 245084 212419 241344 197606 161056 141305 122014
16466A22014P9795M0632K3088M40r778O7939n5604p1961J63200Q9920n2334k35941
$$ 122014 201809 242441 265529 265969 256191 324130 268526 196565 359765 449685 397351 161410
16454A61410l2035O0199M4388Q1150K4666O402j00858j566j38054o7984K3206
$$ 161410 129375 189574 233962 315112 339778 346180 245322 243756 105702 37718 60924
16443F0924P5994l750M741p1965o791K2487L9360Q2869m2654Q9164J12153l3199
$$ 60924 136918 133168 137909 65944 59153 81640 121000 203869 161215 250379 362532 329333
16431C29333N1976m6778j23729k02456l8387M8698O0178n2988R6444K10359J6470
$$ 329333 381309 334531 210802 8346 -30041 18657 78835 25847 122291 332650 349120
16420C49120n5953j7364L019j6526O8765p443j26876J089l0674o671J54842L1935
$$ 349120 293167 275803 278822 262296 331061 323618 196742 197831 167157 160486 315328 347263
16408C47263n3434o471N0836k953M5893n5391p0677j1583r8892j5911J55289K8629
$$ 347263 293829 287358 338194 335241 381134 325743 255066 243483 144591 128680 283969 312598
16396C12598k2614l9388J9862M3078l3760j8503l263k5800m8694n459o9525P3737
$$ 312598 289984 250596 270458 313536 279776 261273 258010 232210 183516 178057 108532 182269
16384A82269R8313m1480o1983m3828p875Q7182M3718l2638n7894N9834p2753j8569
$$ 182269 280582 239102 177119 133291 125416 212598 256316 223678 165784 225618 152865 134296
16372A34296l5139J01724M8094Q9944r3258k1970j12607J7566m2588Q447k987
$$ 134296 99157 200881 248975 338919 245661 223691 111084 128650 86062 94509 91522
16361I1522n4938q220J45614M9695p3842J3543J6060k6070j7808n2957K7369M0822
$$ 91522 36584 28364 173978 223673 149831 163374 179434 153364 135556 82599 109968 150790
16349A50790J4075N9999k6715p7699N6073j9988J5576K1646q2382k4287P0837
$$ 150790 164865 224864 198149 120450 176523 156535 172111 193757 111375 87088 157925
16338A57925K7735j8767r437J0272N1283l8066r837k0572N3343J29780R6588p1020
$$ 157925 185660 166893 157456 167728 219011 180945 171108 150536 203879 333659 430247 359227
16326C59227n914L3997l7311m9664o6118j2607j4559l5481l9662J13801n741n2426
$$ 359227 353313 387310 349999 300335 234217 221610 207051 171570 131908 245709 239968 187542
16314A87542P4305N1737K2715k9350j25873R378J507N2968Q2408l7688m2419l7725
$$ 187542 261847 313584 336299 306949 181076 190454 191961 244929 327337 289649 247230 209505
16302B09505k4988p6615r1756J1159l3242o696K5240N8701P0837O2512L3527r2085
$$ 209505 184517 107902 16146 27305 -5937 -12633 12607 71308 142145 204657 238184 146099
16290A46099l9894L5689P3484L5066J1923k4161o3244K8355K0140L8635l4460
$$ 146099 106205 141894 215378 250444 262367 238206 174962 203317 223457 262092 227632
16279B27632j03414O7409l4774m5075l9382l7522l0882J49893j1823L0653N167
$$ 227632 124218 191627 156853 111778 72396 34874 3992 153885 142062 172715 177882
16268A77882n4400Q1516O5084o1688p3646q8670J4986J82542P4911N6420r0273
$$ 177882 123482 204998 270082 208394 134748 46078 61064 243606 318517 374937 284664
16257B84664p8359N6826j5956J8959P2094l634r0993p9155p671M0870L9648m816
$$ 284664 206305 263131 247175 266134 338228 334594 243601 164446 156775 197645 237293 232477
16245B32477O387K8309j9805j07807J12120K8718n1028J6225l1171O6101j011
$$ 232477 238864 267173 247368 139561 251681 280399 229371 245596 214425 280526 279515
16234B79515n6995Q2342m2270n8918M541O749q856k4951O0131j11049n7293J8563
$$ 279515 222520 304862 262592 203674 208215 214964 206108 181157 241288 130239 72946 91509
16222I1509K7640j5932l5604N5722O2471N3692O648j37621k0836O9735q0183O6316
$$ 91509 119149 103217 67613 123335 185806 239498 246146 108525 87689 157424 77241 143557
16210A43557Q3699N6212m4525k4374n4715j3617K5415M8371Q64j0837Q0046P354
$$ 143557 227256 283468 238943 214569 159854 146237 171652 220023 220887 210050 290096 297450
16198B97450R0204p2365p8252N3473n8782N6533k5172p1456j5909q0902N4544
$$ 297450 387654 315289 237037 290510 231728 288261 263089 191633 175724 94822 149366
16187A49366M0963M2368m1773K2285P3461P4744j28875j77667N6933K3348J7370
$$ 149366 190329 232697 190924 213209 286670 361414 232539 54872 111805 135153 152523
16176A52523M4774k8187J5144L1148k0402m9677L0647J05260J26578O7743m6433
$$ 152523 197297 169110 184254 215402 195000 145323 175970 281230 407808 475551 429118
16165D29118m2577j67022l6317N9110k1255o489Q086K9673J147r0254P8355N4636
$$ 429118 386541 219519 183202 242312 221057 214568 222654 252327 253474 163220 241575 296211
16153B96211Q7265N3330j13802k7976K0868o8675k5761n6607J6200r3040j41280
$$ 296211 383476 436806 323004 295028 315896 247221 221460 164853 181053 88013 -53267
16142e3267J00907N3196M0248J4871k5369m7435N6606J85543J5928j00477j01567
$$ -53267 47640 100836 141084 155955 130586 83151 139757 325300 341228 240751 139184
16131A39184j1513J00734J05536O8936r1031q636j534M4060N8461k0648O6074
$$ 139184 127671 228405 333941 402877 311846 303210 301676 345736 404197 383549 449623
16120D49623p234p9445p4474m0372L4379m3433j32356o3210o040Q0470P3731O6055
$$ 449623 442389 362944 288470 248098 282477 239044 106688 43478 37438 117908 191639 257694
16108B57694M9774k0076k13505l4294r765j0779P3728J23726R2119N9109k6308
$$ 257694 307468 287392 73887 39593 29828 19049 92777 216503 308622 367731 341423
16097C41423o9418l1050N4506q9635m90J7042N562m0803P315Q7218o1955o8937
$$ 341423 272005 240955 295461 205826 205336 222378 227940 187137 194452 281670 219715 150778
16085A50778L6030L8123P2756L3388l5663n7609p1890k4269J0980K5381N4572
$$ 150778 186808 224931 297687 331075 295412 237803 165913 141644 152624 178005 232577
16074B32577K241j00138R945Q4602N1535q742j40023j4873p1398J60592J32118
$$ 232577 234818 134680 144625 229227 280762 272020 131997 117124 45726 206318 338436
16063C38436k7128j23785q0376J10195J28383R6614q5943j51431j00191N1976
$$ 338436 311308 187523 107147 217342 345725 442339 356396 204965 104774 156750
16053A56750M9677k5310J6556J3397M2078K7421p5552l5768p9455J02968N1850
$$ 156750 206427 181117 197673 211070 253148 280569 205017 169249 89794 192762 244612
16042B44612N0023O2983L0157m5227L4910m1373k3863o5998K6142j726n2345O8594
$$ 244612 294635 357618 387775 342548 377458 336085 312222 246224 272366 270640 218295 286889
16030B86889K0899o3508L8945N9469M571M8218q642K8743j35383O527J64809O1075
$$ 286889 307788 244280 283225 342694 347265 395483 386841 415584 280201 286728 451537 512612
16018E12612p1168l3146j59862j18804k667l9218O5169O9703k0325N6347n3302
$$ 512612 441444 408298 248436 129632 126965 87747 152916 222619 202294 258641 205339
16007B05339o7244l6739J27556M7738j2415o811m200J5924l1211j6196p7064j1892
$$ 205339 138095 101356 228912 276650 264235 257424 253224 269148 237937 221741 144677 132785
15995A32785J15105k1331n3126J22433k8448j0209o7243r6570l253J09427R3550
$$ 132785 247890 226559 173433 295866 267418 257209 189966 93396 90143 199570 293120
15984B93120J06925l603L9297j40771l2387O0635P4399J186k2343q889n1379l284
$$ 293120 400045 396442 435739 294968 262581 323216 397615 398801 376458 367569 316190 312906
15972C12906J28916J1880j16429p811K7232J7812r8696k3817m5174L5538O0796
$$ 312906 441822 453702 337273 329462 356694 374506 275810 251993 206819 242357 303153
15961C03153p7235K4788N2991l4369o7349K9584P7666K756K2650O9583K3190O5979
$$ 303153 225918 250706 303697 269328 201979 231563 309229 311985 334635 404218 427408 493387
15949D93387k0598j219j5533k6658m0641P2651N7082n8133j14579l0202M3980
$$ 493387 472789 471570 456037 429379 388738 461389 518471 460338 345759 315557 359537
15938C59537R7197J16011Q5671m5017j6408n6103j29339o3920l5988k2018K6778
$$ 359537 456734 572745 658416 613399 596991 540888 411549 347629 311641 289623 316401
15927C16401N9617R184K5095n6445J5870j8194n6311j01128r2610J9337l8215
$$ 316401 376018 385202 410297 353852 369722 351528 295217 194089 101479 120816 82601
15916H2601N1265R3641J12398L953N111L8859l2140J8143p9628n5367L9400j0557
$$ 82601 133866 227507 339905 343858 348969 387828 355688 373831 294203 238836 278236 267679
15904B67679M9714o6337L3447M7917m918J09836J6826j00614M1178J12714m8172
$$ 267679 317393 251056 284503 332420 327502 437338 454164 353550 394728 507442 459270
15893D59270j14260p2706j09021k6132m8935K2247J07669n5375k7551k0339N7113
$$ 459270 345010 272304 163283 137151 88216 110463 218132 162757 135206 114867 171980
15882A71980N1768k7261j6003j9690P3338J04922m0472M8757K364P899k9924n48
$$ 171980 223748 196487 180484 160794 234132 339054 298582 347339 349703 357602 327678 327130
15870C27130O2277P821l1718j35287o3074M0834O2960M3908J1209m5276R401K1739
$$ 327130 389407 397228 365510 230223 167149 207983 270943 314851 326060 280784 290185 311924
15858C11924L5769j4739P793K2199J9959p6284P4027L532j9605p0755r0724J517
$$ 311924 347693 332954 340747 362946 382905 306621 380648 384180 364575 293820 203096 204613
15846B04613M5000R96j9467l4531j03692l4708P3192K05110J39145O4159o1178
$$ 204613 249613 250609 231142 196611 92919 58211 131403 336513 475658 539817 478639
15835D78639j10639R0688r0607j55943l3640j1555m3375J3099M2910J1642J7408
$$ 478639 368000 458688 368081 212138 178498 166943 123568 136667 179577 191219 208627
15824B08627O3284M398M94J20510J15839k2645j707p033o3983j54951N4351M5510
$$ 208627 271911 276309 276803 397313 513152 490507 488800 481767 417784 262833 317184 362694
15812C62694o324m5442p1918k6215j07095N8163J52381J09208N0862j42574j35839
$$ 362694 356370 310928 239010 212795 105700 163863 316244 425452 476314 333740 197901
15801A97901P9648R8662n6449o5410l3716j4131k1827l6440K7982O410L3913j0435
$$ 197901 277549 376211 319762 254352 220636 206505 184678 148238 176220 182630 216543 206108
15789B06108j596K1472J65484P6302j67418j29453k3070L5428J17367L1028M2096
$$ 206108 204512 225984 391468 467770 300352 170899 147829 183257 300624 331652 373748
15778C73748K0028J002R73l4996J36532L0614k4373M7738l482k9993j01730q7942
$$ 373748 393776 394778 395751 360755 497287 527901 503528 551266 547784 517791 416061 328119
15766C28119P2343P1206Q8632M6973o0288o2319m8209j07250m9398n8205Q3949
$$ 328119 400462 471668 560300 607273 546985 484666 436457 329207 279809 221604 305553
15755C05553J02323n3968l1651K4221n3967j2743L3563L0371m0574Q011k2148
$$ 305553 407876 353908 322257 346478 292511 279768 313331 343702 303128 311139 288991
15744B88991K9185q7874j21621m4647M4776M0664Q0940N7196Q6217N0984L3393
$$ 288991 318176 230302 108681 64034 108810 149474 230414 287610 373827 424811 458204
15733D58204o5483R569J4858K8398k6294n5596l7632l5929n541M629r3849L5476
$$ 458204 392721 402290 417148 445546 419252 363656 326024 290095 284554 289183 195334 230810
15721B30810L5037k8048J58839m0491o223K1127K7117l0079n5150j6883J123J20175
$$ 230810 265847 237799 396638 356147 349924 371051 398168 368089 312939 296056 297179 417354
15709D17354L2049l6402m7936j5459J58O5227O0442k4291K5912M5017j3289j03893
$$ 417354 449403 413001 365065 349606 349764 414991 475433 451142 477054 522071 508782 404889
15697D04889n4533J5589m3502q2186m7831M0369K35976J06339l2318k2269J6213
$$ 404889 350356 365945 322443 240257 192426 232795 468771 575110 542792 520523 536736
15686E36736l0123k6544M2085O8336o7105o1079p6207P2860Q0208N4714j30395
$$ 536736 506613 480069 522154 590490 523385 462306 386099 458959 539167 593881 463486
15675D63486j97571m2914J27337J8257m7705r8301o470R5483J72066O8517O9411
$$ 463486 265915 223001 350338 368595 320890 222589 216119 311602 483668 552185 621596
15664F21596M675n9554p9767j00638q9906k4146J73521M6106k0152j0056p6473
$$ 621596 626271 566717 486950 386312 296406 272260 445781 491887 471735 461679 385206
15653C85206j3232l6133P9077J8121l3092o547K4198o6642m4240m0902k5545j6797
$$ 385206 371974 335841 414918 433039 399947 393400 417598 350956 306716 265814 240269 223472
15641B23472M4352M7481N0567M5323Q9465J9405L3146l2770l8573p2238M882R5420
$$ 223472 267824 315305 365872 411195 500660 520065 553211 520441 481868 409630 414512 509932
15629E09932M4786j29674j04875M4296L4666p7206o9427J3539P7120p0504K4263
$$ 509932 554718 425044 320169 364465 399131 321925 252498 266037 343157 272653 296916
15618B96916K1435L7769K4883K599L1990M186O319R695R9319R4098j30911K7898
$$ 296916 318351 356120 381003 383602 415592 419778 426097 435792 535111 629209 498298 526196
15606E26196O6346j3618o9180j90540n7921J81159J07566J7503r0794j12828o8108
$$ 526196 592542 578924 509744 319204 261283 442442 550008 567511 476717 363889 295781
15595B95781O3975Q5043J2015L2443m7754p7195n8189L1055J03553O8280r0068
$$ 295781 359756 444799 456814 489257 441503 364308 306119 337174 440727 509007 418939
15584D18939K8422R6631k5560j08881j4547k8054m8518L8687M8392M1359j5173
$$ 418939 447361 543992 518432 409551 395004 366950 318432 357119 405511 446870 431697
15573D31697k6782p1198o1196j4713k9048N2987L4647J61383P0492j8686O4615
$$ 431697 404915 333717 272521 257808 228760 281747 316394 477777 548269 529583 594198
15562E94198q1256m5925j2312p3449j01546J06944Q3485L0072l2265j5273m1253
$$ 594198 512942 467017 454705 381256 279710 386654 470139 500211 467946 452673 411420
15551D11420m6436o8661L4183R0800N990L9620n216l644o5704k7240O1383p1483
$$ 411420 364984 296323 330506 421306 427296 466916 461700 458056 392352 365112 426495 355012
15539C55012r867p6372K5031J20747k9991q8515k6364N8616K5712K1686M2551
$$ 355012 345145 268773 293804 414551 384560 296045 269681 328297 354009 375695 418246
15528D18246o353k0424m4037k5165K3150Q3732J7873j25561M9820J5277P2843
$$ 418246 411893 391469 347432 322267 345417 429149 447022 321461 371281 386558 459401
15517D59401o9273n5670l7450j5206L1976L7696k49O7278L9631L2704j1142n1134
$$ 459401 390128 334458 297008 281802 313778 351474 351225 418503 458134 490838 479696 428562
15505D28562J0982L6919k4688m0123q432o3221P324K7015Q0747k5301r37J4077
$$ 428562 439544 476463 451775 411652 403220 339999 347323 374338 455085 429784 428847 442924
15493D42924M6288k0757L1975L6019P0732k2797j45396m4564n0581j7855P6707
$$ 442924 489212 468455 500430 536449 607181 584384 438988 394424 343843 325988 402695
15482D02695J7573N1895p0104l965J39640P3792k9792o1501r2095J5756J30137
$$ 402695 420268 472163 402059 398094 537734 611526 581734 520233 428138 443894 574031
15471E74031l5352N7991o1164j76631j2992l964k8232r2691J4920Q8883j8111
$$ 574031 538679 596670 535506 358875 345883 341919 313687 220996 235916 324799 306688
15460C06688p810R7372o9864n4309k1231l2081J1198P0924J1502J21266M5085
$$ 306688 298878 396250 326386 272077 250846 218765 229963 300887 312389 433655 478740
15449D78740o145Q9990q3012M0377n8022r5803J9863J3779l2605R617K4092j8508
$$ 478740 472595 562585 479573 519950 461928 366125 385988 399767 367162 376779 400871 382363
15437C82363Q1472P9219J8730k9722P396q1902q8670o5311O3502R6717K5062o2363
$$ 382363 463835 543054 561784 532062 539458 457556 368886 303575 367077 463794 488856 426493
15425D26493J021N3409J11179Q3236j4613k5663K6037L4844j35466l3727p460
$$ 426493 427514 480923 592102 675338 660725 635062 661099 695943 560477 526750 519290
15414E19290J0505j41896p1716J82160J74082L2531m300J18766o6010j22192q8532
$$ 519290 529795 387899 316183 498343 672425 704956 700656 819422 753412 631220 542688
15403E42688l8374P3568M0264M6599L0245L5735M5908j1342j8903j34801J0356
$$ 542688 504314 577882 618146 664745 694990 730725 776633 765291 746388 611587 621943
15392F21943l743j23252j18763K590L8250N0780M0706n7871j73384m6712J19515
$$ 621943 618200 494948 376185 378775 417025 467805 508511 450640 277256 230544 350059
15381C50059J18232J20825l1816j23763L6440J44586q149k2809p4471l4124o3236
$$ 350059 468291 589116 557300 433537 469977 614563 606414 583605 509134 475010 411774
15370D11774Q62O2694J24722l2730p4920p2579m1719Q966l620N8923J229o9939
$$ 411774 412636 475330 600052 567322 492402 419823 378104 387070 383450 442373 443602 373663
15358C73663o920L8221L6997K5277J32704N9673p7329P028N8379k0767l3163O1446
$$ 373663 366743 404964 441961 467238 599942 659615 582286 589314 647693 626926 593763 655209
15346F55209K1335n1155O5481J9897J4181j17540J0776J4452N4150m4389j08403
$$ 655209 676544 625389 690870 710767 724948 607408 618184 632636 686786 642397 533994
15335E33994L0392L1668q0434m4320J03414J08759o4901k0038n0992q6384o215
$$ 533994 564386 596054 515620 471300 574714 683473 618572 598534 547542 461158 454943
15324D54943q7576k601K6011P4362K193P5051M0497O0960L5405O7226m8541p7115
$$ 454943 367367 364766 390777 465139 467332 542383 582880 643840 679245 746471 697930 620815
15312F20815n798j6212j12676r9764J3254K0307M5327J49724N355j02052p2332
$$ 620815 615017 598805 486129 386365 399619 419926 465253 614977 620332 518280 445948
15301D45948j2134k6258j9289P4642J43857K9825r0573n9099K4998p9027j04889
$$ 445948 433814 407556 388267 462909 606766 636591 546018 486919 511917 432890 328001
15290C28001K5524N7660j8122N486N9308J29487Q2711j7714j73703j03589N5541
$$ 328001 353525 411185 393063 398549 457857 587344 670055 652341 478638 375049 430590
15279D30590O6850Q6972K00k6699l6277n1640k4181p3211M9218n977L573J28543
$$ 430590 497440 584412 584612 557913 521636 469996 445815 372604 421822 415845 419418 547961
15267E47961o3567o0893p0378K9985R5350L1328K5818k8247j47258j3817J24277
$$ 547961 484394 423501 353123 383108 478458 509786 535604 507357 360099 346282 470559
15256D70559J0258J23597j05298k6189r088N3744R1221L5981p2885j2754N4770
$$ 470559 480817 604414 499116 472927 463839 517583 608804 644785 571900 559146 613916
15245F13916L120M2524R2429o3940r0334j47128l143J13623P4650R521O460n57
$$ 613916 617036 659560 751989 688049 597715 450587 447444 561067 635717 645238 651698 651141
15233F51141j33217n8306O7765K4343j21769k2647j2347J7123j8992k2046Q8953
$$ 651141 517924 459618 527383 551726 429957 407310 394963 412086 393094 371048 460001
15222D60001j1363l7123P3344N5073p2389P0151L2832r1849p8015k852o5290J43408
$$ 460001 448638 411515 484859 539932 467543 537694 570526 478677 400662 397810 332520 475928
15210D75928J4610n6580J00581Q5582o3487M977N394n2359l365L8601K2960o6732
$$ 475928 490538 433958 534539 620121 556634 561611 567005 514646 511281 549882 572842 506110
15198E06110k1442j51701J2070Q3413K4316P5373L3512O0678l754k6810m3077
$$ 506110 484668 332967 345037 428450 452766 528139 561651 622329 618575 591765 548688
15187E48688n3744m3679J1445k6331M4948O5579K8613P6341o0146l3365j24480
$$ 548688 494944 451265 462710 436379 481327 546906 575519 651860 591714 558349 433869
15176D33869p3268K5068R9787R8287k6789p2533N7945M001J2691q8274j02573
$$ 433869 360601 385669 485456 583743 556954 484421 542366 546367 559058 470784 368211
15165C68211L3874J08438K7426j29153p1908K2234P111R7063N6288L8228P8354
$$ 368211 402085 510523 537949 408796 336888 359122 366233 463296 519584 557812 636166
15154F36166m5899m1866k2411L1767L6933M428j07296r8774o700J14762J22766
$$ 636166 590267 548401 525990 557757 594690 599118 491822 393048 386348 501110 623876
15143F23876n1299l971n7428q7859N9164K3233j6800M1027Q3835K2733K5300L931
$$ 623876 572577 568606 511178 423319 482483 505716 488916 529943 613778 636511 661811 665742
15131F65742l7131l4338j0478j4549m6062J01684Q1835O8091j8318j62516o857
$$ 665742 628611 594273 583795 569246 523184 624868 706703 774794 756476 593960 587103
15120E87103J32411Q2921q677n1782j17135r5973j0767L0016R5894J23721J9466
$$ 587103 719514 802435 793758 741976 624841 528868 518101 548117 644011 767732 787198
15109G87198j20642r1411J6876P2449l2001j15955o564J21460P7804o1108l7467
$$ 787198 666556 575145 592021 664470 632469 516514 509950 631410 709214 648106 610639
15098F10639L1681p0839K190j11129n6246P7570J57716o9227l0164o8930R0136
$$ 610639 642320 571481 573671 462542 406296 483866 641582 572355 542191 473261 563397
15087E63397P0020K1210P1531q2594q4147M093J03060j6315L6332K3135j8736
$$ 563397 633417 654627 726158 643564 559417 563510 666570 650255 686587 709722 690986
15076F90986N041J11712m5931o2356j8307M3396R364k0534p4637l5319p0050l3108
$$ 690986 696027 807739 761808 699452 681145 724541 733905 713371 638734 603415 533365 500257
15064E00257j7501j9529P5094j6821J09180K11858J8977N8786l2907j14309j08515
$$ 500257 482756 463227 538321 521500 630680 842538 861515 920301 887394 773085 664570
15053F64570j18234p3993N2367J1163Q4439K4666n5649o3849P4838K2671J35692
$$ 664570 546336 472343 524710 535873 620312 644978 589329 525480 600318 622989 758681
15042G58681k9534j56995j194K5226n5723m373M3604J1809j5717o9359q8870M4892
$$ 758681 729147 572152 570958 596184 540461 536088 579692 591501 575784 506425 417555 462447
15030D62447P4112o101O9453O3962%M9216k3067m8233L6558M7042L0913k5732
$$ 462447 536559 530458 599911 663873 663873 713089 690022 641789 678347 725389 756302 730570
15018G30570J3294M0645l366j0437q9771p8713Q0892K2466L3537J29606l1954
$$ 730570 743864 784509 781143 770706 680935 602222 683114 705580 739117 868723 836769
15007H36769j59980j05587k0747Q1527J3621o6725m1943L1654o6718J0307J3005
$$ 836769 676789 571202 550455 631982 645603 578878 536935 568589 501871 512178 525183
14996E25183M2497J4048P1954q11O8115n9960l4920Q690J2198m6102j402j5735
$$ 525183 567680 581728 653682 652871 720986 661026 626106 634796 646994 600892 599490 583755
14984E83755p1100K5552N1599p8862p2944J13253Q7088N091J2548P8174J28727
$$ 583755 512655 538207 589806 510944 438000 551253 638341 643432 655980 734154 862881
14973H62881l7129n0854N5218o9200j92000m3659J04174P2685j3835r0921j2302
$$ 862881 825752 774898 830116 760916 568916 525257 629431 702116 688281 597360 585058
14962E85058L1103J43489J07147J366q8766r8260j11426o0078N510O7642o2523
$$ 585058 616161 759650 866797 868163 779397 681137 569711 509633 515143 582785 520262
14951E20262k208J06371J43422J02982K0658l8005j92756m7264R550m3341j9335
$$ 520262 518054 624425 767847 870829 891487 853482 660726 613462 623012 579671 560336
14940E60336Q1909K04804J89m6700j3573r5424j25365j34344R8338O4134J74373
$$ 560336 642245 847049 847238 800538 786965 691541 566176 431832 530170 594304 768677
14929G68677J08937J801r3528m8759O7374j9891M780J19764j1810J7777j57101
$$ 768677 877614 879415 785887 737128 804502 784611 789391 909155 897345 915122 758021
14918G58021k26706J5790R0974J85951K3249o2644j5847o721o3684o0204k6405
$$ 758021 531315 547105 638079 824030 847279 784635 768788 762067 698383 638179 611774
14907F11774O8664q6439p3779K5636M0760K9704L7404k1059r754L2509N1534K8377
$$ 611774 680438 593999 520220 545856 586616 616320 653724 632665 622911 655420 706954 735331
14895G35331m8692m8028r1042J19100J45904q6959M1643m5477o9363o6931N7854
$$ 735331 686639 638611 547569 666669 812573 725614 767257 721780 652417 585486 643340
14884F43340J32947Q1688k7319r3702m0888J04222K9216M7882J13250J0654j88952
$$ 643340 776287 857975 830656 736954 696066 800288 829504 877386 990636 1001290 812338
14873H12338o1837J7013P6389j20891o1133j01607l6418J98224R0299J4081J4639
$$ 812338 750501 767514 843903 723012 661879 560272 523854 722078 812377 826458 841097
14862H41097m1166m005j59538l4569R6906J3036K2529R4840P2964j12263j67839
$$ 841097 799931 795926 636388 601819 698725 711761 734290 829130 902094 789831 621992
14851F21992O7080J32503L1694o2590l0871Q2587m3917n0116K5654M1332j24207
$$ 621992 689072 821575 853269 790679 759808 842395 798478 748362 774016 815348 691141
14840F91141r6687J6767J71836K6211K2955P6549k8066o4053K8790l3852k6075
$$ 691141 594454 611221 783057 809268 832223 908772 880706 816653 845443 811591 785516
14829G85516M4467m7503K1671L6001l0169o2829J17228R4300L7734M3117J5214
$$ 785516 829983 782480 804151 840152 809983 747154 864382 958682 996416 1039533 1054747
14818A054747j01809P5762J1093k8895n7257n6155K7398p2754q244P3764k846
$$ 1054747 952938 1028700 1039793 1010898 953641 897486 924884 852130 843886 917650 914804
14807I14804R2077m645j82394j3929J10615M4348K2498j45217J07997m4341k2737
$$ 914804 1006881 1002236 819842 805913 916528 960876 983374 838157 946154 901813 879076
14796H79076m1485L0259k9260N1547m1418k9052L5149J02596l3859j419r3289
$$ 879076 837591 867850 838590 890137 848719 819667 854816 957412 923553 922134 828845
14785H28845j13630q0419O0631P1419P8275M5060l3584l5882q921M301Q7645q5084
$$ 828845 715215 634796 695427 766846 845121 890181 856597 820715 811794 816095 903740 818656
14773H18656j4942J10814q9843r6197J09985P6878r9238o9644j552P9120J56669
$$ 818656 803714 914528 824685 728488 838473 915351 816113 746469 744917 824037 980706
14762I80706J75500m154q2489l2465j19526P1730J05871j6651q7835n3251L0834
$$ 980706 1156206 1152052 1069563 1037098 917572 989302 1095173 1078522 990687 937436 968270
14751I68270P3159M428o9823k2888J14972L5359P2902N1167j28382n9817K3211
$$ 968270 1041429 1045857 976034 953146 1068118 1103477 1176379 1227546 1099164 1039347 1062558
14740A062558J70150M7537q9831N42N8298n3515m1329l8844r0165q2232j8808
$$ 1062558 1232708 1280245 1190414 1190956 1249254 1195739 1154410 1115566 1025401 943169 924361
14729I24361J12793J1187j59028Q3274Q5257L8356O329K4493m7569Q1152j9322
$$ 924361 1037154 1048341 889313 972587 1057844 1096200 1102529 1127022 1079453 1160605 1141283
14718A141283j22082j6853P0104L9342k7737n3413L5235N7696J42364l2210j07934
$$ 1141283 1019201 1002348 1072452 1111794 1084057 1030644 1065879 1123575 1265939 1233729 1125795
14707A125795q4277m1729N0399n0158q6194o3236K4217K6053K2950Q1282K7324
$$ 1125795 1041518 999789 1050188 1000030 913836 850600 874817 900870 923820 1005102 1032426
14696A032426j40447j0052l3630l8312O8593J49626R9037R292k0810M3005Q9706
$$ 1032426 891979 881927 848297 809985 878578 1028204 1127241 1136533 1115723 1158728 1248434
14685A248434Q582m2895M5366k7367j0400j3077j2157p1996k2383m7892k470m7869
$$ 1248434 1257016 1214121 1259487 1232120 1221720 1208643 1196486 1124490 1102107 1054215 1051745 1003876
14673A003876r4601k1567j2451n0166m1482N7754J05182j0191k9955O0724O0949
$$ 1003876 909275 887708 875257 825091 783609 841363 946545 936354 906399 967123 1028072
14662A028072L5165o9446m7254n4976m1059J47626L1882p5726J0025k1920r9917
$$ 1028072 1063237 993791 946537 891561 850502 998128 1030010 954284 964309 942389 842472
14651H42472K7837Q3474P1269j27342L0311N3655L1529n1130q5040N8746K5169
$$ 842472 870309 953783 1025052 897710 928021 981676 1013205 962075 877035 935781 960950
14640I60950J7303N303K0704m5797l7311K6768k6199j843J3560j7543J8767J03735
$$ 960950 978253 983556 1004260 958463 921152 947920 921721 919878 933438 915895 934662 1038397
14628A038397R1341O3809m5024k0639r1927j63900j9585N1927J50086o176r012
$$ 1038397 1129738 1193547 1148523 1127884 1035957 872057 852472 904399 1054485 1048309 1039297
14617A039297J6489l3041k2447j6145n2463m5192n1768O1949J05822o8340p948
$$ 1039297 1055786 1022745 1000298 984153 931690 886498 834730 896679 1002501 934161 926213
14606I26213j3537n7470O1523P2602J5236k3770p7934k947J1370j8366q0089M1435
$$ 926213 912676 855206 916729 989331 1004567 980797 902863 899916 911286 892920 812831 854266
14594H54266J21886J35711J999j9117o0178r0806M8901P4281J09196r4428j69960
$$ 854266 976152 1111863 1113862 1094745 1034567 943761 992662 1066943 1176139 1081711 911751
14583I11751n1702J33790K4548n2923M6572j3776P78K4848l3110P929J45775j1376
$$ 911751 860049 993839 1018387 965464 1012036 998260 999038 1023886 990776 998705 1144480 1133104
14571A133104k7658p3537N1856l4391J8818R448j2792k607j10542n5589L4519
$$ 1133104 1105446 1031909 1083765 1049374 1068192 1077640 1064848 1062241 951699 896110 930629
14560I30629M7697M1925L5361R5081M8059M0833J9850j99757J8522P0969k87q6114
$$ 930629 978326 1020251 1055612 1150693 1198752 1239585 1259435 1059678 1078200 1149169 1148882 1062768
14548A062768l1952M9818K7273K3662q8999p3224M4072N8213j00552L6727P0804
$$ 1062768 1030816 1080634 1107907 1131569 1042570 969346 1013418 1071631 971079 1007806 1078610
14537A078610N52N7891j2066N018m556l0892l4340j3728J18462J06555p1625L1901
$$ 1078610 1079162 1137053 1124987 1130005 1125449 1094557 1060217 1046489 1164951 1271506 1199881 1231782
14525A231782L5712L4202L2438j08312k2985L3424j06862r6308l5170K14974J8830
$$ 1231782 1267494 1301696 1334134 1225822 1202837 1236261 1129399 1033091 997921 1212895 1231725
14514A231725k9933l2083K4634K2168k2705o2772o6031L9206L8774k2466P6006
$$ 1231725 1201792 1169709 1194343 1216511 1193806 1131034 1065003 1104209 1142983 1120517 1196523
14503A196523K8780J6475Q6314J893j7553l3940k3368j8410j19081m8929O0660
$$ 1196523 1225303 1241778 1328092 1329985 1312432 1278492 1255124 1236714 1117633 1068704 1129364
14492A129364K0376L2339M4107J05479M0124j09877M522p0017p7788j2566P9807
$$ 1129364 1149740 1182079 1226186 1331665 1371789 1261912 1266434 1196417 1118629 1106063 1185870
14481A185870M8101k1888J6711k7731Q7930n1085J022Q6735m1829q9677L3407
$$ 1185870 1233971 1212083 1228794 1201063 1288993 1237908 1238930 1325665 1283836 1194159 1227566
14470A227566K7238J3907J1291M5995L1130j6024j6370K7066k5865r5031K9614
$$ 1227566 1254804 1268711 1280002 1325997 1357127 1341103 1324733 1351799 1325934 1230903 1260517
14459A260517n1918O7677N0204M4910k1214Q8206j2412o6613O5858j38797m6934
$$ 1260517 1208599 1276276 1326480 1371390 1350176 1438382 1425970 1359357 1425215 1286418 1239484
14448A239484K0824P1437K02831J05934j18852j97042p3604K1516J69542N9922
$$ 1239484 1260308 1331745 1534576 1640510 1521658 1324616 1251012 1272528 1442070 1501992
14438A501992j07674k459l8399J0739K582o4939J41393O9598n9984o6182k7561
$$ 1501992 1394318 1391859 1353460 1364199 1366781 1301842 1443235 1512833 1452849 1386667 1359106
14427A359106q6832J0616P2708J42834M0935n6162K481N7366K140m5868k6459
$$ 1359106 1272274 1282890 1355598 1498432 1539367 1483205 1485686 1543052 1545192 1499324 1472865
14416A472865k7813R5871M6848L023k6266L8172l360k7161o4611J6749J6598k8222
$$ 1472865 1445052 1540923 1587771 1590794 1564528 1602700 1599340 1572179 1507568 1524317 1540915 1512693
14404A512693O0771N9308L3126n088N8780o299p3610j204L8957P3403Q3170p4695
$$ 1512693 1573464 1632772 1665898 1660810 1719590 1713291 1639681 1638477 1677434 1750837 1834007 1759312
14392A759312k5412L9775j12372p7610j8246k1157j3205L6534J1573m8920l0440
$$ 1759312 1733900 1773675 1661303 1583693 1565447 1544290 1531085 1567619 1579192 1530272 1499832
14381A499832l0774r7661k6004N3822j7881q5762Q1892N2428N4916O782p663J09592
$$ 1499832 1469058 1371397 1345393 1399215 1381334 1295572 1377464 1429892 1484808 1491590 1483927 1593519
14369A593519M0150q286k0378q9630m2849L4287J17490K5439q3337N200n399k8992
$$ 1593519 1633669 1625383 1605005 1515375 1472526 1506813 1624303 1649742 1566405 1571605 1566206 1537214
14357A537214n796P9594k2381M9698j1700k6881j5439K4724O1101K6445m0609
$$ 1537214 1531418 1611012 1588631 1638329 1626629 1599748 1584309 1609033 1670134 1696579 1655970
14346A655970r6123J3487O086R1503J75884N913j7940l8502K5962j4649o3867
$$ 1655970 1559847 1573334 1579420 1670923 1846807 1852720 1834780 1796278 1822240 1807591 1743724
14335A743724p9361M2158O476P1833j5413k6830M593k5011J53120m2494j52881
$$ 1743724 1664363 1706521 1712997 1784830 1769417 1742587 1747180 1722169 1875289 1832795 1679914
14324A679914Q5581P6231l731p1395l4869Q8640N0237m3771M5458K4472o0610
$$ 1679914 1765495 1841726 1837995 1766600 1731731 1820371 1870608 1826837 1872295 1896767 1836157
14313A836157K0236J4424q5363p5083j22011P778j3060L2369P2453p898k4370
$$ 1836157 1856393 1870817 1785454 1710371 1588360 1596138 1583078 1615447 1687900 1680002 1655632
14302A655632k3589J7922n9396O1340J24293n56m4033J2354K3664m6714p6591
$$ 1655632 1632043 1649965 1590569 1651909 1776202 1775646 1731613 1743967 1767631 1720917 1644326
14291A644326j2352p3202l8541J7605L9281M3281J48802k2576j89307J41675J52897
$$ 1644326 1631974 1558772 1520231 1537836 1577117 1620398 1769200 1746624 1557317 1698992 1851889
14280A851889j9811q0801M2351M708K4287J563j848p5860l2971N6277j424o4697
$$ 1851889 1832078 1751277 1793628 1798336 1822623 1824186 1822338 1746478 1713507 1769784 1768360 1703663
14268A703663L8324Q5339K9764k2648r694L2896j7325m1533r3018o4046N3849
$$ 1703663 1741987 1827326 1857090 1834442 1824748 1857644 1840319 1798786 1705768 1641722 1695571
14257A695571J17966l4458p0398Q684O556J8034m2394R0523Q3623n6555j7951
$$ 1695571 1813537 1779079 1708681 1717365 1723921 1741955 1699561 1790084 1873707 1817152 1799201
14246A799201L7876q705M3877O362J3820L7021l6137J4027o466j09928j5955J6706
$$ 1799201 1837077 1828372 1872249 1878611 1892431 1929452 1893315 1907342 1900876 1790948 1774993 1791699
14234A791699N7429M1131O9565M017j6500n1999l7132L3454l0304j02011m5977
$$ 1791699 1849128 1890259 1959824 1963841 1947341 1895342 1858210 1891664 1861360 1759349 1713372
14223A713372J00174J10066L4005J17880r7554n6856O492j7680p2302l7846n8708
$$ 1713372 1813546 1923612 1957617 2075497 1977943 1921087 1927579 1909899 1837597 1799751 1741043
14212A741043J44076J7049m2712r32l9480q8433M7183R4164L4432p1330o1835
$$ 1741043 1885119 1902168 1859456 1858524 1819044 1730611 1777794 1871958 1906390 1835060 1773225
14201A773225J25684L9839J17943J56705K9392Q833N0323p5770j03066o3401O0840
$$ 1773225 1898909 1938748 2056691 2213396 2242788 2251621 2301944 2226174 2123108 2059707 2120547
14190B120547J12436O8311J2960q779r5382L7526q4949j06348p4880l5242L0700
$$ 2120547 2232983 2301294 2314254 2305475 2210093 2247619 2162670 2056322 1981442 1946200 1976900
14179A976900P4592K2656L8107J06554R9440R14n572o6746l2157J31964P946o6061
$$ 1976900 2051492 2074148 2112255 2218809 2318249 2319163 2313591 2246845 2214688 2346652 2354598 2288537
14167B288537N143L079M4606Q5530L5719K461M2269J6279K0130r0603j57j1423
$$ 2288537 2293680 2296759 2341365 2426895 2462614 2465075 2507344 2523623 2543753 2453150 2452993 2441570
14155B441570p5955O2369J24640J9029p5162O5110Q4631M3364J00036k0110j29292
$$ 2441570 2365615 2427984 2552624 2571653 2496491 2561601 2646232 2689596 2789632 2769522 2640230
14144B640230n2763k9929m1820Q7179J53742M5891N687J10897R4458k689Q4976
$$ 2640230 2587467 2557538 2515718 2602897 2756639 2802530 2808217 2919114 3013572 3010883 3095859
14133C095859m0410j10129j24034m4972M2799Q446p214K3406l0914J06548J18921
$$ 3095859 3055449 2945320 2821286 2776314 2819113 2827559 2820345 2843751 2812837 2919385 3038306
14122C038306nj8147M7680J33486n3534j27118N1308o6938l4158J41758L0681
$$ 3038306 3038301 3020154 3067834 3201320 3147786 3020668 3071976 3005038 2970880 3112638 3143319
14111C143319N016n0036k5013O4341K8300p1811n151j69815p2857J04120J16607
$$ 3143319 3148335 3098299 3073286 3137627 3165927 3094116 3088965 2919150 2846293 2950413 3067020
14100C067020j7446m3135N9068Q2487R9092J0403R715L1777J18796O7778o8183
$$ 3067020 3049574 3006439 3065507 3147994 3247086 3257489 3267204 3298981 3417777 3485555 3417372
14089C417372m1290J0517R405p1060m6736Q6192O1622N6118N5244J26403Q7837
$$ 3417372 3376082 3386599 3396004 3324944 3278208 3364400 3426022 3482140 3537384 3663787 3751624
14078C751624m008r898J3950K7557J5351K096N4034n4500k0566k4946L6340m3232
$$ 3751624 3747616 3737718 3751668 3779225 3794576 3796672 3850706 3796206 3775640 3750694 3787034 3743802
14066C743802m783J41897Q4610K0051M2444J04032N9912O9717J687N2654n8793
$$ 3743802 3739019 3880916 3965526 3985577 4028021 4132053 4191965 4261682 4263369 4316023 4257230
14055D257230R2677j5883r2052L7376j1581P8941J32675Q9776j4289j5689O2984
$$ 4257230 4349907 4334024 4241972 4279348 4267767 4346708 4479383 4569159 4554870 4539181 4602165
14044D602165O6310K3493L5007O7210L3172n0840M7578K5394k9626k5647Q0194
$$ 4602165 4668475 4691968 4726975 4794185 4827357 4776517 4824095 4849489 4819863 4794216 4874410
14033D874410K12060J00305j4095R4682N9140O8712O7920j7483P8267M3514L6544
$$ 4874410 5086470 5186775 5172680 5267362 5326502 5395214 5463134 5445651 5523918 5567432 5603976
14022E603976J22262K10868K26807P9697K9753J22437J53725J26683P3253l112
$$ 5603976 5726238 5937106 6163913 6243610 6273363 6395800 6549525 6676208 6749461 6746349
14012F746349J96443K45125K20274K11598J47105J32566J35850J23959J87497
$$ 6746349 6942792 7187917 7408191 7619789 7766894 7899460 8035310 8159269 8346766
14003H346766J68300J28476K82736K25693J00064K28275L10713L31286K46619
$$ 8346766 8515066 8643542 8926278 9151971 9252035 9480310 9791023 10122309 10368928
13994A0368928K03441K50988J64964L43021M38233K56688K25329L60477M41364
$$ 10368928 10572369 10823357 10988321 11331342 11769575 12026263 12251592 12612069 13053433
13985A3053433L99856L70067L75578M75239N25012M21202N98035P33110P42885
$$ 13053433 13453289 13823356 14198934 14674173 15199185 15620387 16218422 16951532 17694417
13976A7694417R58545J090921R94812R27386J105556J340761J543424J718630
$$ 17694417 18652962 19743883 20738695 21666081 22771637 24112398 25655822 27374452
13968B7374452J762216J848006J934096K030334K285827K567278K699901K666756
$$ 27374452 29136668 30984674 32918770 34949104 37234931 39802209 42502110 45168866
13960D5168866K633342K676105K658977K438521K264689J942327J646793J226283
$$ 45168866 47802208 50478313 53137290 55575811 57840500 59782827 61429620 62655903
13952F2655903R31802O35493M29867L16453L28331L31236L41674N56321P32217
$$ 62655903 63587705 64223198 64653065 64969518 65297849 65629085 65970759 66527080 67259297
13943F7259297P19282P31324Q06609O19410L02060O8414l68928r09577j464494
$$ 67259297 67978579 68709903 69516512 70135922 70437982 70506396 70137468 69227891 67763397
13934F7763397k029467k374827k672570k899293k945100k988203k892866k737624
$$ 67763397 65733930 63359103 60686533 57787240 54842140 51853937 48961071 46223447
13926D6223447k499995k310491k126131j897476j605531j494631j329886j208749
$$ 46223447 43723452 41412961 39286830 37389354 35783823 34289192 32959306 31750557
13918C1750557j021336p51014o38574o09088m24246k66121r2403K7207N9050J55931
$$ 31750557 30729221 29978207 29339633 28730545 28306299 28040178 27947775 27974982 28034032 28189963
13908B8189963P9658J64837M33197O08139P38083O96718Q50074R68549J067568
$$ 28189963 28269621 28434458 28867655 29475794 30213877 30910595 31760669 32729218 33796786
13899C3796786J303923J301809J471313J637434J894448J913251J961272J952526
$$ 33796786 35100709 36402518 37873831 39511265 41405713 43318964 45280236 47232762
13891D7232762J957158K007432K068476J994719J949253J592438J481658J222738
$$ 47232762 49189920 51197352 53265828 55260547 57209800 58802238 60283896 61506634
13883F1506634R16428O81025M04526L81380K14250r6761k26055j58111l14072
$$ 61506634 62423062 63104087 63508613 63889993 64104243 64007482 63781427 63623316 63309244
13874F3309244l29595m02498n35672o55016p95826j106522j336710j576442j709986
$$ 63309244 62979649 62577151 62041479 61386463 60590637 59484115 58147405 56570963 54860977
13865E4860977j943482k249675k231888k288465k480200k531955k425801k344768
$$ 54860977 52917495 50667820 48435932 46147467 43667267 41135312 38709511 36364743
13857C6364743k241651k113294k030601j802620j799498j595412j490157j318885
$$ 36364743 34123092 32009798 29979197 28176577 26377079 24781667 23291510 21972625
13849B1972625j305790j254008j195130r57362r28226p59609p54925p86833p80392
$$ 21972625 20666835 19412827 18217697 17260335 16332109 15572500 14817575 14030742 13250350
13840A3250350o87240o22940n12552m46973n69569l06263k19725l38934l38832
$$ 13250350 12563110 11940170 11427618 10980645 10411076 10104813 9885088 9546154 9207322
13831I207322k29016l63501l52794l10988k69067k29587j31983j33544j91866
$$ 9207322 8978306 8614805 8262011 7951023 7681956 7452369 7320386 7186842 6994976
13822F994976k61756j12377q0698m2491o1936k83409j46186j47673j26352r3538
$$ 6994976 6733220 6620843 6540145 6497654 6435718 6152309 6006123 5858450 5732098 5638560
13812E638560J4461r3981q0576l0023p5916j88075k08960j8328m374p7059j3870
$$ 5638560 5653021 5559040 5478464 5448441 5372525 5184450 4975490 4957162 4952788 4875729 4861859
13801D861859r9260k59713k2922K2271Q257r671q0958r7774m6749j5807j27361
$$ 4861859 4762599 4502886 4479964 4502235 4510492 4500821 4419863 4322089 4275340 4259533 4132172
13790D132172P1773N6891k0277O8320L3806j22540j01363k5375L0432N6923m473
$$ 4132172 4203945 4260836 4240559 4308879 4342685 4220145 4118782 4093407 4123839 4180762 4176289
13779D176289j54418q3489O7153M4736P4275O918P135q9239l960o2469l5668k8448
$$ 4176289 4021871 3938382 4005535 4050271 4124546 4131464 4138599 4049360 4045400 3982931 3947263 3918815
13767C918815R2074j0275j1943r9967j04543O9893O3792o5024J8482N7583N20
$$ 3918815 4010889 4000614 3988671 3888704 3784161 3854054 3917846 3852822 3871304 3928887 3929407
13756C929407r2978j5132O0025L3408P1642j08241J0555k1679j711n8245j2893
$$ 3929407 3836429 3821297 3881322 3914730 3986372 3878131 3888686 3867007 3865296 3807051 3794158
13745C794158N3594J6348K3064L9132J7657O9136N7397P6607l4708p7339L2317
$$ 3794158 3847752 3864100 3887164 3926296 3943953 4013089 4070486 4147093 4112385 4035046 4067363
13734D067363J8453L9613M2072K03108K3218j33223j20046q2637M8374J28972
$$ 4067363 4085816 4125429 4167501 4370609 4393827 4260604 4140558 4057921 4106295 4235267
13724D235267J14420l4338K5633K4592j5340K9265J01120J04769K2584j03056
$$ 4235267 4349687 4315349 4340982 4365574 4350234 4379499 4480619 4585388 4607972 4504916
13714D504916L6027P9031K2894J01974J5530j25299m5470Q7599Q3348k2610N8387
$$ 4504916 4540943 4619974 4642868 4744842 4760372 4635073 4589603 4677202 4760550 4737940 4796327
13703D796327Q8333l7823j6088J5837J21558O0191N5743L3876K04974P3359p5585
$$ 4796327 4884660 4846837 4830749 4846586 4968144 5028335 5084078 5117954 5322928 5396287 5320702
13692E320702n0101R9607J62534M0381m4885R9658J49178P5554J65162R8060K2877
$$ 5320702 5270601 5370208 5532742 5573123 5528238 5627896 5777074 5852628 6017790 6115850 6138727
13681F138727K2885K14836R1684J7731J59172K023M1964R4518J18023J38214J31730
$$ 6138727 6161612 6376448 6468132 6485863 6645035 6647058 6689022 6783540 6901563 7039777 7171507
13670G171507J48948J56413J45107J09665J54955J39542R3779J29448J22185J38156
$$ 7171507 7320455 7476868 7621975 7731640 7886595 8026137 8119916 8249364 8371549 8509705
13660H509705J33626J82162K15129K15804K14789L05557J59733K64700L70002
$$ 8509705 8643331 8825493 9040622 9256426 9471215 9776772 9936505 10201205 10571207
13651A0571207K79543M29015L55428M67299N10794M55874O41252P97409O16539
$$ 10571207 10850750 11279765 11635193 12102492 12613286 13069160 13710412 14507821 15124360
13642A5124360P80276J042180R97003J012483J038857J088055Q89018Q72836Q67219
$$ 15124360 15904636 16946816 17943819 18956302 19995159 21083214 21972232 22845068 23712287
13633B3712287Q05704M31976P8702l06495m58118o52063q35111r88019r42987
$$ 23712287 24517991 24949967 25028669 24722174 24264056 23611993 22776882 21788863 20845876
13624B0845876r22823r15878p64444o53525o52755m39773j98930k21482k97036
$$ 20845876 19923053 19007175 18242731 17589206 16936451 16496678 16297748 16076266 15779230
13615A5779230j77679p2413k9358n5298n2042J56469K25351J30176K34872J38188
$$ 15779230 15601551 15529138 15499780 15444482 15392440 15548909 15774260 15904436 16139308 16277496
13605A6277496J05632J68198L62565M80873M61718M41046L37292M35735N39522
$$ 16277496 16383128 16551326 16913891 17394764 17856482 18297528 18634820 19070555 19610077
13596A9610077O53317O06582N70814P19093P58529Q50683R05179Q22868J006620
$$ 19610077 20263394 20869976 21440790 22159883 22918412 23769095 24674274 25497142 26503762
13587B6503762J105886J172268J269271J320146J391986J529443J760167J853716
$$ 26503762 27609648 28781916 30051187 31371333 32763319 34292762 36052929 37906645
13579C7906645J976302K028153K246690K403673K669250K978339L306763L512129
$$ 37906645 39882947 41911100 44157790 46561463 49230713 52209052 55515815 59027944
13571E9027944L841468M326112M610914M984179N687633N984002O619038P482570
$$ 59027944 62869412 67195524 71806438 76790617 82478250 88462252 95081290 102563860
13563A02563860Q060399Q761058R677347J0444761J1329062J2125297J2628302
$$ 102563860 110624259 119385317 129062664 139507425 150836487 162961784 175590086
13556A75590086J2897213J2925534J2664685J2052077J0983096R643799Q158695
$$ 175590086 188487299 201412833 214077518 226129595 237112691 246756490 254915185
13549B54915185O578094N050864L840269K902462K083742J793433J470907Q82259
$$ 254915185 261493279 266544143 270384412 273286874 275370616 277164049 278634956 279517215
13541B79517215L05396o15087j837705l553244n669977p938984j0085000j2004080
$$ 279517215 279822611 279207524 277369819 273816575 268146598 260207614 250122614 238118534
13533B38118534j3546867j4508814j5158085j5178445j4634348j3704917j2866672
$$ 238118534 224571667 210062853 194904768 179726323 165091975 151387058 138520386
13526A38520386j1951891j0800681r766973q878034q073471p190062o488686n739512
$$ 138520386 126568495 115767814 106000841 97122807 89049336 81859274 75370588 69631076
13518F9631076n189389m761915m209000l834176l593576l124582k864942k625915
$$ 69631076 64441687 59679772 55470772 51636596 48043020 44918438 42053496 39427581
13510C9427581k254063k182506k133080j835812j596858j613877j554472j407100
$$ 39427581 37173518 34991012 32857932 31022120 29425262 27811385 26256913 24849813
13502B4849813j284318j154129j044291j019949p50731p80119o42937p51470p42352
$$ 24849813 23565495 22411366 21367075 20347126 19596395 18816276 18173339 17421869 16679517
13493A6679517n48453m75675o16243m32425m27974k69357l41275k31868k95287
$$ 16679517 16131064 15655389 15039146 14606721 14178747 13909390 13568115 13336247 13040960
13484A3040960k74481k54054k04161j84945j25626p7852j27296j17502k5051k1193
$$ 13040960 12766479 12512425 12308264 12123319 11997693 11919841 11792545 11675043 11649992 11628799
13474A1628799Q3074R9240O8126J99336L10572L29224M45085O13442O62038O33113
$$ 11628799 11711873 11811113 11879239 12078575 12389147 12718371 13163456 13776898 14438936 15072049
13464A5072049O93351P95595R63618J216335J114087R26906P81544O77452L22914
$$ 15072049 15765400 16560995 17524613 18740948 19855035 20781941 21563485 22240937 22563851
13455B2563851o7720n01734o34266r99717j256958j423298j329364j222318j268934
$$ 22563851 22496131 21994397 21360131 20360414 19103456 17680158 16350794 15128476 13859542
13446A3859542j093959r38172q74604o90734o56929n33520m94792n34670k82750
$$ 13859542 12765583 11827411 10952807 10262073 9605144 9071624 8576832 8042162 7759412
13437G759412k09588k58794k44377k76890k73215l07008j77555j88636j45060
$$ 7759412 7549824 7291030 7046653 6769763 6496548 6189540 6011985 5823349 5678289
13428E678289j19631j17177j86721k66200j22706q1969p9507l9221q9574p6462
$$ 5678289 5558658 5441481 5254760 4988560 4865854 4783885 4704378 4665157 4575583 4499121
13418D499121n5663j15192j45435j47618j42187r2536j8400K3291m8050o3957
$$ 4499121 4443458 4328266 4182831 4035213 3893026 3800490 3782090 3805381 3757331 3693374
13408C693374q0017r4460r5386r4242J7348m8051j56159k1878O6900p0427l4718
$$ 3693374 3613357 3518897 3423511 3329269 3346617 3298566 3142407 3120529 3187429 3117002 3082284
13397C082284J0770N4408k8687r2622n6110j1197r5840O5831o2219j33506P2120
$$ 3082284 3093054 3147462 3118775 3026153 2970043 2958846 2863006 2928837 2866618 2733112 2805232
13386B805232l2613k5996j02921j30021k8873N2238N7629k7857J2020J9940q1840
$$ 2805232 2772619 2746623 2643702 2513681 2484808 2537046 2594675 2566818 2578838 2598778 2516938
13375B516938l9586L543N5458J8313j686Q5246l7830k7102r0131M0162j4049o4302
$$ 2516938 2477352 2480895 2536353 2554666 2552980 2638226 2600396 2573294 2483163 2523325 2509276 2444974
$$ [...]
##END NTUPLES=NMR SPECTRUM
##END=
