##TITLE=Analysis number 328899
Compound Code cc 12501
Book Reference lab3
Project Code adrs
Chemist Name stores
##JCAMPDX= 6.0         $$ Bruker NMR JCAMP-DX V2.0
##DATA TYPE= NMR SPECTRUM
##DATA CLASS= NTUPLES
##ORIGIN= Bruker BioSpin GmbH
##OWNER= nmr
$$ XWIN-NMR		Version 3.5
$$ Fri Jul 13 12:05:23 2007 GMT Daylight Time (UT+1h)  MAYBRIDGE\nmr@NMR_250MHZ
##.OBSERVE FREQUENCY= 250.131544655141
##.OBSERVE NUCLEUS= ^1H
##.ACQUISITION MODE= SIMULTANEOUS (DQD)
##.ACQUISITION SCHEME= undefined
##.AVERAGES= 16
##.DIGITISER RES= 18
##SPECTROMETER/DATA SYSTEM= dpx250
##.PULSE SEQUENCE= zg30
##.SOLVENT NAME= DMSO
##.SHIFT REFERENCE= (INTERNAL, DMSO, 0, 16.522)
##AUDIT TRAIL= $$ (NUMBER, WHEN, WHO, WHERE, WHAT)
$$ ##TITLE= Audit trail, XWIN-NMR		Version 3.5
$$ ##JCAMPDX= 5.01
$$ ##ORIGIN= Bruker BioSpin GmbH
$$ ##OWNER= nmr
$$ C:\u/data/dgb/nmr/ADRS/950/pdata/1/auditp.txt
$$ ##AUDIT TRAIL=  $$ (NUMBER, WHEN, WHO, WHERE, WHAT)
(   1,<2007-07-13 12:05:03.52 +100>,<MAYBRIDGE\nmr>,<NMR_250MHZ>,
      <created by zg, POWCHK disabled, PULCHK disabled
       configuration hash MD5:
       76 6E 9A 78 1E 09 19 81 EC 84 63 8F B0 6A 59 2D
       data hash MD5: 64K
       6B E0 D6 53 68 0E 90 63 4E 99 CE CA E4 B7 E9 3E>)
(   2,<2007-07-13 12:05:15.55 +100>,<MAYBRIDGE\nmr>,<NMR_250MHZ>,
      <Start of raw data processing
       ef LB = 0.3 FT_mod = 6 PKNL = 1 SI = 32K 
       data hash MD5: 32K
       07 50 3A EB C8 B2 75 2E BB 60 F0 EC 2C 23 C1 AE>)
(   3,<2007-07-13 12:05:17.27 +100>,<MAYBRIDGE\nmr>,<NMR_250MHZ>,
      <apk 
       data hash MD5: 32K
       B7 09 7A FC A3 4B C6 D9 20 BC DA E3 B5 FB 88 E8>)
(   4,<2007-07-13 12:05:18.04 +100>,<MAYBRIDGE\nmr>,<NMR_250MHZ>,
      <abs ABSG = 5 
       data hash MD5: 32K
       2E EE 0B 2F 86 1C 60 61 58 EB 20 C2 62 C5 B4 23>)
$$ ##END=
$$ 
$$ hash MD5
$$ 21 CA C0 C9 96 F1 3C 47 10 7F 17 52 9B 97 89 4B
##$RELAX= 
##$RELAX= 
##$RELAX= 
##$RELAX= 
##$RELAX= 
##$RELAX= 
##$RELAX= 
$$ Bruker specific parameters
$$ --------------------------
##$DU= <C:\u>
##$EXPNO= 950
##$NAME= <ADRS>
##$PROCNO= 1
##$TYPE= <nmr>
##$USER= <dgb>
##$AMP= (0..31)
100 100 100 100 100 100 100 100 100 100 100 100 100 100 100 100 100 100 
100 100 100 100 100 100 100 100 100 100 100 100 100 100 
##$AQSEQ= 0
##$AQ_mod= 3
##$AUNM= <au_zg>
##$AUTOPOS= <27 >
##$BF1= 250.13
##$BF2= 250.13
##$BF3= 250.13
##$BF4= 250.13
##$BF5= 500.13
##$BF6= 500.13
##$BF7= 500.13
##$BF8= 500.13
##$BYTORDA= 1
##$CFDGTYP= 0
##$CFRGTYP= 5
##$CHEMSTR= <none>
##$CNST= (0..31)
1 1 145 1 1 1 1 1 1 1 1 1 1 1 1 1 1 1 1 1 1 1 1 1 1 1 1 1 1 1 1 1 
##$CPDPRG= <>
##$CPDPRG1= <>
##$CPDPRG2= <>
##$CPDPRG3= <>
##$CPDPRG4= <mlev>
##$CPDPRG5= <mlev>
##$CPDPRG6= <mlev>
##$CPDPRG7= <mlev>
##$CPDPRG8= <mlev>
##$CPDPRGB= <>
##$CPDPRGT= <>
##$D= (0..31)
0 1 0 0 0 0 0 0 0 0.06 0 0 0 0 0 0 0.0002 0 0 0 0 0 0 0 0 0 0 0 0 0 0 
0 
##$DATE= 1184324702
##$DBL= (0..7)
120 120 120 120 120 120 120 120 
##$DBP= (0..7)
150 150 150 150 150 150 150 150 
##$DBP07= 0
##$DBPNAM0= <>
##$DBPNAM1= <>
$$ [...]
##$SUBNAM7= <"">
##$SUBNAM8= <"">
##$SUBNAM9= <"">
##$SW= 20.6930455092707
##$SWIBOX= (0..15)
0 0 3 0 0 0 0 0 0 0 0 0 0 0 0 0 
##$SW_h= 5175.983436853
##$TD= 65536
##$TD0= 1
##$TE= 296.16
##$TE2= 300
##$TE3= 300
##$TEG= 300
##$TL= (0..7)
0 120 120 120 120 120 120 120 
##$TP= (0..7)
150 150 150 150 150 150 150 150 
##$TP07= 0
##$TPNAME0= <>
##$TPNAME1= <>
##$TPNAME2= <>
##$TPNAME3= <>
##$TPNAME4= <>
##$TPNAME5= <>
##$TPNAME6= <>
##$TPNAME7= <>
##$TPOAL= (0..7)
0.5 0.5 0.5 0.5 0.5 0.5 0.5 0.5 
##$TPOFFS= (0..7)
0 0 0 0 0 0 0 0 
##$TUNHIN= 0
##$TUNHOUT= 0
##$TUNXOUT= 0
##$USERA1= <user>
##$USERA2= <user>
##$USERA3= <user>
##$USERA4= <user>
##$USERA5= <user>
##$V9= 5
##$VALIST= <valist>
##$VCLIST= <CCCCCCCCCCCCCCC>
##$VD= 0
##$VDLIST= <DDDDDDDDDDDDDDD>
##$VPLIST= <PPPPPPPPPPPPPPP>
##$VTLIST= <TTTTTTTTTTTTTTT>
##$WBST= 1024
##$WBSW= 4
##$XGAIN= (0..3)
0 0 0 0 
##$XL= 0
##$YL= 0
##$YMAX_a= 431382
##$YMIN_a= -430560
##$ZGOPTNS= <>
##$ZL1= 120
##$ZL2= 120
##$ZL3= 120
##$ZL4= 120
##$ABSF1= 16.522
##$ABSF2= -4.171173
##$ABSG= 5
##$ABSL= 3
##$ALPHA= 0
##$AQORDER= 0
##$ASSFAC= 0
##$ASSFACI= 0
##$ASSFACX= 0
##$ASSWID= 0
##$AUNMP= <proc_1d>
##$AZFE= 0.1
##$AZFW= 0.1
##$BCFW= 0
##$BC_mod= 0
##$BYTORDP= 0
##$COROFFS= 0
##$CY= 12.5
##$DATMOD= 1
##$DC= 0
##$DFILT= <>
##$DTYPP= 0
##$F1P= 14.0000005364418
##$F2P= -0.99999901652339
##$FCOR= 0.5
##$FTSIZE= 32768
##$FT_mod= 6
##$GAMMA= 0
##$GB= 0
##$INTBC= 1
##$INTSCL= 1
##$ISEN= 128
##$LB= 0.3
##$LEV0= 0
##$LPBIN= 0
##$MAXI= 10000
##$MC2= 0
##$MEAN= 0
##$ME_mod= 0
##$MI= 0
##$NCOEF= 0
##$NC_proc= -3
##$NLEV= 6
##$NOISF1= 0
##$NOISF2= 0
##$NSP= 0
##$NTH_PI= 0
##$NZP= 0
##$OFFSET= 16.522
##$PC= 1
##$PHC0= -60.36748
##$PHC1= 3.229005
##$PH_mod= 1
##$PKNL= yes
##$PPARMOD= 0
##$PSCAL= 4
##$PSIGN= 0
##$REVERSE= no
##$SF= 250.13
##$SI= 32768
##$SIGF1= 0
##$SIGF2= 0
##$SINO= 400
##$SIOLD= 32768
##$SREGLST= <1H.DMSO>
##$SSB= 0
##$STSI= 32768
##$STSR= 0
##$SW_p= 5175.98343685301
##$SYMM= 0
##$S_DEV= 0
##$TDeff= 65536
##$TDoff= 0
##$TI= <Analysis number 999999
Compound Code 99
Book Reference 9
Project Code 9>
##$TILT= no
##$TM1= 0
##$TM2= 0
##$TOPLEV= 0
##$USERP1= <user>
##$USERP2= <user>
##$USERP3= <user>
##$USERP4= <user>
##$USERP5= <user>
##$WDW= 1
##$XDIM= 32768
##$YMAX_p= 428651990
##$YMIN_p= -53837
$$ End of Bruker specific parameters
$$ ---------------------------------
##NTUPLES= NMR SPECTRUM
##VAR_NAME=  FREQUENCY,     SPECTRUM/REAL,   SPECTRUM/IMAG
##SYMBOL=    X,             R,               I
##VAR_TYPE=  INDEPENDENT,   DEPENDENT,       DEPENDENT
##VAR_FORM=  AFFN,          ASDF,            ASDF
##VAR_DIM=   32768,         32768,           32768
##UNITS=     HZ,            ARBITRARY UNITS, ARBITRARY UNITS
##FACTOR=    0.157963299565203, 1,           1
##FIRST=     4132.6476996994, 0,             0
##LAST=      -1043.33573715361, 0,           0
##MIN=       -1043.33573715361, -53837,      0
##MAX=       4132.6476996994, 428651990,     0
$$ Real data points
##PAGE= N=1
##DATA TABLE= (X++(R..R)), XYDATA
$$ [...]
24016 -16548 -16847 -7007 -5129 -2749 1802 -8057 -11026 -12650 -7798 -6277 -5960 -13668 -28141 -22494 -12287
24001 -12287 -5886 1526 -5529 -3493 -1745 -1187 4089 12852 4540 10174 9675 -1663 -3433 2292 -1540
23986 -1540 -6375 -3264 13472 17303 17905 -2421 -13857 -902 9451 -5881 -6070 -12929 -24955
23973 -24955 -31643 -27901 -11827 -15875 -22667 -18757 -5267 578 5582 -1471 -3203 -572 3309 -286
23959 -286 -10263 -10191 -1333 1041 -1335 2829 -4840 -12241 -14164 -317 7681 6218 2932 6922 17149
23944 17149 23745 21164 5226 9668 12542 1288 -7959 2202 16728 14555 -3700 -4862 7133
23931 7133 13635 7140 5449 -10537 -19455 -18431 -21671 -14005 -7417 7048 9469 3173 -6936 -23500
23917 -23500 -15802 -11123 -7043 -9246 -6711 -1095 3021 1962 6563 3402 -5620 -2594 -6007 -5637 -655
23902 -655 2191 10216 9027 9021 10130 9793 -3612 -10785 3257 22362 20317 5764 -5808 -19211
23888 -19211 -13763 2027 19855 6227 -2497 -15727 -28561 -32192 -18382 -7049 2200 4588 12098
23875 12098 25998 30915 23453 26804 16159 -1661 -14436 -3048 -1561 -13508 -19112 -29013 -17110
23862 -17110 -5966 2057 -6269 -875 -1451 -7481 -3100 2579 5670 7317 13732 22373 -41 1272
23848 1272 11773 18491 13551 2151 5439 13200 14730 5271 -2820 -758 2004 7643 17378 21809
23834 21809 24397 23746 17592 10666 3298 -10742 -10406 -3918 10949 7890 -3367 -22527 -24101 -16800
23820 -16800 -6136 10713 3773 -2500 -1982 6081 -1220 -2786 6606 6001 -6234 -6152 21455 33144
23806 33144 18044 13826 2942 -2220 6426 1146 -4108 -10389 -9193 -20017 -20840 -25630 -25069 -29019
23792 -29019 -17735 -5742 -9295 -5772 7216 4462 6452 20441 7228 -2308 1810 2236 -2883
23779 -2883 -15506 -16626 -7397 9942 12522 -840 -7781 -3978 -1148 -6286 -12700 -17824 -20902 -5053
23765 -5053 926 1185 3838 8333 7983 -159 2409 16664 27667 31078 16713 2029 2443 6657
23751 6657 14279 15646 9320 5312 9825 13307 15321 15802 2698 -2842 9091 26108 15202 13641
23737 13641 6294 307 2235 9812 10630 5168 2786 10018 -556 -3414 13448 16336 20567 26698
23723 26698 18729 11577 2366 6868 16961 13694 14911 6733 6137 9175 4178 5140 2518 -594 -2988
23708 -2988 -1773 -16741 -30937 -20927 -13385 -22638 -23917 -25110 -27378 -18707 -6147 -4568 -9143 -2504
23694 -2504 -4344 -11552 -9741 226 7160 -11256 -17109 -20395 -23221 -17673 -14925 -10984 -10502 -11389 63
23679 63 4876 -1468 -12245 -15615 -2440 1720 11214 13030 9998 3602 7804 2907 -2687 3797 20259
23664 20259 16463 5183 -10535 -11127 -10081 -4638 -3112 8097 587 -5676 -21813 -17057 -1415
23651 -1415 -205 3283 15865 29880 19617 19897 11089 -5238 -9014 -1164 7827 18462 7017
23638 7017 2497 11069 8912 -10182 -26466 -17972 4208 8472 4232 4183 1255 1937 1392 -14753 -6895
23623 -6895 -138 -2552 -6186 -9855 -11249 -6846 -6848 -31 6944 -3018 2922 9686 4418 -3155 458
23608 458 5763 5898 -10045 -19622 -18441 -7602 -8476 -465 -8278 -5360 -2376 114 105 8212 11931 12885
23592 12885 9238 10320 1501 -6653 -20248 -21392 -5144 13402 15562 2069 7740 10212 3212
23579 3212 9757 17236 15536 -3592 -27356 -23683 -25548 -23929 -24894 -23968 -22076 -13493 -8699 -1322 16210
23564 16210 10035 10145 17585 13134 7247 1130 -1345 -1878 -6079 4048 5847 5454 -5233 -14888 -18483
23549 -18483 -17032 -842 17696 26827 35990 23447 13550 5013 4844 13968 19135 26641 21017 -3423
23535 -3423 -23950 -24669 -15591 -8631 7149 3579 -13340 -6827 3425 12746 19864 26541 29674 22680
23521 22680 13710 2783 -8227 -13094 4675 8737 5968 -9966 -2961 7416 4958 -19136 -10127
23508 -10127 5193 3210 1502 -3663 3722 15780 25438 22726 11423 5163 -7976 -8696 -814 3536
23494 3536 8865 8246 2153 -3944 -9538 -12843 -18388 -12722 -16021 -15578 -6842 888 7510 15140 12411
23479 12411 -1817 -10601 -3275 2254 1878 -3137 -11910 -3209 7857 3837 -1991 9601 7593 -5701
23465 -5701 -2776 5055 -909 -6979 -10571 -160 -11619 -17717 -17633 -20514 -15439 -16873 -30602 -32662
23451 -32662 -20666 -12473 -5236 -237 -14465 -4524 1071 6007 17702 13522 155 -9192 -19044
23438 -19044 -36536 -30929 -9689 -2859 7229 17389 -5773 -17253 -10516 -4687 523 -2444 -4883
23425 -4883 -10473 -2415 -5853 -5310 -5313 -5173 -3022 -1234 8445 1754 -18969 -25658 -24587 -20965 -13191 -5453
23409 -5453 -2421 9569 13187 7101 9248 13723 1778 4474 18692 24078 17997 23575 14928 5973
23395 5973 4121 3759 -2970 1232 5869 -185 -1241 6717 -873 -4543 4844 -2259 -2250 758 -4631 -14967
23379 -14967 -20824 -16118 -1594 -12122 -11686 -12540 -27822 -18608 -271 -4011 -12466 -9582 293 6011
23365 6011 3591 4309 -6526 -20136 -19792 -25299 -33425 -29162 -20733 -10722 -3733 1031 -3521 -14134
23351 -14134 -23622 -30063 -16837 -23214 -26511 -16104 -8650 6785 -577 -6787 -13954 -15511 -12262 -9912
23337 -9912 -14097 -12515 -5731 -7405 -14279 -15620 -23823 -9551 8482 10225 7654 -818 -8769 -9451
23323 -9451 -13047 -15295 -19742 -7887 7142 2512 1 478 -5251 -6991 -15426 -23073 -20199 -12087
23309 -12087 -9470 -8296 -2681 4632 13547 18637 12432 9662 18069 15186 2064 -6776 6615 10739
23295 10739 -1698 -8939 -21154 -28403 -34906 -26910 -13726 -13891 -10446 1810 -2138 -6142 6369
23282 6369 6449 -4631 -4943 1250 -14658 -9689 -2938 1490 -9542 -20261 -16904 -18935 -23020 -24831
23268 -24831 -15797 -5164 1111 -7933 -2347 -807 2867 -8866 -16351 -14419 -15069 -1173 7129 -2903
23254 -2903 -7118 -11445 -1298 1390 -15634 -10154 -14922 -14434 -10481 -4175 -6663 -7694 -11224 -24032
23240 -24032 -19193 -4901 -2647 -4478 2806 -2915 -19939 -15843 -21960 -31874 -29376 -8942 -1343 2122
23226 2122 2373 1081 -5326 -1213 9746 9786 16991 26371 20356 23692 20513 10791 14219 7408 -8676
23211 -8676 -4631 1990 5765 1179 1275 2858 -12545 -11215 -16548 -15984 7525 17128 6804 2281 -1447
23196 -1447 -8672 -5421 2808 14143 17056 5151 7983 1478 10097 9611 7236 2247 -82 -6227
23182 -6227 -9002 -3406 41 12219 18579 19197 7043 9607 13194 21281 22457 18306 11472 -7908
23168 -7908 -22017 -6215 -3565 -4898 -12869 -21364 -24561 -20584 -14420 -17735 -16044 -184 -6564 7128
23154 7128 10709 1570 -3169 8365 5827 2037 -709 -10579 -6575 -10235 -3333 5814 9540 365
23140 365 -5710 4037 22227 8307 -601 4600 11811 22813 28078 18093 4744 -17116 -16151 -4485
23126 -4485 3983 -8087 -12924 4498 20845 18958 10939 -3290 -11631 -6121 -1299 10755 17725
23113 17725 19360 22070 11941 2093 -5667 -5741 327 -9177 6316 9972 3068 -11783 -21561 -12375
23099 -12375 -4138 6123 14202 10413 -5547 -13652 -13175 2236 -791 778 6932 6426 -20075 -36061
23085 -36061 -33131 -26705 -12875 -14891 -14796 -21151 -31632 -24046 -23940 -10904 1885 10167 -7051 -18323
23071 -18323 -20571 -33929 -28600 -23932 -19117 -9608 -4193 -3508 3735 16096 11849 5027 1459 -13053
23057 -13053 -16388 -496 5693 -6411 -1005 6226 7336 2259 1363 8412 15222 20720 22070 23877
23043 23877 22779 16574 8162 -10803 -18381 -17533 -9496 -10036 -10385 -16037 -13681 -21171 -3485 -4098 1947
23028 1947 -8495 -21170 -13892 -7081 -9366 -7733 -4188 -8241 -10264 -4498 -11871 -8012 16196 8724
23014 8724 3960 3225 209 -3129 -7165 -2744 2076 212 -845 -9715 -13496 -9438 5789 -2452 1667
22999 1667 6738 14792 7397 -7943 -14461 -5741 8105 11886 9876 9955 18898 10496 -4013 -6731
22985 -6731 -7618 -16467 -4542 11975 7308 -2632 -3589 -190 -8930 -15401 -19017 -7007 -1283 2111
22971 2111 14146 15414 7295 4888 3832 4000 -9805 -14099 -860 -582 -5686 -6265 -22878 -31503
22957 -31503 -32857 -29562 -21462 -19917 -15260 -32062 -41126 -42101 -26203 8294 13726 7223 -3712 -10323
22943 -10323 -8843 -5114 -7387 -4304 3669 4741 -1099 -4272 -10982 -4240 -6897 -6533 -361 -5958 4201
22928 4201 1509 -4706 1525 5735 12226 -11234 -16054 -12410 -14778 -796 1158 -7624 -7236 -7861 289
22913 289 9126 10953 11133 16897 17325 13924 16341 -1180 -5888 -8248 5304 11500 848 -15946
22899 -15946 -7825 -13988 -24835 -17008 -14521 -14835 -8204 -22792 -22722 -13978 -14536 -16345 -18629 -10591 7055
22884 7055 5480 1081 -2286 -10811 -12850 -24503 -16325 -2863 -2834 -9769 -5978 -2581 6841 -3148 -16153
22869 -16153 -5685 -3575 -8017 -17342 -28760 -25091 -10658 -9267 -6322 -11937 -12633 -7491 -1449 -1143
22855 -1143 -17601 -19948 -13276 -10077 -6942 -7024 -4829 4536 5156 1499 -12337 -27404 -23895 -16381 -11594
22840 -11594 -4499 -15496 -22755 -19448 7290 20568 16748 10204 11300 10695 14488 10156 10253 3285
22826 3285 -4950 -12281 1753 26216 37465 45302 36277 16289 -1543 -6552 -2463 -5487 -15378
22813 -15378 -18052 -14129 -2428 1442 4536 -1748 -13223 -23632 -17085 2470 7755 5387 3572
22800 3572 -7133 -12170 -2645 8533 16789 10506 18900 7197 4991 717 -2315 3437 -3783 -6865
22786 -6865 5557 1465 -4170 3533 7193 5105 9107 6817 -98 -5411 -12235 -15972 -12415 -17330
22772 -17330 -10611 -847 -6722 -16945 -22989 -13934 1486 2217 1360 -2355 -13741 -28965 -32054 -28836
22758 -28836 -26343 -18691 -5873 -4307 -8132 -21594 -19904 -21794 -15067 -9990 -15301 -12464 -19014 -21169
22744 -21169 -14393 -10829 -9989 -14973 -10269 2919 11449 5598 1536 8279 15390 7192 -2407 -7570
22730 -7570 -6549 4246 14360 3710 -10707 -12915 -16704 -9742 -17437 -9597 -1401 2963 -3138 -7527
22716 -7527 -4786 3562 2750 -3685 -9792 -5657 -4287 -5057 -7252 -7155 -563 -1399 -8887 -4853 -12970 -17224
22700 -17224 -7703 3341 8071 4331 -6244 -2414 -15029 -26477 -17633 -3904 18598 19484 7018
22687 7018 13348 16102 -414 -3457 -6044 -1156 -5678 2066 8035 33376 40900 29036 18318 21077
22673 21077 11010 -3451 -11418 -8287 -1506 6756 3396 -10545 -12510 -6469 7921 16264 17184 3259
22659 3259 -4493 -24631 -25789 -23346 -18577 -12773 -20833 -13743 -1332 1299 5492 -2837 -7242 -5799
22645 -5799 6678 14011 23136 12004 -725 53 -9887 -10200 1258 -2525 -9130 -2654 2013 14553
22631 14553 17470 21221 18801 7939 -3267 -3769 -16282 -12980 4807 4272 857 3667 9024 15378
22617 15378 25640 15451 11471 16943 10292 -4197 2339 11161 17556 5578 5573 6286 -4897 -18309
22603 -18309 -26102 -12455 5967 1929 -16047 -25027 -17563 -24899 -3103 10678 6059 -5425 -13346
22590 -13346 -18867 -11281 571 -2013 -13106 -11030 -4609 -9046 -21764 -16816 -13823 -20394 -31231
22577 -31231 -21687 -17406 -10498 -4313 -1525 -14147 -9734 506 -2640 -4401 -5442 -8967 -10492 -7359
22563 -7359 13491 12573 9536 15844 9006 -8470 -16761 -13328 -9210 -11354 -11976 -11032 -9353 -25419 -22283
22548 -22283 -12755 -2496 8233 6011 5585 -1325 -13831 -16281 -798 15254 26514 27778 13497
22535 13497 11887 10509 -1425 -7638 1090 2725 -2923 -8531 -9692 -9211 934 11976 3355 456
22521 456 13505 3168 -5531 4581 4790 17317 19299 21844 13590 1183 -1624 3619 5139 -1959
22507 -1959 2844 5064 7345 7818 21080 21366 9206 11351 6415 -5721 -14693 -10216 -9180 -2572
22493 -2572 2651 -117 -5242 -6782 853 5175 9281 20414 23873 12006 4278 7673 12265 12653
22479 12653 20006 18318 11204 3315 -3998 -4756 -223 6448 527 -6275 7439 13579 10246 12068
22465 12068 2633 8562 11857 7506 2490 2817 -9980 -7664 7456 10450 7450 -4393 -11094 -18367
22451 -18367 -15785 -3515 2614 -3848 8972 14839 24321 23667 26272 19386 10328 8003 12964 -2695
22437 -2695 -10945 -16883 -19597 -27626 -23972 -8726 -4227 -10583 -7116 -368 7882 13020 23359 16660
22423 16660 -6139 -24172 -10464 -9339 -14174 -15989 -4390 899 3145 7624 2206 -3857 -9101
22410 -9101 -4524 -4858 -6829 -8952 -19222 -20849 -10210 -16379 -12880 -4321 -1896 -9503 -24913 -26577
22396 -26577 -31978 -24151 -19629 -21261 -13310 -4020 13006 8008 1217 5702 513 -18004 -19210 -18256
22382 -18256 -13407 5 3568 2153 -3509 -15697 -7608 -451 4267 -169 39 4048 -4549 -7642
22368 -7642 -9463 -7646 -18460 -9600 -10698 -12535 -13456 -9201 -18684 -10182 -16390 -14465 -12866 -9960 -1820
22353 -1820 11355 18422 -97 -2197 -3829 -6881 3272 8400 11400 9868 4624 4966 -731 -3274
22339 -3274 -338 -12116 -10475 -6267 -14074 -8502 3348 6034 1118 -4668 907 -4534 -15242 -3528
22325 -3528 -15101 -17408 132 968 4501 7840 -2568 -11674 -8646 -12167 -10299 -11177 -4241 -4264 -15353
22310 -15353 -19674 1269 2598 -15016 -28560 -23836 -12741 -4112 1331 11764 22464 35920 36754
22297 36754 -1609 -28542 -28428 -16454 3290 7443 7174 22122 9706 844 -1678 -6352 -4780
22284 -4780 -2001 -7173 -18559 -12333 -10948 -21916 -26085 -12255 -2431 -10111 -12677 -12415 -2680 -13574
22270 -13574 -16669 -15560 -10904 -6045 1838 11771 12889 28023 27107 14945 14881 24367 12587 2460
22256 2460 3834 -6205 -5897 -9725 -4410 -1772 4149 20377 34660 6855 -22191 -20146 -14386 -16466
22242 -16466 -24418 -9874 -2503 -1 -4494 -14514 -6032 921 4939 10329 8614 5793 2894 19106
22228 19106 14658 15791 6183 -9028 -4503 -8031 -4254 4185 5079 7384 3875 -2536 -1364 -1915 -7574
22213 -7574 1838 18471 32111 32625 32109 28128 11081 4577 9354 29143 26154 10315 11234 23154
22199 23154 24498 4090 -15395 -27418 -24704 -29983 -21324 -16869 -11935 1341 1246 4498 3788 4910
22185 4910 140 -8906 -17549 -5908 -2185 -4466 4616 14005 10658 23590 20468 10786 4368 9499
22171 9499 14143 15530 18856 14672 -1911 -12625 -24756 -21140 -15975 -7792 -4638 1934 -2740 1159
22157 1159 14416 14300 6231 7368 18262 11568 1055 -131 9307 10365 5751 7848 828 9554
22143 9554 6647 -1071 -5069 -7915 -16203 -7723 -4886 -11932 -30702 -20554 -606 2629 10944 7921
22129 7921 9325 10204 1811 13240 14691 12134 16465 2497 1585 11723 13034 1503 -14229 -13137
22115 -13137 -8130 -11387 -13325 -8544 2522 2233 -5000 -9789 -5102 354 -14967 -12601 -12806 -15358
22101 -15358 -12513 -8223 -9903 -13808 -15234 -3339 7245 11233 8743 14208 11819 4298 18384 8499
22087 8499 11542 26769 19391 -1114 -18423 -12485 3650 8681 -12095 -8840 -3901 -4588 5450
22074 5450 4162 -4168 -2666 -8094 -7561 -13718 -10564 -3556 2624 1287 -6437 -16102 -11757 -17915 -12730
22059 -12730 -10118 -7121 -10958 -5710 -2141 -4275 -15398 -21737 -10199 8573 8521 -700 3805 -7487
22045 -7487 -13586 -8694 -12823 -6421 -1525 -2512 -5040 -7229 -17967 -11411 1766 8904 1615 -7972
22031 -7972 -1337 1746 -2221 -1769 -8263 9369 9457 -7909 -15595 -11214 -4503 341 -450 2563 11466
22016 11466 4626 10745 21455 18248 10025 13456 6635 9546 23611 2596 -9658 -1911 1750
22003 1750 -4358 -23534 -34467 -27388 -11143 -10318 -6819 -8228 4857 4455 -9245 -15076 -16892 -15420
21989 -15420 -17102 -25772 -12696 -14044 -17136 -13588 -10644 -14156 -22747 -10603 -20181 -14874 -17544 -17169
21975 -17169 -8275 -4859 -871 9227 -2951 -863 11901 21275 12189 -3535 736 6640 5035
21962 5035 -12187 -7229 9262 19764 14312 15072 14606 5772 -2095 -10184 -8922 -145 -3165 -10925
21948 -10925 -8360 -12268 -15208 -8476 -14045 -18975 -25537 -23557 -14016 -24716 -8576 -5076 -759 825
21934 825 -2511 -2106 4992 4150 -4640 -18572 -2480 1741 920 1578 -1290 -8792 -790 -2824 -14133
21919 -14133 -9178 -4971 -9560 -11357 -21013 -6753 -2725 2326 7064 7499 16760 17479 1712 -90
21905 -90 6229 951 -12184 -2416 10552 8166 7891 1026 -8517 -13129 -5621 5244 -7349 -11122
21891 -11122 -10428 -9310 -5840 -5065 -5429 -4962 -3974 -10526 -5305 12003 18524 23563 17139 9398 10739
21876 10739 14402 21512 13317 2657 10349 -1343 -10384 805 4642 8896 16060 7400 -736 4572
21862 4572 3491 11601 15939 12905 19513 15924 5954 11179 1437 -13579 -12038 -10325 -8074 -12528
21848 -12528 -19418 -15388 -14636 -9832 -2137 171 -10578 -8237 -7351 -5521 -1285 -1527 3673 15840 12907
21833 12907 -9975 -1254 1605 9899 12407 1540 3373 -7110 2122 17646 10545 3021 1788
21820 1788 915 -2377 9335 6784 -9287 -20142 -15014 9064 4611 -2504 5174 13087 16828 19393
21806 19393 13169 6093 17094 12137 10086 7471 1366 -1501 1334 -2327 -842 837 -12547 -21777
21792 -21777 -27994 -24483 -19976 -10153 -9900 -1125 13257 24470 24941 17857 1731 -11026 -3577 22027
21778 22027 19075 6925 1570 -6729 -19530 -30628 -24786 -25991 -25316 -6279 5469 9016 9996 6203
21764 6203 -6092 -24202 -22959 -15091 -19091 -15372 -14666 -15635 -12791 -3058 720 -5457 4444 920 -7576
21749 -7576 -11056 -20998 -22296 -13862 3608 3353 5348 17979 23518 21047 12938 11300 12275 -7886
21735 -7886 -20793 -12130 -7176 -2983 3146 -4138 -13943 -24108 -25666 -5020 12600 9787 -4490
21722 -4490 -1317 9579 2496 7457 6228 -6482 -9933 -12044 -22758 -19737 -5762 -3847 -2285 -4697
21708 -4697 -9789 -14852 -6340 -19320 -22761 -20455 -18307 -11989 -4770 -5993 -2710 10230 -2224 -22278
21694 -22278 -15073 6584 7425 3036 -11047 -14588 -10021 153 8821 2309 -21199 -25929 -9587
21681 -9587 -13199 -24734 -8674 8198 11508 4744 4580 1770 -16222 -25484 -25239 -24273 -21611 -14890
21667 -14890 -13283 -11981 -23574 -36938 -36482 -24301 -14549 -2579 1652 3828 13598 -1229 -12583
21654 -12583 -23813 -22255 -30274 -27693 -35503 -38115 -30649 -22549 -15908 -11725 -8736 -10880 -24151 -17582
21640 -17582 -6241 4524 -11250 -21281 -16990 -11959 -6372 -826 193 4594 17291 21389 4515
21627 4515 12060 18136 16398 10944 -6404 -15821 -17609 -11740 -3414 -6810 -3811 7837 4960 2274
21613 2274 9445 10870 -11472 -18621 -20235 -7311 -487 15509 13121 7187 10353 -4328 -9566 2268
21599 2268 7675 7347 7059 19321 22812 11816 18933 27975 12300 -7049 -14190 -6241 16045 21041
21585 21041 7118 3573 -4393 -16568 -28639 -23245 -19857 -13338 -18430 -13259 9858 17717 15664
21572 15664 18067 9376 5393 10203 15943 3674 -5212 -253 3586 -9782 -16612 -17464 -39 2210
21558 2210 6948 -3874 -6781 -13323 -11789 -6315 -1608 -466 -10102 -27313 -26482 -22113 -23352 -12479
21544 -12479 -6194 -549 1968 -12102 -5484 -3779 1965 -4002 -5780 8221 5415 -18623 -29865
21531 -29865 -10366 4056 2925 -6775 -12898 -16422 -7859 13657 15470 4266 -6273 -3148 -4805
21518 -4805 255 -4111 -15505 4330 15155 8007 1733 -1822 -6097 3343 8055 3992 -4353 -10119
21504 -10119 -7043 -6508 -9680 -9004 934 5542 -1139 -1079 -313 3667 -12568 -23330 -13335 5963 5248
21489 5248 7295 619 -10454 -2988 1040 -1063 -6680 -485 758 3509 -1862 -6219 -15313 -26504
21475 -26504 -21892 -9186 9963 680 -15207 -49 7755 12888 10283 762 -5140 -2320 6783
21462 6783 11812 10642 3632 1097 -833 407 -7381 -18169 -7062 -1512 -15322 -13516 -7837 -4762
21448 -4762 -4902 -12259 -23020 -3689 -575 -2446 -10207 -16573 -21029 -19310 -6665 -6108 -10909 -8052
21434 -8052 -4466 -5544 -15089 -15102 -15612 -8855 -4149 6647 14025 12044 12798 17714 18207 2900 -13006
21419 -13006 -11268 -2060 629 -13185 -25609 -21353 -23713 -20503 -14321 -8823 -12686 -20726 -20910 -14240
21405 -14240 -4870 6304 19333 23612 15884 -3671 -3339 1477 7857 3991 9271 9161 10425 8934
21391 8934 6536 -10220 -11991 -16959 -17978 -13236 -5224 -1616 -6614 -1711 -1947 -16682 -40092 -27011
21377 -27011 -16816 -19557 -33233 -25295 -25446 -16453 -624 -6775 -16018 -14019 -10223 -4450 -3398 -9595
21363 -9595 -1822 -2409 -9954 -11797 -11799 -8343 -12211 -7777 -18656 -17243 -14722 -9564 11350 15838 6532
21348 6532 8174 27493 20453 8975 8992 -1910 -5095 -1200 -6750 -6851 -4283 -2528 4426 5290 9775
21333 9775 11058 1750 4247 654 -1714 -19178 -27784 -21922 -22776 -15219 -30510 -26752 -12792 -12587
21319 -12587 -3085 -3548 -8189 -10372 -682 1027 -71 -4195 -12653 -9008 11343 18902 12102 5852
21305 5852 10197 8400 13220 12404 2783 9022 5906 -2780 -7761 -14668 -13560 -11165 -2354 -9669 -7311
21290 -7311 3415 6192 1691 -7088 8788 5305 -6185 -12759 -4163 2511 -1118 -11893 8480
21277 8480 15182 24693 23436 7699 95 -7019 -4745 -7666 -12828 -6170 -5097 -4010 -4037 10422 12489
21262 12489 4411 1640 1865 11810 6038 1169 -6632 -9433 -15453 -12523 -1467 -2308 6415 -1724 6897
21247 6897 2983 -22446 -33855 -25087 -27002 -23568 -29416 -17925 -13434 -20601 -7053 3674 9097
21234 9097 8533 5095 13764 11599 -1075 244 13326 17473 5575 3942 -1618 1269 -3268 -11447
21220 -11447 -6934 -8142 -7543 1930 6778 8377 -2165 -923 -1459 11241 3534 2523 3484 4977 21486
21205 21486 27788 16407 10631 2857 8863 13103 3654 768 -7674 -13462 -17177 656 6406 -1530
21191 -1530 -3201 6749 10612 13408 4972 -12111 -5659 10097 7534 -7617 -7449 -10420 -4130 -2876
21177 -2876 -9187 -11788 5039 12326 21027 25965 23971 17685 22766 21503 28964 17677 6287 -1016
21163 -1016 -11146 -9310 -6248 -17956 -20848 -10153 -10402 -17361 -10791 -10583 -10121 6981 13183 15552
21149 15552 8240 7424 10686 15732 26969 28301 10316 -10019 -19974 -18785 -23111 -10545 -6858 -1444
21135 -1444 -3298 -9984 -4360 -7725 -19355 3508 11619 -10573 -8322 5399 20596 -1512 -11525
21122 -11525 -15209 -8305 7637 11814 5450 1226 -2509 -19116 -21250 3756 12911 11227 9954 -5044
21108 -5044 -14644 -14691 -20341 -29704 -28556 -13129 -4903 -8347 -12156 -14965 -28655 -28678 -29784 -28041 -14631
21093 -14631 -10954 -15165 -12324 12898 21551 1347 -10399 -6997 -4852 -13703 -5419 6436 9904
21080 9904 5604 5111 -1403 2469 -1730 -8732 -915 371 -3442 -4627 -2302 -14292 -5620 -4337 -12527
21065 -12527 -11220 -8323 -3333 4720 565 -4154 2638 4302 3916 14993 33002 6327 80 4027
21051 4027 12155 18758 12584 1413 9509 12520 -841 -14192 -24486 -22406 -26009 -20377 -8289
21038 -8289 -6050 -7949 -11303 -15727 -12721 -14431 -13153 -13976 -7891 6864 22190 15751 871 -8544
21024 -8544 4388 4898 1082 -2904 -9687 -18430 -10268 17494 16738 6815 -5899 -5931 -3599 -2914 -420
21009 -420 -456 3111 4567 446 -14540 -34522 -31765 -25872 -25135 -11885 3851 3051 -6828 -13658 -20703
20994 -20703 -23884 -29640 -34550 -35750 -23538 -1181 2763 3485 14841 5696 1139 -996 -541 -10202
20980 -10202 -7503 8600 14033 22770 28531 21502 -6939 -9259 11248 14220 11934 2301 6410 12208
20966 12208 8025 13001 12855 10203 19051 19693 8828 7791 -4105 -12397 -8225 -21304 -26282 -21367
20952 -21367 -5945 7084 -710 6462 12446 2388 -3152 7833 32222 29181 6519 -6679 -2442
20939 -2442 3116 15220 14206 13977 5363 -7677 -6269 1916 -5029 -9751 -3569 -8810 -10508 2692
20925 2692 1501 -6379 -7417 3764 6579 5092 -11504 -31838 -31431 -20796 -5877 7788 4281
20912 4281 3917 7991 6731 2397 -12547 -6110 -3057 -8848 1324 1792 -16425 -13903 -4124 -2245
20898 -2245 -12960 -7615 -2614 -15329 -16389 -5337 2002 11879 -6990 -29726 -24049 -13819 -7330
20885 -7330 -6864 -19827 -13399 -9406 -6843 -17588 -12557 -7986 -5197 -5513 -5929 -13434 -23570 -17937 -19873
20870 -19873 -18206 -27421 -27844 -14041 633 2341 -9744 -3580 -12236 -26853 -24054 -18995 -10313 -10752
20856 -10752 -2484 4864 577 1324 19800 18029 17080 9960 8817 2312 3023 10689 8368 12670 13665
20841 13665 10827 6153 -7991 -12077 -19845 -6536 507 4023 7731 11394 7933 9009 9444 8297
20827 8297 -485 -691 -7450 -407 -1686 -5817 5989 14350 -1060 -4939 -2753 6352 13086 8447
20813 8447 15840 24473 13374 8250 7963 -4315 3742 2214 -3752 2329 7768 17469 7447 -1269
20799 -1269 2675 4038 -7555 134 7215 -2596 -3844 -3663 -3788 -3173 -9239 -15959 -17042 -16342 -10820
20784 -10820 -7649 -6077 -2380 1974 9317 12781 -670 1141 15239 21809 7997 -6829 -10838
20771 -10838 -5520 -747 198 -7790 -7517 -3478 -10101 -6726 -10122 -28055 -26990 -20390 -11317 -11438 -6699
20756 -6699 -3902 -6723 2999 10399 7939 -4842 -14729 918 -11515 -9458 -15720 -24094 -16345 -14243
20742 -14243 -13879 -24967 -25643 -22250 -16242 -13859 -7690 4693 4901 -8757 -5952 -11066 5623 18395
20728 18395 11487 -1544 -9815 -10546 -786 2402 -4242 -8408 -28488 -15448 -7352 -5743 -2853 -6702
20714 -6702 -3066 -14941 -22637 -16524 -3042 -10051 -11931 -346 -2095 1698 7963 -77 6431 7141
20700 7141 14000 23438 10902 2443 -507 -1 11021 6125 9347 17622 8836 -14174 -16610 -10815
20686 -10815 -22008 -17438 -14585 -9596 -10275 -8927 -14441 -11267 -14282 -11211 -5336 -6961 -9509 -11025
20672 -11025 -7105 -3156 -3440 -9070 -10119 -15960 2436 9206 -11500 -7516 -10093 -12816 -16823 -16069
20658 -16069 -11862 -12317 -2203 508 -14059 -25031 -21353 -6041 -1156 -911 -4051 3862 1498 4994
20644 4994 3601 -5396 -9692 -4654 15963 14036 -3611 -1093 5084 7287 3367 -5593 -9949 3977
20630 3977 4491 -13974 -16673 -14530 -16202 -16080 1183 -492 -9868 -24716 -16937 -3967 914 -9206
20616 -9206 -14527 -10291 9409 13352 11154 -5819 -31283 -38248 -24830 -8443 -2450 -2179 -7049 -1492
20602 -1492 -2093 -6733 -15618 -13684 -1139 -4581 -11254 -11517 -15341 -24257 -16552 -15644 -22379 -12316 -6131
20587 -6131 -10643 -7120 -3936 -536 664 10919 19611 1825 -7566 -10446 -7971 -8298 -20445 -33418
20573 -33418 -30281 -15294 -22130 -20753 -9315 -14978 -20948 -20521 -11413 -10149 -10327 -5608 -2721 -10388
20559 -10388 -13883 -19438 -21811 -18040 6119 5823 6465 1223 2816 1222 -8394 -14510 -17358 -12906 -4615
20544 -4615 -3431 -14336 4963 13778 -2681 -1451 -2972 1039 3694 -11716 -13528 -9514 -15619 -13290
20530 -13290 -18259 -17548 -9935 -4062 -10564 4921 10207 5827 4143 -1625 -12812 -8714 -1967 -12955
20516 -12955 2585 16029 20456 17943 22584 30948 27648 16438 18298 11921 1771 -9030 -14708
20503 -14708 -5499 1119 -5112 -3365 8755 15663 9888 2131 6170 9430 216 -5623 -16460 -20695
20489 -20695 -21886 -26614 -15020 -7494 -8699 -20432 -13536 2016 4649 -1699 10481 7551 11163
20476 11163 13064 7216 -9476 -18729 -12802 2677 9416 13897 17411 19271 7140 -6940 -23568
20463 -23568 -19756 -17863 -6455 -4283 1613 1236 -1866 -3741 -9362 -20259 -23992 -16693 -11684 -13915
20449 -13915 -11515 6606 24036 8711 -2933 -813 6614 16584 26569 33712 28171 26995 17166
20436 17166 12525 3540 -4174 -15801 -7012 7087 2208 2912 -312 -15998 -13542 -10859 -4820 -9553
20422 -9553 -1451 -4333 -4292 -7565 -11045 -7136 -1123 8648 21170 29129 20219 -12109 -25500 -31076
20408 -31076 -32091 -24996 -11018 -12276 -24897 -38512 -43674 -38455 -22623 -21654 -11534 -9405 -10668
20395 -10668 -9486 -5121 -2771 -11570 -21257 -7775 4458 7898 7263 7066 8733 -1435 -12666 -16611
20381 -16611 -12247 -19343 -22375 -23359 -32778 -36449 -23319 -32095 -34302 -29046 -22511 -10575 -5556 -9961
20367 -9961 -21043 -23035 -26668 -29118 -32813 -33413 -26292 -19192 -8024 21 6192 11506 -35 -5233
20353 -5233 -6337 -10988 3247 20174 9276 -3706 2324 6937 -9642 -8238 -3093 -2203 2902 -12963
20339 -12963 -12145 -7768 -8525 -7848 1645 654 9746 16065 13431 12703 15562 29723 39239 30063 10287
20324 10287 1048 -5640 -10335 -8081 -13535 -17498 -25978 -11610 -8245 -9102 -7460 -2100 1760 416
20310 416 8852 -3636 -18298 -22137 -16638 2070 4593 -3111 -9262 -26618 -30027 -29353 -16338 -12465
20296 -12465 -17163 -24993 -25868 -26647 -20656 -17913 -13440 -2040 7411 11640 10850 -9222 -18919 -19911 -11923
20281 -11923 -13778 -12232 -8322 -8292 -5890 218 11583 9183 -1095 -8522 -1769 -1492 -1305 -2504 -6213
20266 -6213 925 3883 -2915 -901 370 5799 493 -11176 -21954 -17815 -9322 2000 6225 16199
20252 16199 1607 -3871 -13905 -10424 -6264 -9866 -8282 -11543 -11528 -827 -13478 -13118 -3103 3193
20238 3193 2259 2077 639 -5324 -20261 -17423 -11113 -12507 -9020 -11130 -23716 -23081 -12076 -5747 -25343
20223 -25343 -32210 -25527 -6493 1356 5519 -755 -13442 -14981 -7381 -4639 -6294 -5577 -4368 12360
20209 12360 5620 1149 -1676 -9081 -8932 -5244 -7142 -7858 -5334 -804 -8429 -15461 -15836 -7460 -2215
20194 -2215 -10010 -19455 -21562 -26234 -27146 -30104 -24228 -16767 -121 3870 -4063 -4830 -7098 4732 16475
20179 16475 15056 8269 -6833 -10424 -4870 7057 14171 5130 -9640 -18373 -11703 -4730 4615 1451
20165 1451 -15786 -19218 -18145 -16285 -17826 -21402 -33473 -28930 -21466 -18214 -22116 -15275 -1097 1407
20151 1407 2647 8038 8040 2873 438 -18334 -11808 -3515 2251 21324 22020 14376 3985 -9461 -6831
20136 -6831 -1520 482 13810 14848 1513 -8020 -6890 -3817 361 -17163 -27760 -18949 -10706 -5507
20122 -5507 -2935 -4559 410 -992 2097 -9809 -19033 -17049 -14372 -19596 -14192 -6315 6509 -5366
20108 -5366 -10005 1320 7208 -10137 -23659 -21270 -14719 -19389 -23708 -26394 -23426 -16536 -8890 -7034
20094 -7034 2230 -1199 -11189 -5537 13392 20718 12252 7052 9821 -2250 1080 -9770 -21951 -7055
20080 -7055 -11524 -23654 -21693 -16559 -9345 2938 8172 -10202 -17186 -14463 -5679 -92 7682 14772
20066 14772 19858 10540 1047 -11000 -630 9680 10958 -2478 -5039 -4809 -9044 -12885 -13807 -14761
20052 -14761 -8542 -3766 -17506 -24655 -16136 -10921 -4693 -16324 -22010 -3675 -7359 -6486 274 3975
20038 3975 1513 -10310 -1028 2530 -2817 -3801 10622 23748 14542 -3370 -21734 -35697 -30041
20025 -30041 -9153 4990 2121 -3706 -15820 -20300 -12801 975 15046 8647 4812 9950 14367
20012 14367 5657 -1047 -2900 786 10227 17914 18255 20254 18603 3896 -4711 -4395 -894 -1273 1928
19997 1928 -6189 -20647 -21243 -14518 -16467 -9360 -16968 -13721 -18679 -21531 -17859 -32498 -15680 -5160
19983 -5160 -2310 -2659 911 2686 -2509 -9091 -834 15901 12844 15955 32454 44261 36974 18337
19969 18337 3797 -10248 -1843 -1246 10959 4070 -8239 -5882 -10974 11658 12362 13245 14373 7191
19955 7191 -239 -3652 -9531 -8838 -3301 -5667 -8929 -13456 -16021 -2658 8839 12840 20320 27471
19941 27471 22010 3372 -6461 6095 16411 6488 3307 -2744 -13404 -21395 -14768 -8692 -8262 -10012
19927 -10012 -22587 -21444 -18500 -7557 -9963 -7594 -18975 -7989 8129 17943 5502 -1438 296
19914 296 5158 10790 13133 2112 -15025 -14890 -4396 16438 13972 -14760 -30905 -21712 -18094 -4662
19900 -4662 -11423 -11392 303 7435 10774 9113 5092 18483 24545 15296 11701 17691 10579 9873 10440
19885 10440 4710 1159 5062 -3104 -3147 -4857 3171 4014 -977 -8874 -4333 -1810 -6716 -4602 -7442
19870 -7442 -8511 -12579 -1311 12475 15526 5045 10730 13255 21680 997 1255 9345 -4790 -23332
19856 -23332 -20058 -4640 -10859 -8 1535 -12539 -13080 -15799 -5038 1604 -5701 -6684 -16437 -26713
19842 -26713 -35400 -29382 -14450 4238 4121 14156 3692 6529 346 -19994 -33093 -31286 -7810
19829 -7810 -2975 1911 14085 15524 -4093 -7613 3596 6710 10173 -3050 -688 -127 527 4303
19815 4303 -420 -6986 -14177 3388 -6130 -8925 -15188 -15830 -14523 -9395 -857 984 -4729 -3735 18840
19800 18840 29552 35178 40561 32741 19315 14449 25864 35520 24879 16249 17736 10926 7050
19787 7050 12268 10641 20761 21513 18037 10531 -670 -8304 -300 3544 -7329 5378 9786 10825
19773 10825 -1398 -88 -13037 -30560 -30200 -26601 -27494 -22033 -10860 -1858 -13639 -9177 -19903
19760 -19903 -27233 -26226 -11354 -4574 -5780 -6928 -8080 6647 5154 -1488 -116 5585 9076 1053
19746 1053 434 5141 -2471 -4052 -5502 6137 15831 5647 -851 -13048 -22898 -16107 -14614 -8401
19732 -8401 -8343 -10947 -15662 -2562 3477 -3974 -15796 -18242 -10088 -8797 -12955 -3453 -6478 -21078
19718 -21078 -19464 -5013 -1720 -2443 -3976 -10013 1239 3428 11882 9144 -11559 -25575 -34621 -26920
19704 -26920 -7053 5320 -6488 -13326 -21374 -22346 -15909 -9971 -15768 -4097 -6979 -13518 -10063 -15278
19690 -15278 -5455 5676 -217 -2127 -6589 -19013 -12931 1987 -7071 -16244 -17868 -1982 7888
19677 7888 994 -3558 -7824 -11659 -8901 -4088 6056 13908 7963 526 953 7559 487 -6958 2172
19662 2172 3629 8562 19830 23195 3921 -19295 -36329 -49817 -50539 -40968 -34769 -13723 -3058
19649 -3058 -2897 -7894 -11473 -15034 -12964 -14710 -6315 -998 -10273 -5560 -2521 -5564 -6596 -9343 -19189
19634 -19189 -17848 -10132 -9700 -6104 -5085 -19316 -23192 -20949 -13052 -9054 -11977 -28091 -29220 -36504
19620 -36504 -27342 -5784 -13016 -22211 -13434 -15843 -5471 -12131 -21024 -13877 -5243 -7294 -7141 -12492
19606 -12492 -14260 -11211 -10627 -13885 -2539 7039 902 -8559 -11624 -15739 192 11060 7400 3428
19592 3428 -3606 -5142 892 -2942 -2879 -20 -7339 -11401 -12783 1160 -3932 -20436 -5891 6720
19578 6720 7910 20417 8752 1114 -851 -2330 -2595 446 -2399 -8757 -3287 -5886 -4000 -92
19564 -92 -3549 -609 -5299 1387 -10414 -13595 -21194 -15052 -18343 -24515 -15755 -8748 -10549 -6492 -2962
19549 -2962 228 -13013 -17342 -8741 -12290 -17163 -20146 -9022 4071 8927 7469 -2461 -10044 -24554
19535 -24554 -25748 -25793 -12057 -654 -2833 -4878 -6764 -10946 -13490 -18867 -14344 -4956 -12131 -9796
19521 -9796 -11379 -11628 -13792 -14824 -17620 -18258 -11897 -8564 -3344 2388 3957 5512 -2474 -9683 -10202
19506 -10202 -6795 -4395 -3242 -3373 -8296 3008 12249 9385 3885 9407 17259 11863 3262 14547
19492 14547 14190 8492 3426 -10617 -8593 10334 10798 17007 17336 14771 6098 20263 25915 24588
19478 24588 25946 14994 18456 -2785 1192 10471 1863 -8872 -9393 -17554 -13695 -1817 -12214
19465 -12214 275 -4494 -8662 -5364 -12569 -12989 -2212 3824 5584 -3303 -9169 -14510 -19920 -4315
19451 -4315 -1568 -10870 -28569 -28335 -14532 -7474 -3876 -3992 -11081 -11481 -16132 -7507 858 4340 -2723
19436 -2723 -1637 -9566 -14448 -21578 -20370 1818 11751 -6592 -19608 -22431 -27241 -16671 -8510 -57
19422 -57 -5582 -13471 -23175 -23567 -16428 -14096 -18621 -28286 -24038 -16898 -15516 -15493 -13144 953 6960 649
19406 649 -2654 -6197 -2510 -26700 -45837 -33546 -21293 -4354 9898 13594 14146 3271 332
19393 332 -2917 -1001 7265 12086 -3851 -9145 -9744 -10604 -8169 -3499 -13817 -25560 -25090 -13353 -13477
19378 -13477 -4949 -11040 -13444 2872 12466 19970 22593 9232 -1912 -1447 5051 -1516 -13620 -13104
19364 -13104 -7877 -12931 -47 4487 -107 -14883 -20375 -14348 -4150 1932 11707 -2196 -1702 1875
19350 1875 -3041 1467 780 -1587 560 10692 19475 24918 19421 16127 -929 3272 5545 -550
19336 -550 -2913 -3721 -17692 -24278 -16756 -22064 -15737 -16688 -17113 -18749 -33240 -36095 -29540 -34618 -28499
19321 -28499 -24811 -25657 -28937 -17277 -16307 -21309 -12887 -4153 3229 13636 2458 -6430 -7374 -4049
19307 -4049 -2853 4426 1655 -7742 -11728 -4602 -4397 -6278 -27747 -38965 -21434 -22134 -18331 -6462
19293 -6462 -16040 -21821 -20001 -9160 3587 -1281 -15870 -24911 -18678 -24808 -27826 -18213 -11923 -10542
19279 -10542 -9722 -8689 -4627 -12422 -13863 -20650 -31043 -31233 -24309 -25578 -21940 -16373 -13178 -1483
19265 -1483 -7586 -11593 -9617 -7006 -17264 -7878 -3715 -1030 -8309 -10192 -11091 -18252 -22771 -26136 -24557
19250 -24557 -29563 -28590 -20765 -24879 -22259 -23854 -34950 -44978 -19713 -5035 -19544 -15279 -8317
19237 -8317 -9275 -8044 -13827 -8492 -306 -4635 -8550 -6448 6951 -3651 -28213 -31109 -9056 -5266
19223 -5266 -7290 -8429 -8736 -8071 -21599 -27603 -11758 -3418 -2593 -11970 -11489 -11081 -20055 -19838 -13415 -8973
19207 -8973 -6718 -23824 -37066 -19696 -572 310 -18194 -25140 -24112 -19628 -16568 -11954 -5487 -17498
19193 -17498 -13842 -6898 -9500 -6158 4329 6928 -7898 -11651 -14703 -24058 -16794 1475 -1240 -8244
19179 -8244 1486 5692 -8214 -17339 -16176 -15319 -9286 -13860 -14233 -15765 -16512 -8692 2645 2889 -15350
19164 -15350 -18248 -19849 -21674 -14940 -16377 -20928 -19207 -20423 -20989 -27231 -30395 -14746 1429 -3156
19150 -3156 -7167 -7080 -2607 -6262 -8896 -824 -11874 -7522 2837 11708 24001 16999 8238 15241
19136 15241 15654 7953 2367 3869 1015 -442 6106 2146 1933 2913 701 -1489 -19582 -13266 -9140
19121 -9140 -443 15718 4568 -6621 -3709 6016 3319 -7172 -647 456 5567 -9227 -13482
19108 -13482 -23076 -18203 -21977 -18692 -18923 -12543 -3114 -3503 -9272 -5293 -6990 1453 -11134 -10417 5266
19093 5266 -3039 -10797 -11050 -3695 -424 -490 -4214 -7575 -15175 -6207 24893 29767 8596 -12986 -21753
19078 -21753 -13641 -1603 10515 6051 762 -6005 -11366 -12043 -17565 -6371 -13799 -7133 -4624 -14581
19064 -14581 -15644 -23744 -36859 -31881 -19300 -25820 -28912 -33674 -35382 -20955 -3516 11042 24202
19051 24202 19473 20585 18706 8708 -6119 -11395 -7018 -6121 -3098 -4004 -4229 2175 -4634 -4526 -19505
19036 -19505 -24826 -3241 -9851 -2194 1694 417 -9635 -25283 -32594 -48525 -44653 -14835 -11364
19023 -11364 -20832 -26247 -17002 -10592 -9842 -29480 -45398 -40411 -34713 -35492 -33960 -27977 -21052 -8385
19009 -8385 5173 4527 8647 19318 24183 14089 951 -6367 -3712 -4482 -3789 -12902 -21687 -17123
18995 -17123 -2024 3840 1340 -9020 -12497 -15659 -22482 -24971 -21341 -7072 9529 -2946 -20118
18982 -20118 -30549 -21874 -22694 -32603 -17327 2240 11239 12500 -2833 -10721 -19315 -11230 -8849 -10586
18968 -10586 -9777 -13995 10810 23575 13645 -5686 -9582 -16961 -22110 -30521 -28060 -18466 -5967 -8508
18954 -8508 -15814 -18622 -24476 -26244 -18864 -14486 -16969 -19771 -4883 -9749 -12994 -12776 -6194 1963 -3555
18939 -3555 -7238 2615 7297 1620 118 670 -4856 -8883 -4927 -3737 4174 1359 -7838 -20413 -16217
18924 -16217 -3601 -9413 -30628 -34490 -18315 -8449 -10024 -5893 -8874 -14109 -12217 -8765 -11665 -29449
18910 -29449 -26862 -23675 -17345 -9107 4930 12332 19953 19813 24098 27091 16089 15995 15441 -3480 -9380
18895 -9380 -18217 -6790 239 -3776 -8520 -27090 -19987 -8058 1873 5104 -7172 -18369 -14804
18882 -14804 6820 22782 2789 -2619 -17284 -13560 -1333 -358 -10269 -15970 360 -3463 -16749
18869 -16749 -27495 -16747 -13351 -13890 -14452 -14647 -24558 -31095 -20494 -14859 -5659 -11360 -6772 -1443
18855 -1443 9193 -1108 919 2951 -5487 -10787 -26369 -28758 -16408 -6287 -8225 -6744 -1177
18842 -1177 4982 10986 10632 3979 739 -23048 -35062 -24917 -18000 -14712 -14993 -20352 -1844 2489
18828 2489 2620 768 2867 -4275 -7846 -8978 -13718 -9010 -10864 -11663 -11830 -2520 -6468 -23284 -21324
18813 -21324 -11297 -9357 -8355 -7930 -19897 -31488 -28149 -27312 -20307 -6474 -11278 -17438 -15875 -4248
18799 -4248 -2424 -11862 -22600 -20874 954 -600 -1568 -2650 -2102 -6929 -5853 -18419 -22546 -19198
18785 -19198 -21421 -12575 -11990 -15464 -21723 -23515 -8488 -9800 -11919 -11403 -1076 -4315 -20397 -22397
18771 -22397 -14917 -8999 -13709 -17197 -24843 -14385 -1971 6147 8153 -7439 -4437 -3339 -17646
18758 -17646 -21855 -14199 -13358 -7121 -2106 159 3213 -3418 -9440 -17425 -18451 -19449 -27395 -24524 -28682
18743 -28682 -19413 -10360 -1702 14584 4183 -2320 957 4169 1777 1060 17117 22191 10889 -1781
18729 -1781 -16271 -29478 -38714 -48104 -53837 -38447 -29456 -23090 -15015 -3451 -3760 -895 5401 2151
18715 2151 6849 3072 -4027 -17571 -18997 -8034 -15575 -17990 1686 4759 -2498 -4990 6120 5167
18701 5167 -6728 -15813 -14188 -13466 -7283 2806 -340 11186 17164 14322 16738 13537 6461 1184
18687 1184 9188 12199 11348 -4617 -14375 -11377 -14423 5987 17311 24628 26298 21332 1220 -12105
18673 -12105 -10604 -20757 -31440 -26840 -20927 -12743 -6890 -4262 -4118 3025 5374 1403 5411 -3066
18659 -3066 -4871 -7819 -4361 -1652 10581 14855 -3133 -4002 -2790 -7922 -16369 -4551 14795 19348
18645 19348 11665 19621 18828 17188 4561 -626 -1751 -6431 -1703 -8449 2625 1477 -11860 -24636
18631 -24636 -26849 -17346 -9066 -7460 -4359 -6863 -7542 -20307 -25226 -17518 -4973 3623 4079 12661
18617 12661 19329 21931 14277 5873 -3464 -3616 -6284 -17586 -16063 -17854 -17339 -21861 -22352 -4602 -2602
18602 -2602 -9459 -4040 -3469 -6286 1847 1905 -2172 2903 -2923 -6725 1634 11049 -2455 -14444 -11659
18587 -11659 -23741 -27335 -25127 -24091 -13999 -14895 -31957 -25574 -11766 -5180 -11937 -18669 -30358
18574 -30358 -34166 -35999 -32898 -20486 -17570 -14425 -20880 -18430 -15262 -15524 -15844 -7137 -10527 -16602 -11838
18559 -11838 757 5238 -1336 3256 1805 -10792 -8002 -7161 -10816 -5567 4238 9939 9187 -5923
18545 -5923 -8166 -21874 -34079 -46248 -42774 -25835 -31793 -31583 -10949 7229 14610 7101 10827
18532 10827 -2535 -13822 1084 22783 17159 3344 -2337 -11118 -19272 -9390 -42 -1168 4246
18519 4246 5375 379 -2445 1394 8426 2469 -5852 -1112 3325 -2893 -6443 -6023 -2281 -3974 -16028
18504 -16028 -5653 -2059 5901 10002 9480 10576 11646 4664 -3480 1594 16376 26086 9397 8190
18490 8190 -179 -5432 -8093 -15674 -27598 -25094 -7652 5780 -547 7519 9644 897 1243 -7063
18476 -7063 -4050 -2251 3184 308 -2207 -11382 -3741 9068 19071 6321 -11697 -16613 -12880 -11105
18462 -11105 -14881 -9423 -4541 -7911 -1949 -6715 2409 9501 12738 11801 85 7691 5389 -2539
18448 -2539 1607 9158 -2744 -6327 -6118 3279 4188 -3772 -3180 1677 -4427 -11388 -17698 -11068 -3681
18433 -3681 -5225 -22619 -27404 -21463 -18367 -18062 -11748 -3794 -18975 -5162 -7387 -11697 -9306 -1762
18419 -1762 -9746 -22385 -34848 -24735 -9760 643 2960 -7445 -6356 -13571 -26810 -19066 -10804
18406 -10804 -3173 1464 -354 -10536 4462 18071 16426 6613 -3862 -12082 -11308 -6705 -6851 -9812
18392 -9812 -2866 -6780 4178 2009 -9916 -12190 4193 13078 4014 -3319 -5570 -8037 -5325 -4588
18378 -4588 -4840 1685 -13004 -25043 -17067 628 9461 10904 -1487 -18970 -24320 -10408 -14718
18365 -14718 -21893 -32155 -32404 -18910 -23006 -18889 14333 12407 6351 -1303 7240 -1948 -22874 -21998
18351 -21998 1268 17244 8839 9924 16358 7541 7632 6734 -4174 -5615 -20230 -17580 843 -3394
18337 -3394 -12290 -10464 -9731 -11147 -2619 1597 2649 -470 -651 140 7681 7858 -12241 -7899 1730
18322 1730 5916 -2262 -6830 -8049 -13564 -17473 -5311 -3356 -8144 -18127 -18393 -6884 -908 657
18308 657 -8928 -6232 -3825 -3362 -714 2362 10041 13647 546 -7293 1005 10916 17609 2468 2557
18293 2557 -6213 -6681 -10656 -25343 -18126 -20279 -38917 -39311 -34407 -28792 -7861 1706 -941 469
18279 469 3007 2992 -6501 -9329 -10251 -20211 -24762 -22092 -23587 -26320 -15641 7558 12246 -329 -5461
18264 -5461 -2745 -8659 993 11875 14492 8891 4705 -3557 -6503 4006 20578 13757 -7649 -8372
18250 -8372 2655 -11060 -21201 -15492 -2990 -1275 -5364 -9393 -11783 -21763 -18309 -16054 -20661 -16499
18236 -16499 -6841 -3768 -7006 -9015 -7775 3067 -4372 6633 4630 -6857 -3030 2438 -2832 -8773
18222 -8773 -454 3637 4537 19899 22922 10696 6332 6206 2754 -4864 -10143 -15525 -6233 -13641 -6453
18207 -6453 1918 6025 -6584 -5490 -5996 -16356 -2760 8634 8571 2067 435 979 3916 10108 3184
18192 3184 -3593 -7034 -4309 -1209 4040 10404 -2332 -9051 -3770 -14140 -25245 -24370 -13007 -8835
18178 -8835 -8914 -13785 -14554 -31029 -36385 -33489 -21483 -18031 -8159 10654 15639 -3306 -4999 -17234
18164 -17234 -17258 -11538 -11726 2081 21958 2325 -17517 -15802 -10185 -228 -555 87 -6776 -11394 -14117
18149 -14117 -6783 -5448 -5881 -5584 3551 2413 -11504 -20064 -3991 -4133 2022 4148 21112 13133
18135 13133 -3350 545 1732 -1087 -6745 -11404 -7591 -5509 -2145 8659 15687 21176 9714 -3847
18121 -3847 -547 16142 17014 4289 8829 9873 5149 -195 -2556 929 9366 5301 -3259 -11420
18107 -11420 -10875 8958 13220 5881 1801 -3362 -10113 -17296 -13754 -6969 -7491 -13527 -22964 -23800 -13411
18092 -13411 -20969 -28595 -29931 -31878 -21210 -18152 -24691 -24577 -21063 -7980 101 -1186 -6611 -8812
18078 -8812 -6492 -13154 -10193 -3529 -7329 749 9413 2661 -1810 -10769 -15448 -22375 -13161 9582
18064 9582 3276 10129 26967 14252 9985 16797 10898 2449 -461 -1098 -9235 -9084 1411 -410
18050 -410 406 -14994 -30858 -31962 -18003 53 1230 -11138 2279 17652 16033 864 -19261
18037 -19261 -13547 -13882 -11212 -16845 -19487 -13919 -11122 -9098 -12620 -12796 -9825 -14593 -12435 -9957 -14742
18022 -14742 -29282 -28289 -19829 288 1330 11545 13418 2809 -3195 -2171 -1504 -3484 -3823 -8042
18008 -8042 3949 2350 8269 23020 30297 24721 23634 13815 9094 1339 -15620 -18341 -18440 -6340
17994 -6340 4201 1012 6206 -4611 -2575 -2744 -6304 9110 -3235 -26828 -20507 -13788 -21996 -9927
17980 -9927 3660 3902 15528 7406 6128 3805 -8690 -15188 -13607 -11837 -11446 -10672 -11607 -8358 -14492
17965 -14492 -25238 -21590 -11696 -12546 -1151 3754 -8076 -18179 -13942 -13213 -14153 -8184 6569 -2775
17951 -2775 -6492 -3802 -8605 -5664 -11039 8392 25407 4750 -6403 -1393 -11565 -3418 6104
17938 6104 15542 10685 14126 19670 27211 24862 16705 18961 14702 9885 15459 9845 9423 13974 11457
17923 11457 14105 13642 873 -1836 -742 -9430 -8297 -3755 -2229 1087 3634 4434 4745 -5149 -14036
17908 -14036 4479 9862 4372 3095 -8201 -15116 -8773 -3821 -1670 -7046 -4822 -5311 -4899 -21102
17894 -21102 -22370 -13256 -10215 -10410 -24434 -27546 -28974 -28058 -13612 -8770 -12844 -14835 -14794 -6002 6083
17879 6083 16144 8069 -2443 -1370 10801 20305 6296 -5923 -21201 -19620 -9003 6247 5473
17866 5473 5461 10545 4977 -995 -10275 -21210 -19722 -13459 -281 11543 25967 18808 12220 10416
17852 10416 2251 5650 17603 14785 -6261 -13958 -10898 -11888 -13842 -15130 -18440 -16352 -5015 -10209
17838 -10209 -11124 -11940 49 3198 -2125 -4 -5801 -6395 -11831 -6722 4793 8144 -1745 -8459 -1108
17823 -1108 -9223 3663 5222 -3013 -14754 -18895 -21992 -22136 -14617 -24877 -29463 -19654 486 -3242
17809 -3242 -38 5021 7692 6862 17205 18092 -935 -11746 -15291 -36612 -39388 -25409 -12847 -5113
17795 -5113 2564 323 -1910 -4558 -9234 -19261 -13943 -2912 -5849 -8782 -7482 -18496 -14470 -1717
17781 -1717 1978 5356 23261 19777 -3129 -1236 9271 5741 4041 10100 17398 2118 -13012
17768 -13012 -15572 -11995 -1731 -3261 -12706 -13728 6398 11646 11228 744 -17 -9977 -10665 -7046
17754 -7046 -7933 -17128 -12453 -12649 -12206 -24616 -23079 -3740 1780 -14214 -6848 2564 2416 -1774 -12564
17739 -12564 -15057 -12686 -1991 -16112 -21998 -16720 -12833 -20293 -13912 -8608 -10091 -7268 -13905 -14063
17725 -14063 -12445 -9939 -10876 -29486 -22961 -12178 -8361 -643 6084 -4477 4509 -1232 -7767 -18179
17711 -18179 -23103 -14087 -17530 -17332 -11832 -5197 -958 17933 11105 -9051 -901 16973 7628 -1853
17697 -1853 -1054 1099 6811 3573 -5741 -5904 -11299 -20978 -18688 -11268 -13517 8347 23014 15259 904
17682 904 -2714 2871 14191 5540 2660 -1572 -15869 -24164 -28106 -25487 -27225 -14846 -8864 -21790
17668 -21790 -32374 -27932 -16058 -11189 -21186 -20160 -22414 -21671 -24225 -21698 -15789 -15449 -15165 -3910
17654 -3910 15518 21145 17085 23826 35433 41527 31838 33331 26901 17819 22970 17913 566 -14710
17640 -14710 -13723 -20397 -18832 -8662 -16952 -25259 -34409 -21962 -14370 -13355 -1369 -6377 1293 11025
17626 11025 14547 2309 4342 16305 12125 480 7582 10023 4669 5010 14780 24910 34695 27518
17612 27518 19823 23417 38838 53401 83767 124424 174317 220693 286509 356960 423715 468903
17600 468903 474599 483217 476293 435758 364336 296604 239263 180774 124542 79489 67984 55735
17588 55735 39731 26693 13051 -3037 4491 16863 13110 10363 10239 6301 7782 5593 -670
17575 -670 -4616 2972 3254 5463 3787 -955 3882 15119 18337 11793 4171 10902 4697 9469 -3058
17560 -3058 -26862 -23551 -22488 -7809 5518 1935 2975 10827 10166 8304 5317 8815 3003 -7934
17546 -7934 -6306 9257 9540 4823 -9823 -21228 -14973 -8488 -17509 -15432 -15677 -21786 -21428 -11418
17532 -11418 -6567 -621 -2556 -8695 -1826 11330 26964 25667 25572 6423 -4541 6942 507 -5636
17518 -5636 -458 3846 7938 1025 -2252 1831 7614 17984 9147 14432 26367 32293 25017 8032
17504 8032 1304 -4268 -12963 151 8234 5474 -17962 -33539 -36139 -30551 -11863 -12785 -27987 -35459
17490 -35459 -27211 -14299 -12253 -14301 -14012 -9824 -16335 -18601 -2434 1391 -7525 -20075 -10913 -8989
17476 -8989 1908 7685 7389 -3562 -14394 -7233 3430 9450 3839 9542 21963 17517 11033 7401
17462 7401 1889 -8054 -2833 3792 6144 3897 4970 -11086 -14752 -21321 -6137 -44 -3329 -9988
17448 -9988 -5250 966 4786 6623 -2282 -9918 -25478 -39946 -41182 -32644 -21438 -17599 -19412 -24840
17434 -24840 -32557 -26086 -17575 -3065 4131 -3321 -930 -3152 3646 5778 -2706 -15374 -27775 -29739
17420 -29739 -20919 -19924 -22907 -11916 -2796 -13719 -11088 5737 892 -6821 -9079 -11820 -26144 -21679
17406 -21679 -12093 -13031 -25038 -16886 -7113 -10469 -12818 -6010 -1125 -1717 3617 -13681 -46079 -39356
17392 -39356 -18480 -7604 -843 -5664 -12258 -12523 -11847 -13581 -15192 -20979 -12243 -877 -2772 -7932
17378 -7932 2942 18433 11870 1148 4231 -6228 -15309 -22416 -19831 -14093 -21607 -9364 9966
17365 9966 3081 3995 1360 -3520 -3698 73 6101 -7108 -2238 14428 11413 -6617 -19534 -21240
17351 -21240 -24085 -24390 -17006 -10572 -313 4079 -14248 -21718 -15798 -12440 -9437 2973 -4453 4903
17337 4903 15428 15098 11312 1257 -5966 -11369 -13408 4366 9214 -835 -9668 -14460 -10340 4452
17323 4452 1777 -16089 -30116 -29576 -20769 -15937 -17445 -10939 180 7184 4731 6090 -5172 -8549
17309 -8549 1490 19860 22602 11464 16368 28670 46767 48598 39674 35747 37756 40144 49432
17296 49432 60843 56482 44381 38462 35373 34529 38055 40921 37033 30290 39158 33818 32573 28560
17282 28560 20686 1801 -11098 676 3444 -447 2170 14608 15742 -4905 -14674 -381 8228
17269 8228 -2219 -5487 2787 1232 1782 11770 9729 402 -13226 -20734 -18437 -11074 -2967 6579
17255 6579 17754 13487 18196 14579 873 -4766 7613 6998 1807 -3496 -3575 -1636 1962 -2930 -2235
17240 -2235 -6378 -21209 -11154 2548 6608 11083 16113 4276 5552 23614 19906 5806 -4029
17227 -4029 -8041 1011 5577 -553 -8840 -4040 5180 6779 1437 -787 17927 21886 13643 18854
17213 18854 34756 36795 34094 38080 42256 29062 12112 1503 -6846 2675 -2723 -3367 7950
17200 7950 24931 28478 18077 18586 3537 4286 3023 -272 6419 11002 1391 -5151 -1521 -1480 -1149
17185 -1149 -1109 3016 3388 -9564 -10257 16959 19868 30118 49092 58928 59506 46428 45131 62191
17171 62191 73528 89783 100187 92929 58914 29307 13402 20069 22668 11780 3889 8490 -4460
17158 -4460 -4851 -6362 -18392 -13516 -10713 -5528 8998 28889 34221 29974 36268 21251 11676 16183
17144 16183 23127 36773 36491 41990 43293 51311 50560 43202 36810 22823 14630 15040 20222 21414 26775
17129 26775 22265 24973 16211 9776 30883 33775 15087 20251 19767 23314 25734 29919 17629 -170
17115 -170 3966 17313 27378 37747 47428 62548 67847 85227 83889 82922 92048 88433 84729 84080
17101 84080 95084 123696 131981 136186 144701 160123 176052 179981 180583 182559 191334 198564 221721
17088 221721 241477 243957 249704 260642 266441 266574 290333 316704 362058 391744 421691 450469
17076 450469 493256 532269 580365 638093 728235 833934 954987 1076240 1208956 1382461
17066 1382461 1565440 1686109 1783752 1953427 2155874 2304303 2473910 2730831 3015576 3380152
17056 3380152 3865081 4377830 5027768 6021112 7430286 9443940 12500491 17119717 23992266
17047 23992266 33705432 45580316 58454997 74330681 93342976 99022575 92984935
17040 92984935 94246518 98112695 85410920 66668920 51995523 39817969 29186898
17033 29186898 20937572 15203232 11351606 8779739 7045075 5875165 5089363 4486377
17025 4486377 3941912 3537049 3283366 3015864 2721537 2466321 2262253 2130430 2008819
17016 2008819 1823352 1690857 1611446 1482356 1308465 1160638 1036006 929324 850122 782997
17006 782997 716914 663770 630785 596187 558122 533460 518987 491791 457724 437120 435133 428223
16994 428223 414913 402706 383303 358462 341307 328051 334591 327037 305498 288956 286113 280447
16982 280447 275604 264684 255734 250982 251053 245595 241079 231256 237599 233389 228835 232232 228667 223898
16968 223898 230513 221574 212679 205185 196415 198838 192179 184988 184920 173981 171907 172693 174620 172877 168976
16953 168976 160007 161365 170109 160521 142244 114808 117854 120201 113347 115817 130175 127821 127232 133673
16939 133673 137163 118052 118640 120550 119201 129692 135482 122263 127949 126024 120983 104068 101367
16926 101367 114089 124697 127845 124934 132027 140791 154800 154074 140617 141999 142824 141732 140249 134774
16912 134774 126120 124510 106842 101663 89534 67341 51419 63514 66327 62139 62083 70035 80273
16899 80273 59193 46578 47338 54492 50782 56253 74659 75805 67312 67305 59652 49918 61450 68157
16885 68157 55571 26469 20552 19919 5743 16360 41607 65706 67823 52466 40611 41067 49326
16872 49326 53701 43267 33591 35172 30055 23314 28973 31759 40197 36762 38271 50727 45206 29102
16858 29102 29221 26910 22369 27347 23670 18642 8163 14485 10025 8064 12181 13544 18536 23997
16844 23997 19536 33604 33708 29563 22508 28727 25923 23413 18501 6336 4773 19893 10914 12209
16830 12209 34129 30713 23287 27834 32119 50713 48975 38313 38937 43950 41572 41177 37975 42469
16816 42469 55779 49343 39757 42531 43565 42969 44472 36811 36257 23785 15070 19961 24071 30285
16802 30285 33963 24012 25973 25051 22517 23387 16586 7339 1527 12700 20818 18840 24225 21844 14696
16787 14696 17622 11716 -4231 5219 18308 20310 18384 25778 21351 11354 8152 20325 34011
16774 34011 40632 27157 28300 16215 12684 21027 24084 20031 18057 12381 17727 23699 27030 26500
16760 26500 19889 21479 16667 16343 20517 21670 20110 22181 24835 14052 13674 7565 14836 19275 17489
16745 17489 17472 14807 14989 13628 16841 18722 20773 16112 13757 14963 22168 39942 53268 44268 32399
16730 32399 35901 30726 30538 25005 28663 24445 28851 41405 36811 23284 29573 37517 34916 18960
16716 18960 14837 13433 13605 17811 18517 18597 15062 17721 21387 25660 33151 30824 29605 24589 28626
16701 28626 16822 6636 -3794 -5549 -2377 -4465 -4775 -18409 -22278 909 3061 8042 7322 1165
16687 1165 10784 13640 16133 26346 36744 32579 24855 13777 1688 2444 6064 -9153 -9903 2205
16673 2205 9992 14109 12397 9498 12250 22143 30970 27470 21865 37456 35066 20605 11228 11237 2053
16658 2053 4845 2309 5489 -816 -9726 5143 15922 9902 9293 7939 14178 14468 7030 -2649 2931
16643 2931 -2776 -4259 6770 14585 15295 16847 20437 28064 34696 29053 21434 15050 4173 3737 7288
16628 7288 13890 16615 13566 5908 23057 36385 39055 23723 15345 9673 4064 8518 3975 16053
16614 16053 15074 20173 21982 24095 17284 17249 12622 10417 18774 28906 14599 -2062 3984 2814
16600 2814 15552 29793 25534 14392 7819 11023 14156 24614 22219 24518 32355 18394 7215
16587 7215 -563 -12960 -8710 -9516 -17752 -16180 -28683 -31647 -27025 -12615 -14744 -7286 -15745 -30604
16573 -30604 -26291 -17505 -11241 -4140 -2015 -13096 -11567 -5373 5005 3556 2741 2701 -3400 -259 9777
16558 9777 9343 10498 -807 -6386 11304 14234 15704 10366 9511 3856 -10205 -12350 -11064 -13237
16544 -13237 -15214 7392 20861 15811 4173 -348 -6441 -7429 -12331 -4194 -910 -2080 3268 2214
16530 2214 -7008 -13928 -18264 -18575 -13767 -2906 2881 541 -5535 -8869 11296 23295 16359 4591
16516 4591 726 -5685 -6125 -14674 -2738 3949 -203 2244 14641 4988 13734 14770 7436 3033
16502 3033 -2567 6834 18401 14354 17534 27740 29813 28765 28823 6162 -1109 5866 25220 30238
16488 30238 36388 46478 65840 77551 103552 157611 205381 250503 309072 376659 437096 453871
16476 453871 447683 445127 434152 398946 335056 261883 204091 150949 112898 93241 76580 54887
16464 54887 40141 37176 31407 26951 32694 32988 38230 35908 25298 19055 17744 23604 17877 7746
16450 7746 1237 -8442 2366 14735 18381 -5112 -15576 -10428 -2909 -4247 -6222 4538 23493
16437 23493 24213 19695 6122 -5029 -6278 1955 711 1928 7419 16840 13448 1649 -15242 -22888
16423 -22888 -10463 5338 14171 18153 16694 9385 5832 9847 529 -3702 5266 -1215 -2688 -5342
16409 -5342 446 3807 1378 -3373 -1314 -10291 -20213 -19515 -17284 -5027 6519 9918 -8326 -13372
16395 -13372 3239 17088 23307 12975 3656 2204 8487 3981 9160 8077 -1370 7950 10831 7999
16381 7999 -2976 -4778 -2251 1989 5710 2456 -756 -9640 4358 8755 4742 -3849 -16866 -13621
16367 -13621 -8189 -2976 -7178 3769 95 -1967 -12800 -21926 -18302 299 14476 4618 -2497
16354 -2497 6896 8449 13304 8983 3325 4652 7565 17538 12756 7546 7865 4979 10539 21597 24473
16339 24473 23415 12951 -1083 5613 11964 19121 12307 6931 -1418 -4094 7194 2365 330 9891
16325 9891 18082 21813 18248 19092 22040 24692 35422 20389 21075 14315 6676 6936 6750 -1038 9385
16310 9385 -283 -1589 -5500 -1901 6053 -1182 1266 10876 19625 23288 21420 27802 21273 9146
16296 9146 -6439 -9458 -5221 -7588 -5102 -3777 -1348 -2068 -320 8235 -2814 -6503 5123 12097
16282 12097 2092 2761 17330 25868 14262 11084 12098 -4577 10143 16079 13696 7203 -4338
16269 -4338 -15356 -1766 -9364 -3176 -7159 911 3096 17365 27221 22812 25832 15536 -1931
16256 -1931 -6051 949 9093 3426 2509 11360 18103 28336 20876 15333 6838 23755 24816 20892
16242 20892 24481 16629 25250 27769 2840 -6247 -1371 8000 6545 5157 14474 6177 -10747 2814
16228 2814 13326 14277 16753 6203 8744 19156 10669 -1231 2494 12839 7685 -5470 -2580
16215 -2580 6695 24893 25746 12912 9652 1952 -5640 125 14298 20974 12772 13317 14009 21630 22955
16200 22955 10147 -3652 -2802 -3409 3673 14804 14053 20512 31645 23271 11533 -1382 9601
16187 9601 13135 21172 24071 25207 21990 6484 13202 2226 -1884 -619 5435 -3494 -9973 -2064
16173 -2064 6631 3427 -4046 -6482 403 -5880 -21750 -12356 3821 6815 9707 15124 6489 1502
16159 1502 -10793 -21420 -13139 -4439 5279 3422 1048 1877 3247 13713 17796 9264 -1749 -8054
16145 -8054 -11265 2439 9892 7024 -9585 -14824 -7345 -2434 -9620 -1006 -6160 -3336 3489 991
16131 991 -10015 188 2620 -5590 5418 21947 22073 7223 3098 -2900 -12716 -1607 -4231 -9401
16117 -9401 2493 290 -11693 -2280 6204 -2064 -1086 -499 -16424 -21244 -11068 -8197 -8921 -16414
16103 -16414 -17331 -24801 -28472 -16423 4244 10581 -5361 -17738 -4954 -931 -10736 -11577 -4816 -5021
16089 -5021 -5220 3519 -2608 -578 -16997 -11154 -4833 -7209 -8673 -1104 -1023 3563 17674 12154 1479
16074 1479 -2812 -7669 2231 -830 -3903 -12408 -11991 -1496 3837 8836 511 -3711 -19182 -16908
16060 -16908 -7091 6552 16440 22171 20545 3428 -4955 -7600 898 34706 45019 25811 4577
16047 4577 5735 8191 8060 6638 8800 3913 -2426 -4782 -4316 1115 7002 11200 17431 20888 21608
16032 21608 16573 6956 -7109 -8736 -12204 -8382 -12114 -19801 -27373 -15511 -342 -3928 6498
16019 6498 -2934 -9551 13537 32327 33124 22807 9064 12296 8035 12069 22241 19044 12647 -1715
16005 -1715 -3206 2613 -5040 1052 11698 20711 17602 8929 23098 17274 -7811 -9122 -6964 -6694
15991 -6694 -11657 -17951 -3187 2785 1365 -2083 5318 5721 -4647 -6230 2388 1193 3295 7263
15977 7263 6611 13297 3773 -15234 -9553 -729 369 8701 29640 23645 4362 -940 -6546 5404
15963 5404 8902 9984 7481 -7092 8383 19165 4625 4741 -1816 -7093 -2192 3833 4333 -638
15949 -638 696 -1437 15236 23348 24529 17793 19406 14129 12226 1817 -1156 -1738 6843 4654 1427
15934 1427 14144 7174 -1368 8075 10943 6811 12314 9723 8383 23908 26272 18640 7817 -4474
15920 -4474 -684 13625 23994 19222 22185 19087 16434 15025 5307 592 1866 -1468 11404 14633
15906 14633 15008 14624 12678 14222 15500 10641 10291 10853 26160 26646 22194 7778 -2805 -967 -2131
15891 -2131 -6474 -5271 7304 3225 3051 12930 15925 8972 11007 12427 -2463 1695 23607 23894
15877 23894 13412 15990 11829 20822 30572 38714 51004 49864 38635 6479 -3069 6640 14111
15864 14111 11934 17400 17989 10389 5551 5576 9506 6710 -2400 -14801 -10720 -5991 1341 16620 25607
15849 25607 19858 5398 -87 4320 -5730 -27693 -33814 -37493 -16612 -133 -1946 -2526 1811
15836 1811 -1495 -4299 13958 23573 30041 46173 62992 71614 59557 33387 18068 8538 8407
15823 8407 5648 -1781 11793 20244 18710 6041 1968 11301 11756 -416 -15747 -6770 5166 4562
15809 4562 -299 11396 429 -11461 -11365 -12826 -12203 1990 11009 22603 37189 36831 34420 32385
15795 32385 28681 37946 31047 16264 11532 11631 11843 18884 22549 21411 17550 17273 9853 -23 3088
15780 3088 11683 9132 18020 23987 14378 4634 12505 26769 37950 43473 45358 45010 34173 22680
15766 22680 19001 17500 21912 23691 15779 11189 10647 25555 36515 32208 26773 10942 5719 11159
15752 11159 13554 3625 8779 3365 6985 4737 6863 25878 32204 23638 20968 17528 8530 20694
15738 20694 24789 21082 24556 32499 22959 11713 1011 7480 6679 5190 -7112 1127 9913 -8855
15724 -8855 -941 6641 17176 30181 21126 8323 774 -1979 342 10539 21001 19338 14699
15711 14699 11230 14596 22876 21500 13036 5830 1084 7380 13347 8792 -648 2017 4541 -11324
15697 -11324 -8616 11021 14398 2068 -20618 -23712 -15315 -645 14841 16112 13356 21356 11447
15684 11447 7642 6991 12669 33174 28469 19487 11035 3287 2193 -3793 -5063 10124 13542 6458
15670 6458 -432 -1625 -7101 -11710 -9745 5541 22546 32646 23836 8618 8864 32 -7695 1033
15656 1033 -6216 5375 22055 28693 28947 26161 34513 41593 32829 32551 32485 36381 20177 23088 16156
15641 16156 1994 -5538 -232 4478 10547 10731 15787 1051 6004 5958 8961 17016 14016 4067 16952
15626 16952 23456 17495 34380 28468 23575 20894 20557 15635 20840 23997 23251 24910 34885 41942 42644
15611 42644 29345 23564 30693 35432 22013 3637 -10708 -10543 -12985 -9771 -10144 -9715 -12928 -13882
15597 -13882 -269 -653 -2473 -11329 -13656 1286 7185 626 -3294 -713 1784 8222 11226 -1103
15583 -1103 1379 -3691 -9121 -3402 -3198 11251 17480 25692 22604 14838 4286 -5624 17405 15236
15569 15236 12494 20763 19923 26925 32766 22262 14933 5476 7210 10807 4064 8963 18472 6175
15555 6175 -5730 2446 4127 4553 -2859 5957 1377 4135 5661 13793 8888 10740 -6174 -3547
15541 -3547 6122 3147 -752 8580 21237 25909 16445 12919 9688 8107 5094 5730 11413 13448 7826
15526 7826 -7832 -2040 -621 -201 581 10885 20891 20411 19128 2056 4397 12282 16152 18645
15512 18645 16285 20202 11322 7543 6986 13987 9353 8840 13679 6373 7581 11127 6854 34 4556
15497 4556 2979 -292 7336 -6004 -18182 -15407 1031 17382 14523 11237 11748 1047 -5839 4262
15483 4262 9055 2959 -3012 4287 -2907 -1713 -1508 -8984 454 16313 22480 28316 29349 18174
15469 18174 15498 17860 19165 9613 15773 16861 19615 24158 31454 17408 22171 31704 26190 19671
15455 19671 6466 -15187 -17293 -11707 9741 4519 -6668 -1069 8281 7286 3272 -5494 -11242 -3371
15441 -3371 11112 -256 -5248 7492 12423 1006 9007 19106 18235 7975 10886 -9401 -13346
15428 -13346 567 -870 -6116 -4629 4614 8459 5676 3398 12266 8500 13905 24302 27453 20840
15414 20840 10677 2671 -11306 -6706 4188 -724 -5746 -4063 -8728 -10127 -9178 -10490 -12721 -10590
15400 -10590 -12224 -9464 -6138 5798 6145 3874 1083 1592 -10008 -23941 -21086 -21892 -25798 -12681
15386 -12681 4151 12505 11093 11242 -670 -2844 5934 4431 3608 6125 8305 1213 -1998 -11533
15372 -11533 -2125 11322 5398 3602 -3272 -4363 -12366 -6249 2649 3297 -2721 10921 18333 7332
15358 7332 -6234 -3475 1379 21845 25600 20362 12477 24150 29437 30289 8120 -8657 -17137 -15513
15344 -15513 3772 19780 16011 5444 6465 18407 21838 19447 16506 10447 3203 1853 2294 13307
15330 13307 10715 13594 9586 8244 5311 5923 2486 5471 6918 -4497 14009 8794 -12636 -6668
15316 -6668 8385 13254 18007 14677 769 -3870 -8171 -19735 -14586 6857 21708 7505 -3376
15303 -3376 -23179 -29995 -24977 -4609 8398 16380 -2730 -8614 -4694 -5234 -5108 -6917 -5055 -12038
15289 -12038 -18470 -18361 2397 22699 39632 29843 10356 -6127 -13133 -10275 9551 2093 -4198
15276 -4198 -4992 -5662 11697 24425 36957 40078 21067 4475 6262 6838 14256 9292 6735 2159
15262 2159 7706 4566 6530 4778 467 -3002 -2108 972 16606 15918 -1923 -7858 -11233 -6822 -60
15247 -60 11136 11261 4910 -1315 -2114 -7269 -12488 -23967 -20512 -23028 -17667 -4897 -3536 -5405 6976
15232 6976 15488 6963 -728 -10339 -5216 888 7830 10338 8661 3915 -6889 -9457 -14444 -16751
15218 -16751 3179 9046 20753 21630 8219 -4321 -6056 -12984 -10998 -5726 -20719 -10096 -7097
15205 -7097 5365 2287 9020 26284 28024 18333 3320 -6359 9498 10859 7850 19654 18140
15192 18140 1626 -6818 -20338 -23382 -15756 -12346 -17717 -13965 -5910 -762 -1111 339 1624 3079
15178 3079 -11705 -17320 -11175 -7610 2672 -1825 -4793 -14617 -14298 -6407 4932 3782 4111 14818
15164 14818 17567 9021 17625 13925 19001 19060 10179 3120 14710 29985 35910 24650 15430 14509
15150 14509 10872 15196 7905 2338 -3483 -6901 1049 3395 1827 -1525 23237 33860 22928 17407
15136 17407 9663 7656 -9744 -29794 -16871 -7657 -13400 -23143 -16028 -14806 -22260 -5833 2029
15123 2029 -1047 -3064 -8012 -4107 9187 9800 2502 -4850 -11060 -2452 3580 -10204 6341 12081
15109 12081 4594 5018 1734 3670 2845 -1239 -383 7155 14438 7304 3064 12704 11824 12196 8461 -1474
15093 -1474 10880 13664 16147 13693 7749 1993 -2935 -4436 8941 5094 2330 -4654 -3538 7954
15079 7954 16032 7911 2824 3595 105 2353 -11 2250 5044 10617 12535 4135 8915 12013 11053
15064 11053 14085 5819 3281 10613 1900 5978 16522 2684 -10890 -8610 -12574 -27193 -21327
15051 -21327 -15556 -16848 -6946 -14381 -16773 -16297 -14459 -22241 -18346 -16403 -8697 -6680 -15867 -8247 3365
15036 3365 3812 5105 8644 -4674 -21975 -6595 -1783 -13850 -14464 -6434 6544 10259 9417 14822
15022 14822 12655 12989 6396 1336 -4325 -11839 -5757 -7233 -19128 -11211 2985 10153 2950 -4191
15008 -4191 -5231 -1516 -10743 -13668 -16307 -10962 -3102 -2298 -12613 -6771 -1768 -12746 -16639 -3182
14994 -3182 -3718 -8157 -12900 -14768 -13674 -11002 6236 7419 -1484 -7338 -11492 -16733 -17722 -20187 -8570
14979 -8570 -341 -871 12036 21389 28792 16162 3271 3928 -3250 -5062 -6365 -2610 -1475 -7806
14965 -7806 -8581 -5657 4449 3749 11086 32621 20559 -1973 -16516 -6697 2467 4621 -2153 -6340
14951 -6340 -5556 -12861 -11623 -4464 548 14309 36348 45194 33545 14274 -597 463 3201 -3167
14937 -3167 -672 7281 387 -8931 -10973 -10979 928 -3855 -17454 -30734 -32166 -13958 -11547 -13841
14923 -13841 -4748 6211 15147 14020 12702 -62 -5375 1237 -6664 -540 1234 5914 4195 -2265
14909 -2265 -3385 2551 -7373 -3490 -4123 -11150 -14221 -10120 -9028 5784 16010 7232 7463 18256
14895 18256 16805 19283 20936 17085 10912 5270 -2461 -14935 -17558 -16057 -18409 -23232 -28138 -20410
14881 -20410 -12506 -7561 -2282 -1401 -2504 -10849 -2425 9837 11021 9264 7187 7563 3280 -9883
14867 -9883 -12295 -22668 -28997 -17401 -4506 1890 5683 1572 13239 25380 30003 16264 7380
14854 7380 5704 9391 15780 21328 19991 19934 19263 8325 6740 3634 -8950 -15038 3212 7098 9274
14839 9274 12114 10666 1582 -4444 83 8340 7462 9552 10347 -2019 -2169 3041 7941 11051 13498
14824 13498 25217 19317 18563 7654 10264 10548 11719 -4831 -13678 -3650 10179 8126 6324 22320
14810 22320 26795 21842 10932 4727 9030 -5684 -6634 -21528 -24495 -20095 -17521 -9284 -13213 -10129
14796 -10129 -6676 -528 10675 15496 15349 4205 -6979 -27084 -28143 -12076 -12833 -17959 -11510 -9558
14782 -9558 -13408 -519 12589 8386 -8816 -31109 -34622 -16136 -8028 6824 19639 6906 -772
14769 -772 -1977 5494 10840 6790 6303 24278 23515 12546 -5965 -8672 -5709 -14537 -27818 -31280
14755 -31280 -23686 -9021 -10052 -13208 -11745 13060 18402 10958 7625 28963 32224 10489 -615
14742 -615 -11 8136 -2501 -12431 -11245 -6327 14326 14884 1339 -5993 -8186 -6379 -504 -7824 -20879
14727 -20879 -13004 6351 1405 -9809 -14417 -3278 10351 15076 15513 7976 -7334 -6218 13026
14714 13026 2186 3495 24898 19247 3614 15991 19964 -1305 -24727 -15975 -6207 12164 25272
14701 25272 7962 -2110 7772 3152 2529 -4793 -15689 -6645 -19878 -18454 -17498 -21198 -32586 -25145
14687 -25145 -16019 -2930 1106 1538 -9252 3752 10227 10782 4806 11506 27515 20860 11523 12400
14673 12400 16471 14566 -5198 -11524 -5322 -1978 -13653 -16248 -9898 -1929 -3872 838 3230 -6723
14659 -6723 -10459 -4712 -2189 -558 10070 15743 3349 -6486 -12299 -25825 -21096 -15584 -7515 10715
14645 10715 10281 8575 1687 2156 7901 1845 -2200 -8625 -17699 -22713 -22304 -12418 8873 15517 10846
14630 10846 9649 8590 -11968 -16680 -12852 -1997 13339 11437 8354 2941 10163 18112 12125 10942
14616 10942 6706 5517 6840 7010 -81 -3702 16679 15477 19128 17899 -2639 -2048 -6890 -4278
14602 -4278 -5623 -13442 -804 5232 13077 15026 6491 5502 -294 -1422 -2025 -11490 -13364 -8197 -10126
14587 -10126 -5021 -12950 -19175 -15279 -8456 -10455 -23989 -15144 34 983 -1934 -5889 -7158 -12848
14573 -12848 -5515 -9036 1350 -1931 -11084 3404 9699 121 3107 -6380 -14289 -16726 -24175 -26184
14559 -26184 -24442 -13841 507 6547 4742 -7346 -5041 -1300 -4831 -7285 2373 15796 19899
14546 19899 24063 16419 12573 5199 -11637 -20763 -15184 -4773 4763 7298 1083 11781 18808 15741
14532 15741 27774 20766 15516 6608 3952 7573 10781 16959 20773 15403 14832 24394 12995 -2070
14518 -2070 -10678 -7489 9850 11719 -877 -4461 -1942 -440 -3415 -6089 5014 9245 12793 25641
14504 25641 18948 10068 2540 8597 4852 10840 11533 17985 17311 16701 9680 -1055 -1043 4116 10218
14489 10218 13604 2973 3263 3029 -6915 -13367 -10929 -5708 -3192 -2306 -8814 -8614 -13319 -17495 -14070
14474 -14070 -16292 -18941 -17750 -9897 -6354 -9617 -6680 -19513 -23251 -13821 -20630 -16645 -13588 -19605
14460 -19605 -8232 -6512 -3720 -3930 -9769 -3906 -13230 -14192 -3948 -6176 -9308 -11933 -5796 8748
14446 8748 16884 14287 4587 9210 -3266 -5869 -6874 2885 275 -22096 -15196 -14125 -10171 -4989
14432 -4989 -6943 -2210 42 -3825 -7275 -4859 -9002 -11559 -7844 3617 7264 10245 6976 13180
14418 13180 -3229 -3623 -6585 -21035 -14108 -18631 -17015 -16250 -12240 1923 1230 2350 -2840 -9832
14404 -9832 -8246 -1179 -12380 -18797 -19695 -20565 -9088 -9407 -8412 -2648 1219 9888 23382 26587 21784
14389 21784 31841 24208 11703 7867 10246 7882 11793 23096 27168 26848 14806 -929 -9115
14376 -9115 -7306 -1707 -5031 -4016 460 -9623 -16244 2075 15238 16729 10467 -4990 -8712 -2469
14362 -2469 -7560 -20146 -12969 394 -349 -10456 -14556 -3201 6454 4410 5576 11151 5023 18110
14348 18110 25247 13581 16743 18834 20659 20356 25157 28792 20100 12271 19701 24492 13189 5656
14334 5656 5244 5346 2897 15346 18989 14018 15884 12732 8062 696 5485 15403 15220 12771 11229
14319 11229 23924 21763 19757 7978 5850 554 -7248 -4622 517 7794 12462 20375 12706 -4715
14305 -4715 -17465 -19326 -9217 3271 4129 13780 11193 3695 9656 10501 3924 -1996 3755 16459
14291 16459 8512 -2817 -107 12304 12367 5086 6740 2994 756 2007 1040 11779 13950 18578
14277 18578 21843 21282 7569 -2857 -367 1405 4577 7062 13587 17753 1493 -3874 -5418 -628
14263 -628 -5813 -11830 -19724 -22968 -7699 -13240 -13607 -8304 -1416 -7555 -5975 1424 14158 10022 11437
14248 11437 14379 23328 12470 13450 14597 9728 10926 14265 13029 8546 6976 3913 9117 10788
14234 10788 7549 -12151 -5635 14956 15093 13089 9911 11038 13243 5699 3944 17759 36222 23560
14220 23560 16564 6898 6642 1563 -2133 -6354 -10812 -24614 -13427 2718 4080 8592 11393 13852
14206 13852 15611 7021 8800 -3413 -6331 1255 5297 2343 7349 6216 10480 10829 -741 -8415
14192 -8415 -11873 -20715 -17661 -26867 -19628 -11078 -14330 -8644 -938 8578 16919 10824 7943 16897 17088
14177 17088 3432 -185 11463 13911 7606 1100 10062 4963 2182 16453 5117 13245 19260
14164 19260 17947 19345 13623 22031 17024 15233 17705 8982 9943 12702 11125 8898 -820 9082 15914
14149 15914 17389 26515 26518 23312 34669 34805 16148 18682 27882 25799 -485 -6827 -15382 -21239 -21447
14134 -21447 -9488 4289 3786 716 3529 -3407 -6283 -7322 -17066 -12687 -9981 12087 23451 11763
14120 11763 -9000 -7665 -1836 -8555 -4245 6605 7369 -569 9862 25377 18179 4531 999
14107 999 -8882 -13252 -7704 -4828 7230 19217 7435 3027 21964 22287 10641 -2052 -6420 -3167
14093 -3167 8531 20034 26232 18956 4952 -7590 -13053 -17813 -12125 -1839 -4752 -20260 -10505
14080 -10505 -14818 -38962 -34927 -24747 -5704 3054 4862 15815 16656 7326 21919 22249 9923
14067 9923 6842 10749 9836 -655 2562 14474 12485 12094 -3633 -7988 -6010 -4698 443 -5768
14053 -5768 -1591 555 -6700 4789 13479 13074 8298 16322 14338 10496 14315 3893 854 -5899
14039 -5899 -10752 -7116 1352 968 -9126 -12180 2153 9144 10324 1048 -6299 6076 2154 -7359
14025 -7359 -7765 -15248 -6250 4815 4833 1295 -2338 3155 -2325 -4491 -9700 -4429 518 8403 21603
14010 21603 13687 16861 28130 21058 8403 -890 -901 1195 -1758 -6653 -12355 -332 6109 11129
13996 11129 12776 17053 6715 3922 25225 23555 16545 20261 27069 30823 31990 29994 24388 27504
13982 27504 33482 26678 23867 32781 38439 28118 28356 22954 14872 18931 20498 29217 34400 23834
13968 23834 14089 10465 11222 -8 9637 20378 23961 19639 16210 11467 15679 25891 21617 15050
13954 15050 7369 2975 8708 17233 10747 3181 17421 21551 17271 6547 -3512 10943 16970
13941 16970 24567 23465 16257 747 -2687 -2145 -1954 6086 1398 11272 26626 16481 12064 26295
13927 26295 30961 18306 -4916 -12126 -6724 -5860 -2466 4167 15751 11750 -4838 -19308 -2976
13914 -2976 8002 10153 12228 6148 13819 19043 26103 28781 25249 18431 6321 5493 1477 -9925
13900 -9925 5201 14389 7054 -11665 -6910 3710 7717 9764 10103 3060 191 13377 21810 26793
13886 26793 33076 30099 13611 9270 14764 12571 6953 14459 31557 16699 1099 13928 22991
13873 22991 5841 -1399 -3787 7324 10736 15345 11132 5480 15552 17809 25884 16590 4106
13860 4106 14844 20927 19580 22004 5465 9319 25432 14005 4603 1698 -1131 -2796 -2863 -1571
13846 -1571 6816 -2539 -2914 13741 26311 36107 23020 1117 -18621 -23331 -14696 8834 11271
13833 11271 3128 10867 11191 11673 6482 3574 -3354 -5216 -2887 1785 -2372 6 6068 14097 13972
13818 13972 14309 2457 -12957 -14610 18108 36207 33458 33835 21392 16902 21791 21044 25386 23676
13804 23676 7341 9320 39287 40947 21406 9463 10050 13109 8009 4392 -12833 -10793 -3732
13791 -3732 15097 8316 4393 12893 17311 -109 2398 11966 11585 9279 10752 9039 -6174 -11808
13777 -11808 582 12429 6976 1541 2238 -5382 6540 13087 18647 29503 21205 35980 44612
13764 44612 26272 15992 -1772 -8992 4044 24589 36221 36621 21934 23960 13140 289
13752 289 -2033 -1785 2420 6707 -1251 -1457 15030 16228 16091 24340 23127 16744 2170 15907 23110
13737 23110 16272 9685 18469 23433 18661 17000 24414 24965 31611 21359 9509 8572 14889 18331
13723 18331 20304 4829 -9146 -17187 -20832 4155 19482 12625 13320 13526 22685 23583 17521 -1196
13709 -1196 -6493 1915 10 1402 8787 12620 21273 24993 15968 12978 12544 6953 -9691 -14854 -9111
13694 -9111 2772 -1467 9736 31932 39181 37345 38494 22353 3130 -5775 -8448 3412 26961
13681 26961 31509 29478 21333 14390 22043 26458 23787 9466 12988 11169 15727 12471 4271 1274
13667 1274 11877 19531 20290 2634 -367 8579 18422 16449 8989 4918 3360 6203 12665 17409
13653 17409 15601 13565 18989 24086 27056 22132 25567 17149 18667 7562 -11076 -13591 -9699 5597
13639 5597 15136 20647 12061 1091 1769 3395 -3546 -14023 -7877 6279 14547 18481 16494 11139
13625 11139 17582 17734 11046 22384 22227 6914 4189 4016 4018 -3833 7532 6190 12834 15142 23798
13610 23798 22987 9669 14981 13320 12546 12880 13994 18384 19581 11788 2561 11109 14127 13442 582
13595 582 4245 21987 25623 14126 15298 22221 27557 25877 26925 9491 -6114 -9183 -2820 -3025
13581 -3025 -1716 9139 10177 10940 12403 8477 19671 14346 18025 22508 31958 43553 38873 28495
13567 28495 32391 33122 34881 38336 39681 40335 35347 27032 27538 28054 20374 13643 22018 20639 34689
13552 34689 32543 30441 23880 20409 18638 12989 9205 786 14909 18254 9058 -360 -13004 -698
13538 -698 20448 23877 18192 19888 16379 15787 18200 10859 7524 3067 -10298 -1592 17610 15981
13524 15981 -4272 3417 -1464 1244 9596 5383 5075 5075 10730 22650 12761 4765 10233 12996 20191
13509 20191 21592 -2849 1936 19135 25083 28011 27425 33774 27595 38783 32434 19889 9795
13496 9795 6467 10526 6932 3795 5589 22441 43564 38139 31854 29298 36273 20898 7637 -1187
13482 -1187 -12396 1475 21733 30102 19696 12781 28744 39232 41390 37226 29125 20345 22303
13469 22303 17461 23788 30380 36697 39155 39526 38437 22443 6069 -5111 -2938 12254 34574
13456 34574 56357 49594 48772 38329 31491 26664 20166 23786 26378 26055 15106 3292 2760 25693
13442 25693 34580 31642 30527 39309 38128 37048 36515 34227 30358 31494 34446 37344 36524 24239 31902
13427 31902 35207 17970 22728 27575 12605 3195 10552 23739 20600 13748 11663 20398 22976 31159
13413 31159 39471 39741 45299 29938 29089 45472 47607 33466 37498 57702 68219 66648 73302 71666
13399 71666 78468 82434 92293 90900 102931 105075 82954 64852 74803 84502 90563 94731 88247 112877
13385 112877 152621 180586 222158 292172 374397 516968 710684 976014 1349080 1795142
13375 1795142 2144173 2173395 1882411 1449543 1056035 756617 556350 416745 319681 258850
13365 258850 217867 178358 157619 140688 127441 116947 107631 100606 91551 84736 82038 81763 60142
13352 60142 42543 46316 49498 41583 29072 22881 16418 29302 33574 24009 10394 10819 3991 -3944
13338 -3944 -3934 15214 28614 40078 41363 27268 24570 30183 24112 12728 14588 12534 22223 27625
13324 27625 30998 47712 40927 30180 27519 12821 13402 6960 39333 51937 62587 73884 71178
13311 71178 59238 55982 51573 53902 59410 53177 44026 34379 25566 41736 49315 48194 33550 20068
13297 20068 26216 41778 51482 48168 39996 37501 39742 51904 60787 52542 49240 58307 57331 46624
13283 46624 41685 32744 43559 49696 36821 32155 34040 28348 41750 36283 24627 21489 31796
13270 31796 45245 50239 41527 27580 14251 25040 38180 40918 45672 42461 33163 34200 50696
13257 50696 57768 61333 57187 43108 42358 40661 41761 46355 37523 38937 39803 30829 32441 35567 24841
13242 24841 9164 3471 5791 -1134 6043 19149 11861 7452 25015 37517 39121 48892 58292
13229 58292 60465 60510 61406 74428 82041 86279 83606 85282 84459 93661 99299 81852 65497 52033
13215 52033 45102 45926 45876 45275 46700 54669 41266 34931 40951 42904 53555 69472 83340 87285
13201 87285 101390 107474 114863 137104 142895 144059 152893 160886 159125 160586 156249 150354 155722 150563
13187 150563 142891 147543 151463 139763 146547 173130 185263 201294 220051 221545 209993 190476
13175 190476 172666 137287 104994 92090 84226 75151 80904 93020 85487 60282 53398 54111 55589
13162 55589 51170 50269 48655 60889 63888 49575 37249 32700 30943 38760 42128 45429 52862 64125
13148 64125 65615 64474 74562 67634 69059 77984 91759 92550 101232 110643 118135 113629 110905 91703
13134 91703 71474 62685 56861 68077 79651 71456 56090 45333 45637 77687 123963 159394 187241
13121 187241 191588 170607 151039 123661 108267 101801 108491 97322 84038 79747 74133 71572 92338
13108 92338 113757 116196 114170 120361 120659 136738 131683 125171 132644 121045 102149 115714 130869
13095 130869 132552 131406 139011 150549 156444 164592 160426 159939 144768 119132 86671 69940 64494
13082 64494 60349 75439 76585 86853 88673 99477 113175 115478 119763 140245 142398 138480 143763
13069 143763 153533 173324 218272 281174 358109 405591 433686 431756 405212 367336 336606 325424
13057 325424 327056 311236 298182 275094 246709 221475 194241 172183 157994 139258 126108 129161
13045 129161 136125 140678 141632 156758 177723 181007 178324 186046 188334 188723 193463 195827 204890 234282
13031 234282 246789 236291 239188 218540 216783 220582 229427 242969 255511 264664 276812 288506
13019 288506 282068 282217 281723 280718 291835 289275 276030 266218 263659 266145 263648 275932 303159 329426
13005 329426 341640 367282 400314 439428 471630 475417 478496 497528 505495 532360 567753 592522
12993 592522 624069 649274 663915 673791 678077 695000 735519 778324 808209 851822 908887 979385
12981 979385 1042952 1095472 1156676 1202041 1224831 1266018 1299524 1361711 1441082 1499266 1564844
12970 1564844 1651222 1765649 1898891 2047945 2183185 2312953 2454565 2617878 2808191 3010421
12960 3010421 3211984 3438886 3679696 3957210 4265369 4600434 4969914 5425043 5972979
12951 5972979 6622475 7371521 8205675 9178870 10367436 11848592 13704204 16022434 18969698
12942 18969698 22854159 28185832 35685585 46511625 62437746 86183828 121593103
12935 121593103 173255028 245204337 333881828 410196761 428651990 377795072 287439723
12928 287439723 203206853 141558370 100223518 72980107 54715206 42063374 33043881
12921 33043881 26485103 21664341 18066378 15331247 13202769 11478448 10059526 8877560
12913 8877560 7877304 7061806 6399452 5839090 5344622 4895954 4482185 4079752 3729796
12904 3729796 3454508 3235328 3048581 2869647 2698293 2547205 2405467 2275039 2173866
12895 2173866 2102677 2035741 1974971 1895058 1819325 1743072 1666323 1591379 1509316 1433718 1354436
12884 1354436 1284796 1220672 1162009 1126990 1117170 1113302 1096555 1073970 1033232 982209 938168 901938
12872 901938 868169 840761 811454 796184 788661 777892 762802 743130 720541 710997 704918 704134
12860 704134 699730 688721 679243 684524 688275 681549 667546 656177 650940 630407 606716 579882 550186
12847 550186 517796 503081 499684 480559 475454 474950 479550 464901 457897 447535 427141 407843 413143
12834 413143 402457 377987 368127 374151 362866 363487 389973 405843 386065 372701 379011 399491
12822 399491 405815 401843 406357 410003 408654 404442 408997 417789 420329 426490 427284 467539 498137 507143
12808 507143 516841 498164 463609 444872 418372 403683 397767 380804 352409 314381 299410 290178
12796 290178 293001 294125 287663 287016 277855 260219 244000 232862 230842 239143 234921 232962 241194 256743
12782 256743 249614 235348 242114 243169 212335 173593 148837 125529 106745 101645 100119 103449 113166
12769 113166 114738 113041 122635 127883 129270 139674 144350 153761 162668 156155 143923 127375 124741
12756 124741 137343 132540 127212 135227 138366 140181 140004 131179 118907 121423 112723 109041 102301 67267
12742 67267 51677 45384 32765 53141 91357 131187 155111 148682 145849 146034 147560 158588 149422
12729 149422 139672 130830 127343 118094 119276 94465 81692 93230 104679 109213 99776 99749 126506
12716 126506 134813 131251 126261 124678 110509 107072 112387 118509 119524 120449 127426 119469 112746 113074
12702 113074 121321 122513 131131 141647 134894 131633 133150 140957 148355 143567 143165 139357 129869 110038
12688 110038 99012 69588 56470 49205 54813 67023 81716 98438 111363 119469 115102 108268
12676 108268 105183 99859 100080 91793 100749 124845 145582 157536 146638 127854 113571 98542 95087
12663 95087 104302 115044 107626 102068 105758 98694 92060 100022 111873 104634 88550 71715 76000
12650 76000 75710 88687 94791 103699 100609 94470 89338 79638 76153 73246 69072 86750 95957 94383
12636 94383 85562 84080 84750 84385 75210 74564 86643 113687 136778 168004 174350 166364 166120 162459
12622 162459 139021 122199 124020 110474 95979 90026 88114 74785 74640 81159 102316 103950 86660
12609 86660 75134 67398 75451 90474 96618 86358 71849 64648 74519 86428 89436 83718 92981
12596 92981 100547 87688 87118 73587 51896 53829 66238 70621 57585 58205 62131 53664 56638 81660
12582 81660 89371 84947 80321 84397 74199 69515 78407 90965 95534 88582 88324 94836 96311 100425
12568 100425 96535 92181 93222 80741 88598 89309 75679 72114 72118 74482 74800 83555 74271 91646 96109
12553 96109 85419 71587 75094 89329 84795 85668 93925 99442 103129 97785 100958 114935 114940 102123
12539 102123 97330 86804 96966 100868 94762 82781 91066 85159 78491 76316 84362 89361 100622
12526 100622 105498 101117 101624 89269 85067 96195 103343 104731 106491 111078 105631 98956 99246 92854
12512 92854 88765 99182 104860 112677 112009 107778 108103 107984 108322 107222 108600 111100 111450 124830 135089
12497 135089 128139 136550 146148 161432 186612 216213 245888 288451 343016 421064 551518 720128
12485 720128 956862 1294875 1717379 2124227 2310462 2140663 1711505 1269036 942002 708996
12475 708996 537123 401941 327826 297088 256794 232773 202229 183285 167340 156203 151606
12464 151606 140193 140818 146920 139767 124377 123996 128396 124431 110634 119899 136296 122227 100738
12451 100738 98454 109209 108017 109356 115322 107377 90861 103983 104008 114635 117448 103936 93580
12438 93580 101779 110584 96290 93016 104414 98627 96829 103474 110957 108726 110371 103786 82498 79208
12424 79208 86320 92905 92142 105019 108588 105763 110202 104449 96918 106494 95184 87016 92870 90527
12410 90527 77828 83650 88368 94318 100331 101598 107842 109349 101239 101898 111969 115820 99962 94378
12396 94378 105474 106247 105626 116363 111615 116732 112769 111514 119598 117327 111985 115201 115597 112564 110470
12381 110470 109300 107024 116933 132260 135812 132221 130089 139731 143575 140733 133323 111909 95321
12368 95321 85219 105399 121914 132739 126129 124818 129471 128314 109026 93152 98645 109675 126555
12355 126555 143939 134156 110487 118566 123037 108624 104957 103481 99256 108134 119696 119933 116263
12342 116263 124762 115786 119102 126792 135033 141235 141822 129741 122411 121534 115493 108019 119677 139217
12328 139217 142026 138426 126350 111174 119106 133352 150210 155958 145971 132453 129472 144786 153240
12315 153240 151685 136181 132905 134458 150586 163015 154984 148996 146564 147480 150501 145836 151817 168342
12301 168342 174114 168792 159536 148361 144002 138956 137963 148179 157602 143518 146177 148306 149625 162307
12287 162307 174681 178208 159154 157797 159379 164321 160134 159973 160448 168240 182943 183786 187333 196714
12273 196714 199654 197070 181739 172895 175132 176715 179021 188716 201143 205908 197853 188695 197452 199548
12259 199548 194108 190072 185036 184160 182751 177159 183236 197679 201187 193626 195671 200781 190374 192517
12245 192517 195891 196091 198608 200204 203425 227829 232651 232747 231657 222975 220831 215719 212773 213160 211877
12230 211877 207972 215169 219472 210945 215624 220939 224210 237816 244165 242598 248550 244868 231381 222470
12216 222470 223028 215618 226170 249246 255316 251739 257288 253591 256805 262968 250120 251528 261613
12203 261613 265933 266536 268303 273063 277774 279424 268344 256578 255118 258667 270171 269136 270441 273871
12189 273871 260915 260653 272887 287758 297133 299992 307517 312013 307943 308405 301249 305240 323099 342835
12175 342835 337548 324789 325895 326495 318162 314182 322340 323862 332853 327992 322914 333265 347076 346946
12161 346946 331187 337721 344811 341373 325309 323468 338761 343332 336671 344385 360763 360855 354863 362726
12147 362726 372125 374078 379059 394877 414306 416474 412491 408900 401063 400347 408174 413197 426753 432592
12133 432592 423238 412909 409496 424939 438322 446371 455313 464034 459110 455016 458845 467179 475013
12120 475013 484507 487324 477168 481625 492505 504413 507205 498760 507324 515249 527547 537690 543609
12107 543609 541502 542253 547367 554280 557679 569036 586106 597789 603443 620910 626292 639847 647230
12094 647230 641054 636291 640951 661919 649822 638926 636924 648615 645449 656484 657882 672794 678119
12081 678119 677166 685481 697046 707595 703726 713096 716009 714573 716744 723935 740259 749914 753897 769816
12067 769816 787367 803607 815253 826116 821652 833004 850390 874178 884537 895643 905525 915651
12055 915651 934666 953018 962247 975019 984407 982902 988879 985743 984953 993940 1015063 1030556 1028878
12042 1028878 1043734 1061427 1074257 1084929 1089817 1100701 1112787 1129714 1143288 1144527 1164049 1193193
12030 1193193 1214883 1222368 1232820 1250970 1264751 1280648 1297799 1294470 1294109 1297215 1313022 1330676
12018 1330676 1352194 1377404 1403292 1419347 1428791 1439649 1467900 1506486 1523110 1531898 1560584 1581986
12006 1581986 1605224 1619246 1634298 1652802 1679080 1695201 1706260 1717270 1715074 1728571 1736870 1745588
11994 1745588 1774177 1816093 1847439 1882115 1923162 1953342 1956926 1953581 1974028 2003249 2021046 2037724
11982 2037724 2067212 2082711 2090728 2101192 2106621 2134653 2169401 2197790 2209366 2225926 2241785 2260105
11970 2260105 2288194 2294035 2313114 2319055 2336172 2361846 2364014 2390699 2410398 2422699 2439248 2452173
11958 2452173 2463109 2474729 2501838 2524597 2527337 2532157 2546989 2552900 2556068 2557178 2571948 2587915
11946 2587915 2587654 2591798 2608161 2626152 2625868 2618145 2629992 2629606 2623300 2605118 2604363 2625410 2619706 2615117
11932 2615117 2620231 2614368 2600176 2587411 2575701 2570149 2564642 2552260 2553662 2564394 2539135 2521223
11920 2521223 2529894 2509941 2480974 2461209 2440704 2436475 2435984 2423515 2401795 2382602 2375478 2373847
11908 2373847 2357136 2336546 2315034 2287939 2252819 2231746 2210375 2205403 2200859 2181048 2150969 2119692
11896 2119692 2088647 2062231 2039923 2012963 2002146 1985047 1964978 1964683 1957080 1933979 1915627 1888808
11884 1888808 1862208 1853073 1837542 1812426 1798386 1771715 1754618 1723550 1690594 1659851 1643648
11873 1643648 1633253 1611974 1596740 1586798 1582271 1564814 1546433 1527063 1511145 1493872 1467817 1443001
11861 1443001 1417568 1416715 1405507 1389480 1356811 1327350 1305445 1291626 1291905 1287738 1258432 1227459
11849 1227459 1216135 1202129 1194786 1185485 1184914 1169991 1159874 1141186 1127921 1126669 1112234 1089687
11837 1089687 1078749 1067957 1045035 1025089 1016741 997269 981826 983885 978866 964074 951080 939408
11825 939408 928505 924363 911017 905282 900011 895192 892765 874563 855360 852578 844234 829295 806011
11812 806011 792459 792694 796546 786263 769703 758802 762755 756952 736485 727424 718523 710447 708248
11799 708248 703869 693025 679746 667463 676115 691753 677430 669715 655266 632000 621440 613629
11787 613629 613065 618441 616550 618418 613703 607251 607130 589518 575669 563243 566312 573656 563226 547981
11773 547981 549548 556020 555843 555809 540050 542867 540176 524413 521801 527508 516300 509016 514602 505870
11759 505870 491431 485277 468922 467503 460407 442952 447145 448688 454405 455296 435678 426089 422846
11746 422846 415708 414476 407358 417158 407448 415852 424613 430222 404208 390511 387644 385487 388385 377413
11732 377413 375737 369800 366052 362693 351004 352153 355547 357129 366115 359046 344479 339675 344324 334474
11718 334474 327376 333426 334176 329193 332209 337752 347229 355175 352922 340315 316670 304523 297886 300608
11704 300608 292559 301635 304310 292072 301390 311355 310364 306715 282951 278394 270462 275529 274109 267835
11690 267835 286302 296320 280686 265014 266874 258878 264856 259948 270779 278788 276812 256025 255663
11677 255663 263754 250777 239534 248332 261111 262141 250008 240411 231686 231367 216086 218809 237267
11664 237267 239921 212761 206087 216453 221230 220089 213914 213495 211470 215388 212717 214210 213734 220396
11650 220396 231723 240280 242668 233213 235280 247828 236671 221220 205592 213702 218480 221951 228460
11637 228460 215193 206253 193526 197015 191971 187815 187909 201157 203385 199738 197657 188198 191861 195553
11623 195553 181640 173630 163709 159662 167995 170560 175043 182778 183495 184104 176145 164116 169671 173234
11609 173234 162085 149642 155511 151133 136593 134313 140040 145464 152994 153033 146942 150853 154144 155786
11595 155786 158600 166116 181576 183981 184296 166525 155261 159990 147560 131682 141634 149115 147206
11582 147206 150802 137775 132867 130400 134808 145891 150785 150554 129208 115638 126832 134321 128452
11569 128452 137278 130282 128737 134231 131633 118729 128961 132990 124640 113362 111395 125681 135739
11556 135739 143314 138031 135190 145949 144510 142453 146402 151927 148323 144682 127107 119265 124560 119619
11542 119619 116399 126069 123328 110104 101324 105381 98121 104801 105024 105226 106869 124961 122135 102830
11528 102830 102224 103204 108842 112569 124047 110873 110826 124387 125982 124063 116079 113856 107422 114320
11514 114320 123409 123998 116939 116814 116536 121577 120043 116344 122761 123721 119056 119381 118610 112475 105924 103875
11498 103875 104079 103897 102491 102633 102506 97265 96664 104358 112715 111238 99987 96612 99655 108990 105565
11483 105565 95024 101390 109463 113609 105681 95662 93213 96909 103837 95305 87400 88140 95057 97914
11469 97914 101052 98538 95647 99658 101578 101476 96507 83838 90854 98622 84351 70225 70485 76326
11455 76326 83041 82680 78137 74297 74996 78959 90529 89673 98985 107751 114306 111233 109351 103823 92776
11440 92776 84334 85852 90190 79905 67204 60507 53516 67459 75895 72537 63758 73170 80823 100487
11426 100487 102594 85712 73727 89135 98364 95598 89138 91834 92736 92755 89148 84118 81400 72387
11412 72387 70311 74083 70854 77301 100221 103450 98403 100062 96217 92934 71909 69365 59637 73239
11398 73239 80313 78648 82339 84932 76763 77324 77656 87943 84987 80245 94873 96635 87405 84548
11384 84548 94500 86939 67852 65726 58351 64144 63969 72285 70856 64774 71453 86271 92717 79021
11370 79021 77862 71738 82345 92501 92154 81386 65628 71601 79528 78171 76569 94158 87799
11357 87799 84075 76369 71573 69929 74658 72028 59495 57615 70365 80709 71751 65401 63504 62981
11343 62981 61413 57780 54143 61100 73926 82027 84455 72898 66274 83058 76605 56691 58799
11330 58799 67784 64151 67261 68688 70813 64642 66113 81496 86302 79235 78186 60675 39741 44981
11316 44981 59086 65921 62291 52390 47870 57944 69961 65559 65378 81668 93420 84861 70813
11303 70813 63638 65642 53944 56464 39194 30798 37518 45907 42822 42850 47106 45967 56128 56880
11289 56880 55750 59330 64495 59071 40675 42200 55052 70129 73709 58665 47935 51005 39636
11276 39636 36744 45911 51489 41599 40013 44725 41583 38782 49406 53428 59583 60546 50868 51867 56554
11261 56554 53095 60286 54142 54455 69081 81023 90202 80834 74771 73718 74808 77712 71569 67563
11247 67563 74284 71697 66146 50089 61694 62769 60515 68181 78791 83688 84418 80692 71529 71947
11233 71947 83680 82132 82292 90683 85667 67105 68505 68224 65477 75533 70540 63807 65230 63317
11219 63317 49895 52137 56176 61370 61098 47120 53280 61983 63254 45048 47809 51712 59285 54360
11205 54360 55181 68656 67069 61669 53928 51119 56084 71841 71105 65991 61669 63885 66341 62792
11191 62792 58367 58310 56673 58172 61381 62646 53004 55727 60584 55314 53749 49923 64031 75996
11177 75996 82327 66811 62808 63658 61462 47906 46484 50183 41706 40287 47975 68330 76956 63100
11163 63100 59558 54053 45074 54476 59725 55269 51192 46725 44373 51509 63671 70852 62424 56911
11149 56911 52039 54873 60583 81285 86520 78803 63404 70419 76077 70723 57502 46896 36957
11136 36957 33721 45014 51751 45898 52521 56715 64568 56561 56028 42417 40079 37621 41447 46750
11122 46750 61119 81695 92546 75957 59299 58818 59691 61485 56725 63784 77439 72446 69329
11109 69329 77409 72786 77505 73946 62621 62714 69377 75290 69976 64195 71610 83485 80128 68756
11095 68756 50614 51649 65337 76934 73450 83894 75774 73359 80487 77479 77723 88660 95246
11082 95246 92690 89338 91706 91789 77047 67003 67732 69111 74902 76546 78555 79687 69382 76973
11068 76973 83295 78707 89424 100785 107724 110680 121836 141314 129393 121288 116286 122421 131694
11055 131694 134737 151565 163188 194791 208924 230482 266322 288236 318737 363148 417509 452753
11043 452753 479772 480921 444469 425542 448120 481300 514174 561567 630943 718818 820920
11032 820920 902220 909573 850833 763180 692061 662602 667512 700553 786901 886695 1010629 1143834
11020 1143834 1233474 1210411 1080956 917172 783481 696519 657231 654091 680481 732303 812444
11009 812444 890007 914331 864020 748135 611634 522552 454882 405572 388002 386106 406166
10998 406166 435665 444996 436406 399330 350034 295779 236287 189019 156686 131367 112112 101355
10986 101355 90753 92189 89592 85891 76279 62812 77857 85984 81824 64384 39003 32085 45455
10973 45455 60463 72470 60546 64132 74355 69530 72404 74820 62137 55878 58862 69996 87993
10960 87993 84570 79644 75394 74280 73147 72511 76799 74513 84972 78622 73893 69462 64160 66978
10946 66978 73598 89243 90414 84154 78039 76781 73844 72487 68047 65805 69258 75471 72722 68213
10932 68213 69954 86134 96955 98033 97880 80972 65225 54909 51766 38497 27874 26481 31636
10919 31636 32137 25350 37285 42038 43854 59791 67727 75842 76385 62556 46031 53216 51503 54938
10905 54938 49808 47516 57420 68541 73771 66827 57433 55292 44091 43104 54376 55836 70656 84831
10891 84831 76937 73263 75296 95914 113008 117272 112092 107415 107415 100381 98512 116413 134551 141079
10877 141079 134910 126511 117029 114973 111441 119967 124952 148667 158599 150669 138669 131847 138134 157172
10863 157172 161583 164001 157539 172027 188464 201514 202031 203767 216663 204260 195726 206115 210195
10850 210195 222484 213759 210660 205875 213348 212531 223793 226159 215623 229948 242357 246000 231072
10837 231072 211880 213367 210386 200270 193958 194784 185313 176494 175376 189070 194724 183269 174602
10824 174602 172287 165107 162345 156712 154572 142650 130757 135371 129311 126553 124425 123482 129392 146818
10810 146818 139610 136909 124342 109661 108359 116749 121476 120172 134767 135451 125299 115400 116173 123286
10796 123286 126794 142417 161113 166901 159907 171317 167949 160125 157702 150742 144034 148947 157397
10783 157397 166411 166447 169655 180078 188203 181229 157557 166600 171882 168636 172515 176236 181156 195475
10769 195475 204767 194750 181569 177817 180402 183732 193097 192076 189092 199600 201708 196832 189055
10756 189055 174088 174234 193089 200252 203803 205137 220089 240934 246901 250370 250973 258865 246481
10743 246481 239581 243881 237542 250414 274609 284929 291595 299133 315609 312591 297196 298449 309482
10730 309482 299360 284066 286548 293414 302289 312464 338361 378826 397012 394768 375893 357060
10718 357060 357349 346614 331650 334555 344772 348625 341931 347784 353221 351035 347044 340482 338929 327312
10704 327312 319775 324473 344498 349088 346653 347279 340000 337896 330846 336035 346367 350542 340857 347004
10690 347004 349344 358994 372850 381645 378527 377692 371642 384058 399190 397405 397294 412621 446300
10677 446300 450393 452277 455734 475319 481103 493602 515788 528010 549283 581246 611876 637177
10665 637177 648665 672413 699722 731026 765814 808893 854566 889521 913226 945362 990307
10654 990307 1061120 1141701 1242624 1341892 1451423 1583154 1762675 1929184 1960335 1943593
10644 1943593 1973723 2056166 2196526 2356004 2555797 2817922 3152509 3600072 4207727 5030402
10634 5030402 6180466 7716091 9629366 11740983 13223186 13253262 12366865 11530329 11163841
10625 11163841 11381059 12237624 13850001 16364214 19954650 24921255 31389113 38438857
10617 38438857 45075911 52326634 60620579 67968463 71549393 70649138 67428844 64648026
10609 64648026 64196177 67046111 73580980 83510074 96525092 112902644 131103801 145388755
10601 145388755 148349365 139262233 124989375 112274784 104512618 102901372 107903211 119700409
10593 119700409 137979916 161176251 185084130 200884993 198676434 179264111 153554556
10586 153554556 130567929 114005311 104556358 101907347 105486606 114331833 126682627
10579 126682627 138989331 144917970 138430559 121075324 100563167 82818725 69956363
10572 69956363 61932752 58082011 57621585 59620703 62890370 65639511 65365181 60242140
10564 60242140 51146128 40941040 31822977 24592671 19178556 15219392 12331600 10202554
10556 10202554 8620440 7435004 6498010 5775118 5184659 4666479 4211548 3820550 3490884
10547 3490884 3201013 2937986 2713250 2517039 2342750 2187685 2061767 1950240 1837020
10538 1837020 1750072 1686470 1639329 1578823 1507098 1436086 1374755 1320983 1284133 1229322 1197628
10527 1197628 1171247 1136855 1106471 1078445 1051914 1032618 1008540 982930 963511 940924 913262
10516 913262 890030 862078 833558 807265 784351 766072 741465 733043 735286 713391 683666 668356
10504 668356 677850 670344 664933 669499 652932 635963 618276 614144 614883 597746 594351 589695 584822
10491 584822 574543 559172 540045 539328 544400 531758 530251 540859 549483 549999 541055 537302 530485
10478 530485 525645 513011 495994 492702 481631 469950 483544 495623 494874 500353 502849 496960 503516
10465 503516 507205 497812 483755 478121 477214 463078 451933 457459 462531 458512 462864 473223 464507
10452 464507 453033 447735 433907 432309 424399 421552 432606 435836 453709 485966 526905 591558
10440 591558 677593 804884 978183 1198814 1435797 1642110 1772974 1811298 1784129 1663784
10430 1663784 1446688 1180924 940475 749980 601017 486121 405505 361832 326720 297655
10420 297655 271229 245409 224762 215980 215860 226025 215618 216095 221887 194471 165874 157111 168030
10407 168030 162939 153272 145205 162443 158206 171230 170084 155795 141492 134195 130926 144173 149303
10394 149303 157182 163118 178490 175612 178727 168597 158465 144689 122598 122870 124100 123403 141100
10381 141100 143989 143390 147371 149382 154928 152633 141777 137844 134646 132545 125283 122084 125202 133653
10367 133653 145944 153047 144573 138444 142938 143989 149793 155536 152417 143773 145042 136819 131747 134366
10353 134366 142753 136480 135077 124905 108474 103754 103404 94631 92355 87600 86310 94211 99772 98804
10339 98804 94901 94644 94986 91933 100372 101885 110675 125550 116119 117494 122406 129660 141757 155911
10325 155911 164315 167017 162465 141815 134947 132146 123209 126470 143806 156272 162191 148029 123469
10312 123469 116932 123027 121883 120862 122928 123668 116242 123843 139756 150548 153925 174426 180035 192375
10298 192375 212831 222247 229841 223013 211452 213747 224091 234817 239295 242495 250759 255949 251709
10285 251709 258323 258464 260251 257928 252884 248333 258711 242139 217462 200106 185861 173588 157037
10272 157037 144308 139684 137084 132197 126657 114799 100961 107185 122065 131071 126022 131695 130918
10259 130918 120189 108696 105539 106188 99869 95983 118029 119699 104310 113749 109091 113654 126814
10246 126814 129158 125102 129913 144060 142255 147570 160555 152766 128636 115916 115836 129669 121809
10233 121809 80997 55459 57063 72255 98116 128921 140988 153875 173320 183163 198167 205535
10221 205535 186639 163470 147046 157236 159014 166512 176921 175265 151870 138651 156986 170474
10209 170474 168308 166293 168106 182177 182059 189668 195913 197073 208087 208106 197019 208256 215812 228961
10195 228961 247048 263476 279143 293503 298957 284847 272628 259083 254621 253490 243449 262773
10183 262773 297088 329622 377138 422972 479157 528782 572587 597894 589853 576479 575391 591982
10171 591982 636190 696197 791487 912163 1055387 1201068 1306537 1327169 1255691 1151660
10161 1151660 1061911 1008611 997857 1028323 1091925 1184973 1318498 1447980 1487568 1424023 1269974
10150 1269974 1109399 983846 889821 843395 826054 854803 920668 1008323 1081331 1108204 1058726
10139 1058726 956310 843902 750204 682342 655769 656864 651455 662075 669045 687294 692852 655156
10127 655156 605804 561299 530416 498207 464607 441236 426221 415430 410093 416915 415262 420444
10115 420444 435027 423897 414838 416269 436870 451920 469143 482547 499111 518163 536835 558152
10103 558152 585426 617489 646032 670098 693080 718422 743230 770249 787462 807013 833121
10092 833121 854279 891832 920184 966240 1012511 1053706 1093266 1140973 1200928 1253197 1323666
10081 1323666 1391213 1434537 1481304 1537727 1586011 1654464 1738402 1832277 1942218 2070138 2200602
10070 2200602 2346824 2517347 2698656 2898476 3102811 3333318 3582375 3850993 4164180
10061 4164180 4507226 4910779 5388161 5958489 6648190 7426629 8216726 8976847 9766460
10052 9766460 10624564 11564563 12629802 13968779 15718684 17998420 20925370 24652657
10044 24652657 29471935 35909521 44920519 57889457 76659115 103487856 140523722
10037 140523722 188080485 239928767 281099761 303093430 307236501 298574394 272861974
10030 272861974 229356899 177058457 130526739 95466018 70921815 54092271 42476452
10023 42476452 34284397 28290076 23735861 20177784 17316887 14993996 13165816 11771101
10015 11771101 10734134 9949985 9268634 8603176 7948162 7313719 6650568 5945632 5272522
10006 5272522 4712237 4241642 3860122 3548341 3279497 3067496 2879388 2709559 2555098
9997 2555098 2425744 2293988 2195219 2117635 2037203 1948078 1860424 1770342 1665434 1580455 1513891
9986 1513891 1434672 1365900 1314669 1281740 1262083 1226987 1181256 1132284 1091932 1057013 1028792
9975 1028792 988842 938240 906265 896100 869468 851340 835058 811720 796624 776070 765280
9964 765280 740427 724622 717775 701079 692325 692774 686536 688646 688095 663416 636557 611981 591813
9951 591813 560085 542756 531755 521468 507072 491601 491370 486362 478263 460096 437353 429815 425253
9938 425253 426970 419357 401292 390814 378096 371133 370089 374106 376867 360575 346991 354311 362123
9925 362123 371495 375884 373771 366418 365871 364842 367385 371258 363907 362785 361305 388275 418577 431496
9911 431496 440528 448076 449091 445711 429068 402232 386729 366325 350849 333970 319893 313173 306667
9898 306667 294138 287154 270865 263861 255308 249111 236586 223211 218399 237095 233028 214653 220456
9885 220456 218745 227817 235955 233823 225983 210222 189336 171836 149787 130183 112032 96772 85993
9872 85993 95891 111481 118142 129078 135347 145328 151100 140460 121219 127277 124694 124608 128961 135685
9858 135685 138807 140681 138018 144724 151359 134684 117960 102985 88373 80919 74789 65617 50348
9845 50348 50637 61888 50712 37658 51636 67315 83688 110609 125560 137533 142762 134705 119348
9832 119348 105404 76052 74362 89655 92615 82447 75884 70656 60711 55499 72300 64519 66462
9819 66462 83704 87100 102147 107612 98166 97665 96844 95682 112177 124461 129410 124703 103997 94866
9805 94866 88982 88247 89153 88023 86261 89414 82232 86114 100675 84382 73342 75004 80753 85442
9791 85442 74125 73096 81389 67369 59324 54100 41200 31854 30802 34602 41464 39701 37981 40497
9777 40497 51209 64722 80400 83004 81184 84791 83451 55075 43190 40772 37764 32405 38662
9764 38662 36427 45202 49594 51760 38773 34425 23271 31034 36975 43923 43214 43386 42304 41025 49019
9749 49019 64102 53356 34074 33413 29098 25539 22277 37384 29580 28921 24093 17662 28716 26018
9735 26018 18464 15060 31295 42929 48145 59537 82484 94415 95968 89899 89316 78772 77645
9722 77645 67970 58723 43528 38962 44878 58866 65104 60434 50249 50324 43661 39777 41222 42414
9708 42414 32643 24512 26390 24469 35862 44070 55368 59319 55085 38301 15803 10547 12545 26356
9694 26356 33551 37981 50941 57834 53080 30878 21775 21682 19843 20215 23562 16569 20157 24745 33485
9679 33485 33504 17892 10387 11935 21219 15914 14734 13897 12846 33637 44694 47377 47383 49656 49137 55588
9663 55588 56233 65579 58904 45515 49488 53441 51811 43409 52182 67278 86620 82426 82776 93214
9649 93214 122129 139130 125762 110867 114190 109576 107285 114148 134084 166863 191505 216950 252566
9636 252566 314191 398060 523278 690573 910617 1192298 1436779 1589910 1644733 1627702
9626 1627702 1529510 1331100 1078970 828880 618770 471433 375998 311636 254582 209432
9616 209432 170559 137904 113136 101236 90998 83439 73500 73357 73287 73859 76771 66952 72406 64675
9602 64675 52856 44819 34486 20321 21052 23328 19322 27127 20131 24149 29095 40152 30370 19708
9588 19708 28042 51806 61453 52159 46271 33881 18941 22213 20445 17395 31665 20521 2804
9575 2804 -582 12558 14257 8570 5956 7738 -20545 -36216 -33075 -31211 -33080 -16472 -2491 7749
9561 7749 14908 16055 12346 22280 37625 35613 37804 25239 12469 8575 6709 11131 17274 18426
9547 18426 10470 10493 15936 24383 29527 28902 14347 1478 23000 33377 22048 29790 29558 15809
9533 15809 3974 -3807 -12845 -14068 -4426 5687 13832 11750 5007 7277 -5570 -3217 -3181 -12366
9519 -12366 -14679 -12232 -5499 3827 3196 4857 6365 12316 18532 18686 29583 32122 34015 42148 35540
9504 35540 32182 18342 5698 8496 9718 -186 6101 16637 5612 -5250 5598 13217 16800
9491 16800 19546 13616 7882 2533 4362 6664 8276 12312 18758 25638 9950 14928 34880 38398
9477 38398 25673 27891 17685 9715 13808 21168 26392 11815 13470 14327 15218 9479 -4449 -7570
9463 -7570 2206 10686 12989 2779 -3432 6228 12377 13115 14656 15157 9199 11640 13463 10940 8960
9448 8960 14495 15357 23246 19081 5197 -19439 -23668 -7181 82 -2606 -9323 -15975 -17988 -11782
9434 -11782 -8212 -8541 -1717 9705 7317 -2325 -422 1600 -932 -9354 -3003 3370 7997 10051 4371
9419 4371 8311 5825 -7738 -7072 2411 3382 -2703 1287 11202 5208 -817 -11566 -18547 -3732 126
9404 126 5535 10916 17793 10629 -2556 -3779 3160 13943 11185 6169 -4450 1144 2375 -1273
9390 -1273 -13516 -5777 7373 465 -1266 18651 20512 -216 -21215 -22225 -15019 -17007 -15761 -8303
9376 -8303 -5351 -6741 3571 7608 15825 26642 25290 14837 18271 23049 18702 13138 20030 16975
9362 16975 20316 25998 31211 48470 41841 21485 7990 -514 -16121 -12105 -3238 5382 8598 17573
9348 17573 19187 19311 31538 15925 4735 14724 14395 -5724 -2856 -5452 -10024 1679 3795 5745
9334 5745 2731 3893 2404 6928 1844 -12705 -1680 8743 11152 17143 12569 12849 10046 -3418
9320 -3418 3378 5557 11723 6979 13343 19251 14119 18508 27615 32275 19941 1013 -7418 -1823
9306 -1823 -7303 -13913 -26996 -23529 -2916 15511 30140 28992 26684 18068 8195 10154 -811 -17733
9292 -17733 -9695 7752 1854 5173 19538 25705 24031 26796 9830 4619 18495 13407 -104
9279 -104 1455 -210 -16154 -15254 2627 13975 1877 1792 15943 17592 15391 15058 13399 28305 34839
9264 34839 32896 27889 25305 16834 26242 25075 14836 25722 20725 25202 28995 17767 12459 2363
9250 2363 144 21735 26212 12416 17940 13769 3024 3067 13695 24762 31601 28033 8214 15865
9236 15865 16513 15194 31955 39033 27716 28627 14908 9506 24069 28759 21108 24446 32582 27751
9222 27751 7824 -12059 -26143 -5131 3876 2848 -12917 -8059 3352 -2632 -9609 -11246 -14404
9209 -14404 -6493 3835 8091 -1028 -16345 -14075 9426 8125 6350 10988 3828 999 11143 -5442
9195 -5442 -7653 -4552 -630 -12266 -13556 -3935 -5058 -18983 -13050 634 9221 18931 20035 11818
9181 11818 8276 4958 -748 -1604 11464 8120 6096 1688 -1253 2844 -6936 3221 9820 9648 -2105
9166 -2105 -1703 12617 26822 18268 11292 12380 8761 12553 7741 6093 -6663 -18750 -19648 -10532
9152 -10532 2659 14453 22089 13914 23778 30826 18279 9978 3984 -12719 -20457 -25965 -32347 -24995
9138 -24995 4577 16698 5516 6290 18995 18306 11410 1013 -14255 -9728 -1991 -166 2326 -2892
9124 -2892 -6964 -715 -2970 -3611 616 -2494 -19642 -12300 -21804 -24346 -11130 -17458 -13306 -6299 5784
9109 5784 445 -14901 -19417 -5578 -64 -3065 -15552 -10006 1467 8035 2687 -2212 -1948 -1291
9095 -1291 9616 14997 19831 9639 14269 28803 22046 9413 10772 17247 15970 17988 10126 13270
9081 13270 14918 23504 22980 19677 18898 1059 -673 2564 4212 14275 13199 24502 17306 13668
9067 13668 9849 -2825 -4595 4282 15136 12258 -12092 -12425 -3783 -11425 -17936 -18749 -9918 3569
9053 3569 3753 2414 9937 17671 18786 11660 11353 12557 11022 6542 4916 2697 10902 10276 -2877
9038 -2877 39 4816 -4514 -7009 -15299 -6538 10147 11382 1711 -11952 -14911 -8375 5870 12396
9024 12396 3156 -7630 -4240 1138 -4175 -21714 -23289 -15921 -10989 -14935 -5397 -7155 131 1267
9010 1267 1068 1213 -7904 -11060 2851 14234 20508 26059 9237 3882 3592 1702 2622 -16755 -20011
8995 -20011 -18653 -21546 -19055 -9180 -1863 -396 -9457 -9146 -4112 -9314 -14674 -10958 5982 23020
8981 23020 42604 35582 3792 1246 9644 12122 12215 12700 10148 -2153 -13382 -1457 11279 11970
8967 11970 -5653 -891 -2490 -2171 -6233 1116 -1390 -9128 -17339 -29424 -23627 -22982 -23163 -20610 -15361
8952 -15361 -3436 -1886 -2961 -9612 -3295 3381 -14749 -19647 -17168 -15811 -20921 -12885 -10351 -4704
8938 -4704 3672 13737 5367 -522 3048 7562 6887 18380 32158 27891 23810 15619 559 -11170
8924 -11170 -23185 -26210 -19420 5849 26467 23201 18676 10424 6284 5213 -12974 -16582 11772
8911 11772 14957 8813 15111 15843 12497 5521 3441 -11730 -8032 9294 14803 17095 16326 18141 22355
8896 22355 26782 20178 6515 -1621 -7820 -4275 -11435 -18128 -22040 -25898 -22618 -11088 -2914 -26956
8882 -26956 -24982 -20170 -7113 9760 14390 3409 8934 10475 5311 6383 4985 -386 -2999 -3343
8868 -3343 3954 14078 6921 4042 6237 7459 9936 4729 3490 14310 2747 2834 -704 -11742
8854 -11742 -16157 -26286 -19224 -6953 6069 -3591 -9378 -12737 -19766 -30197 -33995 -32643 -16182
8841 -16182 -12547 -12450 -12758 -10282 -1584 5310 9301 10704 10354 -10446 -27365 -36386 -36718 -39495 -25068
8826 -25068 -26044 -33280 -24985 -20026 -9658 -13083 -11312 5288 6211 6584 2115 -385 1510 -1104 -16129
8811 -16129 -23137 -18140 -14439 -9761 -10263 -20877 -27743 -16334 -7848 -10264 5930 22354 8908 -19399
8797 -19399 -26839 -22937 -18574 -19286 -19910 -23607 -16665 -5712 -1741 5544 -1429 -6537 2001 -3087 -5644
8782 -5644 -7242 -450 -5875 -11874 -14550 -17411 -19805 -22339 -14104 -7895 4296 -2007 -14495 -1897
8768 -1897 -617 4020 15793 5838 -9277 -17194 -12175 2638 8352 3127 -11094 -16996 -12980 7418
8754 7418 18736 5426 -4506 -5685 8208 10276 11766 9716 2055 -4255 3337 11999 22398 10422
8740 10422 3932 4335 2698 3804 2600 -8727 -4010 -3363 5995 3562 -3072 -8343 -5981 -9061 -9332
8725 -9332 2653 10954 9859 6334 -10247 -16639 -8739 1052 -6658 -12292 -4650 -4295 -12954 747
8711 747 2185 -6186 -2135 -2958 -6267 -8305 3696 9143 -1034 -7605 -15022 -14608 -6148 -10712 -10784 -11139
8695 -11139 -13882 -10905 -6966 -12680 -4807 5846 -6658 -6339 10785 18168 20227 14108 6321 3380
8681 3380 3619 7740 9130 -1648 -10138 -6806 -13740 907 15969 14466 4114 10214 9467 -2981
8667 -2981 -9459 -21306 -18266 -6885 7254 12092 12481 2299 -14512 -2864 2017 4358 148 2481
8653 2481 14691 13976 8514 10889 3930 3440 -3233 -22798 -27787 -26360 -8968 3552 16821 12863
8639 12863 346 -2580 -537 48 -13765 -26577 -15538 -1469 17851 16397 11787 6862 16937
8626 16937 14347 19507 16701 -2043 -6333 -4621 -1335 -10144 -21215 -12202 -12589 -1067 11801 6337
8612 6337 1273 635 -8517 6191 -3179 -10363 2945 3922 10447 20851 19551 27323 35367 37257 27961
8597 27961 19462 19940 22952 22424 12962 19498 23141 16694 6068 22676 44418 53758 44613 40605
8583 40605 29653 14200 13118 -4264 -3946 5377 14529 27437 21402 24162 8623 7874 28060 36000
8569 36000 21273 -8304 -22276 -11937 -4849 -4297 1626 -1303 476 11108 8072 19365 21660
8556 21660 8139 -487 -20439 -27540 -17662 3333 17881 20950 16792 12315 2193 -1035 6732
8543 6732 1201 -7811 -4424 -547 5579 8650 7795 -11671 -21602 -9433 -6189 -10285 -14532 -14177 -12335
8528 -12335 -3840 -2684 -10909 -238 7105 8833 10918 6053 -5145 -22068 -18464 -17358 -20921 -20005
8514 -20005 -25510 -27285 -13190 -11850 -12569 -20130 -32875 -26197 -11889 -11551 -3612 -1774 -9657 -2917
8500 -2917 16681 16139 10180 -3415 -4153 10129 4895 4758 2158 -7145 -11214 -8293 -2993 -354 -3465
8485 -3465 -364 5762 -3503 3249 5163 6367 3125 -4351 -16365 -19913 -7953 -1261 -2406 -4776
8471 -4776 -3799 -424 4144 5986 -3157 -5642 -5662 -11113 -16683 -7450 -2570 -433 3428 13156 9059 8268
8455 8268 10039 11882 15769 18105 15429 23178 22340 23331 24849 33075 40123 48517 62388 66822 50208
8440 50208 35361 34664 24113 25457 28347 38340 50847 47432 38716 29743 29688 35140 28214 18140
8426 18140 14982 20394 28782 14773 1076 3098 8912 22720 34621 27413 21443 15153 -1536
8413 -1536 -7417 1902 10293 17816 17016 1443 -14541 -6497 -3757 -3063 14684 5037 2083 9487 982
8398 982 1205 4203 -561 -12169 -10260 -3061 -4108 -4997 -740 4941 13176 26868 22624 8755 6057
8383 6057 575 -2818 15676 20351 17300 11079 -1521 14860 22542 27597 25428 12547 8500 -1505
8369 -1505 -12579 -2741 12701 23300 10920 5575 4853 -3549 -8877 -13587 -350 12136 11492 5106
8355 5106 188 7974 12446 4206 -4704 -9621 -34 -3117 13287 24341 18452 24504 29045 42379
8341 42379 71509 104154 95058 59303 28796 11679 10572 5492 6584 6593 2467 1955 -7236 -9396
8327 -9396 -5381 -755 -4095 -19089 -10423 -18247 -15574 -8484 6374 -453 -3483 4224 8545 18217
8313 18217 24965 24717 11745 12451 12132 2811 15469 17692 19501 17634 5437 5925 14874 22182 44836
8298 44836 69365 98149 177025 202379 135551 73828 42117 39017 28257 23675 17899 15179 22126
8285 22126 20749 7699 10318 8058 5658 9704 11861 16386 20695 28534 25484 15399 17726 9623
8271 9623 1040 2195 -9492 5403 14630 8246 19839 17334 20152 33976 45397 41185 40773 26224
8257 26224 8280 -3430 9597 25965 44447 67849 94364 95109 81896 51581 21068 6841
8245 6841 2909 14423 12870 6308 -4918 -1018 5495 4533 8862 11750 -4943 -1159 5246 14201
8231 14201 12403 13273 5614 -21129 -16188 13704 19373 8185 -6345 -5234 3319 -8678 -6453 -1421
8217 -1421 -11963 -4762 -3046 -13205 -21124 -23258 -7038 10889 12440 18028 15346 7610 -565 -993
8203 -993 5681 5910 -1525 -2714 12307 27879 23710 10064 8070 5034 11147 910 -5330 -8590
8189 -8590 -4811 6205 6289 4864 896 -4881 -18073 -26579 -19922 -20196 -15995 -9786 -9870 -4490 -2029 701
8173 701 3226 -2562 -24383 -29422 -12740 -5611 -21392 -30882 -18217 -14755 -3881 -1044 9919 12201
8159 12201 4955 -6671 -19626 -23322 -16565 -1253 -8689 -13106 -19333 -23587 -25313 -21911 -13895 -1052
8145 -1052 258 -9062 -16142 -21808 -19304 -16485 -26836 -37841 -40138 -27290 -11763 -13011 -22249 -26045
8131 -26045 -31685 -23082 -21889 -7837 -4179 -12631 -8019 3268 -120 10121 21627 19295 12560 -2922
8117 -2922 -8196 -6809 243 15530 20696 25199 14954 4132 1445 -13828 -29925 -47770 -40860
8104 -40860 -30142 -20901 -2507 6553 592 5304 6165 12280 6917 2940 5207 -9844 -25789 -14046
8090 -14046 -5784 -7951 -11160 -13547 -20645 -21009 -14138 -5591 4603 -9653 -18198 -3213 15228 16525
8076 16525 -1368 -15671 -15899 -1025 -13841 -11639 -4964 3650 4000 -5186 -9536 -9855 4536 3231
8062 3231 13559 13831 6060 -1658 -8454 -18679 -4890 13919 4804 -9197 -16558 -34593 -38831 -25161
8048 -25161 -4742 2456 9871 6951 476 -8000 -11455 -5124 8516 22272 20807 9280 4750 -6887
8034 -6887 -3834 -7880 9420 26811 26034 4929 -4376 -3267 -8605 -9887 2004 2845 -11727 -10366
8020 -10366 -763 9995 -3279 -19246 -21288 -22049 -3481 5547 6903 7619 -8795 -19877 -27570 -19601
8006 -19601 -11755 -21681 -24410 -13717 10003 12125 11728 217 -423 5451 2437 -2505 -5732 -15020
7992 -15020 -4566 -2668 -8695 -5426 -2964 -2613 8377 2989 6263 2954 -3399 6676 13960 6944
7978 6944 1052 -3699 -5069 -3484 -12767 -13314 -1152 -7510 -4231 -6606 -14546 -7265 -1802 2556 3032
7963 3032 768 -525 5994 -6919 -17046 -18708 -21071 -21877 -19966 -20590 -15194 -3685 -9653 -12769 -4048
7948 -4048 -5553 7563 5985 -8504 -5884 -8263 -3350 -1116 -2268 -6393 -3979 -13048 -19813 -8233
7934 -8233 -8076 -12862 -4852 -3149 -9583 -11523 -17488 -23339 -13183 -6912 4897 2807 -6574 3181 11519
7919 11519 10196 -1947 -13093 -10858 -15911 -8100 -7612 -5433 -11541 -4852 -12736 -7909 -2437 -4319
7905 -4319 -6509 -7954 1830 4867 -3295 -9042 947 5847 4581 -1480 -5567 -5098 -1487 1864 6226
7890 6226 -3673 -4560 -11931 -14450 -12204 -5922 3843 2499 -10316 -22152 -16094 -10882 -2076 2611 4403
7875 4403 -8415 -12039 -11437 -9676 4941 8720 5578 4755 12243 15986 14605 10717 7595 5660 -3681
7860 -3681 -5837 -18608 -10522 6878 6573 17283 5013 -1517 -7136 -11751 -11545 -15407 -13409 -3925
7846 -3925 6864 -5472 -22956 -20038 -14030 -7487 1091 638 -1912 4393 11108 11218 6436 2424 -11625
7831 -11625 -2367 -4635 -2972 -10368 -11203 5358 16158 18832 13933 7859 2965 231 -1445 -3182
7817 -3182 6207 6975 4161 -2235 -19901 -7585 6799 -7884 -14046 -3905 -2510 -6236 3113 20109
7803 20109 27212 17282 1060 -3652 -283 218 1544 19852 11831 -1394 421 5172 -10577 -4197
7789 -4197 202 3379 5497 2614 369 208 -3319 -3156 3599 9465 10011 3869 3032 -2561 5193 -551
7773 -551 -8827 481 -2469 12403 22173 20540 -7963 -19262 -15686 -12607 -2274 10019 -858 -8007
7759 -8007 -10562 -12541 -8980 -10334 -15501 -2238 4862 -1843 -16865 -12813 -5510 -2292 -6384 -21479
7745 -21479 -30170 -23754 -15811 2914 14677 14474 20572 8200 960 1443 -4677 -6556 5032 7674
7731 7674 3905 -2548 -7151 -15033 -10882 170 10495 18090 7087 -2646 -7110 -23341 -11219 1896
7717 1896 -5028 -10141 -12589 -2110 3525 7567 2649 -5139 -8515 -2729 4816 3484 14641 29538
7703 29538 25818 21923 15175 3980 -7205 -1802 -940 2169 5291 12695 21160 28304 28735 22473 17265
7688 17265 12987 6746 11880 12803 5108 -1012 4445 7294 16077 18073 9523 11035 18606 27082 25910
7673 25910 11149 639 12165 14039 4006 994 4289 -1282 -11114 -28088 -34486 -28623 -8921
7660 -8921 5484 -3136 -27489 -46356 -40007 -38010 -25916 -12375 1145 -8408 -2103 3113 -11474
7647 -11474 -4265 9732 2239 1339 3885 1510 5796 9105 5717 6695 10699 8622 10380 24097 25718
7632 25718 14212 -3550 -20036 -14441 -10481 -18026 -11468 -6006 -11407 -33268 -30905 -15256 6264
7619 6264 -4986 -12951 -17568 -9776 -12852 -14940 -10393 -10616 -16464 -16941 -27849 -37717 -34073 -28293 -27726
7604 -27726 -19345 -823 9060 7609 3285 -5043 -506 -10661 -12580 1786 -4490 -16520 -14977 -20751
7590 -20751 -15981 -8501 -11216 -25795 -26385 -17579 -20700 -23411 -17600 -4336 4667 -5403 -12169 -15460
7576 -15460 -7379 -4130 -6476 -14720 -14208 -3936 -3649 -4192 -2702 -5948 -6031 8702 14117 9178 -6220
7561 -6220 -7012 -9587 -11682 -643 -3198 -11490 -7142 -14270 -1335 14044 10566 12835 3961 11174
7547 11174 14304 9568 -7407 -7189 -6014 -8527 2270 17227 27784 20309 14337 15252 12020 17217
7533 17217 8274 6701 4018 853 -6568 -13707 -12677 -5854 4037 4652 3367 16109 14247 7139 -3560
7518 -3560 -10208 1307 14843 22468 17719 12759 8957 484 -922 -4385 -4565 -3401 11921 19656
7504 19656 19486 17787 13095 9014 -4335 6760 10009 628 14091 10303 4633 12054 14019 -6157
7490 -6157 -22037 -17499 -2341 3736 2595 1678 9060 -4298 -6818 -2526 -2163 -13835 -9940 6395
7476 6395 12392 16520 18148 9869 -2325 -7529 -3344 4326 5488 -6926 -8372 -3659 -7706 -9592
7462 -9592 -9774 -11972 -9691 4858 8204 395 -5167 -7193 -25484 -19487 -2685 -3161 -4465 -7692 -7972
7447 -7972 1990 9150 5718 6532 22066 24188 18308 11038 8619 15487 33615 43819 37659 26785
7433 26785 8980 -4217 158 12068 5317 -26126 -28651 -24077 1193 -5409 -8160 -4059 3947
7420 3947 12634 5146 7482 -5963 -10016 -7284 -13273 -16069 -13774 -9623 -2685 -9662 -5196 -420 -13235
7405 -13235 -20396 -17235 -13188 -16580 -11762 -22240 -15290 -12251 -11774 1397 1942 -10836 -15915 -19527
7391 -19527 -12386 -5597 -8629 10295 12208 2422 1741 -6616 -573 5119 7353 -402 -2709 -15258
7377 -15258 -15984 -14366 -16980 -19861 -21084 -8816 4490 1623 -7096 -6486 -11196 -20804 -9328 -4983
7363 -4983 3959 -1179 1283 866 -3313 -10125 -5030 4381 2980 7684 2946 -2152 2289 7819 3908
7348 3908 6425 -1683 -7683 -9604 -15239 -25402 -10093 -9502 -15558 -2903 5331 727 7578 -1721
7334 -1721 -13956 -22086 -19380 -5028 5233 26767 28834 8964 7972 14475 -3176 -3378 -4286 -6910
7320 -6910 -11098 -13210 -12290 -10023 -14541 -16024 -10965 -28095 -34928 -35943 -18697 10322 13444 5058
7306 5058 7332 3183 -7183 -1484 -3757 -18650 -16145 1100 10125 -4630 -9209 -23093 -19345 -8625
7292 -8625 3947 11576 -6963 -30035 -30268 -17450 -21938 -16834 -8974 -24749 -24792 -25536 -14733 -4229
7278 -4229 -11771 -10936 -6863 3453 12276 3545 -279 -17600 -13262 -10230 950 8065 -931 -11280
7264 -11280 -11382 -16771 -8914 -4535 -6014 -4534 -11107 -15244 -27438 -37212 -15489 10938 23318 25514
7250 25514 23041 23770 12176 7443 13944 15045 6982 5037 7600 3591 -12377 -6836 8575 -7297
7236 -7297 -12419 -2403 13164 7329 -13128 -20861 -24211 -24049 -25180 -19388 -3795 8369 7960 -6373
7222 -6373 -7505 -6029 -873 -7419 -6048 -682 -3879 14757 16421 6997 1280 -9843 -9732 -4736 -11842
7207 -11842 -7667 1182 -1891 -7094 -7423 -5607 -7873 -1525 427 9658 18111 16310 16745 24203 12349
7192 12349 8287 102 -5692 -8467 -12096 -17482 -15800 -8162 -5448 -4379 2463 11186 4677 4936 656
7177 656 2038 -3507 -6122 -10355 -12341 -15112 -20014 -14876 -9991 -13111 -11876 -9163 -12074 -16518 -5808
7162 -5808 -2351 -1393 11477 2841 -5703 -7877 -11485 -8158 -10826 -18456 -15590 -19013 -15563 -15130 -12184
7147 -12184 -8389 -2725 -9749 -5535 -12422 -9538 -322 1261 -5250 6794 8599 4447 3881 4346 2178
7132 2178 3660 -2193 -6215 -13013 -25881 -22753 -23950 -20306 -11383 -7782 1711 -246 361 -4614 -10203
7117 -10203 -24329 -35031 -36617 -42646 -35391 -29234 -16598 -11234 -9950 -3364 -7032 -10409 -9425 -8918
7103 -8918 -5123 3648 13130 17178 9501 2663 -7666 -10696 -13813 -14811 2370 10733 7955 141 11353
7088 11353 9632 -13985 -25992 -18657 6616 6251 5291 -5122 -14866 -11086 -18732 -29515 -26990 -15609
7074 -15609 -17310 -15902 -17978 -29661 -21045 -5990 3553 1091 -2458 -5415 -5833 -4758 -8773 -24976
7060 -24976 -36945 -28949 -13449 755 3241 -7222 -1505 -3797 -1124 7587 -3228 -21357 -33983
7047 -33983 -23484 -15365 -5616 4311 -2727 -2404 8712 1128 -2650 -3760 1397 -3555 -9228 -23452
7033 -23452 -21938 -10481 -15133 -16382 1244 4522 -1266 -11310 -4296 11925 22861 26803 15644
7020 15644 4405 198 5694 2988 -6183 -8161 -7459 -11329 -18849 -28186 -16514 2753 9581 3958
7006 3958 -4358 -10104 -15387 -14626 -5069 1304 1128 8753 6301 2796 89 6613 29309 30255 -2868
6991 -2868 -13518 -5452 474 6043 -295 -7096 -55 4493 10906 10744 -4152 -11964 -10341 -24146
6977 -24146 -29743 -10395 -13980 -5702 865 -52 682 -9188 -20953 -9953 -2354 1505 2229 -13771
6963 -13771 -18898 1343 -15 -10248 -5009 4598 10924 8416 7426 2165 -196 -16 -476 -11477 -12077
6948 -12077 -9722 -15465 -18686 -16969 -5124 -5112 -975 -265 -18160 -34449 -31019 -24965 -6099 -10486
6934 -10486 8316 7208 -6293 7133 -808 -10028 -7605 -14447 -21307 -13821 -3097 -3696 -9117 -6420
6920 -6420 -5823 5148 11667 808 -7357 -13045 -24240 -12651 2953 6441 9118 3505 13111 18304
6906 18304 14119 15002 9189 3287 -4045 -4779 -1863 2301 7414 3554 -1247 -1917 -3921 -8809 5374
6891 5374 -2976 -7559 -7031 -1099 1373 11215 1298 -5447 9136 5988 60 5635 17185 12346 -11940
6876 -11940 -16927 -4468 2241 -5512 -12682 -25956 -33066 -33850 -24326 -16181 -13168 -13636 -12465 -4388 4791
6861 4791 -418 -13811 -27511 -21457 -14319 -13615 -9426 -7347 -3216 -247 -2761 -3687 -10960 -7841 -8177
6846 -8177 -10840 -4487 5915 11645 6750 -4450 -15688 -11857 788 935 -3391 9486 9156 -2342
6832 -2342 2339 7183 3080 109 457 -2481 -465 13061 33728 24836 22701 17045 -4629 -17613
6818 -17613 -21180 -92 7152 4536 6625 8298 6017 14624 3304 -2321 -1881 -8436 -4048 8538
6804 8538 16763 19190 8079 1791 -8812 -8443 271 -5263 -2526 1487 1066 2447 -6288 -13072 -5932
6789 -5932 -11475 -11730 -8054 -15929 -14721 -10832 -4069 3001 16114 15786 10751 10737 12465 16030 13151 10748
6773 10748 451 -3221 3652 -4287 -8791 -6445 -5806 7965 16027 6135 1992 -8038 -12154 -26145
6759 -26145 -19996 -4915 9707 16396 8517 12251 9264 10330 22420 15660 11953 16327 28702 33123
6745 33123 12412 -396 6874 11004 8695 2208 -1769 -6236 3461 11884 14162 20152 28596 17166
6731 17166 6912 2613 -4542 767 -875 -584 1831 10455 12271 8114 -5187 -11648 -12083 -28337
6717 -28337 -33277 -19945 -2222 5473 15260 15928 3000 3423 4967 17902 14245 13190 18821 30231
6703 30231 38543 22366 11603 12132 17891 21119 20804 15996 11610 17205 10744 5383 6610 -3940
6689 -3940 -16697 -4546 4838 2884 2710 14339 15383 12610 5416 -3264 -8320 -3986 -8424 -17475
6675 -17475 -19404 -13848 -18173 -19146 -19050 -13472 1264 4894 -7120 -1678 -3838 -5065 -8516 -4641 -10600
6660 -10600 -6813 -13388 -18627 -25353 -14986 -8621 -19375 -22928 -20849 -10738 1978 2524 810 11659
6646 11659 5539 -2179 -6910 -10824 -16817 -19501 -6590 -6212 1061 7068 10829 3169 -11382 -22830
6632 -22830 -22825 -18211 -14182 -9504 -12985 -8735 -12559 -21012 -21218 -9611 9088 4280 8256 3537 -79
6617 -79 -4306 1069 1492 -10480 -24312 -13792 1041 -852 7247 3654 -15184 -7442 14229 21946
6603 21946 9249 -8430 -7445 -11935 -26514 -29868 -24753 -6540 11130 6539 -9295 -8667 -10637 -13316
6589 -13316 -17374 -13201 -14409 -11859 5509 15835 8864 -2849 -5076 -10206 -26657 -5170 16647
6576 16647 17338 9107 2103 -198 -13981 -14595 -20403 -22259 -17487 -15057 -26512 -30491 -22390 -21115 -13205
6561 -13205 -4419 -17955 -27254 -18875 -356 5766 -1997 -14720 -10792 -12201 1203 6277 -1089 3340
6547 3340 -11699 -18200 -12531 -1655 1999 -1530 -4537 -1197 2469 2869 5722 8136 -701 5191 18016
6532 18016 33456 42139 42792 28292 6770 -2841 -1108 -6970 -9388 -7499 -6455 -6726 -9500 -19532
6518 -19532 -5347 9243 27952 19129 9073 1481 4568 2249 12313 15366 19590 13605 -1713
6505 -1713 -526 4796 11701 -1826 -8919 -2462 -2648 -2309 -2363 5926 16752 27814 15339 18904 4754
6490 4754 -5446 -7447 294 17369 21027 9797 5867 2056 -2634 -7045 -22841 -26474 -18733 -14913
6476 -14913 -10233 -8583 -13727 -12879 -4659 -4886 -4994 -3071 -1707 383 -1661 878 7746 10180 10313 5389
6460 5389 3134 9610 3020 6270 -3640 -12733 -4958 7119 -13003 -15662 -4897 -1180 3990 1630
6446 1630 -4715 8183 21851 23353 18811 27374 35451 20318 -1533 -1188 -4594 -835 -3418 -9467
6432 -9467 13058 15721 4299 -7791 -9276 154 -12153 -14543 -19351 -12843 5634 69 -3067 -6242
6418 -6242 -14453 -24329 -17618 5568 26301 18078 1287 510 -7036 -23250 -22965 -7301 -5372 -19253
6404 -19253 -35545 -22041 -9376 -13722 -22618 -25124 -24312 -13505 -13186 -23580 -9842 -18582 -27188 -27367
6390 -27367 -19570 7792 6557 16641 21507 12881 7227 4778 4846 5292 1679 7829 17593 10717 -7632
6375 -7632 -7677 -8005 -10070 -11979 -2226 7981 4735 6863 -3556 -18123 -20377 -15431 -4649 10264
6361 10264 18100 5683 -8768 -714 -1013 -3204 -6423 -8842 -14799 -16229 3060 17377 12444 5484
6347 5484 12322 7009 -3829 -2555 10529 14173 4836 9594 18089 11999 4790 11484 19727 18336
6333 18336 14827 2830 6542 11014 12243 14848 8373 -5484 -13070 -8161 -5791 -10610 -15345 -24060
6319 -24060 -26239 -18503 -8829 -8488 -7225 -5065 -8283 -6630 -16141 -17129 -8789 -6715 -8189 -13826 -8806
6304 -8806 3333 3549 4670 -1004 2732 15953 15495 24966 30921 24210 16948 4970 -9164 -12935
6290 -12935 -9107 -5426 2785 4520 -2447 -6173 -2316 676 1498 5072 288 6221 -8058 -11810 -16488
6275 -16488 -22283 -25991 -18312 -13561 -17152 -11718 -9128 -9934 6642 4383 10915 12291 5003 15415
6261 15415 9396 -5547 -5261 2054 416 2245 284 -6528 -7071 356 -5393 -1553 -16537 -32626
6247 -32626 -30912 -26307 -18026 -16337 -8474 -10307 -16137 -22105 -19117 8357 25165 27996 23161 18264
6233 18264 -971 -3828 4053 15806 11251 22720 30378 18609 9281 -4393 -18579 -6034 -1304
6220 -1304 3734 12158 30749 30643 10054 -14249 -27839 -25724 -13116 7261 23962 21414 22605
6207 22605 17838 1173 -4658 -3086 -8839 6171 8422 -19821 -19404 -20008 -14304 -1761 2111 2052 6681
6192 6681 9466 9236 1793 -16968 -31708 -28826 -18541 -8216 -22196 -32042 -21796 -20197 -21965 -10338
6178 -10338 1459 1052 -1313 4359 20559 8640 -1759 -2230 -5944 1377 12944 3100 -6679 -4253
6164 -4253 -371 -8942 -7962 -12495 -6440 -297 9204 17817 14808 1442 -4421 -667 -5441 -3322 5644
6149 5644 7004 -2517 -7988 3181 18648 20772 9733 7397 6899 5765 8528 675 3167 2296 -5660
6134 -5660 -6100 -4237 -4204 -15343 -6266 8102 8282 13995 18621 14194 13413 14357 18796 8296 -4708
6119 -4708 -9475 -8298 -6889 -4397 -12418 -19038 -11872 2116 15919 11382 4005 -5483 5486 12548
6105 12548 12457 9382 12315 10828 16795 15110 11441 14318 10277 6057 -2210 -9968 -5265 560 -6470
6090 -6470 -13366 -20409 -27859 -11721 -1663 1016 -9810 -23430 -23570 -12573 -9011 -10473 -21252 -8450
6076 -8450 -1354 -3524 -12801 -14771 -9913 -10177 -7843 -12359 -16335 -25683 -15683 791 7683 9022 2945
6061 2945 4903 8321 9206 -2445 -3180 9166 16818 -2866 -11669 -7620 465 2804 -11182 -16281
6047 -16281 -12992 314 7561 6722 13156 19728 46014 35751 31267 14205 510 3496 -4567 -5826
6033 -5826 -2010 -1440 -6911 4982 11040 -1331 -3724 -16282 -20687 -15852 -9146 -6196 -13938 -7404
6019 -7404 -5057 -5396 5703 14794 21788 17940 10116 12692 15409 19845 8906 2787 6650 -7751
6005 -7751 -12118 -4054 -13206 -9620 73 2632 -6302 -11477 -11639 3596 4579 9000 15634 1321 -5216
5990 -5216 -10011 -2217 -1013 -19 -5959 -8146 -4373 -2723 4129 2395 -16816 -22120 -17075 -6434 -12211
5975 -12211 -15007 -17768 -13680 -8224 -7505 847 4147 -6027 -7342 -11048 -8508 -10977 -5328 2052 14440
5960 14440 13584 1477 -5653 -19298 -28585 -36803 -17291 -16863 -8063 1917 -342 -9632 -5451 -74
5946 -74 5939 9137 9610 -13054 -18155 -6453 -2007 -7415 -6758 -1560 -14118 -19444 -9389 -2402 -3930
5931 -3930 6784 9354 2674 5422 7962 20106 33149 16776 2304 8644 -1291 -10315 -15618 4457
5917 4457 23796 16184 -342 -7012 -12855 -20422 -34541 -28782 -21650 -17713 -18858 -3539 -8416 -7156
5903 -7156 1657 9921 2821 5810 3452 4802 -2173 1007 -1941 -1764 18348 11717 11580 14224 12326
5888 12326 25181 30245 20827 16676 21292 25588 29204 16487 23486 17516 9001 8176 2005 -689
5874 -689 8681 18979 21050 14110 -96 -9539 -11856 -5073 -184 -2347 1006 14883 25252 18610
5860 18610 -5698 -16103 -14717 -8169 -8544 -10065 -10592 -14532 -12064 -3909 -491 -9678 -9193 -4398 -4702
5845 -4702 -2454 3505 12014 11989 19522 24639 20537 4932 -11315 -14939 -18501 -18547 -10056 4615 9613
5830 9613 1581 -5482 -5812 -911 -8852 -15947 -9354 -8985 3392 14197 23009 29070 13496 -12232
5816 -12232 -18749 -8660 -890 6531 1972 -1483 -3763 -3503 -1853 1996 3305 6426 5106 16468
5802 16468 26871 22758 6584 1460 -11617 -10925 1218 4233 4772 16751 31872 18446 7750
5789 7750 8017 17889 16739 7647 9543 8454 7149 7102 11559 4733 -2403 -896 -549 -6226 -2401 8549
5773 8549 3565 17836 18308 29177 35945 17836 -951 -6947 1326 13113 3007 2902 16556 16770
5759 16770 -1328 -7318 -12887 -7942 -5723 -6634 -11782 -8194 1071 -693 -5741 6107 4196 -4705
5745 -4705 -4439 -5801 -14568 -20502 642 5931 15877 17762 8834 -302 -12736 -17668 -10987 -1584 -4577
5730 -4577 -1936 -589 5011 38 -4320 -7146 1388 -6030 -14602 -14086 -6912 -12342 -20178 -14950 -4122
5715 -4122 -3539 -1862 -3369 -10645 -23721 -17693 2248 7059 15344 23009 14012 13562 26317 10308
5701 10308 13344 21238 14892 6078 1082 5808 11640 10584 -1121 -5442 -15866 -9161 -4538 -6002
5687 -6002 -10526 -17398 -3419 -2309 -3164 -12671 -26559 -22636 -20881 -7371 -4098 5559 1103 -14380
5673 -14380 -5124 432 -9098 -15103 -7681 -7324 -9904 -12050 -8679 -137 281 1015 1147 2599 16834
5658 16834 18885 2722 5748 9100 10910 5765 -589 -5600 -6821 -11494 -11677 -25 62 1295 4889
5643 4889 4867 4811 11317 -1376 -6587 -6557 7753 9173 14127 7727 8040 2879 1928 7664 4573 4477 11862
5626 11862 13344 4439 -4364 -5155 5819 15130 19134 13115 8892 14460 6447 -1364 2450 5212 10749
5611 10749 16740 6153 2955 4988 10989 13927 4192 -10719 -10189 -7158 -7396 -9970 -13670 -29033
5597 -29033 -40640 -45063 -45497 -35398 -21223 -10557 -5240 -4840 4279 7175 14618 8326 644 -6939
5583 -6939 -20800 -19115 -19875 -30264 -37567 -20963 -19015 -20375 -20083 -5342 -6022 -8903 -20598 -17083
5569 -17083 -12852 -564 -3997 -1359 -4977 -18928 -22045 -14304 -5673 -1505 -9835 -10018 -10328 -25717
5555 -25717 -19346 -16064 -23498 -20059 -15228 -12946 -11126 -8244 -1317 6494 6113 8011 1544 11895 16955
5540 16955 13758 20503 9887 2387 -8401 -8912 -23204 -20013 -11479 -7006 -9718 -14822 -5275 -4365
5526 -4365 -5962 -1697 1635 268 15136 3087 2340 3426 796 -2608 -11878 -8031 -6352 -6418 -2409
5511 -2409 -6576 -20907 -31592 -27368 -12238 -13388 -16235 -3342 4812 -3409 900 7168 9666 7015
5497 7015 8905 20049 20631 12480 16262 21159 9546 -4925 -17933 -14815 -3661 3556 -1169 10466
5483 10466 23168 12673 12193 12233 1321 -9569 4283 -2749 -20182 -6439 3025 11415 13284 -1603
5469 -1603 9059 10110 5719 11570 9168 13653 15161 15352 8587 16317 23142 13175 21381 3210 -3534
5454 -3534 -1701 -3037 2097 4322 -2867 -11464 -15655 -22472 -22321 -10746 -12158 -12150 -21865 -26468 -22630 3883
5438 3883 21355 12770 -3228 1731 21332 16350 5123 11193 20895 25202 32083 25942 12042 7058
5424 7058 -3974 -8038 -16673 -18063 -993 9834 15927 9105 -978 -8159 -2436 -7288 1532 20186
5410 20186 19724 2301 -3775 -5902 -12493 -9672 -14183 -14629 -20675 -18156 -9691 1056 -12759 -13704 -6457
5395 -6457 1765 11743 7585 9736 12305 248 -580 5626 4213 -961 -3557 -4049 -10941 -16725 -8834
5380 -8834 -2149 -10288 -29366 -27326 -24202 -26003 -11185 3263 -1606 -4270 5696 -8818 -14776 -21372
5366 -21372 -29200 -18719 -18263 -18853 -24269 -13263 -5626 1343 7700 238 -4087 -5222 -3230 -4142 -21086
5351 -21086 -23453 -13976 4158 7072 -6415 -11244 -18610 -11474 -18306 -21798 -19763 -7387 -13561 -32530
5337 -32530 -23767 -7963 -6508 718 228 -101 -877 -5509 -11529 -16505 -9424 1991 -6751 -11623 -12363
5322 -12363 -11129 -4923 -21264 -30499 -27152 -19965 -1515 14998 17204 10272 8605 4077 -6018 -6775
5308 -6775 4600 13236 3660 -8178 -15354 -8961 1939 3295 8400 7289 10801 4420 -10403 -20621
5294 -20621 -22652 -28770 -29720 -25122 -22378 -12955 -9945 -761 15192 19579 13528 6176 10703 875 4612
5279 4612 -7818 -7505 2103 2144 124 1827 -12591 -33534 -26297 -2049 1522 -2907 -765 6088 3374
5264 3374 8739 7881 6596 7834 15807 1794 -7443 -5011 -18710 -9351 5408 -1171 -16227 -14681
5250 -14681 -15375 -10645 -2850 209 -12637 -7587 1152 -10840 -27600 -32383 -15373 4033 11761 -953
5236 -953 -19863 -13960 -9902 -10481 -3444 -9133 -23409 -25734 -23433 -12308 7908 22497 19045 -5788
5222 -5788 -13501 -10508 2867 3652 -4811 1774 16472 26300 20976 5677 -10877 -20353 -21230 -31869
5208 -31869 -30566 -23825 -9246 3916 6675 463 -5059 -11258 -7821 6399 16062 6330 -8108 5135
5194 5135 5327 -10206 -13678 -13532 -10278 -3483 4348 3033 1569 9414 4508 5846 -2524 3003 11609
5179 11609 7620 3664 -3333 -4044 -12405 -9050 -2151 -4726 -19396 -35140 -17463 5633 6541 5628
5165 5628 -6085 -14382 -26711 -13053 7325 4039 5241 -5529 -1686 384 -10242 -16952 -7696
5152 -7696 6806 7461 -690 -4598 6017 1464 5596 -1550 -19051 -14048 7167 17557 5682 -3130
5138 -3130 -8304 -5672 9311 18490 21198 11852 1813 -3061 11950 16457 18483 12670 19466 26269
5124 26269 14200 477 -10952 -28679 -36345 -33084 -32011 -19363 -2143 16121 20392 24372 17548
5111 17548 -7414 -13295 -1485 -4271 -15758 -4958 -1965 -7520 -2441 8312 8187 2788 982 11879
5097 11879 11322 -8504 -11816 -10361 -9034 4945 11918 11970 -7094 -9306 -629 9767 5031 -4238
5083 -4238 -14042 -21624 -17241 -3561 1756 -1050 2827 7043 6493 9378 12123 7293 -7286 -19891
5069 -19891 -23046 -17116 -3320 -293 4227 -5095 -9500 -12618 -25481 -32619 -31974 -34592 -35535 -14600
5055 -14600 -607 2238 796 -601 2707 16862 19452 7910 2855 7098 6590 1305 -8428 -16170
5041 -16170 -19183 -8393 -8626 -6837 -6701 -822 3229 1084 -344 -7398 -3790 -2192 7595 19762 24032
5026 24032 14793 -4774 -16217 -4469 -7842 -12734 -10720 -128 6610 5240 -326 -2744 3058 12697
5012 12697 19861 9713 -4472 -14352 -8011 -6939 -5377 -12829 -16258 1307 2920 -3035 -22095 -33543
4998 -33543 -37855 -36484 -16350 -4908 -521 -6638 -8013 -16937 -15004 -1629 10419 25751 20524
4985 20524 18054 10687 1583 -566 -1755 -7077 -5193 -10650 -22132 -22755 -17579 -18924 -13200 -1526
4971 -1526 -9048 -17059 -20489 -20424 -5331 -2889 -7390 -5970 -1919 3701 -3940 3312 4548 3880 15406
4956 15406 17980 17448 13320 9923 1365 7593 5684 10331 15200 9119 11283 12846 14541 -1639 -13524
4941 -13524 -16555 -10387 -424 -1039 -9152 -19226 -4332 14292 24278 15797 -5790 -965 9881 182
4927 182 3030 17868 12879 10096 13526 14319 9758 15578 6794 4603 -3820 2786 2929 -1305 -5216
4912 -5216 -13638 -5214 1183 3294 -3511 -6911 -8628 -2110 -7037 -9201 -11375 -7439 13113 5597 783
4897 783 8847 10674 8531 1331 -13047 -14625 -5088 -1137 -3688 -2336 2706 9072 19563 20257 13084
4882 13084 6824 1634 -229 -4579 -8920 -15379 -28752 -34301 -21672 -2337 8511 16464 5681
4869 5681 -5457 -6157 -7939 -8734 -6558 -12499 -17153 -14706 -18922 -19241 -11261 -3377 -8457 -13297 -7894
4854 -7894 -1060 4710 320 -10927 -14965 -16208 -7869 -8288 -6452 -6838 5613 -154 3927 5331 -5737
4839 -5737 -21742 -28513 -22083 -750 1882 -14695 -12341 -3742 8970 16647 11741 7916 9518 7823
4825 7823 -1862 3502 8742 14043 23496 14306 -1684 -14005 -4148 9719 14650 5819 -11571 -11741
4811 -11741 -8821 5436 8295 -5526 2802 1612 -1015 8471 23366 20828 8667 3140 6314 -4390
4797 -4390 -20865 -27090 -17840 -21120 -23329 -25635 -25212 -25436 -31205 -29682 -21351 -10631 -12993 -15511 -12745
4782 -12745 -4633 -8882 -6313 -4064 -1154 856 1930 -963 -5282 -5962 -20185 -16041 -16090 -15287 -3454
4767 -3454 7087 16819 4444 1726 -1635 22 -3656 1358 17076 25206 17529 2618 -11062 -8630
4753 -8630 -2854 -3114 -1669 6883 13458 -2584 -5258 -3517 -7543 4042 -4170 -8463 -744 6810 11902
4738 11902 1941 -6519 -5698 10019 17831 10693 3729 -7379 -12765 -9799 -7490 -14132 -6063 -5436 109
4723 109 10326 16692 23846 13770 17168 21647 20486 6190 -8210 7383 26634 17722 15035 25082
4709 25082 37692 24035 -803 -4742 -11071 -5324 124 -12154 -6074 -4071 -8464 911 3130 -19319
4695 -19319 -38753 -30504 -17154 -20113 -26737 -20663 -2383 18 -3756 4636 8265 13641 18831 3805
4681 3805 -7937 -3769 6795 1127 -13668 -15297 -18636 -34937 -31828 -32494 -39649 -34238 -19128 -16377
4667 -16377 -18612 -11347 4667 7750 18178 4897 1824 -10873 -22257 -23366 -24263 -21313 -32506
4654 -32506 -30582 -35505 -35318 -38788 -29164 -3013 -3281 -8489 -14024 -11168 -3380 638 3509 12060 7880
4639 7880 1253 9912 12595 -2837 -5643 -16444 -18468 -27269 -35163 -9519 6996 2430 2761 7826
4625 7826 8955 7546 6857 4407 -1522 4439 9890 11218 12489 19836 26622 25519 20000 6733 -5638
4610 -5638 -5086 -7021 -10481 -14325 -13625 -10633 1069 5158 1982 9239 7110 10871 25409 20944 -782
4595 -782 -8317 -4868 -8946 -19037 -36124 -35130 -23887 -13852 -5438 693 2840 -4360 -6157 -13847
4581 -13847 -18592 -12772 -5899 -6630 -11320 -2782 -5765 -1680 2806 -4553 -3904 5393 3762 429 6944
4566 6944 1522 -4939 -6827 -1551 10010 23069 16195 6950 10078 6552 2860 775 -4645 -12734
4552 -12734 -4533 11993 20794 6218 1697 6360 13873 3088 -3162 -10125 -9921 -8832 -9188 -16477
4538 -16477 -16994 -9749 -3046 1572 4380 5623 -481 -21542 -29646 -17659 -8480 -8542 -10668 -10303 -5448
4523 -5448 5459 4520 -13793 -20004 -5236 12267 19989 14328 -1027 -4047 -14943 -26607 -36459
4510 -36459 -31511 -15167 -13459 -21741 -20458 -31514 -17611 -16724 -23127 -23517 -25612 -31627 -24483 -16315
4496 -16315 -7981 -1293 5047 6286 11638 -4083 -6916 -12873 -13624 4261 -5023 -22811 -21285 -26658
4482 -26658 -24614 -22326 -9997 2236 -4774 -1432 -6549 -1483 8016 11781 17071 16039 10933 13145
4468 13145 12263 -4381 -4831 3942 215 -7728 -219 7428 -2384 -1286 5814 5416 -4148 4288 204
4453 204 3578 11343 13098 15571 6411 2334 9957 4128 53 3719 9333 8795 -11259 -7937 -15360
4438 -15360 -7812 -12332 -15405 -2035 -6292 -16886 -4138 3963 13879 19993 15094 12254 2208 4944
4424 4944 13028 11711 11396 6639 8602 6994 7514 984 -12612 -11605 -7393 -16702 -10639 -13847 -28176
4409 -28176 -28066 -20589 -9171 -518 8269 13845 15953 841 -1757 -3014 -12487 -16456 -27241 -37205
4395 -37205 -20550 -5617 2741 8896 30722 32592 24598 17776 -2407 -13948 -14905 -19279 -23146 -14014
4381 -14014 2860 14640 21309 5351 -9740 -11836 -11990 3730 -2406 -7605 -6257 -4243 -8237 -17294
4367 -17294 -14823 -13313 -10871 -5189 2938 -4064 -6706 -11666 -10516 -14102 -10619 -1022 6972 3605 -1243
4352 -1243 212 5960 -4777 -7618 -5132 2572 3554 -824 3790 13575 -376 -1293 2090 -748 -4700
4337 -4700 -7389 -5104 -1214 -16865 -15447 -15357 -7160 1791 -1897 -2372 8611 12460 14177 6858 -5950
4322 -5950 -246 3814 -5946 -16568 -8577 1509 -5693 3087 4808 8455 17023 19324 15181 5738
4308 5738 4162 -2298 13720 -472 -10026 -9414 -2433 -8123 -15561 2796 15998 19570 11408 6342
4294 6342 1644 4527 -931 -4424 -2950 -7812 -12186 -3420 621 -11844 -18435 -29174 -8970 12412
4280 12412 25777 15105 8677 3580 1062 7399 17584 8145 4247 631 4777 1918 4270 259
4266 259 5094 3008 11668 23020 31588 13707 -3340 -4849 2799 -9501 -11255 14123 14301 14001
4252 14001 247 -7740 -10020 -3812 -1728 4732 -37 -21598 -30353 -28941 -19620 -21672 -27037 -30425
4238 -30425 -24457 -8142 6560 -2543 -18435 2401 11158 2772 1853 4032 -5535 -15788 -9937 -11139
4224 -11139 -13103 -11121 -309 2010 1613 11167 17999 10208 21804 21485 18896 6383 -6411 -18219
4210 -18219 -18588 -22181 -12103 -1647 1828 -5426 1817 12261 10099 14611 13006 16460 5914 -6341
4196 -6341 -7815 5360 16816 13488 950 119 -4747 -6234 -2481 8015 67 3398 5277 14054
4182 14054 9320 -6994 -15163 -13658 -14198 -15256 -18635 -12251 -1508 -2730 -5127 -4209 -5741 11702
4168 11702 14333 15335 2602 -5727 -18475 -13072 -11620 -7288 -5043 -6643 -7551 -7190 -4501 2077 7294
4153 7294 12388 -1270 -22688 -22655 -23912 -27488 -23001 -9195 5494 5615 -9437 -10021 -5894 -8698 -15675
4138 -15675 -9113 3430 2736 -2208 -8893 -1785 2602 3711 12004 11435 -8721 -18721 -11928 -1680
4124 -1680 993 -9592 -16306 -16384 -12609 -14816 -15012 -6895 -6250 -6383 -1352 8557 10097 6403 9079 5440
4108 5440 6434 11241 -57 -1765 1291 -1847 -6407 4927 9442 8549 6282 7335 9476 15660 13171
4093 13171 6859 1158 -134 -103 -8410 155 17654 19380 17463 13726 555 643 -13217 -24110 -31530
4078 -31530 -40192 -37103 -33633 -28085 -28672 -26759 -29587 -29745 -19600 -6842 6583 16670 17388 7919
4064 7919 -5010 -8362 -10054 -12342 -17188 -18621 -21921 -18057 -637 7619 -5149 1858 9307 4905
4050 4905 5764 8855 7758 -3617 -15604 -12136 -159 -3533 -17923 -21697 -14892 -1673 7107 9315
4036 9315 -34 -4263 2383 6661 4009 1806 -524 3332 11645 8851 7807 8292 17856 -1888 -5821
4021 -5821 -2843 -5634 3871 16238 15334 1917 1332 4863 9576 13623 12929 19302 20330 16361 17003
4006 17003 24399 21436 19537 25998 20392 14750 7287 9506 15110 24245 29696 24479 20075 13692 -4
3991 -4 -2069 -2510 -6505 -13834 -23475 -4969 9644 4826 3498 -10848 -21596 -17154 -9474 -14590 -6054
3976 -6054 -5789 -3316 856 600 -6540 3562 415 3348 -6468 -14121 13 -1172 -2845 -353 -158
3961 -158 3056 780 8051 958 -14523 -10078 1058 -3724 -11468 -5868 -10826 -18521 -13943 -25391
3947 -25391 -32857 -28931 -26649 -19089 -2000 4700 4709 5561 3631 -7698 -9595 -12635 -16802 -27415 -23463
3932 -23463 -23304 -11967 -10590 -14506 -9325 -7369 -12435 257 -1310 -6025 -14836 -14042 -18453 -20328 -16521
3917 -16521 -7356 -1065 -12067 -7723 -3314 -8885 -1393 11182 9010 -5767 -3789 -6249 -9987 -14753
3903 -14753 -9680 -7267 -4185 3832 -1564 -88 -5958 -14637 -26073 -34213 -19283 -629 16310 17530
3889 17530 21670 28767 7509 2524 14802 35705 31689 20175 14372 -1635 -4741 3823 203
3876 203 -941 -4533 -631 710 -3888 -9861 -3089 -14608 -20370 -3928 11051 3773 -12189 -16941
3862 -16941 -3142 -1155 1444 1759 3071 2149 2640 -11558 -13988 -14375 -16699 -13723 8746 3601 -12902
3847 -12902 -21423 -17849 -4572 -5463 -9327 -2646 349 4860 11045 7517 -7455 -3627 12783 -11
3833 -11 -5368 24 -1087 -5964 -2466 10415 14637 7419 15435 180 -2926 5323 -1401 -629 16261
3818 16261 8889 131 -4631 515 1353 12772 19651 6191 -14333 -20773 -8289 1663 4746 11348
3804 11348 13578 20873 19989 13443 11437 3891 -4252 -9333 -4592 -10917 -20562 -19179 -19498 -16386 -6192
3789 -6192 4701 -621 -10972 -14560 -2057 -3833 407 7496 15420 23333 9420 3553 -10851 -9702
3775 -9702 -2190 3179 2950 11284 15968 12829 8285 8684 3429 -17079 -16418 -2580 -3984 -4561 -1056
3760 -1056 -327 -6865 -13213 -11925 -8636 -13908 -14658 -15911 -25593 -13193 -11436 -15257 -13104 -8890 -9256
3745 -9256 -15835 -12184 -5045 -11368 -11239 -14371 -21974 -22223 -20464 -18778 -3877 11614 10895 -63 -9080
3730 -9080 -7307 13512 12774 6396 8717 12892 26018 15982 6468 6792 16505 19473 9800 -1508
3716 -1508 2812 6147 6741 -269 8013 -5571 -11442 -8307 -6470 6194 12321 9943 4204 -2947 -11609
3701 -11609 -10476 -6092 3879 -1068 -9152 -2379 6594 -5071 -6005 857 2470 -830 2290 14391
3687 14391 15976 14273 4665 4510 5818 3351 2428 9087 -1768 -10110 4137 17795 26123 26798 24592
3672 24592 10250 -14172 -20474 -19927 -11581 -12656 -20727 -17644 -12152 -3965 4464 -6463 -12383 6093
3658 6093 6475 -7659 -3088 -4463 -3937 -11914 -4341 2608 4250 11666 19185 16269 63 -1673 8160
3643 8160 12769 23746 4686 -7697 -6208 -4503 -507 -2779 4336 13697 26393 21454 15806 -64
3629 -64 -16015 -12248 7219 7511 1015 6939 17783 24814 24053 13517 -5299 -10580 -8070 -8680 -10558
3614 -10558 -17369 -10465 1853 5148 2670 -9257 -12531 10145 28016 17166 7116 -8060 -16629
3601 -16629 -17572 -3096 7450 13383 2718 -5254 -7353 -1290 -7393 -14929 -17718 -17192 -13608 -13855 -12561
3586 -12561 10719 11759 10141 6993 7922 2995 -12388 -15734 -9134 -6837 -4771 -1532 1761 1508 5176
3571 5176 -996 -7943 -6349 -5784 -1154 4880 4440 -4740 -11011 -19847 -30423 -38217 -53820 -42388 -27979
3556 -27979 -16386 5155 9582 6507 -6569 -23684 -14057 11293 29450 18607 16130 9104 11798
3543 11798 4982 2964 7991 4533 5443 8113 -2066 -1836 5926 11662 -3207 -11501 5639 15368
3529 15368 -262 -2626 88 -11070 -11613 -17267 -18273 -16942 -8922 -1623 -658 10325 -118 -5968
3515 -5968 -30184 -37220 -29574 -20684 -16982 -18011 -16292 -13375 -18627 -16473 -8355 183 2105 -20 4656
3500 4656 1170 -11774 -16407 -3389 12089 11437 5942 10461 8669 6262 12914 24891 23318 6112
3486 6112 2430 204 -987 5221 -3502 -7239 12086 20396 7140 6280 10126 -5360 -10281 109
3472 109 8344 997 -635 4995 -12683 -27510 -25744 -307 10466 6516 -334 12645 5749 1131
3458 1131 24475 25093 7359 7293 15466 23684 29774 15399 7850 5545 4418 13450 15878 10152 13750
3443 13750 24353 6818 -6672 -2890 -4337 -3929 -8714 -13056 -6739 -5590 -7607 -12826 -18405 -22778
3429 -22778 -20993 -16762 -10291 -7373 1642 4510 -2698 -6330 4163 10069 9877 8334 7063 3295 -248
3414 -248 6325 10767 -2264 667 -16741 -5788 -1688 -20649 -13701 -2781 -2499 9369 11789 4341
3400 4341 -11209 -7299 -5637 -15401 -22093 -11323 -13103 -15866 5434 10474 -4116 -17378 -20269 -25547
3386 -25547 -18598 -9567 -5345 -11787 -17747 -18577 -7421 -5333 -2216 3093 832 -2480 -6317 -12354 -7280
3371 -7280 -4190 -3146 -8536 -539 6741 9343 10029 7311 15799 5312 -374 9903 13130 18946 17416
3356 17416 14683 13520 6460 -718 -16783 -19775 -18353 -20835 -14475 -13725 7128 17497 -2997 -6519
3342 -6519 2962 8181 537 17254 16183 4729 2012 -4232 4168 3542 -9435 5127 30876 23038
3328 23038 4460 987 2629 8574 13781 28650 28691 26973 22957 11810 -1706 -5966 -7834 2342
3314 2342 2101 1905 5875 18051 21010 29202 20790 2770 -6764 -7069 -7574 -5610 476 13076 18711
3299 18711 12207 -2046 -5222 -11871 -14790 -2549 5640 4551 8379 11102 5430 2126 7716 5976
3285 5976 -2822 -6891 141 5992 12236 21700 26590 22034 32151 32231 19312 -4398 -12787 -7600 -12646
3270 -12646 -13575 -8352 -4245 -21368 -31838 -31389 -26202 -14831 -21763 -27154 -17960 -11151 -7545 -15941
3256 -15941 -11114 -8376 2125 4998 -1345 -13123 -6607 -320 2766 354 9025 2173 -3890 2508
3242 2508 -116 -10103 -7696 -15990 -6749 -4503 12664 22868 20071 1072 -5690 -328 -6127 -9479
3228 -9479 -2745 -9691 -5537 -3061 -4513 5398 -656 -16852 -30269 -22108 -9255 -125 -660 5903
3214 5903 6576 8969 11578 7664 -10038 -22689 -30781 -27844 -23913 -18579 -13734 -11251 -2353 1 -4909
3199 -4909 -1703 -2127 1635 10573 20508 6187 -2261 45 -7405 -17682 -19621 -18244 -20138 -15390 -8148
3184 -8148 -6847 -14742 -16548 -14589 -8700 2376 4028 3093 11893 22555 9648 1625 -6010 -4510
3170 -4510 10110 12692 10887 9715 1802 7688 5768 -1219 -9963 -23166 -14835 -10311 -11652 -1375
3156 -1375 1471 838 -2255 -3421 -468 3970 -2066 -10370 -21402 -22220 -12672 -16907 -20402 -23541 -18479
3141 -18479 -19291 -24447 -31284 -32316 -18567 -1009 13244 8370 -5723 -7227 -499 2416 -3062 -12883
3127 -12883 -12918 2196 2418 2987 -193 -6772 -9968 11415 14656 6229 823 7307 6849 -1105 -7806
3112 -7806 -7533 -8703 -6468 1499 10722 7788 -4067 -7264 2725 4588 -384 2599 -10149 -11290 -10942
3097 -10942 -8864 4831 8336 -1419 -15938 -18500 -12319 -18835 -17860 99 4630 -8272 -19854 -10032
3083 -10032 -10126 -13308 -20005 -22347 -3211 10897 15657 11396 14835 12077 11198 15694 10417 -2055 -13433
3068 -13433 -15834 -6538 -14547 -8885 -18135 -24133 -33574 -26222 -6639 951 -2289 -1086 3952 -2440
3054 -2440 -5232 7081 8105 11151 7237 7782 2842 4822 4980 -1449 -1147 -4502 -2639 1730 1290 5099
3038 5099 11004 13270 20705 14941 750 -8845 458 15599 8375 3121 6352 217 378 8996 6828
3023 6828 -4757 2771 8410 4653 -1411 -12370 -10691 -6463 14313 17503 8053 -14022 -20405 -8265
3009 -8265 -5623 7450 16228 10474 820 -7663 3777 20998 23307 9387 6735 10768 19585 22818
2995 22818 12659 7334 4061 18198 7955 -2318 854 13187 17704 21542 23568 36630 30525
2982 30525 20056 -5303 -10695 -3501 13784 14822 15125 20022 13317 774 9597 14209 3067 -993
2968 -993 2919 14992 18350 10863 -6055 -14262 -116 -2860 -22514 -12283 -1822 11318 2611
2955 2611 -601 4853 722 6074 16084 6953 -13100 -16653 -13650 -498 -3576 -11335 -17330 -12769
2941 -12769 -7354 -9323 -7056 -4739 -4690 -10415 -1764 8542 11609 -7025 -21333 -9146 -14952 -18883
2927 -18883 -13585 1960 -5654 -16903 -20109 -7628 -17481 -5623 -9876 -4911 8463 11123 15874
2914 15874 16880 14358 4003 17446 18490 12994 13250 15668 20215 20618 17446 14241 6920 -1968 -6395
2899 -6395 -19372 -19506 -18896 -20405 -12226 -7379 3591 20419 19391 11919 15857 15923 3405 -2975 14720
2884 14720 20826 13843 7598 8335 8613 6157 -8675 -17520 -16372 -19630 -17219 11607 20270 6368
2870 6368 10013 16928 9883 -3976 -7919 -6298 2950 6520 -9103 -17977 -12928 -2171 -13427 -10303
2856 -10303 -10621 3281 15829 8542 452 5581 -1367 -10526 6966 19136 18079 9916 2054 4937
2842 4937 3435 -6320 -15069 -2759 6315 16469 21111 16239 15267 23151 16455 11298 16855 17285 19326
2827 19326 11267 -2124 -2256 -2103 -1647 -6185 -4303 -4999 -8859 -5454 335 -4005 -13613 -6793 3231
2812 3231 -10971 6123 15133 19476 2196 -13993 -11808 -17472 -22194 -5584 6741 10112 -4721
2799 -4721 -14417 -23785 -15222 -17479 -17488 -24053 -30628 -27710 -10503 -4108 -11709 -7736 10410 -1762 -3220
2784 -3220 -308 805 4847 8301 -11146 -18958 -5917 -4607 -18290 -26723 -33139 -14098 -4773 -17150
2770 -17150 -14395 -10566 -7216 -12854 -9059 -4658 847 4375 -8817 -11960 -14053 -22802 -5847 19147
2756 19147 7815 6951 12794 5292 -5278 1548 22663 23818 17695 9111 6667 -899 4127 8907
2742 8907 -892 -1049 -6747 2178 15959 22117 16764 5334 6772 11416 10426 10677 9721 5876 8173
2727 8173 11022 4925 -1598 -12524 -12565 3864 3707 10469 18367 23366 11995 15126 22311 26567 12510
2712 12510 10304 20897 18887 16848 17488 4282 4471 17711 23937 7343 8963 11551 1661 -5362
2698 -5362 149 -698 4657 2336 -5188 1675 152 -7263 -11901 -7576 -3666 4682 10267 17122 2706
2683 2706 -10571 -9109 5837 -4388 -8589 -3691 -3228 -7474 -9896 -2222 -3727 -505 -14435 318
2669 318 10443 3516 -4230 -13748 -24468 -9898 1286 -2300 -13661 -28213 -21030 -16429 -8258 -18082
2655 -18082 -19789 -7130 -8321 -2291 8425 -5068 -12112 -8742 -18099 -8233 -1459 -7766 -23858 -27865
2641 -27865 -7153 1883 -9944 -11005 -9389 -8427 -4380 -3370 4073 -1397 -3067 1746 200 5779
2627 5779 11745 9906 5556 6348 -3873 -660 1607 -523 -13009 -11605 -2605 -2000 -6986 6184 19922
2612 19922 16370 -3364 -5546 3695 -2625 -11949 -9016 -9473 -12651 -473 3222 11750 23535 19400
2598 19400 17327 386 -15076 -23583 -10130 3667 12565 17805 12414 11322 13035 10817 14591 17489
2584 17489 14658 5292 8571 12039 8948 -623 -13006 -12853 -12030 -9876 -1503 4699 7233 10090 2754
2569 2754 -9132 -16773 -15640 -19372 -17664 -13031 -7881 3641 15043 -2775 -20056 -6664 -8719
2556 -8719 -15946 -4339 11370 12583 6353 -8421 -5548 1927 2594 -8207 -532 1510 3609 8267
2542 8267 -7569 -19109 -23846 -20793 -2919 -3008 -1706 -3167 -9093 -3082 12725 8699 16659 17629 5679
2527 5679 3993 10447 2189 -10386 -11224 -16072 -5496 13861 20657 20991 4383 -3053 -3656 -6681 -10332
2512 -10332 1273 -4846 -2813 4639 3481 14858 12126 6372 7533 10470 22727 20423 7471 744
2498 744 3647 5975 17386 21222 13062 12839 17552 18554 21954 12863 292 5284 9256 16241 17053
2483 17053 19020 11403 3015 -5224 4241 23052 20646 13237 7239 21630 34045 26340 4756 -6295
2469 -6295 -836 4437 22713 24786 15455 2890 5599 6786 -5509 -12557 -13293 63 5994 6455
2455 6455 5025 12172 13911 24386 23938 17517 -547 -6298 -2091 3569 7446 3677 -4827 -796 9427
2440 9427 15646 19850 16181 8892 1004 -5495 4673 10393 7025 3170 17101 28983 23630 529
2426 529 7182 3466 7460 13259 7960 10867 14292 2731 14564 28189 33375 26581 15433 3517
2412 3517 5765 14190 9353 -1973 -370 6739 11108 14509 15235 -1179 -10402 -10433 -14387 -714 -6411
2397 -6411 -7438 -971 -13024 -9961 -13955 -24059 -36759 -27509 -16032 -13606 -17882 -18437 -21862 -11925
2383 -11925 -10860 -16094 -25330 -21625 -17501 -7929 -4578 3302 8686 5759 -2319 938 5979 2575 -1741
2368 -1741 1497 3038 -8782 -5921 4388 -6071 -9193 -9992 -8007 1931 8681 5773 -13189 -11562
2354 -11562 -2214 3026 -5359 -8475 2997 9468 7811 12857 -6825 -15654 -6168 -2406 -13012 -14969
2340 -14969 -6001 -7300 -13373 -12672 -16269 -16284 -19781 -24432 -18547 -16484 -22632 -24463 -23925 -14551 -13254 -10409
2324 -10409 -17683 -28071 -25100 -18121 -9779 -6017 -9023 -8277 -2518 -7235 -13851 -4579 1384 -5974 -11037
2309 -11037 -2024 3909 9721 10636 1100 -3380 -3340 -2210 2666 -2749 -7986 -13143 -1362 11341 8619
2294 8619 4898 6332 14837 14374 1036 -6138 -163 5863 10185 3909 -1810 -6285 -2324 5092 13796
2279 13796 8768 -7892 -17814 -17558 -20691 -22487 -7375 881 -4270 -11322 -3946 -3085 437 -3983 -8308
2264 -8308 4342 8051 -595 -418 -2486 -5487 -9415 1746 5729 10661 14783 21336 30594 28031 10056
2249 10056 4126 1897 -4212 -2167 2394 -3012 -12160 -19437 -29421 -27150 -11996 -6162 -12420 -5036
2235 -5036 2140 13213 16 6768 18988 477 -10401 3748 9584 3203 1159 -2484 13212
2222 13212 15793 19936 36666 36100 20772 15373 18915 13042 10288 -2882 -10759 15209 18597 -1532
2208 -1532 -12604 -10436 -738 4146 21569 41832 36931 4936 -3697 -9586 -11849 -15616 -22541 -12861
2194 -12861 -2397 -6016 -7401 -7181 -9364 -1746 -3404 -10649 -4588 -4721 -11106 -3387 5187 14772 -4870
2179 -4870 -10734 -88 4351 5405 1158 1182 -7229 -5155 -18036 -5825 13036 12060 -8499 577
2165 577 13268 20667 7563 -2234 10125 15813 9719 5951 1292 -8519 -15467 -14145 -2882 -2525
2151 -2525 -7163 -9037 -5806 -10005 -17740 -28933 -24457 -7518 18357 14467 14789 15276 21348 19945 17782
2136 17782 12217 11372 21667 2341 -14011 -13350 -15639 -5266 9667 24256 17347 20788 23693 21817
2122 21817 16176 23379 29665 22881 2176 -6390 4129 14013 17093 11095 7203 1754 -6276 -16175
2108 -16175 -23442 -13456 -1763 -3567 -9121 -2799 -2439 2453 11087 7689 18443 10935 -6434 3197
2094 3197 15513 18312 9445 9181 4882 432 14891 -500 -11661 -4787 -3921 2061 3688 -2667
2080 -2667 -6438 1731 7930 -5036 -17829 -17610 -7499 13354 15592 9302 -6662 -15834 -4147 5152
2066 5152 16074 11080 14740 21725 15710 7828 -7517 -6378 5102 18714 19104 7734 -5494 -7016
2052 -7016 1037 -2444 -19138 -26407 -19601 -22925 -20324 -18607 -16420 -5308 5018 12847 22153 26742
2038 26742 30706 29414 18064 3598 10467 22154 20442 25542 11768 -2616 -6991 -7352 -526 -8789
2024 -8789 -22124 -27173 -19354 -7562 -4289 -3760 -1223 -2079 -2549 -11436 -15051 -9050 -1136 10929 5668
2009 5668 6060 17099 23170 12575 1479 2557 7089 13689 6764 -2587 -6368 1748 -1941 -6340
1995 -6340 9797 10770 -2515 -4119 1729 -6479 -7773 -5094 -12234 -17081 -11343 321 -1673 -3556
1981 -3556 3795 5780 9213 10943 9656 13653 26461 19989 5921 -1412 -7280 -9984 -10145 -168 7386
1966 7386 7782 6320 -2591 -8229 -13399 -8991 -1441 4401 -2587 -17265 -19851 -12284 -9126 -3065 -8854
$$ [...]
##END NTUPLES=NMR SPECTRUM
##END=
