##TITLE=Analysis number 328847
Compound Code cc 12801
Book Reference lab3
Project Code adrs
Chemist Name stores
##JCAMPDX= 6.0         $$ Bruker NMR JCAMP-DX V2.0
##DATA TYPE= NMR SPECTRUM
##DATA CLASS= NTUPLES
##ORIGIN= Bruker BioSpin GmbH
##OWNER= nmr
$$ XWIN-NMR		Version 3.5
$$ Mon Jul  9 14:06:55 2007 GMT Daylight Time (UT+1h)  MAYBRIDGE\nmr@NMR_250MHZ
##.OBSERVE FREQUENCY= 250.131544655141
##.OBSERVE NUCLEUS= ^1H
##.ACQUISITION MODE= SIMULTANEOUS (DQD)
##.ACQUISITION SCHEME= undefined
##.AVERAGES= 16
##.DIGITISER RES= 18
##SPECTROMETER/DATA SYSTEM= dpx250
##.PULSE SEQUENCE= zg30
##.SOLVENT NAME= DMSO
##.SHIFT REFERENCE= (INTERNAL, DMSO, 0, 16.522)
##AUDIT TRAIL= $$ (NUMBER, WHEN, WHO, WHERE, WHAT)
$$ ##TITLE= Audit trail, XWIN-NMR		Version 3.5
$$ ##JCAMPDX= 5.01
$$ ##ORIGIN= Bruker BioSpin GmbH
$$ ##OWNER= nmr
$$ C:\u/data/dgb/nmr/ADRS/680/pdata/1/auditp.txt
$$ ##AUDIT TRAIL=  $$ (NUMBER, WHEN, WHO, WHERE, WHAT)
(   1,<2007-07-09 14:06:32.66 +100>,<MAYBRIDGE\nmr>,<NMR_250MHZ>,
      <created by zg, POWCHK disabled, PULCHK disabled
       configuration hash MD5:
       76 6E 9A 78 1E 09 19 81 EC 84 63 8F B0 6A 59 2D
       data hash MD5: 64K
       35 9A 1B E4 DB 1C D7 F3 AF C8 57 96 E9 50 A2 A6>)
(   2,<2007-07-09 14:06:45.06 +100>,<MAYBRIDGE\nmr>,<NMR_250MHZ>,
      <Start of raw data processing
       ef LB = 0.3 FT_mod = 6 PKNL = 1 SI = 32K 
       data hash MD5: 32K
       74 D2 AD F9 29 3E 87 07 7E A7 C8 0E 74 9B 86 BE>)
(   3,<2007-07-09 14:06:46.77 +100>,<MAYBRIDGE\nmr>,<NMR_250MHZ>,
      <apk 
       data hash MD5: 32K
       76 42 CE 3B 52 28 94 A3 08 20 65 A3 E9 B5 AC 30>)
(   4,<2007-07-09 14:06:47.56 +100>,<MAYBRIDGE\nmr>,<NMR_250MHZ>,
      <abs ABSG = 5 
       data hash MD5: 32K
       58 BC C9 6C 37 B1 83 27 D0 16 E6 D4 98 22 38 0E>)
$$ ##END=
$$ 
$$ hash MD5
$$ 4D 9B 60 57 3A FA 40 F7 A3 F5 0A CF 2A 80 26 A4
##$RELAX= 
##$RELAX= 
##$RELAX= 
##$RELAX= 
##$RELAX= 
##$RELAX= 
##$RELAX= 
$$ Bruker specific parameters
$$ --------------------------
##$DU= <C:\u>
##$EXPNO= 680
##$NAME= <ADRS>
##$PROCNO= 1
##$TYPE= <nmr>
##$USER= <dgb>
##$AMP= (0..31)
100 100 100 100 100 100 100 100 100 100 100 100 100 100 100 100 100 100 
100 100 100 100 100 100 100 100 100 100 100 100 100 100 
##$AQSEQ= 0
##$AQ_mod= 3
##$AUNM= <au_zg>
##$AUTOPOS= <50 >
##$BF1= 250.13
##$BF2= 250.13
##$BF3= 250.13
##$BF4= 250.13
##$BF5= 500.13
##$BF6= 500.13
##$BF7= 500.13
##$BF8= 500.13
##$BYTORDA= 1
##$CFDGTYP= 0
##$CFRGTYP= 5
##$CHEMSTR= <none>
##$CNST= (0..31)
1 1 145 1 1 1 1 1 1 1 1 1 1 1 1 1 1 1 1 1 1 1 1 1 1 1 1 1 1 1 1 1 
##$CPDPRG= <>
##$CPDPRG1= <>
##$CPDPRG2= <>
##$CPDPRG3= <>
##$CPDPRG4= <mlev>
##$CPDPRG5= <mlev>
##$CPDPRG6= <mlev>
##$CPDPRG7= <mlev>
##$CPDPRG8= <mlev>
##$CPDPRGB= <>
##$CPDPRGT= <>
##$D= (0..31)
0 1 0 0 0 0 0 0 0 0.06 0 0 0 0 0 0 0.0002 0 0 0 0 0 0 0 0 0 0 0 0 0 0 
0 
##$DATE= 1183986391
##$DBL= (0..7)
120 120 120 120 120 120 120 120 
##$DBP= (0..7)
150 150 150 150 150 150 150 150 
##$DBP07= 0
##$DBPNAM0= <>
##$DBPNAM1= <>
$$ [...]
##$SUBNAM7= <"">
##$SUBNAM8= <"">
##$SUBNAM9= <"">
##$SW= 20.6930455092707
##$SWIBOX= (0..15)
0 0 3 0 0 0 0 0 0 0 0 0 0 0 0 0 
##$SW_h= 5175.983436853
##$TD= 65536
##$TD0= 1
##$TE= 296.16
##$TE2= 300
##$TE3= 300
##$TEG= 300
##$TL= (0..7)
0 120 120 120 120 120 120 120 
##$TP= (0..7)
150 150 150 150 150 150 150 150 
##$TP07= 0
##$TPNAME0= <>
##$TPNAME1= <>
##$TPNAME2= <>
##$TPNAME3= <>
##$TPNAME4= <>
##$TPNAME5= <>
##$TPNAME6= <>
##$TPNAME7= <>
##$TPOAL= (0..7)
0.5 0.5 0.5 0.5 0.5 0.5 0.5 0.5 
##$TPOFFS= (0..7)
0 0 0 0 0 0 0 0 
##$TUNHIN= 0
##$TUNHOUT= 0
##$TUNXOUT= 0
##$USERA1= <user>
##$USERA2= <user>
##$USERA3= <user>
##$USERA4= <user>
##$USERA5= <user>
##$V9= 5
##$VALIST= <valist>
##$VCLIST= <CCCCCCCCCCCCCCC>
##$VD= 0
##$VDLIST= <DDDDDDDDDDDDDDD>
##$VPLIST= <PPPPPPPPPPPPPPP>
##$VTLIST= <TTTTTTTTTTTTTTT>
##$WBST= 1024
##$WBSW= 4
##$XGAIN= (0..3)
0 0 0 0 
##$XL= 0
##$YL= 0
##$YMAX_a= 238674
##$YMIN_a= -154243
##$ZGOPTNS= <>
##$ZL1= 120
##$ZL2= 120
##$ZL3= 120
##$ZL4= 120
##$ABSF1= 16.522
##$ABSF2= -4.171173
##$ABSG= 5
##$ABSL= 3
##$ALPHA= 0
##$AQORDER= 0
##$ASSFAC= 0
##$ASSFACI= 0
##$ASSFACX= 0
##$ASSWID= 0
##$AUNMP= <proc_1d>
##$AZFE= 0.1
##$AZFW= 0.1
##$BCFW= 0
##$BC_mod= 0
##$BYTORDP= 0
##$COROFFS= 0
##$CY= 12.5
##$DATMOD= 1
##$DC= 0
##$DFILT= <>
##$DTYPP= 0
##$F1P= 14.0000005364418
##$F2P= -0.99999901652339
##$FCOR= 0.5
##$FTSIZE= 32768
##$FT_mod= 6
##$GAMMA= 0
##$GB= 0
##$INTBC= 1
##$INTSCL= 1
##$ISEN= 128
##$LB= 0.3
##$LEV0= 0
##$LPBIN= 0
##$MAXI= 10000
##$MC2= 0
##$MEAN= 0
##$ME_mod= 0
##$MI= 0
##$NCOEF= 0
##$NC_proc= -6
##$NLEV= 6
##$NOISF1= 0
##$NOISF2= 0
##$NSP= 0
##$NTH_PI= 0
##$NZP= 0
##$OFFSET= 16.522
##$PC= 1
##$PHC0= -55.76365
##$PHC1= 7.421152
##$PH_mod= 1
##$PKNL= yes
##$PPARMOD= 0
##$PSCAL= 4
##$PSIGN= 0
##$REVERSE= no
##$SF= 250.13
##$SI= 32768
##$SIGF1= 0
##$SIGF2= 0
##$SINO= 400
##$SIOLD= 32768
##$SREGLST= <1H.DMSO>
##$SSB= 0
##$STSI= 32768
##$STSR= 0
##$SW_p= 5175.98343685301
##$SYMM= 0
##$S_DEV= 0
##$TDeff= 65536
##$TDoff= 0
##$TI= <Analysis number 999999
Compound Code 99
Book Reference 9
Project Code 9>
##$TILT= no
##$TM1= 0
##$TM2= 0
##$TOPLEV= 0
##$USERP1= <user>
##$USERP2= <user>
##$USERP3= <user>
##$USERP4= <user>
##$USERP5= <user>
##$WDW= 1
##$XDIM= 32768
##$YMAX_p= 469562067
##$YMIN_p= -1299193
$$ End of Bruker specific parameters
$$ ---------------------------------
##NTUPLES= NMR SPECTRUM
##VAR_NAME=  FREQUENCY,     SPECTRUM/REAL,   SPECTRUM/IMAG
##SYMBOL=    X,             R,               I
##VAR_TYPE=  INDEPENDENT,   DEPENDENT,       DEPENDENT
##VAR_FORM=  AFFN,          ASDF,            ASDF
##VAR_DIM=   32768,         32768,           32768
##UNITS=     HZ,            ARBITRARY UNITS, ARBITRARY UNITS
##FACTOR=    0.157963299565203, 1,           1
##FIRST=     4132.6476996994, 0,             0
##LAST=      -1043.33573715361, 0,           0
##MIN=       -1043.33573715361, -1299193,    0
##MAX=       4132.6476996994, 469562067,     0
$$ Real data points
##PAGE= N=1
##DATA TABLE= (X++(R..R)), XYDATA
$$ [...]
22749b014j8543K64365K8564p4875j92734p5696O9859j51536k88331J83302M69972
22738B12333K0508j18937n8819l5640k55929L391M58828j23820n32385j41632
22728e72102L26909L92551p793k04534l998k70741p6770j03976Q1419K41571P77
22717a96687K33963p3709K02931L8821m00997L0675K42194k03583K69890l6506
22707A06992J5137j23813K05422j67998l1860L1213j24623j76529J3173o4292
22697c17178k68144J14017L25617m5551j03172K42014j38928p4903J41229R3445
22687c1554J01366j83084k1132j62942j43789k15999j42959j92419j76109L9390
22677a129231K53178N07812K52605J02254m1895J4499P8937l37558p5508L7955
$$ y = [-2014, -20557, 243808, 272372, 197497, 4763, -70933, -1074, -152610, -440941, -257639, 212333, 232841, 113904, 55085, 19445, -236484, -233093, 225735, 101915, -430470, -572102, -245193, 147358, 139565, -64969, -68967, -339708, -416478, -520454, -439035, -197464, -196687, 37276, -36433, 166498, 205319, -195678, -165003, 77191, -126392, 143498, 106992, 122129, -1684, 203738, 35740, 3880, 35093, -89530, -266059, -252886, -317178, -585322, -471305, -145688, -191239, -294411, -52397, -191325, -266228, -124999, -31554, 69812, -113272, -134404, -297346, -441135, -657134, -800093, -992512, -1168621, -1129231, -876053, -368241, -115636, -13382, -55277, -40778, 38159, -299399, -374907, -336952]
22667c36952J39396O8896O150Q4205p4694k6552m4457J33846l6454k08566o758
22656c01940J29146j25625k08872J22903M09502k1146j37132m269r8034R3573
22646a41894O53j60315p3483R6248r8237O6343r4602j6108J61983J52918q1246
22635a87740j54991j77312L72827J13822N262r456j97839l87282p7492J08574
22625e91627J58282L7302N6410m5689j89205N9235K13922K14187j27065L9908
22615a74340l19346J13768M22119J86132K74033K54794M6191m45434j82124j81270
22605e477N8890j81249k18320q2243K82205j62479j23045l30766N3645K67029
22595d41810r3322R0452J52606K30921m7820m36416j42171j07257m401K74870
$$ y = [-336952, -197556, -128660, -122510, -38305, -112999, -139551, -184008, -50162, -86616, -295182, -301940, -172794, -298419, -507291, -384388, 25114, 3968, -133164, -137433, -235467, -141894, -141241, -301556, -375039, -278791, -377028, -310685, -405287, -421395, -259412, -106494, -187740, -342731, -520043, -147216, -33394, -28132, -37588, -235427, -622709, -700201, -591627, -433345, -396043, -339633, -385322, -574527, -515292, -301370, -87183, -214248, -174340, -493686, -379918, 42201, 228333, 502366, 757160, 803351, 357917, 175793, -5477, 53413, -127836, -346156, -428399, -146194, -308673, -431718, -762484, -708839, -441810, -535132, -444680, -292074, -61153, -108973, -545389, -687560, -794817, -799218, -524348]
22585e24348K77765K24597n4771J43378J84658J25872K05369j4306J63948k31935
22575E00227j24609K86411J5433k23232k65027l92618j40176k52271p3338K2154
22565f47046N39760J1058n8304J01711j48405j45531M1919j84581J59475R1425
22555b38519J17521J49999n1892N429o5856k01946K5830L07947o6636k75877j20156
22544d14156K11669N6141k06393j39366J10517k8793O778M71515L80048J84772
22534F32732n119n5305j06912r9187j56352k22020l24917N5713P9061K11110N8219
22523F7023P1156j47736p6646Q0771K08467K66348o6699n28474j79906R7611J21962
22512h6123R0048Q8526K1081K76904M7757n14771O917O1661o5071P5149Q1453
$$ y = [-524348, -246583, -21986, -76757, 66621, 251279, 377151, 582520, 568214, 732162, 500227, 375618, 662029, 677462, 454230, 189203, -203415, -343591, -595862, -669200, -647046, -107286, -96228, -154532, -52821, -201226, -346757, -304838, -489419, -329944, -238519, -120998, 29001, -22891, -17462, -83318, -285264, -259434, 48513, -18123, -294000, -414156, -202487, -146346, -352739, -492105, -381588, -410381, -403603, 67912, 447960, 632732, 627613, 572308, 465396, 366209, 209857, -12163, -337080, -281367, -202306, 8804, 67023, 138179, -9557, -86203, -5432, 203035, 469383, 402684, -125790, -305696, -208085, -86123, 3925, 92451, 113532, 390436, 438193, -76578, -69661, -8000, -73071, 2078, 83531]
22501H3531k00365K0459q5782L7012L1124J0724n6291K54665K17580N6299j54103
22490B14853k07830k0439k32220k1470m3828j03239K76421J49936j08212n6808
22480a52836M38774P839l16623J36634j91601k15671r8249m8423n0705R5767k59047
22469f54141l62182K9380K49150j44357J57780K01053L99422M63292k87026l01158
22459b48787J63405r8285k61902J97516L34635M1071k69646l80066J11878K05421
22449b04760K2762j32893n752n2930K1560Q5567R3420J22433L35933j74259l8214
22438G2867L8738L6996o940j06259j23008J33079K55852M0231l83894k45538l040
22427b90916J54215L23842J49602l86333J3742K95591o4650P2365q7885L1391
$$ y = [83531, -116834, -96375, -182157, -145145, -114021, -103297, -159588, 95077, 312657, 368956, 214853, 7023, -13416, -245636, -267106, -310934, -414173, -137752, 12184, -96028, -152836, 285938, 293777, -22846, 113788, -77813, -293484, -391733, -440156, -490861, -395094, -654141, -1016323, -986943, -737793, -882150, -724370, -523317, -123895, 339397, 52371, -248787, -85382, -183667, -445569, -248053, 86582, 127653, -141993, -522059, -410181, -204760, -181998, -314891, -320643, -373573, -352013, -266446, -173026, -50593, 285340, 111081, 72867, 111605, 148601, 141661, 35402, -87606, 45473, 301325, 341556, -42338, -287876, -290916, -136701, 187141, 336743, -49590, -35848, 259743, 195093, 267458, 179573, 210964]
22417B10964j07531O7061j57304O0922J58170L58819Q0579p1350J17719k33783
22407D84266k45370J47158p3665j3211l23786O9403Q0608J69869o6679j55028
22397G3565j16597j63067p868Q5500o475j45752j29899j41146J94448l24297j29273
22386h10861M51256M44132p8498k99733R0512l153K71091j36968k37885m3789
22376c53896P9867J94690K31896J97603K06978j94378j9519J12768k69289J12417
22366B99137j50618k67656k6511J07742J14721n1012k1291K10022j54464M7454
22356A07524l15299l4811k06085k5940N22648l3462l54739J65613J13760r9868
22346a60659m0736J72898j12897j96225M47908k6156J34003l3094m20316K15086
$$ y = [210964, 103433, 170494, 13190, 74112, 232282, 591101, 671680, 600330, 718049, 484266, 238896, 386054, 312389, 299178, -24608, 44795, 125403, 295272, 228593, 73565, -43032, -206099, -213967, -128467, -134942, -280694, -410593, -551739, -357291, -681588, -810861, -359605, 84527, 6029, -293704, -203192, -206345, 64746, -72222, -310107, -353896, -274029, -79339, 152557, 350160, 557138, 362760, 343241, 456009, 186720, 299137, 148519, -119137, -145648, -37906, 76815, 25803, 4512, 214534, 60070, 107524, -207775, -242586, -448671, -474611, 48037, 14575, -340164, -174551, -60791, -160659, -201395, -28497, -141394, -337619, 110289, 84133, 218136, 185042, -235274, -20188]
22336b0188p9867l65290K862O2237r1313K8858K3794K12950J04575L10567J19155
22325C08340j66909L5679o2226k46806j6597q0575q7593k30070Q4146L0750k2955
22314d54816L17749K73266P5850K23844j12533m97863j2740J06285J94147o022
22304A07167j41164J13228O0649k24662J28163K33720j30539K16339j85898N8520
22294B35523J1352J2976N0632M82530j24805j97582q8096l61256p4575p9805R8632
22283c4474K27875j89561k06039j30156K08675K46883O8900j28613l58445k34268
22273e29223k43643j70477l5674K69425K61936j6507l15960O415K45612N54822
22263B6726L47671m2740q2840j65349j39280r4210K09059R4542K6135J79161j5
$$ y = [-20188, -100055, -465345, -462483, -400246, -491559, -462701, -438907, -225957, -121382, 189185, 308340, 141431, 177110, 114884, -131922, -148519, -229094, -316687, -546757, -462611, -431861, -454816, -137067, 136199, 212049, 435893, 323360, -174503, -187243, -80958, 113189, 107167, -33997, 79231, 139880, -84782, 43381, 277101, 146562, 362901, 177003, 235523, 246875, 259851, 310483, 793013, 668208, 470626, 382530, 21274, -53301, -133106, -34474, 193401, 3840, -202199, -332355, -123680, 123203, 192103, 63490, -294955, -529223, -772866, -943343, -979017, -709592, -447656, -464163, -780123, -773708, -528096, 26726, 374397, 331657, 248817, 83468, -55812, -150022, 59037, 153579, 179714, 358875, 358860]
22252C58860O8954L4949j11260l62238n946K50547J57535m25432j63035m0181
22242b37247J73390j33579k51359P2949J69496K04216J20180k99400p5084K19841
22232c6597J67872L82260J37090l16617n9839m95l12134k59562q3918M04461L20004
22221C42525K9375j01787k10463J74324M8083j96047M5378j1717N2523Q352l3014
22210A47532j42174J3940K31169N8566k50693N7921M9442J84738K50742j67052
22200D34131k63245K64932J6591l32376P1894k3727n7739j01064j52814r9251
22190b42668J19365m4067K32006k8686m2683J38247J33408q1310j56015j79984
22180a52387L1284L76024n411j93494L2777R1784j70838l68858K16855M77006
$$ y = [358860, 427814, 462763, 351503, -10735, -16681, 233866, 391401, -34031, -197066, -237247, -63857, -197436, -448795, -375846, -206350, -2134, 118046, -181354, -256438, -36597, 131275, 513535, 650625, 334008, 274169, 273674, -38460, -298022, -381940, 22521, 342525, 371900, 270113, 59650, 233974, 282057, 86010, 131388, 119671, 172194, 180546, 147532, 5358, 19298, 250467, 309033, 58340, 116261, 165703, 350441, 601183, 434131, 170886, 435818, 452409, 120033, 191927, 168200, 110461, 9397, -143417, -242668, -123303, -167370, 64636, 35950, -6733, 131514, 264922, 183612, 27597, -152387, -121103, 254921, 249510, 56016, 88793, 180577, 9739, -359119, -142264, 334742]
22170C34742K35365m33647k86824J6066K06516M13153J33358M3813m07281j69751
22160H5510j36373j5214K28058K11884j87952n18057M1880P9030K66534K6861
22150H2161m7493k54523k32813k96610J69556K91954K16644k3659K48442n34768
22140c81109P2995M54937J35035m63607J12666l7766O1659j9149k57914l7105
22130c59358J56598L24216j51598n2752k51145r2561N8136J27517j69702l2519
22120d43168K21666O0360j89323q7858M0529M75813K05782j47436j55751l32039
22110c51425p8558K81958J22263n1253R037K5550J59422m8100J54635j43636k63149
22099a83256j80583M8688J4759k63562K50950L37355k36793k68880J66128J14528
$$ y = [334742, 570107, 136460, -150364, -134298, 72218, 485371, 618729, 662542, 255261, 85510, -50863, -66077, 161981, 373865, 185913, -332144, -290264, -211234, 55300, 82161, 34668, -219855, -452668, -749278, -579722, -287768, -71124, -94783, 153659, -381109, -308114, 146823, 281858, -181749, -69083, -106849, -45190, -64339, -322253, -359358, -202760, 121456, -30142, -82894, -334039, -426600, -368464, -240947, -410649, -443168, -221502, -161142, -350465, -438323, -397794, 78019, 283801, 136365, -19386, -351425, -429983, -148025, -25762, -77015, -67978, -42428, 116994, 68894, 223529, 79893, -183256, -363839, -315151, -300392, -563954, -313004, 24351, -212442, -481322, -315194, -200666]
22089b00666Q7220p9242m7903K43904M7901m1303J54187j52682L8474J64347J34728
22078C48965j68134j85523m4247l9937k3046j44549M144L0503j48342p4854q9108
22067e34128K92119k6698l13473K96723J82730N3683O3436M8009J50454j00943
22057A11912p3002l06476R7549K74312M9134l9405r7872j35055k20461M12424
22047G3060P2622j06576Q7698r7391l1807J45889o8818k06318J76875J51994q9784
22036A07444k41213N4133r338p5460K38460R6310j53698l7034J20345M3946k66822
22025a22927q5468J20036j07773m72175L27839M75388L55877k72569q0400J06528
22015B44356J79362k10211j69499M3091J74788q3973k26356J49575k5956k11827
$$ y = [-200666, -113446, -192688, -240591, 3313, 51214, 9911, 164098, 11416, 49890, 214237, 348965, 180831, -4692, -48939, -88876, -111922, -256471, -252327, -221824, -370166, -445020, -534128, -242009, -268707, -582180, -285457, -102727, -49044, 14392, 62401, 212855, 111912, 38910, -267566, -170017, 104295, 153429, 114024, 16152, -118903, -339364, 73060, 145682, 39106, 126804, 29413, -2394, 143495, 74677, -131641, 45234, 197228, 107444, -133769, -79636, -88974, -164434, 74026, 170336, 16638, -20396, 99949, 143895, -122927, -208395, -88359, -196132, -668307, -340468, 134920, 490797, 218228, 137828, 244356, 423718, 213507, 44008, 87099, 261887, 177914, -48442, 101133, 75177, -136650]
22005a36650j88177k36087K70321K60072J00219k74360l08833M05521L16413K14228
21995D22667M2213j65487l48953q8445j0525k35266l9575j98556j5141K12088
21985d24980J63488j00822K68022O39535P1650k26228k3782m00942M205P7895
21975D8041j50291r2592J62112R0639l84406j88930J83730M8545j94524K42200
21965b35476k8807j53283m369L69934j95898j66291M7648n2741L15897m0477j38809
21954b82672p6286J79755L57670J40612Q3327j8997k34135j01002p23j42073k01454
21943b95978k93488L75436K43741J71779N1961Q283m88363l6600K1900J74415
21933f6914j00553l51109k99480j50692M81715K44832k39832P1154M9811j83709
$$ y = [-136650, -324827, -560914, -290593, -30521, 69698, -204662, -513495, -107974, 208439, 422667, 464880, 299393, -49560, -138005, -148530, -383796, -423371, -621927, -637068, -424980, -261492, -362314, -94292, 545243, 616893, 390665, 366883, -34059, -29854, 48041, -102250, -194842, -32730, 57909, -326497, -515427, -331697, -283152, -477676, -235476, -264283, -417566, -421935, -52001, -247899, -414190, -366542, -419283, -103386, -143863, -282672, -358958, -179203, 178467, 319079, 402406, 383409, 149274, 48272, 47549, -94524, -295978, -589466, -214030, 29711, 201490, 253451, 261734, -226629, -263229, -241329, -66914, -167467, -518576, -818056, -968748, -487033, -242201, -482033, -410879, -361068, -544777]
21923e44777r9483J74335K53171K78276m4783j58008m8775J3356O7382q8737M4077
21912a53966K24488K76026j0812K22186k5408J29887r5043m01659l84053J15801
21902a02553O8375j46653P6179j20536k50903p4241K51307L52633K70092j45222
21892A78478J05276j13497m9319K604N2581M0091l5635q303J08038J53571q5582
21881C48303j6759k67439m4611j59576K11250j57527m5937r4243L34473O7336
21871A75270j07353J65309j264j59043J44009n2787m49456J01337J83395q5465
21861h6048J04913J61662J40181l6800n74975l35379L37891R6145r1747R5323
21851a88834L7584L21676O3621J1799L49335q8160o3639J2716j18619L490j84917
$$ y = [-544777, -644260, -469925, -216754, 61522, 16739, -141269, -190044, -176688, -109306, -198043, -153966, 70522, 346548, 335736, 557922, 532514, 662401, 567358, 165699, -218354, -102553, -34178, -180831, -104652, -225188, -476091, -550332, -299025, 53608, 323700, 178478, 283754, 170257, 120938, 123542, 176123, 216214, 180579, 172276, 280314, 433885, 348303, 331544, 64105, 19494, -140082, 71168, -86359, -132296, -226539, 107934, 175270, 67917, 233226, 231962, 72919, 216928, 164141, -285315, -183978, -583, -86048, 18865, 180527, 320708, 283908, -291067, -626446, -288555, -192410, -284157, -188834, -151250, 170426, 234047, 245846, 595181, 507021, 443382, 456098, 337479, 340969, 156052]
21840A56052P7225J55573l3828j13541K98922O2426O4814j43577l44644Q6507
21830B65929J57624l0825r8903l42436j35035K29836K97289j32648j7790j82109
21820A0932m07849J06125k944R6925J19121K72466J00713k73155j29630m26579
21810e33875m52513J94434K3337j53509k25439L53050K92028j1326M72783K6729
21800a4301j7809K92794l0440m52172k14636j16348O1411j74383J16787M50072
21790i9025K53611m3814J15024n9482j65511r6931l28533k03167R3259R6704k72835
21779g10700M29876L94931j42209L3313J76921n8703j22584O7020n3090R0012
21769A04787J39138n4015J46088K23992J57410M273j03721k75620l25143O8673
$$ y = [156052, 233277, 388850, 355022, 241481, 540403, 602829, 667643, 524066, 179422, 265929, 423553, 392728, 293825, -48611, -183646, 46190, 343479, 210831, 193041, 10932, -396917, -290792, -293736, -196811, -77690, 194776, 295489, 22334, -107296, -533875, -986388, -791954, -768617, -922126, -1147565, -794515, -502487, -513813, -41030, -14301, -32110, 260684, 230244, -221928, -436564, -552912, -491501, -665884, -549097, -99025, 154586, 110772, 225796, 166314, 803, -96128, -424661, -627828, -534569, -437865, -710700, -280824, 114107, -28102, 5211, 182132, 123429, 845, 67865, 14775, 104787, 243925, 189910, 335998, 559990, 717400, 721673, 617952, 342332, 17189, 85862]
21759H5862j6894j47148l42623L0207L85955P7091q9453J23536J42685l5544o9595
21748A44079L2872j42125j52024l03082k169K30108o1999K15432L25958k08782
21738G8268m85361j22236L28821K25711j61853J32629K29994j28868l0666J98021
21728B64460j6509k2272k42485J23759J18340j84789p8126L06629L20362l31825
21718B57544j32047q1121n423l3646r4313j38888K6866n2002m1395J92195K54579
21707A52349J44108o7338l22209n08875K30972K4717k42139J26153Q5484j29299
21697e06077j56573p1550n483p4546J63976m679J25677L62402L6805k43184J58019
21686b15213J14220L923j29038K48526j39743k42720P8182k76305m8721J87658
$$ y = [85862, 68968, -78180, -420803, -390596, -4641, 72450, -17003, 106533, 249218, 213674, 144079, 176951, 34826, -117198, -420280, -422449, -192341, -254340, -38908, 287050, 78268, -407093, -529329, -200508, 25203, -136650, -4021, 225973, 97105, 66439, 264460, 247951, 225679, -16806, 106953, 225293, 40504, -37622, 269007, 589369, 257544, 125497, 44376, 38953, 5307, -89006, -227894, -201028, -253030, -294425, -102230, 152349, 296457, 229119, -93090, -601965, -370993, -346276, -588415, -462262, -376778, -506077, -662650, -734200, -739683, -814229, -650253, -654932, -529255, -166853, -130048, -373232, -215213, -100993, -97070, -226108, 22418, -117325, -360045, -281863, -558168, -606889, -419231]
21676d19231N5283L44059J58297n3120k60031j61564K75110J82508l88202J88812
21666g8079j42661P7016L71911K77905l65483m41156M8240J11947K24655J16346
21656B00641k2434j35826r7700q0259P437k36330o0130J39884M4692j86678J70881
21645b55822K81633K49475Q2669m13721k28998p1658M3135L0217j76363N2976
21635d06457J86707J42677k53378j24790L42345j35618k85206R2047K73734j06714
21625b74653M5209K01562K20643j13760N1003r2609k84056J9151j96963k97078
21615g21551J44890J89844l78921j3490J46148N22783L55325l01018q4195N8579
21605h1606r2024J35184O0167j18620j5907M9970J11121l17665j97333j79363
$$ y = [-419231, -363948, -19889, 138408, 85288, -174743, -336307, -61197, 121311, -266891, -78079, -220740, -143724, 228187, 506092, 140609, -300547, -252307, -140360, 84295, 200641, 178207, 42381, -55319, -135578, -128141, -364471, -424601, -284717, -240025, -426703, -255822, 25811, 275286, 357955, -55766, -284764, -356422, -313287, -283070, -459433, -406457, -219750, -77073, -330451, -455241, -112896, -248514, -533720, -441673, -167939, -274653, -229444, -27882, 192761, 79001, 130004, 37395, -246661, -227510, -424473, -721551, -576661, -386817, -765738, -779228, -633080, -110297, 245028, -55990, -140185, -81606, -173630, -38446, 21721, -96899, -112806, -62836, 48285, -269380, -466713, -646076]
21595f46076M9626L96595M03728o9638k31999Q1420j04560n1004K9264L7534o594
21584a11704j10180M14901R3296n7196K27887K77206l01853k42489o1262l9817
21574H8789j35452j63190J27988P1881J17506j05014n8428L2980k7337J91821
21564A41544L3625n8109K17835N5079m13556l67834J75630l0447j68394R5389
21554c19238L36931J80502m5230n1373Q4340k07413l44617m61879K18607N19081
21544i0289J28904J59060o0001k18740L5162J39525m138L76732j60476n17205
21534b11466j99386K25093j58873k24487J22243K89759j28020O1501K33796M19290
21524D29450P4474j03215j30631M9854j65685k07408k26718M8113Q5310j73179
$$ y = [-646076, -596450, -199855, 203873, 134235, -97764, -16344, -120904, -171908, -142644, -105110, -111704, -221884, 193017, 286313, 229117, 457004, 734210, 432357, 189868, 128606, 88789, -46663, -209853, -81865, -9984, 107522, 2508, -55920, -22940, -50277, 141544, 175169, 117060, 334895, 389974, -23582, -391416, -215786, -246233, -414627, -319238, 17693, 198195, 152965, 101592, 185932, -21481, -366098, -827977, -609370, -90289, 38615, 197675, 137674, -81066, -45904, 93621, 89483, 466215, 305739, -211466, -410852, -185759, -344632, -569119, -446876, -157117, -285137, -223636, 10160, 429450, 503924, 400709, 270078, 319932, 154247, -53161, -279879, -231766, -146456, -319635]
21514c19635k77256J15300J17059L99528j53856j6029K65277J69540j33077O0731
21504B27582J17184m55684k39560J87034J42114K16468J80824n2808l12339k3419
21494a2604J64195l65966l6280L4969J58009k24115k6376J57444L890j78628Q7136
21483b38326k02898k24361j30362j01840k9399K15075K79941K5320J16092K22606
21473f8152O0160l3047n3110J23245K16252j55081J3361Q9913q8511o0696J8832
21462F3166l3086J61802l33999p5790J81918R9314n2691j48818K12312j02630
21452b8502j25494J68560N3003j72154l25939k15794J92171j41063J47589N07884
21442F0261q7498k27547r7316K95108J98755o25260K19360K46874l5183r7016
$$ y = [-319635, -596891, -481591, -364532, 34996, -118860, -134889, 130388, 299928, 166851, 227582, 344766, -110918, -350478, -163444, -21330, 195138, 375962, 323154, 10815, -12604, 151591, -214375, -250655, -215686, -57677, -281792, -308168, -150724, -146834, -325462, -238326, -441224, -665585, -795947, -897787, -927186, -712111, -432170, -406850, -290758, -68152, -7992, -41039, -94149, 29096, 245348, 90267, 103628, 193541, 105030, 44334, 63166, 30080, 191882, -142117, -217907, -35989, 63325, 10634, -138184, 74128, -28502, -153996, 14564, 67567, -104587, -430526, -646320, -454149, -595212, -447623, 60261, -27237, -254784, -352100, -56992, 141763, -483497, -264137, -17263, -52446, -149462]
21432a49462M6835J19989k37154M8336j2059j92660k6301N0786j04650J31902
21422c24438J35904r7090Q3845j53479j44725j45070q7536l9202R9230J53572
21412e18989L4743J72963j89399J23766L71154J2490q075k70498K5981M7546J90698
21401g620J6546j6667p2866j43738L7882q7378J79665k57490J09612K04992p4555
21390a11617l41200n561O6862J26434j45240J98160O5187P6654k8385J46104n4671
21379g273k89059L3637K07596n8322j33196m03196L6244M57019R3045j96842L92153
21368A31806j89305k39535J99318K01433J52987N55j79029j8670J59516j62083
21358E6993O4490K22550n2537j56522k51024k06917J38439K00398K25459l3749
$$ y = [-149462, -102627, 17362, -219792, -171456, -183515, -376175, -402476, -351690, -456340, -324438, -188534, -285624, -201779, -355258, -499983, -645053, -732589, -771791, -672561, -518989, -484246, -311283, -500682, -376916, -5762, 6728, -1347, -271845, -245864, -198318, -7620, 8926, -7741, -80607, -224345, -186463, -273841, -94176, -351666, -242054, -37062, -111617, -452817, -458378, -391516, -265082, -410322, -212162, -146975, -70321, -98706, 47398, -7273, -296332, -262695, -55099, -113421, -246617, -649813, -613569, -156550, -63505, -260347, 131806, -57499, -297034, -97716, 103717, 256704, 257259, 78230, 59560, 219076, 56993, 121483, 344033, 291496, 134974, -116050, -322967, -184528, 15870, 241329, 207580]
21348B07580l59860K91180k32910k45912k14790J86645L97039L89562l317q3428
21338C31789k2100k89982n00075j19219L83562L52570j33860j99372j26801L1655
21328b91833P4416N7543R4225Q1060P5541j41902J1672J0554M79276N366l29178
21317A26740K13806j68289j73223Q6857j56384j20213j31331j68739Q9657L41554
21307e9565N01020r2413P9232j35417m38816J18303J04422m9723p3431j65783
21297b12171l53712J61040M16811p5409m2211M445J28531Q3350m44144l65307
21287f98777J99078L09432J19004k99067k3012N36891j24795m7361K94925l94512
21277a28194J1524p4820k18965m4310K2732J61141L05196L14174l45082k14939
$$ y = [207580, -152280, 138900, -94010, -339922, -554712, -368067, 28972, 418534, 415217, 331789, 309689, 19707, -480368, -599587, -216025, 136545, 2685, -196687, -323488, -291833, -217417, -159874, -65649, 15411, 90952, -50950, -39278, -28724, 450552, 455918, 126740, 340546, 172257, -966, 85891, -70493, -190706, -322037, -490776, -401119, -59565, 441455, 349042, 428274, 292857, -145959, -27656, 76766, 27043, -46388, -212171, -565883, -404843, 11968, -63441, -105652, -101207, 27324, 110674, -333470, -698777, -499699, -190267, -71263, -370330, -393342, 143549, 18754, -28607, 266318, -128194, -116670, -191490, -410455, -454765, -432033, -270892, 34304, 348478, 3396, -211543]
21267b11543J97771k92349k27684K3321K15001j69056J10862K38060Q5170J01610
21257G1163M1832k18749j53263O3668J00344p9943K35055p2937k72705J3862m7758
21246c19431J16187j17227j03594J18421r5567l90476Q7498M24848L77986o939
21236I1706k62788N1291j17760j48831q5009L20523R8875J17932m06958j74641
21226e15660k4690r1611J30836K78174k42008M2344j15046P6941n2604J13156
21216d00168p6478K71990M6830k4877J22216J38368K78210n6082k11963N6466
21206A44512J14035n5235Q5603k01853j75263k14831j51568J73832K14692M38546
21196C72470K34783j71782j27642j51858j79164p7696p1240q361N1804Q9213j15534
$$ y = [-211543, -13772, -306121, -533805, -510484, -295483, -464539, -353677, -115617, -30447, 71163, 112995, -105754, -259017, -195349, -95005, -174948, 60107, -12830, -285535, -271673, -319431, -203244, -320471, -424065, -305644, -401211, -791687, -704189, -279341, 98645, 91706, -171082, -119791, -237551, -386382, -471391, -150868, -51993, 65939, -341019, -515660, -540350, -631961, -501125, -222951, -464959, -422615, -537661, -460720, -513324, -400168, -476646, -204656, -157826, -182703, -60487, 77881, 356091, 300009, 88046, 144512, 258547, 203312, 288915, 87062, -88201, -303032, -454600, -280768, -66076, 372470, 607253, 435471, 307829, 155971, -23193, -100889, -172129, -180490, -128686, -39473, -155007]
21185a55007M967j82057k14964r225j03022L28764K97585L3221j4646Q2122J1010
21174G8748k10658J53435K51976o2936J8208k1746q0606O2051K2072K65352M014
21163D79910m00578j64379j74091k06552n1723n6428N1631K49371l05793k35975
21153h14607P1436K37434k17175k15241L43595M74633J87497J69596O8127p2547
21143B32748J35566k80186j32925L5096J72266P3921k7805j37440N9127L30764
21133D61132k39376m32154j8172K06844Q0998k3070l68496j73580K48727K80134
21123B2987r7634o7063j40987P1305J82862k29882J09871j13964N6265J96862
21113i378M4933j0624k4915j5410R9352j76311l4841K96969j53929j70082J29012
$$ y = [-155007, -150040, -332097, -547061, -556286, -659308, -330544, -32959, 262, -14384, 67738, 78748, -131910, 21525, 273501, 210565, 228773, 207027, 126421, 188472, 210544, 475896, 479910, 79332, -85047, -259138, -465690, -517413, -573841, -522210, -272839, -578632, -814607, -743171, -505737, -722912, -938153, -594558, -119925, 67572, 237168, 305295, 232748, 368314, 88128, -44797, -9701, 162565, 236486, 208681, 71241, 130368, 461132, 221756, -210398, -228570, -21726, 59272, 36202, -332294, -505874, -257147, 22987, -74647, -141710, -282697, -211392, -28530, -258412, -148541, -262505, -206240, -9378, 35555, 24931, 16, -15394, 83958, -92353, -127194, 169775, 15846, -154236, -25224]
21102b5224J9954J39517p8802K7634q1547j03032L7972J32910j77929m21257K4686
21091e05118o7275Q9257L91662K88347K26600k52771j58136k39144r7850J01036
21081b23392K71434J53212j84413r2559p9590J96253K72627O8301O8091l02918
21071A47046r0688J16444l9567q4354l86304j15091K24075J87037K4548j76328
21061a93182J97076k09279q8280j59949j84295J64633J99872L82923J69115k14653
21051F3981l22585j08194Q1806k5639j11487K2593P4508j54965K05468j63470
21041d37984j7510k139M0816j7381J42539K1893K67420k71223j26443J83839J02438
21030a13735o4837q0788J00362q4062p8779J4978L66350L28789k38918r9905j72864
$$ y = [-25224, -5270, 134247, 55445, 83079, 1532, -101500, -63528, 69382, -108547, -529804, -505118, -572393, -483136, -91474, 196873, 423473, 170702, 12566, -226578, -324428, -223392, 48042, 201254, 16841, -75718, -155308, 40945, 313572, 381873, 449964, 147046, 56358, 172802, 133235, 48881, -337423, -452514, -228439, -41402, -16854, -193182, 3894, -205385, -293665, -453614, -637909, -473276, -273404, 109519, 278634, 63981, -258604, -366798, -284992, -310631, -422118, -399525, -325017, -479982, -274514, -437984, -455494, -457633, -416817, -434198, -291659, -269766, -2346, -273569, -400012, -216173, -113735, -178572, -259360, -158998, -243060, -321839, -306861, 59489, 388278, 149360, 49455, -123409]
21019a23409m54200M5043K44893M42388L1950J8868N9977l45770l28866j32267
21009e41393J86727K95881J90699k39639l47333L08497J80509n4177J57671K3281
20999A60723J67990l73101k88451J31011L41430r8272M46568o5714j35531K48154
20989E34807L353k40038R21J25392k5308n3148j27126L3407k756k59195j99184
20978b08875j02013P6082J32775p5417j72178j1009R3904J93629Q45J21942J89896
20967B39581J87062k86297m99785L1944L188J19245n0077L2007J57219j93886
20957b59799R5699L30877j96684q0787J9653J20146L5798k83765j74459K0555
20947c72766K33218K84635J98410k35509k32428M07976n8615L1427L1129Q713
$$ y = [-123409, -577609, -532566, -287673, 154715, 186665, 205533, 265510, -80260, -409126, -541393, -354666, -58785, 131914, -107725, -455058, -146561, 33948, -20229, 137442, 160723, 328713, -44388, -332839, -201828, 139602, 41330, 487898, 422184, 286653, 534807, 538160, 298122, 299043, 424435, 399127, 345979, 218853, 252260, 249504, -9691, -208875, -310888, -234806, -102031, -177448, -349626, -360635, -266731, -73102, -72257, 49685, 239581, 426643, 140346, -359439, -327495, -324307, -205062, -255139, -223132, -65913, -259799, -164100, 166777, -29907, -110694, -91041, 29105, 64903, -218862, -393321, -372766, -139548, 145087, 343497, 107988, -124440, 283536, 224921, 256348, 287477, 296190]
20937B96190K32267k37557j10639O5603k50422P6868K54669J71106K0773j96013
20927C22845K8390k84106k95226j65439k10361M7651O7513m4875j5707R0559j14969
20916e73725Q9171K93614j22035K75797n7115k22717J71180j00451P55R7420J8282
20905a29824r4556l11996J55791J60950j38424M71407L1461l28473j96115k42855
20895f22634K22592K64439M29420j03556j0357K56001j61745j13622M254m691
20885A60101j7562J90086K50643k22264l86871q9365J87472j93409M8261K26609
20875A53701j2546M1797j94666R4355J59952l10606j84563K02897k768J30169
20865G7722K21672k4280l56902J43622j17188J64686j21868k31788r0756N230
$$ y = [296190, 528457, 290900, 180261, 245864, -4558, 72310, 326979, 498085, 518858, 322845, 351235, 67129, -228097, -393536, -603897, -556246, -488733, -533608, -549315, -458756, -573725, -484554, -190940, -312975, -37178, -94293, -317010, -145830, -246281, -245526, -148106, -129824, -224380, -536376, -380585, -219635, -358059, 113348, 144809, -183664, -379779, -622634, -400042, -135603, 293817, 190261, 179904, 435905, 274160, 160538, 164792, 160101, 142539, 332625, 583268, 361004, -25867, -115232, 72240, -121169, -72908, 153701, 141155, 182952, -11714, 82641, 242593, -68013, -252576, -49679, -52447, 77722, 299394, 275114, -81788, 61834, -55354, 109332, -12536, -244324, -335080, -329850]
20855c29850K18522L8265K38347k23506k42312J8223k3684l13412M36204M67266
20845B84063Q6585q1810l38752j82720j03774J26322J31477m5619m89220m71735
20835a085183P6180J56405M06879J54706N0361K54486o799m40180J46357M5291
20825b41497j61695J27273J13876R3681n7775o9942P3280l67207M76K97644j18623
20814c10509P3166K61167p0230n06721j15971L83939J38756L09072J18556m24853
20804a43628k81391J96710J28242O0426m4758j25718J04575l7311j89305K8595
20794c03563P3253j20090j59981k13819P1671j40324J73064O3023o6509P0235
20784e53040L13356P628l72452L45O6486K67937J86547J16651k24559J94117r4678
$$ y = [-329850, -111328, -73063, 165284, -58222, -300534, -282311, -305995, -619407, -183203, 284063, 370648, 288838, -49914, -232634, -336408, -210086, -78609, -124228, -613448, -1085183, -1009003, -852598, -445719, -291013, -240652, 13834, 7035, -433145, -286788, -241497, -403192, -275919, -162043, -68362, -126137, -196079, -122799, -490006, -489530, -191886, -310509, -237343, 23824, -46406, -553127, -669098, -285159, -146403, 162669, 281225, -143628, -425019, -228309, -100067, -39641, -84399, -210117, -105542, -142853, -332158, -303563, -230310, -350400, -510381, -724200, -652529, -792853, -619789, -556766, -623275, -553040, -239684, -232056, -604508, -604163, -537677, -269740, -83193, 33458, -191101, 3016, -91662]
20773i1662R8908L16201N5642l31949m45164J17477Q8436K33016L91892J94961
20763F27758j92903k48517k16638N9367q2063J15377j3355J47944J51819P7125
20753D25914Q2373M563o9440j34137j72042J42974J20658j71498j08681k64241
20743a43557O9232K119k70096M6170J9554p002k69863j37647R9966J94213L97527
20732F16k07439j69639O4742o400K12857M2678k17319o8739j99030J04631M49833
20721F791K63082o4285j88023r0026k8093k25759J2738j11399j03471j67716K43227
20710d52934L15631o8695j70843p0716k9608m6803L117K43903n1809J45174P3220
20699a10363K2259n9984P0297m01429n1300M69813K81785j74614k95236K40242
$$ y = [-91662, 7246, 323447, 379089, 47140, -398024, -280547, -192111, 40905, 432797, 627758, 434855, 186338, -30300, 29067, -52996, 62381, 49026, 196970, 348789, 425914, 508287, 512850, 443410, 309273, 137231, 280205, 400863, 229365, 120684, -143557, -74325, -72206, -342302, -296132, -276578, -283580, -553443, -691090, -591124, -396911, 616, -206823, -376462, -311720, -318120, -105263, -62585, -279904, -348643, -547673, -443042, 6791, 269873, 205588, 17565, -72461, -100554, -326313, -313575, -424974, -528445, -696161, -452934, -137303, -205998, -376841, -447557, -477165, -523968, -520851, -276948, -328757, -183583, -110363, -88104, -148088, -77791, -479220, -530520, -60707, 221078, 46464, -248772, -8530]
20689h530j29817r8001N1390j6848p4049Q7614K54397j33851K38052q9444k89287
20678b08374m7156Q1659j34639j14542K72779K38183J8625r125o6111Q256l9655
20667a00R7659j08451R3332j60045j14650L85836L8690k01361l78229k82975O7524
20656e62770j65543k63888K813K21863J01290K43449j21095L24891K88166N0433
20646A19609n7796j91569k61740J09609K55697L846J6896q0481q4885R1734K00195
20635A21115q6840J0785J96674j61622m79467M7558J39139J91716J42849K17989
20625C39896j47773l9057K74194l4717j93929K813j7657j8837k48132k25668k61349
20614e70216P4764J24580O6048j11545K47572L11686m4033j73265l17259j08666
$$ y = [-8530, -138347, -236348, -184958, -201806, -275855, -188241, 66156, -67695, 170357, 80913, -208374, -255530, -173871, -308510, -423052, -150273, 87910, 106535, 97410, 31299, 39555, -100, 97559, -10892, 82440, -77605, -192255, 193581, 232271, 30910, -347319, -630294, -562770, -728313, -992201, -989388, -767525, -666235, -422786, -543881, -218990, 69176, 119609, 61813, -129756, -391496, -281887, -26190, -22344, -5448, -85929, -170814, -79080, 121115, 34275, 45060, 241734, 80112, -399355, -351797, -212658, -20942, 121907, 339896, 192123, 153066, 427260, 392543, 198614, 201427, 183770, 164933, -83199, -308867, -570216, -495452, -370872, -304824, -416369, -168797, 142889, 98856, -74409, -391668, -500334]
20604e00334K33622L31317j24195k166J70010l48281j86729J39933J77988k5860
20594a34695r3266K15225Q661Q206r0440j40303j49377J34252j99216R875K69952
20583a61126J16821K10400J14930Q1168j88571j55915k04887J415J99594l23505
20573c09676j61785l44366J63206K47958o9613R8367M3207K81389n3290L12803
20563B08200O1997l27870k03116J89490M05371L1561j81616l29716r9614K84535
20553C9222K26284O7581k18736M6576o9554K50800m5749k49008L2587q6043p6612
20542h2652j62458j015k74246k11394L56852J7752j09225J48844L09553R465m75439
20531d73963n1125M01205q2747p5366j6061N0027N1876k11438O7524k23509Q3202
$$ y = [-500334, -266712, 64605, -59590, -61756, 108254, -240027, -426756, -286823, -108835, -134695, -227961, -12736, -4075, 4131, -86309, -226612, -375989, -241737, -440953, -431078, -161126, -44305, 166095, 281025, 362193, 173622, 17707, -187180, -185765, 13829, -309676, -471461, -815827, -652621, -404663, -474276, -375909, -332702, -51313, -104603, 208200, 270197, -57673, -260789, -71299, 334072, 365633, 184017, -145699, -245313, 39222, 265506, 333087, 114351, 160927, 91373, 342173, 296424, 47416, 80003, -6040, -82652, -245110, -246125, -520371, -731765, -374913, -357161, -466386, -317542, -7989, 1476, -473963, -525088, -123883, -206630, -281996, -298057, -248030, -196154, -407592, -340068, -563577, -480375]
20520d80375j74221J59507M1634L61096J99056n2460j14552k31057n1524M5427
20510b97469j6240J41997m8301M44781L05044k12800k98934R795m16462l11944
20500g00533M30905L13225J03428r981j31411k65052k1002N4764K86949k3216
20490C8076l04543Q3206P6495p1662K35493K22027N2278j73540K20113K5197k94026
20479A09114l45276P356M6701M0743q8781Q0849j5906J73887l822P7954J73500
20468B56319j07800m70442k22584J20508p4830q1220q315N84564K92721J34510
20458D23431m60538n6432m41J13782M00497L0939k38395J53361K0499m84687l21278
20447d19262J49168L04531K00909J45299j55677n04866k81963K05137J44474j63992
$$ y = [-480375, -654596, -495089, -453455, -92359, 106697, 54237, -60315, -291372, -342896, -297469, -313709, -171712, -220013, 224768, 529812, 317012, 18078, 27873, -388589, -700533, -269628, 43597, 147025, 137044, 5633, -259419, -280421, -225657, 61292, 38076, -266467, -183261, -106766, -178428, 57065, 279092, 331370, 157830, 377943, 403140, 109114, -236162, -228806, -182105, -141362, -230143, -149294, -165200, 8687, 4865, 82819, 256319, 148519, -321923, -544507, -423999, -498829, -580049, -588364, -3800, 288921, 423431, -37107, -93539, -93980, 19802, 420299, 451238, 212843, 366204, 386703, -97984, -419262, -270094, 34437, 235346, 380645, 224968, -279898, -561861, -356724, -212250, -376242]
20437c76242o0733L65261J19223k20304k27282j58566l669q3473J73760L46444
20427a25581k2284O8906K56793j47336j56672K29436M9633l05539p3000o925J386
20416b31183k18951j71108J78558K15800k18339l6890K23200j81312J33442J88982
20406a17801O8330L2783J42643o2021L58711j77463l27983k52099J45947O5461
20396a23492k7748k8435n805P3601j98539k91036R6852M98006J93577j21509k86004
20385b20532k79676K09327J1640J42712K79464l11098j87484j95251j6186K05164
20375c61920k7130L34705K51574l66419j51172J65477K53777j87315k87786j29060
20365e05269Q4896L20301j84013j16268J22941K53491j10560K38192N7954m05251
$$ y = [-376242, -436975, -71714, 47509, -172795, -400077, -558643, -562312, -645785, -472025, -125581, -147865, -78959, 177834, 30498, -126174, 103262, 152895, -152644, -225644, -232569, -231183, -450134, -621242, -442684, -226884, -445223, -482113, -258913, -440225, -306783, -117801, -49471, -16688, 125955, 63934, 422645, 245182, -82801, -334900, -188953, -123492, -151240, -179675, -185480, -111879, -310418, -601454, -504602, -6596, 186981, 65472, -220532, -500208, -290881, -279241, -136529, 142935, -168163, -355647, -550898, -567084, -361920, -389050, -54345, 197229, -169190, -320362, -154885, 98892, -88423, -376209, -505269, -420373, -100072, -284085, -400353, -277412, -23921, -134481, 103711, 161665, -243586]
20355b43586k77410J14810J57120J44092J17366J3704r7435L11860P0657J65268
20345D76446k02523j90848J20542J48591K03753k8957j83288L4895j87686k63713
20335g2788m3280M19592N4385K6208j85161J31118O8443j60689m56297l48409
20325e66878J46274M02138j28992Q4980Q1621k4217K01840K39663j52638K16124
20315D99915J53765K12075M2022l72190l86434r0601K08652q9550l9488r0590
20305D7576k6975J52354j08084l79118L2184o3346j95531J9052K28476J30914
20295a62498j87732J3433K1029k04191k25725J26100J74935K05992J75248l8020
20285a01429r0734m16277N5233K57834k69132P2596L13371P6802l0850k32551
$$ y = [-243586, -520996, -406186, -249066, -104974, 12392, 26096, -71339, 240521, 311178, 476446, 273923, 83075, 203617, 352208, 555961, 527004, 343716, 378611, 190925, -72788, -116068, 303524, 357909, 384117, 198956, 330074, 398517, 237828, -218469, -566878, -420604, -18466, -147458, -62478, 19143, -5074, 196766, 436429, 283791, 499915, 653680, 865755, 907777, 535587, 149153, 58552, 267204, 177654, 138166, 47576, 20601, 172955, 64871, -314247, -282063, -345409, -540940, -521888, -293412, -162498, -350230, -336797, -315768, -519959, -745684, -619584, -444649, -238657, -63409, -101429, -192163, -608440, -553207, -295373, -564505, -491909, -178538, -101736, -132586, -365137]
20275c65137q5103J48101o8043P2035j396K17608J98009K86925r5032j35802J2702
20264A84867j96993K31747M5886m34968n34798L1123J60867K53771R7315j31260
20254b92443m03132j89718J48680M86732K202j87058L18019M871p5701l2122n7152
20243b76822j73207J98347J82940l37415p444J42391o6666m9728J15454Q1615
20233a90535R1801K08073j08907j14827R8449l97532j06801L12802k24719j21139
20223e53335K4233K75953M06549j65761k80462J29763L28195O515J3106L5921
20213B20677P3359K5173j72992j11088l0332L31359K36485J09463m31051l175
20203B47878q9637j25631J1656N9880j92012o9071O6157l76822o6089R4090J68705
$$ y = [-365137, -450240, -302139, -370182, -298147, -299543, -81935, 116074, 402999, 307967, 172165, 184867, -12126, 219621, 265507, -169461, -704259, -673136, -512269, -258498, -161183, -292443, -695575, -885293, -736613, -249881, -247679, -434737, -116718, -111847, -187548, -219670, -276822, -450029, -251682, -68742, -406157, -413601, -271210, -337876, -387604, -272150, -190535, -98734, 109339, 432, -114395, -15946, -413478, -520279, -207477, -432196, -553335, -529102, -253149, 153400, -12361, -292823, -163060, 165135, 171650, 184756, 220677, 294036, 319209, 146217, 35129, 4797, 336156, 572641, 682104, 251053, 247878, 158241, 32610, 44266, 104146, -87866, -156937, -90780, -467602, -533691, -439601, -270896]
20192b70896L68336J03810l10718J4808J4902j28869N2973l6110J37365O04263
20182E49864k29398l75621j49410r5931k0086j55872M57543J21788l83693j19454
20172d00270P823l19578j62298j75981J88806J32912k7428L197j06959J44440
20162g15336j10676K68229L11979J38115r4958Q9946K86125K32036L1925m26017
20152A1368j53866K46146M07662l46746q3982j70125k09810Q5332K47118L45695
20142C78792J81960J54142k64447m30258j18252K55976j94401j22984J88765J60451
20132A89744m3636m37389j56442L3085J5118M70007L43824l16788o20668K99258
20122b23887j21267M8766j18819l1221N08133J26638k22053J31443J30917K13774
$$ y = [-270896, 97440, 201250, -109468, -94660, -79758, -208627, -155654, -191764, -54399, 549864, 320466, -55155, -204565, -300496, -320582, -476454, -18911, 102877, -280816, -400270, -392447, -712025, -874323, -1050304, -861498, -728586, -756014, -752817, -859776, -715336, -826012, -557783, -245804, -107689, -202647, -112701, 173424, 405460, 437385, 11368, -142498, 103648, 511310, 164564, 80582, -89543, -299353, -214021, 33097, 378792, 560752, 714894, 450447, 20189, -98063, 157913, -36488, -159472, 29293, 189744, 146108, -291281, -447723, -414638, -399520, 70487, 414311, 97523, -523145, -223887, -345154, -296388, -415207, -446428, 61705, 188343, -33710, 97733, 228650, 442424]
20112D42424J54824J64706k57031p3090k38776n46322J17137K00095K78254k97182
20102e4961j04351n8645Q6236L10027k7109l54258r253K13118p3587Q5044J19799
20091A32060K53957r886k90921K62859J17677j52380j74356J70564j87603j18399
20081C572m1716M5571J48745l8893j46195Q9024K61378M52960q7336m51637m38107
20070b02634m889J42477K89233j06067j73011p7879P4926m2811M96p7941L36208
20059A58108K80532j71709l01789J1515r5668K1820J78539k02122l45214K3263
20049d42725J06917r01J33441K60758l0886m15351l9486K13167K73472J80073
20039B38479j67034K00648q6665k91637k67314K09750Q568k33327J27231J87112
$$ y = [442424, 597248, 761954, 504923, 431833, 193057, -353265, -236128, -36033, 242221, -54961, -159312, -217957, -131721, 178306, 151197, -203061, -212314, 804, -72783, 12261, 132060, 386017, 376131, 85210, 348069, 465746, 313366, 139010, 309574, 121971, 3572, -38144, 7427, 156172, 117279, -28916, 60108, 321486, 774446, 687110, 235473, -202634, -207523, -65046, 224187, 118120, -54891, -132770, -57844, -100655, -100159, -178100, 158108, 438640, 266931, -34858, -23343, -119011, -97191, 81348, -120774, -465988, -442725, -335808, -336709, -203268, 57490, 26604, -388747, -428233, -215066, 58406, 238479, 71445, 272093, 185428, -106209, -373523, -163773, -155205, -388532, -261301, -74189]
20029g4189R0856K09554R3953n8780k7011j43775j48887j11103r3969p1763r5227
20018d30341o8489L49746J31005K09787Q2522J7412R4588j39298j75380j30391
20008e8839P6877M4547j92934j01383J09023N2155L68280M427n7017M6470j31210
19997A60396j24904j67442O9370J31461j15765j58169j03077j65491K04823J38830
19987a29968k52062K65j16143k08132j55226j29699M61897K25499k02227p8424
19977e84220K17227o4117l02972j02047N02065L01478m0269J59729K53336M324
19967C44534k05191k10677o9145J10150l72554j40985L03280J62639q4362k73104
19957d35415J51181N5848r6133N70K51694j19652j22064R4341K7926J35058Q1825
$$ y = [-74189, 16667, 226221, 320174, 261394, 234383, 90608, -58279, -169382, -263351, -335114, -430341, -498830, -149084, -18079, 191708, 274230, 291642, 386230, 246932, 71552, -58839, 18038, 62585, -130349, -231732, -122709, -70554, 297726, 302153, 245136, 291606, 160396, 35492, -131950, -62580, 68881, -46884, -205053, -308130, -473621, -268798, -129968, -382030, -381765, -497908, -706040, -861266, -990965, -529068, -303569, -505796, -584220, -366993, -431110, -734082, -836129, -334064, -32586, -72855, 86874, 340210, 344534, 139343, -71334, -140479, -30329, -402883, -543868, -240588, -77949, -162311, -435415, -284234, -228386, -324519, -323949, -72255, -191907, -313971, -219630, -191704, -56646, 25179]
19946B5179k12773j33225J03295J76173k4729r7577k83175J34728J08085r7306
19936c01325m0414J27515N0050J47855K62569k21502j80268l18740K01052o6277
19926c39485R0891J9991o3330j51144P5937J21162J18898m3151O1811J1324k10127
19915c07223n5156j97458L0846J79538J94431K67176J48282j58310P9930n928
19905A76128j1496J5202k31884m82199k32935J19513M9503J18885N63181k62974
19895a79076o3306P4053j44037j3673R107R9412J64476K84577j72881k19332P6506
19884h4174M5226L9566Q4488K5881J98925l04537l70836J37903K78538J49708
19874B00688p4070k26880k20774n8924o9913p4472r4954L41516j04944l9463K08778
$$ y = [25179, -187594, -320819, -217524, -41351, -66080, -163657, -446832, -312104, -204019, -301325, -341739, -214224, -164174, -16319, 246250, 24748, -155520, -474260, -273208, -339485, -248594, -228603, -291933, -443077, -367140, -245978, -127080, -170231, -108420, -97096, -307223, -362379, -559837, -528991, -349453, -155022, 112154, 260436, 102126, 182056, 176128, 164632, 179834, -52050, -534249, -767184, -647671, -598168, -479283, 83898, -179076, -242382, -168329, -312366, -326039, -316932, -217520, -53044, 231533, 58652, -160680, -84174, -38948, 618, 85106, 110987, 309912, 5375, -365461, -227558, 50980, 200688, 126618, -100262, -321036, -379960, -449873, -524345, -619299, -277783, -382727, -422190, -213412]
19863b13412j68817j89263K3073L09834K2810o0668K22675Q3817l1228k90176
19853b91355J21779j89442k65812N8341L49030N80666q2297l70664k37800K70219
19843e7335M5041p3322N4915J57522J92668j29870k637j41721l21107j32990R2756
19832c16080m2750L38488j22256J2694L3346K75917K15994j8377K617k67400j11740
19821D53j98268j6829J93226j15009J66798l63606l86186r2158J88035J78939
19811d44605K01134m3443P165j72961j61530N32342J42442j65702j43429l63818
19801f12405J63623m6623L10888K83617P148J00419J56783j67229k6357l88551
19791b18687M5041J34933M4012N5128K05525j33271L46850k72395m29725J11155
$$ y = [-213412, -382229, -571492, -548419, -238585, -215775, -276443, -53768, 30049, -1179, -291355, -169576, -359018, -624830, -566489, -217459, 363207, 280910, -89754, -327554, -57335, -12294, -85616, -30701, 126821, 319489, 189619, 186982, 45261, -275846, -408836, -316080, -358830, -20342, -142598, -129904, -96558, 179359, 395353, 376976, 379593, 112193, 453, -197815, -214644, -21418, -136427, 30371, -333235, -719421, -811579, -623544, -444605, -243471, -286914, -279749, -452710, -614240, -81898, 60544, -105158, -248587, -612405, -448782, -495405, -184517, 99100, 106248, 206667, 363450, 196221, 169864, -218687, -173646, -38713, 5299, 60427, 265952, 132681, 479531, 207136, -222589, -111434]
19781a11434k939K55023L36947L69668P5118j75172k73214o877k48889l10597
19771i2366p6098J36413J9871j11592R0633m0104n8369R321O5838j2470J1632
19760e7291k12408l33119K06340K90417j02619k07195o6553L13952O5570J86091
19750H3185N8217j86032O9691j82885l7776K28779l8469j39398K54986j83818
19740g3520k05314J61175O3899J96885j6683m56615l04954K28407N7096q0404
19730d30028j40550r4643L74337N23040Q5816l140k34639l92469K45133L34792
19720B67649J11125q4923K5841j91272J488j24462k85386K02170j4538J03061
19710A0753j1802J7546j08386N7447p3415K7245J70608k5439k48971N5241l1097
$$ y = [-111434, -114373, 140650, 477597, 847265, 922383, 747211, 473997, 467120, 218231, -92366, -168464, -32051, -12180, -123772, -33139, -73243, -131612, -122291, -56453, -68923, -57291, -269699, -602818, -396478, -106061, -208680, -415875, -482428, -168476, -102906, 83185, 141402, -44630, 25061, -157824, -195600, 33179, -5290, -144688, 110298, -73520, -278834, -117659, -53760, 143125, 126442, -330173, -635127, -406720, -349624, -430028, -570578, -665221, -290884, 232156, 317972, 314832, 80193, -312276, -67143, 267649, 378774, 293851, 319692, 128420, 129908, 5446, -279940, -77770, -92308, 10753, -1049, 16497, -91889, -34442, -107857, -80612, 89996, 64557, -184414, -129173, -160270]
19699a60270l00680K23247P02093p662m11634k23982K14005P9944j92184K3463
19689e3660L2192J61498K33K30124l8585q1984j75874j36644l5646M70373r5575
19678B76452k74376n04535j18340K69932K86971j1045l4078k00364l06690K13626
19668d02447J79497J78491n5481P1562M16697J16824l20163k77035j82879o4652
19658c39586o4528P4542j16423J58075M66107K73485R0246k89343j87615j93012
19648a28052J73585K0043m29381j78737L49690P8135K68416K62498j06088m98291
19638a88182L5283J31314O3095k97172r0894K73534J85570J61213K60378l41314
19628A92825R3234J15711m48141l1796J50032r7826p9946j51123L55975m47078
$$ y = [-160270, -460950, -237703, 464390, 456728, 45094, -178888, 35117, 115061, -77123, -53660, -21468, 140030, 140263, 370387, 331802, 249818, 73944, -62700, -98346, 372027, 276452, 2076, -502459, -620799, -350867, -63896, -74941, -109019, -309383, -616073, -402447, -222950, -44459, -99940, -28378, 388319, 505143, 184980, -92055, -274934, -339586, -404114, -329572, -445995, -287920, 178187, 451672, 541918, 252575, 64960, -128052, 45533, 65576, -363805, -542542, -192852, -114717, 153699, 416197, 310109, -188182, -152899, -21585, 41510, -255662, -346556, -73022, 112548, 273761, 534139, 192825, 286059, 401770, -46371, -78167, 71865, -25961, -105907, -257030, 98945, -348133]
19618c48133r5828L34437J55633p3646M8016m3150L6321j13491n1406K01449J27587
19607A77789j8174j14653l9262q6335J34544r4315p435J38217k9126l454m9282
19596H514L9403k38151l57206J77339j1401P5449l567M6891J37476n2520k14084
19585c91857o6876J29776J08097K4515k87738P343L23714j55568J46152K31069
19575F8627J43177J64156L4427j31290p0461n3880k84990J27855q4703k94301
19565c81383J18442K01898K46494j14253m22493k64469k16756N35389N94251m1582
19555B55538K5107K94726o8562l25766m75146O694J31568K66214j728K01952j21695
19544A88902J76294K63790j46422O8123n7344q7155o9510k8942j25729j44817
$$ y = [-348133, -443961, -109524, 46109, -27537, 20479, -22671, 13650, -99841, -151247, 50202, 177789, 159615, 44962, 5700, -80635, 53909, -40406, -47841, 90376, 61250, 57796, 8514, 47917, -190234, -547440, -370101, -381502, -306053, -309620, -262729, -125253, -177773, -391857, -458733, -328957, -220860, -196345, -484083, -476740, -153026, -308594, -162442, 68627, 211804, 375960, 410387, 279097, 208636, 154756, -130234, -2379, -87082, -381383, -262941, -61043, 185451, 71198, -351295, -615764, -832520, -297131, 297120, 255538, 280645, 575371, 506809, 181043, -294103, -287409, -155841, 110373, 108645, 310597, 188902, 365196, 628986, 482564, 550687, 493343, 406188, 336678, 307736, 182007, 37190]
19534C7190n1092K7117j07612J39982k05459j14533L47885k55916m7908J48055
19524h2291J31624n3133l55633k16128P1687N03402J28781K2936j33021j44811
19514a26587M6990j39878j30500J43715J23647L18217J29424J49776P725l14944
19504B07585j91714p3682k94689k00035k32988L48750J23337R7381K06172J79996
19494A70113J49069L9274K9822j76092k76679k98110k32800K11878Q4196J4808
19484b84521n4034K7206J57747J43589l4214m78587j53317J9033K92796J64512
19474a99790o4649o489j54318j33492o8228N007L59813J88481N3007l53587j71505
19463e45750Q5864J16773l265r3450J38378L04423N85621M83539k76845l56956
$$ y = [37190, -13902, 13215, -94397, 45585, -159874, -274407, 73478, -182438, -230346, -82291, 49333, -3800, -359433, -575561, -503874, -472, 128309, 151245, 18224, -126587, -79597, -219475, -349975, -206260, -82613, 235604, 365028, 514804, 522529, 207585, 15871, -57811, -352500, -552535, -785523, -436773, -313436, -216055, -9883, 170113, 319182, 358456, 388278, 212186, -64493, -362603, -595403, -383525, -299329, -284521, -338555, -311349, -153602, -10013, -44227, -522814, -676131, -657098, -364302, -199790, -264439, -270928, -425246, -558738, -626966, -621959, -262146, -73665, -20658, -374245, -545750, -459886, -343113, -346378, -439828, -301450, 2973, 588594, 1072133, 795288, 438332]
19453D38332m25752o9357p2428j18396J18934K39460K38515J1687m29806j01609
19443a70420K66829o9081Q783J64285k99334j16819j07022k92407M98023L81957
19433B64794o1281j9427k28388k84853j11423l30321L2337L67298J04783j36868
19423d03349q6993J30863M22633O3813l2092p8053k39176j31081q9731J09074
19413c34092j29261J81760J41541j61700m8135L43112K46262m85746n23447m0428
19403h10134P7627j50095K48133O64337M08140l2566j997p9819j80263j09801
19393C3562j80368m1010l66137J08286k7565J20131K65603J42933k843l64419
19383c11827j6631n0051O1273K19511J88227j97007j45622k06491o3125R6329
$$ y = [438332, 12580, -56777, -129205, -247601, -128667, 110793, 349308, 360995, -68811, -170420, 96409, 27328, 36111, 200396, -98938, -215757, -322779, -615186, -117163, 264794, 203513, 184086, -44302, -329155, -440578, -770899, -738562, -371264, -266481, -403349, -490342, -359479, 63154, 126967, 94875, 16822, -222354, -353435, -443166, -334092, -463353, -281593, -140052, -301752, -349887, -6775, 239487, -246259, -769706, -810134, -732507, -882602, -634469, 29868, 438008, 405442, 403445, 323626, 143363, 33562, -146806, -187816, -553953, -445667, -473232, -353101, -87498, 55435, 52592, -311827, -328458, -378509, -317236, -97725, 90502, -106505, -252127, -458618, -521743, -425414]
19373d25414q4852J79186L68832L40672r5129m35719j3151K38515J15938r924
19363A78954K30489R3007J66727j76763k06651L5635l020j51372j29364m18496
19353c80854Q4310M78515l62063o37116J59406K64794J03552l1658J04367j50319
19343c67066k030J3247r6317q8861k24013o8880K57853L49732j76201K60449J03285
19332c8802n54553K0130m9981J53782j54418K31534J31378K14220L75662n72946
19322b43994l87756K49469R1058K64026K1877J0248k20568l39861k04522J61960
19312e98063N14392J97138k05623l10686K45900l0377j65373k4241J97174J74874
19302d885J46371L4909j84935j74566J7142K0778R1423M86301j622n5023r6436
$$ y = [-425414, -510266, -331080, 37752, 378424, 283295, -152424, -165575, 72940, 188878, 178954, 409443, 502450, 669177, 492414, 285763, 321398, 318378, 167006, 37642, -380854, -296544, 181971, -180092, -817208, -657802, -393008, -289456, -321114, -216747, -367066, -369096, -355849, -452166, -541027, -765040, -833920, -576067, -226335, -402536, -142087, -38802, -593355, -573225, -623206, -469424, -623842, -392308, -260930, -46710, 328952, -243994, -631750, -382281, -291223, -27197, -5320, 4928, -215640, -555501, -760023, -598063, -83671, 113467, -92156, -402842, -156942, -187319, -352692, -376933, -179759, -4885, 141486, 176395, -8540, -183106, -165964, -145186, -53763, 432538, 430916, 375893, 279457]
19291B79457j01124j13931N0776r0555k46339N9602q7380P096o9281J35449q8260
19280b64490j64665J60323K22205K82118K20611k59578k50847L27186K47515q8869
19270D31509l79254j97813L64338J47449M5802k51019j16996J6888N88488j14178
19260E35214k18765J49182K85471Q2093O8228K58249J11006J52092k20864j51518
19250A050388l2652k77463l37680Q870J47577L80681j47533P479p6540j49564
19240E73563r1780k8107K66902L24966R4947l46191k69654m18716l7790J52864
19230B21004o0695p3942J54659J10645j96238q0616J59665j02082j9325o2296
19220E0779l11699J42646L51376o6233q8948q2251r1064N008J85255j63887j79392
$$ y = [279457, 178333, 64402, 115178, 24623, -221716, -162114, -249494, -242398, -311679, -176230, -264490, -429155, -268832, -46627, 235491, 456102, 196524, -54323, 272863, 520378, 431509, 52255, -145558, 218780, 366229, 412031, 161012, 44016, 60904, 649392, 535214, 316449, 465631, 751102, 833195, 901423, 1159672, 1270678, 1422770, 1201906, 1050388, 1017736, 740273, 402593, 411463, 559040, 939721, 792188, 799667, 723127, 573563, 481783, 453676, 720578, 1045544, 1140491, 794300, 524646, 105930, 68140, 221004, 160309, 86367, 241026, 351671, 155433, 74817, 234482, 132400, 113075, 50779, -260920, -118274, 233102, 166869, 77921, -4330, -95394, -90386, 94869, -69018, -248410]
19209b48410J51951J53347K14087J21813J16972L71480M82854j61756j93558j80557
19199H28223J17437l46285k14499K49258R3530j40732L28946J62971l19263o02451
19189A57135k72298J32601j47063k16162M03429J19448j38356L06316k9849q2069
19179B33132K17294N6899k01151K24970l31926k83892M1872k2887l11259l01646
19169f78594j33871M64742L91543N9024M9896r4791J84817k67896M3234k84483
19159b66379J57522Q1698J72850j28578M9505N438L68293R5213l02975l49189
19149a16602m910j28636o8322j31531J04078p7211K71898J09846J0766N0224j15561
19138i5961p8834K88266M61737m3575J0285o3343m16563k08722N62368m8720j68763
$$ y = [-248410, -96459, 56888, 270975, 392788, 509760, 881240, 1364094, 1202338, 1008780, 828223, 945660, 599375, 384876, 634134, 727664, 586932, 915878, 1078849, 759586, 157135, -115163, 17438, -129625, -345787, 57642, 177090, 38734, 345050, 315201, 233132, 450426, 507325, 306174, 531144, 199218, -84674, -42802, -65689, -376948, -678594, -812465, -347723, 43820, 102844, 152740, 57949, 242766, -25130, 18104, -266379, -108857, -27159, 145691, 17113, 66618, 72056, 440349, 535562, 232587, -116602, -121512, -250148, -318470, -450001, -345923, -423134, -151236, -41390, -30624, 19600, -95961, -174795, 113471, 575208, 531633, 541918, 478575, 62012, -146710, 415658, 366938, 198175]
19127A98175j61604N9133K01433k5007k68338J67270L64133q8920k07722k628
19117B35925R9555K4653l7040m0417j56011j35918J44800p3089N4232L89517k21546
19106B84661j49439K27348p5317j62458o3063K1168L0041k1317q7150m2837L4747
19095c616L3044j71500j71516n94317J06865L92576J97555K23399M6628k75157
19085b16039P6262J8139J33115L11947j14192j13099K25598k75257j7754J31513
19075A60233p7845R5491r0017l46917K784J69239N0978j26588o07953j18927M61999
19064d27523n3068r4038L26155m7187K31705J0824K4639L39857n0153q0774k9637
19053A50800r1368k93519K2198J07467K72267j45941J1334J53827J6258j65968
$$ y = [198175, 36571, 95704, 297137, 272130, 3792, 171062, 535195, 446275, 238553, 235925, 335480, 360133, 323093, 282676, 126665, -9253, 135547, 62458, 116690, 506207, 284661, 135222, 362570, 287253, 124795, 61732, 82900, 112941, 91624, 4474, -38363, -3616, 29428, -142072, -313588, -907905, -801040, -408464, -210909, 12490, 59118, -216039, -139777, -121638, 11477, 323424, 209232, 96133, 321731, 46474, 28720, 160233, 82388, 177879, 87862, -259055, -256271, -87032, -36054, -162642, -770595, -889522, -427523, -480591, -574629, -248474, -295661, -63956, -53132, -28493, 311364, 261211, 180437, 150800, 59432, -234087, -211889, -104422, 167845, 21904, 33238, 187065, 203323, 37355]
19043C7355J87335K75491j8379k26067j93818l74015k17501L86602K23257M924
19033H5184j53971j94165J6683J1589p3128J24411k7299J09154l8440o6022J75538
19022c0466p7419J24967K24720K58994J98316j48770l88905K4357K8991l60984
19012a46199Q0662R3863p6002J02338J15557j68809k24472m7373J37884j3778
19002a46329K73706j10551j7417k39208j98387j00906J75850K81860L7466K73668
18992B29752M301j58433j00090J20376q7136N8207K05690n5540m88175k75534
18982e46582K27098K46592K63377l9178k09946n7450K32242M17561j0721l15468
18972B07525l50961M21532Q7792J20969j44373m85773k4813K42900j19005L5408
$$ y = [37355, 224690, 500181, 481802, 255735, 61917, -312098, -529599, -142997, 80260, 85184, -68787, -262952, -246269, -234680, -307808, -183397, -210696, -101542, -139982, -206004, -30466, -107885, 17082, 241802, 500796, 699112, 550342, 161437, 185794, 214785, -146199, -65537, 28326, -47676, 54662, 170219, 1410, -223062, -270435, -132551, -146329, 127377, 16826, -591, -239799, -438186, -539092, -363242, -81382, -43916, 229752, 234053, 75620, -24470, 95906, 8770, 66977, 272667, 217127, -271048, -546582, -319484, -72892, 190485, 151307, -58639, -116089, 116153, 533714, 522993, 207525, -143436, 278096, 365888, 486857, 342484, -143289, -168102, 74798, -44207, -8799]
18962h799N20902N4409n1078j21218j12744l02725m9218K48967K24167L67872
18952G70535l6382l58796j04543R6132J14012j44769L06385J34382k71961r1482
18942D13513P3542K36996R3750q6813J2190N7031K58951J08782m95429k08607
18932D63906n911M07424R8881l44751k3391N8779N9194Q102R6353q1209p52516
18921a5139o5326K67414J50693l56341j61766k16114p3762L45070K51566O138
18911A32433K6441N2043o4349j58222j03948L34084Q8951j94369K36457l4698
18901C14823l11671L4733L9681m02519q10N01837N0166N16j52264j6794k12533
18890a54835l7856O05240K16652K89943j52304r0236J29941J64492J00028L44384
$$ y = [-8799, 512103, 566512, 515434, 394216, 281472, -21253, -70471, 178496, 402663, 770535, 734153, 375357, 270814, 366946, 480958, 336189, 642574, 776956, 504995, 413513, 487055, 724051, 817801, 730988, 743178, 800209, 1059160, 1167942, 672513, 463906, 457995, 865419, 964300, 619549, 596158, 654937, 714131, 722233, 818586, 737377, -15139, -80465, 186949, 337642, -18699, -180465, -396579, -470341, -125271, 126295, 132433, 158874, 210917, 146568, -11654, -115602, 218482, 307433, 113064, 349521, 314823, 3152, 37885, 77566, -324953, -325763, 176074, 226240, 226756, 74492, 57698, -154835, -192691, 412549, 629201, 919144, 766840, 676604, 806545, 971037, 1071065, 1415449]
18880A415449Q3440M6672k13353N0460P9939J68994j94951k76820j03342k27742
18870H28746J2331M96j99009k04633m05344r8247N19095R0405q5516j4375q2500
18859C61449j70940j50647r4042p4945J73676L30425N3473J59145J02436P1033
18849G61063k72951j84770j64645J17380K9705K01251K73425k19666j99931j57903
18839A82958j5834J57269K02555P8822k60440o8155J65916j84485j41194Q1466
18829A98878J85888J95713K06969K79256j85862J4689o4176l74829R0405r185
18819E37746R5620L14350k51811j49588k0327J07889O1116k38944k73523K3336
18809B05864M05008J26925l26602K68860K68146k72817n0959J42315K8687j88553
$$ y = [1415449, 1498889, 1545561, 1332208, 1382668, 1462607, 1631601, 1436650, 1159830, 1056488, 828746, 841077, 841573, 642564, 437931, 32587, -65660, 453435, 543840, 458324, 443949, 361449, 190509, 39862, -54180, -129125, 44551, 374976, 428449, 587594, 690030, 761063, 488112, 303342, 138697, 256077, 285782, 487033, 760458, 540792, 340861, 182958, 167124, 324393, 526948, 605770, 345330, 277175, 443091, 258606, 117412, 198878, 384766, 580479, 787448, 1066704, 880842, 895531, 831355, 456526, 546931, 537746, 633366, 947716, 695905, 546317, 525990, 633879, 694995, 456051, 182528, 205864, 610872, 737797, 411195, 680055, 948201, 675384, 624425, 766740, 795427, 606874]
18799F06874K00059Q9512L30597K13069R225L06916L40472j6697J60695k44439
18789A996283k81929k4189M19313M21470K68318P04K7822K11138N51543M1334
18779C631807N4166N41419N22114M11137L24764L04542M62859O34538N73117M58141
18769G918604P83520J181269J508616J877858K216750K910411L967424O238602
18761B8603054Q802487J1429277J3069635J2700294J2005404J3514551J6287732
18754A16412434J8458214J6696357J1286671O158569J898013M81394Q92539J579755
18746A73863946j378607r140835j5817838j7494836j5578693j2580687j2332212
18739H9540238j4005433j3927808j2806072j0199160p500653n345892l424844
$$ y = [606874, 806933, 896445, 1227042, 1440111, 1449336, 1756252, 2096724, 2080027, 2240722, 1996283, 1714354, 1690165, 2109478, 2530948, 2799266, 2799970, 2827792, 3038930, 3590473, 3631807, 3685973, 4227392, 4749506, 5160643, 5485407, 5789949, 6252808, 6887346, 7460463, 7918604, 8702124, 9883393, 11392009, 13269867, 15486617, 18397028, 22364452, 28603054, 37405541, 48834818, 61904453, 74604747, 86610151, 100124702, 116412434, 134870648, 151567005, 162853676, 169012245, 170910258, 171391652, 172284191, 173863946, 172485339, 163344504, 147526666, 130031830, 114453137, 101872450, 89540238, 75534805, 61606997, 48800925, 38601765, 31101112, 25755220, 22330376]
18732B2330376k393845k128272j475662r77630p69809l16977o6081j92965J09363
18723A4118498j4603j03426K61953L30486M50488O60512Q76179P94857J108776
18714A8483720K241163L509440M588292O802728R815202J2727911J4980159J4775677
18706H7924292J3541584J5211830J9579755K1595683J8106841J0448413M412317
18699A90820715J041515Q97860R74210q53634m444380j1348672j7897082j8810650
18691A40379882j6380142j4267166j3985645j5189691j5240493j4035564j1364607
18684C9916574q355426n689006m364453k716433k135036j824335j588194j328510
18676A1915181j020796p32894o15907q03844o79500k82223l01582n12997p49729
$$ y = [22330376, 19936531, 17808259, 16332597, 15354967, 14585158, 14268181, 14202100, 14009135, 14118498, 14103895, 14000469, 14262422, 14592908, 15043396, 15703908, 16580087, 17374944, 18483720, 20724883, 24234323, 28822615, 35625343, 45440545, 58168456, 73148615, 87924292, 101465876, 116677706, 136257461, 157853144, 175959985, 186408398, 190820715, 191862230, 192760090, 193734300, 192880666, 188436286, 177087614, 159190532, 140379882, 123999740, 109732574, 95746929, 80557238, 65316745, 51281181, 39916574, 31561148, 25872142, 21507689, 18791256, 16656220, 14831885, 13243691, 11915181, 10894385, 10161491, 9545584, 8741740, 8062240, 7780017, 7478435, 6965438, 6215709]
18667F215709k72155n12333m33086m34035K899m50523n69292j65706n48749m76506
18657B356223k93704j61201o174j80802J89050L05219N0135k14173j07247m44891
18647A492435M0127J8380l14465k03531j33247J96274K6143k07950l21939J75914
18637G68141O14173k3022j73312O8828J78396O4578k87211l7414P1897o6643j95810
18626I82601J93273L43651p3041j63174j9002j07193j42110m13617j09482L06153
18616G98059J53496R219J75752O3470j00219q9471k87021l81156m46829K69113
18606A64413J00965K8343K47971L41299L11229J93430K19013k6007p2988l27059
18596A180609k57043k2160M44093l3846k53819L3684J86696K35095l4788K07363
$$ y = [6215709, 5943554, 5431221, 4998135, 4564100, 4566999, 4116476, 3547184, 3381478, 2832729, 2356223, 2062519, 1901318, 1895144, 1714342, 1903392, 2208611, 2258746, 2044573, 1937326, 1492435, 1532562, 1550942, 1236477, 1032946, 899699, 1095973, 1122116, 914166, 592227, 768141, 1382314, 1359292, 1185980, 1254808, 1433204, 1497782, 1210571, 1173157, 1245054, 1178411, 982601, 1175874, 1519525, 1446484, 1283310, 1264308, 1157115, 1015005, 601388, 491906, 798059, 951555, 960774, 1136526, 1199996, 1099777, 1010306, 723285, 342129, -104700, 164413, 265378, 293721, 541692, 882991, 1194220, 1387650, 1606663, 1580656, 1507668, 1180609, 923566, 901406, 1345499, 1311653, 1057834, 1091518, 1278214, 1513309, 1478521, 1685884]
18586A685884j26519j45419J08265k33893o8524j15297L6567N8887J3983k14507
18576I99427j35348l01447j87151J10166k8569J11209N6297o1067p4768j67258
18566C21491l13863j00974j59982L08360L93229M36034L6894m00881m3363O2613
18556E39558K22191M1112J64983J31940N5759j15464m9432j22635k03715j80376
18546D83921J08403N23420J95312K33834J83663k15281p8535m82122j34982N7724
18536H75357J67113n716m76174m41960K03155L27257L8687O0662m7327m05659
18526B95395k11794K56950M67624L03525J21581j74211j40445k10611k8087J08681
18516G88608l0413k62691p7662K85801J30286j5197L99021k2825k28208N335q3470
$$ y = [1685884, 1559365, 1413946, 1522211, 1288318, 1219794, 1104497, 1141064, 1199951, 1213934, 999427, 864079, 562632, 375481, 485647, 457078, 568287, 624584, 563517, 488749, 321491, 7628, -93346, -253328, 55032, 448261, 884295, 921189, 520308, 476945, 539558, 761749, 802861, 967844, 1099784, 1155543, 1040079, 990647, 868012, 664297, 483921, 592324, 1115744, 1311056, 1544890, 1728553, 1513272, 1434737, 952615, 817633, 875357, 1042470, 1036754, 560580, 118620, 321775, 649032, 687719, 748381, 701054, 295395, 83601, 340551, 808175, 1111700, 1233281, 1059070, 918625, 708014, 679927, 788608, 758195, 495504, 417842, 703643, 833929, 818732, 1217753, 1194928, 966720, 972055, 888585]
18505H88585J60632J55829l5755R0803r2824L4313k08828j32913M7577q0675K0369
18494H47113j90458R1116J00768J72950K1881K8524K2582j31255k03688k12254
18484E47279L1563o6726L24131K47424K93048l274k72061k97319K3422J50444
18474I77931J85937J64237L07558K47028K43171j85190j4098j04836P667l3464
18464A795941j43088J52169K23803J42798k0616L5062j52603L20926K99024J22990
18454B776406K75413P5415M71201M25843N26881K67140M76312K64219L20352P39704
18444F618886J128677J081062J126153J249416J669830K747022L448492N018059
18436B4087597P351717R938159J2019513J0714042P972025Q170148J2332156J8483369
$$ y = [888585, 1049217, 1205046, 1169291, 1260094, 1167270, 1201583, 992755, 859842, 907419, 826744, 847113, 656655, 747771, 848539, 1021489, 1043370, 1071894, 1094476, 963221, 759533, 547279, 578842, 512116, 836247, 1083671, 1376719, 1373445, 1101384, 804065, 827487, 977931, 1163868, 1328105, 1635663, 1882691, 2125862, 1940672, 1926574, 1821738, 1829405, 1795941, 1652853, 1805022, 2028825, 2171623, 2151007, 2186069, 2033466, 2354392, 2653416, 2776406, 3051819, 3127234, 3598435, 4024278, 4551159, 4818299, 5294611, 5558830, 5879182, 6618886, 7747563, 8828625, 9954778, 11204194, 12874024, 15621046, 19069538, 24087597, 31439314, 41377473, 53396986, 64111028, 72083053, 80253201, 92585357, 111068726]
18428A11068726K2696818J7011571M587065n062734n036232J376388Q353269O803686
18420A61798557n516904j7313912k0336923j7260230j1628862q227332r391298
18413G2123096j1754546j1938558j0236376p446903n236342l846828k495823j567664
18405A7600056j249210j085600p40868n06391l87126m53466N8937J20407j24705
18396A3232034J02617J78630N58534J44644L58266J025774J030416J466054J607109
18387A9704078K372623L896840N550182Q119453J1622122J5762335J6882415J2713205
18379I6623253J0022264J3225307K1067938L1090698L0912683J3883865l341272
18372B13484736r694625m514406P613121J3704550J633054j7356396k7845122
$$ y = [111068726, 133765544, 150777115, 155364180, 150301446, 145265214, 146641602, 154994871, 161798557, 156281653, 138967741, 118630818, 101370588, 89741726, 81514394, 72123096, 60368550, 48429992, 38193616, 30746713, 25510371, 21663543, 19167720, 17600056, 16350846, 15265246, 14524378, 14017987, 13630861, 13177395, 13236332, 13356739, 13232034, 13334651, 13513281, 14071815, 14216459, 14574725, 15600499, 16630915, 18096969, 19704078, 22076701, 25973541, 31523723, 39643176, 51265298, 67027633, 83910048, 96623253, 106645517, 119870824, 140938762, 172029460, 202942143, 216826008, 213484736, 203790111, 199275705, 206888826, 220593376, 222226430, 204870034, 177024912]
18365A77024912k7585577k0519542j2861004j1528414j4691953j6101733j5329808
18358E8406881j2609411r654798o621320m706526l385319k459959k215813j770175
18350A4983560j405042j146501j031695j130563n89432o61835r08792m33693p71583
18341F904424q46305o73277l67943m0740m7107m58583l95279k14122j44654m11908
18331C304506l78446j51481p7484k57644j12949J82289k57313l50086j9061J44711
18321B027042Q4210j04056j14279J04663J4556J23888j63606l28578M2768J2969
18311A699577j22901J0409M146L15751j07385j28259j32463l0102k2416k20110
18301A266247K7932L21399J02223j50992M2524K17731R6035J10077k88188l21407
$$ y = [177024912, 149439335, 128919793, 116058789, 104530375, 89838422, 73736689, 58406881, 45797470, 36142672, 29521352, 24814826, 21429507, 18969548, 16753735, 14983560, 13578518, 12432017, 11400322, 10269759, 9680327, 9018492, 8109700, 7676007, 6904424, 6058119, 5384842, 5016899, 4976159, 4929052, 4470469, 4075190, 3861068, 3716414, 3304506, 2926060, 2774579, 2697095, 2439451, 2326502, 2508791, 2251478, 1901392, 1882331, 2027042, 2111252, 2007196, 1892917, 1997580, 2012136, 2136024, 1972418, 1643840, 1686608, 1699577, 1576676, 1587085, 1591231, 1906982, 1799597, 1671338, 1538875, 1508773, 1486357, 1266247, 1294179, 1615578, 1717801, 1566809, 1609333, 1827064, 1923099, 2033176, 1744988, 1423581]
18291A423581O3322J54820m8259j35448j96237j91476K99708Q6905m90312o01590
18281C65014L1529j45118L46260K65228q2268r8795R1288r303N0152j6376J76449
18270I74060K3108O299J57449q0028J87573R9213K7093J57252K01173l520j68391
18259A581281j01678l2888Q2794N7894m5322m68110k26893K88573J71179m763
18249A302067k95490J09362J6928l65148l3582L40521J90840K8478R0541k9741
18239A354776j49829K39116L12135p3473j86134l27866k4600M86801J5318j63541
18229A482703r8304q8495j79774k9316j0410K033l61367k31574J85942r8517j71407
18218D01514O0381K47344N25537k1111l09967J88283P7014J31519L0107P5661
$$ y = [1423581, 1486903, 1641723, 1593464, 1458016, 1261779, 1070303, 1370011, 1456916, 966604, 365014, 396543, 251425, 597685, 862913, 780645, 681850, 773138, 763835, 813987, 797611, 974060, 997168, 1003467, 1160916, 1080888, 1268461, 1367674, 1394767, 1552019, 1753192, 1749672, 1581281, 1479603, 1446715, 1529509, 1587403, 1542081, 1073971, 847078, 1135651, 1306830, 1302067, 1006577, 1115939, 1132867, 767719, 734137, 1074658, 1265498, 1293976, 1384517, 1354776, 1204947, 1444063, 1756198, 1682725, 1496591, 1168725, 1144125, 1630926, 1646244, 1482703, 1384399, 1295904, 1116130, 1086814, 1076404, 1078437, 717070, 485496, 671438, 572921, 401514, 461895, 709239, 1234776, 1213665, 903698, 1091981, 1168995, 1300514, 1330621, 1406282]
18208A406282J29416O8901j83642M0974L0684k28088K22726j70658j75340K1578
18198A162833k18220J38875L28274l29355K65308K98672O5969M2827l8959K5251
18188A741475Q406j85794K21640K96964M1676o2652K47764l07346j48317k42697
18178A611119k98708L24661o3507P5038J78403m08045l7508J73083P7110R0408
18168A722054K44678K19891J84160J32429j28025l4598L28735J33429J18648J22396
18158C043797M91598Q5387J41168J15745r230L33136M85507J2436j5054j13547
18148D570943J92825J037822Q84708N90171J294725J387911J684754K865181M091407
18139A8600447N816971Q557908J3016871J8450149K2767820J8025745L479583
$$ y = [1406282, 1535698, 1604599, 1420957, 1461931, 1492615, 1264527, 1487253, 1316595, 1141255, 1162833, 944613, 1083488, 1411762, 1082407, 1347715, 1646387, 1712356, 1755183, 1716224, 1741475, 1749881, 1564087, 1785727, 2082691, 2124367, 2061715, 2309479, 2002133, 1853816, 1611119, 1312411, 1637072, 1573565, 1648603, 1827006, 1418961, 1381453, 1554536, 1631646, 1722054, 1966732, 2186623, 2370783, 2503212, 2375187, 2340589, 2669324, 2802753, 2921401, 3043797, 3535395, 3620782, 3761950, 3877695, 3868465, 4201601, 4687108, 4699544, 4684490, 4570943, 4763768, 5801590, 6686298, 7276469, 8571194, 9959105, 11643859, 14509040, 18600447, 24417418, 32975326, 45992197, 64442346, 87210166, 105235911, 108715494]
18132A08715494o983524j0161039o921227J588656J0765915J4930144O859542
18125A18793961r538531j8697529k0716980j8497319j3201320q207868n245763
18118B4688651l792724k954893j905902j540098j045246k56583o56545p14310
18110A1822350q6563q3721J12872L19553J40361N56184O66159N28587P31224R55733
18100A5662739J483346J974468K693077M095582N800074Q320321J2522353J8893180
18092G1445140K6102988L0531209K3248278M055368r476181j1631913n586806
18085A28688083O848870K0235093K6904612J7772418m399138k2852609k9569084
18078A43628245k6332604j7546811o747384K417560M719842k972374j2573972
$$ y = [108715494, 101731970, 91570931, 84649704, 86238360, 97004275, 111934419, 118793961, 109255430, 90557901, 69840921, 51343602, 38142282, 29934414, 24688651, 20895927, 17941034, 16035132, 14495034, 13449788, 13193205, 12536660, 11822350, 11735787, 11652066, 11764938, 12084491, 12224852, 12781036, 13447195, 13975782, 14707006, 15662739, 17146085, 19120553, 21813630, 25909212, 31709286, 40029607, 52551960, 71445140, 97548128, 128079337, 151327615, 155382983, 145906802, 134274889, 128688083, 135536953, 155772046, 182676658, 200449076, 196049938, 173197329, 143628245, 117295641, 99748830, 93001446, 95419006, 100138848, 97166474, 84592502]
18071H4592502j5932188j5760741j2527239q637211n475121l797854k643403k248893
18063A7569852j649280j030985o21334o63116o06147o84907m86432n04800l28033
18054A0994818l04044l29012q6721K02537L82434N21809L54844J225055J489521
18045A4451241K076549L173863M570815O896457J0986959J6765908K2955332K3296660
18037A05173784J0951250n138273j2200561j2021446n733745L979224J2214199
18030I7224432J1964400o64561j4499442j9483720j8955305j5213465j0458515
18023B9913824p354559m725995k781927k151254j754259j544976j265927j218319
18015G116608r15924j29933j82579m91941j85226m19163n03435j60604j90510
$$ y = [84592502, 68660314, 52899573, 40372334, 31735123, 26260002, 22462148, 19818745, 17569852, 15920572, 14889587, 14268253, 13605137, 12998990, 12314083, 11827651, 11322851, 10994818, 10690774, 10361762, 10275041, 10477578, 10860012, 11381821, 11736665, 12961720, 14451241, 16527790, 19701653, 24272468, 31168925, 42155884, 58921792, 81877124, 105173784, 116125034, 110986761, 98786200, 86764754, 81031009, 85010233, 97224432, 109188832, 108524271, 94024829, 74541109, 55585804, 40372339, 29913824, 22559265, 17833270, 15051343, 12900089, 11145830, 9600854, 8334927, 7116608, 6200684, 6070751, 5888172, 5396231, 5211005, 4791842, 4288407, 4127803, 3937293]
18006C937293K9424l17570j05230J01495p3823o7635l73531k81830p2981k56833
17996B518779m87608j28551O14687q8835k76114k79870N1178l29329m45449q6224
17986A062664N9407N98819K61979m66059j17264K12414J30547r1339l9257j67374
17976A444537k03647k27024Q8814M6067K30508k13148k60428N93385M04887n8959
17966A844992k03092j92439p0816k03259p6987K31623K03519J13282Q8882r4760
17956A640945k8396k08961j34366n5361j96205m8152l32812l06837K14621O03949
17946A148425J92139Q8999k07202k6473j06785Q4801O9554j19978n6909K88798
17936A355369J78560J88351J69315k5836N8933J07033l7124j81638p3400J75478
$$ y = [3937293, 3966717, 3649147, 3543917, 3645412, 3571589, 3503954, 3130423, 2848593, 2775612, 2518779, 2031171, 1902620, 2517307, 2428472, 2152358, 1872488, 1923666, 1594337, 1148888, 1062664, 1122071, 1720890, 1982869, 1516810, 1399546, 1611960, 1742507, 1651168, 1611911, 1444537, 1240890, 1013866, 1102680, 1148747, 1379255, 1166107, 905679, 1499064, 1903951, 1844992, 1641900, 1449461, 1378645, 1175386, 1098399, 1330022, 1533541, 1646823, 1735705, 1640945, 1612549, 1403588, 1269222, 1213861, 1017656, 969504, 636692, 329855, 544476, 1148425, 1340564, 1429563, 1222361, 1195888, 1089103, 1173904, 1243458, 1123480, 1066571, 1355369, 1533929, 1722280, 1891595, 1865759, 1924692, 2031725, 1994601, 1812963, 1739563, 1915041]
17926A915041k080m59083J57849J11007L31533L24718k26684k24715M8120N3202
17916B028908P0718p2640j29082L62211J61950O0250k79377J15023m8035O21099
17906B891025J58211R4738L68450j74957l66866l37141O7532K79971m2280p506
17896B931177J33735r7037J28590L21047J93666N532j71678k76274J7726J88964
17886C375448R6247L18639O59475L19626j30819P70780R37494P14797N14023O00992
17876H176702J047712R08685L15898P41523J203714R58901P72657Q63441J254676
17867A6243909J375479J814257J884156K383272L194703M607082N827658P881599
17859D5212115J0576683J5997881K4241896L6503627N3445737P0082713P1527367
$$ y = [1915041, 1912961, 1453878, 1611727, 1722734, 2054267, 2378985, 2152301, 1927586, 1975706, 2028908, 2099626, 2026986, 1897904, 2260115, 2422065, 2482315, 2202938, 2317961, 2269926, 2891025, 3049236, 3143974, 3512424, 3337467, 2970601, 2633460, 2700992, 2980963, 2938683, 2931177, 3064912, 2967875, 3096465, 3417512, 3611178, 3616710, 3445032, 3168758, 3186484, 3375448, 3471695, 3790334, 4449809, 4769435, 4638616, 5409396, 6346890, 7061687, 7575710, 8176702, 9224414, 10133099, 10448997, 11190520, 12394234, 13353135, 14125792, 14989233, 16243909, 17619388, 19433645, 21317801, 23701073, 26895776, 31502858, 37330516, 45212115, 55788798, 71786679, 96028575, 132532202, 185977939, 256060652, 327588019]
17852C27588019M4450249N117343j2805257p222118J0593815K3460085J4784555
17845D05966691j2377685m0249655m5181060l1477699p640161J4654897J7491801
17838C01187129j37452j6950509j9080274r268662L337142L036550j4819792l4607019
17830B12697113m2522278l9856593l1243103k1531391j4277163r495863o361832
17823D7408890m953735m041423k867811j671116q28888k01994O2705N02459J263139
17814C4672226L056381N426819Q760681J3595169J9057690K2667606J7874465
17807A25111037N005855j131644J475681J0381133K3546660L1743412K0840018
17800B16972152n644265k1800668k4087626j6673142l207817O326726J71138j6466511
$$ y = [327588019, 372038268, 377155611, 364350354, 357128236, 367722051, 391182136, 405966691, 393589006, 353339351, 308158291, 276680592, 269040431, 283695328, 301187129, 301049677, 284099168, 265018894, 255750232, 259087374, 262123924, 247304132, 212697113, 170174835, 130318242, 99075139, 77543748, 63266585, 53770722, 47408890, 42455155, 38413732, 35545921, 33874805, 33045917, 32843923, 32906628, 33409087, 34672226, 37728607, 43155426, 51916107, 65511276, 84568966, 107236572, 125111037, 130116892, 128985248, 130460929, 140842062, 164388722, 196132134, 216972152, 211327887, 189527219, 165439593, 148766451, 145558634, 151885360, 152056498, 135589987]
17792A35589987k3614424k5098528k1587814j5851838j0808879o833505m669011
17785B7125988l617004k509768k105871j548803j185263r58400n10574l86206
17777A4304099l69924o63007o34634n51497p64145k34590O886J75910L77388L27759
17767A1974245P20405J037215J389783J772028K993030M936269P678531J2074122
17759D4575628J7552927K0558599J4259147o89957p633746p610043k678590N190310
17751H3524275R651648K610519j0337683j6306772j7088849j4324841j0175779
17744B7552518o658782l941906k767901k447190k028779j092163j058168q02064
17736F755565n97324m83137j87722n65087m31947m29614M530K10161l07523n65018
$$ y = [135589987, 111975563, 86877035, 65289221, 49437383, 38628504, 31794999, 27125988, 23508984, 20999216, 18893345, 17344542, 16159279, 15200879, 14690305, 14304099, 13934175, 13271168, 12636534, 12085037, 11320892, 11086302, 11093188, 11269098, 11646486, 11974245, 12694650, 13731865, 15121648, 16893676, 19886706, 24822975, 32501506, 44575628, 62128555, 82687154, 96946301, 96256344, 88622598, 81012555, 78333965, 83524275, 93175923, 95786442, 85448759, 69141987, 52053138, 37728297, 27552518, 20893736, 16951830, 14183929, 11736739, 9707960, 8615797, 7557629, 6755565, 6158241, 5675104, 5487382, 4922295, 4490348, 4060734, 4065264, 4275425, 3967902, 3402884]
17726C402884r2426J00557m82295N7800m2346k68637o00717L4836J01757j94882
17716B016531k48529l32971K09612N9587j19043k31545r2297K45556l12190j47238
17706A047473J43796n533N2107K97687r7451j78072k89360P2237J35211j88451
17696I89644J30978K97943P4482j87481k62771j08859Q4424j7907m6924k80242
17686F73287j7958J96158L98691J08759l68420N5056O0116k15818O5381N8356
17676A013608l8603K99888N17l88757j08744O4298j93524l17130P8739L85547
17666G95839P0335m44305k24865K11276J69405L32928j92895m10453J59022P2207
17656E38494l14552J31482r3114J08922j1173l73277J29322K07869O90232J62675
$$ y = [3402884, 3310458, 3411015, 2928720, 2986520, 2944174, 2675537, 2074820, 2109656, 2211413, 2016531, 1768002, 1435031, 1644643, 1704230, 1585187, 1353642, 1261345, 1506901, 1194711, 1047473, 1191269, 1185736, 1237843, 1535530, 1438079, 1260007, 970647, 1042884, 1178095, 989644, 1120622, 1418565, 1493047, 1305566, 1042795, 933936, 1018360, 1000453, 953529, 673287, 655329, 851487, 1250178, 1358937, 990517, 1045573, 1105689, 889871, 955252, 1013608, 975005, 1274893, 1275410, 886653, 777909, 842207, 648683, 331553, 410292, 795839, 866174, 421869, 197004, 408280, 577685, 910613, 717718, 307265, 466287, 538494, 223942, 355424, 262310, 371232, 360059, -13218, 116104, 323973, 1014205, 1176880]
17646A176880k60686N6874j93612j16564J29823l00649k7435K91399q5881N7441
17636G27590k43168j89575K20453K47987J12644k04191J22877M5664o7845O6004
17626H38440J26609J07992J7190k41814k19943p0199J31144M6513J41003k21205
17616F55730R6756l6173J6143j74753m5883R3720k85574j37319k06674K46983
17606B22956P48872K0700m81815l86971q4925q1509K67681K75660k19531Q9660
17596C70778K51191R5905j00975k65376l16955J68075O2456J52196Q2737j86116
17586C13916j77750L86934J12966J03084J5041j8871L95612K2279m33333J29921
17576H49799Q00k15884K9036J6622J71985j59949l70043R7239K49354K04720l4120
$$ y = [1176880, 916194, 973068, 779456, 662892, 792715, 492066, 464631, 756030, 670149, 727590, 484422, 294847, 515300, 763287, 875931, 671740, 794617, 840281, 772436, 838440, 965049, 1073041, 1090231, 848417, 628474, 558275, 689419, 735932, 876935, 655730, 752486, 716313, 732456, 557703, 511820, 605540, 319966, 182647, -24027, 222956, 971828, 992528, 510713, 123742, 38817, -42692, 224989, 500649, 281118, 370778, 621969, 717874, 616899, 351523, 34568, 202643, 265099, 417295, 500032, 313916, 136166, 523100, 636066, 739150, 754191, 735320, 1130932, 1153211, 719878, 849799, 850599, 634715, 663751, 680373, 852358, 692409, 322366, 419605, 668959, 873679, 839559]
17565H39559k42683J21430M8341l95027J894j20027n0056K65548J21912k57731
17555C33160L1643J93590l70107J77271J67973j55678k29589m38842M89856M33126
17545F32403j71404l89903j33628M46499K77382j9187j9461n7598l18897R4219
17535C40425R272n0318j21025K4319M1519L6388Q0935K10221k0798j33799j12972
17524C04167P336o1882r7293m4874K7659r1015K04412J44808J91138L78156l1384
17513I31228j24202k29706k54276P5099J98590l37662j11496J64182k8956M8800
17503C31601m41254K40721L15197L9995r6523n3974j08048L6964r1896l34780
17493a61997l02794L46400J80903J96283K5399j60068J72631q905k4896J91440
$$ y = [839559, 596876, 718306, 766647, 371620, 373514, 253487, 203431, 468979, 590891, 333160, 364803, 558393, 188286, 365557, 533530, 377852, 148263, -290579, 199277, 632403, 460999, 71096, -62532, 383967, 661349, 642162, 622701, 565103, 246206, 340425, 349697, 299379, 178354, 202673, 244192, 280580, 361515, 571736, 550938, 417139, 304167, 311503, 249621, 152328, 107454, 135113, 44098, 248510, 393318, 584456, 962612, 931228, 807026, 577320, 323044, 398143, 596733, 259071, 147575, 311757, 282801, 331601, -109653, 131068, 446265, 486260, 389737, 335763, 227715, 264679, 172783, -161997, -464791, -118391, 62512, 258795, 284194, 124126, 296757, 287852, 262956, 454396]
17483D54396k1664J31018K25295m0161m13702J09467P0196k05446j01937l91025
17473a83563k99207N6487K10277j05124M53662M62500N6640k55796q2570k64174
17463D9132L02125k49801j20616J7586m147l92786r9396J01563J00923J77468
17453a17949K2656k3480R8031K73133j23590l54690j71016m6348K11254L16402
17443H4403K35356o4658J78068K29337p7793k97993J86151r6716l74395l14212
17433c12452J97592l8939j54049J93073J88041l8785l58123j95241Q5419p4931
17423e08395K71629K04432p6098j92645R1779j30411J75906m76j14360Q0735J63658
17412c4246l7549o4676r2464K06252p3733J87764J99049q0429J64527J3007m09830
$$ y = [454396, 432732, 563750, 789045, 748884, 335182, 444649, 514845, 309399, 207462, -183563, -482770, -426283, -216006, -321130, 132532, 595032, 651672, 395876, 313306, 49132, 351257, 101456, -19160, -1574, -5721, -398507, -497903, -396340, -295417, -117949, -95293, -118773, -20742, 252391, 128801, -225889, -396905, -443253, -231999, 84403, 319759, 255101, 433169, 662506, 584713, 286720, 472871, 376155, 1760, -312452, -114860, -153799, -307848, -114775, 73266, 34481, -323642, -518883, -433464, -508395, -236766, -32334, -108432, -301077, -209298, -339709, -163803, -164279, -278639, -197904, -34246, -71795, -136471, -228935, -22683, -96416, 91348, 290397, 209968, 374495, 387502, -22328]
17401b2328J29987J36946K09729j28737m9243j96612m51887m87l5861n2532L91221
17390f9804K4598j91705L31309K11110j56013o3844j88302Q5777J32336J11696
17380B27158j19827N1240J06289l23999n9100N847j54160K12982L82135N6866
17370C85431L07522j08900j13870m11953j35400J1527J58980O6563L39127K65790
17360G64817K5746n6351L3840j94233k11395m6236R7965o7681k03477J65589J94988
17349E03572j73844J57629J926k85075j04164J13185M60089J16358j31451k24365
17339D33860p6663j87193J3709L8491L00442q4601p11725L9997K77159K08788
17329B52264K14184K75283N7928m21321K76805R5271k26997n9239J67434m90403
$$ y = [-22328, 107659, 244605, 454334, 325597, 276354, 79742, -372145, -372632, -408493, -461025, -69804, -45206, -236911, 94398, 305508, 149495, 85651, -102651, -16874, 115462, 227158, 107331, 158571, 264860, -59139, -118239, -112392, -266552, -53570, 328565, 385431, 692953, 584053, 470183, 58230, -77170, -65643, 93337, 159900, 499027, 764817, 790563, 734212, 768052, 573819, 362424, 316188, 414153, 346472, 142995, 308584, 503572, 329728, 487357, 489283, 204208, 100044, 213229, 673318, 789676, 658225, 433860, 357197, 170004, 183713, 222204, 522646, 438045, -273680, -233683, 43476, 252264, 466448, 741731, 799659, 378338, 655143, 750414, 523417, 464178, 631612, 141209]
17319A41209m29118K43518J48072k42717K46461K15540l8358l3826P3125L23989
17309F47895m08251o5730K25967K67840J65687l02009l13831N1847J05968J76347
17299E51730J61790L38289K35272J29492J84711k17296J02222l564K1486m23k05287
17288A298422L439L56033J00948j51385q3370r4612l6093j50338j16113K41244
17278A368175N5100J55534j0353j64745k77026l88373l58054k76851o0980r6295
17268e3868l2189M68734o394N0505l4336L3121j03594l8888k38352o2184k5229
17257d2674P0081M59473J01369l17023j27931j31681K63718J60481q3181j78086
17247A74546K766J14515K23674P3732N3777j98487m7039j32556j69514K36668
$$ y = [141209, -287909, -44391, 103681, -139036, 107425, 322965, 284607, 250781, 323906, 647895, 239644, 173914, 399881, 667721, 833408, 531399, 217568, 269415, 375383, 551730, 713520, 1051809, 1287081, 1416573, 1601284, 1383988, 1486210, 1482646, 1504132, 1503709, 1298422, 1301861, 1657894, 1758842, 1607457, 1524087, 1429475, 1393382, 1243044, 1126931, 1368175, 1423275, 1578809, 1568456, 1403711, 1126685, 738312, 380258, 103407, 42427, -53868, -86057, 382677, 376283, 426788, 392452, 425573, 321979, 283091, 44739, -17445, -42674, 27407, 486880, 588249, 271226, 143295, 11614, 275332, 435813, 352632, 174546, 177312, 291827, 515501, 589233, 643010, 444523, 397484, 264928, 95414, 332082]
17237C32082K58108l4586m87454k39919J67504J80667k69868p1857q0147K67055
17227B1585j48337r6618q5569M9863K63367P9267Q8845k00003m995Q1446L35877
17216C84728j38581K01828l2941m96911m3269k5876J28934J80722K34281n5479
17206C37436k83227J3709r4369j26060j09061O0621r0587r6457K5478q6232j48632
17195e97381M35301J06773o41790l86930L00897N24169M12485j98458l49143K0926
17185c73151J55064n7544L10686L0753l9991J82450J52383N5737l00482R5928
17175B11833k76277J71097r8919j40427J1446M15352J25298k96555l70171r472
17165b56795R7117P103q4063o6225J20956K52093j7472l10134J39574K29762J47515
$$ y = [332082, 590190, 555604, 68150, -171769, -4265, 176402, -93466, -165323, -245470, 21585, -126752, -223370, -308939, -259076, 4291, 83558, 172403, -27600, -32595, 48851, 384728, 246147, 447975, 415034, -81877, -125146, -151022, -22088, 158634, 392915, 337436, 54209, 67918, -26451, -152511, -261572, -200951, -291538, -387995, -362517, -448749, -597381, -162080, -55307, -697097, -1084027, -783130, -258961, 153524, -44934, -394077, -373151, -218087, -275631, 35055, 65808, 25817, 208267, 360650, 416387, 115905, 211833, -64444, 106653, 7734, -132693, -121247, 294105, 419403, 122848, -247323, -256795, -159678, -152575, -236638, -302863, -181907, 70186, 52714, -257420, -117846, 111916, 259431]
17154B59431J3995L65687R8154l69622j07047l65848k14055j84141j22541L56903
17144b69084J14921J13741M5482j22806m54907o7543L25010K00172J09814J79194
17134A73994J01440J48391P2229M9773k5426l30907m47806j24654J55017p5564
17124c03513K45745L082J0969J83711j10673k15722j79788K01886j32384l0772
17114c27459N1999q0061l0840K07374K58956K15848o03244j41215J15284j47205
17104d80563o6661K64768J93532K24728o8899j84967J55852k37884K9014k16458
17094c87538j66344K17548R2376o5712K1121J07827L3404l06286m6033J46572
17084c53065J77769O4823J42312j00926k95000J24174j66553j06891L55387P5269
$$ y = [259431, 273426, 639113, 737267, 367645, 260598, -105250, -319305, -503446, -625987, -269084, -154163, -40422, 5060, -117746, -572653, -640196, -315186, -115014, -5200, 173994, 275434, 423825, 496054, 545827, 520401, 189494, -258312, -382966, -227949, -303513, -57768, -54686, -43717, 139994, 29321, -186401, -366189, -164303, -296687, -327459, -275460, -355521, -386361, -178987, 79969, 295817, -307427, -448642, -333358, -480563, -547224, -282456, -88924, 135804, 66905, -118062, 37790, -200094, -171080, -387538, -553882, -336334, -243958, -309670, -288549, -180722, -147318, -453604, -499637, -353065, -175296, -110473, 31839, -69087, -364087, -239913, -406466, -513357, -157970, -82701]
17074h2701k12683k00657J30912L0919j31836J5168l53444L76714R6166K50298
17064h1144N1886j64916J87872R0173R8922O6078k34199j94158J12791J28211
17054F1516J80130P9191R1056k4576k82964P5776K0168j88718J18587L67921Q1755
17043E79842l44546n95074N0238K55131n9183j75804L22195K16930l52852p5207
17033a78330J60699J51968M5747k57754Q1363m8990n979l92743l16985J61805
17023e99199M22493O6134J43638j76255k31719J10574k17063J92084J94091r9606
17013a94828o0184P2573M7546J30555O1452k08044Q31j20483p607K12002j92163
17002b58350k16778K14210J65417o1037o7421J24363r0445l64857k49682k16845
$$ y = [-82701, -295384, -496041, -365129, -334210, -466046, -450878, -804322, -427608, -331442, -81144, -29258, -194174, -6302, 83871, 182793, 248871, 14672, -179486, -66695, 61516, 241646, 320837, 411893, 387317, 104353, 180129, 200297, 11579, 130166, 498087, 579842, 235296, -359778, -309540, -54409, -113592, -289396, 32799, 249729, -103123, -178330, -17631, 134337, 180084, -77670, 3693, -45297, -51276, -444019, -761004, -599199, -176706, -110572, 33066, -143189, -374908, -264334, -481397, -289313, -95222, -194828, -255012, -182439, -134893, -4338, 57114, -150930, -150099, -270582, -278189, -66187, -258350, -475128, -260918, -95501, -156538, -223959, -99596, -190041, -554898, -804580, -1021425]
16992a021425O8451O0813L90266O5339r4303M3151K14840j21657P1992M81860
16982A59327k3133l75015j10301l00220l0347M78842L99211K41735n63901M0535
16972h3267Q377j02565k5938L87579P065J35045K97880j61273j88939R666j50504
16961A33126K991K2655O0226k0301j23713K60345j14556m90924k67037Q6181j06171
16950e57178r8055L94448L96667J32980k85407j58987L85086J00396j11190r715
16940A89045j33676Q9524k5649R173m48960p8404p7966j86196p9799K137M05610
16929c35161J24511P8853N7160R0615Q0825L352q5353k24348l426P4593R2026
16918d6353o455K34002k35753m9040J56392R8895m3487K78415J12569o8823R0016
$$ y = [-1021425, -952974, -892161, -501895, -436556, -530859, -487708, -272868, -394525, -322533, 159327, 136194, -238821, -349122, -649342, -679689, -200847, 198364, 440099, -123802, -83267, -74890, -177455, -203393, 184186, 191251, 326296, 624176, 462903, 273964, 283630, 133126, 136117, 158772, 218998, 198697, 74984, 335329, 220773, -270151, -537188, -451007, -557178, -655233, -260785, 135882, 268862, -16545, -175532, 209554, 309950, 198760, 189045, 55369, 144893, 119244, 128417, -320543, -398947, -476913, -663109, -742908, -740771, -335161, -210650, -131797, -74637, 15978, 96803, 100155, 14802, -209546, -212972, -138379, -46353, -52808, 181194, -54559, -103599, 52793, 151688, 108201, 386616, 499185, 430362, 520378]
16907E20378j71379k27681O424J74884K40492N2200L5246l33275j76159j15035
16897F095m4710M3364j87476o232O546J19835N17288j65581j86685J21280k01205
16886B2519k66324J38377O7363l158Q587J93948J73360N2876j79846j20101O2345
16875A49946J74714j42506j60351k70056m1118J26244j11617K27691p2987q2538
16865b02578L53940P3633j31737R8470n5151J56529J40189n3339q4257j72354
16855A23345r3692P0689O8805J64548k81706J45246l50053j87323r8967L75758
16845f3350K22026j46793k04117L4045L83348n8885j84089J25403J81397l0735
16835B58250m22066j56812l81314K84226N59392K93268K50275k53989m81634n85555
$$ y = [520378, 348999, 121318, 127742, 302626, 543118, 595318, 630564, 297289, 121130, 6095, -38615, 4749, -182727, -188959, -182413, -62578, 454710, 289129, 102444, 223724, 22519, -243805, -105428, -38065, -41223, -32636, 161312, 334672, 387548, 207702, 87601, 149946, 324660, 182154, 21803, -248253, -289371, -163127, -274744, -47053, -120040, -202578, 151362, 224995, 93258, 191728, 136577, 293106, 433295, 379956, 295699, 123345, 29653, 100342, 169147, 333695, 51989, 197235, -152818, -340141, -439108, -63350, 158676, 11883, -192234, -158189, 225159, 166274, -17815, 107588, 288985, 258250, -163816, -320628, -701942, -417716, 141676, 434944, 685219, 431230, -50404, -635959]
16825f35959N3133K55293J86991N1512K0246K91093K87205r8443k84837q8187
16815C8047L79427J69079k72541k05449j16930k12885o3803L53252l02567o9001
16805c03371J66094L5748j60649N0462j72735q7599J50893l21823J681K68190
16795c73109K13485j26310m6618L07771k02595l82853K1484L56975L09273k03097
16785a25594o4581L4588J55050k7653k93434k28533k09739L66383K35182j06582
16775b64913l32280J43078J7843o8478L1500M76790j60895j56334K58986O2711
16765H008k94097M646K77013J47912m58843j43339K95787J46827J92965k272l08773
16754a34166j19078P2628n1896R0477K5016j32056J80741j10730r1199j20785
$$ y = [-635959, -582826, -327533, -140542, -89030, -68784, 222309, 509514, 411071, 126234, 38047, 417474, 586553, 314012, 108563, -8367, -221252, -285055, 68197, -234370, -303371, -137277, -101529, -262178, -211716, -384451, -472050, -321157, -642980, -641299, -373109, -159624, -285934, -332552, -24781, -227376, -610229, -588745, -231770, 77503, -125594, -190175, -155587, -537, -28190, -321624, -550157, -759896, -393513, -158331, -264913, -597193, -454115, -436272, -504750, -473250, 3540, -157355, -313689, -54703, 8008, -286089, -281443, -4430, 143482, -315361, -458700, -162913, -16086, 176879, 174607, -134166, -253244, -180616, -232512, -142035, -117019, -249075, -68334, -179064, -270263, -391048]
16744c91048p9500M24901K73153J33722J22448l836k66761J66792Q9879q1230
16734C88520J2576k45579k16582K03883K40182j85704k1350K20918n5928j20864
16724B20072J3782j12493M93317K0062p9577l63589j82773L74817q4840j68271
16714A30507Q4152k51477m388L18898K57784j53926n01881k53635K03084K52286
16704H1404j81074j57190Q4871n0776j07784j23149J83662K10313L08498K79886
16694E28661j37105r1905J42895O9722k32253k40934J89371L04626l21247k32832
16684b1001k8151J496M27899k12540j61493K9208J38566j69110m8421J84863O684
16673A48000j24086k66886M8611l7697j49835k36645k02373N1969J80367J74223
$$ y = [-391048, -470548, -45647, 227506, 361228, 483676, 479840, 213079, 379871, 469750, 388520, 401096, 155517, -61065, 142818, 383000, 197296, 175946, 396864, 340936, 220072, 233854, 121361, 614678, 634740, 555163, 191574, 8801, 383618, 298778, 130507, 214659, -36818, -41206, 277692, 535476, 381550, -120331, -373966, -170882, 81404, -99670, -256860, -171989, -222765, -330549, -453698, -270036, -59723, 248775, 528661, 391556, 299651, 442546, 512268, 280015, 39081, 228452, 533078, 211831, -21001, -49152, -47656, 380243, 167703, 6210, 35418, 173984, 4874, -43547, 141316, 148000, 23914, -242972, -194361, -232058, -381893, -618538, -820911, -768942, -588575, -414352]
16663d14352K11860K26820k6048j30182M7443k92766k60900K80723j57928o4532
16653e79862J17462K26119n9074k94333k7354M5439K03166l4427l05679q6330
16643g94873J06153K67388L3317L88674J83930l87341j39663M77769J65733l52253
16633e1166m1900K36728m1623K25656K21845k93653j53544Q3605L78071L2853
16623E96872j30046j85216j80843j29180K21625n6390j91774l40110k11104j16561
16613g22727K76119L70061K3059k94683L7237L69834K48014R1634j09139k62832
16603B6577J09685K23447m8470Q4047J1184m6776J95444k47787l26511p8941j26382
16592b24483J20644K97071m9155j12016p1874j30627K07084q5931l84504k43581
$$ y = [-414352, -202492, 24328, -1720, -131902, -84459, -377225, -638125, -357402, -515330, -579862, -462400, -236281, -295355, -589688, -617042, -571603, -368437, -402864, -708543, -794873, -688720, -421332, -388015, 659, 184589, -202752, -342415, 135354, 301087, -51166, -93066, 143662, 102039, 327695, 549540, 255887, 102343, 185948, 564019, 596872, 466826, 281610, 100767, -28413, 193212, 136822, -54952, -395062, -606166, -722727, -446608, -76547, -53488, -348171, -310934, 58900, 306914, 398548, 289409, 26577, 136262, 359709, 311239, 395286, 406470, 359694, 555138, 307351, -19160, -98101, -224483, -103839, 193232, 144077, 32061, -39813, -170440, 36644, -49287, -433791, -677372]
16582f77372J18992R8865K02547Q6209P0755q3566k17516k22361O28L21700K06237
16571i4882J89979K4043r6427k60328M1404L88093J04901q5179K36506j54213
16561B93897k436j91290l07554L0689j18886J7073J21534M3500M5888J60756J25638
16550B18809m3973l45969k3369K45749K35453r8724m0205J67495K60932o0819
16540E15379j24487j61483j33794J19871J33464J97069O8034r1466M72608j92359
16530H02836l51430j65296J31684L84580k30697m57338J98893K14785j29873j02265
16520B95879O4365j36144L4132k51986o03154J0827R6315j3823M2170J97104J58449
16509a05866O1923J02971r8881k00412Q4850L63800p790j76116k15975j69214
$$ y = [-677372, -558380, -459515, -256968, -170759, -100004, -183570, -401086, -623447, -622819, -301119, -94882, 95097, 119140, 22713, -237615, -196211, 191882, 296783, 211604, 448110, 293897, 291461, 100171, -207383, -176694, -295580, -278507, -156973, -113473, -67585, 93171, 218809, 174836, -171133, -194502, 51247, 286700, 187976, 147771, 315266, 576198, 515379, 390892, 229409, 95615, 215486, 348950, 546019, 614053, 522587, 995195, 802836, 451406, 286110, 417794, 802374, 571677, 114339, 313232, 528017, 398144, 295879, 360244, 224100, 258232, 6246, -596908, -586081, -489766, -503589, -461419, -264315, -105866, -43943, 59028, -39853, -240265, -155415, 208385, 200595, 24479, -191496, -360710]
16499c60710j47213L16292K01663K1538L80598j27088m93564m0134K88662L85717
16489D25761n8552L3577K43930l38462j30790J71569N5364p9980j49272M01618
16479E74763K08915J89180j6683J08515k70919n39846m19014J38031q3218l42952
16469d53228N9123o6505K5298M50234l2029k16075j24480L27654J05907k9755
16459D6144j90608l0462q077r0350l73j50477j96386J765N24410K83697k54228
16448f4945Q3829J70955m0851q3815j68594l05589K1665P481j6198R5640j73871
16437d74293j07508n3891R8799K03934J15756q5528P9855J30704L91660j94731
16427A04757k65821J16262m4451q3264k5230j90100j16884l8506j08388J03488
$$ y = [-360710, -507923, -191631, 10032, 31570, 412168, 285080, -208484, -248618, 40044, 425761, 367209, 400786, 644716, 306254, 175464, 347033, 402397, 322417, 173145, 574763, 783678, 972858, 956175, 1064690, 793771, 253925, -165089, -27058, -110276, -453228, -394105, -460610, -435312, 14922, -17107, -233182, -357662, -30008, 75899, 46144, -144464, -174926, -183003, -273353, -273726, -424203, -620589, -618824, -94414, 189283, -64945, 18884, 189839, 148988, 65173, -103421, -409010, -387345, -379864, -396062, -300422, -474293, -581801, -635692, -536893, -332959, -217203, -302731, -222876, -92172, 299488, 104757, -161064, -44802, -89253, -172517, -197747, -387847, -504731, -543237, -651625, -548137]
16417e48137L10018L7689P3189K13378K4077j67645j17873j85546L43724K37059
16407B19933q7426k30093M8990j81567k8545j94187N3294q498J39181J89000J25578
16396D5660m5352j83278p3826j93143l5239N0234j0139J85965P8244l3963J35231
16385g9606J43425k94775m7983J4530m0666m5505j27063J33209q7469Q0243P6126
16374b75534L5054Q4275L70782l6402l18386k09157k0716O15408J48290j54250
16364B39364K3990N9566J45583L8423k70590r8225R2343j37106j32075j82868
16354b21595J88639J10460l90210P37J5481P0035M52935K39966q1628j74252j55756
16343E4812K68784k76991k51820L2770K30062j42468m13648m10394k73677K11483
$$ y = [-548137, -238119, -200430, -127241, 86137, 110214, -57431, -175304, -360850, -17126, 219933, 132507, -97586, -48596, -230163, -258708, -452895, -399601, -408099, -268918, -79918, 45660, 308, -182970, -256796, -449939, -485178, -434944, -445083, -259118, -180874, -214837, -79606, 63819, -230956, -278939, -264409, -305075, -350580, -477643, -344434, -431903, -351660, -275534, -240480, -156205, 214577, 178175, -140211, -349368, -370084, 245324, 393614, 239364, 263354, 322920, 468503, 506926, 236336, 138111, 230454, 93348, -38727, -221595, -32956, 77504, -312706, -311969, -296488, -226453, 226482, 466448, 384820, 210568, 54812, 323596, 46605, -205215, -172445, 57617, -84851, -498499, -908893, -1182570, -971087]
16333i71087M00986M24057J20410J76724N3600n9052J52962J878q1112l40571
16323a21205m9166p6163J70321R6692L005j55675k20532Q5009k13926K95564J75732
16312a0344k06531Q9454L52889J23195m2038j05377j24054j88954m4674j41596
16302b98030K77411K23809j94775p8299k8738N5456j04675m3395R875K22414Q9963
16291A31016k72555L87044J72768n3929J92968M42891l67573n61349j96249L7245
16281h7723R2067J04691j06435O0267P9361j77957L16770k27499l4350j78479
16271a59287M2888R1162m0852K31658J01762l99604k2619K70324J97354l41302
16261b8516O7498k36504j04908K51320m513J79103N2630k89219J09027K96714
$$ y = [-971087, -570101, -146044, -25634, 151090, 204690, 145638, 298600, 300478, 219366, -121205, -170371, -246534, -76213, 20479, 23484, -132191, -352723, -267714, -481640, -186076, -10344, -216875, -127421, 225468, 348663, 306625, 201248, 77194, -111760, -156434, -298030, -20619, 203190, 8415, -69884, -98622, -43166, -147841, -191236, -181361, 41053, 131016, -141539, 245505, 418273, 364344, 557312, 1000203, 632630, 71281, -124968, -87723, 4344, 109035, 2600, 62867, 142228, -35729, 281041, 53542, 19192, -159287, -116399, -25237, -66089, 165569, 267331, -132273, -154892, 115432, 312786, -28516, 38982, -197522, -302430, -51110, -55623, 123480, 176110, -113109, -4082, 292632]
16251B92632J07670J3765j18379l34921k33832K66112k8323j50931O4891q1404
16241b02720J1390K76076l600n8472r0773K09256L1424o2862L5108P9309j36033
16230H8103k21893J53424k42412j6874j17517l32561n960J65643Q6982K39851
16220b03214K27662K36599j31435j01112J02975r0686l26392J35966j5804j87197
16210c52638L06617M26708k78196j36686j65007j54094j8377K44726K06623K0889
16200A00565m655R4169k80039J78737L27275k80682n31887k17367m6432n3115
16190g13431J48415K14610n8446Q5968l5665k87524K88579K7498o5291j2713n9407
16179d67407M48825J39979j24275l93810Q3186K20102k65409K29733k5439k5979
$$ y = [292632, 400302, 414067, 295688, -39233, -273065, -6953, -35276, -186207, -121316, -202720, -191330, 84746, 81146, 22674, -68099, 141157, 172581, 109719, 144827, 224136, 88103, -133790, 19634, -222778, -239652, -357169, -689730, -695690, -530047, -443065, -203214, 24448, 261047, 129612, 28500, 131475, 40789, -285603, -149637, -165441, -352638, -46021, 380687, 102491, -34195, -199202, -353296, -371673, -126947, 79676, 100565, 95910, 190079, -89960, 88777, 416052, 135370, -396517, -613884, -660316, -713431, -565016, -350406, -408852, -322884, -358549, -646073, -357494, -329996, -395287, -408000, -467407, -18582, 121397, -2878, -396688, -313502, -93400, -358809, -129076, -154515, -180494]
16169a80494L70253j36186l62439j58927j78690p0663K01582K18991M18173R5991
16159B17591j17742j09866K8958L5663j03934O7671K38517Q5739K02892J62329
16149G07818j25861k77829l37294k3162k31808N5637j07353j7976Q145o1303j57987
16138e68973q7911J11768P4088J71387M58239J40892k82860l67740J38001o96
16128b13805n2539j40238J83157J58640l52848j04217M19033J7344q3586L5418
16118a33641n7303K09349J27625Q9950k81092J02411q5663k03820j81839L1269
16108c82754L00502J2490K45362J95529k64571Q0850j11913k68449j00572j58483
16098d52009j00693q1907J85074K62628l7291m33256J78836R2719q7503J70797
$$ y = [-180494, 189759, 53573, -308866, -467793, -646483, -717146, -515564, -296573, 121600, 217591, 99849, -10017, 18941, 54604, -49330, 18341, 256858, 342597, 545489, 707818, 581957, 304128, -33166, -56328, -288136, -232499, -339852, -357828, -349683, -410986, -568973, -656884, -545116, -471028, -299641, 158598, 299490, 16630, -351110, -213109, -213805, -266344, -406582, -223425, -64785, -417633, -521850, -102817, -85473, -169059, -133641, -190944, 18405, 146030, 235980, -45112, 57299, -28364, -232184, -414023, -382754, -82252, -69762, 175600, 371129, 106558, 187408, 75495, -192954, -293526, -452009, -552702, -634609, -449535, -186907, -224198, -657454, -478618, -385899, -473402, -302605]
16088c02605M54022o5410q8740Q8814J567o9063J47631j3135P5782q6820j46317
16077d274O3465N8138N36899J84900m19378k4723j69662j21108M70384J87411
16067G62052l69109k42664j13859k01698m8393J40596J23655J35639k70484j48826
16057b33091j73506L4505L55715K99772J58751j81838P8167l67369j96635P5025
16047a50504q5353L3593J31854j22269Q5105j97637M5681J07998M67297o283k7915
16036B81567r5512q9779J46675P669L58335J65166j90808m74569l40601L28668
16026I6811j43078k75768L67781K14124N4557j26262R341K70317L23825j18461
16016F73187q4524J06426m31543k96978N2331k95249Q6424K45023J7946n8481
$$ y = [-302605, 151417, 86007, -2733, 86081, 87648, 18585, 166216, 153081, 228863, 142043, -4274, 59191, 117329, 654228, 839128, 419750, 395027, 225365, 104257, 574641, 762052, 392943, 150279, 36420, -165278, -213671, -73075, 50580, 186219, -84265, -233091, -406597, -372092, -16377, 283395, 442146, 260308, 338475, -28894, -225529, -150504, -235857, -202264, -70410, -192679, -107574, -305211, -259530, -151532, 315765, 309482, 281567, 186055, 96276, 242951, 250620, 608955, 774121, 583313, 108744, -231857, 96811, -46267, -322035, 45746, 259870, 314427, 188165, 197506, 467823, 791648, 673187, 588663, 695089, 263546, -33432, 18899, -276350, -189926, 55097, 73043, 14562]
16006A4562k09565m4393n1295k54206N3573K75695J94915N36353J0547l20358
15996B05828J01940L85424j04277k12620n8288J38588j04503k82545l10014k20770
15986d61237l08379K86469N8419J26917L24528J05838Q2224o6426l10368k30786
15976c92801K11361J30128L27250J36924j6706o2963K77638l90602n35132K9145
15966b85758r2748J80190K82047K26936m2575o1586j25829l95484o5784L34411
15956d6180N12400J9791Q9574R9063m30493k74157J77984O6246q618q1682K4271
15945A48199j34832M3471J97895j53082Q0638K1218j87586j98800K43630J22482
15935A83233N048L8496J37582K537k61588m28228J77015K6652j4117K17003j83058
$$ y = [14562, -195003, -239396, -290691, -544897, -491324, -215629, -20714, 515639, 526186, 205828, 307768, 693192, 588915, 376295, 318007, 456595, 352092, 69547, -240467, -461237, -769616, -483147, -424728, -297811, 26717, 132555, 214779, 148353, -162015, -392801, -181440, -51312, 275938, 412862, 396156, 333193, 610831, 220229, -314903, -285758, -378506, -198316, 83731, 310667, 268092, 206506, 80677, -314807, -380591, -46180, 466220, 486011, 575585, 674648, 244155, -30002, 147982, 214228, 205610, 123928, 148199, 13367, 56838, 254733, 101651, 182289, 203507, 15921, -182879, 60751, 183233, 188281, 226777, 364359, 366896, 105308, -322920, -145905, -119253, -133370, 83633, -99425]
15924i9425j08754J61108K40714o456j0672K21843J63692J8686O886j72212n7889
15913C57521j0885j32718j91280n7122q8291o2567R1405j59662j42862j95051
15903e91512j26590K2628M36806L35006R3893q3801J8269k89039k39435j65600
15893e89375K3135J677L88592L84154J56838j28684k56676m9279J73152j09488
15883e954J41873K47279J17270k39887k56666k03780J59733j58984k53647p0528
15873e23291K38015Q5412N8312K25880j62628n5017J27926j07283K66k16859p3835
15862d03102k1030J40798J17246o7604J95487P8990J54588j85284K45039J76538
15852D31666k08513l37642k90179l1220k07297N5057K67477J19033j02980L3471
$$ y = [-99425, -208179, -47071, 193643, 187187, 176515, 398358, 562050, 580736, 587622, 415410, 357521, 346636, 213918, 22638, -34484, -122775, -185342, -93937, -253599, -396461, -591512, -718102, -695474, -258668, 76338, 170231, 86430, 104699, -184340, -423775, -589375, -566240, -564563, -175971, 208183, 365021, 236337, -20339, -69618, 103534, -5954, 135919, 383198, 500468, 260581, 3915, -199865, -40132, -199116, -452763, -523291, -285276, -199864, -141552, 84328, -78300, -133317, -5391, -112674, -112408, -329267, -403102, -424132, -283334, -166088, -233692, -38205, 40785, 195373, 10089, 255128, 431666, 223153, -114489, -404668, -435888, -643185, -588128, -320651, -201618, -304598, -271127]
15842b71127j70347j2140l9288Q5749J0739j82116m1012J70965J30394P9304J7539
15831b21340j08486j33308J31021O06336O9252k5370L6653n15071j4081J53697
15821b0697q3180O6570k4421n855j31267Q2769j16424k54875J96314K70701P2222
15810E1857k46967j63468J53188K2210J89171J11719K39285n1536j61599k29499
15800h5639k33562J85N22000J42095m46428j04754k3889O4446L11645L350j16398
15789C3051K43460J25417k43417l22936L9001j97831L0321N28251M83791J22326
15779H41434k24422o2856k63402j84757n27964j84621N9990Q2109M19530K36960
15769A92001O7429o826j96485q5217R9190K4995k036J55894j34630J20174l80322
$$ y = [-271127, -441474, -453614, -492902, -407153, -396414, -578530, -619542, -448577, -318183, -238879, -221340, -329826, -463134, -332113, 274223, 343475, 318105, 354758, -160313, -174394, -20697, -103877, -37307, -61728, -67583, -198850, -116081, -232505, -487380, -291066, -20365, 51857, -195110, -358578, -205390, -183180, 5991, 117710, 356995, 305459, 143860, -85639, -319201, -319016, 202984, 345079, -101349, -206103, -229992, -165546, 146099, 149449, 33051, 276511, 401928, 158511, -164425, -125424, -323255, -292934, 235317, 719108, 841434, 617012, 554156, 290754, 105997, -421967, -606588, -546598, -464489, -44959, 192001, 259430, 252604, 56119, -29098, 70092, 95087, 93051, 248945, 114315, 234489, -145833]
15758a45833k78602r992L06587M4887J14280o7801j19107J81003o1811K09361
15748A72972m8768k25218J49215K96494m08760j12111K22681L24296j86221R4544
15738B79124M9361L8457j36860K40046k6786l71030K20189j78765m00725J46687
15728a40302k09590K912J09099K40635K53547q4044m07589J135Q352K1910N6700
15717a47235J97054k41503p3262P629q3720j35813q4199k39466Q5873L32674j59201
15706e41169p4717j05275k3449n8823J12027K58858n1040q3867L67916K00102
15696E63m6648K28426N4104k72886j57832L8557j9581j47455P116Q4723N2772
15685a78141k80220K32852j51709j01016K05804n1599M85283J71312k32385j24004
$$ y = [-145833, -424435, -434427, -127840, -82953, 31327, -36474, -155581, 25422, -36389, 172972, 124204, -101014, 48201, 344695, -64065, -176176, 46505, 370801, 184580, 279124, 328485, 366942, 230082, 470128, 443342, 72312, 292501, 113736, -286989, -140302, -349892, -346980, -237881, 2754, 256301, 172257, -235332, -234197, -225845, -203935, -147235, 49819, -191684, -264946, -257317, -341037, -476850, -561049, -800515, -714642, -381968, -541169, -615886, -721161, -744610, -803433, -691406, -432548, -483588, -567455, -199539, 563, -46085, 182341, 236445, -36441, -194273, -155716, -175297, -322752, -315636, -230913, -178141, -458361, -225509, -377218, -478234, -272430, -324029, 161254, 332566, 100181, -23823]
15675b3823J59082J89776K02299M4256L0093j67124k02760q5388k94425K239K96782
15664A51007Q5268K080P6125J9924J10261j32237r9198j5762j79297P0205m40501
15653c52125m6030L07662K08357J95352P2538m6926l24771j94727p1126K80166
15643B8370J19419J11693K24101m14975l55096j9506L96863J97114j53408j9050
15633A15525J01334L23763K45445K6866m18926j10841J33800j50040k54726p8442
15623f6242o7680j55120j4272J84101K49568j28713K43673Q3455o034P5344L2994
15612D31074k54771j11736j72896q9908K2291m5050J87285J16169L858j54338
15602f8022n5704j61601J10929K95227J71539k15736N18878L62091n7368p23191
$$ y = [-23823, 135259, 325035, 527334, 571590, 601683, 434559, 231799, 146411, -148014, -145775, 151007, 236275, 238355, 314480, 334404, 444665, 312428, 213230, 197468, 18171, 88376, -352125, -398155, -90493, 117864, 313216, 385754, 338828, 14057, -180670, -251796, 28370, 147789, 259482, 483583, 68608, -286488, -305994, 90869, 287983, 134575, 115525, 216859, 540622, 786067, 812933, 394007, 283166, 416966, 266926, 12200, -66242, -133922, -289042, -303314, -119213, 130355, 1642, 245315, 328770, 322736, 398080, 431074, 176303, 64567, -108329, -198237, -175946, -220996, -33711, 82458, 86316, -68022, -123726, -285327, -174398, 120829, 292368, 76632, 595510, 957601, 900233, 177042]
15592A77042k89099L4251k20461Q9901j07422j61695K22361K00548J00954R5648
15582A42028l57682j2104R9956j30862M70387L43505q9298k54545m05767j51084
15572c45466j87507K85465N095k67131Q1538L68314m128j05606L58611k40353
15562e1168k67901k07984j3681R3320L41220J83901J62792M831J6536j31912j31648
15551a694m67866P8483J93071O261O2292K78028j71106k09079j31292l9016Q549
15540c93369K68230L8594K20900J1160J9943N2082O240N742j23433m5821r5695
15529c5427j81974K18966K22560j27190K64599j83417q3712o9528P4151J87675
15519B86703Q1257k9860j1766n5951k58429j93952P7146J40574K79309j4270J398
$$ y = [177042, -112057, -77806, -298267, -208366, -315788, -477483, -255122, -54574, 46380, 142028, -215654, -227758, -127802, -258664, 211723, 555228, 465930, 211385, -194382, -345466, -532973, -247508, -242413, -509544, -428006, -59692, -63820, -169426, 189185, -51168, -319069, -527053, -540734, -447414, -106194, 77707, 240499, 245330, 261866, 129954, -1694, -469560, -391077, -198006, -191745, -129453, 148575, -22531, -231610, -362902, -401918, -393369, -125139, -86545, 134355, 145515, 165458, 217540, 223780, 229522, 106089, 60268, -35427, -217401, 1565, 224125, 96935, 361534, 178117, 94405, 24877, 99028, 286703, 367960, 338100, 326334, 270383, 11954, -181998, -104852, 35722, 315031, 300761, 302159]
15508C02159J36056m7110l07510k36174m0316k4479K46379L5180k10997J09998
15498c6814K02702J23513J2913k6363k04787k55324l379k33026O1055J56825k61244
15487d63929N198N10229J98557J939m16534P0898K5623k2748J55527K86795m17841
15476f6286k07915K36299J66053k36241l0729L19366L9958j73233j84614j67894
15466c05236K19754K80755m05887k41270J13331P8711l3183l95711J52084M45711
15456i0941L4790J82163K00977K2915J89247K15996l15575R4639K60954l45580
15446D49585m4755j03511n16555l76942J95344q4835J50514j21716k4865L86992
15436i0744L2978P2551Q8256r2840m09351P8233K87214n7031l6384K56839P5263
$$ y = [302159, 438215, 391105, 83595, -152579, -192895, -217374, 29005, 64185, -146812, -36814, 165888, 289401, 302314, 275951, 71164, -184160, -187539, -420565, -359510, -202685, -463929, -458731, 51498, 250055, 251994, -164540, -93642, -68019, -90767, 64760, 351555, -66286, -274201, -37902, 128151, -108090, -138819, 180547, 220505, 47272, -137342, -305236, -85482, 195273, -210614, -451884, -338553, -259842, -293025, -688736, -536652, -90941, -56151, 126012, 326989, 349904, 539151, 755147, 439572, 534211, 795165, 449585, 404830, 301319, -215236, -592178, -396834, -481669, -331155, -452871, -477736, -90744, -57766, 14785, 103041, 10201, -399150, -320917, -33703, -90734, -127118, 129721, 204984]
15425B04984J41013l60175l92140j04785K44851K81454J34814j95268k54377j58348
15415d57977K80374O3042m11758k45039J90671K64877L31308J37494n762j26346
15405B0884j4668m5344j07789L16093j28281r2919P0332r1971M4157J30897N71595
15394F72986j28583o13963q6634K66320j75898l33819L80699P8736k15970k76391
15384d32517R4437n5967o1Q8779J94222m4209K7841L24381M6109k20409n9698
15373c7092N2386k6359M02259N661k26451j59475k5275j93837k66317L132L59760
15362a11608N29522Q5276l29171l96154j37848L61195Q135j05922J05123N2102
15352F0650j83607l49172k97050J83219K84842K97063N8765k57138J23805K8982
$$ y = [204984, 345997, -14178, -406318, -511103, -266252, 15202, 150016, -45252, -299629, -457977, -177603, -114561, -526319, -771358, -580687, -315810, 15498, 152992, 147230, 20884, 6216, -39128, -146917, 169176, 40895, -52024, 18308, -73663, -29506, 101391, 672986, 544403, -69560, -156194, 110126, -65772, -399591, -18892, 59844, -156126, -432517, -338080, -394047, -394108, -305329, -111107, -155316, -127475, 196906, 243015, 22606, -37092, 15294, -11065, 391194, 396855, 170404, 10929, -14346, -208183, -474500, -471368, -111608, 417914, 503190, 174019, -222135, -359983, 1212, 9347, -96575, 8548, 60650, -122957, -472129, -769179, -585960, -301118, -4055, 54710, -202428, -78623, -49641]
15342d9641K42503m3375p5405N4518K38056L43410p689l35427l16198l62775k54440
15331e66463l7291N38943j42538q6408l49614Q2438K48346K68085K8383l28079
15321c44198j35225J55655q4907M2874m143p690M73835r4232j06039k56172J73310
15310a86932N14179J93746j85248j98849K33303j54246m74778r875K90530J74116
15300A95946L6949j33532K61811q3096R298J12175l58408j0784N1071J55239L9477
15289B76146j56645j1228m4118j5572k78377m2290o1492J23753L48320j29486
15279I011l37871m8226R4592N27118L8794j48567N4301j87821j61818K32412K48228
15268C20153K21027k76337n55792P7414J33525M8340M8260l99293j46392N36396
$$ y = [-49641, 192862, 149487, 74082, 128600, 366656, 710066, 702377, 366950, 50752, -312023, -566463, -603754, -64811, -207349, -293757, -643371, -560933, -312587, -44502, -16119, -344198, -479423, -323768, -408675, -365801, -369944, -377634, 96201, 1969, -104070, -360242, -186932, 327247, 520993, 335745, 136896, 370199, 215953, -258825, -268700, 21830, 195946, 232895, 99363, 361174, 278078, 287376, 399551, 41143, 30359, 81430, 236669, 276146, 119501, 108273, 64155, 48583, -229794, -272084, -333576, -209823, 138497, 9011, -328860, -377086, -282494, 244624, 283418, 134851, 189152, 1331, -160487, 71925, 320153, 541180, 264843, -290949, -213535, -80010, -31670, 16590, -382703, -529095, 7301]
15258G301N1429J34540O5737L1635L54248J11677k82709j89041j43149k69280
15248a27612m7145k865j67124l23806p6370K4049J99852J56618K37264L07745
15238A80606K32397k20435m52594j80322m0492J39843J90796j27740k71328K12739
15228c36530k7968P8731p0677p1601K17199M52908R258k03357l54605k99420k6322
15217f32384L63038K52989l0497j99565j45508M17073J90099j4j74396L23297
15207C64132J90343k19875Q3363j77332j34534j4661J5395j0594K24296K384M7931
15196C70848j73946q9029K88229j50883o8022j36333K32945J81379N6322J4076
15186E25586p8162N9691j64361k019l00726j89083j4J45694j95772j90035j52891
$$ y = [7301, 58730, 193270, 259007, 290642, 644890, 756567, 473858, 284817, 141668, -127612, -174757, -177622, -344746, -668552, -744922, -720873, -521021, -364403, -127139, 180606, 413003, 192568, -260026, -440348, -480840, -340997, -150201, -277941, -549269, -336530, -364498, -285767, -356444, -428045, -210846, 242062, 251320, 47963, -306642, -606062, -632384, -269346, -16357, -46854, -246419, -391927, 25146, 215245, 215231, 40835, 364132, 554475, 334600, 417963, 240631, 106097, 91436, 106831, 96237, 320533, 322917, 370848, 196902, 107873, 396102, 245219, 177197, 40864, 273809, 455188, 511510, 525586, 447424, 507115, 342754, 340735, 40009, -149074, -149088, -3394, -199166, -389201, -542092]
15175e42092J69486j05206J09533n8731j57787L70074N6712J54233N3235J4612
15165F4069l35n71723N2075L1552m19570k94183L03168M87806M92459P3758J04847
15154C23923L13894J65467o80339o38459j58787K06897J56374J22207K44005k98247
15144b43065K33190J54603l04279k90212J53729r9776Q7024K65017J87098j19941
15134B3388J4532P1766j86332R8151R4041J4462k75844J3245L28150R8086m43699
15123a50054j34925R4796K19914M94813j6611k93635m6586K4911L96234M1761
15113F30618j24798l84704r6062J17382m6135k62544k82805O8822j251J05177
15103b76300q6649j03179P7136K71318j38305j95340K17995j23880n8302K20114
$$ y = [-542092, -372606, -477812, -368279, -427010, -584797, -214723, -158011, -3778, 49457, 64069, 63734, -507989, -455914, -424362, -843932, -1138115, -834947, -347141, 145318, 219076, 323923, 637817, 803284, 122945, -515514, -674301, -467404, -311030, -188823, 55182, -243065, -9875, 144728, -159551, -449763, -296034, -395810, -308786, -43769, 143329, 23388, 37920, 109686, -76646, 21505, 115546, 130008, -145836, -132591, 195559, 293645, -150054, -284979, -190183, 29731, 524544, 507933, 214298, 167712, 192623, 588857, 630618, 505820, 121116, 25054, 142436, 96301, -166243, -449048, -380226, -381477, -276300, -362949, -466128, -388992, -117674, -255979, -451319, -233324, -357204, -415506, -195392]
15093a95392k18346o20308J60426L00118K41273J72423J00832K26087K5801q1643
15083A11271M65452L17057l36255n49476n17013p3794K58761L59904Q6379O4998
15073A87284m1336l8209m69308k32497j38245K42638L20928J11293j53478l54927
15063e65857K42104L45619J11107l66530L31965L98535J8960L4994k70273o86497
15053d05873R8559m4135J27226n7431j30564M48765q6449k56536l55544p0312
15043g32294M43394n260J28261N09129j5610k15941l45082j90588j20795j77266
15033g22052L14491J14688J60798R8074j30295j99932N9047P125q5181K48823
15023a34414J22329l56695P7526K25057J03892J11192q4252N7507j50056q9307
$$ y = [-195392, -413738, -1034046, -873620, -573502, -332229, -159806, -58974, 167113, 192914, 111271, 576723, 893780, 557525, 8049, -508964, -582758, -323997, 35907, 122286, 187284, 145948, 107739, -361569, -594066, -732311, -489673, -168745, -57452, -210930, -565857, -323753, 21866, 132973, -233557, 98408, 496943, 515903, 550897, 280624, -405873, -307314, -351449, -224223, -281654, -412218, 36547, -49902, -306438, -661982, -732294, -288900, -294160, -165899, 343230, 327620, 111679, -233403, -423991, -544786, -722052, -407561, -292873, -132075, -34001, -164296, -364228, -305181, -298056, -383237, -134414, -12085, -368780, -291254, -66197, 37695, 148887, 64635, 122142, -27914, -117221]
15013a17221P1152j93058J6624M98k3702k57971k27830J24894K77688J56301J95505
15002B2880l35453j98885L0985J36427l5668j62790l6691M20997K72600M3643
14992A58045j3610k51396N1292j21439n8338N0554j21461K90987J80138l5645
14982A29127k49418k98648j9984J00890K13337J11085Q2109m8279r5537j71281
14972b46599K87979l64544j28900j29654K78264L26628O9159K97705j80692k96428
14962h7082L87568q6751l05983l5135j40128M14739L2929o5147j08787k42244
14952b36021J6892j30806L6784L45814j72209k96825J32197K48001l0426M1991
14942d4608O7865L66980o7108j80144l37841j18542j24705K75554R4613K17451
$$ y = [-117221, -46069, -239127, -222503, -222005, -245707, -503678, -731508, -606614, -328926, -172625, 22880, -312573, -511458, -480473, -344046, -379714, -542504, -579195, -158198, 114402, 158045, 144435, -106961, -55669, -177108, -235446, -184892, -306353, -15366, 164772, 129127, -120291, -418939, -438923, -338033, -124696, -13611, 68498, 20219, -75318, -246599, 41380, -323164, -452064, -581718, -303454, 23174, 92333, 390038, 209346, -87082, 300486, 213735, -92248, -127383, -267511, 147228, 180157, 115010, 6223, -236021, -219129, -349935, -313151, 32663, -139546, -436371, -304174, -56173, -86599, -44608, 23257, 390237, 323129, 142985, -194856, -313398, -438103, -162549, -67936, 149515]
14932A49515Q9541k50591m06017O8131L74731n7949K81961p4431l5368K14970
14922C54493j04011j62334J28770Q6250j7258J9473j77634l290j45561k9383K09066
14911A58581k87754q5010l21927P5678M98850L35870L0332K42005j39056k58694
14901B48875j58325R3484K24309K29879r8078k59122m03960q6779q8776k35054
14891e33547j428j69208K88345M96889K35361l30799r805K54495l3735K51811
14881D48379j35317j31910o17427l11579K52263M15433L95887K6164m29572l42393
14871d30072J71356P6442M1201l45705K06819L63049m5322k9798J8812p2174J38092
14860I2700J8225J10371o1443n10738O6656K79464J06683Q6509R4055M1056r3006
$$ y = [149515, 239056, -11535, -417552, -349421, 25310, -32639, 249322, 174891, 139523, 354493, 250482, 88148, 216918, 303168, 285910, 305383, 127749, 124459, -21102, -50485, 158581, -129173, -214183, -536110, -460432, 38418, 374288, 404620, 646625, 507569, 248875, 90550, 184034, 408343, 638222, 540144, 281022, -122938, -209717, -298493, -533547, -534975, -704183, -415838, 81051, 316412, -14387, -24192, 230303, 196568, 448379, 313062, 181152, -436275, -747854, -495591, -80158, 315729, 341893, -87679, -430072, -258716, -182274, -141073, -486778, -279959, 83090, 37768, 7970, 26782, -45392, 92700, 110925, 221296, 159853, -350885, -284229, -4765, 101918, 188427, 282482, 323538, 230532]
14849B30532J61827k9868j23687j31390o3313j30058k4279L3608J06909N4368
14839H4649K13606q8673J73429M073j97045m1172k43025j36517K32873K4064K14825
14828B41087K31550M7210k30176j34066k29161q6891K42197J99232L2854k77425
14818C6411k32851j48123q5761L08156K30292L9253l93296j26163K55843j01416
14808b17655m7130K10878M40684r640k91793k48703r1696Q6379K8880K5825M9703
14797f4268l6347k69960Q2484J03682n3069J50789L33399K43912l51941r2950
14787D5731r5778p4255Q0465o6777L3173Q5348j33268j04885K9690O0177L01142
14776A60763K9546k22613r9110J10259R744q7899K42818n723k21045K75269n3545
$$ y = [230532, 392359, 362491, 238804, 107414, 44101, -85957, -110236, -76628, 30281, 84649, 298255, 209582, 383011, 387084, 190039, 148867, -94158, -230675, 2198, 26262, 241087, 472637, 519847, 289671, 155605, -73556, -160447, 81750, 280982, 313836, 36411, -196440, -344563, -430324, -122168, 108124, 147377, -245919, -372082, -116239, -217655, -264785, -53907, 386777, 377137, 85344, -163359, -255055, -168676, -139796, -113971, -64268, -100615, -370575, -288091, -184409, -237478, -86689, 246710, 490622, 138681, 45731, -50047, -124302, -43837, -110614, -77441, 7907, -125361, -230246, -200556, -140379, 160763, 190309, -32304, -131414, -21155, -11411, -99310, 143508, 137785, -83260, 192009, 138464]
14765A38464j63838J09055R4051N4077n9966l50223j64598R2386M5800L89121
14755A84329M0624k58023J4123p7899J22704K68015k30926j64120Q0340J65088
14745A44255J5161Q9101j24551m88038k35995M90183J53274j98888p6003P5501
14735a56000m2410k23603j1271R2208M13117K18001j568r1586q5867o324l19294
14724b14597J44515L28824k81674k39883p1917K39165R4577K43709R354j16580
14714A35493j15248j66997J45343L68480n8215l73985l92325J33961K91289N6758
14704B4554J96526j08178j49353R5351J62248J28522J16218m8660J80463j68204
14694D29487J05123j82198j781l21701j34483k07867Q9861k4417j22815R0142
$$ y = [138464, -25374, 83681, 177732, 231809, 171843, -178380, -342978, -250592, -204792, 184329, 224953, -33070, -18947, -96846, 25858, 293873, 62947, -101173, -20833, 144255, 159416, 248517, 123966, -364072, -600067, -109884, 43390, -155498, -231501, -156000, -198410, -422013, -433284, -341076, 72041, 290042, 288474, 196888, 111021, 104697, -214597, -70082, 258742, -22932, -262815, -334732, -95567, -990, 242719, 252073, 135493, 20245, -146752, -1409, 367071, 308856, -65129, -457454, -323493, -32204, 24554, 221080, 112902, -36451, 58900, 221148, 349670, 465888, 417228, 597691, 429487, 534610, 352412, 350631, 28930, -105553, -313420, -223559, -247976, -370791, -280649]
14684b80649P3242Q3355Q6153L55446L38563J07148j98823k55818l57518j91487
14674b40388Q2501L09636J26719R8056J0223K33812J03599n25803k08145J59357
14664A49567J77751j744j49572k17333j88548r7566O7040J54393o3366k16872
14654c86250p8619J16531K30758M4926J06985J0796k04275K16280M62527J97843
14644G17502j22071k40043k35170j70443K6927K1302N068k33962l14238K5091
14634e20037O4077J09754M56666L03495J54415j73097j74094M380j59644n7620
14624H295J43733J23458P8293J34326j45901j03431n7930M6509k42884r5792K18739
14613A07415J40344J06816l4698k4157R6461K1375L77964j50184m31412k84383
$$ y = [-280649, -207407, -124052, -37899, 317547, 656110, 763258, 564435, 308617, -48901, -240388, -157887, 151749, 278468, 376524, 386747, 620559, 724158, 198355, -9790, 149567, 327318, 325574, 176002, -41331, -229879, -327445, -260405, -106012, -169378, -386250, -464869, -348338, -117580, -72654, 34331, 45127, -159148, 57132, 519659, 717502, 595431, 355388, 120218, -50225, -23298, -1996, 3072, -230890, -545128, -520037, -455960, -346206, 110460, 413955, 568370, 395273, 221179, 225559, 65915, 8295, 152028, 275486, 353779, 488105, 342204, 238773, 180843, 227352, -15532, -111324, 107415, 247759, 354575, 319877, 295720, 392181, 413556, 791520, 641336, 209924, -74459]
14603g4459q1747L86468L33998L08397m29901k94619j13627k00247j66417j55823
14593d87977K09035r5548p7395L5578K70253j01378l57258K14344J12219J87714
14583i0413K49287J37612O8899k18984l78460l55638m3540l7135J37460K45506
14573b85406M36514N2911J4764l7639j02072J3859j20413K00835L22256k42804
14563B52805l40813N6314J41750j83204p1968J22514K32993M0462o6962J29072
14553C12963k22832k81419m8239L99536J17954r9018l44487j97677N6999n7410
14543c63630K3501K54753n8154k03020j27322J22668J91321M36182J42078K07055
14533F25432K05247l65609j73399n6588j58841m92147K46945L09374j42061J73903
$$ y = [-74459, -156206, 230262, 564260, 872657, 442756, 148137, 34510, -165737, -332154, -487977, -278942, -374490, -451885, -416307, -146054, -247432, -604690, -390346, -278127, -90413, 158874, 296486, 365385, 146401, -232059, -587697, -631237, -668372, -530912, -285406, 151108, 204019, 218783, 181144, 79072, 92931, -27482, 173353, 495609, 252805, -88008, -31694, 110056, -73148, -145116, -22602, 210391, 250853, 183891, 312963, 90131, -191288, -239527, 160009, 277963, 178945, -165542, -363219, -306220, -363630, -340129, -85376, -143530, -346550, -473872, -351204, -159883, 276299, 418377, 625432, 830679, 465070, 291671, 235083, 76242, -415905, -168960, 140414, -1647, 172256]
14523A72256M66851J86297k19759l66805k57012j01466n6299J40675L49126K2201
14513C36065M864p8512l49933k8543K24936k45522q6927J77709R9061k7075J66567
14502A92690l6292M5685L07831k15550n94642k33954J61771l0736l88958K26912
14492e65243L65979K06691k96918o905K65459L71650Q8212j22296k57553j23905
14482g4829j21541L5566J40031J61029r6134k01985p1641k70747J16346K88160
14472i5745m2261J19140J66655j11865J89600K49002L846l21927k67916J5884
14462i5587K50444n1535l4847q9657P3406L4586J45859L02836l85683k46771K08209
14451A11260J86728n8336M13169j85483l96089o2264J89603J21895J52226j93315
$$ y = [172256, 639107, 825404, 605645, 238840, -18172, -119638, -175937, -35262, 313864, 336065, 340929, 262417, -87516, -116059, 108877, -136645, -223572, -45863, 53198, 26123, 192690, 156398, 202083, 509914, 294364, -300278, -534232, -372461, -403197, -792155, -565243, -199264, 7427, -289491, -296396, -30937, 340713, 428925, 306629, 49076, -74829, -196370, -160804, -20773, 140256, 44122, -157863, -229504, -500251, -383905, -95745, -138006, -18866, 147789, 35924, 225524, 474526, 478372, 156445, -111471, -95587, 154857, 103322, 68475, -21182, 52224, 86810, 232669, 535505, 149822, -96949, 111260, 297988, 239652, 652821, 467338, 71249, 8985, 198588, 320483, 472709, 279394]
14441B79394k60613j9565L15352k47783N6436j29029J41788L9920k76946k35675
14431c36721K64934l950l2651O245L20653Q1620p5847j14819L3820R4732R3585
14420C31601K9791K07798J20430Q1514j34634l18157K42731L80457j04054q9206
14410G48271p9265k63260k36308k09775L1962L16301K39656J31309j13974l59478
14400B05439m5725J04167j49533j89707l83628k83839L98537M76905K72029J81089
14390E85734l99173j77201l14812m57723j13988N66455K9101j40724K06506R2900
14380a22925R9879J51904Q2342q2837m8067k96194K31776q8574l04468k83693
14370f60857k91890K71813L88721K71214K14339J12543m17703m81457J86867K67905
$$ y = [279394, 18781, -784, 314568, 66785, 123221, -5808, 135980, 175900, -101046, -336721, -71787, -75737, -108388, -102143, 218510, 300130, 224283, 109464, 143284, 238016, 331601, 361392, 569190, 689620, 771134, 636500, 318343, 561074, 941531, 837477, 748271, 669006, 405746, 169438, -40337, -8375, 307926, 547582, 678891, 564917, 205439, 159714, 263881, 114348, -75359, -458987, -742826, -344289, 132616, 404645, 585734, 186561, 9360, -305452, -763175, -877163, -310708, -281607, -422331, -215825, -122925, -23046, 128858, 211200, 128363, 80296, -215898, 15878, -72696, -377164, -660857, -952747, -680934, -292213, -20999, 193340, 305883, -111820, -593277, -406410, -138505]
14360a38505O2998j71601J87980L4661k6531o8407k48398j32859K0892r3093K42912
14349c29951J14679k0759m5193k48122L63480L19228j9263J6415R3078K79817
14339E23409L25695k3069j85784k44745n08773o6166K40955k18354m7125M31223
14329B27266J67238j9149k32359j83156j13839J2694K93652M36428J36569k82923
14319D42421N8734j67416k86800j18084J77825j8545j72775J95137K47372J03238
14309D61107o4416k92398j24262K13941O2080M5148k51942J58584N4778j37670
14299A24950j53205m20798p7542J57619j14189m3545J71706L94217n1197n82256
14289e94240L0151k4384j40354P30919L87853k05458k20986m16790k80452K00831
$$ y = [-138505, -75507, -247108, -59128, -24467, -50998, -119405, -367803, -500662, -479770, -572863, -329951, -215272, -236031, -281224, -529346, -165866, 153362, 134099, 150514, 243592, 523409, 849104, 826035, 640251, 395506, -113267, -179433, 61522, -156832, -203957, 227266, 394504, 375355, 142996, -40160, -153999, -141305, 152347, 588775, 725344, 442421, 501155, 333739, 46939, -71145, 106680, 88135, -84640, 110497, 357869, 461107, 396691, 104293, -19969, 193972, 256052, 301200, 49258, 207842, 262620, 124950, -28255, -449053, -526595, -368976, -483165, -526710, -355004, 39213, -11984, -594240, -564089, -588473, -728827, 2092, 389945, 184487, -36499, -453289, -733741, -532910]
14279e32910P3457J36254K93595K08444K79841N2094o1410k15591P5941L37889
14269F47604j98265l61019l55531o1195k19369K70945K9960Q3898K95106O8214
14259B00348j57004J17325J21162n2185l7902k18161J24171j0564k94378J50474
14249e6714O6469n3653K29269K09533r7718k32239k5812M9510l96210k17201k9330
14238e54096l46301M49237M57756o3028J60789L3130K24842k43265n00743n4329
14228d36008J98642L27434k64253J3500J57391J63897r408J45935O6776l12648
14218E1258n3843J68045j20675J50458k68608k14241K30564J67976L6435M7899
14208A95268K31853p9508k38454J28780J754R4705j90935N1045J5880k45596k4244
$$ y = [-532910, -459453, -323199, -29604, 178840, 458681, 510775, 449365, 233774, 309715, 647604, 449339, 88320, -267211, -328406, -547775, -276830, -246870, -162972, 132134, 200348, 43344, 160669, 281831, 229646, 191744, -26417, 97754, 87190, -207188, -56714, 9755, -43898, 185371, 394904, 297186, 64947, 39135, 88645, -307565, -524766, -554096, -900397, -451160, 6596, -56432, 104357, 137487, 362329, 119064, -381679, -436008, -237366, 90068, -174185, -160685, -3294, 160603, 151195, 297130, 363906, 51258, -2585, 165460, 44785, 195243, -73365, -287606, -57042, 110934, 147369, 195268, 427121, 347613, 109159, 237939, 239693, 334398, 143463, 194508, 210388, -35208, -59452]
14197e9452J41135J25480j5350k21570k22363m4542M4409K4829M9376K76687j54612
14186e5973J68084L64686L25541j59658j79551j54817R2466K70093n1376k41777
14176C77718o39014n740K52006L88124k37476n6529k9071l59820k03955K54020
14166b59737K3327j02738M45429l9253O5840j4583M4447L29022J25291j59740
14156D57305o501l23272l62548j11458K16863m9201J5533k95063J00569K66325
14146i1448P8269K50839j53294K30486J24800k75695J14294P0746R0439p6041
14136C63395q8616j38885k95919l22606J44990p9603J08558K19570J26614J03539
14126A41037J0599m46937K199K08257J03423K74202K64325j33551r8921l8659
$$ y = [-59452, 81683, 207163, 191813, -29757, -252120, -296662, -252253, -227424, -178048, 98639, -55973, 112111, 476797, 802338, 642680, 463129, 308312, 400778, 670871, 619495, 377718, -261296, -267036, -15030, 373094, 135618, 79089, 50018, -309802, -513757, -259737, -236410, -339148, 106281, 67028, 132868, 118285, 162732, 491754, 617045, 457305, 450804, 127532, -235016, -346474, -129611, -178812, -163279, -458342, -357773, -91448, -13179, 237660, 84366, 314852, 439652, 163957, 278251, 348997, 439436, 363395, 274779, 135894, -160025, -482631, -337641, -417244, -308686, -89116, 37498, 141037, 151636, -295301, -293102, -84845, 18578, 292780, 557105, 423554, 324633, 285974]
14116B85974J06657k24933J03401M32294k01574j28532O7089o67958l66504J49796
14106d44290J89013J70633o8263l8036J41889q7481k50387K27961J81996j60953
14096a37918j81628K78912j02760P6569k3294j43040r0173J00679L27223O3348
14086A67918m0227p1193k2327L42409q1057l38936j50577L7554Q2145J24586j8158
14075C2137J1732j2670R4211N3334l18274j96451L2285R9170n0298j15824j06717
14064d77365m9208L40449k6295m98104m36122j52548K96685M28548N72410P3857
14054G2307j85720k26559j47218L51447N49223l9786q2098P3809M2644j00006
14044C08043j65979q8348j00578r6298O852m6022n2808P9571Q91j93318l14320
$$ y = [285974, 392631, 167698, 271099, 703393, 501819, 373287, 440376, -227582, -594086, -444290, -255277, -84644, -152907, -190943, -49054, -136535, -386922, -158961, 23035, -137918, -319546, -40634, -143394, -66825, -90119, -233159, -323332, -222653, 104570, 167918, 127691, 56498, 34171, 376580, 295523, -43413, -193990, -156436, -74291, 50295, 32137, 43869, 31199, 125410, 178744, -139530, -335981, -303696, -204526, -254824, -370648, -477365, -526573, -186124, -212419, -710523, -1146645, -1299193, -1002508, -573960, -1550, 72307, -113413, -339972, -487190, -135743, 413480, 373694, 291596, 365405, 408049, 308043, 142064, 53716, -46862, -143160, -136308, -182330, -235138, -155567, -154676, -347994, -662314]
14033f62314R3654J51364J17768K17265K58497M2902K52851k06453l39926k08695
14023b83087P3251J75620o2209J358J58115K7822J65506J40268l24009k78276
14013b05641q0845J17475J5990j09310M0357j40661J69793K60334K02617k2897
14003B47212j39157k4338J09554L98236l64348n09264j66108J57934J14145K31417
13993E5283j9063n50799r5573J60273r3335j13L48282L82859Q0619k43693l09209
13982b84469L24321j11209j16944J65851J35043j33050q4209n1892M916L33869
13972A82227j39621j30093M71627k3479j23102O5113N5000j6070J28562J1523
13962D81687k8456J78011l55564n1669r9902k72424p4830L77352o4370j35725
$$ y = [-662314, -568660, -417296, -299528, -82263, 176234, 219136, 471987, 265534, -74392, -283087, -209836, -34216, -96425, -95067, 63048, 90870, 256376, 396644, 72635, -205641, -286486, -169011, -153021, -262331, -221974, -362635, -192842, 67492, 270109, 247212, 108055, 83717, 193271, 591507, 227159, -282105, -448213, -290279, -176134, 55283, 36220, -514579, -610152, -449879, -543214, -543327, -195045, 187814, 268433, 24740, -284469, 39852, -71357, -188301, -22450, 112593, -20457, -104666, -156558, -151642, 182227, 42606, -87487, 384140, 360661, 237559, 302672, 357672, 341602, 470164, 481687, 453231, 631242, 275678, 224009, 124107, -148317, -223147, 154205, 89835, -45890]
13952d5890l1292j6277j67432j07839R8007M10540N7201m6627j07860j36894n022
13941i9385L23662K28911l27021o25547P4837j7968P2146L41910j9782J9739J47947
13930A19449L63404j49812j05281R6140K22137j19298l43859k8989J81444j88450
13920D6885k11899J0008M1515n5347M9527r1929J19085L66553Q1068k80906J04043
13909A78603l16672j24627J58603P3983j4651J87386J8241J14278P0207J23565
13899D68916L35074l06420n12451K4970j27615l79108k54425M78898M89011L56835
13889E73685j06001k10771l02737J18296j12208j0821K09871L501O5908L4669
13879B63392K47784K60255j38815l68093j69948J05039P102j42880J79226k29436
$$ y = [-45890, -77182, -93459, -260891, -368730, -270723, 139817, 197018, 150391, 42531, -94363, -99385, 224277, 453188, 126167, -499380, -424543, -442511, -370365, -28455, -48237, -28498, 119449, 482853, 333041, 227760, 323900, 546037, 426739, 82880, 53891, 235335, 46885, -165014, -155006, -113491, -168838, -119311, -211240, -92155, 274398, 355466, 74560, 178603, -138069, -262696, -104093, -30110, -44761, 142625, 160866, 275144, 345351, 468916, 803990, 497570, -14881, 10089, -117526, -496634, -751059, -272161, 216850, 573685, 467684, 256913, -45824, 72472, -39736, -50557, 159314, 162815, 228723, 263392, 511176, 771431, 632616, 264523, 94575, 199614, 206716, 63836, 243062, 13626]
13869A3626l36122N9999J91732M87829L38694l01774k70243j00298J2183k8658
13859F6968K6638r0400K39974j66568q7325j34470j68311J33340J58426k05768
13849b27496k54575J6381L76464J51669L06537J08942j88352m15858j78360K20270
13839h4378J71570J01074J73396r8190l07772J25360K33576K09925J56119m18301
13829B62379k42245n1062J07705k94897J23386L1114p9904K56752J71303J01144
13819C85675K85239k04079k27697k65622r0412k18736j20244n0711j27312K81006
13809c52893L43557K27800j93187l37521J56389K32719O1080N0845J3255J70310
13799C72354Q548n2041o1853P146j73273l79865J80708J03149L0776N2856K75560
$$ y = [13626, -322496, -262497, -70765, 417064, 755758, 453984, 183741, 83443, 95626, 66968, 93606, 3206, 243180, 76612, -10713, -145183, -313494, -180154, -21728, -227496, -482071, -465690, -89226, 62443, 368980, 477922, 289570, -126288, -304648, -84378, 87192, 188266, 361662, 263472, -44300, 81060, 314636, 524561, 680680, 262379, 20134, -30928, 76777, -218120, -94734, -63620, -143524, 113228, 284531, 385675, 670914, 466835, 239138, -26484, -116896, -335632, -455876, -506587, -633899, -352893, -9336, 218464, 25277, -312244, -155855, 76864, 137944, 188789, 202044, 372354, 380902, 328861, 267008, 274154, 100881, -278984, -98276, 4873, 35649, 88505, 364065]
13788C64065m5356l87189n1783l01621r3214J96564K94059m7309k11109K7062
13778b55831n5548J73222L65413j01830k54642k48970r5599j8874k10764K83605
13768d19818K20032J62009K90409o4956l4790J65277J20555K00486l96338m52080
13758b09214m2903K24461N3119L3673J18667j82040j62464k76098p1009M99569
13748a4239L12021j47145l1795K99680J26136k61141l43765P0403L7412l72355
13738c24788M60370M2183K6957n9710k60569l15841K63232K75317O2532P5956
13728B45639k55809J96907K42852k54965j40011L4614K51333J46948j28630L2376
13718C71254k24240m98524l08113K76083M14431k6601L2835P6877O7302n4417
$$ y = [364065, 318709, -68480, -120263, -421884, -515098, -318534, -24475, -71784, -282893, -255831, -311379, -138157, 227256, 125426, -129216, -378186, -473785, -492659, -703423, -419818, -199786, -37777, 252632, 187676, 152886, 318163, 438718, 639204, 242866, -209214, -252117, -27656, 25463, 59136, 177803, -4237, -166701, -442799, -513808, -14239, 297782, 150637, 118842, 418522, 544658, 283517, -60248, 10155, 47567, -324788, 135582, 177765, 204722, 145012, -115557, -431398, -168166, 107151, 169683, 245639, -10170, 186737, 429589, 174624, 34613, 69227, 320560, 467508, 338878, 371254, 147014, -351510, -659623, -383540, 30891, 4290, 37125, 114002, 181304, 126887]
13708A26887K62193n7709o25221k59303R5343J33628L71854k64025J18554K95396
13698A97597j38405j60252j06743p174q1536K72895K85468k57278n01451o10L32449
13687a65040m9263L734j12609k70591k2216n2705q179K88795R6476j23263J84043
13676b30818J2085O4011L92927L31690q4200k47860J6035l1447n660L44032J7827
13665E78622j62235p7768k89639j72379L26561M73981R0530J60303l5277J20721
13655A013420j08711K2357o4393k29895m08006N6035k173j68449L63238O3646
13645E37069k18808J61704Q6754j73950m9295k76829J5392J20413K02369K03758
13635F08577l21068j77730p3620k21952r2784J39980L22463J24798K44526J52626
$$ y = [126887, 389080, 331371, -293850, -553153, -457810, -324182, 47672, -216353, -97799, 197597, 59192, -101060, -207803, -214977, -296513, -23618, 261850, 4572, -496879, -497489, -165040, -214303, -210569, -323178, -593769, -615985, -668690, -676869, -388074, -291598, -414861, -230818, -218733, -154722, 238205, 569895, 485695, 237835, 253870, 222423, 216763, 560795, 578622, 416387, 338619, 48980, -123399, 203162, 677143, 767673, 927976, 892699, 1013420, 904709, 927066, 862673, 632778, 224772, 280807, 278634, 110185, 473423, 537069, 318261, 479965, 566719, 392769, 343474, 66645, 82037, 202450, 404819, 608577, 287509, 109779, 36159, -185793, -278577, -138597, 183866, 308664, 553190, 705816]
13625G05816k84275j37085j06175j77413k88591k73004k55822L39794L41302K54443
13615A18990J70557K66385M0811q8683k99826k76488j86790J60778k20550j03984
13605d18800k1483r5803L59589L38742o0069k40226l33763k59159m892L71336
13595c64528J31114J33941Q1195k4310n5932J761L19882K17747r4180l0355o2910
13584B53425m6664M3970Q5529J36511J1424k63738p1098K2065J76104k18292l6871
13573I2365K35898K53646L6550l02630l17326o8773K58190K89628P5192j01044
13563D51696O9l07108r1589j37534K748m6236J6100K50265n3026k34098k8704
13552a77417K24827k18397j65457q9309K87554j49600j41523j88393l3208J03598
$$ y = [705816, 421541, 284456, 178281, 868, -287723, -560727, -816549, -476755, -135453, 118990, 289547, 555932, 596743, 508060, 208234, -68254, -255044, -94266, -314816, -418800, -440283, -536086, -176497, 162245, 102176, -138050, -471813, -730972, -735864, -364528, -233414, -99473, -18278, -42588, -98520, -96759, 223123, 440870, 346690, 316335, 253425, 206761, 250731, 336260, 472771, 484195, 220457, 149359, 171424, 347528, 129236, 92365, 328263, 581909, 618459, 315829, -1497, -70270, 187920, 477548, 552740, 451696, 451765, 144657, 53068, -84466, -81718, -127954, -111854, 138411, 85385, -148713, -177417, 47410, -170987, -336444, -425753, -138199, -287799, -429322, -617715, -650923, -547325]
13542e47325L25680J28678J0039K1262L42672L47727k33994j78849l70775q8344
13532b43229M059l2061Q5886L18988j69734j44099J79547J5689L8528J46971J62264
13521C62809j44170j26207R6976J63448M28400r1480j30624k9827J2924l76714
13511A65535o4981k09345J74226q3158j19628J37146j43222l9142l04481k5120
13501e12170J12180K13172L54789K32107O9846k89667n2294L28234M12196l36527
13491E31866l01117l2344M2524j46902j35675p8026j10515K26226j99002p925
13481b10890k13712J6998L63677j41643j55377O1780j85741R5967J48285O5606
13471a55050k07220j32637p988K50309L38807j08151j0906j38451J91096K00493
$$ y = [-547325, -221645, -92967, -82928, -61666, 281006, 628733, 394739, 215890, -154885, -243229, -239170, -271231, -185345, 133643, -36091, -180190, -643, 15046, 53574, 200545, 362809, 218639, 92432, 189408, 352856, 781256, 689776, 559152, 529325, 542249, 165535, 100554, -108791, 65435, -17723, -137351, -205, -143427, -182569, -487050, -512170, -399990, -186818, 167971, 400078, 469924, 180257, 127963, 456197, 868393, 531866, 230749, 198405, 240929, 94027, -41648, -119674, -230189, -3963, -202965, -210890, -424602, -407604, -43927, -185570, -340947, -279167, -464908, -368941, -220656, -155050, -362270, -494907, -502895, -252586, 86221, -21930, -32836, -171287, 19809, 220302]
13461B20302J48096J07633N9308k74498k61097k58729J10589p0995O7155J25243
13451b6993n8560j27919j25266p3643K89094J19773j0960j15699K09393L0622
13441A09842Q2287k79086k33081R5089J56239K775j17597J87023j44596n45446
13431f86551j9038L83521M94223p9898n6231L99094j70749j11187m2039J20068
13421B31213j93060N6776J88503r7449P5167J69468K2174l02658k81690j19915
13411b51471M6818m1764O8977K9212J68178J32436n2285n9258l48789J08102M48451
13400B48607K0083K30423J51857j35935m26369J46226J26432j79030J99984k30374
13390A51904k41344l3594k58100O3132M23624Q930j48504o5863K73685j15444
$$ y = [220302, 368398, 476031, 535339, 260841, -256, -258985, -148396, -219391, -152236, -26993, -85553, -213472, -338738, -412381, -123287, -3514, -14474, -130173, 79220, 109842, 192129, -86957, -320038, -224949, -68710, -65935, -183532, 3491, -141105, -686551, -705589, -322068, 172155, 92257, 36026, 435120, 264371, 153184, 111145, 231213, 38153, 94929, 283432, 185983, 261150, 430618, 452792, 150134, -131556, -251471, -204653, -246417, -177440, -148228, 19950, 152386, 100101, 40843, -307946, -199844, 248607, 268690, 499113, 650970, 515035, 88666, 234892, 361324, 182294, 382278, 151904, -89440, -123034, -381134, -318002, 105622, 114552, -33952, -99815, 173870, 58426]
13380E8426K39507K49362j12886l5890P7651m45352k37188N7908J02859J62298
13370A16695j64002Q7172j29654J00650q0457j83630j34653L29313L88810O3740
13360C93984K13213J28474k66583k56391k11792J41214P5273j42060k79645R2062
13350a12251K29764K65448K16439p5532k25220k72109l93659Q1546J37346N4999
13340i3229p9895J24258N2526K83013j71190p8048L46724Q7911j5510l8797k35065
13329A82698j98119k0710J81981r829j13066l06158n8126K72917L41364J46236
13319D19188m3510j71259k05247J38563K63707J07307k4393k58273R6979J29400
13309D52462n0290K58577j90322j26126J41789J1878J81211j45087l67592q5489
$$ y = [58426, 297933, 547295, 434409, 398519, 476170, 30818, -206370, -148462, -45603, 116695, -47307, 39865, -89789, 10861, -69596, -253226, -387879, -58566, 330244, 393984, 607197, 735671, 469088, 212697, 905, 142119, 217392, 75332, -204313, -112251, 117513, 382961, 599400, 523868, 298648, 26539, -367120, -285574, -148228, -93229, -173124, -48866, 3660, 286673, 115483, 37435, 384159, 472070, 456560, 417763, 182698, -15421, -36131, 145850, 136021, 22955, -283203, -341329, -68412, 272952, 419188, 375678, 204419, -828, 137735, 401442, 508749, 484356, 226083, 323062, 452462, 402172, 660749, 470427, 344301, 486090, 497968, 679179, 534092, 166500, 81011]
13299H1011n5225K96262k14417j81756O5272L7588K24480J81431k53287p0155
13289A11204N4364J56894J17028l97013k60265P6617J77341l9582K20773m2747
13279A74614O0890N816p5219o0010j52169j75950P0422L39099K13132o053J755
13268C96327l8534k90936R0318J09886k414j41803L1204j40027r3627J21749L1877
13257G4020J0440J96687P183K02178K3260o0341j30895N3859r5673l54171j78699
13246b52152O1581j21532R7509J90981J38438K11537j90085j92260J96065J74651
13236C14733M3132n6739J73295m1550l45725j021l18810j80046n6018K63533l39084
13225e44300m4143N33943K28578j49714M2461m25365J81720Q8848j11271Q5162
$$ y = [81011, 25786, 322048, 107631, -74125, -8853, 28735, 253215, 434646, 181359, 111204, 165568, 322462, 439490, 42477, -217788, -141171, 36170, -3412, 217361, 174614, 235504, 241320, 166101, 106091, -46078, -222028, -151606, 187493, 400625, 394572, 396327, 357793, 66857, 157175, 267061, 264647, 122844, 154048, 14021, -79606, 42143, 74020, 84460, 281147, 288330, 490508, 513768, 453427, 322532, 376391, 280718, -73453, -252152, -190571, -312103, -214594, -23613, 114825, 326362, 136277, -55983, 140082, 314733, 357865, 301126, 474421, 432871, 87146, 86125, -232685, -412731, -468749, -205216, -544300, -588443, -54500, 174078, 24364, 66825, -358540, -176820, -87972, -199243, -114081]
13215a14081o1007l0268J75398J61276M6290M59L35730P855j30190M835J6487
13204D12784k42927J19970N5917r7899J17022J53635P9708k56165r1829n3421
13194A96795j24908J46074J49635j4738k30675j78773k67105j48645J44510p9819
13184d07649K11310K42955K68056K5017J0110q7947L89238J90909j35055l34270
13174C72674J09533K82555O3829m00375l26019k75257J35536J76626r7921j92298
13164a51117K8799K19060m74275n43640O20676P10375J52387j47704o5889k64778
13154H3894m42011Q8349J76730q0711l65696j69049l47245L10464M13248L6076
13144b95951m9799Q3510j83395J90178N472k65388M92231K91873r1205j10850
$$ y = [-114081, -175088, -205356, -29958, 131318, 177608, 178067, 513797, 521652, 391462, 396297, 412784, 169857, 289827, 345744, 247845, 364867, 518502, 598210, 342045, 250216, 196795, 71887, 217961, 367596, 352858, 122183, -56590, -323695, -472340, -327830, -407649, -196339, 46616, 314672, 339689, 349799, 261852, 651090, 841999, 706944, 372674, 482207, 764762, 828591, 428216, 102197, -173060, -37524, 139102, 41181, -151117, -122318, 96742, -377533, -921173, -300497, 409878, 562265, 414561, 348672, 83894, -358117, -269768, -93038, -173749, -539445, -708494, -1055739, -745275, -332027, -295951, -345750, -262240, -445635, -255457, -249985, -515373, -23142, 268731, 177526, 66676]
13134F6676j31885J9677J07378j72745l44136J467P891k7310o9897j16238J73867
13123d85255M04946L24583q5459J58056O2510j20826m34612j69648J43441J99061
13113c203M59561L27277j51677O1629r2683Q954j80176j87958j14598K35475J49978
13102E12579j49637L7669k0111J00204j27679o26680m5869J83821q7692L09242
13092H5847J17505J22413m838j3359l8319n2589j07866J53781K71740j71157r1171
13081B71987j79662j84831M2713K73485K05085o7386l18956k7761n4065P9460
13071D0069j83646J10133L86284J10031k58626j34619J96200L13645m8927L63856
13061H94400j11239k89551k10349j80880j34756J72103J74232p1584n5357K05130
$$ y = [66676, -65209, -45532, 61846, -110899, -455035, -453568, -445677, -472987, -542884, -659122, -485255, -80309, 244274, 158815, 316871, 379381, 258555, -176057, -345705, -202264, -3203, 456358, 783635, 631958, 693587, 600904, 609858, 429682, 241724, 127126, 362601, 512579, 362942, 400611, 380500, 480704, 353025, -273655, -319524, -135703, -223395, 85847, 203352, 325765, 320927, 307568, 269249, 216660, 108794, 262575, 534315, 363158, 271987, 92325, -92506, -49793, 223692, 428777, 361391, 42435, 14674, -39391, 40069, -143577, -33444, 352840, 462871, 204245, 69626, 265826, 579471, 530544, 894400, 783161, 493610, 283261, 102381, -32375, 139728, 313960, 242376, 187019, 392149]
13051C92149k49605k24252j93018k677J30381j60686Q4032J79707O2896R3648
13041A12575K9179j65767K017J17946j76042j41173l44944k3061J97854N15173
13031A23757K92890j561k44742m6930M575K41909p8346j88876K83751N2477l53588
13020H5316j40625J21241J58455K5794l8959k39033k7488J11631p521q5254M772
13009c1671J32318P0788J71285p3263K0296O376j0636J77213k21874K94457j2913
12998E22376l82585j82351K6377K19264J64164L37105L21552N7254R2595m47941
12988G27810l92187j58577q3677n2230j44831P2299P7073K38955O7493k85157
12978F6971q4789M5332M71068J31111j11134l59149k70471k49299K04972N00025
$$ y = [392149, 142544, -81708, -274726, -277403, -147022, -307708, -223676, -43969, 18927, 112575, 141754, -24013, -21996, 95950, -80092, -221265, -566209, -589270, -391416, 123757, 416647, 415086, 170344, 123414, 127989, 369898, 291552, 102676, 386427, 438904, 85316, -55309, 65932, 224387, 250181, 211222, -27811, -55299, 56332, 48811, -36443, -31671, 100647, 171435, 342720, 269457, 289753, 296129, 285493, 462706, 240832, 535289, 522376, 139791, -42560, -16183, 203081, 367245, 704350, 1025902, 1083156, 1175751, 727810, 335623, 177046, 93369, 41139, -103692, -31393, 45680, 284635, 352128, 66971, -17818, 27514, 498582, 629693, 518559, 159410, -111061, -360360, -155388, 344637]
12968C44637l59478k17823k37011N5952M861n0656j39202O1900L61271K77459
12958A01910J76760J14692k06394R1767k26443l24585K62083K67721J04992k27516
12948A34987l20694K63379M40898L59141j32473k13948q933l42104l04178j99767
12938c23692O7896N82057M55340M9158j72315m35007q1591K0876K13612p2686
12928C03648O4948m4025j51370j81467k30829JK49591J48678M7009K50799M9379
12917E06362k78405k65091K55257L89178P8441j94849j94140m435L4186N5267
12907C81771n3840k73100j75871k14312p1566J91023Q8951n0384j34857r7005
12897d09190O7912J02382R6266n1351L9112M94681n3703r8424l14764o3814p4042
$$ y = [344637, -14841, -232664, -469675, -413723, -408862, -459518, -598720, -536820, -175549, 101910, 278670, 393362, 186968, 278735, 52292, -272293, -10210, 257511, 362503, 134987, -185707, 77672, 518570, 877711, 745238, 531290, 522357, 180253, -123925, -323692, -255796, 326261, 781601, 830759, 658444, 223437, 141846, 162722, 376334, 303648, 368596, 324571, 173201, -8266, -239095, -239094, 10497, 159175, 206184, 456983, 506362, 227957, -37134, 218123, 607301, 685742, 490893, 296753, 292318, 326504, 381771, 327931, 54831, -121040, -335352, -406918, -215895, -126944, -177328, -312185, -409190, -341278, -238896, -142630, -193981, -154869, 339812, 286109, 187685, -127079, -190893, -264935]
12886b64935J45614j27909K68923K82041J71052J27912J51695l1005j30578j51289
12876D41521m3035j45041k54741k12773j24142L48496N04520q6506k78596j72307
12866b2604Q5729J31255K09868j06055r7584L15364r3159l99636l61241J88669
$$ y = [-264935, -119321, -247230, 21693, 303734, 474786, 602698, 754393, 723388, 592810, 441521, 398486, 253445, -1296, -214069, -338211, 10285, 514805, 428299, 149703, -22604, 63125, 194380, 404248, 298193, 200609, 515973, 422814, 23178, -338063, -149394]
$$ [...]
##END NTUPLES=NMR SPECTRUM
##END=
