##TITLE=Analysis number 328394
Compound Code cc 13652
Book Reference 521/73
Project Code adrs
Chemist Name evam
##JCAMPDX= 6.0         $$ Bruker NMR JCAMP-DX V2.0
##DATA TYPE= NMR SPECTRUM
##DATA CLASS= NTUPLES
##ORIGIN= Bruker BioSpin GmbH
##OWNER= nmr
$$ XWIN-NMR		Version 3.5
$$ Wed Jun  6 10:51:00 2007 GMT Daylight Time (UT+1h)  MAYBRIDGE\nmr@NMR_250MHZ
##.OBSERVE FREQUENCY= 250.131544655141
##.OBSERVE NUCLEUS= ^1H
##.ACQUISITION MODE= SIMULTANEOUS (DQD)
##.ACQUISITION SCHEME= undefined
##.AVERAGES= 16
##.DIGITISER RES= 18
##SPECTROMETER/DATA SYSTEM= dpx250
##.PULSE SEQUENCE= zg30
##.SOLVENT NAME= DMSO
##.SHIFT REFERENCE= (INTERNAL, DMSO, 0, 16.522)
##AUDIT TRAIL= $$ (NUMBER, WHEN, WHO, WHERE, WHAT)
$$ ##TITLE= Audit trail, XWIN-NMR		Version 3.5
$$ ##JCAMPDX= 5.01
$$ ##ORIGIN= Bruker BioSpin GmbH
$$ ##OWNER= nmr
$$ C:\u/data/dgb/nmr/ADRS/310/pdata/1/auditp.txt
$$ ##AUDIT TRAIL=  $$ (NUMBER, WHEN, WHO, WHERE, WHAT)
(   1,<2007-06-06 10:50:28.38 +100>,<MAYBRIDGE\nmr>,<NMR_250MHZ>,
      <created by zg, POWCHK disabled, PULCHK disabled
       configuration hash MD5:
       76 6E 9A 78 1E 09 19 81 EC 84 63 8F B0 6A 59 2D
       data hash MD5: 64K
       D6 DA AA EA 6C 1F D8 45 4B A6 34 7D 9F F6 E0 E6>)
(   2,<2007-06-06 10:50:47.58 +100>,<MAYBRIDGE\nmr>,<NMR_250MHZ>,
      <Start of raw data processing
       ef LB = 0.3 FT_mod = 6 PKNL = 1 SI = 32K 
       data hash MD5: 32K
       11 A8 51 48 F9 10 36 0F 89 4D 7D 0F 26 36 47 F6>)
(   3,<2007-06-06 10:50:49.96 +100>,<MAYBRIDGE\nmr>,<NMR_250MHZ>,
      <apk 
       data hash MD5: 32K
       D3 7E 4D 3A D0 C2 4E 7C 58 60 79 EF 14 8D 58 53>)
(   4,<2007-06-06 10:50:50.83 +100>,<MAYBRIDGE\nmr>,<NMR_250MHZ>,
      <abs ABSG = 5 
       data hash MD5: 32K
       AA C8 3E 62 B0 B0 B2 FA C6 01 2D C7 62 A1 F3 68>)
$$ ##END=
$$ 
$$ hash MD5
$$ 0A 3E D9 DA C3 AF BE F0 70 04 E3 ED F9 56 8D 6C
##$RELAX= 
##$RELAX= 
##$RELAX= 
##$RELAX= 
##$RELAX= 
##$RELAX= 
##$RELAX= 
$$ Bruker specific parameters
$$ --------------------------
##$DU= <C:\u>
##$EXPNO= 310
##$NAME= <ADRS>
##$PROCNO= 1
##$TYPE= <nmr>
##$USER= <dgb>
##$AMP= (0..31)
100 100 100 100 100 100 100 100 100 100 100 100 100 100 100 100 100 100 
100 100 100 100 100 100 100 100 100 100 100 100 100 100 
##$AQSEQ= 0
##$AQ_mod= 3
##$AUNM= <au_zg>
##$AUTOPOS= <14 >
##$BF1= 250.13
##$BF2= 250.13
##$BF3= 250.13
##$BF4= 250.13
##$BF5= 500.13
##$BF6= 500.13
##$BF7= 500.13
##$BF8= 500.13
##$BYTORDA= 1
##$CFDGTYP= 0
##$CFRGTYP= 5
##$CHEMSTR= <none>
##$CNST= (0..31)
1 1 145 1 1 1 1 1 1 1 1 1 1 1 1 1 1 1 1 1 1 1 1 1 1 1 1 1 1 1 1 1 
##$CPDPRG= <>
##$CPDPRG1= <>
##$CPDPRG2= <>
##$CPDPRG3= <>
##$CPDPRG4= <mlev>
##$CPDPRG5= <mlev>
##$CPDPRG6= <mlev>
##$CPDPRG7= <mlev>
##$CPDPRG8= <mlev>
##$CPDPRGB= <>
##$CPDPRGT= <>
##$D= (0..31)
0 1 0 0 0 0 0 0 0 0.06 0 0 0 0 0 0 0.0002 0 0 0 0 0 0 0 0 0 0 0 0 0 0 
0 
##$DATE= 1181123423
##$DBL= (0..7)
120 120 120 120 120 120 120 120 
##$DBP= (0..7)
150 150 150 150 150 150 150 150 
##$DBP07= 0
##$DBPNAM0= <>
##$DBPNAM1= <>
$$ [...]
##$SUBNAM7= <"">
##$SUBNAM8= <"">
##$SUBNAM9= <"">
##$SW= 20.6930455092707
##$SWIBOX= (0..15)
0 0 3 0 0 0 0 0 0 0 0 0 0 0 0 0 
##$SW_h= 5175.983436853
##$TD= 65536
##$TD0= 1
##$TE= 296.16
##$TE2= 300
##$TE3= 300
##$TEG= 300
##$TL= (0..7)
0 120 120 120 120 120 120 120 
##$TP= (0..7)
150 150 150 150 150 150 150 150 
##$TP07= 0
##$TPNAME0= <>
##$TPNAME1= <>
##$TPNAME2= <>
##$TPNAME3= <>
##$TPNAME4= <>
##$TPNAME5= <>
##$TPNAME6= <>
##$TPNAME7= <>
##$TPOAL= (0..7)
0.5 0.5 0.5 0.5 0.5 0.5 0.5 0.5 
##$TPOFFS= (0..7)
0 0 0 0 0 0 0 0 
##$TUNHIN= 0
##$TUNHOUT= 0
##$TUNXOUT= 0
##$USERA1= <user>
##$USERA2= <user>
##$USERA3= <user>
##$USERA4= <user>
##$USERA5= <user>
##$V9= 5
##$VALIST= <valist>
##$VCLIST= <CCCCCCCCCCCCCCC>
##$VD= 0
##$VDLIST= <DDDDDDDDDDDDDDD>
##$VPLIST= <PPPPPPPPPPPPPPP>
##$VTLIST= <TTTTTTTTTTTTTTT>
##$WBST= 1024
##$WBSW= 4
##$XGAIN= (0..3)
0 0 0 0 
##$XL= 0
##$YL= 0
##$YMAX_a= 287798
##$YMIN_a= -269514
##$ZGOPTNS= <>
##$ZL1= 120
##$ZL2= 120
##$ZL3= 120
##$ZL4= 120
##$ABSF1= 16.522
##$ABSF2= -4.171173
##$ABSG= 5
##$ABSL= 3
##$ALPHA= 0
##$AQORDER= 0
##$ASSFAC= 0
##$ASSFACI= 0
##$ASSFACX= 0
##$ASSWID= 0
##$AUNMP= <proc_1d>
##$AZFE= 0.1
##$AZFW= 0.1
##$BCFW= 0
##$BC_mod= 0
##$BYTORDP= 0
##$COROFFS= 0
##$CY= 12.5
##$DATMOD= 1
##$DC= 0
##$DFILT= <>
##$DTYPP= 0
##$F1P= 14.0000005364418
##$F2P= -0.99999901652339
##$FCOR= 0.5
##$FTSIZE= 32768
##$FT_mod= 6
##$GAMMA= 0
##$GB= 0
##$INTBC= 1
##$INTSCL= 1
##$ISEN= 128
##$LB= 0.3
##$LEV0= 0
##$LPBIN= 0
##$MAXI= 10000
##$MC2= 0
##$MEAN= 0
##$ME_mod= 0
##$MI= 0
##$NCOEF= 0
##$NC_proc= -3
##$NLEV= 6
##$NOISF1= 0
##$NOISF2= 0
##$NSP= 0
##$NTH_PI= 0
##$NZP= 0
##$OFFSET= 16.522
##$PC= 1
##$PHC0= -67.40772
##$PHC1= 9.596642
##$PH_mod= 1
##$PKNL= yes
##$PPARMOD= 0
##$PSCAL= 4
##$PSIGN= 0
##$REVERSE= no
##$SF= 250.13
##$SI= 32768
##$SIGF1= 0
##$SIGF2= 0
##$SINO= 400
##$SIOLD= 32768
##$SREGLST= <1H.DMSO>
##$SSB= 0
##$STSI= 32768
##$STSR= 0
##$SW_p= 5175.98343685301
##$SYMM= 0
##$S_DEV= 0
##$TDeff= 65536
##$TDoff= 0
##$TI= <Analysis number 999999
Compound Code 99
Book Reference 9
Project Code 9>
##$TILT= no
##$TM1= 0
##$TM2= 0
##$TOPLEV= 0
##$USERP1= <user>
##$USERP2= <user>
##$USERP3= <user>
##$USERP4= <user>
##$USERP5= <user>
##$WDW= 1
##$XDIM= 32768
##$YMAX_p= 307927206
##$YMIN_p= -301737
$$ End of Bruker specific parameters
$$ ---------------------------------
##NTUPLES= NMR SPECTRUM
##VAR_NAME=  FREQUENCY,     SPECTRUM/REAL,   SPECTRUM/IMAG
##SYMBOL=    X,             R,               I
##VAR_TYPE=  INDEPENDENT,   DEPENDENT,       DEPENDENT
##VAR_FORM=  AFFN,          ASDF,            ASDF
##VAR_DIM=   32768,         32768,           32768
##UNITS=     HZ,            ARBITRARY UNITS, ARBITRARY UNITS
##FACTOR=    0.157963299565203, 1,           1
##FIRST=     4132.6476996994, 0,             0
##LAST=      -1043.33573715361, 0,           0
##MIN=       -1043.33573715361, -301737,     0
##MAX=       4132.6476996994, 307927206,     0
$$ Real data points
##PAGE= N=1
##DATA TABLE= (X++(R..R)), XYDATA
$$ [...]
19194A4795q319n562J9615K9916J9265J1526k7684p272r489M376K4626O992N720
$$ 14795 6476 914 20529 50445 69710 81236 53552 46280 36791 41167 65793 72785 78505
19181G8505k7107k466K0l1192j273J202j078N860j803L492j257N786p772J2944
$$ 78505 51398 48932 48952 17760 16487 17689 16611 22471 20668 24160 22903 28689 20917 33861
19167C3861j2541j8361J0133J0776J4528K2448P557R631k693J3479k6810k3732
$$ 33861 21320 2959 13092 23868 38396 60844 68401 78032 75339 88818 62008 38276
19155C8276j0702J0476N097l440o521K0979k9377k627m393J0663K5212J8671J4606
$$ 38276 27574 38050 43147 39707 33186 54165 24788 22161 17768 28431 53643 72314 86920
19142H6920j3561j5690j5498Q734K1235j1916j2709l3131M469K2033L5669n125
$$ 86920 73359 57669 42171 50905 72140 60224 47515 14384 18853 40886 76555 71430
19130G1430k7514N638L615m370L2185j548m2960j6993J3278K2304K5032J7384
$$ 71430 43916 49554 53169 48799 80984 79436 36476 19483 32761 55065 80097 97481
19118I7481j5986k4857l487j1812K6648q650l3112M85r099q536M131J988j0847
$$ 97481 81495 56638 53151 41339 67987 59337 26225 26710 17611 9075 13206 15194 4347
19105D347J3174P095j2156l1138j6536J7321J9185o584M420k689r349j3471M752
$$ 4347 17521 24616 12460 -18678 -35214 -17893 1292 -5292 -872 -3561 -12910 -26381 -21629
19092b1629J9355K6631J593l2184J0073R245O823j8172J652P771Q81L034K295
$$ -21629 -2274 24357 25950 -6234 3839 13084 19907 1735 3387 11158 12039 15073 17368
19079A7368m605N859j3912k1516J3727K0218J0941j1896R727q15j1762J2088r140
$$ 17368 12763 18622 4710 -16806 -3079 17139 28080 16184 25911 25096 13334 25422 16282
19066A6282K5327K8978j9134k5336j3262Q742J3104P347r832P460O141M142j488
$$ 16282 41609 70587 51453 26117 12855 21597 34701 42048 32216 39676 45817 49959 48471
19053D8471R715J1030J5977J1250n65j5773j4542O865j923L9193L2222J6238k0050
$$ 48471 58186 69216 85193 96443 95878 80105 65563 72428 70505 109698 141920 158158 138108
19040A38108j6596j0781J5007m871r479p482J5856J2066N860Q193N516k2359K2816
$$ 138108 121512 110731 125738 120867 111388 103906 119762 131828 137688 145881 151397 129038 151854
19027A51854J0816m7262m0005J2637R261j5371m6602j6968K3801N076j3328m062
$$ 151854 162670 115408 75403 88040 97301 81930 35328 18360 42161 47237 33909 29847
19015B9847K0262p049k2410n019K433K2130R172M067p339j2739j9324j1814N707
$$ 29847 50109 43060 20650 15631 18064 40194 49366 53433 46094 33355 14031 2217 7924
19002G924k319J9392O950k7434o368J8440k3039j7611O337K0634L1417J2668M908
$$ 7924 5605 24997 31947 4513 -1855 16585 -6454 -24065 -17728 2906 34323 46991 51899
18989E1899Q012K1380K4495J1418p192j0817j0233J5213j0922k4689j999M844
$$ 51899 59911 81291 105786 117204 110012 99195 88962 104175 93253 68564 66565 71409
18977G1409L3531L1692M836P538j5904m2514n3206p265J7855M5k3901N065j8428
$$ 71409 104940 136632 141468 149006 133102 90588 37382 30117 47972 48017 24116 29181 10753
18964A0753j3486r772L573K6682P145m6603R906K7564r702k8502q462o799o691
$$ 10753 -2733 -12505 -8932 17750 24895 -21708 -11802 15762 6060 -22442 -30904 -37703 -44394
18951d4394M484K534P00K5963P597j4904Q04K6440J5283r725j8396J0906m794
$$ -44394 -39910 -37376 -36676 -10713 -3116 -18020 -17216 9224 24507 14782 -3614 7292 2498
18938B498k9789k2415Q991J8610L5222J6489J249O050j7130J670K7765J9415q122
$$ 2498 -27291 -49706 -40715 -22105 13117 29606 30855 36905 19775 21445 49210 68625 60503
18925F0503q856j1151n585l1841j5041m392J4134p517j7843O523J3710K5515J9450
$$ 60503 51647 40496 34911 3070 -11971 -16363 -2229 -9746 -27589 -21066 -7356 18159 37609
18912C7609O650j4108J3845L7950m632k7524o754j3028k512q839J8334K1395K522
$$ 37609 44259 30151 43996 81946 77314 49790 43036 30008 27496 18657 36991 58386 60908
18899F0908n870j0394j879j2405l0233M0332L8245J6637L7599M2117N066K341
$$ 60908 55038 44644 42765 30360 127 40459 78704 95341 132940 175057 180123 182464
18887A82464N102m840P062O822k9981k5128k0900j6572l613j0431k1328k7985
$$ 182464 187566 182726 189788 196610 166629 141501 120601 104029 100416 89985 68657 40672
18875D0672k8851k6126n678O445Q579P411J6388K2056J1941q334j6567j3702J0967
$$ 40672 11821 -14305 -19983 -13538 -4959 2452 18840 40896 52837 44503 27936 14234 25201
18862B5201j5097k044p901J3117R335j9489K20K432J8581J2367k1613J282J0736
$$ 25201 10104 8060 159 13276 22611 3122 3342 5774 24355 36722 15109 16391 27127
18849B7127J2444N131n7k8698J1234J653j9850K7402K4162J2709J8791J9852K3672
$$ 27127 39571 44702 44645 15947 27181 28834 8984 36386 60548 73257 92048 111900 135572
18836A35572K1835J2176J0203J6935m33j3133p405l051o580j3507k0541O36j9450
$$ 135572 157407 169583 179786 196721 196288 183155 175750 172699 166119 152612 132071 132707 113257
18823A13257j2956j4919N280j5364j9036j8742p724j737o962P945L934m430J3541
$$ 113257 100301 85382 90662 75298 56262 37520 29796 28059 21097 29042 32976 28546 42087
18810D2087j9424M841L867k2559k4680j0189j3492o463r160N046J4831O713M477
$$ 42087 22663 27504 31371 8812 -15868 -26057 -39549 -46012 -55172 -50126 -35295 -28582 -24105
18797b4105J9835K7524J3240K501J4629O578j001J8375j6064j9371j1508J0258
$$ -24105 -4270 23254 36494 38995 53624 60202 59201 77576 61512 42141 30633 40891
18785D0891J5619j4758n5105j3996j6969L2141J9192K756j2330P969J9295q918
$$ 40891 56510 41752 -13353 -27349 -44318 -12177 7015 9771 -2559 5410 24705 15787
18773A5787p387n921L019J9781j5446O124K371o945J7064r910j7094J5771O476
$$ 15787 8400 2479 5498 25279 9833 15957 18328 11383 28447 18537 1443 17214 23690
18760B3690O97L918J7696p24j4265j0289M374k606j1791Q330K297k9343r090j07
$$ 23690 24387 28305 46001 45277 31012 20723 25097 22491 10700 19030 21327 -8016 -17106 -17213
18746a7213J7246J0590N963K716j4656J7683L1352J9698m138J1211j3384j0271
$$ -17213 33 10623 16586 19302 4646 22329 53681 73379 69241 80452 67068 56797
18734E6797k1438k8435o866N033P537l886J4116j4262K0281K6174R344r235k2291
$$ 56797 35359 6924 58 5091 12628 8742 22858 8596 28877 55051 64395 55160 32869
18721C2869m112M773K9585K555k0451j1903k1242k0975R2J5399r15l899P3k2425
$$ 32869 28757 33530 63115 65670 45219 33316 12074 -8901 -8809 6590 5675 1776 1849 -20576
18707b0576J2676N319n609o729L567M656K0677J2645K0677J2527j2370k3342k5364
$$ -20576 -7900 -2581 -8190 -14919 -11352 -6696 13981 26626 47303 59830 47460 24118 -1246
18694a246j0554J3717O322J4339j8055k928j0715J6904j552k1181j8212j5272
$$ -1246 -11800 1917 8239 22578 4523 1595 -9120 7784 6232 -14949 -33161 -48433
18682d8433R446M2499R035j0829O575r364k9006J0016r37L1428J9726k4943k1661
$$ -48433 -38987 3512 12547 1718 8293 -1071 -30077 -20061 -20998 10430 30156 5213 -16448
18669a6448j2150K1265K0227J2541l3269M307J4150k0655j9651j1058J1650J608
$$ -16448 -28598 -7333 12894 25435 -7834 -3527 10623 -10032 -29683 -40741 -29091 -27483
18657b7483j2858r220K5597K4236j0346r339O91L619K7121L073j3097r397o543
$$ -27483 -40341 -49561 -23964 272 -10074 -19413 -18722 -15103 12018 15091 1994 -7403 -13946
18644a3946k695K4681M867L245j3025k5841m106J2679K5438K3378k551n962J9846
$$ -13946 -16641 8040 12907 16152 3127 -22714 -26820 -14141 11297 34675 32124 26162 46008
18631D6008r594l518k0613k3140k7542r494o654n816J6370k924K7021J6722l5618
$$ 46008 36414 32896 12283 -10857 -38399 -47893 -54547 -60363 -43993 -46917 -19896 -3174 -38792
18618c8792J2003J4472j7943k2895R609L4757L681J7825l168J7733o573l660J2091
$$ -38792 -26789 -12317 -30260 -53155 -43546 -8789 -5108 12717 9549 27282 20709 17049 29140
18605B9140j9272k624o270k8852Q383K0726k0283k0581J5823K7579J5597J9618
$$ 29140 9868 7244 974 -27878 -19495 1231 -19052 -39633 -23810 3769 19366 38984
18593C8984J2468J737j2337n189J544r508l506O16j8602l675K0399J8213n259
$$ 38984 51452 53189 40852 35663 37207 27699 24193 24809 6207 2532 22931 41144 35885
18580C5885k531o72l5086k6860J8951J346J4612p981k6747j2276R380J0401j3825
$$ 35885 33354 32682 -2404 -29264 -10313 -8967 5645 -2336 -29083 -41359 -31979 -21578 -35403
18567c5403o09L8505K5953j3251k0791J045M495N80r084j6511n904K6012J4111
$$ -35403 -36012 2493 28446 15195 -5596 -4551 -56 524 -8560 -25071 -30975 -4963 9148
18554I148r055L55M292l6563j9124K3134Q768J1161j2498P177P254j9643J198
$$ 9148 93 448 4740 -31823 -50947 -27813 -19045 -7884 -20382 -13205 -5951 -25594 -24396
18541b4396Q585o868n151p54k3297M594L6628J6445N150J837j3490n557o781Q919
$$ -24396 -15811 -22679 -27830 -28584 -51881 -47287 -10659 5786 10936 12773 -717 -6274 -13055 -4136
18527d136n60j9905q022P2p782q562J6087K4195p16K1894L834J9070j8478k3532
$$ -4136 -4696 -24601 -32623 -32551 -40333 -48895 -32808 -8613 -9329 12565 16399 35469 16991 -6541
18513f541q007K5419L186j0668m895m087k892o772j3310j672J0254K0207J743
$$ -6541 -14548 10871 14057 3389 -1506 -5593 -8485 -15257 -28567 -30239 -19985 222 1965
18500A965k489o379k698k593j5934o877L208J0744K71J4306Q410J574l161k7122
$$ 1965 -524 -6903 -9601 -12194 -28128 -35005 -31797 -21053 -20782 -6476 1934 3508 347 -26775
18486b6775p597L552J226J741L6654P125n478j0445k250q381J20K5907j584k3919
$$ -26775 -34372 -30820 -29594 -27853 8801 15926 10448 3 -2247 -10628 -10508 15399 13815 -10104
18472a0104j3694p200m418J2499L602Q971r628Q963o611n228Q866J2505n81K2590
$$ -10104 -23798 -30998 -35416 -22917 -19315 -10344 -19972 -11009 -17620 -22848 -13982 -1477 -2058 20532
18458B0532Q957j3549k737p394j0771k3341J5598J8253m021m8470j3797K570J5778
$$ 20532 29489 15940 13203 5809 -4962 -28303 -12705 5548 1527 -46943 -60740 -58170 -42392
18445d2392J7403k0144J4611J3803K9915J6792O467j5935L423j181O48k7j2347
$$ -42392 -24989 -45133 -30522 -16719 13196 29988 36455 20520 23943 22762 23410 23383 11036
18432A1036R211Q97k8366J5842m855j2609K794j4761r383q543J8541Q054j6204
$$ 11036 20247 21144 -7222 8620 3765 -8844 -6050 -20811 -30194 -38737 -20196 -12142 -28346
18419b8346j8165K3500r790j7690L055j2J0233K5996j1833L700R1K4603R566k2585
$$ -28346 -46511 -23011 -32801 -50491 -47436 -47448 -37215 -11219 -23052 -19352 -19261 5342 14908 -7677
18405g677j1435p597j2756k224r91p454n908R532j694K9213j303k716J4439k532
$$ -7677 -19112 -26709 -39465 -41689 -42680 -50134 -56042 -46510 -48204 -18991 -20294 -23010 -8571 -11103
18391a1103j7853p670k2980K7896J3589o360Q78O882J3804K4028L1427j741l109
$$ -11103 -28956 -36626 -59606 -31710 -18121 -24481 -23603 -16721 -2917 21111 52538 50797 47688
18378D7688l1480j1367K0184P736j274j5398K036q68j4027q642q009j7416Q158
$$ 47688 16208 4841 25025 32761 31487 16089 18125 17257 3230 -5412 -13421 -30837 -22679
18365b2679K1199J2855j4914l9452j8781K91K2409O498o905J5702K7902m719k744
$$ -22679 -1480 11375 -3539 -42991 -61772 -61481 -39072 -32574 -39479 -23777 4125 -594 -3338
18352c338l6133l05J1010L422m599K4594j0991M091J0773m282M506N400N581P091
$$ -3338 -39471 -39776 -28766 -25344 -29943 -5349 -16340 -12249 -1476 -5758 -1252 4148 9729 16820
18338A6820P483Q861k6280l353L81k9243q883K2635K3294J3860l3490l726m200
$$ 16820 24303 33164 6884 3531 3912 -25331 -34214 -11579 11715 25575 -7915 -11641 -15841
18325a5841M043j1610K309o593k1305J7777j1781R976J8591j9671K0261Nj9165
$$ -15841 -11798 -23408 -21099 -27692 -48997 -31220 -43001 -33025 -14434 -34105 -13844 -13839 -33004
18312c3004L2024R199O282K5810j1065j6769k9017k4854p10L979N046J6561K5232
$$ -33004 -980 8219 14501 40311 29246 12477 -16540 -41394 -42104 -38125 -33079 -16518 8714
18299H714l973j1364j3458k4186j5926N55o468P927j0489j000L4263K924l4308
$$ 8714 4741 -6623 -20081 -44267 -60193 -59638 -66106 -58179 -68668 -69668 -35405 -32481 -66789
18286f6789j6256k2132J6619K5884P440m10J7167L3134K1848r32q384m88o660
$$ -66789 -83045 -105177 -88558 -62674 -55234 -55644 -38477 -5343 16505 15573 7189 6701 41
18273D1r639p058j7849K8131L6880l217j2542J156p742k1694m880R898J4657J4077
$$ 41 -9598 -16656 -34505 -6374 30506 27289 14747 15903 8161 -13533 -18413 -8515 6142 20219
18259B0219q273k4992j582p599M157P364k4624j647O066J2310J8442J4621K37
$$ 20219 11946 -13046 -14628 -22227 -18070 -10706 -35330 -36977 -30911 -18601 -159 14462 14699
18246A4699k6674k6221o146n136N154J7780j7760j409m57K26J1075k928M13j6867
$$ 14699 -11975 -38196 -44342 -49478 -44324 -26544 -44304 -45713 -46170 -45944 -34869 -37797 -37384 -54251
18232e4251m878J0698J4912K0460J2433j6812J838J0088K2107P655j0319L041
$$ -54251 -59129 -48431 -33519 -13059 -626 -17438 -15600 -5512 16595 24250 13931 16972
18220A6972p979m021J2080r455j3571l692j4538M531J2779K1361K6374j5736j1264
$$ 16972 8993 4972 17052 7597 -5974 -9666 -24204 -19673 -6894 14467 40841 25105 13841
18207A3841j5283k9396l157Q309J0616L2176k557k4538r928J158j3926N578k614
$$ 13841 -1442 -30838 -33995 -25686 -15070 17106 14549 -9989 -19917 -18759 -32685 -27107 -29721
18194b9721J83J8808o418J9733J6520J4800J1956k1317k3687j3551K844K2340
$$ -29721 -29538 -10730 -17148 2585 19105 33905 45861 24544 857 -12694 -9850 12490
18182A2490M772k251l467J3896q255l7952j1565O047L029j7647j279L1907N966
$$ 12490 17262 15011 11544 25440 17185 -20767 -32332 -26285 -23256 -40903 -42182 -10275 -4309
18169d309j562k3829J529J0174K3441J9514j008O0n462k8718j9830j9751J0334
$$ -4309 -5871 -29700 -28171 -17997 5444 24958 23950 24010 18548 -10170 -30000 -49751 -39417
18156c9417M817K9730J0978J6858l789k4266N474J2134K4488q513K667N779K5349
$$ -39417 -34600 -4870 6108 22966 19177 -5089 385 12519 37007 28494 31161 36940 62289
18143F2289K2105j8047J4897J2167j8952K3133L0038J3609j2641k5741m4371J797
$$ 62289 84394 66347 81244 93411 74459 97592 127630 141239 128598 102857 58486 60283
18131F0283K0969M089j1288j7974J409j0489J2496J1412l5977j3075j0170k3126
$$ 60283 81252 85341 74053 56079 57488 46999 59495 70907 34930 21855 11685 -11441
18119a1441j6449k0390J9798J0069J4258R796j9342n615j4544o567K7876r114
$$ -11441 -27890 -48280 -28482 -18413 -4155 5641 -13701 -19316 -33860 -40427 -12551 -21665
18107b1665n254K5538K7509J2843J1670J4002M4385N9588N2265M2989M521l4021
$$ -21665 -26919 -1381 26128 38971 50641 64643 109028 168616 220881 263870 268391 234370
18095B34370J5596j0482K2232M8163J8728m30l7641o6150l9674J0248M260L1197
$$ 234370 249966 239484 261716 309879 328607 328177 290536 224386 184712 194960 199220 230417
18083B30417K261k4621j3409j2784l1944n1103m6165l8721k1988J3663L4032M539
$$ 230417 232678 208057 194648 181864 149920 98817 52652 13931 -8057 5606 39638 44177
18071D4177j2207j21R412J0730k5401j6490K0279M103J0864J4976J0649K3780
$$ 44177 31970 31849 41261 51991 26590 10100 30379 34482 45346 60322 70971 94751
18059I4751K0098j8258m0977j9235K5905N133L106M827K2879M8982Q1209R0715
$$ 94751 114849 96591 55614 36379 62284 67417 70523 75350 98229 147211 228420 319135
18047C19135N7908K1381k2729j5273k6890o935m9353l0030j8374n2929m6890l0704
$$ 319135 377043 398424 375695 360422 333532 326597 277244 247214 228840 175911 129021 98317
18035I8317o795J0875J05k3492l2093k2358j0071k7564k6523M719L0389j435O374
$$ 98317 91522 102397 102502 79010 46917 24559 14488 -13076 -39599 -34880 -4491 -5926 448
18022D48P293O673O491M490j6781k1380n040n728j450J7844l137N511L6098R879
$$ 448 7741 14414 20905 25395 8614 -12766 -17806 -23534 -24984 -7140 -10277 -4766 31332 41211
18008D1211p804j7207N479Q767L373R665Q079J5629J5011M5095L9010J8093N206
$$ 41211 33407 16200 21679 30446 33819 43484 51563 67192 82203 127298 166308 184401 189607
17995A89607J6471J3850J4320J9846J3880K4073L4292J9357L8229K5790L9381
$$ 189607 206078 219928 234248 254094 267974 292047 326339 345696 383925 409715 449096
17984D49096O8573M1078j784l9998n1641m3745m6990n3615k8068J7761r616m2190
$$ 449096 517669 558747 556963 516965 465324 421579 374589 320974 292906 310667 301051 258861
17972B58861m9757j9238Q431p658N764J8471K7890m365j1965q749m607k7657l2647
$$ 258861 209104 189866 198297 190639 196403 214874 242764 238399 226434 217685 213078 185421 152774
17959A52774n6797l386O001M142R393J0570R257l609l421J2524J727K6306N849
$$ 152774 95977 92591 98592 102734 112127 122697 131954 128345 124924 137448 139175 165481 171330
17946A71330Q173K8904k104k451J9198J7738J0451j3639k0120j905k616l815o342
$$ 171330 179503 208407 206303 203852 223050 240788 251239 237600 217480 215575 212959 209144 202802
17933B02802n899j0597O17j7135J560m209l5275l79k1235j7331N052j7460J2586
$$ 202802 196903 186306 186923 169788 171348 167139 131864 131485 110250 92919 97971 80511 93097
17920I3097R937K6893P874K7013j3203p534k2604J5869O517l537k6665k1704k6606
$$ 93097 103034 129927 137801 164814 151611 144077 121473 137342 143859 140322 113657 91953 65347
17907F5347j2638l21k1363j6887l0044j9429J7851M1134K2330P816q168j2431
$$ 65347 52709 52388 31025 14138 -15906 -35335 -17484 23650 45980 53796 45628 33197
17895C3197k0171J0782P547N651k8752o250M05J7075K0975N683l1292j7362j1726
$$ 33197 13026 23808 31355 37006 8254 2004 2409 19484 40459 46142 14850 -2512 -14238
17882a4238p57j2778K0899L9884J9131m194J1378O621k5038k2529j6752K3642
$$ -14238 -14995 -27773 -6874 33010 52141 47947 59325 65946 40908 18379 1627 25269
17870B5269L589J1101n0l140j2352p612k0221l25J2728o929p700P578J114J7096
$$ 25269 28858 39959 39909 36769 24417 16805 -3416 -3741 8987 2058 -5642 1936 3050 20146
17856B0146P675j1026p759n572J8399R72q853k8344l0877J2152J1412J1738j9533
$$ 20146 27821 16795 9036 3464 21863 22835 13982 -14362 -45239 -33087 -21675 -9937 -29470
17843b9470l019j9921n28J0399L642K2988K937N60N972J4612J8027k0434O391
$$ -29470 -32489 -52410 -52938 -42539 -38897 -15909 -12972 -12412 -6440 8172 26199 5765 12156
17830A2156o406L520r310k7233k0729J3774J6318K2119J3946q862r113K305M914
$$ 12156 5750 9270 -40 -27273 -48002 -34228 -17910 4209 18155 9293 180 2485 7399
17817G399j0650J7656K3441J233j4223L954o859l17k2837j8780J5019P302M537
$$ 7399 -3251 14405 37846 39079 24856 28810 21951 21634 -1203 -19983 -4964 2338 6875
17804F875K235J6938L0673o223l2791k6449q768J2013J0161J4060q245k4617j4300
$$ 6875 9110 26048 56721 50498 17707 -8742 -17510 -5497 4664 18724 10479 -14138 -28438
17791b8438l319Q142J5058J3814j669j0384J163K4156j5829j0559R900L727o491
$$ -28438 -31757 -23615 -8557 5257 3588 -6796 -5633 18523 2694 -7865 2035 5762 -729
17778g29J109q111j5927K515k157K2208L396R927J1482k735j7089j457j5081k2123
$$ -729 380 -7731 -23658 -21143 -23300 -1092 2304 12231 23713 20978 3889 2432 -12649 -34772
17764c4772j22J0398K5897M699J7981K6771l4863k1585K2822P198j4090k1556
$$ -34772 -34894 -24496 1401 6100 24081 50852 15989 -5596 17226 24424 10334 -11222
17752a1222n957J1341L1681o37k275j2518j5257J6737p907J8725Q077l9859l9256
$$ -11222 -17179 -5838 25843 25206 22931 10413 -4844 11893 3986 22711 30788 -9071 -48327
17739d8327K084p653L0034L4894O889p411k3106k3955o037K8827K0801J9342o509
$$ -48327 -46243 -53896 -23862 11032 17921 10510 -12596 -36551 -42588 -13761 7040 26382 19873
17726A9873R119L488K289J804j8793j8204q679l5126N413L351Q914M810k2834
$$ 19873 28992 32480 34769 36573 17780 -424 -9103 -44229 -38816 -35465 -26551 -21741 -44575
17713d4575j3769M5699K2095q231j6212k4481Q530k0212O82L6491K7972l461M68
$$ -44575 -58344 -12645 9450 1219 -14993 -39474 -30944 -51156 -50474 -13983 13989 10528 10996
17700A0996P356n084Q233j7955j9567l19m496p987M175L0048k648k1152K630o047
$$ 10996 18352 13268 21501 3546 -16021 -16340 -20836 -28823 -24648 5400 2752 -18400 -15770 -21817
17686b1817p537J0245J9726K1683O312l0612l1342J3106l2170r126J8682Q869
$$ -21817 -29354 -19109 617 22300 28612 -2000 -33342 -20236 -52406 -61532 -42850 -33981
17674c3981N959m95N089j0908j1692J5785j2785J5123J011K264j907o687J1856
$$ -33981 -28022 -28517 -23428 -34336 -46028 -30243 -43028 -27905 -26894 -24630 -26537 -33224 -21368
17661b1368P946l800k803J5164L251p700J76r606q51J1494J55k542j0399J2553
$$ -21368 -13422 -17222 -20025 -4861 -1610 -9310 -9134 -18740 -19591 -8097 -7942 -10484 -20883 -8330
17647h330j336p66j1457j0772J4483K685j6220j4381j0471j492L2753J8284k2109
$$ -8330 -9666 -10432 -21889 -32661 -18178 -15493 -31713 -46094 -56565 -58057 -25304 -7020 -29129
17634b9129l2443M555K7288K3673K8110K3261q647j8304j4548k5570l493j5302
$$ -29129 -61572 -57017 -29729 -6056 22054 45315 36668 18364 3816 -21754 -25247 -40549
17622d0549K217k5269j530M6031N1207k402k2327m086l0585J170K4118J3585j1482
$$ -40549 -38332 -63601 -65131 -19100 32107 29705 7378 3292 -27293 -26123 -2005 11580 98
17609I8k038k2249L661J4586K9956j0720j6521q625P53J4601l0k3071P2m089N319
$$ 98 -1940 -24189 -20528 -5942 24014 13294 -3227 -11852 -11099 3502 3472 -19599 -19527 -23616 -18297
17594a8297N529j1181L7224L7124j2242l1989j6474Q076Q997R793J4209j3604
$$ -18297 -12768 -23949 13275 50399 38157 6168 -10306 -2230 6767 16560 30769 17165
17582A7165n426j4163k840j0569K745j3139n272R636J6114K8614j9050l1006N612
$$ 17165 11739 -2424 -5264 -15833 -13088 -26227 -31499 -21863 -5749 22865 3815 -27191 -21579
17569b1579n776j3165O911K0809K7382j4914j5506J0045k2244R172K3141j2509
$$ -21579 -27355 -40520 -33609 -12800 14582 -332 -15838 -5793 -28037 -18865 4276 -8233
17557h233m391j0095j1545J694p546j7076j783J2766K4332J8892N952l5116k5097
$$ -8233 -12624 -22719 -34264 -32570 -40116 -57192 -58975 -46209 -21877 -2985 2967 -32149 -57246
17544e7246K4157K7795K1243R540J3371J720L651k837k2641j4731j2540M674j1582
$$ -57246 -33089 -5294 15949 25489 38860 40580 44231 41394 18753 4022 -8518 -3844 -15426
17531a5426j0051o256k0734J1978O424r841J3562j016P560j9774j8154J2429K3296
$$ -15426 -25477 -31733 -52467 -40489 -34065 -43906 -30344 -31360 -23800 -43574 -61728 -49299 -26003
17518b6003L3492j600q146k4542N090K7443k7278k3529L814J595M058q184J0019
$$ -26003 7489 5889 -2257 -26799 -21709 5734 -21544 -45073 -41259 -39664 -35606 -43790 -33771
17505c3771Q401J0246o99j5581j1363J1233p988j174M203J3288Q609J6360J7449
$$ -33771 -25370 -15124 -15823 -31404 -42767 -31534 -39522 -40696 -36493 -23205 -14596 1764 19213
17492A9213j4747k0070k2221j1462j2014J9941K1355R677K805n561p962l0567
$$ 19213 4466 -15604 -37825 -49287 -61301 -41360 -20005 -10328 -7523 -13084 -21046 -51613
17480e1613K6635J9980j3864M455N585l482l4062j3279J2611o917J8128R451Q618
$$ -51613 -24978 -4998 -18862 -14407 -8822 -12304 -46366 -59645 -47034 -53951 -35823 -26372 -17754
17467a7754J851P82J3750j2964r091j0186j8651L0032J7781j7222J5084N468r41
$$ -17754 -15903 -15121 -1371 -14335 -23426 -33612 -52263 -22231 -4450 -21672 -6588 -1120 -2061
17454b061N163J7351j5519l0077J8395K730j227R562k3277j2408J9214J3880l806
$$ -2061 3102 20453 4934 -25143 -6748 -4018 -5245 4317 -18960 -31368 -12154 1726 -2080
17441b080J3282J0988j2453L296k1423N307K5760r19Q052l122K966J5056K243
$$ -2080 11202 22190 9737 13033 -8390 -3083 22677 21758 29810 26688 29654 44710 46953
17428D6953k4850n427k366P254K5377j2993n1191r610K0910k326k843L202j9549
$$ 46953 22103 16676 14310 21564 46941 33948 -17243 -26853 -5943 -8269 -11112 -7910 -27459
17415b7459k0171L738K3291l765J5031K279Q980j6755l6201l545J6269K5436o47
$$ -27459 -47630 -43892 -20601 -24366 -9335 -7056 1924 -14831 -51032 -54577 -38308 -12872 -13519
17402a3519k4707O89K1439O820o799j1059J4230M802j511o583j4011q415R853
$$ -13519 -38226 -37537 -16098 -9278 -16077 -27136 -12906 -8104 -9615 -16198 -30209 -38624 -28771
17389b8771K0472K3646j356k8564O049P558k7037M026J7613o119k1181J738p152
$$ -28771 -8299 15347 13991 -14573 -8524 -966 -28003 -23977 -6364 -12483 -33664 -31926 -39078
17376c9078j8666L0183L9324k7102j0323J90J0380N394k6734k5188L2327J5139
$$ -39078 -57744 -27561 11763 -15339 -25662 -25472 -15092 -9698 -36432 -61620 -29293 -14154
17364a4154j3278r566n921J674o373m382j0146M254r416l659K7048M3319J0811
$$ -14154 -27432 -36998 -42919 -41245 -47618 -52000 -62146 -57892 -67308 -70967 -43919 -600 10211
17351A0211P935Q063O284J2766M33k0338l6148k2273j7539n14M2515j9053o699
$$ 10211 18146 26209 32493 45259 45692 25354 -10794 -33067 -50606 -51120 -8605 -27658 -34357
17338c4357R868Q594m212L060k1304p257N205J8414J3822k696l0006p158j2847
$$ -34357 -24489 -15895 -20107 -17047 -38351 -45608 -40403 -21989 -8167 -10863 -40869 -48027 -60874
17325f0874R619L784j6180r249J8090J6161N283J3627K1798j893k3690j1140J4726
$$ -60874 -51255 -47471 -63651 -72900 -54810 -38649 -33366 -19739 2059 166 -23524 -34664 -19938
17312a9938K2776O221k6899j0279p289J2096n724m746o703r842j3988r931J5265
$$ -19938 2838 9059 -17840 -28119 -35408 -23312 -29036 -33782 -40485 -50327 -64315 -74246 -58981
17299e8981K1568J0464K2017j2288J1214J0735N991j2243K233r807k5409J3382
$$ -58981 -37413 -26949 -4932 -17220 -6006 4729 10720 -1523 710 -9097 -34506 -21124
17287b1124J6378K6298k3619l758j7260l295J3841J059o209J688J2041K7247P528
$$ -21124 -4746 21552 -2067 -5825 -23085 -26380 -12539 -11480 -17689 -16001 -3960 23287 30815
17274C0815l1640j2168L127M783m582P89J1300P748l0737j2323J5181r683j2100
$$ 30815 -825 -12993 -9866 -5083 -9665 -8876 2424 10172 -20565 -32888 -17707 -27390 -39490
17261c9490P231P906J5612j9607Q1O728j1998N552P832j1013o563K1686J5295
$$ -39490 -32259 -24353 -8741 -28348 -28267 -21539 -33537 -27985 -20153 -31166 -37729 -16043 -748
17248g48O106l550j0425L116J3739n13k4599J1958j1508o007J6662O416K527l5775
$$ -748 5358 1808 -8617 -5501 8238 7725 -16874 -4916 -16424 -22431 -5769 647 3174 -32601
17234c2601j3472O07J3704J0390M692o380j1077K8933J8873n272n0287k5739j2841
$$ -32601 -46073 -45466 -31762 -21372 -16680 -23060 -34137 -5204 13669 8397 -41890 -67629 -80470
17221h0470R428K6333L0278J8898j0367l0310K3871L691p374j4881Q665J2805
$$ -80470 -71042 -44709 -14431 4467 -5900 -36210 -12339 -8648 -16022 -30903 -22238 -9433
17209i433K1687j0622k2471o306J1836O20k2169K758j470N887j1370O353J4817
$$ -9433 12254 1632 -20839 -27145 -15309 -14689 -36858 -34100 -35570 -29683 -41053 -34700 -19883
17196a9883J757l3008k3884J2650K5766R461K317K3097j4345j0106J0985l068
$$ -19883 -18126 -51134 -75018 -62368 -36602 -27141 -24824 -1727 -16072 -26178 -15193 -18261
17184a8261k0371r866J5911r484O692M981k0420k0579N808J3350K4478J2987L866
$$ -18261 -38632 -48498 -32587 -42071 -35379 -30398 -50818 -71397 -65589 -52239 -27761 -14774 -10908
17171a0908M39J8333O935k9572r193M159J4129K678K2782j0105k2779j766j6240
$$ -10908 -10469 7864 14799 -14773 -23966 -19807 -5678 -3000 19782 9677 -13102 -14868 -31108
17158c1108R219r519L4561L095o167m161J1463j8846j6884k0731J502K4875K2826
$$ -31108 -21889 -31408 3153 6248 81 -4080 7383 -11463 -28347 -49078 -47576 -22701 125
17145A25J9980J2222j7028k5985k375J2872L2278k089m2390j841J3181j6235N120
$$ 125 20105 32327 15299 -10686 -13061 -189 32089 30000 -12390 -14231 -1050 -17285 -12165
17132a2165Q487N366M631K195k0192k2587L263P777J5263J7296j3082k1981r536
$$ -12165 -3678 1688 6319 8514 -11678 -34265 -31002 -23225 -7962 9334 -3748 -25729 -35265
17119c5265J6493L0428j9840l8439M501J9172j2316j7649l70K0985J5060P882
$$ -35265 -18772 11656 -8184 -46623 -42122 -22950 -35266 -52915 -53285 -32300 -17240 -9358
17107i358J6971k0218N812Q72m700L022l708J5840P436J9493O91l1744j4531j7957
$$ -9358 7613 -12605 -6793 -5921 -10621 -7599 -11307 4533 11969 31462 32153 409 -14122 -32079
17093c2079j5659N965L9092J2535P941M561J0312j0782o280k4928k0127k3056
$$ -32079 -47738 -41773 -2681 9854 17795 22356 32668 21886 15606 -9322 -29449 -52505
17081e2505R654J2001K599j2390k344M61N588K4542j6018R745J8247R299j2782
$$ -52505 -42851 -30850 -28251 -40641 -42985 -42524 -36936 -12394 -28412 -18667 -420 8879 -3903
17068c903J896k6101j4534j1535K1981K6834j2526j1201R507M671j2792J362O468
$$ -3903 -2007 -28108 -42642 -54177 -32196 -5362 -17888 -29089 -19582 -14911 -27703 -26341 -19873
17055a9873p792p279J9577K4132j283j2662K5607l351j2714l2907j2568J8731
$$ -19873 -27665 -34944 -15367 8765 7482 -5180 20427 17076 4362 -28545 -41113 -22382
17043b2382j2517j784N0372J0317k5154k8799L962N752M727L921J823P339J2806
$$ -22382 -34899 -36683 13689 24006 -1148 -29947 -25985 -20233 -15506 -11585 -9762 -2423 10383
17030A0383j2119p571Kr068O812J9765P256k9184j8673J5334K0704l1874J5629
$$ 10383 -1736 -9307 -9305 -18373 -11561 8204 15460 -13724 -32397 -17063 3641 -28233 -12604
17017a2604j547j8929j1278J2744O379j8360q276k698J4694K4064L4786k6278
$$ -12604 -14151 -33080 -44358 -31614 -25235 -43595 -51871 -54569 -39875 -15811 18975 -7303
17005g303J633n852k1964j5020K6779n904J2850J3061K9769P61m5378J575M3087
$$ -7303 -5670 -11522 -33486 -48506 -21727 -27631 -14781 -1720 28049 28810 -16568 -14993 28094
16992B8094J508l9548k1113K388k5591J7372K3750Q478j0208R41p898K4412o913
$$ 28094 29602 -9946 -31059 -28671 -54262 -36890 -13140 -4662 -14870 -13929 -21827 2585 -4328
16979d328k8379j962k929j7045K1652K3069l369o945K9238j5835l845K4709O029
$$ -4328 -32707 -34669 -37598 -54643 -32991 -9922 -13291 -20236 9002 -6833 -10678 14031 20060
16966B0060k3671j7541l44l433p408K8351p210j1442o082r263J6835J1491k2644
$$ 20060 -3611 -21152 -21496 -24929 -32337 -3986 -11196 -22638 -28720 -37983 -21148 -9657 -32301
16953c2301k1137O900R707M678O981K9746p960L340J0915j1363k9619K794J9904
$$ -32301 -53438 -46538 -36831 -32153 -25172 4574 -3386 -46 10869 -494 -30113 -27319 -7415
16940g415m826k0885J2377K1596J3421k5239j695K2232j3140j6956j1547j1866
$$ -7415 -12241 -33126 -20749 847 14268 -10971 -12666 9566 -3574 -20530 -32077 -43943
16928d3943j8168K4674Q617L51K279j9905j626R655R951J1682O334k170q786O959
$$ -43943 -62111 -37437 -28820 -28469 -26190 -46095 -47721 -38066 -28115 -16433 -10099 -12269 -21055 -14096
16914a4096O831K0m255R417J3293o795m441j3246j7680O928N695J8844M293J205
$$ -14096 -7265 -7245 -11500 -2083 11210 4415 -26 -13272 -30952 -24024 -18329 515 4808 6013
16900F013J1896J4436q35j7755j771Q25J1665j6066p812j7851p568K9765J4744
$$ 6013 17909 32345 31510 13755 11984 12809 24474 8408 596 -17255 -24823 4942 19686
16887A9686l2580j6736j7188k002J5476J7342J201P130p956J4667q326k2462M912
$$ 19686 -12894 -29630 -46818 -48820 -33344 -16002 -14801 -7671 -15627 -960 -9286 -31748 -26836
16874b6836O108o115j146k371j9K3370K1586k3395oK6353r401j3496N178l4518
$$ -26836 -20728 -26843 -27989 -30360 -30379 -7009 14577 -8818 -8824 17529 8128 -5368 -190 -34708
16860c4708k0856q850K5347J6147J423o373M875J0095l858J3061l416j7715k995
$$ -34708 -55564 -64414 -39067 -22920 -21497 -27870 -22995 -12900 -16758 -3697 -7113 -24828 -27823
16847b7823L5238R326k0177m008r597N345L5242L067m410k3323j3312o748L1878
$$ -27823 7415 16741 -3436 -7444 -17041 -11696 23546 26613 22203 -1120 -14432 -21180 10698
16834A0698l113k9296m913j771N663K6100j731l998n173j7380j875J4993l815
$$ 10698 7585 -21711 -26624 -28395 -22732 3368 1637 -2361 -7534 -24914 -26789 -11796 -15611
16821a5611j237l024K2588J9886K032j5999k4964r620J3512N32J650K5637l863
$$ -15611 -16848 -19872 2716 22602 24634 8635 -16329 -25949 -12437 -11905 -10255 15382 11519
16808A1519j2607N246L826j960J726J6777l783r440K2445j3228j9778k6042K919
$$ 11519 -1088 4158 7984 6024 7750 24527 20744 11304 33749 20521 743 -25299 -22380
16795b2380m689N78j3528K51O416J6553R819P203L722k7162k3859K006j0193J1355
$$ -22380 -27069 -26491 -40019 -39768 -33352 -16799 -6980 223 3945 -23217 -47076 -45070 -55263 -43908
16781d3908q351j5991N007J9455J4771K982K0494j216n0264o173K8785o760N820
$$ -43908 -52259 -68250 -63243 -43788 -29017 -26035 -5541 -6757 -57021 -63194 -34409 -41169 -35349
16768c5349K2611O182j1614o591R807K5802Q409q312J0859j175j0781k968j7820
$$ -35349 -12738 -6556 -18170 -24761 -14954 10848 19257 10945 21804 20629 9848 6880 -10940
16755a0940J719j5683R692K5360O160m278k811J0729k2268k8127r415N337L649
$$ -10940 -9221 -24904 -15212 10148 16308 12030 9219 19948 -2320 -30447 -39862 -34525 -30876
16742c0876K0899j7497j7634L2387p454L339N871o546L8031j0942p465J533n725
$$ -30876 -9977 -27474 -45108 -12721 -20175 -16836 -10965 -17511 20520 9578 2113 3646 -2079
16729b079M872j7591o454j7147J9812o871j5321O256J4854j0973j1331Q672k4172
$$ -2079 2793 -14798 -21252 -38399 -18587 -25458 -40779 -34523 -19669 -30642 -41973 -33301 -57473
16716e7473r022K5200m961l381K0288K7618o336k8424r98J5289j94k5796j9745
$$ -57473 -66495 -41295 -46256 -49637 -29349 -1731 -8067 -36491 -37489 -22200 -22394 -48190 -67935
16703f7935m81J9757M506j2687R156J0603J0238J8276n144J2362M619k0745k014
$$ -67935 -68416 -48659 -44153 -56840 -47684 -37081 -26843 -8567 -13711 -1349 3270 -17475 -19489
16690a9489P615l518N224o362m536K104O893j0385K4599M04J1593n091m497j3900
$$ -19489 -11874 -15392 -10168 -16530 -21066 -18962 -12069 -22454 2145 2549 14142 9051 4554 -9346
16676i346k2440J1689J785M255J4267j1725j0028J1833K916p028l1108K3557K7323
$$ -9346 -31786 -20097 -18312 -14057 210 -11515 -21543 -9710 -6794 -13822 -44930 -21373 5950
16663E950k0800l541j4504n061J4438J8188K3163K286k1877k732J5141J5912n183
$$ 5950 -14850 -18391 -32895 -37956 -23518 -5330 17833 20119 -1758 -4490 10651 26563 21380
16650B1380m122m727j9378p970J6212p565q051K2742k0397j1747Q942J4844q284
$$ 21380 17258 12531 -6847 -14817 1395 -6170 -14221 8521 -11876 -23623 -14681 163 -8121
16637h121J6420o282q77K4040l4036j2655J1811r924J941r78J9583K72j2296J2909
$$ -8121 8299 2017 1140 25180 -8856 -21511 -9700 -19624 -17683 -18661 922 1194 -11102 1807
16623A807K3848j5206k3256j1150P088L5937O256j1836n91k92l313J868j1445
$$ 1807 25655 10449 -12807 -23957 -16869 19068 25324 13488 12897 12605 9292 11160 -285
16610b85k0111M870K1147k0628k8419Q91J2694L086O19j8088K499J4335J1103
$$ -285 -20396 -15526 5621 -15007 -43426 -42535 -29841 -26755 -26136 -44224 -41725 -27390 -16287
16597a6287o002j5216J2705r9K5858L8741L952l4506k0165O105L551r220j9550
$$ -16287 -22289 -37505 -24800 -24899 959 39700 43652 9146 -11019 -4914 -1363 -10583 -30133
16584c0133j1953J8468M2672k1m4083j5161j1238O98J9457K3349K0102m685j5832
$$ -30133 -42086 -23618 19054 19033 -25050 -40211 -51449 -50751 -31294 -7945 12157 7472 -8360
16571h360j1279j4643M26r723P76J2400K2562k8161j4490J1240R083K7692J7365
$$ -8360 -19639 -34282 -33856 -43579 -42803 -30403 -7841 -36002 -50492 -39252 -30169 -2477 14888
16558A4888J1126K136j5162l5240j5667P998L940R631J3278J620l1993j8679q052
$$ 14888 26014 28150 12988 -22252 -37919 -29921 -25981 -16350 -3072 -1452 -33445 -52124 -60176
16545f0176j0234J2940k172M196J6471N519k1660O633R342P272M075J3455J4016
$$ -60176 -70410 -57470 -59642 -55446 -38975 -33456 -55116 -48483 -39141 -31869 -27794 -14339 -323
16532c23m563l142r041j0138J6488J2668K955K266J7818o656j9089j6254R394
$$ -323 -4886 -8028 -17069 -27207 -10719 1949 4904 7170 24988 18332 -757 -17011 -7617
16519g617J587l015J336N543Q48j471j0017J1343J7975N842j8260k2778k0598
$$ -7617 -6030 -9045 -7709 -2166 -1318 -2789 -12806 -1463 16512 22354 4094 -18684 -39282
16506c9282o312R47K5422L5246j2831j2325k0575K7617K6164k6506m101J2377
$$ -39282 -45594 -44647 -19225 16021 3190 -9135 -29710 -2093 24071 -2435 -6536 5841
16494E841j4296k6145m407o716J5325L2967j0277m714P214J0810j4529j5079P74
$$ 5841 -8455 -34600 -39007 -45723 -30398 2569 -7708 -12422 -5208 5602 -8927 -24006 -23232
16481b3232l977l100j423P676J4431J8615P017j1910Q405l997L408L7414J1087
$$ -23232 -27209 -30309 -31732 -24056 -9625 8990 16007 4097 12502 8505 11913 49327 60414
16468F0414j0710k5456l8896k2422R898Q377K0632j5410l2061Q888J5370K3930
$$ 60414 49704 24248 -14648 -37070 -27172 -18795 1837 -13573 -45634 -36746 -21376 2554
16456B554k7797j7426J2592J4007J6678L357J5813K804k317J0850l6056k5533
$$ 2554 -25243 -42669 -30077 -16070 608 3965 19778 22582 20265 31115 -4941 -30474
16444c0474K0917K132J0438m715j1324K6489N020k5079j1356q703j1222q793k186
$$ -30474 -9557 -7425 3013 -1702 -13026 13463 18483 -6596 -17952 -26655 -37877 -46670 -48856
16431d8856J5170J9661Q123l8829r560K943M388O557J7278J4094l0585j5133M704
$$ -48856 -33686 -14025 -5902 -44731 -54291 -51348 -46960 -40403 -23125 -9031 -39616 -54749 -50045
16418e0045L3039J4444j0095p420j0259j0978Q55K2513L816p801J9864r064k6988
$$ -50045 -17006 -2562 -12657 -20077 -30336 -41314 -40459 -17946 -14130 -21931 -2067 -11131 -38119
16405c8119L853j678m86O575O374J8322k513m712K3470k0428m1543P047J2647
$$ -38119 -34266 -35944 -36430 -29855 -23481 -5159 -7672 -12384 11086 -9342 -50885 -43838 -31191
16392c1191o745J630k5470K5688K8971J5445K950j6844N716l998j1850M2325J2989
$$ -31191 -37936 -36306 -61776 -36088 -7117 8328 11278 -5566 150 -3848 -15698 26627 39616
16379C9616J6034Q014o889j7323o421j347l2392j1575o524K0595j0260j7516k8951
$$ 39616 55650 63664 56775 39452 33031 31684 -708 -12283 -18807 1788 -8472 -25988 -54939
16366e4939j1088J7776R109k313K1899r471k6686q319Q381N431J4279n475k522
$$ -54939 -66027 -48251 -39142 -41455 -19556 -29027 -55713 -64032 -55651 -50220 -35941 -41416 -43938
16353d3938K3155J929k338K164J388j6840j4351j8730L805K0065K9383K3993p969
$$ -43938 -20783 -18854 -21192 -19028 -17640 -34480 -48831 -67561 -63756 -43691 -14308 9685 1716
16340A716k5467N918j9446m631J0741J2320P672K5305J440j8203j9950J3220P361
$$ 1716 -23751 -17833 -37279 -41910 -31169 -18849 -11177 14128 15568 -2635 -22585 -9365 -2004
16327b004J5160j5965k6653M586m522J0331L8303n175n774J5086k4397j8254k325
$$ -2004 13156 -2809 -29462 -24876 -29398 -19067 19236 14061 8287 23373 -1024 -19278 -21603
16314b1603N199J9376j3142M546J8412J2322J2216j2516n324q596k305l513l3252
$$ -21603 -16404 2972 -10170 -5624 12788 25110 37326 24810 19486 10890 8585 5072 -28180
16301b8180M89m826j3492r875L060n173K734J3476J5560J0857P74K07l0461M243
$$ -28180 -27691 -32517 -46009 -55884 -52824 -57997 -55263 -41787 -26227 -15370 -14596 -14389 -44850 -40607
16287d0607J2598J9264K9724k5271J4378K2187k391j362j8684J2125m739O288
$$ -40607 -28009 -8745 20979 -4292 10086 32273 29882 28520 9836 21961 17222 23510
16275B3510j7468k0155R298K2104k4780j5797j5330Q427J6289O62j0368p161L333
$$ 23510 6042 -14113 -4815 17289 -7491 -23288 -38618 -30191 -13902 -13240 -23608 -30769 -27436
16262b7436K4264J7466Q724k2827r340N347j5005k3218j4042J8814Q463M0223
$$ -27436 -3172 14294 23018 191 -9149 -3802 -18807 -42025 -56067 -37253 -28790 11433
16250A1433J1157m132j0971l3043j9739K2588J7156J0482Q302J1691j8008k5682
$$ 11433 22590 18458 7487 -25556 -45295 -22707 -5551 4931 13233 24924 6916 -18766
16238a8766q062K0587O368p825Q604n330j1318j6498K5976J6242J2264k1398j1845
$$ -18766 -26828 -6241 127 -7698 906 -4424 -15742 -32240 -6264 9978 22242 844 -11001
16225a1001N61K8314j8694j6255j4075o455J1015p143K1005K3066J3493l2777
$$ -11001 -10440 17874 -820 -17075 -31150 -37605 -26590 -33733 -12728 10338 23831 -8946
16213h946j7065n722K4209j7135J1917k1284k6524J4217J4133K0492O732J2523
$$ -8946 -26011 -31733 -7524 -24659 -12742 -34026 -60550 -46333 -32200 -11708 -4976 7547
16201G547j4458k0590O698q631j8597k2505k6067q44k132K2283K5895j6482J7324
$$ 7547 -6911 -27501 -20803 -29434 -48031 -70536 -96603 -97447 -99579 -77296 -51401 -67883 -50559
16188e0559Q360L370r179l153J5601J6987J6578k2990l1258k451J5759K9410M190
$$ -50559 -42199 -38829 -48008 -51161 -35560 -18573 -1995 -24985 -56243 -58694 -42935 -13525 -9335
16175i335q055j3554M121r67k3748q147o126J2682m254J0105r377J6288k8953
$$ -9335 -17390 -30944 -26823 -27790 -51538 -59685 -65811 -53129 -57383 -47278 -56655 -40367 -69320
16162f9320J5461J6995q924r998j6000R000L8043m768j7029R89J8288m1829k5114
$$ -69320 -53859 -36864 -45788 -55786 -71786 -62786 -24743 -29511 -46540 -45551 -27263 -69092 -94206
16149i4206J0245L2705L6139K4124J5794O741m0266m7132o02K1570K8138p353
$$ -94206 -83961 -51256 -15117 9007 24801 31542 -8724 -55856 -56458 -34888 -6750 -14103
16137a4103n752k155M495J4212j8843R239M688j0881o012p158q975n22l3326K0470
$$ -14103 -19855 -22010 -17515 -3303 -22146 -12907 -8219 -19100 -25112 -32270 -41245 -41767 -75093 -54623
16123e4623J7900M4502L1117K3931m4155l8703o072L185j3395R788O470J1644
$$ -54623 -36723 7779 38896 62827 18672 -20031 -26103 -22918 -36313 -26525 -20055 -8411
16111h411J773k2890k3323j4874K3713M4966K0080l487O181j8566j3107L988N867
$$ -8411 -6638 -29528 -52851 -67725 -44012 954 21034 17547 23728 5162 -7945 -3957 1910
16098A910M893j0679l3417j0018L1391J7506O561L108J3427j0330k4429k7432
$$ 1910 6803 -3876 -37293 -47311 -15920 1586 8147 11255 24682 14352 -10077 -37509
16086c7509J2478J2608j6236K7057p815j1213J2523J5115r945k5191n907K8253
$$ -37509 -25031 -12423 -28659 -1602 -9417 -20630 -8107 7008 -2937 -28128 -34035 -5782
16074e782J9071M051j6774j1744J0171l273j7957o704K5171J5701j3899k715l6683
$$ -5782 13289 17340 566 -11178 -1007 -4280 -22237 -28941 -3770 11931 -1968 -4683 -41366
16061d1366n781q373L9621J0932O703Q980M07l5381j1986q198j200K2950o833
$$ -41366 -47147 -55520 -15899 -4967 1736 10716 11123 -24258 -36244 -44442 -45642 -22692 -29525
16048b9525j5299J2460k174K4459J4734J4749j9105j6168k6603J4515l99j582
$$ -29525 -44824 -32364 -34538 -10079 4655 19404 299 -15869 -42472 -27957 -28356 -29938
16036b9938k994J6895L2695J6933r188k9497R168k5859q936K5732J8728L5211
$$ -29938 -32932 -16037 16658 33591 24403 -5094 4074 -21785 -30721 -4989 13739 48950
16024D8950m950k8729l2174n79J189j2519L237K5370J5890K138J2837j7562k9776
$$ 48950 44000 15271 -16903 -17482 -16293 -28812 -25575 -205 15685 17823 30660 13098 -16678
16011a6678k4175L332J7192R652k2648m6523K1506L6518M916J4259J469J6847
$$ -16678 -40853 -37521 -20329 -10677 -33325 -79848 -58342 -21824 -16908 -2649 -1180 15667
15999A5667M65k514l0948K877J6539J3978l5393k2694J0144j3309P60K5030L3903
$$ 15667 16132 13618 -17330 -14453 2086 16064 -19329 -42023 -31879 -45188 -44428 -19398 14505
15986A4505K9395j092q747k5929j3588m871R80J4407J5713k6792k5212p343K0239
$$ 14505 43900 42808 34061 8132 -5456 -10327 -9347 5060 20773 -6019 -31231 -38574 -18335
15973a8335K3013J458j5907j1973K3905k225k7130L041N291o105R782m157M577
$$ -18335 4678 6136 -9771 -21744 2161 -64 -27194 -24153 -18862 -24967 -15185 -19342 -14765
15960a4765J8965o253k7610J013K0954J9317o066K1009J0368q382j652j2154j3610
$$ -14765 4200 -2053 -29663 -28650 -7696 11621 5555 26564 36932 28550 26898 14744 1134
15947A134l621m603J6886P036N111J8822k9261k9677j0676L2923J3732k5954l3044
$$ 1134 -2487 -7090 9796 16832 21943 40765 11504 -18173 -28849 4074 17806 -8148 -41192
15934d1192p486M806r07M871J6056J4879J0237J871K7638k8020o637R310J3718
$$ -41192 -48678 -43872 -44779 -39908 -23852 -8973 1264 3135 30773 2753 -3884 5426 19144
15921A9144j9688k2306k3432j1766j695K4645J2152j5218k2735K3881L4610O360
$$ 19144 -544 -22850 -46282 -58048 -59743 -35098 -22946 -38164 -60899 -37018 -2408 3952
15909C952O309j8611K5978N807k2318j290n164j4886j1618m399J335J4381Q920
$$ 3952 10261 -8350 17628 23435 1117 -173 -5337 -20223 -31841 -36240 -34905 -20524 -11604
15896a1604o836q456p926j0771K216K7531n72R271J2039p091K8678p344l0636
$$ -11604 -18440 -26896 -34822 -45593 -43377 -15846 -16418 -7147 4892 -2199 26479 19135 -11501
15883a1501j8074K1663L5993k3582r373N378j8112j3258K2606J8491r759K5493
$$ -11501 -29575 -7912 28081 4499 -4874 504 -17608 -30866 -8260 10231 472 25965
15871B5965O05J4492J856k0020k0619k8928r956j1114n060L1787J2554j124K118
$$ 25965 26570 41062 42918 22898 2279 -26649 -36605 -47719 -52779 -20992 -8438 -9562 -7444
15858g444Q247N130L5855M426j4216k5474k253J384J0275k7654l9369J4086K100
$$ -7444 803 5933 41788 46214 31998 6524 4271 5655 15930 -11724 -51093 -37007 -34907
15845c4907J3101Q463j3541l426j827K6731J6163q189j6327K0402j0624m614J6382
$$ -34907 -21806 -13343 -26884 -30310 -32137 -5406 10757 2568 -13759 6643 -3981 -8595 7787
15832G787j23k0360K8951K45m2149Q500L6357q421k1263l2328n637N0083l559
$$ 7787 7664 -12696 16255 16500 -25649 -17149 19208 10787 -10476 -42804 -48441 1642 -1917
15819a917j441k0073o482M875P177j9727k1871J8355J5320k898J3293r560P818
$$ -1917 -3358 -23431 -29913 -25038 -17861 -37588 -59459 -41104 -25784 -28682 -15389 -24949 -17131
15806a7131J1871k5602l3029P85L3726K9147P696k1322j9441k6439K2538L3626
$$ -17131 -5260 -30862 -63891 -63106 -29380 -233 7463 -13859 -33300 -59739 -37201 -3575
15794c575k4069L68J9744P672j6344m757J2071J2070j3778J1772l711J4080N320
$$ -3575 -27644 -27276 -7532 140 -16204 -20961 -8890 3180 -10598 1174 -2537 11543 16863
15781A6863k2193q627j0439q979J8051K571O290l512j9204P050M024J9644K5328
$$ 16863 -5330 -13957 -24396 -33375 -15324 -12753 -6463 -9975 -29179 -22129 -18105 1539 26867
15768B6867k005K077o660k2739k6511l981j1396o457J4054L6235Q19j9482j7475
$$ 26867 24862 26939 20279 -2460 -28971 -32952 -44348 -50805 -36751 -516 303 -19179 -36654
15755c6654K6229j234k7639p890P02L716J9240L353L404k6793N464N427m984M6905
$$ -36654 -10425 -11659 -39298 -47188 -46486 -42770 -23530 -20177 -16773 -43566 -38102 -32675 -37659 9246
15741I246K6575j5490q713k451J2481o642j9316j009P929p451o754M5453O120
$$ 9246 35821 20331 11618 9167 21648 15006 -4310 -5319 2610 -4841 -11595 33858 39978
15728C9978k6430k2704k7974n021K0288k2582J4950R422j031L237k6344Q581L3823
$$ 39978 13548 -9156 -37130 -42151 -21863 -44445 -29495 -20073 -21104 -17867 -44211 -35630 -1807
15715a807N719k0492j4335j6592J7343p112j078k567Q28q033N37k238K1835K642
$$ -1807 3912 -16580 -30915 -47507 -30164 -37276 -38354 -40921 -40093 -48126 -47589 -49827 -27992 -25350
15701b5350O940K631j6453L2757J2699k1005k9563p427L4161L4049Q299l6749
$$ -25350 -18410 -15779 -32232 525 13224 -7781 -37344 -44771 -10610 23439 31738 -5011
15689e011l3750J0214m105K1502l969N075K715m417P887L0280J9280j3290j5222
$$ -5011 -38761 -28547 -32652 -11150 -15119 -10044 -7329 -11746 -3859 26421 45701 32411 17189
15676A7189j2834L933J312m768J0202M96k8118O452M025K3465n883j6544q3K933
$$ 17189 4355 8288 9600 4832 15034 15530 -12588 -6136 -2111 21354 15471 -1073 -1156 1777
15662A777J399l2676l401K1432L735K8096R451k2557k0522j2218m365j1275R01
$$ 1777 3176 -29500 -32901 -11469 -7734 20362 29813 7256 -13266 -25484 -29849 -41124 -40223
15649d0223L363L495M781L4347R424k0741j2031j2047n181n228j424m745k0540
$$ -40223 -36860 -33365 -28584 5763 15187 -5554 -17585 -29632 -34813 -40041 -41465 -46210 -66750
15636f6750J6922P798J0087J5915J3704J2300P257m822m702L384k3525n0512K1441
$$ -66750 -49828 -42030 -31943 -16028 -2324 9976 17233 12411 7709 11093 -12432 -62944 -41503
15623d1503M8409K5908r656j3437k596J0505L883m235k4003j5909m971K991l497
$$ -41503 6906 32814 23158 9721 7125 17630 21513 17278 -6725 -22634 -27605 -24614 -28111
15610b8111J4821L981N54j195k91L953k446j7399k6085m8J2716J9484p302j7241
$$ -28111 -13290 -9309 -8755 -9950 -10241 -6288 -8734 -26133 -52218 -52266 -39550 -20066 -27368 -44609
15596d4609l938M6508K0208r883L861K1697J0449l478n26j6844j847m783n726
$$ -44609 -48547 -2039 18169 8286 12147 33844 44293 40815 40289 23445 21598 16815 11089
15583A1089K407m553j2064k2577j6325K4135L6132q573l8645j4714J6532M818
$$ 11089 13496 8943 -3121 -25698 -42023 -17888 18244 9671 -28974 -43688 -27156 -22338
15571b2338n446m761N337J0645K450k9988j7038M1779J8929J131j6643l277J6429
$$ -22338 -27784 -32545 -27208 -16563 -14113 -44101 -61139 -19360 -431 700 -15943 -19220 -2791
15558b791k281j9458m350J6874j1716k758L8037J4236j7784m0583l1949j3964
$$ -2791 -5072 -24530 -28880 -12006 -23722 -26480 11557 25793 8009 -32574 -64523 -78487
15546g8487L1482M0538R457L2406J0332j805j2357l5248j2265J493J7489J1666
$$ -78487 -47005 -6467 2990 35396 45728 43923 31566 -3682 -15947 -14454 3035 14701
15534A4701j8426k1634j2390J742p303K794K2306L1963k2928j2505q579R7M251
$$ 14701 -3725 -25359 -37749 -36007 -43310 -40516 -18210 13753 -9175 -21680 -30259 -30162 -25911
15521b5911m842m338j420M304l0316j6772K6321L5678n08j2539p75J6494Q479
$$ -25911 -30753 -35091 -36511 -32207 -62523 -79295 -52974 -17296 -17804 -30343 -31118 -14624 -6145
15508f145l6049k128J2351K2377J3980p366Q103R20K9112k8525j6174j5567j560
$$ -6145 -42194 -44322 -31971 -9594 4386 -2980 5123 6043 35155 6630 -9544 -25111 -26671
15495b6671o046j4060j0437p689K2989J2350r779J0026j826L866J6600M281J0604
$$ -26671 -32717 -46777 -57214 -64903 -41914 -29564 -39343 -29317 -31143 -27277 -10677 -6396 4208
15482D208K010l7605N803J0818l2150j34N2561J2629q782k4158j7309j0209j6798
$$ 4208 6218 -31387 -25584 -14766 -46916 -47050 5511 18140 9358 -14800 -32109 -42318 -59116
15469e9116M444K0854J9338L3185m355p959j9025k55N8540J345k6331K9247J2361
$$ -59116 -54672 -33818 -14480 18705 14350 6391 -12634 -12889 45651 46996 20665 49912 62273
15456F2273j5006j1238p937m211k4308j4748j3182K814P659K217R278j2565J2609
$$ 62273 47267 36029 28092 23881 -427 -15175 -28357 -25543 -17884 -15667 -6389 -18954 -6345
15443f345l596k1112J2364K0383J2824k6592n343K0344J5899k9739K487j230P149
$$ -6345 -9941 -31053 -18689 1694 14518 -12074 -17417 2927 18826 -10913 -8426 -9656 -2507
15430b507l942j3160J039j0559J0271j1330j4935N668K6798K2584j406r993j8118
$$ -2507 -6449 -19609 -18570 -29129 -18858 -30188 -45123 -39455 -12657 9927 8521 -1472 -19590
15417a9590l2455Q03K7661o374J7284q4J731l224k89R990J5078M559j6159j1481
$$ -19590 -52045 -51242 -23581 -29955 -12671 -12755 -11024 -14248 -14537 -4547 10531 15090 -1069 -12550
15403a2550j6446L213J2456p174r482j2614O754J0325J4604J7689O829j3050J022
$$ -12550 -28996 -25783 -13327 -20501 -29983 -42597 -35843 -25518 -10914 6775 13604 554 1576
15390A576j2715Q094K6063k2756j6276k3295o364K9765K8830L1406M887j2438
$$ 1576 -11139 -3045 23018 262 -16014 -39309 -45673 -15908 12922 44328 49215 36777
15378C6777j3768j6756k3321j0644Q366P105J8164o571n0296j9318J5067K4803
$$ 36777 23009 6253 -17068 -27712 -19346 -12241 5923 -648 -50944 -70262 -55195 -30392
15366c0392J1949o164J66M027K6464J5111k2602j8327m120j9818L746L339K8585
$$ -30392 -18443 -24607 -24441 -20414 6050 21161 -1441 -19768 -23888 -43706 -39960 -36621 -8036
15353h036r280k6114Q400M269K9642R664j6539l11L9405L3483m716j7128k3294
$$ -8036 -17316 -43430 -35030 -30761 -1119 8545 -7994 -8305 31100 64583 59867 42739 19445
15340A9445Q50K885k1890j7095J5238R138o388k4076P107J3788k74k8730k8606
$$ 19445 20295 23180 1290 -15805 -567 8571 2183 -21893 -14786 -998 -1272 -30002 -58608
15327e8608N774J9865L0047j3118j3087R927k084r873J4108m44J1983Q924p187
$$ -58608 -52834 -32969 -2922 -16040 -29127 -19200 -21284 -31157 -17049 -17493 -5510 3414 -3773
15314c773k7556m30J0619J6618J515j6798j1186J4362K2621j8348r71O608Q799
$$ -3773 -31329 -31759 -21140 -4522 -3007 -19805 -30991 -16629 5992 -12356 -13327 -6719 2080
15301B080j382M059M0000p935o448K004l5473m0011k6677J1240l774K3474M1451
$$ 2080 698 4757 44757 36822 30374 32378 -3095 -43106 -69783 -58543 -62317 -38843 2608
15288B608J7228k1922k1802R164q325M377O697K2265Q332j7341k2182N681M2526
$$ 2608 19836 -2086 -23888 -14724 -23049 -18672 -11975 10290 18622 1281 -20901 -15220 27306
15275B7306m178K95j5129n060J8268R383k3886r709k0026p205o402K0023K2675
$$ 27306 23128 23423 8294 3234 21502 30885 6999 -2710 -22736 -29941 -36343 -16320 6355
15262F355m529k1458j0137M975J8100j7748k277J2833N947K443J3968j0393j0407
$$ 6355 1826 -19632 -29769 -24794 -6694 -24442 -26719 -13886 -7939 -5496 8472 -1921 -12328
15249a2328l096m437M102j5523r300K4579m488j1097M019o197Q307r516j3514
$$ -12328 -15424 -19861 -15759 -31282 -40582 -16003 -20491 -31588 -27569 -33766 -25459 -34975 -48489
15236d8489L6381J3549J6692k6335l5453O521Q907K1018k1618j515J9883k0137
$$ -48489 -12108 1441 18133 -8202 -43655 -37134 -28227 -7209 -28827 -30342 -10459 -30596
15224c0596j7202n197K0629L7006K3728l134j2717k5980j8683j3495L550R50M954
$$ -30596 -47798 -52995 -32366 4640 28368 25234 12517 -13463 -32146 -45641 -42091 -41141 -36187
15211c6187j8660p244J9248O215K301J8399K7235l1509r548L1949Q176q73j0137
$$ -36187 -54847 -62091 -42843 -36628 -34327 -15928 11307 -20202 -29750 2199 10375 9502 -635
15198f35m587K5369J0763k656j7548L916K2690J4098r685R60j4770r882J5173
$$ -635 -5222 20147 30910 28254 10706 14622 37312 51410 41725 42685 27915 18033 33206
15185C3206j1407j532l2144o507K1491n074p853K828J2824j2201j1484J124K564
$$ 33206 21799 20267 -11877 -18384 3107 -1967 -9820 -6992 5832 -6369 -17853 -16729 -14165
15172a4165L7763N344j5790p579o185k0864l7257J4900K7479j0242N732J3649
$$ -14165 23598 28942 13152 5573 -612 -21476 -58733 -43833 -16354 -26596 -20864 -7215
15160g215k720j9947k083q608J0284k2403n978J9220J2141O063l304R5j592l9311
$$ -7215 -9935 -29882 -31965 -40573 -30289 -52692 -58670 -39450 -27309 -21246 -24550 -24455 -26047 -65358
15146f5358l2075L2381J4280L452L785K7840K2338K8743L978n8712j7016p53L448
$$ -65358 -97433 -65052 -50772 -47320 -43535 -15695 6643 35386 39364 -19348 -36364 -37117 -33669
15133c3669j2944Q825P42O685J4094l660n531k700K9342J0218j6990r274K2877
$$ -33669 -46613 -37788 -37046 -30361 -16267 -19927 -25458 -28158 1184 11402 -5588 -14862 8015
15120H015K1377j5251l103J0679j6177j881R690Q80k91J1732n221j4314k8334
$$ 8015 29392 14141 11038 21717 5540 3659 13349 14229 13938 25670 20449 6135 -22199
15107b2199J613j1059m8052k4250K5917L4992R497O701J5137j2983J6125o242
$$ -22199 -20586 -31645 -79697 -103947 -78030 -43038 -33541 -26840 -11703 -24686 -8561 -14803
15095a4803K658K531j9227Q326J4180j2881j967J3992K5782J1444r260k0910l377
$$ -14803 -12145 -9614 -28841 -20515 -6335 -19216 -21183 -7191 18591 30035 20775 -135 -3512
15082c512q605k607J0734m645Q731J6957n153j2399j1922O331J9444R316j5230
$$ -3512 -12117 -14724 -3990 -8635 96 17053 11900 -499 -12421 -6090 13354 22670 7440
15069G440k5877J8823j040j5816L1081J6014k3443n65q873j356J8298K535K275
$$ 7440 -18437 386 -654 -16470 14611 30625 7182 6617 -2256 -3612 14686 17221 19496
15056A9496K6907J6048j6020j5350k2148l0082K948p692j9308J6727m083j6423
$$ 19496 46403 62451 46431 31081 8933 -21149 -18201 -25893 -45201 -28474 -32557 -48980
15044d8980P018K336J1499j202K7191n35j3566Q186L1639o721j6820J890J4965
$$ -48980 -41962 -39626 -28127 -29329 -2138 -2673 -16239 -8053 23586 16865 45 1935 16900
15031A6900J3416r16j481j5300k0871r38P22j3987K53P28R832l574J4972J4110
$$ 16900 30316 29400 27919 12619 -8252 -9190 -8468 -22455 -22202 -21474 -11642 -15216 -244 13866
15017A3866R851P421j521k1952j4956Q144K41L412K18M983j3496k099K3972J4172
$$ 13866 23717 31138 29617 7665 -7291 853 1094 4506 4724 9707 -3789 -5888 18084 32256
15003C2256j2282j6292k1142k4027J0955M194R220J1968R373J2907k3827k5964
$$ 32256 19974 3682 -17460 -41487 -30532 -26338 -17118 -5150 4223 17130 -6697 -32661
14991c2661P699K6577n87j6273j1247K7574n479k5290K82J8610R680J7814L4426
$$ -32661 -24962 1615 1028 -15245 -26492 1082 -4397 -29687 -29405 -10795 -1115 16699 51125
14978E1125P337j0486k4753j9839k8520K4819K7499l638K829P06o011k1108K1730
$$ 51125 58462 47976 23223 3384 -25136 -317 27182 23544 26373 27079 21068 -40 21690
14965B1690O604k7982j103k7506J1286K0069J2765p403l5253j7430K1924K9273
$$ 21690 28294 312 -791 -28297 -17011 3058 15823 8420 -26833 -44263 -22339 6934
14953F934J6569o492j5374j7581n405J3403K4444o961k6352j5169J8041Q724p294
$$ 6934 23503 17011 1637 -15944 -21349 -7946 16498 9537 -16815 -31984 -13943 -5219 -12513
14940a2513j8299m085J3623O515p152q584l764k3571j4783J6131r70O813j5576
$$ -12513 -30812 -34897 -21274 -14759 -21911 -30495 -34259 -57830 -72613 -56482 -57452 -50639 -66215
14927f6215J0345J226K8017L674j1108r079K8695Q876q61k1909j7901K0375J063
$$ -66215 -55870 -54644 -26627 -22953 -34061 -43140 -14445 -5569 -6430 -28339 -46240 -25865 -24802
14914b4802J6672K3659J905j3623k976j8199j8361q333M322J7259L742k0371j3851
$$ -24802 -8130 15529 17434 3811 835 -17364 -35725 -44058 -39736 -22477 -18735 -39106 -52957
14901e2957J518l08J8831K4183L354j1766P474K9609K0109l669K459j6420k6978
$$ -52957 -51439 -51747 -32916 -8733 -5379 -17145 -9671 19938 40047 36378 38837 22417 -4561
14888d561p867J6495j5806j4586j2075L117r481N965R142J0045J0444o782l0872
$$ -4561 -12428 4067 -11739 -26325 -38400 -35283 -44764 -38799 -29657 -19612 -9168 -15950 -46822
14875d6822j0433j057n015L7386r908j6663j0599J972J0682K2984j0047n854K6377
$$ -46822 -57255 -58312 -63327 -25941 -35849 -52512 -63111 -61139 -50457 -27473 -37520 -43374 -16997
14862a6997n624k0797K5573L2791J0292p69p294j5166k6538L894P269q635J8335
$$ -16997 -22621 -43418 -17845 14946 25238 24469 17175 2009 -24529 -20635 -13366 -22001 -3666
14849c666K0082L4939J3013k9427j3130J4837p340r962p696j9233K638J4533J9076
$$ -3666 16416 51355 64368 34941 21811 36648 29308 19346 11650 -7583 -4945 9588 28664
14836B8664M930k2535p504K1437Q303J0376j2371k4644J4794J2838r711J251j4595
$$ 28664 33594 11059 3555 24992 33295 43671 31300 6656 21450 34288 24577 25828 11233
14823A1233k5214j3743L652J0690k74L06R245J9945J2557P643q720j3618k3902
$$ 11233 -13981 -27724 -24072 -13382 -13656 -13350 -4105 15840 28397 36040 27320 13702 -10200
14810a0200N42j2263J363j1340K01O865j2748K2268R037o900J0275j6129k2162
$$ -10200 -9658 -21921 -20558 -31898 -31697 -24832 -37580 -15312 -6275 -13175 -2900 -19029 -41191
14797d1191k6547M402L3662K5642J640k6579j200j100K1058K167J304P260o159
$$ -41191 -67738 -63336 -29674 -4032 -2392 -28971 -30171 -31271 -10213 -8046 -6742 518 -5641
14784e641k140j4277p426M107P157J2203j0066M736j4416j158O668O303k2380
$$ -5641 -7781 -22058 -29484 -25377 -18220 -6017 -16083 -11347 -25763 -26921 -20253 -13950 -36330
14771c6330K0650L813q870R782K1378L3432k2956n0884k2309K937K6587M6404
$$ -36330 -15680 -11867 -20737 -10955 10423 43855 20899 -29985 -52294 -49357 -22770 23634
14759B3634J4446j7595p652J6586l1097k8200K945p867r247K1627K6916K4056
$$ 23634 38080 20485 12833 29419 -1678 -29878 -26933 -34800 -44047 -22420 4496 28552
14747B8552o55q619k1118J4489K6428q027k6695j2135j8926k3551j0713K312J4939
$$ 28552 27897 19278 -1840 12649 39077 31050 4355 -7780 -26706 -50257 -60970 -58658 -43719
14734d3719J1481J0705K3872j4554k6659j1148J2450J1913j5857k7807J4409J6491
$$ -43719 -32238 -21533 2339 -12215 -38874 -50022 -37572 -25659 -41516 -69323 -54914 -38423
14722c8423J0081L401j6004J3486L4981J5491k0695l3086j3819L4486K5743J0869
$$ -38423 -28342 -24941 -40945 -27459 7522 23013 2318 -30768 -44587 -10101 15642 26511
14710B6511j4919j4582J5269N383k3250m784r100R833R417J0649r997j1620Q808
$$ 26511 11592 -2990 12279 17662 -5588 -10372 -19472 -9639 -222 10427 430 -11190 -2382
14697b382J970P132r526j5767J224O768k966Q533J3486j7205j055J2099J1181
$$ -2382 -412 6720 -2806 -18573 -17349 -10581 -13547 -5014 8472 -8733 -9788 2311 13492
14684A3492L079l294j6432o237l7612j3901K1380O246J9506L4784J9733J532k9737
$$ 13492 16571 13277 -3155 -9392 -47004 -60905 -39525 -33279 -13773 21011 40744 42276 12539
14671A2539l3472m585N660J6041L4034m562j0179j221J8306K4141L276j1730l758
$$ 12539 -20933 -25518 -19858 -3817 30217 25655 15476 14255 32561 56702 59978 48248 44490
14658D4490k315o783n826K586r818l0230j735K5683J8149k773k5451R431J2611
$$ 44490 42175 35392 29566 32152 22334 -7896 -9631 16052 34201 31428 5977 15408 28019
14645B8019J901k2182m8119k0787l42K466L0595r019k469R3R924o637K9311j6055
$$ 28019 29920 7738 -40381 -61168 -61510 -59044 -28449 -37468 -39937 -39844 -29920 -36557 -7246 -23301
14631b3301r98N643J5841L3103O372l7891j1557j2429J745l0388k3258K7109p403
$$ -23301 -24299 -18656 -2815 30288 36660 -1231 -12788 -25217 -23472 -53860 -77118 -50009 -57412
14618e7412L6895K8757k5138j7939j8291n77J4619K9528K293k964j5885O895j5640
$$ -57412 -20517 8240 -16898 -34837 -53128 -53705 -39086 -9558 -7265 -10229 -26114 -19219 -34859
14605c4859j7225J8123J4946J3342O341J7714j8160M642N040K2455l123j8408
$$ -34859 -52084 -33961 -19015 -5673 668 18382 222 4864 9904 32359 29236 10828
14593A0828j3774J9550J0859l5472r04J8575R604k799j0333j331J968q27k9773
$$ 10828 -2946 16604 27463 -8009 -8913 9662 19266 16467 6134 4803 6771 5944 -23829
14580b3829j1501R438K5148M3309L9196k1613j9165k079j6284m6974k2570R680
$$ -23829 -35330 -25892 -744 42565 81761 60148 40983 38904 22620 -24354 -46924 -37244
14568c7244K0980n58o422K6384J9014n013J1391j1109K5625L365k5894n686K2523
$$ -37244 -16264 -16822 -23244 3140 22154 17141 28532 17423 43048 46413 20519 14833 37356
14555C7356J7477q843j5643J85p228j1262J0698j1453r076k6534M071J1166m250
$$ 37356 54833 45990 30347 30532 23304 12042 22740 11287 2211 -24323 -20252 -9086 -13336
14542a3336k0880K7995J852k2004N571K5613r355n088n848L936j2710k8921K5555
$$ -13336 -34216 -6221 -4369 -26373 -20802 4811 -4544 -9632 -15480 -11544 -24254 -53175 -27620
14529b7620K3715k67K7300L7786k8568k2743o614p074K137J4451j1841r926K928
$$ -27620 -3905 -4172 23128 60914 32346 9603 2989 -4085 -1948 12503 662 -9264 -6336
14516f336P015nO080O159j845P695M94k2099j075K1061n120J9726P59N196j0825
$$ -6336 679 674 6754 12913 11068 18763 19257 -2842 -3917 17144 12024 31750 32509 37705 26880
14501B6880j6050m225Q2N24j1352n385m73l820j0311R663J3466l090j7313l0736
$$ 26880 10830 6605 6687 7211 -4141 -9526 -9999 -13819 -24130 -14467 -1001 -4091 -21404 -52140
14487e2140n810K2174L3905n599k288m275K3602n583J894n898k0660l324j508
$$ -52140 -57950 -35776 -1871 -7470 -9758 -14033 9569 3986 5880 -18 -20678 -24002 -25510
14474b5510L9410N330j7464j0632q963K3296J7859O435o32k4618m681K349k883
$$ -25510 13900 19230 1766 -8866 -17829 5467 23326 29761 29129 4511 -170 2179 -704
14461g04m777J7048K3056k2060l177J9480K6804M266n241n7067m8425k1369R707
$$ -704 -5481 11567 34623 12563 9386 28866 55670 59936 54695 -2372 -50797 -72166 -62459
14448f2459J5404J3398M008J4549J0818R832O956J2190k7284r325M440Q272J5311
$$ -62459 -47055 -33657 -29649 -15100 -4282 5550 12506 24696 -2588 -11913 -7473 799 16110
14435A6110k0712k1897M901J6180P740k2107k1737P578k943j498J7005K7435Q513
$$ 16110 -4602 -26499 -21598 -5418 2322 -19785 -41522 -33944 -36887 -38385 -21380 6055 14568
14422A4568L480l3817k9464j839J3299N155k671k1720M356p398O331P707l612
$$ 14568 18048 -15769 -45233 -47072 -33773 -28618 -31289 -53009 -48653 -56051 -49720 -42013 -45625
14409d5625L5261L0979n854n973K2460p160l5212J449k81k9445N600J7237j599
$$ -45625 -10364 20615 14761 8788 31248 24088 -11124 -9675 -9956 -39401 -33801 -16564 -18163
14396a8163K0507K6050r197q908o173J134K0702l42M865k2786k8620q934J0083
$$ -18163 2344 28394 19197 10289 4116 5250 25952 25610 30475 7689 -20931 -29865 -19782
14383a9782P114r346J6833K0297J6962k323k0627J018P718o303M129J9791o258
$$ -19782 -12668 -22014 -5181 15116 32078 29755 9128 10146 17864 11561 15690 35481 29223
14370B9223j8644k5225N174N102j5402J1170K2902O143j7906m134k3025j8377
$$ 29223 10579 -14646 -9472 -4370 -19772 -8602 14300 20443 2537 -1597 -24622 -42999
14358d2999J7397L3084M795j8761j456J3661j1210o655m299Q34P183r729j5904
$$ -42999 -25602 7482 12277 -6484 -7940 5721 -5489 -12144 -16443 -15609 -8426 -18155 -34059
14345c4059o534K3929J8445o409l119k0727m904K6347J0223J695j4529q586k2918
$$ -34059 -40593 -16664 1781 -4628 -7747 -28474 -33378 -7031 3192 4887 -9642 -18228 -41146
14332d1146j1928L716K3799L5875r467n724k2056J9389J8144k0200k2201n330
$$ -41146 -53074 -49358 -25559 10316 849 -4875 -26931 -7542 10602 -9598 -31799 -37129
14320c7129L4387Q127j3788R551J3906J024k7589P734P095Q172J8538j771j1773
$$ -37129 -2742 5385 -8403 1148 15054 16078 -11511 -3777 3318 11490 30028 28257 16484
14307A6484j9023m0590J0464J9593j6250j8193K0485J2392j103R199J5314K0908
$$ 16484 -2539 -43129 -32665 -13072 -29322 -47515 -27030 -14638 -15741 -6542 8772 29680
14295B9680N431j6086n137R902k0090j8333K085Q00J539n205q593j9410O38K5277
$$ 29680 35111 19025 13888 23790 3700 -14633 -12548 -11748 -10209 -15414 -24007 -43417 -42779 -17502
14281a7502L221n796L889j1183n169R785J0223J0922J5634k915J678K728l903
$$ -17502 -14281 -20077 -16188 -27371 -32540 -22755 -12532 -1610 14024 11109 12787 15515 11612
14268A1612j0976k0678P796K594J8525l191k1376K6387K983j760l844Q075j5368
$$ 11612 636 -20042 -12246 -9652 8873 5682 -15694 10693 13676 11916 8072 16147 779
14255G79q789Q395o86P667k0715q4K0551Q420m065o138P161m092n570k6942l622
$$ 779 -8010 385 -301 7366 -13349 -13433 7118 15538 11473 5335 12496 8404 2834 -24108 -27730
14240b7730J2483J6958J8138k0926r738R625Q209k302j5833J579J2073m1167j6823
$$ -27730 -15247 1711 19849 -1077 -10815 -1190 7019 4717 -11116 -9537 2536 -38631 -55454
14227e5454P657J6723L9276l181j6332K152K7234J403j4029j4484k1570k517r535
$$ -55454 -47797 -31074 8202 5021 -11311 -9159 18075 19478 5449 -9035 -30605 -33122 -42657
14214d2657r736K1927P109R914o925p101K5383q865k69o605j3393k905j5056J4417
$$ -42657 -52393 -30466 -23357 -13443 -20368 -27469 -2086 -10951 -11220 -17825 -31218 -34123 -49179 -34762
14200c4762J7044K7977J7896p634j4236l7362j4807J0335R475K3087K094K600
$$ -34762 -17718 10259 28155 20521 6285 -31077 -45884 -35549 -26074 -2987 -893 1707
14188A707o049l2333k0089K5540j6147j2127p791n026J1184J5779N469K2248m225
$$ 1707 -4342 -36675 -56764 -31224 -47371 -59498 -67289 -72315 -61131 -45352 -39883 -17635 -21860
14175b1860j5147J6635L6917L561P68j6125j5811K9513K5398J2987P687l8929
$$ -21860 -37007 -20372 16545 20106 20874 4749 -11062 18451 43849 56836 64523 25594
14163B5594k3131l2048k8440m504R715L542J8587j521K8652K3352R866j696k381
$$ 25594 2463 -29585 -58025 -62529 -52814 -49272 -30685 -32206 -3554 19798 29664 27968 25587
14150B5587l2419k2629J5743K1587P182m46J4358q95k8384j6548j2379K1449R840
$$ 25587 -6832 -29461 -13718 7869 15051 14605 28963 28068 -316 -16864 -29243 -7794 2046
14137B046j901J3860k3435L034j3431N899J2074J6922J3662j3330k89K9491J487
$$ 2046 145 14005 -9430 -6396 -19827 -13928 -1854 15068 28730 15400 15111 44602 46089
14124D6089p457J6859j7274j6469J250k841Q525Q503o518J5149k299j6116j0058
$$ 46089 38632 55491 38217 21748 22998 20157 28682 37185 30667 45816 43517 27401 17343
14111A7343j5571r312J9495J5897k6501m2625l359K6065J4014r013J8694J2622
$$ 17343 1772 -7540 11955 27852 1351 -41274 -44633 -18568 -4554 -13567 5127 17749
14099A7749j573O60P08r615J4324j1557J5655J2055Q623J018q069k5174J097k0474
$$ 17749 16176 16836 17544 7929 22253 10696 26351 38406 47029 48047 39978 14804 15901 -4573
14085d573k1914r975K0064J5188J898j6418J0022k2611j2225J8022m247L331O573
$$ -4573 -26487 -36462 -16398 -1210 688 -15730 -5708 -28319 -40544 -22522 -26769 -23438 -16865
14072a6865K3071J424J3264r263j2553J232Q472k2531l828J3968k0001k7227j8179
$$ -16865 6206 7630 20894 11631 -922 310 8782 -13749 -17577 -3609 -23610 -50837 -69016
14059f9016L2089J8214q041P742j5992J0926P574j3730J0280K3343j119j9163
$$ -69016 -36927 -18713 -26754 -19012 -35004 -24078 -16504 -30234 -19954 3389 2270 -16893
14047a6893n099q486j4045j8228J3387L6780J867k515k764K8869l2115k8431P511
$$ -16893 -21992 -30478 -44523 -62751 -49364 -12584 -10717 -13232 -15996 12873 -19242 -47673 -40162
14034d0162o169O754j5974P931J9491j4638j121K7065K9430j0149j3948l3068
$$ -40162 -46331 -39577 -55551 -47620 -28129 -42767 -43888 -16823 12607 2458 -11490 -44558
14022d4558j0188L6105K8340j4251l4372K490L5431K4695j1198j7419k3141P004
$$ -44558 -54746 -18641 9699 -4552 -38924 -36434 -1003 23692 12494 -4925 -28066 -21062
14010b1062m536j7633O100M2183K819m356M099P570J685J2235q542k044k5189
$$ -21062 -25598 -43231 -37131 5052 7871 3515 7614 15184 16869 29104 20562 18518 -6671
13997f671q762J1157q752j1566K5291J3307O540j3331J0274R320l791j6345j5452
$$ -6671 -15433 -4276 -13028 -24594 697 14004 20544 7213 17487 26807 23016 6671 -8781
13984h781N35J0080J3609N059l396j5046j9577N473J812p503J0469p59N468o08
$$ -8781 -8246 1834 15443 20502 17106 2060 -17517 -12044 -10232 -17735 -7266 -8025 -2557 -3165
13970c165k2422k843K2209L272k4213k41J3407J5643n195j9605L337J4840K2660
$$ -3165 -25587 -28430 -6221 -2949 -27162 -27403 -13996 1647 -3548 -23153 -19816 -4976 17684
13957A7684j628k4835o566L141J5633K0832J2102k5884r566R713N745k4858l05
$$ 17684 16056 -8779 -15345 -12204 3429 24261 36363 10479 913 10626 16371 -8487 -8792
13944h792K7175j3739j8022P435K2926K3796k1200q60j3135j138j2595o638J8745
$$ -8792 18383 4644 -13378 -5943 16983 40779 19579 18719 5584 4446 -8149 -14787 3958
13931C958j1521j4294J673q058J6602J7158P188j053k3144k2749m713K9431M694
$$ 3958 -7563 -21857 -20184 -28242 -11640 5518 12706 11653 -11491 -34240 -38953 -9522 -4828
13918d828j9881k405J6266O328J4881J671r590j6831j920M487N101L1854Q756
$$ -4828 -24709 -27114 -10848 -4520 10361 12032 2442 -14389 -16309 -11822 -6721 25133 33889
13905C3889j2222j4576r845k6929J1857K8968R210o084Q340j2356K3098N518j5322
$$ 33889 21667 7091 -2754 -29683 -17826 11142 20352 14268 22608 10252 33350 38868 23546
13892B3546M266l571J8931L3064j2513l5463k4174k46M679J4382p52R389N545
$$ 23546 27812 24241 43172 76236 63723 28260 4086 3840 8519 22901 22149 31538 37083
13879C7083k2645k8492p550J8486P540l324n566P155L0754m101o419j413n89J5459
$$ 37083 14438 -14054 -21604 -3118 4422 1098 -4468 2687 33441 29340 22921 21508 20919 36378
13865C6378J3738m4331j9476J0011j4532K9432J0988L871R709n388n769q556J7720
$$ 36378 50116 5785 -13691 -3680 -18212 11220 22208 26079 35788 30400 24631 16075 33795
13852C3795k4597k2818Q846j3936Q829J2407J745J7256K3191J761O64j8913k3994
$$ 33795 9198 -13620 -4774 -18710 -9881 2526 4271 21527 44718 46479 47143 28230 4236
13839D236K1670M470k1007M376K3355M87j9861O807Q670j3253M433L6096M384
$$ 4236 25906 30376 9369 13745 37100 37587 17726 24533 33203 19950 24383 60479 64863
13826F4863r692R832j2994k1919m1125Q264R014o284l842P851j1697k5190O049
$$ 64863 55171 65003 52009 30090 -11035 -2771 6243 -41 -3883 3968 -7729 -32919 -26870
13813b6870L177j1099n750L0260j0414K3694J4837o911R703L221r612k1128k2391
$$ -26870 -23693 -34792 -40542 -10282 -20696 2998 17835 10924 20627 23848 14236 -6892 -29283
13800b9283k1189O917K7796K4769J7066Q084l6156k4530p326K3396L9340Q855
$$ -29283 -50472 -43555 -15759 9010 26076 34160 -1996 -26526 -33852 -10456 28884 37739
13788C7739l0072l389L640j6150J5075J5785Q503K3889k572j4728j0699j6383
$$ 37739 7667 4278 7918 -8232 6843 22628 31131 55020 52448 37720 27021 10638
13776A0638q896P725O587J553k7838j9973j4816p239Q950L7102O835r225l4040
$$ 10638 1742 9467 16054 17607 -10231 -30204 -45020 -52259 -43309 -6207 628 -8597 -42637
13763d2637k7888K8634K2963J9233j4727J0095J4498J0285j6407j4446J6637Q573
$$ -42637 -70525 -41891 -18928 305 -14422 -4327 10171 20456 4049 -10397 6240 14813
13751A4813j3132j1401k2808L965M317N044K0188J1549n88L689j4280j1321J5853
$$ 14813 1681 -9720 -32528 -28563 -24246 -19202 986 12535 11947 15636 1356 -9965 5888
13738E888K040k284j1148R067k1842p21K0621K1036k9582k9109N576K6482j2648
$$ 5888 7928 5644 -5504 3563 -18279 -19000 1621 22657 -6925 -36034 -30458 -3976 -16624
13725a6624J380J4079k476M826R862R80r977L641P939K1307j5301j6027P575Q836
$$ -16624 -15244 -1165 -3641 1185 11047 12027 2050 5691 13630 34937 19636 3609 11184 20020
13711B0020Q733J5821j7371k3386o36J1153r568j6101L993r289j7574J3327o415
$$ 20020 28753 44574 27203 3817 3181 14334 4766 -11335 -7342 -16631 -34205 -20878 -27293
13698b7293K818J3528L753K2341Q965J4174o835k3558M906J1982L026J9328J651
$$ -27293 -24475 -10947 -7194 15147 24112 38286 31451 7893 12799 24781 27807 47135 48786
13685D8786j526m584J0205j9065l9679j8084J2597K5898o243R078k1471j5315
$$ 48786 47260 42676 52881 33816 -5863 -23947 -11350 14548 8305 17383 -4088 -19403
13673a9403l193L2064K0288j7281R652J1621j9409k8710k5727l752J4814M0952
$$ -19403 -22596 9468 29756 12475 22127 33748 14339 -14371 -40098 -43850 -29036 11916
13661A1916K5237l7419k2174J5224N5P612L4698K9746K5626j5822m0673m0967
$$ 11916 37153 -266 -22440 -7216 -7161 451 35149 64895 90521 74699 34026 -6941
13649f941J1755J0486Q678r755P333q782j90j543J2355Q615j6964Q636J2135j1944
$$ -6941 4814 15300 23978 14223 21556 12774 12584 11041 23396 32011 15047 23683 35818 23874
13635B3874K1233K2679J1929M249J4660o360j2243l2246j9432q743Q159K8711
$$ 23874 45107 67786 79715 83964 98624 92264 80021 47775 28343 19600 27759 56470
13623E6470J7440qR789j1070l6083n781j7592R416O049O239L639J5396r239k989
$$ 56470 73910 73902 83691 72621 36538 30757 13165 22581 28630 34869 38508 53904 44665 41676
13609D1676J0825L005j2510k1133K016M7216K4586j4517j6255o414J1238j9315
$$ 41676 52501 55506 42996 21863 23879 71095 95681 81164 64909 58495 69733 50418
13597E0418J191J0639K2519K8966M1849p749P710K5269n179K013L8703k1064k2341
$$ 50418 51609 62248 84767 113733 155582 147833 155543 180812 175633 177646 216349 195285 172944
13584A72944J3509K1375K5976K9267R637J2340L4835O3090J03114P6487J24122
$$ 172944 186453 207828 233804 263071 272708 285048 319883 382973 486087 562574 686696
13573F86696J72941J86796J89094J55238J00465l064o9613r7058j62331j87884
$$ 686696 859637 1046433 1235527 1390765 1491230 1488166 1418553 1321495 1159164 971280
13563I71280j61461j23263j15611j07002m7712n0256o6015o3834j9826k9779k1159
$$ 971280 809819 686556 570945 463943 416231 365975 299960 236126 216300 186521 165362
13552A65362o272j8371j5903J0870k275j3944K0009p936j5414L311R949R688l451
$$ 165362 159090 140719 124816 135686 133411 119467 139476 131540 116126 119437 129386 139074 135623
13539A35623k5339J0365n081k209P363j287j1328k7151j2490j1909J9879r898
$$ 135623 110284 120649 115568 113359 120722 119435 108107 80956 68466 56557 76436 66538
13527F6538j1693l0522nK5258J3593J4561n598J0137p923n57R852m092j2724k966
$$ 66538 54845 24323 24318 49576 63169 77730 72132 82269 74346 73789 83641 79549 66825 63859
13513F3859j0625j241J1576p93j5005k6645J1122J3332J4926M3887M614j5999
$$ 63859 53234 51993 63569 62776 47771 21126 32248 45580 60506 104393 109007 93008
13501I3008j4067l7906j7369P934K8625k31Q047M878P070j2536l600j0020R651
$$ 93008 78941 41035 23666 31600 60225 59994 68041 72919 79989 67453 63853 53833 63484
13488F3484N3281l274j8842l0164j0364m899J8011O508j9932k942J8787j842j7103
$$ 63484 116765 113491 94649 64485 54121 49222 67233 73741 53809 50867 69654 67812 50709
13475E0709n260J2167j0184j9289p162J2530M185N099K0003P364m220p007K1699
$$ 50709 45449 57616 47432 28143 20981 33511 37696 42795 62798 70162 65942 58935 80634
13462H0634m336m033l699J1987k1523m3302M926K6699J1418K3196M0299J2469
$$ 80634 76298 72265 68566 80553 59030 15728 20654 47353 58771 81967 122266 134735
13450A34735k4519j9779q166l52J9854l744l0689j7137j404O734J7318J5486k0107
$$ 134735 110216 90437 82271 81919 101773 98029 67340 50203 48799 55533 72851 88337 68230
13437F8230J6255k931K0585O742J9465K5498O230r543j9819j4683q953p892L485
$$ 68230 84485 81554 102139 108881 128346 153844 160074 150531 130712 116029 107076 99184 102669
13424A02669j7085k6775j1169k2325l108k4691l0415j2964R8K1989N889J3209
$$ 102669 85584 58809 47640 25315 22207 -2484 -32899 -45863 -45765 -23776 -17887 -4678
13412d678j3309o184N938J0030K40o670P601L9083J3350j0218J535j5594n398
$$ -4678 -17987 -24171 -18233 -8203 -7963 -14633 -7032 32051 45401 35183 36718 21124 15726
13399A5726J5149J6349n416L58J0840q706L215l462M419K0371k7524J086J3255
$$ 15726 30875 47224 41808 42166 53006 44300 47515 44053 48472 68843 41319 42405 55660
13386E5660o987k496J1726j2666m810j2309K8600M1055K0296j0655K9314M9981
$$ 55660 48673 46177 57903 45237 40427 28118 56718 97773 118069 107414 136728 186709
13374A86709L1709K3754J0274J3946j3276l0628J4633j9567m4578k6543k9258
$$ 186709 218418 242172 252446 266392 253116 222488 237121 217554 172976 146433 117175
13363A17175Q304J2128k6532J6668K062k6331j0361p303k996r111r860l329k5060
$$ 117175 125479 137607 111075 127743 129805 103474 93113 85810 82814 73703 63843 60514 35454
13350C5454N312J8068j8905j5470J1907L8559J1545l4131j14J064N420J2158j1939
$$ 35454 40766 58834 39929 24459 36366 74925 86470 52339 52225 53289 58709 70867 58928
13337E8928m425J7514L1818j7436l910J2017K9385j5908k1373k3436J7J8131j5934
$$ 58928 54503 72017 103835 86399 82489 94506 123891 107983 86610 63174 63191 81322 65388
13324F5388l5515j083M681J821J8395K9441L163P101j4855J8526j1504O680o009
$$ 65388 29873 28790 33471 35292 53687 83128 86291 93392 78537 97063 85559 92239 86230
13311H6230J4568J5443K032j6364Q234Q484J8830j3240J3591K224J2091j0740
$$ 86230 100798 116241 118273 101909 110143 118627 137457 124217 137808 140032 152123 141383
13299A41383j169J4114k656J4449J8903k78j7132m168j7210k2694O170J6301o204
$$ 141383 140214 154328 151672 166121 185024 184746 167614 163446 146236 123542 129712 146013 139809
13286A39809o310J6324J5635n994P919J1518K354n287j3562q225J0161M665j4455
$$ 139809 133499 149823 165458 159464 167383 178901 181255 175968 162406 154181 164342 169007 154552
13273A54552l7977k3550R29K3477K4731L0986K3308O58k089J0436k985k808M861
$$ 154552 116575 93025 93954 117431 142162 173148 196456 197114 195025 205461 202476 199668 204529
13260B04529J9866K6311K8186L600K2394K5272J1448p657m0194J3368K6707K2239
$$ 204529 224395 250706 278892 282492 304886 330158 341606 333949 293755 307123 333830 356069
13248C56069M5548P9099J31314J41614J12949J06539O8557K5258k6915n7566q5605
$$ 356069 401617 480716 612030 753644 866593 973132 1041689 1066947 1040032 982466 896861
13237H96861n1337k3423l3308n5255l6233L853j3203r383N088k424K1344j1103
$$ 896861 845524 822101 788793 733538 697305 701158 687955 678572 683660 681236 702580 691477
13225F91477k5562j0256l725r116l3116j299j824J2420K156q198J6245K3823M3477
$$ 691477 665915 655659 651934 642818 609702 608403 606579 618999 621155 612957 629202 653025 696502
13212F96502N527q522Q515J8941N1222L5322J0457M8474P1217K1153M2969N6921
$$ 696502 702029 693507 702022 720963 772185 807507 817964 866438 937655 958808 1001777 1058698
13200A058698P9279Q1035P6329M5923O6450J06345J22694J41216J61567J92035
$$ 1058698 1137977 1219012 1295341 1341264 1407714 1514059 1636753 1777969 1939536 2131571
13190B131571K67344L54431N06120O78094Q67912J095802J304071J240514Q45532
$$ 2131571 2398915 2753346 3259466 3937560 4805472 5901274 7205345 8445859 9291391
13181I291391L16098m7867l31699p67031j153358j201385r73566p39613n07259
$$ 9291391 9607489 9559622 9227923 8460892 7307534 6106149 5132583 4392970 3885711
13172C885711l56864k43405k33131j99207j07099n7989p200N6p564L7707Q0730
$$ 3885711 3528847 3285442 3052311 2853104 2746005 2688016 2680816 2680872 2673308 2711015 2791745
13161B791745P4205O5058P1002Q9983J12948J29096J38979J76388J93421K41400
$$ 2791745 2865950 2931008 3002010 3091993 3204941 3334037 3473016 3649404 3842825 4084225
13151D084225K68622K91400L26888L91352M26960M45934N02344N79878O43114
$$ 4084225 4352847 4644247 4971135 5362487 5789447 6235381 6737725 7317603 7960717
13142G960717P37663Q55039J007035J216554J456380J736343K080931K419356
$$ 7960717 8698380 9553419 10560454 11777008 13233388 14969731 17050662 19470018
13134A9470018K742130L025661L298098L670462M261043N020513O179099P982928
$$ 19470018 22212148 25237809 28535907 32206369 36467412 41487925 47667024 55649952
13126E5649952J0730963J4745306K0399657K8046288L7231329M5474969M5731141
$$ 55649952 66380915 81126221 101525878 129572166 166803495 212278464 258009605
13119B58009605L3499174J6081046L37381j4848475l1460958m3808755m6066192
$$ 258009605 291508779 307589825 307927206 293078731 261617773 217809018 171742826
13112A71742826l8826769k9108763k1220548j5633953j1692690q945995p059604
$$ 171742826 132916057 103807294 82586746 66952793 55260103 46314108 39254504
13105C9254504n641627m614256l825113l166634k625557k212341j902974j598269
$$ 39254504 33612877 28998621 25173508 22006874 19381317 17168976 15266002 13667733
13097A3667733j335779j178227j003107q62338p84385p16183o19704n27345m38991
$$ 13667733 12331954 11153727 10150620 9288282 8503897 7787714 7168010 6640665 6201674
13088F201674m00237l57552l20261k89012k37228k39119k13183j95965k14058
$$ 6201674 5801437 5443885 5123624 4834612 4597384 4358265 4145082 3949117 3735059
13079C735059j98268j78111j83214j70654j35826j17879j33373j24357j03381
$$ 3735059 3536791 3358680 3175466 3004812 2868986 2751107 2617734 2493377 2389996
13070B389996q1609j07977j00263o4148o5284o5133p9790o2872p0629m2619k3927
$$ 2389996 2308387 2200410 2100147 2035999 1970715 1905582 1825792 1762920 1692291 1649672 1625745
13059A625745l0772o1923n9436o4477l9260j6007l4566o1592p4775m3899p080
$$ 1625745 1594973 1533050 1473614 1409137 1369877 1353870 1319304 1257712 1182937 1139038 1131958
13048A131958p924k7195k9779m1076o2829m6318k7483l1620k0278j1014k3837
$$ 1131958 1124034 1096839 1067060 1025984 963155 916837 889354 857734 837456 826442 802605
13037H02605o421o983j8503L159M37L0246k4984m7282o2899l7542n714l1996K3160
$$ 802605 796184 789201 770698 773857 774294 804540 779556 732274 669375 631833 626119 594123 617283
13024F17283K0405j1536K152j5788k7700l9018j9161K448j0000Q403O16l0236
$$ 617283 637688 626152 628304 612516 584816 545798 526637 529085 519085 527488 528104 497868
13012D97868k8073j9165P784M3413j3589l4386j824l116l6626l7077k3462l7717
$$ 497868 469795 450630 458414 501827 488238 453852 452028 448912 412286 375209 351747 314030
13000C14030l7140l9730o8809o6114l5413n5035j6799M4360O2637P6007O1672
$$ 314030 276890 237160 168351 102237 66824 11789 -5010 39350 101987 177994 239666
12989B39666P6827J00577Q0419O4562K6931n3J4029j130l6477j2147l591m0118
$$ 239666 316493 417070 497489 562051 588982 588929 602958 601828 565351 553204 549613 509495
12977E09495k9246L990r818l4408k6935j867q267l3391k6220q270K8999J5880
$$ 509495 480249 484239 474421 440013 413078 411211 402944 369553 343333 335063 364062 379942
12965C79942K526p208o899p079k639j3122n894J0577j5612j2333Q801J5027r756
$$ 379942 382468 375260 368361 361282 358643 345521 339627 350204 334592 322259 331060 346087 336331
12952C36331k2302o896J545L4185J1915J8187K6917j5361j8571q753Q719O132
$$ 336331 314029 307133 308678 342863 354778 372965 399882 384521 365950 357197 365916 372048
12940C72048n971m2327l5660k2875l9690j0718L777J3673N2096j3395l5545K685
$$ 372048 366077 323750 288090 265215 225525 214807 218584 232257 284353 270958 235413 238098
12928B38098K7379J465q303k1672j2656J1963j2637k8626m625J2553l387O282
$$ 238098 265477 266942 258639 236967 224311 236274 223637 195011 190386 202939 199552 205834
12916B05834J6038K4237Q203J3816Q917l226j4044K371m2492K110J9639l8836
$$ 205834 221872 246109 254312 268128 277045 273819 259775 262146 219654 221764 241403 202567
12904B02567j4489M975L085K6425K0669M4468L8584R513r368k5218k8792k6543
$$ 202567 188078 193053 196138 222563 243232 287700 326284 335797 326429 301211 272419 245876
12892B45876m2266k6541Q651L938J4512p330P078J0643K4j6740J5216K8267L292
$$ 245876 203610 177069 185720 189658 204170 196840 203918 214561 214585 197845 213061 241328 244620
12879B44620l6341k0633Q736m319j4073j2500K5811R074j3922o516K7708M2929
$$ 244620 208279 187646 196382 192063 177990 165490 191301 200375 186453 179937 207645 250574
12867B50574m486m3404j4265L7869j0096l7283j0175o31n434J8924Q929Q341k0975
$$ 250574 246088 202684 188419 226288 216192 178909 168734 168103 162669 181593 190522 198863 177888
12854A77888n885J6407p090m561P267k3088K258L7101L0561P57J4776L2879N6310
$$ 177888 172003 188410 181320 176759 184026 160938 163196 200297 230858 231615 246391 279270 335580
12841C35580Q7563N0662j9690n0125m6793n6028m4038q192j7736k5762m253q142
$$ 335580 423143 473805 454115 403990 357197 301169 257131 248939 231203 205441 201188 193046
12829A93046m752l3827r855J6724j7310M593k0621J0272J8947J8657K8689j1892
$$ 193046 188294 154467 144612 161336 144026 148619 127998 138270 157217 175874 204563 192671
12817A92671j0254J7082j4575k5425m645q435j1283k0745j3179J2504p867l1047
$$ 192671 182417 199499 184924 159499 154854 146419 135136 114391 101212 113716 105849 74802
12805G4802k1802q118L788J31J1546L094J3090R164o814j0714k0674J3406J1171
$$ 74802 53000 44882 48670 48801 60347 63441 76531 85695 78881 68167 47493 60899 72070
12792G2070L697K6720j249j1711M040k107m308q484K87J6729k8715m6440k678
$$ 72070 75767 102487 101238 89527 93567 91460 87152 78668 78955 95684 66969 20529 17851
12779A7851J0820L3049n39j1987j7596J6390k388J4788L1263K0278m299l895j0753
$$ 17851 28671 61720 61181 49194 31598 47988 45600 60388 91651 111929 107630 103735 92982
12766I2982q500k0345r226n637K9905J3544j7809L305l452P69j5223k4791J443
$$ 92982 84482 64137 54911 49274 79179 92723 74914 78219 74767 75536 60313 35522 36965
12753C6965o951k0392j1118J457J0849P494L1142J5692k511J6361O677k5249k6184
$$ 36965 30014 9622 -1496 -39 10810 18304 49446 65138 62627 78988 85665 60416 34232
12740C4232p564L8664J1349k3733L030J5067k3033J8811L580K4269j4871j2786
$$ 34232 26668 65332 76681 52948 55978 71045 48012 66823 70403 94672 79801 67015
12728F7015k344j0323j3574K60J7576K3086J832K1013L0926K9695l0812k9408
$$ 67015 64671 54348 40774 41034 58610 81696 83528 104541 135467 165162 134350 104942
12716A04942o002O733J8616j6077j1182j8776R194m577l2185M514J2499k0774
$$ 104942 98940 105673 124289 108212 97030 78254 87448 82871 50686 55200 67699 46925
12704D6925O251m396k1435J66M4693L1904p429j5205p440Q467J9863L3028J1659
$$ 46925 53176 48780 27345 27511 72204 104108 96679 81474 74034 82501 102364 135392 147051
12691A47051m835r969K6850J0954l381q026k4285l588J2040n467n736r431j6726
$$ 147051 142216 132247 159097 170051 166670 158644 134359 130771 142811 137344 131608 122177 105451
12678A05451J7040M1935Q418o947K5569L3956J6862P192L2141N2415O3968P0283
$$ 105451 122491 164426 172844 165897 191466 225422 242284 249476 281617 334032 398000 468283
12666D68283P1609J11844J56731J58014J82849J60286J15296L5868m2689j11960
$$ 468283 539892 651736 808467 966481 1149330 1309616 1424912 1460780 1418091 1306131
12656A306131j50884j78188j86247j64629j22535p0139p0549o4822o5337n9556
$$ 1306131 1155247 977059 790812 626183 503648 433509 362960 298138 232801 173245
12646A73245j6825P531J493k7735m950j0482l4894j470J2922j6204r368J147o43
$$ 173245 156420 163951 165444 137709 132759 122277 87383 85913 98835 82631 73263 74410 73767
12633G3767j6208j1586R534j489J8238J8143k3984j8851K2166L8560K886l0615
$$ 73767 57559 45973 55507 54018 72256 90399 66415 47564 69730 108290 111176 80561
12621H0561k389j9152r359k2393P339J8162j1570o931J0437k0950k0405K2195
$$ 80561 78172 59020 49661 27268 34607 52769 41199 34268 44705 23755 3350 25545
12609B5545K8653K0618j5095l2028L547L227O983j0689L618K3185P637j0101m175
$$ 25545 54198 74816 59721 27693 31240 34467 41450 30761 34379 57564 65201 55100 50925
12596E0925O937k3147Q580J747j4628K2391R151j5487M541J2116J0454K5144j489
$$ 50925 57862 34715 43295 45042 30414 52805 61956 46469 51010 63126 73580 98724 97235
12583I7235k2992j5977j2956N546j9140j0766J7789j6915k4183j2689K3371K3658
$$ 97235 74243 58266 45310 50856 31716 20950 38739 21824 -2359 -15048 8323 31981
12571C1981Q11m504K602l0030k1361R075j3526j8852l017L3657J0163J5044j4108
$$ 31981 32792 28288 30890 860 -20501 -11426 -24952 -43804 -46821 -13164 -3001 12043 -2065
12558b065J220K495J7575K9479J1179L197J8831n473k4676q035R552k8269k5850
$$ -2065 -845 1650 19225 48704 59883 63080 81911 76438 51762 43727 53279 25010 -840
12545h40L71L6759Q939K862m849p11R057P643q182k8374j3817J0002J1601k210
$$ -840 -469 36290 45229 48091 43242 42531 51588 59231 51049 22675 8858 18860 30461 28251
12531B8251p718P441K182o931q578j0781J4451O073K8814n505j8998N994J4657
$$ 28251 20533 27974 30156 23225 14647 3866 18317 24390 53204 47699 28701 34695 49352
12518D9352j4369l244l540n842L0239l4j1845k5362m247L0478p2P917J5619L818
$$ 49352 34983 31739 28199 22357 52596 52562 40717 15355 11108 41586 41514 49431 65050 68868
12504F8868o029m765l1696k0705o824K1583L3405j0748J0851K385L684o080k9324
$$ 68868 62839 58074 26378 5673 -1151 20432 53837 43089 53940 56325 60009 53929 24605
12491B4605n889Q639k671M827k526K2766J0933j9326J2868q204J2654r833p993
$$ 24605 18716 27355 24684 29511 26985 49751 60684 41358 54226 46022 58676 48843 40850
12478D0850j0010J0101L229j206m553l171j1235k6462j9691n270j461M1523L4342
$$ 40850 30840 40941 44170 42964 38411 35240 24005 -2457 -22148 -27418 -28879 12644 46986
12465D6986j8263J2373K2814p379l9247k8093J1486m300O877L9980J0810l5961
$$ 46986 28723 41096 63910 56531 17284 -10809 677 -3623 3254 43234 54044 18083
12453A8083k4137J7448J0189J2743N528J5589j786j6045L9736j7414l1970k5631
$$ 18083 -6054 11394 21583 34326 39854 55443 53657 37612 77348 59934 27964 2333
12441B333N570P721o99p457L229Q317O30J6352p064q103O592j2935l2361K143
$$ 2333 7903 15624 14925 7468 10697 19014 19644 35996 28932 20829 27421 14486 -17875 -15732
12427a5732n81J8022L9816L71k101q65k4997J7039j4275j9278J0469J0115J0930
$$ -15732 -16313 1709 41525 41896 39795 38930 13933 30972 16697 -2581 7888 18003 28933
12414B8933K1560k8435l0091J9090R117n615Q042k194n862k0718K7678K1500O75
$$ 28933 50493 22058 -8033 11057 20174 14559 22601 20407 14545 -6173 21505 43005 43680
12401D3680K001j4567k1462k830N558j0025n996K5505L701k3543j1252n782o037
$$ 43680 45681 31114 9652 6822 12380 2355 -3641 21864 25565 2022 -9230 -15012 -21049
12388b1049K4004R070N281K3901L750n660j7637q504k0727K0468M6427o107p735
$$ -21049 2955 12025 17306 41207 44957 39297 21660 13156 -7571 12897 59324 53217 45482
12375D5482j0586j0587J1310j3975k0238q159j1157K082L016J3589L0766K6684
$$ 45482 34896 24309 35619 21644 1406 -6753 -17910 -15828 -12812 777 31543 58227
12363E8227m4002k5508J6133J655j3390j698J19J8549o380K1028N109Q631J5176
$$ 58227 14225 -11283 4850 6505 -6885 -8583 -8464 10085 3705 24733 29842 38473 53649
12350E3649M295j0568l0221j5319J5580J7732q203J2015K0467k7066N634J2338
$$ 53649 57944 47376 17155 1836 17416 35148 26945 38960 59427 32361 37995 50333
12338E0333m224p734K16o37J0874k7132j2093K0649J4781Q468k858k2666j2207
$$ 50333 46109 38375 38591 37954 48828 21696 9603 30252 45033 53501 50643 27977 15770
12325A5770R158K335q44j79L3473j5094j8890L1161Q733j8308l0960N182O986
$$ 15770 24928 27263 26419 26240 59713 44619 25729 56890 65623 47315 16355 21537 28523
12312B8523j6317j5731K0766J6373J828o198J3369o479J0483j5730k2797k1952
$$ 28523 12206 -3525 17241 33614 35442 29244 42613 36134 46617 30887 8090 -13862
12300a3862K4642P868l3514q637n377J0709K2429J5795r01j885PP002k4632j7436
$$ -13862 10780 18648 -14866 -23503 -28880 -18171 4258 20053 19152 17267 17274 24276 -356 -17792
12286a7792J2990R195J4693o966j1162r364R727l792j4410N587K7212N97K0182
$$ -17792 -4802 4393 19086 12120 958 -8406 1321 -2471 -16881 -11294 15918 16515 36697
12273C6697M682l4880Q293K3859l183k6367m051Q398o889J7662K0020j0255q097
$$ 36697 41379 6499 14792 38651 35468 9101 5050 13448 6559 24221 44241 33986 25889
12260B5889j8970K4463k619J8304M334k467j3184j126n070j4300j8596l802k002
$$ 25889 6919 31382 28763 47067 51401 48934 35750 34624 29554 15254 -3342 -7144 -9146
12247i146L2631J7479m295j4214m079J002J0439O450j7758k1414M501J841J3466
$$ -9146 23485 40964 36669 22455 18376 19378 29817 36267 18509 -2905 1596 3437 16903
12234A6903N944J1206j032k3019J769j8841o016j2399K3488N769j8186K534j0449
$$ 16903 22847 34053 33021 10002 11771 -7070 -13086 -25485 -1997 3772 -14414 -11880 -22329
12221b2329K050l859n291q45K1993k6j0273j6272O463L5642M413j128K7750J1972
$$ -22329 -20279 -24138 -29429 -30274 -8281 -8307 -18580 -34852 -28389 7253 11666 10538 38288 50260
12207E0260j4396j2318J8363l93J719j7860k301M911j0275k1013j3772J5483J6356
$$ 50260 35864 23546 41909 41516 43235 25375 23074 27985 17710 -3303 -17075 -1592 14764
12194A4764o637M60l821R809K500j4544K0331N1579J0702l1951k5570J863N542
$$ 14764 8127 8587 4766 14575 17075 2531 22862 74441 85143 53192 27622 29485 35027
12181C5027r938m53J2885M203L5797L999j8586J749k7670q719j3479J451r782
$$ 35027 25089 24636 37521 41724 77521 81520 62934 64683 37013 28294 14815 16266 6484
12168F484j9740N712J1310L8072N98k6017k0376j8645j4517K45K9264l609l460
$$ 6484 -13256 -7544 3766 41838 42436 16419 -3957 -22602 -37119 -36874 -7610 -11219 -14679
12155a4679r214m714P639L5758l744k4667m337J0850K9114M395O362r54M043l746
$$ -14679 -23893 -28607 -20968 14790 11046 -13621 -17958 -7108 22006 26401 32763 31809 35852 32106
12141C2106J4325J3667M116k2961J0892P053j6915j1755k5975K611K4653J4190
$$ 32106 46431 60098 64214 41253 52145 59198 42283 30528 4553 7164 31817 46007
12129D6007L7010K9953R471J484L564J234J5827j2238N042j5182j6295k4238j0755
$$ 46007 83017 112970 122441 123925 127489 128723 144550 132312 137354 122172 105877 81639 70884
12116G0884J0004j1540k4544K888k0866m119M811q469l937j776K284J0530o919
$$ 70884 80888 69348 44804 47692 26826 22707 27518 19049 15112 13336 15620 26150 19231
12103A9231M465J4125j2606j5412j7080j258K3314K9196J9663P732k5586r902
$$ 19231 23696 37821 25215 9803 -7277 -8535 14779 43975 63638 71370 45784 35882
12091C5882k5464k834O058l925n185J2090o098J9622j8433K6289K2820q09k3018
$$ 35882 10418 7584 13642 9717 4532 16622 10524 30146 11713 38002 60822 60013 36995
12078C6995k2023n655K4844j0835j0673q510j5654M730K060K5894L4332q371j0008
$$ 36995 14972 9317 34161 23326 12653 4143 -11511 -6781 -4721 21173 55505 47134 37126
12065C7126k103M247N029k0279Q271j0238j9941l09R026k152p833P614k054O920
$$ 37126 35023 39270 44299 24020 32291 22053 2112 1803 10829 8677 844 8458 6404 13324
12051A3324K5475J1163p165k852O553O257l6324m3283j1123k8546o125O2961L7620
$$ 13324 38799 49962 42797 39945 46498 52755 16431 -26852 -37975 -66521 -72646 -9685 27935
12038B7935j2004p227L855p07l4784R155Q991j2558j1271K2401j8506O017K6706
$$ 27935 15931 8704 12559 11852 -22932 -13777 -4786 -17344 -28615 -6214 -24720 -18703 8003
12025H003L270j4386O159K7519M467j5086k116j1148K2042L87j3485j7791O337
$$ 8003 11273 -3113 3046 30565 35032 19946 17830 6682 28724 29111 15626 -2165 4172
12012D172J7548K1060k3581K817M978j2584j124M359m590m683j7245K293P754
$$ 4172 21720 42780 19199 22016 26994 14410 13286 17645 13055 8372 -8873 -6580 1174
11999A174j3049K448j3856K9097J6211l055O519P365L3091l2623j2781L59J1621
$$ 1174 -11875 -9427 -23283 5814 22025 18970 25489 32854 65945 33322 20541 20900 32521
11986C2521L0221K0610o640J481j2660r692k77j1702q6k3497j5535k3162N816
$$ 32521 62742 83352 76712 78193 65533 55841 55564 43862 43776 20279 4744 -18418 -12602
11973a2602K5252j1112m940J6214q355l79M7266r63l0780j5564K1324l857k1796
$$ -12602 12650 1538 -3402 12812 4457 4078 51344 50381 19601 4037 25361 21504 -292
11960b92j7499O716K3116K1461P588j2146q653j2454o743l577k3358J4185L8306
$$ -292 -17791 -11075 12041 33502 41090 28944 20291 7837 1094 -2483 -25841 -11656 26650
11947B6650j3016l0002M858j2583O76J9328K3399K635M81J5334p341r942K4056
$$ 26650 13634 -16368 -11510 -24093 -23417 -4089 19310 21945 22426 37760 30419 20477 44533
11934D4533j6219j1942k357p10j1768J0976M672k588k7650n584J2095K7344L751
$$ 44533 28314 16372 14015 13305 1537 12513 17185 14597 -13053 -18637 -6542 20802 24553
11921B4553K342M575j906j5621j0600J0985J3212O73k1634j8760q247L164p828
$$ 24553 26895 31470 29564 13943 3343 14328 27540 28213 6579 -12181 -20428 -17264 -25092
11908b5092p980j1172J8647P603Q137M716O189O687K236j1862j0145r117J7552
$$ -25092 -33072 -44244 -25597 -17994 -9857 -5141 1048 7735 9971 -1891 -12036 -21153 -3601
11895c601o957K8830J0507L787M327K38j0371o479j229q608K3835m564j1211N803
$$ -3601 -10558 18272 28779 32566 36893 37131 26760 20281 19052 10444 34279 29715 18504 24307
11881B4307J1030J8376k399l3903J292r814k3045j8789r908J4796J9338m351J216
$$ 24307 35337 53713 51314 17411 18703 8889 -14156 -32945 -42853 -28057 -8719 -13070 -11854
11868a1854J5057M6627L102l2727j5426j6297O873J7022K3117J7377r759r504
$$ -11854 3203 49830 52932 20205 4779 -11518 -4645 12377 35494 52871 43112 33608
11856C3608j0562N289N725M79M0534l0059k1101P163m114J2046p570m307R689
$$ 33608 23046 28335 34060 34539 75073 45014 23913 31076 26962 39008 31438 27131 36820
11843C6820J722j193k6691N526L4336J351k1384j582P558j3281j0369M062J1450
$$ 36820 38542 37349 10658 16184 50520 51871 30487 28905 36463 23182 12813 16875 28325
11830B8325J3805k353l8712o163J4107j2722k0763l483J4320O145K1554J2271
$$ 28325 42130 39777 1065 -5098 9009 -3713 -24476 -27959 -13639 -7494 14060 26331
11818B6331k0901k1914J4895p86K5102J828j8964l1521j9007J1939J2262N708
$$ 26331 5430 -16484 -1589 -2375 22727 24555 5591 -25930 -44937 -32998 -20736 -15028
11806a5028K0031j18q93m345J8144j8248j6056J1946K5844o021j2313K900k780
$$ -15028 5003 4885 3992 -353 17791 -457 -16513 -4567 21277 15256 2943 5843 3063
11793C063J8891N472l061K770j7030k8600J2386m924j7077R396K3267Q220J3264
$$ 3063 21954 27426 24365 27135 10105 -18495 -6109 -11033 -28110 -18714 4553 12773 26037
11780B6037R825N303N091m79k5907k0006p020J0003Q490k1442j8875P467k5558
$$ 26037 35862 41165 46256 45777 19870 -136 -7156 2847 11337 -10105 -28980 -21513 -47071
11767d7071j2050Q961R083K3830L0399m230J1963o484k705J9031j3801k2556m2908
$$ -47071 -59121 -50160 -41077 -17247 13152 8922 20885 14401 11696 30727 16926 -5630 -48538
11754d8538m68J7280O605K3818K2590Q215N48m991R983N050j1862n791k455K659
$$ -48538 -49006 -31726 -25121 -1303 21287 29502 30050 25059 35042 40092 28230 22439 19984 22643
11740B2643j9929l3652l436R099J9006L771j6003n198R086J8851L1008K0909j798
$$ 22643 2714 -30938 -34374 -25275 -6269 -2498 -18501 -23699 -14613 4238 35246 56155 54357
11727E4357O610j7996n235k1371q625J5216n990j8397J3284J8538o221M186J5664
$$ 54357 60967 42971 37736 16365 7740 22956 16966 -1431 11853 30391 24170 28356 44020
11714D4020r597k7822J412K663p11J6023J2840j1634j4197n62M6k010m632j285
$$ 44020 34423 6601 8013 10676 9965 25988 38828 27194 12997 12435 12481 10471 5839 4554
11700D554r204l2844R492K3672J0779j0147J3806l313n447L097J815M22K942j4749
$$ 4554 -4650 -37494 -28002 -4330 6449 -3698 10108 6795 1348 4445 6260 6682 9624 -5125
11686e125J0265K979K757j5276j0479l530J135M352J1693l1905J3288M886J1281
$$ -5125 5140 8119 10876 -4400 -14879 -18409 -17274 -12922 -1229 -33134 -19846 -14960 -3679
11673c679j9396L513M7082k2771k5641J7655O184N691Q005N634j1374k0085j5754
$$ -3679 -23075 -19562 27520 4749 -20892 -3237 2947 8638 16643 22277 10903 -9182 -24936
11660b4936P17P321O951K3845r019k1165J2914L4744J776j3261j3511j454q488
$$ -24936 -24219 -16898 -9947 13898 4879 -16286 -3372 31372 33148 19887 6376 4922 -3566
11647c566j7756j791K2960P135J6085J6985J2845m715p633k2491k7577k2241M844
$$ -3566 -21322 -23113 -153 6982 23067 40052 52897 48182 40549 18058 -9519 -31760 -26916
11634b6916K2472L981r59J6832R310n289k4575J6608J3149l014q67o660o648J2796
$$ -26916 -4444 -463 -1422 15410 24720 19431 -5144 11464 24613 21599 20732 14072 7424 20220
11620B0220J8064M171k54j2555K565j7730j3247O374R575j7530K393j6488l846
$$ 20220 38284 42455 42201 29646 32211 14481 1234 7608 17183 -347 2046 -14442 -18288
11607a8288J8032K3002K1933j6192j1192j1805k1854k6524K9306J2124P560J380
$$ -18288 -256 22746 44679 28487 17295 5490 -16364 -42888 -13582 -1458 6102 7482
11595G482l3926l882o846L4970K924p014P720K553N883j5075o082L724j480J715
$$ 7482 -26444 -30326 -37172 -2202 722 -6292 1428 3981 9864 -5211 -11293 -7569 -9049 -7334
11581g334q166R677l3064J297L0654P141N438j524J9489K4641j802j0277J893
$$ -7334 -15500 -5823 -38887 -37590 -6936 205 5643 4119 23608 48249 46447 36170 38063
11568C8063k9218l5856R894M0124J3155M888M685Q820M718O342k5097j5511J9006
$$ 38063 8845 -27011 -17117 23007 36162 41050 45735 54555 59273 65615 40518 25007 44013
11555D4013j88j9856Q928K3248K351l0918l6909k5840n662K4629j773M044J721
$$ 44013 43825 23969 32897 56145 58496 27578 -9331 -35171 -40833 -16204 -17977 -13933 -12212
11542a2212n312Q322J3323J7759M022j1364k0957l0625m762K6962K2057p451M543
$$ -12212 -17524 -9202 4121 21880 25902 14538 -6419 -37044 -41806 -14844 7213 -238 4305
11529D305J8591J1804n832q437o496p713j745j9880p013n506j5487j7997K1187
$$ 4305 22896 34700 28868 20431 13935 6222 4477 -15403 -22416 -27922 -43409 -61406 -40219
11516d0219M8942j24j3050o755l430J1720K0584J9973l235j9463j4030L937J0887
$$ -40219 8723 8599 -4451 -11206 -14636 -2916 17668 37641 34406 14943 913 4850 15737
11503A5737j9729j520j0110R338K5281j0121o546L918k971N373J5880j9221j5565
$$ 15737 -3992 -5512 -15622 -6284 18997 8876 2330 6248 3277 8650 24530 5309 -10256
11490a0256j4535J1196r75J6007J1728J9102K2871k6607j5149J3816m439O068
$$ -10256 -24791 -13595 -14570 1437 13165 32267 55138 28531 13382 27198 22759 28827
11478B8827k6608k7137j5196q172K4638K5199O244r452L0532K8592j0359j3330
$$ 28827 2219 -24918 -40114 -48286 -23648 1551 7795 -1657 28875 57467 47108 33778
11466C3778q044k6319l703J038N137P260J7682Q472R57l1558l1291J0353K1489
$$ 33778 25734 -585 -4288 -3250 1887 9147 26829 35301 36258 4700 -26591 -16238 5251
11453E251N683l711K7856J4151k3339k6934j6882K3596m243K751J1912p644l1911
$$ 5251 10934 7223 35079 49230 25891 -1043 -17925 5671 1428 4179 16091 8447 -23464
11440b3464P983J0457L614M9406M9433j6317m2018k0878k7969j2768r949N673
$$ -23464 -15481 -5024 -1410 47996 97429 81112 39094 18216 -9753 -22521 -32470 -26797
11428b6797M331J2241J2157J7332J6180l333l0733m638j1866k5263O184L7877
$$ -26797 -22466 -10225 1932 19264 35444 32111 1378 -3260 -15126 -40389 -34205 3672
11416C672J2312J3390m650m673j4893N102K087K913m781r569K6104J8573m224
$$ 3672 15984 29374 24724 20051 5158 10260 12347 15260 10479 910 27014 45587 41363
11403D1363N953l7588l6701m677J5788J4022j264O181j9136k486q924K3107k141
$$ 41363 47316 9728 -26973 -31650 -15862 -1840 -3104 3077 -16059 -18545 -27469 -4362 -6503
11390f503L062K5257n626j2695l644P747p197N9p857Q103K0331L061j7987r879
$$ -6503 -3441 21816 16190 3495 -149 7598 401 460 -7397 706 21037 24098 6111 -3768
11376c768J9662K060j1351j0443j8740n24J0158r661j1440j2288J7337K1645r474
$$ -3768 15894 17954 6603 -3840 -22580 -23104 -12946 -22607 -34047 -46335 -28998 -7353 -16827
11363a6827P311O287j966j0398O299J0488O531J9968l985k1798L230j429K4501
$$ -16827 -9516 -3229 -5195 -15593 -9294 1194 7725 27693 23708 1910 5140 3711 28212
11350B8212J9300m595p668O59J8069j4760m514j3175k5671k0907J3325M1247J3871
$$ 28212 47512 42917 35249 35908 53977 39217 34703 21528 -4143 -25050 -11725 29522 43393
11337D3393L7846J1287k8053R811Q145q325P92j1342p127K5051P126k05K6590
$$ 43393 81239 92526 64473 74284 82429 74104 74896 63554 56427 81478 88604 88399 114989
11324A14989K4303L0538J0836m335j4989m293j3481j6532j0664N419J2006J9993
$$ 114989 139292 169830 180666 176331 161342 157049 143568 127036 116372 121791 133797 153790
11312A53790K4194L5700p235j2143k727j291q337j6735l597j0410K0183j705j1079
$$ 153790 177984 213684 206449 194306 191579 190288 181951 165216 161619 151209 171392 169687 158608
11299A58608m250L636Q605n633k2668k7506j9677p552j3364O059M679k762J810
$$ 158608 154358 157994 166599 160966 138298 110792 91115 83563 70199 76258 80937 78175 79985
11286G9985l790J65p07k4202p815K47J0342J3802p848l1865j4091k5455k9331
$$ 79985 76195 76360 75653 51451 43636 43883 54225 68027 60179 28314 14223 -11232 -40563
11273d0563K1808J1411J4908K4632J9527n945m1720p457Q710M125J2913L551m717
$$ -40563 -18755 -7344 7564 32196 51723 45778 4058 -3399 5311 9436 22349 25900 21183
11260B1183r794k246R25j86j1884j838j2592p863k1967k1681J9630J928J9732
$$ 21183 11389 9143 10068 9882 -2002 -3840 -16432 -24295 -46262 -67943 -48313 -46385 -26653
11247b6653L9398K113P670N955k810j4883j1144j2565J6208o68O351J0465K8097
$$ -26653 12745 14858 22528 28483 25673 10790 -354 -12919 3289 2621 8972 19437 47534
11234D7534L787n471j2623l8315p143p074L358K7831O97r495j568n294j2966j3820
$$ 47534 51321 45850 33227 -5088 -12231 -19305 -15947 11884 12581 3086 1518 -3776 -16742 -30562
11220c0562J1086P179J8992L4675K5508p609l0729k5931k1788Q559j408R03j2265
$$ -30562 -19476 -12297 6695 41370 66878 59269 28540 2609 -19179 -10620 -12028 -11125 -23390
11207b3390J7813k4539k8686K1050J9434J0697Q931J5124j2968J2126K7355k204
$$ -23390 -5577 -30116 -58802 -37752 -18318 -7621 1310 16434 3466 15592 42947 40743
11195D0743j3843r10j8846P866J0357j1866N918Q551r779l3431m742J0858K7267
$$ 40743 26900 25990 7144 15010 25367 13501 19419 27970 18191 -15240 -19982 -9124 18143
11182A8143o770j6020M992R433K375J8001J1693J131q213K9229p09L5011K3818
$$ 18143 11373 -4647 345 9778 12153 30154 41847 42978 34765 63994 63285 98296 122114
11169A22114j2393k6829j967J526j2174l2911O101Q152m309k4457k2365j6274
$$ 122114 109721 82892 80925 82451 70277 37366 43467 51619 47310 22853 488 -15786
11157a5786L064L1Q189K697k505j4300j7495J1870M0110K5930k8211l0490o745
$$ -15786 -12722 -12691 -4502 -1805 -4310 -18610 -36105 -24235 15875 41805 13594 -16896 -23641
11144b3641M843J6713N779J4901j4148J2635J5405j4571L054p428k7936p132J557
$$ -23641 -18798 -2085 3694 18595 4447 17082 32487 17916 20970 13542 -14394 -21526 -19969
11131a9969L7632Q565l315j502n380j923j3397k0579K5253R314m343j5568K259
$$ -19969 17663 26228 22913 21411 16031 14108 711 -19868 5385 14699 10356 -5212 -2953
11118b953J562j0093j4869J291K3394P620m099j8067K525K2369j5556j3477l653
$$ -2953 -1391 -11484 -26353 -25062 -1668 5952 1853 -16214 -13689 8680 -6876 -20353 -24006
11105b4006O17j0849J3104j4519K7177M004k139J3080M207n307K1659K504l2998
$$ -24006 -23389 -34238 -21134 -35653 -8476 -4472 -6611 6469 10676 5369 27028 29532 -3466
11092c466l3443N888R846L4125N266l0620k5933K5429K5150o276j3698K804K1815
$$ -3466 -36909 -31021 -21175 12950 18216 -12404 -38337 -12908 12242 5966 -7732 -4928 16887
11079A6887M718k644k223j2305j0254K9657J8558l6494p341J0382J486k9349J9023
$$ 16887 21605 18961 16738 4433 -5821 23836 42394 5900 -1441 8941 10427 -18922 101
11066A01L0454k304L083j4274r211l72R648O643j7767k3479j4086L132m617Q216
$$ 101 30555 28251 31334 17060 7849 7477 17125 23768 6001 -17478 -31564 -28432 -33049 -24833
11052b4833om77P981J7482J9295J4952K0870J9036R905n940m651q722K1739l607
$$ -24833 -24839 -25316 -17335 147 19442 34394 55264 74300 84205 78265 73614 64892 86631 83024
11038H3024j4792j5272M91M7616K1443J0909J0734j9961L290q922Q384n422k2991
$$ 83024 68232 52960 53451 101067 122510 133419 144153 124192 127482 118560 126944 121522 98531
11025I8531R594K6158K4134Q793K4717K420m525j9390k9061k5104j112p830k5223
$$ 98531 108125 134283 158417 167210 191927 194347 189822 170432 141371 116267 115155 107325 82102
11012H2102j9946K4392M8072J4463j1481l1664k7765q452N004k8813q329J0654
$$ 82102 62156 86548 134620 149083 137602 105938 78173 69721 74725 45912 37583 48237
11000D8237O024M878L2925j9967o648j0734j5147J6410O925Q748k7942k1354j0085
$$ 48237 54261 59139 92064 72097 65449 54715 39568 55978 62903 71651 43709 22355 12270
10987A2270K0120K379q585q229l548J130K144r560L607J17j5333J9460J2347q983
$$ 12270 32390 34769 26184 17955 14407 15537 17681 8121 11728 11845 -3488 15972 28319 19336
10973A9336k9942j395O396J7052j2107K156r388j3181K455R033R58j3051J829
$$ 19336 -10606 -12001 -5605 11447 -660 1496 -7892 -21073 -18618 -9585 -8627 -21678 -19849
10960a9849K1388J3483J5880j6405l1132L5148m107j6057J0800K240K884J951
$$ -19849 1539 15022 30902 14497 -16635 18513 14406 -1651 9149 11389 14273 16224
10948A6224L384J6339M565l6195k8618K352J7433L0688K6979o339l0044K86R132
$$ 16224 19608 35947 40512 4317 -24301 -21949 -4516 26172 53151 46812 16768 17054 26186
10935B6186J1867J97r960l7085L109J6941Q633O861K4382J1618l110j7534p384
$$ 26186 38053 38250 28290 -8795 -5686 11255 19888 26749 51131 62749 59639 42105 34721
10922C4721P96j6155j296q313p756j1835l093K4670q715Q894j4927j5117k6099
$$ 34721 35517 19362 18066 9753 1997 -9838 -12931 11739 3024 11918 -3009 -18126 -44225
10909d4225k143K9271j1676K144N268J3010r272j9060j1121R520P003O684j3943
$$ -44225 -46368 -17097 -28773 -26629 -21361 -8351 -17623 -36683 -47804 -38284 -31281 -24597 -38540
10896c8540o533J872j0208J0376M6111J0773j5657j3522J4469L899j0409L210
$$ -38540 -45073 -43201 -53409 -43033 3078 13851 -1806 -15328 -859 3040 -7369 -4159
10884d159j1562M63n291l168J8046K8038p409n4761O625M1221n397j2237J3412
$$ -4159 -15721 -15258 -20549 -23717 -5671 22367 14958 -39803 -33178 8043 2646 -9591 3821
10871C821R731L223k5598n371L225J0357p813M024j6805Q956j8949q967J0399
$$ 3821 13552 16775 -8823 -14194 -10969 -612 -8425 -4401 -21206 -12250 -31199 -40166 -29767
10858b9767L082m399k4808K814J7739J1681J5646J6792L468K4288M782m556l4930
$$ -29767 -26685 -31084 -55892 -53078 -35339 -23658 -8012 8780 12248 36536 41318 36762 1832
10845A832k0389R11J2845Q16m528l667q082K3138J3607k555r469m716k8912k1400
$$ 1832 -18557 -17646 -4801 -3985 -8513 -12180 -20262 2876 16483 13928 4459 -257 -29169 -50569
10831e0569P740N9837J7311j8820j4545k3099J1042k9669r060K37K2611K2985
$$ -50569 -42829 17008 34319 15499 954 -22145 -11103 -40772 -49832 -49595 -26984 -3999
10819c999K3138l591l367j4402j6571k88m642n660k1971r41L1321Q455k1761M764
$$ -3999 19139 15548 12181 -2221 -18792 -19080 -23722 -29382 -51353 -52294 -20973 -12518 -34279 -29515
10805b9515o803j3682R144L8105J7806K410k0654j5720j374j5835j782P009J8594
$$ -29515 -36318 -50000 -40856 -2751 15055 17465 -3189 -18909 -20283 -36118 -37900 -30891 -12297
10792a2297J6607j128k1412R280J2354Q50p131j652J1165p62L968j3886j7575
$$ -12297 4310 3182 -18230 -8950 3404 4254 -2877 -4529 6636 5874 9842 -4044 -21619
10779b1619K2339L590l3580k5089J8958J0452k5174j821N335K075n703k338k093
$$ -21619 720 4310 -29270 -54359 -35401 -24949 -50123 -51944 -46609 -44534 -50237 -52575 -54668
10766e4668N097q394J3023P563l395l037J4272K213j3266o264P126N743p519J1297
$$ -54668 -49571 -57965 -44942 -37379 -40774 -43811 -29539 -27326 -40592 -46856 -39730 -33987 -41506 -30209
10752c0209J5411k1959k0384J0567J9017J6840K0240K948k2939k8921j1884J910
$$ -30209 -14798 -36757 -57141 -46574 -27557 -10717 9523 12471 -10468 -39389 -51273 -49363
10740d9363K7069L897l6116J6357N254j2160k821Q215K3716K6078K1223J2338
$$ -49363 -22294 -18397 -54513 -38156 -32902 -45062 -47883 -39668 -15952 10126 31349 43687
10728D3687o239J2817q794j8837K951j0357j1868j035q150P609J3015M2199K6754
$$ 43687 37448 50265 41471 22634 25585 15228 3360 2325 -5825 1784 14799 56998 83752
10715H3752M974j7516j8767J9410J1147O144j3389j7192j0523q101K5379J1565
$$ 83752 88726 71210 52443 71853 83000 89144 75755 58563 48040 39939 65318 76883
10703G6883P826k621j0062p472J8944M993P57r593r975J244J8102k904R170J1673
$$ 76883 84709 82088 72026 64554 83498 88491 89248 79655 69680 70924 89026 86122 95292 106965
10689A06965j2884j7721Q96J1533L336P242m108l7654j7186l928K4894L4963k6296
$$ 106965 94081 76360 77256 88789 92125 99367 95259 57605 40419 36491 61385 96348 70052
10676G0052m5037K3467k895L234j2346Q705m734K0105l1503k8008K1076L2830
$$ 70052 25015 48482 45587 48821 36475 45180 40446 60551 29048 1040 22116 54946
10664E4946J4368J2915k2679L819K4194J3987Q007J9223k71r694M928r39p329
$$ 54946 69314 82229 59550 63369 87563 101550 109557 128780 128509 118815 123743 122804 115475
10651A15475K4299K9117N904j7427J3574J6391P69m418K3415J7103K5984O646
$$ 115475 139774 168891 174795 157368 170942 187333 188102 183684 207099 224202 250186 256832
10639B56832j154k62J3359O6965Q1226M8042M2231N8006Q2960P5204N6741R0639
$$ 256832 255678 255416 268775 335740 416966 465008 507239 565245 648205 723409 780150 870789
10627H70789R4081Q4960J10541J62481K34187L18205M53940O30158Q81369J164751
$$ 870789 964870 1049830 1160371 1322852 1557039 1875244 2329184 2959342 3840711 5005462
10617E005462J490970J808365J796481J423576P28793l8609n05996n11478j96646
$$ 5005462 6496432 8304797 10101278 11524854 12253647 12215038 11709042 11197564 11000918
10608A1000918L50204J041350J899330K799187L552287L580654K470026N88398
$$ 11000918 11351122 12392472 14291802 17090989 20643276 24223930 26693956 27282354
10600B7282354j313009k296883k185850j338357k26813J006094K368827L668302
$$ 27282354 25969345 23672462 21486612 20148255 19921442 20927536 23296363 26964665
10592B6964665M519780M228870K333046o56780l332081m493053m158894l031021
$$ 26964665 31484445 35713315 38046361 37389581 34057500 29564447 25405553 22374532
10584B2374532j717769m31985P73627J746686K335339K009379N70793j454435
$$ 22374532 20656763 20224778 20998405 22745091 25080430 27089809 27660602 26206167
10576B6206167l094812l664839l264632k377450j478393o90761p7422L66254N40719
$$ 26206167 23111355 19446516 16181884 13804434 12326041 11635280 11557858 11924112 12464831
10567A2464831L21717k99779j098369j641293j807854j662381j339868j022883
$$ 12464831 12786548 12486769 11388400 9747107 7939253 6276872 4937004 3914121
10559C914121p48558n61819l89035l31141k37379j96073j74936j31919r6162q8669
$$ 3914121 3165563 2603744 2214709 1883568 1646189 1450116 1275180 1143261 1047099 958430
10549I58430j11124r8910l9720k7337n8354m4358n1653l0011k4520k6636k6098
$$ 958430 847306 748396 708676 681339 622985 578627 526974 496963 472443 445807 419709
10538D19709k6612k1839l3987j9327m184k5024n662R873M488n585r225k5296j1248
$$ 419709 393097 371258 337271 317944 313760 288736 283074 292947 297435 291850 282625 257329 246081
10525B46081J0192j4265l7901k0048k667L361k9942j3416J4629L341j725J4407
$$ 246081 256273 242008 204107 184059 181392 184753 154811 141395 156024 159365 157640 172047
10513A72047j9398m855l585j3939J0870K17k0978j3277J0128j2222K997p644m291
$$ 172047 152649 147794 144209 130270 141140 141357 120379 107102 117230 105008 108005 100361 96070
10500I6070Q765N480j3566J4665m144L527m0694k0275J6730L0882j2559j6761
$$ 96070 104835 110315 96749 111414 107270 110797 70103 49828 66558 97440 84881 68120
10488F8120K3447J5447o952L714q276q401j8550J0542J1018o470l3562l8193j4571
$$ 68120 91567 107014 100062 103776 95500 87099 68549 79091 90109 83639 50077 11884 -2687
10475b687l805J6868J2862L607J5864K715k9315j446k3783P839R227j5008K4935
$$ -2687 -6492 10376 23238 26845 42709 45424 16109 14663 -9120 -1281 7946 -7062 17873
10462A7873Q046n95q051j959J794K1702L5276k811j1151k7569j4866K4097J5864
$$ 17873 25919 25324 17273 15314 17108 38810 74086 71275 60124 32555 17689 41786 57650
10449E7650k3054o226L4558L2683j7709j5054k5808N829L301R892K0601O320K6783
$$ 57650 34596 28370 62928 95611 77902 62848 37040 42869 46170 56062 76663 82983 109766
10436A09766K0804n501j5447k0279k4275m597K5276J2854o303j4169L704n439
$$ 109766 130570 125069 109622 89343 65068 60471 85747 98601 92298 78129 81833 76394
10424G6394j284k447P627k054k0489m1414p117R593O978J7768k0429k1675M798
$$ 76394 75110 72663 80290 78236 57747 16333 9216 18809 25787 43555 23126 1451 6249
10411F249n952K0295J4982o212J1795k368J1070J4193j8922j2550O962K685j940
$$ 6249 297 20592 35574 29362 41157 38789 49859 64052 45130 32580 39542 42227 40287
10398D0287J8848J2460k5345j6212P038J962J0288K994J4671q145k3048K2108
$$ 40287 59135 71595 46250 30038 37076 39038 49326 52320 66991 58846 35798 57906
10386E7906k637m1732k7301k3567J8144J7615O283j8975J0979K0344l43j8399
$$ 57906 55269 13537 -13764 -37331 -19187 -1572 4711 -14264 -3285 17059 16716 -1683
10374a683N198j3342L9081K7322j4454K1271J0325J4940j76k5327l2776M268k006
$$ -1683 3515 -9827 29254 56576 42122 63393 73718 88658 88482 63155 30379 34647 32641
10361C2641q293K7137o765k5370Q801Q402j4629j1022P004K1888Q838J1994J6542
$$ 32641 24348 51485 44720 19350 28151 36553 21924 10902 17906 39794 48632 60626 77168
10348G7168j0363k9896o354r35L5328j3934o445J2881J0805L112j8943l2176J04
$$ 77168 66805 36909 30555 29620 64948 51014 44569 57450 68255 71367 52424 20248 20352
10335B0352N880K2854O856J4230O754k842l264k391k4092m9683o119J8061J1529
$$ 20352 26232 49086 55942 70172 76926 74084 70820 68429 44337 -5346 -11465 6596 18125
10322A8125K5710J6427j7746j9965J6615K4858L319m3403J17J4725K5552O149
$$ 18125 43835 60262 42516 22551 39166 64024 67343 23940 24057 38782 64334 70483
10310G0483j7437N146p031k037k4436j8661J3916K2066k2106j1705K4975K397
$$ 70483 53046 58192 51161 49124 24688 6027 19943 42009 19903 8198 33173 35570
10298C5570k7719k2001J4562L4573K5249J3481j5400J6550l3757j4162j9187K5468
$$ 35570 7851 -14150 412 34985 60234 73715 58315 74865 41108 26946 7759 33227
10286C3227J9878l141j5800J3812k0113l4656L602N568K4896O897L901R944M060
$$ 33227 53105 49964 34164 47976 27863 -6793 -3191 2377 27273 34170 38071 48015 52075
10273E2075J6593r148j0289L5031J4877j4084J7466o230l660J749r501k1498J838
$$ 52075 68668 59520 49231 84262 99139 85055 102521 96291 92631 94380 84879 63381 65219
10260F5219L0934O3115P6307J11285J33447J69366J72488K27625K58894K20458
$$ 65219 96153 159268 235575 346860 480307 649673 822161 1049786 1308680 1529138
10250A529138J78644O1073r822j8838q6322j76950k16146k31915j90663j63060
$$ 1529138 1707782 1768855 1759033 1740195 1653873 1476923 1260777 1028862 838199 675139
10240F75139j57823j20959j22272p0987l3010k4821n217q095k2333m1930j6676
$$ 675139 517316 396357 274085 203098 170088 145267 140050 131955 109622 67692 51016
10229E1016j7351n832J3771J0109j9214j0340j6590K6102J1118k0328q840J7909
$$ 51016 33665 27833 41604 51713 32499 22159 5569 31671 42789 22461 13621 31530
10217C1530j2640j3000J1553M0286P13l0034j3418O467R042j0613o431K1525j9310
$$ 31530 18890 5890 17443 57729 58442 28408 14990 21457 30499 19886 13455 34980 15670
10204A5670j5050P756M9379L325k0387k6137J9707J6484j9645k1251k921k5888
$$ 15670 620 8376 57755 61080 40693 14556 34263 50747 31102 9851 6930 -18958
10192a8958J5207M112K0957n195j2227j6029j7787K9477J2805j2534m968J2945
$$ -18958 -3751 361 21318 16123 3896 -12133 -29920 -443 12362 -172 -5140 7805
10180G805K6020Q945M800P151p28J9635J32p572j4607J7763J0170K4943J9852
$$ 7805 33825 42770 47570 54721 53993 73628 73760 66188 51581 69344 79514 104457 124309
10167A24309Q109L4354K4014j9746o1244o326l07K63K0108J9183L7248L7793K5644
$$ 124309 132418 166772 190786 171040 109796 103470 103163 103426 123534 142717 179965 217758 243402
10154B43402J4672j7134j6442m5942l9340k0480j0733r726K6545L235J551J1685
$$ 243402 258074 240940 224498 178556 139216 118736 108003 98277 124822 128057 129608 141293
10142A41293J68j7305j4657k715l933l918Q27k3427k6892L53j189j0290K1347
$$ 141293 141461 124156 109499 106784 102851 98933 99760 76333 49441 49794 48605 38315 59662
10129E9662J9319J7647k0190j5912m217m54J2901m429r018J1831k4396j0869N367
$$ 59662 78981 96628 76438 60526 56309 55855 68756 64327 55309 67140 42744 31875 37242
10116C7242M396k766O470J1800N062n9448k5772K7089K5002Q475l5265K800K4861
$$ 37242 41638 38872 45342 57142 62204 2756 -23016 4073 29075 37550 2285 5085 29946
10103B9946L0707L5176m936l260j1492l0300j2268j069l101n39j2750k2568J616
$$ 29946 60653 95829 90893 87633 76141 45841 33573 32504 29403 28864 16114 -6454 -4838
10090d838N541j6904J7905J8231r944j3256K873K2025J7618j7547j189J0249l92
$$ -4838 703 -16201 1704 19935 9991 -3265 -392 21633 39251 21704 20515 30764 30372
10077C0372k2298p341L6779L530j1799j3103K0750L938J2568q778l6875j7258
$$ 30372 8074 733 37512 41042 29243 16140 36890 40828 53396 44618 7743 -9515
10065i515K1382n584K926L110l721m850j105n919J9535j5944k9021Q619K0341
$$ -9515 11867 6283 9209 12319 8598 3748 2643 -3276 16259 315 -28706 -20087 254
10052B54J7390J0893J997K211o926j9219j1052k2828O877p636P773J0554o499
$$ 254 17644 28537 30534 32745 25819 6600 -4452 -27280 -20403 -28039 -20266 -9712 -16211
10039a6211j5356J9158N468J8382K6713R826j611k1334l022m315M475j5341k3682
$$ -16211 -31567 -12409 -6941 11441 38154 47980 46369 25035 22013 17698 22173 6832 -16850
10026a6850N222p162J5769j578k438n478Q964r926j3164k560n036j1319J9255
$$ -16850 -11628 -18790 -3021 -4599 -7037 -12515 -3551 -13477 -26641 -29201 -34237 -45556 -26301
10013b6301K6602L0217N09m863M874r891P064j4217k2043j1266N444J9001j4843
$$ -26301 301 30518 31027 26164 31038 21147 28211 13994 -8049 -19315 -13871 5130 -9713
10000i713n363r739O14K1900o071N924J81j6605M585O796K6713R744j4610l4505
$$ -9713 -15076 -24815 -24201 -2301 -8372 -2448 -2267 -18872 -14287 -7491 19222 28966 14356 -20149
9986b0149j7287J3663K1409K8883p670r313l5596j2317j3876K0331Q442K4867
$$ -20149 -37436 -23773 -2364 26519 18849 9536 -26060 -38377 -52253 -31922 -23480 1387
9974A387R990j1715Q437j5740j7766K979l85l3165j7577M1714P690J4405j7228
$$ 1387 11377 -338 8099 -7641 -25407 -22428 -22813 -55978 -73555 -31841 -24151 -9746 -26974
9961b6974N261K8261K1931j3575k7200l067o267j6664L46k055o495J3280J5565
$$ -26974 -21713 6548 28479 14904 -12296 -15363 -21630 -38294 -37948 -40003 -46498 -33218 -17653
9948a7653J7835L2644j3595k1605j5283Q948P389K8451Q853l5784j6569j0983
$$ -17653 182 32826 19231 -2374 -17657 -8709 -1320 27131 35984 200 -16369 -27352
9936b7352j696K3051L389m466p473O078j2990m362J547K3935N3097K9371j74m4145
$$ -27352 -29048 -5997 -2608 -7074 -14547 -8469 -21459 -25821 -24274 -339 52758 82129 81955 37810
9922C7810n0426N587j3373J9939K9680n835K0260j2635k4969p878j536J545J1709
$$ 37810 -12616 -7029 -20402 -463 29217 23382 43642 31007 6038 -1840 -3376 -1831 9878
9909I878o555j2810n248J0475j721M134R317P771k3451k3234k0594k2162K741
$$ 9878 3323 -9487 -14735 -4260 -5981 -1847 7470 15241 -8210 -31444 -52038 -74200 -71459
9896g1459L6173K1826K4429j7975j9867J0578J5398J5328K308L306j57q436J6031
$$ -71459 -35286 -13460 10969 -7006 -26873 -16295 -897 14431 16739 20045 19888 11452 27483
9883B7483k260j1427L333K1310j078j4815k4318o36N140K175K2118m795l46o007
$$ 27483 25223 13796 17129 38439 37361 22546 -1772 -2408 2732 4907 27025 22230 21884 15877
9869A5877O627J9262P129k864l3298n196J2435R23o635j59j3756j8216o874K5909
$$ 15877 22504 41766 48895 46031 12733 7537 19972 20895 14260 14101 345 -17871 -24745 1164
9855A164L1209k9183j2674J715L751L925L393L6526J0284j2379l1154K1073J3990
$$ 1164 32373 3190 -9484 -7769 -4018 -93 3300 39826 50110 37731 6577 27650 41640
9842D1640k2747j5049p237k330M09J4695Q907M741P963J681R683k611o892j3975
$$ 41640 18893 3844 -3393 -5723 -5314 9381 18288 23029 30992 32673 42356 39745 32853 18878
9828A8878j2191L6994M0294J1328j5891J1782j4107k1303j7133N57J9599J8924
$$ 18878 6687 43681 83975 95303 79412 91194 77087 55784 38651 39208 58807 77731
9816G7731P145k4505j2854K6947j394M942K3138J0539L191m419j224J817n068
$$ 77731 84876 60371 47517 74464 73070 78012 101150 111689 114880 110461 109237 111054 105986
9803A05986j907J2800j9654l7336J0029M5173L0737k578l4069k2781j77J0361
$$ 105986 104079 116879 97225 59889 69918 115091 145828 143250 109181 86400 86223 96584
9791I6584P740k1932p58K5938J3868j1234N732J1925j0473n4581j4405J2814J7354
$$ 96584 104324 82392 81634 107572 121440 110206 115938 127863 117390 62809 48404 61218 78572
9778G8572O000J1751j4430r244K8788J4580k7299j4653k2850j7679J8462K1515
$$ 78572 84572 96323 81893 72649 101437 116017 88718 74065 51215 33536 51998 73513
9766G3513J929r154j321k9496k7345K4353l874J1147J036J0724m959l3926K566
$$ 73513 75442 66288 64967 35471 8126 32479 28605 39752 40788 51512 46553 12627 15193
9753A5193q820o541j9853L7118L7981N733j5885j0943l672j75K1293j3963J307
$$ 15193 6373 -168 -20021 17097 55078 60811 44926 33983 30311 30136 51429 37466 38773
9740C8773Q934q792j919M883p949p270k1659n339J4956J7304k0201j9312J9741
$$ 38773 47707 38915 36996 41879 33930 26660 5001 -338 14618 31922 11721 -7591 12150
9727A2150J9289J287O701k763O99R724j058l6512m643Q992J067Q735N873J6115
$$ 12150 31439 32726 39427 36664 37363 47087 46029 9517 4874 13866 14933 23668 29541 45656
9713D5656J2299k3734N171j669n817r619j9303l538q948O810R273K489O380j6976
$$ 45656 57955 34221 39392 37723 31906 22287 2984 -554 -9502 -2692 6581 9070 15450 -1526
9699a526J0275J2724O387K164k6493j2111k2698N285n43k0981O493K6754K6797
$$ -1526 8749 21473 27860 30024 3531 -8580 -31278 -25993 -26536 -47517 -41024 -14270 12527
9686A2527J3772R667J2725k8788j1823j4972m875p032J9205N2773P704l0370M545
$$ 12527 26299 35966 48691 19903 8080 -6892 -11767 -18799 406 53179 60883 30513 35058
9673C5058O265k6143j4919J3733j1224j0242J5502M713K49j691j2430R29m441
$$ 35058 41323 15180 261 13994 2770 -7472 8030 12743 12992 11301 -1129 -200 -4641
9660d641L559J9765J1404L27j2592k2151R505k524J181J2418K9820K0322J4702
$$ -4641 -1082 18683 30087 30414 17822 -4329 5176 2652 3833 16251 46071 66393 81095
9647H1095M2302Q2721J08617N6957k2907j13278j01033o5328k9027j7718j1739
$$ 81095 123397 206118 314735 371692 348785 235507 134474 69146 40119 22401 10662
9636A0662J8674l508j5118j935J4413J0121j1299m0005k331J9546L46p643J8252
$$ 10662 29336 25828 10710 8775 23188 33309 22010 -17995 -20326 -780 -434 -8077 10175
9623A0175j1928k8631M243K3594K1065L1958k6628j6542o054k0904J0000K4795
$$ 10175 -1753 -30384 -26141 -2547 18518 50476 23848 7306 1252 -19652 -9652 15143
9611A5143j881r530k1110j0193K3372K3324j5541q444p508L17P984J8468q760
$$ 15143 13262 3732 -17378 -27571 -4199 19125 3584 -4860 -12368 -12051 -4067 14401 5641
9598E641j498J0461J3109J7609j9291j3263j4807j6826M401Q21K1425r200j3460
$$ 5641 4143 14604 27713 45322 26031 12768 -2039 -18865 -14464 -13643 7782 -1418 -14878
9585a4878O409J1274j8851L094L4033O892l1780j8983p039K0497M692j8504P079
$$ -14878 -8469 2805 -16046 -12952 21081 27973 -3807 -22790 -29829 -9332 -4640 -23144 -16065
9572a6065r511M214K5218j981l4641M759K5584j0329m206K295l3075n453j7608
$$ -16065 -25576 -21362 3856 1875 -32766 -28007 -2423 -12752 -16958 -14663 -47738 -53191 -70799
9559g0799J4848r984o305J6622J9237j94j5579l485J2305j1268j0749J0780j318
$$ -70799 -55951 -65935 -72240 -55618 -36381 -36575 -52154 -55639 -43334 -54602 -65351 -54571 -55889
9546e5889m665k4090J3938L7870r869j473K8678Q676K2115r918P255j1821j699
$$ -55889 -60554 -84644 -70706 -32836 -42705 -44178 -15500 -6824 15291 5373 12628 807 -892
9533h92k2195R897O283J314J3819Q70l451J1687J4779n435o526n554k5188M929
$$ -892 -23087 -13190 -6907 -5593 8226 9096 5645 17332 32111 26676 20150 14596 -10592 -5663
9519e663J9539j1797k5257O43M570J4386J8057M815J397j839m319r8m647p874
$$ -5663 13876 2079 -23178 -22535 -17965 -3579 14478 19293 20690 18851 14532 14434 9787 1913
9505A913p025j4647j552K2184Q911N93J2248j5261j8938p855j4337j3052K9238
$$ 1913 -5112 -19759 -21311 873 9784 10377 22625 7364 -11574 -19429 -33766 -46818 -17580
9492a7580L4894J1100j8360j6494j5486J1917L2325J0867l428l467J0341q300
$$ -17580 17314 28414 10054 -6440 -21926 -10009 22316 33183 29755 26288 36629 28329
9480B8329l8334N659r339J019K1086J3570m082o508M199j6617l4954J0452K1753
$$ 28329 -10005 -4346 -13685 -12666 8420 21990 17908 11400 15599 -1018 -35972 -25520 -3767
9467c767K4041j0867j9842k7585K437J3166L2623L1239J4813r577l1203m7855
$$ -3767 20274 9407 -10435 -38020 -35583 -22417 10206 41445 56258 46681 15478 -32377
9455c2377m957J2314N32o959o267J8395k345R054P338N831J8031Q257j7397j9146
$$ -32377 -37334 -25020 -24488 -31447 -37714 -19319 -21664 -12610 -5272 559 18590 26847 9450 -9696
9441i696J6622J1436j5325l6j3758k5281N591K8785K5621j4512k972J265q134
$$ -9696 6926 18362 3037 3001 -10757 -36038 -30447 -1662 23959 9447 6475 7740 -394
9428c94p184m41J3670J4929K3461p438k1417k9388j5172K2372L774m775J0057
$$ -394 -7578 -8019 5651 20580 44041 36603 15186 -14202 -29374 -7002 -3228 -8003 2054
9415B054k9344K2981P971j3915J830R563K0564j1534l5112q209J683J3197J607
$$ 2054 -27290 -4309 3662 -10253 -8423 1140 21704 10170 -24942 -33151 -31468 -18271 -16664
9402a6664j336O61P637j1482j8289J7962J0632q821O590P20j3259j989J4401L2053
$$ -16664 -18000 -17339 -9702 -21184 -39473 -21511 -10879 -19700 -13110 -12390 -25649 -27638 -13237 18816
9388A8816j6360l1178J8131N830O578R042j6491k4959k4767K3139J2923k901j7404
$$ 18816 2456 -28722 -10591 -4761 1817 10859 -5632 -30591 -55358 -32219 -19296 -22197 -39601
9375c9601J7869J0610J3239l853j0286J3053j459P95N075p755j6427o722j0544
$$ -39601 -21732 -11122 2117 -1736 -12022 1031 -428 367 5442 -2313 -18740 -25462 -36006
9362c6006R976q732j407J2418j1863k076K4264P283J1706k440j7610l745j5937
$$ -36006 -26030 -34762 -36169 -23751 -35614 -37690 -13426 -6143 5563 3123 -14487 -18232 -34169
9349c4169o2m968J3327R593n253j5401k1282j103j7151R49J7649J4405J4772J6826
$$ -34169 -34231 -39199 -25872 -16279 -21532 -36933 -58215 -59318 -76469 -75520 -57871 -43466 -28694 -11868
9335a1868l30j918Q01J0911k960j1697j9265n725j3695j6199N998J5978L3384
$$ -11868 -12198 -14116 -13315 -2404 -5364 -17061 -36326 -42051 -55746 -71945 -65947 -49969 -16585
9322a6585J4404j2740j0171k771j214K8706n864q862K3617N866k480j3049J8589
$$ -16585 -2181 -14921 -25092 -27863 -29077 -371 -6235 -15097 8520 14386 11906 -1143 17446
9309A7446l376j3032j3085q077r029q485M3145J6519m767j4723J2949J1250q372
$$ 17446 14070 1038 -12047 -20124 -29153 -37638 5507 22026 17259 2536 15485 26735 18363
9296A8363j2802k3795J24k7911l2926J2963L3000Q524K0104K5113n637K823m5093
$$ 18363 5561 -18234 -18110 -46021 -78947 -65984 -32984 -24460 -4356 20757 15120 17943 -27150
9283b7150k8913m252J9008K4092j2445L812J4458l819n881L687j0515R93K1205
$$ -27150 -56063 -60315 -41307 -17215 -29660 -25848 -11390 -15209 -21090 -17403 -27918 -26925 -5720
9270e720O911m4936j8839j2249O28K9434j3029L729L2763L8883L274N317p582
$$ -5720 1191 -43745 -62584 -74833 -74205 -44771 -57800 -54071 -21308 17575 20849 26166 18584
9257A8584j6217K7710J5666Q40j4923k678k3571k0871j8750J5831R201k7395j5118
$$ 18584 2367 30077 45743 46583 31660 28982 5411 -15460 -34210 -18379 -9178 -36573 -51691
9244e1691K0334Q486j3302N268K5308J9383j7482j0195O457m651J6566P921m127
$$ -51691 -31357 -22871 -36173 -30905 -5597 13786 -3696 -13891 -7434 -12085 4481 12402 8275
9231H275P13J3720l195n9237l6317m221K2627K8000J4018J2839j2272j2751P851
$$ 8275 8988 22708 19513 -39724 -76041 -80262 -57635 -29635 -15617 -2778 -15050 -27801 -19950
9218a9950J9900K56l162o371j2887K925R220p61K2211J3659O305L231k5192k3076
$$ -19950 -50 206 -2956 -9327 -22214 -19289 -10069 -10830 11381 25040 31345 34576 9384 -13692
9204a3692j5220P843J0837j3916Q76K7414K3701n445l672r739J8877J7254l9547
$$ -13692 -28912 -21069 -10232 -24148 -23272 4142 27843 22398 18726 8987 27864 45118 5571
9191E571k7662j2257J5720L3311N268o797J2599r379N379j6790q564P700R933
$$ 5571 -22091 -34348 -18628 14683 19951 13154 25753 16374 21753 4963 -3601 4099 14032
9178A4032j6782j5777m164l483k202k2499q802L0815J5409P983j870P451k4064
$$ 14032 -2750 -18527 -22691 -26174 -28376 -50875 -59677 -28862 -13453 -5470 -7340 111 -23953
9165b3953m4J935L419K2878q134k4814P600Q346l363m083q9J3077J3742J4048
$$ -23953 -23997 -22062 -18643 4235 -3899 -28713 -21113 -12767 -16130 -20213 -20302 -7225 6517 20565
9151B0565J6031m165j1684l114J6686j2117j6372p484j2460O077M692J7934J301
$$ 20565 36596 32431 20747 17633 34319 22202 5830 -1654 -14114 -8037 -3345 14589 15890
9138A5890o323J4809k79l8852l6446J4412N654M595l1165k0035J1186Q445K7643
$$ 15890 9567 24376 24097 -14755 -51201 -36789 -31135 -26540 -57705 -77740 -66554 -58109 -30466
9125c0466J9133J2386K1218M22j2956r311j3830N620j3123N059O139j2928O746
$$ -30466 -11333 1053 22271 22693 9737 426 -13404 -7784 -20907 -15848 -9709 -22637 -15891
9112a5891K7048J9793j3992j7334n572J2057J4499j1674k6817r502J3743j165
$$ -15891 11157 30950 16958 -376 -5948 6109 20608 8934 -17883 -27385 -13642 -14807
9100a4807j316M404O705l0018m627J4000K390J0637j2176q362J584J1315l294
$$ -14807 -16123 -11719 -5014 -35032 -39659 -25659 -23269 -12632 -24808 -33170 -31586 -20271 -23565
9087b3565K1135j6724n386j3218n153J0498j0613k1545q326R764R097J2122J7827
$$ -23565 -2430 -19154 -24540 -37758 -42911 -32413 -43026 -64571 -72897 -63133 -54036 -41914 -24087
9074b4087n494l0481M38o62k326J9669K142K2375j0385p894J9114k039P603P000
$$ -24087 -29581 -60062 -59624 -60286 -62612 -42943 -40801 -18426 -28811 -36705 -17591 -19630 -12027 -5027
9060e027K0086j3382r986j582l878J9282L8370J905j2950j4859o721R025k0237
$$ -5027 15059 1677 -8309 -9891 -13769 5513 43883 45788 32838 17979 11258 20283 46
9047D6l8692J993L5560K7161J554k9100Q053J8552R604p306k2865j1058k424k442
$$ 46 -38646 -36653 -1093 26068 27622 -1478 6575 25127 34731 27425 4560 -6498 -8922 -11364
9033a1364N597j361l444o510P02K119j2699l58J5773m847l104j0298R791J0820
$$ -11364 -5767 -7128 -10572 -17082 -16380 -14261 -26960 -27318 -11545 -16392 -19496 -29794 -20003 -9183
9019i183p009J0392J0694r428j4662k7572Q853K3986J1737Q222j945n397J41q304
$$ -9183 -16192 -5800 4894 -4534 -19196 -46768 -37915 -13929 -2192 6030 4085 -1312 -1171 -9475
9005i475M271o254K789L2983J5392n006R382k5884j5013J9413n39N477k3395k0464
$$ -9475 -5204 -11458 -8669 24314 39706 34700 44082 18198 3185 22598 22059 27536 4141 -16323
8991a6323L174j5513j326j3573L6570L1714l4092k8034j9015M425k680P300L18
$$ -16323 -13149 -28662 -29988 -43561 -6991 24723 -9369 -37403 -56418 -51993 -54673 -47373 -47055
8978d7055L1118J5581J02j006O142L369l704j1108l27J9848M91q497J0991M970
$$ -47055 -15937 -356 -254 -1260 4882 8251 4547 -6561 -6888 12960 13451 4954 15945 20915
8964B0915J0317Q569o822P545j0258j4145J532K2395q144j9755L591J509n934
$$ 20915 31232 39801 32979 40524 30266 16121 17653 40048 31904 12149 15740 17249 11315
8951A1315J955m215j0855p355j58J5999P63r690J1002j7229O946j0300N660O455
$$ 11315 13270 9055 -1800 -9155 -9313 6686 7449 -2241 8761 -8468 -1522 -11822 -6162 293
8937B93l678n726k1077J2842K1119P590l7543k317L75J8283J4436K039J5253j0386
$$ 293 -3385 -9111 -30188 -17346 3773 11363 -26180 -28497 -28122 -9839 4597 6636 21889 11503
8923A1503Q032n086j9770P533j311J3246r799j8788o231n73J3716j7797k8783
$$ 11503 19535 14449 -5321 2212 901 14147 4348 -14440 -20671 -21244 -7528 -25325 -54108
8910e4108k4242J5207K1769K4505K78J1327p207M495m03J9735K2867N676l1570
$$ -54108 -78350 -63143 -41374 -16869 -16591 -5264 -12471 -7976 -8379 11356 34223 39899 8329
8897H329j9185j2660K2951J0407Q077J9151O549n067k4621j5192J632j1562L79
$$ 8329 -10856 -23516 -565 9842 17919 37070 43619 38552 13931 -1261 371 -11191 -10812
8884a0812M488L242m264L2440J254p778O659P364k1151j88o182j1459K148n016
$$ -10812 -6324 -3082 -7346 25094 26348 18570 25229 32593 11442 11254 5072 -6387 -4239 -9255
8870i255j415j893j7866r726j8242j6127M336J5737K1839P702K1527J2089j5392
$$ -9255 -10670 -12563 -30429 -40155 -58397 -74524 -70188 -54451 -32612 -24910 -3383 8706 -6686
8857f686q784J3406P516L842O380L5130j7252J5385K2828J9268R946j3840l8476
$$ -6686 -15470 -2064 5452 9294 15674 50804 33552 48937 71765 91033 100979 87139 48663
8844D8663j4223m815j6904j1028k2077L656k606K1550K8613K506l0689j7009K2068
$$ 48663 34440 29625 12721 1693 -20384 -16728 -19334 2216 30829 33335 2646 -14363 7705
8831G705L8654M8357K321j3504M426K088j9697k8688j4908J1190K7783q196j5083
$$ 7705 46359 94716 97037 83533 87959 90047 70350 41662 26754 37944 65727 57531 42448
8818D2448m18J6810J8216j926k8823K583Q103k4000R333m467J8185K0752Q855
$$ 42448 42030 58840 77056 75130 46307 48890 56993 32993 42326 37859 56044 76796 85651
8805H5651q529K248K1898r425p443k9474j4275j0407k117j501j8487j9870Q123
$$ 85651 77122 79370 101268 91843 84400 54926 40651 30244 28127 26626 8139 -11731 -3608
8792c608J8409L341J5590K4981K1375N848L1847M9604K8490M97l6790m1383j9068
$$ -3608 14801 18142 33732 58713 80088 85936 117783 167387 195877 196374 159584 118201 99133
8779I9133k5511n3037k2813l7532j728J9837J244j3624J6843K2670o048j6138
$$ 99133 73622 20585 -2228 -39760 -41488 -21651 -20407 -34031 -17188 5482 -566 -16704
8767a6704R624N926j4821r096J2437J9635L0901K3388j3530l2999k8957K2082
$$ -16704 -7080 -1154 -15975 -25071 -12634 7001 37902 61290 47760 14761 -14196 7886
8755G886m4m4204o126L8869K536j4060R178J1070j0322O803P312L63J8536K1957
$$ 7886 7842 -36362 -42488 -3619 -1083 -15143 -5965 5105 -5217 1586 8898 9261 27797 49754
8741D9754J8674j2262j0708k5392m5781k2986K469k32R690K6011m99n099j0446
$$ 49754 68428 56166 45458 20066 -25715 -48701 -46232 -46464 -36774 -10763 -11262 -16361 -26807
8728b6807j0294K4633J5773j4626j8227L0607L7245O041k5687k6099K1401J1843
$$ -26807 -37101 -12468 3305 -11321 -29548 1059 38304 44345 18658 -7441 13960 25803
8716B5803o020L526j5221k2748n855j934l178o65J2875O936K7317J0909N5K7475
$$ 25803 19783 23309 8088 -14660 -20515 -22449 -25627 -26292 -13417 -6481 20836 31745 31800 59275
8702E9275n376l2262p513q593l220J0296m907j938m352J0554r825o365L5556M503
$$ 59275 53899 21637 14124 5531 2311 12607 7700 5762 1410 11964 2139 -4226 31330 35833
8688C5833j3135j3085J7746j0531J7086k705j4246J8620J3789n274j6319j5290
$$ 35833 22698 9613 27359 16828 33914 31209 16963 35583 49372 44098 27779 12489
8676A2489p714j8478K1251p347J0276K772j3191k6485j7363L806K3776J7662m575
$$ 12489 4775 -13703 7548 201 10477 13249 58 -26427 -43790 -39984 -16208 1454 -3121
8663c121K0788J4084k1790k5258K7010K3135P268j7694k3674P42p241j297o370
$$ -3121 17667 31751 9961 -15297 11713 34848 42116 24422 748 1490 -5751 -7048 -13418
8650a3418Q309k5266j0347J1891J1155J4317K0393O348l593r876O006r903M871
$$ -13418 -5109 -30375 -40722 -28831 -17676 -3359 17034 23382 19789 9913 15919 6016 10887
8637A0887J606j8885Q136j5488j1001N729p784J3095K1593J549j7696q957l181
$$ 10887 12493 -6392 1744 -13744 -24745 -19016 -26800 -13705 7888 9437 -8259 -17216 -20397
8624b0397N245O198K0173j6895j8386o371k3584K3259L7889m281j3055j0616K137
$$ -20397 -15152 -8954 11219 -5676 -24062 -30433 -54017 -30758 7131 2850 -10205 -20821 -18684
8611a8684N478j8280j4455K0652J1604j7159O291K8695J4946O321j5524m557j1501
$$ -18684 -13206 -31486 -45941 -25289 -13685 -30844 -24553 4142 19088 25409 9885 5328 -6173
8598f173J384J6026M1486L489l2728j9773R409J5038j0528k7413k4637J1358J7050
$$ -6173 -4789 11237 52723 56212 23484 3711 13120 28158 17630 -9783 -34420 -23062 -6012
8585f012K7476J4201J8602J5481N524p747j0840K1115K4239q455j260J7766L947
$$ -6012 21464 35665 54267 69748 75272 67525 56685 77800 102039 93584 92324 110090 114037
8572A14037L7097N5759Q7237J16931J08062K0228p4325j37579j04799l3104j2768
$$ 114037 151134 206893 294130 411061 519123 539351 465026 327447 222648 189544 176776
8561A76776k1917j8345m47l3055q725N326n3691l5864m908K2168K3434m083P270
$$ 176776 154859 136514 136067 103012 94287 99613 45922 10058 5150 27318 50752 46669 53939
8548E3939K1093k1064j4299R910K0118o69j1132j1302O021J5038k1418l2165r350
$$ 53939 75032 53968 39669 49579 69697 69028 57896 46594 52615 67653 46235 14070 4720
8535D720j516m14n236K022M471Q667L3631L5332M2044Q4983M2915J05194Q0655
$$ 4720 3204 2790 -2446 -424 4047 12714 46345 81677 123721 208704 251619 356813 437468
8522D37468m4975j16942r5204q4021n1070m4064J0623L4985o206m198j4558K5638
$$ 437468 392493 275551 180347 96326 45256 1192 11815 46800 40594 36396 21838 47476
8510D7476l4475o138O489k274j2656p635j2422j393J2073j249J1255L942J9076
$$ 47476 13001 6863 13352 11078 -1578 -9213 -21635 -23028 -10955 -12204 -949 2993 22069
8497B2069j099k0595j9206J7997J5418j5075j3157K260N298M484J759r786j2976
$$ 22069 20970 375 -18831 -834 14584 -491 -13648 -11388 -6090 -1606 153 -9633 -22609
8484b2609K5132K0641r03n157M20R468j15m933r861l9914N687K4014K3186k1813
$$ -22609 2523 23164 22261 17104 17524 26992 26877 21944 12083 -27831 -22144 1870 25056 3243
8470C243k2066K942L4586Q829j6732l257K0208J5995j4305Q826Q132j8987k3508
$$ 3243 -18823 -15881 18705 27534 10802 7545 27753 43748 29443 38269 46401 27414 3906
8457C906n341K1689J7853q651Q852m60l1600n0877L097L0498N3369k091l1707
$$ 3906 -1435 20254 38107 29456 38308 37848 6248 -44629 -41532 -11034 42335 40244 8537
8444H537J5627J4184M196J193J492k4055j3753n88P706j1943J1674K3516j2297
$$ 8537 24164 38348 42544 43737 45229 21174 7421 6833 14539 2596 14270 37786 25489
8431B5489k9543j3287P45J8587L3630J459k8748N64k986m748l525o796Q310J8890
$$ 25489 -4054 -17341 -16596 1991 35621 37080 8332 8896 5910 1162 -2363 -9159 -849 18041
8417A8041J4744j2504l956l5229m907L4051K2974N47K132k096M5142M1405K3964
$$ 18041 32785 20281 16325 -18904 -23811 10240 33214 33761 35893 33797 78939 120344 144308
8404A44308P076M438k0351m9821k5106k6143j2622l0269p053K1094l142k1548
$$ 144308 151384 155822 135471 85650 60544 34401 21779 -8490 -15543 5551 2409 -19139
8392a9139n08J543K0220Q807r440M792J8756O829j0382k970M192J5774J5620q350
$$ -19139 -19647 -18104 2116 10923 1483 6275 25031 31860 21478 18508 22700 38474 54094 45744
8378D5744j5457l1309o267Q705J1679k7061r144J7748J9923L0559K446j8259l2184
$$ 45744 30287 -1022 -7289 1416 13095 -13966 -23110 -5362 14561 45120 47566 29307 -2877
8365b877N01L6635M8568K8343L0463m178l0802m0804l9069q533J816J0472n942
$$ -2877 -2376 34259 82827 111170 141633 137455 106653 65849 26780 18247 20063 30535 24593
8352B4593j6150J6645J6684p664k4177k4905L091p806n303O313k6799J1014l030
$$ 24593 8443 25088 41772 34108 9931 -14974 -11883 -19689 -24992 -18679 -45478 -34464 -37494
8339c7494j2178J6812J9220K3614o693j7762k960j5702j6468O606L2856J9398
$$ -37494 -49672 -32860 -13640 9974 3281 -14481 -17441 -33143 -49611 -43005 -10149 9249
8327I249j5991j0494K2055p120j6513M056K1681k2785j0896j6393j1119R080K8441
$$ 9249 -6742 -17236 4819 -2301 -18814 -14758 6923 -15862 -26758 -43151 -54270 -45190 -16749
8314a6749J3944J9244k5098q590K4712N519o458M839k430j3993M351O129r545
$$ -16749 -2805 16439 -8659 -17249 7463 12982 6524 11363 8933 -5060 -709 5420 -4125
8301d125m382q710N690r018m993J2906K011N569J516L696R455J21j1570l1746
$$ -4125 -8507 -17217 -11527 -20545 -25538 -12632 -10621 -5052 -3536 160 9615 9736 -1834 -33580
8287c3580n702Q344J9311O395R16K806j790j2596j5450R577L3918M958r055Q915
$$ -33580 -39282 -30938 -11627 -5232 -4316 -1510 -3300 -15896 -31346 -21769 12149 17107 8052 16967
8273A6967l3903r619Q370K1847J1007P695l4560l0485n086J6417p655Q381j8974
$$ 16967 -16936 -26555 -18185 3662 14669 22364 -12196 -42681 -47767 -31350 -39005 -30624 -49598
8260d9598j935lo404n468P337K7978J4662j6917j2452J6409P007o874J918J907
$$ -49598 -51533 -51536 -57940 -63408 -56071 -28093 -13431 -30348 -42800 -26391 -19384 -26258 -24340 -22433
8246b2433p670J6818J1144J0652l0704k3501J3590L5910j9608j5743n42R517K5488
$$ -22433 -30103 -13285 -2141 8511 -22193 -45694 -32104 3806 -15802 -31545 -32087 -22570 2918
8233B918O985j238L9245n229l3615k0920j7601m161L559J6754J1843r169O54k4367
$$ 2918 9903 8665 47910 42681 9066 -11854 -29455 -33616 -30057 -13303 -1460 -10629 -9975 -34342
8219c4342K8499J9572j2066l718K3472j7929k0208J3594q795l227J0721j7373
$$ -34342 -5843 13729 1663 -2055 21417 3488 -16720 -3126 -11921 -15148 -4427 -21800
8207b1800j1431l740q178Q722J4778K7489j7714o890N794L9299k155l0149O05
$$ -21800 -33231 -36971 -45149 -36427 -21649 5840 -11874 -18764 -12970 26329 24174 -5975 -5370
8194e370K1719M94J2108J4395j3243n885r272m225k503K623j6867k016m334r79
$$ -5370 16349 16843 28951 43346 30103 24218 14946 10721 8218 10841 -6026 -8042 -12376 -13355
8180a3355J2606p72q758j417M181P643l822k5831J4256j1973j0438K9522J7212
$$ -13355 -749 -1521 -10279 -11696 -7515 128 -3694 -29525 -15269 -27242 -37680 -8158 9054
8167I054K6589J2433r314j222J5035j18k2253R336N746j2366K596N772L855J446
$$ 9054 35643 48076 38762 37540 52575 52457 30204 39540 45286 32920 35516 41288 45143 46589
8153D6589J5292L20P520o778j6791M122k1476j481J6607J0979K3770J8689N768
$$ 46589 61881 62201 69721 62943 46152 50274 28798 27317 43924 54903 78673 97362 103130
8140A03130r160J397J3136r00l5040j6810K7300j7683k7707k5721L935j001j8359
$$ 103130 93970 95367 108503 107603 72563 55753 83053 65370 37663 11942 15877 14876 -3483
8127c483K2023J4900m890R91j831j2653j4169O268p878k4431k630r588p413K6149
$$ -3483 18540 33440 28550 29541 27710 15057 888 7156 -722 -25153 -27783 -37371 -44784 -18635
8113a8635P278Q340Q58J2262j648O120n575J2912J4223L854J6164K3585j682Q602
$$ -18635 -11357 -3017 -2159 10103 8455 14575 9000 21912 36135 39989 56153 79738 78056 86658
8099H6658J5775J5979K3520j02l6443l5807j335M530m97J3855k8086j4668r74
$$ 86658 102433 118412 141932 141830 105387 69580 68245 72775 72278 86133 58047 43379 42405
8086D2405l097j0656k9145q73K7858J7757j3053m4411o476J8038l621J7245P015
$$ 42405 39308 28652 -493 -1366 26492 44249 31196 -13215 -19691 -1653 -5274 11971 18986
8073A8986j0152r440j8759k1653k0082j5631J3991J4706J7357J1589p933P88k905
$$ 18986 8834 -606 -19365 -41018 -61100 -76731 -62740 -48034 -30677 -19088 -27021 -26233 -29138
8060b9138j7380J851J7166K363m308J5345n246j9269k1124K9477J7214j7439o597
$$ -29138 -46518 -44667 -27501 -25138 -29446 -14101 -19347 -38616 -59740 -30263 -13049 -30488 -37085
8047c7085k492j0105J0793L5788J1164p749k8515N992J429J0014M389r148l007
$$ -37085 -39577 -49682 -38889 -3101 8063 314 -28201 -22209 -20780 -10766 -6377 -15525 -18532
8034a8532J3224R86n960j0520R311J2840J5224J2730k6301j3308j3171J4155J8581
$$ -18532 -5308 -4322 -10282 -20802 -11491 1349 16573 29303 3002 -10306 -23477 -9322 9259
8021I259k2135N261j4771j0496l168P272l39J1541J2912j067m904K0655R141J188
$$ 9259 -12876 -7615 -22386 -32882 -36050 -28778 -29117 -17576 -4664 -5731 -10635 10020 19161 20349
8007B0349o252o175Q243K0708k2916j6822J1811J444L208l204M509J2698M1948
$$ 20349 14097 7922 16165 36873 13957 -2865 8946 10390 13598 10394 14903 27601 69549
7994F9549J7240Q188q7n894K7485K1981K520J8709m306l5841j2905J4436l4070
$$ 69549 86789 94977 94890 88996 116481 138462 140982 159691 155385 119544 106639 121075 87005
7981H7005n5619j5357J6559K8542O169L032j2428j624Q076o902j0348O407L7432
$$ 87005 31386 16029 32588 61130 67299 70331 57903 56279 64355 57453 47105 53512 90944
7968I0944P380L549R053L4236M737l0937j7473j7465q920J2044N180l393L245
$$ 90944 98324 101873 110926 145162 149899 118962 101489 84024 75104 87148 92328 88935 92180
7955I2180J0413O140N163J5808r668j6539j0068k3334J1712J2202J4481j4056
$$ 92180 102593 108733 113896 129704 120036 103497 93429 70095 81807 94009 108490 94434
7943I4434j6525n754J5590J047J6772O483J631n760k7319J6580j2561n0459j7264
$$ 94434 77909 72155 87745 88792 105564 112047 113678 107918 80599 97179 84618 34159 16895
7930A6895M006P168j424J0181r077k1348J2844M4885J4259j8878j2221m137l632
$$ 16895 20901 28069 26645 36826 27749 6401 19245 64130 78389 59511 47290 43153 39521
7917C9521m558O92K1171J2047J3430l3592j5849j6240k8071J7332O842m59Q019
$$ 39521 34963 35655 56826 68873 82303 48711 32862 16622 -11449 5883 12725 12266 20285
7904B0285K4434J5998j647j3750k85r261j342k2019j5364K800J4626m322R068
$$ 20285 44719 60717 59070 45320 45035 35774 34432 12413 -2951 -151 14475 10153 19221
7891A9221K1925K51l1156n125j6835j4413L1706J4531J6331j9732k4523J4748
$$ 19221 41146 41397 10241 5116 -11719 -26132 5574 20105 36436 16704 -7819 6929
7879F929K9351K2736k120k399k7924j6088k480q424k8320j8498j524M6910J9541
$$ 6929 36280 59016 56896 54497 26573 10485 8005 -419 -28739 -47237 -48761 -1851 17690
7866A7690j297j3460j0703j043o442n396k7301l1765K7987L7694n408p569J83
$$ 17690 16393 2933 -7770 -8813 -15255 -20651 -47952 -79717 -51730 -14036 -19444 -27013 -26830
7853b6830p823J1359J220P547m298p638P199L243j5707l1640N090L6130P990l4566
$$ -26830 -34653 -23294 -22074 -14527 -18825 -26463 -19264 -16021 -31728 -63368 -58278 -22148 -14158 -48724
7839d8724n355K0557K7987J6814k4033M905K0490j03K479Q01k4136l1526K1096
$$ -48724 -54079 -33522 -5535 11279 -12754 -7849 12641 12538 15017 15818 -8318 -39844 -18748
7826a8748Q614o155Q828k556Q101K0392r115k5447J3061O987j7238l839J6129
$$ -18748 -10134 -16289 -7461 -10017 -1916 18476 9361 -16086 -3025 3962 -13276 -17115 -986
7813i86P094j2251K1856Q818j4659k586P089j8656k6973r090p859J5969P294M798
$$ -986 6108 -6143 15713 24531 9872 7286 14375 -4281 -31254 -40344 -48203 -32234 -24940 -20142
7799b0142O651p131j882j0192J7114o863J4346J0841N663j4555j0828L1351K2230
$$ -20142 -13491 -20622 -22504 -32696 -15582 -22445 -8099 2742 8405 -6150 -16978 14373 36603
7786C6603k1326j4885k3760j2303K0798J2180J3909j1897l1136j567r349k434
$$ 36603 15277 392 -23368 -35671 -14873 -2693 11216 -681 -31817 -33384 -42733 -45167
7774d5167j7282m338J452J8966P168J4347R15J7337k499j455J7577j4421j5763
$$ -45167 -62449 -66787 -65335 -46369 -39201 -24854 -23939 -6602 -9101 -10556 7021 -7400 -23163
7761b3163J2946l5671l8389P299K6200j2595N895K3224J4639m75L939J9988J3252
$$ -23163 -10217 -45888 -84277 -76978 -50778 -63373 -57478 -34254 -19615 -20090 -16151 3837 17089
7748A7089l6323k0662j3487J3202j2773l965J2788J9100M2537K904k6746J1755
$$ 17089 -19234 -39896 -53383 -40181 -52954 -56919 -44131 -25031 17506 20410 -6336 5419
7736E419J5195J164k7346q476m529o868k5170Q686J5578R336O816Q091Q715K445
$$ 5419 20614 21778 -5568 -14044 -18573 -25441 -50611 -41925 -26347 -17011 -10195 -2104 6611 9056
7722I056j5922j768k5263L074j5832j708K6297L566M018j3725j7132J1395O820
$$ 9056 -6866 -8634 -33897 -30823 -46655 -48363 -22066 -18500 -14482 -28207 -45339 -33944 -27124
7709b7124J1836M932o493K5622J0115k249l028J6662j228j5152m976J2420j257
$$ -27124 -15288 -10356 -16849 8773 18888 16639 13611 30273 29045 13893 8917 21337 20080
7696B0080k462P727j0711j4525m906k5725J1011p406K3305R244O765j8321L21
$$ 20080 17618 25345 14634 109 -4797 -30522 -19511 -26917 -3612 5632 12397 -5924 -5603
7683e603O600K1675k340k3238K247L7207j5121o673o538j9434m481J0049K9542
$$ -5603 997 22672 20332 -2906 -659 36548 21427 14754 8216 -11218 -15699 -5650 23892
7670B3892k1474j7802p524j1625J2404j2638j3165K050P970K7157m406j9576m171
$$ 23892 2418 -15384 -22908 -34533 -22129 -34767 -47932 -45882 -37912 -10755 -15161 -34737 -38908
7657c8908J3232L0246L1476J5232r307j9759j8572j1609j7373N789L3293J0053
$$ -38908 -25676 4570 36046 51278 41971 22212 3640 -7969 -25342 -19553 13740 23793
7645B3793k6024k7129J5923j6686r369j2475L2770J247j4651Q098K1042J5855
$$ 23793 -2231 -29360 -13437 -30123 -39492 -51967 -19197 -17950 -32601 -24503 -3461 12394
7633A2394l660N235j3768O270q928J1149K6804l154j8752k9143K1718r426p712
$$ 12394 8734 13969 201 6471 -2457 8692 35496 32342 13590 -15553 6165 -3261 -10973
7620a0973P12l989K2525o369k9157k91j5895K9614q433j6712l783J3895L1449
$$ -10973 -10261 -14250 8275 1906 -27251 -27542 -43437 -13823 -22256 -38968 -42751 -28856 2593
7607B593J2244l4446j8719K042j1K921Q731J2624O037j5194n918K5800N357j1586
$$ 2593 14837 -19609 -38328 -36286 -36297 -33376 -24645 -12021 -5984 -21178 -27096 -1296 4061 -7525
7593g525o818o103m105M548j3665R049J5562j0671l3313j7954L4695K2528M743
$$ -7525 -14343 -20446 -24551 -20003 -33668 -24619 -9057 -19728 -53041 -70995 -36300 -13772 -9029
7580i029P639n049J967L0821p441o131j6506K3986J0400j6158J917p248j4552
$$ -9029 -1390 -6439 -4472 26349 18908 12777 -3729 20257 30657 14499 16416 9168 -5384
7567e384M511j236j3773K751R434j4849k2094P107J781J4473p789k0715J4764
$$ -5384 -873 -2109 -15882 -13131 -3697 -18546 -40640 -33533 -31752 -17279 -25068 -45783 -31019
7554c1019q81l328L0584K8029n121r299r371m414o525p810J5332j295j6338J1833
$$ -31019 -31900 -35228 -4644 23385 18264 8965 -406 -4820 -11345 -19155 -3823 -5118 -21456 -9623
7540i623J739m3L083j4097r94n97j8529J1808L7343J5307j5599j733p747L598
$$ -9623 -7884 -7927 -4844 -18941 -19935 -20532 -39061 -27253 10090 25397 9798 8065 318 3916
7526C916J3233J3214l275m832k4465J964k4665p871p356m294J9016K2195m644
$$ 3916 17149 30363 27088 22256 -2209 -245 -24910 -32781 -40137 -44431 -25415 -3220 -7864
7513g864j3460J478l062j1981R314j414k36n199K1J6599K0083J3138M02L515o237
$$ -7864 -21324 -19846 -22908 -34889 -25575 -26989 -27225 -32424 -32403 -15804 4279 17417 17819 21334 15097
7498A5097p969j1023k6400j2602K9910L1230O124K2785j1555j0763k846J8483
$$ 15097 7128 -3895 -30295 -42897 -12987 18243 24367 47152 35597 24834 21988 40471
7486D0471q141l379j5897j5034k482m92k0805j375m236j1784Q522K1967J7720
$$ 40471 32330 28951 13054 -1980 -4462 -4954 -25759 -27134 -31370 -43154 -34632 -12665 5055
7473E055J3087k3649k3228M069K4854J8010k6890k4090J3988K1004l6067j517
$$ 5055 18142 -5507 -28735 -24666 188 18198 -8692 -32782 -18794 2210 -33857 -35374
7461c5374J422Q840j5080N290R832K9764J2443j5086J1929J4029J4727l294q722
$$ -35374 -33952 -25112 -40192 -34902 -25070 4694 17137 2051 13980 28009 42736 39442 30720
7448C0720q631j1956j51J270o115j4548l3092j7145k425P651K0621j5984r818
$$ 30720 22089 10133 9982 11252 5137 -9411 -42503 -59648 -62073 -54422 -33801 -49785 -59603
7435e9603K8956j1777q591K0393K2190Q358O464k4326j7125N383M839j2139N184
$$ -59603 -30647 -42424 -51015 -30622 -8432 -74 6390 -17936 -35061 -29678 -24839 -36978 -31794
7422c1794O037K0437J1898Q487j1589l9734j0134o877L784K4369J0287o669m0010
$$ -31794 -25757 -5320 6578 15065 3476 -36258 -46392 -53269 -49485 -25116 -14829 -21498 -61508
7409f1508j2856j3954J4430K1002L5055K1058j3264j8538j3572q34l078k855m552
$$ -61508 -74364 -88318 -73888 -52886 -17831 3227 -10037 -28575 -42147 -42981 -46059 -48914 -53466
7396e3466J3990J2259l0918l2286k040K3999M351J4920m053M026K8960j4736l4815
$$ -53466 -39476 -27217 -58135 -90421 -92461 -68462 -64111 -49191 -53244 -49218 -20258 -34994 -69809
7383f9809J4018N820k07L462p217K4751J8056j9565Q478L8721q154q186k594J3802
$$ -69809 -55791 -49971 -50178 -46716 -53933 -29182 -11126 -30691 -22213 16508 8354 168 -2426 11376
7369A1376q227o42M104L58Q792K1275L157J020l041j9217k2489j9105L268j9155
$$ 11376 3149 2507 6611 6969 15761 37036 40193 41213 38172 18955 -3534 -22639 -19371 -38526
7355c8526J4061Q304M686J6084M87q399J0833k923K2801k783o579J6128K210J7403
$$ -38526 -24465 -16161 -11475 4609 5096 -3303 7530 4607 27408 24625 18046 34174 36384 53787
7341E3787j8683l526j5232j0943K2644j4436p165l745J2711m056j2057N025j8046
$$ 53787 35104 31578 16346 5403 28047 13611 6446 2701 15412 11356 -701 4324 -13722
7328a3722l1017O246L7361m18j1496j4669j1164J0157j8817J0589K6419K5525
$$ -13722 -44739 -38493 -1132 -1550 -13046 -27715 -38879 -28722 -47539 -36950 -10531 14994
7316A4994J0144O018j5148J610J2134j132p599m001P565L3822k6694n0137j8276
$$ 14994 25138 31156 16008 17618 29752 28620 21021 17020 24585 58407 31713 -18424 -36700
7303c6700k2149K382P960j7065k0504K4844L3603j5483r04L9385J791k0105j7918
$$ -36700 -58849 -56467 -48507 -65572 -86076 -61232 -27629 -43112 -44016 -4631 -2840 -22945 -40863
7290d0863L121J3441j1208r025J336J6022J3002J5571R0r329l1088l213O279Q180
$$ -40863 -37742 -24301 -35509 -44534 -43198 -27176 -14174 1397 1487 -7842 -38930 -42143 -35864 -27684
7276b7684l093R271O492O493l4722k6027R031L0682J8435M337L9037J751l5804
$$ -27684 -30777 -21506 -15014 -8521 -43243 -69270 -60239 -29557 -11122 -6785 32252 34003 -1801
7263a801j3989n032J308n640J6223J8776k7416j2632R736Q773m059K506K2417
$$ -1801 -15790 -20822 -19514 -25154 -8931 9845 -17571 -30203 -20467 -11694 -15753 -13247 9170
7250I170J2597q191K404j309p270m977M93K432n732k8223p69j7334J1552K3093
$$ 9170 21767 13576 15980 14671 7401 2424 2917 5349 -383 -28606 -29375 -46709 -35157 -12064
7236a2064K154J2081N436K865j9363L1087p014k6381M407J5148j6026j3426l4411
$$ -12064 -9910 2171 7607 10472 -8891 22196 15182 -11199 -6792 8356 -7670 -21096 -55507
7223e5507M1L1827P077K111m809j7274K312L610j2846k412m130j966L3740n064
$$ -55507 -55466 -23639 -16562 -14451 -19260 -36534 -34222 -30612 -43458 -45870 -50000 -51966 -18226 -23290
7209b3290k4950L5893P035j1160o522J5136J2023k5961l0641j4993M8979M6205
$$ -23290 -48240 -12347 -5312 -16472 -22994 -7858 4165 -21796 -52437 -67430 -18451 27754
7197B7754K1869o088k9746m563Q784j6919j634j579r364K0413R971m938L905j5445
$$ 27754 49623 43535 13789 9226 18010 1091 -543 -2122 -11486 8927 18898 13960 17865 2420
7183B420j856K5999J1642j7646K6196N273k1207k3671j0564O302K655o651k2210
$$ 2420 564 26563 38205 20559 46755 52028 30821 7150 -3414 2888 5543 -1108 -23318
7170b3318k0064Q824q904J954r331Q34K6671J035N532n280k0785J1915J7949K8272
$$ -23318 -43382 -34558 -43462 -41508 -50839 -50005 -23334 -22299 -16767 -22047 -42832 -30917 -12968 15304
7156A5304J724l715J653N97R178J7616l7946r160m030k6128K0738J6627N348k4562
$$ 15304 17028 13313 14966 15563 24741 42357 4411 -4749 -8779 -34907 -14169 2458 7806 -16756
7142a6756l151K0031j4446j4953K2421J6501M714k5016k3489N055O982J7334J3127
$$ -16756 -19907 124 -14322 -29275 -6854 9647 14361 -10655 -34144 -29089 -22107 -4773 8354
7129H354J2632j4165m303k351j6658o004k737l815K474K8792J2474j3257k518
$$ 8354 20986 6821 2518 167 -16491 -22495 -25232 -29047 -26573 2219 14693 1436 -1082
7116a082K8116K904j9641K369k709k6193J4299M255Q22j7829p509J0141K0067
$$ -1082 27034 29938 10297 12666 9957 -16236 -1937 2318 3140 -14689 -22198 -12057 8010
7103H010j5753r755J1735K748j2607k2299N822J7985Q675j325j8222n865M292
$$ 8010 -7743 -17498 -5763 -3015 -15622 -37921 -32099 -14114 -5439 -6764 -24986 -30851 -26559
7090b6559R059J1029K913R46j8745l1589j0651J2149J2503K1919j3093O333J0492
$$ -26559 -17500 -6471 -3558 -2612 -21357 -52946 -63597 -51448 -38945 -17026 -30119 -23786 -13294
7077a3294k5129j0139o844P189J568m243J7294K0534J708J1288J0409P111r826
$$ -13294 -38423 -48562 -55406 -48217 -46649 -50892 -33598 -13064 -11356 -68 10341 17452 7626
7064G626j7858j0968n05N222q917o940k040n211k863L9577j3386k897j2024J780
$$ 7626 -10232 -21200 -21705 -16483 -25400 -32340 -34380 -39591 -42454 -2877 -16263 -19160 -31184 -29404
7050b9404J8244J6517k3938k6922O571J48j2420K8947K7766k7609q108J6911M081
$$ -29404 -11160 5357 -18581 -45503 -38932 -38784 -51204 -22257 5509 -22100 -30208 -13297 -9216
$$ [...]
##END NTUPLES=NMR SPECTRUM
##END=
