##TITLE=Analysis number 329042
Compound Code cc 13655
Book Reference 521/101
Project Code adrs
Chemist Name evam
##JCAMPDX= 6.0         $$ Bruker NMR JCAMP-DX V2.0
##DATA TYPE= NMR SPECTRUM
##DATA CLASS= NTUPLES
##ORIGIN= Bruker BioSpin GmbH
##OWNER= nmr
$$ XWIN-NMR		Version 3.5
$$ Tue Jul 31 10:52:41 2007 GMT Daylight Time (UT+1h)  MAYBRIDGE\nmr@NMR_250MHZ
##.OBSERVE FREQUENCY= 250.131544655141
##.OBSERVE NUCLEUS= ^1H
##.ACQUISITION MODE= SIMULTANEOUS (DQD)
##.ACQUISITION SCHEME= undefined
##.AVERAGES= 16
##.DIGITISER RES= 18
##SPECTROMETER/DATA SYSTEM= dpx250
##.PULSE SEQUENCE= zg30
##.SOLVENT NAME= TFA
##.SHIFT REFERENCE= (INTERNAL, TFA, 0, 15.5035)
##AUDIT TRAIL= $$ (NUMBER, WHEN, WHO, WHERE, WHAT)
$$ ##TITLE= Audit trail, XWIN-NMR		Version 3.5
$$ ##JCAMPDX= 5.01
$$ ##ORIGIN= Bruker BioSpin GmbH
$$ ##OWNER= nmr
$$ C:\u/data/dgb/nmr/ADRS/1790/pdata/1/auditp.txt
$$ ##AUDIT TRAIL=  $$ (NUMBER, WHEN, WHO, WHERE, WHAT)
(   1,<2007-07-31 10:52:13.25 +100>,<MAYBRIDGE\nmr>,<NMR_250MHZ>,
      <created by zg, POWCHK disabled, PULCHK disabled
       configuration hash MD5:
       76 6E 9A 78 1E 09 19 81 EC 84 63 8F B0 6A 59 2D
       data hash MD5: 64K
       C2 F2 C9 94 D9 D7 2E 00 14 62 BA C0 CE 2A EF AC>)
(   2,<2007-07-31 10:52:29.95 +100>,<MAYBRIDGE\nmr>,<NMR_250MHZ>,
      <Start of raw data processing
       ef LB = 0.3 FT_mod = 6 PKNL = 1 SI = 32K 
       data hash MD5: 32K
       38 7B 89 A7 48 07 60 7C 09 FC 36 80 77 27 57 F1>)
(   3,<2007-07-31 10:52:31.93 +100>,<MAYBRIDGE\nmr>,<NMR_250MHZ>,
      <apk 
       data hash MD5: 32K
       9A EB A7 AA A5 5F B1 35 3E EA 76 28 16 23 D1 08>)
(   4,<2007-07-31 10:52:33.29 +100>,<MAYBRIDGE\nmr>,<NMR_250MHZ>,
      <abs ABSG = 5 
       data hash MD5: 32K
       EB 73 38 3D 75 B2 EF 8C AB 6C B6 EC 77 FA D9 3C>)
$$ ##END=
$$ 
$$ hash MD5
$$ 72 A2 0E DF 8B E7 99 8D 78 FC FE 04 AC D8 A5 47
##$RELAX= 
##$RELAX= 
##$RELAX= 
##$RELAX= 
##$RELAX= 
##$RELAX= 
##$RELAX= 
$$ Bruker specific parameters
$$ --------------------------
##$DU= <C:\u>
##$EXPNO= 1790
##$NAME= <ADRS>
##$PROCNO= 1
##$TYPE= <nmr>
##$USER= <dgb>
##$AMP= (0..31)
100 100 100 100 100 100 100 100 100 100 100 100 100 100 100 100 100 100 
100 100 100 100 100 100 100 100 100 100 100 100 100 100 
##$AQSEQ= 0
##$AQ_mod= 3
##$AUNM= <au_zg>
##$AUTOPOS= <25 >
##$BF1= 250.13
##$BF2= 250.13
##$BF3= 250.13
##$BF4= 250.13
##$BF5= 500.13
##$BF6= 500.13
##$BF7= 500.13
##$BF8= 500.13
##$BYTORDA= 1
##$CFDGTYP= 0
##$CFRGTYP= 5
##$CHEMSTR= <none>
##$CNST= (0..31)
1 1 145 1 1 1 1 1 1 1 1 1 1 1 1 1 1 1 1 1 1 1 1 1 1 1 1 1 1 1 1 1 
##$CPDPRG= <>
##$CPDPRG1= <>
##$CPDPRG2= <>
##$CPDPRG3= <>
##$CPDPRG4= <mlev>
##$CPDPRG5= <mlev>
##$CPDPRG6= <mlev>
##$CPDPRG7= <mlev>
##$CPDPRG8= <mlev>
##$CPDPRGB= <>
##$CPDPRGT= <>
##$D= (0..31)
0 1 0 0 0 0 0 0 0 0.06 0 0 0 0 0 0 0.0002 0 0 0 0 0 0 0 0 0 0 0 0 0 0 
0 
##$DATE= 1185875531
##$DBL= (0..7)
120 120 120 120 120 120 120 120 
##$DBP= (0..7)
150 150 150 150 150 150 150 150 
##$DBP07= 0
##$DBPNAM0= <>
##$DBPNAM1= <>
$$ [...]
##$SUBNAM7= <"">
##$SUBNAM8= <"">
##$SUBNAM9= <"">
##$SW= 20.6930455092707
##$SWIBOX= (0..15)
0 0 3 0 0 0 0 0 0 0 0 0 0 0 0 0 
##$SW_h= 5175.983436853
##$TD= 65536
##$TD0= 1
##$TE= 296.16
##$TE2= 300
##$TE3= 300
##$TEG= 300
##$TL= (0..7)
0 120 120 120 120 120 120 120 
##$TP= (0..7)
150 150 150 150 150 150 150 150 
##$TP07= 0
##$TPNAME0= <>
##$TPNAME1= <>
##$TPNAME2= <>
##$TPNAME3= <>
##$TPNAME4= <>
##$TPNAME5= <>
##$TPNAME6= <>
##$TPNAME7= <>
##$TPOAL= (0..7)
0.5 0.5 0.5 0.5 0.5 0.5 0.5 0.5 
##$TPOFFS= (0..7)
0 0 0 0 0 0 0 0 
##$TUNHIN= 0
##$TUNHOUT= 0
##$TUNXOUT= 0
##$USERA1= <user>
##$USERA2= <user>
##$USERA3= <user>
##$USERA4= <user>
##$USERA5= <user>
##$V9= 5
##$VALIST= <valist>
##$VCLIST= <CCCCCCCCCCCCCCC>
##$VD= 0
##$VDLIST= <DDDDDDDDDDDDDDD>
##$VPLIST= <PPPPPPPPPPPPPPP>
##$VTLIST= <TTTTTTTTTTTTTTT>
##$WBST= 1024
##$WBSW= 4
##$XGAIN= (0..3)
0 0 0 0 
##$XL= 0
##$YL= 0
##$YMAX_a= 344684
##$YMIN_a= -279528
##$ZGOPTNS= <>
##$ZL1= 120
##$ZL2= 120
##$ZL3= 120
##$ZL4= 120
##$ABSF1= 15.50353
##$ABSF2= -5.189622
##$ABSG= 5
##$ABSL= 3
##$ALPHA= 0
##$AQORDER= 0
##$ASSFAC= 0
##$ASSFACI= 0
##$ASSFACX= 0
##$ASSWID= 0
##$AUNMP= <proc_1d>
##$AZFE= 0.1
##$AZFW= 0.1
##$BCFW= 0
##$BC_mod= 0
##$BYTORDP= 0
##$COROFFS= 0
##$CY= 12.5
##$DATMOD= 1
##$DC= 0
##$DFILT= <>
##$DTYPP= 0
##$F1P= 14.0000005364418
##$F2P= -0.99999901652339
##$FCOR= 0.5
##$FTSIZE= 32768
##$FT_mod= 6
##$GAMMA= 0
##$GB= 0
##$INTBC= 1
##$INTSCL= 1
##$ISEN= 128
##$LB= 0.3
##$LEV0= 0
##$LPBIN= 0
##$MAXI= 10000
##$MC2= 0
##$MEAN= 0
##$ME_mod= 0
##$MI= 0
##$NCOEF= 0
##$NC_proc= -4
##$NLEV= 6
##$NOISF1= 0
##$NOISF2= 0
##$NSP= 0
##$NTH_PI= 0
##$NZP= 0
##$OFFSET= 15.50353
##$PC= 1
##$PHC0= -50.57055
##$PHC1= 4.528832
##$PH_mod= 1
##$PKNL= yes
##$PPARMOD= 0
##$PSCAL= 4
##$PSIGN= 0
##$REVERSE= no
##$SF= 250.130254743663
##$SI= 32768
##$SIGF1= 0
##$SIGF2= 0
##$SINO= 400
##$SIOLD= 32768
##$SREGLST= <1H.TFA>
##$SSB= 0
##$STSI= 32768
##$STSR= 0
##$SW_p= 5175.98343685301
##$SYMM= 0
##$S_DEV= 0
##$TDeff= 65536
##$TDoff= 0
##$TI= <Analysis number 999999
Compound Code 99
Book Reference 9
Project Code 9>
##$TILT= no
##$TM1= 0
##$TM2= 0
##$TOPLEV= 0
##$USERP1= <user>
##$USERP2= <user>
##$USERP3= <user>
##$USERP4= <user>
##$USERP5= <user>
##$WDW= 1
##$XDIM= 32768
##$YMAX_p= 360495861
##$YMIN_p= -875530
$$ End of Bruker specific parameters
$$ ---------------------------------
##NTUPLES= NMR SPECTRUM
##VAR_NAME=  FREQUENCY,     SPECTRUM/REAL,   SPECTRUM/IMAG
##SYMBOL=    X,             R,               I
##VAR_TYPE=  INDEPENDENT,   DEPENDENT,       DEPENDENT
##VAR_FORM=  AFFN,          ASDF,            ASDF
##VAR_DIM=   32768,         32768,           32768
##UNITS=     HZ,            ARBITRARY UNITS, ARBITRARY UNITS
##FACTOR=    0.157963299565203, 1,           1
##FIRST=     3877.90179542849, 0,            0
##LAST=      -1298.08164142453, 0,           0
##MIN=       -1298.08164142453, -875530,     0
##MAX=       3877.90179542849, 360495861,    0
$$ Real data points
##PAGE= N=1
##DATA TABLE= (X++(R..R)), XYDATA
$$ [...]
23318 -9500 39641 34651 -40860 -80937 -8400 83593 23380 -13803 -10522 -44585 -53090 -57801 -37270
23305 -37270 -27359 -1173 -24689 -21931 -64432 -63265 -49241 -70748 -32933 -5660 -55174 -65098
23293 -65098 -65896 -26832 -7027 -18697 871 -19412 -22027 -46501 -92898 -83575 -125994 -97377
23281 -97377 -84824 -51236 -52603 -25525 -45678 -91664 -44113 -23504 -10682 27358 58708 58944
23269 58944 51888 13746 548 59958 55512 31372 23660 16016 6074 20877 -22047 -68514 -126429
23256 -126429 -131437 -90571 -86797 -93030 -80087 -76623 5120 48961 90203 71648 8777 -26537
23244 -26537 -28427 12736 119882 102439 26788 -20636 -88846 -92759 -112738 -117217 -108841 -61901
23232 -61901 -32975 -34919 -51087 -56655 1593 -25662 11025 35164 54764 33139 -2415 23367
23220 23367 -3678 -16555 9787 35242 5618 -86650 -94881 -13334 9108 39884 62854 12135
23208 12135 6098 62678 60032 5618 -23201 -57439 -68369 -79923 -95136 -85562 -46720 -8611
23196 -8611 -35566 -71301 -97453 -117986 -97585 -96270 -63623 -58808 -41123 -33653 9330 23067
23184 23067 62843 43449 26665 -40491 -44073 -21755 -23516 11282 20719 4676 8123 -15724
23172 -15724 -50588 -35261 -23623 5655 39398 1326 -12879 -76194 -124533 -103203 -73357 -49084
23160 -49084 -35507 -74328 -60825 -67277 -55813 -29597 -61377 -67655 -18428 -6316 27887 45553
23148 45553 26430 -15131 14113 11308 32277 -1849 -85790 -37066 5529 -27669 -91864 -61393
23136 -61393 -124036 -156295 -120855 -33267 -42928 -71086 -14277 11531 31322 59063 39643 10570
23124 10570 -6015 -56835 -58029 -66823 -107582 -74039 16248 -79 -19924 38508 38741 -11473
23112 -11473 -18676 -21777 18113 27764 26096 49751 39744 19811 1142 -72203 -23950 37483
23100 37483 25949 49462 57722 25450 72588 81347 97614 106448 24680 20973 71746 46271
23088 46271 17838 14067 -8482 -16680 -17356 -25917 -15730 -64072 -93417 -77063 -124479 -59277 -929
23075 -929 -5147 -34512 -63850 -25052 -7935 -4519 48993 14702 -532 32555 26239 -65177 -117526
23062 -117526 -108038 -72073 -2696 -27317 -44832 -105366 -131470 -174839 -154305 -139054 -130031 -95187
23050 -95187 -56762 -66730 -69863 -71964 -74444 -88109 -71328 -72247 -88164 -67035 -15904 38923 52565
23037 52565 -35575 -85534 -18353 -42070 -58880 -25891 -26847 15858 57496 55666 37921 29565
23025 29565 -35123 -69770 -60675 -38956 12024 -5200 -44501 -74573 -116261 -154337 -158636 -54057
23013 -54057 -27610 -6136 -43308 -50370 -15051 4624 -4705 -39989 -61778 -32545 -28532 -43349
23001 -43349 -53403 -87964 -118200 -88578 -140676 -124925 -27144 -60240 -45111 -26203 -51104 -71333
22989 -71333 -74892 -44205 -21117 -60567 -110175 -104000 -61737 -17536 -11588 -48377 -41850 6908
22977 6908 14545 49 4068 34161 -13899 -24923 -3390 -52181 -27528 -6546 -58914 -73329
22965 -73329 -62423 -30585 -20295 -3178 -7269 -37156 6687 30503 -3744 7971 -10377 -17040
22953 -17040 20910 -15578 -5286 23520 66085 4692 -70170 -86507 -116275 -96238 -49821 -40104
22941 -40104 -62142 -22033 28999 -15607 -66652 -67267 2387 36643 -50158 -90332 -69562 -75294
22929 -75294 -79759 -75178 -85398 -101318 -65822 -69817 -68004 -79701 -91379 -107568 -52677 -54602 -38476
22916 -38476 -33181 -59758 -59380 -97621 -83932 -16542 -7270 1425 390 -1022 -4474 48134 90149
22903 90149 64208 38711 15809 60397 94062 51288 -17575 -19096 -10400 37386 10122 80238
22891 80238 151699 165180 104050 47641 86379 80646 84648 58070 525 -27929 16828 49867
22879 49867 28908 12589 6333 7673 46939 -28547 -99936 -51899 23256 101533 97842 58551
22867 58551 11324 42907 94581 62785 37365 32568 36220 31965 27471 -30123 -71590 -80816 -69477
22854 -69477 536 94825 47333 19931 49970 71044 9729 -4015 9013 -12569 -27974 -18974
22842 -18974 5516 16734 41384 96321 90042 59151 46436 76979 47608 -12400 -68925 -139528
22830 -139528 -146416 -71709 -48952 -53036 -57478 -81398 -107994 -41062 -44934 -105268 -94900 -128531
22818 -128531 -135191 -94726 -14094 45491 26435 31100 -6023 -25024 43885 108949 118090 50887
22806 50887 -43291 -18775 33025 33794 92843 107550 59602 -52554 -96149 -45595 -19040 -34261
22794 -34261 -85820 -75544 -48380 -48058 -19288 25922 32208 10470 16396 48793 75873 38283
22782 38283 13366 19698 -47063 -71701 -74574 -41193 -32093 -107640 -109378 -59328 -3906 -19035
22770 -19035 -4722 15770 10998 741 -23499 22906 62196 37876 30615 2637 41858 43114
22758 43114 4994 7269 33455 51656 73121 93961 39189 -6277 38381 90087 108836 81229
22746 81229 27354 -29936 -25882 13834 43576 42190 -624 -51593 -56744 -60251 -27862 -85080
22734 -85080 -120392 -86221 -49727 -10450 5401 12876 -72557 -65389 -32280 -35544 -19148 -42236
22722 -42236 -39549 -5259 95165 106856 99087 52127 21811 14706 21809 3156 2842 -47038 -56378
22709 -56378 18007 29763 41300 65632 27068 -31578 -85786 -76635 -60132 -63034 -30895 -30383
22697 -30383 18993 -15499 -7390 -4636 -45369 -22177 37669 38235 43916 75744 46912 5168 17423
22684 17423 5428 -46038 -63454 -30517 -33203 -14264 -40874 -12358 -35418 -45187 -68391 -68029
22672 -68029 -90011 -83352 -84322 -111592 -92738 -102484 -69182 -5177 -9453 -92035 -107452 -78573 -47920
22659 -47920 -45256 -75531 -111035 -109695 -153208 -159502 -107388 -82188 -56563 -26567 -26897 -7099 22625
22646 22625 9763 -53527 -90611 -53012 -55017 -59025 2504 -26638 -78591 -68700 -64138 -113408
22634 -113408 -129477 -79637 -49458 34544 36254 -7802 -41067 -20461 6300 22031 36705 -17159
22622 -17159 -3403 -10242 39101 46516 67448 75598 112048 94292 124931 126965 92828 62635
22610 62635 12393 17728 2172 -2245 12362 5130 31542 37504 52405 49909 32812 -27375 -41472
22597 -41472 13406 -693 -71481 -134038 -98186 -60231 36229 138758 153399 99382 83536
22586 83536 50064 -10545 -41606 -67508 -8799 20842 -21309 -32119 -38050 14718 49298 -15071
22574 -15071 -96930 -139866 -80857 -20432 -8497 -12912 -15235 985 34581 38765 -5010 6712
22562 6712 15053 -37617 -122718 -142690 -67876 -48631 1090 34070 6085 -14062 -39720 -30503
22550 -30503 -35465 -31766 -29353 -25315 -44105 -33620 11696 68212 54646 11744 -62531 -95886
22538 -95886 -124575 -59183 -45898 -64175 -108525 -145893 -117573 -80615 -96436 -103880 -31111 168
22526 168 23777 63520 48346 -8598 -12040 -31291 -46788 -68976 -62324 -37681 -36756 -4230 -24109
22513 -24109 -59362 -53164 -42445 46971 19058 25987 40302 13516 1018 -505 -50085 -12869
22501 -12869 -7025 7267 -24297 -54579 4525 20404 -8078 -57448 -18908 35495 -21051 -27549
22489 -27549 -10552 16977 3807 41924 70109 53607 49964 16582 32608 39575 39311 32100 30374
22476 30374 9748 -65291 -140128 -97395 -36673 -3756 -8916 -56139 -21996 13746 8325 -802
22464 -802 5170 -8866 6767 7717 39460 91682 122437 99324 -19401 -52874 -22426 -6216
22452 -6216 -71804 -75796 -32027 -25062 -25246 -28120 -11253 -10653 -55820 -78378 11420 24716 6172
22439 6172 17413 13154 -17026 -11159 -24771 -48284 -80093 -88389 -108551 -94580 -50341 -7644
22427 -7644 19584 31311 -22805 -45742 12498 29376 11396 33844 29798 40881 53252 -7887
22415 -7887 -31843 47837 31310 -32916 -27977 -56189 -80296 -31402 -2110 4518 -37402 -71105
22403 -71105 -4841 -2255 -54056 -46550 -37550 -31612 -10578 2985 14908 35976 116510 132435
22391 132435 86451 79815 126363 120060 141987 150206 134674 124077 136401 155009 164928 181911
22379 181911 218741 281332 312461 320151 376068 382438 366403 402568 444917 430157 446510 476132
22367 476132 478289 514988 478192 426111 403586 325898 212743 191018 194725 253930 160096 48186
22355 48186 -15382 51918 101134 102624 54249 56748 35573 -34400 -15590 -40 13919 42107
22343 42107 51006 26242 22014 25727 -24218 11418 -2871 -35146 -51923 -82656 -24323 18553
22331 18553 67208 108693 92637 53991 55987 61515 9079 1674 78969 63968 92724 110991
22319 110991 61030 4614 -16162 -16604 -8617 -20527 -37397 10875 8951 7436 26552 26404 -35454
22306 -35454 -29311 11918 6216 -2564 30648 81328 40785 -30831 -56891 -12687 -4826 -32530
22294 -32530 -52678 -9434 -16058 -13927 -37494 -39749 -69927 -32592 -28437 -11097 4439 15248
22282 15248 -28353 -48549 -74945 -90273 -66577 8669 26163 -10697 -7052 2081 -3093 16774
22270 16774 22895 14023 6188 -51483 -52937 -16096 -33991 -67221 -44502 -19146 -63315 -75581
22258 -75581 -60877 -39946 -78429 -143204 -138131 -156311 -105296 -66554 -58348 -81021 -127053 -87569
22246 -87569 -75702 -50281 5192 -32265 -44265 -11668 44923 8643 -34643 -94194 -65843 -25433
22234 -25433 -28527 3916 46274 47780 49747 54384 26190 4707 29503 -18730 -30541 4918
22222 4918 4503 -32232 -113616 -74032 7026 62579 52276 72205 59212 40024 34090 12265
22210 12265 48978 125102 130950 109194 119107 63525 17400 10169 11804 25496 -8069 -14715 -27275
22197 -27275 -94619 -133551 -36000 13448 -17833 -66388 -48908 -7047 -22637 -61026 -62366 13554
22185 13554 -20805 -61312 -107344 -51218 -2993 -17562 -15112 7464 -13816 17065 8897 -22182
22173 -22182 11764 48885 20351 11199 11861 4324 -50582 -104866 -168934 -127248 -36337 9449
22161 9449 18971 -8609 -7181 -42380 -55861 -74621 -59722 -16354 4724 69668 114235 72802
22149 72802 -4626 -9153 36073 67573 48763 53407 -7664 -5868 -4675 38024 21747 10322
22137 10322 46434 30567 72462 110679 91080 44498 -8495 -5659 -24545 1202 20204 -31305
22125 -31305 -50902 -15981 22334 50741 -26095 29789 55700 52741 -3796 -48381 -83678 -40486
22113 -40486 -16846 -355 -12420 -33036 -90109 -122381 -117363 -37039 11252 23130 -20489 -16967
22101 -16967 23078 39830 -17035 -90920 -63883 -6877 -68051 -108208 -104337 -92162 -90399 -128523
22089 -128523 -99411 -26789 54544 34726 -56345 -81446 -63511 -28523 -40728 -33675 -40430 -61245
22077 -61245 -54863 -74784 -53069 -77433 -45073 -48072 -100424 -134538 -154272 -98724 -62076 -19340
22065 -19340 -15252 -69219 -110868 -97559 -89973 -51517 -14006 -27709 -19148 -5808 -45349 -54968
22053 -54968 -31407 17928 34381 1516 -1013 -420 3613 22134 -7093 -34216 -77629 -99722
22041 -99722 -97776 -112107 -135054 -109363 -85942 -128126 -164337 -153049 -61686 -22611 -37498 -44408
22029 -44408 -107534 -140705 -94981 -44112 -36924 -77428 -99882 -123291 -128032 -98127 -8798 -6800
22017 -6800 -53854 -76047 -45246 27835 71119 66941 53126 50779 24964 45103 13830 -22746
22005 -22746 -42851 -76315 -68809 -96784 -53314 -41717 -51667 -13269 28241 8629 13892 26127
21993 26127 10556 62343 67352 132410 90204 47015 58908 102202 69047 39785 14165 -2369
21981 -2369 -30799 -12645 -34089 -71221 -66809 -41781 -22332 45433 60730 59419 57235 37864
21969 37864 52092 -317 -28927 -50812 -22860 -79180 -136264 -157921 -147053 -218773 -257872 -223046
21957 -223046 -226760 -242162 -186982 -209513 -223379 -220893 -151881 -127140 -127994 -55293 -4921 -24276
21945 -24276 -37271 -23928 -15178 -67145 -69431 1492 25064 15114 40637 75428 11766 -40083
21933 -40083 20435 65151 95075 89845 62245 110849 155800 175235 188632 268354 242019 237796
21921 237796 167424 170978 183210 113128 122476 126728 101648 40349 64116 92610 105479 120174
21909 120174 84304 76060 123795 124477 110261 154904 135890 147144 155967 128075 131049 137464 118050
21896 118050 120619 190344 264132 236697 260304 248185 235740 153278 95593 104502 143220 190094
21884 190094 199025 188347 125770 73896 -24631 -23438 15685 -23305 -92215 -39528 -78200 -137483
21872 -137483 -69674 -11137 -9002 -31933 -39151 -75153 -93679 -79280 -73890 -65831 -58064 -72295
21860 -72295 -29207 -12032 -17377 -10270 -35772 53381 89849 83353 119178 146911 165465 115615
21848 115615 86646 126689 113649 76722 47533 -5295 -100349 -107248 -98093 -87477 -76253 -96471
21836 -96471 -91566 -117295 -98986 -62216 -54330 -98923 -179379 -238087 -210812 -190185 -160538 -211433
21824 -211433 -234944 -249318 -217416 -219366 -235464 -193064 -114256 -71352 -57469 -9937 89853 128293
21812 128293 184332 264998 308134 261633 263539 316624 351031 343325 326902 311644 243554 187990
21800 187990 174762 158018 133681 105987 104098 113179 60688 -7038 -19170 -41563 -70786 -34770
21788 -34770 -50531 -103637 -121368 -99165 -127301 -136443 -62221 5864 -15331 -39857 -45429 -114037
21776 -114037 -127250 -80381 -71508 -46652 -32568 -15640 -13745 -26136 -31088 -29060 -46629 -116075
21764 -116075 -83913 -7287 18609 90843 169593 176853 182359 189984 188521 214196 220218 156794
21752 156794 184564 171405 119183 129000 92282 88789 102972 134996 185580 223358 274543 294817
21740 294817 355226 442412 472932 580334 675962 726081 762663 786295 760792 755619 715999
21729 715999 682118 675173 650186 659856 636697 545826 504159 501946 489731 444249 403480 345034
21717 345034 275748 240809 203284 184733 170250 189060 214704 237211 322873 415602 483771
21706 483771 562284 705458 931218 1193746 1482617 1818721 2130326 2453439 2829617 3118744
21696 3118744 3432191 3802190 4247475 4765246 5369222 6102291 7023689 8287231 9995663
21687 9995663 12369875 15448537 19359549 24219448 30253488 37352686 45406298 54114492
21679 54114492 63157672 72309760 81166065 89378049 96679478 102901313 107788357 111242906
21671 111242906 112820739 111847544 108011314 101566825 93337601 83736316 72770821 61233872
21663 61233872 50439310 41099926 33518247 27608349 23079210 19716211 17183760 15162160
21655 15162160 13508856 12205734 11121544 10205483 9424161 8879626 8551297 8261310 7979890
21646 7979890 7791649 7665519 7512167 7328895 7211366 7100206 6895188 6636626 6372722
21637 6372722 6048534 5653322 5162802 4720864 4259076 3874268 3514446 3202529 2928869
21628 2928869 2657356 2409504 2205011 2033206 1952749 1771798 1544160 1417554 1324231 1152875
21618 1152875 1015832 857270 701906 541454 398442 336204 298303 235858 254798 284920
21608 284920 317637 344997 349383 385528 460324 529775 546444 503115 562039 580000 621027 627441
21596 627441 605875 574110 521484 520530 502221 507537 548508 503111 564848 584210 563841 512911
21584 512911 525612 508181 503785 454011 480438 488168 530904 559532 568774 548734 475180 399598
21572 399598 354004 285794 263575 253235 271485 327208 325234 391702 390564 332360 327478 399310
21560 399310 466910 409434 385823 394381 431379 459149 490891 460709 453329 431076 421171 461832
21548 461832 432109 388071 383300 340622 321668 338988 331163 249900 222449 227948 186366 224107
21536 224107 261910 295202 203399 221429 286724 309287 304340 359937 370751 406937 457278 479470
21524 479470 510052 528716 528226 501776 503706 494919 489250 465379 482405 485210 468399 453558 452302
21511 452302 442617 436065 370796 286798 217241 228108 279457 339116 323895 218406 137231 103208
21499 103208 114287 104793 62066 19596 20089 40840 83722 115921 160383 152661 143563 138677 90727
21486 90727 91436 137780 184252 202418 199594 194915 148494 104001 90133 133608 133083 92404 109561
21473 109561 123529 78074 97506 126001 177335 161062 132815 101403 74988 82537 91197 89419
21461 89419 37160 801 9774 60051 100650 62685 -69419 -63446 -32098 -17632 1865 -36144
21449 -36144 -38523 -65398 -93366 -73155 -62096 -84439 -129209 -126378 -134836 -156210 -135611 -140658
21437 -140658 -123270 -114919 -148436 -72605 -45998 -50629 -59929 -130696 -103613 -89062 -82719 -89310
21425 -89310 -120426 -123712 -112043 -106414 -117602 -108569 -111476 -67880 -68535 -36975 -9596 860 15383
21412 15383 21764 56048 57838 119770 155227 137874 117365 133214 167212 162430 217226 293426
21400 293426 257229 266141 293302 293418 245897 166417 139567 211629 193115 253114 264097 276437
21388 276437 258988 211629 165133 122461 108554 112125 115959 137130 60704 1697 -5227 -6905
21376 -6905 29367 67591 61696 83266 62248 54253 44546 67528 96672 132299 146091 94842
21364 94842 69713 76099 132018 162094 113866 103372 96105 94211 115269 56967 63565 70485 61965
21351 61965 90590 132408 170180 157296 138130 129061 158595 232348 257126 258492 185758 139123
21339 139123 162074 183967 186861 190871 227407 180367 175263 115230 87001 49513 -6385 12547
21327 12547 34778 57396 96387 86416 59380 52893 69620 73987 70027 31978 58907 103901
21315 103901 107078 154689 215281 131259 114046 141528 166557 189192 202291 224180 164510 139559
21303 139559 176577 207663 214066 117942 47027 100093 128059 155258 175266 164837 79873 -4958
21291 -4958 -9871 29255 31630 29789 6434 57555 76923 36210 52339 43416 19645 -22116 -39052
21278 -39052 -92927 -121675 -62535 8073 13731 -9098 -16933 41585 62420 36577 89325 138873
21266 138873 94727 57596 75795 87606 62923 -10724 -5991 -10142 -18683 -7471 7371 191
21254 191 8725 40304 33642 86130 80057 66760 48191 101636 125843 137966 121252 108694 100994
21241 100994 115645 182737 213424 243142 252046 263748 238614 262074 224830 159378 116722 68364
21229 68364 46624 96269 68575 51344 16770 -4315 13896 77245 145753 144070 155066 127198
21217 127198 85622 32066 65152 108596 156377 165666 176700 129467 106850 178639 244919 259823
21205 259823 200547 126122 165889 171352 159454 65097 39740 25240 30095 6577 27117 61865
21193 61865 79054 60595 57644 33145 57030 23908 72961 95063 61077 43274 20121 68859
21181 68859 72788 78763 143810 148022 120020 188852 240378 256188 226438 221047 313043 302949
21169 302949 361265 474007 614030 716611 733615 653440 579236 640467 651191 614347 587041
21158 587041 559044 551055 549399 546769 546594 552326 554475 526712 519948 468076 448977 401091 407686
21145 407686 364050 325112 323878 269516 273952 267832 259354 271462 261913 241651 161359 158555 193012
21132 193012 171435 175420 205401 192063 162541 135907 115430 86579 30468 15238 8961 9820
21120 9820 16853 -55505 -100988 -117155 -46051 -22092 -44194 -7260 7223 -6944 18448 -11423
21108 -11423 42120 66220 65779 97646 107538 97388 77581 73451 58765 22562 -8485 45028
21096 45028 72546 88118 46710 25117 42160 55326 87711 69452 81895 81844 102149 111026
21084 111026 124661 83085 57238 31019 37513 60167 43299 60219 96015 116626 139895 178369
21072 178369 106182 94006 69528 102618 106925 72205 68056 63173 64203 86045 138541 223379
21060 223379 201409 192770 213828 167274 71379 -41209 -79997 -66412 -39799 -24253 -24049 -28320
21048 -28320 -50284 36503 52123 -2774 13773 51855 33126 50195 80227 101133 58479 7921
21036 7921 69797 96544 -13268 -59916 -35225 9796 20869 39504 30286 -31513 17209 71588
21024 71588 77481 49389 31000 38492 33051 52039 1376 -70964 -44089 14951 39103 4571
21012 4571 -1572 33870 67579 43044 56130 101454 115134 49441 31534 -19086 -2854 -20061
21000 -20061 -33115 -7259 20230 42833 632 -33709 -46568 -10716 -2904 -27796 -69233 -118694
20988 -118694 -92254 -6881 -41797 -50697 -5291 29834 40071 50494 26009 16206 57541 64732
20976 64732 163341 304718 356366 357464 393869 422657 393144 430469 485634 520304 468490 473912
20964 473912 462875 393348 371529 401443 379925 340389 232983 149046 172529 146237 57207
20953 57207 1210 -8400 56195 79598 57562 51097 20107 23546 5101 5582 -25324 -44976 -45154
20940 -45154 6091 41891 73107 107187 92278 60524 77824 73166 32946 -37064 -51347 -64140
20928 -64140 -53484 -35872 -20997 -2863 7413 -67421 -76620 6011 19103 45123 65470 66118
20916 66118 57391 80769 98886 65822 50203 68947 97034 62476 47301 33391 -49512 -90981
20904 -90981 -111728 -145558 -99070 -111020 -146465 -127407 -81086 -73962 -35034 -113582 -114308 -182283
20892 -182283 -166308 -110577 -63450 -65487 -55581 -70058 -89527 -36895 20283 6889 -29106 -23003
20880 -23003 -10220 58812 62347 44583 35556 77439 65457 99932 175145 218186 234538 272952
20868 272952 197330 180557 170366 183662 193247 248462 302303 240376 153065 71330 72518 126210
20856 126210 136250 137713 112969 150390 204120 217675 198800 217771 257989 239457 186276 109009
20844 109009 74410 152161 197325 167868 120126 78466 102520 131165 167082 103441 63723
20833 63723 103218 105446 65903 29324 36462 47726 30676 59847 49168 22931 13584 23423
20821 23423 9015 -6993 -25542 48978 80911 102283 152232 147699 125450 128402 123364 91750
20809 91750 102543 139137 195884 196484 202612 195274 237316 319947 343166 330257 297386 292814 240142
20796 240142 218915 213722 206633 171273 164367 183053 197763 147003 71396 55389 71667 91866
20784 91866 29185 14129 66027 98584 98977 85915 36695 -19051 -68643 -162464 -190234 -194391
20772 -194391 -188153 -167983 -139175 -132673 -145482 -185771 -193771 -181038 -83142 -51734 -101788 -148571
20760 -148571 -136168 -96407 -15798 70035 138152 109298 61988 107802 153990 115022 122860 164800
20748 164800 151119 137396 110156 153741 171425 152580 175149 112768 1113 -44545 -30047
20737 -30047 -40105 -59621 -4718 66993 42250 -45907 -74242 -105131 -120819 -157101 -198591 -194513
20725 -194513 -184209 -171478 -128641 -117982 -82001 -110511 -136760 -190488 -146749 -90905 -66300
20714 -66300 -22855 28616 27228 -20331 -49002 -94395 -55951 52904 145770 195947 187896 198047
20702 198047 192650 246889 255587 274632 271830 290272 267315 269575 306148 368542 389926 346703
20690 346703 380380 381499 364635 341411 423363 509226 543944 556124 580143 570458 635002 676414
20678 676414 719329 695281 685227 694583 717665 723983 663721 601981 558451 558081 521622 504304
20666 504304 554119 514540 437055 351970 261063 202644 136485 123082 199327 159343 73133
20655 73133 75964 195308 369112 490081 623092 816885 1005866 1127715 1321939 1508002
20645 1508002 1674011 1891921 2230087 2524638 2899721 3375090 3939269 4616111 5600096
20636 5600096 6913143 8613311 10829165 13776510 17413394 21793724 26747550 32138932
20628 32138932 37815224 43755342 49783551 55794969 61907983 68406218 75330645 81921044
20620 81921044 87272094 90646321 92367664 93279478 93293581 91695406 88309265 84345901
20612 84345901 81051855 78241465 74893894 70084707 64091279 57856808 51649976 44871980
20604 44871980 37190570 29663400 23345350 18553874 15113881 12802805 11242845 10099655
20596 10099655 9069278 8068327 7168384 6349594 5723503 5129780 4594598 4201779 3828548
20587 3828548 3510313 3361840 3197994 3048951 2897954 2776237 2668810 2642897 2504091 2320985
20577 2320985 2206817 2124024 2059956 1995270 1924070 1861447 1809131 1784803 1711597 1621739 1483513
20566 1483513 1343164 1229499 1115492 1045983 1023522 993398 1032532 1067505 1115941 1247037
20556 1247037 1373713 1512335 1668416 1780222 1976504 2259930 2521344 2729632 2981080
20547 2981080 3266266 3450371 3554969 3647482 3720436 3746319 3726609 3641862 3578983 3439884
20537 3439884 3276313 3163315 3044877 2859252 2602196 2410672 2223211 1959570 1685572
20528 1685572 1433836 1181316 984641 875094 811224 805660 739836 691483 627134 602346 617836
20517 617836 557270 517452 513074 504078 525571 441632 380377 360550 378067 376250 376278 359141 362018
20504 362018 328042 360599 408184 381740 354340 333876 293876 300888 319472 282809 310910 367598
20492 367598 325395 304443 322125 290773 262670 227426 211171 215765 207593 208883 244329 216647
20480 216647 235657 208953 175908 234172 272796 333922 426921 412557 410467 385456 383367 404380
20468 404380 416761 444440 505758 588444 584735 572430 573583 491520 379506 319766 309510 320647
20456 320647 284201 269964 313554 361845 335530 187433 175621 158453 101639 127078 143746
20445 143746 136068 108042 64230 5602 39973 121515 109643 75044 89377 57346 80615 208478
20433 208478 203843 181958 139449 126722 163561 204009 276994 246548 183327 204447 235149 269374
20421 269374 261290 270787 308671 302271 313673 293393 229529 168133 196183 145956 100276 102788
20409 102788 62464 98154 102001 85467 80028 111253 41941 -31449 -15493 1854 26640 48742
20397 48742 23028 -187 -34660 -67171 -82419 -136110 -160628 -147513 -143137 -112093 -83523 -51432
20385 -51432 -44686 -39354 2167 -1632 -39130 -52401 -73981 -71556 -98875 -69670 -98955 -135906
20373 -135906 -178275 -158454 -52383 35827 47575 20656 -81049 -131584 -119476 -86232 -94186
20362 -94186 -62471 -34328 -41373 -31304 -27106 9803 18651 48943 106725 163884 163434 140920 147931
20349 147931 188236 248781 287886 266138 294718 320457 287983 309589 338664 241043 179154
20338 179154 153063 233753 250176 241741 227541 187379 162840 225315 273603 197812 130647 153552
20326 153552 125902 96456 84856 111718 112455 98194 54361 48638 54565 -15678 -62049 -23422
20314 -23422 34730 89592 133978 52000 11989 -14210 -52137 -39094 -28435 -12381 6882 39177
20302 39177 74367 62368 43471 85578 147004 168494 126115 95077 142655 165050 109107 26704
20290 26704 28555 43879 49330 88260 81610 73221 133673 173647 191345 177112 171972 183869 189034
20277 189034 146034 132730 36122 32523 84080 87248 104898 120391 129478 147010 176521 155627
20265 155627 142669 130381 132592 115457 168220 204219 178429 171865 196310 137638 107776 160832
20253 160832 246967 250598 258595 202915 183925 188862 153915 104752 71429 42350 36654 42980
20241 42980 -9976 -51677 -48099 -42183 -13119 -989 -29658 -3766 -9638 -6444 13683 16758 18059
20228 18059 44238 76913 153383 167795 178334 228266 183076 141379 102276 103335 64735 28099
20216 28099 70277 140412 194299 183223 191731 144839 72209 120944 118095 71798 88114 163963
20204 163963 228074 217815 172252 183503 122242 64861 100799 146333 135296 75659 22103
20193 22103 -5914 -16224 -12438 -89283 -169608 -198845 -236027 -261138 -259083 -258959 -249392 -197130 -113804
20180 -113804 -15131 11389 25325 50211 116575 162655 226662 188656 150731 158671 197918 211946
20168 211946 222078 265768 255423 226155 211042 177987 122161 174773 183198 159348 201113 196014
20156 196014 250227 274317 240793 216383 241402 344609 430294 456050 479098 504770 507709
20145 507709 504019 546694 507785 430308 401156 386526 342996 238212 170487 192207 266172
20134 266172 345612 321302 305199 384178 395070 353550 319198 351760 378914 383220 443130 535668
20122 535668 598743 749773 828010 906310 942858 991313 1062615 1125193 1225200 1336619 1457297
20111 1457297 1639576 1886035 2131632 2401561 2796708 3367641 4174871 5345854 6825693
20102 6825693 8696905 11133274 14009428 17173010 20469013 23614424 26446042 29039011
20094 29039011 31522570 34021943 36950729 40485326 44330381 47540399 48857754 47728981
20086 47728981 44949048 41718443 38962466 36965769 35844304 35493265 35458456 34741594 32470167
20077 32470167 28357810 23201279 18227590 14200475 11282707 9232970 7899538 7107384
20069 7107384 6575664 6121773 5745028 5320796 4886883 4483183 4179240 3895753 3725039
20060 3725039 3599853 3511884 3519973 3598956 3666860 3816653 4023518 4255888 4552307 4942722
20050 4942722 5532420 6362248 7500949 9020999 11028254 13625133 16803455 20295081
20042 20295081 23961583 27475188 30631180 33561299 36302436 39025319 42111516 45908664
20034 45908664 50230631 54098819 56161318 55628635 52770797 49012370 45552857 42879363
20026 42879363 41275161 40688001 40612360 40075684 37944647 33553091 27591518 21565876 16487322
20017 16487322 12657501 10016995 8346668 7295494 6553395 5983526 5414871 4807735 4284257
20008 4284257 3855700 3392895 3026515 2725789 2477120 2299395 2215984 2162915 2119223 2083872
19998 2083872 2039976 2060763 2032538 1973367 1881093 1761759 1702282 1603998 1521996 1489964 1427783
19987 1427783 1362079 1319681 1262795 1070156 943029 881655 755554 712124 683518 647377 635572
19976 635572 631214 563053 482777 449115 410009 304854 305695 307132 313908 334979 341269 348614 314964
19963 314964 308000 312294 340401 381946 418410 413086 413227 406857 372849 332046 276693 301114 300991
19950 300991 300113 338825 310472 287494 303444 273162 305769 391681 432131 469216 480141 496710
19938 496710 495114 480646 464501 469864 545267 536702 457604 473238 488135 502881 458765 412179
19926 412179 387170 338795 321706 322329 333192 315790 322788 302506 262746 214429 150689 108488
19914 108488 85357 110070 153935 191348 202845 226311 233986 185620 164237 169232 174681 168310
19902 168310 177357 140807 112911 107038 65855 78844 139983 172462 201630 181996 201765 189442
19890 189442 140130 129726 170701 265929 330625 378327 354488 322035 311990 342083 363576
19879 363576 392101 392433 377070 388605 400464 405701 357991 324772 304825 329373 334736 332243
19867 332243 262927 243006 223461 278551 321349 309532 305621 327575 347628 347435 364749 381054
19855 381054 381731 431224 451671 471706 576314 564385 510380 453083 482331 446438 417992 438380
19843 438380 376850 319769 344247 320824 350975 329958 293478 294266 302298 268310 308622 361474
19831 361474 339119 275213 326837 317993 278357 275895 277175 274180 264049 299845 237015 158951
19819 158951 110030 107791 160362 249137 237941 188635 156301 188336 241947 206853 94739
19808 94739 22663 65267 127921 123960 86822 119034 162492 176619 162694 231629 281122 278728
19796 278728 303446 278583 297616 289706 262986 245992 278575 240118 143522 88584 69244 81409
19784 81409 60661 86506 157441 149147 89211 92793 93943 44141 -54024 -46520 9944 68732
19772 68732 79990 68735 45798 79231 76770 124639 202778 228561 205735 188058 117571 35422
19760 35422 49061 134401 127808 90735 119295 114741 165194 124642 134434 162451 132736 133011 96597
19747 96597 121993 131944 99204 100539 69244 49350 50999 16698 19570 40416 43883 2900 13005
19734 13005 135525 173171 144828 70678 54885 148877 182351 166141 128752 87843 84445 99817
19722 99817 92237 99304 92222 63357 64609 92873 132488 114573 83792 73600 87713 76013
19710 76013 109761 139685 95852 103740 153663 130489 145099 158737 121533 72207 84713 147927
19698 147927 151179 111762 111626 142782 70933 -26151 14117 34469 63575 -15587 -43892 -61712
19686 -61712 -98490 -94981 -62383 -80833 -64379 11076 60544 27935 -54605 -103821 -38269 9255
19674 9255 -12139 -13095 24782 73205 60184 116680 130488 115937 113143 77884 66996 92494
19662 92494 115685 163255 178524 168763 202020 205696 158996 159466 151816 154505 114734 70227 106225
19649 106225 110917 79856 77565 45699 38061 17075 16342 50266 154432 164461 158939 162740 114240
19636 114240 75003 118815 131766 62764 31605 28096 55325 107577 119033 154928 102696 138811
19624 138811 106570 88370 92035 82777 121474 127345 140531 104006 77263 64050 69853 71600
19612 71600 70854 91814 90792 182605 211942 213886 208731 114822 76098 53373 47849 76519 68964
19599 68964 69414 13880 -1077 67844 74938 39592 -17406 -26076 -12774 -25630 -70181 -49069
19587 -49069 69870 91521 122796 139817 109949 17596 -27007 6929 32525 22687 14891 25568
19575 25568 126462 105173 115482 166822 149701 186427 294473 297003 341189 311942 338170
19564 338170 414103 390648 422728 430189 416450 459579 443856 406831 384894 408178 373203 367575
19552 367575 389900 390724 382480 315717 246063 179263 168775 234724 284088 206074 199039 188155
19540 188155 151805 165118 188836 161944 200797 172177 133818 108150 104819 133885 158222 183848
19528 183848 186872 168619 123777 108127 76560 66754 116181 162427 166576 193199 192293 239125
19516 239125 317864 398302 389881 309142 259539 320506 421558 392740 350555 384997 445994
19505 445994 434267 401760 423330 464102 415959 404080 426508 461649 406626 352779 411349
19494 411349 372493 332449 344565 343420 347970 310241 285891 289371 273357 229606 236077 285653
19482 285653 329611 305056 269431 193297 182085 152709 153911 122606 143857 127469 132210 155585
19470 155585 143960 122269 11223 -60822 -111309 -51702 27047 2479 -6099 27244 46022
19459 46022 48812 84102 93161 119312 147039 187126 197790 174721 219090 221572 226903 169058
19447 169058 244276 315593 357615 331266 234356 194326 177323 185391 240438 210723 194611 150586
19435 150586 109607 86215 72252 -10493 -80496 -51863 36210 -12255 -41918 24676 -188
19424 -188 -48792 -93689 -75654 -56683 -71684 -52650 9328 -63819 -141074 -158397 -134711 -136212
19412 -136212 -167743 -177215 -198672 -173166 -165563 -122640 -63403 33804 85630 104512 150334 143084
19400 143084 177357 255970 291091 372451 427612 453342 488028 469694 459592 440375 418192
19389 418192 367351 307114 262985 243984 244379 244012 229647 280047 362769 401553 450207 478749
19377 478749 476423 451477 437313 413077 429421 418916 446318 455163 388911 375608 420211 356700
19365 356700 376538 445133 388442 293512 252582 232400 176982 149785 101554 63773 9824
19354 9824 25463 52152 101159 197198 336480 462276 537390 639581 828975 1031773 1221579
19343 1221579 1425490 1639487 1818462 1903996 2018957 2128644 2287677 2382990 2540262 2756184
19333 2756184 3011228 3496246 4139497 5105261 6494796 8344035 10877749 14228967 18399715
19324 18399715 23229375 28449716 33850524 39332037 44630171 49431965 53634199 57417600
19316 57417600 60849036 63746140 65504124 65176366 62384048 57953358 53010234 47624015
19308 47624015 41129952 33623444 26275505 20213571 15787577 12706685 10715129 9441024
19300 9441024 8437628 7546290 6686003 5948994 5327147 4824295 4499162 4235782 4084110
19291 4084110 4062497 4205859 4377988 4652546 4872797 5053605 5265236 5471550 5622396 5686701
19281 5686701 5763342 5825599 5844253 5906293 5980856 6061338 6386684 6949389 7770900 8975322
19271 8975322 10721812 13186528 16443784 20341288 24743594 29315651 33881531 38353042
19263 38353042 42597395 46332462 49554196 52491390 55093175 56898593 57079513 55101588
19255 55101588 51403926 47025100 42369280 37034449 30664585 24018338 18339937 14137414
19247 14137414 11284322 9371093 8180096 7346142 6625393 5884780 5255040 4739212 4341714
19238 4341714 3977051 3653325 3358495 3232481 3238841 3267779 3267773 3309707 3304504 3305902 3326375 3398858
19226 3398858 3403455 3344369 3346268 3377463 3296919 3100269 2930390 2752429 2545170 2263675 1990087
19215 1990087 1721938 1555633 1426029 1328692 1289759 1197774 1106875 1033483 913588 859619
19205 859619 778153 655099 532108 495917 492122 426386 396073 353019 427826 406548 392865
19194 392865 392743 384650 400322 424151 435865 398252 456027 450474 482291 480154 427138 453963
19182 453963 450288 461727 410757 385246 365988 338221 268937 285599 353212 388329 367316 405550
19170 405550 458284 523466 566516 512137 499999 499241 538071 574027 563192 524339 568937 590665
19158 590665 582741 552254 509485 473409 458859 417972 364430 343184 329572 287684 194233 190137
19146 190137 205342 164196 137235 68246 23581 4144 21506 79051 161508 167418 194411 235900
19134 235900 264763 192162 126890 155278 238589 177456 111678 110182 96796 156238 170103 117208
19122 117208 167421 193457 250091 281838 326480 303757 292586 294554 284545 335633 341711 347757
19110 347757 416139 433440 394342 414077 431177 405299 397988 427644 426020 440650 409256 331439
19098 331439 296337 264756 222323 201628 216388 196600 146991 60543 -22121 -33153 20503
19087 20503 22501 -8526 47813 45189 7905 51703 63084 44849 104676 195761 235008 211768
19075 211768 194952 224954 232658 248412 236039 192392 139703 166210 179412 139578 64477 39931
19063 39931 74935 119160 117828 148978 96714 87150 128505 170765 175303 300118 308510 208789
19051 208789 186173 184843 177911 164393 141520 175809 181844 222098 260549 165369 119119 74170
19039 74170 84281 138278 168315 214190 231726 207559 168039 140382 150785 145198 78088 41109
19027 41109 37154 80339 88373 98643 142330 130305 80620 65344 57265 73616 86055 88568
19015 88568 90172 22710 -83001 -48133 -191 26925 23564 44216 45327 59216 96646 89221
19003 89221 75236 112040 134475 95917 99825 91110 101364 76635 44903 136758 162503 158677
18991 158677 173232 136381 122293 120338 156864 182735 191651 187785 117441 130687 149387 238102
18979 238102 252634 207180 168107 176854 131959 125043 95843 110978 109003 105466 138576 106944
18967 106944 95592 111348 132567 141233 134234 91932 28698 25173 87473 115022 64937 28427
18955 28427 20402 42761 18618 52097 36531 26027 43514 10678 23579 44630 43676 30571
18943 30571 66505 72892 34704 -4247 23515 90455 81967 18800 4596 30925 25198 33954
18931 33954 11134 18633 -5491 5811 42628 90593 87637 114674 98036 31974 1322 966
18919 966 37013 45965 28836 39022 82629 103946 81243 77829 64448 8558 46949 24645
18907 24645 -31745 -3976 6068 11864 55224 22554 46375 -7967 -26343 -14350 -9053 55491
18895 55491 56723 57276 9566 -43551 -49561 -34280 -35951 9580 48396 88970 100372 116803 148373
18882 148373 127019 77869 55707 26276 62341 79953 51965 59018 48334 42509 109130 105588
18870 105588 14916 2853 -7718 -28117 -26816 -29361 -17950 8530 6970 19522 1358 -11131
18858 -11131 -34184 -47206 3206 22659 67701 42552 -71469 -126290 -77916 -57156 16578
18847 16578 12733 42825 14620 9662 52945 25322 -47290 -22668 -9720 -39113 42794 82999
18835 82999 91837 57261 61653 89462 120422 158145 180561 188363 162881 177028 43838 19235
18823 19235 30521 27529 48210 42858 4976 21680 13811 -12630 -27940 -73215 -128582 -30807
18811 -30807 15915 -3853 -27573 -22143 33066 -3769 -46796 -28978 4345 3724 29580 21293
18799 21293 -10754 -40059 -10892 -4100 -4643 18692 37347 -42769 -89717 -63596 -80105 -53659
18787 -53659 45299 109681 108407 69194 23531 -33187 2470 86573 139827 172114 221439 258622
18775 258622 245938 255144 233080 212271 222768 214481 254054 245756 173690 245671 324672 332240
18763 332240 247778 124848 68570 -2562 -19754 10481 -96 -60638 -77417 -72662 -56630
18752 -56630 -28891 -16013 -26380 -3271 34473 38299 25036 10366 7605 23610 62799 37654
18740 37654 19878 58912 25660 21245 84625 118919 98105 63668 42006 -7074 -8345 48253
18728 48253 -11394 -41955 27957 67989 105308 126359 127704 78463 111269 159420 146925 149250
18716 149250 229676 282272 270290 314855 326506 324475 292209 270814 254547 223821 188378 151273
18704 151273 85285 59039 56954 10222 -55345 -63888 -7860 1962 -33331 -15241 36847 -16792
18692 -16792 -63052 -76124 -63147 -16121 7373 8886 83358 103475 95127 43884 21461 11947
18680 11947 -1718 30757 36426 32626 -9418 41818 109383 124695 122052 90519 48410 20949
18668 20949 45630 64295 8494 6870 95019 84836 61562 81342 110651 132431 105708 73397
18656 73397 55551 57138 56362 56291 49758 52900 -13166 -73005 7425 -20407 -40796 -43709 -58959
18643 -58959 -36655 887 -39470 -77054 -86031 -66332 -45266 -53548 -104019 -140468 -105924 -32423
18631 -32423 47454 58548 44523 72755 63467 40858 46651 27899 17060 12465 -59772 -43474
18619 -43474 -31208 -11832 39427 42492 -2373 -59370 -61859 -50393 -26853 -5061 13162 35517
18607 35517 -7810 -26412 -7760 10919 -30593 -63537 -27534 -6789 -4860 1881 -11780 -101244
18595 -101244 -127340 -109308 -48976 57301 48541 23889 4612 537 52664 54608 58076 23929
18583 23929 9388 20043 44188 35755 13325 -6499 -3323 -43299 -70697 -98726 -82552 -80094
18571 -80094 -66732 -37667 -70537 -30049 -15081 -65864 -57739 -21747 36812 15626 -7379 -2760
18559 -2760 -44877 -19544 -32465 -45165 -28497 -18433 6057 39341 55466 54778 89460 47256
18547 47256 56941 115062 108572 45913 74919 105162 75343 71458 37271 -17131 -72827 -70934
18535 -70934 -23964 102665 136233 135499 102646 81723 95719 126938 118541 135389 188743 175984
18523 175984 97633 26827 51476 88000 101780 34564 -20788 -20033 -2489 35029 4063 -48353
18511 -48353 -108214 -109635 -94171 -76442 -20327 -38264 -49962 -56327 -71684 -79480 -80470 -72676 -85406
18498 -85406 -21109 19931 19051 -12333 -21565 -43410 -52121 -70573 -58944 -44538 -11718 -40289
18486 -40289 -85836 -24251 43533 47062 -37566 -81459 -12447 66310 99775 76049 46574 -10340
18474 -10340 -57496 -22882 -11176 42933 66094 78063 60215 43082 54589 59821 32003 -257
18462 -257 -36402 8263 -25659 -94525 -89093 -17285 25753 -70371 -131516 -80530 -34243 -4910
18450 -4910 -54018 -93444 -106261 -132250 -124529 -110338 -70615 -36933 -45175 -33661 -72840 -110266
18438 -110266 -109494 -68145 -43819 -49243 17112 55718 21776 -11918 -2138 46573 42286 20382
18426 20382 18103 14794 34451 32228 25924 70785 31163 2429 -1135 73472 79030 40773 -5279
18413 -5279 -37679 -798 34032 30798 52198 8190 -36491 -29685 3807 23595 8065 14205
18401 14205 25158 25763 48964 37580 -21256 -20545 -43068 -87943 -111590 -124290 -105702 -51290
18389 -51290 50850 42208 -33970 -102299 -104399 -83082 -101628 -72216 -26806 -5121 -13901 -1516
18377 -1516 -25818 -7224 6845 47112 64295 -781 1328 -22080 16881 73676 118249 43966
18365 43966 47027 -26851 -54842 -68526 -79465 -57616 -18736 4078 -24957 30391 54751 35938
18353 35938 -20372 8237 43055 17316 11734 34226 48690 62572 83011 65496 48337 10859
18341 10859 -27532 -31382 -20949 15893 35703 970 -51167 -39366 5266 -1567 -5638 -14258
18329 -14258 -54810 -64969 -18284 2257 6849 30164 -29183 -141262 -142401 -71757 -9873 -46285
18317 -46285 -61520 -33918 2714 -21589 -32795 -41729 15740 65133 45785 -17040 -56679 -109450
18305 -109450 -134035 -69806 -26902 -56574 13892 43959 17610 -7436 -21259 30576 12425
18294 12425 -41469 -43390 -43745 -33714 -1246 -36396 -65259 -73536 11654 26997 38971 7605
18282 7605 -45000 -67607 -100504 -145011 -144638 -71314 -65764 -42057 -22893 -53985 -44256 7033 37628
18269 37628 54986 124347 168966 114233 61589 55042 46672 50271 49619 36328 -32821 -50933 -87742
18256 -87742 -80083 -54636 -42309 -43647 -36189 -68165 -92249 -101686 -72914 -47281 22218 8228
18244 8228 2152 -9143 -70403 -66886 -16000 -16407 -53452 -44332 -55555 -9575 58352 48680 7299
18231 7299 -39863 -1030 18809 25655 67275 75628 88063 34283 32849 -96 475 -26039 -67040
18218 -67040 -60775 -22853 29637 67584 102259 57879 16699 13619 18877 19269 20963 100835 83400
18205 83400 68180 102316 82430 61721 -4863 10429 34370 -3548 16117 59811 38763 33583
18193 33583 13831 -59447 -77264 -142225 -132998 -58500 -36983 -101401 -85392 -18530 17525 23150
18181 23150 33415 7636 2116 33754 42562 -22185 -60632 -73435 -81227 -57058 -23952 34937
18169 34937 56185 68870 81264 66081 68799 62150 42410 75839 106923 143015 180673 154103
18157 154103 138733 160513 161153 179539 159268 93238 5401 -17951 -7017 54234 81429 77372
18145 77372 50644 68375 52990 48050 64343 49854 72321 41986 -7792 -79318 -117752 -61577
18133 -61577 5914 -16951 -100905 -116292 -94521 -12156 13437 28331 39677 -41518 -61460 -41193
18121 -41193 -41899 18156 7551 -3266 -15460 -25294 -16198 40316 10793 -37838 -26174 18749
18109 18749 67709 111571 109349 99471 63642 76667 -3238 -21909 23576 -12328 -54262 -44097
18097 -44097 -44160 -104832 -131625 -124024 -93905 -57362 -29673 -8882 21829 4555 16033 99676
18085 99676 77577 30825 -64936 -99007 -118739 -103769 -91262 -51465 -7535 -34241 -112036 -123293
18073 -123293 -77247 -46645 -66852 -42677 27153 21540 -35235 2667 21180 30899 58974 37455
18061 37455 15530 24362 -28562 -47130 -10636 2702 26605 28919 59996 30555 16204 45565
18049 45565 56036 53730 85231 25758 -25942 -37414 -51197 -81662 -89169 -74517 -68233 -74629
18037 -74629 -47479 255 3558 24938 22530 82271 74851 51726 75690 66525 1000 -36381
18025 -36381 -47646 -8362 41717 29340 -34257 -44552 -33649 -18133 -33994 -66399 -107548 -57646
18013 -57646 -47028 -54283 -38718 -64447 -66806 -90430 -97206 -52582 -15615 -46522 -75773 -116126
18001 -116126 -88070 -82886 -56181 7120 61305 43356 33050 -24933 43725 48940 -4074 -35376
17989 -35376 -41779 -49738 -25447 -35868 -12783 9792 9186 -42361 -60343 -77125 -79178 -78547 -92560
17976 -92560 -40362 36358 -7691 -71137 -114497 -112189 -52158 -9391 32356 14899 26588 39181
17964 39181 61138 53878 -1408 -98038 -86991 -81928 -19455 -39547 -59077 -46636 -21871 -61973
17952 -61973 -81998 -128430 -135258 -93485 -42275 -28553 -10453 -9851 2727 52453 12024 -37547
17940 -37547 21402 60119 47007 13558 -22487 -7453 8883 -22547 27351 63964 -7924 -100774
17928 -100774 -121887 -22103 -10741 11419 1887 -28378 -1887 -9333 21240 29974 -26456 -28269
17916 -28269 -18694 -11318 16870 13771 42231 65440 88405 68811 -24579 -12313 -40777 -56961
17904 -56961 -49453 -51844 -30832 -33918 -42165 34556 67406 32463 9459 -48773 -45120 -6013 -3057
17891 -3057 -43942 -69811 -79651 -88088 -92332 -86005 -36773 -20669 -13418 32943 22616 71400 57610
17878 57610 -12764 -98392 -124005 -108013 -55364 -8453 -54609 -89924 -94278 -34687 -17688 -72804
17866 -72804 -103194 -89037 -65903 -43234 -21139 -45848 -74434 -42487 -40547 -140532 -152094 -82198
17854 -82198 -21666 9606 -51691 -87455 -94703 -103248 -58206 -79333 -70595 -82530 -98195 -81156
17842 -81156 -13489 -49963 -65076 -32787 -17814 -41155 276 14744 71827 73468 30892 -29379
17830 -29379 -48872 -60482 -56948 -68673 -39612 30185 3626 -3377 27527 -21081 -98280 -122703
17818 -122703 -113382 -117257 -96579 -85643 -60153 -20483 16883 -8800 -74153 -51462 -64529 -55533
17806 -55533 -77329 -73958 -25121 12090 33622 11260 30588 40835 39026 44517 34971 -18431
17794 -18431 -69934 -86196 -55992 -37326 -31027 -54989 -95213 -41515 -52666 -41860 -58253 -67671
17782 -67671 -103248 -92326 -37854 31371 43204 62945 21995 9198 -34026 6023 78211 26686
17770 26686 -1542 -20460 -21829 -736 -32402 -39072 -11964 -20688 -71533 -75887 -21019 -9310
17758 -9310 22295 60065 33632 24441 11011 -16979 -38146 -16002 8478 7155 -54014 -92337
17746 -92337 -77788 -50740 -51604 -113046 -87214 -76480 -39513 34362 2107 -79890 -79413 -72061 -109320
17733 -109320 -106695 -90554 -27871 -26952 -26032 -34886 -15732 38990 28947 -20220 -10808 49099 40573
17720 40573 18836 -4349 45956 48091 14051 1649 -40218 -87265 -75104 -31955 19762 15310
17708 15310 -34049 -111159 -143654 -85056 -11195 -21770 -18086 -17063 -67692 -59482 -31322 11632
17696 11632 55160 29984 66633 87144 70203 21199 17715 39418 31689 7701 22443 4788
17684 4788 -25990 -12782 -55865 -52836 -73463 -100317 -45880 6437 21789 -37271 -51234 -5542
17672 -5542 49380 15578 43016 20609 5963 35775 35034 -12362 -44444 -48225 -33209 328
17660 328 -31929 -75758 -44935 -25401 -35599 2450 26506 97687 198515 257432 274937 261380
17648 261380 294348 341673 353352 307236 318712 339476 285817 165844 156607 71081 23396
17637 23396 26108 43770 32967 11954 16610 10797 3764 -46117 -46248 58777 7763 -28497 -34080
17624 -34080 -72661 -152723 -118735 -122078 -157638 -146820 -105229 -70067 -58084 -63546 -134970 -178739
17612 -178739 -125854 -72353 -86245 -133532 -131924 -116995 -98347 -31817 -18500 -10531 62939 87157
17600 87157 60850 10295 -51864 -43116 -62664 -96981 -35088 23679 -14017 -48692 42206 84336
17588 84336 37096 -32180 -5459 -14943 -18601 -58680 -57595 -61591 -103203 -115549 -62613 -74992
17576 -74992 -103406 -124367 -140536 -139256 -116479 -81832 -44509 26032 21126 -17630 -111007 -164554
17564 -164554 -132394 -99974 -48418 -40363 -28810 -18990 -11928 -12209 -15312 -18860 -42614 12856 22145
17551 22145 41623 50222 52353 10816 -9359 8291 -7688 25911 -26664 -40449 90623 74888
17539 74888 11987 56649 70728 67618 68630 55512 25424 -12109 -31867 -13464 19691 -6803
17527 -6803 -14866 118 69392 55802 53122 56411 47659 19879 59190 114613 140029 95328 36083
17514 36083 1205 -50022 -65666 -59383 -15432 73279 92542 18338 -72153 -64518 -60422 -25351
17502 -25351 4748 -3871 5227 -11833 -21760 36993 99453 108944 18974 73117 53409 31681
17490 31681 25024 -8362 -31709 -47922 -37183 -42599 158 39241 68113 43188 -11211 -40368
17478 -40368 -11619 -37020 -59478 -33172 -15333 -42162 -55874 -47150 -60234 -80896 -36510 -26937
17466 -26937 -54085 -62335 -71698 -95541 -75098 -67138 -30927 3773 -677 -24003 -1931 -1358 -37566
17453 -37566 -91292 -92289 -70247 -81316 -66092 -8568 37605 39422 44349 -22999 -32344 -20404 16566
17440 16566 -21977 -28210 -51394 -143851 -160302 -90735 -57907 -31020 -4784 -44919 -60580 -32010
17428 -32010 15496 50801 34775 -51747 -75460 -88544 -70475 -50241 -25429 -33777 -23667 7127
17416 7127 2249 -21765 -69672 -62399 -36583 -51612 -47108 -46651 -92879 -82354 -123927 -152162 -149103
17403 -149103 -114059 -87592 -8056 -25405 -21961 37475 56656 71028 82124 52032 323 989
17391 989 4119 -64508 -56918 -29364 2547 -7118 -11503 -40824 -82438 -7254 13283 -3299 8265
17378 8265 -44798 -100217 -103450 -112446 -68727 -38104 -31626 12243 14501 -36549 -11465 8689 -18315
17365 -18315 -20986 6169 -16115 -35264 -54744 -58017 -54084 -21017 -24 17037 52814 30222
17353 30222 20996 -24644 -50678 -5413 33954 21203 -6944 -27047 24700 50748 35684 10132
17341 10132 -78348 -39954 16779 -51416 -100650 -62941 -11898 17680 -12048 -19378 -21642 -10904
17329 -10904 32013 21098 -22551 -50492 -16963 3580 81068 100485 25456 -43823 -33521 -58492
17317 -58492 -60402 -27232 26258 -36658 -45216 -2485 90957 107382 94011 53262 18217 -10819
17305 -10819 -25165 -18675 -71240 -84008 -30118 -11244 -16123 -677 13406 24888 30391 8747
17293 8747 -2481 3595 -9478 -20901 23366 65441 62299 24071 -20261 -37314 -7954 13406
17281 13406 -5041 -3960 -22873 -21422 -40667 -10836 71865 78626 65545 41996 -9373 -16576
17269 -16576 -59054 -43606 -864 3265 -13873 53634 26773 -16643 -55154 -106112 -105415 -100720
17257 -100720 -108300 -55223 -46577 -87405 -62196 -42856 2220 58971 -22530 -83551 -76013 -48676
17245 -48676 -7696 -19072 -44551 -51231 -30777 -62591 -26467 -41380 -51388 -44673 -37757 -26108
17233 -26108 3498 35334 24960 28959 -27203 -101477 -146362 -145892 -143354 -77423 -97974 -101316 -39787
17220 -39787 22530 6671 -14120 -49145 -20047 -130 18013 1229 -36989 -19010 -3944 -6297
17208 -6297 -14523 -67438 -73649 -78225 -75787 -69826 -81972 -78489 -32123 -15056 -8649 53056 60467
17195 60467 45165 106283 165069 92936 5793 987 56170 62103 42086 86009 52084 -17542
17183 -17542 -64845 -9057 4480 -11885 3877 31125 -8619 -94588 -152409 -64689 35059 20382
17171 20382 -21732 -7382 -15871 -46016 -27545 7594 36483 -46715 -67732 -70043 -48123 63151
17159 63151 99070 110237 99228 49011 69725 133746 119259 77738 51377 6253 3110 -66172
17147 -66172 -75113 -95453 -104453 -88222 -73217 -2560 -10621 -20413 -2236 6783 -18617 -82930 -46059
17134 -46059 29436 57293 40126 4911 60625 74932 18799 -41780 -95675 -92536 -142213 -148836
17122 -148836 -103904 -78348 19957 58233 41399 36640 31595 -2979 2156 37187 483 19824
17110 19824 -11650 -49994 13949 19295 20239 2111 2043 11655 -13281 10457 434 -11315 51370
17097 51370 22944 -29526 -105255 -61811 44182 56628 26318 15409 -29333 -45298 -60479
17086 -60479 -66631 -56127 -108571 -54894 -41151 -101573 -46469 -7983 23950 48259 59542 39884
17074 39884 -45359 -130246 -132784 -86603 -51984 -3807 -36918 -38547 -54360 -55543 -31903 53747
17062 53747 74006 88618 42639 7065 -6472 22004 62284 8273 36338 28217 -10311 -191
17050 -191 -53279 -102467 -86301 -76213 -80912 -86688 -72854 -3504 33623 38793 4693 -76546 -68249
17037 -68249 -69288 -78656 -67524 -76311 -109053 -55671 3848 -22765 -35563 -43521 -50714 422 -22981
17024 -22981 -84946 -116118 -86506 -66175 -22725 -4933 -6403 -21074 -19246 -40919 -12937 -31324
17012 -31324 -38948 -50517 -38064 -61347 -84328 -20716 -5990 -5769 -2870 5758 7912 31047 -10192
16999 -10192 12246 -29899 -50115 -31926 10403 43555 85387 100061 99313 60893 5970 -2756
16987 -2756 4951 5543 7870 -566 15897 19191 6423 -31474 -31651 -13473 17660 1000 -48938
16974 -48938 -65770 -125312 -152454 -109272 -121341 -95153 -97790 -143998 -98032 -59303 -75630 -101516
16962 -101516 -47337 -15428 27118 41362 56145 77198 106781 78318 65042 -14443 -105341
16951 -105341 -124948 -89815 -99368 -72044 -806 8589 -20494 6837 -14493 -73685 -42270 -67843
16939 -67843 -72781 14366 55782 34099 23234 14932 41015 53546 47350 35938 16792 19545
16927 19545 46551 52922 25885 -778 -27930 10824 68910 96480 109769 27904 -62232 -92810
16915 -92810 -35180 -19081 -27163 -5022 -30317 -47252 -42796 -68220 -58517 -49830 -19423 -27004 -66858
16902 -66858 -53085 -35207 -60293 -54085 -57344 -40883 -54611 -33942 7410 25168 62154 67506
16890 67506 -2597 -29429 -35274 -3142 3122 -36455 -31619 -38888 -73733 -50431 -65566 -72524 -35160
16877 -35160 -44994 -70820 -7036 50274 63333 28001 4830 -20409 -18262 -46550 -28048 23172
16865 23172 68401 86124 118059 100643 27516 -50363 -85583 -55912 -37393 -16825 -17762 -52454
16853 -52454 -24502 -31283 -17221 -57324 -18508 41832 -164 -20630 -60998 -90266 -120369 -59339
16841 -59339 29808 59680 -3001 -56699 -42733 -84769 -108695 -72185 -47126 -46418 -39075 -39380 -17677
16828 -17677 -22980 -56136 -31517 34192 47347 30224 13847 28129 43887 33629 -79078 -109266
16816 -109266 -93816 -55884 -19165 -41523 -36630 -45883 -68865 -58679 -53102 -68907 -30992 -11485
16804 -11485 -36865 -88324 -43208 -44060 -79866 -83772 -69077 -46473 5688 78286 66422 -1290
16792 -1290 -58152 -69160 -111862 -135608 -109622 -77404 -227 29465 18316 661 -76593 -119602
16780 -119602 -72294 -47149 -42705 -47415 -60008 -65022 -63253 -57598 -45678 -17671 8486 43521
16768 43521 4496 -83925 -108617 -112566 -61543 -8592 36458 90323 81281 79740 2170 -19035
16756 -19035 -64977 -106701 -109260 -85756 -72822 -8722 28279 1027 -8389 12803 39698 69817
16744 69817 37751 -7258 15375 42635 31604 34377 31773 17261 -14612 -57216 -51268 -50663 -12376
16731 -12376 -16859 -13159 16934 29526 24640 -35513 -29999 -57423 -45675 -75283 -18571 -10658 -13991
16718 -13991 -70888 -63677 -28783 -32169 -25632 -48731 -75055 -95163 -96905 -48820 -57953 1114 40575
16705 40575 33723 -18560 -9873 -8870 -26999 43238 4734 -94822 -75276 -44168 -45253 -47025 -47711
16692 -47711 -46138 -34106 -76672 -95133 -112435 -102079 -77911 -42202 938 50794 25673 -58354
16680 -58354 -23962 -26614 2417 11594 -31115 41768 93944 30129 -15088 -1079 -9651 5943
16668 5943 24557 -22108 -54649 -48135 -46181 22560 -4441 -17439 -6806 -26551 -41483 -2674
16656 -2674 75089 71870 13442 -44915 -49572 -61583 -102517 -94743 -66715 -39793 6395 48349
16644 48349 56127 54169 3841 -23749 -3849 45879 57340 10165 -11778 6355 33697 -860
16632 -860 -25187 -29237 29798 130424 103787 89667 57993 21470 -2849 -39803 -64278 -43700
16620 -43700 -17865 -24324 -30491 -41300 -50851 -18525 -38831 -42575 -8097 -5751 5154 1506 8266
16607 8266 24128 48881 46459 51299 -10280 -25333 -5210 -26893 -85486 -96029 17301 60740
16595 60740 -25627 -17408 1906 -499 44352 17197 -14779 -2243 -9181 26820 21107 -25746
16583 -25746 -55345 -51648 -64825 -72869 23881 67082 68566 67344 49845 21937 -10857 -3414 -16882
16570 -16882 -47694 9258 -342 -65230 -92451 -25802 -33748 -27008 -50237 -81254 -104548 -88644
16558 -88644 -33266 -20155 -16834 -12181 -1782 55132 101417 58707 60822 84926 38326 71047
16546 71047 56323 44234 37358 1722 -48487 -64080 -43664 -17811 12907 15391 -9744 -12310
16534 -12310 -9210 20086 12312 -30633 -75496 -85088 -33827 -8446 -56150 -26298 28855 6859
16522 6859 -52865 -66578 -51700 -77089 -69921 2998 48497 23111 3023 -12042 14282 17873
16510 17873 -22182 15375 14141 30977 9342 -1724 -42763 -62588 -43831 -30599 7062 6779
16498 6779 19061 11727 3416 16276 16883 -35114 -31007 -26031 -36373 -21628 -48121 -32276 -29321
16485 -29321 -23954 -37344 -56548 -59681 -21596 1248 -42752 -13898 48171 78199 -8294 -43817
16473 -43817 -41674 16610 35272 -19560 -74134 -79262 -58008 -96239 -128945 -113281 -88585 -2726
16461 -2726 35805 10871 -48320 -37814 4368 11129 -5249 -15920 7933 50539 22093 16240
16449 16240 11776 27864 12346 26980 10793 -27390 -64097 -64768 -128465 -152350 -163109 -69412
16437 -69412 -50504 -79920 -107848 -115406 -78365 -11120 28298 54039 35061 -38248 -52086 -44362
16425 -44362 -95292 -78644 -86880 -63787 -43466 -72929 -27076 -678 6551 -8282 32069 15481
16413 15481 -52893 -80799 -106074 -91016 -76967 -57739 -2349 -76071 -118185 -121974 -123777 -72226
16401 -72226 -35967 21571 -13359 -39264 19059 31221 18217 24664 25119 107544 99813 86643
16389 86643 47238 -37654 -62335 -60356 -18937 33105 41050 25764 33872 29803 29790 37777 71562
16376 71562 85754 60175 14042 2563 -8635 -19589 -40609 -70520 -85455 -74158 -107155 -160889
16364 -160889 -67931 -1382 13833 -770 -53462 -77543 -124354 -70660 -36907 -49912 -82372
16353 -82372 -73901 -66080 -47497 -3268 57302 62757 59694 46128 27355 -23693 -33631 -52531 -47975
16340 -47975 -83671 -94135 -78232 -59575 -76050 -94064 -70317 -11575 -24656 -75844 -146126 -130559
16328 -130559 -133722 -109292 -74738 -116669 -84825 -90071 -112971 -86315 -90535 -90116 12894 9682
16316 9682 24286 47439 27343 37893 72016 92426 28521 -28172 16313 7848 -78315 -87470
16304 -87470 -65116 -62238 -57115 -56806 -64109 -29845 23077 16093 35524 49565 34992 28171 -7067
16291 -7067 -303 -88773 -158581 -173300 -141385 -130827 -128403 -103569 -117574 -161188 -133743 -74223
16279 -74223 -60895 -7453 -20718 37366 27813 623 -37545 -33165 -82174 -78894 -89043 3888
16267 3888 30796 12284 -23012 13487 -11156 -15311 -16366 -58702 8357 61376 34696 41663
16255 41663 -2733 -31027 -2308 41602 58161 50845 49859 71912 93997 67139 32757 592
16243 592 -6409 -27199 -78070 -89435 -39658 -54334 -41970 29958 34145 -14947 -47007 -36401
16231 -36401 -37470 13155 29006 40636 5438 22854 63158 74225 9666 -461 -4559 -37895
16219 -37895 -69859 -103014 -109775 -120843 -46963 35797 63568 57415 56083 1841 -52747 -21429
16207 -21429 -43550 -32680 -2004 -52059 -73955 -71312 -88528 -104615 -78540 -99257 -74183 -698
16195 -698 -3811 -1541 24507 17991 32371 4855 -13676 -49465 -62273 -70755 -85529 -63399 -56054
16182 -56054 -153000 -190105 -149619 -58239 -35397 7477 24772 43536 52362 31170 -29213 -31887
16170 -31887 57939 73024 60671 42225 2537 18138 -6421 -23557 -1302 -29910 -69827 -63631
16158 -63631 -2148 50071 108491 42814 -27456 -4803 -19649 -62220 -74296 -75923 -31365 8152
16146 8152 5150 35613 56670 40799 12576 30663 55214 -10941 -36112 4689 14119 -27707
16134 -27707 -29618 12633 1521 -8615 27711 35868 18398 -24324 -82319 -20583 -1464 21862
16122 21862 9707 -23990 -10406 16453 55071 88216 73375 67604 -46103 -43760 -1782 -9438
16110 -9438 -14022 22258 35555 54407 47953 -15794 -89082 -100241 -101765 -110141 -59287 -73837 -102888
16097 -102888 -65105 -53690 -66475 -55378 -24738 -45428 -32435 7128 -2030 724 -18895 44458
16085 44458 102892 86464 66590 33541 3175 -19200 -74102 -35041 4387 27326 44614 71228
16073 71228 92595 38644 32992 1858 36188 49623 71487 73250 128223 147045 76407 42576
16061 42576 15834 -25991 -9651 -30288 -40764 -6020 26093 35125 37605 14337 48965 12814
16049 12814 -72311 -64148 -3685 23524 86541 125687 99260 72835 101919 97609 130049 86763
16037 86763 63512 84265 -27647 -62452 -15383 9318 17475 -3184 -34474 -34597 10634 53923
16025 53923 90022 67174 -13533 -491 57094 196709 209847 150797 108392 71484 54999
16014 54999 60482 93595 71483 33019 21739 -15669 -38164 -36306 -55156 -40695 -3823 666
16002 666 -26566 -64405 -2075 23676 -6231 -20997 -68534 -63696 -10895 -37991 5923 -10177
15990 -10177 -13374 -77213 -56009 -34736 22002 35924 61930 42042 28917 47008 52008 -15906
15978 -15906 -49272 -18130 4812 17151 25935 -11059 22607 -12771 11304 37450 37800 15539
15966 15539 43234 -6323 10555 13817 -7817 20137 -6419 21690 16794 47971 83930 93169
15954 93169 57434 53594 -23194 -73984 -14908 -25610 -31914 -61064 -38322 19797 -18342 47003
15942 47003 49575 29064 56296 24110 4053 -50562 -33742 47953 31252 -56978 1039 82482
15930 82482 89490 83179 62929 44458 10551 -40823 -106914 -74214 -91192 -51263 -39966 -21206
15918 -21206 2637 1926 15177 76105 70513 124409 121578 73747 39348 8089 -70046 -94716
15906 -94716 -84937 -33736 -51032 -53566 2408 -13420 -43589 -38226 1096 -4458 21249 2098
15894 2098 27847 58032 -366 -30276 37019 38407 7931 14328 24510 -2252 -19093 2328
15882 2328 9272 -55114 -89468 -35477 -32978 -69981 -47518 18156 26476 54697 53290 19480 41304
15869 41304 54694 101650 71482 -16270 -77086 -79069 -143853 -170114 -90359 -42582 -31857 -9430
15857 -9430 -37897 -67049 -51174 -42109 1437 -5789 -12934 -35822 -57093 -39236 -53294 -11224
15845 -11224 26195 -15403 -7992 6582 38729 70740 30940 -1946 -60332 -77569 -73345 -67837
15833 -67837 666 8494 44942 41798 9534 21675 25700 56296 73521 27876 -48251 6194
15821 6194 80788 92050 97857 72289 44163 36041 49723 -2044 41933 24933 -13711 -13154 -31837
15808 -31837 -55821 -11865 -20114 -75672 -59959 46793 28422 -60510 -112086 -56674 -33312 30024
15796 30024 120029 137853 104164 38183 39034 -4727 -50719 -81624 -92773 -94111 -100302 -95351 -51580
15783 -51580 -20769 -8516 36776 59549 36942 1417 19089 97441 79815 55489 77051 26524
15771 26524 27883 57316 81343 54011 -2149 -8181 35588 32140 -10553 -35631 -61256 -96967
15759 -96967 -82444 -61319 -27119 23392 37676 -5232 -47165 -66599 -39277 -2458 1938 -13783
15747 -13783 52819 59284 66331 62783 69199 54116 45027 20065 317 13959 28008 39270 12559
15734 12559 -33704 -19998 11004 53726 642 -96156 -137753 -103532 -24025 16925 11762 -55773
15722 -55773 -69012 -49857 -60809 -50057 -60776 -31551 -67285 -12587 23784 11484 26195 -400
15710 -400 -21568 2984 11545 5849 28601 56019 66422 80203 85478 47921 49990 28918 3722
15697 3722 42624 106646 81113 88911 32683 -57799 -59489 -47369 -42302 17088 2729 -3842 30362
15684 30362 42947 63072 81588 88625 113337 65500 -30456 -12662 -3471 -14247 -44699 -68219
15672 -68219 -44741 40653 91178 39108 56976 80624 74058 51656 -13692 -98197 -105706 -69586
15660 -69586 -69855 -28270 11076 27911 72698 19769 -31657 -10589 56711 52498 -19031 -34524
15648 -34524 -55860 -53283 -20867 -45081 -62725 -84741 -50098 -51474 -37700 -21803 -20429 -46789
15636 -46789 -58195 -38445 -2914 -16458 -44292 -45467 -40490 2665 21122 46238 50228 87249
15624 87249 46995 1849 -49894 -44214 -17085 27662 84488 107772 74566 31455 17180 15177
15612 15177 51232 15186 -14336 -28875 725 381 71639 128148 69575 14474 -110 6766
15600 6766 3624 11786 34754 66378 44929 103645 121123 134531 92216 41791 -23663 -38057
15588 -38057 -9080 -10873 -20714 330 -7448 63901 78402 3352 25452 67836 51939 -170
15576 -170 -33793 -25914 -51226 -20460 21361 -27780 -42649 -47235 5740 46714 35572 53374
15564 53374 25954 -33347 -11147 -26196 1620 41002 -18980 -48327 -33151 -2496 35902 56439
15552 56439 103923 80923 -13923 -61462 -39275 -25529 -40794 -23206 -198 -5318 -22079 -6080
15540 -6080 23573 23033 71917 120163 98969 58688 -12502 -53137 -33747 -76208 -27466 2531
15528 2531 43548 57803 80170 41516 6073 -9955 -8704 3971 -16300 1008 -30770 -21438
15516 -21438 33481 21721 36546 89350 89126 1646 -43454 -48618 -110533 -70473 -42388 -38693
15504 -38693 -18074 -40891 -86508 -75915 -15749 -29294 -31132 -28097 -43461 -42834 -66861 -19013
15492 -19013 -2601 -46491 17557 12234 64381 37914 35157 14255 109 11848 18101 27713
15480 27713 29811 55470 33178 44448 35259 75409 62929 -819 -56126 -42634 -14672 16552
15468 16552 -45514 -150837 -176518 -108636 -63958 41392 86674 88637 86941 54502 38574 14370
15456 14370 23957 -6181 1496 20569 -5433 -2602 -24404 -47623 -24436 2110 -5244 -2553 -15508
15443 -15508 12370 14941 42391 72835 77954 93960 26725 -1202 -5131 16461 -3094 4527
15431 4527 -16281 -80280 -73208 8184 96850 107640 54015 16789 -23050 -21526 37737 76724
15419 76724 55837 55902 32106 22112 28925 -2036 -9852 -54588 -41860 -10581 4145 69402 74830
15406 74830 34374 26449 -9990 -29235 -23793 -75456 -70096 -57287 -44562 56660 28624 -5811
15394 -5811 -31727 -58767 -14567 -33651 -12182 1495 -50051 -79024 -73983 -65206 -59092 -36943
15382 -36943 -39247 -7829 35338 -9103 16654 55133 -5597 -38186 3754 -14704 -29586 35787
15370 35787 -2348 -12757 -19081 -32655 6693 10102 25519 53394 110498 48333 41127 19951
15358 19951 2959 -73930 -107929 -60331 -42021 40193 91798 24386 9602 8939 18673 50040
15346 50040 10221 37980 95934 60184 42927 96619 103388 25391 -1237 26317 26825 55322
15334 55322 47743 3720 18230 59485 27843 -24678 82 116 -64806 -27429 13024 18685 26207
15321 26207 83537 71962 36484 31401 16331 -30241 -13822 63725 81517 43762 38502 -13827
15309 -13827 -45617 -59236 -18356 1201 -22169 -35821 26062 72425 48225 11654 41346 16698
15297 16698 27485 61438 79770 31156 11741 20396 12586 44822 41699 12762 11999 -6849 -43876
15284 -43876 -22578 -30856 -44142 -32910 36610 22398 39539 65334 4084 -69628 -103459 -92787
15272 -92787 -102194 -93215 -94363 -90790 -60392 -41208 -74385 -76110 -70120 -72026 -73979 -116293 -94311
15259 -94311 -79812 6770 80259 56084 29033 47115 36422 29567 48827 47460 -23677 -10190
15247 -10190 -3705 -40630 34232 63914 70497 90626 70862 125041 136883 95932 90764 72041
15235 72041 67876 -4210 -48629 -46951 -78941 -49734 -47849 -9674 -2703 -21375 -52919 -81615
15223 -81615 -45610 27776 33723 -591 -1913 -17263 -11489 -4673 -14490 33355 96145 86529 49961
15210 49961 36377 7939 21173 11205 -4787 -43006 -74749 -39610 -53423 -17046 -6867 37865
15198 37865 84197 92926 39892 65053 90713 94357 72150 84580 24425 -20789 -6874 13105
15186 13105 57774 10878 -27978 7950 44884 75272 90783 49303 18542 99989 153748 106882
15174 106882 86359 60200 23534 22114 37298 33397 39216 53339 37883 4854 50729 101210
15162 101210 79530 47273 43429 18190 8169 -29130 -27518 -63713 -72804 -61939 -69806 -39908
15150 -39908 20056 12779 65193 81126 46131 35333 17038 -9234 34255 77737 70043 44716
15138 44716 30374 3868 24545 81049 105798 112887 117892 120094 110338 88301 70418 60558 91659
15125 91659 82489 120067 128923 89474 42468 29083 46098 129772 83248 1388 -26965 27623
15113 27623 45347 12490 -2577 2359 12109 1847 -72026 -57345 -92118 -74916 13018 36659
15101 36659 83844 134861 112314 126002 102518 84373 66065 59762 32785 69201 107361 91765
15089 91765 89763 32495 8508 -50922 -76769 -34393 8907 -27326 -54729 -56449 -31435 -9947
15077 -9947 36265 58835 25144 18699 658 -11839 -31315 -33186 -1669 585 18300 13689 18711
15064 18711 18164 18223 18878 -15552 -22819 10106 43952 63502 42580 45728 48682 2413 393 24288
15050 24288 16376 -40008 -47827 -12030 -11151 -20926 -36048 -39590 -40844 -645 80306 84510 4014
15037 4014 -32213 -16525 8894 -356 -39044 -63140 -58818 -56553 -51863 -50953 -49433 -34783 20626
15024 20626 9825 22175 46099 70641 26022 1856 -33079 -49066 -51441 -58411 -65021 -96329
15012 -96329 -46309 12338 32194 -31067 -30742 -11308 19576 -11566 -80279 -23812 19223 50433
15000 50433 34067 6696 31601 44021 53521 25783 22123 22289 3277 -5695 -665 -43500 -72421
14987 -72421 -40138 26849 13902 -43621 -59191 -87223 -109832 -85598 -53530 -35181 -47953 -13245
14975 -13245 -13734 -27215 -31832 -55760 -94819 -75347 -21833 -26532 -44744 -33738 -31131 -34321 14431
14962 14431 33886 15479 34974 102834 40918 5484 14257 -43617 -51505 54056 164783 165739
14950 165739 145669 146429 99363 98257 81615 100366 96194 96781 103331 123924 142816 168951 102003
14937 102003 68918 28361 22806 -19253 61933 122969 104684 102555 132016 151316 119465 63278
14925 63278 49022 15753 34568 44948 33476 -21 -38293 -6682 -55149 -78855 962 -16461
14913 -16461 -77852 -60808 -25783 -75571 -99165 -47783 -23504 -1388 31815 45676 -18881 -11703
14901 -11703 -1894 7684 36919 69321 87316 93394 116040 57908 76073 142090 123814 114448
14889 114448 133164 91991 51848 103474 142334 107809 53040 102522 163915 150326 136224
14878 136224 108520 93308 107902 99361 82236 38929 -21306 -32971 -29846 -32280 -44039 -55879
14866 -55879 -16623 15817 13838 19463 30818 45765 32017 14413 38234 41368 50746 40759 21553
14853 21553 -9490 3316 67637 44960 10124 -15211 33059 42323 55329 56680 81548 67348
14841 67348 106764 102479 17624 58894 143348 233479 252588 205323 86149 67715 37155 18981
14829 18981 71285 78756 50693 81224 69113 -3214 18489 60392 52295 60131 65219 68400 44290
14816 44290 -16914 -58709 9722 11057 650 -73028 -65412 -27385 -12102 64285 114467 98077
14804 98077 60460 84638 48198 -12495 -17764 39372 16720 24983 4738 29871 70135 71059
14792 71059 79761 74220 86392 82582 53467 48485 61756 90514 91137 70300 13933 -44969 -9135
14779 -9135 49220 49045 67127 36647 499 -8501 -14521 -73335 -89579 -163109 -167660 -103000 -44806
14766 -44806 -32262 -56089 -92779 -106791 -80844 -66567 -92748 -55542 -51912 -84607 -41177 37955
14754 37955 47690 22857 -3149 -49110 58616 111667 62170 94063 113576 69756 75191 118920
14742 118920 141935 78599 59939 59894 -12488 -53964 -86651 -722 48795 15095 -10954 -44165
14730 -44165 -88498 -20585 23421 11968 18493 11985 -44034 -53752 -81591 -90577 -36659 52813
14718 52813 77741 -12641 -11717 20564 22104 85443 101127 109876 70113 50497 38407 103991
14706 103991 40383 -35125 -43094 -20404 -61332 -26422 19741 -5589 9939 -48633 -92355 -52737
14694 -52737 -49521 23495 88132 105979 102857 107115 138259 166066 142883 118725 95869 52051
14682 52051 -1126 13587 50873 55558 -617 -13364 -6499 43031 48439 41146 61383 69427 85347
14669 85347 153050 171217 150154 133844 107029 -6901 -59555 -46199 -52841 13086 36631 53400
14657 53400 73150 118867 120523 183635 183238 144918 123373 87670 118183 176798 92293 117383
14645 117383 177456 124029 106213 86231 38048 48364 80893 116726 38496 12826 61078
14634 61078 69136 29012 -5208 -3697 49071 75741 44135 55054 45687 -13691 21430 32760
14622 32760 10761 -31348 -45603 -6298 2792 -8710 7066 20378 -6396 14697 16707 21602
14610 21602 70304 72689 92279 114025 146121 165360 136149 138861 120491 62584 24812 81357
14598 81357 182640 155966 190491 209214 243660 245624 225373 320185 288998 276522 363650 415430
14586 415430 362301 286586 377879 526275 639894 763921 965003 1038595 1077256 1125741 1195796
14575 1195796 1216812 1277564 1311450 1266715 1182469 1072220 954241 803350 688314 628303
14565 628303 575923 490291 485437 444370 377637 383404 370157 379664 364506 308573 248217 231188
14553 231188 222611 281079 348650 326485 312962 243957 174085 197507 162195 164744 175006 164440
14541 164440 106266 43192 42320 104589 110478 152191 198019 222728 182552 157456 120812 73352
14529 73352 94272 8487 -38971 -20274 51414 73651 -34783 -116388 -118079 -57388 35631 104061
14517 104061 104250 67386 15717 -26988 -20826 -22682 -17241 42519 60250 48926 51395 36066 -12162
14504 -12162 -4498 9028 -19743 -49442 -11861 59853 85340 51276 90510 15284 4441 39522
14492 39522 68049 28259 45970 89072 105305 111807 42730 -14566 -19481 -11453 11136 -18531
14480 -18531 -25285 -27885 4397 66174 96106 56824 -7030 -3934 -30283 -43795 -47852 -35615
14468 -35615 -12525 39766 18902 -51217 -69205 -65646 -54106 -87728 -148034 -128656 -130380 -111246
14456 -111246 -56908 -25590 -37378 -75748 -50940 -6749 15477 14761 47050 72351 39560 38544
14444 38544 29447 36206 72553 107501 59250 46752 45618 38685 101356 125641 111881 114734 88132
14431 88132 48313 38525 41645 47244 -16375 8950 44639 41484 36510 72452 71414 42593 42794
14418 42794 82583 134876 139965 178244 210659 192168 170027 171110 171161 170139 137070 140172 171941
14405 171941 146975 82477 -5974 29045 60797 132565 203288 206840 202191 248327 279125 380446
14393 380446 467737 451227 447609 396056 338275 304284 293243 240825 246912 208330 123244 40255
14381 40255 -9338 -84132 -118432 -137633 -149691 -212382 -239437 -281478 -224730 -164986 -151143 -107267
14369 -107267 -96852 -66332 -59577 -74399 -91364 -75604 -7396 60938 94870 66379 46941 46903
14357 46903 99450 136196 214744 298166 343193 362800 351757 336669 411366 443778 427046 425693
14345 425693 461695 460760 467304 472007 482879 481384 457632 457516 397231 343774 265017 261193 317886
14332 317886 384217 382708 271225 219276 276929 353486 380778 398062 429361 424859 377764 359029
14320 359029 442676 475104 500163 521341 532538 516940 532621 528793 539197 493826 469894 428979
14308 428979 385832 324162 275552 234393 166369 125925 58914 -9378 -12676 -70561 -62799 -12811
14296 -12811 12153 9968 -5679 -20583 276 55075 175309 261563 253815 214788 205073 169788
14284 169788 121963 108134 112718 187808 249528 301858 324603 282211 197177 112774 164787 232466
14272 232466 320169 352475 325862 290571 212492 173162 174387 137178 85574 115150 138877 94530
14260 94530 101300 48899 3726 11493 -26391 -147618 -229686 -266559 -283687 -270494 -267076 -223975
14248 -223975 -260016 -307497 -337906 -388341 -366065 -358562 -365125 -313314 -253787 -184783 -32486 98657
14236 98657 269621 469772 621730 684356 749741 739065 743445 774581 778365 760652 788696
14225 788696 768218 699759 628482 525354 367360 239342 140387 116351 162993 249050 236119
14214 236119 191357 108325 19211 -31536 -39359 -41016 -27041 -3403 20698 54381 141616 123305
14202 123305 104957 45686 46145 10549 -7149 -17750 -6197 -14907 -11418 -31735 -34359 -15278
14190 -15278 18071 63067 58055 102624 214169 303903 373906 435995 494849 625754 746833
14179 746833 817270 898460 973956 896084 834896 733422 668592 495856 402175 405118 406814
14168 406814 367903 403781 420175 523989 643457 898696 1187556 1446793 1641973 1791045
14158 1791045 1864640 1951293 2046315 2197066 2341929 2422576 2443094 2297588 2037652 1762539
14148 1762539 1595884 1572800 1611034 1581520 1479347 1365338 1192710 1046102 892929 802590
14138 802590 736934 687492 671368 773898 774510 764276 802439 823675 838924 878002 987279
14127 987279 1120331 1343704 1778094 2427155 3123588 3667059 4114082 4618341 5153140 5695576
14117 5695576 6188926 6667694 7131038 7680140 8585200 9809268 11572001 13920425 17096380
14108 17096380 21532605 27629784 35846789 46615336 60383515 77739798 98918913
14101 98918913 122573476 146288997 167578261 185191173 198869295 208742638 215775016
14094 215775016 222476814 230915631 240204728 245296506 238454670 213461992 173664494 131969858
14086 131969858 97835900 73327879 57390914 47758225 41838642 37499434 33581743
14079 33581743 29895465 26557972 23239983 19989538 17094881 14755415 13032135 11942590
14071 11942590 11277040 10707735 10176817 9788666 9563131 9471845 9463148 9374979 9119233 8766142
14061 8766142 8394942 8063996 7803504 7609109 7412286 7187471 6974508 6742425 6465148
14052 6465148 6071661 5593538 5181743 4753826 4387648 4010568 3721063 3464353 3225991
14043 3225991 3006505 2749142 2410389 2000918 1664412 1328972 1099360 918597 818450
14034 818450 720196 679711 676004 709553 686673 654261 653048 764326 952319 1169965 1278397
14023 1278397 1303011 1260992 1239983 1228272 1211361 1205502 1257810 1170037 990222 847555 758936
14012 758936 695188 681260 722984 786722 909314 919278 920170 885843 923568 1022382 1133558 1196919
14000 1196919 1220794 1145508 1097813 1058134 1004223 951244 849806 746498 733494 742026 712805
13989 712805 706264 701633 699585 615626 594039 629767 606001 618526 649030 641996 634129 669373
13977 669373 634723 630961 668741 696372 674477 633160 635571 642909 623527 534203 456698 393642
13965 393642 329166 344609 358518 340419 355909 365337 327013 276982 241188 264729 362883 440220
13953 440220 530933 638996 776268 817345 933412 1012781 1022078 1040267 1102451 1165990 1175721
13942 1175721 1174657 1186082 1163074 1097351 1023341 994063 984531 938113 964977 898665 788526
13931 788526 657746 606146 565367 517875 491947 432362 375709 349247 294153 257425 223367
13920 223367 215375 271944 329355 360210 403926 487528 601047 670401 810724 949617 1074203
13909 1074203 1185260 1312405 1517937 1767777 1952634 2066214 2169785 2198569 2228616 2188324
13899 2188324 2182834 2213656 2213132 2165899 2032617 1830084 1627489 1429504 1314071 1188800 1095899
13888 1095899 1060367 987073 910676 819338 641543 520707 494316 502909 360942 208015 100671
13877 100671 8984 -30688 -131608 -94778 -57534 -41226 -54450 -62306 -43933 -21185 -60402
13866 -60402 -97608 -103542 -40400 -29436 -6539 51762 101471 88678 43960 25043 5632 -49984
13854 -49984 2770 16985 19516 17836 87227 98892 82129 -36531 -157055 -135335 -74132 -67624
13842 -67624 -52864 -30318 -7560 -16789 -54331 -49718 23158 27180 24424 64336 137348 240575
13830 240575 251339 246341 278919 287847 333602 325836 348239 305609 225669 192771 241681 341101
13818 341101 362542 296691 269497 210601 112451 56946 69913 131132 119665 172449 207554
13807 207554 205761 196339 219799 199999 124589 95618 107071 24236 -26068 -12025 23658 62255
13795 62255 80177 97323 99849 44382 24929 68183 142741 123013 133989 152767 190787 228437
13783 228437 212611 110207 38265 -19433 11964 85509 85827 178115 201560 163683 157728 133829
13771 133829 202055 305747 341174 315108 309003 423204 498179 528841 516074 476991 412481
13760 412481 362124 307494 255659 185986 148708 132879 123402 131049 181189 237570 237656 267158
13748 267158 325232 310546 345799 414172 464207 475691 500243 508991 461190 421898 314648
13737 314648 213045 122682 84887 28578 34402 -10366 -48749 -69649 -160195 -201922 -214013
13726 -214013 -218601 -198883 -114419 -77859 -61852 -26772 -73692 -104110 -85632 -75186 -33572 15390
13714 15390 -21315 10318 74698 105577 151394 203622 216011 232625 305326 421206 489709
13703 489709 535734 551896 573325 581894 651636 670924 715630 813478 852217 840048 831209 842640
13691 842640 869813 784492 763903 653259 558089 502318 502886 489708 466858 480727 492797 435661
13679 435661 468049 556385 582522 537076 535754 488977 596255 724432 747809 753789 815011
13668 815011 879833 927045 925650 879891 788163 758911 702682 615483 561294 454715 398600
13657 398600 355071 263384 174255 142458 80947 -2057 -72818 -162615 -140850 -133828 -139147 -152515
13645 -152515 -157366 -114864 -122123 -81524 -5631 19693 78650 78665 45608 27097 36145 45756 49760
13632 49760 67204 191023 235065 264218 332717 325231 382739 406803 489540 529803 570517 588432
13620 588432 603528 561317 618857 639472 679596 807772 882568 903697 925317 959008 957228
13609 957228 966929 986586 987893 986745 866301 769059 686232 534644 349246 133621 -77355
13598 -77355 -193664 -283479 -311530 -386610 -436268 -400522 -262238 -111956 25821 146791 288136
13587 288136 489776 683617 818335 898088 1004503 1127109 1243389 1326832 1377389 1385752
13577 1385752 1366554 1286371 1154616 1024407 866791 722350 553775 399134 330358 287530
13567 287530 247676 241384 183522 140352 117634 49819 -32978 -50469 -11962 27600 42764 77003
13555 77003 122111 151406 128031 87307 47158 67162 102175 99137 84947 19555 -15578 -43796
13543 -43796 -5668 -26003 -4782 74255 93122 105891 237031 350936 424527 579241 732577
13532 732577 834246 940503 1040606 1102475 1190735 1125665 1073451 1060161 983595 865617 792916
13521 792916 689003 596422 623919 755430 877510 940707 1065932 1303238 1628217 1961704
13511 1961704 2237131 2479535 2708899 2904638 3027544 3125910 3171425 3122466 3074946 2958207
13501 2958207 2829579 2689215 2537535 2429642 2322170 2306507 2214443 2076301 1918741 1785090
13491 1785090 1680172 1544761 1444409 1419415 1425218 1436472 1479415 1496616 1509013 1509436 1595442
13480 1595442 1835636 2111134 2498570 3090297 3774444 4530453 5405961 6374017 7274810
13471 7274810 8188326 9031989 9882973 10830046 11972565 13319882 14984009 17082016 19836369
13462 19836369 23512150 28495994 35269989 44346485 56157229 71355094 90719040 114469704
13454 114469704 142037969 172121612 203215197 233686028 261838353 286239000 306345948
13447 306345948 323218571 338371218 351503830 360143913 360495861 348949911 325558357
13440 325558357 293722093 255025655 211236303 168839327 134388153 109301414 91921608
13433 91921608 79773233 70759710 63227597 56045533 48959796 42167694 36005484 30649539
13425 30649539 26252533 22698373 19836666 17661630 16044632 14821179 13757087 12905621
13417 12905621 12277223 11596614 10983443 10432391 9944714 9516220 9141870 8873557 8669796
13408 8669796 8621461 8603148 8486241 8344875 8144778 7895366 7552475 7019666 6538700 6264190
13398 6264190 5986258 5703748 5452615 5112450 4698640 4300739 3792267 3329157 2880479
13389 2880479 2398623 1952896 1639094 1423679 1319648 1273138 1248104 1183775 1219787 1332403
13379 1332403 1568873 1835607 2049962 2295379 2506447 2716063 2835880 2953824 3007679 3077556
13369 3077556 3096276 3126313 3079180 2943127 2778361 2651754 2572960 2483528 2411824 2339944 2270369
13358 2270369 2213010 2111749 2030616 1943371 1884122 1832539 1766764 1725019 1686008 1654641 1543183
13347 1543183 1413801 1279639 1193331 1174873 1169308 1152967 1135575 1138581 1082397 1049966 1013522
13336 1013522 978306 1000858 1066122 1083619 1027361 1013923 1032591 1103225 1180900 1132324 1084437
13325 1084437 1126314 1150225 1165470 1191890 1092349 938756 826641 752952 728388 702655 629729
13314 629729 562253 495503 458682 431831 366973 425733 489531 579197 710732 806140 934164
13303 934164 1033854 1127437 1290654 1415384 1504037 1525250 1559052 1631899 1727684 1670275 1603455
13292 1603455 1599059 1495045 1438089 1399804 1405828 1376865 1312291 1170853 1104101 1012198 910948
13281 910948 773769 604181 544094 516975 465859 385216 261379 184932 136798 109131 114007
13270 114007 114197 60784 99023 111876 180531 228498 255406 280237 363687 423737 417820 333215
13258 333215 328152 431745 487373 491542 451650 392176 368206 375117 402758 455195 438519 372629
13246 372629 341915 359650 425502 475238 525051 581007 636059 658179 663570 650497 606702 551605
13234 551605 515667 399848 222886 65837 -5522 -102947 -217685 -257179 -288876 -331881 -298565
13223 -298565 -216667 -170947 -212770 -242379 -202865 -182913 -212801 -242041 -207386 -186686 -169058
13212 -169058 -145483 -125501 -93864 -108372 -95094 -40723 -7522 -4722 -22522 -59678 -61081 -60823
13200 -60823 -37017 -45708 -53715 -93038 -130168 -114900 -87103 -66900 -84300 -106348 -131181 -128435
13188 -128435 -112693 -52978 28702 118096 206831 323429 397293 418094 418380 390511 343295 438610
13176 438610 493454 501385 498396 512063 582085 725099 792420 853876 859411 909731 972145 1009122
13164 1009122 1001857 1064675 1132609 1078433 976173 854615 767971 707754 601699 473997 362710
13153 362710 246015 137817 62069 -19047 -49431 -21790 -3877 -8408 9221 6834 42881
13142 42881 122659 127897 123769 207548 195026 218432 202696 232185 256932 196244 125622 -15224
13130 -15224 -19428 -6245 -30383 -16824 -3148 55736 100285 120247 140923 182695 169590 150920
13118 150920 163650 201868 210220 203183 152848 185430 205928 198624 184318 169783 202319 160767
13106 160767 142659 189039 226291 251219 243035 191840 153173 154955 141682 108018 89406 89712
13094 89712 120611 141927 178242 159903 120095 160433 190739 205378 223875 231202 241805 270937
13082 270937 255638 272441 271780 251620 316068 389026 405727 436063 380534 336605 289983 222092
13070 222092 222955 266702 240458 231331 201898 234239 184528 168706 168948 155621 161428 205967 229298
13057 229298 194425 154959 95535 39706 -7792 32911 37505 3064 -10298 22439 47263 97239
13045 97239 74900 111392 153920 109581 149541 157438 134290 115149 159870 219973 235384 200925
13033 200925 157071 191226 155527 122791 118225 108972 108290 131459 158372 127851 128163 139301 172616
13020 172616 179842 174885 177492 143399 120753 86936 91845 117563 93620 70249 102615 109501
13008 109501 64997 22315 81826 81278 89787 96091 83901 59295 68564 115381 166529 245777
12996 245777 303230 320192 370482 509616 716671 879164 1067141 1238276 1311439 1364834
12986 1364834 1384683 1446138 1506022 1539367 1536295 1569636 1584946 1503297 1340144 1160807 976640
12975 976640 776383 623615 530648 476892 420330 419553 373941 234588 222116 248326 229570
12964 229570 224496 200233 195276 193543 144057 125194 96154 41812 17387 21726 42665 25377
12952 25377 -82325 -163554 -182980 -177792 -169034 -189927 -168277 -118586 -115523 -182699 -188331 -153541
12940 -153541 -123277 -96346 -70318 -56749 -61444 -72324 -33256 17878 51120 -1588 -5404 41428
12928 41428 91658 167952 187254 160938 162060 171026 162964 127848 136872 84497 6662 -831 -30624
12915 -30624 9851 28833 -2385 -9108 -6178 -18429 24408 35303 38555 40879 -4496 -6777 -10620
12902 -10620 -7743 1557 36006 11641 30940 46704 -25084 -56265 -47942 -49371 -103584 -139016
12890 -139016 -140359 -51271 -50374 -39298 -54743 -49261 43867 -5264 -63961 -91824 -128443 -99892
12878 -99892 -123991 -113015 -11483 52321 63978 46724 32666 41543 38256 25736 27530 27389
12866 27389 17451 37880 12741 -36178 -93558 -135996 -150628 -147038 -86579 -73055 -58407 -28182
12854 -28182 -17117 -15407 23185 57928 83198 14338 -51502 -80193 -88133 -99415 -78923 -47933
12842 -47933 63861 100822 92413 142497 138185 76210 107948 10825 -31601 -29439 -28758 -54582
12830 -54582 13620 29070 5975 -16461 -29097 -38739 -26623 20131 56981 51044 49163 57798
12818 57798 84123 77337 46883 48998 16783 -16072 -9945 3139 49957 76014 88970 48628
12806 48628 -20740 -39905 -345 -15989 -32538 -518 36777 94801 136775 145102 113823 119307
12794 119307 96967 63698 26544 71289 99935 90986 76620 67406 73962 60945 40357 31353
12782 31353 29973 35607 91884 156729 131822 76660 92031 97387 81281 37389 31372 43804
12770 43804 81384 70076 46767 59985 74276 103970 100994 118013 95069 84147 109537 123407
12758 123407 85689 49558 54290 25250 4664 12608 44831 54651 8625 -9553 -2520 -23324
12746 -23324 -530 -53869 -71817 -72054 -76131 -71519 -52954 -53723 -98811 -102029 -45419 13188 61550
12733 61550 68676 63077 91628 108477 123047 55661 13309 4568 16766 42225 19179 -24923
12721 -24923 -16822 -16365 25962 10733 -9890 -31076 -54756 -33352 -63910 -100514 -47275 -78019
12709 -78019 -113596 -91475 -83754 -99398 -127599 -139658 -139102 -105519 -57216 8914 -40705 -24020
12697 -24020 -20699 -9142 -12902 2555 -26594 -30382 -56840 -85659 -46602 -64176 -102817 -46368
12685 -46368 -24464 -33314 -11087 -33096 16283 45195 53281 5332 -4362 1607 34696 20704
12673 20704 -21971 -36268 -34826 -79804 -103704 -99380 -74786 -76278 5495 -19342 -25172 -39134
12661 -39134 -96206 -77977 -119264 -88043 -94395 -105674 -34559 -40422 -49302 -71472 -90973 -82168
12649 -82168 -71634 -12991 38848 49665 31218 7276 -5475 19270 -19796 -50126 -12119 -48500
12637 -48500 -105834 -152907 -152856 -121800 -81148 -60874 -62552 -63180 -7861 3512 -5905 -36165 -46077
12624 -46077 -24027 -39804 -46886 -79480 -82604 -112501 -64454 -17726 -28099 -53461 -59858 -70722
12612 -70722 -46327 -41125 -72145 -134203 -138483 -108785 -95463 -49416 -40839 -70852 -97333 -112514
12600 -112514 -74428 -45241 -56363 -39244 -40897 -84577 -70254 -47213 8212 17028 7943 27553
12588 27553 45974 60963 3990 -19388 21806 102078 94784 57527 -10700 -30447 -32827 -7775
12576 -7775 -6576 22521 283 -68286 -2518 35064 3963 -5492 -34121 -41371 -8090 -47624
12564 -47624 -33776 17628 68365 95497 55988 -22252 -53592 -64383 -50915 21239 67756 98605
12552 98605 84097 65089 50679 23814 36395 28781 21077 8597 -41086 -43655 -59204 -104844
12540 -104844 -83265 -7475 -14062 -45763 -53613 -37018 -40515 18558 42046 27347 17014 29969
12528 29969 2290 -6677 31577 1440 35299 66712 11522 -34318 -33661 16849 380 -26799
12516 -26799 -8632 -9217 -27501 -106105 -125970 -99176 -104305 -59925 -13045 -13891 -101873 -131445 -124042
12503 -124042 -103114 -53728 -30572 18341 77057 69871 53931 68143 71160 79038 66574 26905
12491 26905 -7710 -12925 24545 52958 52287 -973 -40021 -53907 -26202 54101 57749 16763
12479 16763 52145 42071 29465 75332 105521 138887 164225 128759 189722 193569 190330 158688
12467 158688 116802 123457 90818 53711 18230 22918 26624 -10359 -5559 14851 11968 27301
12455 27301 40313 36178 17784 -2678 -14996 -48786 -25018 -32180 -20238 -81125 -115196 -123609
12443 -123609 -144782 -137153 -74968 -40642 -18803 -13863 -40548 44836 111648 71858 49099 35275
12431 35275 -8206 -20881 -33240 -27153 -3836 37494 19041 49265 89716 87953 52323 -40499
12419 -40499 -71354 -5390 56418 104627 124530 144420 75938 88622 151746 118259 91845 35819
12407 35819 20623 -12009 -77125 -57285 6714 12450 -10196 -8770 -22039 16928 52409 82130
12395 82130 112416 131458 145378 118652 77466 84491 113820 92687 97073 69219 32519 -24731
12383 -24731 -35774 10861 -21995 -35275 177 45702 54631 29864 6783 26156 21982 -49435
12371 -49435 -44117 11894 46330 59162 72601 114593 90947 85655 15065 -3320 7616 4301
12359 4301 41815 46102 62037 41163 -16633 -1259 16832 31603 44916 -263 -4738 15263
12347 15263 44293 53001 8048 -7920 -2711 -25983 -24796 -4549 -16424 -17640 -36206 -5150
12335 -5150 27227 64102 102890 101401 54555 19408 -18131 -37745 -46863 -14122 14520 -943
12323 -943 -17370 -36581 44713 55360 60235 13769 -19828 -53860 -55925 -45430 -48407 -53308 -91787
12310 -91787 -149611 -136984 -80938 -29857 -22210 -67826 -101365 -70934 -99727 -77550 17625 19069
12298 19069 14344 37783 52719 91942 139542 158163 72913 47389 63605 8637 -55509 -11089
12286 -11089 46899 35925 38120 13736 -16495 -50871 -32114 23623 80006 106797 119248 148296
12274 148296 133049 110773 24698 -18823 -90210 -115761 -17769 45781 9988 -4814 14481
12263 14481 48344 103561 86233 68467 62969 80221 62228 30402 6263 -51806 -37400 22920
12251 22920 -8758 -11454 26343 82262 104571 38878 -49083 -60081 -42890 -52491 -88731 -138534
12239 -138534 -186186 -168641 -91356 -71697 -62009 -67577 -86428 -38226 -19191 -31715 -81219 -134013
12227 -134013 -97121 -78660 -78494 -97378 10893 45472 66149 48304 9680 -53319 -102667 -59281
12215 -59281 -29678 -25456 17718 1750 18771 3305 -57630 -14577 -20720 1786 -2270 -9198
12203 -9198 -35743 -90923 -101561 -80684 -47130 -224 3854 -5890 -25329 -21327 -16480 13157 4526
12190 4526 7830 14442 23289 53826 42133 -71900 -79510 -1259 -17502 -42089 -41257 21235 -12104
12177 -12104 -25126 -61718 219 38200 31944 27371 13450 -3197 29042 64952 51221 24742
12165 24742 -11353 -17263 -64190 -39938 -5285 51195 7107 -8399 -2957 37192 30277 -55873
12153 -55873 -111660 -89596 -50299 -59004 -68508 1833 -7018 -3853 -20116 -25301 46104 32251 -33915
12140 -33915 10283 55065 5809 -25902 -59423 -67605 -13088 18839 58554 84091 84673 71047
12128 71047 -2117 -22629 1745 -57579 -5106 65785 60463 32720 65537 103942 88405 63405
12116 63405 67301 107162 14937 -7705 5311 -20305 -56262 -10276 16224 2438 -41683 -58886
12104 -58886 -18576 -35269 -25823 44961 146697 163838 104337 123951 146905 155109 137019 30133
12092 30133 30051 62951 92993 66004 93480 128833 110282 160845 157382 154052 146135 128866 75956
12079 75956 65648 93787 101229 61065 41158 36402 32414 15874 -7944 24897 71278 125342
12067 125342 121348 94522 80883 88142 99409 80931 86090 90202 62008 -5042 23784 25778
12055 25778 -34701 -10288 -31567 -63747 -29004 50408 92654 90499 85326 46638 64910 89753
12043 89753 110752 106527 43856 51476 91101 123994 111267 138829 175009 142749 69064 23408
12031 23408 -235 -20447 -31491 -45928 -43746 -10552 58065 70048 22303 5126 -9021 -7718
12019 -7718 18960 9074 -45032 -48454 -12051 -33041 -63894 -69823 -37687 -35107 -19053 13952 23016
12006 23016 -17167 -70974 -53182 24426 -10835 -32190 -42472 -6930 -5836 -18206 -14272 2477
11994 2477 -32827 -51844 -32617 12488 27438 64536 35353 28409 72844 129687 245958 293289
11982 293289 261886 202557 241233 247372 254345 251628 263404 340224 317295 285476 251317 157141
11970 157141 130363 156698 172208 85919 -9886 -59363 -70690 -4135 37127 30305 32906 3319
11958 3319 3355 71938 126228 125844 109519 80595 18762 -35414 -14817 -25421 -54612 -39758 16321
11945 16321 5753 -53786 -41435 -39673 -45396 -39354 -5892 55792 39924 23022 84422 62216
11933 62216 68374 102116 81632 35013 1491 36559 58686 -1981 5665 13301 55267 35756
11921 35756 27429 8963 19841 44665 67019 82019 47751 4286 -59177 -87555 -165988 -161428
11909 -161428 -84369 17429 87111 106074 99721 80092 56782 63972 70339 38724 3021 20676
11897 20676 -5030 -31424 -12974 -8548 -13609 -13733 23251 6180 -30011 -39791 -39316 -38320 29608
11884 29608 54708 47150 53416 76839 39001 68840 30844 -30132 -46846 -36325 -5987 14594
11872 14594 54319 95910 49433 45834 94645 132594 132963 101824 31046 -14804 -41772 -15597
11860 -15597 -16582 -16219 -46462 -39811 -23267 -84575 -82241 -34461 -10315 43305 21234 16386 12319
11847 12319 25359 26760 75114 119604 133038 136313 119698 122544 99414 36279 -3677 -37479
11835 -37479 19920 -3496 -54190 -62238 -54828 -29364 -20650 -11036 44009 94340 60338 -5071
11823 -5071 3683 40073 18225 -38609 24071 52908 40151 44890 64143 74914 88334 60047
11811 60047 -41055 -109127 -125777 -91528 -13747 -27479 -233 -1574 -39268 -10964 11620 -40200
11799 -40200 -24965 -22740 20370 31227 -10536 -45888 19612 26957 -9283 -26320 -994 52786
11787 52786 94735 115242 101178 57485 19131 49742 92464 48491 74058 96575 80673 77531
11775 77531 95676 -9683 -103268 -69189 -64914 -54231 -100266 -54109 9839 72739 109895 95688
11763 95688 12225 -35280 -4540 85391 108910 101056 90748 49012 44030 76354 79306 79982 108859
11750 108859 97854 43189 -8779 43531 48656 96699 80442 25189 55696 27300 56650 110485
11738 110485 92673 100315 100845 21833 -27693 -24246 25357 67006 -5637 -84197 -85533 -100557
11726 -100557 -124931 -53959 -1249 -12200 15330 3570 -6991 28576 29111 26422 -57998 -13256
11714 -13256 1929 -24940 -80158 -119999 -71096 -54444 -97409 -125494 -102847 -11852 23877 55678
11702 55678 93983 -231 12850 -975 -102882 -96502 -114892 -66759 -20966 -37958 -53955 -66510
11690 -66510 -57850 -67626 -94089 -138239 -104875 -76673 -68497 -83382 -21490 71342 75208 -23258
11678 -23258 -54546 11708 31751 81614 117242 55081 -12030 -11766 16329 -12678 42884 59778
11666 59778 54256 -7685 15205 66907 65010 40629 34879 33061 27651 32499 48128 -11805 -60757
11653 -60757 -58026 -58032 -50906 -1486 13037 -33614 11379 23775 10244 -42001 -33221 22371 31213
11640 31213 19809 33065 56990 16629 -21527 -15874 -5090 -1665 -7481 8321 -11554 -49558
11628 -49558 -78092 -80596 -47996 -36578 -54314 -72076 -109380 -104277 -74358 -34437 12557 -6214
11616 -6214 21001 8297 -26055 -3742 16907 48202 37979 41597 -7404 25907 53364 71321
11604 71321 87905 58201 62696 35240 12900 -2790 -67795 -92381 -37012 -2650 -13397 -7677
11592 -7677 15824 52993 29754 -20796 -74913 -117787 -136256 -29680 8792 -24159 4507 94938
11580 94938 106430 79933 16166 -7327 12634 27717 1380 -46221 -67368 5110 65218 93588
11568 93588 64275 3287 38330 70716 50277 45568 7409 11317 42134 124365 221957 228551
11556 228551 150103 34873 -22685 -63681 -35702 -28889 -45745 -81905 -64034 -18221 -18168 -42752
11544 -42752 -70241 -13650 -11658 -41371 -53202 -12179 8598 -20212 2426 32814 -2221 5991
11532 5991 33168 40508 110353 153013 161462 120482 93534 73013 77116 68662 86526 86016 152866
11519 152866 167016 124654 131173 204644 287348 271739 221320 186571 246425 308646 372890 467919
11507 467919 539237 564773 527314 458157 454939 421625 267536 198525 231280 239801 196468 200894
11495 200894 112930 4329 -25552 -50224 -37978 -26840 -18622 46648 77496 26458 -26690
11484 -26690 -5650 -4627 15622 34299 18814 31832 2583 50359 83351 118441 98677 69565
11472 69565 111930 79710 76764 91757 691 -47206 -33518 -43475 1696 33279 84873 115068
11460 115068 106489 107647 143601 65009 53123 67627 72506 15190 -24451 -26023 4986 59485
11448 59485 113583 101139 53069 -23345 -106191 -139031 -158339 -149581 -120066 -53702 50022 52224
11436 52224 77128 55878 33089 63472 68915 17877 -15833 -35968 -54844 -48558 -32244 -58693
11424 -58693 -101995 -98220 -63482 -69717 -49690 -50334 -52521 -48004 -4396 44447 -2557 18422 35855
11411 35855 49496 66338 21385 -43009 -17355 12227 59001 113698 99687 71626 82222 74259
11399 74259 81532 -7523 -29449 46283 58441 58965 104852 151988 183556 187685 144498 59770
11387 59770 38249 39874 47431 117096 142455 99782 58261 31973 35631 44402 108484 164377
11375 164377 145348 51577 3364 5625 29529 49067 39845 42618 56912 60608 110926 97634
11363 97634 81743 40336 59308 44306 46107 41179 63761 56285 20255 45782 34100 24844
11351 24844 10835 -36315 -71546 -32047 25908 1454 16064 -15083 33049 71938 95583 88596
11339 88596 132463 181688 146329 135846 145675 117654 145266 133709 107333 77747 116320 75311
11327 75311 17615 58323 85235 89689 122966 88919 71925 107018 131631 187021 154946 117046
11315 117046 68840 54241 36623 95141 96885 64416 50580 98802 141765 177632 177478 168105
11303 168105 125218 90722 53081 -22326 -64338 -18322 15460 108863 101137 96858 94393 59660
11291 59660 -520 -6438 49505 77190 43041 12667 80157 136667 151428 171484 177050 246747
11279 246747 343116 405942 424728 354307 317097 350131 429140 532668 530734 611354 836952
11268 836952 1135199 1539710 2019654 2610072 3350585 4334884 5586513 6901017 8099695
11259 8099695 9124830 9939453 10545159 10922435 11233640 11644664 12234194 12862229 12931770
11250 12931770 12016150 10015072 7550157 5487336 3946436 2942053 2388362 2088331
11242 2088331 1922908 1780908 1620750 1495760 1345234 1134294 989142 905780 786437 708332
11232 708332 663927 616915 664783 594244 527281 477774 494846 485416 512772 496320 448772 371543
11220 371543 335081 308304 329312 363576 293191 266841 272168 308889 335410 304278 284209 289757
11208 289757 255781 231180 239422 199529 150323 122343 45758 78170 114453 93414 49742 7511
11196 7511 22 -12526 -7634 8265 19486 -723 -5766 8025 13312 5535 31885 69429 82459
11183 82459 71500 72591 48762 53006 45894 -21104 -84296 -17141 3970 42070 61771 -15851
11171 -15851 -24474 -12603 -17575 -37109 -22174 -813 -7706 13107 33156 52119 23982 102444
11159 102444 106864 132934 132541 78923 48857 -16527 -102358 -74548 -31124 -81078 -76387 15132
11147 15132 116312 110403 42661 -35295 -22695 -5805 -35900 -18699 3606 38048 53279 -35817
11135 -35817 -65022 -45323 -74393 -98876 -81513 -62477 -64742 -56803 -2254 75733 57196 32767
11123 32767 37026 76555 39220 9079 31279 71778 42066 4669 7405 42980 47122 6913
11111 6913 18260 68570 87283 102670 78685 -965 -19751 11830 47813 42902 -25159 -68598
11099 -68598 -43235 -32915 -86545 -135051 -82832 -64904 -20626 22065 -746 -15878 61458 109071
11087 109071 30563 25691 58550 100244 57845 12348 32150 27526 -33159 -8603 -11049 19481
11075 19481 86384 104855 107263 79824 61819 66885 85483 24671 -32285 -55256 -28581 -7262
11063 -7262 -25035 -57809 -63393 -41900 -2892 9244 8896 -92257 -93616 -56881 -17053 -15418 -14097
11050 -14097 4242 -7560 11028 -18395 -84450 -95686 -29138 42320 -1106 -52068 -139172 -165912
11038 -165912 -117698 -60727 -41926 -65875 -77085 -33022 -40197 -52583 -24003 -12511 -43356 -39296
11026 -39296 -40479 -77986 -118304 -138121 -117316 -101183 -71908 -25531 -4255 27893 22187 -19094
11014 -19094 -43728 -34213 -18773 -39228 -53656 -50008 -100088 -126306 -64726 -23421 -24340 -31916 -47257
11001 -47257 -17174 -26093 -59129 -45239 -4564 -17495 48687 40696 9657 15270 -14948 -42407
10989 -42407 -31813 31427 66688 49736 41462 40103 56402 34269 70993 89604 42440 4895
10977 4895 -44212 -92298 -65334 -39190 -50594 -686 49627 68996 -7500 -4812 62987 139771
10965 139771 132215 89553 67799 48897 26282 12096 -50249 -20270 22568 -58961 -165149
10954 -165149 -194095 -140585 -60297 -31594 -38686 18734 46329 24128 -9963 7045 2194 6289
10942 6289 28269 42258 -25600 -101115 -105949 -45016 -23756 -16040 -38762 -15434 14861 2243
10930 2243 8745 -12645 9828 -18710 -36233 -14059 -7522 -47490 -28930 -72319 -91470 -34429
10918 -34429 -44402 -26220 59673 48287 -12015 -30802 20019 100621 75612 26330 -35166 -61425
10906 -61425 -52282 -12096 -22003 -71521 -76245 -70203 -48837 -34465 -16500 -46932 -32306 -16227
10894 -16227 -45566 8018 53762 28117 -50946 -114667 -42463 -115 -9657 -26646 13395 -14647
10882 -14647 -68154 -15445 20810 11851 -41466 -74736 -12028 45026 39902 -21349 -88020 -92449
10870 -92449 -54758 4639 -20784 -36982 -42517 -64373 -33655 -3260 10854 -69117 -164619 -132934
10858 -132934 -115673 -130920 -154859 -117675 -76748 -70681 -15010 11598 20360 23066 -1487 40079
10846 40079 100418 74016 97561 93202 68594 49515 88263 90489 50017 49214 54688 -4622 27078
10833 27078 59984 64900 35393 14397 -26070 -23242 -12396 -1686 13696 -1907 -17856 -35938
10821 -35938 -31854 -14755 -36377 -48298 -54074 -69442 -89482 -36949 -22337 -49239 -49394 -8440
10809 -8440 8831 13129 32122 41336 -14735 3470 -24107 -34451 -6884 5744 55640 77535
10797 77535 29779 38637 27102 -33916 -92020 -78062 -22764 25987 26664 16631 30403 25717
10785 25717 17521 11810 33943 11387 15235 -34633 -54849 -59159 -27863 -85873 -69219 -49174
10773 -49174 -56128 -50482 15 5317 29132 34610 20119 -5779 -50579 -35437 4132 21634
10761 21634 42283 48074 -36949 -111870 -60485 27926 27294 -13168 -14522 -68864 -94472 -61642
10749 -61642 -31160 5103 21225 -33493 -51508 -20780 -30074 -55592 -24127 55848 56259 44599
10737 44599 43000 34215 -6186 -43760 -78745 -61074 -89530 -44263 -47476 -88256 -66882 -88234
10725 -88234 -94975 -87760 -53700 -15406 18128 -31653 -8092 -9704 3530 -30595 -86385 -66341
10713 -66341 -73095 -45807 -49443 -28000 54523 48543 26113 -3922 -45945 -61226 -64554 -97648
10701 -97648 -76902 -24957 -8641 -28493 -77279 -70323 -83910 -72754 -41449 -11917 209 2738
10689 2738 -18816 -4931 -47289 16701 74675 86961 49394 102544 133050 174258 168391 234606
10677 234606 410133 537411 645859 754861 770324 825704 881839 952370 976661 974318 1026872
10666 1026872 1034518 1032573 828818 533086 367880 293474 237611 200083 137536 135420 133477
10655 133477 68536 93051 56467 25743 29858 76637 97173 90702 62480 3645 23447 32336
10643 32336 88684 122699 72477 54830 52044 94600 99372 6235 -67028 -85048 -50477 -53110
10631 -53110 -16960 33280 62266 92721 83563 95570 113737 106623 111774 34404 30839 11082
10619 11082 -7750 31780 13099 -13759 -42907 -35470 -41026 -34727 -43930 -91958 -71162 -51796
10607 -51796 -23564 -109126 -114189 -75851 -34006 42608 96582 70281 4248 -21995 12160 32837
10595 32837 56189 29122 -25679 -22788 -11930 1330 -78105 -94998 -33841 -55096 -84824 -110183
10583 -110183 -143970 -104531 12387 75638 64536 17340 -23639 -82137 -30503 55589 22661
10572 22661 -76736 16143 89030 99394 48049 44175 -5115 13065 -11564 -39894 -57761 -71779
10560 -71779 -4451 50657 45904 -19438 -57598 -73878 -53772 -48515 -59762 -56397 -51243 -17488
10548 -17488 -24246 -75026 -48563 -48125 -62496 -92240 -28377 -1462 -45504 21608 -5769 -50647
10536 -50647 -57846 -9500 25140 17493 14152 22140 71581 69441 60249 32005 10937 -25998 -83912
10523 -83912 -80678 -27516 -22726 -427 -20224 -9927 -64982 -98503 -143521 -138414 -64307 -27383
10511 -27383 -12548 -27754 -27891 -121451 -134084 -95768 -19080 17164 -16274 -45893 -63143 -7657
10499 -7657 11324 17660 -23239 -22322 57183 43009 9347 40199 87639 98276 110357 33625
10487 33625 -16295 -5855 6795 38088 44731 4835 -37184 -37430 19093 20709 13304 23822 45386
10474 45386 51488 84211 52779 47996 53122 64955 9083 -44421 -57417 -61530 -94999 -95557 -47560
10461 -47560 -6097 -41775 -97412 -105369 -32540 7634 12042 22474 39253 18814 47744 22122
10449 22122 -23585 -25600 -20442 -29375 -1637 -10473 -42356 -160283 -173178 -59302 -9517 2181
10437 2181 -5701 -63662 -99351 -105424 -120681 -75419 -3970 8705 -56608 -91879 -59977 19895
10425 19895 56526 40016 32245 30559 -30138 -23714 19541 55633 40394 -24602 -82709 -55671
10413 -55671 -5310 37451 61154 49611 3392 -22386 -8209 15584 15580 24034 21156 12093 -13333
10400 -13333 -32725 1401 1553 8736 39673 5810 -64196 -57051 -3847 29559 13728 -17884
10388 -17884 -52239 -85234 -114662 -115960 -116095 -44161 -41747 -52241 -46481 -17008 17797 1154 -21798
10375 -21798 58449 56649 30587 22490 31539 42411 55603 127717 103349 74103 55269 7401
10363 7401 -885 6741 -10208 -16791 -41444 -77804 -101659 -34837 -13207 12044 62869 77428
10351 77428 39659 48849 -302 -51357 -53223 -60656 -100017 -62666 50602 129233 76525 47824
10339 47824 48027 48407 79082 53089 55906 62005 75917 102549 126269 37895 -71611 -106677 -87574
10326 -87574 -36992 70491 85973 60496 28123 41401 16262 -88318 -130769 -88644 -49257
10315 -49257 -16468 23959 9123 7231 15931 14437 24030 70222 96579 72460 80874 98825 41223
10302 41223 -1566 19752 45283 3995 6134 46002 57445 11310 2732 70401 69943 14936
10290 14936 43005 62178 20809 27322 15108 -23010 -39369 33192 20815 -937 59792 58745
10278 58745 20656 2654 42048 70853 76355 85644 62307 34763 36256 -18660 13263 30567
10266 30567 -14823 -11270 -40620 -55820 11841 73918 97357 107917 118592 136787 156404 170032
10254 170032 100836 49133 46373 70937 124473 252563 320761 326432 396405 598652 859060
10243 859060 1219750 1740723 2465280 3411483 4698389 6076431 7354324 8344636 9076983
10234 9076983 9676603 9954981 10050519 10356805 11087993 12072854 12647881 12025342 9551939
10225 9551939 6442455 4115563 2704747 1896771 1493877 1341327 1265410 1214333 1136644
10216 1136644 1016741 899623 748455 572569 445804 470048 499560 455898 356233 300805
10206 300805 277694 240423 206466 233140 231734 172140 161633 112318 81952 138043 180700 173299
10194 173299 191903 160507 150176 114143 100457 105517 111046 124721 108124 147566 152555 112780
10182 112780 89909 89651 98646 112073 74743 -8779 -39424 -19169 -5473 -7602 25705 56717
10170 56717 27430 -28063 -67380 -107422 -104221 -72042 -29913 -2861 69336 56872 27489 18613
10158 18613 -6884 -9720 -10735 3167 13031 66212 62533 29794 37111 9233 29928 74796 62314
10145 62314 56378 55185 -8708 -70888 -101624 -38652 -8101 2279 38930 32477 9278 45530
10133 45530 51850 49046 -15878 -67299 -84206 -11630 -10384 -14028 -35762 -40242 14157 116732
10121 116732 164686 128432 170211 120129 54349 77657 115955 85844 73418 90739 99747 20024
10109 20024 29429 81628 65246 22001 -14845 -73348 -118644 -99254 -101249 -94037 -65397 -16829
10097 -16829 -9609 -25447 -43336 -90924 -56373 1402 -12438 -2627 19726 47550 11955 -7934
10085 -7934 62 -22445 -4158 24881 48289 77689 60364 58154 58485 61564 41233 54643 56720
10072 56720 29384 -4840 5436 -2218 -29161 -6799 31172 19674 3387 -38071 -31879 -51553
10060 -51553 -30115 -5266 -53407 -34399 8078 -19253 -71135 -103685 -76239 2741 -28211 -108436
10048 -108436 -95758 -69762 -13189 -29859 -17280 46434 89217 25356 -10587 17690 -12365
10037 -12365 -25125 -68797 5588 51276 -11747 -67024 -65905 -24893 39512 5972 -713 14754
10025 14754 18614 19162 71803 83785 72252 30693 3912 47000 -15389 -27295 13173 -5119
10013 -5119 -30155 -37923 -26176 -20202 -9759 14798 36553 28618 37384 54165 62832 29255 -3601
10000 -3601 49171 92705 81699 77634 115172 84819 70597 54153 45260 57459 19204 24649
9988 24649 26877 23299 41795 58843 79893 37742 -9461 54704 217126 358002 527457 794977
9976 794977 1164723 1543594 1849673 2106570 2212998 2267500 2317366 2337954 2460719 2737618
9966 2737618 2987625 3048787 2705892 1971674 1292107 840405 503733 385605 326026 318062
9956 318062 308066 306846 236113 191984 161846 193998 128910 117345 145778 102328 54390 85958
9944 85958 57397 73131 113231 91840 37143 49237 84295 99737 74814 63594 121447 153662
9932 153662 70138 58444 48059 56403 44891 72904 14392 43113 5606 7847 -7340 -26324
9920 -26324 -1921 32166 18938 67215 54722 6057 -21352 6554 70875 88903 73832 69638
9908 69638 27842 39737 60367 52504 7430 -38702 -11772 14739 1747 4302 8790 -16464
9896 -16464 35639 121753 133570 49802 10315 19236 52256 9173 -29587 4583 48267 69926
9884 69926 57138 30549 -10900 -56161 -53188 8174 25621 33441 -38085 -71881 -8935 33677
9872 33677 44454 -2363 -22157 -46464 -67898 -49054 -17769 19496 47910 8947 -11137 36259
9860 36259 75306 94078 124232 86698 63645 24061 44948 6684 10745 54003 76636 72212
9848 72212 86902 63528 39333 10847 -37264 -55198 3603 -19950 -85852 -98741 -43901 -59578
9836 -59578 -85765 -71212 -25887 33377 7506 9406 -5908 14114 19235 -11415 -51097 -43277
9824 -43277 -35610 -9693 14777 26506 46949 -2184 -5275 39040 34725 15875 37858 42877 53812
9811 53812 61196 37646 65793 37836 27301 10035 -17571 21812 51860 32874 42251 -20416
9799 -20416 -103952 -67639 -13058 20020 35071 65626 83865 47896 53432 90469 102283 71198
9787 71198 21617 61555 91026 113641 90822 70962 86817 48314 -18025 -42584 -89884 -52193
9775 -52193 -4281 -202 -7575 27082 51764 -8511 -34463 2300 84203 58474 21592 17840
9763 17840 13310 -99335 -152882 -131067 -129931 -67227 -47523 -51373 -68381 -105007 -101808 -59092
9751 -59092 -75315 -92099 -138861 -175515 -135608 -123299 -79413 -64458 -83845 -102673 -124262 -118640
9739 -118640 -65879 -50757 -47278 -40257 -65263 -10960 -18326 -37586 -47162 -78721 -70162 -54578 7972
9726 7972 66764 53252 4612 -36009 -46875 -8776 -23253 21195 52365 79303 23757 -38907
9714 -38907 -42855 -9585 16829 31896 20490 20464 73258 53134 31423 34082 -19964 -23305 -36763
9701 -36763 -76955 -111140 -77612 -62936 -80226 -41422 20234 66316 52906 1606 -32842 -50725
9689 -50725 -30785 -23049 -40719 -6476 -34348 -67778 -56178 -53790 -79179 -70497 -39176 -3434
9677 -3434 -41242 -46855 -35398 7690 -22863 -37153 -32358 -23686 -963 58287 31769 43741 45719
9664 45719 31050 29268 23013 7940 6247 -57294 -78097 -23307 42152 55918 40267 -13728
9652 -13728 236 43056 71878 18195 14808 31929 47432 19684 24346 26980 -28688 -42741
9640 -42741 -1159 3369 5000 15059 13104 -39604 -42682 11491 9623 -122 15394 21669 -42688
9627 -42688 -122509 -69420 -22442 4163 13100 2949 8745 -51867 -43997 -21623 7158 60585
9615 60585 56916 -18688 1603 -31459 -69331 -38857 -8962 -34644 -21272 27318 -20294 -15544
9603 -15544 16002 59311 922 -11139 19054 21412 -37872 -50068 -47842 -62382 -89176 -48426
9591 -48426 -3679 10448 -13909 37084 71040 22872 23094 -32881 -47278 -29819 16164 47644
9579 47644 70028 50989 -16029 -29226 -36014 -72141 -61674 -28884 -13482 9242 88817 105846
9567 105846 113505 63442 49898 43304 34928 36485 4857 4323 -29414 -64769 -23722 70102 58068
9554 58068 -4459 -31567 -3196 -28184 -58317 -24895 -6529 -57077 -86441 -65320 -31307 -7339
9542 -7339 15280 -6946 -17448 3304 13673 16547 16128 53020 43499 37649 43262 -26047 -57695
9529 -57695 -11832 -38025 4405 -2285 -14904 62070 66290 21337 -6704 54061 60246 59296 37600
9516 37600 5477 -7849 23403 -14450 11772 62531 137964 103343 69130 68320 95251 83110
9504 83110 -11662 -76332 -77751 -35105 11339 19710 -39043 -68157 -61772 -108905 -117339 -82583 -37438
9491 -37438 6574 47440 61028 32152 -11441 -43708 -48460 -3373 -19660 -14176 16172 -25905
9479 -25905 -40976 -13232 11566 -45166 6562 58873 24478 11634 -33517 -36555 -6709 -37952
9467 -37952 -13517 -23580 -4872 -8012 16444 619 -29306 -45423 -1508 9043 -21946 3550
9455 3550 -12194 -82983 -132368 -92806 -125707 -117132 -135605 -181920 -102714 -40289 -68672 -66607
9443 -66607 -17504 31154 12846 -40378 -35699 -40549 -30807 17772 195 -10937 26055 -38226
9431 -38226 -76575 -51254 3792 42612 34542 45547 63053 80011 34692 -18147 -68648 -99115
9419 -99115 -107011 -116882 -151368 -111696 -81583 -61818 -23089 -34863 -61425 -71198 -104690 -112319 -55626
9406 -55626 -15101 32415 44633 14403 44867 70100 59458 74039 -1694 -38646 -62041 -142924
9394 -142924 -209273 -228725 -155248 -58768 30733 77485 91193 117656 110580 64269 43959 42634
9382 42634 54473 58879 52576 -13518 -18649 16964 41511 13504 -27981 -30464 -6318 13593 -29386
9369 -29386 -5965 18113 -35708 -80457 -79712 -102901 -60632 -49098 -54770 -31140 -67109 -75722 -48710
9356 -48710 -57701 -27735 -20266 -48876 -33524 -49544 3472 12555 -66942 -97495 -73377 -12984
9344 -12984 584 7246 26678 60509 16143 19287 9173 11893 -26972 -77968 -84007 -21479 33403
9331 33403 59056 32363 -3 -9392 -13155 -86637 -121681 -101061 -75171 -63741 -65498 -6754
9319 -6754 8231 -2005 -4182 -91252 -83640 -63142 -28913 -36570 -57109 -93495 -97492 -2806 100386
9306 100386 132619 140907 146512 171365 194846 198218 197078 219301 152423 60770 56184 46995 14448
9293 14448 -5528 -33031 -5448 11993 14856 7246 -10521 -30546 12667 -18317 -17993 61249 15208
9280 15208 25862 52739 78358 58466 39730 60233 63008 41757 39046 35809 1412 -22918
9268 -22918 55875 105076 21363 -53803 -35993 47711 156552 244267 260993 236334 206091 222168
9256 222168 222601 206171 238675 225960 246265 210790 117859 83588 15437 37428 31684 16832
9244 16832 -72573 -78292 -12472 46532 42434 80320 53613 12784 33201 82428 69376 61366
9232 61366 45693 45105 70507 9126 -57514 -25742 7046 -34956 -73591 -80318 -81341 -34454 14191
9219 14191 12700 -8191 -33369 29720 83191 11289 -22519 -22431 -4185 5720 47862 77104 106977
9206 106977 164980 117293 13351 6459 -16879 -22527 10774 -7889 -18038 -34379 -105860 -140222
9194 -140222 -86619 13583 60707 117888 69840 4901 13156 -52084 -95780 4218 48125 -3813
9182 -3813 -45513 -57838 -34629 38378 110592 104239 104682 89455 100292 95900 91417 -5327 -54883
9169 -54883 -17961 24249 23233 36128 97902 83913 24574 -44941 -70236 -42038 -36407 16391
9157 16391 24226 65781 37075 9097 15190 -11803 -91540 -152013 -184468 -137860 -73337 -43214
9145 -43214 -76009 -19783 30736 18433 -4386 -11028 3707 5987 13617 22605 -7657 17448 -13292
9132 -13292 -31585 5058 -29002 -52171 -20596 -6684 -15195 -39961 -21972 -24061 -24784 -66052 -61778
9119 -61778 -55397 -64448 -15173 7634 39040 63878 72241 23047 -47722 -80658 -116364 -102032
9107 -102032 -49743 -63358 -111398 -114137 -80439 -56511 -33429 -86173 -77177 -28915 -20145 17526
9095 17526 -75922 -99491 -98108 -56752 -44982 -44645 -14475 3771 -11301 -66073 -103792 -65589
9083 -65589 -37015 -2802 3660 1305 -30261 -38368 -31665 -14060 19296 -1745 27642 43171 63758
9070 63758 -6421 -18099 -5643 39445 2076 24463 92641 91214 40679 42144 30107 24789
9058 24789 25651 32149 54982 2507 -67210 -93891 -37325 -47214 -80664 -110179 -133710 -103241 -79761
9045 -79761 -21088 2117 30240 -6861 -73607 -63207 -19679 -35478 -49015 -24121 -24582 -71119
9033 -71119 -93322 -89829 -76762 -25721 8582 -3866 -34753 -91964 -114538 -138685 -106503 -7715
9021 -7715 29417 81774 11504 -72863 -73672 -40648 -25739 -11730 -38284 -66350 -38458 36227
9009 36227 -59039 -103260 -62902 -36582 -59916 -30751 -30087 -67114 -22881 576 -32573 -45485
8997 -45485 -39262 -73605 -93040 -19769 24896 23468 48694 61728 82714 38906 24108 42291
8985 42291 45870 -51578 -83250 -99678 -58242 28120 63907 43555 11252 28481 17436 73304
8973 73304 68670 -13588 -46106 -18409 -26966 -29130 7976 38477 24669 -60769 -110645 -60563
8961 -60563 2660 838 -18238 12987 23586 16126 -9244 36387 -11132 -25208 -66286 -66322 -70386
8948 -70386 -64317 -107205 -91538 -36881 5624 25900 26378 -19522 -45186 -39797 36545 128352 117721
8935 117721 72273 38704 -11538 -11672 -14420 396 -2681 18135 54647 42354 57435 82063
8923 82063 80981 12442 -39877 -86831 -92368 -65782 60838 61438 -48610 -26880 7463 -61872
8911 -61872 -85897 -57861 -94550 -102678 -96485 -74325 -74987 -9480 62613 132754 164595 103012 102189
8898 102189 44123 -18506 -14677 45029 57891 28274 31818 9652 53394 148214 131681 76056
8886 76056 68196 20574 -28107 -58386 -48167 12674 61667 43674 -23016 -52770 18094 34574
8874 34574 8844 -29954 -99768 -68057 -53042 -48808 1752 5801 -11384 -3393 -7024 1966 17961
8861 17961 28256 75423 46706 48275 43271 35939 12192 32573 69954 56919 31353 13417
8849 13417 -16481 -17263 -44457 -34212 -42850 -48209 -34098 57865 78140 72107 58447 31286 -45874
8836 -45874 -33786 -35858 -6511 41844 28324 -42895 -1961 26073 -3680 24905 31433 58182
8824 58182 74398 42612 33058 34743 27499 1699 45915 43630 60278 80084 69927 4670 -24373
8811 -24373 -34012 15732 69718 74865 37157 43466 55044 45999 49859 47534 51621 14698 -8508
8798 -8508 -91796 -59341 23893 57880 51325 47375 40479 20625 -32873 -21013 13793 50863 107004
8785 107004 38112 -22279 -15119 -2119 -18209 -376 12944 25480 72386 75421 57962 -3241
8773 -3241 6197 47823 52451 12704 -32287 -39306 2936 13279 62390 64573 6504 13737 -15357
8760 -15357 -41988 -44490 -32173 -26913 -59416 -55205 -59000 -23910 50298 74108 56069 9733 -39118
8747 -39118 -29802 -5787 5330 56737 72918 136141 170649 113156 69632 95930 123421 125746
8735 125746 109891 101218 95788 51465 9293 1122 24155 39180 20926 33128 70269 22560
8723 22560 23603 3655 -3430 -40471 -46995 11950 55312 23997 -9110 -10809 -35881 -21953 6880
8710 6880 -3315 10519 -13766 -5986 -6810 29297 110976 110726 55241 63495 60168 34976 51173
8697 51173 104679 110897 46063 84796 145364 96479 -4013 -47938 -20284 -19459 21917 49507
8685 49507 16962 11635 4292 -6735 -978 13203 -23077 -6833 46306 60234 19532 37245
8673 37245 79387 33188 -70 5462 48996 35896 23234 26312 17939 -15566 -13224 20581 75998
8660 75998 128784 100005 41678 46192 18240 -19636 -75460 -117573 -72941 -24516 -47909 -53868
8648 -53868 -20835 12010 -65268 -106521 -73462 -53745 -90568 -108379 -71403 47674 103212 57333
8636 57333 61518 53950 2535 -32769 -34956 -26159 3808 -4487 -12724 -32644 -37052 -44082 -24731
8623 -24731 27058 30586 34467 -19246 -87767 -81173 -66601 -75290 -60867 -52643 -35536 2075 -23122
8610 -23122 -40973 -51306 67894 80341 55841 17794 68226 90126 78106 99352 94086 24587
8598 24587 -33660 -38251 56050 1180 -74249 -86579 -129073 -88738 -113421 -135736 -133689 -98314
8586 -98314 -57342 -4962 -19404 -73761 -83754 8897 32065 -51264 -75564 -20508 -82498 -64362
8574 -64362 -46801 -76783 -37028 -56476 -15419 60600 66471 47415 -18527 -61388 -87882 -33649
8562 -33649 -7406 31533 77151 58567 76578 -19882 -69177 -30413 -18289 60824 68971 25619
8550 25619 -62524 -48294 34627 41224 28188 96533 109055 61520 60473 62021 52282 48878 52672
8537 52672 -4633 8603 301 26986 27216 9962 -11688 36862 66256 66270 83567 52427 60453
8524 60453 18086 -15217 -33913 -93769 -82009 -47685 -52193 -93325 -91153 -71338 -47748 -1018
8512 -1018 40094 91636 59784 25366 -41886 -72559 -88521 -24552 -16572 26677 62005 73762
8500 73762 9147 -709 -40077 -73758 -107472 -83096 -69680 -72936 7938 63809 30152 -43333
8488 -43333 -113019 -121421 -134288 -127541 -51623 -86327 -55725 9661 24155 -17583 -54413 -13246
8476 -13246 -22285 -59588 -64589 -65910 -101240 -124858 -91320 2661 23059 -218 9615 52210 88943
8463 88943 95446 70366 73131 74528 63880 73467 12000 14692 -50172 -81424 -72294 -82643 -105996
8450 -105996 -107064 -140937 -109204 -77407 -48194 -53870 -88558 -65545 -84731 -50145 -11629 -63664
8438 -63664 -138979 -146708 -132431 -103219 -99221 -78175 -57828 -31941 -30264 -42535 -35522 -22068 -28643
8425 -28643 -81290 -80073 -25856 -36674 -46740 -64039 -125769 -150903 -107909 -92970 -141118 -100122
8413 -100122 -67115 -55596 -2361 55944 81346 27587 231 -16794 -36858 -25824 15415 1823
8401 1823 -49176 -65572 -15727 40360 3521 -56169 -58400 -75573 -81781 -79707 -87740 -7872 26766
8388 26766 -9762 -29282 -26293 -17786 -16398 12874 19602 -17155 -38211 -1479 53151 18843 4497
8375 4497 -28206 33409 94950 32386 -10668 -64874 -79200 -40651 -56473 -75199 -39311 -38113
8363 -38113 -39638 -18813 -40089 -34608 -24641 -23291 -978 -30171 -61588 -113271 -74947 -75965 -117268
8350 -117268 -18568 61290 32334 -56446 -95463 -81141 -59516 -78109 -153173 -95806 -59137 -45699
8338 -45699 -46453 -74232 -103810 -116426 -159963 -131778 -92700 -42859 11762 -17273 -8825 -36522
8326 -36522 -49391 -38951 -41275 -8491 -7405 17211 -11879 -15180 -23111 -30034 -47363 -3770 49099
8313 49099 24047 -46032 -174743 -144688 -104688 -13876 -15231 -60063 -61063 -50559 -25475 -28608
8301 -28608 28358 75215 81500 78501 63727 23378 9757 18461 5151 -19554 -30254 -44187
8289 -44187 -653 31511 76063 22947 3130 14783 48261 49438 18286 24091 23720 51768 55342
8276 55342 23271 32381 84092 54219 11678 31161 -7254 -34303 -16185 9854 -65525 -96428
8264 -96428 -65444 -54460 -22812 21864 -6616 -57933 -86648 -61957 -14818 54221 54039 24190
8252 24190 50167 124268 97483 67722 55005 83011 24262 -7451 -28982 22594 -5137 -50705
8240 -50705 -48952 -8658 -59655 -142502 -98678 25822 92783 77393 28001 -73806 -116909 -83911
8228 -83911 -74901 -41647 -7747 -21590 -43798 -52814 -58753 43111 120388 98215 47910 -11056
8216 -11056 -69536 -40356 294 16497 -3847 20212 36755 27594 -2790 -20092 -25418 -86735
8204 -86735 -139037 -94273 -7799 -11662 -474 63743 40965 -6520 -38564 -31500 -29693 9385
8192 9385 38797 30126 11051 12256 21995 34542 35822 14115 -53097 -44978 -51440 -63345 -71402
8179 -71402 -50855 -12233 -24165 -73666 -44994 11090 -2008 -33625 -63102 -50524 2780 10812
8167 10812 9231 29238 47857 19233 17959 1984 -15068 1160 -26 -23160 -90910 -78172
8155 -78172 -69419 -82557 -41040 41677 69444 51714 32010 22322 45254 65183 102401 92133
8143 92133 37238 11628 54349 52338 14853 32974 71821 34805 -12769 7697 -29183 -34411
8131 -34411 -53124 -73114 -100943 -66324 9709 38069 -15309 -27932 -15712 -765 24069 33487
8119 33487 69938 45402 30853 33359 13324 31571 21318 -17191 -63800 -126764 -99512 -63797
8107 -63797 -46419 -28995 -11952 -15666 -40129 -50942 -89030 -74090 -63455 -41516 12907 75919
8095 75919 74497 4831 25488 69750 96842 71511 64952 -19966 -62858 -84623 -75362 -14269
8083 -14269 -47119 -60215 -88072 -79586 -34251 -5212 -8023 10361 98932 34086 21669 62283
8071 62283 42085 24568 23177 17346 18385 15239 8281 12344 19473 11704 -33621 -29843 21308 -14885
8057 -14885 13506 1644 -17041 -6489 10291 -1159 -30068 -24673 19579 31236 46296 38183
8045 38183 32829 49293 44935 67842 42472 28259 78371 81451 57742 54744 15455 -34226 -25079
8032 -25079 -33150 -43737 13545 50048 45956 35799 751 -20500 -39660 -51580 41944 68917
8020 68917 59228 2141 -66769 -66340 -97536 -118322 -116561 -118106 -83796 -27886 -77267 -151430 -152141
8007 -152141 -130366 -31857 14381 -19149 -41728 -55910 -61480 -44794 -8328 -17436 -15215 32013
7995 32013 29405 -31888 -33463 -79743 -73763 -31823 12294 -34829 -42142 -10007 -6514 8382 -17171
7982 -17171 -36062 -78878 -107203 -80208 -35285 -1632 -20290 -80804 -94629 -97594 -105099 -99688
7970 -99688 -84202 -43405 28600 3567 -7550 36139 34337 -19765 26727 52055 19907 5833
7958 5833 -41719 -50863 -87754 -97690 -138391 -137848 -117236 -64828 -28147 15796 32254 42341 35535
7945 35535 -42948 -78320 -40292 -57513 -21566 51416 -7644 -107560 -131958 -149379 -136011 -57578
7933 -57578 -7797 -48700 -43161 -40295 -46645 -19997 -12750 -53603 -22437 -7178 -37808 -103777 -75618
7920 -75618 -46105 -7592 6541 -18854 -36583 -34149 -16697 -27568 -44937 -67821 -93989 -60095
7908 -60095 -75471 -111639 -26007 -1776 951 -6530 -7548 12825 488 3668 47446 73963 96278
7895 96278 69992 5827 -6112 24319 81684 78837 8912 -62248 -64296 -45243 -40039 -25110
7883 -25110 13843 46284 63737 38895 -17333 -14406 60362 58152 82837 94312 67452 56098
7871 56098 19884 66095 -2403 -21431 6375 22961 5059 -22948 -22682 -36042 -39935 -9341
7859 -9341 3464 22089 15497 -28468 -12842 -4108 -46354 -68419 19293 31548 9352 27895
7847 27895 27729 -20311 -31327 -74762 -89628 -95339 -55071 -91300 -62145 -60322 -124743 -119844 -109398
7834 -109398 -71931 -19004 -4593 23620 40917 30137 39012 23993 -9450 23411 50648 75911
7822 75911 31661 11418 38316 49942 22808 23388 96505 79550 91583 140739 98377 20555
7810 20555 -29263 -43304 5856 4052 -36885 812 17187 44869 52966 63673 43783 304
7798 304 -30563 -73622 -33833 -10596 -2315 -5366 19829 64002 27132 -27422 -19713 46282 69562
7785 69562 51647 -273 -54040 -108038 -52162 12724 27858 41 18275 26333 -973 -6936
7773 -6936 -28220 -94037 -124335 -112364 -101889 -95099 -66034 -42609 -2994 16725 19351 3617
7761 3617 -16055 25453 32395 -25484 36893 49773 14900 11085 14169 39623 6241 -2429 -15328
7748 -15328 -38269 -21634 -15371 -2077 42897 18672 61586 109220 117461 89888 81125 18479
7736 18479 11723 64550 68081 -8949 -16057 -6513 -33313 -46480 -36784 -94676 -121285 -83010 -21245
7723 -21245 25984 -51353 -41055 3552 -6490 -23732 -34597 -47154 -55469 -31950 -31647 -23371 -41922
7710 -41922 -92527 -73326 -50558 -20761 34356 43278 4124 10922 12772 18133 17330 -8203 -63673
7697 -63673 -114428 -97558 -41039 -54331 -14694 38125 41832 -29638 -78916 -73380 -12434 13100
7685 13100 28110 16574 -62411 -54136 -1796 23436 38318 70693 57023 24785 24281 23865 3447
7672 3447 -15048 16229 75452 95658 74062 65239 100173 77675 75399 57570 79333 76901 31898
7659 31898 5352 1264 2254 13354 3870 40471 81342 39590 55028 88091 110579 104533 49829
7646 49829 51149 67704 70970 66143 -20954 -63526 7788 86976 113022 90097 20441 2927
7634 2927 70759 92824 106139 85927 61872 63787 62445 53353 47090 53081 71135 50298 29677
7621 29677 -3531 -22414 6277 42930 -19045 -40322 -75432 -88482 -37752 -18115 1451 34619
7609 34619 60947 99378 98174 52677 40716 42362 86417 39960 22624 -23061 -2310 26387
7597 26387 12795 9351 -17620 -16718 3530 -43228 -41713 -46200 -120542 -126581 -66036 -14861 6093
7584 6093 -15643 -25383 -53850 -69687 -108792 -43531 91244 127458 40911 53123 106880 94384
7572 94384 50816 -10313 -30550 -1305 17309 -13192 -2750 -2084 39102 10450 -32058 -55851
7560 -55851 -10028 25419 36553 13110 27090 -3562 -13851 -8529 1176 -10738 -12172 -16391 -61318
7547 -61318 -67818 -63491 16174 2461 -1726 -17222 -39084 -60253 -50625 -51177 -46149 -64714 -111863
7534 -111863 -71200 41387 50881 1875 5998 34940 -48795 -68480 -42069 -52645 -18328 -35055
7522 -35055 -78538 -62665 -105196 -123450 -119666 -109296 -136536 -104409 -14403 -14265 -51951 -24616
7510 -24616 -73349 -123058 -53334 7970 -11017 -69919 -33127 9945 -31605 -77809 -56694 -720
7498 -720 -26310 -72022 -36468 -44653 -44450 -45690 -39046 13585 39349 62694 25964 -14374 -65471
7485 -65471 -83513 -41223 28437 37647 11799 2983 1650 50036 62032 -27619 -73910 -57080
7473 -57080 -73570 -18316 67860 103678 140216 90586 82313 119887 103942 44857 10783 -11413
7461 -11413 -21907 -9952 48491 53865 45255 7449 18997 33465 -34046 -48842 -71551 -89781
7449 -89781 -67116 -17577 43278 65735 110908 134045 99744 102873 106208 88940 92569 73214
7437 73214 68777 62989 42161 23233 -12779 -61377 -21512 87468 94159 54435 30982 49771
7425 49771 42047 45802 36744 39693 -2093 14320 52618 117355 154707 117128 70583 64494 71014
7412 71014 49729 86467 88343 87331 41720 24276 -13062 -52207 -41522 -6044 19389 112933
7400 112933 175883 168662 134425 108381 75224 34209 76904 85776 28634 17386 -3006 -46038
7388 -46038 -72700 22119 28628 13944 -20623 -10162 -11606 -9945 752 18539 -1877 -24221
7376 -24221 -19031 16250 8008 -11949 -12090 -5947 26995 26214 440 -83606 -58744 -58946 -104882 -85514
7362 -85514 -67088 -19617 -25334 -20734 -8928 -48472 -88743 -128271 -125153 -92326 -35756 -49169
7350 -49169 -86932 -153389 -170256 -207424 -175482 -67158 12815 60942 80782 99570 67441 97626
7338 97626 54944 -11597 -62170 -57048 -73349 -47868 -204 -1476 -89826 -90493 -47717 -44213 -23286
7325 -23286 39273 -5209 -20774 772 36806 20910 -7257 15658 33575 47856 60195 84179
7313 84179 79408 70101 22283 -18271 17339 48747 50395 10923 -47072 -88458 -63704 2617
7301 2617 26152 34487 51284 7507 -19809 -8508 16647 30967 82978 112195 76793 20863
7289 20863 29135 63779 42691 -431 18655 53522 -6627 -31601 -16401 -11212 -22496 -38002
7277 -38002 -22018 49317 103334 26615 -68484 -78180 -54486 -85293 -116470 -122651 -90347 11179
7265 11179 92584 44722 -1924 -44047 -27087 8481 -29687 -71504 -75617 7099 42970 32750
7253 32750 46959 -3037 -47542 -43199 -38762 30584 52640 18160 25430 59962 49574 49194 16423
7240 16423 -21659 -26131 22544 6248 -38131 -66749 -43525 -12869 -18331 -50049 -48461 23688
7228 23688 96790 65628 23533 -36238 -81492 -84278 -50845 -4432 27685 -13898 -2268 63630
7216 63630 89685 23312 -37541 -36162 -2950 26388 47290 -20288 -79196 -109734 -93708 -79715
7204 -79715 -62807 -21964 -7530 -5180 -46358 -24562 74817 41234 27951 93833 95969 86920
7192 86920 95446 66387 42238 99940 39621 -58534 -26009 -78583 -115720 -36928 7013 -100308
7180 -100308 -145882 -97461 -54408 -72886 -99627 -94697 -48948 -6221 52155 59348 59281 6156 -121373
7167 -121373 -116500 4095 -19618 -117577 -129192 -100690 -75648 -6403 35564 57071 44209 22719
7155 22719 37501 63282 34821 -10410 6232 76427 157378 107030 78884 27594 -42481 -1248
7143 -1248 50840 75592 -23488 -19635 3936 -9711 -11820 -4628 -44904 -42071 -46549 -58372 -59915
7130 -59915 -116940 -100573 -55983 -12096 -21899 -36457 -52469 -55628 -78640 -49371 2805 7791
7118 7791 28982 -6864 -54253 -29901 -850 59405 75470 37884 -44623 -93776 -41247 -23311
7106 -23311 -29847 -23240 -55060 -42434 -31402 -78559 -130712 -90634 -44560 -88593 -116688 -104545
7094 -104545 -80118 -34169 -10931 -54509 -74995 -44622 51654 61995 86530 67986 -2505 -3175
7082 -3175 31897 18581 11784 48814 37717 6100 -30443 -78042 -19745 32235 39111 -4738
7070 -4738 -52893 26447 47398 41355 26164 40106 39407 52498 46926 10847 61193 125194 78295
7057 78295 34922 40421 98718 136437 96356 21401 -45166 -46466 -13296 -59546 -23051 23122
7045 23122 64325 37491 33260 39605 -23402 -21827 -8609 -24925 -49258 -49255 -49345 -3512 -11090 13704
7031 13704 -2617 41020 68004 50615 61962 37783 6162 -39493 -121043 -106211 -46359 -49726
7019 -49726 -22689 24664 15183 -937 30543 38019 -12158 -20513 39801 44923 61334 76494 93712
7006 93712 106498 92229 48721 38150 4906 -37330 -4336 -21241 -78930 -26616 63685 16194
6994 16194 -35813 -11298 3159 11300 -7818 -7228 -50109 -30367 -85669 -47806 -81117 -71364 -51382
6981 -51382 23291 25567 14635 -30714 -15987 -46916 -118381 -155942 -141262 -91519 -69207 -109803
6969 -109803 -104510 -116342 -97133 -79026 -39861 13657 49741 64721 58892 -8365 -35103 -54720
6957 -54720 -72669 -30868 -23283 35156 39475 5950 16635 -7239 -35478 -37238 13050 27257
6945 27257 -14909 -43211 -64645 -55917 -40817 -58774 6862 38909 63521 39298 25879 17626
6933 17626 33796 7167 24523 38682 22735 60566 105162 127832 127117 56522 -17209 -3100
6921 -3100 19710 25033 76422 41112 -3608 -4955 -92816 -98552 -61257 -55985 -72258 -81759 -51151
6908 -51151 -39363 -63853 -40060 -9422 -71682 -93151 -59428 11246 29181 29484 45687 6035
6896 6035 -5637 25868 19889 -8470 -42994 -34933 14117 26404 38324 46429 77012 94968 124580
6883 124580 65435 12495 -36866 -5288 4020 43398 27157 12229 14997 44346 38273 17113
6871 17113 -1243 -31710 -34244 -24587 -32584 -69297 -48000 -19345 -2469 64058 50983 6838
6859 6838 -55962 -40242 17800 56494 20965 16356 27644 61631 62297 -13614 -66794 -65066 -10940
6846 -10940 -10984 -3891 17032 -6684 -63341 -37592 7612 8217 -12624 -44513 -31682 -23382 -13079
6833 -13079 -6681 -28645 -11130 27249 37003 -17191 -69791 -111650 -139185 -105704 -104837 -120053 -111977
6820 -111977 -90164 -90260 -101041 -62217 5954 68942 -3517 11075 3980 9582 44191 103430 68797
6807 68797 -794 -34274 -29484 -24487 -46809 -63729 -42907 -934 -12436 15488 27808 47170
6795 47170 74138 60082 46092 22422 55003 92982 33529 583 -22136 -39809 -43670 -63682
6783 -63682 2522 720 -22965 -51354 -66965 -52955 -18327 -14524 -3737 19746 -3756 -53771
6771 -53771 -84557 -100761 -62407 -57370 -32765 -16390 -23633 3656 42651 65511 -3321 -95631
6759 -95631 -83055 -60029 -69553 -37500 4100 -8224 33574 35228 33630 15055 46333 64063
6747 64063 68764 59751 32585 41593 26167 65452 26774 37674 47552 -34995 -8444 24004 37354
6734 37354 14252 -6102 -15275 -78929 -99715 -100327 -75472 -97534 -44540 -54458 -78223 -72744 -55586
6721 -55586 -30395 28583 57780 58303 75946 76647 14137 -18913 -44166 -6800 -64015 -99731 -83168
6708 -83168 -88151 -72688 -24840 -30887 -2896 24454 65138 68420 23280 2890 19791 79009
6696 79009 60817 28053 -49525 -83647 -33880 -11079 8847 860 -42585 1270 63452 -18178
6684 -18178 -80090 -115344 -56715 -15028 24462 -3658 -63930 -70809 -31179 -46723 -113668 -148890
6672 -148890 -92321 -11551 17013 -28857 -15981 18333 17566 -921 22185 11192 -8172 -19641
6660 -19641 -11792 -33209 -27988 -66995 -80124 -30755 -54762 -38046 -30458 -8517 -24833 -29530 -30021
6647 -30021 12609 73594 98116 61433 -2614 -59241 -113417 -110717 -48472 40952 41747 39205 45977
6634 45977 82362 46291 25033 18811 15451 50358 88033 75556 52320 72509 32499 -49375
6622 -49375 -98149 -83448 -36147 18895 25837 17083 2167 44619 38852 -8652 36523 133586
6610 133586 134550 18309 -18851 -20515 -43034 -49344 22696 66434 17182 -32559 -27017 -30202 -49810
6597 -49810 -84480 -30135 10446 -34169 -55552 -56243 -71871 -36249 33498 23469 -21378 -17759
6585 -17759 -17772 17551 4112 -29544 -48018 30077 71782 107889 59900 51567 13552 -23613 68271
6572 68271 162731 106360 70719 48450 52648 36446 82296 85657 78476 42945 8150 16282 5719
6559 5719 -9239 -24349 -48885 -93908 -73463 -24473 14556 -12709 -27993 -76201 -44151 -10884
6547 -10884 -3795 50577 48805 54808 19825 31232 27075 19289 103376 108194 54373 32049 -12211
6534 -12211 -41251 -7775 -10848 -35835 -22145 -21422 -7977 21761 33478 -14526 -39313 -18497
6522 -18497 12272 13410 -4938 51803 37322 16722 59658 25933 -29407 -17722 -13735 -28196
6510 -28196 37894 76789 35163 69872 63728 -1510 -21926 -38826 -45177 36016 74199 71209
6498 71209 71055 95194 68217 3783 -2386 54583 78216 123693 187365 167796 93592 125087
6486 125087 111727 -2631 -3965 -13953 -33099 20283 17363 18305 9147 -38801 -51739 -14306 60498
6473 60498 42665 19569 -44112 -68110 -72066 -68083 -42120 -53358 -89214 -19813 1765 -30568
6461 -30568 16749 64534 94732 82839 8415 -62401 -127448 -116846 -21397 -6339 -21416 43366
6449 43366 42183 -21400 -72600 -101556 -51055 -34283 -27208 31455 91785 98382 35057 -40245
6437 -40245 4524 -40890 -82263 -60782 -51284 -10871 -15841 -25688 -21859 40902 30552 9694 -14681
6424 -14681 -61930 -53710 -21199 -2248 3819 -5144 -25546 -85874 -52878 -75229 -88270 -92657 -110546
6411 -110546 -66779 -65714 -11950 15056 -50612 -42754 -64632 -80610 -21327 20323 -9954 10492
6399 10492 1388 24989 14721 26452 3025 1363 31190 13101 -47535 -66939 -19823 25817
6387 25817 23247 9786 -46258 -18192 55697 17785 10065 23197 -1642 27059 47867 18985
6375 18985 2576 -17957 -52178 -31948 -45859 -40619 10073 34155 29483 56267 64276 73940 81725
6362 81725 47282 -42073 -95236 -57613 20127 12032 -30900 -59081 -34939 35030 56891 31667
6350 31667 32056 56589 11651 14745 -31607 -27676 -76501 -128016 -135591 -87677 -10502 10362 2468
6337 2468 -24752 -18904 -57426 -94398 -68968 -102899 -86827 -57583 -118762 -133881 -104349 -33259
6325 -33259 15643 -23872 -21502 -41042 -50941 -77722 -57490 -6092 27850 14676 -29454 -66486
6313 -66486 -56135 -49187 -83846 -82482 7750 -23419 -111024 -106162 -30567 -23409 -6225 38884 17225
6300 17225 6918 60318 81631 37426 12470 -47775 -59097 -27123 -1690 -25362 -114011 -101583
6288 -101583 -17931 21999 26463 42770 60303 92189 103491 67312 75013 70261 -7188 5330
6276 5330 28441 2165 -48198 -25284 33741 87299 102200 84592 63405 48295 26299 60064
6264 60064 59565 49159 18148 16530 78534 111294 134121 85421 44518 21687 32372 36192 -36782
6251 -36782 -100732 -18478 -10832 -55811 -45246 -44831 -31466 -94706 -137127 -110490 -92324 -14389
6239 -14389 -1145 -23233 -27043 -40378 -40930 3309 -2918 -23701 -55114 -59836 -65047 -75932 -87843
6226 -87843 -91618 -63379 -21168 -35899 -17894 -3968 -20507 21802 -13951 -89161 -75614 -77000
6214 -77000 -104375 -26542 -23085 -34207 -41170 -54340 -90342 -152447 -176107 -68770 -24827 -45208
6202 -45208 -46247 -22011 -15321 -35998 -29871 22217 66123 69201 98629 93304 68564 24007 -26854
6189 -26854 -51949 -87144 -98198 -62696 -40451 39406 21452 -28021 -8214 32429 -51487 -92642
6177 -92642 -72486 -111589 -92595 -72809 -48358 -40238 -28186 -31215 -57444 -57053 -69864 -31978 -59306
6164 -59306 -53812 -54106 -42792 37640 53228 -36501 -41708 -12426 20325 36101 -10743 -30188 -47219
6151 -47219 -60778 -59686 -10409 32383 39065 -12291 -24814 -7321 -6949 -7131 56921 51206 6981
6138 6981 -45022 -55920 -61793 -81651 -19940 -40038 -40835 -2177 6619 -12955 17579 36438 11872
6125 11872 13999 21766 -16328 -18038 -9948 -50462 -65223 -109512 -95379 -59925 6320 35930 81448
6112 81448 97724 29221 -736 -9975 -59240 -51749 -81925 -36839 -9629 -40489 -92927 -44911
6100 -44911 -49998 -39059 -17468 -37180 -52638 -73565 -14818 -5541 -12632 -10651 -30751 -14268 14808
6087 14808 -1489 8172 -9886 -81163 -64958 -36427 -14206 7917 -11901 -57510 -26037 32690
6075 32690 94102 113710 71961 73029 59614 -39045 -60361 -5882 38830 37263 3492 -34840
6063 -34840 -104075 -117962 -89383 -80382 -84042 -68233 -96740 -59785 -71008 -111169 -103086 -91117
6051 -91117 -46386 20438 -21103 6168 78988 64455 9386 -29159 -34807 -62259 -33344 -43081
6039 -43081 -57945 -73440 -101014 -89811 -100156 -113520 -92558 -14571 77112 64426 46484 54669
6027 54669 26550 -12303 17827 22356 7775 42647 54514 59011 45471 -1064 -14476 -35115
6015 -35115 -88182 -99836 -70275 -26363 29593 89554 61711 20973 90034 74686 8766 764
6003 764 -22699 -8023 -2276 -13194 -38701 -56472 -9522 2762 -59846 -56520 -76829 -123324 -110555
5990 -110555 -110388 -49180 -20203 -27163 -42327 -16577 -16592 -99982 -131548 -110281 -36639 4791 22633
5977 22633 38076 36338 14525 -32039 -68983 -99755 -66092 -62984 -27671 -40223 -73881 -20045
5965 -20045 31929 -671 -64453 -71831 -63547 -60124 -28153 -38835 -69510 -57043 -7354 -8483 -25001
5952 -25001 -8326 -5616 -32439 3968 66247 81723 98463 115385 41903 22321 10791 3494
5940 3494 -22546 9818 16919 -8354 -43283 -110093 -87228 -53649 -32273 -30742 -35297 -3846 8462
5927 8462 33536 63939 44375 -7084 -33148 5334 38711 78822 42509 -29715 -102 13016
5915 13016 -7919 -25932 -30389 -41477 68445 114659 135292 44195 -58393 -93753 -91658 -122354
5903 -122354 -68081 25087 92054 79482 10498 -23052 15416 -17379 -50481 -57277 -17015 17092
5891 17092 -6357 -10453 -73611 -152157 -101561 -36224 10865 -1066 36815 93691 131962 61837
5879 61837 -7707 -15202 24018 12635 29080 52778 26923 428 12482 10514 61400 99883
5867 99883 52092 -182 2348 18210 15493 -2656 46170 40275 88673 113385 82059 34182
5855 34182 57687 32463 -43375 -39387 -72487 -106164 -76835 -64082 -11682 21123 35783 13820
5843 13820 38837 34446 -18029 -92410 -119399 -148022 -135520 -73879 -17978 48150 74817 62819
5831 62819 4167 28137 47887 58882 46855 64608 103337 90247 44079 -20346 7489 42256
5819 42256 65315 25563 25018 47133 59187 1077 -43415 5531 6985 -24110 -5032 15604
5807 15604 29249 20912 10179 12281 78276 69503 8823 7610 -27967 -11331 -27934 -6888 3216
5794 3216 -8068 57148 58462 22650 15244 -32190 -24990 -49946 -95405 -44898 27767 39586 31921
5781 31921 13451 -1217 -31964 -30026 -27999 50338 133733 97290 72565 77838 16877 18405 36448
5768 36448 16325 70063 56403 47891 41083 -9947 -30689 -343 62149 45404 25423 -31636
5756 -31636 -99164 -61345 61524 72610 680 -6116 -18457 -4287 67754 101488 51370 37629
5744 37629 -17031 -59002 -65486 -76540 -94724 -43639 -8519 -6404 -40710 -34521 12240 7545 -64217
5731 -64217 -46830 -92 83136 114710 122910 108341 78462 73525 86061 73866 51847 31734
5719 31734 -11375 -15651 -14418 -9889 42228 32722 22820 11357 1532 -43520 -62113 -26592 59237
5706 59237 32287 -35740 -54599 -31222 -33407 -19063 -46534 -34728 -9121 98 -23418 -51549
5694 -51549 -57538 1813 87151 127020 168406 187192 137704 134383 132305 111590 57988 23143
5682 23143 54197 74407 53110 15257 43777 84599 107818 103174 87734 -11998 -48772 -33153
5670 -33153 -45817 -26643 21386 16838 34618 46576 5770 5810 -19632 -28329 -32265 -22650 41047
5657 41047 15432 1387 -45767 -58411 -17961 -11524 53285 90492 77404 46746 31393 19338
5645 19338 -3415 -18665 32579 110672 123634 75928 -27603 -60377 -102075 -65682 -45492 -17900
5633 -17900 14871 -18880 -16017 48884 133190 143166 95174 59860 63706 80534 127609 92751
5621 92751 55092 5146 52218 23680 -22601 15743 17626 -1947 59000 127844 102649 90713
5609 90713 115550 110794 141261 112654 94568 26507 -9332 -62539 -55536 -10731 6231 -3447
5597 -3447 14443 49145 54559 30604 45002 14 -59939 -49660 -48490 -64685 -37787 3640
5585 3640 9047 27126 -11113 -75979 -69374 -137975 -61841 -3891 -8366 -4518 -4268 -10659 -33711
5572 -33711 -36396 -13418 -11350 -15342 -26671 19840 -33276 -114645 -64343 -1672 -4251 10933 -8303
5559 -8303 -7422 -34179 -22402 18741 28664 64567 77558 69512 17827 16000 10072 -10710 41934
5546 41934 51487 8872 -10080 -36961 -27122 22014 33362 10505 -4463 -38041 -3938 34272
5534 34272 28281 -20490 -31083 -43693 -66255 -66763 -51054 -31674 -38687 -62909 -15725 -3372 -28237
5521 -28237 -36291 -57671 -26064 29735 73810 86652 15012 -8781 48429 109759 118096 127123
5509 127123 51643 18149 52129 15925 -29146 -47132 -5267 39739 34056 -3898 -15874 17163
5497 17163 -11887 -67298 -76423 -50582 -4091 -246 -871 -9180 -75020 -76369 -28587 37746 50893
5484 50893 -5590 -26597 -60136 -64508 -75457 -81713 -75495 -52453 -88699 -54986 -4321 70725
5472 70725 101673 94204 94994 131692 90409 43526 40199 3980 16017 15333 -10442 33724 63652
5459 63652 10750 -61044 -16229 -62329 -91154 -17060 494 -33415 -30894 -484 461 72046
5447 72046 96613 67481 66257 13641 -39638 -60850 -56198 -90143 -144768 -122322 -88998 -42700
5435 -42700 23646 48497 5476 11701 -14238 -35707 -33483 -72477 -47261 -18359 -24872 -42139
5423 -42139 -31084 -52848 -28293 -29949 -24588 35524 56490 27667 6668 16993 29383 -29213
5411 -29213 -46893 -50072 -24719 -33465 -29016 -51053 -74983 -87062 -57653 -72193 -42419 -21179
5399 -21179 15812 81073 85173 51903 43460 23890 24771 -50133 -156136 -222790 -211977 -93993
5387 -93993 -36538 2450 -64731 -113765 -117047 -103155 -93182 -87290 -30483 -15730 6249 13146 23743
5374 23743 6764 -13154 12074 43201 -15099 763 -11511 -22615 35246 42982 23842 -7988
5362 -7988 -21695 -60852 -90169 -102793 -111631 -42075 22841 45623 26293 5438 38297 26794
5350 26794 6167 -67553 -81037 -46535 -39353 -78941 -19797 32903 66607 9321 -1333 28551
5338 28551 86554 110037 75500 58950 72250 51444 45916 -12904 -58537 -95967 -35045 -21899
5326 -21899 10511 27184 28508 28482 36656 52786 33557 26954 6639 -36378 -12006 17125 -22860
5313 -22860 -54106 -24916 8011 -44922 -58323 -9228 28 30497 106500 101256 -13786 -76856
5301 -76856 -61609 -62341 -40362 56639 10412 -24114 -109658 -188266 -129942 -57142 -22291 604
5289 604 -27453 8254 98811 88941 68997 78761 99346 84148 70427 31660 -28792 -13955 28861
5276 28861 11563 -48807 -88329 -50158 -7038 16892 35985 -13483 -8472 3678 8909 -4899
5264 -4899 -23123 -40197 -24282 60016 87523 58621 19263 -7544 -54064 -89957 -36648 -16009
5252 -16009 -80594 -116733 -48836 38308 -7785 -46536 -9545 62632 88479 59877 41544 20181
5240 20181 -19486 -22982 -17353 3027 -14072 2449 -8751 -14617 4498 -11033 -23726 -11598
5228 -11598 -18586 -14930 48724 42697 52760 39294 48316 71375 90081 82344 73036 24652 -42449
5215 -42449 -41408 -907 21054 44828 3367 -28521 -57954 -23824 -4289 19809 68038 20510
5203 20510 9117 10552 -12276 -16061 -46795 -56598 -59626 -72509 -60842 -47666 -33840 -45587 -101776
5190 -101776 -206605 -249441 -192558 -157821 -114825 -53431 -15119 1255 -217 15737 5885 -27813
5178 -27813 -65521 -91460 -92351 -96981 -128515 -112040 -1139 79354 86601 115257 118644 128550 59640
5165 59640 -46369 -74985 -44119 -36378 -40644 -54192 -27719 46344 74031 47572 56092 67266
5153 67266 68486 58257 -29201 -109311 -139750 -84424 -5322 42465 86008 88239 55087 42109
5141 42109 39927 52374 8256 23592 79689 83789 47909 18582 -30976 -26984 -6403 13538
5129 13538 15299 -8279 -53746 -38103 35881 64021 37402 -18273 -26751 -2851 10798 1272
5117 1272 -5126 58124 73820 58828 -24514 -63587 -82591 5832 -3285 -88511 -45834 -17816
5105 -17816 2730 19815 -7532 -31870 2365 -24840 5620 14322 -1348 -27466 -38613 -80703
5093 -80703 -33111 7531 47180 43222 -25979 -35623 -52685 -60750 -85263 -113939 -52047 11507
5081 11507 38101 -4627 -18982 -32168 -54375 -65067 -73215 -71238 -33600 21287 51506 129016
5069 129016 116522 79335 19177 -54135 -34450 -52520 -80307 -36359 11271 1764 474 35626
5057 35626 22339 21128 59049 95103 99141 81589 49732 11816 680 -9584 -6281 -32067
5045 -32067 19728 67684 23314 -16398 -8572 -58570 425 44989 3750 -24219 -1747 38856
5033 38856 10902 55563 63033 21513 -26749 -38249 -36425 -79728 -101847 -92521 -45681 -12727
5021 -12727 -34480 -53434 -37085 -57407 -14936 -3066 13783 31225 32656 45913 26159 5039
5009 5039 28630 61068 36071 25792 43021 59251 67264 39608 48713 33992 8288 -44098
4997 -44098 -54556 -35219 -48654 -27754 -43209 -52644 -65270 -98847 -127057 -115938 -107355 -108587
4985 -108587 -88689 -81391 -39006 -26343 -32712 -76426 -63480 -56471 -6859 22794 28742 15963
4973 15963 -13301 -40397 -98390 -117342 -81758 -20183 -25499 -53764 -26202 -34855 -26191 16753
4961 16753 27748 36764 9737 -6425 2282 32023 -3825 -69059 -51848 -6247 -25566 -40561
4949 -40561 -25192 8565 11622 10748 -7387 36990 60347 37193 -58059 -75573 -58600 40974
4937 40974 54684 -28585 -101421 -77196 -60231 -8285 61548 -9768 -113721 -100784 -102380 -75976
4925 -75976 -44428 -8300 18105 34173 68601 21294 24586 49604 54728 7741 -20757 2442
4913 2442 11503 -9494 6272 55947 69335 19301 12563 26877 62979 68357 67287 84024 111886
4900 111886 75418 34137 -32320 -44008 -49935 -69374 -42591 -23732 -19520 23549 -5544 28881
4888 28881 14790 -22587 -2692 34141 43579 60425 54553 89819 98711 72936 78442 64556 33625
4875 33625 29128 -13139 9091 96637 80713 69417 11895 29688 -71597 -100333 -33937 94539
4863 94539 178151 161122 96066 57442 -3786 20012 54546 -18952 -80242 -83412 -66698 -10927
4851 -10927 45073 81082 35134 52994 -1718 -44029 -90687 -121899 -149044 -123027 -123411 -113517
4839 -113517 -119233 -129700 -93735 -58976 -3898 4082 32500 58894 47663 23714 38919 4246
4827 4246 672 -66350 -139544 -133033 -128071 -49563 -16464 7851 44049 29767 5554 33581 75726
4814 75726 92012 69524 12993 -2510 -10896 -47051 -39165 23781 44254 27553 10537 8021
4802 8021 37427 14810 43926 75940 55661 -7210 -19524 37119 25241 -40368 -68167 -33978
4790 -33978 1590 14491 -29781 -34491 -12191 -11563 -39813 -29024 10238 33815 83164 50832
4778 50832 -14748 -26531 6242 -17273 -13614 10781 -30425 -77675 -46353 16250 36980 -30413
4766 -30413 30313 69752 103334 87805 16756 430 8639 -3935 28648 44252 2191 43473
4754 43473 96654 87917 49126 45377 25476 16166 29244 15407 -50736 -82933 -90154 -14170 12268
4741 12268 50861 78822 68807 -11215 -69722 -51782 -1967 26710 9922 32467 32151 70883
4729 70883 73041 35924 24834 57708 65886 63268 73376 41507 30709 24674 17450 33943 48000
4716 48000 67733 128447 195334 208536 188744 123619 69808 25635 -1663 28139 28987 79348
4704 79348 80444 65466 58172 35092 -311 -42999 -92523 -97861 -102937 -78531 -41982 -38983 -41224
4691 -41224 -62905 -59847 -77412 -40404 -16544 40545 94216 61083 2816 -6387 7351 3523
4679 3523 68009 93123 73519 108015 75843 90177 23053 -45572 1339 32983 28484 26303
4667 26303 59851 43225 24056 97477 107989 59170 33173 -8443 5635 -2930 -208 65593
4655 65593 99635 86834 60339 52033 54016 18490 20098 9712 -27438 -7969 23288 5466
4643 5466 -46401 -64136 -31300 -19251 -32811 -7314 19043 -21922 -16205 -31715 -14575 51334
4631 51334 41439 64011 104941 85981 -2457 -6562 71831 78489 42753 28210 -23307 -43550
4619 -43550 11436 21415 44385 61756 60605 28700 14129 57672 34290 -7767 -38604 -66392
4607 -66392 -55326 -51475 35730 49825 897 -15396 -43622 -29537 -2601 33670 36184 -16900
4595 -16900 -53377 -62781 -81967 -76770 -97650 -118541 -97276 -44633 -15580 -49157 -27758 -22592
4583 -22592 -12099 12944 53333 54832 27364 -34897 -48376 -5628 -902 -50332 -71734 -46984
4571 -46984 -27029 -63511 -102787 -59480 3706 -15527 -50041 -50198 29076 39271 -8664 -63477
4559 -63477 -83638 -77883 -7822 1257 -7882 38424 47478 -3131 35892 65625 23210 -28279 -59677
4546 -59677 -21177 4315 -19948 -48088 12960 13735 966 -27526 -20566 -54122 -45949 37842 99563
4533 99563 111137 86459 44539 -54261 -98776 -74191 -85767 -111063 -100391 -112936 -85945 -23170
4521 -23170 -51231 36161 80582 113081 124523 82003 57304 93220 59226 -10769 -62572 -23191
4509 -23191 16365 -43188 -50536 -71025 -42883 -34268 -76637 -60387 -13907 -13125 -11399 53608 40496
4496 40496 -1989 -65253 -18266 70205 81716 104428 92830 16711 27712 -24953 -42515 -75239
4484 -75239 -91647 -96602 -130429 -133315 3074 36226 -51416 -75589 -63203 -40735 -58083 -61065
4472 -61065 2166 48240 23240 18590 16524 49611 14999 37951 62749 50537 23432 36676
4460 36676 22059 53568 101310 96910 45411 -4291 26863 28782 29120 -4215 -6262 10253 40975
4447 40975 99010 95246 54279 7469 -8078 -26896 19179 31634 11897 9277 28640 -1981
4435 -1981 -40873 -42757 -30572 -34470 -32110 -5816 -31986 -44841 17782 65147 74521 51923 8489
4422 8489 -26517 -56216 -57741 -25345 64763 52911 43102 18213 -15297 -56741 -53684 -28414 -25816
4409 -25816 27953 49910 33112 17130 -51958 -50768 -38872 3540 5939 -8778 14412 69055
4397 69055 21317 -16564 -26770 -34698 -31456 -14760 8157 -4359 -9220 -240 -34026 -37100 8037
4384 8037 14027 -10293 24802 -3022 -13193 20163 15034 -3107 -29922 -62869 -117365 -72347
4372 -72347 -30882 -80792 -67621 -57069 -84970 -88271 24036 92196 76783 65731 49714 10797
4360 10797 -36818 -62495 -43896 -82564 -70359 -106407 -148940 -143993 -79342 -34883 1832 21352
4348 21352 22812 25472 34624 59792 -5274 -20225 -46661 -85533 -51044 -16144 -4701 -22918
4336 -22918 -8372 -13368 -10412 4668 2043 -25841 -52323 -49237 -54503 16824 79161 45089 13555
4323 13555 20096 18862 -54919 -94725 -47412 19500 36670 -10817 27030 23201 -14308 -27506
4311 -27506 71716 42821 6533 35308 69421 80496 89864 19708 -11433 -23228 -26254 41186
4299 41186 104071 86127 7357 -15692 -4689 11163 61038 96686 79561 27456 37089 43341
4287 43341 27875 13513 -13980 -16310 -15701 -19244 -34104 11505 -9212 -4445 10733 11453 -24659
4274 -24659 -51801 -25704 -16404 -29341 -64726 -28302 5442 34053 -2125 -4894 56091 135659
4262 135659 122092 85440 50387 41049 23353 5049 -88253 -108849 -127583 -83408 -99238 -120691
4250 -120691 -139317 -154333 -108229 -115781 -73715 -3938 -2037 27391 29460 17779 106443 92990
4238 92990 38515 55502 19045 -37332 -57397 -29549 13740 35979 25770 25415 -11730 -25484
4226 -25484 -19553 5530 55820 44319 6966 -39392 -52346 -66306 -30058 11323 -12543 -42104
4214 -42104 -74965 -39214 25636 87746 144777 157218 99487 84718 58460 -29891 -48448 -6448
4202 -6448 7940 -12945 -45581 -62444 -40367 -141670 -153384 -58826 1456 608 25555 74841
4190 74841 111192 96385 77731 52749 53305 37487 -5097 6579 41987 11212 -5128 25028
4178 25028 -32345 -71030 -47897 -48979 -67164 -49934 -70522 -11139 -3580 -37094 -106214 -129389
4166 -129389 -96384 -64517 -55148 -60928 -45291 -36266 -72675 -76390 -65139 -68853 -95064 -151343 -188040
4153 -188040 -158469 -145875 -125843 -101513 -61561 -95352 -104300 -69346 -52785 -11465 43057 87783
4141 87783 72282 32817 -48468 -19008 31020 41499 63096 49122 16062 98462 183449 116400
4129 116400 30706 65209 117661 114934 102367 67243 46712 53906 32357 28952 41403 70201
4117 70201 102863 37486 -62204 -43702 -7347 -14653 -32724 -19622 28110 62673 24377 19265
4105 19265 28025 32122 16388 -937 46447 98596 163866 142376 127647 103117 16548 -54327
4093 -54327 -51643 -48707 -66809 -27677 7869 34561 31788 6060 12115 25545 37601 56595 77833
4080 77833 24197 30586 59828 96421 128004 94631 3015 -43897 -26942 21571 41371 7358
4068 7358 -4781 -16064 -17325 -16604 -42610 -60416 -43091 -21578 -93797 -113485 -59841 -35392 8783
4055 8783 38264 36938 58380 36908 2875 23119 42727 75712 36068 -6763 -20841 -36114
4043 -36114 -36300 -44869 -95579 -65647 -20148 33708 60372 28215 28864 45648 47359 25916 -18809
4030 -18809 -68239 -79561 -19543 -21173 -86374 -86428 -72157 -68772 -54724 -77341 -107888 -154253 -120426
4017 -120426 -96726 -38550 -30095 -55584 -49222 -72734 -57211 -74849 -54758 8464 28116 6663
4005 6663 -9667 -54301 -50883 -78454 -102199 -103007 -91401 -85953 -45521 -47579 -21923 -5570 -44134
3992 -44134 -20495 23537 45454 92606 59320 -6149 -44308 -29434 18820 65550 70056 71204
3980 71204 33942 24292 32850 909 -3902 19796 39754 -8834 -30686 -13370 -1173 -3016 -33500
3967 -33500 -27782 59989 67522 36488 32203 8103 -16290 58553 82878 61840 12621 -52179
3955 -52179 -101527 -56883 -4110 47518 54535 23555 28761 42694 46734 -9871 -38337 -28786 10334
3942 10334 -15894 -74499 -64481 -19812 -2823 -13106 -18529 -20399 24083 70622 17984 15432
3930 15432 68633 118392 69223 44631 78840 101467 99503 132362 125713 82291 4251 -76055
3918 -76055 -55446 -27883 -23435 8707 46070 69316 71632 88775 41020 23084 36655 54217
3906 54217 42002 9194 -4578 60206 118267 124843 42773 11524 -1179 -16799 -55263 -40557
3894 -40557 -22180 -51425 -19574 -9782 18693 35258 59458 16419 -9707 -18219 -30612 -31244 37165
3881 37165 104480 100663 84748 44333 6721 -31784 -29877 -39562 -38525 -43995 -49051 -76369 -65423
3868 -65423 -63827 -24535 -5953 -80054 -118917 -72199 -14041 21401 50124 52908 799 -43394
3856 -43394 -1204 24336 -5885 25683 43303 5140 43492 110931 168973 147870 105248 38737
3844 38737 21174 16097 -5516 -19238 -50564 -92636 -102092 -90464 -80573 -80380 -9569 20466 52576
3831 52576 -5548 -21171 33600 57582 57225 38496 44565 53219 6521 -24422 -18441 -40253 -48670
3818 -48670 -41821 -44626 2561 4992 29117 38668 39197 67629 31492 14456 11820 12549 -39681 -111817
3804 -111817 -99764 -68696 -86986 -28085 49610 119981 94554 25326 93747 75666 -23505 -53677
3792 -53677 -26792 -47826 -97006 -71711 -46777 -41733 29444 59582 61820 78017 19093 -79765
3780 -79765 -101346 -133008 -87391 -72395 -52691 -8234 35136 15175 -8 -10270 -21034 -18749
3768 -18749 -29958 -43282 -39120 3062 13006 1977 -2687 19941 10915 20397 102268 103873 81638
3755 81638 41418 -19948 -28028 -32796 -75509 -116503 -89537 -78992 -81946 -74814 -40195 -9578 -30982
3742 -30982 -41181 -18211 28298 43912 -27993 -39775 -16944 -69269 -110566 -106027 -42873 -50334
3730 -50334 -37287 -47768 -82536 -57132 -74983 -89864 -54669 21063 66316 31788 64337 51555
3718 51555 33399 32087 34870 50629 21267 16331 7139 44287 77602 81071 59890 53481 30546
3705 30546 -8226 37280 79678 81782 62792 40697 43739 24081 30125 44065 32864 27561 94430
3692 94430 76626 38134 63301 47979 43075 43185 24041 -25810 -11119 41975 28519 19662 58687
3679 58687 22811 29586 4265 -16255 1144 -34677 -13157 70028 68164 -3159 -23026 32159
3667 32159 29724 -15615 -29751 -21814 6194 49299 49707 64044 66569 73729 70394 60544 136923
3654 136923 108361 12511 42018 92870 68545 8173 -39915 -63042 -26385 13010 -9986 -71756
3642 -71756 -117266 -115621 -72904 -47878 -43503 -76943 -36953 -4925 -9455 -11304 -25654 2398 1712
3629 1712 5794 357 10927 13916 27792 31923 -20031 -751 -11978 -8464 10942 -17104 17209
3616 17209 60126 21889 -58143 -43702 2760 -28933 -34236 -19693 -10594 35902 35201 23420 27455
3603 27455 50714 14188 27575 76945 126347 74852 43962 55626 14698 62253 99144 63023
3591 63023 31088 -19482 -69695 -59979 -26288 -18622 21754 -3025 -16581 -18798 -2004 8435
3579 8435 14160 31131 35090 10675 -22654 -36845 -42855 -30430 -22842 -23604 -10343 10399 42908
3566 42908 25287 5108 429 -770 51289 99536 114341 98244 42103 32708 77399 113303
3554 113303 100169 71092 53806 3326 25245 77921 54026 18685 -18876 -37836 -43814 -13640
3542 -13640 -5383 10893 37234 31200 -30178 -82122 -53333 -15805 -1177 -29741 -7556 54839
3530 54839 101867 104172 71231 2419 -2574 50579 94825 44860 -14022 -48434 -5278 -29312
3518 -29312 -54989 -62941 -38049 953 56366 23574 6053 -40638 -68115 -27019 44289 77413
3506 77413 46039 17952 -25437 12549 74415 68850 36678 33470 1829 5981 34711 31759 -54898
3493 -54898 -61815 21092 62516 83451 26238 -68901 -81204 -19387 -32448 -66616 -79546 -410
3481 -410 -5218 -60380 -60356 -11522 19419 19277 -9853 25215 70236 122442 128242 114948 88699 64248
3467 64248 82585 66445 87983 73053 4318 -31120 -32975 -11198 2359 27048 -10490 -35420
3455 -35420 -21930 -37871 -41884 17749 61298 45734 36340 62075 90372 74211 44846 -8563
3443 -8563 -73468 -88258 -5320 -22228 -53868 -47631 -10056 25422 -16901 -40481 -29884 -23319
3431 -23319 -1653 -22854 10231 34751 67418 -11835 -12908 24098 71445 105735 58898 46866
3419 46866 34128 24781 17980 -43676 -42656 14028 18559 -6844 -718 69812 28956 8648 -20405
3406 -20405 -64967 -55707 -55267 -39946 -33903 -64234 -48085 -42680 4711 32391 84321 97724 79376
3393 79376 13668 -12951 -40608 -37253 -38289 31684 79689 21465 -14070 -34202 -57198 -16691
3381 -16691 30598 17265 61004 55780 6715 -15707 24219 24214 12821 54941 73433 16739 15638
3368 15638 70166 99197 38690 35839 33354 -9425 -2387 -18243 -12439 -2054 -14130 10883 -21757
3355 -21757 -37867 26922 18730 28130 -13099 -47380 -79911 -61257 -52997 -49530 -6621 48239 80957
3342 80957 103435 37458 35800 31186 37495 -44907 -141988 -76286 -54754 -108528 -87872 -77222
3330 -77222 -111664 -107665 -103513 -91887 -41476 -68528 -52573 -11513 4822 32237 36180 30038 61995
3317 61995 73187 108676 86427 53476 44834 12079 67864 33988 -64560 -80254 -44801 37183
3305 37183 49786 81574 85259 50037 -18393 -45045 -3774 3960 -14173 -4993 17586 52635
3293 52635 9639 -30086 -18105 -4768 -71585 -48679 -2661 -39128 -88651 -79908 -65173 -9105
3281 -9105 56454 55153 -20139 11613 60828 73777 97443 75374 42101 33962 61099 -11497
3269 -11497 -25574 26282 47088 58084 23150 -71069 -125884 -138520 -110496 -104182 -113024 -60290
3257 -60290 -35718 -15214 -77457 -86123 -41139 -17751 53324 55849 59263 1275 -73079 -114157
3245 -114157 -28575 66314 38602 -13346 -24833 -52304 -52247 -21175 -24057 -18170 -22732 14361 24821
3232 24821 56767 67317 31828 -26131 -20563 11006 -36583 -60764 -57979 -9495 -27190 -85382
3220 -85382 -49964 -71032 -71532 -67168 -38911 49988 131023 84250 41332 54128 41931 66182
$$ [...]
##END NTUPLES=NMR SPECTRUM
##END=
