##TITLE=Analysis number 317442
Compound Code btb 06289
Project Code qc-cat
Chemist Name fudan
##JCAMPDX= 6.0         $$ Bruker NMR JCAMP-DX V2.0
##DATA TYPE= NMR SPECTRUM
##DATA CLASS= NTUPLES
##ORIGIN= Bruker BioSpin GmbH
##OWNER= nmr
$$ XWIN-NMR		Version 3.5
$$ Mon Feb 20 15:52:29 2006 GMT Standard Time (UT+0h)  MAYBRIDGE\nmr@NMR_250MHZ
##.OBSERVE FREQUENCY= 250.131544655141
##.OBSERVE NUCLEUS= ^1H
##.ACQUISITION MODE= SIMULTANEOUS (DQD)
##.ACQUISITION SCHEME= undefined
##.AVERAGES= 16
##.DIGITISER RES= 18
##SPECTROMETER/DATA SYSTEM= dpx250
##.PULSE SEQUENCE= zg30
##.SOLVENT NAME= DMSO
##.SHIFT REFERENCE= (INTERNAL, DMSO, 0, 16.522)
##AUDIT TRAIL= $$ (NUMBER, WHEN, WHO, WHERE, WHAT)
$$ ##TITLE= Audit trail, XWIN-NMR		Version 3.5
$$ ##JCAMPDX= 5.01
$$ ##ORIGIN= Bruker BioSpin GmbH
$$ ##OWNER= nmr
$$ C:\u/data/dgb/nmr/ADRS/16380/pdata/1/auditp.txt
$$ ##AUDIT TRAIL=  $$ (NUMBER, WHEN, WHO, WHERE, WHAT)
(   1,<2006-02-20 15:51:54.09 +000>,<MAYBRIDGE\nmr>,<NMR_250MHZ>,
      <created by zg, POWCHK disabled, PULCHK disabled
       configuration hash MD5:
       84 BC 41 DB A1 6E 1D 46 DA 25 12 A5 C1 ED C5 3A
       data hash MD5: 64K
       36 F3 E6 4C 37 54 39 A3 74 A7 46 67 16 34 CE 8C>)
(   2,<2006-02-20 15:52:13.40 +000>,<MAYBRIDGE\nmr>,<NMR_250MHZ>,
      <Start of raw data processing
       ef LB = 0.3 FT_mod = 6 PKNL = 1 SI = 32K 
       data hash MD5: 32K
       38 5B 27 52 16 B0 60 07 F8 23 F0 68 F9 69 BC 54>)
(   3,<2006-02-20 15:52:17.90 +000>,<MAYBRIDGE\nmr>,<NMR_250MHZ>,
      <apk 
       data hash MD5: 32K
       2C AD 54 02 69 70 27 1D 65 29 37 A3 40 3E F0 2C>)
(   4,<2006-02-20 15:52:19.39 +000>,<MAYBRIDGE\nmr>,<NMR_250MHZ>,
      <abs ABSG = 5 
       data hash MD5: 32K
       F2 51 AD DA 3E BE 79 EE E7 11 1F C3 F5 85 41 A6>)
$$ ##END=
$$ 
$$ hash MD5
$$ 99 35 47 F0 21 B6 65 65 B3 2F 0F 2F 70 EA 0D 11
##$RELAX= 
##$RELAX= 
##$RELAX= 
##$RELAX= 
##$RELAX= 
##$RELAX= 
##$RELAX= 
$$ Bruker specific parameters
$$ --------------------------
##$DU= <C:\u>
##$EXPNO= 16380
##$NAME= <ADRS>
##$PROCNO= 1
##$TYPE= <nmr>
##$USER= <dgb>
##$AMP= (0..31)
100 100 100 100 100 100 100 100 100 100 100 100 100 100 100 100 100 100 
100 100 100 100 100 100 100 100 100 100 100 100 100 100 
##$AQSEQ= 0
##$AQ_mod= 3
##$AUNM= <au_zg>
##$AUTOPOS= <46 >
##$BF1= 250.13
##$BF2= 250.13
##$BF3= 250.13
##$BF4= 250.13
##$BF5= 500.13
##$BF6= 500.13
##$BF7= 500.13
##$BF8= 500.13
##$BYTORDA= 1
##$CFDGTYP= 0
##$CFRGTYP= 5
##$CHEMSTR= <none>
##$CNST= (0..31)
1 1 145 1 1 1 1 1 1 1 1 1 1 1 1 1 1 1 1 1 1 1 1 1 1 1 1 1 1 1 1 1 
##$CPDPRG= <>
##$CPDPRG1= <>
##$CPDPRG2= <>
##$CPDPRG3= <>
##$CPDPRG4= <mlev>
##$CPDPRG5= <mlev>
##$CPDPRG6= <mlev>
##$CPDPRG7= <mlev>
##$CPDPRG8= <mlev>
##$CPDPRGB= <>
##$CPDPRGT= <>
##$D= (0..31)
0 1 0 0 0 0 0 0 0 0.06 0 0 0 0 0 0 0.0002 0 0 0 0 0 0 0 0 0 0 0 0 0 0 
0 
##$DATE= 1140450712
##$DBL= (0..7)
120 120 120 120 120 120 120 120 
##$DBP= (0..7)
150 150 150 150 150 150 150 150 
##$DBP07= 0
##$DBPNAM0= <>
##$DBPNAM1= <>
##$DBPNAM2= <>
$$ [...]
##$SUBNAM7= <"">
##$SUBNAM8= <"">
##$SUBNAM9= <"">
##$SW= 20.6930455092707
##$SWIBOX= (0..15)
0 0 3 0 0 0 0 0 0 0 0 0 0 0 0 0 
##$SW_h= 5175.983436853
##$TD= 65536
##$TD0= 1
##$TE= 294.16
##$TE2= 300
##$TE3= 300
##$TEG= 300
##$TL= (0..7)
0 120 120 120 120 120 120 120 
##$TP= (0..7)
150 150 150 150 150 150 150 150 
##$TP07= 0
##$TPNAME0= <>
##$TPNAME1= <>
##$TPNAME2= <>
##$TPNAME3= <>
##$TPNAME4= <>
##$TPNAME5= <>
##$TPNAME6= <>
##$TPNAME7= <>
##$TPOAL= (0..7)
0.5 0.5 0.5 0.5 0.5 0.5 0.5 0.5 
##$TPOFFS= (0..7)
0 0 0 0 0 0 0 0 
##$TUNHIN= 0
##$TUNHOUT= 0
##$TUNXOUT= 0
##$USERA1= <user>
##$USERA2= <user>
##$USERA3= <user>
##$USERA4= <user>
##$USERA5= <user>
##$V9= 5
##$VALIST= <valist>
##$VCLIST= <CCCCCCCCCCCCCCC>
##$VD= 0
##$VDLIST= <DDDDDDDDDDDDDDD>
##$VPLIST= <PPPPPPPPPPPPPPP>
##$VTLIST= <TTTTTTTTTTTTTTT>
##$WBST= 1024
##$WBSW= 4
##$XGAIN= (0..3)
0 0 0 0 
##$XL= 0
##$YL= 0
##$YMAX_a= 356758
##$YMIN_a= -451866
##$ZGOPTNS= <>
##$ZL1= 120
##$ZL2= 120
##$ZL3= 120
##$ZL4= 120
##$ABSF1= 16.522
##$ABSF2= -4.171173
##$ABSG= 5
##$ABSL= 3
##$ALPHA= 0
##$AQORDER= 0
##$ASSFAC= 0
##$ASSFACI= 0
##$ASSFACX= 0
##$ASSWID= 0
##$AUNMP= <proc_1d>
##$AZFE= 0.1
##$AZFW= 0.1
##$BCFW= 0
##$BC_mod= 0
##$BYTORDP= 0
##$COROFFS= 0
##$CY= 12.5
##$DATMOD= 1
##$DC= 0
##$DFILT= <>
##$DTYPP= 0
##$F1P= 14.0000005364418
##$F2P= -0.99999901652339
##$FCOR= 0.5
##$FTSIZE= 32768
##$FT_mod= 6
##$GAMMA= 0
##$GB= 0
##$INTBC= 1
##$INTSCL= 1
##$ISEN= 128
##$LB= 0.3
##$LEV0= 0
##$LPBIN= 0
##$MAXI= 10000
##$MC2= 0
##$MEAN= 0
##$ME_mod= 0
##$MI= 0
##$NCOEF= 0
##$NC_proc= -4
##$NLEV= 6
##$NOISF1= 0
##$NOISF2= 0
##$NSP= 0
##$NTH_PI= 0
##$NZP= 0
##$OFFSET= 16.522
##$PC= 1
##$PHC0= 229.7684
##$PHC1= 10.24123
##$PH_mod= 1
##$PKNL= yes
##$PPARMOD= 0
##$PSCAL= 4
##$PSIGN= 0
##$REVERSE= no
##$SF= 250.13
##$SI= 32768
##$SIGF1= 0
##$SIGF2= 0
##$SINO= 400
##$SIOLD= 32768
##$SREGLST= <1H.DMSO>
##$SSB= 0
##$STSI= 32768
##$STSR= 0
##$SW_p= 5175.98343685301
##$SYMM= 0
##$S_DEV= 0
##$TDeff= 65536
##$TDoff= 0
##$TI= <Analysis number 999999
Compound Code 99
Book Reference 9
Project Code 9>
##$TILT= no
##$TM1= 0
##$TM2= 0
##$TOPLEV= 0
##$USERP1= <user>
##$USERP2= <user>
##$USERP3= <user>
##$USERP4= <user>
##$USERP5= <user>
##$WDW= 1
##$XDIM= 32768
##$YMAX_p= 573854198
##$YMIN_p= -229905
$$ End of Bruker specific parameters
$$ ---------------------------------
##NTUPLES= NMR SPECTRUM
##VAR_NAME=  FREQUENCY,     SPECTRUM/REAL,   SPECTRUM/IMAG
##SYMBOL=    X,             R,               I
##VAR_TYPE=  INDEPENDENT,   DEPENDENT,       DEPENDENT
##VAR_FORM=  AFFN,          ASDF,            ASDF
##VAR_DIM=   32768,         32768,           32768
##UNITS=     HZ,            ARBITRARY UNITS, ARBITRARY UNITS
##FACTOR=    0.157963299565203, 1,           1
##FIRST=     4132.6476996994, 0,             0
##LAST=      -1043.33573715361, 0,           0
##MIN=       -1043.33573715361, -229905,     0
##MAX=       4132.6476996994, 573854198,     0
$$ Real data points
##PAGE= N=1
##DATA TABLE= (X++(R..R)), XYDATA
$$ [...]
20363 43617 29618 78652 144658 103301 46741 56062 83703 71430 69855 44744 -36987 -30611
20351 -30611 -44614 -84170 -81584 -66054 5839 41663 43594 -10137 -10065 -21453 -85329 -94572 -74857
20338 -74857 -68971 -75741 -73030 -71813 -45596 -28651 48318 83449 96404 63949 2728 -29523
20326 -29523 13317 18754 101713 125197 158105 148388 71343 40442 115946 142732 52445 -20062
20314 -20062 17977 98830 167100 254905 369937 444253 488187 644020 722703 740291 826466
20303 826466 793833 724949 647010 651579 649009 606346 654820 673490 688220 695992 748614 842819
20291 842819 850607 850460 916490 926483 914940 875869 755534 667441 551426 447134 366562 362192
20279 362192 303787 244945 211810 142811 136062 170514 226927 204938 214329 207897 195876 121444
20267 121444 77646 40579 13871 22286 34869 54878 29463 15177 13736 -29767 -32977 -9569
20255 -9569 39106 34026 8566 35823 85303 30889 22284 55690 27707 -5836 24104 42177
20243 42177 -30480 15831 85747 43412 16675 60768 39409 53096 19405 8366 7260 28112
20231 28112 6503 2064 42613 36306 42912 33877 34656 444 -18667 -95903 -86199 19524 53960
20218 53960 39056 30959 858 -41823 -7662 11963 -20761 -33698 -663 38375 79907 58805
20206 58805 23765 44730 140329 99487 8285 24763 12643 -21256 -17227 5261 21210 5815
20194 5815 2334 924 -21768 -41377 -12599 62407 93260 112210 95496 -11871 -26259 -84822
20182 -84822 -74221 -51250 -52562 -79660 -23013 -37068 -31793 -50327 -68300 -61334 -67165 -119459
20170 -119459 -84260 -50318 -34056 -34426 -21032 13171 51823 103128 115890 137500 60348 48140
20158 48140 43709 6533 -11125 1396 16110 84138 134886 192459 202087 227088 295360 316398
20146 316398 323818 406501 479826 545039 575492 621660 610757 620159 601952 592560 601608 566095
20134 566095 500627 443159 336340 267322 257138 262271 237297 122754 93821 101593 91259
20123 91259 88809 57334 50665 76294 49601 25034 -16177 -28807 32998 70952 78941 17039
20111 17039 21972 87151 74420 24375 -49496 -29527 51333 81354 28286 16492 43630 55244
20099 55244 117667 185420 187931 189187 185315 278334 386977 430605 448725 522002 568450 585759
20087 585759 655073 710626 678396 660755 603509 540887 515601 388695 322745 313578 266644
20076 266644 176808 103732 141735 155138 144711 77329 54880 77674 118468 123685 54263 31725
20064 31725 -5846 -32094 -34982 15830 61178 6163 -3906 57790 71443 -27018 -38675 20306
20052 20306 45951 55321 10419 38098 110086 88029 85392 78715 -8081 -44507 -8943 -22790
20040 -22790 -20551 -51767 -58117 -48489 -46159 25833 31377 -8675 -34672 -47236 -2663 17031 1741
20027 1741 35000 51732 19820 48607 62841 -25565 -28972 88410 58382 6330 19862 29981
20015 29981 47669 57961 68836 21076 8579 -13141 -39875 -6002 12243 -40616 -65059 -101496
20003 -101496 -83504 22573 4986 18011 11567 -16381 -790 -4857 -28436 -5752 63443 50821
19991 50821 3859 -6894 -13363 22231 -7216 -50683 -16932 8367 45622 49601 -993 -51057
19979 -51057 -35291 -38955 -51660 -76738 -30743 11500 22726 21858 62427 73886 -5975 -106747
19967 -106747 -98781 -98997 -111689 -132653 -146774 -114975 -111919 -95170 -50615 -9915 14976 -2026
19955 -2026 -17203 -42414 -2767 27136 9394 -21173 9186 5293 -47229 -78275 -103427 4060
19943 4060 61120 -9236 91 69163 83284 78507 27836 -25512 -18215 46986 64622 39816
19931 39816 814 13363 19439 36249 -9795 25190 32984 22991 -20167 -64145 -46780 36611
19919 36611 80090 61297 74551 61484 53861 81280 113052 66130 1101 -32558 -42634 -27228
19907 -27228 -29735 -8747 -3541 13366 13523 -22600 -27717 6212 -5263 929 -31703 -22111 -17796
19894 -17796 -17341 -37017 -28430 -19723 29300 79728 33778 -12690 -34822 -9042 -29957 -36656 -66966
19881 -66966 -99480 -33768 36023 51465 31990 -68813 -166748 -168622 -171079 -102416 -27831 -7895
19869 -7895 40387 34107 75659 78752 118769 68436 33147 31237 20565 26186 35425 82303 106557
19856 106557 35808 -29004 -64845 30181 42609 7762 -17456 -11546 -12941 -32499 -32621 -41806
19844 -41806 -33359 -6413 23261 70945 57767 42830 25208 -18191 9916 35720 -8386 -14187
19832 -14187 -25569 -40523 -33456 -28182 -12999 -27994 -6092 23193 -5799 4195 -22759 -32574
19820 -32574 -14163 -9087 -66195 -97708 -58561 -11730 8846 33258 -5049 -94392 -74750 -35783
19808 -35783 -29817 -14691 48191 65695 -1260 -74197 -90638 -84279 -61874 -14594 -2465 -16289
19796 -16289 -7599 11567 17596 50677 6312 -10693 15493 58824 34476 -71545 -80176 -14495
19784 -14495 18883 11216 -47726 -96815 -103293 -96946 -75447 -68018 -37881 58493 68395 91565 62628
19771 62628 28554 -3519 -7827 -16368 1879 807 35573 33192 34603 17235 3702 -56411 -22422
19758 -22422 96730 148964 133000 191176 278668 305780 318454 348481 361181 273895 231439
19747 231439 201088 150287 151235 169058 225167 254743 290733 329865 295373 251200 265684 290557
19735 290557 317815 306352 251923 201657 164933 173609 167468 208622 243310 203322 127893 79771
19723 79771 124907 71228 31727 23550 -7120 -5404 28050 -4075 -21071 27917 41990 47049
19711 47049 66338 66001 -20713 -29558 14728 95893 178710 197601 188563 214385 220901 209098 270050
19698 270050 349723 364597 450519 608062 681389 746319 664695 556690 501306 375713 334129
19687 334129 355233 367867 397339 416344 469652 545730 578196 620708 647461 553042 507969
19676 507969 401286 347354 324185 330555 356281 272842 195991 188581 188588 140339 74259 9786
19664 9786 52860 110646 104109 61093 51965 25979 25371 25146 27226 13693 52646 37126 57206
19651 57206 38041 -624 30262 75335 126831 126366 125787 97904 18319 -16969 2168 -6804 1797
19638 1797 28313 16055 -12544 12690 30899 52970 60724 10058 39705 71263 55049 57404
19626 57404 51448 8064 18306 31770 110069 147503 126533 124164 132394 137010 149603 148358 108048
19613 108048 97476 97586 42801 68142 126302 163948 220255 284922 343801 402177 411822 463360
19601 463360 465549 448600 475708 435239 443461 418305 371133 343597 295635 274596 217666 214675
19589 214675 251608 250188 194649 153816 92177 99283 66041 88764 160794 182386 139272 133366
19577 133366 121675 116604 89814 78959 53183 25323 20670 32862 27859 77333 102120 121342
19565 121342 101217 105513 167182 180937 147066 155767 218544 201138 172395 180055 261164 219397
19553 219397 168350 152629 208246 223675 214243 218480 231726 222176 268144 291269 344575 375036
19541 375036 399817 393992 303480 296303 303718 288263 272766 304130 272305 174171 173413 156068
19529 156068 115948 143559 157013 171835 132198 125932 92315 94764 122449 91778 81594 73871
19517 73871 91295 86495 94016 134351 154358 161457 139564 135181 129566 109179 138846 147811 233607
19504 233607 241711 169383 118746 68124 65996 111631 127501 116992 142345 187413 239356 266864
19492 266864 335648 398855 427282 428057 468242 522301 540666 485161 472402 480189 449616 342763
19480 342763 249796 278160 275086 256206 249213 223589 195748 156202 118004 131222 123700 140508
19468 140508 167962 157325 154634 184252 184720 225680 262870 332197 383858 439778 506333 547326
19456 547326 718567 819850 906468 962100 968919 1004541 952415 862287 797362 717978 645490
19445 645490 506601 435825 391729 324334 253185 248205 263098 232934 199929 217409 227370 178259
19433 178259 135258 116858 78424 78344 151198 223370 155641 98539 107173 62110 100262 169758
19421 169758 128250 31717 32919 39020 38777 59489 118363 177543 173098 179117 164476 67070 27445
19408 27445 60448 95369 85079 119099 173067 230488 349089 474443 527254 567979 636638
19397 636638 654919 707597 681673 620961 657428 700261 654670 596944 506138 417860 341899
19386 341899 281965 264922 241556 196235 180549 150695 177608 174535 130472 121121 95665 66939
19374 66939 116755 142196 85509 26127 -19133 9472 97684 79075 31104 -14732 -30738 54009
19362 54009 74175 133345 115234 38552 53648 38473 -9919 38812 79064 105800 152264 154539
19350 154539 131701 106975 71662 92896 68309 20340 -64994 -11397 -7021 64555 108370 103829
19338 103829 20368 45984 67674 -7208 -15623 48271 161998 195923 127556 75224 58922
19327 58922 56600 95591 130192 123156 66519 49154 76916 60646 36642 28104 -3288 43149
19315 43149 64461 40605 29774 43967 55389 96202 163354 159893 101391 115087 109888 76386
19303 76386 35163 38348 73442 94976 67802 60427 133822 104491 76811 75751 114543 149405
19291 149405 164964 127441 145292 188382 146287 118066 131447 153696 157834 110418 55787 80159
19279 80159 73718 45862 79345 56019 44862 66124 64048 71921 -15038 -49811 3912 9757
19267 9757 58824 112708 91269 40922 10587 -4167 -36262 -21295 5666 39335 13712 32394
19255 32394 29285 -1552 -4884 31816 23777 -22266 -14809 -30524 -34199 25497 90409 91038 133569
19242 133569 152561 101264 87685 57294 57307 136975 154993 139381 90374 55468 61332 47061
19230 47061 44585 96834 124908 133733 161445 141432 170370 241274 301333 314649 263385 234972
19218 234972 229855 212471 210614 213334 185111 145764 178438 204063 193337 156654 126752 135190
19206 135190 123697 149809 151105 150075 128540 91973 67324 55463 45854 103584 74474 69523
19194 69523 114624 214947 203937 142095 131186 138340 145932 190950 210957 181803 242829 315663
19182 315663 323578 354451 293698 267546 320071 341545 369819 456790 482206 525647 529996 535977
19170 535977 547579 518862 507705 479042 432288 370107 352292 358367 322951 372108 400870 457158
19158 457158 462672 480507 469750 433635 442256 464013 525287 546268 476821 383848 318252 345853
19146 345853 377789 282764 250581 323011 360391 299990 241785 260324 321084 342884 352240 401801
19134 401801 373814 387117 401345 398677 438004 457300 443292 460135 493538 543216 550395 587053
19122 587053 600739 628762 642513 695497 757251 784847 748761 781798 801705 796473 756113 658737
19110 658737 655688 691404 646522 586426 635431 650296 666972 684020 715347 734337 793270 753915
19098 753915 750130 756567 784404 831005 808540 768027 736201 711923 651054 641830 625858 614751
19086 614751 661925 721866 708290 698053 662500 647106 718769 736688 697285 741081 794509
19075 794509 792232 792992 779480 774939 874647 986759 1043148 1114236 1197638 1300044 1435556 1575510
19063 1575510 1701285 1818189 1979157 2160736 2282852 2353742 2538556 2801587 3046748 3282790
19053 3282790 3562487 3882924 4288264 4752565 5344842 6135230 7148271 8557119 10654528
19044 10654528 13607685 17632013 22796074 29263614 36930295 45250953 53479095 60910433
19036 60910433 66845194 70847947 72630696 72331990 70073910 65926714 60200737 53187719
19028 53187719 45562473 38279051 31873416 26664386 22721707 19698543 17288852 15322590
19020 15322590 13669202 12293382 11081558 10087597 9210449 8457556 7825204 7272644 6786087
19011 6786087 6359461 6062850 5847544 5600999 5429675 5367987 5294352 5225489 5252961 5275808
19001 5275808 5379650 5522551 5751081 6032506 6347593 6805272 7414421 8336969 9725482
18992 9725482 11651835 14412915 18372364 23692956 30329990 38211699 47076097 56187826
18984 56187826 64742351 71926354 77100600 79921677 80330624 78532551 74666357 68826630
18976 68826630 61383147 53031611 44653679 37070872 30763049 25808987 22085483 19209771
18968 19209771 16760266 14778288 13170439 11711346 10423640 9282090 8327250 7570520
18960 7570520 6870302 6205008 5624866 5108177 4662275 4289134 3957817 3653953 3342295
18951 3342295 3020000 2743537 2515114 2275228 2104792 1950400 1814857 1648248 1490515
18942 1490515 1372977 1250354 1191251 1123725 1004835 938428 811618 641027 624543 662352
18932 662352 592616 519809 535336 641508 653305 559352 494253 423621 358288 377367 393900
18921 393900 365466 354944 301392 297965 305785 336789 316715 315779 374297 389283 419736 461683
18909 461683 504875 498092 551694 594519 648704 687942 621601 594137 591573 537736 475339 443110
18897 443110 442177 356287 274568 251828 240292 214173 238723 299783 257040 221096 164571 95570
18885 95570 65152 49712 90392 96392 89064 131931 179289 181111 125706 140440 170255 225875
18873 225875 272294 313940 337753 304899 313228 281740 250093 248786 238362 211673 222907 264419
18861 264419 252026 230799 263229 297551 242197 241374 254089 279399 371859 477017 563758 623554
18849 623554 676985 649188 651465 593712 520543 496970 487737 418163 370508 307855 204091 170521
18837 170521 204061 207820 233894 186822 176368 185704 221955 205124 133559 94497 157867 231952
18825 231952 220794 217540 248706 238181 190423 174506 144634 174421 249760 252554 285174 380664
18813 380664 324035 237875 165043 177304 197127 201448 289289 338039 229034 121934 123518
18802 123518 131442 184893 200872 176849 235594 273918 302543 243864 141223 126276 106712
18791 106712 126660 155346 140289 156870 177642 225861 274804 292098 312695 235195 223072
18780 223072 230920 236432 244199 229745 210358 202144 210217 144316 126017 280575 319883 315134
18768 315134 302393 327236 284511 287113 325305 261877 218063 224424 241518 291239 308293 289110
18756 289110 277644 341329 316001 379257 385893 371944 362154 306938 315801 367605 390845 370662
18744 370662 373688 349615 326186 308887 384436 347982 333529 395523 435667 402071 401787 453427
18732 453427 515946 508733 480191 501088 499311 523271 548343 556598 498056 470477 570001 605539
18720 605539 615015 651191 663917 687117 720685 675366 609815 594395 695655 790206 772674
18709 772674 813438 869164 926369 1032946 1111957 1214879 1250065 1326770 1390761 1487049 1585300
18698 1585300 1670833 1791254 1909312 1982184 2026508 2162022 2386202 2603968 2844076 3110559
18688 3110559 3447923 3857119 4351480 4990705 5860039 7059703 8739180 11087182 14361805
18679 14361805 18761042 24416093 31287924 39054000 47431731 55493367 62322979 67407229
18671 67407229 70537195 71560956 70344042 66938230 61723725 55427271 48543851 41486429
18663 41486429 34759086 28997635 24313973 20700645 17971285 15715726 13891161 12366209
18655 12366209 11050816 9941891 8988810 8177522 7514035 6994974 6529222 6185026 5876985
18646 5876985 5608682 5291481 5092081 4975734 4879480 4771593 4649840 4573372 4526389 4541484
18636 4541484 4603920 4729488 4812361 4949423 5134763 5511908 5973772 6643971 7484297 8710175
18626 8710175 10363939 12688447 15944886 20309945 26030060 33096672 41380113 50661269
18618 50661269 60180737 68768936 75574842 80256835 82698159 82606316 79778649 74593541
18610 74593541 67818872 60070760 51784058 43566610 36099359 29899260 25137810 21465448
18602 21465448 18608606 16330162 14299189 12578930 11115776 9864461 8799154 7876481
18594 7876481 7040782 6317049 5723691 5253827 4895519 4484059 4118906 3817096 3598332
18585 3598332 3364068 3123831 2880383 2672810 2480193 2255210 2095465 1974363 1828285
18576 1828285 1765219 1836581 1870096 1865307 1762890 1763253 1780517 1687690 1564658 1393645 1260368
18565 1260368 1103044 1004496 887299 782357 708754 614380 490804 420572 356106 321680
18555 321680 331293 352110 374704 403513 429682 361037 324582 296244 317411 331590 301302 303730
18543 303730 327549 341495 348532 294634 293623 295261 269318 284347 278246 269982 268658 207446 199942
18530 199942 222095 247068 310842 300102 274768 322703 338124 402002 373276 379158 369983 352316
18518 352316 297492 301369 310943 276597 256425 283691 234895 213925 202611 178742 155791 204311
18506 204311 176797 186413 188319 157577 189082 228802 219827 221384 256802 294466 253754 218051
18494 218051 217319 183049 177793 225761 296546 405951 483533 576564 569203 539035 532437 575161
18482 575161 607257 604433 563526 516412 519099 491992 405414 420094 487111 558844 651152 650847
18470 650847 555301 534023 495277 448704 406719 398522 367665 330436 334048 357450 319388 257426
18458 257426 193820 178732 177924 141724 67928 36926 104200 174629 174757 184059 193898 170619 122318
18445 122318 67138 70995 131724 146789 130685 103943 134729 153905 155448 182302 288842 365748
18433 365748 435849 454738 413150 408323 411350 387036 346782 293022 244354 188469 132014 115824
18421 115824 101500 96700 121511 192472 228031 146622 109809 119627 130072 69728 -11042 73558
18409 73558 143594 167821 195658 147320 134312 143348 134408 157010 121390 62214 -29329 -41641
18397 -41641 5751 41668 76205 37099 37583 -20519 416 119031 220696 279840 283076 284597
18385 284597 264105 270631 226308 167933 204315 186341 214992 206345 220117 260194 247056 209397
18373 209397 256141 276727 304902 311197 313641 336127 298431 318050 322219 261310 282340 269793
18361 269793 232357 239784 208026 163673 143912 117969 144622 177685 179406 127091 94975 123745
18349 123745 148294 123296 75976 86602 122166 152915 213806 286333 309964 323191 289641
18338 289641 234279 246341 222970 205910 219668 179871 203703 216843 252153 209535 236945
18327 236945 280426 276591 253711 174873 137757 175722 123375 127874 147600 92405 117387 114873
18315 114873 203401 238387 251404 270587 233364 167342 131470 126681 120597 179232 205565 176895
18303 176895 167690 157638 115792 77770 64702 39882 59594 85724 96277 127695 162921 224868
18291 224868 220712 249240 218331 224619 258114 244950 231050 175542 171364 112246 70121 92434
18279 92434 73461 94462 145797 147954 166605 189780 130470 124645 156978 196969 164478 82614
18267 82614 50081 147171 218295 217953 225892 244057 256255 268081 291052 278182 223397 176492
18255 176492 219032 242695 281365 300652 228907 230575 229434 324986 355625 348257 339906 343706
18243 343706 362862 299002 272201 256421 149607 155427 145931 113799 129777 185241 192907 141248
18231 141248 192385 159655 115155 99799 89384 75675 82155 40146 53024 46224 80478 96475
18219 96475 102263 100773 73899 113507 109452 88731 84137 115341 164149 184363 179476 220320 286867
18206 286867 308266 273395 267227 245829 249228 212087 230842 265423 313507 338877 287623 231429
18194 231429 181500 149297 152190 194398 262787 226840 281760 330465 343345 273693 204206 186332
18182 186332 195353 183898 203195 204899 273693 248472 198333 216088 210208 225880 247586 252729
18170 252729 275529 353894 446395 473334 451285 451573 510226 536047 466603 457505 435772 451721
18158 451721 361931 300512 290842 216822 191376 159012 164669 244312 242327 200795 202034 223972
18146 223972 173633 121148 103808 207368 212704 139401 120429 99945 108184 148473 143842 241230
18134 241230 306383 320894 277910 281318 340365 283751 231454 126547 138989 98540 143753
18123 143753 188354 227836 236805 253731 253567 245633 261793 296120 352110 380509 426795 499129
18111 499129 570508 609130 641002 659325 694090 675051 630375 556329 488639 477813 443432
18100 443432 421507 409931 405392 481045 439417 370225 338818 281839 284651 267919 267213 222741
18088 222741 207473 191544 175638 219936 222364 210898 255101 278840 274618 291562 303632 309805
18076 309805 359386 339975 313960 318384 318429 311762 382600 399215 397829 417096 449267 465604 477190
18063 477190 451040 426182 456419 488253 476666 478731 497578 497087 454860 453217 458403 468951
18051 468951 436982 432350 450527 430965 378893 404986 452213 483284 477203 529886 577614 527612
18039 527612 534847 583873 592887 586661 556530 611858 671037 717335 735662 798813 856006 886168
18027 886168 973109 1021527 1058529 1136478 1182800 1113074 1084769 1051393 1054141 1098012 1118354 1083001
18015 1083001 1106865 1103927 1163612 1253830 1379832 1458308 1489194 1528356 1688558 1819354 1935457
18004 1935457 2149750 2401320 2573282 2702081 2898546 3014377 3193238 3447776 3739509
17995 3739509 4043046 4580865 5263925 6196384 7406496 8884285 10988396 13981607 18237589
17986 18237589 24239873 32648223 43773223 57266471 72065559 86258997 97706679
17979 97706679 103887634 102876729 94549986 81214155 66343041 53087418 42882707
17972 42882707 35636781 30494950 26551148 23316705 20479018 17966934 15813340 13970681
17964 13970681 12398367 11076448 9960406 9102729 8362551 7721682 7234819 6913139 6580246
17955 6580246 6210510 5847696 5587159 5413397 5193929 5059364 5008833 5002184 4965392 4941863
17945 4941863 4882492 4890846 4985050 5195712 5568632 6009631 6536907 7437367 8676397 10335956
17935 10335956 12635231 15964194 20812943 27690948 37082154 48781883 62003628 75376297
17927 75376297 86830813 94143089 95216354 89341381 78001795 64366780 51603287
17920 51603287 41404405 34096764 29050936 25276868 22230877 19621180 17354703 15371296
17912 15371296 13669698 12298828 11186276 10266285 9585855 9088761 8735737 8480515 8302925
17903 8302925 8187282 8240578 8361793 8603691 9140341 10069671 11602770 14064158 17936543
17894 17936543 23568030 30727975 38769462 46783434 53580298 57633986 57365889 52342733
17886 52342733 44390067 36399023 30418734 26812283 25062091 24769429 25916755 28611941
17878 28611941 33051896 39257118 46524808 53663229 59496592 62609085 61295638 54997116
17870 54997116 45591618 36160477 28761707 23587027 20128191 17628789 15716543 14074533
17862 14074533 12635652 11398304 10307996 9339569 8560094 7837982 7133097 6558460 6089447
17853 6089447 5791403 5613281 5427243 5237000 5189844 5252393 5314602 5433324 5703263 6068956
17843 6068956 6549109 7258591 8400209 10160279 12795301 16848178 22376725 29019445
17835 29019445 35961709 42535810 47740399 49839546 47753028 41935126 34688754 28412919
17827 28412919 24188865 21854236 21010699 21344451 22897232 26000163 30815042 36950559
17819 36950559 43481417 49539188 54046084 55295436 52118489 44933427 36114758 28246317
17811 28246317 22524411 18695915 16123096 14189851 12598460 11228232 10035913 8927647
17803 8927647 7944470 7147688 6458001 5841714 5335529 4837529 4314845 3828071 3465676
17794 3465676 3174114 2924974 2710025 2529650 2349736 2200150 2124291 1960384 1778305 1605038
17784 1605038 1470455 1351929 1205975 1091975 1022317 932820 853058 804545 698861 675763
17774 675763 694740 677036 632567 567371 579609 625007 559614 481920 445305 456804 482098
17763 482098 483981 413365 403123 347740 328093 302687 298355 303183 295341 283219 305325 317496
17751 317496 302876 243009 154135 198908 224677 192324 158494 101187 63896 -2281 28404
17740 28404 57270 145060 141426 111181 106433 105604 121198 113191 113657 70645 39217 52825 97784
17727 97784 107119 104730 161650 196789 224029 201695 145605 134435 137308 137910 175047 152918 85518
17714 85518 86408 100316 107101 159718 174885 139685 132527 167885 224243 250407 220859 151948
17702 151948 140562 171605 194227 163692 105798 98048 35151 32570 71712 49435 46811 112483
17690 112483 162546 161727 97258 50712 83469 70536 90651 126500 101671 145654 188032 178942
17678 178942 144876 116377 134397 156475 168234 171161 116576 91809 106436 159798 179180 222239
17666 222239 256497 277852 353870 423460 434975 463635 447962 406036 322914 294294 290627 325064
17654 325064 312529 347792 364548 327807 316317 355515 377066 384896 377468 388435 373224 334903
17642 334903 329304 294019 160581 159287 202161 196225 86443 54503 47011 85864 103907 91421
17630 91421 133518 103127 44646 51020 74891 114091 135869 155457 151209 164572 253421 214048
17618 214048 159875 148309 110488 68203 68028 7271 -4427 33422 47576 31895 22033 19705
17606 19705 36042 20872 36278 62722 50983 44018 49864 67250 106659 127217 78365 2973
17594 2973 -16962 -22104 35667 112761 75569 44522 57109 101364 102978 106188 73257 145913
17582 145913 163280 151809 106415 51876 12640 92603 133860 149554 176467 132727 142450 123668
17570 123668 127509 96306 138594 122776 51959 54477 39265 55807 115485 111848 138179 122340
17558 122340 156849 177021 170305 129064 134711 163588 191808 188135 132273 141192 109578 59065
17546 59065 33439 3520 8416 30771 -13313 -19331 9657 37972 867 37951 34147 51425
17534 51425 67078 66950 75070 26157 52061 74126 73297 83231 74969 100839 161244 157089 66366
17521 66366 43694 14362 -34342 -17275 9916 98499 119160 83167 163969 143006 92215 57404
17509 57404 44376 41531 101988 176085 191182 114014 68871 120888 143905 95784 81549 78731
17497 78731 97977 121571 112227 99339 108459 114832 120010 102754 146533 188531 141769 89529
17485 89529 104812 118113 73350 366 -47649 -28177 13384 75053 96644 102359 131295 204383
17473 204383 262560 290493 387776 456880 509263 488854 474688 446607 465624 438312 466549
17462 466549 424263 346488 284944 269178 278226 285605 265235 210209 183256 150705 141387 134301
17450 134301 168896 194369 226639 223458 223434 231257 283589 246872 213459 166289 202242 261336
17438 261336 279249 240029 156433 183093 245948 318744 279990 280462 273190 301089 279391 280981
17426 280981 321663 364472 386126 365919 341748 380434 416656 532161 576163 613643 632380
17415 632380 625940 658129 674392 677447 692972 653155 512127 486668 527147 556884 553068 561976
17403 561976 572218 531194 503179 480103 535404 514331 440281 443471 551051 566697 594300
17392 594300 613115 536193 472018 558565 577227 608635 654845 737044 765801 721932 656341
17381 656341 668663 662986 637243 617388 691754 724107 731309 776814 804085 867166 890650 807763
17369 807763 782119 772226 797692 796935 836277 817014 843618 950108 1012360 1021709 974228 972430
17357 972430 1029689 1116234 1191218 1259717 1329439 1408945 1443545 1572531 1751787 1869370 2060205
17346 2060205 2352962 2682691 2983375 3220409 3503521 3845380 4201812 4553264 4921687
17337 4921687 5361003 5871253 6534980 7381632 8443623 9844669 11742979 14514149 18496522
17328 18496522 24102651 31508845 40806639 51853884 63865816 75536177 85435594 92114976
17320 92114976 94667583 92815739 87006422 78672695 69540225 61142125 54803420 51384042
17312 51384042 51272613 54232603 59696910 67223469 75897159 84402229 91259848 95070417
17304 95070417 94999537 90721479 83028692 73105017 62438594 52278776 43467928 36393252
17296 36393252 30951313 26721214 23361256 20582174 18124120 16100635 14371062 12870501
17288 12870501 11627531 10549848 9616332 8758559 7942516 7161112 6475857 5849225 5324692
17279 5324692 4799725 4402834 4024128 3621856 3296245 3071295 2834631 2617899 2405236
17270 2405236 2213168 2044633 1900250 1740675 1559902 1410971 1309515 1254255 1230017 1199688
17260 1199688 1099271 990072 901047 797272 781004 765135 687818 646276 588156 538583 566697
17249 566697 542367 488471 393874 331260 323265 333523 268338 247651 240169 196789 176566 156220
17237 156220 148767 158346 141045 101477 132317 150365 171280 150633 147034 156715 180296 183124
17225 183124 156794 141928 115762 102787 144300 117923 37148 18110 486 60596 90411
17214 90411 84819 134691 149079 118501 102675 112484 172464 218729 180640 171842 133461 146788
17202 146788 214788 201449 160794 153088 124103 94207 64665 69055 84372 82828 86842 127485
17190 127485 105737 107097 148793 140398 106464 94850 84602 115754 151236 156881 139991 120153
17178 120153 78391 122961 64907 -37448 -6940 539 6976 -12229 4598 80926 53836 54179
17166 54179 61057 30514 69215 74841 101351 79157 78069 35810 35652 81060 76156 37936 30180
17153 30180 6123 -43596 -59490 19033 20235 77497 124175 181085 82283 36773 68620 70985
17141 70985 59068 -14666 4336 75887 106805 92749 35717 47134 59121 43692 -25318 -8157
17129 -8157 61240 78593 22187 -14077 -26249 -52458 -95682 -106873 -84690 -75711 -72430 -69868
17117 -69868 -42615 4659 -27027 -63040 -78515 -36890 -63101 -80763 -66773 -49529 -11748 38373
17105 38373 89690 71222 10112 -17362 22254 43661 6051 49128 83145 73260 102022 113698
17093 113698 60633 39649 73590 52662 48876 32836 79229 115443 120042 99788 111209 53202
17081 53202 42876 9407 15151 -2395 -25767 327 21037 31514 74630 87748 58271 -5990
17069 -5990 -18023 -34443 12390 7552 1724 6443 -55992 -102837 -51263 10099 4549 17436 -18026
17056 -18026 -29439 -1391 -13690 28721 79287 78728 28232 -105543 -59169 17798 20495 -970
17044 -970 25960 35592 18935 29725 94361 80136 81732 16109 -18577 -22399 -26150 -27423 23429
17031 23429 53377 44599 14385 30839 37926 34491 9847 24764 6385 -29962 11755 53559
17019 53559 55157 3571 -18299 -7850 41373 32104 5639 56742 65631 -3128 -40384 12280
17007 12280 15169 -14547 -6356 52802 73927 43387 24518 5379 -38845 -37570 -21383 -17422
16995 -17422 -11789 -24225 -10694 18996 19670 3157 29403 14131 -13911 -41395 -43216 -48602 -44843
16982 -44843 -8567 -18206 -72099 -65793 -77442 -49576 53791 54069 580 -66992 -112640 -94295
16970 -94295 -24841 51603 44448 19907 -39101 -39644 -6543 38815 -42211 -82458 -43923 -11665
16958 -11665 6390 -746 -31252 -14871 -32542 2780 7459 -6492 -16842 -72856 -137178 -147675
16946 -147675 -155373 -160423 -158533 -59512 -59547 -69747 -8548 11969 25481 19938 -117451 -148482 -49536
16933 -49536 -23068 -89952 -72207 -20139 -7528 -13314 20367 91170 88571 108942 113574 110331
16921 110331 87985 31214 -10761 -22912 -76961 -109005 -90841 -19855 -14335 21137 -37715 -65372
16909 -65372 -10694 1489 7982 -13243 -4372 30686 15419 19613 50842 3521 -24223 27807
16897 27807 64568 59109 78122 83735 22676 -27772 -31100 11040 31595 -8919 -54293 -43126
16885 -43126 -43827 10939 10903 -1371 10203 56302 57881 28686 -23835 -3978 -7403 -8177 38107
16872 38107 9471 -21854 -15654 -52951 -120422 -186820 -204540 -129846 -25008 61193 -10656 -43176
16860 -43176 10987 79769 96447 73688 36312 71446 112293 135874 75561 32411 15335 -2918
16848 -2918 -12392 6464 42836 38770 38657 36627 101996 154082 158265 90925 53099 73656 54317
16835 54317 3335 55865 116476 114564 127194 162980 132698 85217 130022 243754 270061 299557
16823 299557 331193 304946 283214 331131 402401 384267 319287 336054 335314 292852 264733 247442
16811 247442 256899 272648 351913 397417 447702 516127 552246 545327 515296 438097 302091 232022
16799 232022 205606 132373 91501 28851 -7259 -55589 -55572 -40954 -43684 -47571 -80579 -112877
16787 -112877 -98150 -27310 -6108 -23569 -32089 -39577 -64803 -10532 1119 -25344 -47908 -42910
16775 -42910 -128101 -171095 -100705 -103210 -76568 -44501 -77675 -113861 -117978 -157525 -130186 -40738
16763 -40738 -32684 -41971 -28137 -81917 -31208 54235 6910 -94681 -127184 -103455 -102639 -119565
16751 -119565 -98974 -49809 -50818 -15565 -19351 -27018 -36019 -34920 -48695 -40302 -45508 -61325 -19914
16738 -19914 38597 16357 22429 22021 16661 38089 17016 58842 44932 18778 14099 -3858 1719
16725 1719 2262 -6975 9826 -33058 -59167 -110062 -106526 -116239 -140879 -177658 -137198 -63541 -92770
16712 -92770 -51559 -48429 -59456 7524 48334 -12954 -82006 -105530 -112995 -69741 -77097 -84015
16700 -84015 -57140 -57606 -40724 -1956 38663 46368 25351 5932 -38549 -89 49474 50502
16688 50502 -71868 -128539 -161237 -160473 -140302 -148837 -185422 -109731 -91800 -113229 -102246 -96765
16676 -96765 -88881 -72047 -43415 -69726 -43358 -69263 -55418 -5727 10253 -14439 -38879 -47601
16664 -47601 -96116 -175171 -163046 -103136 -69964 -21659 -29808 -28175 1766 -11068 22984 34661
16652 34661 54142 -23752 59019 108247 111522 78531 11007 -32509 16689 -17816 -65556 -86902
16640 -86902 -124481 -69963 -94904 -125708 -28044 46235 -7507 -35691 -32683 30958 41895 -7057
16628 -7057 -38615 -83712 -44936 -31728 1141 16139 39038 7909 -30970 -26185 6489 -10667
16616 -10667 -42785 -33202 -36453 -14593 -17699 -50490 -79517 -84595 -79037 -88346 -127655 -159615 -149508
16603 -149508 -96841 18223 108445 140397 95634 88291 100488 136400 131563 120702 74416 -34155
16591 -34155 -72809 -15620 15995 79858 68016 38887 -30356 -10652 -70851 -114368 -170486 -153106
16579 -153106 -59321 14997 4818 28344 12307 -16195 -30808 -34898 15314 -15555 -89369 -117220
16567 -117220 -111804 -121627 -116239 -42750 -67054 -47384 -29237 -53544 -108041 -93423 -58766 -28649
16555 -28649 -46559 -101106 -31436 52671 37703 53902 35936 -33717 -27415 -24630 -37081 -19755
16543 -19755 2465 -2922 24109 57516 12226 -6560 66319 88596 140601 163184 112607 71340
16531 71340 16634 -27399 -119889 -64356 34490 39466 -40484 -48144 9190 -20201 -11941 1238
16519 1238 -1355 11844 -903 -78521 -97515 -48184 -86916 -155886 -146462 -104375 -60473 -55266
16507 -55266 -53627 -47600 -11886 -5778 -35858 -9300 2788 31926 4310 -29198 -18554 -71272
16495 -71272 -68549 -79965 -103395 -107043 -108881 -158432 -156996 -100024 -94900 -91873 -36302 3265 -39637
16482 -39637 6911 40049 10248 -35375 -67593 -79251 -93405 -104895 -161647 -137751 -170324 -145575
16470 -145575 -97015 -83236 -83281 -39842 -13608 -48983 -27529 74143 73352 77806 107231 10680
16458 10680 8416 -8362 3041 30286 22955 -13169 -32475 8985 -25473 -42971 -43280 -25188
16446 -25188 -19331 -7238 -44075 -55252 -15632 15724 -56400 -85719 -93901 -88586 -112233 -100228
16434 -100228 -68101 -7004 -38899 -60016 -46558 -81084 -95861 -58060 -2979 -5822 14936 -41124
16422 -41124 -50901 -55316 -100324 -85309 -82444 -83067 -47966 -62970 -99565 -158014 -99124 -62023 -36823
16409 -36823 -86008 -65041 -23101 -30315 -82385 -80367 -102598 -120024 -76219 8511 40868 -25977
16397 -25977 -11094 11509 -29912 -30177 -18154 -28693 -77641 -81522 -62141 15575 81220 114314
16385 114314 123450 55290 22557 -10150 -7421 -24086 -26051 16851 9846 -32195 -20237 -20237 42454
16372 42454 47070 103903 94302 57328 36083 31295 49498 12394 -94025 -109124 -79354 -18124
16360 -18124 45830 89352 81634 -3685 -51619 -95536 -118106 -72827 -34381 -65337 -73986 -126948
16348 -126948 -70090 -27621 -54437 -65256 -84388 -98676 -140984 -141773 -77095 -17205 -18520 -13133
16336 -13133 6279 -83188 -116923 -87702 -165587 -98557 -24866 -6731 -28486 -33427 27095 43663
16324 43663 41588 22053 -31821 -39765 -58777 -74689 -60861 -53141 -43072 -17690 -2112 -72210
16312 -72210 -134578 -143816 -132217 -112292 -106094 -159777 -137014 -97325 -72189 -28288 9896 52314
16300 52314 63709 -7190 -84167 -68506 -135545 -139478 -126653 -71426 -39502 -50518 -63797 -61169
16288 -61169 -87013 -49549 -27568 12257 -1602 -10176 -26484 -13277 67062 65083 31827 21119
16276 21119 33172 33498 -13951 7769 -14800 8335 40684 40553 37877 12886 -31632 -46670 -57161
16263 -57161 -63182 -24800 -18356 11090 -872 37237 11175 -71757 -71046 -55648 -57823 -41137 -26182
16250 -26182 -55723 1563 22648 23373 -8550 30200 47748 2883 -3905 -18651 -26782 -25071 -21114
16237 -21114 37018 78246 82589 79511 70542 61107 19166 -48 -52712 -39073 -29977 -65636 -88007
16224 -88007 -44724 7798 -13359 11920 -22089 -16500 -68494 -82174 -43001 10436 16079 55553
16212 55553 28893 40251 8251 -7652 -2129 -45256 -80053 -45775 -59793 -94587 -56079 5117
16200 5117 -31671 -66452 -39831 -67411 -15138 45699 4005 25582 72494 52222 32473 -37406
16188 -37406 -48691 -56886 -41089 -74490 -32130 19082 6598 6336 -37948 -65959 -94556 -78156
16176 -78156 -77952 -68069 -24809 -19439 292 27310 10051 -9471 -18381 -31479 -68568 -48125 2746
16163 2746 4535 42430 8971 -19202 -21772 11824 -13999 -27042 17172 72846 -25781 -32601
16151 -32601 7297 -46747 -51224 -31010 59610 84892 106743 104543 81726 18221 -54199 -31439
16139 -31439 -3257 -19582 32773 51322 -17867 -31336 4536 -56012 -70453 -39043 -16731 -30796
16127 -30796 20789 46171 39988 5817 -9371 4182 2357 -8267 -35561 -42598 -13743 -1083
16115 -1083 321 1410 2218 4431 -81096 -95392 -108390 -105402 -49528 -15506 10938 -19253 -49550
16102 -49550 34575 105944 74909 61385 -4244 49651 61643 37356 76549 71755 48060 -14526
16090 -14526 -70716 -61165 -27371 -37134 -97159 -63203 -31098 5949 16999 37681 58506 60234
16078 60234 72713 41037 23387 -8650 74485 77017 72514 85974 53648 48970 -8562 -7816 9611
16065 9611 -21022 -50309 -69250 -113099 -97058 -56049 8195 42639 13353 27984 52335 52432
16053 52432 75494 22171 1002 -9776 -27009 15198 -16626 10760 6967 2425 51204 38082
16041 38082 43379 64000 -44804 -128002 -109362 -61825 -37100 -667 -23353 -37699 -19584 -46748
16029 -46748 -48669 -39413 -62153 -56042 -37666 42719 86481 78351 -2320 5040 -21561 40119 80772
16016 80772 33697 -2690 -12597 -42452 6932 -40704 -82272 -97673 -69280 14884 76769 33261
16004 33261 -11817 -42875 -59677 -74846 -58972 -7651 10997 -21571 800 2464 -37731 -17988
15992 -17988 20009 18641 -877 -24597 -55361 -82380 -101958 -110255 -87712 -24063 37050 9192
15980 9192 -51693 -72933 2641 22300 12761 -59954 -106350 -106781 -55055 -16010 -84237 -133757
15968 -133757 -126402 -111847 -94213 -9890 -7570 -30158 -51457 -19330 13911 30477 119798 118958
15956 118958 64810 70982 -353 -13980 10430 19145 50055 49316 21251 1339 38794 40717
15944 40717 79431 40422 -7693 -11099 13 -23003 -45746 37093 103401 104329 88293 86156
15932 86156 55287 43677 34361 34203 66442 20408 -1302 31359 51898 57752 45046 80665
15920 80665 84562 65620 20946 37716 33561 40247 69657 76915 21529 1917 -72954 -87291
15908 -87291 -55097 -9087 -40997 -31977 -24809 -14335 6628 20099 44033 28220 8318 -36044
15896 -36044 -72994 -75450 14869 38685 104486 106815 58269 52757 111763 75135 39240 -153
15884 -153 -15978 -23986 -52873 -85897 -60319 -11394 24439 62036 56064 10582 -57191 -77117
15872 -77117 38094 80540 91625 28014 -52801 -63890 -29629 36797 16057 47530 99607
15861 99607 97157 60649 91130 168724 119746 51394 28112 50247 30302 63504 40882 7068
15849 7068 24988 -14754 50581 101705 62694 103372 112535 36572 -6125 -31148 -30463 -37976 -560
15836 -560 16390 13730 -25084 -5634 41821 34863 14992 -3115 -28908 -80845 -57140 78465
15824 78465 104723 97759 87298 67622 20621 49220 51837 7482 -77128 -22177 34790 91773
15812 91773 81768 6690 13958 26818 34648 43067 20256 24715 29880 25229 17896 -6026 1668
15799 1668 -47478 -7301 6179 92053 112717 93921 74222 45324 45210 44784 77357 102155 75453
15786 75453 19093 -7844 42932 40790 35714 -38269 -97580 -75846 -17342 45053 69691 49552
15774 49552 72167 90713 126065 154953 146552 168102 218103 201576 153813 110199 52169 30239
15762 30239 3246 63055 83014 90721 62526 77317 101762 126881 144410 118023 38343 7905
15750 7905 8261 54474 44613 2566 94345 48657 -8789 -2552 -30711 -18985 27112 104115 186617
15737 186617 158130 123444 143540 173613 103469 38231 -11107 -112835 -103686 -32473 -17280
15726 -17280 -2420 73351 70240 19409 66311 -11253 -75765 -25112 40109 14802 8401 -1713
15714 -1713 22351 -398 -31478 -46969 42906 110514 130939 137623 107712 137746 174134 152163
15702 152163 134235 47723 42751 77912 205082 154730 111904 122403 106856 28115 45613
15691 45613 114044 128417 111895 139895 160617 93051 42584 34495 3871 10432 27922 49148
15679 49148 99121 108858 80734 1867 3467 14889 97677 147228 104533 25729 -59598 37204
15667 37204 126629 146485 141915 187685 207418 207506 223110 143263 124791 153610 92511 78508
15655 78508 134300 174758 223417 183606 94452 51302 47767 92876 83700 105544 141683 150696
15643 150696 116179 31504 62641 79915 105308 72253 58054 82407 72420 51857 45162 107900
15631 107900 68133 74292 61280 84835 76090 43072 54000 19839 42026 50794 82737 97315
15619 97315 71255 59462 37791 68316 110267 83308 77790 179853 165317 128276 182386 171659
15607 171659 164688 133094 144248 179872 166685 89102 70438 43007 39967 47506 129930 214508
15595 214508 245160 216743 187603 189455 137994 124464 132451 113128 116351 132034 183566 212458
15583 212458 180919 144976 138843 94892 66632 103312 89639 20697 9509 -36701 21668 30916
15571 30916 6053 -1056 21699 65376 120212 125765 156313 125364 103304 84180 83271 97901
15559 97901 147629 119482 40556 58833 113430 103630 94243 133482 186753 215608 214288 258929
15547 258929 290985 316185 301215 262156 231079 150011 158597 263072 342920 315606 312629 275740
15535 275740 282719 312894 261190 260818 273068 283304 279751 279048 263279 262219 236877 194382 195222
15522 195222 184534 213539 283307 323070 348363 323106 352160 392156 379215 333522 397156
15511 397156 485611 630773 726212 780699 797983 755674 688428 633168 660307 662254 580177
15500 580177 473551 438219 483278 511692 484146 509952 500941 479031 424003 472295 460888
15489 460888 470951 501903 510247 450409 391387 364037 423976 428632 394935 379600 388303 410644
15477 410644 372260 369706 371318 388234 383612 378689 387494 368691 358025 378914 434828 472876
15465 472876 483740 389535 395946 443444 386781 373212 417390 413215 347652 330552 415376 379838
15453 379838 406556 411367 461435 466035 433041 467057 459427 451548 428876 465731 498045 492431
15441 492431 450217 389963 347426 297095 332319 415328 508140 527690 535098 538780 542180 476938
15429 476938 519023 561505 577869 602571 614286 560531 474878 415965 432786 455679 540952
15418 540952 518353 489021 513661 537666 547271 502645 498982 542247 585632 580749 574466 583885
15406 583885 632036 681558 602161 588972 615516 653764 722629 739969 739746 750012 717705 702600
15394 702600 767891 775265 796327 839047 813920 853122 888955 938901 967756 945419 986387 1029206
15382 1029206 1057212 1063450 1061217 1025275 1039044 1089310 1132937 1124193 1116085 1100314 1137017 1181115
15370 1181115 1286743 1299817 1299542 1318990 1331463 1352166 1411892 1452930 1450595 1468889 1495470 1495186
15358 1495186 1466100 1545101 1543282 1546511 1572412 1597350 1607428 1656549 1723768 1797306 1824843 1817620
15346 1817620 1826099 1817882 1846647 1927010 2025207 2026049 1975073 2000049 2073298 2147755 2182571 2259497
15334 2259497 2361036 2476391 2495994 2473093 2492772 2543276 2602942 2646943 2701677 2739041 2744216
15323 2744216 2757941 2872026 2927544 2948550 2977675 3039120 3202804 3318927 3432167 3551713
15313 3551713 3586453 3632409 3760327 3855082 3938397 4048606 4212958 4364777 4521112 4609342
15303 4609342 4718044 4876938 5092473 5268738 5428772 5571415 5782486 5994065 6216994
15294 6216994 6480995 6719621 6918455 7173281 7447149 7706525 8085907 8443839 8804744
15285 8804744 9184839 9582142 10082670 10604475 11096831 11644197 12233609 12887409 13546553
15276 13546553 14285323 15102473 15968654 16850024 17866961 19046142 20222612 21484144 22987697
15267 22987697 24543612 26200038 28059981 30087459 32367251 34860729 37680870 40793433
15259 40793433 44108716 47755825 51793645 56284532 61262337 66720150 72580137 78860739
15251 78860739 85554830 92627166 99870083 107121716 114058036 120489946 126076222 130570959
15243 130570959 133711780 135277915 135207108 133604667 130627846 126502922 121402999 115707528
15235 115707528 109599302 103310298 97092658 90971065 85092726 79465254 74188005 69215810
15227 69215810 64553459 60238093 56176866 52366778 48931395 45763092 42792109 39991258
15219 39991258 37536045 35191506 32968290 30963628 29100134 27327353 25742744 24314133
15211 24314133 22975192 21665229 20474033 19379714 18315041 17295284 16310530 15429951
15203 15429951 14628970 13936575 13298300 12697366 12073717 11458744 10911873 10391837 9945373
15194 9945373 9502226 9093027 8716944 8347450 8009464 7709353 7383961 7159318 6900140
15185 6900140 6571220 6248140 5965682 5772191 5591113 5467225 5320904 5139501 4929028
15176 4929028 4682261 4489562 4377129 4291110 4153238 3984671 3866484 3824689 3771544 3708262
15166 3708262 3572134 3429859 3256558 3233457 3226584 3136273 3011692 2876504 2787287 2816314
15156 2816314 2777027 2705276 2653716 2560679 2496206 2473982 2407728 2320483 2287349 2233542 2196623
15145 2196623 2091621 2047781 2013189 1949796 1909167 1825429 1758388 1769916 1725276 1671386 1651634
15134 1651634 1664296 1619016 1590238 1576388 1620570 1676414 1669017 1589716 1534911 1503834 1539955
15123 1539955 1577444 1543011 1466285 1385135 1317125 1310413 1321078 1266720 1228491 1215938 1208802 1133128
15111 1133128 1096873 1064913 1124217 1159057 1109992 1096376 1152211 1145437 1132538 1086285 1036845
15100 1036845 996588 902631 906941 946773 951102 965919 985777 989552 1013470 999646 895184 864848
15088 864848 880064 871816 821875 811614 854140 816831 817317 857084 815601 805453 780284 801666
15076 801666 786636 747607 763817 736341 707130 750896 783664 731915 669422 715847 765126
15065 765126 709966 697246 666285 628955 611678 563458 537424 512432 498803 545591 619525
15054 619525 585976 483116 485368 546322 538643 489430 441610 403647 433659 467125 474209 492969
15042 492969 438107 341934 357166 417985 485657 510441 428349 436318 440008 432732 468697 432190
15030 432190 433870 408060 395624 417467 399280 389010 415044 450472 434206 379998 389967 395108
15018 395108 411232 370055 381366 453716 479850 408903 379268 394840 385347 387729 326007 285390
15006 285390 299224 365703 436777 483682 450943 392273 404400 499340 482680 402030 399442 408786
14994 408786 376368 358004 404385 385997 358759 370912 454209 522669 519877 464718 445218 468241
14982 468241 503181 510046 550619 613287 733331 810372 813540 807301 777278 717213 667370 608678
14970 608678 573374 539786 444346 350339 325233 318948 314522 347309 380037 367384 369774 349200
14958 349200 388445 345738 292747 234049 219206 252641 308163 305149 299845 305571 270364 227218
14946 227218 199015 251285 292670 304986 239247 223552 179997 232046 201597 168121 157415
14935 157415 161934 128212 79138 63681 129296 118491 115889 122261 139573 170191 189047 200689
14923 200689 217681 208057 170419 138099 155016 150010 153878 218841 250869 211179 186829 155616
14911 155616 142274 146384 196233 263258 245551 175516 138608 164155 142154 131730 88123 185600
14899 185600 247120 252979 194922 174407 174707 178065 107723 93977 54646 72171 69037 100811
14887 100811 141676 119326 136606 163275 156106 173987 153611 132231 152493 162803 106187 83217
14875 83217 83729 111576 86759 99192 124170 122252 65850 68104 101715 101801 160515 118261 104212
14862 104212 167931 150652 144841 93648 50295 49037 35476 74974 132647 79047 93573 120961
14850 120961 95508 106454 74509 67301 53459 72064 131029 95192 65730 13031 37342 111074
14838 111074 136978 137227 112716 68322 98808 79404 92021 113286 98668 81391 75640 21299
14826 21299 38510 -16264 -17511 58752 101441 160905 152980 175365 192896 179412 116625 99716
14814 99716 61296 54489 24942 56061 35411 30465 33209 16475 102963 137495 159943 173824
14802 173824 95769 81649 87933 106437 45954 9586 -373 -40294 471 57127 69903 29641
14790 29641 -3658 -1164 -10044 -21511 -41247 44742 60215 18548 30455 13107 15225 45991
14778 45991 54228 63435 72288 57322 33586 30666 55891 65306 49140 -10198 32088 75305 70047
14765 70047 60357 116296 112629 95339 99332 109627 103124 96566 136597 134100 80460 64706 92214
14752 92214 125488 121506 90116 81699 59152 56100 67237 98877 132364 125737 94202 148452
14740 148452 94383 55198 111004 110146 110233 83332 18420 32991 64929 25529 -3916 50339
14728 50339 78597 56119 23686 75546 105090 92531 80431 88911 112184 82099 20347 -2074
14716 -2074 41687 35785 78000 120356 89498 84361 138600 173411 164003 98787 49239 24512
14704 24512 15035 38107 55788 12792 -24604 -40873 -14999 3435 -4803 -12124 -50351 -99399
14692 -99399 -82665 -22801 10120 46000 34781 -29181 -63455 -1245 42902 50870 60716 97624
14680 97624 90318 45493 29071 43966 49223 37722 -2055 14690 54724 53313 83748 107707
14668 107707 116948 141417 81356 88400 93490 47370 -33141 -97344 -91815 -69942 -54040 -72378
14656 -72378 -23964 -2936 50337 49477 57832 25882 6857 -50334 -76263 6626 -19899 -37557
14644 -37557 8449 59192 55847 32353 24915 49751 13260 -27154 22573 94903 65484 39641
14632 39641 50852 47971 1481 278 7079 4218 -4678 -10750 11192 -3146 -89354 -75646 -57287
14619 -57287 -76836 -149643 -166276 -161499 -156077 -71209 48943 89487 28996 3776 8376 26976
14607 26976 66409 76084 79564 34291 20447 40556 58509 42730 -18576 -82227 -29201 52977
14595 52977 35359 -7153 -84596 -88367 -43484 45106 44311 60637 47913 60209 94486 78167
14583 78167 78755 116599 115707 149613 145130 59278 -3844 29209 31412 30718 42164 90256 122230
14570 122230 90785 43455 62267 81038 46788 29399 -23904 -24057 -14859 7510 52666 -2040
14558 -2040 -27560 -9167 -42668 -49210 -49620 -32469 10479 -17174 -70372 -63532 -77340 -122670 -186198
14545 -186198 -111830 4848 33646 25079 -6134 52646 81629 42943 18775 -6102 -35712
14534 -35712 -27455 -301 26028 37014 -3990 3013 22825 37182 -14579 -81060 -94135 -79546
14522 -79546 -27114 -11515 -35390 -29174 -15175 -12846 -45493 -4974 86737 127438 106441 62483
14510 62483 77821 70444 66351 66361 66434 16846 -30344 -30106 -20631 -39794 -7676 25053 32573 57650
14496 57650 98603 58896 81940 175229 148358 90486 40499 -38708 -23760 -25452 8405 1039
14484 1039 -41828 -96395 -83616 -13627 -21382 -38414 -26443 -8470 65167 64629 60577 37175 -16169
14471 -16169 -1705 -1210 -8834 -34730 -49898 33333 123752 74598 69892 59672 10641 -51699
14459 -51699 -67610 -8235 37829 25092 -12894 10754 -20657 -69728 -90299 -58744 10819 36932
14447 36932 -11675 -12694 -16784 -94571 -108350 -57908 -5442 32753 77948 72098 60203 87093
14435 87093 101918 45046 -21695 -31945 -25263 -4347 16533 13536 -34373 -54417 -3158 -52647
14423 -52647 -19391 51108 16404 -3287 -19685 31196 35330 93238 38692 -17637 -23895 -25293
14411 -25293 9570 84374 109829 125939 69999 66418 87669 116791 54377 62493 37114 -15356
14399 -15356 -27029 23688 26794 8965 -25923 -65360 -46824 -77032 -44261 28152 95344 109663
14387 109663 107386 73992 67176 91579 30052 -35435 23322 99920 182792 133163 92368 84217
14375 84217 -30107 -34989 2716 -10550 -42495 -75163 -46745 -22013 -75761 -109532 -48744 -9128
14363 -9128 27976 50378 16040 -73047 -59042 -55785 -20007 25912 22493 47230 65338 138175
14351 138175 158757 73378 -30028 -34452 -65100 -57707 13811 -12214 -15117 -24399 10550 -8051
14339 -8051 -46432 -74369 -37068 -13278 -10451 -47705 3998 92645 72067 4704 -34680 -8053
14327 -8053 77413 116958 51327 40299 4744 -23673 -10193 19450 -13776 -24704 -72277 -62784
14315 -62784 -46854 -59499 -36894 -8885 -12725 -40645 51 39164 35406 -3622 7594 38038
14303 38038 101154 84408 2902 -61537 -58129 -21397 84134 141232 92001 27227 75858 78467
14291 78467 45622 11109 11819 -5486 -44736 -65989 -22821 -35510 -17143 -2977 25703 -21094
14279 -21094 -125460 -117769 -68782 16098 31444 33339 47575 48157 59388 45621 35803 -7771
14267 -7771 797 62877 58712 18049 -1171 -11274 31031 60065 45370 -32560 -86639 -53684
14255 -53684 -26394 -43936 58189 56549 -32536 -98190 -91548 -52911 -48671 -59957 -35988 -51674
14243 -51674 -34648 -9331 -34920 -30695 988 8724 57923 100074 95026 95304 61018 3969 -7100
14230 -7100 44953 61171 18787 -16508 -24219 39877 97792 100180 -9613 -77378 -77213 -43676
14218 -43676 -53200 -110485 -118936 -120918 -125841 -65078 -43140 -43250 -680 35773 -10985 -45096 -7688
14205 -7688 38345 68851 44623 -41094 -96234 -38269 -20972 -22690 55672 62710 25164 18843
14193 18843 -17351 7178 63347 112545 99997 71842 81121 74836 21869 -32809 10511 29132
14181 29132 28461 29466 48370 23580 -72453 -115638 -92093 -106310 -96795 -102134 -51733 31972 83555
14168 83555 65061 19448 -22870 -61716 -66505 -51786 -10447 -44530 -109792 -67401 -58066 -115083
14156 -115083 -32807 16213 -2486 6805 5538 -15693 6520 -10017 -42236 -57124 -11347 1674
14144 1674 -47163 -30008 -70380 -107505 -46771 1218 37501 9119 3848 -18252 -37143 -101194
14132 -101194 -132598 -129124 -102604 -80074 -52749 44116 107908 46592 -35444 -58498 -2243 24753
14120 24753 23674 64515 45744 12040 42168 17690 -30660 -28957 -32303 -34885 -50777 -38744
14108 -38744 23220 53965 25674 25067 24252 39515 44079 5813 -35678 -17625 19502 26692 -3825
14095 -3825 5503 10717 16273 45345 16239 -12549 -2363 11729 2075 33888 72222 39968 -5214
14082 -5214 -28812 -876 -22554 12903 74331 67206 47876 505 22392 -27486 -35236 -69287
14070 -69287 -74245 -88831 -93741 -100707 -65992 4083 -19670 -78220 -133818 -96297 8698 35731
14058 35731 2754 12082 -71793 -66980 -10864 16520 11260 -12399 -3925 52934 28664 9942
14046 9942 -54093 -56661 -26883 -44961 -7524 36083 30270 70343 50800 21184 4211 15731
14034 15731 61005 96525 82142 49172 51049 41232 55546 63817 28858 -957 -2629 14151
14022 14151 9699 71375 76520 14512 -12579 -2524 49001 13938 -44473 -32694 501 9892
14010 9892 36729 27748 37416 13416 28396 -4474 -92295 -119790 -139678 -83143 -43367 -9040
13998 -9040 -26901 -90743 -43602 19394 42103 55678 55355 36624 23154 23297 -17097 -51862 -31808
13985 -31808 -15762 -6200 -38332 -5511 15363 8983 22982 9321 -4907 2624 -597 -20811
13973 -20811 -34195 -80943 -98574 -149654 -116954 -22076 31928 46503 61872 82688 60530 52286
13961 52286 64331 26783 -1296 -55737 -99926 -82488 -30696 12090 47452 72960 75685 11995
13949 11995 -21432 -42027 -33767 -19590 -68064 -80550 -97624 -157237 -188210 -112817 -48972 55608
13937 55608 100369 38240 10471 4980 1514 34 57878 62997 31824 -19620 -18110 9416 -1833
13924 -1833 22498 48725 22078 -42399 -58436 41779 53888 8428 4872 5694 -25214 13455
13912 13455 12201 46365 113674 180638 131771 98035 11317 -75899 -136635 -114748 -65495 -71432
13900 -71432 -26939 5601 -26218 -11593 15993 21961 24580 49303 59114 58884 59366 40921 55465
13887 55465 33169 -20492 -128788 -139989 -45561 29994 4452 19628 -31534 -77738 -86958 -64844
13875 -64844 -36251 44225 72044 101035 46118 51953 5233 -14513 -9162 -7989 -13138 -27933
13863 -27933 -75388 -117406 -108236 -52495 -44715 -56067 -18676 473 5033 -30025 -86789 -128532
13851 -128532 -113065 -101932 -96500 -38870 -60299 -118266 -104048 -54984 -29855 -48731 -47679 -29124
13839 -29124 -67751 -51979 -27242 9677 15785 -26806 -80131 -84671 10074 51153 49407 10977
13827 10977 -24879 -757 21381 -39791 -66859 -52160 -34509 -43299 -34439 -65508 -81609 -55554
13815 -55554 -62724 -45898 -57578 -50708 5334 -14885 -17743 -28404 -31674 -30832 -11922 -20480 -49920
13802 -49920 -78774 -52617 46799 58861 63771 52455 32305 18544 -8003 6098 52193 -7132
13790 -7132 -56754 -107214 -89772 54628 68517 -11951 -5315 30514 56933 39861 20443 31239
13778 31239 44065 55870 -15256 -21661 -42344 -18920 -3796 -44669 -23444 -32195 -110201 -46928
13766 -46928 47862 53878 -12913 -52705 -31370 -82247 -95895 -79906 -117899 -76370 -47859 -27401
13754 -27401 -25849 -42113 -30490 8850 -48694 -62247 -61393 10768 62674 95103 142603 145888
13742 145888 118179 115476 63859 16953 -43146 -56458 -53722 -44264 -8922 -17212 -56850 -97907
13730 -97907 -108147 -128222 -69698 -39239 20590 61849 -37643 -47713 -47949 -109040 -42293 -46172
13718 -46172 -103203 -83122 -42910 -64002 -31764 15506 -42855 -140157 -128848 -96217 -88449 -19493
13706 -19493 40400 20805 -41820 -60700 -6577 34625 61666 30558 -9857 -18608 -38698 -4062
13694 -4062 -8915 18650 33337 41654 20304 -36097 -83147 -62110 -47826 -63317 -111716 -134072
13682 -134072 -124997 -76928 5790 13479 431 -85741 -133444 -115353 -70771 -54995 -87425 -38570
13670 -38570 -18893 6225 13782 -5723 -11223 5305 -19777 -24452 -37576 -27979 -38978 -57458
13658 -57458 -117030 -140039 -110655 -135075 -167057 -168721 -135440 -139035 -77409 -53476 -117343 -142641
13646 -142641 -88689 -61708 -41871 -72826 -115192 -91818 -60695 -70158 -75441 -143834 -147167 -122236
13634 -122236 -53887 -32912 -32606 -7967 31343 33449 81622 51490 17538 25198 -38007 -74436
13622 -74436 -77229 -88946 -58464 -22558 -28687 -34454 -66423 -65560 -64303 -57966 -57815 -143302 -51092
13609 -51092 76920 74337 100274 48905 30865 67485 -1259 -76252 -40806 4712 46665 57952
13597 57952 22030 -8380 -6938 -5981 -21225 -13160 -28705 -8556 -51361 -75324 -12791 -42789
13585 -42789 -22407 -60273 -84891 -63892 -91808 -70776 -29328 -44511 -52840 -23281 -68737 -119710
13573 -119710 -130166 -97099 5735 13597 50468 54887 35759 37906 23306 19922 28785 14706
13561 14706 -33453 -49916 7578 39901 4838 -63976 -87297 -98389 -92967 -64712 -56794 -90986
13549 -90986 -88436 -119284 -51095 15424 63382 30404 -82923 -117397 -111973 -113237 -118868 -142322
13537 -142322 -80273 -97215 -102518 -120450 -111876 -108357 -111918 -130204 -48024 20422 42509 26131
13525 26131 3151 9990 29191 18313 -10549 19513 38614 -5905 22571 111713 41547 -32638
13513 -32638 -37198 7005 17055 16062 23267 39898 -9142 -16353 45581 69340 58157 35940 14321
13500 14321 28427 29144 -24830 -79992 -61512 -306 -5061 -28829 -14674 -36558 -25008 -1922
13488 -1922 14627 69489 61963 52549 34091 75133 80561 66532 17166 61587 43996 -12552
13476 -12552 -28498 1817 3925 -203 16913 -81113 -93949 -14841 40353 48383 3514 -22932
13464 -22932 -1137 -19231 -85307 -103521 -117372 -104419 -86574 -25604 19301 45906 18631 -68980
13452 -68980 -55011 -58812 -104904 -159291 -178217 -105002 -96358 -116558 -78169 -56983 -34242 -6478
13440 -6478 -37001 -83463 -110398 -92584 -49132 -32796 -116927 -203829 -184369 -95015 -86801 -82276
13428 -82276 -115191 -128507 -76565 21746 44439 29631 -23583 -100356 -141123 -61750 -88008 -119468
13416 -119468 -128654 -73602 -79565 -6338 9309 16766 10488 49898 64530 26243 7954 -3788
13404 -3788 -9263 -1746 -25607 -54062 8861 22573 -15967 -50974 -44996 -74480 -79537 -106997 -73597
13391 -73597 -48649 -25218 -20575 -13328 435 -51546 -101331 -62672 -60686 -51158 -47712 -77236 -121444
13378 -121444 -50597 -5935 -27794 -31183 -11784 10102 12834 -21232 -35624 -5092 2059 -16796
13366 -16796 18047 -23424 -85038 -76483 -85432 -77825 -16883 -14720 -14148 -18088 6948 -32116 -75819
13353 -75819 -73892 -37850 9153 1534 -85581 -68090 -41768 -63205 -17108 27582 -33848 -71618
13341 -71618 -46078 -38837 -58873 -60490 -28508 9102 -13458 -66063 -131818 -167904 -128687 -102233
13329 -102233 -47882 -26711 -50398 -67730 -11365 -2958 -80150 -53601 -30788 -28696 -76898 -61574
13317 -61574 -15197 -34092 -47695 -47941 -61024 -70902 -44453 -27517 -52258 -73993 -83018 -28845
13305 -28845 8894 73673 73642 87181 81420 51144 5444 -3691 11149 -5362 23827 9766 -47283
13292 -47283 -55587 -38703 35883 55195 -2154 16334 -2202 23919 29023 104557 80387 2974
13280 2974 15610 24268 31528 1751 -61979 -60798 -71769 133 30064 -17208 -54260 -75037
13268 -75037 -78887 -82153 -54394 -6845 1769 36606 81175 73511 83416 32981 -4638 -25083 -22536
13255 -22536 -39618 -47549 -58004 -57622 -23590 4007 26855 -6428 -9817 -7600 42810 79087 125062
13242 125062 45209 -30957 -67164 -31636 32566 77993 72992 12681 -40484 -19012 -78473 -77851
13230 -77851 -116236 -113629 -61545 -23677 -96798 -163981 -180347 -152100 -84428 -82721 -44593 -23053
13218 -23053 -22090 -50106 -30617 -25469 10688 102721 175042 146328 142449 106031 101526 110519 142162
13205 142162 220115 235629 241517 224292 203346 125610 98933 66771 59754 69717 59988 26365
13193 26365 32520 31192 -7696 33204 53427 18300 -40919 -20500 -30429 25008 86563 101196
13181 101196 108759 148765 167067 230394 308281 415326 570162 757217 839760 947315 973327
13170 973327 849930 698723 569423 462264 328695 244104 212838 111769 74225 85073
13160 85073 132169 142178 92681 24729 -11902 -31766 16819 39367 43719 82795 113550 125476
13148 125476 159542 233450 271684 249830 301849 404784 565131 682848 845360 969153
13138 969153 1015730 944559 761561 603584 467237 349428 306535 269778 161932 171389 216313
13127 216313 156441 69659 48854 70866 84271 80832 97314 24600 -29506 -96611 -144300 -140899
13115 -140899 -53332 5859 26729 23114 55032 96565 171520 228820 328924 371410 377812 323467
13103 323467 248111 177022 145305 135105 40423 68411 107440 116209 91324 103261 129850 98866
13091 98866 100253 69753 68079 58204 49351 15308 14044 37242 13814 3484 55723 90600 24231
13078 24231 -2672 1204 75620 73369 23160 12869 -8487 -68149 -20946 -30241 -8336 63325
13066 63325 37138 73176 46294 10681 -8375 -37850 -40216 -1130 72754 63693 3165 -79147
13054 -79147 -64054 3351 504 -7605 -2219 -31436 -99575 -148613 -129030 -80820 -24815 39500
13042 39500 86212 3362 -60384 -45696 -8890 -35245 -50328 -98825 -58664 -38503 -100398 -89956
13030 -89956 -45342 -47149 19753 52686 -4845 -40303 -29916 -23326 -13381 -41186 -121479 -148632
13018 -148632 -128468 -78874 -78207 -400 43418 -13857 -47322 -73292 -38079 -31972 -99587 -150417
13006 -150417 -167439 -171527 -187476 -134694 -64868 -41781 -15897 -27301 -10409 -11136 -28511 -86742
12994 -86742 -149300 -133501 -117897 -70618 -67118 -114415 -99737 -58209 -52110 -39412 -89928 -86480
12982 -86480 -64364 -51148 -62198 -864 35872 42989 1861 819 -28052 -71228 -51812 4894
12970 4894 2122 -24060 -31569 -66097 -81724 -61702 -53953 -26871 -22167 -47882 -58770 -72818 -28872
12957 -28872 -4836 28220 -9565 -57561 -98612 -100180 -56492 -8775 5286 25822 -8586 -88133
12945 -88133 -108598 -82634 -83165 -59515 5362 59059 17286 22293 15694 -40194 -34890 9792 4849
12932 4849 -15415 8749 4311 50073 1645 -51981 -28015 1065 141 -57782 -29741 -21807 -4675
12919 -4675 -40460 -59288 -5209 -9475 -12833 -62205 -104970 -75145 -116880 -131593 -83960 -23927
12907 -23927 -14849 -38754 13672 25786 -38924 -48461 -23144 562 42004 39329 -9920 -30688
12895 -30688 -7585 -12754 -32983 -21019 -47765 -36872 -11325 -44635 -71422 -28900 7565 54328
12883 54328 54460 47308 31497 -6785 28022 -6891 578 -6234 -75065 -35030 34017 68796 99477
12870 99477 132543 64482 9341 9611 11862 15986 22357 -6550 21980 25148 -40862 -74496 -100010
12857 -100010 -112659 -85758 -74730 -79339 -58346 -58536 -78427 -68010 -46507 -42608 -76682 -140138
12845 -140138 -116980 -107090 -66789 7540 32670 1109 -18779 2776 38410 59567 38657 22824
12833 22824 -36489 -92169 -83398 -94175 -60748 -60209 -43654 -66601 -17187 7466 -46276 -23677
12821 -23677 -485 -2264 70706 68142 58309 25886 36919 -18467 -66500 -84199 -38540 -39680
12809 -39680 -38234 -76172 -80591 -51170 -4511 14192 -41561 -61288 -2798 34885 58769 35866
12797 35866 25986 10118 19250 -2211 -51174 -20959 -10052 -3917 -2772 9903 73625 21205
12785 21205 -33998 -63839 -23529 -33188 -7948 10246 2458 -7964 -53680 -80075 -102290 -156536
12773 -156536 -161651 -162462 -75219 -38921 -49947 -45410 1051 29940 -36699 -111184 -55809 12070
12761 12070 87095 113346 59138 -9352 -79544 -69935 -69410 -53823 -39826 34001 21986 92
12749 92 -31042 10581 -12554 -55200 -14037 -6880 -8204 -12311 34792 90828 6836 -85230 -83746
12736 -83746 -79379 -60289 -39218 -54535 12829 91694 81761 -46393 -21863 20148 37293 50863
12724 50863 59326 13922 -46270 -57716 -83951 -101757 -50573 -48275 -111174 -142060 -113753 -54306
12712 -54306 -25296 -3096 -21927 -22870 -20447 -42251 -56365 -65456 -59389 -38115 -48816 -17038 -21022
12699 -21022 -38002 -68056 -106152 -125528 -61535 -36218 -43820 -149480 -201346 -134716 -90937 -69932
12687 -69932 -57772 -7357 -42812 -114464 -166786 -133221 -82827 -52585 -30236 -39801 -10687 14538
12675 14538 5377 6134 -45635 -123165 -152015 -118071 -60106 -4925 -18807 55 -58496 -77029
12663 -77029 -62001 -55194 -67348 -17696 -2660 26076 20719 16790 24004 41312 5200 -25411
12651 -25411 -14452 30025 -30931 -50829 -14718 -2809 13129 12035 13046 -13392 -61444 -98504
12639 -98504 -135391 -102557 -44820 58225 78094 26916 28535 8250 -36964 29070 26962 11516
12627 11516 11192 27183 71247 -1480 -17189 -5193 -38494 -115460 -116763 -41453 29307 53399
12615 53399 -4370 -85076 -131056 -135432 -228687 -173908 -118614 -85058 -39904 -3521 3382 -21177
12603 -21177 -26265 28631 45465 22115 -59829 -79755 -19969 -44014 -84371 -83114 -104080 -97667
12591 -97667 -64680 -68096 -71100 -90835 -46135 25234 66453 20328 -54780 -91831 -76892 3860
12579 3860 78771 75338 62049 -8444 -3888 47331 55608 384 32511 -13365 -57035 -65729 -26553
12566 -26553 -45174 -59521 -27452 -61335 -58050 -68528 -39905 28849 -44103 -42501 -38927 -10810
12554 -10810 41954 52517 48704 33521 -11603 -15364 5083 -39630 -69556 -43906 -47418 -8758
12542 -8758 34384 39608 16079 -8331 -27391 -23959 -97206 -56528 -42859 2877 16763 -15883
12530 -15883 -19856 -23117 -42893 -59396 -35663 13837 -55812 -75691 -49323 -43773 -5051 8015
12518 8015 15933 28246 53808 19386 -21488 -44629 -36525 -24555 -48491 -68556 -93807 -154083
12506 -154083 -153601 -38562 -38801 -84476 -36575 8006 42185 58789 32854 -22681 -10588 60187
12494 60187 71788 -9604 -46123 -53663 -35005 19050 -11147 -54535 -80808 -92064 -95435 -68895
12482 -68895 -7567 -1196 -46271 -39180 -57255 -77448 -104988 -44940 13341 12824 22936 295
12470 295 -47715 -48250 -83799 -102523 -65794 -79959 -153522 -117531 -20761 29732 40696 19611
12458 19611 58487 33873 -26375 -35049 -47571 -56446 -33043 -971 -55326 -51145 -85147 -106181
12446 -106181 -154016 -116041 -43992 -19207 -2709 3576 2102 -6648 -7738 -41833 17083 107528
12434 107528 136082 112503 35023 -44162 -20686 8051 -48652 -96267 -41368 14438 31306
12423 31306 37117 73502 61402 38549 5545 -58494 -57069 -7581 -23991 -22583 -12559 17736
12411 17736 -64872 -70300 -34788 -14274 3542 40263 27776 5462 -45274 -10711 -6366 24950
12399 24950 36508 39878 65641 83644 20491 -59503 -15942 47452 71977 112788 106407 58339
12387 58339 41576 41283 24825 -4804 -57326 -73488 -78216 -72223 -60229 -77608 -88578 -75442
12375 -75442 -124545 -96843 -102892 -95837 -30558 36907 53031 9778 -514 25930 11247 -21067
12363 -21067 -7538 -19496 -8733 22575 1568 20015 -13954 -73960 -50398 -27822 6713 10565
12351 10565 27311 68734 41809 -26821 -18354 -29280 -12117 15570 2432 -6352 -1007 -9100
12339 -9100 25677 65231 34245 -7583 -28144 -37587 -3198 91396 60997 -52347 -35257 -7604
12327 -7604 -79833 -28018 45506 97331 54466 18488 -2578 -60624 -22038 42122 -25612 -53526
12315 -53526 -54051 -99493 -107808 -4590 13819 -38708 -58697 -32611 -66309 -125116 -115776 -87528
12303 -87528 -77967 1980 10460 -46861 -64843 -86561 -40554 -21389 -18472 10393 80579 57366
12291 57366 7497 58638 101396 26936 -20696 -13020 -28165 -19468 3046 -8118 52670 62246
12279 62246 -32557 -49326 -15946 -49395 -37615 578 10372 6779 -43749 -32233 -44083 -85511
12267 -85511 -143045 -100487 -64489 -25029 11074 13090 -18513 -22563 -817 18890 2934 58292
12255 58292 53575 -418 25758 38842 18377 37445 32526 -15202 -22730 -33261 -4370 44660
12243 44660 97819 121973 84839 32856 2621 -19616 -100216 -87699 -62887 -121566 -132768 -118239
12231 -118239 -123421 -174217 -115583 -60350 -91660 -78195 -25889 -44499 -39062 38626 86407 -13765
12219 -13765 -60189 -13235 11490 58749 90979 25757 -10168 22426 16917 -569 5021 7850
12207 7850 -831 -37900 4233 19557 12861 -48323 -87163 -100731 -26715 -9960 -84688 -88544
12195 -88544 -68276 -112 40507 104301 47561 -1830 -64792 -45290 -6990 32070 57159 64204
12183 64204 97107 113364 56355 -37795 -83020 -59734 25959 39424 -5672 -78180 -13569 13370
12171 13370 8804 17491 29751 74115 16483 -79111 -103697 -94452 -43918 -5681 -80390 -47553
12159 -47553 -35505 -26551 -11721 -29718 -53360 -57427 -36782 -56492 -77391 -119048 -111966 -94428
12147 -94428 -66943 -89388 -56873 -65775 -108105 -113593 -37274 42142 61477 16978 -59764 -55022
12135 -55022 -40641 -43883 -60030 -14594 -4259 20039 8519 37468 79852 103147 18337 -31040
12123 -31040 -48633 -89090 -133703 -106445 -24967 9884 -20367 -19322 -27493 -8437 47043 92717
12111 92717 81244 41632 -7513 -44472 -100062 -148922 -191913 -135932 -93651 -19477 -5486 -102557
12099 -102557 -108782 -50999 -14542 -32764 2899 -44366 -37762 62902 122533 114753 117034 104920
12087 104920 105466 102777 79572 28014 44066 66944 89063 107171 103123 34437 69039 135712
12075 135712 133173 146577 162949 75166 87188 202920 233179 119777 54259 20547 27380
12064 27380 100138 126113 174121 151440 128871 138613 165411 198507 180856 193575 170104 162163
12052 162163 101943 98177 119790 90832 118358 142685 213186 241164 223607 167328 183908 170008
12040 170008 122598 73926 82860 113257 133279 159284 140290 78299 111926 158269 135352 99231
12028 99231 107375 185203 237039 236753 220438 183556 97067 129656 130065 120893 80062 135310 145873
12015 145873 184357 208497 128428 115364 168941 188912 143942 181869 200198 226410 271159
12004 271159 284173 293311 301363 325057 350399 371204 397276 455098 456842 468958 418590 429242
11992 429242 431866 450057 516504 544616 582905 577896 557049 548388 636250 696903 717785 747651
11980 747651 737442 754027 825441 848427 851177 900575 1052617 1132542 1213547 1357351 1482822
11969 1482822 1569681 1634005 1729852 1935277 2095049 2241881 2418494 2561077 2715518 2928571
11959 2928571 3241357 3631483 4014005 4497798 5059214 5728774 6607699 7670899 8942870
11950 8942870 10587624 12741020 15642717 19620285 25241488 33269467 44800353 60831784
11942 60831784 80701545 101407635 120365639 136390401 145204212 140200166 121421174
11935 121421174 97040451 75918659 60817425 50557834 43360271 38027218 33633989
11928 33633989 29598648 25940396 22731078 19962644 17694698 15629833 13843007 12330179
11920 12330179 11111889 10052281 9094830 8271355 7564594 6956520 6420388 5900195 5468341
11911 5468341 5025494 4604135 4180605 3923375 3639235 3409240 3174887 2993977 2791145
11902 2791145 2571981 2372058 2179549 2008978 1931295 1818570 1735607 1633096 1544270 1447768
11892 1447768 1377252 1304825 1233071 1161826 1082476 984493 893797 860800 849784 818780 673084
11881 673084 559738 625702 628861 581655 582611 550441 549750 535065 546301 510302 515304 535708
11869 535708 480770 499737 499700 437725 385470 342763 335555 267888 274412 234711 224321 216196 218441
11856 218441 178677 226723 249814 222271 216515 219174 305735 347296 335133 306778 251661 189485
11844 189485 216092 292100 265748 262986 194109 152420 159427 183856 168299 166391 230831 240240
11832 240240 247677 249555 186496 72884 71868 106701 100231 108251 118961 124540 132181 161912 159917
11819 159917 107534 83096 96115 111076 137533 187776 173777 95008 102717 107649 112096 98265
11807 98265 99115 100152 124643 107053 66882 10611 51437 104965 163822 214068 202396 143476
11795 143476 133581 158933 175183 146474 130080 153588 84127 97331 95549 45447 48072 50212
11783 50212 99115 122590 162552 197074 212808 247414 248037 154170 163987 162740 148547 157717 158743
11770 158743 84357 67435 62783 82385 128328 150633 162916 165256 124371 133141 70752 20658
11758 20658 50011 28959 68343 63474 63841 78474 59134 -20171 29102 62146 53278 35448
11746 35448 3782 -23504 36541 42472 28721 41688 88317 18485 -63749 -87374 -122238 -94642
11734 -94642 2910 -15862 4525 24311 35147 49341 62648 104635 182798 200040 203653 103036
11722 103036 -8524 23223 19706 54751 40004 24856 26148 47766 53624 53554 39715 13120
11710 13120 50161 39179 60793 61637 57346 70378 71615 139961 154881 73640 58413 59008 73453
11697 73453 50161 13456 34283 76498 91385 127351 111214 102366 119504 86806 14816 6931
11685 6931 12952 -13687 -5063 76787 143929 50846 94368 151974 152941 153151 103906 49250 67930
11672 67930 78522 117647 69433 104517 195055 246858 365473 478152 634385 912399 1301651
11661 1301651 1842265 2471596 3110878 3689303 4198331 4295815 3759439 2805202 1962681 1502226
11651 1502226 1234756 1001489 825858 804246 770407 685074 627019 505144 475916 433498
11641 433498 356840 352917 346952 302492 290052 284599 330297 372132 476150 545579 635097 819998
11629 819998 1026919 1514939 2197729 2811251 3331669 3842280 4046651 3672030 2799527 1945149
11619 1945149 1472290 1193362 1021784 929341 818469 686389 585157 542503 515785 438185
11609 438185 376607 278293 262807 260103 174707 115580 93911 103020 162985 216350 219033 210436
11597 210436 186565 182402 175266 122345 97177 88259 54581 40178 40030 45931 71305 36734 37769
11584 37769 61621 90323 66758 16090 18001 46428 27497 -20471 -58814 -98620 -75604 -24651
11572 -24651 6240 3966 -13565 19934 -37559 -94123 -105440 -75112 -14762 22484 50523 76638
11560 76638 88418 16224 -34830 -28901 -28257 -23557 -3159 40085 33359 31640 51922 46811 27422
11547 27422 8748 -25749 -29647 -59631 -41727 -34552 -74854 -42268 -23037 1176 42045 -84659
11535 -84659 -168112 -158248 -83295 -78728 -122993 -124719 -79066 -40080 -39952 -59401 -53756 15291 54895
11522 54895 19222 15780 -3559 17803 17045 -26249 -18115 -1634 -44213 -50516 -58624 -31643 -60345
11509 -60345 -14793 -16648 -28166 -17677 -22514 -110013 -110159 -30606 -33605 -35609 16972 2203 -21271
11496 -21271 40797 117736 155174 87049 34888 12885 27298 31463 11059 35100 67843 14940
11484 14940 -33874 -107176 -69597 -14450 -26417 8684 12611 -5558 48139 31407 -34802 -74877
11472 -74877 -25232 -34776 -59518 -119042 -61921 -622 14266 -56395 -22182 53933 31839 16144
11460 16144 4503 -14402 27009 55496 60324 65863 59407 53347 29009 -70664 -138349 -149780
11448 -149780 -139977 -119188 -48700 -43583 -88346 -117575 -103388 -111608 -89990 -80938 -100144 -147286
11436 -147286 -111790 -73876 -81824 -102766 -78177 -100123 -51119 9126 35643 55746 39967 -23352
11424 -23352 -7063 41034 -7712 -35309 31977 73015 55429 68777 60517 45864 33938 -4917
11412 -4917 -97009 -94953 -54875 -51194 -59499 -91434 -83652 -98353 -82540 -106552 -177726 -139303 -36171
11399 -36171 55059 24182 -21257 -4854 35710 22910 14674 -28247 -69453 -49990 -52299 -68990
11387 -68990 -70469 20409 18318 -12383 -31979 -38206 -71480 -84180 -88891 -81016 -28290 -39446 -37831
11374 -37831 -33348 -72420 -69002 -26060 -70196 -29729 -36733 -39294 -32165 -42984 -32231 55460 49160
11361 49160 28803 28036 13858 -36137 -99446 -117093 -115488 -56786 22367 435 23513 55330
11349 55330 29609 -27785 -79325 -50019 -39722 -52858 -38206 8124 -13851 -42779 -80690 -11187
11337 -11187 43870 44671 -3162 -20422 -27978 19494 11175 17108 -12414 -412 72360 99350 100819
11324 100819 66737 18835 -2990 -21639 8564 -29398 -47786 -51122 -30058 24787 24793 -17235
11312 -17235 -17116 -8630 12208 76189 114188 71144 39814 67330 66084 77949 43436 -44152
11300 -44152 -63375 -94259 -70908 -104924 -59908 -10195 -12492 11621 83012 76173 35621 -79573
11288 -79573 -105209 -86118 -47207 -28140 44321 46827 19944 38524 32025 -60453 -80118 -69698
11276 -69698 -98339 -44820 6543 45170 90915 106558 76863 59300 63395 17888 -50221 -66536
11264 -66536 -60514 -94558 -93982 -79490 -52545 -18739 26600 17248 -27434 -23143 -31639 9420 -40100
11251 -40100 -79611 22367 30743 40842 79447 -38539 -143709 -106725 -46977 -59033 -118039
11240 -118039 -143661 -108073 -71971 -33770 -58745 -67601 -75944 -91209 -86865 -128434 -66809 -63039
11228 -63039 -69751 -92920 -123270 -103826 -103556 -37652 7894 3217 -22468 9931 -11500 -4309 28934
11215 28934 84293 21302 -21609 -60238 -58900 -45551 -90566 -29861 32506 -16167 -9323 -2931
11203 -2931 70539 47267 -19569 -77785 -32021 57350 18400 23530 36758 32733 -24254 -44617
11191 -44617 -60752 -57942 -17327 6662 -29906 -51834 -74988 -35882 -72557 -68886 -46430 -42341
11179 -42341 -61284 -82055 -78200 -63232 -53555 -40250 -92397 -138638 -116570 -87605 -37225 -26058
11167 -26058 1985 -28103 -115358 -66973 -5768 -22004 -47249 6597 30815 2495 -28458 -123139
11155 -123139 -122672 -54762 -28183 -47766 -65133 -70162 -68369 -43439 -25428 -55736 -65362 -40861
11143 -40861 -63891 9645 -23804 -43149 18360 -13256 -3154 -30752 -77551 -83358 -57717 -34218
11131 -34218 5106 27684 22214 -24677 -70893 -121425 -97315 -11074 15500 33936 -185 585
11119 585 -26292 -60701 -22094 -4266 -57909 -8682 27014 -4533 9918 -31971 -29846 -65969
11107 -65969 -84330 -47950 -14114 -26187 23635 41016 29419 -12657 -80201 -125877 -174008 -176298
11095 -176298 -115319 -43141 -34450 -24203 26319 -5057 -88195 -167453 -204378 -197473 -186389 -155937
11083 -155937 -147370 -139900 -141442 -94782 -90090 -127910 -90234 -85118 -72765 -103189 -95257 -31736 8039
11070 8039 40776 11132 -47455 -49145 -5411 44999 41865 46788 -11032 -75027 -125253 -126032 -53845
11057 -53845 -12969 -54513 -69167 -64216 -92842 -63716 1881 54982 36517 21022 20769 59358
11045 59358 67569 32832 17510 5281 5978 97064 156045 132993 126105 152348 174722 134413
11033 134413 165082 183681 191097 205098 225178 284912 273131 242834 238521 292298 381244 442242
11021 442242 440416 459701 497214 518570 616464 669411 698782 775169 936626 1136312 1364890
11010 1364890 1566637 1860149 2207384 2552722 2893787 3170527 3297462 3256580 3008106 2613807
11000 2613807 2215596 1907936 1566862 1338810 1195686 1096495 987068 840133 793570 778016
10990 778016 743379 706569 681958 603310 536842 458564 420724 417975 333577 279848 258886 276477
10978 276477 231459 157754 134381 144976 198933 251609 259286 302948 248486 208294 183841 179231
10966 179231 165742 92277 103586 83330 96290 184567 156623 136343 138361 103418 78866 80992
10954 80992 137255 161053 86535 92424 127931 174833 223323 292145 369601 363804 407640 403195
10942 403195 379498 472554 609791 735913 892039 960171 994863 1132006 1313414 1607734
10932 1607734 1932492 2346608 2844859 3316209 3701609 3984417 4129602 3997683 3696386
10923 3696386 3295504 2826719 2404048 2082710 1852634 1653868 1503601 1371110 1233974
10914 1233974 1141974 993853 870456 769685 680040 562869 537410 475167 411733 359497
10904 359497 320692 331912 306610 239364 214883 236302 256341 320371 273253 217200 196278
10893 196278 211974 212624 144333 133950 183555 201364 165313 168013 121725 77655 58491 51812
10881 51812 22065 16574 56458 52823 95193 74482 104623 61450 52853 70181 77111 63070
10869 63070 43391 104599 120485 99993 97085 99943 158101 224974 281766 277933 232836 255430
10857 255430 221442 186645 210921 208327 191815 225389 159675 125990 85279 44835 105602 140673
10845 140673 161831 104391 3879 33479 69114 70972 133654 137299 160719 140570 113455 110146
10833 110146 129608 107968 63791 102500 138860 112992 100932 70819 56226 71897 75680 97690
10821 97690 152200 170519 131035 154735 154802 127806 135240 100471 33972 25339 22019 12543 -11460
10808 -11460 26696 52193 51008 45307 81210 49509 18407 63155 101596 116660 141186 177859
10796 177859 190777 185450 134549 129104 142965 105956 104201 143771 128790 99487 92217 108603
10784 108603 107308 29644 -19156 -33612 -51635 -8548 56499 46335 -41510 -87613 -60382 -102597
10772 -102597 -149932 -199883 -229905 -207988 -210332 -221989 -210393 -218304 -206634 -61792 73643
10761 73643 183153 250440 314890 360515 316711 301061 293895 284767 296263 308313 346977 356827
10749 356827 358331 326701 322184 372386 426530 482319 519158 529284 527975 543411 559823 646282
10737 646282 699557 724985 806714 910491 1008745 1137741 1208342 1319272 1341177 1312754 1243879
10726 1243879 1121343 988510 940681 926796 900387 873751 828275 872188 873488 843962 895967
10715 895967 951881 978411 948390 962886 976801 902637 879315 913922 926390 917077 935591 881955
10703 881955 926967 1012527 1079795 1042345 997798 1009951 1021909 992846 968383 970841 924310 891697
10691 891697 900598 921076 955892 966290 1031373 1062439 1070554 1024383 1026225 1093016 1108930 1102560
10679 1102560 1108418 1187006 1283172 1314017 1380286 1435424 1451772 1491065 1583299 1678294 1727112
10668 1727112 1770098 1895693 1948096 1993330 2055300 2163072 2226902 2268412 2340008 2380394 2421361
10657 2421361 2538276 2657974 2770198 2850246 2978709 3128143 3308968 3525112 3695739 3938442
10647 3938442 4238285 4539491 4962726 5411594 5871399 6401414 6907403 7462405 8041635
10638 8041635 8585119 9071970 9518538 9920690 10482057 11225896 12232063 13422292 14672599
10629 14672599 16096483 17734385 19487070 21364481 23386993 25775062 28784336 32506972
10621 32506972 37209070 43025406 50383896 59931220 72723404 90427802 115482955 150951674
10613 150951674 199754579 262873740 337381806 416511856 490469289 547150177 573854198
10606 573854198 562009548 513633868 442317990 367100905 302759470 255019958 222456519
10599 222456519 200733424 185848877 174866530 165855799 157844042 149958907 141164359
10592 141164359 131113516 120970634 112379442 106434969 103612618 103708568 106159577 109701381
10584 109701381 113230277 115689229 115779903 112259975 105065332 96007785 87621521 81508511
10576 81508511 78082829 77083979 77857439 79461429 80935359 81380571 79957926 75984908
10568 75984908 69581256 62208325 55539893 50488163 47155247 45265217 44356554 43814369
10560 43814369 43122094 41929551 39991727 37057005 33208737 29028263 25204862 21949721
10552 21949721 19277235 17149179 15422329 13902479 12610260 11448871 10431535 9511230
10544 9511230 8786392 8188216 7572190 6919097 6344338 5937339 5602897 5295307 5006627
10535 5006627 4742922 4470517 4210726 3956978 3720800 3561415 3313275 3121764 2971091
10526 2971091 2832934 2761451 2718477 2619325 2516336 2430387 2392194 2324010 2185235 2077917
10516 2077917 1988912 1912047 1828513 1775244 1739685 1730069 1722113 1671112 1611803 1569986 1549107 1510487
10504 1510487 1378260 1330647 1324051 1340542 1289132 1264850 1228477 1200021 1220230 1220670 1162780 1117888
10492 1117888 1134010 1057085 1017608 1034202 1033935 1033150 1044321 1017632 1031456 1080791 1075298 1111387
10480 1111387 1094894 1093437 1027702 991567 964610 954502 945607 883310 866459 878457 882891 929983
10468 929983 887341 872992 799014 774162 792263 809610 833436 849687 823279 787534 771657
10457 771657 713220 691803 750170 812326 886355 934742 1037598 1101541 1105811 1104722 1032272 1032984
10445 1032984 1058157 1045819 1025925 1031821 1026749 948227 910477 844314 810787 775996 769661 764954
10433 764954 737605 718054 692704 694599 660159 582226 491713 522786 627556 612755 539026
10422 539026 558881 557773 525235 491383 465244 506507 598279 614324 613409 567564 549774 568480
10410 568480 576351 565685 524259 503381 450153 427129 496855 549402 512850 471058 454023 463277
10398 463277 476424 487713 478519 469842 466863 385375 364927 378524 350997 339018 352750 382262
10386 382262 397095 418845 444075 414426 425729 456546 469545 476665 511514 525546 547636 522038
10374 522038 544857 498139 452814 451314 427909 410460 433879 420649 387136 359949 375889 387766
10362 387766 383675 358302 407142 436808 369975 352272 350913 346762 382661 379409 332459 357931
10350 357931 390173 403145 378007 413546 390167 385228 387614 427906 446595 495843 479412 422472
10338 422472 406261 411436 454082 409948 409129 380560 404533 417810 399630 387357 372506 319302
10326 319302 343671 354256 374180 385488 385052 276849 247781 307174 292225 240435 239319 295060
10314 295060 339106 346114 330942 368763 391519 368214 295385 287930 305209 329590 347918 379592
10302 379592 352516 319991 255085 238140 298275 305601 267984 267080 265223 216601 231157 223607
10290 223607 149514 145529 132202 135364 186390 244120 196325 186462 254270 228789 253563 263654
10278 263654 265077 274543 206249 176712 206218 197847 190434 230849 197419 146171 121519 107919
10266 107919 154240 190598 209258 225243 171723 171206 163261 155888 147673 145246 144912 162522 191159
10253 191159 193948 139275 78005 58144 72735 120828 145266 140636 131098 98531 102931 64505
10241 64505 68316 98805 171947 204654 242161 278765 237523 202435 179540 241940 293985 362555
10229 362555 395342 347622 298851 298128 335537 356947 346060 360103 364704 389828 423056 427306
10217 427306 424073 480454 550627 656253 762324 892415 1095728 1426006 1779228 2157007
10207 2157007 2500656 2829537 3130121 3082735 2924309 2613638 2209874 1860825 1631910 1456968
10197 1456968 1290991 1127524 957832 868325 849552 833013 768433 660586 646936 622337
10187 622337 557431 496856 432455 394355 407435 391558 363825 344895 325488 357032 342621
10176 342621 295668 217753 253650 341498 342938 265746 257270 278956 245285 235612 293177 386786
10164 386786 330994 363409 421638 405651 371888 491491 535769 535799 483511 412549 390156 374025
10152 374025 355723 391308 456432 418853 417115 498475 567371 614477 627398 641039 670804 644381
10140 644381 574929 522819 525878 548821 637854 646974 620716 576113 502365 457152 440310 395335
10128 395335 426680 417985 421377 378703 315264 301863 287293 241875 260542 251245 265878 246649
10116 246649 248593 313886 362332 276146 227238 196568 198565 242016 274764 276275 243267 215370
10104 215370 245526 248929 160544 79022 89880 122448 127218 184758 213931 180873 187944 152333
10092 152333 110082 128816 137028 124725 19585 19674 77715 96224 111060 89316 68282 27161
10080 27161 24500 75339 115603 106302 119837 127140 81306 93996 98759 72056 23769 31007 66530
10067 66530 100204 87082 145896 167235 92274 40513 62639 105093 104205 140928 156141 107171
10055 107171 59019 53488 49452 134911 155676 127966 126008 163478 160292 142895 101420 75713
10043 75713 104508 120184 134609 90772 61308 107378 87935 75459 40437 37123 8259 43320
10031 43320 77584 67459 102581 133781 139252 85037 -4019 38898 57758 42161 42685 76155
10019 76155 82729 77580 84328 152231 178646 160597 149899 103103 76135 119183 134403 90414
10007 90414 96670 117964 146600 150231 139444 115688 123493 125368 96083 91607 64430 36283 55408
9994 55408 49347 63458 113057 77467 77225 93264 47933 -24327 -32501 54713 115220 117959 106824
9981 106824 28755 21119 87947 137411 156959 126093 127748 50859 -45916 -51015 -1993 36296
9969 36296 41567 43664 60855 66701 70271 104062 90260 77497 82908 96248 179812 207119 161565
9956 161565 164634 190843 207783 162123 131634 90104 95701 50373 58680 62847 64104 76731 95497
9943 95497 75047 56664 123505 118597 70467 88538 151560 172546 117034 139894 212795 244506
9931 244506 191604 189810 127114 82633 121574 137502 186401 408056 658982 760134 889615
9920 889615 1044068 1083896 924910 668705 426368 355280 363859 347606 304734 268781 218898
9909 218898 172862 126014 105197 87404 74672 100222 98945 115715 147347 102662 46269 22996
9897 22996 83141 138451 151717 146451 105674 100479 103609 125637 135529 95750 68517 60495 57541
9884 57541 132416 140025 128708 67831 81792 71064 71400 50020 40775 67347 91997 127950 175726
9871 175726 208261 141911 94626 111758 107966 43139 18889 104660 98727 70102 86420 99597
9859 99597 54589 74708 62746 64279 61898 92263 135080 103031 77342 37001 103710 160498
9847 160498 170809 131723 126513 99054 58956 63067 72531 70132 16710 13473 101560 87531 75919
9834 75919 98239 79074 14566 42305 72216 104775 113083 121157 138856 122832 72375 38334
9822 38334 95190 51797 -38804 -6397 26629 39195 54011 88398 67392 21417 -4944 -17643
9810 -17643 9706 72199 46571 -952 -29593 -16302 -33488 -84316 -84814 12578 12340 6901 -3935
9797 -3935 -19252 -42194 -56285 -33614 48863 56495 25938 67155 53636 59370 97565 123464
9785 123464 86449 6209 -2542 35850 19482 45035 39224 10028 -12396 -36881 -91543 -92390
9773 -92390 -24671 -41665 -51109 -41966 2617 -34109 -32825 56334 58138 47622 70221 84055 154717
9760 154717 104788 44762 33947 11845 19044 65170 96639 63279 138548 200990 209139 92830
9748 92830 37177 66907 15160 62142 118328 171632 186612 210613 144273 83023 103619 120802
9736 120802 45016 35268 29569 21552 30897 72363 42461 -13800 19676 63582 54341 67310 100302
9723 100302 137612 104580 89862 68915 37042 63109 99066 15548 -35956 89811 86710 34917
9711 34917 50873 44435 28914 14707 18031 19034 33467 64397 29364 -59829 -73254 -18638
9699 -18638 -14781 -62643 -71360 5366 61655 29148 7046 -6264 -21992 -5459 22551 62796
9687 62796 5329 -27395 -50125 -54691 7886 30781 76804 67115 54269 29181 -17524 -28337
9675 -28337 -34706 -19528 -23793 -37254 17451 37970 35132 124640 177880 160660 145184 90785
9663 90785 66766 78049 137405 136956 81230 91343 132371 118960 112924 56855 60994 73049 38876
9650 38876 49803 85271 206129 298586 324174 295636 178544 139359 135427 121062 142959 162643
9638 162643 183212 180328 214854 168426 138723 149765 100495 35001 39688 102206 60382 71008
9626 71008 124904 165609 185276 193025 215160 211707 179025 166304 49674 -12993 31269 121386
9614 121386 134711 120008 154761 93108 -10773 -53682 -30519 -16475 -28489 3497 -13863
9603 -13863 -18974 -56788 -57372 -280 -11599 63551 102785 48432 50031 68220 73665 67625 4627
9590 4627 -11421 -16621 -13712 67321 152324 134907 78583 84140 92349 40907 8926 13455 10457
9577 10457 -36607 -101605 -52241 -28078 -23034 49908 65879 90748 72525 61739 96706 86735
9565 86735 86859 51055 31572 67741 55338 61778 36592 74560 63840 75160 71909 47651 66167
9552 66167 100327 117126 105912 130586 113974 50938 -9471 12983 -19322 2796 101052 136868
9540 136868 78721 99872 89562 93477 46288 29846 30926 63564 70680 96416 113417 67542
9528 67542 74511 32784 44366 80391 101962 127864 133893 127916 74798 24801 42709 66157
9516 66157 99949 185366 144841 70513 36889 17031 89230 77339 58947 55904 50675 62338
9504 62338 43921 85160 95847 88782 73502 70459 37754 5492 -35299 -45936 -53045 -43150 -10470
9491 -10470 20374 66597 52366 53646 77569 115634 105337 59850 56608 55079 130918 134409 110262
9478 110262 68402 41805 16832 31578 47709 43238 34051 29049 4694 -15933 -11511 -13280 -52519
9465 -52519 -85272 -57328 83826 153760 149160 88058 79112 42574 51604 95793 97977 58287
9453 58287 -4707 -92785 -109174 -77615 -61924 -36172 -64552 -418 23094 -19089 -15040 -52573
9441 -52573 -42797 15969 47863 58511 83760 94245 78850 58424 66420 27652 36267 31140 54269
9428 54269 82633 105486 104097 69808 42188 48704 73564 50697 59774 93640 127991 30263
9416 30263 -32567 18981 36657 32465 79616 125975 98792 38373 -6803 20116 1939 -24001
9404 -24001 -5648 25818 31700 -1351 -55786 -42815 31175 81146 84743 32388 83920 108252
9392 108252 58814 20183 -28568 -42246 10843 43912 55816 89363 23541 -41083 43509 76679
9380 76679 49546 -7804 -56386 18076 31373 43048 -10025 -14133 23187 -10698 -9518 -37107
9368 -37107 30311 51327 22759 31416 17702 5958 12932 6041 -60574 -83298 -23667 -66301
9356 -66301 -33706 50284 44473 -2823 8158 42993 -11434 -5873 52492 52866 17027 -25893 -27573
9343 -27573 -51989 25691 56236 54417 16075 28284 42722 17777 -61160 -102046 -104433 -96198
9331 -96198 -52114 -36651 15977 51572 49248 52499 88247 102037 63738 12784 -70244 -51009
9319 -51009 -17294 -46507 -21787 5007 -19860 -40883 -27442 -12910 17069 12686 -18472 -46610
9307 -46610 -30529 -31274 -25978 13229 80708 55072 55126 73111 36122 54238 83722 98899 96361
9294 96361 71372 40739 -11329 32456 72869 44012 40227 40844 7700 -61496 -75218 -83551 -67622
9281 -67622 3549 78605 93028 43872 101128 96536 64791 103102 110677 65985 -30853 -41454
9269 -41454 20841 57761 48835 28204 99204 129046 42637 22280 -763 -25442 -61058 -9389
9257 -9389 28680 51129 30443 24136 34687 28642 5005 22366 8978 27914 -22119 -41904
9245 -41904 -18088 2644 -24765 -27745 -41427 -44738 -46710 16811 80882 158579 104852 37765
9233 37765 -22066 -76283 -77269 -28701 40723 45848 41198 71936 14524 8087 42539 31351 6248
9220 6248 51065 47790 22621 5721 -18301 -43419 -7680 -38768 -61524 -13404 -10727 -35372
9208 -35372 33548 80460 66521 38907 34574 9871 -14374 -40163 -13660 33324 10394 83346
9196 83346 82935 -28962 -64686 -98668 -54505 -100045 -92085 -63960 -68794 -135536 -165894 -121953
9184 -121953 -85193 -35153 -32486 -15846 -34113 -46188 9981 38343 51553 -9406 -22050 15736
9172 15736 40379 24803 17774 15477 28544 26638 27152 20963 13415 4682 -12417 26899 29716 30532
9158 30532 -3158 -28532 -6606 -11585 9107 27554 14208 29044 37763 42933 -28163 -8364
9146 -8364 51968 136561 138931 71279 59893 42951 36294 51223 49136 17688 -5337 -10290 46838
9133 46838 35732 -15337 -1914 4526 20110 38528 -45067 -58335 -36642 -19667 -5508 68505
9121 68505 91928 75987 64342 29837 3951 41287 54277 -6072 -27388 -12908 21721 81267
9109 81267 74415 48391 16930 2123 -52104 -47294 13769 47307 42240 2863 11174 62932 82810
9096 82810 51637 39634 70182 90487 103381 93067 80486 8069 -6295 18574 -40633 -30959
9084 -30959 -42105 -23692 -62579 -25957 30092 29726 -9062 -27961 -60546 -58967 -292 38850
9072 38850 4104 54489 81268 80320 82099 41397 20281 30266 17911 57826 123950 132462 74089
9059 74089 24393 49514 61222 12917 -34823 -29622 47863 52126 -33136 -54627 -11288 -22287
9047 -22287 -27046 -27725 -27254 -19247 -1677 -53313 -47472 13337 14034 -44521 -42101 -11174 -16676 19246
9033 19246 46468 13878 -44309 -31940 -6605 17170 31909 27621 96239 77610 21211 -20907
9021 -20907 3525 40308 38565 41330 44850 74479 89957 74929 78586 97340 93851 84235 72022
9008 72022 30762 64751 28295 -7355 -24749 -54919 -110659 -93413 -76046 -36845 -1972 -30007
8996 -30007 -51459 -17699 -12665 -23608 -1927 37307 40584 -20064 11930 39540 72133 139150
8984 139150 117109 112753 117575 149158 204796 160411 128932 60214 53475 40319 -22832 -110121
8972 -110121 -161139 -98796 -78621 -36191 51259 66468 19986 -18516 -41745 -3285 18963 -23345
8960 -23345 -48230 -95639 -99693 -31341 -44535 -72373 -58094 -21619 -27352 -55131 -29794 -34031
8948 -34031 -24219 -7487 -33006 16402 -405 60449 43441 30782 -2044 -51091 -49454 44769
8936 44769 123940 72038 15182 -15073 -14150 -16967 2958 31005 52487 50690 60865 31212 -39440
8923 -39440 -57183 -7788 62012 85005 25374 -44891 -89668 -3455 19181 8208 50791 62717
8911 62717 89015 96941 106440 65128 -16507 -40457 -32870 -70842 -74958 -72599 8202 65218 56605
8898 56605 91610 146940 101945 90201 54341 5071 -17961 25513 62768 122087 132404 140418
8886 140418 150811 84322 74311 108558 71587 32409 67450 56693 69221 38790 28755 37325
8874 37325 27005 -1731 -41195 -21614 -13085 -15673 -39993 -60905 -84685 -40203 -38179 -58204
8862 -58204 -56122 -10045 4561 88762 66648 5444 -6907 12637 4521 -14800 -28079 -12083
8850 -12083 -19028 -5973 81143 91925 27554 -23487 19860 68240 66489 20427 -38441 -93522
8838 -93522 -76210 -35475 -14208 42402 95491 64739 25149 28472 -5525 -35983 1103 55818
8826 55818 48173 56844 65413 -4338 -25691 13953 -9809 -29252 -20756 -18122 -6245 -57329 -88425
8813 -88425 -70192 -39759 -36613 -64339 -64891 -59540 -13872 32615 87902 76336 50360 19668 19172
8800 19172 57479 75380 55728 14700 -16725 -33423 -34064 11596 -16969 -21981 -13527 -8730 -61809
8787 -61809 -112470 -99451 -60682 -35993 27220 40950 30668 -9953 26785 82700 32978 -59590
8775 -59590 -55021 37772 59130 -19775 -35793 -26240 -17059 -9047 -31622 -28520 46700 66006 46690
8762 46690 38570 -7235 521 46170 56512 116510 108078 80835 59735 30978 -13689 1524
8750 1524 3189 17082 65979 112941 95700 72014 34360 23539 -14048 -14056 19671 50162 11168
8737 11168 -6917 -43328 -48946 -27533 42444 53687 60743 73515 99642 69088 36122 3892
8725 3892 41439 33879 25913 25524 61726 85174 100089 135039 140876 105472 56183 83342 76730
8712 76730 94934 85140 23542 15473 64316 40746 -36191 -70873 -63583 -3891 6790 38559
8700 38559 88038 48934 33662 3227 -11787 21826 17376 37908 67392 111865 46167 7710
8688 7710 -9242 33303 78637 88632 64657 -20761 -25536 -29135 -19386 -39424 -9 22725 -22091
8675 -22091 26054 48058 -45633 -120190 -70997 -33412 -27598 -33973 -887 17604 -9326 -11642
8663 -11642 -32517 -53720 40464 28266 -2652 -33105 -78444 -64132 -63537 -23858 -11181 -41634
8651 -41634 -58080 -41115 -81830 -99329 -49006 7604 48360 59807 68114 52732 74611 61726
8639 61726 53077 45221 30771 14291 61643 77675 35002 9190 59280 -443 -39968 -18463
8627 -18463 -41545 -77747 -40789 -16708 20832 25262 18511 10306 10153 -21359 -109173 -83752 -102128
8614 -102128 -84940 -34017 24587 34738 67534 91104 62706 102630 104127 9650 12826 52964
8602 52964 106367 107352 130084 64607 40785 35054 9745 -44104 -26267 -43102 -10367 21517
8590 21517 5288 -9190 1820 692 -36914 -5973 33530 51354 -2788 -46233 -74206 -39793
8578 -39793 28179 110798 70495 20985 -12477 -9569 -11701 -27664 24990 46385 -36185 -45569
8566 -45569 2699 73096 158184 153352 70150 103797 191192 176531 181817 155119 59047 26382
8554 26382 14114 52693 39387 9828 25366 45101 166620 148039 105312 118927 124641 20055
8542 20055 -8151 -12319 35174 54102 9457 -50831 -17363 -20239 -48786 -23493 -17991 15613
8530 15613 7014 -11925 -56526 -43188 -26901 -54393 -17634 925 -41222 -37027 -58797 -80033
8518 -80033 -102371 -100320 -13778 61580 87224 66183 18368 -3304 74095 72675 21861 -18789
8506 -18789 8509 4304 10919 -13851 -31798 21240 20780 67705 71031 2380 5065 -38703 -79464
8493 -79464 -35114 -64698 -71826 -54160 8814 11162 20325 31525 19613 62241 38377 23148
8481 23148 14643 -40096 -1866 24006 52018 45535 -34965 -24499 23555 52772 5584 32564
8469 32564 36209 9393 -17096 -93507 -51685 -22381 45110 39279 7001 47108 72940 100293
8457 100293 95877 57502 76636 41831 -4114 -27863 -12247 -30206 -50601 29919 44753 37507
8445 37507 60749 40153 -10178 -22529 13433 -2447 30335 112356 106837 57926 36291 32332
8433 32332 40485 87329 78324 -2383 13698 -18549 307 8885 7008 10323 -5714 -76965 -63181
8420 -63181 -48342 -37492 -29350 -44380 13628 72489 100348 65258 7701 -63082 -75142 -25073
8408 -25073 -3838 -8591 -13753 -54015 -42118 2882 29704 -10875 -70852 -22098 17786 2776
8396 2776 6426 71231 62793 -7357 -9304 -2240 -13291 37134 65806 39822 35353 43471 60519
8383 60519 -2222 -55596 -71021 -57485 -57635 -16130 -1432 -25199 -28146 339 -20343 -16535 42296
8370 42296 18725 -32206 -34439 -34376 -19320 42220 -4775 -79551 -76252 -17277 -20625 -40927 -78902
8357 -78902 -25280 30564 342 34147 39092 32265 32286 7991 -47496 -48708 1739 26665 3709
8344 3709 10373 49577 35489 -34458 -52511 -14692 -31988 -101201 -75149 2888 37914 59057
8332 59057 9750 -69399 -66509 -6941 45487 26962 19057 16025 1563 29425 -15637 7954
8320 7954 3443 23647 22190 -2577 22575 27242 -41531 -50273 6948 -22041 16458 50784 12637
8307 12637 -7511 -7234 -27875 -18088 11637 24536 10148 -22946 -28053 -79953 -89242 19349 57269
8294 57269 35880 18859 39367 23295 -9890 -26701 -40708 -91227 -82542 -37505 20481 37539
8282 37539 50044 -4927 29805 40828 49722 -1615 -63751 -61601 -55571 -15817 50148 8314
8270 8314 -17598 -47475 -35856 45565 60616 23089 26644 42056 26155 1765 33002 17769
8258 17769 22384 27975 -12658 3533 34589 28521 72677 79891 43719 25528 80687 98579 117368
8245 117368 91054 63532 49476 46761 27962 40805 46142 30733 -14133 -3467 23169 58323
8233 58323 59819 72626 100251 96906 101320 58842 26264 9819 -22762 -34732 78058 97947
8221 97947 7955 -42554 -64014 -86682 -99919 -56627 7986 -32555 -35724 -8185 22695 61349
8209 61349 53335 41335 79289 59678 28652 28634 5099 -16223 -56323 -90441 -30767 -54617 -57847
8196 -57847 -33460 -57864 -52697 -70233 -108588 -96769 -75994 -49986 734 18373 41136 52423
8184 52423 105044 128889 106516 113120 87779 51274 57061 28499 21033 69028 41815 20724
8172 20724 -8094 -37693 25687 16362 31284 7951 18588 64778 67762 62657 19824 -12877
8160 -12877 -26647 -1279 -4632 -35628 -133822 -131436 -75007 22040 38480 -19400 -63331 -58649
8148 -58649 -43648 -71141 -86140 -77156 -60290 -68641 -80376 -44554 -16790 45120 102843 121581
8136 121581 109950 68618 80974 36456 11236 -18057 -2330 41897 103706 120670 130937 104233
8124 104233 47521 -11206 -5712 44433 58355 22299 28135 -29050 -17789 -32231 -35813 -36602 -66106
8111 -66106 -69107 -77279 -136959 -95478 -6096 7617 27446 80495 62834 9518 -11367 9091
8099 9091 -28476 -121584 -71783 -33453 8836 -9807 -47842 -43262 -31607 -34092 -17717 25470
8087 25470 34932 -23875 -79451 -25344 61 6757 15594 15802 -17231 -61936 -62327 -51964 4034
8074 4034 67695 69868 65656 45734 58145 76284 80295 76360 39128 23462 -19312 -56850 -80653
8061 -80653 -85427 -65039 -10681 -20739 -66316 2701 85233 63872 43249 74548 58899 48993
8049 48993 26127 3401 -63770 -63493 1250 59636 33898 1257 406 -4606 566 21683 47050
8036 47050 94930 136609 147528 94037 78441 101117 147068 147920 130097 132185 137351 73706 11951
8023 11951 14719 30703 51804 62342 56095 32592 23186 7661 67548 83645 47750 10435
8011 10435 -10147 16000 37062 23900 -33229 -26300 -52947 -52381 -25476 -36731 7995 -21252
7999 -21252 -29326 5942 2825 -11881 -58247 -55462 -45947 -86878 -47515 22137 15066 31160 71456
7986 71456 123784 147089 65685 5250 -37314 -25616 -232 3927 8761 47681 -9595 -16426
7974 -16426 25067 8665 -53018 -93559 -41857 -2740 -26838 -15437 3473 -15432 -67481 -60793
7962 -60793 31814 60386 32241 -12679 59235 60314 54747 36055 21263 7072 64413 91821
7950 91821 82893 69596 83921 68302 64870 66611 -5947 -38171 -22823 -17610 6022 33343 25491
7937 25491 33733 42384 9696 -7714 -8532 27401 98817 164761 188702 133029 50118 11312 27112
7924 27112 49304 46320 -8157 -34878 -74030 -8416 16133 -3802 10613 52143 24374 44307
7912 44307 2556 -6266 43001 46843 12944 -9936 35558 33180 -19287 -35774 -3365 -3494 34031
7899 34031 40057 9599 -28742 -68317 -45742 -15924 -17345 -59360 -46674 -23602 -22013 2619
7887 2619 11687 -26802 4338 78180 48396 16128 8168 -537 -24496 872 23435 44897 111757
7874 111757 60231 26262 36400 22346 -1139 -8310 14014 -7008 -9519 30826 -16301 9216
7862 9216 36610 30707 -2367 -7769 -26498 -8380 8581 31083 51640 33712 69812 84980
7850 84980 106241 78958 -10218 -46856 -39990 -28742 -8001 45280 81083 94378 81771 92181
7838 92181 50243 1475 -15320 -67156 -70538 -16633 -35384 -45928 -16695 -9599 4913 27185
7826 27185 22857 78193 132378 65836 25310 55235 82102 108974 63914 57274 98150 77768
7814 77768 30106 9710 11168 29426 -31569 -22380 -15999 29517 89240 93867 62683 29677 2399
7801 2399 22303 -14405 -33692 34868 104870 60979 -19087 -68047 -18030 -30974 -33786 -65358
7789 -65358 -63408 -46281 25803 42104 9077 52802 10675 -64122 -84905 -79157 -88760 -57447
7777 -57447 -26432 -3997 -43596 -47996 -97820 -91493 -69988 -24447 -663 -43404 -39481 -35684 31515
7764 31515 49933 17614 13455 18225 -3359 -79012 -51794 13523 82419 49052 30272 31420
7752 31420 36279 38467 -18199 -53973 -47460 -28806 5270 26565 -14143 -10604 35970 24748 1706
7739 1706 -12104 9069 -10891 -39510 -54271 -81431 -116555 -159024 -139592 -116687 -74310 -69949
7727 -69949 -73143 -59028 -18307 46767 106580 124063 123578 101355 28370 6430 33931 51738
7715 51738 37098 -30518 -51596 6079 43024 46155 100148 168525 138372 90745 30775 10098
7703 10098 10316 26518 63730 -11083 -32719 29415 83983 56471 79806 116129 115167 121143 78072
7690 78072 -5939 -72900 -74648 -23885 -35034 -109902 -50859 -26741 -32217 -1430 -18088 -8095
7678 -8095 70820 73300 43083 23154 34305 55129 18446 -14578 -83624 -56199 -12635 -20775
7666 -20775 35426 41277 -14717 -64045 -71086 -63507 -30709 8059 22691 -27094 -22667 -14120 -38999
7653 -38999 -5988 11949 -23802 -42565 -70983 -48508 -4713 68839 41847 -19037 -56827 -107302
7641 -107302 -116124 -97757 -63463 -1621 32745 56957 44678 52447 42092 14132 3596 32859
7629 32859 80516 59927 7605 -55949 -11413 22543 -15171 7770 22728 -18346 -15553 -29367
7617 -29367 -22106 -20994 -1791 -20673 -59231 -51925 -24093 6555 10350 -4813 -44612 -41102 -13348
7604 -13348 654 -2071 -25730 -44712 -43713 -54014 -87321 -106687 -50567 -19193 -57906 -96131
7592 -96131 -115593 -108630 -112003 -81024 -43176 -22906 -17898 -19258 -4739 12819 4752 -30754 -26604
7579 -26604 -6833 3250 -16012 -6698 -9831 40052 99373 80932 -5705 -63288 -66403 -63066 -77639
7566 -77639 -81532 -94389 -72385 -27330 -28998 -45843 -60808 -54621 -30951 18042 20696 28732 11130
7553 11130 -35533 -74213 -57105 -93971 -81370 -19642 -2735 -94025 -74480 -13686 -27543 -65642
7541 -65642 -79443 -77248 -58842 -110315 -190479 -146453 -33574 9192 52314 55130 -872 32341
7529 32341 74880 61756 16669 20000 41309 85925 90024 84654 91881 67136 64781 27110 -30383
7516 -30383 -32552 5809 2066 11256 12954 43918 73573 97238 27706 -14247 -28405 -72935 -55016
7503 -55016 3064 40152 -7522 -60253 -11168 33182 38313 19943 -43820 -52740 -35708 21896
7491 21896 40883 -52693 -133269 -111010 -49435 -5838 35566 33794 50843 32122 13156 6209
7479 6209 43678 63013 76737 35801 -45613 -77831 -74749 -91719 -96060 -163078 -171259 -141529 -110124
7466 -110124 -36485 4955 -26296 -57360 -54353 -64171 -1329 38136 44941 21139 26815 39091
7454 39091 34463 27876 31882 68142 118180 92851 -7232 -86843 -42419 -23635 23471 33073
7442 33073 -25036 -109751 -96315 -32550 23116 18719 14866 22958 37467 12001 -9474 16065
7430 16065 31455 7691 -9365 -24673 -49630 -46744 16035 -18231 -28606 -8263 -43686 -64006
7418 -64006 -29477 -42842 -56608 -17930 -2827 1820 13623 51033 73275 43344 -33304 -37334
7406 -37334 19542 30197 33755 77569 60787 20148 61474 39708 -31639 -101070 -80129 -49021
7394 -49021 -78177 -67870 -53713 4653 96651 117256 116416 98136 30114 -3848 17896 63419
7382 63419 11668 -39379 -50580 -85136 -286 27794 50961 92255 97663 77978 100845 25401
7370 25401 35960 65479 26865 13449 22237 27091 7042 -32599 -87244 -9884 24859 20402
7358 20402 17302 -17266 -26089 -25810 -20440 -42026 -64937 -33298 2374 19029 27087 38534 28506
7345 28506 45451 55478 -11681 -60947 -49329 43547 65190 35303 39065 11837 5768 -9313
7333 -9313 -60856 -67565 -119533 -154686 -102211 -33743 -62488 -88010 -102228 -117326 -101380 -111529
7321 -111529 -138625 -113072 -69524 -47869 -42380 -60489 -107217 -83959 -67989 -34018 9001 -46938
7309 -46938 -33411 -45721 -56398 -1961 36020 9566 -4045 12295 8471 9614 21531 30051
7297 30051 12717 48681 105982 95239 -225 -26906 71862 81602 57985 78563 30351 11840
7285 11840 -22390 -70704 -20870 -54057 -39159 -31492 -15998 60752 60193 90560 59168 104200
7273 104200 95531 -13600 -45697 -24292 2390 -7730 -34061 -40735 -22084 -29302 45170 55801
7261 55801 52424 34254 54592 69052 59821 40590 33193 -32813 -14382 34630 64722 40247
7249 40247 10046 -34699 -25227 -25437 -69316 -95697 -145200 -143561 -131808 -87696 -73538 -40306 -20594
7236 -20594 -45714 -71315 -95827 -127312 -64639 -24858 5920 61819 56427 8425 74641 88052
7224 88052 67884 4769 -22876 -102924 -44675 24958 35081 66372 61426 6453 -37910 -66949
7212 -66949 -31296 8091 62963 30031 18712 46544 38737 -6561 -6237 -45172 -6402 17535
7200 17535 4493 2630 48486 63200 54062 76368 87211 76801 48069 50833 66298 125475
7188 125475 117044 87044 70974 -9133 -43274 -38698 -15558 42301 76289 19945 -39792 -25211
7176 -25211 15684 -11722 -21781 -24199 -10446 -14254 -92854 -75238 -22410 -34479 -51997 -71361
7164 -71361 -83791 -22119 -9166 -55793 -45465 -12753 28640 -1167 18873 71020 66017 67473
7152 67473 -8108 -100367 -96265 -114031 -29101 23755 -19028 -17932 32069 9320 51669 16888
7140 16888 -22764 -64909 -71276 -68106 -79425 -35529 -980 25016 9304 -5095 9417 -10696
7128 -10696 -60390 -107972 -139382 -126201 -141301 -136156 -137801 -107785 -62800 -7091 29426 -31955
7116 -31955 -43032 -17335 1568 -58809 -90721 -101109 -78434 -140537 -118914 -23928 65974 59667
7104 59667 15354 6588 -30487 -47496 8975 67680 76528 73490 65732 -11721 -75213 -72771 -17457
7091 -17457 -4946 39203 60941 16070 32166 18081 24344 60101 99323 134659 138017 104695
7079 104695 -1795 -35979 -20589 -47090 -3958 -31971 -638 48047 -42170 -52273 -7016
7068 -7016 -6944 -2006 28993 38172 -2975 -50738 -58312 -40375 -7460 29129 26484 54904 12763
7055 12763 44401 17569 -44547 18093 98690 105089 152207 144357 79431 70580 46418 -38874
7043 -38874 -60311 -46940 -57866 -68099 -45421 13828 70484 99274 92943 -8756 -106840 -71075
7031 -71075 12295 -44613 -81502 -78591 -110916 -59805 -11139 -17676 -18428 -1563 21888 6577 26006
7018 26006 13946 -2481 51020 60127 41160 73944 43562 -18806 -16886 14685 64728 54000
7006 54000 27209 15447 45053 -22826 -35739 -73251 -8880 56341 18324 -8589 -12295 -61402
6994 -61402 -49786 13707 99052 74937 32130 -10453 -53394 -38814 -17418 -21222 -29751 -73819
6982 -73819 -77987 -60514 -31607 -33581 -15522 -29780 -56601 -55102 29816 94417 74580 86672
6970 86672 79027 112630 136307 75250 36941 32789 84134 76307 33021 -14978 36000 39671 10134
6957 10134 32193 23696 -15104 12243 -8733 49041 109874 62990 10319 -1131 23923 21753
6945 21753 21229 -35521 -84791 -123858 -88351 -56334 -27358 -1399 20414 -7742 13264 -41844
6933 -41844 -126160 -94432 -15582 7425 -57726 -107914 -106739 -88347 -65032 4426 53314 27112
6921 27112 19400 9819 9645 13650 -12675 -9742 -77374 -166793 -94050 -64170 -12611 -41420 -53188
6908 -53188 -51762 -26908 -9183 80110 55635 52702 88426 61996 -6051 -25793 -33039 -18110
6896 -18110 34216 -4880 -52157 -23805 11599 -12508 -14936 -30958 -43673 -3874 30870 8286
6884 8286 -19852 -32489 -50122 -91933 -100644 -76374 13151 46172 46985 22024 -11271 -4277 -31111
6871 -31111 -48000 -43745 -45266 -15358 44753 74377 87830 121792 56970 -3995 11289 -47511
6859 -47511 -39678 7050 -14153 -15109 -11720 -17673 -1696 32128 46093 -52530 -69049 -63255 -12547
6846 -12547 -9451 4974 93544 143120 67950 17148 -5256 -4043 38292 58076 38374 -8288
6834 -8288 -66200 -66326 -87132 -124787 -110872 -82847 -73213 -107062 -134954 -119493 -79546 -88704 -101515
6821 -101515 -82166 -48753 -74368 -54438 -12215 50177 51355 -7005 5007 38580 4867 -71450
6809 -71450 -50421 -24307 -61402 -54482 -68099 -77496 -63285 -18912 -51394 -44593 8295 -49537
6797 -49537 -97659 -98114 -42793 18361 35647 38050 28009 -7186 -21961 -43806 -8679 10124
6785 10124 61680 12137 -29758 -66059 -68882 -37982 -47129 -50191 -52513 -73971 -38019 -20960 -45824
6772 -45824 -87553 -97089 -107663 -104489 -104258 -108145 -52940 13355 7125 -33843 -6389 21608 -38672
6759 -38672 -66637 -86050 -97579 -94707 -55665 -29283 -64988 -68077 -37557 -13063 -3667 -1897 28951
6746 28951 -9028 -44708 -80286 -85349 -68478 -73951 -74328 -139761 -59892 52626 24948 -55094
6734 -55094 -90134 -79884 -31551 -58698 -23036 -9820 25748 50 -3960 100369 49261 -19716
6722 -19716 -18550 -33283 -46403 10760 48613 86928 81063 29180 12557 2542 9857 23128
6710 23128 48470 35502 -26222 -97705 -106112 -90386 -30047 28886 56424 63493 77868 61208
6698 61208 16691 -62095 -38093 -36815 -15128 9128 15406 50799 23634 36010 16053 54565
6686 54565 59614 47596 61534 98219 79606 21469 -14309 34050 56182 39982 9354 -3509
6674 -3509 53738 97097 46260 24633 15966 24029 -7604 -30537 -93547 -101013 -97755 -30844 21646
6661 21646 15773 -17850 -29271 -37146 -57716 -8475 20460 47063 4322 -11626 -14578 -37032
6649 -37032 -19444 -30746 -26735 -24868 -77384 -93553 -57220 -41109 -100899 -66272 -26773 -29032
6637 -29032 -1562 -18504 -42272 -37231 -30020 -24839 18753 36697 38868 40343 67316 55210 69014
6624 69014 38059 38384 79901 129518 124017 155430 86758 70306 37780 38069 39658 -6227 -28210
6611 -28210 -33284 8604 30953 32947 -4581 10373 34786 9573 -31063 -42952 -72044 -90937
6599 -90937 -85742 -11047 11750 -25562 -52307 -88706 -66764 -105239 -113998 -130019 -92536 -112491
6587 -112491 -56892 11608 7137 19971 32230 -8461 -14111 44087 51042 7344 23183 64732
6575 64732 35128 -30558 -31479 -52404 -65149 -57711 -29950 26056 -10889 -16962 -1267 75919 115890
6562 115890 62842 10435 17240 46168 61680 47664 23876 -23980 -64324 -23823 -23878 16784
6550 16784 59212 38868 29809 17433 7659 71879 78291 78460 54186 34747 -10744 -22813 6135
6537 6135 19274 -29109 -33330 62 -34343 -128010 -113615 -81140 -10762 -25418 -55975 -51380
6525 -51380 -21424 -7271 -56984 -40248 -27437 -57 26149 75212 65065 8398 -13809 1809
6513 1809 25129 59466 97503 85515 67708 25534 -17726 -39446 -22605 -36901 -37447 -45569 -38131
6500 -38131 -65111 -4251 54106 44828 29175 3017 -78966 -77369 -91591 -139535 -104598 -37763
6488 -37763 51446 51544 -14621 -54096 -10526 48107 62298 12299 28783 63069 6729 19483
6476 19483 -33387 -78231 -97434 -79137 534 -22976 -65453 -55298 -44021 18386 75652 79917
6464 79917 104069 66511 52030 58528 2531 -74968 -57337 -13407 23436 -5019 -53824 -98218
6452 -98218 -23826 13075 34943 21250 -37614 -72122 -85457 -30000 -35864 -61932 -61394 -29016
6440 -29016 31301 55568 89788 37261 -4099 33439 130050 156839 111675 18159 -17685 -8833
6428 -8833 -19053 25544 -18525 -22089 8249 34725 41172 87669 73588 28020 57390 78865
6416 78865 57686 24399 32116 -2535 -11069 -519 1410 -69790 -104913 -108181 -50781 -20954 -38694
6403 -38694 -81627 -44327 -10965 -8344 -50428 -31759 -17870 -30047 -35269 -28492 -31151 -5034 -21097
6390 -21097 8529 -35160 -48669 54368 95998 51992 -3299 24707 34184 3171 -59086 325
6378 325 111843 118890 92691 80410 -5435 -128462 -99584 -40714 -66795 -68052 -75802 -11196
6366 -11196 33339 2152 -924 7457 46863 63877 -13279 -72854 -81522 -14236 13030 4952 52099
6353 52099 76987 47858 -28573 -35703 -17381 40565 141181 128134 39580 830 21152 59590
6341 59590 73673 112575 15396 -46346 14745 50054 824 -11408 -1097 19930 89272 81658
6329 81658 50790 12969 -16457 -44488 -36225 -20535 -9630 -19881 -62156 -67650 53508 67995
6317 67995 88397 106156 77002 52425 9988 -18857 -25640 42763 65914 32434 2193 -36159
6305 -36159 -88570 -56950 9848 51863 20007 -40580 -19542 11050 -11805 30770 16787 -1329
6293 -1329 27181 63050 27057 -6115 1314 -22356 -10126 -3427 -61372 -94663 -107252 -80037
6281 -80037 -31855 -61829 -77972 -70266 -107979 -50963 5985 -7741 27107 33113 71012 127231
6269 127231 43448 -23827 -42342 -108963 -84021 -61698 -44498 -55366 -28604 -23095 -10817 -3370
6257 -3370 -8617 43114 53140 33176 -2285 -8551 4902 7497 -46085 -100564 -102271 -53152 -25070
6244 -25070 -53156 -55155 -59041 -100158 -63645 -71284 -96033 -141474 -121373 -28196 43257 41825 54507
6231 54507 -508 -75421 -79426 -99156 -102008 -48083 -101502 -82087 -71397 -116639 -93552 -36028
6219 -36028 15559 21297 23725 -10693 -44165 54076 59554 80823 40309 14012 -21003 -19455 -928
6206 -928 9513 32126 2001 -77642 -58042 14754 82528 131398 85513 48283 18606 31106
6194 31106 63377 49970 5174 -58931 -59344 -32374 30832 23745 17471 37407 74554 77579 46453
6181 46453 -8288 -17786 -13829 -6729 4103 -6477 -3257 21682 8193 -22663 -27491 -25351 -5715
6168 -5715 -26014 -53019 -82506 -141489 -158394 -126807 -48962 -13658 -3689 46994 50964 39095
6156 39095 34536 58925 50075 48530 10552 -56860 -71208 -30296 22736 55427 62440 29866 69199
6143 69199 40256 -58164 -52227 -38211 9193 42434 92306 79909 26665 -41124 -49870 -58398
6131 -58398 -86436 -123006 -61920 -26543 45705 55224 3942 -18812 -56740 -76957 -78165 -58216
6119 -58216 -53536 -92066 -159577 -109178 -16957 -35962 -28297 -70378 -110872 -156759 -146796 -68269
6107 -68269 -26962 32197 -20090 -31765 7216 -3609 -20751 3768 10882 -7513 23637 45520
6095 45520 34789 -66 547 8477 -6518 -779 -129 28615 -4923 -56158 -76054 -52294 -39274
6082 -39274 -41178 -26486 -10115 -11391 -15084 8244 29393 -32569 -105507 -117415 -99851 -84455
6070 -84455 -32268 27376 6405 -10587 -13611 -52955 -98009 -118739 -102395 -53120 26282 85431
6058 85431 108023 52565 -21922 -1200 -24913 -28020 -61090 -23696 -14324 51322 70671 25796
6046 25796 23573 17951 35033 76564 35650 -11883 8697 -2705 -8263 52273 52048 -7242 -60571
6033 -60571 -54012 -32165 -93608 -46036 -22944 41480 7636 -53877 -25857 -18299 18229 31296
6021 31296 63213 66113 -11398 -26180 -3313 -7228 27955 23967 64650 72975 74053 51034 -31737
6008 -31737 -88920 -97465 -101243 -55791 -11578 26947 -8835 -44164 -31322 -35833 4508 13151 -8043
5995 -8043 -84251 -70854 -6972 -7534 -28450 -33913 -76526 -73531 -90900 -76215 -57436 -21935 18871
5982 18871 37182 14094 -40855 -45607 13795 35299 21407 63486 153958 138326 77766 56065
5970 56065 46046 44495 46684 35237 51369 86148 18009 -38500 36026 77692 82997 37120
5958 37120 6472 6033 11314 -65251 -81186 -43371 -23196 -46636 6452 -1642 -1591 64409 112327
5945 112327 91837 111721 106114 125621 62119 11214 1412 -3218 -12356 -14378 25575 47326 59447
5932 59447 76068 67366 68227 41701 13890 43462 64005 38546 -2385 28550 -342 -9463 47201
5919 47201 36849 13299 -35619 -110884 -83343 -25614 1218 -335 29322 -1811 -40522 -13639
5907 -13639 -5966 120 -2964 -3576 -5787 20339 12037 13138 -9877 -20468 -2845 -82288 -83907 -57791
5893 -57791 -42650 -66004 -53631 -31159 -24188 13556 9157 2610 9024 64627 97752 107633 71258
5880 71258 5208 -6880 27997 9786 -15273 -10351 -32554 -53229 -85320 -59301 -8857 -9674
5868 -9674 -33813 -27711 -53459 39913 79942 62774 65090 63303 35091 -36573 -50200 -49185 -20519
5855 -20519 12435 39838 34577 49160 28846 -40984 27893 56407 42448 81140 119545 70627
5843 70627 38359 74897 -6077 -29070 12065 17124 -22350 -51846 -44787 -87714 -102633 -101514
5831 -101514 -27631 33993 21660 -19999 5678 -21776 -32265 17063 11421 34383 -10089 1566
5819 1566 23060 13395 -42468 -34554 -85572 -106399 5 16401 -38558 -102223 -127198 -100652
5807 -100652 -87144 -14609 -4395 2914 -5663 70360 126905 101120 68820 70826 106929 77452
5795 77452 60084 52460 79803 101794 35003 40818 10772 27540 38374 86627 88925 29425
5783 29425 836 -38030 -112687 -81658 -65339 -24704 51936 42967 23328 -27023 -27530 28540
5771 28540 52793 80512 27629 -9618 -55626 1251 24208 -12606 -14866 -13319 -90593 -98970
5759 -98970 -132373 -89861 -56924 -840 -32860 -115031 -89237 -123619 -81970 -33719 -73822 -53480
5747 -53480 -36634 -77347 -60400 -89599 -130804 -93551 -73842 -60386 -27268 -1578 -32151 -54599
5735 -54599 -41072 -12824 -28053 -60856 -49228 -33430 -94636 -128092 -103394 -52004 -23520 30373
5723 30373 22240 -27647 -46433 -59265 -98544 -54077 -17256 25694 44901 75879 20815 -92000
5711 -92000 -79512 -39858 -37515 -10480 19337 60115 2412 1877 45146 1066 -33473 -28013 -5578
5698 -5578 -19240 -31580 -2609 19121 -5313 -26678 -69640 -102416 -71433 -28225 -22680 23054
5686 23054 5305 -11556 -335 -35291 -54167 -41118 -96749 -115221 -99178 -108635 -123040 -111480
5674 -111480 -81876 -73121 -104943 -96619 -67951 -36169 17328 33074 -11596 -7652 -19997 28554
5662 28554 77864 20831 -40533 -90331 -20986 919 -34607 -52253 -33124 20682 52601 461
5650 461 -45997 -20325 -59991 -126956 -194623 -178190 -152575 -122415 -67433 -17268 26064 47087
5638 47087 46625 61419 100315 117791 43955 -7749 -53338 -66831 -23593 9680 8205 -34252
5626 -34252 -44820 36400 80424 88630 42415 -12386 -66827 -34314 2269 -22728 42679 117688
5614 117688 47322 7076 13398 -10635 -5974 -12261 -39272 -57431 -82131 -27694 17988 -23510
5602 -23510 -36938 -33179 -61433 -41272 11402 -14798 -31333 -6568 -8855 -11246 -53525 -92311
5590 -92311 -39553 -60671 -115584 -70079 45696 59391 36411 28042 -14439 -95254 -78633 17324
5578 17324 26791 -3365 59921 71120 67100 98658 107546 101411 61925 19200 -17389 23601 92195
5565 92195 52603 30180 6527 -12327 -55620 -113929 -105678 -1608 42200 -48158 -35842 -35564
5553 -35564 -40861 -42926 12257 -5668 23413 16243 -56559 -33142 -13933 -61134 -59731 -3416 -29199
5540 -29199 -24129 -17186 35997 13949 11050 30393 56591 6234 -12087 -20018 -50781 -16632 -25848
5527 -25848 -21939 10978 -11826 -33629 21939 -37459 -67032 -46410 11725 40115 9469 -15199
5515 -15199 -37175 -50393 -61342 -56990 -8534 12993 -29501 -113594 -153616 -153806 -108526 -67300
5503 -67300 -35755 -1427 29502 70073 68936 30835 23022 50425 84426 66770 54546 27846
5491 27846 23175 51539 94541 7264 -16999 -8125 19617 7558 -39420 -133895 -116710 -67490
5479 -67490 -25643 -9888 706 17827 -22520 -52549 17395 89076 16050 -71606 -44358 -18285
5467 -18285 -58230 -127773 -91883 1799 14281 10392 16097 -1178 -30096 -441 28626 57465
5455 57465 89987 72900 -3408 581 78765 95526 78341 57608 23293 -13227 26281 34489
5443 34489 -10859 -52032 -41313 -16642 29797 4773 -63716 6301 33323 -52291 -106640 -122783
5431 -122783 -144211 -80802 -64908 -71980 -52186 -34240 -24133 -52473 -74637 -15129 -25847 15608
5419 15608 18015 -52 51566 52870 43964 11234 -14865 -11811 -14192 -83621 -55102 -19085 -82747
5406 -82747 -54507 28552 11867 -26971 -82680 -115760 -95004 -43624 -17258 43826 106117 115929
5394 115929 62998 54524 72131 7650 -30413 -7322 17565 -4770 -45916 -26455 -2585 -29323
5382 -29323 -40797 7591 25456 55188 44980 9825 1541 80460 82830 28753 10871 29472
5370 29472 40405 29194 17885 -28985 -28938 11513 40741 54053 55911 114311 137697 78772 12200
5357 12200 7181 -35776 -63866 -39407 12648 53358 142097 115913 31786 -28089 -36695 -43062
5345 -43062 6632 68616 44244 -13864 40567 14723 -82692 -29017 4829 -9645 -50623 -20331
5333 -20331 -29102 -78444 -42632 -84383 -80542 -46829 -31537 -59658 -63274 -111511 -27971 50395
5321 50395 64772 28949 -6958 22560 -5987 -30575 -49106 10462 44682 35857 26634 -18454
5309 -18454 -44834 -27457 -29874 -87872 -43562 12561 50483 87305 100474 82488 30494 -6999
5297 -6999 -31185 2672 -12755 -17788 7088 5493 52183 73827 53272 -18048 -93033 -95917 -43053
5284 -43053 -74464 -151237 -169859 -43509 37705 -33256 -50070 -37633 -29939 -21340 -74365 -104167
5272 -104167 -79545 -62463 -24799 -74924 -101751 -56764 -25992 -64094 -56735 -1766 -26856 -54353
5260 -54353 -44164 19072 -9177 -64540 -79895 -97479 -98133 -68842 -36471 -7453 10267 -11726
5248 -11726 12459 -29204 -31288 -17476 -47517 -68613 -46306 -43437 -53281 -84900 -78482 -55577 -86982
5235 -86982 -92863 -36941 19769 2044 38592 117892 70102 17018 159 -27903 26115 90865
5223 90865 95217 22505 28168 39692 65945 5155 -31766 16520 15683 19568 7645 -4889 -6020
5210 -6020 -24349 -36321 7997 17074 1699 8280 -16171 -22347 -21143 29256 37011 -3497 -41687
5197 -41687 -75407 -123775 -61862 32177 1602 -38424 -49207 -81560 -37796 -458 49222 55809
5185 55809 -9635 5911 49457 29542 29546 -5708 -51662 -39454 -37767 6447 40210 43795 113989
5172 113989 158497 122798 80716 -4013 9276 34109 11003 -7513 30444 20943 -50131 -55114
5160 -55114 20707 7593 -72945 -164284 -151341 -50293 13135 7005 10436 11726 6457 -48318
5148 -48318 -99911 -83918 -45621 13928 64150 61887 27532 55295 24054 -29660 6894 31799
5136 31799 20524 -47648 -31961 -25040 -38097 -7932 36160 93846 67853 80974 113361 137787
5124 137787 119722 66948 58973 65930 15658 -93287 -102228 -90747 -71233 -103826 -77951 -66518
5112 -66518 -61148 -31328 -23276 30281 14310 -25599 1082 -59054 -105644 -80267 -53541 -54704
5100 -54704 -38163 -16057 -20281 -56168 -90510 -83226 16581 59201 43295 -5287 -31819 -39536
5088 -39536 39674 33807 19101 11068 -10037 -29459 -65418 -40356 -75802 -97511 -21411 27364
5076 27364 84442 88199 105428 47657 57600 36513 -41685 -26146 -4943 -39722 -31122 2664
5064 2664 -17033 -29931 -34959 -85994 -70727 -51524 -91278 -83800 -37471 48278 8379 -54052
5052 -54052 -79237 -66334 -37372 -12521 -48805 -6072 -20115 -7096 1403 -13366 -7787 -37509
5040 -37509 -42616 -18615 19945 2902 -16638 -66824 -56062 -21708 -5489 -3792 -27415 -11687
5028 -11687 -35487 -33598 -1162 43394 82685 37646 83504 91398 56306 50063 68370 87387
5016 87387 103082 118367 74066 54518 55421 30171 35972 -23115 -100926 -115781 -44927 1474
5004 1474 -20458 -24800 8448 2017 -63706 -79349 -51378 -12154 -5357 -31355 -50782 -51491 -34390
4991 -34390 -57727 -98628 -133979 -112493 -66421 -7125 15609 45133 60056 21464 -21801 -68372
4979 -68372 -23919 29615 33273 -2488 35751 61959 30708 32759 11365 -8759 29635 50031
4967 50031 79527 146505 144993 119292 50252 49589 68668 58394 59591 -11620 -76326 -42736 -22893
4954 -22893 18295 18402 -19337 -34348 18643 22160 59 -47609 -31248 -6880 18996 53423
4942 53423 25298 -642 62001 63321 46928 45057 91783 81384 80885 -45334 -39341 31076 43911
4929 43911 13270 -3235 32889 37815 -7539 -37963 -67361 -52298 -60653 -28151 -90772 -107659
4917 -107659 -44670 -6136 68232 19765 46636 67307 37237 48842 78154 33763 -42572 -97904
4905 -97904 -53013 25906 42234 32053 -22617 -57627 -66726 -126090 -120244 -127172 -97556 -9379
4893 -9379 42042 -17395 -44136 -32244 -70266 -80162 7665 66372 30534 5587 28880 -21604
4881 -21604 -72565 -30782 29265 44998 28088 -7762 -17001 -45973 -34538 -50801 -86813 -78603
4869 -78603 -64644 -33946 14924 24843 85430 65790 -16748 -108044 -79499 -84357 -64140 -41432
4857 -41432 -340 17682 56195 66597 52728 48730 28302 -702 -19322 -39998 -37481 -24829
4845 -24829 -7876 -29974 -46699 -37817 -28877 -14000 -12059 -32758 -59875 -47457 -11620 -3833 11189
4832 11189 -17627 -34115 -43504 12927 94006 87030 133694 154224 94288 23697 59050 47010
4820 47010 30682 15984 -44561 -51537 -29130 -48173 -35544 -76734 -40590 -6684 8147 14396
4808 14396 14770 14966 33173 9039 -20196 10383 34268 69355 112270 70436 14843 -53329 -82299
4795 -82299 -22453 -2879 11112 14020 44355 55289 50058 78226 48124 46110 41372 -415 -39822
4782 -39822 -37676 -56180 -90374 -39378 2657 -21897 -4310 24924 -12108 -36443 -49930 -60889
4770 -60889 -28183 5729 2353 20405 9598 -55207 -90430 -60148 -17309 29652 -5850 -47980
4758 -47980 -50503 -50296 13533 41220 19293 -34858 -49584 -50954 -26483 34598 33513 52474 55754
4745 55754 36540 40409 55384 10108 -14192 68407 33652 -49084 -20097 -41896 -36692 73390
4733 73390 66309 16949 22962 48450 11816 -26305 -41384 -17164 30402 37915 13299 8740 -8923
4720 -8923 72536 55615 35623 50282 96600 73615 10303 8963 -47413 -72572 -34142 -32398
4708 -32398 -47525 -88162 -84157 -90855 -132996 -102768 -93694 -109143 -87873 12983 77488 59714
4696 59714 49774 42595 10849 -13236 -69369 -63364 -72214 -1188 10416 22287 -32418 -80096 -64787
4683 -64787 -46379 -94195 -58689 -38189 10567 43001 -40990 -72435 -31421 -20290 -67696 -85241
4671 -85241 -81223 -82075 -85023 -92837 -111861 -32662 -3158 -4562 -947 4335 35385 83530 76314 9481
4657 9481 -32625 -18649 -11526 19852 45381 24129 -12039 -42286 -95344 -76133 -126133 -129746
4645 -129746 -49198 -20743 -24585 -12653 -34960 -80392 -96350 -72942 -88963 -79013 17090 67607
4633 67607 53796 94062 134208 106217 18664 -2731 -9407 -25377 -16889 22902 5744 19864
4621 19864 85017 123310 109072 106130 29904 2530 -39820 -80575 -51765 -40847 -17551 5059
4609 5059 -22950 -37375 -67569 -66478 -46297 -90650 -118692 -34935 -44453 -65092 -82005 -75797 -32555
4596 -32555 -17275 38118 44128 -15342 14905 40130 -4362 9911 61917 57182 10076 -29776
4584 -29776 -12956 -22893 -82668 -31018 64479 62738 10796 -5885 233 -24520 47219 12502
4572 12502 2291 -21705 -27516 18508 -19610 -12067 -10560 -38373 -69334 -94188 -96328 -62828 -40934
4559 -40934 68127 111368 79488 83069 58173 74287 128685 137125 95576 52920 57964 69459
4547 69459 78797 22711 19133 38052 59497 50566 72545 19859 -5992 3587 -1358 -8049 15479
4534 15479 8370 4423 -4407 -56188 -62093 -36600 -50018 -91097 -76738 -20114 -5488 -4079 -38760
4521 -38760 -40218 -1549 -19142 -39196 -64994 -26727 11914 16960 -30982 -32773 -13525 -19369 -846
4508 -846 44272 75795 110866 85151 49675 19307 65885 78149 34545 -3118 -14304 -1730
4496 -1730 37735 49590 54468 34889 -40492 -57343 -11432 20350 9848 27994 -48679 -42657
4484 -42657 -8116 -7560 -40459 -7249 20544 11811 -1196 -18361 -66330 -45333 -88817 -127963
4472 -127963 -162263 -139774 -43874 -48345 -73142 -77721 -88231 -113788 -54948 -4167 39066 89311
4460 89311 105193 90724 98429 105225 111074 125664 109610 55109 8813 -589 -33383 -27379 6000
4447 6000 26020 34145 20185 11715 19707 -54441 -84264 -32683 -41366 -98659 -39453 17414 10114
4434 10114 16973 -9456 -36717 -44975 -24483 -2407 -53583 -70183 -76913 -27616 -46038 -49485 -87258
4421 -87258 -133710 -99463 -72471 -28913 -27856 -26423 -10335 36303 38197 75548 60253 14141
4409 14141 18130 -29382 -64038 -77734 -105318 -129088 -99339 -65005 -24852 -4927 -37437 -79365
4397 -79365 -70102 -80345 -71395 -103428 -85870 -69481 -46613 30386 49544 66117 61899 51169
4385 51169 56374 3135 -34088 20427 505 -17992 -11124 -6101 23916 72516 44890 884
4373 884 -43127 1707 35964 16718 20464 100433 101917 20947 -73701 -58612 -70948 -64678 -80347
4360 -80347 -72791 -55095 -24502 -10904 -168 -1030 7487 10467 29284 10921 6529 63413 14674
4347 14674 -40811 -39147 -78490 -72219 11967 13923 34997 39300 8524 26120 25632 1380 -4213
4334 -4213 59910 62285 48523 34311 53077 -25880 -66122 -42674 15624 107530 173244 164302
4322 164302 132997 113605 133639 54343 30084 75630 105879 90725 41444 -40277 -50089 -72210
4310 -72210 -74293 -48650 -48656 1304 44068 47398 19054 29871 113107 65681 -1161 9647 -15927
4297 -15927 8610 22069 434 -22966 -20223 -49591 -52391 -66996 -66069 -44522 -38701 -50429 -14214
4284 -14214 28898 -53616 -94634 -60162 -68889 -78712 -38677 -10516 12650 18307 -22891 -64175
4272 -64175 -47944 -68925 -31763 6602 -33616 10174 9062 -43735 -41200 -46318 -15379 -20025 -6939
4259 -6939 35733 -15453 -16455 878 -42033 -59388 -31973 -47511 -51629 -58375 -26201 -7974 -35532
4246 -35532 -59706 -60122 -22243 -38220 -15685 -41380 -72823 -44219 -48537 31640 36255 -16007 1036
4233 1036 -28684 -20629 13802 2449 8548 50238 21920 4265 -65545 -73194 -23971 -39481 -57716
4220 -57716 -89215 -114220 -54546 65756 71627 49298 -9174 -19294 -25219 -15923 19878 -13591
4208 -13591 -32877 -39774 2588 -59759 -66108 -27880 310 -64801 -57164 -13781 29428 33897 30341
4195 30341 39359 46613 62981 95114 89132 33157 -62515 -28134 -1233 28615 28275 3542 14818
4182 14818 -29924 -85049 -89695 -26454 11841 17702 39911 68935 50613 17195 -36227 -19781
4170 -19781 -51089 -33106 57429 86129 110116 59952 24550 -37048 -18085 -42301 -70234 -47932
4158 -47932 38564 105953 54767 8291 56101 -17229 -33424 -22418 -13395 -25548 -59536 -11450
4146 -11450 25684 -6097 -11893 -36853 -53932 -37837 -17462 -3430 -38036 -65349 -59266 -59481 -53584
4133 -53584 -41860 -18275 36571 20975 -58434 -93417 -76143 -70614 -92989 -45263 -1906 -4350
4121 -4350 -43449 -50509 -23490 4636 -6227 -10240 22980 43302 11423 -45028 -102722 -75793
4109 -75793 -41487 -24658 -19573 -4034 6787 3902 21185 14434 -684 -36068 -22131 -630
4097 -630 43877 59885 53535 19495 -5554 -36590 -37982 -16930 28872 27337 18324 1129 23365
4084 23365 73803 41256 1631 23891 11155 -46572 24479 41852 22077 63122 71950 -5555
4072 -5555 39113 40690 -1410 -310 -98186 -115550 -29599 57359 32864 30284 6967 -5373 -10309
4059 -10309 -10459 -4172 27899 6900 47833 53690 83559 91941 15848 13920 29564 82558 56670
4046 56670 32979 72661 101891 64300 21411 2794 -50515 -48943 -15817 -39096 -43596 18259
4034 18259 56005 51816 30691 42843 -4910 -1542 -18474 -43377 -522 -18129 -63637 -90599
4022 -90599 -63314 -30193 -33712 -48761 -152940 -203461 -122925 -80857 -71104 -7035 8164 31548
4010 31548 56139 49364 82004 95116 50336 17927 -18404 -80573 -80795 -56912 -1314 58043
3998 58043 48120 37096 17519 6840 37824 15938 -5130 -21025 31804 24680 61867 135054
3986 135054 141166 94756 47661 21636 21435 5194 -6365 -24622 -13877 49486 148497 148830 116153
3973 116153 64779 19554 18193 -12029 -59926 -69097 -60111 -100416 -122827 -111153 -112909 -50895
3961 -50895 -33727 -38810 -32287 -30563 31963 24954 -56122 -28668 -18745 -15706 -16398 2582 -56207
3948 -56207 -29286 -2377 1815 25887 55143 12547 -43306 -45834 -73087 -106055 -39135 -5463
3936 -5463 10048 -12050 -21831 -52193 -36060 -13385 -38818 -41773 -27516 -35140 -40907 -63604 -79995
3923 -79995 -67660 -38554 -30985 -23152 21934 24722 23937 34085 -5898 -48547 -11739 45686 60531
3910 60531 57820 -9041 -37405 -72821 -78431 -24127 13647 -33524 -96995 -93089 -69038 -35499
3898 -35499 -1430 -42045 -87232 -79027 -96128 -81801 -70498 -33647 50236 43835 -12318 -69320
3886 -69320 -124532 -170104 -178536 -93302 11050 16094 5345 20162 48642 783 -126710 -116105
3874 -116105 -44520 -14449 -33719 -41224 -11305 -7917 19267 47068 35007 2565 -33714 -2958
3862 -2958 -23365 -45926 -47305 -31893 23105 30721 -23675 -26339 44358 74853 16184 -36351 -22175
3849 -22175 -31041 -29333 35537 13190 -44560 -16901 36581 42637 -44039 -37521 -11673 63668 82303
3836 82303 64607 93507 48459 -31335 -83387 -95172 -3764 73986 73561 88466 40126 -23242
3824 -23242 -77664 -92642 -51590 -43922 -12333 6415 -6612 21590 79086 41261 -15748 -34430
3812 -34430 15530 12112 -17862 -37885 -109246 -17914 22577 9447 36903 85263 35828 -36498
3800 -36498 -35178 7867 38587 -5311 -52500 -92735 -38744 18673 80008 96885 66864 -14201
3788 -14201 -64939 -6537 -39363 -70263 -42651 -4984 11811 42071 113074 61314 3840 -21178
3776 -21178 -38541 25949 84658 27245 -29220 -53032 15478 10013 406 3620 -63076 -124904
3764 -124904 -28447 -65765 -65949 -4758 942 -50588 -39630 -6214 19601 -4975 4030 -710 -9873
3751 -9873 -30578 29622 99421 112785 70590 54636 91260 110645 82639 65445 -13405 -17150
3739 -17150 -28519 -41112 58892 30769 4685 -10540 -29286 -54286 -26780 -43562 -65721 -46007
3727 -46007 -98265 -85468 -51061 -39461 -44340 -4796 5978 5704 -35834 -43831 -49242 -82468 -91575
3714 -91575 -88092 -35532 -25431 -58103 -119471 -119999 -73599 -73974 -59500 -30992 -11008 -35689 -35271
3701 -35271 -59251 -23069 10390 44201 -16466 -105139 -174193 -148330 -97484 -36045 42764 44507
3689 44507 30221 -41 -10352 -585 55980 22034 30804 -13688 -26669 37925 54513 -11136
3677 -11136 -5951 7191 -8332 -10887 16438 44412 53920 26789 19515 28841 34375 -22020 -55385
3664 -55385 -50894 3685 52671 -6881 -20853 -21805 -3611 22074 58204 24522 -11038 -52981
3652 -52981 -29618 -33090 18421 62055 42439 2735 8221 17446 12556 25333 22113 1514 41009
3639 41009 79494 96942 50228 60226 87571 88874 11884 -65937 -64936 -1362 -62715 -68002 -35808
3626 -35808 11015 -7202 32569 97349 33964 -7160 2950 4277 1989 32484 55260 58214
3614 58214 -463 4283 14812 -29616 -35018 37297 44622 13358 17083 9706 -16845 14037 35150
3601 35150 68257 52768 3846 -66972 -67757 -31384 5473 44034 81042 50871 2594 -19042
3589 -19042 -11669 34319 47087 10431 28890 -12189 -69223 -129693 -135760 -101716 -72494 -13931
3577 -13931 70372 40150 -31454 -10548 -47900 -33802 -2993 24325 -7799 6375 -9394 19944
3565 19944 44656 63085 59215 24875 -51063 -77844 -88020 -56296 -24829 -20441 -39340 -7245
3553 -7245 5443 -7758 -58331 -38568 27836 15035 13641 78067 72758 35330 -21326 -38797
3541 -38797 -34820 -93546 -40059 -10180 9523 -38211 -62160 -77982 -16326 102164 144990 51929
3529 51929 -38847 -52215 35047 71136 60123 38210 62964 43070 -1418 -39406 17523 -1153
3517 -1153 -33370 -39473 -76841 -77964 -25821 17607 123471 106976 85223 79146 38296 37474 13563
3504 13563 1970 -23701 -51748 -144116 -63879 28744 45841 35535 -39379 -55015 -33433 -9712
3492 -9712 -39353 -66575 -31577 65525 72223 52864 48834 -22789 -44002 -47176 -48084 -16866 -27095
3479 -27095 -47454 -17541 -8735 4951 -27844 -65433 29103 84553 65833 69934 119490 82762
3467 82762 -9419 -42721 -13535 -22022 -31890 -15809 -28465 -63576 -41046 -18388 70558 52030
3455 52030 20831 -6061 -20024 -9078 23876 49070 34014 49876 44418 36501 -25982 -34983
3443 -34983 1084 3231 -2503 33988 41474 -19928 -41702 -52194 -89000 -78353 -79972 -40950 -11382
3430 -11382 -9134 -15152 -4742 24586 56788 49677 9527 33813 5833 3058 30188 47263 20593
3417 20593 15279 59515 102887 88254 15096 26275 9705 36104 91913 80709 2405 -12095
3405 -12095 23984 58864 85184 -8465 -22200 59031 100598 12250 -26849 -8148 29490 1805
3393 1805 -27298 -8633 10099 21753 56321 2785 -25748 -40057 -35777 23288 38249 1067
3381 1067 -37681 -47156 -36841 5528 -4006 -26958 -7092 9540 17181 82579 123285 94112 17456
3368 17456 -19990 -34256 -32268 -28212 27169 14082 -73567 -40507 40218 113871 153231 70756
3356 70756 4675 -29669 -33248 -20155 -10829 -24011 -32563 -13039 29062 25444 70427 108236 143041
3343 143041 124244 29785 -3151 28751 -14457 -13889 28196 74746 62426 76030 130772 76899
3331 76899 62743 55057 78097 171761 129789 110202 75936 19185 -12354 1027 -42620 -9118
3319 -9118 4495 -7869 36168 37484 -38220 -60484 -36502 -38684 -58025 -84211 -38010 15441
3307 15441 41184 13255 -28007 -32835 -80002 -75488 -36814 39443 91853 48855 23385 16626
3295 16626 -57303 -98993 -4007 24848 11104 25935 -24624 -18567 964 -16019 -122 -8361
3283 -8361 -54773 -65755 25415 54474 78924 51082 45659 35982 -1040 -4698 2855 40363 34176
3270 34176 21787 46542 51409 46767 34070 58024 70562 95704 83561 93722 131727 71976
3258 71976 -3814 -41576 -111879 -83668 -50330 -15878 5050 -15210 1706 -37983 -81835 -94322
3246 -94322 -78677 89 43992 78392 85636 50276 25016 22549 63030 51860 64091 113657
3234 113657 124356 17761 -63834 -54343 2937 -18159 -40198 -347 21125 19265 38489 95799
3222 95799 99634 81911 29584 -5469 -13365 -7270 32127 71248 101123 138264 95656 87979 71446
3209 71446 47255 -15428 -28251 -44040 -31683 279 54052 64624 10943 -21307 -68807 -146829
3197 -146829 -114375 -4753 47261 1727 -1321 38956 56572 35670 11004 -1668 18394 9002
3185 9002 25582 27299 7048 -27384 -37403 -16477 -14726 -31377 -27598 40514 77408 68580 75261
3172 75261 61067 37435 10144 -38733 -39732 18275 7433 16581 699 -23694 -14005 382 45781
3159 45781 65142 79496 41257 -42294 -55377 -29862 -45794 -17674 40566 78472 71275 -25013
3147 -25013 -10800 50072 42146 -20170 -16890 -2313 63149 86342 117008 66932 58330 5867
3135 5867 -39137 -46501 -86956 -122823 -64177 13076 -991 -40756 11422 56594 66116 18275
3123 18275 38814 109101 90375 48392 13868 43644 68450 91472 58870 13025 -2724 -1882
3111 -1882 39109 21093 3186 283 -19374 16324 55026 62419 51784 49225 56034 47156 -15479
3098 -15479 -59494 -83666 -34449 -68929 -99536 -75473 -27664 -45091 -53221 -1113 23212 -41989
3086 -41989 -91881 -36809 6481 15834 -3103 -22986 4305 24210 9851 -13983 16021 33031
3074 33031 10995 29039 -5102 -38610 -38504 -32027 -43278 -50676 -48307 -29111 -76298 -59665 12583
3061 12583 38496 71145 65569 28667 12814 -2940 -2555 9155 54657 79161 28137 -23257
3049 -23257 31955 52855 25521 22464 32931 21357 -9886 -59888 -24132 -35897 -29237 -1329
3037 -1329 32588 7549 87905 62876 -27335 -92858 -119041 -62266 -17776 31016 -154 -51484
3025 -51484 -30974 4219 21719 13067 26232 21499 3493 38446 114378 10288 -7314 11776
3013 11776 -27042 -17072 11363 56629 68852 106435 84812 4167 -47875 -18242 8684 2191
3001 2191 -72108 -53091 -30746 -51017 -12307 23275 -17755 -15225 -55926 -82286 -19242 1164
2989 1164 -13716 -63916 -76306 -66430 -14718 25225 -10997 -48582 -90364 -44384 -33254 -6015
2977 -6015 -9946 -20457 -16867 -36007 -47573 -54021 -7265 -18619 -70313 -84074 -62443 -67541 -47651
2964 -47651 -16876 -1556 8269 67505 49466 -31608 -27691 33414 35048 -33357 -41130 -2872 -26026
2951 -26026 7435 -26756 -71263 -72703 -51801 -31678 59144 68821 -6306 20546 35203 38536
2939 38536 4196 16752 68899 66837 39779 80407 88434 60286 44686 70937 80025 43224
2927 43224 22584 -10589 -9962 31581 -33424 -34842 -44872 -142793 -79191 24064 33043 -42420
2915 -42420 -13026 -34703 -48013 -8134 42425 -40177 -97447 -85029 -48602 -5160 15495 55773
2903 55773 -11893 -18890 3813 -30508 -23656 30362 75382 62146 -1132 14867 329 -59882
2891 -59882 -46140 49597 111956 96946 78241 84254 99642 47409 -23829 -100137 -35096 32240
2879 32240 47046 -42825 -71463 -22774 -41956 -33821 8959 2517 18671 33202 44672 61186
2867 61186 103989 63025 46945 51946 -604 981 -54870 -87988 -84686 -70561 11598 1044
2855 1044 -12939 -39678 -35310 -30017 -84946 -13972 -8553 -20709 -13929 -22754 -12737 30168 9423
2842 9423 39449 48144 40751 6067 -29971 -55308 -77421 -92248 -125903 -183636 -171564 -136774
2830 -136774 -112003 -89216 -67159 -80225 -9240 4531 -9991 34222 12778 -63295 -98861 -54500
2818 -54500 -67089 -15203 -1905 -51968 -90789 -48496 15684 39670 113640 139169 78542 78627
2806 78627 50271 -26822 -57087 -71106 -87517 -63146 -29425 12860 11584 -30064 14694 62293
2794 62293 9750 -10518 -5915 -4786 -6822 -26058 -41742 -26337 -55197 -34581 -21404 -30130 -35127
2781 -35127 -74178 -40701 -46983 17558 63350 125570 149703 119584 109974 77899 34260 -46252
2769 -46252 -39119 19294 37394 48512 79563 10709 -83355 -84031 -102721 -49743 -2407 1256 30895
2756 30895 -21537 -18839 11427 -1052 -8801 -39408 -45344 14622 9368 -30202 -46048 -66949 -8895
2743 -8895 5304 -14232 -10541 4808 -2927 -15472 4401 77340 60871 86756 131765 77286
2731 77286 38910 43107 48328 54851 92842 99416 61420 21959 31605 52414 31748 -15414 67341
2718 67341 62592 -2550 5997 27806 39406 27092 71630 50977 57168 37539 37076 34879 30605
2705 30605 6186 73096 68655 55313 108039 119686 58947 26652 -17875 11543 82228 106575
2693 106575 74452 37340 -54689 -49031 32310 100866 99740 16894 -15634 -38438 -19691 -52905
2681 -52905 -27294 4857 -11694 9912 48664 37812 79147 99548 94227 64086 3987 32223
2669 32223 40024 66143 87829 53197 29658 64153 91619 114902 105684 29777 31539 39218 36916
2656 36916 25479 4179 9706 -16974 -45112 19423 45361 43220 47494 76819 -5026 -78053
2644 -78053 -35680 5460 19660 20005 -14186 -16268 7651 65321 124407 68874 56599 74152
2632 74152 14335 -10215 14391 -984 -62425 -44915 -23652 -13653 -2876 37313 53557 85977
2620 85977 109836 68613 64434 103398 78363 63536 42920 16423 -24582 39966 60818 83962
2608 83962 109573 82063 -14497 -49378 20491 68857 76532 44325 26228 5627 -26424 -23337
2596 -23337 43379 89683 93978 21583 -18498 -21583 -61031 -131638 -77764 -23591 -59009 -92254
2584 -92254 -84331 -52565 -40515 -60220 8027 58062 15682 -26232 -38913 -31390 -17126 50736
2572 50736 53064 77708 92321 80660 9586 -18610 -35600 -10337 -46606 -42401 -3062 27032
2560 27032 -10513 -20468 -2303 46497 56105 20692 51175 6530 5088 -4576 -43461 -109202 -107184
2547 -107184 -33601 34348 19282 16459 13544 26314 53291 40651 -6475 77541 82613 35643
2535 35643 -9762 -3500 -22028 -30676 -33126 -40145 -13724 -4612 -53251 -61325 -16049 18545 21113
2522 21113 -38411 -30216 3513 31396 53672 60791 32669 -3890 33103 93947 109406 118659
2510 118659 111090 72077 -3591 -39335 -34613 -12670 -4326 -31063 -48750 -46263 -30386 4472
2498 4472 39568 30585 50875 44881 24121 -27845 -30864 19789 -12401 -18256 16255 35213 1923
2485 1923 -13841 -18494 -78343 -107770 -98055 -121020 -109384 -102565 -73034 5134 38923 73495 70862
2472 70862 37069 -2986 -315 255 5204 23333 37361 -27847 -3378 5859 3395 29967 53548
2459 53548 -76 -18757 -977 -24529 -95094 -66573 -40443 -47890 -73724 -8617 50296 44055
2447 44055 38824 17190 -26054 -45290 -51204 33662 59963 -4863 -74717 -91389 -82359 -103384
2435 -103384 -105682 -101549 -64127 -136276 -158537 -115280 -29366 -11457 3671 8323 27740 -40460
2423 -40460 -43340 -42310 -106157 -68649 -15986 -14694 -54401 -22123 -7062 -7273 -36936 -25246 -37371
2410 -37371 -17468 21496 50494 23428 -99018 -127562 -87987 -31694 -3759 28 -33080 -54007
2398 -54007 -79400 -79867 -11819 30306 -2903 -45510 -70764 -81346 -30960 -604 56728 110556
2386 110556 68651 27175 55921 47222 8155 -52895 -79857 -36128 -19855 -23523 -36433 -34164
2374 -34164 -7798 26517 32544 -73684 -138545 -93431 -15446 -19651 -10675 -45720 -38750 -39663 -28502
2361 -28502 -30100 -5075 14578 7741 -18543 6383 20854 -232 9863 54567 58364 55291 14345
2348 14345 8472 15022 874 12937 -36857 -57585 -36803 -8355 -24897 -52456 -56863 -19077
2336 -19077 -25535 -50151 -46016 20188 52259 33753 -17455 -31261 5071 -48840 -75463 -91666
2324 -91666 -46152 3431 1882 -59037 -85703 -91750 -66567 -58479 -11167 28572 15676 -6900
2312 -6900 58362 85935 32192 15457 7655 -13322 -36073 -49131 -30664 10390 -31581 -83599
2300 -83599 -33441 -38215 -66530 -72735 -60541 6003 36514 57877 20920 -28807 -29705 9333 -19074
2287 -19074 -3034 16766 -29055 -38160 18641 4061 51521 -13590 -103955 -89054 32431 33020
2275 33020 -56315 -65732 -105262 -86650 -28192 -46989 -14032 -51378 -100708 -126224 -123256 -41398
2263 -41398 -1815 40072 68265 47274 -17195 -80843 -32238 -15758 34201 66506 64179 -308
2251 -308 -6262 15511 -8246 -28355 -11721 22692 -6924 -26542 -5575 -27577 -18525 32391 47674
2238 47674 73819 196880 178268 103348 79999 89786 59804 36263 13140 -37240 42907 81731
2226 81731 17666 -7560 67038 98628 106996 91992 54891 71648 70274 60944 68922 61463 61810
2213 61810 87517 87817 51738 23316 -14143 -19008 5265 34936 47634 88487 158535 143720
2201 143720 119435 80653 71599 9528 -28090 -153 57972 36605 -9378 -19537 50604 63847
2189 63847 37486 57443 107071 85599 28157 48056 73875 67297 74240 57127 -988 -50353
2177 -50353 -68203 -60856 -37517 -64977 -90349 -34611 33199 43210 7576 -16392 -18445 -61763
2165 -61763 -106247 -72828 -19185 2207 -1667 32273 7424 66572 141165 113116 115847 102009
2153 102009 78048 6379 -43217 -52031 17455 121941 95900 69522 55719 15804 -7640 624
2141 624 15800 -17237 -15172 2160 -23959 -67226 -104663 -31561 23177 -42202 -49780 5916 15978
2128 15978 -21272 -25688 -12602 24837 9104 16303 36907 61259 69532 30984 -54936 -106714
2116 -106714 -70817 -38721 4613 52420 21288 -23198 14225 43956 44939 82003 46192 25849
2104 25849 3709 -14574 -35331 -73607 -61965 12106 23495 12256 15291 22765 1981 -4441
2092 -4441 -23719 -46640 -23596 -70320 -87126 -105619 -91362 -72848 -69980 -38606 11735 12690 -21248
2079 -21248 -14664 46133 93700 83144 46208 22160 9414 20519 -10850 -31420 -2634 -28636
2067 -28636 -48369 -59635 -49462 -64322 -56702 -38742 -41386 2959 8422 -13039 -43987 -58772
2055 -58772 -48234 -24367 -14476 1205 41521 19739 -37852 -15068 -1190 -15827 -53865 -111812
2043 -111812 -107804 -107562 -132728 -55483 807 -20589 -47 8298 -10172 -15311 -35599 -74014 -29707
2030 -29707 27494 54638 86146 33223 40014 68778 70009 35794 49618 27335 31890 49645
2018 49645 600 -81559 -93120 -488 19584 -31771 -54391 -66199 -50871 -70381 -52090 -54765
2006 -54765 -41799 -32639 -66666 -31843 9388 -18372 -7748 -3826 -35789 -32598 -49538 -31452
1994 -31452 47090 29778 -46617 -78155 -99330 -53384 -12036 -45226 -110124 -56215 -1469 -65016
1982 -65016 -91370 -123766 -154361 -175887 -160460 -42336 9779 12840 -8280 -11655 -110135 -134337
1970 -134337 -116216 -80467 -115765 -111679 -59026 -34895 -30648 -87173 -170859 -160428 -98105 -36042
1958 -36042 -37411 -12547 -6346 -77538 -62837 -61920 -46261 -24104 11244 37277 36486 10127 -16872
1945 -16872 14806 -11297 5413 48154 10302 -6340 -23488 11041 -4554 -9780 -58575 -121556
1933 -121556 -23667 32636 47408 66289 101706 142404 149933 107056 65239 5625 9581 42544
1921 42544 28322 -16008 -6332 -26466 -86942 -47137 -26390 -10538 4296 -11697 -17881 -6644
1909 -6644 -39913 -73874 -98329 -108649 -62869 -38572 -20420 2734 -5255 27644 46784 23123
1897 23123 -22975 -3730 48228 56217 11313 -34646 -46498 -51830 -49262 10131 60017 39455
1885 39455 -14338 -9555 56140 39375 70402 97281 149991 142502 93473 70831 41702 78584
1873 78584 71043 30276 -594 36594 25689 20838 29634 19080 53955 14965 -61356 -73428
1861 -73428 -71635 -53146 -107687 -95354 -72486 -79729 -48208 -31814 -18107 17545 42072 67716
1849 67716 76591 80667 110293 127150 158566 154788 54652 49597 81013 60280 -8163 -22895
1837 -22895 -75313 -189203 -190320 -100059 -74906 -60859 12173 46153 29101 46757 6811 -41917
1825 -41917 -39565 2879 11369 22695 35981 36489 -60084 -120827 -113487 -94949 -73103 -2851 -11077
1812 -11077 17076 78358 26916 -65137 -108120 -120297 -148168 -61312 5541 -39035 -48355 -69001
1800 -69001 -65459 12383 59526 85310 79102 105130 86902 37187 -69639 -64653 593 -44060
1788 -44060 -83204 -145715 -165179 -107719 -52965 -22597 -48974 5790 76198 91264 31821 29072
1776 29072 29675 29505 -10907 -54876 -52104 22439 27281 17195 -1078 -39929 -11078 -22414 -82178
1763 -82178 -76660 -46466 -28009 -42405 -19900 -28027 -49174 -76021 -68780 -93927 -58813 5389
1751 5389 59736 71890 34275 50135 -15575 -16452 -36396 -34864 -67949 -120602 -84688 -95682 -94299
1738 -94299 -131872 -47862 39973 53490 101554 102811 60604 17281 -31961 -46936 -15316 -36663
1726 -36663 -54892 -91360 -44100 -42202 -36934 -56036 -60774 -73260 -103825 -117436 -57417 -55640 8821
1713 8821 3139 -24257 -25078 -7084 6688 -10137 38487 102455 157506 124607 102061 43258 19687
1700 19687 65049 4804 -79819 -90741 -72778 -20242 -49289 -118647 -191660 -137564 37360 26844
1688 26844 -43057 -23765 -8306 3386 -44270 -66581 -19054 31577 -1601 -2797 34049 21769
1676 21769 -56377 -25381 43485 46478 65294 6521 -34780 -16535 -5278 35613 75421 57191
1664 57191 69533 47661 27494 -5884 14322 -7624 44906 78123 90006 50483 -6245 -48218
1652 -48218 -27406 694 24445 21912 49380 82370 20141 -8503 -31539 -46710 -35167 -7322
1640 -7322 41391 42142 11065 -24571 2574 -17293 -3885 44053 81135 108894 121029 147341
1628 147341 96829 15703 -22030 -18055 7807 32982 37166 48517 75634 70281 86032 67470
1616 67470 46606 72242 40593 86101 63413 18011 20621 -1173 -14430 -68086 -68289 -2872
1604 -2872 -32064 -52617 -76277 -76037 -63624 -32133 23063 61795 7038 -45761 -18177 -21461 -30485
1591 -30485 -15688 -21438 -61847 -40246 -24819 -3387 -19197 -2561 -268 -33989 -43690 -30985
1579 -30985 65660 53254 4698 -60300 -81653 -48433 -11685 23136 -35475 -115948 -97633 -62678
1567 -62678 -5614 44575 67529 39338 41439 16616 -2735 36745 -13379 -53803 -11530 -20895
1555 -20895 -40193 -51810 -99066 -109355 -97136 -108529 -109315 -106818 -108245 -106090 -107890 -81161 -70708
1542 -70708 -91324 -92561 -76346 -29459 -585 -37764 -17148 14756 42059 58899 29897 -20324
1530 -20324 14631 17426 13830 32227 14973 -1633 -10776 20224 4018 1123 27428 25798 7146
1517 7146 -30117 -61651 -48501 -28557 -22753 1193 42994 79675 56720 30251 -25649 -76977
1505 -76977 -41122 -65471 -22327 48776 76281 119300 137146 95515 15251 28559 36396 61066
1493 61066 74444 36438 18999 31249 51045 60574 33639 25947 11781 -32394 -34218 -46938
1481 -46938 -21535 -57939 -54919 -59177 -64462 -23708 -13862 -19614 -38967 -35187 -71523 -85069 -81457
1468 -81457 -35264 -5988 -56992 -97510 -95454 -25230 -52799 -97015 -64219 -67182 -75316 -68400 -7363
1455 -7363 59451 -10242 -105851 -96474 -44334 -50918 -56563 42061 31530 -6514 -47818 -33727 -31599
1442 -31599 -4929 1190 -28380 2568 54311 50153 25007 12768 3985 -28762 -96539 -111679
1430 -111679 -109563 -73766 18489 101322 61035 36315 22983 -1101 -45682 -68354 -76124 -38899
1418 -38899 -66285 -33158 11092 62425 65165 -5101 -13517 -10706 2486 4757 -40974 -36635 -3570
1405 -3570 -582 67167 66135 25361 32616 10347 35550 45061 25859 18839 12643 22687 2840
1392 2840 -7453 42429 75478 59898 69003 44545 34275 23483 14667 -25685 -57304 -68586
1380 -68586 -26747 -14040 13735 53264 25077 6490 -6643 -31505 -61393 -85463 -74353 -65901
1368 -65901 -5181 49986 28650 -32958 -101456 -159021 -142512 -99455 -56992 -36889 -12397 1356
1356 1356 14932 57561 56849 27177 -10247 -52214 -69487 -63885 -67551 -61607 -11545 26673 27150
1343 27150 5749 -44337 -17243 -16239 1250 -25194 -6239 -63461 -66310 18691 75971 104564
1331 104564 97533 42181 4204 40494 43767 20665 -477 11347 14723 70420 13960 16484
1319 16484 14769 -19951 3867 37153 79149 85821 49240 35228 -6114 40106 76253 -11313
1307 -11313 -42692 -86456 -77460 -83809 -78094 -75209 -30130 40799 82845 53534 58977 62991 26058
1294 26058 30915 31420 16095 -15850 -8465 38284 79930 62687 -2422 -87412 -85601 -49013 -5585
1281 -5585 26520 82719 58274 -28007 -42728 -52 29923 33420 50419 54929 49066 64601 13712
1268 13712 -4740 27171 -46282 -454 29291 61812 43573 -42380 12534 31321 52901 60280
1256 60280 49698 27726 -25305 -58634 -6621 45111 23108 -17593 -629 -2615 -20760 -10266
1244 -10266 -8770 -21228 -21720 12047 22308 46699 64578 52378 44219 26296 -2151 -191 -63331
1231 -63331 -7831 -14512 -39185 -41154 12780 46220 74166 178482 124257 21431 -17447 -74641
1219 -74641 -78193 -23482 -29581 -13132 58335 91580 102187 -13049 -76587 -61966 1108 34612
1207 34612 -11535 -55532 2528 41890 9086 -21929 11476 18234 36180 81747 63744 38848
1195 38848 67285 52675 51552 130 -46191 -65407 -20033 44389 2109 73231 93527 58668
1183 58668 94679 122454 106534 18283 -13923 -46264 -48955 5366 13950 -11474 -90541 -133431
1171 -133431 -96264 1201 64267 -10988 3682 34624 3155 -5502 39198 73876 149462 134127
1159 134127 35254 20787 -50504 -68694 -53299 -77813 3043 89661 59979 31103 63950 162164
1147 162164 193124 194151 145264 25412 -36273 -70062 -114283 -42117 54811 39673 11907 20459
1135 20459 8899 -59828 -62645 -38753 -64665 -58205 -16859 54573 148828 164893 44493 -35905
1123 -35905 -6311 8945 10631 -20459 -10435 19687 20092 39729 91142 79056 55194 37466
1111 37466 -9814 -2433 -29128 -1321 93975 61883 -3309 9684 19447 51430 20361 -9610
1099 -9610 46091 93258 73163 3244 -75803 -96219 -33976 -46320 -71037 -35922 41895 60132
1087 60132 69675 53062 39103 29069 89993 40609 13923 -79703 -104929 -37659 -50549 11514
1075 11514 87003 120244 107778 87016 130156 186621 96070 41561 65974 58790 16629 15145
1063 15145 27086 287 -50116 -96228 -89139 -72649 -17846 9627 -25945 -57062 -8091 56245
1051 56245 93449 88198 77019 74986 81113 36344 30601 56333 -1900 -3894 19149 -20643 -728
1038 -728 -5580 8438 -9230 -44586 -74975 -146900 -99080 -27156 10114 45208 73995 110738
1026 110738 130638 113199 138790 97944 53243 50876 67208 50280 4183 -15654 -29180 5799
1014 5799 70526 119408 101026 11264 20246 314 -34583 -83688 -43317 -50383 -20945 11450
1002 11450 49011 60387 -8322 -39672 -19191 33339 67693 88124 -7642 -32320 -30693 -292
990 -292 -34270 -19521 -10082 -34924 1437 48691 109976 133361 105350 88750 50179 55701 79062
977 79062 106787 63046 -20283 -35528 -306 31686 8000 -48491 5593 -21095 4983 -23846
965 -23846 44321 61790 45805 1643 -5975 -77880 -119693 7061 88380 57096 47197 8920
953 8920 -79438 -118741 -47795 -27186 -75005 -53945 -13782 -21677 -35318 13892 17739 -5556 34542
940 34542 79468 134303 116800 79053 66990 86073 85317 112313 89718 47719 2618 -56430
928 -56430 -25984 35215 29558 33661 45213 34692 6528 52810 80882 74790 43607 21508 49763
915 49763 55138 61248 60349 70416 44219 43752 50210 51754 58493 30836 -53779 -41708 510 52886
901 52886 68148 100178 63314 42005 50012 90630 139885 122276 43183 -6912 -21038 -14986
889 -14986 33224 24252 40464 -19725 -78634 -45758 -10732 10598 5079 17111 83055 90843 85069
876 85069 66813 40223 12464 43453 58820 52651 56426 76999 83637 74780 79591 104171 49789
863 49789 -1876 -8445 50560 115891 114481 111337 96475 94958 47500 -11015 -17925 4852 6820
850 6820 -10810 28394 43208 38068 148 123 11205 23137 15553 70535 104148 83723 63391
837 63391 33470 24642 57135 12403 -18168 -22562 5261 26415 -10362 -61875 -39146 -49798
825 -49798 -25547 -34457 -14024 21224 51062 69334 45372 1488 -26535 30354 97148 67252
813 67252 56986 -4721 -65427 -38542 -1813 -11691 1250 15814 60584 29148 26610 28274 -9606
800 -9606 -33019 -18905 -43559 -54713 -53557 -84811 -38022 15328 22440 555 -32036 15831 -31035
787 -31035 -92273 -82069 -72621 -48782 8606 -1640 417 -38968 -41966 -32351 7006 -26496 -5544
774 -5544 25035 35951 53457 141307 167266 90203 -6639 -35525 -23412 6286 32026 13906
762 13906 -14385 -11379 46089 93858 62880 -15228 -71676 -19177 25762 14482 -12044 -73255
750 -73255 -88405 -64131 -21192 5696 -838 26719 8299 10952 16023 -30298 -41153 -31019 9826
737 9826 368 34719 68863 60944 87890 27609 671 9589 54927 43816 -37637 -57094 -12127
724 -12127 21490 64650 67356 49134 -8122 -69922 -45491 -36634 -31383 -29619 12088 40041 -31802
711 -31802 -44739 -23928 -11907 -16636 -7235 34214 54297 32328 2196 20176 49623 48082 32323
698 32323 46438 42630 -13239 -14410 -25421 967 -2298 -40759 -85892 -69871 -28517 -2702 47827
685 47827 65254 88340 71467 138161 130776 56940 -11201 -12440 42618 64142 105809 44986
673 44986 11809 12274 -8681 53874 96779 8062 -24955 -13095 -27606 -1193 23787 16100 56893
660 56893 23594 -3459 -2086 27988 31630 14029 37076 66015 78033 33633 79744 34954
648 34954 -15359 7882 60561 59215 -21357 -72300 -51738 -11635 -419 -7208 -50337 -25327
636 -25327 -13816 46834 31342 20501 -8000 54877 50322 -3584 -49652 -57378 -45803 19419
624 19419 61253 52265 -56011 -99001 -89543 -90998 -31738 25127 45978 -873 -8113 80861 69866
611 69866 -16181 -22005 -52097 -48816 21348 33380 32479 114801 91475 60028 59829 -6669 -37608
598 -37608 5788 35062 89528 120312 53566 64722 103679 86315 41043 33290 55699 19660
586 19660 -3716 16222 -7801 -18248 -13650 -21071 -662 14165 -20942 -14346 -53982 -51694 -8331
573 -8331 -22267 -40441 -5988 -14147 4410 -7493 -515 20890 4296 1497 24122 32728 16660
560 16660 -5116 17807 -26806 1110 26753 6642 -3488 14796 17209 21591 39056 81167
548 81167 104735 48092 -16716 -25430 23456 41505 1565 40237 70423 56244 37699 5275
536 5275 -21246 23250 77184 74541 18141 -27615 40810 16020 -14466 -12360 -18755 29186 64636
523 64636 52764 10031 -57758 -131000 -123440 -16390 51558 31383 17389 -135 -33815 -57848
511 -57848 -7591 -6879 6769 65279 77083 104001 139835 92731 -12930 -27502 -18056 -2714
499 -2714 -65518 -142300 -150624 -113824 -36702 -60498 -71001 -14047 -23094 -37433 -31404 4946 15920
486 15920 -3653 -17577 -77239 -87783 -11544 45654 -1309 18067 61736 3418 69125 112538
474 112538 99245 31096 5244 22401 16423 64854 48611 18106 9006 14159 15995 -1582 -24412
461 -24412 -64107 -75812 -37425 -3710 50142 -5881 -64065 -85617 -77851 -12485 18551 13165
449 13165 51497 51050 62812 59465 -3086 16440 -17202 -56128 -61692 -36904 51992 49103 59981
436 59981 64487 53475 19490 33837 3149 4932 -523 -48282 -49973 -56151 -2919 21026 68275
423 68275 36636 9772 25192 28254 46204 62439 29740 1968 47696 52569 36774 79990
411 79990 59727 -56012 -68850 -86921 -49388 -41131 -40086 -33525 431 6052 -258 -11911 -23921
398 -23921 -6626 -5978 -8446 997 6432 22208 36135 36762 -35569 -38808 30067 47305 7770 6705
384 6705 -384 12837 17314 37113 59803 91942 61128 52251 17127 -8523 60314 111402 62670
371 62670 31598 21593 32260 15493 51304 65530 40741 60877 45540 18548 -12890 27636
359 27636 85960 139692 138995 68817 40955 12282 -31320 -29380 -13269 34597 26584 -8588 -22496
346 -22496 -35907 -7719 40403 60374 7176 22805 51211 30453 26359 36563 -15851 27684
334 27684 87969 63035 25397 14977 25432 25706 47658 67345 28536 -9696 -49694 -54566 -7395
321 -7395 34002 34258 32922 47766 42697 5300 -11015 46983 90983 115742 87769 54859 58755
308 58755 98915 91865 51457 31972 65105 126021 127078 97964 99186 123006 81886 5536 -14111
$$ [...]
##END NTUPLES=NMR SPECTRUM
##END=
