##TITLE=Analysis number 317996
Compound Code btb 07447
Project Code adrs
Chemist Name fudan
##JCAMPDX= 6.0         $$ Bruker NMR JCAMP-DX V2.0
##DATA TYPE= NMR SPECTRUM
##DATA CLASS= NTUPLES
##ORIGIN= Bruker BioSpin GmbH
##OWNER= nmr
$$ XWIN-NMR		Version 3.5
$$ Fri Mar 10 08:53:30 2006 GMT Standard Time (UT+0h)  MAYBRIDGE\nmr@NMR_250MHZ
##.OBSERVE FREQUENCY= 250.131544655141
##.OBSERVE NUCLEUS= ^1H
##.ACQUISITION MODE= SIMULTANEOUS (DQD)
##.ACQUISITION SCHEME= undefined
##.AVERAGES= 16
##.DIGITISER RES= 18
##SPECTROMETER/DATA SYSTEM= dpx250
##.PULSE SEQUENCE= zg30
##.SOLVENT NAME= CDCl3
##.SHIFT REFERENCE= (INTERNAL, CDCl3, 0, 16.522)
##AUDIT TRAIL= $$ (NUMBER, WHEN, WHO, WHERE, WHAT)
$$ ##TITLE= Audit trail, XWIN-NMR		Version 3.5
$$ ##JCAMPDX= 5.01
$$ ##ORIGIN= Bruker BioSpin GmbH
$$ ##OWNER= nmr
$$ C:\u/data/dgb/nmr/ADRS/430/pdata/1/auditp.txt
$$ ##AUDIT TRAIL=  $$ (NUMBER, WHEN, WHO, WHERE, WHAT)
(   1,<2006-03-10 08:53:10.56 +000>,<MAYBRIDGE\nmr>,<NMR_250MHZ>,
      <created by zg, POWCHK disabled, PULCHK disabled
       configuration hash MD5:
       84 BC 41 DB A1 6E 1D 46 DA 25 12 A5 C1 ED C5 3A
       data hash MD5: 64K
       F5 ED 98 77 75 A9 95 9E F5 B7 9E 96 6D 4D 5F BC>)
(   2,<2006-03-10 08:53:23.28 +000>,<MAYBRIDGE\nmr>,<NMR_250MHZ>,
      <Start of raw data processing
       ef LB = 0.3 FT_mod = 6 PKNL = 1 SI = 32K 
       data hash MD5: 32K
       24 58 34 E8 8E 50 17 88 B6 B1 35 CD E7 C8 D8 62>)
(   3,<2006-03-10 08:53:24.80 +000>,<MAYBRIDGE\nmr>,<NMR_250MHZ>,
      <apk 
       data hash MD5: 32K
       80 54 09 47 33 D7 7A 66 D0 2C 2A 63 6B 60 23 85>)
(   4,<2006-03-10 08:53:25.59 +000>,<MAYBRIDGE\nmr>,<NMR_250MHZ>,
      <abs ABSG = 5 
       data hash MD5: 32K
       0D 84 11 AB 0D CC 15 A7 00 5A CF D3 CD C0 88 4B>)
$$ ##END=
$$ 
$$ hash MD5
$$ 3D FC BD A2 D8 FD 31 FC 73 B2 15 CB C4 AD 2F 97
##$RELAX= 
##$RELAX= 
##$RELAX= 
##$RELAX= 
##$RELAX= 
##$RELAX= 
##$RELAX= 
$$ Bruker specific parameters
$$ --------------------------
##$DU= <C:\u>
##$EXPNO= 430
##$NAME= <ADRS>
##$PROCNO= 1
##$TYPE= <nmr>
##$USER= <dgb>
##$AMP= (0..31)
100 100 100 100 100 100 100 100 100 100 100 100 100 100 100 100 100 100 
100 100 100 100 100 100 100 100 100 100 100 100 100 100 
##$AQSEQ= 0
##$AQ_mod= 3
##$AUNM= <au_zg>
##$AUTOPOS= <3 >
##$BF1= 250.13
##$BF2= 250.13
##$BF3= 250.13
##$BF4= 250.13
##$BF5= 500.13
##$BF6= 500.13
##$BF7= 500.13
##$BF8= 500.13
##$BYTORDA= 1
##$CFDGTYP= 0
##$CFRGTYP= 5
##$CHEMSTR= <none>
##$CNST= (0..31)
1 1 145 1 1 1 1 1 1 1 1 1 1 1 1 1 1 1 1 1 1 1 1 1 1 1 1 1 1 1 1 1 
##$CPDPRG= <>
##$CPDPRG1= <>
##$CPDPRG2= <>
##$CPDPRG3= <>
##$CPDPRG4= <mlev>
##$CPDPRG5= <mlev>
##$CPDPRG6= <mlev>
##$CPDPRG7= <mlev>
##$CPDPRG8= <mlev>
##$CPDPRGB= <>
##$CPDPRGT= <>
##$D= (0..31)
0 1 0 0 0 0 0 0 0 0.06 0 0 0 0 0 0 0.0002 0 0 0 0 0 0 0 0 0 0 0 0 0 0 
0 
##$DATE= 1141980789
##$DBL= (0..7)
120 120 120 120 120 120 120 120 
##$DBP= (0..7)
150 150 150 150 150 150 150 150 
##$DBP07= 0
##$DBPNAM0= <>
##$DBPNAM1= <>
##$DBPNAM2= <>
##$DBPNAM3= <>
$$ [...]
##$SUBNAM7= <"">
##$SUBNAM8= <"">
##$SUBNAM9= <"">
##$SW= 20.6930455092707
##$SWIBOX= (0..15)
0 0 3 0 0 0 0 0 0 0 0 0 0 0 0 0 
##$SW_h= 5175.983436853
##$TD= 65536
##$TD0= 1
##$TE= 293.16
##$TE2= 300
##$TE3= 300
##$TEG= 300
##$TL= (0..7)
0 120 120 120 120 120 120 120 
##$TP= (0..7)
150 150 150 150 150 150 150 150 
##$TP07= 0
##$TPNAME0= <>
##$TPNAME1= <>
##$TPNAME2= <>
##$TPNAME3= <>
##$TPNAME4= <>
##$TPNAME5= <>
##$TPNAME6= <>
##$TPNAME7= <>
##$TPOAL= (0..7)
0.5 0.5 0.5 0.5 0.5 0.5 0.5 0.5 
##$TPOFFS= (0..7)
0 0 0 0 0 0 0 0 
##$TUNHIN= 0
##$TUNHOUT= 0
##$TUNXOUT= 0
##$USERA1= <user>
##$USERA2= <user>
##$USERA3= <user>
##$USERA4= <user>
##$USERA5= <user>
##$V9= 5
##$VALIST= <valist>
##$VCLIST= <CCCCCCCCCCCCCCC>
##$VD= 0
##$VDLIST= <DDDDDDDDDDDDDDD>
##$VPLIST= <PPPPPPPPPPPPPPP>
##$VTLIST= <TTTTTTTTTTTTTTT>
##$WBST= 1024
##$WBSW= 4
##$XGAIN= (0..3)
0 0 0 0 
##$XL= 0
##$YL= 0
##$YMAX_a= 512489
##$YMIN_a= -540614
##$ZGOPTNS= <>
##$ZL1= 120
##$ZL2= 120
##$ZL3= 120
##$ZL4= 120
##$ABSF1= 16.522
##$ABSF2= -4.171173
##$ABSG= 5
##$ABSL= 3
##$ALPHA= 0
##$AQORDER= 0
##$ASSFAC= 0
##$ASSFACI= 0
##$ASSFACX= 0
##$ASSWID= 0
##$AUNMP= <proc_1d>
##$AZFE= 0.1
##$AZFW= 0.1
##$BCFW= 0
##$BC_mod= 0
##$BYTORDP= 0
##$COROFFS= 0
##$CY= 12.5
##$DATMOD= 1
##$DC= 0
##$DFILT= <>
##$DTYPP= 0
##$F1P= 14.0000005364418
##$F2P= -0.99999901652339
##$FCOR= 0.5
##$FTSIZE= 32768
##$FT_mod= 6
##$GAMMA= 0
##$GB= 0
##$INTBC= 1
##$INTSCL= 1
##$ISEN= 128
##$LB= 0.3
##$LEV0= 0
##$LPBIN= 0
##$MAXI= 10000
##$MC2= 0
##$MEAN= 0
##$ME_mod= 0
##$MI= 0
##$NCOEF= 0
##$NC_proc= -2
##$NLEV= 6
##$NOISF1= 0
##$NOISF2= 0
##$NSP= 0
##$NTH_PI= 0
##$NZP= 0
##$OFFSET= 16.522
##$PC= 1
##$PHC0= 173.7464
##$PHC1= 1.721854
##$PH_mod= 1
##$PKNL= yes
##$PPARMOD= 0
##$PSCAL= 4
##$PSIGN= 0
##$REVERSE= no
##$SF= 250.13
##$SI= 32768
##$SIGF1= 0
##$SIGF2= 0
##$SINO= 400
##$SIOLD= 32768
##$SREGLST= <1H.CDCl3>
##$SSB= 0
##$STSI= 32768
##$STSR= 0
##$SW_p= 5175.98343685301
##$SYMM= 0
##$S_DEV= 0
##$TDeff= 65536
##$TDoff= 0
##$TI= <Analysis number 999999
Compound Code 99
Book Reference 9
Project Code 9>
##$TILT= no
##$TM1= 0
##$TM2= 0
##$TOPLEV= 0
##$USERP1= <user>
##$USERP2= <user>
##$USERP3= <user>
##$USERP4= <user>
##$USERP5= <user>
##$WDW= 1
##$XDIM= 32768
##$YMAX_p= 275451701
##$YMIN_p= -35864
$$ End of Bruker specific parameters
$$ ---------------------------------
##NTUPLES= NMR SPECTRUM
##VAR_NAME=  FREQUENCY,     SPECTRUM/REAL,   SPECTRUM/IMAG
##SYMBOL=    X,             R,               I
##VAR_TYPE=  INDEPENDENT,   DEPENDENT,       DEPENDENT
##VAR_FORM=  AFFN,          ASDF,            ASDF
##VAR_DIM=   32768,         32768,           32768
##UNITS=     HZ,            ARBITRARY UNITS, ARBITRARY UNITS
##FACTOR=    0.157963299565203, 1,           1
##FIRST=     4132.6476996994, 0,             0
##LAST=      -1043.33573715361, 0,           0
##MIN=       -1043.33573715361, -35864,      0
##MAX=       4132.6476996994, 275451701,     0
$$ Real data points
##PAGE= N=1
##DATA TABLE= (X++(R..R)), XYDATA
$$ [...]
16739B8155K426l387n414m550P039J0537l228n193Q02j049k532n995m853o07K2
16724A2173O085L086J546J026O154N849m688p439q501n867K152J917M521K12J552
16709A9778p64J306M559Q991L346o977l972J328O963L728J269O608N656J335J0480
16694F3634J1999K673J5817R338K622Q92j246N236n6j0131j2634L442j885P62
16680I0463P967J2564l570Q155J2196J7553K7961K7519K8273J7607q978k5417
16668B12293l4272l2667l0455k8815j8075m640L58o26J875j303m365J255N853
16655F6416L258K575r42N836P637J1805K160n75p5L162J1095R806k433n918M033
16640A17840J4644J3494J5362J2542R855J4889J0354J26j5518j6749o953m641
$$ y = [28155, 30581, 27194, 21780, 17230, 24269, 34806, 31578, 26385, 27187, 26138, 23606, 17611, 12758, 12151, 12173, 18258, 21344, 22890, 23916, 30070, 35919, 31231, 23792, 15291, 9424, 11576, 13493, 18014, 18226, 19778, 19014, 20320, 24879, 33870, 37216, 30239, 26267, 27595, 34558, 38286, 39555, 46163, 51819, 53154, 63634, 75633, 78306, 94123, 103461, 106083, 106975, 105729, 110965, 110909, 100778, 88144, 91586, 89701, 90463, 98430, 110994, 107424, 115579, 127775, 145328, 173289, 200808, 229081, 246688, 237710, 212293, 178021, 145354, 114899, 86084, 68009, 63369, 63727, 63101, 64976, 63673, 59308, 60563, 66416, 69674, 72249, 71307, 77143, 84780, 96585, 98745, 98170, 98095, 101257, 112352, 122158, 119725, 113807, 117840, 132484, 145978, 161340, 173882, 183737, 198626, 208980, 209106, 193588, 176839, 169886, 165245]
16628A65245l81O77J3845K5312L1836K7774J7071p753j8977l2427m1160l3033
16616A48029k2183j3802K766N355m438m926o18O401J088K494Q429P053J4076K4904
16602A74628K927j5317k5866k5649k3439j8435j4482k088m119n721p5o690l812
16589C1862k98m421R30M454J1055R59J1341P043J1373K3114K2333J1987O556J6174
16575A54462J5726N273j2011k0600k1003l1419k8402j6046k586n146k450m92l508
16562C1798j0182j383L334M827Q543M239Q02j949p426j881k064l893J082p06n941
16547A9200p891j48p429L271k036L777j162j58N152j321k937o67J848m668J216
16532F047N332N132M025m027o804j740J187P985n685M71n616J36j292k764K067
$$ y = [165245, 164864, 165541, 179386, 204698, 236534, 264308, 281379, 273626, 254649, 222222, 181062, 148029, 125846, 112044, 114810, 120165, 115727, 110801, 110183, 116584, 117672, 120166, 128595, 135648, 149724, 174628, 177555, 162238, 136372, 110723, 87284, 68849, 54367, 52279, 48160, 42439, 42364, 35674, 31862, 31564, 27143, 28073, 32527, 43582, 44541, 55882, 62925, 74298, 97412, 119745, 131732, 138288, 154462, 170188, 175461, 163450, 142850, 121847, 90428, 62026, 45980, 43394, 38248, 35798, 35306, 31798, 21616, 20233, 23567, 28394, 36937, 41176, 41978, 40029, 32603, 30722, 28658, 24765, 25847, 25141, 19200, 11309, 11161, 3732, 7003, 4967, 8744, 7582, 7424, 12576, 11255, 8318, 7651, 9499, 4831, 6047, 11379, 16511, 20536, 16509, 9705, 7965, 9152, 17137, 11452, 11923, 6307, 6443, 5151, 2387, 4454]
16517D454M92K171J67M660n512L170O360J640n990Q0q910m88J522M575O742l393
16501A1740l62M31n78k816q34o96L893K140L06k996l972J232j666n458l37J274
16485A301K865K371k369m593N820R58j244O755N790j522k37L843k59n244n928
16470H307p003k00j673K525M696N629o25N469M977K407l276n115J158j301m340
16455A1635J1m055L225n35L66j215R077j625n923l559l562L187M653N101L337
16440B0118q501p627O954J3863L854j841j676q080m571r086p899L157P788K395
16426H848L009m969l972J489L228K341N71k982M752L221q391p893l710K644R472
16411G658O191K33K831k980q175k294J161m126n787j410J682M190J0484M954K802
$$ y = [4454, 4946, 7117, 7284, 11944, 6432, 9602, 15962, 17602, 11612, 11692, 2782, 2294, 3816, 8391, 15133, 11740, 11378, 11809, 11231, 8415, 7581, 6885, 10778, 12918, 13224, 10228, 6256, 7488, 5822, 364, 27, 1301, 4166, 6537, 4168, -425, 5395, 6353, 5109, 11864, 17654, 16132, 15895, 19738, 19479, 14235, 8307, 1304, 1104, -569, 1956, 6652, 12281, 11656, 17125, 22102, 24509, 21233, 16118, 17276, 15975, 11635, 11646, 7591, 10816, 10281, 10647, 9432, 18509, 16884, 10961, 7402, 3840, 7027, 11680, 16781, 20118, 11617, 3990, 10944, 24807, 28661, 26820, 25144, 17064, 12493, 3407, -4492, -1335, 6453, 8848, 11857, 6888, 2916, 4405, 7633, 9974, 10545, 7563, 12315, 15536, 7145, -748, -4458, -1814, 7658, 13849, 14082, 16913, 13933, 5758, 3464, 4625, 499, -5288, -6698, -5016, -826, 9658, 14612, 17414]
16396A7414p150m806L776Q8K643K536L340k227l970m012O435R17j174M67p758
16381F519p367O661J2582K862m532p303L467N45j552J096j763k091j076K127m726
16366E449p939P364P816o61M156k718n234j992M352K755j693K549j784L581K462
16351A8463k815L842k322J328j130k729j053p803k175M022p04m219K146K895N186
16336A2932N597J692l672n126L340j716k230K593m686l86J588n919N25q66m981
16321a315l948N628Q88k102n945j824O461J101K910N019L169M1k803K648k590
16306G338n954K04N19R354P236o989n960j1599l680j640P49P039j833Q860O048
16291I692m217m630k675O641k126l622q2R44L157J208J26o867L238K322L336l506
$$ y = [17414, 10264, 5458, 9234, 9322, 11965, 14501, 17841, 15614, 11644, 7632, 14067, 14984, 13810, 14277, 6519, -848, 5813, 18395, 21257, 16725, 9422, 12889, 13434, 11882, 12978, 11215, 9124, 8048, 10175, 5449, -2490, 4874, 12690, 12029, 16185, 13467, 8233, 6241, 10593, 13348, 11655, 14204, 12420, 16001, 18463, 15648, 19490, 17168, 18496, 17366, 14637, 13584, 5781, 3606, 7628, 6924, 2705, 4851, 7746, 12932, 18529, 20221, 16549, 11423, 14763, 13047, 10817, 13410, 8724, 8338, 9926, 4007, 4532, 3666, -1315, -5263, 365, 1253, -849, -6794, -8618, -2157, -1056, 1854, 6873, 10042, 10083, 7280, 9928, 7338, 1384, 1588, 2107, 11461, 18697, 11708, 5748, -5851, -9531, -11171, -10422, -3383, -5216, 3644, 9692, 5475, 845, -1830, 4811, 2685, -937, -1019, -75, 3082, 4290, 4416, -2451, 787, 3109, 6445, 2939]
16275B939l804J739K268K460l072r043N434Q66j490L774K8n677M302n64J509j954
16259b85m727j629j28j443n97J719K301j842j735k998p4J592N471N542m050n26
16243c409N155J783j124l218o81P76p07m588L074O468k274j988K658J801l625
16228A01M274J811m44j685l770N710K759n203m854n345j314N575N556K750q050
16213b129m103J646M142J710L805J839l65k376l363O220Q066P46q493l450j468
16198B427O464L998j370q796j1858l968M749O13J308L601k851L499M464j351N280
16183F209Q34P90k230O4O079J918n023n800m194o219O4R054l530n40j446N035
16167A065R81K354K50O85O701j762l596k488o491L816K513L581m469k752P971
$$ y = [2939, -865, 874, 3142, 5602, 2530, -6513, -1079, -213, -1703, 2071, 2099, -3578, 724, 160, 1669, -285, -5012, -6641, -6769, -8212, -8809, -7090, -4789, -6631, -8366, -11364, -11438, -9846, -4375, 1167, -2883, -3409, 1746, 3529, 2405, -813, -1494, -718, -1425, -6013, -2939, 3529, 1255, -733, 1925, 3726, 101, 4375, 6186, 5742, 4057, 287, 5997, 8756, 3553, -1301, -6646, -7960, -2385, 3171, 5921, -2129, -6232, -4586, -444, 1266, 5071, 6910, 6545, 4169, 806, 7026, 15092, 15838, 7345, 3895, 2427, 8891, 12889, 11519, 2723, -9135, -13103, -8354, -7741, -6433, -2832, -5683, -2184, 2280, 929, 6209, 7043, 7833, 5603, 5667, 11746, 13664, 8641, 2841, -1353, -7572, -7508, 1546, -1984, -2524, -3970, 1065, 2046, 4400, 4650, 5335, 12036, 10274, 6678, 4190, -2301, 1515, 4028, 7609, 3140, 388, 8359]
16152H359M145m216k241K364k453k486l771p83N649K631n351n671M292L668P182
16137A1318L609l944j971k829L566L667m237j732m466K392K272j991j030Q98j949
16122C573J116m47N45k958J199k905k527J095l15J385M631L574k444q64J116L073
16106H847K965j4410j537N825M456M274L268j723p431K234j275k9J162M220j679
16091I167o604K981K047k34l740l55N924Q285M093o040k343p028n78j413L037
16076G199o005q55J1087O700o383j3154j484N699M788P30o252q905N27O838N309
16061E839M909N505K958l831k283K950J515j0833m926K231m700k352K402k943
16047c559m151L383M767M511J592o323k072R30r64k446J541P137m486n01k81j582
$$ y = [8359, 12504, 8288, 6047, 8411, 5958, 3472, -299, -1082, 4567, 7198, 1847, -3824, 468, 4136, 11318, 14927, 10983, 9012, 6183, 9749, 13416, 9179, 7447, 2981, 5373, 7645, 5654, 4624, 5522, 3573, 4689, 4242, 4787, 1829, 3028, 123, -2404, -1309, -1624, -239, 4392, 7966, 5522, 4658, 5774, 8847, 11812, -2598, -4135, 1690, 6146, 10420, 13688, 11965, 4534, 6768, 5493, 5464, 6626, 10846, 9167, 2563, 5544, 7591, 7357, 3617, 3262, 9186, 17471, 21564, 15524, 13181, 6153, 5575, 4162, 7199, 1194, 339, 11426, 18126, 11743, -1411, -2895, 2804, 7592, 8322, 2070, -6835, -6308, 530, 5839, 10748, 16253, 19211, 15380, 13097, 16047, 17562, 6729, 1803, 4034, -666, -3018, -616, -3559, -7710, -4327, 440, 4951, 6543, 220, -1852, -922, -1886, -4332, -2791, 4346, -140, -641, -922, -2504]
16031b504K207O762O567j067j834J886k8j791J2j965M625p27o486p765m314k01
16015f623K273K645O672J068l455K86J864p98j757m10J792N388p650n672L453
16000i24P833P74n56l621n334K882j15n338l774L759N312O929L922k761q105l020
15984b137r2l338k17N232l257N704k667m939K579P685O652m975n093n63K90M148
15968E012L578m912J310N18P84l221K56K160J0810j359p821J441M241k805k712
15953G280Q28r569j659J102N289N123k802n511j842P450P806j72o871q713j0101
15938a2362P0J683M244N531K550j5156J989R702J902r767K555O208K340R2L166
15923D747P048K108R88n814n066J642K038o02l541m961o68l134J272J0732K531
$$ y = [-2504, -297, 6465, 13032, 11965, 10131, 12017, 11989, 10198, 10210, 8245, 12870, 12143, 5657, -2108, -6422, -6623, -4350, -1705, 4967, 6035, 2580, 2866, 4730, 3932, 2175, 1765, 3557, 8945, 1295, -4377, -924, 6909, 7683, 7127, 3506, -1828, 1054, 939, -4399, -8173, -4414, 898, 7827, 11749, 8988, 883, -2137, -2229, -5567, -5784, -552, -3809, 1895, -772, -5711, -3132, 4553, 11205, 6230, 1137, 574, 864, 5012, 8590, 3678, 4988, 5506, 6290, 3069, 3325, 5485, 16295, 14936, 7115, 8556, 12797, 9992, 7280, 8108, -1461, -3120, -2018, 3271, 8394, 5592, 81, -1761, 5689, 13495, 13323, 6452, -2261, -12362, -12292, -10609, -6365, -834, 1716, -13440, -11451, -1749, 153, -9614, -7059, -851, 1489, 1581, 4747, 11795, 13903, 14891, 9077, 4011, 5653, 7691, 7089, 3548, -1413, -2081, -5215, -3943, 6789, 9320]
15908I320m75j629k500K029J910J561k123j0275r56J596L679N78K806j832n576
15893a887Q015J832l104m996l42Q98k520M472k025R56j350J53K617M615O713k829
15877A1218j0998n274N487j733j583M746k544j577k018N552O733k844o843k755
15863d433M394n00m877l057Q065Q393K892m7m510l564m703n81N799j165o304K64
15847c934P257J2015p393j0210o01j162J102L49p998o813J213j418J2391N057
15833a45K076q89J44k234j548O356J965k546J895k454L570J1467j488o826k664
15818F679j722j414L42R94l59K939k116k691L139m419J016K872N162p673k234
15803E15j918Q26k792O225K089l532Q73m676l286N767j629j574l417K662P49L05
$$ y = [9320, 8845, 7216, 4716, 6745, 8655, 10216, 8093, -2182, -3138, -1542, 2137, 2715, 5521, 3689, -1887, 6128, 7960, 4856, -140, -482, 416, -2104, 2368, 343, 1299, -51, 102, 2719, 7334, 14047, 11218, 220, -5054, 433, -1300, -2883, 1863, -681, -2258, -4276, 1276, 8009, 5165, -1678, -4433, -39, -539, -5416, -8473, -408, 7985, 10877, 10830, 6320, 2756, -1947, -2528, 3271, 2106, -4198, -3934, 3323, 15338, 7945, -2265, -2866, -4028, -2926, -2577, -10575, -17388, -16175, -17593, -5202, -145, 1931, 1042, 1186, -1048, -2596, 3760, 5725, 3179, 5074, 2620, 6190, 17657, 16169, 9343, 6679, 4957, 3543, 3885, 4879, 4520, 7459, 5343, 2652, 5791, 1372, 2388, 5260, 10422, 2749, 515, -1403, -577, -3369, 2856, 4945, 1413, 2286, -2390, -5676, 91, -1538, -3112, -6529, -3867, -3118, -2813]
15787b813j802j232L913N059N365K280k675m920k599j508m103o690n102M631M828
15772g368R836P801L617m909l707K858N103L851q2m132r135j828j46J158J126
15757D043j215M116J885o40l755j224j84J121m008k390J642j359n34L981K065
15742C544k726k17R2O639J910M8k091K666l04M761m07m035j310K251m54J314r141
15725B540K408l851q17K577K31M644P548J257K376n246j493j660q570j0819j0902
15710a9777J4682N759m625O108O438o301o070L971k638l068J329K341r13J748
15696a016L482r59o271K65l9M916n857r0L597N88m928j302M49m598K536O228L341
15679C42l102K431m429O205j224m341O48Q70R103N053o406L497M02L77j209k992
$$ y = [-2813, -4615, -5847, -1934, 3125, 8490, 10770, 8095, 3175, 576, -932, -5035, -11725, -16827, -12196, -7368, 2468, 10269, 13886, 8977, 5270, 8128, 13231, 17082, 17000, 12868, 3733, 1905, 1759, 2917, 4043, 2828, 6944, 8829, 8189, 4434, 3210, 3026, 4147, 139, -2251, -609, -1968, -2502, 1479, 3544, 818, 601, 693, 7332, 9242, 9290, 7199, 9865, 9561, 14322, 13915, 9880, 8570, 10821, 10367, 11681, 2540, 4948, 1097, 280, 2857, 3088, 7732, 15280, 16537, 18913, 13667, 12174, 10514, 1944, -8875, -19777, -5095, 664, -3961, 2147, 8585, 2284, -3786, 185, -2453, -5521, -4192, -1851, -2764, -1016, 2466, 1507, -4764, -4499, -4538, 378, -5479, -5569, -1972, -1384, -6312, -7614, -7165, -11763, -9227, -2999, 342, -2760, -329, -4758, 1447, 223, -4118, -3470, -2600, 6503, 11556, 5150, 8647, 9049, 9426, 8217, 5225]
15663E225n649k609k445n37Q40K92k745k684M471J079Q193L458K766n167n027
15648e39J852j663m1k638M097K902l977o7j282q9N214p970L794M85j889J330m62
15631i43L10J95J769l33k617L43O89M180K914R402l715m035M612l146r237o481
15615f093m394N548J584O351K764k19O74N741p45j638j82J39n903o76M65P67j112
15598C071K69p041J232N574R475J035r556p629n781P79K196Q388L57m127r49K50
15582b457J180K976L897J722L930k176o285m562m26L997K725k791l381J128m547
15567e070n21l479n717M695P955Q7L520j536m141k563j00J404l10m819L636j208
15551h167K089r1m946L566J549j399M72O78o719L182O079L640l75K53k437l016
$$ y = [5225, -424, -3033, -5478, -6015, -5175, -4883, -7628, -10312, -5841, -4762, 3431, 6889, 9655, 4488, -539, 1313, -350, -391, -3029, 1068, 3970, -7, -74, -1356, -1445, 3769, -4201, -407, 78, -1811, -481, -943, -633, -438, 1331, 998, -1619, -1276, -587, 3593, 6507, 15909, 12194, 8159, 12771, 9625, 388, -6093, -10487, -4939, -3355, 2996, 5760, 5541, 6215, 11956, 11211, 9573, 9391, 9530, 3627, 2951, 3416, 4183, 3071, 3340, -3701, -2469, 3105, 12580, 13615, 4059, -3570, -9351, -8572, -6376, 2012, 2369, -1758, -2707, -2457, -1277, 1699, 5596, 7318, 11248, 9072, 2787, -1775, -2201, 1796, 4521, 1730, -1651, -523, -5070, -5591, -9070, -14787, -10092, -2137, -2050, 1470, -66, -4207, -6770, -6870, -5466, -5776, -10595, -6959, -8167, -6078, -6169, -11115, -7549, -6000, -7399, -6927, -6249, -12968, -9786, -3707, -67, -442, -189, -2626, -5642]
15535e642M433k576K246J810l63l628L601L570l022k48K175J473J63j1973j18
15520h099O127R135L018L823M092r911l006o30j130J779K458j456j0013n361M884
15505d290k632n773N355Q068J036k918k434J654R411L628J75m586r662J23K697
15490a48m342k628L973l778j065J773J960R373J116m874j376M304M906m185j94
15475D815O982l921p759j985o58l088l464M824L165K349r0k646m55k657M811M477
15459D700o445k233M435J361k828l440O657k069p468Q582P059j627r5m648r638
15444g697n524L698J861M949K016k467K936j308n280p250l53J902O667M187j223
15429b886m999k027r84J159N314K965J909O255k075j2281k344N626O33J782k235
$$ y = [-5642, -1209, -3785, -1539, 271, -92, -3720, -119, 3451, 429, 181, 2356, 3829, 3992, -7981, -8099, -1972, 7163, 10181, 14004, 18096, 8185, 5179, 4549, 3419, 5198, 7656, 6200, -3813, -9174, -4290, -6922, -12695, -7340, 728, 1764, -1154, -3588, -1934, 7477, 11105, 11280, 6694, -2968, -2845, -148, -4490, -7118, -3145, -6923, -7988, -6215, -4255, 5118, 6234, 1360, -16, 4288, 9194, 5009, 4815, 11797, 7876, 117, -1868, -2526, -5614, -9078, -4254, -1089, 1260, 1170, -1476, -1931, -4588, 223, 4700, -1745, -3978, 457, 1818, -1010, -4450, 2207, 138, -7330, 1252, 8311, 6684, 6589, 1941, -7697, -13221, -9523, -7662, -2713, -697, -3164, -228, -1536, -6816, -14066, -14419, -12517, -5850, -1663, -2886, -7885, -9912, -10896, -9737, -4423, -1458, 451, 6706, 4631, -7650, -9994, -4368, -3735, -1953, -4188]
15414d188J320l56m405J580M589L721M271r781m061L180J753n337R63j503J64
15399h090N737q46l023j502k135j887p40O789m45Q10O475K812p573k626J817R612
15383E185k044l275J53q15Q961q715m396j231K47k5L389N568j564l048k760M147
15367b23P61K72J221k319p055PP082K176k730m061k040k473k119K745l09l649
15351a2714p75K006r76k701O184p56O71L039K918J055j321j975M126J1992L335
15336A4108j542l815o204j0920j441R81j80J1138J465n59o62o267K067K595m302
15321c538J96j397k476J356K042j296K379j316n89M459k134k838M928N607J748
15306G131k420M208L773L091l921o855m124L644j313p34J0252m999j592L071M44
$$ y = [-4188, -2868, -3224, -7629, -6049, -1460, 2261, 6532, -3249, -7310, -4130, -2377, -7714, -6751, -8254, -8090, -2353, -3199, -6222, -7724, -9859, -11746, -12486, -5697, -6142, -5332, 1143, 3955, -3618, -6244, -4427, 5185, 3141, -134, 19, -796, 8165, -550, -4946, -6177, -5930, -5955, -2566, 3002, 1438, -1610, -4370, -223, 538, 810, 2031, -288, -7343, -7336, -254, 1922, -808, -4869, -6909, -9382, -11501, -8756, -9065, -12714, -13489, -11483, -12459, -15160, -8976, -9732, -9061, -6022, -3104, -2049, -3370, -5345, -1219, 10773, 14108, 12566, 8751, 2547, -8373, -9814, -8833, -9013, 2125, 3590, 3031, 2369, -3898, -1831, 764, -3538, -3342, -4739, -7215, -5859, -3817, -5113, -2734, -4050, -4639, -180, -2314, -5152, -224, 5383, 7131, 4711, 8919, 12692, 15783, 11862, 5007, 883, 4527, 3214, 2480, 12732, 7733, 6141, 9212, 9656]
15291I656L387Q932p32k344L89l954k963L271o07n794j0831l484J727l409l525
15276a0281J879k554M356L623L153j357k556L938N751j409l502N667M914m873
15262F749j6536K165J0012k904p190m252K37L620l082Q65N247R617Q15l660N1
15247A754n646l27J553K351m51J148o5k501o022K661N631K300p48l455Q098N247
15231A1528O26J493n210k242p117n055K543L166m629l483l115O227P650l349J838
15216H71p165n050O35L969N378J209L171m97K642o60j512J98N649m232m014J702
15200B294M727q152q137R29K209R118j008m530k455Q998J0758L685o70q367m519
15185D880K8l076q192M774N327M61m450L974M428l910M125P160n409q818P91N458
$$ y = [9656, 13043, 21975, 21243, 18899, 19288, 15334, 12371, 15642, 15035, 9241, -1590, -5074, -3347, -6756, -10281, -8402, -10956, -6600, -2977, 176, -1181, -3737, 201, 5952, 4543, 1041, 6708, 11622, 6749, -9787, -7622, 2390, -514, -7704, -11956, -11719, -8099, -11181, -10316, -5069, 4548, 5363, 1703, 1754, -3892, -4219, -2666, -315, -766, 382, 317, -2184, -8206, -5545, 86, 2386, 1638, -1817, 6281, 11528, 12154, 13647, 8437, 6195, -922, -5977, -3434, -268, -4897, -8380, -11495, -5268, 2382, -967, 871, -6294, -11344, -10709, -6740, -1362, -153, 3018, 2521, 5163, 4503, 2991, 3189, 8838, 4606, 592, 2294, 7021, -1131, -9268, -8339, -6130, 2988, 1980, -2550, -5005, 3993, 14751, 18436, 17766, 9399, 4880, 4908, 1832, -6360, -1586, 3741, 4202, -248, 3726, 8154, 4244, 8369, 15529, 10120, 1302, 2093, 7551]
15169G551l508k121n21J385M310J474L797j335K35K644l437l553k877q172k361
15154f489k843L710P965L915p452j0151L05K713P518Q574J70k895k043J757R16
15139E670j172J790j469j4478M928J987l845j401k116l028K573j670k840k648
15125a7719N652N898NL52M993j616m594j191N078K140j60n021N753N773k918L206
15109E631Q57M76j263K110k076k276r22p895m710j254R380O644l312J703L24J39
15093C556n602J002l557j0183K310J0481O133L519n091j991l832m904L69O13o464
15078a3641R88M430J685j925l430N29P39M894P92l527M970k071K962K078L617
15063C090n551N008M18p691n425O894P798l252q772L443N304M298p3M172k985
$$ y = [7551, 4043, 1922, 1401, 2786, 7096, 8570, 12367, 11032, 11267, 13911, 10474, 6921, 4044, -4128, -6489, -9332, -5622, 2343, 6258, -1194, -11345, -11040, -8327, -809, 7765, 7935, 5040, 2997, 4754, 5670, 4498, 6288, 4819, -9659, -4731, -2744, -6589, -7990, -10106, -13134, -10561, -12231, -15071, -17719, -12067, -6169, -6164, -5812, -819, -2435, -7029, -8220, -3142, -1002, -1162, -6183, -430, 5343, 2425, 5631, 6488, 6964, 5701, 7811, 5735, 3459, 2537, -5358, -10068, -11322, -1942, 4702, 1390, 3093, 3417, 3556, -2046, -1044, -4601, -14784, -12474, -1993, 4140, 7659, 2568, 577, -3255, -8159, -7790, -7177, -13641, -12653, -8223, -6538, -8463, -11893, -11364, -10625, -5731, -4939, -8466, -3496, -5567, -2605, -527, 3090, -2461, 2547, 2965, -4726, -10151, -3257, 4541, 1289, -7483, -4040, 1264, 5562, 5489, 9661, 6676]
15048F676n443p293m297M678m539k002L844J312L059J689N74n78k48o440j905
15033a0913L006M936l501q809N589N631n380L8O575M715j546j287K62P337k363
15018D290K800n636k902r66O415k71j374l621J364M548j796m681m52M962K25K898
15002E803n621j980j37K163o54J468P90K28l057o66m684K777N240n542J308P575
14986E011N364K52q110k258m193j376k460j157L709J64J109L579N242O944o507
14971E313p892k743J403J932n641r92l88n218N145K236k250q466k156K351P036
14956a0330J1288P707j209r69m258k748o979m890Q897J337P72L445Q148R56m819
14941F348m11O48n50n408j653K855L259n140p961Q95L22L205n322n963p81l626
$$ y = [6676, 1233, -6060, -10357, -5679, -10218, -12220, -8376, -7064, -4005, -2316, -1742, -2320, -2568, -9008, -10913, -7907, -2971, -6472, -15281, -9692, -4061, -9441, -9403, -2828, 1887, 341, -946, -684, 6653, 4290, 7090, 1454, -1448, -2414, 4001, 3730, 2356, -1265, 99, 4647, 2851, -1830, -2282, 2680, 2905, 5803, 182, -1798, -1935, 228, -426, 1042, 1832, 2060, -997, -1663, -6347, -3570, 1670, -3872, -2564, 5011, 10375, 10627, 2517, 259, -3934, -5310, -7770, -8927, -5218, -5054, -3945, -366, 4876, 11820, 5313, -2579, -5322, -3919, -1987, -7628, -8620, -9008, -14226, -9081, -6845, -9095, -17561, -19717, -17366, -10330, 958, 8665, 7456, 6487, 2229, -519, -7498, -12388, -3491, -2154, -1382, 2063, 10211, 11167, 6348, 5937, 6585, 6035, 627, -1026, 1829, 5088, -52, -8013, -7118, -6796, -3591, -8913, -14876, -15657, -19283]
14925a9283K086L973K440L662M209N668k310j213K64K687K541j598l692m127k729
14910g422L321O10l525J274q607l040N923J2700K266l803n009K357M793O548N967
14895A4353l127j519n559n483p106N82J1678K670k617L485K380m348k907L22J685
14880D489j970k191J896m313p845j067N467Q750k391j027j287m757l768J491K75
14865h248J229O909R262j642M545j397j0730M448L170j629n457p322j789L300
14851e351M59J99k647p48M930j113n253L471L673K847M467k388j16p137n175N051
14835d831Q418L878j517p106n268M383N768L139k153m559q19n385K240J187l511
14820f136m67l462j798N390n094l459m68L701Q201Q767M388r471o100O551j978
$$ y = [-19283, -17197, -13224, -10784, -7122, -2913, 2755, 445, -768, -504, 2183, 4724, 3126, -566, -4693, -7422, -4101, -3491, -7016, -5742, -14349, -17389, -11466, 1234, 3500, -303, -5312, -2955, 1838, 8386, 14353, 11226, 9707, 4148, -1335, -8441, -7859, 3819, 6489, 3872, 7357, 9737, 5389, 2482, 2804, 4489, 2519, 328, 2224, -2089, -9934, -11001, -5534, 3216, 825, -202, -1489, -6246, -10014, -8523, -8248, -7019, -110, 9152, 7510, 12055, 10658, -72, 4376, 7546, 5917, 460, -6862, -8651, -5351, -4892, -4693, -7340, -8088, -3158, -4271, -9524, -6053, -2380, 467, 4934, 2546, 2430, -4707, -9882, -4831, 3587, 7465, 5948, -1158, -6426, -2043, 3725, 6864, 4711, 152, -667, -6052, -3812, -2625, -6136, -6603, -10065, -11863, -6473, -11567, -15026, -15494, -11793, -3592, 5175, 9563, 92, -6008, 543, -1435]
14805a435M883L980O19l349M362j365k155O125j441P54o246p326k845P10L791
14790i38L559J226M8J411l075M936M328m382k334k839L04k762j760k713L502O973
14774E484L68j350r02l130n0M083K675l846k019j503j005n068M926N853N477m453
14758E540k307p46q504m838J0297M673k32J035l603p626m410J1239P672L738p406
14743D522n58P567n435n336K616n07q434m621Q75J6K528L585N070m060O02J837
14727B67k107m331k605L469K968L459K506l380N099M698l055n994k38J861k058
14712E59o052l088N887j440L892M593K808M525q10o994j549J54J772l27m057n339
14696e466k917L978L89j058k286M80n764L548Q739k959m835j683J3054L436r947
$$ y = [-1435, 3448, 7428, 8047, 4698, 9060, 7695, 5540, 11665, 10224, 10978, 4732, -2594, -5439, -4729, -938, 2621, 3847, 3895, 5306, 2231, 7167, 11495, 7113, 4779, 1940, 2244, -518, -2278, -4991, -1489, 5484, 5852, 4502, 3600, 470, 420, 4503, 7178, 3332, 1313, -190, -1195, -6263, -1337, 4516, 9993, 5540, 3233, 2487, -6017, -10855, -558, 4115, 3883, 4918, 1315, -6311, -10721, 518, 8190, 11928, 4522, 3964, 11531, 6096, 760, 3376, 2869, -5565, -10186, -9311, -9295, -6767, -3182, 1888, -2172, -1570, 267, -1840, -6171, -8776, -5307, -2339, 1120, 3626, 246, 5345, 10043, 6988, 994, 756, 2617, 559, -5493, -8581, -2694, -4134, -242, 4351, 7159, 11684, 10874, 3880, 2331, 2485, 4257, 3930, -127, -5466, -8383, -4405, -4016, -5074, -7360, -6880, -12644, -9096, -357, -3316, -8151, -9834, 3220, 6656, -3291]
14681c291p264N725P532l670M65j022P215n694l965j283K834P347r72m321r01
14666a265J792o107l472N266K605o331l196N528K844l203L527N925n990j8Q17
14651a278N985k628R46L34l791L658Q38j2398q16K595O339K372l651k455K160
14636a790K929k546K9M580m241J777P24l355j486k626K1K586O024R142n421l520
14620B827k285j018j817m784j969Q004R102p182j2932n29J294L448M759K213M625
14605C756P972o987o582q131j202O963N221j0544m095K671J203l503O452M634
14591b172P1R09l62p923R87O587l649R457n346l240K260M015p676m631L410R805
14575B502N816o273K89n17M97M639R45p5k891m739L297M099j904l219n209m018
$$ y = [-3291, -10555, -4830, 2702, -968, -503, -1525, 5690, -4, -3969, -5252, -2418, 4929, 3957, -364, -1265, 527, -5580, -9052, -3786, -1181, -7512, -10708, -5180, -2336, -5539, -2012, 3913, -2077, -2095, -1278, 4707, 2079, 3025, 3359, -432, 3226, 4064, -8334, -9150, -6555, -216, 2156, -1495, -3950, -1790, 1139, -1407, -1378, 3202, -1039, 738, 1462, -1893, -3379, -6005, -5984, -3398, 2626, 11768, 6347, 2827, 542, -476, -2293, -7077, -9046, -1042, 8060, 878, -12054, -12583, -11289, -7841, -3082, -869, 3756, 11728, 4741, -1841, -9972, -11174, -4211, 1010, -9534, -13629, -10958, -9755, -13258, -6806, -2172, -2101, -1192, -1554, -9477, -8490, -1903, -5552, 3905, -1441, -4681, -2421, 1594, -6082, -10713, -7303, 2502, 8318, 2045, 2334, 1817, 2314, 6953, 7898, 7823, 4932, 193, 3490, 7589, 5685, 2466, -2743, -6761]
14559f761q75N576m455m703n946L602Q914J603L458k806n826k53P117L082q261
14544f534O145N362K4J327j013m309k674K233L442k660m913m314K889n551m801
14529a5347N376M907l708M839J991m09J641J576J563j582j867J254M246J569m441
14514A608j564j586k133n92l457R175L409m306k787K23q406l825P808O983j474
14499i24m175O41j728O646J626L354R501K49p342p184O891j004q369n054n58O031
14483a399q22M956j57j828j465O42N862J166j15m550m028L094K883P29m881r754
14467i667k234O167N222R722n08n51J084K07L231L197n996o139j423L015l246
14452B081k461l70J40m418J2261Q019p397r087J053P432J257m229o605m335M091
$$ y = [-6761, -7636, -2060, -6515, -11218, -17164, -13562, -4648, -3045, 413, -2393, -8219, -8472, -1355, 1727, -6534, -389, 4973, 4997, 6324, 5311, 1002, -1672, 561, 4003, 1343, -3570, -7884, -4995, -10546, -15347, -9971, -5064, -8772, -3933, -1942, -2351, -710, 866, 2429, 847, -1020, 234, 4480, 6049, 1608, 44, -1542, -3675, -4267, -7724, 1451, 4860, 554, -2233, -2010, -10416, -14241, -6433, 550, -924, -5099, -4458, -6186, 460, 2086, 5440, 14941, 15190, 7848, 664, 7555, 6551, -1818, -6872, -7430, -1399, -2221, 2735, 2578, 750, -715, -73, 5789, 6955, 6840, 2290, -1738, 1356, 4239, 4968, 87, -9667, -11901, -5734, -512, 9210, 8702, 8151, 9235, 9442, 12673, 15870, 9874, 3735, 2312, 5327, 2081, -380, -750, -610, -5028, 7233, 15252, 7855, -1232, -179, 7253, 8510, 4281, -2324, -6659, -2568]
14437b568j614k275k643P638J0351O33L367J55J50j0451j0523L451Q620j066n465
14422b240K851O617j11n909l984o950L962J665K285K951L666Q43P08O38l060m366
14406d34j507j596J304N85M883M688r483l431O246J0532K592n988m430n992K681
14391F50J882K554O69m353l534L973L42K822O696m192R48l191n293L127O97j183
14375B614N44L610J703R36L807M222j0007o541K900J44Q10M814j612j585P06M814
14359A1879m574o943k695J431j086r96l76o738P002K408M265o282n07K825O384
14344E997k400j273J040j595M224Q118N498j783L898M69n795k003M532K438j1274
14329A0091m436J681L196k14Q91l265k257K606K933N491k418Q4Q95l078m404m245
$$ y = [-2568, -4182, -6457, -9100, -1462, 8889, 9522, 12889, 13044, 13194, 2743, -7780, -4329, 4291, 3225, -2240, 611, 7228, 7117, 1208, -2776, -9726, -5764, -4099, -1814, 1137, 4803, 5646, 6354, 6992, 3932, -434, -1941, -3537, -2233, -1648, 3235, 7923, -1560, -4991, 1255, 11787, 14379, 8391, 3961, -2031, 650, 2532, 5086, 5755, 1402, -2132, 1841, 2183, 5005, 11701, 7509, 8457, 5266, -27, 3100, 3797, 2614, 3158, 6768, 8471, 9407, 13214, 17436, 7429, 888, 3788, 3932, 4742, 9556, 7944, 6359, 7065, 11879, 7305, 362, -2333, -902, -1988, -2984, -3360, -10098, -3096, -688, 3577, -2705, -3212, -387, 5997, 3597, 2324, 3364, 1769, 5993, 14111, 19609, 17826, 21724, 22193, 16398, 14395, 18927, 21365, 10091, 5655, 7336, 10532, 10318, 11209, 7944, 5687, 8293, 11226, 16717, 14299, 14383, 15278, 12200, 7796, 3551]
14313C551j729k522K910L400n84K619l69J025l3k410L526k491l499m207k341Q128
14297D974P11q063k782J031q502k955K127K032K544m613K001Q467K696m382l927
14282h641j196Q64J019M018M338L399j624l341K906l193k788K894M532M244N074
14267A2505n985n109J904l088k040L871j386n757J928L110J713k677J645K472
14253C106p883r667N120J941Q98Q72P781J689r347p571K631k103K381j655L380
14238h427P607k8J473K13J303J699O05o128m628L985O768k649k164k620j275n000
14222i266o10P10R755P592q041l200L568J288k181p78J279M715r89p404n031J090
14206g503M847K285J627p385MO067N033L59j143m127M048P69j022J09N171J647
$$ y = [3551, 1822, -700, 2210, 5610, 5026, 7645, 7276, 8301, 8268, 5858, 9384, 6893, 3394, -813, -3154, 4974, 5685, -2378, -5160, -4129, -12631, -15586, -13459, -11427, -8883, -13496, -11495, -3028, -332, -4714, -8641, -9837, -8973, -7954, -3936, 402, 3801, 2177, -1164, 1742, -1451, -4239, -1345, 3187, 7431, 12505, 6520, 1411, 3315, 227, -1813, 2058, 672, -5085, -3157, -47, 1666, -1011, 634, 3106, -4777, -14444, -9324, -7383, -6485, -5613, 2168, 3857, -5490, -13061, -10430, -12533, -10152, -11807, -8427, -820, -848, 625, 838, 2141, 3840, 4445, -1683, -6311, -2326, 4442, 1793, -371, -2991, -4266, -9266, -9876, -9166, 589, 8181, 140, -3060, 508, 1796, -385, -1163, 116, 4831, 3842, -3562, -8593, -7503, -2656, -371, 1256, -6129, -6125, -58, 4975, 5334, 4191, 64, 4112, 4881, 3859, 3968, 9139, 10786]
14190A0786k005r98l355o311m449P46k840k37K655O315N523K626L108j845p425
14175B294o346K15L013M420L145m441J833L607l010rK797k717L989L717M493o277
14159A0723p532l446l544l573J324n571M403J047l176O477N901M455L617j1583
14145d78J630M256k232m732L306j044K69M491J202l738o77l295l018L190O41N673
14129E444J336J189l479K86q865K573N73j0608M194N481k267k061j349l481p91
14114a1825O797L36L264N072N21j0758k364L470L406k025K55K522M32M45P300
14099F848N963k802j919L857R22l424l259n46j798K452L078K398J51n35l210J386
14083I562L70l862K656L588m84n087o220j527N108N228m695k260P235n272J68
$$ y = [10786, 8781, 7783, 4428, -1883, -6332, -5586, -8426, -8663, -6008, 307, 5830, 8456, 11564, 9719, 2294, -4052, -3837, -824, 3596, 6741, 2300, 4133, 7740, 4730, 4721, 7518, 4801, 8790, 12507, 17000, 10723, 3191, -255, -3799, -7372, -6048, -11619, -7216, -6169, -9345, -2868, 3033, 7488, 11105, -478, 1152, 5408, 3176, -1556, 1750, 706, 975, 5466, 6668, 2930, 2253, -1042, -4060, -870, -229, 5444, 6780, 7969, 4490, 4776, -4089, -1516, -943, -11551, -7357, -1876, -4143, -6204, -7553, -11034, -11825, -5028, -4692, -1428, 3644, 4165, -6593, -8957, -5487, -2081, -4106, -3851, -1329, -897, -452, 6848, 12811, 10009, 8090, 11947, 12869, 9445, 6186, 5640, 3842, 6294, 9372, 11770, 11921, 11386, 8176, 9562, 9932, 6070, 8726, 12314, 11830, 6743, 523, -1004, 4104, 9332, 4637, 2377, 9612, 4340, 4508]
14068D508K526k378o022J879n97K500k057J507O619P007r29j1021k44L868M442
14053A1608n149m804L100p74N71N483o89j5k466j0912k418M765Q420P303J655
14038A5678J0461K737p108K611n64m878k902o714m665N49N026K507q535m729p959
14023h485K601P173J625K019l66Q240l59p286k013J968K567o636j632L89L050
14008B855l80n52j660j505q07J160m352j223K468j672J068L489l556L092L39j1104
13992a2340j339O181R80N049q47k204M57K525L19M830O896j333k964N502R51n293
13976G370m167l751K544O074R30j126n326M885M961K583j0867K397R605m964l693
13961G455K613o329j256l070l663P77K125K102l753L488J273j763l802K996K139
$$ y = [4508, 7034, 4656, -1366, 513, -84, 2416, 359, 1866, 8485, 15492, 14563, 3542, 3298, 7166, 11608, 6459, 1655, 4755, 3981, 4552, 10035, 9346, 9331, 6865, -4047, -6465, -1700, 6720, 14023, 15678, 26139, 28876, 21768, 24379, 23815, 18937, 16035, 9321, 4656, 5205, 10231, 12738, 4203, -526, -8485, -5884, 1289, 2914, 4933, 4567, 12807, 12448, 5162, 3149, 5117, 7684, 1048, -584, -195, 2855, 2475, 1923, 263, -1242, -2049, -889, -5241, -6464, -3996, -5668, -4600, -1111, -4667, -1575, -1236, -12340, -13679, -7498, -6518, -1469, -2316, -4520, -4063, -1538, -1219, 3611, 10507, 9174, 6210, 11712, 12663, 7370, 3203, -548, 1996, 8070, 9000, 7874, 2548, 7433, 12394, 14977, 4110, 6507, 16112, 11148, 7455, 10068, 3739, 2483, -587, -4250, -3473, -1348, 754, -2999, 489, 1762, -1, -3803, -807, 1332]
13946A332p825P012M722J440M554J037r553m475K546K337J127m243l384j720M336
13931g57J39k088N943M087J74K504O282Q47q047m932r296k989Q731N131K176r92
13915F913p16K178n579p702o057L133R693N724j687m8n0K79R97l649O704N445
13899A5578k587l950J760O400m510l551O607K105p386l699n000j707o265j649
13885g854M319j914J887L318j236j332j192K390j970k829j162K300O365p983l362
13870a0255N085K982l026R99m055j734M869K448j148N392J933j815J711k434M845
13855E797O727m311q762m450O239M465N105L052m6l05k420J543l025j650O013
13840A3972O027o479q564P042K498q993J92m45j20j267m672r448K341M550Q346
$$ y = [1332, -6493, 519, 5241, 6681, 11235, 12272, 2719, -1756, 790, 3127, 4254, 11, -3373, -5093, -757, -618, -2706, 3237, 7324, 7498, 10002, 16284, 17131, 9084, 4152, -5144, -8133, 598, 5729, 7905, 6913, 6197, 8375, 2796, -4906, -10963, -7830, 1863, 7587, 5900, 5852, 5802, 6081, 7078, 3429, 10133, 15578, 12991, 9041, 10801, 17201, 12691, 9140, 15747, 17852, 10466, 6767, 1767, 60, -6205, -7854, -3535, -5449, -3562, -244, -1480, -2812, -4004, -1614, -3584, -6413, -7575, -5275, 1090, -6893, -10255, -5170, -2188, -5214, -4215, -8270, -10004, -5135, -2687, -3835, 1557, 3490, 1675, 3386, 952, 5797, 12524, 8213, -549, -4999, 1240, 5705, 10810, 13862, 13816, 13511, 11091, 12634, 9609, 7959, 13972, 19999, 13520, 4956, 11998, 14496, 5503, 5695, 5250, 5130, 3863, -809, -10257, -7916, -3366, 4980]
13825D980j702p410R54l673J924J1665P323j47m259m673k810k333K605O442j363
13810G523p925k791N964J0489m342j788j454k857q235k086K846J607K091M790
13796C832k839l668L873m476L762J392O98J85k79K750j25O04J009k912j218o999
13780d411m889J930K423M240N230j632k16o341o721o107J746P11J258J0031K672
13765g6L865k059L333j80K049p07j235k678J091M13J572k333n49N330O118m156
13749I798o259m450l298J075M016P071J472J971n014o323N384J0638L163j401
13735A7843k687q802r53p64j885l6k611m337n154O036P145M456k045m953O422
13720G675j238L85k87oO011j975k357K604J674k325k168p164l05L158n032j266
$$ y = [4980, 3278, -4132, -3178, -6851, -4927, 6738, 14061, 13914, 9655, 4982, 2172, -161, 2444, 8886, 7523, -402, -3193, 2771, 13260, 8918, 7130, 5676, 2819, -5416, -7502, -4656, -3049, -958, 3832, 993, -2675, 1198, -3278, 484, 1876, 2574, 2759, 2480, 5230, 5105, 5709, 6718, 3806, 2588, -4411, -9300, -7370, -4947, -707, 4523, 2891, 2675, -3666, -10387, -16494, -14748, -14037, -12779, -2748, -76, 3789, 1730, 5063, 4883, 6932, 6225, 4990, 2312, 3403, 3816, 5388, 3055, 2506, 7836, 13954, 9798, 3539, -911, -4209, -3134, 882, 7953, 9425, 11396, 6382, 59, 5443, 16081, 19244, 17843, 15156, 6354, 5401, 4637, 2752, 2716, 105, -4232, -9386, -3350, 3795, 8251, 6206, 1253, 7675, 6437, 6822, 6535, 6529, 12540, 10565, 8208, 10812, 12486, 10161, 7993, 829, 524, 3682, -1350, -2616]
13704b616N914M336l151j225j646M82L63P875o855q094r50P638M598n866O836
13689G639L778r905O90R06n71L955L407j135L012m868L87r69O154k11k53k608
13673I408n300K563K182j459K238n949n126K489r159k361Q658K928k405O022J111
13658E840j400r351m084j558K478M67N269m36J928K209L424J526J510J955k684
13643G093m165l449J294l523j495K672N878M716n481m182P987k814K322L912m02
13628A0363M017k320l268j566K413j564n85J563j036l973j342Q459P913m960k082
13613A2032k168j930p875k943J593N285L057j877j387o079q180l352K089J0181
13599a554P904p370L653L477j361j902L562J802o493n979L325O285j171k588N142
$$ y = [-2616, 3298, 7634, 4483, 3258, 1612, 2094, 2457, 10332, 3477, -4617, -5567, 2071, 6669, 803, 7639, 11417, 1512, 2202, 3108, 2537, 6492, 9899, 8764, 11776, 6908, 7295, 6326, 12480, 12269, 12016, 9408, 4108, 6671, 8853, 7394, 9632, 3683, -1443, 1046, -8113, -10474, -1816, 1112, -1293, 4729, 5840, 4440, -4911, -8995, -10553, -8075, -7608, -2339, -2775, -847, 1362, 4786, 6312, 7822, 9777, 7093, 2928, -521, 773, -2750, -4245, -1573, 4305, 9021, 3540, -642, 7345, 4531, 6853, 10765, 10363, 14380, 12060, 8792, 7226, 9639, 8075, 7490, 9053, 8017, 4044, 2702, 11161, 19074, 14114, 12032, 9864, 7934, 59, -2884, -1291, 3994, 7051, 5174, 3787, -2292, -10472, -13824, -11735, -1554, 6350, -1020, 2633, 6110, 4749, 2847, 6409, 8211, 1718, -4261, -936, 5349, 4178, 1590, 6732]
13584F732L440k283J686r17K578o660l397m089J979Q039O359K102k93P435p685
13569A5026n710O101K761p115o85j573p365l871P696M434m458j10M112j266p823
13554A54j326P457M869n730N165P288Lk57q992J671N374N744l282r173p278L000
13538D687M131j800Q570p291R16R510m444r279p617K067O934R645m16J616N498
13523B2727Q4k897j4930k648M649m635o044K491Q205J887n061J437l323J722L602
13508G266L177J564K002j731o904j330O981K221n034m717j016M564L007j305k195
13493F550K675o25J161O049L592M179n306m777n347m976j422K378N552M936j160
13478A3459j384m427o108M49p63R51J033L694j283j205L211P004n624k322J263
$$ y = [6732, 10172, 7889, 9575, 8658, 11236, 4576, 1179, -2910, -931, 7108, 13467, 15569, 15276, 22711, 15026, 9316, 15417, 18178, 11063, 10378, 8805, 1440, -2431, 5265, 9699, 5241, 5131, 9243, 7977, 154, -1172, 6285, 11154, 5424, 10589, 17877, 17880, 17623, 8631, 10302, 15676, 21420, 18138, 8965, 1687, 4687, 8818, 7018, 15588, 8297, 9213, 18723, 14279, 5000, -2617, -550, 6384, 16029, 15613, 17229, 22727, 22811, 19914, 4984, 2336, 6985, 2350, -3694, -1203, 7002, 8889, 3828, 5265, 1942, 3664, 7266, 10443, 12007, 14009, 12278, 5374, 4044, 11025, 13246, 8212, 3495, 2479, 7043, 10050, 8745, 6550, 9225, 8600, 9761, 15810, 19402, 23581, 18275, 13498, 8151, 3175, 1753, 4131, 9683, 14619, 13459, 12075, 7648, 1540, 1989, 1226, 2177, 3210, 6904, 5621, 4416, 7627, 14631, 9007, 6685, 7948]
13463G948p232K283M652l15k636n150M860M999k622l222K386R86M191n76O06r022
13447B136k521O609J95J596n522m170p9N630O442l350j722k391k41p96M993M112
13431A0921n799o265k343m95N735J023l168o293p20K475L709J546P792N938J104
13416A5160l49p08q893j282J700P18l321P779o034M055J0426k004j364o62K514
13401A7735N000m635p279Q23k66k193M37K591j669r81M756r32k704J247k651j0173
13385h94p15n047L644K987k466M999M853n772l162M492N836N069m500P64k085
13370H003K466j738k45J785m291L359J126J003P048o075P57m307J204J117m662
13355F550j918j455N168K032J419j875L4k079L873J240p339J18R469M079k685
$$ y = [7948, 716, 2999, 7651, 7336, 4700, -450, 4410, 9409, 6787, 3565, 5951, 6937, 11128, 10552, 11158, 2136, -385, 6224, 6419, 8015, 2493, -1677, -1756, 3874, 10316, 6966, 5244, 2853, 2612, 1816, 6809, 10921, 5122, -1143, -3486, -3981, 1754, 2777, -391, -6684, -7404, -4929, -1220, 326, 8118, 14056, 15160, 14811, 14103, 5210, 3928, 5628, 6346, 3025, 10804, 4770, 8825, 19251, 17247, 15883, 15221, 17735, 22735, 18100, 10821, 11644, 11378, 9185, 9622, 12213, 10544, 9563, 14319, 13387, 10683, 11930, 9279, -894, -1609, -6656, -3012, -25, -2491, 2508, 7361, 1589, -1573, 2919, 8755, 13824, 9324, 10088, 8003, 10469, 8731, 8486, 10271, 5980, 9339, 10465, 11468, 18516, 12441, 13198, 8891, 10095, 11212, 6550, 4632, 3177, 8345, 10377, 11796, 9921, 9955, 7876, 11749, 12989, 5650, 5768, 15237, 19316, 16631]
13340A6631k8j1798k969P226O427J792Q28l13q605j392P007Q637l153r500q849
13325A941l422O10J5313N921m207L731L398r709p722P57J869N076K221M621m78
13310A9920o547j503j002O128N225l869n257M104k512J505L387J049k130p590
13296A0908j0111K358J0418M759j468m518M023J079q21L28Q298J539o419l482
13282A6891k763O489N055n919p210l814p24r85K855O93k744l7L358K730L477M43
13266A7795l154M826L240l480p278n042K591M784J200q10J919m043M474O989K79
13251B4290L849N43p054l238O379l138j345M010k244q190j151R2N760p108n645
13236E810L207O926l116L944K044k225k3m442M410L715J500k759l326L411k946
$$ y = [16631, 16603, 4805, 1836, 9062, 15489, 17281, 18109, 17796, 9191, 7799, 14806, 23443, 20290, 10790, 1941, -1481, -871, 14442, 20363, 16156, 19887, 23285, 13576, 5854, 6611, 8480, 13556, 15777, 20398, 19920, 13373, 11870, 10868, 16996, 22221, 18352, 13095, 17199, 14687, 16192, 19579, 20628, 18498, 10908, 797, 3155, 13573, 18332, 16864, 12346, 16369, 17448, 16627, 16955, 25253, 26792, 20373, 16891, 14128, 20617, 25672, 19753, 12543, 8729, 8005, 7020, 9875, 10568, 7824, 7787, 11145, 13875, 17352, 17795, 14641, 19467, 22707, 19227, 11949, 6907, 9498, 14282, 15482, 14672, 16591, 12548, 17022, 24011, 24290, 28139, 28682, 21628, 18390, 24769, 21631, 20286, 24296, 22052, 13862, 12711, 12803, 18563, 11455, 5810, 9017, 15943, 12827, 16771, 18815, 16590, 16567, 12125, 16535, 20250, 21750, 18991, 15665, 19076, 16130]
13221A6130n080j916J695N666N646M11J173J341O327p547n233p73N136J185l329
13206B0832l5K592k240m810r38L351j424N22j027j118O676L739m821j313M75j212
13190A9249K213L633L309j0733n320L961R7l454n75J645L22M570k391k918L07
13175A3915P05J773k063J2249P659l830j196j262m736j403o80o813J137J0625
13161B6080M253M604np604l993M764k318o531o230Q56L273m43k826O330P242m680
13145B2772k803n651r65j734P436N104L145N753k264q67m178q270n704N046P866
13130B4686J701l861n97L030J970m672J159m938j992N118M842m892j652r66m562
13115A4374Q028N840j088n262O90R326m468j440Q791K676m180l720M307L057k89
$$ y = [16130, 11050, 9134, 10829, 16495, 22141, 22552, 23725, 25066, 31393, 23846, 18613, 17840, 22976, 24161, 20832, 20797, 23389, 21149, 16339, 15401, 18752, 17328, 17850, 16823, 15705, 22381, 26120, 21299, 19986, 20461, 19249, 21462, 25095, 28404, 17671, 12351, 16312, 16409, 12955, 12380, 14025, 14347, 18917, 16526, 13608, 13915, 14620, 16393, 14330, 26579, 34238, 30408, 29212, 27950, 23214, 21811, 21131, 14318, 15455, 26080, 30333, 34937, 34932, 27328, 23335, 28099, 25781, 19250, 13020, 13876, 17149, 16706, 13880, 20210, 27452, 22772, 19969, 14318, 13353, 11619, 19055, 24159, 27304, 33057, 30793, 29926, 25748, 17478, 11774, 16820, 24686, 26387, 22526, 21929, 24959, 26929, 22257, 23416, 18478, 16486, 21604, 26446, 21554, 19902, 18936, 14374, 22402, 28242, 27154, 21892, 22582, 31908, 27440, 26000, 34791, 37467, 33287, 29567, 33874, 36931, 36642]
13100C6642o827l160l252j918j821m504P30J1683R627m832m023l593j032N888
13086B9608l358n340O052J049k46q04J171L696K769n192J883P451k673o189k078
13071B7799l779L491J959N42M858q59k864L163k896r612p343J060P058K928Q339
13056C3844p152J245Q482n582n770O155m239o187l568L875P129q482o208R58Q08
13041A5308R516N284j395q6L470m479L15Q03J096J636l533J97J222L277j864r19
13025B9848n135o645m111J067J0074K815r41M484j163J63l099K92l391J69J681
13010B6108l542n029k72o242O0L341N266L333K97K744L102j04l86m064m032L765
12994B4345L21l245K861P57K063K715j548k305P164k255Q65n009k529P466L298
$$ y = [36642, 29815, 26655, 23403, 21485, 19664, 15160, 15890, 27573, 37200, 32368, 28345, 24752, 23720, 29608, 26250, 20910, 26962, 28011, 27765, 26961, 28132, 31828, 34597, 29405, 31288, 38739, 36066, 29877, 27799, 24020, 27511, 29470, 30012, 34870, 34011, 31147, 34310, 31414, 21802, 14459, 15519, 22577, 25505, 33844, 26692, 27937, 36419, 30837, 25067, 31222, 26983, 20796, 17228, 21103, 28232, 19750, 13542, 14500, 15308, 24824, 30108, 28713, 28627, 32097, 27618, 27933, 28736, 29832, 31468, 27935, 28132, 29354, 32631, 30767, 29848, 24713, 18068, 13957, 15024, 25098, 27913, 26972, 31456, 30293, 30456, 27357, 27649, 24258, 24427, 26108, 22566, 17537, 17265, 11023, 11083, 14424, 19690, 23023, 23320, 26064, 29166, 29062, 28676, 24612, 20580, 24345, 24666, 21421, 24282, 25039, 27102, 29817, 28269, 25964, 33128, 30873, 31738, 26729, 24200, 31666, 34964]
12979C4964L339j78r235j1261k60o65L653M688N96N592L648q826l811K09j620
12964B0833L382M796K271M715q23L672M754K36n287k153K43k470j981M903N078
12949D2169l860l985j096j167m851j702J871P35j032L034M236m746l288k830j332
12934B2156K89K617K544M77J132L989L506K273q870J01N390N81j730M610p91m711
12918C3563L86M483j649P63K31n030j072k048n402L683O415K806O164l806o029
12903C3458L088j322l840j761M52K338K768L463l608o664j2394n691K089N602
12889A7978R955K847L406O822M427r41m327l251J401M234n258n328j511L277L836
12874C7567M065m243M198J718K02N224m823n282J121N596J970o908j0481K534
$$ y = [34964, 38303, 38125, 28890, 17629, 17369, 16704, 20357, 25045, 25641, 31233, 34881, 26055, 22244, 22453, 20833, 24215, 29011, 31282, 35997, 35174, 38846, 43600, 43836, 38549, 36396, 36639, 34169, 32188, 37091, 42169, 38309, 34324, 33228, 32061, 27210, 25508, 27379, 28114, 27082, 30116, 34352, 29606, 26318, 23488, 22156, 22445, 25062, 27606, 28083, 29215, 33204, 36710, 38983, 30113, 30214, 35604, 36185, 34455, 39065, 38274, 33563, 33949, 38432, 36783, 37546, 37777, 32747, 31675, 29627, 24225, 27908, 34323, 37129, 43293, 39487, 33458, 36546, 35224, 31384, 29623, 30075, 32413, 35181, 38644, 35036, 28372, 15978, 10287, 12376, 17978, 27933, 30780, 34186, 41008, 45435, 44494, 40167, 36916, 38317, 42551, 37293, 31965, 30454, 33731, 37567, 41632, 37389, 41587, 43305, 43507, 48731, 43908, 38626, 39747, 45343, 47313, 40405, 29924, 32458]
12860C2458L814o220l161j495j58N264J916j984M018K528j127J316m252k257J120
12845C1780R540O82j993m572p140l472K415M034L525j96M846J776M69o203o510
12830B8981P208P588l542L157k93l36M647K502n395k353l854l146p29M909L722
12815D3066K407P677O88l151l214n466n290O793L562O24r8N87N933L34o406p358
12799D0688N054P50M780n47n773J130J514P43N453L242l63O37N15N947O062K247
12783G2079l945p802j0805l807n77N116Q02j537m80K756K794j493K356j449r498
12768D4510p047l860M028J2962O143K267j548J017K393k565k941k092N69L029
12754E6865q12R38m102k556k886m75K478P801L969m00N97M980P395k691n028r917
$$ y = [32458, 36272, 30052, 26891, 25396, 25238, 30502, 32418, 30434, 34452, 36980, 35853, 37169, 32917, 30660, 31780, 41320, 42002, 40009, 35437, 28297, 24825, 27240, 31274, 34799, 34603, 39449, 41225, 41694, 35491, 28981, 36189, 43777, 40235, 43392, 43099, 42763, 47410, 49912, 44517, 42164, 38310, 35164, 34435, 39344, 43066, 45473, 53150, 53838, 50687, 47473, 42007, 36717, 43510, 47072, 47696, 47598, 48185, 54118, 54452, 48046, 40688, 45742, 46492, 51272, 50725, 44952, 46082, 47596, 48339, 53792, 57034, 56671, 57308, 57823, 63770, 69832, 72079, 68134, 60332, 49527, 45720, 45143, 50259, 51061, 49524, 49044, 51800, 54594, 53101, 55457, 54008, 44510, 37463, 33603, 37631, 50593, 56736, 59003, 57455, 58472, 60865, 58300, 55359, 53267, 53836, 56865, 56053, 56991, 52889, 50333, 47447, 46972, 49450, 57251, 61220, 60820, 61417, 66397, 73792, 71101, 66073, 56156]
12738E6156J339M671m692L969p30j683j139J933m470j313n66o676K149L086m237
12723D7797K603J0251O609j162l725k553m53o583J766N271k333j000J0632j23
12709F6997n310k113j638m23P303l98J952J954n927m953l23J308N822M35k710
12694F1976j196M660N407m528l949Q17K323N68k295o992N410J972M715J457j06
12679G0239m091Q49l915l928L56K111N438K060j2921p208L555N771K465J235l877
12664E8139j681J3644R275k4q023o609N206K154K275j538J466n651j441J611k720
12649F6083l332O558M342M232l753M77N095M4j868j985n48l630P71r04L318J194
12633G6094M842k505p796p49O270N195J991J107j570L870R6o832k415R12J33j53
$$ y = [56156, 57495, 62166, 57474, 61443, 60713, 59030, 57891, 59824, 55354, 54041, 53475, 46799, 48948, 52034, 47797, 50400, 60651, 67260, 66098, 62373, 59820, 59367, 52784, 54550, 59821, 57488, 56488, 67120, 66997, 61687, 59574, 57936, 57513, 64816, 64418, 66370, 68324, 62397, 57444, 57121, 58429, 64251, 64686, 61976, 60780, 65440, 70847, 66319, 62370, 63187, 65510, 66078, 63783, 56791, 62201, 64173, 68888, 70345, 70239, 66148, 66997, 63082, 59154, 59510, 61621, 67059, 69119, 56198, 48990, 52545, 58316, 60781, 62016, 58139, 56458, 70102, 79377, 79353, 71330, 64721, 69927, 72081, 74356, 72818, 74284, 68633, 67192, 68803, 66083, 62751, 69309, 73651, 77883, 74130, 74607, 79702, 79746, 77878, 75893, 75345, 71715, 72486, 71582, 74900, 76094, 80936, 78431, 70635, 69886, 76156, 81351, 83342, 84449, 82879, 86749, 86845, 80013, 77598, 78510, 78643, 78490]
12617G8490n814n18L348nK334Q692M279M068r90q366k970J050l334K0n878K021
12601G6427L555j462L068K643M834O239J360J75P481j21p777L746j232o499k538
12586H9899n382L747J768J297j326R233n03l779p427j802J102P208P602J976p270
12571I6343p308K097O336M025n020O60P517N671k704N060M032j879j239J210p10
12556A14091j0234k120m544j333l402J299Q506k87p620O799M053K009J504m018
12542A04703K365j776J496O470m264q180m179M68j322r73Q860Q844r51o469j021
12527A04071K064K529K821j73M978l377r558L355P542j522j200L023M7N668P808
12512A28076n11j965j789m21m950n497J878M885P683N991J672k807l919Q093M874
$$ y = [78490, 72676, 72158, 75506, 75501, 77835, 86527, 90806, 94874, 93884, 85518, 82548, 83598, 80264, 80284, 74406, 76427, 79982, 78520, 81588, 84231, 89065, 95304, 96664, 96839, 104320, 104199, 96422, 100168, 98936, 92437, 89899, 84517, 88264, 90032, 91329, 90003, 99236, 98733, 94954, 87527, 85725, 86827, 94035, 101637, 103613, 96343, 89035, 91132, 97468, 101493, 96473, 97133, 104650, 110321, 107617, 112677, 116709, 114830, 113591, 114801, 114091, 103857, 101737, 97193, 95860, 92458, 93757, 102263, 101976, 94356, 101155, 105208, 107217, 108721, 104703, 107068, 105292, 106788, 113258, 108994, 100814, 96635, 97103, 95781, 94808, 103668, 112512, 111561, 105092, 104071, 106135, 108664, 111485, 111312, 116290, 112913, 103355, 106710, 114252, 112730, 111530, 114553, 114600, 120268, 128076, 127565, 125600, 123811, 123390, 118440, 112943, 114821, 119706, 127389, 133380, 135052, 132245, 128326, 136419, 141293]
12497A41293m317r708k044M623P707K959Q32m643m233m820N540J527L52j442k383
12482A31243J851L845R600o365m688N240M640j359J603L276l561o471m21K703
12468A41136q140m219N708N373P637Q083K761q885l292J889M019q590L08K409
12454A46197l565o046P242O146K639N424j888j398k902n89L258N994M510J348
12440A66370K726n073j768n458p437M380J0773o516l60P870P455k232L086l9K640
12425A76417R06j573K511k980j567K367l810l375J058M460k629L72L319m503j013
12410A69960J345L1M021N375M175L296l426n200N35J0322M723N863J290l936l081
12395A95293p82Q31N239l805j011J215L950K95j924l35R05rN26P013L737l140
$$ y = [141293, 136976, 127268, 125224, 129847, 137554, 140513, 141345, 136702, 132469, 127649, 133189, 134716, 135068, 133626, 131243, 133094, 136939, 146539, 140174, 135486, 140726, 145366, 144007, 145610, 148886, 145325, 138854, 138433, 141136, 132996, 128777, 134485, 139858, 147495, 155578, 158339, 149454, 146162, 148051, 152070, 143480, 143788, 146197, 142632, 136586, 143828, 149974, 152613, 158037, 156149, 154751, 151849, 151260, 154518, 160512, 165022, 166370, 169096, 164023, 162255, 156797, 149360, 153740, 164513, 157997, 157637, 165507, 172962, 170730, 173816, 173777, 176417, 177323, 175750, 178261, 175281, 173714, 176081, 172271, 168896, 169954, 174414, 171785, 172157, 175476, 170973, 169960, 171305, 171336, 175357, 180732, 184907, 188203, 184777, 179577, 180112, 190434, 195157, 201020, 202310, 198374, 195293, 194511, 195342, 200581, 196776, 195765, 196980, 200930, 201225, 199301, 198966, 199871, 199862, 200388, 207401, 211138, 207998]
12379B07998J465k686O506K790K443N380l845n421J421l550P077Q721J777m47
12365B29629o980K912Q68N792p50n823p621P465Q453m30J313o3J927M55M679j569
12349B40257m07O524l779l440L712J485J69L503M758Q954O729r608o832P005J0808
12334B69838J2544n033j2097l222j373L717l816l330N607R908N847K625K093j479
12320B81829l598O144K766O414J652J473l527j548j135Q00K831L38R862J0301
12306C14602l493o997N51M855L718P423N930L422L338n157l869N3k511J2153N198
12291C39216j066k337p411N22j180n987N941R042j942n399N643J1215P882L657
12277C57796N444k230k694k117M393J2925J501p10K371r62N628M927l554n931
$$ y = [207998, 209463, 206777, 213283, 216073, 218516, 223896, 220051, 214630, 216051, 212501, 219578, 228299, 230076, 229629, 222649, 225561, 226429, 232221, 231471, 225648, 218027, 225492, 233945, 233515, 234828, 234765, 236692, 237147, 241826, 240257, 239850, 246374, 242595, 239155, 242867, 244352, 244521, 248024, 252782, 261736, 268465, 258857, 252025, 259030, 269838, 282382, 277349, 265252, 262030, 260657, 264374, 260558, 257228, 262835, 272743, 278590, 281215, 283308, 281829, 278231, 284375, 287141, 293555, 295207, 296680, 293153, 291605, 290470, 291270, 294101, 294439, 304301, 314602, 311109, 304112, 304663, 309518, 313236, 320659, 326589, 330011, 333349, 328192, 324323, 324376, 321865, 334018, 339216, 338150, 335813, 328402, 328924, 327744, 321757, 327698, 336740, 334798, 329399, 335042, 346257, 354139, 357796, 363240, 361010, 358316, 356199, 360592, 373517, 375018, 374308, 376679, 375717, 381345, 386272, 382718, 376787]
12263C76787M375Q951N784j95Q269L597p33M975M908N352j788j427J285L142P739
12248D31021M561L344J436j0768O864Q570N400N05N635N957j981N686J3749O760
12234D86739k894p378P435J0299O971Q719M242m097K265N894L680N631Q845R883
12220E46234J794p21j11L423L298L696R932M932K727O868M992M476N885O489J670
12205F05584l361Q386J0601J0202J563L123O744j28N935R302R267N719o59L49
12191F72627L048L720N899M546J1366J0362K773N140K139N635Q942L258J2353
12178G51808Q244K512J062k866J511Q845O971M134P903J8156J3549P041k082J221
12164H28009J6292J1304N967J4330Q523P688R698J0125Q435O608N116P435J1589
$$ y = [376787, 381162, 390113, 395897, 395702, 403971, 407568, 406835, 411810, 416718, 422070, 420282, 418855, 420140, 423282, 431021, 435582, 438926, 440362, 429594, 436458, 445028, 450428, 450933, 456568, 462525, 460544, 466230, 479979, 486739, 483845, 476467, 483902, 494201, 501172, 509891, 514133, 510036, 512301, 518195, 521875, 527506, 536351, 546234, 548028, 547307, 547196, 550619, 553917, 557613, 567545, 572477, 575204, 582072, 587064, 591540, 597425, 603914, 605584, 602223, 610609, 621210, 631412, 632975, 636098, 642842, 642714, 648649, 657951, 667218, 672937, 672278, 672627, 675675, 679395, 685294, 689840, 701206, 711568, 714341, 719481, 721620, 727255, 736197, 739455, 751808, 760052, 762564, 763626, 760760, 762271, 771116, 778087, 782221, 790124, 808280, 821829, 828870, 826788, 828009, 844301, 855605, 861572, 875902, 884425, 892113, 901811, 911936, 920371, 926979, 932095, 939530, 951119]
12151I51119P645O117J0838J1201J4966Q910J025Q083J2361J0258Q305J4417J4450
12138A079695P089J3553J9402J2588J5119J8368P288J0164P753O919K4958K0981
12126A243877J5425R661O613J7214J8801J5857J6542Q404J1646J9111J6225J7737
12114A417113J8590J5752K2648J9683J9675J2076J8541K0757J4751K3825K2013
12103A625424J3981J6058L3398L6483K2235K3930K2817K0593K9673L2292K0981
12092A897865K8695L3901L1585K2344K4598L2873M3319L3802K5345L2540L2807
12081B239674L1961L8694L9691M0487L8800M2492L9209L9860L9745M2358M8340
12070B681311M8374M9362M6687M7464N6393N0977N0992O0733N7591N0957N2314
$$ y = [951119, 958764, 964881, 975719, 986920, 1001886, 1010796, 1011821, 1019904, 1032265, 1042523, 1050828, 1065245, 1079695, 1086784, 1100337, 1119739, 1132327, 1147446, 1165814, 1173102, 1183266, 1191019, 1197938, 1222896, 1243877, 1259302, 1268963, 1275576, 1292790, 1311591, 1327448, 1343990, 1352394, 1364040, 1383151, 1399376, 1417113, 1435703, 1451455, 1474103, 1493786, 1513461, 1525537, 1544078, 1564835, 1579586, 1603411, 1625424, 1639405, 1655463, 1688861, 1725344, 1747579, 1771509, 1794326, 1814919, 1844592, 1876884, 1897865, 1926560, 1960461, 1992046, 2014390, 2038988, 2071861, 2115180, 2148982, 2174327, 2206867, 2239674, 2271635, 2310329, 2350020, 2390507, 2429307, 2471799, 2511008, 2550868, 2590613, 2632971, 2681311, 2729685, 2779047, 2825734, 2873198, 2929591, 2980568, 3031560, 3092293, 3149884, 3200841, 3253155]
12059C253155N9339O4770O4789N7359O2978O8338P6769P8139P6384P4606Q0039
12048D016665P8488Q1318R3789R0387Q5458Q8340R6592J06423J03257R7449J09237
12037E047403J14231J16488J20629J23268J40598J36116J37689J49603J47527
12028F233552J48997J53600J62650J75192J78581J84842J91597J95214J94320
12019G818545K11925K27996K28825K35999K51851K54047K66673K77255K79099
12010A0052215K97830L16694L26954L34767L46096L67717L77237L87341M20146
12001A3226997M35001M40518M50712M83785M96975N13247N37693N54726N71448
11992A7711102N99559O18502O38696O54337O88168P13530P21609P38442P58944
$$ y = [3253155, 3312494, 3377264, 3442053, 3499412, 3562390, 3630728, 3707497, 3785636, 3862020, 3936626, 4016665, 4095153, 4176471, 4270260, 4360647, 4446105, 4534445, 4631037, 4737460, 4840717, 4938166, 5047403, 5161634, 5278122, 5398751, 5522019, 5662617, 5798733, 5936422, 6086025, 6233552, 6382549, 6536149, 6698799, 6873991, 7052572, 7237414, 7429011, 7624225, 7818545, 8030470, 8258466, 8487291, 8723290, 8975141, 9229188, 9495861, 9773116, 10052215, 10350045, 10666739, 10993693, 11328460, 11674556, 12042273, 12419510, 12806851, 13226997, 13661998, 14102516, 14553228, 15037013, 15533988, 16047235, 16584928, 17139654, 17711102, 18310661, 18929163, 19567859, 20222196, 20910364, 21623894, 22345503, 23083945, 23842889]
11983B3842889P75280P93415Q04806Q15572Q20836Q25022Q22860Q19973Q21814
11974C1142467P96964P80821P62733P30438O86948O40612N91551N31458M81578
11965C7145570M12874L39088K63803J77644J03703K8390o6530j50706k27062k97673
11955C7729101l67369m41888n06513n59014o17814o66652o95147p39393p58115
11946C2377196p79558p94757p98297q06934q13689q04083q04404p96289p84413
11937B5194772p73233p59294p45178p29720p04520o81737o58244o44135o23890
11928A8874821o03734n89481n67339n48712n30639n07216m84468m71370m46015
11919A4125847m35833m23621m06926l89788l77234l64702l47686l35483l26715
$$ y = [23842889, 24618169, 25411584, 26216390, 27031962, 27852798, 28677820, 29500680, 30320653, 31142467, 31939431, 32720252, 33482985, 34213423, 34900371, 35540983, 36132534, 36663992, 37145570, 37558444, 37897532, 38161335, 38338979, 38442682, 38471072, 38404542, 38253836, 38026774, 37729101, 37361732, 36919844, 36413331, 35854317, 35236503, 34569851, 33874704, 33135311, 32377196, 31597638, 30802881, 30004584, 29197650, 28383961, 27579878, 26775474, 25979185, 25194772, 24421539, 23662245, 22917067, 22187347, 21482827, 20801090, 20142846, 19498711, 18874821, 18271087, 17681606, 17114267, 16565555, 16034916, 15527700, 15043232, 14571862, 14125847, 13690014, 13266393, 12859467, 12469679, 12092445, 11727743, 11380057, 11044574, 10717859]
11910A0717859l07100k93407k92884k80933k66849k53135k44976k37168k31094
11901H310313k23571k14164k01039k01168j89562j78942j81429j75073j56998
11892F588367j61617j60758j57452j41909j36345j37477j31512j25381j24524
11883E311392j21285j13125j12833j11285j04009j00630j06171r2539r4761r1192
11873D263562q5929q0334p6037q0123q3454p3099p2541p2689o5223o3950p1680
11862C438503p2029o1155n7487o3108n8298n0447n9932n2295m5021n0150m7023
11851B821558l7824m0927m9801n2708m5208l9059l6136m2542m8175m2779k8673
11840B357726k5344l2371l8512l4947l5863l0123l3579l1088k6101l0920l3570
$$ y = [10717859, 10410759, 10117352, 9824468, 9543535, 9276686, 9023551, 8778575, 8541407, 8310313, 8086742, 7872578, 7671539, 7470371, 7280809, 7101867, 6920438, 6745365, 6588367, 6426750, 6265992, 6108540, 5966631, 5830286, 5692809, 5561297, 5435916, 5311392, 5190107, 5076982, 4964149, 4852864, 4748855, 4648225, 4542054, 4449515, 4354754, 4263562, 4177633, 4097299, 4021262, 3941139, 3857685, 3784586, 3712045, 3639356, 3574133, 3510183, 3438503, 3366474, 3305319, 3247832, 3184724, 3126426, 3075979, 3016047, 2963752, 2918731, 2868581, 2821558, 2783734, 2742807, 2693006, 2640298, 2595090, 2556031, 2519895, 2477353, 2429178, 2386399, 2357726, 2332382, 2300011, 2261499, 2226552, 2190689, 2160566, 2126987, 2095899, 2069798, 2038878, 2005308]
11829B005308k6678l0066k9298k4943l0684k4813l0097k5477k3440j0521j9311
11818A729980l0149k6800j8371j7842k0264j2163k4952k6965k0053k5099j9060
11807A488262j3985j4423k5673j6886j5197j1051j8743k1225j4726j7920k1215
11796A297218j8428j7066j0299j0798j6470j6235j1601j2761r503j6100j8435
11785A139522j3732j1482m795j746j7996j9914j0774j6244j6086j5206j0119l983
11773I97445l303j0369j8261j1591o238q782o632j2449j1265l878j5462p712j3101
11760H68402p551j879l636p628j6181j2766l682o416j0295q859j1689j0785r288
11747G57747l862n975o934p080p957m393l590k084m501r870j0522l957j1178q617
$$ y = [2005308, 1978630, 1948564, 1919266, 1894323, 1863639, 1838826, 1808729, 1783252, 1759812, 1749291, 1729980, 1699831, 1673031, 1654660, 1636818, 1616554, 1604391, 1579439, 1552474, 1532421, 1507322, 1488262, 1474277, 1459854, 1434181, 1417295, 1402098, 1391047, 1372304, 1351079, 1336353, 1318433, 1297218, 1278790, 1261724, 1251425, 1240627, 1224157, 1207922, 1196321, 1183560, 1174057, 1157957, 1139522, 1125790, 1114308, 1109513, 1107767, 1089771, 1069857, 1059083, 1042839, 1026753, 1011547, 1001428, 997445, 994142, 983773, 965512, 953921, 947683, 938901, 932269, 919820, 908555, 904677, 889215, 881503, 868402, 860851, 858972, 855336, 847708, 831527, 818761, 815079, 808663, 798368, 789509, 777820, 767035, 757747, 753885, 747910, 740976, 733896, 725939, 721546, 717956, 715872, 711371, 701501, 690979, 687022, 675844, 667227]
11733F67227j600j604m114j026n345p602r263m560r482n444m32j352J97M13j0366
11718F05647n255o022j1442l045q177j444m03o192r927p585p206j351j286k976
11704E33336o364J26N80n222q604L7k186k727j0520m973j074q429p116n550k471
11689D68843J404M476n121j498K992q796m987L469p428r950l632l473L423l15
11675D39407k593p235m884n153k113N8K29J782L665j454R29n149o330o455L47
11660D05051m259p452q436M237k443n117n504L278L98j1401j3148k302J90J20
11646C53212l096m190k96m300J45k804L62l280K83N712l405j0660n331k950L882
11631C23284j955m502k115o746J77K396q221j117l440j548o197N07M10k267K209
$$ y = [667227, 665627, 664023, 659909, 658883, 653538, 645936, 636673, 632113, 622631, 617187, 616755, 615403, 615600, 616013, 605647, 600392, 594370, 582928, 579883, 571706, 570262, 569859, 563667, 553740, 546155, 538949, 537598, 536312, 533336, 526972, 527098, 527678, 522456, 513852, 513889, 511703, 508976, 498456, 493483, 492409, 483980, 476864, 471314, 468843, 470247, 474723, 469602, 468104, 471096, 462300, 457313, 460782, 453354, 443404, 439772, 436299, 439722, 439407, 436814, 429579, 424695, 419542, 417429, 417487, 417716, 419498, 423163, 421709, 422638, 417489, 411159, 404704, 405051, 400792, 393340, 384904, 389141, 386698, 381581, 376077, 379355, 379753, 368352, 355204, 352902, 353092, 353212, 350116, 345926, 345630, 341330, 341475, 338671, 339033, 335753, 336036, 341748, 338343, 327683, 322352, 319402, 323284, 321329, 316827, 314712, 307966, 308143, 310539, 302318, 301201, 297761, 296213, 290016, 290523, 290933, 288666, 290875]
11616B90875k77m898K602l331J077l019m345k805Q38o985n247l299N788j470P94
11601B66298j013K802R871j0470r999n53m495j345J816J474r827q952k833q9N576
11586B38261K147Q73K37j776o249L108Q706l248l591j545q811m551J516L39n321
11571B20095l690o97J147p682j2332P002O353L24j41J280L818M153l83K6k463
11556B16810p354r774n03K750j019K098P53j091o35k141N068K48j1850p540n518
11541A80302J451J778j869q986m114L939j614J0899m58n466L418k436l09M906
11527A81441K292l857j818J834j486m114J048l600k438J843j116j314J307l063
11513A66959o136J776R34m667m240j0304M28L91O363J841o032m144L799K932P56
$$ y = [290875, 290598, 285700, 288302, 284971, 286048, 283029, 278684, 275879, 276717, 269732, 264485, 261186, 266974, 265504, 266298, 265285, 268087, 277958, 267488, 257489, 256936, 252441, 251096, 252912, 254386, 244559, 235607, 232774, 232685, 238261, 240408, 241281, 241518, 239742, 233493, 236601, 245307, 242059, 238468, 236923, 228112, 223561, 225077, 225416, 220095, 216405, 215708, 216855, 209173, 196841, 203843, 210196, 210520, 210379, 211659, 215477, 219630, 219247, 219273, 216810, 209456, 199682, 199179, 201929, 200910, 203008, 203761, 202670, 202035, 199894, 204962, 205210, 193360, 185820, 180302, 181753, 183531, 181662, 172676, 168562, 172501, 170887, 181786, 181328, 175862, 179280, 176844, 176535, 181441, 183733, 179876, 178058, 179892, 178406, 174292, 175340, 171740, 169302, 171145, 170029, 168715, 170022, 166959, 160823, 162599, 163533, 158866, 154626, 144322, 144750, 145141, 151504, 153345, 147313, 143169, 146968, 149900, 150656]
11498A50656J120n67N00P496J177N76M693M58p24j360p606m046K235j577r819
11483A43212p039K503O142J992m769l204P127l269j1598K714Q030J258n375k573
11469A35151P50l449k002r08O705P009k804l051J57j532p006L449L27K490n043
11454A30243k427N372M691n151l339k386j01k511o06Q62M079J246l59m728J264
11439A26149M426K026m584m199K149m488j963L868L362l826K408m264o096l455
11425A11513K97l544o651J307N204M462j368l135l638m377P2k098O135L017L587
11410A10783j380l376n059j144K326k861m326P624O413J149j652o175P2J261j774
11395A01881q74k733J149N291O238N74p828Q4j172k805M155q37L512q31j755O23
$$ y = [150656, 151776, 151209, 151709, 159205, 160382, 160958, 165651, 166109, 165385, 164025, 156419, 152373, 154608, 153031, 143212, 136173, 138676, 144818, 146810, 142041, 138837, 145964, 142695, 131097, 133811, 141841, 143099, 137724, 135151, 135901, 132452, 130450, 129542, 136247, 143256, 140452, 137401, 137558, 136026, 129020, 132469, 132796, 135286, 130243, 127816, 133188, 137879, 132728, 129389, 127003, 126902, 124391, 123785, 124647, 128726, 129972, 129613, 124885, 126149, 130575, 132601, 128017, 123818, 125967, 121479, 119516, 123384, 126746, 122920, 125328, 121064, 114968, 111513, 111810, 108266, 101615, 102922, 108126, 112588, 111220, 108085, 104447, 100070, 100142, 98044, 104179, 107196, 110783, 109403, 106027, 100968, 99824, 102150, 99289, 94963, 102587, 109000, 110149, 108497, 102322, 102394, 103655, 101881, 101007, 98274, 99423, 104714, 110952, 111526, 103698, 103782, 102610, 99805, 103960, 103123, 106635, 105804, 104049, 104672]
11379A04672j118n114o934j700m706K861N402j492j731P425j412N89O474P87o919
11364I7084j884N123Kk020o308K065K41k637l371J523O051K536k739k391n113
11349H8162o936K301Q245L731n68k096K683k508n592O184J412j749n737Q04Q56
11334H9192l457L608j001J417m369n329J682K041m034k117m174j513K363L140
11320G7449J308o45k2n30L237P400m820j0309J029R100k922N27l97k251j539R147
11304H5762P059n637l141k812K767m990n114O22j920J4J895l019J415L421q27
11289G5495K154M676R4r419k819k30m45O74p23L516k557o973J434L751m413L005
11273F7220K857N327n260j587K067J87k879n38O63m334l592J205K279M477J586
$$ y = [104672, 103554, 98440, 91506, 89806, 85100, 87961, 93363, 91871, 90140, 97565, 96153, 96742, 103216, 104003, 97084, 95200, 100323, 100325, 98305, 91997, 94062, 94303, 91666, 88295, 89818, 95869, 98405, 95666, 93275, 88162, 81226, 83527, 91772, 95503, 94935, 92839, 95522, 93014, 87422, 93606, 95018, 93269, 87532, 88336, 89192, 85735, 89343, 88342, 89759, 85390, 80061, 81743, 83784, 79750, 77633, 73459, 71946, 74309, 77449, 78757, 78112, 78090, 77560, 80797, 88197, 83377, 73068, 74097, 83197, 80275, 80802, 80405, 78154, 76615, 85762, 92821, 87184, 84043, 81231, 83998, 79008, 73894, 74516, 72596, 72610, 74505, 71486, 72901, 76322, 75495, 77649, 82325, 82419, 73000, 70181, 69951, 69506, 70180, 69457, 72973, 70416, 63443, 64877, 68628, 64215, 67220, 70077, 75404, 70144, 68557, 70624, 70811, 67932, 67394, 68057, 63723, 60131, 61336, 63615, 68092, 69678]
11258F9678Q6l695m015J566K306k894J882K219o088n024N007J0923N816j5q163
11243F9589j0419K38j78J87O386M956J825r718j277K643j006q502M523J559j172
11228E9634m883l982P376K982l360k436N452M404k840j751q95k549k696L135K865
11213F0456P143k331q910j4075L377R14K190J0850j113M525N626j125l301p949
11199E6277q729k534L463J050j566k971M848P840p57l666L119L593j1177p133
11185D1657L75M869J58L437j477J882Q674J317N813k63r269n034o431m956Q371
11170D9123N172j004m402K807L302M010p590J844N755R73l333l066m949M719r9
11155E3262M735k856n151l335j133K02J537o01L501M365m273q272k481o552K731
$$ y = [69678, 69764, 66069, 62054, 63620, 65926, 63032, 64914, 67133, 61045, 56021, 61028, 71951, 77767, 77752, 69589, 59170, 59408, 59230, 59417, 65803, 70759, 72584, 62866, 61589, 64232, 63226, 54724, 59247, 60806, 59634, 54751, 50769, 58145, 61127, 57767, 55331, 60783, 65187, 62347, 60596, 59701, 57152, 54456, 57591, 60456, 67599, 65268, 56358, 42283, 45660, 46574, 48764, 59614, 58501, 63026, 68652, 67527, 64226, 56277, 47548, 45014, 48477, 49527, 47961, 44990, 49838, 57678, 56921, 53255, 56374, 59967, 48790, 41657, 42032, 46901, 47059, 50496, 49019, 50901, 59575, 60892, 66705, 66442, 57173, 52139, 45708, 40752, 49123, 54295, 53291, 48889, 51696, 54998, 59008, 51418, 53262, 59017, 59990, 56657, 53591, 48642, 53361, 53262, 57997, 55141, 49990, 46655, 45522, 45724, 47261, 46660, 50161, 54526, 50253, 41981, 39500, 32948, 35679]
11140C5679J0365j95p717J239N245N33J574M951j18m203P607q30M088O482K838
11125F7538l406l658n980K720N645j347j898m934m30K038J034M338P363l899n026
11110F0098m651j209M931L658n2N495n97l70o134o397N699j604r744o172r612
11095C3339N49J1109j578m665j02N295K919j604k503M959N14n273l675P581L380
11080E0245Q381Q596j208k202k356r98l441k59J28n311J016q62M076N923l471
11065E8257L866K380J799m068r877o469N53K505N625R9O153k442l948n746l482
11050D5205M894R367K004j102K716m789k826k908K726O666O096O283P395o34m882
11035G6211k999k788K820J1738P100j555j0488k342j527l840n652m717L50k528
$$ y = [35679, 46044, 45849, 38132, 39371, 44616, 45149, 46723, 51674, 51556, 47353, 54960, 54130, 58218, 64700, 67538, 64132, 60474, 54494, 57214, 62859, 61512, 59614, 54680, 54250, 56288, 57322, 61660, 69023, 65124, 60098, 55447, 54238, 59169, 62827, 62775, 68270, 67673, 67303, 61169, 54772, 60471, 58867, 49123, 42951, 33339, 33888, 44997, 43419, 38754, 38652, 43947, 46866, 45262, 42759, 47718, 48232, 42959, 39284, 46865, 50245, 58626, 67222, 66014, 63812, 61456, 60458, 57017, 56758, 56886, 51575, 52591, 51729, 55805, 61728, 58257, 62123, 64503, 66302, 62234, 52357, 45888, 46441, 48946, 54571, 54670, 60823, 58381, 54433, 48687, 45205, 50099, 59466, 61470, 60368, 63084, 58295, 55469, 52561, 55287, 61953, 68049, 74332, 81727, 81093, 76211, 73212, 70424, 73244, 84982, 92082, 90527, 80039, 77697, 76170, 72330, 66678, 61961, 62311, 59783]
11021E9783q455p259J565J367M052L170l54K01l014q266n126K297K789p93k500
11006C9457M105n075k585K568j610k146N067m03K298o348j470L63L411J0239j308
10991D6563n642J375L641J561o511K125k304k288n29j639M850L108Q080J935K108
10976E6433R65p46k951J091k921o257r521J666J28k936L452o57L450K670M325
10961D8191k209j906q66k390j39m667M549O592j508k236R29M258J402k86M10M774
10945E4898O88K745k935j1076n562L156l266k195j726n311n881K146K599P409
10931C5689J125q929j642P100N417L823j833m15J118l308j834k8k268L067L9m119
10915C3002m877J556q79k909q83R256L756o95q466m725K505M852L792L908l362
$$ y = [59783, 51328, 44069, 45634, 47001, 51053, 54223, 53869, 54070, 51056, 42790, 37664, 39961, 42750, 41957, 39457, 43562, 38487, 35902, 38470, 36860, 34714, 39781, 39378, 41676, 35328, 33858, 34221, 37632, 47871, 46563, 40921, 42296, 45937, 47498, 40987, 43112, 40808, 38520, 37991, 36352, 41202, 44310, 52390, 54325, 56433, 57398, 56652, 53701, 54792, 51871, 45614, 36093, 37759, 37887, 34951, 38403, 37746, 41196, 43866, 48191, 45982, 44076, 43210, 40820, 40681, 36014, 40563, 47155, 45647, 43411, 44340, 48598, 50000, 49714, 50124, 54898, 55586, 58331, 55396, 44320, 38758, 41914, 38648, 36453, 34727, 29416, 23535, 25681, 28280, 35689, 36814, 27885, 26243, 33343, 38760, 42583, 40750, 40335, 41453, 38145, 36311, 36283, 34015, 37082, 37121, 33002, 28125, 29681, 28802, 25893, 25010, 34266, 38022, 37327, 28861, 24136, 26641, 31493, 35285, 39193, 35831]
10900C5831o869k030J129J79Q716m836o27J936L454J541N816Q83p625l605l867
10885C0026K28J106n484n597j235J1400R676N777j0411m448L068L759L225L69
10871D1459m786j610J213J581o213m864M274R816l31n355n671M517n72q24k569
10856C0065k145q36M130J741m075j196o87L327n33M646J485j847p136R36P831
10841C5706J23M385L123l904p184m414P821M203J934k718j0554n369J1186R26
10827C5264k466l897K44K597l191l439j214K770L666N981J896J511l99J783M473
10812D5579l03j934m387j573L390K814j801m077p47k007L368K502M241k722n314
10797C7029p609p544P928M997k97Q64k57J861M392l396M393L163K87l088J0j608
$$ y = [35831, 28962, 26932, 28061, 28240, 36956, 32120, 31493, 33429, 36883, 38424, 44240, 45123, 37498, 33893, 30026, 30254, 31360, 25876, 20279, 19044, 30444, 40120, 45897, 35486, 31038, 34106, 37865, 41090, 41459, 36673, 35063, 36276, 37857, 31644, 26780, 31054, 40870, 40539, 35184, 29513, 34030, 33458, 32634, 30065, 27920, 27084, 31214, 32955, 28880, 27684, 26997, 30324, 29791, 34437, 35922, 34075, 26939, 27875, 35706, 35829, 40214, 43337, 39433, 32249, 27835, 35656, 39859, 41793, 39075, 28521, 23152, 34338, 35264, 32798, 28901, 29145, 31742, 28551, 25112, 23898, 26668, 30334, 36315, 38211, 39722, 39323, 41106, 45579, 45276, 43342, 38955, 37382, 40772, 43586, 41785, 37708, 36961, 34954, 38322, 40824, 45065, 42343, 37029, 29420, 21876, 29804, 34801, 34504, 35368, 35111, 36972, 41364, 37968, 42361, 45524, 45811, 42723, 42733, 41125]
10781D1125j229m448N299J1446m272o312m724m350K372M032j211k051n006l708
10767B6963j374P548n74K272m754K501Q79k456L029O428k431p831j2389k468O367
10752B1710O265L045M921J961l577m307l548N535R134o165n073n30m908K762M490
10737C1715J279j547k646l230K825K519J0498L27k91L073K521N13P39j732j0799
10722C5764m610J839J638K61k354J060P121L449P92j3479p788Q46K177j838m706
10707B0172N820L904O788N86j74K078m712j726L668l950l662n49l908J772l11
10692B5796K34L641K485K120M99l786k627L184K383N937M529K013l400n912J050
10677C8146n712r369m913O657j569K096Q216K501K548L844o782l941L892m145
$$ y = [41125, 39896, 35448, 40747, 52193, 47921, 41609, 36885, 32535, 34907, 38939, 37728, 35677, 30671, 26963, 25589, 33137, 32563, 34835, 30081, 32582, 33461, 31005, 34034, 40462, 38031, 30200, 17811, 15343, 21710, 27975, 31020, 35941, 37902, 34325, 30018, 26470, 32005, 41139, 34974, 29901, 29371, 24463, 27225, 31715, 32994, 31447, 28801, 25571, 28396, 30915, 41413, 41740, 41449, 44522, 47043, 47556, 48295, 46563, 35764, 31154, 32993, 34631, 34892, 32538, 33598, 40719, 44168, 44960, 31481, 23693, 24539, 26716, 24878, 20172, 25992, 29896, 36684, 37270, 37096, 39174, 34462, 32736, 36404, 32454, 28792, 28243, 24335, 26107, 25796, 26030, 29671, 32156, 34276, 34775, 30989, 28362, 31546, 33929, 39866, 44395, 46408, 43008, 37096, 38146, 32434, 23065, 18152, 24809, 23240, 25336, 33552, 36053, 38601, 42445, 35663, 31722, 35614, 31469]
10663C1469q239k343J067L149J0665L224p757l273K269p750J603N414k556n01
10649B6441M571o88k700J937K428O938l911o544k90p87o09k540m553k00k63K914
10633B2144P554R299P772n244r307l650n36P852Q142M871n53j894q065K07P325
10618D5917k070J781L002n098r48m397m170m494N11O673R9k075L947J974m065
10603C6587r99J1937M849j0672k220J519m769J440M691O253n614m132k920m163
10589C1787k691j917j687M47N892M7L496k164R40M31J405J190k792O245N36l20
10573D0845Q728O577K036P246l366n192J250M586j677o405o369o6L282k99j298
10558D9878n357M071j272k407O676k729m431K095k225J124J320K49o977n090l595
$$ y = [31469, 23230, 20887, 21954, 25103, 35768, 38992, 31235, 27962, 30231, 22481, 24084, 29498, 26942, 26441, 31012, 30324, 27624, 29561, 31989, 38927, 35016, 28472, 28182, 27395, 26786, 24246, 19693, 19493, 19230, 22144, 29698, 38997, 46769, 41525, 32218, 28568, 28032, 35884, 44026, 48897, 48344, 46450, 38385, 38592, 45917, 43847, 45628, 48630, 43532, 42584, 38187, 34017, 29523, 30034, 36707, 36806, 34731, 38678, 40652, 36587, 35588, 47525, 52374, 41702, 39482, 41001, 36232, 37672, 42363, 48616, 43002, 38870, 35950, 31787, 29096, 27179, 25492, 25939, 31831, 31878, 35374, 33210, 34150, 34581, 35986, 37176, 34384, 40629, 41165, 40845, 49573, 56150, 58186, 65432, 62066, 56874, 58124, 62710, 61033, 54628, 48259, 48193, 51475, 51176, 49878, 44521, 48592, 47320, 44913, 51589, 48860, 44429, 46524, 44299, 45423, 46743, 46992, 40015, 34925, 31330]
10543C1330j666K38Q669O423j796L038Q84M354P176j174n838r95N229L181O053
10528F5106p60k461P968R401Q446l011l499k869M770N505P115R623M904N416J0061
10513A25715J6948K1882L2177N0474Q3242J62061K55731K81506K21666J83492
10503A434894P8160m8329j69715k73176k76404k27583j53876q9582n8155l9069
10493A77165j7677r253p369j3585j8447l596O84j829r392M836j340l088j1759
10480H5350r953M371O175P39k552p482p260J853l20Q100J985k174m173j454o687
10465F6518k636k476j423n781L11R921M011N635o527n191m841n154L727N244n56
10450F0782P52L398M334k023K762L469o312j324j239l48r23o177l934K33O06Q7
$$ y = [31330, 29664, 29902, 38571, 44994, 43198, 46236, 47120, 51474, 58650, 57476, 51638, 50643, 55872, 59053, 65106, 64346, 61885, 69853, 79254, 87700, 84689, 81190, 78321, 83091, 88596, 95711, 105334, 110238, 115654, 125715, 142663, 164545, 196722, 247196, 330438, 492499, 748230, 1029736, 1251402, 1434894, 1513054, 1464725, 1295010, 1021834, 745430, 517847, 363971, 274389, 216234, 177165, 159488, 150235, 142866, 129281, 110834, 107238, 107922, 106093, 96701, 101537, 100197, 97109, 85350, 75397, 79768, 85943, 86682, 84130, 76648, 69388, 71241, 70921, 79021, 81006, 78832, 74659, 73205, 66518, 63882, 61406, 59983, 54202, 54513, 64434, 68445, 74080, 67553, 62362, 57521, 52367, 56094, 61338, 60782, 61534, 64932, 69266, 67243, 70005, 73474, 67162, 65838, 64599, 64251, 63328, 57151, 53217, 53450, 54056, 54143]
10434E4143K845N318N114k557n577l376j581N880l874J276L208j0469r528l041
10420C7781m773j2873j3570j2360k009O516J639Q071J1400J2421J3009R108N717
10407F0077l160j0650p853K822L562n037m120M500Q939Q237l492M688P577m621
10393F1469k623j336l577j466K223N870K315J857P984j307p507l753P642J2906
10379H0697n584j310J383R50n300o933m780j971n720J696j729M954R056J2707
10365G8116J6293J3529J5597L2325K5229J2227J7142J1645j5117j4162j8689k0104
10353A54031k0014j7959j8177j9575l050J819L505P188M026N00q339p601K522
10340G8876J726J690J373K437J513N969K947j930J846J671j037O124J0497j082
$$ y = [54143, 56988, 62306, 67420, 64863, 59286, 55910, 54329, 60209, 56335, 57611, 60819, 50350, 40822, 37781, 33008, 20135, 6565, -5795, -7804, -1288, 351, 8422, 19822, 32243, 45252, 54360, 60077, 56917, 46267, 38414, 41236, 44798, 39761, 35641, 40141, 49080, 57317, 53825, 58513, 66090, 61469, 58846, 57510, 53933, 52467, 54690, 60560, 62875, 64732, 72716, 71409, 63902, 60149, 67791, 80697, 75113, 73803, 75186, 76136, 70836, 63903, 59123, 57152, 51432, 53128, 51399, 56353, 65409, 78116, 94409, 107938, 123535, 155860, 181089, 193316, 210458, 222103, 206986, 192824, 174135, 154031, 134017, 116058, 97881, 78306, 75256, 77075, 80580, 87768, 91794, 92294, 83955, 76354, 78876, 80602, 82292, 83665, 86102, 87615, 93584, 96531, 94601, 96447, 98118, 97081, 103205, 113702, 112620]
10326A12620R436J8777J4593M942R094J2596J6773R467j956j3224j9852j4685
10314A58581j2887p873q772j6095j0469l333o340m027J668J476q75l128j9703
10301F8223q800J510N545K32p014J9556J0389J6865J2090Q38n604k485J034L258
10287A15637L498P529J0796J687l891l868M05O57l513m439j1521p736j954R86
10273A04273M264N181M317K515p704j0851j284k418r060k3764j6222j3560k5311
10260A0376k9351p518J3947J3042J4377J0724J0183R942P529Q367J0579Q845P723
10247H8765J2349J0150J2477J1309R302j774j319q449j5941k5749l2431k5009
10235C3680l674K755J9997M5083O4595M8783K9329J0401m855j6066j4803q306
$$ y = [112620, 122056, 140833, 155426, 160368, 169462, 182058, 198831, 208298, 206342, 193118, 173266, 158581, 145694, 137821, 129049, 112954, 102485, 99152, 92812, 88785, 90453, 91929, 91054, 87926, 68223, 59423, 60933, 66478, 66710, 59696, 79252, 89641, 106506, 118596, 119434, 113830, 111345, 112379, 115637, 119135, 126664, 137460, 139147, 135256, 131388, 131793, 132450, 128937, 124498, 112977, 105241, 103287, 104273, 108537, 113718, 118035, 120550, 112846, 101995, 100711, 98293, 89233, 65469, 49247, 35687, 10376, -18975, -26493, -12546, 496, 14873, 25597, 35780, 45722, 53251, 61618, 72197, 81042, 88765, 101114, 111264, 123741, 135050, 144352, 142578, 141259, 132810, 116869, 91120, 58689, 33680, 30006, 32761, 52758, 97841, 162436, 211219, 240548, 250949, 246094, 230028, 215225, 206919]
10223B06919M94J1176P8l10J0327m516p281J0874N800L045M500R515J1776L488
10209B65885n991k784r829p845j371m185J5251J8071J1452M695R400j969n52K765
10195B92993N288j669N975j728m651j1460o52l300j6706m598Q212J2762R114J5925
10181C05505J6800R270M506M603n98q238J12J6872J6400K3846L6491L1395K5991
10168D82955J1181l791l592k636k020M679P966P183O122J4503J9706L3056L2850
10155F08162K8789L5958N1406O8623N8866O4057Q6131R8897Q8046M9850P991p284
10143A239492J0559L4541M6727N6650M5664M1140N9666J02007J34814J71346K23622
10132B166228K72948L38864M33549N30724O02975P68353R39852R87842R06453
$$ y = [206919, 207413, 218589, 218667, 218357, 228684, 224168, 216887, 227761, 233561, 236606, 241106, 250621, 262397, 265885, 259894, 257110, 247281, 239436, 238065, 233880, 249131, 267202, 278654, 283349, 292749, 290780, 290228, 292993, 298281, 296612, 302587, 300859, 296208, 284748, 284096, 280796, 264090, 259492, 267704, 280466, 289580, 305505, 322305, 331575, 336081, 340684, 340086, 331848, 331960, 348832, 365232, 389078, 425569, 456964, 482955, 494136, 490345, 486753, 484117, 482097, 486776, 494742, 501925, 508047, 522550, 542256, 575312, 608162, 636951, 672909, 724315, 792938, 851804, 915861, 1001992, 1100889, 1188935, 1238785, 1246776, 1239492, 1250051, 1284592, 1331319, 1387969, 1433633, 1474773, 1534439, 1636446, 1771260, 1942606, 2166228, 2439176, 2778040, 3211589, 3742313, 4345288, 5113641, 6053493, 7041335, 7947788]
10123G947788P52648P55730R31673J171194J458617J883554K661494M074003O444049
10114B8080750J0415763J7861266L1087528M6504531N0428170M2251379L4654296
10107B61283683J4168018j6785894l9755508n6757587n1354988l7369365k3293520
10100E0134839j3695903q320189n279646l394573k263339j780495j501329j242971
10092A2656394j020157q32633p36886q42830r26924r25339r26034q37340p07076
10083D901175n79613m55486l67475l08852k92423k68382k62301k46001k25392
10074A895250k04595j64672j29810q7108l9134M811K4526J3086m4410j01150j09593
10063A057201j08100q8450p0759n1693l3450j6682o824r649K614m443k0025m7112
$$ y = [7947788, 8700436, 9456166, 10387839, 11559033, 13017650, 14901204, 17562698, 21636701, 28080750, 38496513, 56357779, 87445307, 133949838, 184378008, 226629387, 261283683, 275451701, 258665807, 218910299, 162152712, 110797724, 73428359, 50134839, 36438936, 28118747, 22839101, 19444528, 17181189, 15400694, 13899365, 12656394, 11636237, 10803604, 10066718, 9223888, 8296964, 7371625, 6445591, 5608251, 4901175, 4321562, 3866076, 3498601, 3189749, 2897326, 2628944, 2366643, 2120642, 1895250, 1690655, 1525983, 1396173, 1309065, 1269931, 1274742, 1299268, 1312354, 1267944, 1166794, 1057201, 949101, 860651, 789892, 738199, 704749, 688067, 681243, 671594, 674208, 669765, 649740, 602628]
10051F02628o0055o2867m8078l7064k6077k4325k0554m886O516Q715k976j4988
10039C15989k0198j2091j6037j7836o955k216m128n55K466Q14r93o895j7440j5522
10025A98403k1238k1623j5547j3462j4884j3914l204N209J833N36R186R088J6499
10012A36882L877m449p928j1027r962j5670k2605j7331p440K597R279J4313N297
9999G5833P91J740o528j0339m809o161p260l97P40J519m120j1270j1364R546J9795
9984D7716K8007M7686M9478L4956J9050J030l5984n2196l9395k7848j3880m517
9972E4103p388l609O693J6951J1103L098Q996L127P225P028L546Q167O286J0224
9958A35550J0349J9441J6973L037r946k1984k0720l0808k5219j4922j4966r792
$$ y = [602628, 542573, 479706, 431628, 394564, 368487, 344162, 323608, 318722, 325238, 333953, 330977, 315989, 295791, 283700, 267663, 249827, 242872, 240656, 236528, 235973, 238439, 239253, 238260, 231365, 213925, 198403, 177165, 155542, 139995, 126533, 111649, 97735, 94531, 99740, 101573, 102109, 111295, 120383, 136882, 140759, 136310, 128382, 117355, 107393, 91723, 69118, 51787, 44347, 46944, 56223, 70536, 75833, 76624, 78364, 71836, 61497, 56688, 50527, 43267, 42870, 43610, 45129, 41009, 29739, 18375, 27921, 47716, 75723, 123409, 172887, 207843, 226893, 227923, 191939, 139743, 100348, 72500, 58620, 54103, 46715, 43106, 49799, 66750, 77853, 80951, 89947, 93074, 100299, 107327, 110873, 119040, 125326, 135550, 145899, 165340, 182313, 185350, 175404, 153420, 132700, 101892, 76673, 61751, 46785, 36993]
9946C6993j3931q805k283j84k827M404M327n56L93L036k928j622j4180l054l98
9931a615n528o34Q402R80n68L992j095m252J000P294P132Q179J6288J6975j231
9916E5319P577k86j2868p144n549n154n893l562P78M432L285K637q2j851l486
9901B8153p49o217m156j576j100k936l021J612j0692q839J339Q935K532k138n11
9886F36J964j970N358L877l208l88K215O799L814j038L486n482n162N518l505
9871A2914q159l047M491M0R657K865o384m085J027l709l654N284P687N720N393
9856B6040L951Q273N490O53j959M43m918q886P424Q592m469p026q759k079j932
9841B0838P97k955K369j017m024Q82O875J1933K564o89n64q350J3366J8654J5560
$$ y = [36993, 23062, 14257, 11974, 11790, 8963, 13367, 17694, 17138, 17531, 20567, 17639, 16017, 1837, -1217, -1615, -7143, -7777, 625, 1605, 1037, 5029, 3934, -318, 682, 7976, 15108, 23287, 39575, 56550, 55319, 62896, 62610, 49742, 42598, 37049, 31895, 26002, 22440, 23218, 27650, 30935, 33572, 33490, 31639, 28153, 27404, 21187, 17031, 15455, 14355, 11419, 8398, 10010, -682, -9521, -8182, 753, 3285, 1147, 636, 2600, 630, 5988, 9865, 6657, 6269, 8484, 15283, 19097, 18059, 21545, 16063, 10901, 16419, 12914, 4755, 1708, 6199, 6239, 15896, 18761, 12377, 8292, 9319, 5610, 1956, 7240, 14927, 20647, 26040, 29991, 38264, 43754, 44407, 42448, 42891, 37973, 29087, 36511, 45103, 40634, 33608, 24849, 22770, 20838, 21635, 18680, 21049, 20032, 16008, 16890, 23765, 35698, 38262, 37573, 37009, 28659, 42025, 60679, 76239]
9826G6239J0761K5738N1056J00902J86785K24551O3952q6402j86714j81154j00946
9815A84768n1988k9236j7564j7675q381j162o925j2114r58l465K612M612M861
9802D7385J1259R224J5430K61k288j210q670j4320j0691j5563j2439p282j126
9789I970K102n97j79j779j908n704l533K174J940l553l304N058J2140R77L054
9774A6858o596n463k297K065l035q52J327n287q255L64R326K426o8P90O587m351
9758C539m320j0863m168l92k259P190O901N909m096j856k70N178J0883O766l110
9743A5032P75l634p177k386M303n323k49M648k366l1K664m142J455K420K881P401
9727A6271M508N392N596R200J6315J2295k939L723M324M568J0454N416J6875L5561
$$ y = [76239, 87000, 112738, 163794, 264696, 451481, 676032, 739984, 653582, 466868, 285714, 184768, 132780, 103544, 85980, 68305, 59924, 58762, 51837, 39723, 38765, 35300, 37912, 42524, 47385, 58644, 67868, 83298, 83559, 81271, 80061, 71391, 57071, 46380, 30817, 18378, 11096, 9970, 12072, 11475, 11296, 9517, 7609, 1905, -1628, 546, 2486, -1067, -4371, 687, 12827, 13804, 16858, 10262, 4799, 2502, 4567, 1532, 680, 2007, -3280, -11535, -11171, -1845, 581, 513, 1303, 7890, 3539, -781, -11644, -15812, -16204, -18463, -11273, -4372, 1537, -2559, -4415, -4685, 493, 11376, 18142, 15032, 15807, 12173, 4996, 2610, 6913, 1590, 1341, 5989, 3623, 3592, 6256, 2114, 3569, 5989, 8870, 16271, 20779, 26171, 31767, 40967, 57282, 69577, 66638, 70361, 74685, 79253, 89707, 95123, 111998, 147559]
9713A47559M4162P4264J34726K08588K79978K90712K32678P8746p0595j79091
9703A241727k80123k68692k21202j59961r7651n1301l1978k0987j3646r988j9256
9692F6942j6619n471n130k27O550l049m499o509r632l50m934j0051J173J0525
9678A8719p44l141Q285k010l422j352L843J684j390q05j409j3072j959P800k571
9663H456j019L031k303o309J639L594m005n044j22M931j016L370O011j480j187
9648H547k636m871j3947r174M058N403j421j716M184P106J374L912N240M887O905
9633A7851n204O395K805k579L247n179o771r14O29k742P48j72l2M00m005m261
9617B16m588n337O900k3P01O141l189M417O984l685j607m594k868L159R09o526
$$ y = [147559, 191721, 265985, 400711, 609299, 889277, 1179989, 1412667, 1491413, 1420818, 1241727, 961604, 692912, 471710, 311749, 214098, 162797, 130819, 109832, 96186, 86198, 66942, 50323, 44852, 39722, 39495, 46045, 42996, 38497, 31988, 22356, 22006, 17072, 7021, 8194, 18719, 17975, 14834, 23119, 21109, 17687, 16335, 20178, 21862, 20472, 19667, 18258, 5186, 3227, 11027, 8456, 7437, 10468, 8165, 1856, 3495, 7089, 3084, -1960, -2082, 2849, 1833, 5203, 11214, 9734, 8547, 5911, 1040, -12907, -22081, -18023, -12620, -14041, -15757, -11573, -4467, -3093, 819, 6059, 10946, 17851, 12647, 19042, 21847, 19268, 22515, 17336, 10565, 9651, 10280, 7538, 8286, 8114, 8082, 8482, 4477, 216, -4372, -9709, -2809, -2832, -2131, 4010, 821, 5238, 12222, 8537, 6930, 2336, -532, 2627, 3536, -2990]
9601b990J264J383M512k98j238K729J082k763m909J861J529N38L82N01l356J463
9585A690O177J682j584L636j0279r307N34J3313K378j975M90j006r50P19k112
9570C406K707j242M52m119M067J679j633J72K987J11l884o039mq98p493Q426J2237
9553A0932J7l821J152M118J178m233q188k001M822K390p239m652L61L634M234
9538B704m085j0395N715M323K169K701m412M48k469l779M692L008N762k286R74
9523E070K602k435j079l725k085L188L374K002J112M229L35k827n2m084o325r52
9507a652K91P688J619K977l816n174J014j258J069r78k331o449P99N954Q999L059
9491A1811p460L853O390J156r92J728j223K29k553j880k839k306j910J782M968
$$ y = [-2990, -1726, -343, 4169, 3871, 2633, 5362, 6444, 3681, -1228, 633, 2162, 2700, 3082, 3583, 227, 1690, 7867, 9549, 7965, 11601, 1322, -7985, -7451, 5862, 8240, 6265, 6755, 5749, 4799, 5518, 3406, 6113, 4871, 5323, 1204, 5271, 6950, 5317, 5489, 8476, 8587, 4703, -1336, -1340, -2238, -9731, -1305, 10932, 10949, 7128, 8280, 12398, 13576, 9343, 1155, -846, 3976, 6366, -873, -5525, -5164, -1530, 2704, -1381, -11776, -6061, -1738, 431, 3132, -1280, -832, -3301, -7080, -2388, 620, 6382, 4096, 5070, 7672, 5237, 4158, 433, -1652, 1536, 4910, 6912, 8024, 12253, 12588, 9761, 9709, 5625, -700, -1652, -1361, 6327, 7946, 10923, 7107, 1933, 2947, 1689, 2758, 1780, -551, -7000, -6201, -247, 8752, 11811, 4351, 8204, 14594, 15750, 14758, 16486, 15263, 15492, 12939, 11059, 8220, 5914, 4004, 5786, 10754]
9476A0754k236k246m817n630M566l599l412m88q055J649M89Q870O051l343J671
9461B24l559N68Q147q41m710k525L877k656K64J938L119j721m821M960j216M535
9445E583K146j857j434N446J935n490n346J155j222j124J820J07n697l173O638
9430e13O930P80m805q688k543O929O97l64j604j672K307n94P410P392K40q499
9414C403j645P220n052r7q82l782j754K754q0J099n92L391k969K789N340o262
9398B881j0583n66N611P541J639q824m849M949o07K382J312j49N362M93p165j0058
9382a0631J745N278J325M343p24L78p94n240j415N725M213J455K881K110l254
9367G395P37O75J342k067l754m90k813j217L880l216l094K432j959n064p19m442
$$ y = [10754, 8518, 6272, 1455, -4175, 391, -3208, -6620, -7108, -15163, -13514, -13025, -4155, 1896, -1447, 224, -3335, -2767, 5380, 4539, -171, -2696, 1181, -1475, -1211, 727, 3846, 2125, -2696, 2264, 1048, 5583, 7729, 5872, 4438, 9884, 11819, 6329, 983, 2138, 916, -208, 1612, 1719, -3978, -7151, -513, 6417, 7197, 2392, -6296, -8839, -1910, -1213, -1577, -3181, -4853, -2546, -3140, 4270, 11662, 11902, 3403, 1758, 8978, 3926, 3829, 2947, -835, -2589, 165, 85, 1184, 592, 3983, 1014, 3803, 9143, 2881, -7702, -8268, -2657, 4884, 6523, -2301, -7150, -2201, -2808, -426, 886, 737, 6099, 6592, -573, -10631, -8886, -3608, -2283, 2060, 1336, 1714, 920, -4320, -5735, -10, 4203, 5658, 8539, 10649, 7395, 8132, 8807, 10149, 8082, 4328, 3838, 1025, -192, 3688, 472, -2622, -190, -2149, -7213, -7932, -12374]
9351a2374M329N371J2475M892l060l412K875M727l740l381J956o098Q55l282l640
9336a507n16k073N428O486o18l153k194L285j878n732L669O63P76j287k237O04
9320b84M425L343M50K963l203m287J630R10N233J891L028k394q559p804k7l486
9304f171J493p87N209O787L403k324J875K101J665k54j588J26j86J920j477r924
9288A868l618L134L376L05M265R11M577j31q283n705j562J700O2J239M457L640
9272A0235K022j298P550l66j4253J083j725K763N810l722j335L732k765k596M838
9257I973P633j301l668K581l536k876j090o229l30p894m588O80P053P551N187
9242I146l055n044r00j326N968L609j475p92M150L33k119n656N256O170K678j423
$$ y = [-12374, -8045, -2674, 9801, 14693, 11633, 8221, 11096, 15823, 12083, 8702, 10658, 4560, 5415, 2133, -1507, -2023, -4096, 1332, 7818, 7200, 4047, 1853, 5138, 3260, -2472, 1197, 1860, 2636, 1349, -888, -284, 4141, 7484, 7934, 10897, 7694, 3407, 5037, 5947, 11180, 13071, 16099, 13705, 5146, -2658, -2685, -6171, -4678, -5465, -256, 6531, 9934, 7610, 9485, 11586, 13251, 12997, 11409, 11535, 11349, 13269, 11792, 1868, -1750, 1384, 4760, 5065, 9330, 10241, 14818, 14687, 6404, 699, -863, 837, 899, 2138, 6595, 10235, 12257, 10959, 18509, 18143, 3890, 4973, 3248, 6011, 11821, 8099, 6764, 10496, 7731, 5135, 9973, 17606, 16305, 12637, 15218, 11682, 8806, 7716, 1487, 1157, -6737, -11325, -10645, -3592, 3959, 9146, 6091, 1047, 147, -1179, 4789, 8398, 6923, 6131, 10281, 10614, 8495, 2839, 8095, 14265, 16943, 15520]
9226A5520k722p801L023O101k648l653r4l8j315J148N969q272l213K033L3K156
9210F227K690j30k928L679m131K435j021J923L273K681j240p005k322k564k561
9195i94j276K822N94J48N768K290n242k831P016L271p433m913j306r18K887N008
9179D891L928P089O758l821o967n072N93O324j22k830o23K300K502L778K433K340
9163B3501m187k25k989q75j6n83m84k499q42L011K616K492O54j109j520r37n173
9146A0835j627K447k632l408J654L57j230m427k726q38O460O165l917n85l365
9131C163K734K791P050n24m761j999L423M678k111O959J147m604m411r601j924
9116B010O652O385r66m727k72K716l240K41j894q065K918L136M539n324k667J170
$$ y = [15520, 12798, 4997, 8020, 14121, 11473, 7820, 7726, 7688, 6373, 7521, 13490, 5218, 2005, 4038, 4071, 6227, 8917, 8787, 5859, 9538, 5407, 7842, 6821, 8744, 12017, 14698, 13458, 6453, 4131, 1567, -994, -2270, 552, 1146, 1294, 7062, 9352, 4110, 1279, 8295, 11566, 4133, -780, -2086, -3004, -117, 4891, 8819, 15908, 22666, 18845, 11878, 6806, 7399, 13723, 13601, 10771, 10148, 12448, 14950, 18728, 21161, 23501, 19314, 19089, 16100, 15225, 15209, 14626, 14142, 11643, 10801, 13812, 16428, 18920, 19574, 18465, 16945, 16008, 10835, 9208, 11655, 9023, 5615, 7269, 7626, 6396, 1969, -757, -1595, 4865, 11030, 7113, 6528, 3163, 5897, 8688, 15738, 15214, 10453, 8454, 11877, 16555, 14444, 21403, 22550, 17946, 13535, 3934, 2010, 8662, 15047, 14081, 9354, 9082, 11798, 8558, 8799, 6905, -1160, 1758, 4894, 9433, 4109, 1442, 2612]
9100B612K769O548R88o23P78L944L835l256j0841l265k857N241N096J09M19n44
9084A0953K436n360l939q960j187K190O113P00q306J551J096k58n50M079N61k170
9068a051J531Q90L464R45m499p02k521o189J09J911p858O488O368J481j082J885
9052A170P893M763J674n216M053R079n942q551Q57o784o310l315o64R979P226
9037I912M19l07j932j736P05J491J307l055K292L191k945n957l073j609j258L730
9021A175M126K981L82M123J907p31N18n260n194L046L893m467n549j753O420O111
9005A1728K851k597m487L42k640k604O70j313n712O09P08K200m24J017K010L533
8989E891P169L782l687m945P66P689n567m647K58J137o550N59J163k773l769q173
$$ y = [2612, 5381, 11929, 12917, 12294, 13072, 17016, 20851, 17595, 6754, 3489, 632, 5873, 10969, 11078, 11497, 10953, 13389, 8029, 4090, -4870, -6057, -3867, 2246, 2946, -5360, -3809, -2713, -2971, -3521, 558, 1119, -1051, 480, 1370, 4834, 5779, 1280, 578, -1943, -8132, -8023, -6112, -13970, -7482, -1114, 367, -715, 1170, 9063, 13826, 15500, 10284, 14337, 23416, 17474, 8923, 9780, 2996, -3314, -6629, -7293, 2686, 9912, 10331, 10024, 8092, 6356, 7061, 8552, 9859, 6804, 9096, 12287, 9342, 3385, 312, -1297, -2555, 1175, 5301, 8282, 8664, 12787, 14694, 13963, 14481, 9221, 4027, 7073, 10966, 6499, 950, -803, 5617, 11728, 14579, 11982, 7495, 7837, 5197, 2593, 3263, 1950, -3762, -3153, -2445, -245, -669, 348, 2358, 5891, 13060, 16842, 13155, 8210, 8976, 16665, 11098, 6451, 6709, 7846, 1296, 1855, 3018, 245, -3524, -11697]
8973a1697k155R156J5625k264n1R69k77J595J943l68j139j462n417q09J586m001
8957A234L629K20R350M257j1028K977N94l391j473J969m213n570K563M317J796
8942G231l691m677k905K600N130O617O273M506j049M205K219J27n210j431m073
8927A5872n54q493l287L110L475N681j081L999R59q123m953L99j573K228L087
8912A0746L104J160l413k38k324l249p6N506J541N305p58J73j162n28k317p668
8896E802m984O83Q003K129K70l521J240M803L100o920k095M033l292j0867k408
8881d024P509M715J795Q086J849M549k173j0039n952l878p83L483l015L317K48
8866E687k098k568J856J000L770mK200m116l098M832K509O134K074r440n534q1
$$ y = [-11697, -13852, -4696, 10929, 8665, 8614, 9583, 9306, 10901, 12844, 12476, 11337, 9875, 4458, 3649, 5235, 1234, 4863, 5083, 14433, 18690, 7662, 10639, 11233, 7842, 6369, 8338, 4125, -1445, 1118, 5435, 7231, 3540, -1137, -4042, -1442, 3688, 10305, 16578, 21084, 20035, 24240, 26459, 26586, 21376, 19945, 15872, 15318, 6825, 3538, 6648, 10123, 15804, 14723, 18722, 19681, 11558, 6605, 7004, 5431, 7659, 10746, 13850, 15010, 11597, 11359, 9035, 5786, 5710, 11216, 12757, 18062, 17304, 17477, 16315, 15787, 13470, 5802, 818, 1501, 9504, 11633, 11903, 8382, 9622, 14425, 17525, 10605, 8510, 12543, 9251, -1616, -4024, 3485, 8200, 9995, 18081, 19930, 24479, 22306, 12267, 6315, 2437, 1654, 5137, 2122, 5439, 5687, 3589, 1021, 2877, 3877, 7647, 7643, 9843, 5727, 2629, 7461, 9970, 16104, 18178, 8738, 3204, 3123]
8850C123K493o96L17J238M531N502L211k863j0225k07J214O457M706p856r253
8835A692n711J379J578j25J718R097l598j3239N570L321P93M858O594L477N179
8820B2583N813n634l211L604J4024J7009K938L102j1559j8997n398O32p137o08
8806A7161l5K056J324n184o267N055K975p304N524J2403O088Q227L424p894j0825
8791B6728j2524p429L761l40M918O529L177L51k921q741L542n20k752k172l50
8776A1257K873L838j581r48K357k33R3R75m5o199m981j040L596J837L814K425
8760A8038l354Q67L971r55J91k333j528j483l464J120J198J479j736J067N507
8745A8585o374l769l005M036J965j710o415m495k410L686J1044Q369l020M80J192
$$ y = [3123, 5616, 4920, 5237, 6475, 11006, 16508, 19719, 16856, 6631, 6424, 7638, 14095, 18801, 10945, 1692, -4019, -2640, -1062, -1187, 531, 9628, 6030, -7209, -1639, 1682, 2475, 7333, 13927, 17404, 22583, 28396, 22762, 19551, 23155, 37179, 54188, 57126, 60228, 48669, 29672, 24274, 24906, 17769, 17161, 17126, 19182, 20506, 15322, 9055, 14110, 17085, 9781, 15305, 27708, 33796, 42023, 45447, 37553, 26728, 14204, 6775, 10536, 10196, 15114, 21643, 24820, 25171, 22250, 13509, 17051, 16531, 13779, 11607, 11257, 14130, 17968, 16387, 15439, 17796, 17563, 17656, 18631, 18586, 12387, 7406, 6366, 9962, 11799, 15613, 18038, 14684, 15551, 19522, 18567, 18758, 16425, 14897, 13414, 9950, 11070, 12268, 13747, 12011, 13078, 18585, 12211, 8442, 5437, 9473, 11438, 9728, 3313, -1182, -3592, 94, 11138, 19507, 16487, 16967, 18159]
8730A8159q594k3Q581k208L058M289l788j6j015r67j740n638m674L983N936m10
8714A4933L680l022j365l40Q376j261k960j622k777J941R772O634l306p133n881
8699A5669j839Q664P364l109m114m6J83J475k791p72M016J245M637q299n209k778
8683A4296R24r88j94R834J0546M109m880o908k16R928O353k660k064l287M30j378
8667C3845N408O989j186Q128j408l191P835p45j0720l328N862l41O228M296L417
8652F1089m816K279k089O050L710J2023J1360O890K343L758k149R093J1624P7
8638A21242O788J9933J9654J3308K2681K5743K0716J7636J4570J5832J3510k162
8626C09451k4423k9900k9612k8585k6279k3847j0482j0001j0378j2937K212M022
$$ y = [18159, 9565, 9542, 18123, 15915, 18973, 23262, 19474, 19458, 18443, 17476, 15736, 10098, 5424, 9407, 15343, 14933, 18613, 15591, 14226, 13886, 22262, 21001, 18041, 16419, 13642, 15583, 25355, 31989, 28683, 21550, 15669, 13830, 22494, 29858, 26749, 22635, 22589, 22772, 24247, 21456, 20684, 24700, 25945, 30582, 22283, 17074, 14296, 15220, 14232, 14038, 23872, 34418, 38527, 33647, 26739, 26523, 36451, 42804, 40144, 38080, 34793, 35223, 33845, 39253, 46242, 45056, 53184, 51776, 48585, 56420, 55675, 44955, 41627, 47489, 47148, 53376, 57672, 61089, 56273, 58552, 56463, 62513, 66223, 78246, 89606, 96496, 98839, 102597, 100448, 109541, 121165, 121242, 128030, 147963, 167617, 180925, 203606, 229349, 250065, 267701, 282271, 298103, 311613, 309451, 285028, 255128, 225516, 196931, 170652, 146805, 136323, 126322, 115944, 103007, 105219, 109241]
8614A09241J476o216j1740j2738o994M172p22k245n68j3965o820j263o664j052
8600D3902l154j627k126K333k492o526M464P569K317J336m566q061K145l409j378
8585C0727M231k548m22p240l604N222O761J088o420n785k024k024k581j008M613
8570A8986J0280J0162M111q83m629K77j872n596j57o73j731j82k965J111L310
8555B9549q215n119N491m396o923P658R163m565q280J092J449q336p443L015Q329
8540A2469q60j85n509k421m700j050J1017p23M423J2092K001l599J164m457k418
8525A7244n227j077K544j134q80M095L154j382N57r37J406o67j364J133K488m074
8509A5879O591k686m469k386R01O010l050o884o859M96M681L742j921K270L623
$$ y = [109241, 110717, 104501, 92761, 80023, 73029, 77201, 76479, 74234, 73666, 59701, 52881, 51618, 44954, 43902, 40748, 39121, 36995, 39328, 36836, 30310, 34774, 42343, 44660, 45996, 41430, 33369, 35514, 32105, 30727, 34958, 32410, 31988, 24748, 21144, 26366, 33127, 34215, 27795, 22010, 19986, 17962, 15381, 14373, 18986, 29266, 39428, 43539, 42656, 38027, 38304, 36432, 30836, 30679, 30006, 28275, 28093, 25128, 26239, 29549, 21334, 16215, 21706, 17310, 10387, 18045, 27208, 22643, 14363, 15455, 16904, 8568, 1125, 4140, 12469, 11609, 11424, 5915, 3494, -1206, -2256, 8761, 8038, 12461, 24553, 26554, 22955, 24119, 19662, 17244, 12017, 10940, 13484, 12350, 11470, 15565, 18719, 17337, 17894, 16957, 18363, 17696, 16332, 17465, 19953, 15879, 22470, 19784, 15315, 12929, 13830, 19840, 16790, 9906, 3047, 3543, 8224, 11966, 10045, 12315, 15938]
8494A5938N93l540k648n38j1980l841O708P522j190J137O281M519r28p937k062
8479H034J79J22l019K135J621l301j26P859k902J965J943o364o117j49L02K456
8463D638M217N603n52j569q31p847O467J559r62K732r47j1832j147k1O401P180
8447A3089m27L873P06j966o293l435k52Q96n77R9q56j939o64N861m404p510J630
8430b169L922N873p7l993k216N43M122K375k340j750m565M798N424N467L988l751
8414A5651O64k016k566m714n799j125j106K626J811L232J696l547K710K640j735
8399H422P969O809m583m892m166m119L129P442K376n548j885k538k597O057j127
8384A0749o398j618J093p97n27J756L69J043j651O76M162l308p00j734N52L787
$$ y = [15938, 16531, 12991, 10343, 9805, -2175, -6016, 692, 8214, 7024, 8161, 14442, 18961, 18033, 10096, 8034, 8213, 8335, 5316, 7451, 9072, 5771, 5645, 13504, 10602, 12567, 14510, 8146, 2029, 1880, 2182, 4638, 8855, 14458, 13906, 12337, 11506, 3659, 10126, 11685, 10723, 13455, 12508, 676, -471, -492, 5909, 13089, 12662, 16535, 17241, 15275, 8982, 5547, 5295, 6191, 5614, 5713, 4857, 2918, 2254, 8115, 3711, -3799, -2169, 1753, 7626, 7549, 3556, 1340, 1883, 6005, 8380, 6040, 4290, -275, 4523, 9947, 15414, 19402, 15651, 16315, 14299, 11733, 7019, 1220, 95, -1011, 1615, 3426, 6658, 8354, 4807, 7517, 10157, 8422, 16391, 23200, 18617, 13725, 9559, 5440, 8569, 16011, 18387, 12839, 10954, 8416, 5819, 11876, 10749, 4351, 2733, 3826, 3029, 2502, 4258, 4627, 5670, 4019, 4695, 8857, 5549, 4849, 3115, 3667, 7454]
8368G454J322o41m132o670J383J439P768k631q94n081K913R18o180r61Q99L583
8352D89L541k554r56L224K482p896l432M882O279K045M077j622q776j212L485
8337D056k576p033N504L266P090N732m558j066k065M738P458o752m420J887J865
8322A3126l69L176l705m870j566K876j389j72L878O292L347l631n410l192K799
8307A1190M035M563K76l729m114n15r741r962P737P327oq554J863k502J64O003
8291D035N87P9j440K461N346J361N890J742p807l073k19J766n711L028p30n089
8275B226P90k650j624P667J550k333N834k63j449j763n279m049l779j565M171
8260b516J3371L227K465l792j0151P60M437p287o757M439J549M885M685j117K022
$$ y = [7454, 8776, 8135, 4003, -2667, -1284, 155, 7923, 5292, 4398, -683, 2230, 3148, -3032, -3993, -3094, 489, 4030, 1476, 520, 3744, 6226, -1670, -5102, -220, 6059, 8104, 12181, 10559, 1783, 571, 4056, 1480, -5553, -49, 3217, 10307, 16039, 11481, 10415, 8350, 13088, 20546, 13794, 9374, 11261, 13126, 12757, 15933, 12228, 7358, 5792, 8668, 7279, 7107, 10985, 17277, 20624, 16993, 11583, 8391, 11190, 15225, 19788, 20064, 16335, 12221, 11706, 1965, -7997, -260, 7067, 7061, -1493, 370, -2132, -1968, 4035, 4622, 4701, 3261, 5722, 11068, 12429, 18319, 20061, 12254, 9181, 8962, 10728, 5017, 8045, 7315, 2226, 3016, 366, -1258, 6409, 7959, 5626, 11460, 11197, 9748, 7985, 2706, -1343, -5122, -6687, -2516, 10855, 14082, 16547, 12755, 2604, 3364, 7801, 514, -6243, -1804, -255, 4630, 9315, 8198, 10220]
8245A0220j127l647m64j653L782j502o630M702L013L451j176l484j805N352M108
8230A3140k627o560p348N872L891K703J296Q96k605n054L321K968L286n785m383
8215C011j512m641Q12l435J254J2137k526n005l883K035P099P737n638o407R084
8200A0122j174J396l703m048K297L972l786L923k506o918K844J970r377q0M820
8185b48L689O768J755K179j340n573k622n653m110Q759O018L319K1o49m936o185
8169A192O83P685N897K410p856r804O631M747R85O373K269n391p332N432J729
8154A5650m289k995J215L120o74N6M850J0596k443j930l371J275m921n786l480
8139F873K991k296m506O791J455n395J632k211P39N939J918Q48N69N300J590j966
$$ y = [10220, 9093, 5446, 4982, 3329, 7111, 5609, -1021, 3681, 6694, 10145, 8969, 5485, 3680, 9032, 13140, 10513, 3953, -3395, 2477, 6368, 9071, 10367, 11263, 8658, 3604, 6925, 9893, 13179, 7394, 3011, 1499, -3142, -2330, -5765, -4511, 7626, 5100, 95, -3788, -1753, 5346, 13083, 7445, 1038, 10122, 8948, 10344, 6641, 2593, 4890, 8862, 5076, 8999, 6493, -425, 2419, 4389, -4988, -5068, -248, 3441, 10209, 11964, 14143, 12803, 7230, 4608, -1045, -5155, 3604, 9622, 12941, 12962, 12313, 7377, 1192, 1875, 9560, 15457, 17867, 10011, 207, 6838, 11585, 12570, 18943, 21212, 15821, 8489, 13921, 15650, 11361, 8366, 9581, 12701, 12027, 12083, 16933, 27529, 25086, 23156, 19785, 21060, 16139, 10353, 6873, 9864, 7568, 3062, 9853, 11308, 5913, 7545, 5334, 6073, 12012, 13930, 14778, 15347, 20647, 22237, 20271]
8123B0271k058M372J612l228l557j711J212L448J464k51j477l958N55K468k786
8108A6376j49O441n21p608p324J279M549P61r8l064K379K320L262N158L116j218
8092B5659q500m403N24N29m859N498M461o32J821L882L393m88K310Q00j252L207
8076C1950L995k818q585L402Q721L46k671m542k110l921K810N837L416m769m470
8061B6591M087n026O28L685q30j476L781J582J163L008L511P36n549n361L926
8046C4456M706M609O36K718R318K889J45J0067P356K782M799k475l717J089o876
8031G2502J972pM288p392q121o167k206j603l89l517q859R91k67m850m866J23
8015C1632N62K228r89M291J399M412j385j608l269O333R101K331M53J277N4O842
$$ y = [20271, 18213, 22585, 24197, 20969, 17412, 15701, 16913, 20361, 21825, 21574, 20097, 16139, 16694, 19162, 16376, 16227, 22668, 22147, 14539, 7215, 8494, 13043, 13804, 13706, 10642, 13021, 15341, 18603, 23761, 26877, 25659, 17159, 12756, 13280, 13809, 8950, 14448, 18909, 18277, 20098, 23980, 27373, 26885, 29195, 29995, 28743, 31950, 35945, 33127, 24542, 27944, 36665, 37011, 34340, 29798, 27688, 23767, 26577, 32414, 35830, 31061, 26591, 30678, 25652, 26280, 29965, 29135, 27659, 31440, 33022, 34185, 37193, 40704, 41440, 35891, 30530, 34456, 39162, 43771, 44407, 47125, 56443, 59332, 59477, 69544, 76900, 79682, 84481, 82006, 78289, 79378, 72502, 74474, 74467, 78755, 71363, 63242, 57075, 54869, 53266, 52877, 49360, 40501, 41492, 41225, 36375, 31509, 31632, 32194, 34422, 33433, 37724, 39123, 43535, 42150, 40542, 37273, 43606, 52707, 55038, 55491, 56768, 56822, 63664]
7999F3664J438m21n76J99O347J0142N170M045p034p282k437j1718k538j906K997
7984F0090m972j1515K986M793j266l899j1863j675k15J105K608L511k981o458
7970C0249l953j875M795J009K071n55K901L799n837M351N46N291O774J08O814
7955E6488N010n358r981m046j775K930k356k74k270j0053l420J935j463L600K199
7940C1166J26n386l971k497n180l556L203j637p72K468k677N27k544O700m82j783
7924A3705l057p685M405J338K861N909M250o562p068L179Q152K749j622q158l389
7909I007p170l338M137K018M103J438l553k820q241l000M733L763O567J249L213
7894A2106J614o243m302p983m27k490J508M078L754l934k17R792R738j092m437
$$ y = [63664, 65102, 64681, 64105, 64304, 70651, 80793, 85963, 90008, 82974, 75692, 73255, 61537, 58999, 57093, 60090, 55118, 43603, 46589, 51382, 50116, 46217, 34354, 32679, 32464, 33569, 36177, 39688, 36707, 30249, 26296, 24421, 29216, 30225, 32296, 31741, 34642, 38441, 32604, 36955, 37501, 42792, 49566, 49674, 56488, 61498, 56140, 46159, 42113, 40338, 43268, 40912, 40638, 38368, 28315, 24895, 26830, 25367, 28967, 31166, 31292, 25906, 21935, 19438, 14258, 10702, 13905, 12268, 11496, 13964, 11287, 11814, 9270, 15970, 15488, 13705, 10648, 2963, 7368, 8706, 11567, 17476, 21726, 15164, 8096, 11275, 19427, 22176, 20554, 12396, 9007, 1837, -1501, 2636, 4654, 8757, 10195, 6642, 3822, -4419, -7419, -2686, 1077, 7644, 8893, 12106, 13720, 7477, 3175, -4808, -5235, -7725, -6217, -2139, 1615, -2319, -2536, 7256, 16994, 15902, 11465]
7879A1465k044P28J578O775q228n477J0789O31p623j2213Q59Q903N523q9P89q66
7863A1500p675q454R94m092M898P461j587N468N405j594m127p289n095k26L76
7848d037J896J297j044M284J1654J901j1450m267K432j435p368l232j494N505
7834e358J319L402P073P97r584l840O532k1q79L96k720l593L483o96O097Q547
7818A0955p285j154o047k681O449M342K22O19J248k588k881L75J857l252k589
7803b410L552L47r56l178l624J077J792r27O369M218n76k032q264r12j695L018
7787d201J24K153j860o905l389P216J0386j088o253p007O75p13K586O947j532
7772b861j236L500M253j631n99K313N36l959m973l756R71L372L827L967M63K194
$$ y = [11465, 9421, 10149, 11727, 18502, 10274, 4797, 15586, 16217, 8594, -3619, -2760, 6143, 11666, 11577, 12366, 11500, 3825, -4629, -3635, -7727, -2829, 4632, 3045, 8513, 13918, 12324, 8197, 908, -4187, -4413, -4037, -2141, -844, -1888, 2396, 14050, 15951, 4501, 234, 2666, 1231, -6137, -9369, -10863, -5358, -4039, -637, 6436, 7233, -2351, -6191, 341, 320, -559, -163, -2883, -6476, -2993, -3689, 2408, 10955, 3670, 2516, -3531, -6212, 237, 4579, 4801, 5420, 6668, 4080, 1199, 1574, 3431, 179, -2410, 1142, 1489, 533, -2645, -6269, -5192, -3400, -4327, 2042, 6260, 5684, 3652, -4612, -5524, -7219, -4201, -4077, -1924, -3784, -10689, -14078, -6862, 3524, 2436, -3817, -10824, -10149, -10862, -8276, -1329, -2861, -4097, -597, 3656, 2025, 1426, 3739, 4275, 316, -4657, -8413, -7442, -4070, -243, 3724, 4187, 6381]
7756F381j426r92j472j565j930K877q52m554N785M893k73m219j392p640K520N365
7740A506L317k361M59l023J975l914o133M825K06J867m98k239M693N806J051O82
7724H219o910k807k473l270O869M231j0209M98j696p945L151J2951K796j947q081
7709f623j172P230k682N568O546n579l668o749m691m353M269L206L173n480k857
7694a3862N64N698L446j934l83O61m146n659L124M734L386P350Q816k167q156
7679A472j504l683K218o653j734n84L094k42l937j00P370N384n473j936M813K488
7663I93j670m846q81J482p17J489k571M488k591j194N98k003M51Q915l057l025
7647d139J8k311O927K210j698k54q261n559K290n255M140j076K980k72m580n44
$$ y = [6381, 4955, 3963, 2491, 926, -1004, 1873, 1021, -3533, 2252, 7145, 6872, 2653, 1261, -6379, -3859, 1506, 4823, 2462, 2921, -102, 1873, -2041, -8174, -3349, -3143, -1276, -1774, -4013, 680, 6486, 7537, 8219, 1309, -1498, -3971, -7241, -372, 3859, -6350, -5852, -7548, -15493, -12342, 609, 3405, 1458, -6623, -7795, -565, -3247, 2321, 8867, 3288, -380, -7129, -11820, -16173, -11904, -8698, -5525, -11005, -13862, -13298, -7600, -4154, -6088, -6471, -5810, -9956, -15615, -12491, -7757, -4371, 2979, 11795, 9628, 1472, -32, -3715, -1497, -8150, -9884, -10468, -7374, -7616, -11553, -11653, -4283, 1101, -4372, -6308, -1495, 993, -677, -5523, -6404, -4922, -5639, -4150, -6721, -2233, -4824, -6018, -5420, -7423, -6972, 1943, -1114, -4139, -4121, -6432, 495, 2705, 1007, 753, -7508, -13067, -10777, -16032, -11892, -12968, -9988, -10260, -14840, -15384]
7631a5384J0590O559j306m05n097m650L394L82l043k483p16K66L357O445K925
7616H34l490l526J091M294j523l701o8r92p141n333K861m916j467L492O979K066
7600a0540P544l184q118j159R055K466l475q569j189M412k10N771j27M224l91
7585c490l130L625M539k634l235L384n20L826O601o950o399l155L381Q235M72
7570D550l314j0496o350J567R74j399j118J964L648M418L165k003L358o81l189
7555d906K24L87j040L881M634L05q308J513L121l963J949Q82m141J742O338m732
7539b114p267O24K583O057m969K024j724M259N903K947k261j2208k961L590j698
7524g215n158n970J558K157r7J2662m603o53k488m563o83K590o987p269J455L522
$$ y = [-15384, -4794, 1765, 459, 54, -5043, -9693, -6299, -5917, -8960, -11443, -12159, -11893, -8536, -2091, 834, -2656, -6182, -5091, -797, -2320, -6021, -6089, -7081, -14222, -19555, -16694, -21610, -23077, -19585, -12606, -10540, -2996, -6180, -14298, -15457, -6402, -3936, -7411, -15980, -17169, -12757, -12967, -7196, -7323, -3099, -3490, -6620, -2995, 1544, -1090, -4325, -941, -1461, 2365, 8966, 2016, -4383, -7538, -4157, 4078, 4550, 1236, -9260, -15610, -14043, -13069, -14468, -15586, -13622, -9974, -5556, -2391, -4394, -1036, -1717, -4906, -4682, -4295, -5335, -1454, 3180, 3485, -4823, -3310, -189, -4152, -2203, -1321, -5462, -3720, 2618, -2114, -9381, -8757, -6174, -117, -5086, -3062, -4786, -527, 5376, 8323, 6062, -6146, -9107, -5517, -7215, -12373, -18343, -16785, -14628, -14725, -2063, -6666, -7319, -9807, -14370, -15053, -12463, -19450, -26719, -25264, -21742]
7508b1742j74J292Q813L593n637p37J054m902o88O813M566L17l868L578P321m923
7492e324m768L777k2R46k489o798M053L563l177l199n54j655m40K632r3R54j917
7475a4511P99L025N903l311n618O060O452m34l940m855p4L81n622n678O805Q891
7459e727m63M27K869R27p110k723l473o423L317N375o99l21Q260M886R41L433
7443C496J0480K847o576m883J369N627o915l437M29k818n034n440k034M205K130
7428f554Q94l35l70p04m991m560K320P401j297n669Q05K507J1391j685m325o735
7412a1907k957M77k716j530Q946N048M706k943k39m09K515J786m163o729j813
7397a1928J0438j532q307K266N830j2086K840j545k371J624L822P47m792j371
$$ y = [-21742, -21916, -20624, -11811, -8218, -13855, -14592, -13538, -18440, -19128, -12315, -7749, -7432, -11300, -7722, -401, -5324, -10092, -6315, -6337, -5391, -7880, -14678, -10625, -7062, -10239, -13438, -13992, -15647, -16087, -13455, -13548, -12594, -14511, -13712, -10687, -4784, -8095, -13713, -7653, -1201, -1635, -5575, -10430, -10504, -10123, -15745, -21423, -14618, -5727, -6190, -5763, -2894, -1967, -9077, -11800, -15273, -21696, -18379, -13004, -13703, -14024, -5764, -878, 63, 3496, 13976, 16823, 10247, 5364, 6733, 12360, 5445, 2008, 2437, -381, -5415, -10855, -12889, -8684, -6554, -5660, -5995, -6365, -7069, -12060, -16620, -14300, -6899, -8196, -13865, -13060, -10553, 838, -847, -5172, -11907, -14864, -14387, -17103, -18633, -9687, -4639, 67, -2876, -3115, -3524, -1009, 777, -3386, -10115, -11928, -1490, -3022, -11329, -9063, -3233, -15319, -12479, -14024, -16395, -14771, -10949, -10202, -14994, -16365]
7383a6365O374J1145j799R43J0451n130o658p415K479L189j845J504O302L325
7369F500p705j0330L217M051j06J666N441q258n030j361O94n24k286R24O810J1206
7353D909O14o990l44k27J29k33n174q521m257L709L165L938l793j454O506J0418
7337B395n65J535l889j947N023p055l57o27M552k32k864r9J600P005l130p825
7321f480q78l018K38L797o356j746K988L448K430M703k48l025l196K714M567L983
7305C921l753j322k494L928K03o210k287Q19l293k447j697K119m87q47L510K955
7289g382N925P17k813q440m364J750l80K648n15p103M29J925N134J574J583L547
7273e765N138r3J533l005j172j229l644k369o75J612M093K283O98o56J065j774
$$ y = [-16365, -9991, 1154, -645, 298, 10749, 5619, -1039, -8454, -5975, -2786, -4631, -3127, 3175, 6500, -1205, -11535, -8318, -4267, -4373, -2707, 2734, -5524, -10554, -11915, -11221, -11745, -14031, -13107, -6297, 4909, 5523, -1467, -1811, -2038, -1909, -2142, -7316, -15837, -20094, -16385, -13220, -9282, -13075, -14529, -8023, 2395, 1830, 3365, -524, -2471, 2552, -4503, -4860, -5487, -935, -1167, -4031, -4130, -2530, 4475, 1345, -6480, -7358, -10376, -10138, -6341, -12697, -14443, -11455, -8007, -5577, -874, -1122, -4147, -7343, -4629, -62, 3921, 168, -1154, -3648, 280, 483, -5727, -8014, -7195, -10488, -12935, -14632, -12513, -13000, -13847, -10337, -7382, -1457, -740, -3553, -11993, -16357, -14607, -14987, -12339, -12854, -19957, -19528, -17603, -12469, -10895, -9312, -5765, -627, -720, 813, -2192, -3364, -4593, -8237, -10606, -11281, -9669, -5576, -3293, -2595, -3251, -2186, -3960]
7257c960J204K262l923K40J770N671N96M772K051q448j729K78q384k969O346k985
7241g208k057K815q033k757M343P159L327j689l189r86M573j289L56O19k658o153
7225a2827L885R10K775R410J63p653p849K064k733K58N188K234n048q459M618
7210a3064K673M80p340j869L868P932j50k674L665N92k277k529J53K951K099K168
7194c322k353K892L099K55q379k523R265J667j956o672k005J436O962K125m076
7179c585k119j407k108K752K470O086N887M131L40l202p423j1197L291k599j183
7164i866L186Q544K926m14j0143q142M668P332p263k901j97k870m82j915K712
7149a4825P051p104J106K881O842P747R94n665J150Q13k161k136l98O0m281j572
$$ y = [-3960, -2756, -494, -4417, -4177, -2407, 3264, 3860, 8632, 10683, 2235, 506, 784, -7600, -10569, -4223, -7208, -9265, -6450, -14483, -17240, -12897, -5738, -2411, -4100, -7289, -8275, -3702, -4991, -4635, -4016, -6674, -12827, -8942, -8032, -5257, 4153, 4316, -3337, -11186, -9122, -11855, -11597, -6409, -4175, -9223, -17682, -13064, -10391, -9911, -17251, -19120, -15252, -7320, -7470, -10144, -6479, -5887, -8164, -10693, -10540, -7589, -5490, -3322, -5675, -2783, 316, 571, -7808, -10331, -1066, 601, -1355, -8027, -10032, -8596, -1634, 491, -3585, -5704, -7111, -9219, -6467, -3997, 2089, 7976, 12107, 12447, 9245, 1822, -9375, -6084, -8683, -9866, -6680, 1864, 4790, 4376, -5767, -13909, -9241, -1909, -9172, -12073, -12270, -15140, -15622, -17537, -14825, -7774, -14878, -13772, -10891, -4049, 3698, 4692, -973, 177, 990, -1171, -3307, -3705, -3645, -7926, -9498]
7133i498k801p32K64K955l69l68P099L302l641P558j288n407K461P521m964l357
7117a265o632m790n135p464k438J2617J1113O883k291O275M977l381k216j550
7103D703l570j491L32j81R93j262l332P571K872q908j267K314P247J831n350o836
7087d334M776N55j977J325j439o98o344p08N803M809n69J008l818n360l083l100
7071a3154N01j930m821L23j295K140R572O523J411o441j1681L926k092l483M232
7056a6269O934O463O110k797k190N805L909K232n881p969j234q134r66K859j017
7041a2145L11J37M59L658L551N76k62J588j608l674o75k463O148O29n323J098
7025g995M036L962K940K661n307m686r95k407n888P067M315L349m176p73K769
$$ y = [-9498, -12299, -13031, -12767, -9812, -10181, -10549, -3450, -148, -3789, 3769, 2481, -2926, -465, 7056, 2092, -1265, -7897, -12687, -17822, -25286, -27724, -15107, -3994, 2889, 598, 6873, 11850, 8469, 6253, 4703, 1133, -358, -26, -207, 786, -476, -3808, 3763, 6635, -2273, -3540, -1226, 6021, 7852, 2502, -4334, 442, 997, -980, 345, -1094, -1792, -8136, -8844, -3041, 1768, 1199, 2207, -1611, -6971, -10054, -13154, -12653, -14583, -19404, -19081, -20376, -18236, -8664, -2141, -730, -7171, -18852, -14926, -17018, -20501, -16269, -9335, -2872, 3238, 441, -1749, 4056, 7965, 10197, 4316, -3653, -4887, -13021, -13987, -11128, -12145, -11834, -11697, -11238, -7580, -4029, -3453, -3715, -2127, -3735, -7409, -8084, -10547, -4399, -3770, -9093, -7995, -3959, 3, 2943, 5604, 297, -4389, -5384, -7791, -13679, -6612, -2297, 1052, -3124, -3897, -1128]
7010a128j725K199J83m573l275k167k418J623j134j651k037m710Q23J1569M391
6995d030K860l552k22j978n493K797K925M391p04L297M897l43l566k412o71p456
6979i260m168l323O213O643L974n179J040O21m982r44J171L30K657K690n608m099
6963a2224k406m503L206K824N770P752M139j1258q484K984P606L323K021L005
6949C755n217M88j683L77N53j952l892K922J515M414p808q037k288O428J636j851
6933a0640j74N4J789Q742K711K93O096p347p133o48l957J782K455J449O244o917
6917e201j088R44p310j632R094M324K401l314r977n760Q850J2725L752k862j799
6902C147J408n302l790L589r008q35N569n062p60r52L2Q60L68J402J395N240k452
$$ y = [-1128, -2853, -654, -471, -5044, -8319, -10486, -12904, -11281, -12415, -14066, -16103, -20813, -19990, -8421, -4030, -1170, -4722, -4944, -6922, -12415, -9618, -6693, -2302, -3006, 291, 5188, 4845, 1279, -1133, -1804, -9260, -13428, -16751, -10538, -3895, 79, -5100, -4060, -3439, -8421, -9365, -8194, -7864, -5207, -2517, -8125, -12224, -14630, -19133, -15927, -13103, -7333, 419, 4558, -6700, -15184, -12200, -4594, -1271, 750, 3755, -1462, -974, -2657, -2280, -1727, -3679, -7571, -4649, -3134, 1280, -6528, -14565, -16853, -10425, -8789, -10640, -10814, -10760, -8971, -229, 2482, 2775, 8871, 1524, -5609, -6257, -10214, -8432, -5977, -4528, 1716, -5201, -6289, -5345, -12655, -14287, -5193, -869, 1532, -1782, -11759, -17519, -8669, 4056, 7808, 4946, 3147, 4555, -747, -4537, -948, -9956, -10791, -5222, -10284, -11044, -11996, -11964, -11104, -10736, -9334, -7939, -2699, -5151]
6885e151l015k54l153N33N050L668L934K706m480q846L754R15m643q081J346J471
6869a4246K944k949m309K522N375P994N654m935l415l0j473m946k930J319K291
6854a1134K31O291K369n657J604L755M509O199m819o496n318m754l344L544q14
6839a3834L869J2117n119m87L355J250J507o49l924r915l564O950j313j0222J42
6824a9837p06L408q83L151R797l48j901k079M08k259k06J036J620L455o165m551
6808a6060N899j787J745o592k7N161L528N02O236l031J267L009o423q00M559r27
6792c741j789l911K605j699L821O129m696l207L875j229J650k521q047m243P087
6777i916O631M226O04m503p734k371N557l90K88j272O11N429K569n250j122M455
$$ y = [-5151, -8166, -8420, -11573, -11040, -5990, -2322, 1612, 4318, -162, -9008, -5254, -4339, -8982, -17063, -15717, -14246, -11302, -14251, -18560, -16038, -10663, -2669, 2985, -1950, -5365, -5395, -6868, -11814, -14744, -13425, -11134, -10903, -4612, -2243, -7900, -6296, -2541, 1968, 8167, 3348, -3148, -8466, -13220, -16564, -13020, -13834, -9965, 2152, -2967, -3454, -99, 1151, 2658, 2009, -1915, -11830, -15394, -8444, -9757, -19979, -19837, -20543, -17135, -18018, -14867, -5070, -5418, -7319, -9398, -8990, -11249, -11455, -10419, -8799, -5344, -11509, -16060, -10161, -11948, -10203, -16795, -16822, -11661, -8133, -7631, -1395, -4426, -3159, -150, -6573, -7373, -2814, -3741, -5530, -9441, -6836, -8535, -4714, 1415, -3281, -6488, -2613, -3842, -2192, -4713, -12760, -17003, -9916, -3285, 941, 1545, -2958, -10692, -13063, -7506, -7896, -7608, -8880, -8269, -2840, -271, -5521, -6643, -2188]
6761b188P689n270p717J3K142J748K584j553l005l380L08k890o300j527j742M267
6745a6821K011K441K076J697j78m162O61l39m44K683M935J350K134m532r10p17
6729h115k700N290j00k311n1p36J078K17k99J50M170P50k856J243k511P32J143
6712d906L360Q818K492m216l314o521O36J439p90j201L637L675L376k453l030
6697A002l237j615J907N913k121J297l212o571j471N160M950K339k769o285m03
6682e116j880j881M396K976l904j284l182l816P81J950O198k919L262M173j386
6667a632l217p66J829L066l57j43l162l179k660O220K421l545n280J035Q763o93
6651a300j822K033P999J0316k89j2370j824p752p66K674N41K739l295l885J388
$$ y = [-2188, 5501, 231, -7486, -7473, -5331, -3583, -999, -2552, -5557, -8937, -8629, -11519, -17819, -19346, -21088, -16821, -14810, -12369, -10293, -8596, -8774, -12936, -12275, -12614, -13058, -10375, -5440, -4090, -1956, -6488, -7398, -8115, -10815, -5525, -5625, -7936, -7987, -8723, -7645, -7428, -7727, -7577, -3407, -2657, -5513, -4270, -6781, -6049, -4906, -1546, 7272, 9764, 5548, 2234, -4287, -3651, -2212, -3002, -4203, -566, 3109, 6485, 4032, 1002, -2235, -3850, -1943, 3970, 1849, 3146, -66, -6637, -8108, -2948, 2002, 4341, 1572, -4713, -5116, -6996, -8877, -4481, -1505, -5409, -6693, -9875, -13691, -12910, -10960, -4762, -7681, -4419, -246, -1632, -4849, -5615, -3786, -720, -1077, -1220, -4382, -7561, -10221, -4001, -1580, -5125, -10405, -9370, -607, -1300, -3122, -1089, 6910, 17226, 16937, 4567, 2743, -5009, -5775, -3101, -2560, 179, -3116, -7001, -5613]
6636e613P35O127L028J207r712l98p081p065K516P894l157m801K240m016R80K09
6620a6907J982j781n76K696O374K538L317M049K203p91o936l820R864P14r802
6605f876K064J873j585r16K968j27k281K473O25q087j28O881n83j945k551J037
6589g158r54J80k59L616Q723Q661J087l888j0564m134l939k373R125Q537j871
6574D789k453M71J143k241l314j423J44N158J061n946m077O330o1M044K337L018
6558H980K92j0105p549Q775L562k658o556j641M047o374J292Q20l8J564O014J740
6542B165J519k711r337n424O141L67K337q046J614K766K887k446r60j917M618
6527f427J783k859o27M852N00m493J64R754l200k032j797j272q284j226j151O674
$$ y = [-5613, -4878, 1249, 4277, 5484, -4228, -4626, -11707, -18772, -16256, -8362, -11519, -16320, -14080, -18096, -17116, -16907, -14925, -16706, -17282, -14586, -8212, -5674, -2357, 1692, 3895, 3104, -3832, -7652, 2212, 2926, -6876, -4812, -2939, -4524, -5440, -2472, -2599, -4880, -2407, -1782, -9869, -9997, -3116, -3699, -5644, -8195, -7158, -8112, -7932, -8191, -4575, 4148, 12809, 13896, 10008, -556, -4690, -8629, -11002, -1877, 6660, 4789, 2336, 2807, 3950, 1709, -1605, -3028, -2884, 2274, 3335, -2611, -6688, -358, -419, 3625, 5962, 8980, 9272, -833, -8382, 393, 3955, 1297, -5259, -6900, -2853, -9227, -7935, -7115, -7153, -5589, 425, 2165, 3684, 973, -8364, -13788, -7647, -7280, -4943, -12989, -11375, -8609, -5722, -8168, -9128, -11045, -6427, -4644, -7503, -8130, -3278, -2778, -7271, -7107, 2647, -553, -2585, -4382, -5654, -13938, -15164, -16315, -9641]
6511i641q46P10M73N170L638m459l616K817o433J407K47N586J636R55p738l426
6495a3520L900L793J0717J476m371j567m658k134N245l934M226L363n901M838
6481A473L94q067k808N205J083l718K042P943q95J58o179j469K141Q39R50N32
6465c76M323N836k33o771o244M72n388m86J2658m015j552n862K606R240j787j549
6449H72n961k809J4771n029n975J985o320l619J586m229k384P694J991L985P750
6434D308n527J901N144m851m206J393o479r71J661K474J448o338l090J367K427
6419i339N697N126N45l124J44J26m1L722M339n321j1143k538j714P280L792l08
6403b757L899m00M356K738l582p732m369j986o730O378L868j389N113J630r50
$$ y = [-9641, -10487, -9777, -9304, -4134, -496, -4955, -8571, -5754, -12187, -10780, -10533, -4947, -3311, -2356, -10094, -13520, -9620, -5827, 4890, 6366, 1995, 428, -4230, -6364, -1119, -5053, -827, 2536, -3365, 1473, 1867, -6200, -9008, -3803, -2720, -6438, -4396, 3547, 2652, 2810, -3369, -4838, -2697, -1858, -908, -376, 3947, 9783, 9550, 2779, -3465, -2993, -8381, -8867, 3791, -224, -1776, -7638, -5032, 4208, 2421, 872, -5089, -7898, 6873, 1844, -4131, -2146, -8466, -12085, -10499, -14728, -17112, -9418, -7427, -3442, 4308, -1219, 682, 5826, 975, -3231, -1838, -8317, -9288, -7627, -5153, -3705, -10043, -13133, -11766, -9339, -3642, 1484, 2029, -1095, -951, -825, -866, 2856, 7195, 1874, -9269, -11807, -13521, -6241, -2449, -2757, 1142, 742, 5098, 7836, 4254, -3478, -7847, -9833, -16563, -10185, -6317, -7706, -2593, -963, -1913]
6388a913m074q19K444n818K181M59r23O088N431l433R72l337k327K295o62N616
6372B180j428j382r855k527L211o97L573j483j533M729j814Q770q39l760k775
6357e630K033p59j618L075R41j919n69L452L087p38k924J908R85k768q4Q245J259
6340G976J384m460j0169q553k658J404P664J968N946r3k351M256K202q387j0494
6325a4365o767M099M451M736J1959L058j58J088j0526j4195j141N333Q025R89
6311c414l763N36r398O929M275L253O704k865j521j018l671j12K496l698m376
6296i643L035Q03M987K292J73l051j842J031K193O640P4j0558p69N099R63Q90
6280B317K201n220k491J781k403o472P4Q353p9O271k380J477L350q368k156k31
$$ y = [-1913, -5987, -6806, -4362, -10180, -7999, -7540, -8463, -2375, 3056, -377, 595, -2742, -5069, -2774, -3436, 2180, 752, -630, -10485, -13012, -9801, -10498, -6925, -8408, -9941, -5212, -7026, 1744, 905, -2855, -5630, -3597, -4356, -5974, -2899, -1958, -3877, -4446, -994, 2093, 1355, -1569, 339, 1324, -1444, -1528, 6717, 7976, 9360, 4900, -5269, -13822, -16480, -15076, -7412, -5444, 502, 409, -1942, 2314, 4516, -3871, -14365, -21132, -17033, -12582, -7846, 4113, 7171, 7013, 8101, -2425, -16620, -17761, -12428, -4403, -3414, -7177, -6641, -16039, -9110, -4835, -1582, 5122, 2257, 736, -282, -3953, -4065, -1569, -5267, -9643, -6608, -5805, -818, 1474, 1647, -1404, -3246, -2215, -22, 6618, 6692, -3866, -4635, 464, 1427, 2317, 4518, -702, -3193, -1412, -3815, -10287, -10213, -1860, -1939, 4332, 1952, 3429, 6779, -1589, -3745, -3976]
6264c976N88k116L35k998K191L566K794K368Q25l302p847L580K753p101m251m07
6248a2998L859J241J54P887L777J07P30J103k192m82m274k96K521p57l038j026
6232c684M324N408k916q370j1381k104K916P731K819n484l573L768M279p138K364
6217a1041l219O001R718O284K011n586j596m461r074k544l534k889K116M848K
6202a2964J1418J106K634o567k242J414K723Q80M677o569n065K764J277o65M758
6187d21J658K815J00m291n1j229L871p44l086k814l416P116N825n679k57n926
6171f529o061N230N130p01n73M277j070o8R2R19m000J434L215L131M35m291l758
6154c188J621q999n257M260L594R085O293o346k960Q849J818J708K092l128j380
$$ y = [-3976, -3388, -5504, -5169, -8167, -5976, -2410, 384, 2752, 3577, 275, -7572, -3992, -1239, -8340, -12591, -12998, -9139, -7898, -7744, 143, 3920, 4027, 4757, 5860, 3668, 3186, -1088, -1384, 1137, 380, -2658, -3684, 640, 6048, 3132, -5238, -16619, -18723, -15807, -8076, -5257, -10741, -14314, -10546, -6267, -13405, -11041, -14260, -8259, 1459, 7743, 9754, 4168, 2572, -1889, -10963, -13507, -17041, -19930, -17814, -12966, -12964, -1546, -440, 2194, -4373, -6615, -5201, -2478, -1598, 3079, -3490, -8555, -5791, -4514, -5179, -421, 1237, 4052, 4152, -139, -190, -1419, 2452, 1708, -1378, -4192, -7608, -492, 5333, -346, -603, -6529, -12590, -7360, -2230, -2931, -3504, 773, -297, -365, -273, 646, -3354, -1920, 1295, 4426, 4861, 570, -3188, -1567, -10566, -15823, -11563, -7969, 1116, 7409, 1063, -1897, 6952, 8770, 10478, 12570, 9442, 8062]
6139H062P19m792J689Q90l137k763J80N194m94o396q861K698J1583M884l215k565
6123C676m567O400Q26j961K445K586j673L24j638m867k895k465l987J907J535
6108d354K245N95l43R203m328o419o145K443M202N56K317J247n955n949M11J05
6092a0169k305Q280P793k224n873j084k282L853R345r88J240l877j0356j0891
6078a9538R669Q461o60j285o65p316K471O461q916p005O361O50J14l52l041R99
6062a3592L298O542Np98J342J779J682O64M465k748p324l821p08l777M095n747
6046a4643l650Q404M736N997N808J595p411q40M308k259m618L548l785j0719J896
6031a1633K594k816j435L854N187J233j392j628l490L570P045M646j416m456l267
$$ y = [8062, 8781, 3989, 5678, 6568, 3431, 668, 848, 6042, 5548, -848, -9709, -7011, 4572, 9456, 6241, 3676, -891, 5509, 6335, 4374, 6819, 9405, 7732, 8056, 6418, 1551, -1344, -3809, -7796, -5889, -4354, -2109, -1514, -1857, 7346, 3018, -3401, -9546, -7103, -2901, -2345, -28, 1219, -4736, -10685, -10274, -10169, -12474, -4194, 3599, 1375, -4498, -5582, -7864, -4011, 5334, 4346, 5586, 1709, -8647, -19538, -9869, -1408, -2068, -3353, -4018, -11334, -8863, -2402, -11318, -18323, -11962, -11312, -11198, -11550, -14591, -13592, -10294, -3752, -3747, -4545, -3203, -1424, 258, 922, 5387, 2639, -4685, -8506, -9214, -12991, -8896, -14643, -18293, -9889, -5153, 844, 6652, 8247, 836, -4, 4304, 2045, -2573, 975, -2810, -13529, -11633, -9039, -11855, -13290, -9436, -4249, -3016, -4408, -6036, -9526, -5956, 1089, 5735, 4319, -137, -3404]
6016c404k519k75M904m2j339N324l619j222J155k151k611M588j466J256M191l079
6000c09l032n346K447l826j012l543L144J036J234J186p47l669N093L719N342
5985A717j08N273r09j1817m374J38O582O206m595k059k583N83k38M35k212K599
5969e362k299L063J946K5k877q07P53P44P008J472m927j026m607o015J237P65
5953a0907J477Q78q32K413J268L805N67o008n32Q339J73m141l09Q86n007J0243
5937B313L481m815j320l347m99j401p810j796R052j256j08L964k666l954k884
5922a3046Q796P599M14j681n177m069L703R247M749k412n331m943L718j371o939
5907f743K729N871k069k217L7K371j310o79o89k054o383K462L96j065N219O193
$$ y = [-3404, -5923, -6198, -1294, -1336, -2675, 2649, -970, -2192, -1037, -3188, -5799, -1211, -2677, -1421, 2770, -309, -3341, -8687, -6240, -10066, -11078, -14621, -11477, -10441, -9207, -8021, -8768, -12437, -7344, -3625, 1717, 1609, 6882, 5973, -5844, -10218, -10080, -3498, 2708, -1887, -3946, -6529, -5946, -6184, -5749, -7961, -5362, -7661, -4598, -2652, -2627, -5504, -6311, -5558, -4814, 2194, 3666, -1261, -2287, -6894, -12909, -11672, -10907, -9430, -8552, -9384, -6971, -5703, -1898, -1331, -7339, -7871, 468, 641, -3500, -3809, -2923, -7930, 2313, 5794, 979, -341, -3688, -4187, -5588, -13398, -15194, -6142, -7398, -7506, -3542, -6208, -10162, -13046, -4250, 3349, 3763, 2082, -3095, -7164, -3461, 5786, 10535, 8123, 2792, -2151, 1567, 196, -6743, -4014, 1857, -212, -2429, -2392, -21, -1331, -2010, -2699, -4753, -11136, -8674, -8278, -9343, -4124, 2069]
5891B069j759j392m413L228l057j309n363j583J4210P706l535l516L168j287N81
5876C748o235r16j949n127k76N744P871M553m40p371r567K796L841L510L989n516
5860a345p652k307P462M297l77n249L294O891m167k363m670Q965L971m744j893
5845A13O44L368n52o100n505k342j562O915N212K849J466n781o833j103K393N396
5829a422J284j267M015m136l985p923N906J202Q558N148m053N368l105l916l862
5814b188J051K105o676j898Q700l072L84K316K966M200l025o116M369k039k072
5799i95p483M30J254o62k954l451M11P487P768n616q944J449P208J866O238M505
5783H511L903n558m716L290k339k733N49L226l151j331Mj148l244l047K773K060
$$ y = [2069, 310, -1082, -5495, -2267, -5324, -6633, -11996, -13579, 631, 8337, 4802, 1286, 4454, 3167, 3748, -2487, -3403, -5352, -10479, -10755, -5011, 2860, 7413, 6973, -398, -9965, -7169, -3328, 182, 4171, -1345, -8997, -11304, -3842, 455, 78, -5171, -1877, 5014, 847, -1516, -6186, 2779, 6750, 2006, 113, 757, 4125, 3573, -2527, -8032, -10374, -11936, -5021, 191, 3040, 4506, -1275, -8108, -9211, -6818, -1422, -138, -1405, 2610, -1526, -5511, -13434, -7528, -6326, 2232, 7380, 3327, 8695, 5590, 1674, -2188, -1137, 968, -5708, -7606, 1094, -1978, -1594, 722, 3688, 7888, 4863, -1253, 3116, 1077, -995, -8478, -8048, -6794, -7456, -10410, -13861, -13450, -5963, 1805, -3811, -12755, -11306, -4098, -2232, 4006, 8511, 12414, 6856, 2140, 5430, 3091, 358, 907, 4133, 982, -349, -345, -1493, -4737, -7784, -5011, -2951]
5767b951k98o601m109n348K934R662Q953K890o964m266p31R36P910j131l75K179
5751B690J682j685m558m280j243L183P343K127m00R34m363o039j478J849J857
5736b381m672L408J604K105O17k834k180q59K103j117k890O350J65J03n489n373
5720a1340J468P581N398l198p537O853L032m348L33o987K594O549J750K032j023
5705C157j223l87q45r525m960N31j25j817O734l224N814M374j176l586m242J997
5689h503Q907J1250q701j1067l280K079K543K534m025j378O337J407p470k400
5675a1767L340M217L251m603K700k087o414n359L579L718j238k192l787M803N287
5660f552j341L591L472K468J371n411k173m701k361j233n437Q53Q804K095j261
$$ y = [-2951, -3249, -9850, -13959, -19307, -16373, -6711, 2242, 5132, -1832, -6098, -6829, -5893, 2017, 886, 511, 2690, 4372, 2687, -1871, -6151, -7394, -4211, 3132, 5259, 4859, 5793, 1430, -4609, -6087, -4238, -2381, -7053, -3645, -2041, 64, 681, -2153, -4333, -5192, -3089, -4206, -7096, -746, -581, -478, -5967, -11340, -9872, -2291, 3107, -91, -7628, -775, 2257, -2091, -1758, -8745, -6151, 398, 2148, 4180, 3157, 1934, 1547, 702, -8823, -13783, -13252, -13377, -15194, -8460, -11684, -5870, -1496, -2672, -6258, -10500, -8503, 404, 11654, 2953, -8114, -11394, -9315, -6772, -4238, -8263, -9641, -3304, -1897, -9367, -11767, -8427, -4210, -959, -5562, -2862, -4949, -11363, -16722, -13143, -9425, -10663, -12855, -16642, -11839, -6552, -7893, -4302, -830, 1638, 3009, -2402, -4575, -9276, -11637, -12870, -18307, -17454, -8650, -6555, -7816]
5645g816J326O206J289n222j65Q10o706k251N741O242l51L145M336J694p631k077
5629a430L445l026n080Q43J758K398l658M245J553J92k273Q82l932o053k753J425
5613a1464M312j797J0737N597n626l110L726M59l712o45j613O702r86j0533k929
5598a0882L701R670k2l507M465N345L373q595j469M621o135k264r533n256O877
5583i611L595j537l459N335N198L625K374l40k395k228l545J674N281O086r718
5568C35q035J31j913K464M078K097n610o777M751k059J39Q290L270K291j227k318
5552i3k063J906q377j1735n46M456o13j358j660M029N565J669j855n280m359j756
5536b2070M002K557P278K346M462l183k767Q16K562R621o062m167p42M594O701
$$ y = [-7816, -6490, -284, 1005, -4217, -4382, -3572, -10278, -12529, -6788, -546, -897, 2248, 6584, 8278, 647, -1430, 2015, -1011, -6091, -5248, -3490, -1092, -4750, -505, 1048, 1240, -1033, -151, -4083, -10136, -12889, -11464, -7152, -8949, 1788, 7385, 1759, -1351, 2375, 2834, -878, -1523, -3136, 3566, 2580, -7953, -10882, -7181, 2489, 2467, -1040, 3425, 8770, 12143, 3548, 2079, 6700, 565, -1699, -11232, -16488, -9611, -6016, -7553, -11012, -5677, -479, 3146, 5520, 5180, 2785, 557, -2988, -1314, 3967, 10053, 335, -7700, -7569, -9482, -7018, -2940, -843, -6453, -13230, -8479, -10538, -10399, -2109, 1161, 3452, 2225, -93, -2156, -250, -8627, -20362, -20908, -16452, -17065, -18423, -20083, -16054, -10489, -8820, -10675, -15955, -20314, -22070, -18068, -15511, -8233, -5887, -1425, -4608, -7375, -6559, -3997, 5624, -438, -4605, -5347, -753, 5948]
5521E948o445l291o517j81l831j403J911O724k27l08J669j339p975j117P26J4229
5505a427N801k113K170o166j0216J423K662M091N469j516q694n452O24r72L372
5490a0944P094K141m073K057O068o443q358Q92K409l247L872M898k301p919k367
5475a6221J159J2924K904k613p127k522k078o18L358N571M1P019n528m947J752
5460f926J829J14K443J497L855j1360o716P52J972m133M574J120N779N074Q71
5445G45j0251N596R109j141m090l370q39J449o276j743J842o546n508K706N213
5430a3104j928J421k830l671m022Q436M558l261M824K191p550J725L475k959k992
5415a5687J645q56k843L561J0667P242l809j010m479l356k588J0099O36j173O135
$$ y = [5948, -497, -3788, -10305, -10486, -14317, -15720, -13809, -7085, -7312, -7620, -5951, -7290, -15265, -16382, -15656, -1427, 4374, 2261, 4431, -1735, -11951, -10528, -7866, -3775, 1694, 178, -8516, -13968, -13344, -14316, -10944, -3850, -1709, -5782, -3725, 2343, -4100, -12458, -11566, -9157, -12404, -8532, -3634, -5935, -13854, -16221, -15062, -2138, 766, -1847, -8974, -11496, -13574, -14192, -10834, -5263, -5222, 1797, -3731, -8678, -6926, -5097, -4983, -2540, -1043, 2812, -8548, -15264, -14512, -12540, -16673, -12099, -10979, -5200, -126, 745, -9506, -3910, 5199, 4058, -32, -3402, -4241, -2792, -9068, -10811, -8969, -15515, -21023, -18317, -13104, -15032, -13611, -16441, -20112, -24134, -15698, -11140, -14401, -9577, -7386, -14936, -13211, -9736, -12695, -15687, -14042, -14898, -17741, -14180, -3513, 3729, -80, -1090, -5569, -8925, -11513, -1414, -778, -1951, 4184]
5400D184K89j932j237L117R03j378k951o247J339O649k040l994P10n860q208L047
5384a3609J292Q211K463l577o88J846L037j412J02l242j027R15N612N489j590
5369C822m953J054M42J372j654k66M62J162K856J208J65l021m420p401L26J440
5353g406J220j612j683o066O82O681L179N514M494k128l964k416j894k974M457
5338c916l447j333J760L979R6L889J527J405m229J663j166n104q5N309l60k628
5322b640J830L227j393P67J813o509n521n191M461O515m596K816L230L92q624
5307i423l785L340R95K676Q702J717o649k625j728j395K727M329q084k763N574
5292f392J937k867m170k396j464J290M446n42L327N101L163J23m8m561P04m091
$$ y = [4184, 4473, 2541, 1304, 4421, 5324, 3946, 995, -5252, -3913, 2736, 696, -3298, -2588, -8448, -16656, -13609, -12317, -4106, -1643, -5220, -5908, -4062, -1025, -2437, -2335, -5577, -6604, -5689, -77, 5412, 3822, -1131, -77, 365, 1737, 83, -183, 279, 1441, 4297, 5505, 5670, 2649, -1771, -9172, -8846, -7406, -6186, -7798, -9481, -15547, -14865, -8184, -5005, 509, 5003, 2875, -1089, -3505, -5399, -8373, -3916, -7363, -8696, -6936, -2957, -2861, 1028, 2555, 3960, -269, 1394, 228, -4876, -4961, 348, -12, -2640, -810, 2417, 1024, 1791, 3604, -2905, -8426, -13617, -9156, -2641, -7237, -4421, -1191, -799, -9423, -13208, -9868, -8873, -6197, 2505, 4222, -2427, -5052, -6780, -8175, -5448, -1119, -9203, -11966, -6392, -4455, -7322, -11492, -13888, -15352, -14062, -9616, -10158, -6831, -1730, 1433, 1556, 1508, -3053, -2349, -6440]
5276f440j871J486N87l983j107K042M62O969Q891l845r85m873k001j784J634M365
5260d53K390p64j789L078j03l424m125M046M0L85J571r20M870p58j398K970l052
5243B564l767k42j499j644O163P543k127j613o89J692k845j214l808p264J278
5228g472J928K75L469K725n898r0k921K374P446l433m957J632N647j293k272K240
5212f00L177M001J487l124o984P38J991m258m187N28J780O42N616l610l734n804
5196a2341m638j458J2506N955M81n585k175L438J771j257n081j433N622L808P75
5181C88M65k986k735M381N762n32m583k230k679l499j140O572k943p29O782L411
5165C705q89j01o309q310L08j285J748K865K377K999n452L020K056j201j73n226
$$ y = [-6440, -8311, -6825, -6238, -10221, -11328, -9286, -8824, -1855, 7036, 3191, 2206, -2667, -4668, -6452, -4818, -453, 1937, 1173, -616, 2462, 2359, -1065, -5190, -1144, -1104, -719, 852, -68, 4802, 4044, 2646, 5616, 2564, -1203, -1445, -2944, -4588, 1575, 9118, 6991, 5378, 4689, 6381, 3536, 2322, -1486, -8750, -7472, -5544, -5269, -1800, 925, -4973, -5063, -7984, -5610, 1836, -1597, -6554, -4922, 725, -568, -2840, -600, 2577, 6578, 8065, 4941, -2043, -1305, 686, -3572, -7759, -7231, -5451, -4809, 807, -2803, -6537, -12341, -16979, -18437, -5931, 24, 505, -5080, -7255, -3817, -2046, -3303, -8384, -9817, -4195, -387, 388, 853, -2133, -4868, -487, 5275, 4743, 160, -2070, -4749, -8248, -9388, -2816, -5759, -6488, 294, 3705, 2816, 2715, -3594, -11904, -11596, -12881, -11133, -8268, -5891, -2892, -8344, -5324, -3268, -4469, -4642, -9868]
5149i868l060l613Q376J526K585J121q016L298K410L302j246K496R431N32k763
5134F511q595J338M478m872p46J919j026o606m144J675K27l624O515R777J0164
5119A2991R6J600n581r127J5k966m535P99J955n71n22p164j0899K546N246P091
5103i026K581P73n186o23K643L060P658J076q7p09m684r828q195O245R133L127
5087b042n20k12J447L735l647j866M437k80N66M596k87k283K356m882q380l334
5071a0596j806K75N426Q820M425K355N70J465M04o415Q6o76l354l650m00M377
5055A306l288m813J764k219k484L686M028N090p53l38J75j412q09N220k63j1182
5039f292j678p82J679J650R594J577Q29KK102N51r536r240J490L932k041J157
$$ y = [-9868, -12928, -16541, -8165, -6639, -4054, -2933, -10949, -7651, -5241, -1939, -3185, -689, 8742, 9274, 6511, -2084, -746, 3732, -1140, -1886, 33, -993, -7599, -11743, -10068, -9841, -13465, -6950, 2827, 12991, 13087, 14687, 9106, -21, -6, -2972, -7507, -6708, -4753, -5324, -5846, -13010, -23909, -21363, -16117, -9026, -6445, -5672, -10858, -11481, -8838, -5778, 1880, 2956, 2869, 2160, -2524, -12352, -20547, -14302, -5169, -2042, -2562, -2774, -1327, 2408, -1239, -3105, 1332, 1052, 1618, 6214, 5927, 3644, 6000, 1118, -7262, -10596, -12402, -12127, -6701, 2119, 6544, 8899, 9469, 10934, 11338, 4923, 5009, 4333, 979, -2671, -3071, 1306, -1982, -6795, -5031, -7250, -9734, -6048, -2020, 3070, 2317, 1979, 2154, 742, -67, 5153, 4890, -6292, -7970, -8752, -7073, -5423, 4171, 5748, 6577, 6579, 8681, 9232, -304, -9544, -8054, -4122, -6163, -5006]
5023e006K666k648r039J65j028q83q28P264J4637M657o378N240R97k490j1320
5008c994m991J648r31l30K200Q926p397k35J66l66q37l893J911O079M123p10r59
4991D10J604l442n059l069L981j12L307K715M032p711p292o368N648L801N305
4976b250J020j586q89j997K678M39o463n69M132M341P037J318n402L522J106J021
4960G458N333m37j773l00n246l725l953Q40k799O46J274l79N078j057n525L362
4944a203L148j413l236L476O106P850P8m105l20k619R92l194m933l605j461n681
4928a0120o147l392M448R820M081K145n691l631k24J496Q412P307J653n248m620
4913B89k018k218l779j527L120j185K999N669J052j876q942k500O79J2334M013
$$ y = [-5006, -2340, -4988, -14027, -13862, -14890, -15773, -16601, -9337, 5300, 9957, 3579, 8819, 9816, 7326, -3994, -8985, -7337, -8268, -8598, -6398, 2528, -4869, -5104, -4938, -5304, -6141, -10034, -8123, -2044, 2079, 1369, 410, 2014, -1428, -6487, -9556, -5575, -5687, -2380, 335, 4367, -3344, -10636, -17004, -11356, -7555, -2250, -1230, -2816, -3705, -5702, -3024, -2585, -9048, -9617, -5485, -1144, 5893, 7211, 1809, 5331, 6437, 7458, 12791, 12354, 10581, 10281, 5035, 1310, -2643, -1803, -4602, -3956, -2682, -3061, 2017, 960, -4565, -1203, 1945, 532, -2704, 772, 6878, 14728, 14806, 10701, 10381, 7762, 8754, 5560, 627, -2978, -4439, -10120, -16267, -19659, -15211, -5391, -1310, 835, -4856, -8487, -8711, -7215, 1197, 8504, 10157, 4909, 289, -1729, -3947, -7726, -9253, -6133, -7318, -4319, 1350, 2402, 526, -8416, -10916, -10237, 2097, 6110]
4898F110q828n871k330L653K736L323o49m553N925J622m861o656M618J671m676
4883h766q487O808R03O70l088K167M961K707O26j1368K481P567O336K520k269
4868C768O030l518q641o728k473K449o84K463J116m217J168R517L683J038j035
4853C936r071n039J189q971O413J3104K988p22j728m219n889j611j27Q841M110
4838C204o530p296n68L081j464K223R438N575k073o766k928j714R19n601j250
4823a1750k84L146R77M194l482Q57j432l758P406l047o953j721l132L44J3378
4808e257N845j990m502R92M432O701j1944o888Q94N741Q878K10n201j497J0934
4793G348j558n963k995j493L067K560n494M874K356m6k547q319k539O109J57K418
$$ y = [6110, -2718, -8589, -10919, -7266, -4530, -1207, -1856, -6409, -484, 1138, -3723, -10379, -5761, -4090, -8766, -17253, -10445, -9542, -8872, -11960, -9793, -4832, -2125, -1499, -12867, -10386, -2819, 3517, 6037, 3768, 9798, 6280, -2361, -9089, -11562, -9113, -9797, -7334, -6218, -10435, -9267, 250, 3933, 4971, 3936, -5135, -10174, -8985, -17956, -11543, 1561, 4549, 3827, 2099, -2120, -8009, -9620, -9747, -906, 3204, -3326, -10622, -11190, -8109, -9573, -7350, 2088, 7663, 5590, -1176, -4104, -5818, -4899, -10500, -11750, -12034, -8888, -7911, -3717, -7199, -6342, -7774, -11532, -4126, -7173, -14126, -15847, -18979, -18635, -5257, 588, -1402, -5904, -4912, -480, 6221, -5723, -12611, -11717, -5976, 2902, 3112, -2089, -3586, 7348, 5790, -173, -3168, -4661, -1594, 966, -4528, 346, 2702, 2656, 109, -8210, -10749, -4640, -4483, -2065]
4777b065l912P63R906L523q286j0482l29L690M28M956O911l013j685k797k107
4762d499N703J0297l660p624J157O237l132q901m183Q9j57J468M148J849L545
4747B337n315k455K821L577l274k531m227l784L444J650j517K74N712Q57q31O24
4731b638n051L338M036j519k77M275O454M40o664j572l527k988L496m403M94M642
4715a464K141m16k577L757J0552m576j2456M88m42J641r38j037k404L493j81j2654
4699a7073M222N612l960J541L925L863p46J281j41j424m585J558K444j989j467
4684f939M719Q569n846K95J26K211R67k590O1M203M22j1762l546j243J928J147
4668g278J657K059M212k156p29J541K645r27L68L750q17j95m148o26M25k815p413
$$ y = [-2065, -5977, -5214, 4692, 8215, -71, -10553, -10882, -7192, -6764, -1808, 5103, 2090, 405, -2392, -4499, 1204, 11501, 7841, 217, 1374, 7611, 4479, -4422, -8605, -8516, -8673, -7205, -3057, -1208, 2337, -2978, -5433, -2612, 965, -2309, -4840, -9067, -12851, -9407, -7757, -9274, -9000, -3288, -2431, -3262, -2638, -7689, -4351, -315, -1834, -2111, 2164, 8618, 9058, 2394, 822, -2705, -5693, -2197, -6600, -6106, -1464, 677, 261, -2316, 1441, 11993, 7417, -5039, -4551, -4993, -3352, -4290, -5327, -7731, -4238, -4419, -17073, -12851, -7239, -11199, -9658, -5733, -1870, -2616, -1335, -1476, -2900, -7485, -5927, -3483, -5472, -6939, -2220, 6349, 503, 798, 924, 3135, 4102, 1512, 1573, 5776, 6198, -5564, -9110, -10353, -8425, -7278, -5621, -3562, 650, -1506, -2235, -694, 1951, 1024, 1392, 5142, 4325, 4130, -18, -644, -219, -3034, -10447]
4651a0447K662o126K026L666J920J007N086L017m159l87o97n82j187Q247O765
4636A0811q958J887m570L019N25n680j079O635Q419J033j413k443o982m084j161
4621d041l771j791j202J823O469N117o053k017O939l78l210n1l286K25N135m00
4605d92k383o416k931L949J974m064j318J0265M288l219k690L75j06o90M84j836
4589d810k084Q240P732n494r2J713l119m598k365L181L3N99K852L47L242R0o879
4572a412o103l752k490l668M070m29J679N0J317J533n75O113l262j972P105K837
4556A041N45J997j655J02O317r18O26l217O120p696k238K153L009O796r523r309
4540e850l717m277J42Q795J085Q028k572j3251k667P283R625P862L132m460q362
$$ y = [-10447, -7785, -13911, -11885, -8219, -6299, -5292, -206, 2811, -1348, -1735, -2432, -3014, -4201, 4046, 10811, 1853, 3740, -830, 2189, 2714, -2966, -4045, 2590, 11009, 12042, 10629, 8186, 1204, -2880, -4041, -7812, -9603, -10805, -8982, -2513, 2604, -3449, -5466, 1473, 1095, -2115, -2166, -5452, -5227, -92, -492, -2875, -9291, -12222, -8273, -6299, -10363, -11681, -1416, 2872, -347, -3037, -2662, -2768, -3458, -2974, -4810, -6894, 1346, 9078, 3584, 3492, 5205, 2086, -2512, -4877, -1696, -1663, -1064, 1788, 2135, 5377, 5467, -1412, -7515, -11267, -13757, -17425, -13355, -13784, -12105, -12055, -10738, -9205, -9780, -3667, -6929, -8901, -1796, 1041, 1586, 3583, 1928, 2030, 8347, 7429, 8055, 4838, 10958, 3262, 1024, 3177, 6186, 12982, 3459, -5850, -9567, -13844, -13702, -4907, -3822, 4206, 1634, -11617, -14284, -7001, 2624, 10486, 13618, 9158, 796]
4525G96j3040J764L469M833K544q49j43M564q456j843K696n12L964k876q962O31
4509a1420K535R86L857m081L39M454J995m427K914p240K764L431L070m349k882
4494h054M906Q700j352j478N592l654q162L164M408n975m42P81L19O124L531N59
4478H967m226j796M670L142l816j1101l951m213L186M791m505P37R227k745n580
4463g213o10j55K831k730n041J265M55Q531K333n600o747j395o02M626j373K885
4447h540l208j349K316N744J0950N606J47N519n628P4K431j51q768p402q191M140
4431f310J1794N294j316r290k309M733k811M832R17k754N034l0k913L654j097
4416G428n406j03n852j933j951J377P086M546m114J120N565K090k757M821q301
$$ y = [796, -12244, -10480, -7011, -2178, 366, -483, -626, 3938, -4518, -6361, -3665, -4177, -213, -3089, -12051, -11420, -8885, -7899, -4042, -8123, -7784, -3330, -1335, -5762, -2848, -10088, -7324, -3893, -823, -5172, -8054, -3148, 5552, 4200, 2722, 8314, 4660, -3502, -338, 4070, -1905, -2347, -1566, -1247, 4877, 8408, 8967, 4741, 2945, 7615, 10757, 6941, -4160, -8111, -12324, -9138, -4347, -8852, -8115, 1112, -1633, -7213, -7823, -7978, -5147, -7877, -12918, -11653, -11198, -2667, -334, -5934, -12681, -14076, -14678, -10052, -11425, -8540, -11748, -13097, -10781, -5037, 5913, 11519, 11666, 17185, 11557, 11631, 14062, 13911, 5143, -2259, -10450, -6310, 5484, 10778, 9462, 172, -2137, 2596, -215, 4617, 5534, 2780, 7814, 7784, 4871, 8525, 7428, 2022, 1919, -3933, -5866, -7817, -6440, 646, 5192, 1078, 2198, 7763, 9853, 7096, 11917, 3616]
4401C616M879J577q982k048L412J502j615M44r75M820N26q772q30L914L74j957
4385a15K70l444k113L194L619N003M213k447k736j518j418k237P484J630J231
4370A0616j584J685m29J453m10l260l009o573l224K805K098j697P70L608k61O35
4354C223N823Q084K646q723m053K192l818p637N270P221k519q347m882N158j744
4339b106L948o597k792N138M682J000O106l768n097k376L913O059l590J799K603
4324H922m891k279L741j935L479k697n508O843J860O50m66n435L056M700n190
4309D850k630K811O09n586n879O74N20l06K706j419R034J382o81o995K013K5m148
4292c020k268K397m992P50J791J739K90o276M072J029N18q456n236O771O536k864
$$ y = [3616, 8495, 10072, 1090, -958, 2454, 3956, 2341, 2785, 1810, 6630, 7156, -1616, -2446, 1468, 1842, -115, 155, -3289, -5402, -2208, 1411, 6414, 10627, 8180, 5444, 3926, 2508, 271, 7755, 9385, 10616, 9032, 10717, 10288, 11741, 11331, 8071, 5062, -1511, -4735, -1930, 168, -1529, -759, 2849, 2588, 3223, 9046, 17130, 19776, 11053, 7000, 9192, 5374, -2263, 3007, 10228, 7709, -638, -5520, -362, -2106, 1842, -4755, -7547, -2409, 2273, 3273, 9379, 5611, 514, -1862, 2051, 8110, 4520, 6319, 8922, 4031, 1752, 5493, 3558, 7037, 4340, -1168, 5675, 7535, 8185, 7719, 2284, 5340, 10040, 4850, 2220, 5031, 5640, 54, -5825, -5151, -4631, -4937, -2231, -3650, 5384, 6766, 6085, -910, 1103, 1128, -3020, -5288, -2891, -7883, -7133, -5342, -3603, -3313, -9589, -5517, -4488, -3970, -12426, -17662, -10891, -4355, -7219]
4276g219l686K385K195l180Q22M84J0619J0040J352n750o520L519L266q499m726
4261d898k384J467k222m501O837R224j247J706M786J050j954K465p674j809M462
4246E308k703j047M191Q095m470r234J62J0959M169k800o645p911K192j733K685
4231A218N689J055L465k167J803p739q531q07R515R146l370k307o57j792L352
4216G873J952m721m113m048o206k497P583K973l866M488O510N512K590n909r886
4201a765l539P746K418O78j343N65K481n204O10n714L545j937j91p261N801J2502
4185I392j900n476o12l742l368L621P705k685p88j500j567L58O950k116K626M75
4169G373O38m154n693j051O92k174j918L814R740L795k203m673o352K499m908
$$ y = [-7219, -10905, -8520, -6325, -9505, -8683, -8199, 2420, 12460, 13812, 8062, 1542, 5061, 8327, -172, -4898, -7282, -5815, -8037, -12538, -5701, 3523, 2276, 3982, 8768, 9818, 7864, 10329, 2655, 846, 5308, 2605, 1558, 5749, 13844, 9374, 140, 302, 11261, 15430, 12630, 5985, -1926, 266, -1467, 1218, 6907, 7962, 11427, 9260, 11063, 3324, -5207, -6014, 3501, 12647, 9277, 6970, 6313, 4521, 7873, 9825, 5104, 991, -3057, -9263, -11760, -4177, -1204, -5070, -582, 5928, 11440, 14030, 8121, -1765, -5304, 2442, 4860, 5538, 4195, 4760, 7241, 2037, 2647, -3067, 478, -1459, -1650, -8911, -3110, 9392, 7492, 2016, 1404, -2338, -5706, -2085, 5620, 2935, 2147, 647, -920, -562, 6388, 4272, 6898, 7373, 8011, 3857, -1836, -2887, -2195, -4369, -6287, -2473, 7267, 11062, 8859, 4186, -2166, 333, -4575]
4154d575l182o794M329L902J16k259q991j088O943M583J681M69Q987L683r74j991
4138D839q688n987k487K505J65L569N994J709L134M055n498l743MK555K44k786
4122d16m312j390N437j35k611o916N834M190j156J017m726o195n262O973J426
4107h242K41K961j366K74j985m099K293K029q59M749L331j474r644L092N540K416
4091g43K477K324p795p568q91N269J017j59O28r37q25p45M495N501k152m742P04
4074d142J787J882j751J062q4k642k164M495L369j4q19J412K684L613r24r46o356
4057D62p356o749k287L809r14n520L480M257N025L272j171K133m423L05m95K979
4041c193K809q83m218o43P318n954k761M5J012M460l439p43K048J397K143n624
$$ y = [-4575, -7757, -14551, -10222, -6320, -6204, -8463, -17454, -18542, -11599, -7016, -5335, -4866, 4121, 7804, 6830, 4839, -3849, -9836, -12323, -9818, -9653, -6084, -90, 1619, 4753, 8808, 3310, -433, -429, 2126, 2370, -416, -4728, -6118, -681, -816, -3427, -10343, -4509, -319, -1475, -458, -5184, -11379, -16641, -9668, -8242, -8001, -5040, -6406, -6132, -8117, -12216, -9923, -7894, -8753, -4004, -673, -2147, -11791, -8699, -3159, -743, 1734, 4058, -3737, -11305, -12196, -6927, -5910, -6069, -5441, -6378, -7203, -7948, -3453, 2048, -104, -4846, -4142, -2355, -473, -2224, -1162, -1246, -3888, -6052, -1557, 1812, 1798, 979, 2391, 5075, 8688, 7764, 6818, 462, -6894, -13643, -15930, -12121, -13035, -18555, -15075, -10818, -5793, -2521, -3692, -1559, -5982, -5677, -6172, -3193, -384, -1267, -5485, -6128, 1190, -4764, -7525, -7480, -6468, -2008, -5447, -6190, -4142, -2745, -602, -6226]
4025f226M09L988J035j736n013R00R13m984O611p66j052k73P867L309m612m98
4009a28L185P960K2j75p554j2503K722J0795L623k597o757q73q2R35j0931m396
3993a6754L315M790L564L289L265R4k750l704r61L536N565j188j242l39M074j792
3977B762j912m308K364J077N43K719l336J404J0493m023k898J006m484n012j942
3962e547N286l174o81R04K852M993j642l591m459n294m741M979O075l084k467
3947i591L59J1456Q100N17n88p835r491K73N684o80o762K115P97Q526M727q4l517
3930D006j552l133j806j113j257l560N962M925L459q759K905j543q96k750l06
3915e418J452M927k783o15K182K28P499M60n697j529k952k660n269n037M858P67
$$ y = [-6226, -5817, -1829, -794, -2530, -7543, -6643, -5730, -10714, -4103, -4869, -5921, -6194, 1673, 4982, 370, -128, 3057, 11017, 11039, 10864, 3310, -9193, -6471, 4324, 7947, 5350, -1407, -2280, -2362, -1427, -12358, -16754, -13439, -8649, -5085, -1796, 1469, 1563, -1187, -4891, -5852, -2316, 3249, 2061, 819, 480, 4554, 2762, 850, -3458, -1094, -17, 526, 3245, -91, 1313, 11806, 7783, 4885, 5891, 1407, -3605, -5547, -261, -3435, -4116, -3212, -360, 4633, 2991, -600, -5059, -10353, -15094, -10115, -4040, -7124, -9591, -9232, 2224, 10324, 10841, 10253, 2418, -7073, -6800, -1116, -1796, -8558, -6443, -5646, 2880, 7607, 7523, 4006, 2454, -679, -2485, -3598, -4855, -8415, -2453, 2472, 5931, -2828, 77, -1466, -2362, -5112, -5418, -3966, 961, -1822, -2437, -255, -27, 7472, 7932, 2235, 706, -2246, -4906, -10175, -15212, -10354, -9587]
3899i587J223J2853M012m515j131J241l877l010k07N196O41k086L419m943q027
3884h798k233L944L484J269K602O02j725J64k273L51p47l610k998k199K544K981
3868f642L981n996m468P890o262K38N007K506j25l585k820K136m377J005P500
3853d012Q04j751P488P420j2j485r642l280k488k210J138N839k310l557K222R573
3837C737L078m755q335J484L900N178K22m694j098l831J813L569m098L426J046
3822F42p661j655P218o41m177K170p248o429Q350j149l904O04O027j352k262j975
3806a3442j509M103J492P123L705l590l739l141l126j72M078J1527q6m827M218
3791B614O533l513L854l354L968m93n178N43n565M600N008l581J610J029K144
$$ y = [-9587, -8364, 4489, 8501, 3986, 2855, 4096, 219, -2791, -2998, 2198, 2839, 753, 4172, -771, -8798, -11031, -7087, -3603, -2334, 268, 870, -855, -691, -2964, -2613, -3360, -6970, -9968, -12167, -9623, -6642, -2661, -8657, -13125, -5235, -11497, -11259, -6252, -3746, -3871, -7456, -10276, -8140, -12517, -11512, -4012, -3208, -4959, 2529, 9949, 9937, 8452, -1190, -4470, -6958, -9168, -8030, -2191, -4501, -8058, -5836, 3737, 6815, 2060, -6275, -4791, -891, 4287, 4509, -185, -1283, -5114, -3301, 268, -3830, -404, 642, -7019, -8674, -1456, -2097, -6274, -4104, -11352, -17781, -9431, -10580, -14484, -13880, -7853, -9205, -11467, -13442, -14951, -10848, -9356, -2233, 1472, -2118, -5857, -8998, -12124, -12296, -8218, 3309, 3223, -1604, 2614, 9147, 5634, 9488, 6134, 10102, 9609, 4431, 4974, -591, 4009, 9017, 5436, 7046, 8075, 10219]
3776A0219o486m831M349N900l520j828K133q66n044l587k330K134M005o73L338
3761B913J240o214m150l643P419k92l539L599k312l16l895m413P327M097k555
3746d734r8K487J1504j464j087P208k881k977k971l180n330K819Q897J686o577
3731C302p495p921r07K526K393K059p00l973N314J777j882N155N11K894J95j689
3715A559N97Q239K422l745n049j1131N483N143l546J171J638m285M13l395K600
3700a886J046M504J122k385k448Q0j596K262O469o898j371N052l57o830j746j655
3684f637o9L563o000l255M26k836K69P453L737J446K036O588N929k462j0797j005
3668a614J400J437k311l999m608m40O174M772j447J370K753j133N019o849o110
$$ y = [10219, 3733, -1098, 3251, 9151, 5631, 3803, 5936, 5070, 26, -3561, -5891, -3757, 248, -425, 2913, 4153, -2061, -6211, -9854, -2435, -2727, -6266, -2667, -4979, -5295, -9190, -13603, -6276, -2179, -4734, -4832, -2345, 9159, 7695, 6608, 13816, 10935, 7958, 4987, 1807, -3523, -704, 8193, 9879, 3302, -4193, -12114, -13021, -10495, -8102, -6043, -6743, -10716, -5402, -3625, -5507, -352, 159, 3053, 3248, 1559, 2156, 10395, 12817, 9072, 4023, -7108, -1625, 3518, -28, 1143, 2781, -1504, -1091, -4486, -1886, -840, 3664, 4786, 2401, -47, 33, -1563, 699, 7168, 270, -1101, 3951, 3594, -3236, -4982, -6637, -6706, -3143, -9143, -12398, -11972, -14808, -14539, -7086, -3349, -1903, 133, 6721, 12650, 10188, -609, -1614, -214, 1223, -1088, -5087, -9695, -10135, -3961, 811, -636, 734, 3487, 2354, 7373, 524, -5586]
3653e586m474J950M040J099Q085Q778N34j852L247J585l109l881n451n071o333
3638f439j866J361M325K829l664o981N427L055J747p155l496k676L604O36J565
3623g728Q180j305P47P184r211o002J397J897k138m282J68N401K788Q2N188L700
3607F066L363O037m513o018O9J420k098J282j877n414n56j613j124J605k451K618
3591c204L617l49K980p271n51O546p526P72L032L739J945O510K69o704n033j061
3575b289N582O739k294M24j270p91k268l968l815p501J995J0530J1472j79O1M409
3559A6837j051m048R86k053J18K906l884n410L612l729m28O757q9o045m479l601
3543c601j007J37K777J053L744M990K28l336k55O40k987l344K406l064J800M111
$$ y = [-5586, -10060, -8110, -4070, -2971, 5114, 13892, 14426, 12574, 15821, 17406, 14297, 10416, 4965, -106, -6439, -8305, -6944, -2619, 210, -3454, -10435, -5008, -1953, -206, -7361, -10857, -13533, -9929, -9293, -7728, 452, -853, -106, 7078, -2133, -8135, -6738, -4841, -6979, -11261, -11093, -5692, -2904, -2822, 2366, 6066, 9429, 15466, 10953, 4935, 5004, 6424, 4326, 5608, 3731, -1683, -2239, -3852, -4976, -3371, -5822, -3204, 413, 64, 3044, -4227, -4778, 1768, -5758, -4986, -1954, 1785, 3730, 10240, 10509, 3805, -1228, -2289, 3293, 10032, 7738, 8162, 6892, 6101, 3833, -135, -3950, -11451, -9456, 1074, 12546, 12367, 12428, 16837, 15786, 11738, 12724, 10671, 10789, 13695, 9811, 4401, 8013, 4284, 3856, 10613, 10524, 4479, 0, -3601, -4608, -4471, -1694, -641, 3103, 8093, 8321, 4985, 4730, 5370, 2383, -961, 1445, -1619, 181, 4292]
3527D292K701K666r09o46l590m860J854k88p019j43J844R05p81M639M075Q76k147
3510C469q197j32O865L722o475o039l509P94L429N514P268K529l756n793j440
3495a751k947n72K827K646N908M461K884j379K21j475K363k865j1816k254J703
3480b046L457j324L794M262j095k19J075l520l212J450J472l138k071l571n844
3465a0530k077L271n648m912J4011R499O000j460k927j770m717j630L445M007
3451D562j316o697j413q8o772P96J1960J2193n1n788J168J574o763p250L695M263
3435D073K01N34l00m825J56q093o055O299N03m925O991R424q14m772L599L076
3419E072j086P603K054j0261k308m30L816K024n626l790n444P12J540M201J003
$$ y = [4292, 6993, 9659, 8750, 8104, 4514, -346, 1508, 1220, -5799, -5942, -4098, -3193, -3974, 665, 4740, 5616, 3469, -4728, -4860, 2005, 5727, -748, -6787, -10296, -9502, -6073, -559, 6709, 9238, 5482, -311, -1751, -4698, -5270, -2443, 203, 6111, 10572, 13456, 12077, 12298, 10823, 13186, 10321, -1495, -3749, -2046, 1411, 87, 3881, 8143, 7048, 6829, 7904, 4384, 1172, 2622, 4094, 956, -1115, -4686, -10530, -12607, -9336, -14984, -19896, -5885, 3614, 9614, 8154, 5227, 3457, -1260, -2890, 555, 4562, 3246, -3451, -4864, -4952, -11724, -10928, 1032, 13225, 13174, 7386, 8554, 10128, 3365, -3885, -190, 4073, 4274, 4808, 4508, -317, -161, -8254, -14309, -8010, -7507, -12432, -5441, 3983, 3169, -1603, 1996, 5072, 3986, 11589, 13643, 3382, 1074, 644, 4460, 6484, 858, -2932, -8376, -7664, -6124, -1923, -920]
3404i20K629L925p02K683Q89k406n064J77O518K5k793J981M547k064q818K494
3388C101O866J538K64q107k958q0j831k607m780l272P812M124o265J536k679l627
3372a0965j102J054J242J202N08N126K743k243m791N509K88k302J504J30l844
3357e941p619m18Q089N956J187J338p28J175O333N332j741k459n144O08L14J165
3341G447k098J693O22N563l151p17O62k378N060l152p628k541j408M98j87L070
3325A355k240K292K959k755L621j92P24M543r43m735j063m59k445l679P18k113
3309d412p503l3K644o74J1251j409J723l13O507j686k720K163o94N10L88J562
3293G304r90L560L237j02k492J40J287J255m831K492p095l204N50K556L077l281
$$ y = [-920, 1709, 5634, 4932, 7615, 8504, 6098, 1034, 1211, 7729, 7754, 4961, 6942, 11489, 9425, 607, 3101, 9967, 11505, 11769, 3662, 704, 624, -1207, -3814, -8594, -11866, -4054, 70, -6195, -4659, -7338, -10965, -12067, -11013, -9771, -8569, -8061, -2935, -192, -2435, -7226, -1717, -1429, -3731, -2227, -2097, -5941, -13560, -13978, -5889, 67, 1254, 2592, 1864, 3039, 9372, 14704, 12963, 10504, 5360, 5968, 6282, 7447, 5349, 7042, 7664, 13227, 10076, 9359, 10021, 7643, 12703, 9551, 1923, -618, -2026, -1528, -1715, 1355, -885, 1407, 4366, 1611, 5232, 5040, 5764, 10307, 9364, 4629, 3566, 3107, 662, -3017, -2299, -4412, -11915, -11948, -9304, -9978, 1273, -136, 1587, 1274, 7781, 6095, 3375, 5538, 4844, 5354, 5742, 7304, 6314, 9874, 13111, 13009, 10517, 10657, 11944, 13199, 8368, 10860, 3765, 561, 1111, 3667, 6744, 3463]
3277C463m980j507N652L438q532m925k040L037Q512m932o647J689K659J316l403
3262g200m396K742L902J786M437K665l991K97n621j733o02J174Q920J2041j513
3247A2908l941Q93q92K60m441p231K52L837q36j369r87P267l772n382p06O210
3231B070O05l91M778k291n976K300M49l711m529J497R642K770r839K37J0043P67
3215H421k888l674m520L154Q343J287l203l016l001L421o01l854l209J097P428
3200E185m892O89O885l20p904j633N337K416K424O265o253q578r25J85o640L910
3184c849N359N092p98n242m017J212J757J777R193O577l605r934J023N96p197
3169b056k33o862k348L326k340K036J170l487O326Q190R125K291p231l951m752
$$ y = [3463, -1517, -3024, 2628, 6066, -2466, -7391, -9431, -6394, 2118, -2814, -9461, -7772, -5113, -3797, -7200, -11596, -8854, -4952, -3166, 1271, 3936, -55, 242, -5379, -7112, -7714, -6540, 2380, 14421, 12908, 8967, 9860, 8968, 9228, 4787, -2444, -2192, 1645, 809, -560, -1547, 5720, 1948, -3434, -4140, 2070, 2675, 2284, 7062, 4771, -1205, 1095, 1544, -2167, -6696, -5199, 4443, 7213, -2626, -2389, 7654, 8421, 5533, 1859, -2661, 493, 8836, 10123, 6920, 3904, 903, 4324, 3723, -131, -3340, -2243, 5185, 293, 982, 7867, 7547, -357, -1990, 3347, 5763, 8187, 14452, 8199, -379, -1304, -1119, -7759, -3849, 1510, 6602, 5804, 562, -3455, -2243, -486, 1291, 10484, 17061, 13456, 3522, 4545, 5141, -2056, -2289, -9151, -11499, -8173, -10513, -8477, -7307, -10794, -4468, 3722, 12847, 15138, 7907, 3956, -796]
3154g96j289J678j050l83l342r30n24k940J168N279J51k871J078P801k566P23
3138A187j429k531m728l255m738P332R490m455k929M852l10l343p58R170N315
3123H870K669l878J161n027k336m75o344n191O522J1770L679K512m810p162J747
3108C707Q590l02n691j4330m674L410q74K462p4L447L071N056M390j842L049o59
3092H736n715l003j1684m73M734Q078L275Q033J5831J171j141j901j7852j5622
3078g533m694M211J0001P449K335q070p620m4J624J414l67k315J586M876N013
$$ y = [-796, -2085, -407, -1457, -1840, -5182, -6112, -6636, -9576, -8408, -3129, -2978, -5849, -4771, 3030, 464, 1187, -242, -2773, -7501, -10756, -15494, -8162, 1328, -3127, -6056, -1204, -1514, -4857, -5615, 3555, 8870, 11539, 7661, 8822, 3795, 1459, 984, -5360, -10551, -4029, 7741, 11420, 13932, 9122, 1960, 3707, 12297, 11995, 6304, -8026, -12700, -9290, -10164, -7702, -7776, -4329, -1258, 3798, 8188, 6346, 9395, 8736, 3021, 18, -11666, -12139, -7405, 673, 3948, 11981, 27812, 28983, 27842, 25941, 8089, -7533, -12227, -8016, 1985, 9434, 11769, 3699, -3921, -3965, -2341, -927, -1294, -3609, -2023, 2853, 7866]
$$ [...]
##END NTUPLES=NMR SPECTRUM
##END=
