##TITLE=Analysis number 314970
Compound Code btb 07732
Project Code adrs
Chemist Name stores
##JCAMPDX= 6.0         $$ Bruker NMR JCAMP-DX V2.0
##DATA TYPE= NMR SPECTRUM
##DATA CLASS= NTUPLES
##ORIGIN= Bruker BioSpin GmbH
##OWNER= NMR
$$ XWIN-NMR		Version 3.5
$$ Tue Nov  1 09:18:43 2005 GMT Standard Time (UT+0h)  MAYBRIDGE\NMR@NMR_250MHZ
##.OBSERVE FREQUENCY= 250.131544655141
##.OBSERVE NUCLEUS= ^1H
##.ACQUISITION MODE= SIMULTANEOUS (DQD)
##.ACQUISITION SCHEME= undefined
##.AVERAGES= 16
##.DIGITISER RES= 18
##SPECTROMETER/DATA SYSTEM= dpx250
##.PULSE SEQUENCE= zg30
##.SOLVENT NAME= DMSO
##.SHIFT REFERENCE= (INTERNAL, DMSO, 0, 16.522)
##AUDIT TRAIL= $$ (NUMBER, WHEN, WHO, WHERE, WHAT)
$$ ##TITLE= Audit trail, XWIN-NMR		Version 3.5
$$ ##JCAMPDX= 5.01
$$ ##ORIGIN= Bruker BioSpin GmbH
$$ ##OWNER= NMR
$$ C:\u/data/dgb/nmr/ADRS/11690/pdata/1/auditp.txt
$$ ##AUDIT TRAIL=  $$ (NUMBER, WHEN, WHO, WHERE, WHAT)
(   1,<2005-11-01 09:18:22.52 +000>,<MAYBRIDGE\NMR>,<NMR_250MHZ>,
      <created by zg, POWCHK disabled, PULCHK disabled
       configuration hash MD5:
       62 19 C7 07 E1 42 D1 B7 37 6C 3D D0 77 39 F9 E6
       data hash MD5: 64K
       BF B4 26 AB 6D 55 1B 20 54 EA D2 F1 00 D4 D1 C2>)
(   2,<2005-11-01 09:18:34.10 +000>,<MAYBRIDGE\NMR>,<NMR_250MHZ>,
      <Start of raw data processing
       ef LB = 0.3 FT_mod = 6 PKNL = 1 SI = 32K 
       data hash MD5: 32K
       6B C0 A4 13 D0 5D 7E 85 B5 D1 9A F1 98 36 C7 53>)
(   3,<2005-11-01 09:18:36.18 +000>,<MAYBRIDGE\NMR>,<NMR_250MHZ>,
      <apk 
       data hash MD5: 32K
       3E BE D0 88 4A AB 9A 7A 62 F2 8E 76 46 E3 B1 F9>)
(   4,<2005-11-01 09:18:36.86 +000>,<MAYBRIDGE\NMR>,<NMR_250MHZ>,
      <abs ABSG = 5 
       data hash MD5: 32K
       A8 CD DF 37 80 28 9D E3 AC ED 90 E0 60 89 EC E9>)
$$ ##END=
$$ 
$$ hash MD5
$$ 41 91 F5 A1 38 32 8D B8 20 42 37 36 09 CC 14 34
##$RELAX= 
##$RELAX= 
##$RELAX= 
##$RELAX= 
##$RELAX= 
##$RELAX= 
##$RELAX= 
$$ Bruker specific parameters
$$ --------------------------
##$DU= <C:\u>
##$EXPNO= 11690
##$NAME= <ADRS>
##$PROCNO= 1
##$TYPE= <nmr>
##$USER= <dgb>
##$AMP= (0..31)
100 100 100 100 100 100 100 100 100 100 100 100 100 100 100 100 100 100 
100 100 100 100 100 100 100 100 100 100 100 100 100 100 
##$AQSEQ= 0
##$AQ_mod= 3
##$AUNM= <au_zg>
##$AUTOPOS= <3 >
##$BF1= 250.13
##$BF2= 250.13
##$BF3= 250.13
##$BF4= 250.13
##$BF5= 500.13
##$BF6= 500.13
##$BF7= 500.13
##$BF8= 500.13
##$BYTORDA= 1
##$CFDGTYP= 0
##$CFRGTYP= 5
##$CHEMSTR= <none>
##$CNST= (0..31)
1 1 145 1 1 1 1 1 1 1 1 1 1 1 1 1 1 1 1 1 1 1 1 1 1 1 1 1 1 1 1 1 
##$CPDPRG= <>
##$CPDPRG1= <>
##$CPDPRG2= <>
##$CPDPRG3= <>
##$CPDPRG4= <mlev>
##$CPDPRG5= <mlev>
##$CPDPRG6= <mlev>
##$CPDPRG7= <mlev>
##$CPDPRG8= <mlev>
##$CPDPRGB= <>
##$CPDPRGT= <>
##$D= (0..31)
0 1 0 0 0 0 0 0 0 0.06 0 0 0 0 0 0 0.0002 0 0 0 0 0 0 0 0 0 0 0 0 0 0 
0 
##$DATE= 1130836701
##$DBL= (0..7)
120 120 120 120 120 120 120 120 
##$DBP= (0..7)
150 150 150 150 150 150 150 150 
##$DBP07= 0
##$DBPNAM0= <>
##$DBPNAM1= <>
##$DBPNAM2= <>
$$ [...]
##$SUBNAM7= <"">
##$SUBNAM8= <"">
##$SUBNAM9= <"">
##$SW= 20.6930455092707
##$SWIBOX= (0..15)
0 0 3 0 0 0 0 0 0 0 0 0 0 0 0 0 
##$SW_h= 5175.983436853
##$TD= 65536
##$TD0= 1
##$TE= 295.16
##$TE2= 300
##$TE3= 300
##$TEG= 300
##$TL= (0..7)
0 120 120 120 120 120 120 120 
##$TP= (0..7)
150 150 150 150 150 150 150 150 
##$TP07= 0
##$TPNAME0= <>
##$TPNAME1= <>
##$TPNAME2= <>
##$TPNAME3= <>
##$TPNAME4= <>
##$TPNAME5= <>
##$TPNAME6= <>
##$TPNAME7= <>
##$TPOAL= (0..7)
0.5 0.5 0.5 0.5 0.5 0.5 0.5 0.5 
##$TPOFFS= (0..7)
0 0 0 0 0 0 0 0 
##$TUNHIN= 0
##$TUNHOUT= 0
##$TUNXOUT= 0
##$USERA1= <user>
##$USERA2= <user>
##$USERA3= <user>
##$USERA4= <user>
##$USERA5= <user>
##$V9= 5
##$VALIST= <valist>
##$VCLIST= <CCCCCCCCCCCCCCC>
##$VD= 0
##$VDLIST= <DDDDDDDDDDDDDDD>
##$VPLIST= <PPPPPPPPPPPPPPP>
##$VTLIST= <TTTTTTTTTTTTTTT>
##$WBST= 1024
##$WBSW= 4
##$XGAIN= (0..3)
0 0 0 0 
##$XL= 0
##$YL= 0
##$YMAX_a= 373602
##$YMIN_a= -258071
##$ZGOPTNS= <>
##$ZL1= 120
##$ZL2= 120
##$ZL3= 120
##$ZL4= 120
##$ABSF1= 16.522
##$ABSF2= -4.171173
##$ABSG= 5
##$ABSL= 3
##$ALPHA= 0
##$AQORDER= 0
##$ASSFAC= 0
##$ASSFACI= 0
##$ASSFACX= 0
##$ASSWID= 0
##$AUNMP= <proc_1d>
##$AZFE= 0.1
##$AZFW= 0.1
##$BCFW= 0
##$BC_mod= 0
##$BYTORDP= 0
##$COROFFS= 0
##$CY= 12.5
##$DATMOD= 1
##$DC= 0
##$DFILT= <>
##$DTYPP= 0
##$F1P= 14.0000005364418
##$F2P= -0.99999901652339
##$FCOR= 0.5
##$FTSIZE= 32768
##$FT_mod= 6
##$GAMMA= 0
##$GB= 0
##$INTBC= 1
##$INTSCL= 1
##$ISEN= 128
##$LB= 0.3
##$LEV0= 0
##$LPBIN= 0
##$MAXI= 10000
##$MC2= 0
##$MEAN= 0
##$ME_mod= 0
##$MI= 0
##$NCOEF= 0
##$NC_proc= -5
##$NLEV= 6
##$NOISF1= 0
##$NOISF2= 0
##$NSP= 0
##$NTH_PI= 0
##$NZP= 0
##$OFFSET= 16.522
##$PC= 1
##$PHC0= 71.58247
##$PHC1= 6.561204
##$PH_mod= 1
##$PKNL= yes
##$PPARMOD= 0
##$PSCAL= 4
##$PSIGN= 0
##$REVERSE= no
##$SF= 250.13
##$SI= 32768
##$SIGF1= 0
##$SIGF2= 0
##$SINO= 400
##$SIOLD= 32768
##$SREGLST= <1H.DMSO>
##$SSB= 0
##$STSI= 32768
##$STSR= 0
##$SW_p= 5175.98343685301
##$SYMM= 0
##$S_DEV= 0
##$TDeff= 65536
##$TDoff= 0
##$TI= <Analysis number 999999
Compound Code 99
Book Reference 9
Project Code 9>
##$TILT= no
##$TM1= 0
##$TM2= 0
##$TOPLEV= 0
##$USERP1= <user>
##$USERP2= <user>
##$USERP3= <user>
##$USERP4= <user>
##$USERP5= <user>
##$WDW= 1
##$XDIM= 32768
##$YMAX_p= 329606781
##$YMIN_p= -876835
$$ End of Bruker specific parameters
$$ ---------------------------------
##NTUPLES= NMR SPECTRUM
##VAR_NAME=  FREQUENCY,     SPECTRUM/REAL,   SPECTRUM/IMAG
##SYMBOL=    X,             R,               I
##VAR_TYPE=  INDEPENDENT,   DEPENDENT,       DEPENDENT
##VAR_FORM=  AFFN,          ASDF,            ASDF
##VAR_DIM=   32768,         32768,           32768
##UNITS=     HZ,            ARBITRARY UNITS, ARBITRARY UNITS
##FACTOR=    0.157963299565203, 1,           1
##FIRST=     4132.6476996994, 0,             0
##LAST=      -1043.33573715361, 0,           0
##MIN=       -1043.33573715361, -876835,     0
##MAX=       4132.6476996994, 329606781,     0
$$ Real data points
##PAGE= N=1
##DATA TABLE= (X++(R..R)), XYDATA
$$ [...]
23594A155933K3850k37176k80527k21683K48611J86418K39520O183k33065K9120
23584I17184Q3194M6199j19657r8132j0567j54249k00119N5190J67525N9164j04729
23573F41003J32901P9561p0455K38259K69767J18684P6407r1235j00109j77473
23563A117310o8580M0953M8583q9631r5575l0331l6420Q8942K96615L4520l8642
23552A267744K4233J02479J30126P0110k40332j36525k07515j8804j06547j38007
23542G46962L20747L1249k95981j51235q2713K82100J36985l4520l5666K3791
23532I41719O8565j65376j76562K2833r5958o598J94295J00491Q8793N2413k7244
23521I97371J60428M2699J16141l3718j21776k6292J16506j4265o6048j19021
$$ plain form
23594 1155933 1179783 942607 662080 440397 689008 875426 1114946 1121129 888064 917184
23584 917184 1000378 1046577 926920 828788 818221 663972 463853 519043 686568 745732 641003
23573 641003 773904 853465 783010 1021269 1291036 1409720 1486127 1394892 1294783 1117310
23563 1117310 1048730 1089683 1138266 1048635 953060 922729 886309 975251 1271866 1306386 1267744
23552 1267744 1291977 1394456 1524582 1594692 1354360 1217835 1010320 991516 884969 746962
23542 746962 1067709 1098958 802977 651742 569029 851129 988114 953594 917928 941719
23532 941719 1010284 844908 668346 691179 595221 588623 782918 883409 972202 1024615 997371
23521 997371 1157799 1200498 1316639 1282921 1161145 1134853 1251359 1237094 1171046 1052025
23511A052025j01324K08350O4486p6013p7116j67621R2158n0172j48000J51259
23501I48032K12689R2079O6066J11084j1350L7498K77205o3715l68632q6329J43955
23490A358582j19767k89965J46558L07716l6947j52468N9947l0194j79255n1213
23480A012994O0065n2827j55883P3815L60704J46095k01285j52837J38645K2437
23470A251923j51578j15779J94097O5994j93772O4344J00875m9902K66078K80958
23460A713238J64110j18497j81564l20828K8025K21787J67371J74471J10718j29328
23450A829503j27541r5376P1272k82576k05586L9016k6081K0931J92287J71184
23440A587033J15762J60041k07752j76851J88490j0229j48694N9204j53568j13573
$$ plain form
23511 1052025 950701 1159051 1223537 1147524 1070408 902787 994945 944773 796773 948032
23501 948032 1160721 1252800 1318866 1429950 1418600 1456098 1733303 1669588 1300956 1214627 1358582
23490 1358582 1238815 948850 1095408 1403124 1366177 1213709 1273656 1243462 1064207 1012994
23480 1012994 1073059 1020232 864349 938164 1298868 1444963 1243678 1090841 1229486 1251923
23470 1251923 1100345 984566 1178663 1244657 1050885 1115229 1216104 1166202 1432280 1713238
23460 1713238 1877348 1758851 1577287 1256459 1284484 1506271 1673642 1848113 1958831 1829503
23450 1829503 1701962 1606586 1677858 1395282 1189696 1228712 1202631 1223562 1415849 1587033
23440 1587033 1702795 1862836 1655084 1478233 1666723 1656494 1507800 1567004 1413436 1299863
23430A299863N7182O4225K0617O4397L44708o1804k58023R2255o6158j81804L53282
23419A728740N6185l1941j41598j9747j64208K4911K13669j41273M5463J36013
23409A706214O4297K32427R4476J70182l3995k39988K6383J72327P4307j12186
23399B154444k31157N0095j0072M1534J44107j35510j29052J28146J56371j30572
23389B038334O4684J98432O2897k8826j97899j41640j03370P3833K73378l9577
23379B200246l45468L9448K08831Q8175j49112n7929k3450p306j30543O0436K05581
23368B088909J95559P793M6163j11315j05804q5213J05020J95011j3977k51554
23358B070592P2517K14861R3198k72425n3903J29975n3675j76179j56591J81726
$$ plain form
23430 1299863 1357045 1421270 1441887 1506284 1850992 1789188 1531165 1623420 1557262 1375458 1728740
23419 1728740 1784925 1752984 1611386 1591639 1427431 1452342 1666011 1524738 1570201 1706214
23409 1706214 1770511 2002938 2097414 2267596 2233601 1993613 2019996 2192323 2266630 2154444
23399 2154444 1923287 1973382 1963310 2004844 2148951 2013441 1884389 2012535 2168906 2038334
23389 2038334 2103018 2301450 2364347 2335521 2137622 1995982 1892612 1966445 2239823 2200246
23379 2200246 1854778 1894226 2103057 2191232 2042120 1984191 1960741 1953435 1822892 1883328 2088909
23368 2088909 2284468 2292261 2338424 2227109 2121305 2036092 2141112 2336123 2322146 2070592
23358 2070592 2143109 2357970 2451168 2178743 2124840 2254815 2201140 2024961 1868370 2050096
23348B050096J43439K51111m368j53875Q1666K87290K4788R6242N1158R1015L0165
23337B948727j56670Q595p647j37229m238K61610Q8334r6703p6420r0833k00536
23326B536990r1028N6873J28530k5809M3131J5827J61928P9838p3128p766J78772
23315C004158k96185j12821J27165J85403j75465J08889J74753j24087O0409J52155
23305C104374Q1344r9373j41424j6529Q5209K6586n9705N5316J42041m0120k30514
23294B907205J44027p428j7700K37226j75600J68856K45831j4857L8439K02000
23284C727999l02980j84666q6433q6955J03800j72686l8985K18591P4805J29739
23274C382229K5185R633J3663N4429P2313J00467R9704K03081K16764N2551m7961
$$ plain form
23348 2050096 2193535 2444646 2440278 2286403 2368069 2655359 2680147 2776389 2827547 2918562 2948727
23337 2948727 2792057 2800652 2793005 2655776 2651538 2913148 3001482 2904779 2828359 2737526 2536990
23326 2536990 2445962 2502835 2631365 2605556 2648687 2664514 2826442 2906280 2833152 2825386 3004158
23315 3004158 2707973 2595152 2722317 2907720 2732255 2841144 3015897 2891810 2952219 3104374
23305 3104374 3185718 3086345 2944921 2928392 3013601 3040187 2980482 3035798 3177839 3137719 2907205
23294 2907205 3051232 3043804 3026104 3263330 3087730 3256586 3502417 3487560 3525999 3727999
23284 3727999 3425019 3240353 3153920 3066965 3170765 2998079 2959094 3177685 3252490 3382229
23274 3382229 3407414 3417047 3430710 3485139 3557452 3657919 3757623 3960704 4177468 4230019 4182058
23263D182058j98489N2743K19636k94478j58447K65821J51675p9135J445q3885
23253D058944o4481r0825J66051K59780m7703j40516J85853k0499p0772K36778
23243D472610J48400K6337J03842j02940J50580J28331k00278k07423J89691N9612
23233D768762J7287J13954J5243J85122J44276M028j05168j52935L6477N4773
23223E081819J85953J18711j67816q4411J91972J88192j40648j0005J77811p8793
23213E462785J24067P7582L181J59406j0686J14348j41101j80586N9296M41790
23203F110082r9787n0726K34049P6675L4148j92387m7999K85536p7813j69039
23193F102739m139J65929J25594J78782K15608j7257m6640q7944K27100J34150
$$ plain form
23263 4182058 3983569 4036312 4255948 3961470 3803023 4068844 4220519 4141384 4142829 4058944
23253 4058944 3994463 3903638 4069689 4329469 4281766 4141250 4327103 4306604 4235832 4472610
23243 4472610 4621010 4647347 4751189 4648249 4798829 4927160 4726882 4519459 4709150 4768762
23233 4768762 4786049 4900003 4915246 5100368 5244644 5248672 5143504 4990569 5027046 5081819
23223 5081819 5267772 5386483 5218667 5134256 5326228 5514420 5373772 5363767 5541578 5462785
23213 5462785 5586852 5664434 5667615 5827021 5816335 5930683 5789582 5608996 5668292 6110082
23203 6110082 6010295 5959569 6193618 6270293 6304441 6112054 6064055 6349591 6271778 6102739
23193 6102739 6098600 6264529 6390123 6568905 6784513 6767256 6720616 6632672 6859772 6993922
23183F993922j04953j75396m2832N930J04063J21977k12752K05699J72339J39055
23173G207052K12639P8708j3642j40827n101M1592K80180o3564q7140l6045m3650
23162G430202N4674K49206J77592K86734L13712j9885k38498K560J23879L68492
23152H748668l8503M6176J40907K2401j95621J03930K62263K12990J02005J01895
23142I507111j04702j18746K33234J63919Q4243K42521n9033j27349J11653O5977
23132I998828Q4851j4299K05469L35353L1784q4228k5141M09060K62024J14987
23122A1318688R9210Q019J86223p717J17931L07430J87320l4256l06790l8830
23112A1837228K42819q8869M0394L58880K56377K50318J52798j03059j43503L6094
$$ plain form
23183 6993922 6888969 6713573 6670741 6676671 6780734 6902711 6689959 6895658 7067997 7207052
23173 7207052 7419691 7498399 7484757 7343930 7338829 7380421 7660601 7597037 7509897 7473852 7430202
23162 7430202 7484876 7734082 7911674 8198408 8512120 8492235 8253737 8256297 8380176 8748668
23152 8748668 8710165 8756341 8897248 8919649 8724028 8827958 9090221 9303211 9405216 9507111
23142 9507111 9402409 9283663 9516897 9680816 9765059 10007580 9948547 9821198 9932851 9998828
23132 9998828 10083679 10069380 10274849 10610202 10641986 10557758 10532617 10941677 11203701 11318688
23122 11318688 11417898 11425917 11612140 11604423 11722354 12029784 12217104 12182848 11876058 11837228
23112 11837228 12080047 11991178 12031572 12390452 12646829 12897147 13049945 12946886 12803383 12839477
23102A2839477J20595J32465J81079L06945n5697k3508K17770L36332K64930J39166
23092A4459554N10152N31121q8882p321L20943Q0532J06720K9451j27492j37744
23082A5677034j80570J72829M13395K09924J64883L54246K77949K91118r9859
23073A7280949K7725K30100K54958J77315L53765K60850J75941k4069j16171L61298
23063A8982661M37716M21681L3758J24182L08103L59981P0979o7497L30786N11793
23053B1514143L71189K0677K82743J09419k3683J12448J89832J26069M40155N70537
23043B3713529J30142N7835K52745M01011K06860J61351K72949L54577K72714
23034B5823713k13359J62642M39060M67592L62559J93567J62971L78835K56940
$$ plain form
23102 12839477 12960072 13092537 13273616 13580561 13524864 13501356 13719126 14055458 14320388 14459554
23092 14459554 14969706 15500827 15411945 15404624 15725567 15806099 15912819 15942270 15814778 15677034
23082 15677034 15496464 15669293 16082688 16292612 16457495 16811741 17089690 17380808 17280949
23073 17280949 17308674 17538774 17793732 17971047 18324812 18585662 18761603 18737534 18621363 18982661
23063 18982661 19420377 19842058 19875816 19999998 20308101 20668082 20739061 20671564 21002350 21514143
23053 21514143 21885332 21906009 22188752 22298171 22274488 22386936 22576768 22702837 23142992 23713529
23043 23713529 23843671 23901506 24154251 24555262 24762122 24923473 25196422 25550999 25823713
23034 25823713 25610354 25772996 26212056 26679648 27042207 27235774 27398745 27777580 28034520
23025B8034520R5727L15184P7021L97189K95039L28793O46923J23043L2268J70447
23015C0516154M16893J50232J93447M27317K96255K60521M70528K73939J70277
23006C3175563K57523M46278M32763K21396K56018K04634L17542K78280L38441
22997C5928438N10694K75941J7187J29841M72856L33547M05369L36446K27402
22988C8637721J67088J41445J82603M50137L38088L61119K52868M02965L98952
22979D1332986L01130K73428J76654l5748K54413N03397L03120p8205J64805P0664
22969D3266644J51224N84873N17221L04503J91307J23910R914N5571K27944L06707
22959D5739818L77176J69487J19357o7488J75537K72454n3127K14152K94968j84544
$$ plain form
23025 28034520 28130247 28445431 28522452 28919641 29214680 29543473 30190396 30313439 30345707 30516154
23015 30516154 30933047 31083279 31276726 31704043 32000298 32260819 32731347 33005286 33175563
23006 33175563 33433086 33879364 34312127 34533523 34789541 34994175 35311717 35589997 35928438
22997 35928438 36439132 36715073 36732260 36862101 37334957 37668504 38073873 38410319 38637721
22988 38637721 38804809 38946254 39128857 39578994 39917082 40278201 40531069 40934034 41332986
22979 41332986 41634116 41907544 42084198 42048450 42302863 42806260 43109380 43031175 43195980 43266644
22969 43266644 43417868 44002741 44519962 44824465 45015772 45139682 45149596 45205167 45433111 45739818
22959 45739818 46116994 46286481 46405838 46338350 46513887 46786341 46733214 46947366 47242334 47057790
22949D7057790j64053p1955j11674l3707J80200J73671J60194J78003k09943k65593
22939D6892933J56699j01739k82665q405K68667O7375J41211N1350J513M0750
22929D7227689k78299j84690j39308J25795k94455j90608l9712l954k49341j19691
22919D5853426k18603k31093N6418P7912k23881k60550m5122j99239p3463m03102
22909D4332703n01365k70052k13188l80431j27326m05689l25096K25069j16071
22900D2218554k42643k88187k29903j41408m97446l78485m15346k85831k90894
22891C9448411M0891m8165m23368n54257j70314j09677l59658m05269l01062j73766
22881C6943766m12972m66345k08757k98542n02770l61562j53956l86505k27381
$$ plain form
22949 47057790 46893737 46821782 46710108 46676401 46856601 47030272 47190466 47368469 47158526 46892933
22939 46892933 47049632 46947893 46665228 46656823 46925490 46992865 47134076 47185426 47186939 47227689
22929 47227689 46949390 46764700 46625392 46751187 46456732 46266124 46226412 46222458 45973117 45853426
22919 45853426 45634823 45403730 45460148 45538060 45314179 45053629 45008507 44809268 44735805 44332703
22909 44332703 43831338 43561286 43348098 42967667 42840341 42434652 42109556 42334625 42218554
22900 42218554 41975911 41687724 41457821 41316413 40818967 40440482 40025136 39739305 39448411
22891 39448411 39489302 39441137 39017769 38463512 38293198 38183521 37823863 37418594 37117532 36943766
22881 36943766 36530794 36064449 35855692 35557150 35054380 34692818 34538862 34152357 33924976
22872C3924976K3639j59651j31662l88325k09374j72469l15133m60890l94053
22863C1717058l69683l36919k01555j74957j43791l12172n5384k38523l39089
22854B9544985n19808l33655k90752m11773n63960o8817m8718O2509J4386k51343
22844B7133054m14110k90073k67900o5466j58643j58247l52997k85128k59971
22835B4880519k92805j77797n9256k79401m30706k76128l79750l87886r1166j96584
22825B2309040l7911j99052m75641k87714j82550P7245J1295k19622q5894j12841
22815B0796355k20578p0366m7050k12193k62656n16930l02428k57508k17617R6074
22805A8785103o5609j53799j08735r3368l0559k19261k4402l68911j1467Q7654
$$ plain form
22872 33924976 33948615 33788964 33657302 33268977 33059603 32887134 32572001 32111111 31717058
22863 31717058 31347375 31010456 30808901 30633944 30490153 30177981 30122597 29884074 29544985
22854 29544985 29025177 28691522 28400770 27988997 27425037 27356220 27307502 27370011 27384397 27133054
22844 27133054 26718944 26428871 26160971 26095505 25936862 25778615 25425618 25140490 24880519
22835 24880519 24587714 24409917 24350661 24071260 23640554 23364426 22984676 22596790 22505624 22309040
22825 22309040 22271129 22072077 21596436 21308722 21126172 21203417 21214712 20995090 20909196 20796355
22815 20796355 20575777 20505411 20458361 20246168 19983512 19466582 19164154 18906646 18689029 18785103
22805 18785103 18719494 18565695 18456960 18363592 18333033 18113772 18089370 17720459 17708992 17796646
22795A7796646l44257m40264l23037j65574l2491N6614l2975k39287q6022n08
22785A6188845j55604l03154J7432k43113k09364m8724l17165j13894P9541j94474
22775A4700326k07603j10858K675j19953k45257k49990k21008J50057O7471n9066
22765A3706794k17933l56223k42799J0884J2936k18248j14351q0674j00665o2996
22755A2336725J3024q9825n6704k5437j23339M7621j13812J23491q1481k80687
22745A1749576j95100J20415k10446l56013j50873j35295j59692m4274J72871
22736A0791169l1216k34562K69717j19690m01219j58902R5838k07880l2812p1147
22726I899296k8114P1395J9967J23199m372l39892l67204J02480J32713j44308
$$ plain form
22795 17796646 17452389 17012125 16689088 16523514 16491023 16547637 16514662 16275375 16189353 16188845
22785 16188845 16033241 15730087 15747519 15504406 15295042 15246318 14929153 14815259 14894800 14700326
22775 14700326 14492723 14381865 14384540 14264587 14019330 13769340 13548332 13698389 13765860 13706794
22765 13706794 13488861 13132638 12889839 12900723 12913659 12695411 12581060 12500386 12399721 12336725
22755 12336725 12349749 12259924 12203220 12177783 12054444 12102065 11988253 12111744 12030263 11749576
22745 11749576 11554476 11674891 11464445 11108432 10957559 10822264 10662572 10618298 10791169
22736 10791169 10759953 10525391 10795108 10675418 10274199 10115297 10211135 10003255 9970443 9899296
22726 9899296 9871182 9942577 9962544 10085743 10081371 9741479 9374275 9476755 9609468 9465160
22716I465160k98617k87716O4792J56384j29262J01112k090j63155j00668J9654
22706H825594r7724j26857k88990l4902r2205m001k08125j26393k46322j6048
22696G584027N8633q6908K44850R987m6434J57651j60294J48266j59088j34959
22686G615731j15519j20267J45483q558r6266j29525j60756j9526J29920j7278
22676G223439j35680l0227J3510k38939J29157q2883Q3862K988J05185l55213
22666F715199j51589J12457P0859l83094j1660L0375j38721j9204K059N7301j52871
22655F131111j65637N5986j7662N3036j15945r3405j47177j27946j9121J37755
22645E690995M4985n0029J27249q4005j63511j41129j10881O7919J80572m0855
$$ plain form
22716 9465160 9166543 8878827 8943619 9100003 8970741 9071853 9069763 8906608 8805940 8825594
22706 8825594 8727870 8601013 8312023 8277121 8184916 8180915 7972790 7846397 7600075 7584027
22696 7584027 7642660 7555752 7800602 7810589 7764155 7921806 7761512 7909778 7750690 7615731
22686 7615731 7500212 7379945 7525428 7516870 7420604 7291079 7130323 7110797 7240717 7223439
22676 7223439 7087759 7057532 7071042 6832103 6961260 6878377 6962239 6965227 7070412 6715199
22666 6715199 6563610 6676067 6746926 6363832 6352172 6382547 6243826 6224622 6226681 6283982 6131111
22655 6131111 5965474 6021460 6003798 6056834 5940889 5847484 5700307 5572361 5553240 5690995
22645 5690995 5735980 5685951 5813200 5729195 5565684 5424555 5313674 5381593 5562165 5521310
22635E521310k60983j04847R5607j868j17746k2926K18372J79617j21678j22850
22625E262008J42055l9396k06068Q3974J61289j68029j94163r8806n7475P0029
22615D955418J25579P3L0821q9472Q9515k9409j76770q1746K6182J36772r2311
22604D894652j94449j91219K88176j8323j87366l4599q0490Q5509J31834k993
22594D690732r3593j91562K6007q7528Q0181j05739j99085j83278j285J9411K97713
22583D251974J25878j93362r5170j07182R7373j7689k29255p1523R7533K9312
22573C887889j25364p9702o2122K57632J01480J7636j57977R6021K13789J77918
22563D327200l0001j00468k66547n8916k97899O4903r475r6392j77936j16531
$$ plain form
22635 5521310 5260327 5155480 5251087 5249219 5131473 5108547 5326919 5506536 5384858 5262008
22625 5262008 5404063 5364667 5158599 5242573 5403862 5235833 5041670 4942864 4885389 4955418
22615 4955418 5080997 5081070 5111891 5022419 5111934 5082525 4905755 4824009 4850191 4986963 4894652
22604 4894652 4700203 4508984 4797160 4778837 4591471 4556872 4476382 4561891 4693725 4690732
22594 4690732 4597139 4405577 4431584 4344056 4424237 4318498 4119413 3936135 3934850 3954261 4251974
22583 4251974 4377852 4184490 4089320 3982138 4079511 4061822 3832567 3761044 3858577 3887889
22573 3887889 3762525 3682823 3620701 3878333 3979813 3997449 3839472 3935493 4149282 4327200
22563 4327200 4297199 4196731 3930184 3871268 3573369 3638272 3628797 3532405 3354469 3237938
22553C237938J32626K424K66209R9083r8756o8170r0097p4775J26658j36846o6126
22542C330168M9593l6124Q7417J8282r8721Q8495J26080j05980m936j9579L9526
22531C474221j047j23822l69134j46081P7397L1839J03709J15811k983P6529j98271
22520C038168j25770k38925K74716O7781j22894J34993j31608l03342J23093K27592
22510B943804N8341K2223k060q4804l25492p4802L09777M5703j558l8189o0222
22499B792721j03635k6583q829J72111r7813n4308J6687k68434o4067M4953m2211
22488B360592l1200M4094J39245P6982K3386J3827J17624K2356K6000l2163N9410
22477B820153J5880P3519m1884Q9815l39166J4479m6106n6258j16563j36341j67839
$$ plain form
22553 3237938 3370564 3372988 3639197 3738280 3639524 3571354 3481257 3406482 3533140 3396294 3330168
22542 3330168 3379761 3343637 3431054 3449336 3350615 3439110 3565190 3459210 3454274 3434695 3474221
22531 3474221 3473174 3349352 2980218 2834137 2911534 2943373 3047082 3162893 3159910 3236439 3038168
22520 3038168 2912398 2673473 2948189 3015970 2893076 3028069 2896461 2593119 2716212 2943804
22510 2943804 3002145 3024368 3022308 2937504 2612012 2537210 2846987 2892690 2891132 2852943 2792721
22499 2792721 2689086 2662503 2653674 2825785 2727972 2673664 2690351 2421917 2357850 2402803 2360592
22488 2360592 2329392 2373486 2512731 2589713 2613099 2626926 2744550 2766906 2792906 2760743 2820153
22477 2820153 2836033 2909552 2867668 2957483 2618317 2632796 2586690 2530432 2413869 2277528 2109689
22466B109689L5334q2930Q7229k2047k7629J15810J2794k5014J00583k9391p3111
22455B201317J60570K02588j61065k4680j37408Q1797j10231k2907J81557K1085
22445B392623m2228l8576j95122L2482J01969j34032l5090j7860l2812L577q4129
22434A950802o3107l7579O385J48180J20826Q9583J19637r9363l47937j72818
22424A714609Q8123L86340k81622l15119L72378K23982P3898j27789M7896K0031
22414B202727J24107R9218j04173l34020r2335K9899J1187q7615O1481o2651P8011
22403A925836Q7622j04934R3749J72001j39052j78083R6299J37405k3050N6642
22393B124435J89346j52018k73313R1851K60151K47946k38420l86569n0339n4228
$$ plain form
22466 2109689 2145023 2062093 2149322 2127275 2099646 2215456 2228250 2203236 2303819 2274428 2201317
22455 2201317 2361887 2564475 2403410 2378730 2241322 2323119 2212888 2189981 2371538 2392623
22445 2392623 2350395 2311819 2116697 2149179 2251148 2117116 2082026 2064166 2031354 2034931 1950802
22434 1950802 1887695 1850116 1856501 2004681 2125507 2215090 2334727 2235364 1887427 1714609
22424 1714609 1802732 2189072 1907450 1592331 1964709 2188691 2262589 2134800 2182696 2202727
22414 2202727 2326834 2426052 2321879 1987859 1895524 1925423 1936610 1848995 1910476 1847825 1925836
22403 1925836 2013458 1908524 2002273 2174274 2035222 1857139 1953438 2090843 2067793 2124435
22393 2124435 2313781 2161763 1888450 1980301 2240452 2488398 2249978 1863409 1813070 1758842
22383A758842k8074r519P6354j27729r4348k3870K07618J74942P0766J31007k29942
22372A906047k68602p6963J84821P0767k28273l05857K11561J37064O4917j35061
22362A560421j2465j75219Q3694P6232k81547N1858p2862Q5059Q4527J14788K03641
22351A718127M8186j70013o5265j72725o2705K47016J59900j48221k11597o6133
22341A276570O8411J7257K91634J64115k00455q9185p2602j05681k69089p7695
22331A003280Q8398J4686r7975P1889P1136k3726J21405k0063K25674J72141P5694
22320A702539j64839n231j02148k3479n8420P49R1846k35471J3593K18522p0307
22309A367354K16378P9175J31484k86069R5642R2458j83662O3083L5912R671O9170
$$ plain form
22383 1758842 1730768 1721249 1797603 1669874 1575526 1551656 1759274 1934216 2004982 2135989 1906047
22372 1906047 1637445 1560482 1745303 1816070 1587797 1281940 1493501 1630565 1695482 1560421
22362 1560421 1547956 1372737 1456431 1532663 1251116 1302974 1230112 1315171 1399698 1514486 1718127
22351 1718127 1766313 1596300 1531035 1358310 1295605 1542621 1702521 1554300 1342703 1276570
22341 1276570 1344981 1362238 1653872 1817987 1617532 1528347 1455745 1350064 1080975 1003280
22331 1003280 1091678 1106364 1008389 1080278 1151414 1127688 1249093 1229030 1454704 1626845 1702539
22320 1702539 1537700 1532469 1430321 1406842 1348422 1349171 1441017 1205546 1219139 1437661 1367354
22309 1367354 1583732 1662907 1794391 1508322 1603964 1696422 1512760 1575843 1611755 1621426 1690596
22298A690596k94916K2579l3891j19537J63963R0186J6946j90793j70938l7789
22288A136406r3750j64658n246O3007K36232N3040k11438P4531K61114l4514j66552
22277A148172K16738J64523j43200m281p9958o1277J62990n1856k03557R0062
22267A238356O9954j24932P0783M9476p6708o8613j870L2879p2780j07530j0975
22256I98040P7706o4525L6739J38482M5192j26730k6374J06052L19465J08105
22246A612152j10664j59872l50234p3749n194J1799j43181j72032J2301L45266
22236I66592J78775r490j49670k15510r141j3200m1523m0894Q3505J67337P561
22225I24342J70425J66144J12101O2945o1243k48243j94686r1989K03864J29994
$$ plain form
22298 1690596 1395680 1418259 1384368 1264831 1428794 1518980 1535926 1345133 1174195 1136406
22288 1136406 1042656 877998 872752 935759 1171991 1225031 1013593 1088124 1349238 1314724 1148172
22277 1148172 1364910 1529433 1386233 1381952 1301994 1240717 1403707 1351851 1148294 1238356
22267 1238356 1308310 1183378 1254161 1303637 1226929 1158316 1156446 1189325 1116545 1009015 998040
22256 998040 1075746 1011221 1047960 1186442 1231634 1104904 1078530 1184582 1504047 1612152
22246 1612152 1501488 1341616 991382 917633 912439 924238 781057 609025 621326 966592
22236 966592 1145367 1135877 986207 770697 761556 748356 706833 665939 749444 916781 924342
22225 924342 1094767 1260911 1373012 1435957 1374714 1126471 931785 839796 1043660 1173654
22215A173654j8382l7016k32477r8651K32060J83219j79663j98669K49349n482
22205A067942o9805M7906j1135J54943L16382N6706j74679p773l7980J9553l22470
22194A039590q3745j09640J69854J52352J88752j18965j04101P8031j66680j86020
22184H59428p7339j39050R004P1557J33581J07918J38595o7375k04321k68008
22174E63990J80954Q4028j41784P5940L98n3588m6291J54168j44818J81642Q1151
22163I35790j12723O8816M081n1854k44526L81285J51561o4118k15115j52892
22153G00305J02818J52460J37235J37791k17346j70320k581l4814j81631K7490
22143F51407K15524j90433k72044q2690J02887Q0624J67513j38550M1540m5401
$$ plain form
22215 1173654 1155272 1118256 885779 787128 1019188 1202407 1022744 824075 1073424 1067942
22205 1067942 998137 1046043 1034908 1189851 1506233 1562939 1388260 1380487 1342507 1362060 1039590
22194 1039590 955845 846205 1016059 1168411 1357163 1238198 1134097 1212128 1045448 859428
22184 859428 782089 643039 652043 723600 857181 965099 1103694 1036319 831998 563990
22174 563990 744944 828972 687188 763128 763526 709938 663647 817815 672997 854639 935790
22163 935790 823067 891883 895964 844110 599584 980869 1132430 1068312 853197 700305
22153 700305 803123 955583 1092818 1230609 1013263 842943 840362 805548 623917 651407
22143 651407 866931 676498 404454 321764 424651 505275 672788 534238 575778 530377
22133E30377K77675K40862K449m3567K4437j96853K54522p913j62528l1025O1187
22122I49623j95001j6818q6433O7233R498J791Q0464J89395J01792Q9167M0915
22111A231626k02263q784n8064J05442o9246j52648j61521j00901k27041J37246
22101D93846L70425j26694j55546P8851L29838L78129q7449m1001k738k85743
22091I51918j19456K58336j20475l39429n3886K34112K6901J2826Q9209J08493
22081A048549k00891j27463J7368Q9824j1603L2761p4679k24089Q1913k2482j764
22070F07444P9888L9429q3900o8050N7239p55J61198K22724j93181j61982O8383
22059G28437j30627r5671L8811J27479n3830j56984L1296L47259J60730j11366
$$ plain form
22133 530377 808052 1048914 1051363 1007796 1032233 835380 1089902 1081989 919461 888436 949623
22122 949623 754622 737804 651371 718604 728102 729893 810357 999752 1101544 1190711 1231626
22111 1231626 1029363 1020579 962515 1067957 998711 846063 684542 583641 356600 493846
22101 493846 864271 737577 582031 660882 990720 1368849 1281400 1240399 1237661 951918
22091 951918 832462 1090798 970323 630894 577008 811120 838021 850847 940056 1048549
22081 1048549 847658 720195 737563 827387 815784 848545 773866 549777 631690 609208 607444
22070 607444 687332 726761 642861 574811 632050 631295 792493 1015217 822036 660054 728437
22059 728437 597810 502139 540950 668429 614599 457615 488911 836170 996900 885534
22049H85534k9748k11174N2633k3097l6752K0373l41016J54330R3590l8180p5183
22038D51310R0958J04972J11407j46601j11651L648J5000R5683l9406n645K27702
22027G97377K7694j97829L4618j8189m641l3941o4279j36498L4876J56373M7108
22016F42669J82273K18552k60327j43700K96343J54436K3263j75185k52527k51635
22006D34162q7373K95525J80660m3212j72910n885k9601n2936K9835l1951J0325
21995E26639l901K0K02859j22611j36516J9002n1780j70102j58382J32270J44662
21984C82160k022j03463K33428K80084P4603j44039N3239l5067k77949o0316L6387
21973D37045K22650L4081j74178j39376J03460J45605P7999j10695j90904O6036
$$ plain form
22049 885534 855786 644612 697245 674148 637396 657769 316753 471083 564673 526493 451310
22038 451310 542268 647240 758647 612046 500395 504043 519043 614726 575320 569675 797377
22027 797377 825071 627242 661860 643671 639030 605089 540810 404312 439188 595561 642669
22016 642669 824942 1043494 783167 639467 935810 1090246 1113509 938324 685797 434162
22006 434162 346789 642314 822974 779762 606852 600967 571366 518430 548265 516314 526639
21995 526639 522738 522758 725617 603006 466490 485492 433712 263610 105228 237498 382160
21984 382160 380138 276675 510103 790187 864790 720751 773990 738923 460974 400658 437045
21973 437045 659695 693776 519598 380222 483682 629287 707286 596591 405687 471723
21963D71723K80221J65825K11605l25811l26245O7114K1060j72383Q7565J87593
21953F68267J7903q8912n7499l4005K1007N8351M3237J58125P7857M4808j2655
21942H96484j81219r2846k22572j89919K29159J91698J52201J16987j13678j1489
21932G74806P8614j7375q6118l2912R1069Q4116j61800k00300P435l2303q2201
21921D23031j58632o6871l4690J56121p6465k7170P5344j6311P6775k09520k7208
21910A14404o9087K4522L58K4098P3246L60416K75216K9956j32725j92183j75097
21899C33124Q6336J75455j11595l8877P1956k32484J8866n9079L329J254J20274
21888C68559R8597k72684r8036p807j00948J31225J11823k5408k9864j13552M9194
$$ plain form
21963 471723 751944 917769 1129374 803563 477318 544432 565492 393109 480674 668267
21953 668267 686170 597258 539759 505754 526761 585112 628349 786474 864331 909139 896484
21942 896484 715265 622419 399847 209928 439087 630785 782986 899973 786295 774806
21932 774806 853420 836045 749927 717015 808084 892200 730400 530100 537535 505232 423031
21921 423031 264399 197528 162838 318959 242494 215324 290668 274357 351132 141612 114404
21910 114404 45317 69839 70197 94295 167541 527957 803173 833129 700404 508221 333124
21899 333124 419460 594915 483320 444443 516399 283915 302781 243702 247031 248285 368559
21888 368559 467156 194472 96436 88629 -12319 118906 230729 205321 175457 61905 111099
21877A11099R3607n3002j48313n7676j4509m8411O9527O3929J76876J42618J85530
21866E21275o7287k55628J21889J46885k53480m32165J17503J8624J22434Q2569
21856A22619Q0227N3555l9185J64994j45999j31317k26637J1907K51890P8845
21846B20899k02042K0047K15426J23908r0865k50383j20406J64998K28077J04693
21836D14352M7611m4335L6021K6000k85455M1452q838Q8801J56454J55782l01549
21825C26296k09470J22194L10070L1588j27849o1067J14909P3109j21830K10228
21815F68178j02732k13940l16984M5551J98956J82690L09984M3876l22652p4594
21805D18333J51911k26503p0208k58160j90020k9964Q3999K01781j47467j04416
$$ plain form
21877 111099 204706 151704 3391 -54285 -68794 -117205 -47678 16251 193127 335745 521275
21866 521275 453988 198360 320249 467134 213654 -218511 -101008 -82384 40050 122619
21856 122619 202846 256401 217216 382210 236211 104894 -121743 -109836 142054 220899
21846 220899 18857 38904 254330 378238 287373 36990 -83416 81582 309659 414352
21836 414352 461963 417628 453649 479649 194194 235646 226808 315609 472063 627845 326296
21825 326296 116826 239020 549090 580678 452829 391762 506671 579780 457950 668178
21815 668178 565446 351506 34522 80073 279029 461719 771703 815579 492927 418333
21805 418333 570244 343741 273533 15373 -174647 -204611 -120612 81169 -66298 -170714
21795a70714J63312K50920J46299j38892m2422l2224j028R1257J1162J09844J20674
21784E08188R1480l04873l40125p0736J03345l1100M0690j2633J38657n5103J1085
21773G8875J81213L8584m8203Q7239J07240J97519k35518l59100J24701K48865
21763D21415j27954q8150n6364l0066J45819o3788q4186n0853J49753j05921O1640
21752A71345L09891j17812j94393L3248j4638k6831j4875O8897j915j59366k02122
21741a48571k24K57763K99155J62266p5373m6771O3194j61770k64493k8137r2687
21730c5648O0346J15425P7818J95520K3373j70789J14485J15546r213r4879l0837
21719C61147j54826r8282r8571J90111j58464m4861J14881N8014J69308K13331
$$ plain form
21795 -170714 -7402 243518 389817 250925 208503 176279 175251 266508 277670 387514 508188
21784 508188 599668 294795 -45330 -116066 -12721 -43821 -3131 -15764 122893 67790 78875
21773 78875 260088 298672 250469 337708 444948 642467 406949 47849 172550 421415
21763 421415 293461 205311 148947 118881 264700 200912 116726 65873 215626 109705 171345
21752 171345 481236 363424 169031 202279 187641 160810 145935 214832 212917 53551 -148571
21741 -148571 -148795 108968 408123 570389 495016 448245 511439 349669 85176 57039 -35648
21730 -35648 24698 140123 217941 413461 436834 266045 380530 496076 486863 391984 361147
21719 361147 206321 108039 9468 199579 41115 -3746 111135 169149 338457 551788
21709E51788j5396k33297J5598r1477q3774J65124M9116K59049N6585r9288k47844
21698C26184l9139k2851L09937J46464K0552j61960l15483J35123J70987K5690
21688E95504k26489O5940K02502M9895j31109k77200j00955L5164o6586O589Q5834
21677B39089K2929O2327j38178p6985k09776N9735J85166L01565J40764j23061
21667D63575j66775k756j83400k02193j97313J39044K44267K09422k14801r7857
21657h787K55266J18707n9004j40980j34948Q8465N8370P9335J87085J08923M0283
21646E92715j20201K19496M5356k59529l74768j20017K85576k7434L9643k3715
21636B57122l1259J63730J72709n3555K27778j85571j40758j03153j17440j30514
$$ plain form
21709 551788 536392 303095 318693 227216 143442 308566 357682 616731 673316 574028 326184
21698 326184 287045 264194 574131 720595 741147 579187 263704 398827 569814 595504
21688 595504 369015 434955 637457 687352 556243 279043 178088 213252 146666 153255 239089
21677 239089 262018 324345 186167 109182 -100594 -40859 144307 445872 586636 463575
21667 463575 296800 294044 110644 -91549 -288862 -149818 94449 303871 89070 -8787
21657 -8787 246479 365186 306182 165202 30254 118719 177089 256424 443509 552432 592715
21646 592715 472514 692010 737366 477837 103069 -16948 268628 241194 280837 257122
21636 257122 225863 389593 562302 508747 736525 550954 410196 307043 189603 59089
21626E9089P3992L01541Q9148j13071k93318j89861K04307L51153J15820j57140
21616D41660j4566k48507r9685o4929J74170M7191j83213j61132R6108J58858
21606A45955O3694K16364K07212q302o7827J15502k14719L1394k8421j30646j83367
21595A46839Q0296j3479N0394p8680j80081P4017J43938p1653j11501q3151J0633
21584c2428j56116j6029K2270o431J03176J96154j08944r0105N8486n9017k235
21573i1219K3323J55074K46472J11046o7126l06551J40303J75692p9394K4419
21563C32039O0582q7495J3171J85374l1313m4297J49594r9725l99736J11961n3111
21552A37044M908M16035K89397k24515l78q5869p4098j16460j29137j07459p4752
$$ plain form
21626 59089 133081 434622 523770 410699 117381 -72480 131827 482980 598800 441660
21616 441660 427094 178587 78902 13973 188143 235334 52121 -109011 -12903 145955
21606 145955 209649 426013 633225 624923 557096 672598 457879 489273 460852 330206 146839
21595 146839 227135 213656 264050 185370 5289 79306 223244 151591 40090 -43061 -32428
21584 -32428 -188544 -204573 -182303 -188734 -85558 110596 1652 -88453 -29967 -88984 -91219
21573 -91219 -67896 87178 333650 444696 377570 71019 211322 387014 307620 332039
21563 332039 392621 305126 318297 503671 472358 428061 577655 477930 78194 190155 137044
21552 137044 141952 557987 847384 622869 622491 536622 462524 346064 216927 109468 34716
21541C4716R6380j3870J35225L7064j05084r9021p8180K5237n3160j75800J40890
21530e5603K67968N7391O2277J98644k97093n7105N963j17998j91004j57495k3503
21519c07558J17674N7353Q949r4148J36574j92661K59769J35910J4121n9941J31644
21508B07686P5014R1975j59068J35254J06311J9014j33517k0926o1787J08692
21498C68648K67725k5104N9423j9113m7065j32078j96379j21239J24676p8727
21488B00767M2238J0393j29694p6540q6747Q6247J06402J36768J88824o613k14830
21477B57215M6147j8964j31385j28318J6034L4992K59591l5108j84055J09185
21467B25334K40222N5455j83594k87025O3584J42555n5906m9834j05620J4525
$$ plain form
21541 34716 131096 117226 252451 289515 184431 85410 7230 32467 -20693 -196493 -55603
21530 -55603 212365 269756 332033 530677 233584 176479 182442 64444 -126560 -284055 -307558
21519 -307558 -189884 -132531 -123582 -217730 -81156 -273817 -14048 121862 135983 76042 207686
21508 207686 282700 374675 215607 350861 457172 476186 342669 321743 259956 368648
21498 368648 636373 611269 670692 651579 604514 472436 276057 154818 279494 200767
21488 200767 243005 253398 123704 47164 -39583 46664 153066 289834 478658 472045 257215
21477 257215 303362 284398 153013 24695 40729 75721 335312 300204 116149 225334
21467 225334 465556 521011 337417 50392 113976 256531 200625 150791 45171 59696
21457E9696J90399M4327J0719o3349K2139K52j9163r0569j60882j90361j19926
21446c16718K1228L45277L52423p976j91178k34194n2970J39253j00492q4450
21436a29797j05949K3873J04629P3357J23953q0498j56212K38702K41499J27040
21426D60597k2350M8451j62828l15763J37424L6328k8665J7422j19808P9308Q2562
21415B12678j31230p3333J86373j24029K2886k4234m3050j03854r8541Q8167K25418
21404A37251J09476j68160o4521r88O5585R1718M0122M1228k57705m0218R9295
21393E3083r258l6215M959K4162j9864J31605o5464j06093J43645M405k09554
21382h4589R9481L31764K32582M9193k51640j87512j9642m9846j24834j70528
$$ plain form
21457 59696 250095 294422 305141 241792 263931 264183 245020 154451 -6431 -196792 -316718
21446 -316718 -295490 49787 402210 394234 203056 -31138 -84108 55145 -45347 -129797
21436 -129797 -235746 -211873 -107244 -33887 90066 9568 -146644 92058 333557 460597
21426 460597 438247 486698 323870 8107 145531 181859 153194 170616 50808 130116 212678
21415 212678 81448 8115 194488 70459 93345 69111 26061 -77793 -176334 -88167 137251
21404 137251 246727 78567 14046 13058 78643 170361 210483 251711 -5994 -46212 53083
21393 53083 43825 7610 12569 36731 16867 148472 83008 -23085 120560 124965 -84589
21382 -84589 14892 346656 579238 628431 376791 189279 169637 119791 -5043 -175571
21372a75571M7351J3067L6795K8175k39910m4183J86730J26721J09444J07545
21362A96164J08367k5073J36207L4131R3018k34111n743l0703k82052p3324J19497
21351C6378J28912O6032M4435O5812k01999O161M5P2626k73330j23137J8858M9824
21339a09383J67875J26659j58494L3184R7104P143j00298N4795M621Q2590J52413
21328C58209l10863M5258M8116j02599j13484j24462J48510J69121R5564j14847
21318I8523P2890k3343k9936J61160m5456j59952k80241J6412M31691J01378j41304
21307B01822j99424l8539J37497O9233j40437L0938J06630p3511j54895k10910
21297b71596J9393K8627L01758n2293J638J53258J16350j02115j27224l9116J32345
$$ plain form
21372 -175571 -128220 -115153 -78358 -50183 -290093 -334276 -147546 -20825 88619 196164
21362 196164 304531 279458 415665 449796 542814 308703 302960 272257 -9795 -83119 36378
21351 36378 165290 231322 275757 341569 139570 145731 145776 218402 -54928 -178065 -159207 -109383
21339 -109383 58492 185151 26657 59841 156945 164088 63790 118585 123206 205796 358209
21328 358209 47346 92604 140720 38121 -75363 -199825 -51315 117806 213370 98523
21318 98523 171413 148070 118134 279294 233838 73886 -206355 -189943 241748 343126 201822
21307 201822 2398 -36141 101356 170589 30152 61090 167720 94209 -60686 -271596
21297 -271596 -252203 -223576 78182 25889 27527 180785 297135 195020 67796 28680 161025
21286A61025R6556Q2501J2801K6245j6363j97736j98726J4566J35938M8902P2651
21275B38360M5617j46977o6845O749K03634j04755o6482j0163R7786J69466q9430
21264B76960p2764j26800J09759O3187l6048N9293l4993j95080p1884J15340r3668
21253f698K6343K5408K38951K0185r124l7761Q9627j34105N0232J50521j47216
21242B66363k381K43915k752J74844j93094k48888p906j1293k35671l5052J76282
21231A24367k90675k08379R2276r3420j35297J38663J71465k597j61398k00897
21221e65892L331J27014K52254L41572j0305J01008R56k70572J8238R9680j4581
21210H2703P9015J53340r3858L6015l4712J10098m3484n6672J68484K5680p536
$$ plain form
21286 161025 257581 340082 352883 379128 362765 165029 -33697 -19131 116807 165709 238360
21275 238360 283977 137000 70155 76904 280538 175783 109301 99138 196924 366390 276960
21264 276960 204196 77396 187155 250342 214294 273587 238594 43514 -28370 86970 -6698
21253 -6698 19645 45053 284004 304189 295065 257304 346931 212826 263058 413579 266363
21242 266363 263982 507897 505145 679989 486895 238007 230101 218808 -16863 -51915 124367
21231 124367 -166308 -374687 -282411 -375831 -511128 -372465 -201000 -203597 -364995 -565892
21221 -565892 -562561 -435547 -183293 158279 147974 248982 249938 -20634 -2396 97284 82703
21210 82703 161718 315058 221200 257215 222503 332601 289117 232445 400929 426609 419073
21199D19073m5328k45154j27437J34445J74124O9833o6863q2961k2930J74467
21189C81269j06719k99789M1158k417J46503P3651m3822L5418k4946O2879n5395
21178B07790j81988j5175L8932J61790l3145j54064K0624J22853j16505k2095
21168B9017m0023j3827P1741P549k71685l1959J84793M3044j20602r6070J16074
21157a21948p628p7210K24132j03710n0583l9775k8989n936k2058j76857K15515
21146a95047J27062K59313J10047K5746j5730Q8571k12298k06631J25473K05584
21136C12090R9521k99068L2856k17976o664l0825p7824J17228j4493R7805n142
21125G508k42585j18265K00855K14730K72393J01131R4376j2593l5795k59807
$$ plain form
21199 419073 373745 128591 1154 135599 309723 379556 312693 229732 206802 381269
21189 381269 274550 -25239 15919 13502 160005 233656 189834 225252 200306 263185 207790
21178 207790 25802 10627 49559 211349 178204 24140 44764 167617 51112 29017
21168 29017 -11006 -24833 46908 54457 -217228 -249187 -64394 -21350 -141952 -238022 -121948
21157 -121948 -129576 -206786 17346 -86364 -136947 -176722 -205711 -211647 -233705 -410562 -195047
21146 -195047 -67985 191328 301375 327121 311391 399962 187664 -18967 106506 312090
21136 312090 411611 112543 145399 -72577 -79241 -110066 -187890 -70662 -85155 12650 7508
21125 7508 -235077 -353342 -152487 62243 334636 435767 530143 517550 481755 221948
21115B21948M313O9774J06874j4677j1017L451j2147l15912k07320K81260J55217
21104B81764j77056j92447m7586l0481J51948j3977J29090N4530j61996j08619
21094a14830J28233R9849q1302J09710O1797r3450j46360N5767r2574j30028K16377
21083A3189K26031k5697o0073K29344K34074M9773k52083l51641k99648j23380
21073c60111J23593k02608p750J30303J04368q412L2532J29597L2095J5183j04840
21062a16050n9098L81023o2147R826k07866j75346n0531J00426K9782J1220J76946
21051C8185n3090J28330K56934P941j93614j49370j17500R5391n719M1815J4551
21040F3854m9747r7746J17811M3785m0339J51009n6899n0132n7974l21305M6460
$$ plain form
21115 221948 226261 296035 402909 388232 377215 380666 368519 52607 -154713 126547 281764
21104 281764 104708 -87739 -135325 -165806 -13858 -27835 101255 155785 -6211 -114830
21094 -114830 13403 113252 31950 141660 203457 110007 -36353 19414 -73160 -203188 13189
21083 13189 239220 213523 153450 382794 616868 666641 414558 62917 -236731 -360111
21073 -360111 -236518 -439126 -446876 -316573 -212205 -220617 -188085 -58488 -26393 -11210 -116050
21062 -116050 -175148 205875 143728 153554 -54312 -229658 -280189 -179763 -149981 -138761 38185
21051 38185 -14905 113425 370359 378300 184686 35316 -82184 13207 7488 49303 63854
21040 63854 14107 -83639 34172 77957 37618 188627 131728 81596 23622 -297683 -251223
21029b51223J26006k0600m352P5286j07509k8215K26557r360O499J33229j02149
21018D4169j67669j56125J18190K90582J43523l6865m0866K1818J12143k7650
21008C01250l25954p8154Q8521J08658k261k91813j77337r0966l1149n7130J9580
20997e36755j00623J28611J83097L5319K55643m5343J26262j55710K31329P1511
20987A93341j61920l0056k1888p4606L0174n3073r1348J86293L24981N9476k01418
20976A59956p3399j609p917k19737l10077L77274N7737k59776m1166q1525k5666
20965d25905j26714K55680J53444O7105k05514k5825J52318P0226l8206k86750
20955d10141m6529J72482J61252p741J57349j16980j61916J29741m2082n9784
$$ plain form
21029 -251223 -125217 -145817 -150169 -74883 -182392 -210607 15950 6590 13089 146318 44169
21018 44169 -123500 -279625 -161435 129147 272670 235805 194939 216757 328900 301250
21008 301250 -24704 -102858 -14337 94321 92060 -199753 -377090 -468056 -499205 -556335 -536755
20997 -536755 -637378 -508767 -325670 -290351 -34708 -80051 46211 -109499 121830 193341
20987 193341 31421 1365 -20523 -95129 -64955 -118028 -209376 -23083 301898 361374 159956
20976 159956 86557 84948 77031 -142706 -452783 -75509 -17772 -277548 -318714 -400239 -425905
20965 -425905 -552619 -296939 -143495 -76390 -281904 -307729 -155411 -85185 -123391 -410141
20955 -410141 -456670 -284188 -122936 -130677 26672 -90308 -252224 -122483 -164565 -224349
20945b24349k31081R8776J97547J51760k8353L0025j66476l3466j51848k5643
20935c83108J87455R0093l4989R528J85742K4306m6277K51804r4639j40517L3579
20924H2977J6780j56399q2692J23780m3522J7230Q1343j15862k262j7264j24609
20913b20500l3487j63048O4489J38720o3867J339L14247J07065j00019M0309r7002
20902a1754q1831J61406N5374j60081K21371K53447J09245j5873l25854p0852
20892A34598j42553j35719n622j99693q2664M91583J31294k58577q5783M5564
20882a07572L32J42668K64832O7746j52410Q6988O2531j37523o4000j32131k39275
20871b07814L2079K65640j4261K3916M7748j24359N162J37774J28671j09003N7753
$$ plain form
20945 -224349 -455430 -356654 -159107 -7347 -35700 -5675 -172151 -205617 -357465 -383108
20935 -383108 -195653 -105560 -140549 -131021 54721 79027 32750 284554 189915 49398 82977
20924 82977 99757 -56642 -139334 -15554 -59076 -41846 39497 -76365 -78627 -95891 -220500
20913 -220500 -253987 -417035 -352546 -213826 -277693 -276354 37893 144958 44939 85248 -11754
20902 -11754 -93585 67821 123195 -36886 184485 437932 547177 531304 205450 134598
20892 134598 -7955 -143674 -149296 -348989 -431653 59930 191224 -67353 -153136 -107572
20882 -107572 -107240 35428 300260 368006 215596 302584 365115 227592 163592 31461 -207814
20871 -207814 -175735 89905 75644 99560 147308 22949 28111 165885 294556 185553 243306
20860B43306j33191k53441M9866J69363p1655L9642P5729K09743N7492K7867j39224
20849B75497k58584n7588P9914L5015k45260M3713L47498J9840l37695q5351k9403
20838b12404K74454J16684k88475j07728j74694K54469J43047K1942j96514j02229
20828b71448j18888O0899J66140L04890M5965J22162J04465P5744J70164k26702
20818D33391k98013k02766J7371K63333k0401j56126l69566j03907J82116P3445
20808a81123k03437O4164K13247J20003N815K04430k47257k22362J34214R0396
20798b1910K55316q5338j70859r9026J02757q0293R4335N7782O9088Q4977j6144
20787A90685j03029j22861j57581L2032L08833J2450r4456J13051J2245k73378
$$ plain form
20860 243306 110115 -143326 -93460 75903 4248 43890 119619 329362 386854 414721 275497
20849 275497 16913 -40675 39239 74254 -171006 -127293 220205 240045 -97650 -183001 -212404
20838 -212404 62050 178734 -109741 -217469 -392163 -137694 5353 27295 -169219 -271448
20828 -271448 -390336 -329437 -163297 141593 187558 309720 414185 489929 660093 433391
20818 433391 135378 -67388 -50017 213316 192915 36789 -332777 -436684 -254568 -181123
20808 -181123 -384560 -320396 -107149 12854 18669 223099 -24158 -246520 -112306 -21910
20798 -21910 233406 148068 -22791 -121817 -19060 -99353 -5018 52764 121852 206829 190685
20787 190685 87656 -35205 -192786 -160754 148079 160529 66073 179124 191369 -82009
20777h2009k13863Q7575J20285j07006j54905P0213L76354K88985p5789q3766
20767B26074J04533j63501k6699p0530n5130j43614l53j29600R3565O886K23156
20756F4787K43874l2171j76516j46523p0058N9781m426J3068J08005J30966l5404
20745A55383l8563J93824O6342l68542j35823j07061p0671k38610r8693K22099
20735d20315J45654J90517j89471M3604J01747m2669j17444K5415K70470K00200
20725B07708J27700m8400j40647K0705j64900N5445k3806j29093k5870J76402
20715E5244J35132q702j48600m862J9379K6912O0778R513j6888J91210j03904
20704B15212j24193N5533p6780J14597J86331l1954N3466o076j70716n1893k8972
$$ plain form
20777 -82009 -295872 -208297 -88012 -195018 -349923 -279710 96644 385629 309840 226074
20767 226074 330607 167106 140407 69877 14747 -128867 -129220 -258820 -165255 -158369 64787
20756 64787 308661 276490 99974 -46549 -116607 -56826 -61252 -48184 59821 190787 155383
20745 155383 116820 310644 376986 8444 -127379 -234440 -305111 -543721 -642414 -420315
20735 -420315 -274661 -84144 -273615 -230011 -128264 -170933 -288377 -262962 7508 207708
20725 207708 335408 287008 146361 167066 2166 57611 33805 -95288 -121158 55244
20715 55244 190376 181674 33074 28212 47591 74503 135281 144794 127906 319116 215212
20704 215212 91019 146552 69772 184369 370700 338746 392212 386136 215420 163527 134555
20693A34555j61017P6991P4012j35970j56222R7901j8219p5902r3724Q5043l0482
20682b03034J06439M0598j12182K41136P3372L6633r3555j19914M440P008Q5839
20671F6780p8318n9984n8020J31462K09633k22315j45490k38107k463K78807N5048
20660f2967j6552m4791K8810j03891n7287L015K5993Q5479J84818o1277n3291
20649g1941l060M6665L7630j0086p5733p7823R864k01050O0518K09459J26700
20638E1143o1246J26716J22994j33962q9844K954r9973K55677J56975o2284r0866
20627A78284l3003O9454J7775k26684k07358K963j07132k40495M9248Q8279M22759
20616A4090K7918n2318j64457q826N294K6996K24452J28395k3544n7629k88393
$$ plain form
20693 134555 -26462 50529 124541 -11429 -167651 -69750 -87969 -163871 -257595 -172552 -203034
20682 -203034 -96595 -55997 -168179 72957 146329 182962 89407 -30507 -26067 -19059 66780
20671 66780 -11538 -71522 -129542 1920 211553 -10762 -156252 -394359 -396822 -118015 -62967
20660 -62967 -79519 -124310 -95500 -199391 -256678 -253663 -227670 -142191 42627 -18650 -71941
20649 -71941 -75001 -28336 9294 -792 -76525 -154348 -144484 -345534 -285016 -75557 51143
20638 51143 -10103 116613 239607 105645 15801 18755 -81218 174459 331434 269150 178284
20627 178284 145281 214735 232510 5826 -201532 -198569 -305701 -546196 -496948 -408669 14090
20616 14090 42008 -10310 -174767 -183593 -178299 -151303 73149 201544 178000 120371 -168022
20605a68022P5992L7174q9313Q1976L159o4775J4897m9240O6855K9048R5347o387
20593B6711J67668k1171r0644J08987n3640n5861M3597n1878k68806m2416k10424
20582d47877P0612l830J05888K61877J26241k0088j46956q3298r364P0197o6603
20571a43201k68100q4542K05074N7727j36853l116J67345P8874q9965J33250J49907
20560F6400j04214m5857k791K33762k2948o1779l033J55364p7221k83665J24944
20549b1038O0102P3028j09788j71662m6868J91925N598j00431j46507n5333L7013
20538b83961n4758L9666l160K49742J71051J16282J29001m5990j01074k01557
20528A5242n6328O722j79888p2748K26962L88175p5633m33331j87612k45825J41005
$$ plain form
20605 -168022 -92030 -54856 -144169 -62193 -59034 -123809 -108912 -158152 -91297 -62249 33098 26711
20593 26711 194379 173208 82564 191551 137911 82050 125647 73769 -195037 -237453 -447877
20582 -447877 -377265 -381095 -275207 -13330 112911 92823 -54133 -137431 -146795 -76598 -143201
20571 -143201 -411301 -495843 -290769 -233042 -369895 -373011 -205666 -126792 -216757 -83507 66400
20560 66400 -37814 -83671 -86462 147300 124352 62573 59540 214904 137683 -145982 -21038
20549 -21038 39064 112092 2304 -169358 -216226 -24301 -18703 -119134 -265641 -320974 -283961
20538 -283961 -338719 -299053 -302213 -52471 118580 234862 363863 317873 216799 15242
20528 15242 -41086 -34364 -214252 -287000 -60038 328137 252504 -180827 -368439 -614264 -473259
20517d73259J96700M3736J67674O0897J78015j49474k51879j54661K27827R3692
20507f0732O5847J14973k49222k30754j41312K86651J1686Q4098K2684L3729P9530
20496A7178j1282j57241N6452L70548p9862l28273l04235j36184Q3184K89548
20486b00167Q0900m6694r2928k28250J106J48294m1356k0879K28119K8688k8806
20475a71973J73106r5094J03066p7786j04388K91480J855k05660J9677j05425
20465a71142L2340j126K2986J56353O4138n9364K17538M0078j9659j46755J42202
20454B77589k5078J19261p7010j08634o8486j9415j85291j94099N1709K17742
20444a1712J17681l8635L4144l6673N1481q0104j21235Q844O0542O0453j19144
$$ plain form
20517 -473259 -276559 -232823 -65149 -4252 173763 24289 -227590 -382251 -154424 -60732
20507 -60732 5115 120088 -129134 -359888 -501200 -214549 -202863 -118765 -96081 -62352 17178
20496 17178 5896 -151345 -94893 275655 195793 -132480 -436715 -572899 -489715 -200167
20486 -200167 -119267 -165961 -258889 -487139 -486033 -337739 -379095 -399974 -171855 -143167 -171973
20475 -171973 1133 -93961 9105 -68681 -173069 118411 120266 -85394 -65717 -171142
20465 -171142 -138802 -139928 -116942 39411 103549 44185 261723 301801 282142 135387 277589
20454 277589 252511 371772 294762 186128 117642 98227 -87064 -281163 -229454 -11712
20444 -11712 105969 67334 101478 64805 116286 36182 -85053 -76209 -15667 44786 -74358
20433g4358j32330N3320J09393K2472j10744J51395J89117K826j05518k33445
20423a27872p6517j09146J49117k6554R2395J74620j21797n2502L1177j73103
20413b40182r0130k01723n0026K09542L45468N3R4797J38821l26247m2373J37492
20402b4508K57105j5973j47036k48986j06610J28373J23937N6530l3652k5423
20392c6243j80112j83957m2553O8698K80634J00971k1677q4447K7836K24367l8690
20381A14827j23082J82713P4694k4807j04007p6737R4999l4644k08699j88144
20371b92887k17829q7202O2212L00445J61770p108j85856N5729M3652j9392j26537
20360c13003J12228N1249N9147Q7312J2213k43777j15130p7257n2106j13135o1475
$$ plain form
20433 -74358 -206688 -153368 -43975 -21503 -132247 19148 208265 211091 105573 -127872
20423 -127872 -204389 -313535 -164418 -190972 -98577 76043 -45754 -98256 -67079 -240182
20413 -240182 -330312 -532035 -582061 -372519 -27051 -26998 67799 206620 -119627 -162000 -24508
20402 -24508 232597 216624 69588 -179398 -286008 -157635 -33698 22832 -10820 -36243
20392 -36243 -216355 -400312 -442865 -374167 -93533 7438 -14239 -98686 -70850 153517 114827
20381 114827 -8255 174458 249152 224345 120338 43601 138600 103956 -104743 -292887
20371 -292887 -510716 -597918 -535706 -235261 -73491 -80599 -266455 -210726 -167074 -186466 -313003
20360 -313003 -200775 -149526 -90379 -3067 9146 -234631 -349761 -427018 -479124 -592259 -653734
20349f53734L88392J63036J74778j53304r3807r5590J58165J21326J15510j24120
20339F52Q6623J20820r8502l42057k82688K26413M14253J32860j85438J71012
20329B43948o7765k82451r9038K9894K68654J15768l76230j37089o032K044j29773
20318d38070J20620J973K94553J56676j68463q5604j03937K73491K3460J7333
20308I2032r0053n2575j54394K1462J21817J8004P8135n2138n5628o2439O295
20297a29482O3791m0039l1810k91583N2824M05351n8732M4546K9588J76181J052
20286B21687k76476j66924N1892M7237j65524j66544O3021J75894K4541J62611
20276b8585P5162N3234Q7046M316k09780R372k14825k37519K11558O9922k56435
$$ plain form
20349 -653734 -265342 -102306 72472 -80832 -174639 -270229 -112064 9262 124772 652
20339 652 87275 208095 109593 -232464 -515152 -288739 125514 258374 72936 243948
20329 243948 176183 -106268 -205306 -175412 93242 209010 -167220 -304309 -310341 -308297 -438070
20318 -438070 -317450 -315477 -20924 135752 -32711 -118315 -222252 51239 74699 92032
20308 92032 1979 -50596 -204990 -183528 -61711 -43707 34428 -17710 -73338 -135777 -129482
20297 -129482 -65691 -105730 -137540 -429123 -376299 29052 -29680 14866 44454 220635 221687
20286 221687 -54789 -221713 -169821 -122584 -288108 -454652 -391631 -215737 -191196 -28585
20276 -28585 46577 99811 186857 191173 -18607 -9235 -224060 -461579 -250021 -180099 -436534
20265d36534o5013K31926P6322J46038l2360j39267j24913o5133J35640Q0079
20255a93215J08063q9409j6872R9045L46434Q1346l00158J5546j7344J6451j33806
20244h3919J02870R0554p3060k8578K0965j94601r5599j17945j55263J40658J30322
20233b63596J14419P7211L2641P0026R2872J5567m3548j96061k263J13290J65375
20222A75933n0449k42486j35669l8263m611N8151J2938j12249O0518q8311j8194
20211c82692Q2052n5264Q3991J16421Q5016O4161j9081j86024M7914j96704l8843
20200c99053J6406P5591J59596L7788j2675m4448L9538j886k1323J11711j16743
20189a55498n0532L4517J07583M4515Q774j56164J47767j5340l0289j10333m6996
$$ plain form
20265 -436534 -501547 -269621 -193299 -47261 -79621 -218888 -343801 -408934 -273294 -193215
20255 -193215 -85152 -174561 -191433 -92388 254046 335392 35234 50780 33436 49887 -83919
20244 -83919 18951 109505 36445 7867 28832 -165769 -261368 -379313 -534576 -393918 -263596
20233 -263596 -149177 -71966 -39325 30701 123573 139140 95592 -100469 -102732 10558 175933
20222 175933 125484 -117002 -252671 -290934 -295545 -237394 -224456 -336705 -276187 -364498 -382692
20211 -382692 -300640 -355904 -271913 -155492 -70476 -6315 -25396 -211420 -163506 -360210 -399053
20200 -399053 -382647 -307056 -147460 -109672 -122347 -166795 -127257 -129143 -150466 -38755 -155498
20189 -155498 -206030 -171513 -63930 -19415 -10641 -166805 -19038 -34378 -64667 -175000 -221996
20178b21996K98881K02390l67006k6994J55970p2956N32q73q8948j51663j50006
20167d22669M9966K04236m6920K84584P0201j39572k35623j50822k81865J12070
20157e56414K55734J37193K87773J22911j76353n9836m9245M4777L09448J14702
20147D30690J3070k02369j48788j34430r1235m08069N3430K26899K83028J31683
20137A53909j57320r0512J32602l2672O5379l8005J27593L7654k30795k50075
20127b82242o7334P4210L13837J69065k5820j86377j19485J39001N3730j18252
20117d9667j20086K0534R0186O5245j77364k18194L3974j74210J09710k3498K48376
20106a94994q7249R786J24847K87281L8746K3066j56357k83061P1162K27359j0198
$$ plain form
20178 -221996 76885 279275 -87731 -114725 41245 -31711 -31179 -32052 -121000 -272663 -422669
20167 -422669 -372703 -168467 -215387 69197 139398 -174 -235797 -386619 -668484 -556414
20157 -556414 -300680 -163487 124286 247197 70844 11008 -38237 6540 315988 430690
20147 430690 443760 241391 92603 -41827 -133062 -541131 -487701 -260802 22226 153909
20137 153909 -3411 -93923 38679 6007 71386 33381 160974 198628 -32167 -282242
20127 -282242 -349576 -275366 38471 207536 181716 -4661 -124146 14855 68585 -49667
20117 -49667 -169753 -149219 -59033 6212 -171152 -389346 -355372 -529582 -419872 -443370 -194994
20106 -194994 -282243 -272457 -147610 139671 178417 201483 45126 -237935 -166773 60586 50388
20095E0388m0271l1813k9943l1714Q819O143P0939j1099J52616j4953q2806L8250
20083H4556R7009R9915K7104J20899o7236j10672j58077l2544K9328l6242J38025
20072A92065j99489m93594K7733K38928P2988k8143Q5143J52754p5344N5508j21367
20061i2818j68177L5739k7247K00305J92522J29339o6804k40772k48193R3944
20051a92162p5420P904q6676j50056N8984Q0473L7220K7636J578J3246j4231k8312
20039c19816m0853L01315l7796j79075q0140J31217O8571k5334j33240J82557
20029a32594K51452k794k27413J92823J90093J03763R3786p674k97612k12469
20019d8639P8661L5779k5138P119J97125j44209N7872N7180p944J4089r97j84524
$$ plain form
20095 50388 10117 -21696 -51639 -83353 -74534 -68391 2548 -8551 144065 129112 46306 84556
20083 84556 181565 281480 308584 429483 362247 251575 93498 60954 90282 54040 192065
20072 192065 -7424 -501018 -473285 -234357 -161369 -189512 -104369 48385 -26959 28549 -92818
20061 -92818 -260995 -225256 -252503 -52198 140324 269663 202859 -37913 -286106 -192162
20051 -192162 -267582 -259678 -346354 -496410 -437426 -356953 -319733 -292097 -290519 -277273 -291504 -319816
20039 -319816 -360669 -59354 -97150 -276225 -356365 -225148 -156577 -181911 -315151 -132594
20029 -132594 118858 116064 -111349 81474 271567 375330 469116 461442 163830 -48639
20019 -48639 30022 65801 40663 47782 244907 100698 158570 215750 207806 221895 220898 36374
20007C6374J7723M308K5803J16787r0399J62387N1917j21982l8158K0156n841
19996A79075n7177j50068q5811j39710q7564R491K80623P4417j1853j49077j96200
19985c33854K7384O4291r0197K5014K1330P1978j03393O1150J48541K33025j39554
19974a4285j48048O5037M6774K1798J28641J22143j30061L6098j31558m2826P1192
19963B4905J3445J21128J81598n7993M0979K53495j25351m07540l5904O7450p8598
19952b386J37753K4091j4928j59434j5752j09148J16626R2838J36494M5781q198
19941B43737R9924K57909l8953m23574j3139J128p1901j19412K03591K54986p0388
19930C23908M8559J37363j28675j74069k01479K04023L98904J06816j76465k06527
$$ plain form
20007 36374 54097 58405 84208 200995 110596 272983 324900 202918 164760 184916 179075
19996 179075 121898 -28170 -113981 -253691 -341255 -331764 -51141 23276 11423 -137654 -333854
19985 -333854 -306470 -242179 -332376 -307362 -286032 -214054 -317447 -256297 -107756 125269 -14285
19974 -14285 -162333 -97296 -50522 -28724 99917 222060 91999 128097 -3461 -46287 24905
19963 24905 38350 159478 341076 283083 324062 577557 452206 44666 8762 76212 -2386
19952 -2386 135367 159458 144530 -14904 -30656 -139804 -23178 69660 206154 251935 243737
19941 243737 343661 601570 562617 139043 125904 127032 55131 -64281 139310 394296 323908
19930 323908 372467 509830 381155 207086 5607 209630 608534 715350 538885 332358
19920C32358p1389K11852K97632j46607k53153k21372j29785j73986N0439J4703
19910h9308J1556K76012K90508K15453o3241K8932Q5717k94106j18731M0423j01725
19899B81490j20653p5527K89838O52k80907K88992K20382k1680j69575m67289
19889e4277K74660L69066L2844j52268r988k10452k23897M4971N3352L6795K17301
19878C78107L45997j23902j30197N592l31652j62233K58436k0726j24616L08076
19868D02882Q546o9261J36955J94465n0256j77979J1806J03659o8682j41487k9957
19857C20691k961M5048q4973R0389Q1744j06545M324L6986J82604K39420K6786
19846H33513j92620q9443j80451o7893L31136m4781K8234M1432j10401k20107
$$ plain form
19920 332358 260969 472821 770453 623846 370693 149321 19536 -154450 -104011 -89308
19910 -89308 -77752 198260 488768 704221 640980 669912 755629 461523 342792 383215 281490
19899 281490 160837 85310 375148 375800 94893 383885 604267 582587 413012 -54277
19889 -54277 220383 589449 622293 470025 460037 249585 25688 70659 124011 160806 378107
19878 378107 724104 600202 470005 475597 143945 -18288 240148 219422 94806 402882
19868 402882 411428 342167 479122 673587 623331 445352 457158 560817 492135 350648 320691
19857 320691 317730 362778 277805 368194 449938 343393 347717 384703 567307 806727 833513
19846 833513 640893 551450 370999 303106 634242 589461 617695 659127 548726 328619
19836C28619M6662J44261Q7178K02033J08252l23345r6646J46221R3913p3971
19826F63177k02620r5781J13681J92324J46069J19389J77845m32608k49292J09411
19816E41595J46967J96757k0342p4377M3467J67451P642j55164q489J00154J60465
19805A106126K37532P8692k69868j74458j23118K34402J18750j79769J82039J70497
19795A380825M7655n5572j73087o2745j8564Q4512q5933M295N8862J20175J41013
19784A441436J54484J08370M4335l1288l29347j64101M06766j8024l03236o9439
19774A239956J95444L19337j15579o7071L2185q0549J90314J97672J81930Q9326
19764B182965k9874J45339K77380k8692M4049r3331L5622J24338M3536o9657R0619
$$ plain form
19836 328619 375281 519542 606720 808753 917005 593660 497014 643235 737148 663177
19826 663177 460557 364776 478457 670781 816850 936239 1114084 681476 432184 541595
19816 541595 688562 885319 864977 790600 834067 1001518 1009160 853996 845507 945661 1106126
19805 1106126 1343658 1422350 1152482 978024 854906 1089308 1208058 1028289 1210328 1380825
19795 1380825 1428480 1372908 1199821 1137076 1118512 1203024 1117091 1121386 1180248 1300423 1441436
19784 1441436 1595920 1704290 1748625 1717337 1387990 1223889 1630655 1612631 1309395 1239956
19774 1239956 1435400 1754737 1639158 1572087 1604272 1523723 1714037 1911709 2093639 2182965
19764 2182965 2153091 2298430 2575810 2547118 2591167 2497836 2533458 2657796 2701332 2631675 2722294
19753B722294J54806L1707P5285k86614q0384J35718m6548K55671K00820J08502
19743C271257K47827J10381m1407N8676M00278L18893J59872j12724k49722l9132
19733D124199Q057R3257J49757J11821K54431J48070J54745K15061K43251J85046
19723E687695J08766K67351J52097K73610J63263L969M1544K05721L09615L00371
19713G514002K45783K35228J0856R5213J76248L66870N86580M42550K68956M18754
19703A0361040M63859N84647M53918N69786N52578N25981M20675O21511P54168
19694A5308163L27980K56926P65180R42984N43936N81966Q55259J016145J035697
19685B1634236R59295P80721R61707J070754J340801J613576J618739J175955
$$ plain form
19753 2722294 2877100 2908807 2984092 2697478 2617094 2752812 2706264 2961935 3162755 3271257
19743 3271257 3519084 3629465 3588058 3646734 4047012 4365905 4525777 4413053 4163331 4124199
19733 4124199 4132256 4225513 4375270 4487091 4741522 4889592 5044337 5259398 5502649 5687695
19723 5687695 5796461 6063812 6215909 6489519 6652782 6656751 6698295 6904016 7213631 7514002
19713 7514002 7759785 7995013 8005869 8101082 8277330 8644200 9230780 9673330 9942286 10361040
19703 10361040 10824899 11409546 11863464 12433250 12985828 13511809 13932484 14553995 15308163
19694 15308163 15636143 15893069 16658249 17601233 18145169 18727135 19582394 20598539 21634236
19685 21634236 22593531 23374252 24335959 25406713 26747514 28361090 29979829 31155784
19677C1155784J670263J626094J368231J794204K030322J823445K143858J938910
19669D5551111J837316K341767K268884K143613K306258K410140K347813K136106
19661F3343008K149598K240935K081993J584537J700682J528098R61048N83929
19653G6173828N44665L35852j26248l21597p23422j127731j166869j354400j717149
19644G0516929j674860j915107k183167k115499k247393k202461k157495k210822
19636E3810125k135904k103088k343752k014742j947294j741307j919078j739055
19628C7865905j690605j352301j404318j444861j310047j188991j213482j311522
19620B6949778j311976j172952q51812q22253r80309p65694p75393p36423o84261
$$ plain form
19677 31155784 32826047 34452141 35820372 37614576 39644898 41468343 43612201 45551111
19669 45551111 47388427 49730194 51999078 54142691 56448949 58859089 61206902 63343008
19661 63343008 65492606 67733541 69815534 71400071 73100753 74628851 75589899 76173828
19653 76173828 76718493 77054345 76928097 76606500 75883078 74755347 73588478 72234078 70516929
19644 70516929 68842069 66926962 64743795 62628296 60380903 58178442 56020947 53810125
19636 53810125 51674221 49571133 47227381 45212639 43265345 41524038 39604960 37865905
19628 37865905 36175300 34822999 33418681 31973820 30663773 29474782 28261300 26949778
19620 26949778 25637802 24464850 23613038 22790785 21810476 21044782 20269389 19532966 18848705
19611A8848705p06485p44168q19579o63336l83742m93429o53738m37412l42303
19602A3604513k63877l07942n46509o67315l58680m94141l51744k54357l11418
19593A0048530m56461k71010j29264p3671p5895j47791j72199l62529l00476k62202
19583G797032k51602j45758m08132l73416N9606j83042m7220R4777j77013k55080
19573F110152k43149j08314l68062m28354j347Q5081K1842j90101m2013n5466
19563D780269N3115J215k30294o4141j58236m45155k77785J52368L92666O2514
19553D266536j11794k09390j59465l0958k06535k56935N0340J22426o3993n8321
19543C341911P670L1338m33224j19564K2845L9402K42719K7766O608j58562l89740
$$ plain form
19611 18848705 18142220 17398052 16578473 15915137 15531395 15037966 14384228 13946816 13604513
19602 13604513 13340636 13032694 12486185 11818870 11460190 10966049 10614305 10359948 10048530
19593 10048530 9592069 9321059 9191795 9118124 9042229 8894438 8722239 8359710 8059234 7797032
19583 7797032 7545430 7399672 6991540 6618124 6677730 6494688 6447468 6542245 6365232 6110152
19573 6110152 5867003 5758689 5390627 4962273 4960926 5046007 5067849 4877748 4835735 4780269
19563 4780269 4833384 4834599 4604305 4540164 4381928 3936773 3658988 3811356 4204022 4266536
19553 4266536 4154742 3945352 3785887 3754929 3548394 3291459 3341799 3464225 3400232 3341911
19543 3341911 3349581 3380919 2947695 2828131 2850976 2890378 3133097 3160863 3167471 3008909 2619169
19532B619169j32966l676J21864r992k01470j52518o3147j2472j12236j2137l9208
19521B001211J87306J74498m7727j18850j09638m030J0590L02874J81070j63318
19511B413986N4208m6583l63753j85361k57925j63975K03755p6304J27139K67820
19501A973007j36893j03768Q2526K64991j33234l67642m4561k3498j2461n4712
19491A443755q4579r8032P5811j77938J27858J82253L552k49091Q6852M1941j09225
19480A243157L5079K25260J47547k6350k12993j46238j90541K2352K69384k23557
19470A143100o4463q7427J1099l3618P1575R1324j60093j41425p007k3581M4048
19459H43532R8907O0538k38150l10456J89128J46931M6606K09793k5228j70597
$$ plain form
19532 2619169 2486203 2482527 2604391 2594399 2392929 2240411 2177264 2164792 2052556 2040419 2001211
19521 2001211 2188517 2363015 2315288 2196438 2086800 2082770 2093360 2396234 2577304 2413986
19511 2413986 2468194 2421611 2057858 1872497 1614572 1450597 1654352 1578048 1705187 1973007
19501 1973007 1836114 1732346 1814872 2079863 1946629 1578987 1534426 1510928 1498467 1443755
19491 1443755 1359176 1261144 1336955 1159017 1286875 1469128 1472680 1223589 1310441 1352382 1243157
19480 1243157 1278236 1503496 1651043 1624693 1411700 1265462 1074921 1097273 1366657 1143100
19470 1143100 1078637 991210 1002309 968691 1040266 1131590 971497 830072 823065 799484 843532
19459 843532 942439 1002977 764827 454371 643499 790430 837036 1046829 1021601 851004
19449H51004l93183K40877L05386K6596J01157j56869n1096j6227L1262J29309
19439A068216j80543l04584j03212J52476l06727J8173K84485J10473n152J25086
19429H58691J2494j2302m3373q0021J56746N5720J5153j07416p170k25720K0848
19418F43650J49337n9509j23324K9252K4592p1920J97162J9578P2923n2454r5883
19407G33404J84538l7554j04563j93791k6326j82186j7526J37647q3391L2883
19397D43135N5124J50163J4691k18522R7649R1660q1861r0680l3334R3080r5527
19386D25578m1732K07318J50137M2917j37787K24601k7162j56139k48607k15392
19376B23732K3923J23338J35475N8367L3309p7384j1841J28764L1942M608j20521
$$ plain form
19449 851004 457821 698698 1004084 1030680 1131837 974968 923872 907645 938907 1068216
19439 1068216 887673 583089 479877 632353 325626 343799 628284 738757 733605 858691
19429 858691 871185 858883 815510 735489 892235 947955 963108 855692 848522 622802 643650
19418 643650 792987 733478 610154 639406 663998 592078 789240 808818 881741 829287 733404
19407 733404 917942 880388 775825 582034 555708 373522 355996 493643 410252 443135
19397 443135 498259 648422 663113 444591 542240 633900 552039 461359 428025 521105 425578
19386 425578 383846 591164 741301 784218 646431 871032 843870 687731 439124 223732
19376 223732 247655 370993 506468 564835 598144 520760 508919 637683 669625 674233 553712
19365E53712K7195J26265j22825j35961j62043j13875K30668J69682l00525O4610
19355C36903R9987l3010m5569q9082j23580L2069K32791K83636j73020k16689
19345C04436P3961J59875j15108l4850j44970N7345j1491k34970k16509q0771
19335b43052K16867L21347R7763r4521m0606q940J40812K27318r1009L4789j66562
19324C94206q1296r1737k68479k12153m1750o2146L23130M17389L00518n0499
19314F27183l79155k71863N3961j07318K332q082O6967l7398L1465m5847J46908
19303G9153m2953J49621n5441k46177P9732K035j19833o844J10602j13643K07369
19292D3621K74913n6213p2623J0259O0946k429L0399q0131j20415J1374j6102
$$ plain form
19365 553712 580907 707172 584347 448386 286343 172468 403136 572818 272293 336903
19355 336903 436890 403880 358311 269229 145649 177718 410509 694145 521125 304436
19345 304436 378397 538272 423164 388314 243344 300689 289198 54228 -162281 -243052
19335 -243052 -26185 295162 392925 298404 257798 248858 389670 616988 525979 560768 394206
19324 394206 312910 221173 -47306 -259459 -301209 -363355 -40225 377164 677682 627183
19314 627183 248028 -23835 30126 -77192 -74860 -82942 -15975 -53373 -21908 -67755 79153
19303 79153 36200 185821 130380 -115797 -36065 -34030 -153863 -160707 -50105 -163748 43621
19292 43621 318534 262321 189698 199957 260903 258474 288873 208742 88327 99701 83599
19281H3599J59726P9999o8490J12759J57846P8799k05088l25091l5053j10423
19271g1417p2921O8271N7556n1082J36922p6519N8226K32564J89599p7092m69745
19260g5638Q243K94480J77771K69234j09605k71308k987n0618j17104m34772k34607
19249e46911J88597L22629K26516k62023k48579o7715J35900J38108j18542O258
19239b25762R38m5825K16713K22514J5421q7150j78899K37790J99609K88332J22169
19228G65850m01643j40274K64799N8998J050M633k32234K8810j45429M3882J40847
19217C89289n0191j42860k5601k965O5033j22037j11965J17670J35825o8390K0730
19206B04538p6052r3677K4142J7117j0413J8031J6692J6441J1258K1364M3500
$$ plain form
19281 83599 243325 323324 254834 367593 525439 604238 399150 74059 39006 -71417
19271 -71417 -144338 -76067 -18511 -69593 67329 -9190 49036 281600 471199 394107 -75638
19260 -75638 -67395 227085 404856 674090 564485 293177 290190 239572 122468 -312304 -546911
19249 -546911 -358314 -35685 190831 -71192 -319771 -387486 -251586 -113478 -232020 -225762
19239 -225762 -224824 -270649 -53936 168578 183999 96849 -82050 155740 355349 643681 765850
19228 765850 364207 223933 488732 547730 548780 553413 321179 349989 204560 248442 389289
19217 389289 339098 196238 170637 167672 232705 110668 -1297 116373 252198 183808 204538
19206 204538 128486 34809 58951 76068 65655 83686 100378 116819 128077 149441 192941
19195A92941O0510j43173k3641J38252P4358K1360l1363K0018O0616o8759j08322
19184A92797K3417j38853k13772p7012j91485J38327M19770P1031k6239r5033
19174A02948j59668k6765P6338J47173L02987J38777K57303J58945l35992r8420
19164E63626m5918q4800m4220j44709o6691Q7830K83406K00738J43245K25715
19154A118222n2203j70980J22757J26986j72376j58929m8454k1386l88785l4830
19144C20022K82027m3720J20345k27214j38439j44281P1208l0130l1862N001r1053
19133I1904o4674K2166j76170r8606J79321L918J7799J50460Q8974o3466j78604
19122b6978m5887L8572j11153j19692k17812Q9843L61207J27844l1072O65k09176
$$ plain form
19195 192941 253451 110278 86637 224889 299247 320607 289244 309262 369878 301119 192797
19184 192797 216214 77361 -136411 -213423 -404908 -266581 153189 224220 197981 102948
19174 102948 -56720 -83485 -7147 140026 443013 581790 839093 998038 662046 563626
19164 563626 517708 432908 388688 243979 177288 265118 548524 749262 892507 1118222
19154 1118222 1066019 895039 1017796 1144782 972406 813477 765023 743637 354852 320022
19144 320022 602049 558329 678674 451460 313021 168740 239948 209818 177956 182957 91904
19133 91904 27230 49396 -126774 -225380 -46059 -42141 -24342 126118 215092 151626 -26978
19122 -26978 -72865 -34293 -145446 -265138 -482950 -393107 -31900 95944 64872 65537 -143639
19111a43639p9559J06320J97020K73557n2278m21682k66800K6638J73711J46965
19101c9747k8839M492o1234R153J33231k21657j44710L2600J77852K4968j12767
19090b26658K11208j56978Q7847n0239j08396J90653K46901o8884K5838k0782
19080A30510j49088P1837K1146n5939K63715Q329n5869k11828k37544j49340M3194
19069c20877J12962k4640Q2991o3794j15442J31896P1827J19280R6150K38k90873
19058b00282k62657J62358J44956J97607p2137j38186k14J14561J47826k2869
19048G0963J12181n9113k38293J23645P9668k2914j70397J9563M5442j05964r930
19037a55149K1280Q4480Q9801M1713L577N1269J67623r5559q8382k06425p5471
$$ plain form
19111 -143639 -223198 -116878 80142 353699 301421 -120261 -387061 -360423 -186712 -39747
19101 -39747 -68586 -64094 -125328 -116175 17056 -204601 -349311 -316711 -138859 -113891 -226658
19090 -226658 -15450 -172428 -84581 -134820 -243216 -52563 194338 125454 151292 130510
19080 130510 -18578 53259 74405 18466 282181 290510 234641 22813 -214731 -364071 -320877
19069 -320877 -207915 -232555 -149564 -213358 -328800 -196904 -125077 -5797 90353 90591 -200282
19058 -200282 -462939 -300581 -155625 41982 -30155 -168341 -168555 -53994 93832 70963
19048 70963 183144 124031 -114262 9383 89051 66137 -104260 -84697 -39255 -145219 -155149
19037 -155149 -133869 -49389 40412 82125 85702 136971 304594 209035 120653 -85772 -161243
19026a61243J28030J09584o74R4314M555l3704n2910j03439k18675P854k2459
19015b48767Q1464Q3448R0951k47893n3658n9709k73383Q168J39835M00778j76057
19004b54823p0998J66660Q0960n6814Q0902n5936l198j20268N3478K3762k5605
18993a81880K99379J36208j47860j82086k87216m8334J47041P5135N4915O6383
18983f8315n0897M6316j33110k5281l5365j18113O4544J87834L25186j55140j94084
18972a56425j23573J37381K71079Q8274j18544J67654j0776r4102J02999j04557
18962A59410k21314J94810K70682R207n1768K5923j00241l2572Q9197j59723r336
18951A74275q7830M7222R4357K9059j43313q0003N7460K2003L69025J58320j40343
$$ plain form
19026 -161243 -33213 76371 75697 170011 174566 140862 87952 -15487 -234162 -226308 -248767
19015 -248767 -167303 -83855 7096 -240797 -294455 -354164 -627547 -619379 -479544 -78766 -254823
19004 -254823 -325821 -159161 -78201 -135015 -54113 -110049 -113247 -233515 -180037 -156275 -181880
18993 -181880 117499 253707 105847 -76239 -363455 -411789 -264748 -189613 -134698 -68315
18983 -68315 -119212 -72896 -206006 -231287 -266652 -384765 -320221 -132387 192799 37659 -156425
18972 -156425 -279998 -142617 128462 216736 98192 265846 255070 160968 263967 159410
18962 159410 -61904 132906 403588 412795 361027 386950 286709 254137 343334 183611 174275
18951 174275 86445 133667 228024 257083 113770 33767 91227 113230 482255 640575 500232
18940E00232l28577k19581P2539N768q6483L5183L979J9980R4866n8841O205k49239
18928b03969j45126j89198L83529K71114q4792p1877o1301n4183m6950j31620
18918c34373R9491Q2636J69511L925o1911O9376J4340K5514P7247J0872p465K24450
18906C73613j63136j44820J6301J50003m4379j1409K3838n8193m2858r0654q2805
18895g4499j21450R432R6351L81580K02296R3438M2625j62472k18582J20880j37864
18884B31735j31304n7376n0559M9230l1407j1121P3109r2637J1772M592J23879
18873A19913J19507J35108m239J2877k34319j62925j54289j23640J18207k95415
18863d69215p7145J12416J47786l7499J94440J65341M1227n5888j75382j2820
$$ plain form
18940 500232 171655 -47926 24613 30381 -56102 -20919 -16940 3040 97906 39065 45270 -203969
18928 -203969 -349095 -538293 -154764 116350 31558 -40319 -101620 -155803 -202753 -334373
18918 -334373 -234882 -152246 17265 21190 -40721 28655 42995 68509 145756 156628 149163 373613
18906 373613 210477 65657 81958 231961 187582 176173 200011 141818 98960 8306 -74499
18895 -74499 -195949 -186517 -90166 291414 493710 587148 629773 467301 248719 369599 231735
18884 231735 100431 43055 -7504 41726 10319 -802 72307 -20330 -8558 -3966 119913
18873 119913 239420 374528 370289 383166 148847 -14078 -168367 -292007 -173800 -469215
18863 -469215 -546360 -433944 -286158 -323657 -129217 36124 77351 21463 -153919 -166739
18853a66739j20578K40028j5388k41952K2483J4065j2893j02304J22167R1096
18843a70015j51972L7797J08671R7946o0539Q4798j52762J33580n1008M0984o1771
18832a44291m4244N8712j36018k40153L3785M0876M2848K18610J49551J8594j57342
18821a59072k51376p6054j72030j40208N7173K13084O2339j1986R5054J34396
18811b48680J01559J59296j26760l10148j02719R1137J72576L6355l3985p4101
18801c35470P0699J34176m6148r53j06011J71528K65958k3804k12244l08793j9264
18790d10326R30K9855L40858j3938j09332j95106P7466P4123L6329N5401m4656
18779a58396j05357r660N47J05958p2671q7010j01390k62221L1842J74232J0349
$$ plain form
18853 -166739 -287317 -47289 -62677 -304629 -282146 -268081 -280974 -383278 -261111 -170015
18843 -170015 -321987 -284190 -175519 -77573 -138112 -53314 -206076 -72496 -123504 -82520 -144291
18832 -144291 -188535 -129823 -265841 -505994 -472209 -431333 -388485 -169875 -20324 -1730 -159072
18821 -159072 -410448 -486502 -658532 -798740 -741567 -528483 -466144 -478130 -383076 -248680
18811 -248680 -147121 12175 -114585 -424733 -527452 -436315 -263739 -227384 -261369 -335470
18801 -335470 -264771 -130595 -176743 -177696 -283707 -112179 153779 129975 -82269 -391062 -410326
18790 -410326 -409396 -379541 -38683 -52621 -161953 -357059 -279593 -205470 -169141 -113740 -158396
18779 -158396 -263753 -273413 -272866 -166908 -239579 -326589 -427979 -690200 -658358 -484126 -473777
18768d73777k02900m8045J50146K31578O1110j16162l1745M4258L9748L8062n2543
18757c60270R9154m2608k08360n9993j5405j23408J834J95635O5517L8054J77
18746d09673r3389P8578J11796R1654P464J52904J08497k87011j75487J69819
18736b44848J23193n1233l55209J62191L9128J51777P3334j18631k96369j73359
18726f90026R3974J65885M850k43243j17658K33676J3358j49293M4506K89100
18716c54871M6985l3838K09883o3122l49902m009J19012J97905L6954j86795j15331
18705d97129R8312K01593j29860k16677J6963m1962J86193J42934j07733k9282
18695c76648Q9803J1939j78920n2758N3856l1510P2816N4359j02433j976k7679
$$ plain form
18768 -473777 -676677 -724722 -574576 -342998 -281888 -398050 -429795 -385537 -345789 -307727 -360270
18757 -360270 -261116 -303724 -512084 -572077 -587482 -710890 -709056 -513421 -447904 -409850 -409673
18746 -409673 -503062 -424484 -312688 -221034 -213570 -60666 47831 -239180 -414667 -244848
18736 -244848 -121655 -172888 -528097 -365906 -326778 -175001 -101667 -220298 -516667 -690026
18726 -690026 -596052 -430167 -425317 -668560 -786218 -552542 -539184 -688477 -643971 -354871
18716 -354871 -307886 -341724 -131841 -194963 -544865 -548874 -429862 -231957 -195003 -381798 -497129
18705 -497129 -398817 -197224 -327084 -543761 -526798 -568760 -382567 -239633 -347366 -376648
18695 -376648 -286845 -274906 -453826 -506584 -452728 -484238 -411422 -357063 -459496 -461472 -489151
18684d89151J16918L73905J43017k51730q7143l9820j17550K6774P4427L5515
18674b14838r564N7910L33207O1508j5202n1948q201K27951j03866j14026o8028
18663I4903R80K02673J65532L62637J81564l1485m1050O9999K79439L51078N67668
18652B203938N07243N79176N03727M88850K69059K62012P94695J071470R30272
18643G610442R59160J281993J388773J606311K070957K521732M182823P004170
18635B8626361J0488969J6572307K6677701M1263994N7031476N7952014K9042961
18628B67655783j0564826l6087200m8391385m6310677l2631748j9073223q888752
18621F5707972j538403N417661J4434515K7045688M5134949O3852709O1863271
$$ plain form
18684 -489151 -372233 1672 144689 -107041 -194184 -234004 -351554 -324780 -250353 -214838
18674 -214838 -224402 -166492 166715 228223 213021 161073 152872 380823 276957 162931 94903
18663 94903 95883 298556 464088 826725 1008289 976804 935754 1005753 1285192 1636270 2203938
18652 2203938 2711181 3290357 3794084 4282934 4551993 4814005 5608700 6680170 7610442
18643 7610442 8569602 9851595 11240368 12846679 14917636 17439368 21622191 28626361
18635 28626361 39115330 55687637 82365338 123629332 180660808 238612822 267655783
18628 267655783 257090957 221003757 172612372 126301695 93669947 74596724 65707972
18621 65707972 64169569 69587230 84021745 111067433 156202382 220055091 281918362
18614B81918362K6450379j6628906m5547953n9443261n5616417m0134525k5775119
18607F5222560j6508908j0997436p490455n151778l690085k597133j512795p70941
18599A6503029q82941j086846o03255j115646j377552j302867j118417j030338
18591G985167j051615q80150o27997o40839m10528n54141m90379J61J23377k67543
18581C185513k27116j7251R9205j60087k86906l3430M0787k61234j42280p5414
18571B121787q8639j37876k67174j81054J54492J55517P3831P0051n5516l55173
18561A490246L4557K8455N5144N9969K4629J6096k96682r7201q9640n9182K38514
18550A404905J35290k11047O8374k83448k77438j27144j02213J2241L86886J28931
$$ plain form
18614 281918362 308368741 291739835 246191882 186748621 131132204 90997679 65222560
18607 65222560 48713652 37716216 30225761 25073983 21383898 18786765 17273970 16503029
18599 16503029 15620088 14533242 13929987 12814341 11436789 10133922 9015505 7985167
18591 7985167 6933552 6053402 5425405 4784566 4374038 3819897 3329518 3329679 3453056 3185513
18581 3185513 2958397 2941146 3040351 2880264 2593358 2559928 2600715 2339481 2197201 2121787
18571 2121787 2033148 1895272 1628098 1447044 1601536 1757053 1830884 1900935 1845419 1490246
18561 1490246 1524803 1553258 1608402 1668371 1693000 1709096 1412414 1315213 1225573 1166391 1404905
18550 1404905 1540195 1329148 1397522 1114074 836636 709492 607279 619520 1006406 1135337
18540A135337j34534j14262k06093k90535l2677O8145K23226J57641o0106j72787
18530E73355n5074J16968r0966k03679r1770n0196R8894M2171K8119Q3664m4055
18519D07431j17484Q8754J26685m1036j85634j33457J30535M90905L6919p5560
18509G28058M2945P2045k85545r3244P5181K39503l6440l78942k89206J09195
18499A83550K89826J44000o9095k71726J36305Q4518l4190k02227j32263p3409
18489E5289K89128K16064J04992q8402l3224j12169j41695P0069n7973K3792j9864
18478C06007K67261K90551M8113M550j98723l38163Q9421L9400K4310J30497J07648
18467G70872p6433j07066J79847P4350k3194J67961p8387J01531K25266J35154
$$ plain form
18540 1135337 1000803 886541 680448 389913 357236 425381 648607 806248 746142 573355
18530 573355 518281 635249 544283 340604 248834 198638 297532 339703 367822 451486 407431
18519 407431 289947 378701 505386 464350 278716 145259 275794 766699 803618 728058
18509 728058 771003 843048 557503 464259 539440 778943 742503 363561 74355 183550
18499 183550 473376 617376 548281 276555 412860 497378 463188 260961 128698 55289
18489 55289 344417 560481 665473 577071 543847 431678 289983 360052 302079 325871 306007
18478 306007 573268 863819 911932 916482 717759 379596 469017 508417 532727 663224 770872
18467 770872 694439 587373 767220 841570 818376 986337 907950 1009481 1234747 1369901
18457A369901Q8580J1827J3921K24013J63818O0309J8456P3554P8234R2446K16412
18446B411471M05321N45373L75231M13034M53614N89042Q22411J186464J320318
18437H522279J534149J953776K608091L917693N733454Q331838J2293571J7522124
18429F2416975K3202244K3799896J2949036k253909j3358726j9119147j9186742
18422F8449627j4317519r172511n239334k057081Q37333M163261P785547J2678964
18414F3128287J7700903J8511964J0315459k254715j1929969j7254674j7769589
18407F0447666j4394712j0368754p174790m865926l390891k095869j383064j295107
18399A5478553j276435j068593r64682p12082n12530m73890m78623m51082j767
$$ plain form
18457 1369901 1458481 1470308 1484229 1708242 1872060 1932369 1950825 2024379 2102613 2195059 2411471
18446 2411471 2816792 3362165 3737396 4150430 4604044 5193086 6015497 7201961 8522279
18437 8522279 10056428 12010204 14618295 18535988 24269442 32601280 44894851 62416975
18429 62416975 85619219 109419115 122368151 120114242 106755516 87636369 68449627
18422 68449627 54132108 44959597 39720263 37663182 38500515 42663776 50449323 63128287
18414 63128287 80829190 99341154 109656613 107401898 95471929 78217255 60447666
18407 60447666 46052954 35684200 28509410 23643484 20252593 18156724 16773660 15478553
18399 15478553 14202118 13133525 12168843 11456761 10944231 10470341 9991718 9540636 9538869
18390I538869N3908J2577K13817N10256P61441J222973J263036J438817J388575
18381A6404269J838960K664312L914980N734032Q572352J2164193J7528930K4234973
18373I3057001K8938022K3271496O361646j0407237k0484129k4419569k1241187
18366G5076043j4806156q867488m360809o41096K783821P177537J3072283J9228472
18358H8662607K4734592K1238287O223852r601431j9918487k4302407k2265531
18351F4771482j6220187j1237814p896677n601459m008734k720012k123199j633942
18343A3329458j324980j356094j062194j011044p54999p31891o13861m54311l55503
18334E664581o44064n74754k71601j9241J11418J36835k70712n36760k54481j32577
$$ plain form
18390 9538869 9592777 9605354 9819171 10329427 11090868 12313841 13576877 15015694 16404269
18381 16404269 18243229 20907541 24822521 30556553 39128905 51293098 68822028 93057001
18373 93057001 121995023 145266519 151628165 141220928 120736799 96317230 75076043
18366 75076043 60269887 51402399 47041590 46400494 49184315 56361852 69434135 88662607
18358 88662607 113397199 134635486 140859338 131257907 111339420 87037013 64771482
18351 64771482 48551295 37313481 29416804 23815345 19806611 17086599 14963400 13329458
18343 13329458 12004478 10648384 9586190 8575146 7820147 7088256 6474395 6020084 5664581
18334 5664581 5020517 4445763 4174162 4154921 4266339 4403174 4132462 3595702 3341221 3208644
18324C208644j3971M1345k96125k82652l7390q5127j35866m16989L6649k56985
18314A761533l14003o395J17639O9644l1421r7158k5697P7770N1704M700O9502
18303A677818J7316j04606j3584k427J28396j04054k18823k7766J6044R1658R734
18292A469706j73774k47555k6172m318J13731N8924J30485l9292k47172k3090
18282A011473o3319k43770q2526k7351K65136J16531N1884k17810n1953J69832
18272I28127j7893J01463l5263j79134k07765n5423J22709J21513K18464k6017
18262I70781j03770j88172l55447j21870K22933n436K27880L14061j75077k43409
18252E42474k72857N121J6382j82657J21707J70055K08491K6788J45691m1536
$$ plain form
18324 3208644 3194673 3236018 2939893 2657241 2619851 2534724 2398858 1981869 2018518 1761533
18314 1761533 1447530 1441135 1558774 1628418 1596997 1499839 1474142 1551912 1603616 1608316 1677818
18303 1677818 1695134 1590528 1576944 1574517 1702913 1598859 1380036 1352270 1368314 1459972 1469706
18292 1469706 1295932 1048377 1022205 1017887 1131618 1190542 1321027 1281735 1034563 1011473
18282 1011473 948154 704384 621858 594507 859643 976174 1028058 810248 758295 928127
18272 928127 910234 1011697 976434 797300 589535 534112 656821 778334 996798 970781
18262 970781 867011 678839 323392 201522 424455 419019 646899 960960 785883 542474
18252 542474 269617 274738 291120 108463 230170 400225 608716 635504 781195 739659
18242G39659J23318r688j16004m5692n6696j86044J17465j13373m2803L03907
18232G14049M9853K6223j1278k07571R9991J44790k78394n6055K7357k3032j47025
18221C38908j95070n3845R9590K85030Q8134j19627j15254m6921j8614p1002o9930
18210A21399j72987N2408Q7670K11743K33377j3464j49390j81971j76891Q6334
18200I8228P626K8818l7895q2104o829L30155L19248p4311j24158j52722j43884
18189A62172K3335K13628N2478J52885O7051J3817N9075j53587o5778j62321j17288
18178B45467m716q171Q9208J30731j1774j32700l5032q0969l7917o6552O612J45062
18166B39249k9596n9500j6146r7700J56265J53466j06956P2465M7684L538j52764
$$ plain form
18242 739659 862977 853289 737285 691593 634897 448853 566318 452945 410142 714049
18232 714049 763902 790125 778847 571276 671267 816057 537663 481608 508965 485933 338908
18221 338908 143838 89993 189583 474613 562747 443120 327866 280945 262331 191329 121399
18210 121399 -51588 820 88490 300233 533610 520146 370756 188785 11894 98228
18200 98228 105854 134672 96777 14673 7844 337999 657247 582936 458778 306056 162172
18189 162172 185507 399135 451613 604498 671549 685366 744441 590854 525076 362755 245467
18178 245467 240751 232580 321788 452519 440745 308045 273013 192044 154127 87575 94187 239249
18166 239249 209653 150153 134007 36307 192572 346038 239082 311547 359231 362769 210005
18155B10005J2683L26795J29652j38224k1732j99659J2822j86511j70766j0644
18145c5579j23498J59034L07566N5119Q7706J25271J526p3153j93968j66475o8482
18134G5067J66678K20986k63180k56369l4709K46289J65427p2245p3508M4467
18124B18903K38602J379j17816R6472J20711j46664k54872J40585K14628J34074
18114F46002L5726j49119k03518l31522k60502K54393J91045j3944r0025j18567
18104d0031M3564P6244m8254m1811M5874j35371j00854J90794l0351J02648J32467
18093A94919J75746r4344L7238J18065J78562M5455K06686M4026l1028j19407
18083G55918j50019L5288m2580k18524j07626j36225O8812j4975l6547L6907L66932
$$ plain form
18155 210005 222688 549483 679135 540911 519179 319520 332342 145831 -24935 -35579
18145 -35579 -159077 -43 307523 362642 450348 575619 577145 503992 310024 143549 75067
18134 75067 241745 462731 199551 -56818 -91527 154762 320189 247944 174436 218903
18124 218903 457505 458884 341068 437540 558251 411587 156715 297300 511928 646002
18114 646002 681728 532609 329091 -2431 -262933 -8540 182505 168561 78536 -40031
18104 -40031 3533 79777 31523 -10288 35586 -99785 -200639 -9845 -40196 62452 194919
18093 194919 370665 276321 313559 431624 610186 655641 862327 906353 875325 755918
18083 755918 605899 641187 598607 380083 272457 136232 205044 190069 153522 190429 557361
18072E57361J47185K91377J87628J40633p9634j98274l47279R9797k01930k61730
18062C35134l5319k7457Q7065J53330o1807j12962L7178J35682j04104l06714
18052A00026M7910j70739k503L4778K91672J53513j61545j25123J34549k4103
18042B78435j62834j27710J46200P1849q6234n549j9215m8306q3912J80085K06473
18031C49282k78885J6717M54648J71843N415l6341r5797j17529q5798O784j52018
18020B38321Q1243J82908n8900r5562k0603j05989q9674m5344J99742L93339p3129
18009F06352j21590K21551O8474o8564o4003k60445q6864j21772M5038l4964k9753
17998A53460N4201K01700O5453K2274R104o5870M0472M25292K55793r856N4591
$$ plain form
18072 557361 704546 995923 1183551 1324184 1244550 1046276 698997 798794 596864 335134
18062 335134 299815 272358 359423 512753 450946 337984 375162 510844 406740 100026
18052 100026 147936 -22803 -25306 9472 301144 454657 293112 167989 302538 278435
18042 278435 115601 -12109 134091 205940 119706 114157 94942 46636 -37276 142809 349282
18031 349282 70397 87114 541762 713605 719020 682679 586882 469353 383555 390339 238321
18020 238321 319564 502472 443572 348010 327407 221418 131744 86400 286142 679481 606352
18009 606352 484762 706313 774787 706223 642220 381775 294911 173139 218177 183213 153460
17998 153460 207661 409361 474814 497088 506192 440322 480794 906086 1161879 1152023 1206614
17987A206614k5206j84372k4912K53717J3071K7375K21968K56177M89434K04648
17977B438514Q17L12913M37466J81814J04523J65095J13051K7516J6045r3910
17967C703844k16347o8958J46978K02744K59046N94036M85037K25532M37060N04419
17957F273391Q08441J033895J056122J262250J528092J909371K649964L263977
17949A9785503M180186N636678P580242J0070718J3923446J9660844K6681923
17942A07519540L3485658L6927055L2045574J8116224m33802j7681474k8757471
17935A81221304l2926148l1186889k6109140k0031563j4663236j0946129q154807
17928C7203392o073294m456024l297611k785445k284204j877431j465624j174790
$$ plain form
17987 1206614 1181408 997036 972124 1225841 1238912 1266287 1488255 1744432 2233866 2438514
17977 2438514 2439331 2752244 3189710 3371524 3476047 3641142 3754193 3781709 3797754 3703844
17967 3703844 3487497 3418539 3565517 3768261 4027307 4621343 5106380 5331912 5768972 6273391
17957 6273391 7081832 8115727 9171849 10434099 11962191 13871562 16521526 19785503
17949 19785503 23965689 29602367 37182609 47253327 61176773 80837617 107519540
17942 107519540 141005198 177932253 209977827 228094051 227660249 209978775 181221304
17935 181221304 148295156 117108267 90999127 70967564 56304328 45358199 37203392
17928 37203392 31130098 26674074 23376463 20591018 18306814 16429383 14963759 13788969
17920A3788969r89002r08303o47767o29074m52794m66651j6193n06117m91552
17911H681516k94437R7331K90675J49395J11366K0990L42610K20541L83955O58836
17901A0662778L41413N90034Q92471R59939R64696J523942J954241K368274L196016
17892B3453804M733347O376666Q954407J2664023J7790420K3809179K9340606
17885A27122452K9961874K2739441R067874o316816j9060357k5918798k7267658
17878A10328012k4362668j9296378j4254481j0339558p959241o095898m553391
17871B3466397l220629k408165k023424j627543j351303j368146r45915o20003
17863I901269q29509q03110n65928o58421p51024n62121k25917N7873M1572m8771
$$ plain form
17920 13788969 12799967 11891664 11243897 10614823 10162029 9695378 9679185 9173068 8681516
17911 8681516 8387079 8484410 8775085 8924480 9035846 9056836 9399446 9619987 10003942 10662778
17901 10662778 11004191 11594225 12486696 13446635 14411331 15935273 17889514 20257788 23453804
17892 23453804 28187151 34563817 43518224 56182247 73972667 97781846 127122452
17885 127122452 157084326 179823767 188891641 182574825 163514468 137595670 110328012
17878 110328012 85965344 66668966 52414485 42074927 34115686 28019788 23466397
17871 23466397 20245768 17837603 15814179 14186636 12835333 11467187 10521272 9901269
17863 9901269 9071760 8268650 7702722 7044301 6293277 5731156 5505239 5563112 5604684 5555913
17853E555913k12289k87231q9842j48280j09610l17022k11014P6844l97992j57962
17843C701515j13886o3662P305q4502l66005l78882k1610m0143k97470l5809J26547
17832B433398o5901k3687j0855j01438r9779n4711J532j84188k2750m9301k20467
17821A601853p7526L6264j65616j43079m7427J62813l5529Q3219J83132R8471
17811A696575J31533N5974j12538j08724M5547l5362l39650j03639j18186N0238
17801A161768j47819P9072J1150p6481M7607Q3823j64171j5992P6873p7270p7529
17790I01031p6814q7072L340J45068p9116k55671j0274O0211L06437K6293j78399
17779G55034l0156J7477M4780j3085k44381j45353P4923J98088k7445j2886k9772
$$ plain form
17853 5555913 5343624 5056393 4966551 4818271 4708661 4391639 4180625 4257469 3859477 3701515
17843 3701515 3587629 3523967 3531272 3446770 3080765 2701883 2680273 2640130 2342660 2306851 2433398
17832 2433398 2367497 2343810 2332955 2231517 2131738 2077027 2078559 1894371 1871621 1822320 1601853
17821 1601853 1524327 1560591 1394975 1251896 1204469 1367282 1331753 1414972 1598104 1696575
17811 1696575 1828108 1884082 1771544 1662820 1708367 1673005 1333355 1229716 1111530 1161768
17801 1161768 1013949 1093021 1104171 1027690 1075297 1159120 994949 978957 1055830 978560 901031
17790 901031 824217 737145 740485 885553 806437 550766 540492 600703 907140 933433 755034
17779 755034 724878 742355 787135 774050 529669 384316 459239 657327 629882 616996 587224
17768E87224o1181J12091R2034l63453j56706J95921J82522J27050J98465J53690
17758A067657j21181o367o4668L2395k0862o0440r4206j22818k04113j01258L31113
17747F35252K24651L0103J8914l30576j07525J68283J60731j86183p0494j20187
17737D22969K4718J11211K22136l6149p8343j2592j37303j39341K9009J7766J12305
17726E36386j0860k3452o6748j78902J68878J30310k23516j20805K51756j05271
17716C57776O0573J9894l41403k56249J66585J95998m7536k62297J6112J19129
17706B8582K33452K14190j17325m50124O7197J68328j0712K22791K44129J29618
17696G30126m8014j93958J7237R0329K8373k07432j77405K1191j27039l844r051
$$ plain form
17768 587224 526043 638134 730168 366715 210009 405930 588452 715502 913967 1067657
17758 1067657 946476 940109 875441 907836 886974 826534 732328 609510 405397 304139 635252
17747 635252 859903 890006 908920 578344 470819 639102 799833 613650 543156 422969
17737 422969 447687 558898 781034 744885 666542 653950 516647 377306 406315 424081 536386
17726 536386 525526 502074 435326 256424 425302 555612 332096 211291 463047 357776
17716 357776 418349 438243 96840 -159409 7176 203174 155638 -106659 -90547 28582
17706 28582 262034 476224 358899 -91225 -24028 144300 133588 356379 600508 730126
17696 730126 682112 488154 505391 595720 624093 416661 239256 260447 133408 129564 120513
17685A20513L0030K67505m0301r5996J07231j733k35850k4731L7246k0975L805
17674A46744p1403J80951J71974p7628j59213m7786Q5307M99243J89059j79183
17664G38065n1760k13127Q6989j4199j58752k358j86028o3104K36163J69112Q2972
17653F23973j25810l89084k48007o6745K74019J29478K65109L5878m4814Q2720
17643E36717j04970j22951J37897J7049r2260P8908J60739k1266l20658p3370
17633A95835P8602O2710k7490k4707m0253j47519N7161p8295J8104r0110L2818
17622C6856L26298J68628k46119l98796m589K02298J38439Q792r0985j63064j07559
17611a29801M975M2938J34750M1535j28039M2541p6097O7698J46403n7853p9322
$$ plain form
17685 120513 150543 418048 377747 281751 388982 387249 151399 126668 163914 142939 146744
17674 146744 75341 256292 428266 350638 191425 143639 228946 728189 917248 738065
17664 738065 686305 473178 560167 545968 387216 384858 198830 135726 371889 541001 623973
17653 623973 498163 109079 -138928 -205673 68346 197824 462933 498811 453997 536717
17643 536717 431747 308796 446693 463742 371482 450390 611129 589863 269205 195835
17633 195835 274437 337147 309657 284950 244697 97178 154339 76044 94148 4038 36856
17622 36856 363154 531782 285663 -113133 -117722 84576 223015 231807 140822 -22242 -129801
17611 -129801 -124826 -81888 52862 94397 -33642 8899 -67198 500 146903 89050 9728
17600I728l7233M8621j40282R9532R1875N5425R4874M1073j67830l0419j82567
17589a17203L4772K30365L4340k93908O6493P2300j18663L6364K2400K05088K950
17578A75298r8991k19765o2615j08568J12916J61139M2728J45033k2592j78187
17568e3604m2651p499K46211J40625k52913k37846o1300K0156J56115J98607l3227
17557G2674j59326k0726J14626O6617K0317r6635j50504K4542n8345P5175K51071
17546A39486J87640j8739J0100j5247N3200k76610J18121J52417J16493m44946
17536B1915j30363j08916L8589J31173R5035P5155J78922J97337k9328j54200
17526C15319j90306k04025j47015k0152N0078J49950r9778J1020J73167J48198
$$ plain form
17600 9728 -27505 21116 -119166 -19634 72241 127666 222540 263613 95783 65364 -117203
17589 -117203 -82431 147934 182274 -111634 -45141 27159 -91504 -55140 -32740 172348 175298
17578 175298 76307 -143458 -206073 -314641 -201725 -40586 2142 147175 124583 -53604
17568 -53604 -96255 -103754 142457 283082 30169 -207677 -268977 -248821 -92706 105901 72674
17557 72674 -86652 -107378 7248 73865 94182 -2453 -152957 -128415 -186760 -111585 139486
17546 139486 327126 308387 318487 303240 356440 79830 197951 350368 466861 21915
17536 21915 -108448 -217364 -178775 -47602 47433 122588 301510 498847 469519 315319
17526 315319 125013 -79012 -226027 -246179 -196101 -46151 -145929 -134909 38258 186456
17516A86456K445k18764J4388M2389R2848M4968j7192k53008P3073j14400P4683
17505g2114N2400L0458J04631R8605K6609k50368J57260m3178L615M7976j29113
17494B6781r1674j31966J49517K15570J14285R0218J46970k32563j01750R9013
17484B84401l2220k66901k02015j8565K00784R9051J93682L3582J0691j00719
17474B01771k08634L0417K62672l6076q9582j15880j60652N2045l6325j57622
17464b57866J86154o4564j43026K1746P6143R5124J85140n5461J01066J11851
17454B56307m5290n6263j46251m1047K14633j55885j07676n0896J51763K00323
17444B19718L0455M2277j18464j26217R0964j77922j1862K0670K66085m8211j80251
$$ plain form
17516 186456 188901 -29863 -15475 26914 119762 164730 147538 -105470 -32397 -146797 -72114
17505 -72114 -19714 10744 115375 213980 240589 -9779 147481 104303 107918 155894 26781
17494 26781 -64893 -196859 -47342 168228 282513 372731 519701 287138 185388 284401
17484 284401 252181 -14720 -216735 -235300 -34516 64535 258217 291799 302490 201771
17474 201771 -6863 23554 286226 250150 160568 44688 -115964 -63919 -100244 -257866
17464 -257866 -71712 -136276 -279302 -257556 -181413 -86289 98851 43390 144456 256307
17454 256307 211017 154754 8503 -32544 182089 26204 -81472 -132368 19395 219718
17444 219718 250173 292450 173986 47769 138733 -39189 -51051 -30381 235704 187493 7242
17433G242m2645M838N4007N6721L06533J10067m8736L1834P7983L9942J04934
17422G02720M5968m1005L4747R1282m397n5785L0960j4095k9690r133o2795q2983
17410F05794l26369j72661K4313j33821k2972K3317K70281J22922q4115l3549
17400B73140j40606Q0049J8814j1391m2993j25249j01857p6116R7182j60539J25439
17389f4127q5007j0056o318Q6581l13350j19476L53062Q3175K63490J88551j5467
17378C61058P0079K9155J4049j02087k04949q4800J01867J68449O4076J65322
17368E82219j39463L1026j83166k7218Q5599M4720J20652J07160K3100k2727j63320
17357D58582j47204J94562J37542k24574l4271q3747K7168j60672P3496p6804
$$ plain form
17433 7242 -35403 -30565 23442 80163 386696 496763 448027 479861 557844 597786 702720
17422 702720 748688 707683 742430 833712 829315 773530 804490 790395 760705 751572 688777 605794
17410 605794 279425 106764 131077 -2744 -25716 -2399 267882 390804 306689 273140
17400 273140 132534 212583 231397 220006 177013 51764 -50093 -126209 -29027 -189566 -64127
17389 -64127 -149134 -159190 -165508 -78927 -392277 -511753 -158691 -75516 187974 376525 361058
17378 361058 431137 460292 474341 372254 167305 82505 184372 352821 416897 582219
17368 582219 442756 473782 290616 263398 348997 393717 514369 621529 644629 621902 458582
17357 458582 311378 505940 643482 418908 384637 300890 328058 167386 240882 164078
17347A64078j22239J96426O076j71800J689M4051R0126n5660j4307j08304J34365
17336A64501J15582j13449j56799O60K2094n1691O4731K16993m3786l41621l53093
17325d75878J91470K1157m948J98236J94065j45944j73514l5358j4407K11704
17315c3417J48026j00855l15657p3968N2298j43886P393J22256K01965J17627
17305a8218j94003M0153j05178K8158R7957J56718P4859l00005k07657j26625
17295e53841J28449K53300k807n7234O0841K24079L33109P8692p7284j61657l14178
17284h8531j51141j11176N4614P7253J78974J10178k9597P544p9035j55221p8677
17273b64815l0403k4872k26093j51268L4989J04275K44608N2909j7423K01834
$$ plain form
17347 164078 41839 238265 244341 72541 74230 118281 208407 152747 138440 30136 164501
17336 164501 280083 166634 9835 10495 32589 -19102 45629 262622 218836 -122785 -475878
17325 -475878 -284408 -263251 -268199 -69963 124102 -21842 -195356 -230714 -245121 -33417
17315 -33417 114609 13754 -301903 -375871 -323573 -467459 -460066 -337810 -135845 -18218
17305 -18218 -212221 -172068 -277246 -249088 -151131 5587 80446 -219559 -427216 -553841
17295 -553841 -425392 -172092 -174899 -232133 -171292 52787 385896 464588 387304 225647 -88531
17284 -88531 -239672 -350848 -296234 -218981 -40007 70171 40574 48118 -30917 -186138 -264815
17273 -264815 -295218 -320090 -546183 -697451 -662462 -558187 -313579 -260670 -278093 -76259
17263g6259n1277k1367P423l2393R1549J80830p9352N5441j62818j11667J36244
17252f3646J93194J5509J1445k21105j43054P5446J17789j3682J54880j52246
17242b5470k45401N039j60129K951m3316j58782K11637p230J72020M08526j15451
17231D4394p9733L3070Q297R1231J21664j56176k35039Q2448M987p1953K0824
17220a35986Q0713J74950j87603k49467k0034o4214l2165L28327L61189J59912
17210D15622l10886o3865P152k6213j64973J23899J30762j54535k55720J87778
17200a10979J64790q6581J80606j2549m110l6628p1296k71191l9809Q5420J31114
17189g1213Q3634j00979j15263J29523k0944n7905j38094J38550m4428j20494
$$ plain form
17263 -76259 -127536 -148903 -141480 -173873 -82324 98506 19154 74595 -88223 -199890 -63646
17252 -63646 129548 145057 156502 -64603 -207657 -132211 -14422 -28104 126776 -25470
17242 -25470 -270871 -265832 -425961 -423010 -466326 -625108 -413471 -420701 -248681 159845 44394
17231 44394 -35339 -2269 6028 97259 218923 62747 -172292 -89844 -84857 -156810 -135986
17220 -135986 -55273 119677 -67926 -317393 -337427 -401641 -433806 -105479 255710 415622
17210 415622 104736 40871 48023 21810 -143163 -19264 111498 -43037 -298757 -110979
17200 -110979 53811 -32770 147836 135287 131177 94549 23253 -247938 -287747 -202327 -71213
17189 -71213 12421 -88558 -203821 -74298 -95242 -153147 -291241 -152691 -197119 -317613
17179c17613N7145n5389q3194L3525l254k21423P6036K85214J17942J23676m9002
17168c6337q0537l09027k2164L90213K68089M0305p7419J8129m67085p8824j08396
17157d63053j9259P3209K42036P2461k2204Q202j66158j91320J92574L5395K87742
17146D9625K08685j09089j1755j81530j31436j55142J40554J01684o916K4705
17136g0615q8188J17263L36825p0504p0391m36950j97587N1146O7814L0307p0859
17125d01739r123J4488L3081K53542L82263j00395j85361K73589K068k05223j42750
17114h5560j5875l2874J82920J63229N9504Q9952L444j69647j83604m1281j65384
17103a95176l2765p5356m571Q6627j53857K35373K94038Q3130o2796k19844L1327
$$ plain form
17179 -317613 -260468 -315857 -399051 -365526 -368780 -590203 -514167 -228953 -111011 12665 -36337
17168 -36337 -116874 -425901 -448065 -57852 210237 250542 173123 191252 -275833 -354657 -463053
17157 -463053 -482312 -409103 -167067 -94606 -116810 -108608 -274766 -466086 -273512 -238117 49625
17146 49625 258310 149221 137466 -44064 -175500 -330642 -190088 -88404 -95320 -70615
17136 -70615 -158803 -41540 295285 224781 154390 -282560 -480147 -429001 -361187 -330880 -401739
17125 -401739 -410862 -396374 -363293 -109751 272512 172117 -13244 260345 262413 57190 -85560
17114 -85560 -101435 -134309 48611 211840 271344 361296 364740 195093 11489 -29792 -195176
17103 -195176 -227941 -303297 -307868 -221241 -375098 -139725 154313 237443 174647 -45197 -13870
17092a3870k8183j06531j1242Q10J30406p7257r724J4812J0737R4375j51502q7487
17080b34656m5625K65039j05562L1501k1485O8974L2911P2900o2591j8635j09911
17069a27140j98892p6992j8443K12621K01277J16289j01639j2218J05434r4789
17059E508j23032j07888l7504j17551o9232J1055M86294J32067r756m7036k42834
17048a19909r7050J65522o4959p2373j22808l1413O6031K33729J47320J86625
17038B90715o060k50109j23663p8976j71251j82558l3403N4567P7882J38647L36441
17027E2232m6171k52553K7588Q5306J18292J73658j75409n9525K14970P5838l2413
17016A81813j25197n9103j17l19550j71755N9598M8366J11016J96641K12774J75625
$$ plain form
17092 -13870 -42053 -148584 -159826 -159016 -28610 -105867 -115591 -100779 -90042 4333 -147169 -234656
17080 -234656 -280281 -15242 -120804 -89303 -110788 -41814 -8903 63997 1406 -17229 -127140
17069 -127140 -326032 -403024 -421467 -208846 -7569 108720 7081 -5137 100297 5508
17059 5508 -117524 -225412 -262916 -380467 -449699 -438644 47650 179717 169961 122925 -119909
17048 -119909 -216959 -51437 -116396 -188769 -311577 -342990 -276959 -43230 104090 290715
17038 290715 284655 34546 -89117 -168093 -339344 -521902 -555305 -500738 -422856 -284209 52232
17027 52232 6061 -246492 -218904 -133598 -15306 158352 -17057 -76582 138388 214226 181813
17016 181813 56616 -2487 -2604 -322154 -493909 -434311 -385945 -274929 -78288 134486 310111
17005C10111K37425j90181k41665j47115M5806j82035l35937R0923Q7458K74416
16995e0794q528Q8365k4594j05280m6479k53971j93643K88635J55540K00818L06553
16984C56622m2555j70127j37375L9965J23102m3088j21656R5057j45424k40090
16974b85569J12334J53990J35609J69696k09758j3690J90058R2063j17387l06672
16964g9326j15442J177l96J20205q3847j65170j36196K50087L01754j51721J18736
16953E9861k790k99708p784K23553R534L1212k45211j00978J47227K83455j64782
16942f6411r7252J61552l566p2812L4466r8953J2944J8328L1069K31281n0692
16931I9954k70843n8921n5613M3221N3952R1715K33026L2124L9967j90850k91032
$$ plain form
17005 310111 547536 357355 115690 -31425 14381 -167654 -503591 -412668 -325210 -50794
16995 -50794 -59322 29043 4449 -100831 -147310 -401281 -594924 -306289 -150749 50069 356622
16984 356622 314067 143940 6565 46530 169632 126544 4888 99945 -45479 -285569
16974 -285569 -173235 -19245 116364 286060 76302 62612 252670 344733 227346 -79326
16964 -79326 -194768 -193591 -193987 -73782 -157629 -322799 -458995 -208908 92846 -58875 59861
16953 59861 57071 -242637 -250421 -26868 -17334 13878 -231333 -332311 -185084 98371 -66411
16942 -66411 -163663 -2111 -5677 -78489 -44023 -142976 -130032 -111704 -80635 150646 99954
16931 99954 -170889 -229810 -285423 -242202 -188250 -96535 136491 168615 208582 17732 -273300
16920b73300j32772M2305l9266K62688N0624k45223j09052k37248J30183L25527
16910b25534J50622J6014J14330j13146K2219P1622J04292j57700k11435q0854
16900c09570R1526J74012n4579O4407o5706j89555R1186p1065j26395j4637J77424
16889b32952K34401r2497k88704l0679L2054J95012K03623p1773r6162R903Q2543
16878e5231j51193j4554N3674k3164k73774J89800K92669j70368r5857K56591
16868H593L3775R0910k42883j68057j22775R7219L8484o6773j9846m4631O5193
16857c30791L1971j64641N0139p6319K15214J12866q421O9077J31874o0548j42743
16846a72322O2197j2793J070O6678J64004J0348J6124k18068j62704p9873J49032
$$ plain form
16920 -273300 -406072 -363767 -403033 -140345 -89721 -334944 -443996 -681244 -551061 -225534
16910 -225534 -74912 -58898 55432 -57714 -35495 36127 140419 -17281 -228716 -309570
16900 -309570 -218044 -44032 -98611 -34204 -99910 -289465 -198279 -269344 -395739 -410376 -232952
16889 -232952 1449 -91048 -379752 -410431 -378377 -183365 20258 -51515 -147677 -137774 -55231
16878 -55231 -206424 -220978 -167304 -190468 -464242 -274442 18227 -152141 -247998 8593
16868 8593 42368 133278 -109605 -277662 -400437 -303218 -264734 -331507 -351353 -395984 -330791
16857 -330791 -298820 -463461 -413322 -489641 -274427 -161561 -169982 -100905 30969 -29579 -172322
16846 -172322 -110125 -122918 -121848 -55170 108834 119182 135306 -82762 -245466 -325339 -176307
16835a76307K74926O1190k90620k84741k8053K8054J19492j22240n6959o9788
16825e45046K25146K17782o98M0740K67501N1980j71686q8783O9765n23K4022
16814I0200q8357K3217o0213Q4578l4182q0743L0417k81879J71175j34251J32850
16803a47188J31161j66075R2590J24427J00931p8633M9894m3073K4060r8859J01610
16792I0845N2627J51061j60433j20241k2725k14580n8849P6845J32327L5686r9257
16781a36694j35617p0693J98416M4322Q5620J6295J04644l542J59853P2193j70953
16770A63844j74795j80123k4386P57J99228O590J01562j46379l45297k26696J61437
16759d64258Q1635m2223j0698J49155j23650J6828k5701m568J4813L81582K22828
$$ plain form
16835 -176307 98619 159809 -130811 -415552 -443605 -415551 -296059 -418299 -475258 -545046
16825 -545046 -319900 -102118 -102816 -62076 205425 257405 85719 -3064 66701 66178 90200
16814 90200 1843 25060 -35153 49425 15243 -65500 -35083 -316962 -145787 -280038 -147188
16803 -147188 -16027 -182102 -89512 34915 135846 57213 107107 64034 88094 -10765 90845
16792 90845 143472 294533 134100 13859 -8866 -223446 -282295 -205450 -73123 -37437 -136694
16781 -136694 -272311 -343004 -144588 -100266 -14646 1649 106293 102751 262604 334797 163844
16770 163844 -10951 -191074 -215460 -214703 -15475 -8885 92677 -53702 -398999 -625695 -464258
16759 -464258 -382623 -424846 -435544 -286389 -410039 -393211 -418912 -423480 -408667 -27085 195743
16748A95743k0155Q9201j2106p081l0202j53154j1861k339j21791K2072M4679
16737f994J0896p7722J5656n4192j42316k5178K17720q9273q5978K77056j47348
16726a07673l56923Q3502K43507J01238M8964o1927K84744J69555j29107l71883
16716i6003r8243L8332Q5808j63794J0890K35412L7224o1108M0660j76748k198
16705a49768J38238N7736p3777l17513j31523O4154J53396J73225M1478J91481
16695A47127l7039r9371m5200j63575j02012J61964L8534p6623j17431j21245
16685d14871j9696J88366J69708K09284k03976l97064k44539o4883p850L23783
16675d61738K05382K3952P447j65067r4711k5407J8404J00280J94261k77403r3520
$$ plain form
16748 195743 175588 264789 252683 245602 215400 62246 50385 48046 -73745 -51673 -6994
16737 -6994 3902 -73820 -58164 -112356 -254672 -279850 -62130 -151403 -237381 39675 -107673
16726 -107673 -464596 -381094 -137587 -36349 12615 -49312 235432 404987 275880 -96003
16716 -96003 -194246 -155914 -70106 -233900 -223010 12402 49626 -11482 29178 -147570 -149768
16705 -149768 -11530 46206 -27571 -345084 -476607 -412453 -259057 -85832 -44354 147127
16695 147127 110088 10717 -34483 -198058 -300070 -138106 -99572 -176195 -293626 -414871
16685 -414871 -434567 -246201 -76493 132791 -71185 -468249 -712788 -777671 -785521 -461738
16675 -461738 -256356 -232404 -224957 -390024 -484735 -510142 -491738 -391458 -197197 -474600 -568120
16664e68120J81135N6420K51058K22889O8263j70819q3140j53428m0471J15877
16654a20336n9575j91337K30289Q1613k47576J1860l6754K65992K22281q596R7588
16643B45449P8048l46885j20749o9354k42578K2353J02062J10274o892j29176
16633c57448J79595o6505o8086J89429K58077K55870k22721m51544k26938L1400
16623d78871J24960J0680m7774J10703J79854r2051j52395k7514o5009K83333
16613a54084K13666j39204n4712M0549j32957k8374p4933M6174L4651J46057j23999
16602b27166K27844Q5670m4250j58089l38123m9227K44275j8547N1936p2696J3538
16591b84835L2011o9177Q5911j22899J04232p3673J05713O2865J90653P3640j4114
$$ plain form
16664 -568120 -386985 -330565 -79507 143382 211645 40826 -42314 -195742 -236213 -120336
16654 -120336 -179911 -371248 -140959 -59346 -306922 -295062 -331816 -65824 156457 147861 245449
16643 245449 323497 -23388 -144137 -213491 -456069 -433716 -331654 -221380 -228272 -357448
16633 -357448 -177853 -244358 -312444 -123015 135062 390932 168211 -283333 -510271 -478871
16623 -478871 -353911 -343231 -391005 -280302 -100448 -192499 -344894 -372408 -437417 -154084
16613 -154084 59582 -79622 -134334 -93785 -226742 -255116 -330049 -283875 -249224 -103167 -227166
16602 -227166 678 86348 42098 -115991 -454114 -503341 -259066 -277613 -225677 -298373 -284835
16591 -284835 -252824 -322001 -236090 -358989 -254757 -328430 -222717 -159852 30801 104441 90327
16580I0327k4190m3869k4292K0920N6706q5799j88619L825R1871K2434j10608
16569a91294J35P9609R923L12159L19104j41751k02861r0239p8276k00652M3197
16558a40946J26668j34620j59802J53370J25980j99581l23294J30855O9667J03737
16548b47966J51007J35886l8547J32321k2789k1340j03404K9708K16651J59255
16538C90782N2736p5154N8937k72061r4127R9916j64865j59704J95016J64548
16528A96024q5979j7587k91036J01652O6471o7768l846l21632J28185J17305m9111
16517b27322N4389J5449j13390N6175J11062k11570k2599L2900J8366P3484m7819
16506b60875K68909l0818m8115K20370O1126Q5904q0503j69092j02284j49669
$$ plain form
16580 90327 66137 22268 -2024 18896 75602 -10197 -198816 -194991 -103120 -80686 -191294
16569 -191294 -191159 -111550 -101627 210532 529636 387885 185024 94785 16509 -184143 -140946
16558 -140946 -14278 -148898 -308700 -155330 -29350 -228931 -552225 -421370 -351703 -247966
16548 -247966 -96959 38927 380 132701 109912 88572 -14832 14876 231527 390782
16538 390782 443518 368364 427301 155240 61113 161029 -3836 -163540 31476 196024
16528 196024 110045 92458 -198578 -96926 -30455 -98223 -102069 -423701 -295516 -178211 -227322
16517 -227322 -172933 -157484 -270874 -214699 -103637 -315207 -337806 -304906 -286540 -213056 -260875
16506 -260875 8034 -22784 -70899 149471 210597 296501 215998 46906 -55378 -205047
16496b05047k0523J58686n0478p2030j98673J51415K30485J09415m47135n775
16486c49660r399P5469K6806j1842r0366Q6210K07203k6350j23805j9497P2719
16475a62512p4745k34174j32640Q9536J29302j2234R2069J84160J37653k16511
16465b00096j46086k1116K06902J12876j35775L22181P7819k14892j88486J57007
16455b9666L08058j2770r9754l05604l46979n8577L08522K73623o5441k3247j43291
16444a95126j87430L5550J33938J50698J19615P5926R4754m8338J7592K6643j06597
16433A17225n192j85558J00671o5428j8554J89588J31543k6659j18809j44288
16423b5461O41L8786K07760j92977j29522j23164j93174R772K13007J34501k47283
$$ plain form
16496 -205047 -225570 -66884 -117362 -189392 -388065 -236650 -6165 103250 -343885 -349660
16486 -349660 -359059 -283590 -256784 -268626 -358992 -272782 -65579 -91929 -215734 -235231 -162512
16475 -162512 -237257 -471431 -604071 -514535 -385233 -397467 -305398 -121238 16415 -200096
16465 -200096 -346182 -367298 -160396 -47520 -183295 138886 216705 1813 -186673 -29666
16455 -29666 278392 265622 165868 -139736 -486715 -545292 -236770 36853 -28588 -51835 -195126
16444 -195126 -382556 -347006 -213068 -62370 57245 133171 227925 179587 197179 223822 117225
16433 117225 112033 -73525 27146 -38282 -56836 132752 264295 237636 118827 -25461
16423 -25461 -24820 13966 221726 28749 -100773 -223937 -417111 -407339 -194332 -59831 -307114
16412c07114r5385O4094Q8244r7646J25076R2006Q72j45978L1626L59272P5726
16401A90793J3222k63228M0238P665K0789k38132L5124K56773j51772k1765K57733
16390A47440K0823m6080J77209k04913l61578L9411K59025J84029M3873j43121
16380A16118R0462L9200K25688j16501j63318p7224p3198j27188l507J32677j23204
16369g9995m1708k4173r4984J61222J23719k1627j78081P8421J67205p9170o0109
16358d9280Q0863P0143j38578j44042J25111J70616J3195K2814P8664j14476p0244
16347D4786k10438l1567K18178q621k42123k14309j4324J42328K73305L13484
16337B70699N960l48190j47382k69404m5057K53449O5422m2943J22475J95278
$$ plain form
16412 -307114 -402499 -338405 -250161 -347807 -222731 -130725 -129853 -275831 -244205 115067 190793
16401 190793 204015 -59213 -18975 -11310 9479 -228653 -193529 63244 -88528 -110293 147440
16390 147440 168263 122183 299392 94479 -267099 -227688 31337 215366 259239 116118
16380 116118 206580 245780 471468 354967 191649 114425 41227 -85961 -89468 43209 -79995
16369 -79995 -121703 -145876 -240860 -79638 44081 22454 -155627 -77206 89999 10829 -49280
16358 -49280 31583 101726 -36852 -180894 -55783 114833 128028 150842 229506 115030 44786
16347 44786 -165652 -197219 20959 12338 -229785 -444094 -458418 -316090 -42785 270699
16337 270699 276659 -71531 -218913 -488317 -533374 -279925 -214503 -257446 -134971 60307
16327F0307j34375M7217J459P2362r3500p3035O6883P948J26611o8923O7837K92746
16315C73537m4688j15713k07011n5852O7135J29754j33349K7374n6700o8080N8791
16304b4802o919J90540m7k26854l6108K05682l473o0015q0150O5714j02687q2386
16292a61505o8418j08556o3377J59471j2366r2501J86592J41104J7792q197j88693
16281a98654J5808K35372J33134j61659k61103K469R1776k1667J92414R1209m3235
16270G5864j05541j64957M9821P2525r8120J80623P4438j58188j71266J39778
16260a05023J64790j01410k29292J09866m9089J9947P4252R9116J06449n459q7218
16249c071m6598q8503P553J2690J79783n6505k79625j08965O296J71152K68540
$$ plain form
16327 60307 -74068 -26851 -25392 46970 -46530 -119565 -52682 -44734 81877 12954 80791 373537
16315 373537 328849 213136 6125 -49727 17408 147162 13813 41187 -15513 -83593 -24802
16304 -24802 -31721 158819 158772 -68082 -104190 101492 98019 38004 -42146 23568 -79119 -161505
16292 -161505 -229923 -338479 -401856 -242385 -254751 -347252 -160660 -19556 -1764 -9961 -198654
16281 -198654 -182846 52526 185660 24001 -237102 -234633 -142857 -164524 27890 119099 75864
16270 75864 -29677 -194634 -144813 -72288 -170408 10215 84653 -73535 -244801 -105023
16260 -105023 59767 -41643 -270935 -161069 -210158 -190211 -115959 -16843 89606 84147 -3071
16249 -3071 -49669 -138172 -130619 -117929 61854 5349 -274276 -383241 -376945 -205793 62747
16238F2747K53975j186n5970j14282q1708r0733k3584k19260j99158K44177K41442
16227A6460O4290k43536k79924J04711Q2091L652N2936J90095K56288K37043k07225
16216B76881j25126l00291j97935l2614J57565J28101K30150Q7406j37825k44077
16206a57765K07773J15838O5042j7900n4192j13898K21747K30889k15260j8823
16196B63451O727j02108p0436p7288j78681j00903k4498M9912J40170j0461j73850
16185b77965o868K34197J77120R3893J25435Q4457j54896k14845k29199J13523
16175e5148J2696j30178K60480P2238m9905J27659r8658j29436j37591K1095k63089
16164c69837j34078J28881j4790P5610K24192r7403o8716J53616K52869j64557
$$ plain form
16238 62747 316722 315536 259566 145284 63576 -27157 -50741 -270001 -469159 -224982 16460
16227 16460 80750 -162786 -442710 -337999 -255908 -252256 -199320 -9225 247063 484106 276881
16216 276881 151755 -148536 -346471 -379085 -221520 -93419 136731 224137 86312 -157765
16206 -157765 50008 165846 230888 212988 158796 44898 266645 497534 282274 263451
16196 263451 270178 168070 97634 20346 -158335 -259238 -283736 -233824 -93654 -104115 -277965
16185 -277965 -284833 -50636 126484 220377 345812 430269 275373 60528 -168671 -55148
16175 -55148 -42452 -172630 87850 160088 110183 237842 139184 9748 -127843 -106748 -369837
16164 -369837 -503915 -375034 -389824 -314214 -90022 -187425 -256141 -102525 150344 -14213
16154a4213k51943j31214k431j15518k9127L2073N2704P3741J21366J14762k93348
16143d43148o5807k3128J9997K25715P1096k29367j82959N5085K64314J40509
16133a67693K7792p1152p1272j20305J19355K82074p8478k22131l6532j09984
16123d48326j96048k0483K45932J03168K03566P6431j02674m5469j05330M8352
16113b40881R9850n409M4075O1078J33947k06074j65051J13889K7262J32985n8504
16102f2833L7835K57719R2786j93724k45639J12889Q4626k2511M5701l8747k34607
16091a66505O7648J2512q1140J38032k65341N0628L29218L8256j35017q044m8378
16080f8131j20326q0025Q3105k01434K1464K38558l736k47184L1862K48711N5322
$$ plain form
16154 -14213 -266156 -397370 -399801 -515319 -544446 -512373 -459669 -385928 -264562 -149800 -443148
16143 -443148 -508955 -532083 -512086 -286371 -215275 -444642 -627601 -572516 -308202 -167693
16133 -167693 -139901 -211053 -282325 -402630 -283275 -1201 -79679 -301810 -338342 -448326
16123 -448326 -644374 -664857 -418925 -315757 -112191 -35760 -138434 -183903 -289233 -240881
16113 -240881 -141031 -146440 -102365 -41287 92660 -113414 -278465 -164576 -137314 -4329 -62833
16102 -62833 -24998 232721 325507 131783 -113856 -967 83659 61148 106849 68102 -166505
16091 -166505 -98857 -86345 -167485 -29453 -294794 -244166 85052 123308 -11709 -19753 -68131
16080 -68131 -188457 -268482 -185377 -386811 -365347 -126789 -130525 -377709 -345847 -97136 -41814
16069d1814j09483L9054M6945k53836J5846J5419J24237J48658O0343M4049k52155
16058a62737j19465J9602m1287L0025j5873k8940J37612J22225j14931j10249
16048b84018M2748J08656J48986j39615l02079o5203J95372o7159J3770J40763
16038b07779K97685Q7092k02103m6002o9566l01689j52932j5715J56678k4521
16028d78852J63791J17715r8142j52076L2165L4545P4733J18690J85454K07348
16018B05371M0379r5972k25126r6870J13568K5566l56280m4422K98466J64322
16008B9002J67977m5716o9652j82808n5278j30049K54689j76390J07547J69639
15998F8961j44576j40645j10144K26559P963j15648r0143q0185L9449P0444p1620
$$ plain form
16069 -41814 -151297 -112243 -65298 -319134 -303288 -287869 -163632 -14974 45369 89418 -162737
16058 -162737 -282202 -262600 -303887 -273862 -289735 -318675 -181063 -58838 -173769 -284018
16048 -284018 -241270 -132614 16372 -123243 -425322 -490525 -295153 -362312 -348542 -207779
16038 -207779 89906 176998 -25105 -71107 -140673 -442362 -595294 -611009 -454331 -478852
16028 -478852 -315061 -197346 -295488 -447564 -415399 -380854 -306121 -187431 -1977 205371
16018 205371 245750 149778 -75348 -172218 -58650 -33084 -389364 -433786 -135320 29002
16008 29002 196979 151263 81611 -101197 -156475 -286524 -31835 -208225 -100678 68961
15998 68961 -75615 -216260 -326404 -99845 -91882 -207530 -297673 -377858 -338409 -267965 -339585
15987c39585M6833P6459l9209J84652J40874J91780K76483M732j85867m00833
15977d3681j00739K33042q1600k73024l5466J31029k2970p0528O2803J1633k89034
15966d78535O2426p9211j90314N6800J11139R9506P089L8339r1214q384K46654
15955b25705J75468J5223j12510p2973q7690j36084k7388J88303j7418l3684K53980
15944h0478K87487k8842O4443M5049K5379l593l02515q8858q3791n1708p4069
15933b91496K9082j52702r6335q3929P4447K02559k7271l5540r4871k37788R8750
15922f15094K34537M1905J46350J9351j69075J54461K66428J59777j82626k24097
15912a68083J46751J33894l09562k00688J36415J99328L73563j59037Q1948n2211
$$ plain form
15987 -339585 -292752 -216293 -255502 -70850 70024 261804 538287 543019 357152 -43681
15977 -43681 -144420 88622 7022 -266002 -301468 -170439 -193409 -263937 -201134 -189501 -478535
15966 -478535 -416109 -495320 -685634 -628834 -517695 -418189 -411100 -372761 -463975 -472359 -225705
15955 -225705 -50237 -35014 -147524 -220497 -308187 -444271 -471659 -283356 -300774 -334458 -80478
15944 -80478 207009 178167 242610 287659 313038 309445 6930 -81928 -165719 -217427 -291496
15933 -291496 -262414 -415116 -511451 -595380 -520933 -318374 -345645 -381185 -476056 -713844 -615094
15922 -615094 -380557 -338652 -192302 -172951 -342026 -187565 78863 238640 56014 -168083
15912 -168083 -21332 112562 -197000 -397688 -261273 -61945 311618 152581 234529 182318
15902A82318j61903o3966r1015J7628P568J31668J21705J07861J8127k852k44551
15891B2588j74788k85380M4123L5060J25505K18190j72691o1979n9135J59379
15881a49128L300n8642J9505K62605Q4108n8981k05562L2305J23638L5476J65462
15870B54086o3943q1551M2929j15489k34346j34864J94679J0009k70130M0831
15860c57789K95014j51269J48569K57002l39983k59139J37894J76406j47866p0618
15850c11779Q7097R0797j81339J00864L12520j85632j05399k09897O4910m4102
15840c81960K54490J9849j9351L4395M2477q0955n8431j69518M0267p1159k18270
15829f08166q4281L09272O7265P4246m2329q6253n6725J01141P7407M6305N0682
$$ plain form
15902 182318 20415 -43551 -134566 -116938 -109370 22298 144003 251864 269991 267139 22588
15891 22588 -152200 -437580 -393457 -358397 -232892 -14702 -187393 -249372 -308507 -149128
15881 -149128 -145828 -204470 -184965 77640 161748 102767 -102795 -70490 53148 88624 254086
15870 254086 190143 108592 151521 36032 -198314 -333178 -138499 -128490 -398620 -357789
15860 -357789 -62775 -214044 -65475 191527 -148456 -407595 -269701 -93295 -241161 -311779
15850 -311779 -224682 -133885 -315224 -214360 98160 -87472 -192871 -402768 -337858 -381960
15840 -381960 -127470 -107621 -126972 -92577 -50100 -131055 -189486 -359004 -318737 -389896 -608166
15829 -608166 -692447 -383175 -315910 -241664 -283993 -370246 -426971 -325830 -248423 -202118 -151436
15818a51436J08382J41279j94765k75818J48791q8787q5615J00166Q2343K69505
15808E4045J62027j13960l23308j34822J73376J21740J0908j73369L6587J21682
15798f5094K6205k76085j6589K77893L2197o1745k51494l7415M0066J13272Q1883
15787a36906k59491k30331O6475R7283j99899R4220K85381Q4885P1106j10701
15777b37978N5136J04432J19319r2085j0943j06433O3543p4118l2080P5604P2550
15766f3053j30769o0498Q651K42000k28819r3876m996N7197J17449J33649J09341
15755H6276k9602N2571n9715j35749j10507p256k98691j05603K60450K56143j50658
15744b42341r3722K36718K25749J77312j39977j37998q1001j55389J7785n8432
$$ plain form
15818 -151436 -43054 98225 -96540 -372358 -223567 -312354 -397969 -297803 -215460 54045
15808 54045 216072 102112 -221196 -356018 -182642 -60902 -49994 -223363 -186776 -65094
15798 -65094 -38889 -314974 -331563 -53670 -21473 -83218 -334712 -372127 -332061 -218789 -136906
15787 -136906 -396397 -626728 -560253 -462970 -662869 -568649 -283268 -198383 -127277 -237978
15777 -237978 -182842 -78410 40909 -51176 -62119 -168552 -105009 -179127 -211207 -135603 -63053
15766 -63053 -193822 -254320 -245669 -3669 -232488 -326364 -331360 -274163 -156714 -23065 86276
15755 86276 56674 109245 49530 -86219 -196726 -203982 -502673 -608276 -347826 -91683 -242341
15744 -242341 -336063 -99345 126404 303716 163739 25741 -55260 -210649 -192864 -251296
15734b51296q9546Q0523k33636k10840J77560L5635L37172l4651q9080Q9066j36196
15723c25289K07172J02810O1336k9791r5114j53185J6944R4819o3236o0948q8860
15712c33342l10030R2116K77549m4265m990P5902O159P0445j72041R5975K85728
15701C9206L2531j83315j69195q1323O1160j0803P5477M67403J07467j77862q6569
15690G4177Q9744q4638N2385J81900l8596k46520j13536j38274j4763j68087J34075
15679b72133R1357J25531J30421l6106J90749P0166j18690j67661k9106j9200
15669c4672P054J52497J1564l26662J3230J00669m2593j50961j1372P1513K55314
15658D5581J47603r3570k52534j6398J16121J3526r8595Q8366K18452p2954q9386
$$ plain form
15734 -251296 -340842 -260319 -493955 -704795 -527235 -491600 -154428 -189079 -278159 -189093 -325289
15723 -325289 -118117 -15307 46029 16238 -78876 -232061 -215117 -120298 -183534 -244482 -333342
15712 -333342 -643372 -551256 -273707 -317972 -322962 -247060 -240901 -170456 -342497 -246522 39206
15701 39206 71737 -111578 -280773 -362096 -300936 -311739 -236262 231141 338608 160746 74177
15690 74177 163921 79283 131668 313568 274972 28452 -85084 -223358 -238121 -406208 -272133
15679 -272133 -180776 -55245 75176 39070 229819 299985 181295 13634 -15472 -34672
15669 -34672 -27618 124879 136443 -190219 -176989 -76320 -118913 -269874 -281246 -209733 45581
15658 45581 193184 99614 -152920 -169318 -53197 -39671 -138266 -49900 168552 95598 6212
15647F212J09401J08098j36044k27793M8791K05347j34114k78148j68166J44799
15637c21617j11394J90875L04753j27941p4752M5969l5491k3454Q4128k317q7742
15626a58983O7393K50495n0249l09805p5500j48997l06689p6507K12376L49202
15616b47264K65708q029k13660k02832N5941K70958P5780J6651j22457p0742n9183
15605b39129J16747k7001m538K38960J93239j7484k03923k23954j04926o7006
15595c39015j44324K01936L48693Q668j12421L0839o0329j50672n874N6368P9687
15584h6444K6881M6884p6903p2646K88169J6466r8442o6787j33222r6972j32273
15573c85289j20083M3159N10754L54892l321j70707r364K24345p1700p9617K7859
$$ plain form
15647 6212 115613 223711 87667 -140126 -91335 114012 -20102 -298250 -466416 -321617
15637 -321617 -433011 -242136 62617 -65324 -140076 -94107 -129598 -153052 -68924 -71241 -158983
15626 -158983 -91590 158905 108656 -201149 -276649 -425646 -732335 -808842 -596466 -247264
15616 -247264 18444 10415 -203245 -406077 -350136 -79178 -3398 13253 -109204 -179946 -239129
15605 -239129 -122382 -149383 -153921 85039 278278 260794 56871 -167083 -272009 -339015
15595 -339015 -483339 -281403 67290 75958 -36463 -5624 -65953 -216625 -222499 -166131 -86444
15584 -86444 -59563 -12679 -89582 -162228 125941 142407 43965 -22822 -156044 -253016 -385289
15573 -385289 -505372 -462213 48541 403433 400112 229405 220041 444386 372686 293069 320928
15562C20928j00115k8014k16479j67486N2801m1722J03836l2587k9973J61436
15552B2625J82304q229q8307j03801j09077r6616K16229Q5469j92701j98214j29670
15541d19988J84300J22561K51516k47964m5317n5755P5389r9988Q2123m2294m8152
15530b43569J43550J25126N4021p7538o357j78917k6625R7517J96206l00952m6922
15519b64460K34800j52560J14074k06228r7145J46588m36J05906J15319j37592
15509a41734q0755J0942Q877K00375N7694k56133j8678j57929J20436K25092k3408
15498e5221m2993J0398J84868K31126l54050k3947J84524J72283l2924k89415
15488a5351j07860K19414K12211k1306J94501n1419n8602r29j3973k1893l47707
$$ plain form
15562 320928 220813 192799 -23680 -191166 -138365 -180087 -76251 -108838 -138811 22625
15552 22625 204929 196700 108393 4592 -104485 -201101 15128 100597 -92104 -290318 -419988
15541 -419988 -235688 -113127 138389 -109575 -154892 -210647 -135258 -235246 -153123 -195417 -243569
15530 -243569 -100019 25107 79128 1590 -4767 -183684 -210309 -112792 83414 -217538 -264460
15519 -264460 -29660 -182220 -68146 -274374 -371519 -224931 -225367 -119461 -4142 -141734
15509 -141734 -222489 -211547 -202670 -2295 55399 -200734 -219412 -377341 -256905 -31813 -55221
15498 -55221 -98214 -87816 97052 328178 -25872 -49819 134705 306988 274064 -15351
15488 -15351 -123211 96203 308414 287108 481609 430190 371588 370659 356686 334793 -12914
15477a2914q7466K24043M23776o7749o4532q6560m0178k823k3862k7891L4067
15466B67911J6539J9609n4327o8824j03709n4803k69608O0200Q9867o1602j81493
15455c40240l2610K92298K5105j90366O6010p2993r7688j00908r8110J2848K34394
15444c02260J91958K26155j89266j76208j11873J19314k14541k0179J15299R1325
15434b70276p5598R4421K73474Q1842j42584k7500l1762q8284m3705J40514l9006
15423a28464o1303Q9021Q6055L139q4674k31528O1655l2247j04333p3235P2673
15412d03241J65735K19599M5770J86378j99306n9162R993j41431J0553P6644j99617
15401b88085R7348L74502J31295k11025K8118k9520j71530n4402m4903K33093
$$ plain form
15477 -12914 -100380 123663 547439 479690 415158 328598 288420 285597 261735 233844 267911
15466 267911 284450 304059 249732 180908 77199 22396 -247212 -187012 -97145 -158747 -340240
15455 -340240 -372850 -80552 -55447 -245813 -179803 -252796 -350484 -451392 -549502 -536654 -302260
15444 -302260 -110302 115853 -73413 -249621 -361494 -242180 -456721 -476900 -361601 -270276
15434 -270276 -345874 -251453 22021 103863 -38721 -66221 -97983 -186267 -229972 -89458 -128464
15423 -128464 -189767 -100746 -14691 -11552 -96226 -327754 -266099 -298346 -402679 -475914 -403241
15412 -403241 -237506 -17907 27863 214241 14935 -44227 -34234 -175665 -165112 -88468 -288085
15401 -288085 -190737 183765 315060 104035 132153 102633 -68897 -123299 -168202 64891
15391F4891k2463j2335j75148j12695k3191J32404Q3170O5834k27915K86735L55611
15380D14898k19619n4576j88516j9066J13572n235j39996K26036N7735o0872p5687
15369D8674j15329Q9796J88003o2803k15108j00220P3541K31494K24738r0898
15359B71888j35435P7210j68759k21357M0885L4080J53896j30837o266l3563P730
15348a10528j54414m8713Q8673M1414P3685P7940J06466j15739j09638k4795L4959
15337a40690K41006K08533j86619k64698j47985J92935J47736r9051o882M1014
15327a4701k4624k41760O1022K702n9787n3375K0673K25310K28317l4148j17083
15316g454J66447q3065k19406J1437N9047R5305J91967q6470K1157L846Q5429
$$ plain form
15391 64891 42428 30093 -145055 -257750 -280941 -148537 -65367 467 -227448 59287 414898
15380 414898 195279 140703 -47813 -66879 46693 41458 -98538 127498 185233 124361 48674
15369 48674 -66655 23141 211144 148341 -66767 -166987 -93446 138048 362786 271888
15359 271888 136453 213663 44904 -176453 -135568 -101488 52408 -78429 -84695 -118258 -110528
15348 -110528 -264942 -313655 -224982 -183568 -109883 -31943 74523 -41216 -150854 -175649 -140690
15337 -140690 100316 308849 122230 -142468 -290453 -97518 50218 -48833 -55715 -14701
15327 -14701 -39325 -281085 -220063 -217361 -277148 -330523 -309850 -84540 143777 109629 -7454
15316 -7454 158993 75928 -143478 -132041 -72994 22311 214278 127808 148965 152811 238240
15305B38240k50418j30368L5586J50919J54582K44452K3564k51339l45695O9589
15295f0888K79264r6933j69047j22829K17892K44966n160l30274k3596j30294
15285a96899R2505K56978j50960j74907j48653j13587j36116M5094J46358J85730
15275a94457j04778l6731J63161J29779J61650r1823k46031r3924o30J85501J58513
15264C0230m580k42569j74410L22521K36982R1141k6140p1563j90279m9162l32819
15253d10648o6599K64264J51012N1822j04690L1260J5683j78632j20283J53581
15243b13230J15517p2987n278R1075l1624j34802l9531J51206j78041K4492l4170
15232c27373l9202L3297L5552J3469p1736J48378N2177P3262N5507K97791K31089
$$ plain form
15305 238240 -12178 -142546 -106960 43959 198541 442993 466557 215218 -130477 -60888
15295 -60888 218376 121443 -47604 -170433 47459 292425 287265 -43009 -66605 -196899
15285 -196899 -104394 152584 1624 -173283 -321936 -435523 -571639 -526545 -380187 -194457
15275 -194457 -299235 -335966 -172805 -43026 118624 26801 -219230 -313154 -313784 -128283 30230
15264 30230 25650 -216919 -391329 -68808 168174 259315 233175 161612 -28667 -77829 -410648
15253 -410648 -477247 -212983 -61971 -10149 -114839 -83579 -67896 -246528 -366811 -213230
15243 -213230 -97713 -170700 -175978 -84903 -116527 -251329 -290860 -139654 -317695 -293203 -327373
15232 -327373 -366575 -333278 -297726 -284257 -355993 -207615 -155438 -82176 -26669 271122 502211
15221E02211Q0360k08805j38186L8737j79908j65262q7357k0124K4097L6064j64130
15210b82303N6463j54160r900j65710j26668K1548J07960J30338R7144R900n265
15199c20653J30955K81156j71290j57770j09348Q9108k76177r8575Q0215J30215
15189d22164K24913J38890k67465j80299m6319j6537O8395K92559j1126j18126
15179c37279N9699Q9450J3060J02895J07843j07712r4374j06091j10950J34817
15169b48642J5406J5510k5244o3338p0778o0621J67582J25413L7700L5760J28230
15158E6978q4994p2048l1293J05233j52866k7154j46367m0392K49847j00531o1121
15147c04708Q815n2304O5526K22506o1846j86312J38885J34147k7434n4986r5191
$$ plain form
15221 502211 582571 373766 235580 274317 94409 -70853 -158210 -178334 -154237 -118173 -282303
15210 -282303 -225840 -380000 -389900 -555610 -682278 -660730 -552770 -422432 -325288 -315388 -320653
15199 -320653 -189698 91458 -79832 -237602 -346950 -257842 -534019 -632594 -552379 -422164
15189 -422164 -197251 -58361 -325826 -506125 -552444 -568981 -500586 -208027 -219153 -337279
15179 -337279 -277580 -188130 -175070 -72175 35668 -72044 -166418 -272509 -383459 -248642
15169 -248642 -233236 -217726 -242970 -306308 -377086 -437707 -270125 -144712 -107012 -71252 56978
15158 56978 -28016 -100064 -131357 -26124 -178990 -206144 -352511 -392903 -143056 -243587 -304708
15147 -304708 -295893 -348197 -282671 -60165 -122011 -308323 -169438 -35291 -62725 -117711 -212902
15136b12902J9381J7449R8678J67384o7535j02809m5465q8129O2768l7286j3372
15125b01838J2442M2830K11799J58172o872j69972n8693M8224K53804Q3095J11800
15114D84791K04792p7438j54991j02649J50512j77252j63256j01754K6784q2902
15104F637j53097J54561n4134r2261K24681o7373j02842j02186q5885K2918J24368
15093a24613L22049j24895o670p202j0677R5367p4246j6309J24515J18621P1276
15082C67216r7228l79434j75743k1750P6945J15512o7059K17122K16448j00305
15072A51724j49118M365j78427p4145q5647j6898Q5350m8608l5226L3443L7183
15061b76004k0823q8765L34756L78158R578l70286l0568P4200O5578J22567k83207
$$ plain form
15136 -212902 -193521 -176072 -77394 89990 22455 -80354 -125819 -213948 -151180 -188466 -201838
15125 -201838 -189396 -146566 65233 223405 216533 46561 -12132 36092 289896 372991 484791
15114 484791 689583 612145 457154 354505 505017 327765 164509 62755 89539 6637
15104 6637 -146460 8101 -46033 -138294 86387 19014 -83828 -186014 -271899 -248981 -124613
15093 -124613 197436 72541 65871 58669 47992 143359 69113 52804 177319 295940 367216
15082 367216 269988 -109446 -285189 -306939 -229994 -114482 -181541 35581 252029 151724
15072 151724 2606 6971 -171456 -245601 -331248 -348146 -262796 -311404 -346630 -313187 -276004
15061 -276004 -296827 -385592 -50836 327322 336900 -33386 -63954 10246 75824 198391 -84816
15050h4816k23023Q646J6160K23697j58058J57716p1402l00017r8169l7606k0859
15039e87731J16966J60336J31356R3189j3169N7979J43328j3544k46088k375K15012
15028E5259Q0009R9394j23397j15072j5138J6742r1428k9990J37872j05701K10231
15017A18781n6201m8941m6313P7140J37167q247j60592j30307j5047r3888j11882
15006c38330j27461J81362m191m8992K29378J12083K23022j46896r2968J16495
14996A03502j757k07183o557J34139M5967o9342k62394J2462K4107M9617r4550
14985b71989q0611j07031q1474K71710J73330Q5036J80323r6325m52731Q9055
14975b90707J25777J90380K71157K7429k46725k57639J17707Q3800j71224m4615
$$ plain form
15050 -84816 -307839 -299193 -283033 -59336 -217394 -59678 -131080 -431097 -529266 -566872 -587731
15039 -587731 -470765 -310429 -179073 -85884 -99053 -41074 102254 88710 -157378 -159753 55259
15028 55259 135268 234662 111265 -3807 -18945 -2203 -93631 -123621 14251 -91450 118781
15017 118781 62580 13639 -32674 44466 181633 173386 12794 -117513 -132560 -226448 -338330
15006 -338330 -465791 -284429 -288620 -337612 -108234 3849 226871 79975 -12993 103502
14996 103502 101745 -105438 -111995 22144 68111 -1231 -263625 -251163 -227056 -177439 -271989
14985 -271989 -352600 -459631 -541105 -269395 -96065 -11029 169294 72969 -379762 -290707
14975 -290707 -164930 25450 296607 324036 77311 -180328 -62621 21179 -150045 -194660
14965a94660J1438j24143p7207J88208j43056R5628J63182j01063q3528N6523
14955b08678n5211N1224O5961J89844J59767j20330j27546j9905L685J52869J5938
14944A07618m7703l6122r4099j41664n4969Q1439n1233K34728j65130k06663L08388
14933f5410J57227k68776L40920n6492m08699j17197p8105n8483o3778P5503J67003
14922c76287P9352j49052P5572J91712K47856J68752K27079j737l01679j57502
14912D066R6473m4370j41917j46745k53131p7764Q3049J67780L0765l6142n3802
14901c71738o1782K69451J05322J29701j48751j70903J47088L56600O836k03988
14891E7836k55917M5696J7768J36572J49493J39350k05080j7641l9829r2279J1290
$$ plain form
14965 -194660 -183222 -307365 -384572 -196364 -339420 -243792 -80610 -181673 -265201 -208678
14955 -208678 -263889 -212665 -146704 43140 202907 82577 -44969 -64874 -61189 91680 107618
14944 107618 59915 23793 -70306 -211970 -266939 -185500 -236733 -2005 -167135 -373798 -65410
14933 -65410 91817 -176959 163961 107469 -301230 -418427 -496532 -555015 -618793 -543290 -376287
14922 -376287 -296935 -445987 -370415 -178703 69153 237905 464984 463247 161568 4066
14912 4066 100539 56169 -85748 -232493 -485624 -563388 -480339 -312559 -281794 -317936 -371738
14901 -371738 -433520 -164069 -58747 70954 -77797 -248700 -101612 254988 261824 57836
14891 57836 -198081 -152385 -134617 1955 151448 290798 85718 68077 28248 -64031 -52741
14880e2741J99005K35335M3008j77239k62991k23108j24692J07408L456J10042
14870a42517K6932J6834j19980j62179Q8914K16711K00971q2670k22080J16863
14860f2201R6402O0553L7032j95395O792J51463P7557j50971k6568J50137L3068
14849A77869l1174K420q1895p680K9589k19129J36133K27835j47126k39909q5450
14838b38517k2711j0197r3897R0454J3454J62988j0180j27919O0376L59963J87254
14827C71068j2422j11338j1114J671j13282r9983r7371j18965r7809J36866J17762
14816c4917J12895j19547l8038r5172J6942J14450K20839J03517J58351K00119
14806F39439q1769k12157l37129m0752N1380p3449o2391j85755P1529L8782J8864
$$ plain form
14880 -52741 146264 381599 424607 247368 -15623 -238731 -363423 -256015 -252559 -142517
14870 -142517 -115585 -98751 -218731 -380910 -291996 -75285 125686 43016 -179064 -62201
14860 -62201 34201 94754 131786 -63609 -56817 94646 172203 21232 -5336 144801 177869
14849 177869 146695 149115 67220 59540 89129 -130000 6133 233968 86842 -153067 -238517
14838 -238517 -261228 -271425 -365322 -274868 -261414 -98426 -108606 -236525 -176149 183814 371068
14827 371068 358646 247308 236194 237865 124583 24600 -72771 -191736 -289545 -152679 -34917
14816 -34917 77978 -41569 -79607 -174779 -157837 -43387 177452 280969 439320 639439
14806 639439 557670 345513 8384 -32368 19012 -54437 -116828 -302583 -231054 -192272 -173408
14795a73408p3876K79937J57965k07941j85067J46925J0069J45673j44699j6960
14785f1382j0401j30971k8467J94397L00k7709k68729j28216m8098K11541J59838
14774a37897l6727k6889J57091k4755j20593j9951O0342o4803p5916j89733P3316
14763d06515M4820j07808K86471k5903j17952j48172J86682L48093R3231K4628
14753A77575J03570J59440j44954j05068j46070q2854l2502R8828J0684M508J08937
14742A52094Q5303j76538N0359J85316p8151j46760k03566j29818p2009J77488
14732a56282J59725J07829o4952l2392p7396J45615R851j04795p601l9376J64403
14721A04629J15300k2338j03449j62814O752J05625o370j69265j21485L59914
$$ plain form
14795 -173408 -247284 32653 190618 -17323 -202390 -55465 -45396 100277 -44422 -61382
14785 -61382 -71783 -202754 -231221 -36824 -36524 -64233 -332962 -461178 -509276 -297735 -137897
14774 -137897 -174624 -201513 -44422 -69177 -189770 -209721 -149379 -214182 -290098 -479831 -406515
14763 -406515 -361695 -469503 -183032 -208935 -326887 -475059 -288377 59716 152947 177575
14753 177575 281145 440585 295631 190563 44493 -38361 -70863 27965 38649 43157 152094
14742 152094 237397 60859 111218 296534 218383 71623 -131943 -261761 -333770 -156282
14732 -156282 3443 111272 46320 13928 -63468 82147 91998 -12797 -20398 -59774 104629
14721 104629 219929 197591 94142 -68672 -61920 43705 37335 -131930 -253415 106499
14711A06499K4783k19097q5586j49670J14948K89543J0059p0830j14436j5685
14701a09472K2660Q824j90513k3591K88589K07059K19370N4054j56256j52368
14691A68356r5724m0756l3503J3934N8213o9700m2430P0166k24836j61159J54893
14680b02546K68699j33953r9146l2702m3416J5460M565j78856L08645J27118j64598
14669a30730J21499M2232R5850r6244m5955m6371M9636j04101j49263J5889q8643
14658c36201J15755O7202p2815J33854K2221Q1917M2649P7615M9560j91762K0108
14647A0103m0525q4341l8063j11746p0660P0639K96947P0906j17142r8170j43355
14636b55407m4053r3828R4082M0479k2020L32192M3918k15146k61709J3521K53660
$$ plain form
14711 106499 131282 -87815 -173401 -323071 -208123 81420 91479 20649 -93787 -109472
14701 -109472 -86812 -77988 -268501 -292092 -3503 203556 422926 476980 320724 168356
14691 168356 72632 31876 -1627 12307 70520 820 -41610 28556 -196280 -357439 -202546
14680 -202546 66153 -67800 -166946 -199648 -243064 -227604 -223039 -401895 -93250 33868 -130730
14669 -130730 -9231 33001 128851 32607 -13348 -59719 -10083 -114184 -263447 -247558 -336201
14658 -336201 -220446 -153244 -226059 -92205 -69984 11933 54582 132197 181757 -10005 10103
14647 10103 -30422 -114763 -152826 -264572 -335232 -264593 32354 103260 -13882 -112052 -255407
14636 -255407 -299460 -393288 -299206 -258727 -280747 51445 95363 -119783 -381492 -367971 -114311
14625a14311J44457Q9418o4109p8927J25051j63254j33398J37498K19716J67243
14615C29384m4892l01277k60630Q1472M1348P3140n9219j23499R6637q7267n6776
14604c11579P435K36777J33481j26015M5822O7645k82327j07675J35759K33848
14594C3171N6756O3599J97142k19600k41008j25850j02016m228q1407r332J09981
14583c22792K9322J34855j0022K36684J71974l5164k2694j23267L6828P4260k9144
14572A40840j25954j08719N208K25286r0244m2074Q7451N7910k00796j71783L2339
14561a90536k07589r7478K26936J18354P9222q4419j96127m4209l7481l2422J13457
14550c52292M1390p6316q9336l24P7157R6859J38756J92012p3891p2761k2793
$$ plain form
14625 -114311 30146 119564 55455 -23472 101579 -61675 -195073 -57575 162141 329384
14615 329384 284492 -16785 -277415 -195943 -154595 -81455 -140674 -264173 -167536 -254803 -311579
14604 -311579 -304144 -67367 66114 -59901 -14079 53566 -228761 -336436 -200677 33171
14594 33171 89927 153526 350668 131068 -109940 -235790 -337806 -342034 -423441 -432773 -322792
14583 -322792 -293470 -158615 -168637 68047 240021 204857 182163 58896 95724 169984 140840
14572 140840 14886 -93833 -88625 136661 46417 4343 91794 149704 -51092 -222875 -190536
14561 -190536 -398125 -495603 -268667 -150313 -71091 -155510 -351637 -395846 -433327 -465749 -352292
14550 -352292 -310902 -387218 -476554 -476878 -399721 -302862 -164106 27906 -45985 -118746 -141539
14539a41539k26644R3623Q9204q8150J01773k2804M8199J37760J24499n7343O0225
14528A18803j69477l9031M2513J03833n5107k33026r7379J6517K6485O833J13385
14517a65651K2329J56081O2183o6296j23865n8601k770n2152J75236k38236q603
14506c00345m1643J99262J80782q0286K08084K80284j51772r1816J29450j51181
14496A80819l75246o7858J56260L0813m2555P3395K38483k05636k56160K8208
14486b39477K51742J4900k3191P9612J0058j70646m1712O9571L16397K09618k6104
14475D50768r8430k54872k74457j3792K02295J58954k29517l1615J16805J54793
14465A80932K23382l14771j51184j58030j28236Q8774o0144N9220o1337J70276
$$ plain form
14539 -141539 -368183 -274560 -185356 -273506 -171733 -194537 -146338 -8578 115921 58578 118803
14528 118803 -50674 -89705 -47192 56641 1534 -231492 -328871 -312354 -285869 -279036 -165651
14517 -165651 -143322 12759 74942 8646 -115219 -173820 -176590 -228742 -53506 -291742 -300345
14506 -300345 -341988 -142726 38056 -42230 165854 446138 294366 202550 332000 180819
14496 180819 -194427 -262285 -106025 -75212 -117767 -44372 194111 -11525 -267685 -239477
14486 -239477 12265 27165 3974 83586 93644 -77002 -118714 -49143 267254 476872 450768
14475 450768 352338 97466 -176991 -190783 11512 170466 -59051 -90666 26139 180932
14465 180932 404314 89543 -61641 -219671 -347907 -259133 -319277 -260057 -321394 -151118
14455a51118R5849r3357p1586L86157P9233r9841K8580J50137l17035k02120N6862
14444a38239j13985O663R9529L764J68802O9348N8705J41470l07065j96333K71616
14433F4275j81860R0282J04268o7920K2868L4957j05274q2543K41803K85311k04281
14422B01886j50592J11110j82447j29202j08047j27839R9445J77591j89640L7790
14412b59945J73484P3103M2673Q3853j6100J45517j26476n9094j9933O3652l26821
14401b26087p387K47697j7429k11597P5877M04994J22684k17190n810M3704j31838
14390G7618j01717r2114J53279j39010K2712Q9188Q1897Q7708O6068k22941j71673
14379a48985j71928N0186J93665n403l373r153J78648J71386j47641n3817k5206
$$ plain form
14455 -151118 -55269 -148626 -220212 165945 245178 145337 173917 324054 7019 -195101 -138239
14444 -138239 -252224 -245561 -146032 -142268 26534 95882 154587 296057 -11008 -207341 64275
14433 64275 -117585 -27303 76965 9045 31913 66870 -38404 -120947 120856 406167 201886
14422 201886 51294 162404 -20043 -149245 -257292 -385131 -285686 -108095 -297735 -259945
14412 -259945 -86461 -13358 29315 113168 97068 242585 116109 57015 37082 100734 -226087
14401 -226087 -233474 14223 -3206 -214803 -138926 266068 388752 171562 165752 209456 77618
14390 77618 -24099 -116213 37066 -101944 -79232 9956 91853 179561 245629 22688 -148985
14379 -148985 -320913 -270727 -77062 -82465 -85838 -94991 83657 255043 107402 53585 28379
14368B8379J044l7177J96222j39739j47062m7670r3535J00111j45054p3161j07950
14357d65592J06027O1239L3204K49526j9571R2151M4930j10469j97934j58374
14347c64863l57553n1994Q6083K79915J39651O3011J68946K47697J70739j08703
14337B72929k53108R2575K05225q0650J10146l6427j30959l285j3443J9439j80478
14326A964l68598j06330J91712K6183j82927L04273R1719L672j9772j9251P3423
14315c932K46106M9146j77097q6079j143j32477j22508r559j6834R706L5124J06834
14303a02713K48679k9119j49528K9008J10706j108k22627j61431J51500K01913
14293G5280L470q5263O6499j21662k2159m7649J32735K50242K16435m5242k78613
$$ plain form
14368 28379 29423 -7754 188468 48729 -98333 -146003 -239538 -139427 -284481 -357642 -465592
14357 -465592 -359565 -298326 -265122 -15596 -35167 56984 101914 -8555 -206489 -364863
14347 -364863 -722416 -774410 -688327 -408412 -268761 -205750 -36804 210893 381632 272929
14337 272929 19821 112396 317621 236971 347117 310690 179731 176446 163003 182442 1964
14326 1964 -366634 -472964 -281252 -255069 -437996 -133723 -42004 -38332 -58104 -77355 -3932
14315 -3932 242174 291320 114223 28144 27001 -105476 -227984 -237543 -254377 -244671 -209547 -102713
14303 -102713 145966 116847 -32681 -3673 107033 105925 -116702 -278133 -126633 75280
14293 75280 78750 -6513 59986 -61676 -83835 -131484 1251 251493 467928 422686 144073
14282A44073r3580j81587p5463q2309o7680Q8309K11442N2522Q580k48698j97944
14271d42335j11044J03670J60034o747L6147J79970l13531j00019L43025K10497
14261E9667J1862k00499j71128k9192Q8497k818m148q3118R3026K39135M6160
14250D7444m8895K78266P1090m4485o9885j63869R0912q2431n5542n8872q1983
14239a18250k5659j32364R9504J38955k12977q0447j1918K43896K72217J24956
14229B97913j15758k37170J03617J60358r1711k40825P3294R0735j68858p7494
14219b05899j23202p4910J00179J11462L9160M7279N2177N7224j4341j38862n1757
14208b01490j39528J53393R6258o5488j81109l8080j21653q5573k35J95813j718
$$ plain form
14282 144073 50493 -131094 -206557 -288866 -356546 -268237 -56795 -4273 4307 -244391 -442335
14271 -442335 -553379 -449709 -289675 -296422 -260275 -80305 -393836 -493855 -150830 59667
14261 59667 71529 -128970 -300098 -329290 -240793 -243611 -247759 -330877 -237851 1284 47444
14250 47444 -1451 276815 347905 303420 233535 69666 160578 78147 22605 -36267 -118250
14239 -118250 -143909 -276273 -176769 -37814 -250791 -331238 -343156 -99260 172957 297913
14229 297913 182155 -55015 48602 208960 117249 -123576 -50282 40453 -128405 -205899
14219 -205899 -329101 -404011 -303832 -192370 -153210 -105931 -53754 3470 -10871 -149733 -201490
14208 -201490 -341018 -187625 -91367 -156855 -337964 -376044 -497697 -583270 -583505 -387692 -389410
14197c89410r815p805K0583Q4615P3458N609m3224j32937R6488J05752J12103
14186h4583p8956k0911J03004M7674K16045k4358m4691j56189k40202J48805k6375
14175a60737o9824J13580K02976L4055k97901l44076R322J10500R4638k805K94559
14164a5713P7981N1734J44259l4288k01801k450q0330J51505J55051N4418L0284
14153C30650R588k18113j37688L2921M0070L0791K57157J69685j92455k55209
14143F7397q6218j314j28513m6830R5934J24247l7000r8982N2530K82816N9573
14132B83640k83726j98330K9063j4044K35740k66686Q093N1763J08360j10991
14122a57118k3433k22124j42444j57746J36419J00268J30137K49333K53007J16053
$$ plain form
14197 -389410 -399225 -407030 -386447 -301832 -228374 -222765 -265989 -398926 -302438 -196686 -84583
14186 -84583 -163539 -184450 -81446 -33772 182273 157915 113224 -42965 -283167 -134362 -160737
14175 -160737 -230561 -116981 85995 120050 -177851 -521927 -512605 -402105 -307467 -310272 -15713
14164 -15713 62268 114002 258261 223973 22172 19722 -60608 90897 245948 300366 330650
14153 330650 340238 122125 -15563 17358 57428 88219 345376 515061 322606 67397
14143 67397 -18821 -20135 -148648 -195478 -99544 24703 -12297 -111279 -58749 224067 283640
14132 283640 -86 -198416 -169353 -183397 52343 -214343 -206250 -154487 -46127 -157118
14122 -157118 -180551 -402675 -545119 -702865 -566446 -466178 -336041 -86708 166299 282352
14112B82352k10986j28126l8972n3404J40370K00306J69516k30444k27298n1766
14102a48452J5090q8767j16213J32553k1764J05770R2255J57793j60164k37116
14092b69015Q7830q3148n7667l8226J97045L8081J48744R6611R6131Q8725J1125
14081C16236k37502j78666K9797j55935J08968J49245k2799J01153k75490o2051
14071b27044M02379j19854j10312j83071m809N487j38294k75445P9296J80163
14061c91504K87003j12378J45567K53896j22119o5900O1986l7022n2960o5818
14051i9249P9247J9730O1883n3281q9871l598J34497K01499K5800j73077k13803
14040a10223Q1916J1972j6041k14945J4795J3990q8334j89106L8742J92570L00095
$$ plain form
14112 282352 71366 -56760 -95732 -149136 -8766 191540 361056 130612 -96686 -148452
14102 -148452 -133362 -222129 -338342 -205789 -227553 -121783 -29528 128265 -31899 -269015
14092 -269015 -181185 -264333 -322000 -360226 -163181 -125100 23644 120255 216386 305111 316236
14081 316236 78734 -99932 -70135 -226070 -117102 32143 9344 110497 -164993 -227044
14071 -227044 175335 55481 -54831 -237902 -242711 -237224 -375518 -650963 -571667 -391504
14061 -391504 -104501 -216879 -71312 182584 60465 -5435 56551 19529 -33431 -99249
14051 -99249 -20002 -272 61611 8330 -81541 -85139 49358 250857 276657 103580 -110223
14040 -110223 -28307 -16335 -32376 -247321 -232526 -218536 -306870 -495976 -457234 -264664 35431
14029C5431k07473l6521J33107J01391q1733n210J8543n9722J20924K43608j9149
14018B43196J21395j86201k46951m9945M2809j01085J59451O8474p0229P3309
14008E4223j41866J87728K97247k63988k49615m2836m9618m7288M11153l0877
13998A24263k44525J16346o2873k15916Q3079K93458P2085r1512m184l6416L4030
13987F7835j62027r4536J66290K66462J30983j38186k77668L26856J19140m7857
13977C57292k00978l19865M6657J24478J19391L75126o9083l42106k44123j18322
13967b71533o5218K09652M5320r3752K036q9552j11170J10263J58520J03608J36866
13956A35040L05119q8543k18403j81859q7100j4844J00098Q5021q9114N7139o6028
$$ plain form
14029 35431 -172042 -208563 -75456 25935 -55798 -61008 -42465 -102187 18737 262345 243196
14018 243196 364591 178390 -68561 -118506 -75697 -176782 -17331 51143 -19086 54223
14008 54223 -87643 100085 397332 133344 -116271 -159107 -208725 -256013 155140 124263
13998 124263 -120262 -3916 -66789 -282705 -199626 93832 165917 74405 70221 33805 67835
13987 67835 -94192 -188728 -22438 244024 375007 236821 -40847 286009 405149 357292
13977 357292 156314 -163551 -116894 7584 126975 502101 433018 90912 -153211 -271533
13967 -271533 -336751 -127099 -81779 -175531 -173495 -263047 -374217 -263954 -105434 -1826 135040
13956 135040 440159 351616 133213 -48646 -135746 -150590 -50492 34529 -54585 2554 -63474
13945f3474J61709J00115M9966j73522o5498k51515k45429J32784K34687J87889
13935F7712P2607j75313k28656p235K35643L41773K34206J55478m3168k21631
13925D31416k99113J05129J90608j73665p2090M8334k4817j06331o2045j4686
13915B2740o5173j15974N7565P562M3280m7539m4441J68510K27699O0562k0674
13904B94117q2914P57J08573p3615n2727j04745j85308k43536q8363K70210j15655
13893b73206r7446p6246N9780L17644n5168P6264j43310k03259k9786O2300R0732
13882b71701q1151J32394L8610n1135j69704P9276J65334J8411K25723J13077
13872A99134J06719j49799j44971Q2799L06144o7544l33229n5567J29826N4483
$$ plain form
13945 -63474 98235 198350 248316 74794 9296 -242219 -487648 -354864 -120177 67712
13935 67712 140319 -34994 -263650 -270885 -35242 306531 540737 696215 653047 431416
13925 431416 132303 237432 428040 254375 182285 230619 205802 99471 37426 22740
13915 22740 -42433 -158407 -100842 -93280 -50000 -97539 -141980 26530 254229 314791 294117
13904 294117 211203 211960 320533 246918 194191 89446 -95862 -339398 -427761 -157551 -273206
13893 -273206 -370652 -446898 -387118 -69474 -124642 -48378 -191688 -394947 -424733 -362433 -271701
13882 -271701 -352852 -220458 -181848 -232983 -402687 -323411 -158077 -139666 86057 199134
13872 199134 305853 156054 11083 93882 400026 332482 -747 -56314 73512 127995
13862A27995J04067J32963k4651R6894R1075k02368k32303J0977J80644K2506
13852C07799p3713j73194o9363p1392J16484l042k02410J34787o957j0565m5971
13841i7537J40255m533J31237N6144j63286j45642L7199k18335o6308J41601J19289
13830f9916J27090L5804J02509J33176Q968o0146j74423J1293j26312K00648K4637
13819B13328k18510q3203J74005j17704L34573N4228j71625j58634j00101m3126
13809a16769o4026N9500M9915J72710J84239p4755j86369K27998J40992O617j77850
13798B22202J7860j64476j56593j43367l2066M6917O8046o470O596m963K91977
13787A45663N1757J4186l164j32574j13875l8619J28262j41559O029J986o0370
$$ plain form
13862 127995 232062 365025 340374 437268 528343 325975 93672 104649 285293 307799
13852 307799 234086 60892 -8471 -79863 36621 33579 -168831 -34044 -41001 -51566 -97537
13841 -97537 42718 38185 169422 225566 62280 -83362 -46163 -264498 -330806 -189205 -69916
13830 -69916 57174 92978 195487 328663 337631 277485 103062 114355 -11957 188691 213328
13819 213328 -5182 -88385 85620 -32084 302489 356717 185092 26458 -73643 -116769
13809 -116769 -180795 -121295 -71380 101330 285569 210814 24445 252443 393435 400052 222202
13798 222202 240062 75586 -81007 -224374 -256440 -209523 -141477 -147947 -141351 -146314 145663
13787 145663 197420 211606 208442 75868 -38007 -76626 51636 -89923 -83894 -81908 -142278
13776a42278J19701K2549o0925L45494M7144j6256J40777j79007k53191k05787
13766a81779o1202J38045J2636M7493l8529J31739r8726P5771J30509n3196J08645
13755B11406j27296P3186J76854j06870j13413J82858J14571R565O2159O2614
13745E45634j58862o8463k75814j80351L7228j10172j09276p9345L5909J65229
13735a98283J72048K29910k28909k7291L75279k1097j70011j3527J17144j09828
13725A25435k78121O925K13650Q7056j57661q7053J73109J88709M4185n0675q8869
13714A76690o0343j53411j10628o1788j16189m2471J96579K61624J50599j44891
13704I5771m0115o8966K23781q0161k09097O2037J07983K45k1135r646l98p8261
$$ plain form
13776 -142278 -22577 -28 -60953 284541 331685 315429 456206 277199 24008 -181779
13766 -181779 -242981 -104936 -92300 -44807 -83336 48403 -50323 25448 155957 102761 211406
13755 211406 84110 157296 334150 227280 113867 296725 411296 420861 483020 545634
13745 545634 386772 318309 42495 -137856 -100628 -210800 -320076 -399421 -363512 -198283
13735 -198283 -26235 203675 -25234 -52525 322754 301657 131646 118119 235263 125435
13725 125435 -152686 -145761 67889 154945 -2716 -89769 83340 272049 316234 265559 176690
13714 176690 116347 -37064 -147692 -209480 -325669 -368140 -171561 90063 240662 95771
13704 95771 55656 -13310 210471 130310 -78787 -16750 91233 91478 70343 60697 60299 -17962
13692a7962l889J37647Q8118K8221j76751R3001K40080r5227j85044q7342N8890
13681G9742k03214n2879K83787J36329q0649o0310l7665J29824J5884k41j51415
13670E9193j03663K20371K05246p0317K4897j71980l16238K17690J63754j51679
13660G7274o0238j31n8453j49794l7745M9647p7398k23799K25651L43444Q1987
13649A70445R5226P9416n8572n0667l41548N118J35082m1716o9501j01672k1353
13638a99742J01959R6001J78090p5433j43458J28933M3475M774L6159L3628n9598
13627A44788l8714j02198q6259j28270K15746L1463J13645k5419j9917K39573
13617C44438K66504j55576l24911k76577j46144J34589J36380J03418O7392j77466
$$ plain form
13692 -17962 -21851 115796 203914 232135 55384 148385 388465 293238 108194 20852 79742
13681 79742 -123472 -176351 107436 243765 163116 102806 65141 194965 210849 210608 59193
13670 59193 -44470 175901 381147 310830 335727 163747 -152491 65199 228953 77274
13660 77274 17036 16905 -41548 -191342 -229087 -179440 -256838 -480637 -254986 88458 170445
13649 170445 265671 345087 286515 235848 -105700 -100582 34500 -7216 -76717 -178389 -199742
13638 -199742 -97783 -1782 176308 100875 -42583 86350 129825 134599 170758 204386 144788
13627 144788 106074 3876 -82383 -210653 5093 36556 150201 124782 104865 344438
13617 344438 610942 455366 130455 -146122 -292266 -157677 -21297 82121 149513 -27953
13607b7953j13709j44358K3189K47554N4372L2444J15832J10204L7642k04605
13597A30612j48487k1723J69633J11153N2531J55978P8842l24136p9711j38560
$$ plain form
13607 -27953 -141662 -286020 -262831 -15277 39095 71539 187371 297575 335217 130612
13597 130612 -17875 -39598 130035 241188 293719 449697 528539 204403 124692 -13868
$$ [...]
##END NTUPLES=NMR SPECTRUM
##END=
