##TITLE=Analysis number 317641
Compound Code btb 08663
Project Code adrs
Chemist Name fudan
##JCAMPDX= 6.0         $$ Bruker NMR JCAMP-DX V2.0
##DATA TYPE= NMR SPECTRUM
##DATA CLASS= NTUPLES
##ORIGIN= Bruker BioSpin GmbH
##OWNER= nmr
$$ XWIN-NMR		Version 3.5
$$ Tue Feb 28 09:21:08 2006 GMT Standard Time (UT+0h)  MAYBRIDGE\nmr@NMR_250MHZ
##.OBSERVE FREQUENCY= 250.131544655141
##.OBSERVE NUCLEUS= ^1H
##.ACQUISITION MODE= SIMULTANEOUS (DQD)
##.ACQUISITION SCHEME= undefined
##.AVERAGES= 16
##.DIGITISER RES= 18
##SPECTROMETER/DATA SYSTEM= dpx250
##.PULSE SEQUENCE= zg30
##.SOLVENT NAME= DMSO
##.SHIFT REFERENCE= (INTERNAL, DMSO, 0, 16.522)
##AUDIT TRAIL= $$ (NUMBER, WHEN, WHO, WHERE, WHAT)
$$ ##TITLE= Audit trail, XWIN-NMR		Version 3.5
$$ ##JCAMPDX= 5.01
$$ ##ORIGIN= Bruker BioSpin GmbH
$$ ##OWNER= nmr
$$ C:\u/data/dgb/nmr/ADRS/16990/pdata/1/auditp.txt
$$ ##AUDIT TRAIL=  $$ (NUMBER, WHEN, WHO, WHERE, WHAT)
(   1,<2006-02-28 09:20:45.83 +000>,<MAYBRIDGE\nmr>,<NMR_250MHZ>,
      <created by zg, POWCHK disabled, PULCHK disabled
       configuration hash MD5:
       84 BC 41 DB A1 6E 1D 46 DA 25 12 A5 C1 ED C5 3A
       data hash MD5: 64K
       36 FE EB 9D 15 86 9E 37 C3 B0 14 27 C5 56 F6 E6>)
(   2,<2006-02-28 09:20:58.54 +000>,<MAYBRIDGE\nmr>,<NMR_250MHZ>,
      <Start of raw data processing
       ef LB = 0.3 FT_mod = 6 PKNL = 1 SI = 32K 
       data hash MD5: 32K
       2A 9D A2 23 AC 76 EC 72 59 7D BC 96 E8 76 23 AF>)
(   3,<2006-02-28 09:21:00.15 +000>,<MAYBRIDGE\nmr>,<NMR_250MHZ>,
      <apk 
       data hash MD5: 32K
       B4 D8 83 D1 10 57 9A E4 F0 B4 CC 18 F1 8B B5 CB>)
(   4,<2006-02-28 09:21:00.87 +000>,<MAYBRIDGE\nmr>,<NMR_250MHZ>,
      <abs ABSG = 5 
       data hash MD5: 32K
       1A D1 75 CA 88 50 BA 9E 40 69 22 EA 08 8C F8 D4>)
$$ ##END=
$$ 
$$ hash MD5
$$ ED 54 03 60 4B CE 90 48 9C 4E D8 5B 7A A7 56 E3
##$RELAX= 
##$RELAX= 
##$RELAX= 
##$RELAX= 
##$RELAX= 
##$RELAX= 
##$RELAX= 
$$ Bruker specific parameters
$$ --------------------------
##$DU= <C:\u>
##$EXPNO= 16990
##$NAME= <ADRS>
##$PROCNO= 1
##$TYPE= <nmr>
##$USER= <dgb>
##$AMP= (0..31)
100 100 100 100 100 100 100 100 100 100 100 100 100 100 100 100 100 100 
100 100 100 100 100 100 100 100 100 100 100 100 100 100 
##$AQSEQ= 0
##$AQ_mod= 3
##$AUNM= <au_zg>
##$AUTOPOS= <16 >
##$BF1= 250.13
##$BF2= 250.13
##$BF3= 250.13
##$BF4= 250.13
##$BF5= 500.13
##$BF6= 500.13
##$BF7= 500.13
##$BF8= 500.13
##$BYTORDA= 1
##$CFDGTYP= 0
##$CFRGTYP= 5
##$CHEMSTR= <none>
##$CNST= (0..31)
1 1 145 1 1 1 1 1 1 1 1 1 1 1 1 1 1 1 1 1 1 1 1 1 1 1 1 1 1 1 1 1 
##$CPDPRG= <>
##$CPDPRG1= <>
##$CPDPRG2= <>
##$CPDPRG3= <>
##$CPDPRG4= <mlev>
##$CPDPRG5= <mlev>
##$CPDPRG6= <mlev>
##$CPDPRG7= <mlev>
##$CPDPRG8= <mlev>
##$CPDPRGB= <>
##$CPDPRGT= <>
##$D= (0..31)
0 1 0 0 0 0 0 0 0 0.06 0 0 0 0 0 0 0.0002 0 0 0 0 0 0 0 0 0 0 0 0 0 0 
0 
##$DATE= 1141118444
##$DBL= (0..7)
120 120 120 120 120 120 120 120 
##$DBP= (0..7)
150 150 150 150 150 150 150 150 
##$DBP07= 0
##$DBPNAM0= <>
##$DBPNAM1= <>
##$DBPNAM2= <>
$$ [...]
##$SUBNAM7= <"">
##$SUBNAM8= <"">
##$SUBNAM9= <"">
##$SW= 20.6930455092707
##$SWIBOX= (0..15)
0 0 3 0 0 0 0 0 0 0 0 0 0 0 0 0 
##$SW_h= 5175.983436853
##$TD= 65536
##$TD0= 1
##$TE= 293.16
##$TE2= 300
##$TE3= 300
##$TEG= 300
##$TL= (0..7)
0 120 120 120 120 120 120 120 
##$TP= (0..7)
150 150 150 150 150 150 150 150 
##$TP07= 0
##$TPNAME0= <>
##$TPNAME1= <>
##$TPNAME2= <>
##$TPNAME3= <>
##$TPNAME4= <>
##$TPNAME5= <>
##$TPNAME6= <>
##$TPNAME7= <>
##$TPOAL= (0..7)
0.5 0.5 0.5 0.5 0.5 0.5 0.5 0.5 
##$TPOFFS= (0..7)
0 0 0 0 0 0 0 0 
##$TUNHIN= 0
##$TUNHOUT= 0
##$TUNXOUT= 0
##$USERA1= <user>
##$USERA2= <user>
##$USERA3= <user>
##$USERA4= <user>
##$USERA5= <user>
##$V9= 5
##$VALIST= <valist>
##$VCLIST= <CCCCCCCCCCCCCCC>
##$VD= 0
##$VDLIST= <DDDDDDDDDDDDDDD>
##$VPLIST= <PPPPPPPPPPPPPPP>
##$VTLIST= <TTTTTTTTTTTTTTT>
##$WBST= 1024
##$WBSW= 4
##$XGAIN= (0..3)
0 0 0 0 
##$XL= 0
##$YL= 0
##$YMAX_a= 448879
##$YMIN_a= -455669
##$ZGOPTNS= <>
##$ZL1= 120
##$ZL2= 120
##$ZL3= 120
##$ZL4= 120
##$ABSF1= 16.522
##$ABSF2= -4.171173
##$ABSG= 5
##$ABSL= 3
##$ALPHA= 0
##$AQORDER= 0
##$ASSFAC= 0
##$ASSFACI= 0
##$ASSFACX= 0
##$ASSWID= 0
##$AUNMP= <proc_1d>
##$AZFE= 0.1
##$AZFW= 0.1
##$BCFW= 0
##$BC_mod= 0
##$BYTORDP= 0
##$COROFFS= 0
##$CY= 12.5
##$DATMOD= 1
##$DC= 0
##$DFILT= <>
##$DTYPP= 0
##$F1P= 14.0000005364418
##$F2P= -0.99999901652339
##$FCOR= 0.5
##$FTSIZE= 32768
##$FT_mod= 6
##$GAMMA= 0
##$GB= 0
##$INTBC= 1
##$INTSCL= 1
##$ISEN= 128
##$LB= 0.3
##$LEV0= 0
##$LPBIN= 0
##$MAXI= 10000
##$MC2= 0
##$MEAN= 0
##$ME_mod= 0
##$MI= 0
##$NCOEF= 0
##$NC_proc= -4
##$NLEV= 6
##$NOISF1= 0
##$NOISF2= 0
##$NSP= 0
##$NTH_PI= 0
##$NZP= 0
##$OFFSET= 16.522
##$PC= 1
##$PHC0= 234.9466
##$PHC1= 9.440545
##$PH_mod= 1
##$PKNL= yes
##$PPARMOD= 0
##$PSCAL= 4
##$PSIGN= 0
##$REVERSE= no
##$SF= 250.13
##$SI= 32768
##$SIGF1= 0
##$SIGF2= 0
##$SINO= 400
##$SIOLD= 32768
##$SREGLST= <1H.DMSO>
##$SSB= 0
##$STSI= 32768
##$STSR= 0
##$SW_p= 5175.98343685301
##$SYMM= 0
##$S_DEV= 0
##$TDeff= 65536
##$TDoff= 0
##$TI= <Analysis number 999999
Compound Code 99
Book Reference 9
Project Code 9>
##$TILT= no
##$TM1= 0
##$TM2= 0
##$TOPLEV= 0
##$USERP1= <user>
##$USERP2= <user>
##$USERP3= <user>
##$USERP4= <user>
##$USERP5= <user>
##$WDW= 1
##$XDIM= 32768
##$YMAX_p= 466001743
##$YMIN_p= -298216
$$ End of Bruker specific parameters
$$ ---------------------------------
##NTUPLES= NMR SPECTRUM
##VAR_NAME=  FREQUENCY,     SPECTRUM/REAL,   SPECTRUM/IMAG
##SYMBOL=    X,             R,               I
##VAR_TYPE=  INDEPENDENT,   DEPENDENT,       DEPENDENT
##VAR_FORM=  AFFN,          ASDF,            ASDF
##VAR_DIM=   32768,         32768,           32768
##UNITS=     HZ,            ARBITRARY UNITS, ARBITRARY UNITS
##FACTOR=    0.157963299565203, 1,           1
##FIRST=     4132.6476996994, 0,             0
##LAST=      -1043.33573715361, 0,           0
##MIN=       -1043.33573715361, -298216,     0
##MAX=       4132.6476996994, 466001743,     0
$$ Real data points
##PAGE= N=1
##DATA TABLE= (X++(R..R)), XYDATA
$$ [...]
28336 124014 18715 -58185 -54572 -67719 -118497 -131735 -91483 4921 25636 45170 48280 53253
28324 53253 7059 -23200 -35140 -44067 -45738 -67117 -71866 -94358 -87602 -65426 -70952 -88797 -62439
28311 -62439 -43684 -19667 -13311 19265 20557 -46155 8672 59293 111589 139963 89371 134794
28299 134794 123023 173576 189541 119614 54300 47753 62153 63976 60054 -1344 -9559 5870
28287 5870 53162 49821 53549 15361 12108 -54131 -100220 -38004 -3363 -8330 14617 96792 75039
28274 75039 83179 1800 -59654 -64727 -36611 21781 17579 6896 37295 88080 123847 138044
28262 138044 98047 53251 -13429 10499 20622 17925 35353 75615 29273 -26872 -61623 -51227
28250 -51227 -18294 -30931 -4112 18941 56085 105246 75262 35194 29872 42657 -30946 -69633
28238 -69633 -45005 -22785 -15387 6706 51554 93599 91463 28958 -14805 -45017 -73585 -79263
28226 -79263 -66150 -52626 -73406 -66688 -71870 -58188 -47017 -59318 -67508 -78787 -33796 -13354
28214 -13354 -68864 -83429 -63780 -12978 1370 34240 30108 40899 37055 16552 31967 52459
28202 52459 57112 77674 81018 -24141 -48537 -35113 12661 -2015 75842 109915 163815 99308
28190 99308 26960 -9970 9511 47073 29876 49116 9119 -11630 -20696 16608 20673 26538
28178 26538 78229 94362 91762 141521 66498 22406 -65974 -139315 -135635 -97128 -45249 10618
28166 10618 55905 67561 60029 60627 55630 44212 30956 19851 31318 -1277 -79282 -116783
28154 -116783 -88020 -11256 43551 51761 13058 22290 44818 76367 50978 11741 -39212 -8275
28142 -8275 28657 65663 11178 -15665 3010 -13178 -31319 -33137 12423 43800 63511 84120
28130 84120 54331 8793 8688 43328 60078 106086 124371 115088 128070 68531 -26615 -57180
28118 -57180 -82341 28484 121801 44627 -7209 28654 23978 34245 69905 -15035 -62964 -58236
28106 -58236 -36907 -24425 37921 46138 -176 -38686 -42958 -35163 34215 79868 98318 127873
28094 127873 88468 9864 -15089 17549 70547 53267 11727 -15187 -28209 -52696 -44995 37022
28082 37022 62103 24907 -823 -13970 39925 70707 60817 36059 -18960 -10914 -13928 -28311
28070 -28311 -22461 23921 10719 -3428 -3493 28701 14200 -6280 -24107 6688 -8655 -33172
28058 -33172 -70536 -99992 -123895 -110858 -68220 -35164 -37309 -7150 68266 86068 71018 65219
28046 65219 86404 82589 2842 -14651 -35776 -34198 -2223 -42341 -56316 -47876 25629 100279
28034 100279 110785 112386 72975 -11494 -48212 -25689 40442 -33779 -144580 -113216 -42063
28023 -42063 -2806 -5462 -26234 -16307 -41092 -38771 -48126 -35579 -5130 -17504 -72518 -133502
28011 -133502 -92624 -48372 -85813 -81899 -88887 -93660 -57298 -20291 -62914 -90371 -66312 -47801
27999 -47801 -14324 4506 -11079 31662 25929 18156 -43976 -20815 35426 64300 69212 64915
27987 64915 84578 68065 29430 20981 -21745 -35347 -47191 -18717 -3843 -16744 -38212 -74385
27975 -74385 -102072 -105807 -61972 14061 52106 93857 22612 -2185 13509 1521 -23269 23851
27963 23851 84161 42261 19084 26807 -11146 -1150 24255 73172 69311 23423 -10282 -14028
27951 -14028 -61723 -36523 -52923 -62594 -25525 -18591 -22102 -17111 -60992 -117383 -103737 -46322
27939 -46322 -5272 -47515 -48971 19506 72235 75388 50876 58318 51065 59562 93388 77222 59622
27926 59622 21902 -30135 -68388 -84112 -43592 -1357 36437 62216 -691 -11479 38319 -24211
27914 -24211 -51655 -46151 -45503 -77565 -104938 -67299 -30358 -27540 -48604 -124006 -118163 -29282 26411
27901 26411 25813 9007 10489 8145 49900 71648 101964 38407 -8991 -34568 -64273 -48576
27889 -48576 -50730 -45706 -18349 -80212 -70050 -14058 -59397 -47624 -67865 -17415 -21774 -73872
27877 -73872 -84925 -31075 50817 110317 96750 83711 102085 150775 91885 26890 51529 21015
27865 21015 -64718 -54729 -23247 -44054 -74924 -27070 45951 9020 -8840 30865 36945 90538
27853 90538 91558 71626 28320 26267 -14512 38251 21168 -55583 -60728 -41492 -12064 -40077
27841 -40077 -107916 -86226 -59330 -62814 -43209 -60784 -35506 8473 13867 -28109 -51284 -56560
27829 -56560 -36815 27080 1035 -20668 6227 -13592 -267 50984 82516 114091 106813 35755
27817 35755 4813 34302 -4968 -15599 -4517 -947 -66296 -72926 -35650 -6872 -13340 -27998
27805 -27998 -45890 -62438 -111291 -87796 -47722 -26628 -7953 -150 -29523 -6416 5917 -28915
27793 -28915 -7392 -214 -60437 -81124 -29102 -62681 -18292 -29986 -55442 -89122 -83679 -78256
27781 -78256 -69934 -21035 -10077 -7407 28204 56121 24981 27603 21290 37266 67167 68131 23683
27768 23683 36424 34297 -4287 7888 37065 28176 43394 34983 45068 25242 -16504 -36327
27756 -36327 -3988 18461 12633 58309 109041 88310 23765 63576 60915 59356 95415 62451
27744 62451 29905 57528 52642 -1083 -15857 -79293 -111587 -59947 -11944 -32208 -43102 -39349
27732 -39349 -53559 -100791 -68050 -18866 -22374 -74691 -83637 -82732 -50628 -2275 6523 17732 52778
27719 52778 55080 16367 59931 142565 84422 -22210 167 128265 158954 126905 153715
27708 153715 149428 84481 -30984 -51693 -59679 -38706 -7802 17562 45910 42136 32215 13982
27696 13982 7996 16455 -2267 1889 72360 100227 58390 61923 67288 97083 82454 74472 61469
27683 61469 61277 61611 16275 24940 88786 86094 59966 26479 10004 -9476 13185 -39168 -97760
27670 -97760 -59492 -86395 -99290 -49469 -22977 -72507 -57369 -48150 -23075 29138 56839 -4308
27658 -4308 -104479 -85851 -29822 29687 82902 66984 63630 45243 -50136 -56935 -29562 -56896
27646 -56896 -49915 16884 43541 -28869 -62148 -86482 -115210 -143078 -175770 -106478 -60099 -18509
27634 -18509 50705 -9373 -60429 -42194 -2563 -23037 -41333 -123248 -63690 63264 29141
27623 29141 -12316 -22281 -45500 -55306 -62570 4705 46826 52486 107401 105185 62245 30810 22335
27610 22335 22867 20583 -3794 -14641 -3680 -25592 -3295 11236 -13520 -25491 -97978 -106841
27598 -106841 -96476 -92793 -121418 -70841 -51299 -121667 -183453 -114462 -40485 16917 50697 34933
27586 34933 40156 86933 73586 -26118 -87559 -52931 -32767 -46464 -41386 -8774 2075 3413
27574 3413 -12173 39219 21738 -22526 -59687 -1581 101175 119341 78689 -17031 -71768 -60274
27562 -60274 -39694 -10829 41920 53566 -4466 -51403 -38811 -83968 -72398 -55930 -105999 -88098
27550 -88098 -32880 -9683 19606 17345 -27123 -4306 -9134 31881 51409 13850 -26423 17512
27538 17512 63980 63990 11365 -62071 -60061 -29063 -66191 -69847 -9215 -27027 -28872 64889 100006
27525 100006 53720 11240 -26791 -92184 -72739 -77823 -62722 -3393 11337 48138 10162 20395
27513 20395 -19321 -42041 -12810 11483 15305 21198 8641 10192 -31589 10592 24544 -13230
27501 -13230 -38533 -43040 -72331 -85112 -48730 -35366 -45573 -46041 14912 101610 70403 30131
27489 30131 21438 -25402 4282 35827 16803 -10420 -9870 -29477 -58607 -58053 18069 28270 9320
27476 9320 10364 -19107 -15916 -2750 -12187 -2095 -36273 -69199 -103793 -140884 -152235 -129041
27464 -129041 -85406 -24983 21078 1891 15273 22404 -43541 -75880 -65092 -54689 17545 -6949
27452 -6949 -79774 -69639 582 4344 2179 30408 -3872 -41966 -18535 -1789 73125 61425
27440 61425 9309 41313 6628 58824 72427 -3603 -62966 -104869 -79381 -91333 -116557 -105067
27428 -105067 -97268 -66367 16193 -5871 -48494 -36388 -33179 10746 -4302 -20772 9342 -13324
27416 -13324 -78568 -125610 -155336 -100469 13750 14086 46047 57682 -7582 -41860 -26483 -46434
27404 -46434 -52105 -77746 -76936 -139455 -131004 -82520 -53690 -102156 -160462 -140972 -57346 -28721
27392 -28721 -81432 -132564 -82111 -21299 16064 17584 34099 14189 37826 26606 -4659 -16820
27380 -16820 -58410 -66323 -120463 -108827 -108918 -102354 -49472 44200 85970 65271 97720 24753 -22211
27367 -22211 -48176 -47579 -21507 -640 2510 -11060 -12573 59566 86363 64147 11305 -28376
27355 -28376 -20537 6774 -52743 -35524 -29875 -5763 46186 51187 7481 42453 73674 42458
27343 42458 44506 72182 78758 123740 99247 53872 23881 -9743 -35504 -10205 -5032 8603
27331 8603 62581 103655 57193 23471 24160 -17598 -9334 49780 78196 39175 -38311 -79522
27319 -79522 -11409 12087 -7461 599 7148 4524 83057 115497 99725 44578 13796 36466
27307 36466 38259 14674 18415 -11588 -59397 -62472 1042 34743 42123 -45498 -95970 -79051
27295 -79051 -83868 -52329 -16702 -43368 -13692 -69755 -34018 18263 93832 -988 -78963 -84845
27283 -84845 -18017 -11296 -39380 -24203 38149 -14462 -47721 -26223 -26540 -77058 -123721 -132785
27271 -132785 -132977 -120722 -136454 -61162 141 29472 -8631 -16819 48950 95227 137202 117181
27259 117181 95013 62675 15585 -29585 -32698 -26228 -11165 -4855 -4983 4101 54657 26353 -52298
27246 -52298 -67599 -22750 -23708 -102616 -148117 -124812 -52910 -19781 -20552 -1463 -36654 -58640
27234 -58640 -52154 -121420 -135392 -61615 -26661 291 -7933 -7511 -9575 -69990 -127871 -56422 8975
27221 8975 36546 -14776 -30408 23118 -1238 -64196 -91173 -78586 -96261 -31982 37816 17344
27209 17344 2080 -14515 -3124 32108 24011 13633 33482 89494 97157 67864 50258 16899
27197 16899 49725 55473 7235 58906 77174 40345 69923 69719 71632 54061 15097 -36416
27185 -36416 -3738 33535 59866 37739 71133 82146 70931 789 9462 25564 56882 75554
27173 75554 -6986 -65613 13254 77735 100791 76923 130757 129451 145674 172514 105704 111888
27161 111888 110705 61234 29988 3258 -33205 -61394 -71923 -103740 -86698 -49831 -36398 16891
27149 16891 59684 44954 4457 -52716 -103574 -55249 10059 37608 81529 71075 12911 -7357
27137 -7357 25705 19015 2536 29731 40314 9018 -2928 -52650 -39882 -32987 -28767 2944
27125 2944 40352 68428 74883 12689 -46754 -71509 -83770 -37667 12022 48200 41702 36062
27113 36062 11149 3032 2176 -12977 -28044 -39277 -59507 -79076 15152 52126 51211 15847 -64481
27100 -64481 -105942 -64272 -24946 -21691 -2478 -52579 -66421 -87039 -113254 -146070 -56790 -28051
27088 -28051 -22218 -24803 -40808 -48671 -822 43636 51980 45027 -31811 -50413 -922 53575 59668
27075 59668 13891 -32875 -62676 -18173 -26685 -19283 18416 -230 -75955 -96291 -73997 -58314
27063 -58314 -19542 11996 22431 48750 61258 38510 6601 -37629 -11139 37950 87749 113815
27051 113815 64604 -5929 45576 27823 -21598 -19201 -11435 -33385 -58080 -51583 -77014 -64580
27039 -64580 -67375 -21579 26310 -1316 -16366 3948 28515 38257 4319 -5285 38671 9263
27027 9263 -10841 -22742 -12281 20770 -51360 -38289 -4023 42791 30690 34260 17861 -29763
27015 -29763 -108535 -116520 -78420 -102649 -115353 -3752 53569 42735 18718 10552 24932 56679
27003 56679 40287 74717 72537 57065 55771 39659 35523 51595 80494 77006 1241 -37210
26991 -37210 -14101 -14242 -41633 -11821 -22462 -1070 -31826 11142 102429 139136 105434 50781
26979 50781 24163 42050 -11645 -25263 -15521 -7551 5931 -18531 29887 13302 -28937 19712
26967 19712 -12243 -74450 -60998 -18472 24007 67568 35159 19464 70732 78119 49400 25852
26955 25852 -2896 -16988 -5014 32522 36258 -3017 4151 40995 24376 30441 18768 7558
26943 7558 11020 53806 80154 43482 21585 9911 -50297 -49066 -6044 -9396 -35022 -54617
26931 -54617 -25013 -6798 47231 22668 29585 65851 43120 -26335 6827 73912 83075 -11414
26919 -11414 -64592 -136427 -144353 -118262 -133359 -83994 -86020 -64065 -25602 -71856 -109377 -59995
26907 -59995 33577 99821 69567 69739 24170 -25973 -29234 -18644 -59194 -8331 70355 83353
26895 83353 92631 -4430 -72981 -109996 -107979 -24000 31069 46280 40907 36211 16117 -24049
26883 -24049 -36873 4242 20197 7013 25736 64912 68506 82105 82727 33310 -5693 3488
26871 3488 23685 73725 90847 135449 123259 104199 92020 53966 -41949 -52487 -79640 -106720
26859 -106720 -63495 -28595 -44582 -4633 88038 143333 144304 66161 -15763 -14307 8705 17925
26847 17925 61710 31870 72241 98492 64546 -9959 -106295 -104767 -46096 -46846 27979 82323
26835 82323 103731 72913 51647 23009 -16295 4783 51767 33473 -5790 11131 2770 2880
26823 2880 15416 49454 63628 15066 -56374 -50727 -32009 -81572 -68866 -20586 -9656 -35381
26811 -35381 -100136 -85582 -107839 -118260 -11588 -40102 -25792 12217 -8897 -1605 31701 -7136
26799 -7136 -49115 -22671 5569 18747 65291 79755 31973 -1282 19962 -27718 -75676 -28660
26787 -28660 -50559 -51883 -28591 -4594 15667 54701 80530 87203 95728 -10744 4948 37541
26775 37541 22597 -8951 31377 65760 17049 -11028 769 5830 47894 71707 38761 38443
26763 38443 24385 20761 -27142 -50447 -93177 -72074 -24157 -31411 -40807 -18462 -2821 -4388
26751 -4388 56708 103109 84438 -4297 -52594 -57833 12682 21517 48007 16745 20375 -37324
26739 -37324 -37495 -28582 -55642 -101385 -80410 -23303 -2158 -88113 -43564 -12486 6613 9350
26727 9350 -44799 -79093 -68208 -83910 -27037 32151 33348 -53517 -80847 -24967 -39778 -16673
26715 -16673 18580 28843 -31280 -17323 16766 68908 24887 8113 -38651 -40647 32899 36275
26703 36275 9016 46650 57625 42281 26757 44115 56751 46499 55202 74377 6484 -40407
26691 -40407 -6115 58930 109027 67243 44250 -19174 -18712 2969 -30999 -45803 -72126 -59393
26679 -59393 1881 -7885 12243 98420 88351 539 -75751 -50358 -11316 5391 -36462 14464
26667 14464 55442 97509 73493 123107 133754 68546 -7594 -5906 -55380 -141784 -110910 840
26655 840 -28706 -52845 -43472 -32054 19583 34448 72639 10291 -70808 -68262 -50091 23465
26643 23465 38388 58145 52171 64824 90714 60443 15878 12560 17352 26110 66680 82615
26631 82615 14004 -62244 -99149 -45819 -23810 -91876 -137883 -119140 -102732 -47940 -19920 -21813
26619 -21813 46004 112534 79448 59869 -8450 -31530 -42520 -15531 -25541 -58352 -97283 -107059
26607 -107059 -91001 -62474 42317 118071 129120 104157 77685 3208 2452 70772 48279 -13223
26595 -13223 4682 -2730 -11455 -46157 -42759 -73919 -53184 -46999 18652 69875 102139 42252
26583 42252 14023 4352 47690 85506 32596 22159 48742 43611 67887 37775 52101 49392
26571 49392 94245 105290 147229 107007 5344 -26643 -20167 -73152 -16327 39520 24589 73739
26559 73739 120654 73557 9994 -56697 -82073 -126496 -140430 -73356 -90098 -44248 -14931 -27412
26547 -27412 -98656 -133757 -148132 -150524 -112431 -107044 -88208 -60796 -55664 -55240 -47826 -79302 -131400
26534 -131400 -99059 13384 1030 -21129 -84754 -108150 -111348 -39624 -13988 -31258 -91678
26523 -91678 -112262 -123635 -94839 -83530 -42528 -50705 -69278 -66529 -27323 -43500 -47670 35292
26511 35292 113406 137349 106709 5307 -22136 -29533 -6951 -3447 -6741 37454 -35855 -70461
26499 -70461 -57702 -134755 -110270 -27010 2391 -14992 -46902 -55326 -45309 -44562 -38439 -12175
26487 -12175 23488 31569 -31704 -8813 -33688 -2834 52710 38341 -19261 -74676 -122861 -119237
26475 -119237 -65056 7878 49379 113758 16276 3693 34636 31952 54245 30796 3059 35939
26463 35939 56069 53181 58423 25857 16258 -17525 9626 58625 39791 -9413 -5885 -28213
26451 -28213 -26634 -15107 40705 48140 2477 -255 12690 19495 -47964 -85915 -65581 -62364 -56174
26438 -56174 -36065 -89862 -42279 46918 61020 15873 20679 60707 39420 28191 -3171 -68418
26426 -68418 -110332 -94472 -86875 -60121 -13518 7479 -8403 65857 14651 -18196 5579 -14736
26414 -14736 -34437 -11587 -34341 -50706 -48448 7028 48197 25785 29479 39735 -10438 -51516
26402 -51516 -23045 10646 -39410 -17816 -6312 -8390 -76866 -70105 -52293 -40270 -3291 11779
26390 11779 12553 -36766 -102388 -50461 -37752 -9767 12082 41755 89954 98299 63099 24795
26378 24795 20866 4389 15223 -5249 -76539 -72262 -21953 -42552 -103524 -89839 -72675 -29577
26366 -29577 29763 2051 -95121 -94439 -40223 -36961 -44116 -21092 -92481 -79905 -52816 -36086
26354 -36086 -49311 -37373 -34849 -45703 11594 44275 89699 27786 -38631 -63048 -84388 -65233
26342 -65233 -64066 -80342 -96409 -120648 -83118 -26895 -34027 -1004 -35603 -30592 -42587 -65779
26330 -65779 -60571 -3639 63908 41911 12477 42319 29824 50531 2753 10194 56071 53166
26318 53166 33903 16191 -15391 -4735 22053 -26128 -67894 -85488 -24057 14869 23050 19112
26306 19112 23472 23429 -1603 38545 -527 -66894 -67848 -47883 -24641 16113 35059 -22875 -87836
26293 -87836 -35553 -43750 -99037 -31095 22340 63430 -31137 -39311 9855 2865 -29259 -27823
26281 -27823 -44059 -46294 -55692 -17653 -21037 -23680 -42394 -110150 -105939 -91336 -48969 -25154 16641
26268 16641 -5854 31740 116449 100051 52081 59217 52243 20322 19138 25668 15260 -5569
26256 -5569 -26509 -28439 -12291 -21694 -44825 -26324 -30066 -45875 53290 68577 17579 -14386
26244 -14386 8548 35401 52634 78220 85971 21885 -2955 -4585 -9405 -21710 -53540 -70708
26232 -70708 -77680 -30369 -7049 -53027 -61935 48824 97271 78442 43426 72919 22702 27974
26220 27974 28197 -12749 -44058 -63404 -47326 50565 37388 12819 -4363 59437 -20642 -95584
26208 -95584 -25143 6425 49187 83741 22611 -3752 -16026 -52261 -42347 -33673 -111983 -145123
26196 -145123 -131198 -81666 -9245 65013 90331 178069 167691 109593 91321 73620 74222 34243
26184 34243 43438 62324 23430 7336 14655 55670 83740 48801 -21264 -37147 -50384 -94608
26172 -94608 -90144 -37600 -44840 -47374 -66783 -61789 -9735 49213 50899 3771 -44214 21911 26547
26159 26547 21502 -3656 -52644 -60726 35363 54280 18397 12181 31772 -19455 -53053 -26701
26147 -26701 -26554 -99552 -54559 6267 -12382 -33161 -78145 -97295 -87943 -87041 -62300 -54174 -58168
26134 -58168 -84690 -21713 -68203 -47708 -46341 -62572 -47876 -59149 -60924 -7653 -21053 -33005
26122 -33005 -39788 -17649 -142400 -88509 42151 86933 32345 -9768 -36465 -33947 -80169 -133644
26110 -133644 -104492 -131929 -60858 8153 18961 -21690 -51905 -29619 -9916 42412 117844
26099 117844 114314 71265 4130 -13104 15819 34190 13611 545 32555 8879 28168 42017
26087 42017 52123 16890 -42180 -15091 -50751 -63759 3190 53139 36801 15009 -14952 52861
26075 52861 81284 54844 33889 26145 21451 51134 10748 24604 50306 8111 -7560 -16342
26063 -16342 -8709 10447 45876 88317 81181 91848 54370 18745 -8835 -27972 -40857 11229
26051 11229 58232 61135 126749 105459 64692 69972 59304 55422 -26545 -2994 59002 46040
26039 46040 -27652 -34014 -12994 17957 27392 -11247 22759 62170 50208 52450 62742 10260
26027 10260 -5211 -23267 -12090 24424 116081 165083 171998 138334 128464 119710 31784 29844
26015 29844 16177 27940 18890 36874 80982 65823 32796 224 27769 -8255 -22762 -46356
26003 -46356 14137 49534 7189 -43808 -96363 -65197 -87574 -96564 -48913 -996 11289 -41454
25991 -41454 31794 121276 82750 7195 46775 82704 34989 3656 13524 28272 62143 38250
25979 38250 -33162 -42492 -17086 -13885 55490 53309 27420 10860 25351 16948 -964 -25306
25967 -25306 -65011 -30277 5512 -9301 -20585 -37032 843 26098 -58872 -64179 -33014 -48600
25955 -48600 -69440 -42159 -27619 -35133 -81687 6824 74251 6982 -49053 -34235 -48537 -92789
25943 -92789 -97961 -75744 -34144 39757 11266 -23841 -29754 -44744 7012 83830 62329 18063
25931 18063 -37073 -73532 -41442 -9758 -47457 -100238 -137582 -127813 -80349 -35105 4229 -43552
25919 -43552 -59095 7817 -19207 33532 12079 -50009 -4665 -2630 -13315 -393 10581 25884
25907 25884 33212 19019 81141 75549 88241 66374 36351 78099 81115 38525 5963 41727
25895 41727 108454 107494 104798 115415 51628 79367 63030 -3322 5801 -13235 -93213 -86146 -74442
25882 -74442 -54745 -86551 -79322 -71342 17354 48899 -52164 -57595 -582 23736 51379 46770
25870 46770 48801 46559 30255 1801 -19524 25950 48746 44736 54161 26399 -40893 -13072
25858 -13072 -33778 -98942 -118368 -103505 -77569 -17848 -14981 -29678 -20388 17618 57833 87268
25846 87268 28301 -50406 -41957 -1629 1185 519 19057 -13664 -8975 -20092 -45053 -27330 -2398
25833 -2398 -1442 -1009 27481 76486 77319 82190 2013 -5858 35874 85176 30873 -4452 -4551 -47983
25819 -47983 -55881 -40772 4581 58140 71800 34456 -1036 -8459 35434 73648 65888 -17513
25807 -17513 -29963 -53421 -78374 -77125 -35786 -28304 42203 94912 64455 -19945 -70571 -93982
25795 -93982 -116998 -92039 -24195 -20109 -23469 13537 41353 -5083 -47174 -32452 -31659 23351
25783 23351 63933 66021 26503 67522 77621 21191 -14635 564 -16029 -15674 -59931 -68511
25771 -68511 -116494 -149346 -131786 -150871 -172996 -121610 -153276 -149784 -50078 -53300 -49083 -18335
25759 -18335 -53885 -92822 -23076 -2996 26344 -7984 8043 -15901 -22799 -50473 -76649 -44183
25747 -44183 -40390 -44884 -55645 -51799 -48092 -110652 -116659 -138613 -125317 -43309 -31011 -8065 20923
25734 20923 41498 69695 44938 11858 28724 46425 82409 64434 13951 -47479 39075 93405
25722 93405 103107 97507 111288 87253 72691 -3301 -60609 -81058 -50307 -102211 -177306 -180254
25710 -180254 -160309 -76248 -71105 -67100 -23502 -8591 34157 70506 -11885 9491 62088 78692
25698 78692 33669 -8573 17591 53739 67332 38501 51354 36259 -31630 5938 -77775 -87892
25686 -87892 -38780 -30842 -14068 32583 -28135 -85656 -30915 -5448 31911 -14685 -29811 -11473
25674 -11473 -31628 -28655 -77393 -120028 -126652 -109252 -66078 -29569 14830 18737 20115 -29717
25662 -29717 -60719 -34164 -47239 -66779 -87834 -60071 -38901 12818 28841 31516 -21362 -41106
25650 -41106 -11688 -19743 -35109 -34585 -27022 -29440 -5030 1307 17152 26723 47824 81977 93950
25637 93950 125340 105617 99811 101899 45168 31969 46220 49976 23680 26300 42984 41611 24557
25624 24557 35968 104440 47949 19831 57143 93821 133455 87435 52868 36061 22186 -40675
25612 -40675 -84681 -74917 -36036 20774 -31491 -106161 -99737 -80814 -50899 -59386 -70864 -61996
25600 -61996 -66600 -43865 -44055 -70199 -57250 -93606 -70971 -21716 21138 -10061 5848 49678
25588 49678 52286 4746 22291 -15425 -72038 -59343 -34638 -37097 -123429 -130245 -62950 -18989
25576 -18989 47549 69278 50021 -2255 -36300 -92268 -124542 -183644 -192012 -161906 -125233 -116913
25564 -116913 -117293 -67434 -20111 59638 75573 21387 -28350 -37248 -86918 -95968 -117897 -128136
25552 -128136 -72088 -10704 19568 19645 24852 -16791 -24100 -2396 9767 -11272 -16400 17470 2532
25539 2532 -67914 -40654 18930 55560 25312 6438 45591 28754 26011 24526 -24949 -38204
25527 -38204 -73567 -54797 -45742 -30947 -61099 45649 35987 4376 35406 -26571 -67174 -77629
25515 -77629 -3463 18867 41607 -7713 -95069 -44081 23193 -3023 12219 36878 53719 22621
25503 22621 -49597 -55013 -70116 -81345 -89691 -35494 -33926 -3510 19136 6183 -40461 -45541
25491 -45541 -46738 -81404 -16692 -43762 -77023 -50442 23850 63037 36001 21516 44276 57146
25479 57146 55277 -4606 -51469 -44596 16398 -27351 -39634 -31955 32403 41804 51805 49066 52310
25466 52310 34042 9838 -27055 -57397 -12388 29249 68801 84730 59596 92067 16527 -47111
25454 -47111 -18166 4174 -27999 27209 55629 38081 49522 57374 2518 -58422 -55798 58289
25442 58289 87966 50229 45310 40710 88379 85197 43014 22886 -33100 12223 22890 5957
25430 5957 27814 118844 136310 80933 35860 20528 -4568 -14113 -53418 -111386 -118875 -90911
25418 -90911 -67659 -19569 -17416 -57444 -64762 -136057 -122191 -61363 -65671 -55535 -112469 -108745
25406 -108745 -8731 19653 18436 -35078 -50453 -122410 -167701 -103922 -53472 -15749 22297
25395 22297 29503 39188 -1050 10289 23647 50124 58839 60830 68867 20350 679 -1879 41082
25382 41082 17605 -41762 19456 -11726 -31214 -69305 4712 54884 32040 -2066 -46021 -38369
25370 -38369 -10564 1436 -22051 -22588 -22929 -27918 37769 83847 20994 35373 86597 52338 29337
25357 29337 81641 105761 91658 61783 29874 -36207 -71726 -9298 -17762 -85396 -32930 8852
25345 8852 27781 63214 29609 -2499 4754 818 30196 -23608 6808 7523 20310 24236 23808
25332 23808 -26186 -49820 -23098 -14045 16993 -13369 15722 25312 4437 -14919 2119 -6250
25320 -6250 -56271 -45858 -18257 -42205 -82928 -123651 -81950 -42073 -29538 -37975 -22423 -24891
25308 -24891 -24491 -12040 62677 60466 49899 65068 113348 103074 28639 -29365 -8785 -16953
25296 -16953 -59137 -40675 -69789 -75532 -81409 15837 134488 154450 110587 44930 -713 -33956
25284 -33956 -2213 37138 -8476 71590 150771 95171 -38388 -78155 -14660 3856 -25813
25273 -25813 -65976 -38794 26178 60470 61358 18147 26330 -5596 -53193 -61005 -27827 -51638
25261 -51638 2975 -3743 -11813 9105 39831 76788 -18684 -120336 -80083 -26352 9507 46581
25249 46581 48540 38437 42575 48358 33600 57557 76842 53445 -24661 -83882 -110723 -161588
25237 -161588 -71233 -41345 -42576 -85853 -90938 -127118 -122922 -76498 7690 49159 25606 9055
25225 9055 14604 -24993 -39306 -54029 -52603 -68735 -98884 -141096 -125706 -87680 -75351 -46979
25213 -46979 -27089 14184 -7574 -51979 -10905 -42886 -79795 -46935 20240 47590 16054 49764
25201 49764 9773 26471 40381 39053 -20908 -30678 -44455 -68724 -64610 1927 76902 76161 13381
25188 13381 -21628 4412 -18254 -51061 -82254 -71858 -45808 -48768 -84194 -67862 -43670 -17432
25176 -17432 -14231 31649 62294 89597 -7086 7934 36043 6689 1173 27569 4744 28178
25164 28178 21773 28347 31587 106966 148505 98652 119360 136626 88822 18021 37679 104429
25152 104429 71937 32324 45532 50965 -5736 -32656 -42652 -47701 18148 -3380 4435 38998
25140 38998 50462 76338 153429 127953 61618 17119 -24932 -51223 -72577 -59404 -21847 -30733
25128 -30733 -20372 -56975 -33028 -44525 -41007 -48431 -36827 -73365 -104055 -136831 -106936 -43319
25116 -43319 -47499 -72221 -47411 14513 -30560 -10079 55026 35201 16061 18052 3962 7941
25104 7941 -22553 -13020 -21864 -64126 -101337 -67459 -4833 -26797 -82621 -50116 -22910 -44396
25092 -44396 -12576 -3904 -38832 20837 -5363 -46970 -25450 44809 53357 58875 8665 -28058
25080 -28058 -27790 14413 12775 -6143 -16142 14082 -11941 -58916 -16684 11944 21840 24606 43690
25067 43690 -26326 -41675 -37301 -36072 -30952 6695 46467 24111 -32595 -43199 -33581 -22978
25055 -22978 -15041 38337 41733 72081 116078 58546 4967 -56491 -66151 -66744 144 35647 20455
25042 20455 42142 3530 14820 8420 45698 63553 -6331 -48639 -25046 -10557 70139 91522
25030 91522 99263 90282 54682 -4407 -40005 -48417 12195 985 -6482 19258 119717 173953
25018 173953 165922 133459 -1035 -10968 -5889 -25939 -31874 -8034 13183 8302 -72683 -60757
25006 -60757 -55799 -128785 -56774 -89115 -122398 -73748 -91437 -78842 -150250 -69293 70286 87340
24994 87340 83767 50866 11654 4515 19925 14607 -31150 -10819 36457 79556 84895 79202 -2667
24981 -2667 -5924 -66945 -113946 -117309 -76591 8498 35563 -5094 -9621 -90551 -96322 -150 23388
24968 23388 -21060 -37519 16177 35583 16499 44933 74926 53423 -815 -42366 -43433 -48153
24956 -48153 -68240 -105058 -88433 -71389 -88763 -85316 -107169 -93306 -58998 -44189 -36982 7528
24944 7528 20153 39159 23609 18204 32497 47329 64345 106925 48621 24502 65640 122627
24932 122627 120525 90113 134255 202496 111105 22145 49836 89937 131841 185290 153174 145443
24920 145443 153410 95664 -957 -64650 -29883 -4074 36997 51729 96194 41367 -2898 -70176
24908 -70176 -13705 27703 17839 39896 54534 -16208 -108555 -111566 -23254 10035 -13224 22733
24896 22733 -20313 -72685 -80936 -95595 -76310 -10529 30017 15033 -63958 -33496 26168 66818
24884 66818 44943 43598 43844 -23050 -26729 15657 6093 -11918 -42247 -39480 41134 105302 105759
24871 105759 99527 84268 78035 106445 134109 117060 7452 -13450 28600 38788 42262 3308
24859 3308 12829 11585 15919 94996 67353 55606 53029 23150 23886 88521 93556 126231 105544
24846 105544 67421 13093 -41862 -22850 65861 80526 73111 44720 53293 26941 47039 13765
24834 13765 36387 89751 86941 23617 -20194 -64069 -21449 18466 -60776 -90612 -64602 -92811
24822 -92811 -81815 -42504 -2773 26016 13410 73418 68043 -30159 -65317 -49402 -118973 -98993
24810 -98993 -33233 12853 35384 -13048 -30882 -7778 -1784 -1461 48303 110508 126290 127273 58963
24797 58963 56132 34027 8274 4631 -32809 -46590 -42512 17332 -26721 -84938 -96520 -43294
24785 -43294 7771 33905 46733 26171 11064 -11783 -41984 35517 27752 6895 35168 40358
24773 40358 72765 147331 119892 101299 73104 30539 24684 62707 42884 13848 -20989 -66482
24761 -66482 -11432 29998 42273 35451 71232 83880 44058 1549 -43851 1189 30891 29083
24749 29083 54810 43144 67720 28133 -40021 -41718 -30512 -21962 -49089 -43800 -24 9276
24737 9276 86230 144674 117834 67937 76164 102739 67323 75700 79257 56511 85764 106289
24725 106289 97804 68663 78569 92670 26906 -5323 26304 10464 -30807 -77949 -112263 -114167
24713 -114167 -80220 -44315 -39110 -78359 -76126 14584 12585 -49421 -35784 -10142 22368 19900
24701 19900 -11596 -29783 -59907 -83502 -40468 -1541 41867 81113 109700 87840 23623 -57963
24689 -57963 -79195 -5882 54557 42366 57881 24855 12717 -6328 -30385 -14009 -11854 -41853
24677 -41853 -72284 -55789 -39474 -58410 -43056 -7159 9529 11085 27311 21872 61799 60538
24665 60538 -9668 -57642 -6238 18938 55443 46661 8600 -30651 -58106 -112828 -73279 14380
24653 14380 -4744 -24336 35181 52644 67644 93273 94153 48219 20134 -14658 -19709 -60830
24641 -60830 -94058 -67815 -44118 -6963 -32696 -60240 -28755 -52696 -119214 -102700 -75945 -46616
24629 -46616 -59447 -64776 -37338 -26492 -24225 -34533 14248 26303 13886 4275 -42 34191
24617 34191 72756 53683 39427 38045 64560 115649 80657 68637 102930 114427 115402 66622
24605 66622 54828 53148 68161 108950 724 -41855 -19833 -48227 -47460 -13593 879 -4339
24593 -4339 -31757 -87261 -85077 -20451 -65940 -92851 -53560 -43212 -25572 -68460 -77622 -64889
24581 -64889 -94934 -97941 -58020 -19199 -59197 -33569 1766 10798 47670 74507 50422 22346
24569 22346 10497 -45103 -78832 -46537 -60251 12971 121227 140088 88719 41706 60625
24558 60625 42409 17375 -5197 -36679 -76512 -130504 -103522 -129135 -105429 9189 49418
24547 49418 35541 25188 9180 -29109 -13535 3954 -1392 13106 2144 -40520 -29938 17332
24535 17332 10703 -23352 37140 105088 78595 -8108 -51522 -39625 -54393 -15809 20477 -45479
24523 -45479 -53047 -7760 -13633 27337 56719 2010 14037 33891 40947 6103 53861 49605
24511 49605 28332 -1109 -19570 -71270 -61475 -78445 -111463 -30874 46126 89203 108972 24774
24499 24774 6097 39177 81489 109176 85271 51516 -5743 17424 9789 61220 59018 16230
24487 16230 7336 -23608 9989 34498 38184 22938 7730 9993 -25378 -77812 -84726 -82763 -55069
24474 -55069 11796 12254 4897 15742 60246 87148 49199 15679 26699 33473 3792 -13989
24462 -13989 34316 109960 120280 40958 6826 1996 11176 24990 21780 13745 10326 56035 100194
24449 100194 14688 -36393 -24625 -8565 -15022 -65604 -74068 31607 44495 45746 11456 -26712
24437 -26712 -33143 -38969 -3476 35949 43964 38674 41624 55421 70833 56621 49309 60172 78619
24424 78619 111947 124300 97879 83181 34934 -21352 -50084 -69371 -64236 -728 -11563 20666
24412 20666 56093 26230 63980 43463 76232 98087 112741 82527 45355 67359 93743 103482
24400 103482 35452 -6103 -42831 -53345 -45426 -40021 -49841 869 18137 16762 12455 39924
24388 39924 92246 92399 69474 64699 3303 -49522 -70733 -96779 -88216 -112788 -143639 -118504
24376 -118504 -68725 -47592 -44966 -10938 24716 45433 10170 54667 93569 64552 -22533 -54863
24364 -54863 -31713 -9486 -43182 -45505 -6861 8690 17355 40692 33226 86498 89541 39088
24352 39088 60829 76112 38370 35358 67928 122349 101833 98697 119597 133239 180787 173443
24340 173443 125011 111686 87229 89211 52004 66067 75819 71738 100630 56410 10838 -9188
24328 -9188 -31179 21426 58328 46771 4952 -20085 23742 78234 116981 119840 92417 36792
24316 36792 -25059 -91539 -110148 -65984 34827 52579 51098 75633 14583 -15863 24336 69782
24304 69782 75374 66316 -6213 19427 78358 -435 -80162 -144494 -114436 -29652 55288 64919
24292 64919 33529 41119 114010 144902 75768 35660 15955 48253 55353 -2061 -8989 -24575
24280 -24575 -24648 -1315 15397 26916 33894 28192 12217 -5510 -38263 30474 105694 108762 66093
24267 66093 54948 -11073 -50117 -45671 -8320 21074 47647 52515 16357 1657 10848 -9198
24255 -9198 -17572 -39452 -24655 -19213 -87992 -139142 -58268 25777 98985 174925 114584 66498
24243 66498 75156 44617 45886 11434 35999 82847 118915 140255 131301 37127 -13926 -7055
24231 -7055 37285 60459 95370 76673 38521 -22005 -74521 -82134 -49235 28968 8816 -19008
24219 -19008 47621 97426 113808 95483 48604 11223 48318 64547 74872 83795 30072 -16694
24207 -16694 35394 13878 -1390 12631 16481 25774 82948 70007 69062 56526 58338 33137 1358
24194 1358 -22795 -3349 67372 56152 32156 -10634 -26510 -66962 -80222 -54799 -33536 2134
24182 2134 -3952 1798 30053 71817 -4575 -43961 -46485 -39596 -48124 -15231 38533 46406 -12159
24169 -12159 -66235 -78988 -73565 -30922 19111 44609 25663 17533 -1659 13252 25857 20468
24157 20468 41930 81977 81756 46298 -31068 -69558 -37327 22892 86142 42384 19937 59587
24145 59587 -1979 -41701 -5752 12398 33900 81018 127836 115648 104131 137311 139017 73385
24133 73385 79525 106759 120095 107374 62563 5157 6570 20683 60123 105970 108864 89237
24121 89237 63191 52731 45067 -10478 -23375 -45502 -81518 -39840 -3214 70774 47278 47265
24109 47265 62059 11099 -56650 -84061 -55128 -59066 -58153 -33559 -71181 -48980 27045 58596
24097 58596 79627 39924 45245 88257 90300 4917 -104666 -108376 -30718 -17597 -6180 6414
24085 6414 8861 46477 63996 55439 56610 23506 4514 30789 27268 7046 91108 105378 80670
24072 80670 67917 135252 177169 188505 176504 150401 138477 138986 128093 108894 77750 105172
24060 105172 137770 68376 48391 37280 46491 35127 60514 37091 29688 86845 85121 73075
24048 73075 67113 67508 54085 85277 84579 97135 99590 72962 35943 -20682 -26268 45309 -11210
24035 -11210 -44595 -61946 -71739 5509 77160 70388 73578 110099 83891 68485 75130 115021
24023 115021 123767 65628 57411 53561 50490 66026 29197 30274 59121 49445 68302 80886 90575
24010 90575 68522 36072 -12782 15445 38862 44314 71310 80417 31811 62279 42120 -14902
23998 -14902 -23226 -26473 7894 18640 61681 46688 60320 91639 126399 182361 164131 52462
23986 52462 77309 137542 158814 169973 152769 119769 70540 67245 100030 98890 100005 118429
23974 118429 63060 10133 45623 45481 -19360 20587 40872 39589 36395 56478 32956 17633
23962 17633 65959 98432 114739 100987 143935 166239 92081 27524 419 -6743 58855 169496
23950 169496 148263 54916 -1541 -51302 -43310 16210 30328 40126 72449 86500 96048 93447
23938 93447 115005 143084 138844 87649 58672 46868 87314 71269 75341 13938 -42201 43828
23926 43828 61742 87379 95676 61110 3398 46105 55740 25656 62463 108914 164322 125827
23914 125827 169622 147813 96318 137311 156158 148877 142514 39951 76920 107080 83661 95882
23902 95882 70766 87360 93858 46914 63182 69365 65693 78500 83270 97496 90501 74355 68076
23889 68076 127985 186093 181494 146956 141433 147319 135793 100122 91512 22464 -21804 4217
23877 4217 54319 119381 125661 186730 147502 66095 -940 16249 41069 -8693 14664 63632
23865 63632 -19344 20513 65000 94735 42058 34274 111365 186288 140294 47735 41477 96437
23853 96437 162784 106067 49266 88517 147135 222180 219225 126657 76661 35701 47219 31711
23841 31711 25573 57639 83166 171220 229490 178139 261951 220408 154676 205984 216091 118919
23829 118919 92004 137832 126456 122504 106043 107648 114533 116954 138490 157318 183098 104701
23817 104701 53912 47328 26086 34627 33856 29611 39883 47022 29104 26655 60406 68015 60655
23804 60655 46294 51013 74944 133217 139822 152892 164144 128985 82828 123366 146598 105088
23792 105088 117250 140265 127268 129677 136026 139213 203241 179938 161849 137764 140128 125412
23780 125412 70360 62766 166939 194966 179582 167651 137634 123856 130176 160180 189823 136340
23768 136340 114317 121033 216965 231152 243004 210397 146937 100293 85953 29696 -6463 45049
23756 45049 68370 108623 93234 111390 118600 152429 161621 191340 135854 39726 47556 96284
23744 96284 89982 152678 170761 161058 92437 75182 41548 24598 58627 -6555 -21167 -6084
23732 -6084 31889 44684 79228 77816 99425 97652 196700 212051 202231 152964 157190 162604 184622
23719 184622 207215 191420 154786 132373 182348 228991 263443 191070 103499 114089 117285 128723
23707 128723 185510 233458 225643 223654 241262 261047 216864 135672 80736 116782 151917 177959
23695 177959 202652 190569 209563 235816 215971 208004 175091 168611 160255 142422 190517 209525
23683 209525 165302 201358 234581 274675 275593 236891 252031 219721 129172 127509 212880 227680
23671 227680 168975 109830 53143 63328 169814 228226 197686 151030 54178 752 28671
23660 28671 103188 112360 139326 112032 128322 119527 112313 144755 158115 124656 81439 88248
23648 88248 96859 155043 213297 232109 225821 206094 221217 269162 271658 259589 282865 195552
23636 195552 221806 280901 228691 208817 182827 178958 160081 192846 273101 270095 242188 255036
23624 255036 328522 323913 264055 295260 284345 270780 218393 254867 239685 197049 160093 91821
23612 91821 102556 111780 108567 129913 170416 253750 264837 287942 303360 238004 243428 246415
23600 246415 223556 193695 134345 153377 223673 242591 238945 263584 231787 253592 254484 241028
23588 241028 257889 298255 289579 210820 213359 262879 240719 221869 217139 175761 188679 188254
23576 188254 263776 322216 320821 296769 230879 219139 251493 268282 268896 268638 242366 259628
23564 259628 258190 213592 195240 236194 308714 323080 256950 241784 277734 351693 332989 315841
23552 315841 336373 352395 402492 340614 272097 306287 347532 339766 325540 278620 277678 259715
23540 259715 246297 234720 235381 255416 260730 265838 326610 325396 250262 211041 233472 284872
23528 284872 248335 280769 282850 246281 262656 264990 247504 323782 431793 379989 334142 307719
23516 307719 302127 271524 240996 253182 301039 360273 365111 335929 375963 405703 358321 286230
23504 286230 302330 310046 342963 347652 283251 303005 297632 262645 305152 342815 376452 366955
23492 366955 397877 405969 345239 346004 402196 399858 395629 386901 377741 387662 373954 338439 329700
23479 329700 414523 469365 485565 450947 407626 351469 259744 230128 260601 263457 236144 255633
23467 255633 282770 241467 217800 293680 327570 334606 353281 394935 366344 377189 370300 385643
23455 385643 361723 358745 325233 379057 447739 433551 414155 432573 460695 453264 512246 518323
23443 518323 532371 577461 547352 533945 527214 480689 465053 475856 493785 476702 489262 533823
23431 533823 507179 472221 384118 316611 334466 372568 384396 349297 332373 329165 338555 386707
23419 386707 420464 418000 387632 348873 375785 379752 410048 469103 498216 488551 456015 410074
23407 410074 404914 418255 458373 516667 529205 492635 488238 453269 441836 502396 553627 585268
23395 585268 574546 525982 487227 410026 453392 515275 502150 509810 540884 502170 475640 474122
23383 474122 486057 548615 516293 483443 536886 545878 537636 532793 578098 583471 537654 501452
23371 501452 488370 453445 465664 486925 518578 564758 517627 492726 454444 465390 525766
23360 525766 574558 555787 527481 568683 549377 519244 578171 618181 654438 615673 567463
23349 567463 589928 657417 652968 637949 637843 654023 622257 619653 630473 616237 543465 576262
23337 576262 586267 570221 586967 635042 605835 611488 654531 677024 652015 633827 637128 653421
23325 653421 625775 547785 532895 602592 666271 703247 744770 719765 698087 733188 732726 696517
23313 696517 707947 697383 643032 580265 589543 610006 638596 709933 719611 730293 781116 786839
23301 786839 738172 734905 770283 763111 727639 712127 735665 731787 759841 758618 784789 805435
23289 805435 853676 843709 818039 820757 807530 834243 903868 898147 893097 878670 903884 855818
23277 855818 786168 798480 800875 818265 811815 833143 834389 846711 917895 956393 949166 964371
23265 964371 954067 955616 942248 967453 952135 975269 950405 915362 932978 970298 1026056 971325
23253 971325 943253 969438 961372 949109 1026156 1038353 1020114 1050352 1002026 943024 975849 985401
23241 985401 984416 1018515 1022973 1042288 1065137 1006953 1029418 1045929 1051378 1108205 1177674 1194002
23229 1194002 1219737 1183580 1115411 1101635 1094431 1086324 1104078 1115280 1175035 1164597 1209229 1235627
23217 1235627 1277588 1314820 1273005 1235333 1277978 1289939 1299540 1280805 1226081 1252900 1292321
23206 1292321 1361086 1435759 1397772 1374487 1312598 1299129 1316856 1334338 1345050 1370019 1362397
23195 1362397 1416161 1461325 1483990 1496187 1488260 1472597 1461616 1441743 1446312 1501380 1618979
23184 1618979 1635072 1620438 1594026 1605895 1606263 1583219 1568495 1538229 1588940 1611570 1572124 1570023
23172 1570023 1586147 1564116 1560788 1587721 1524070 1546621 1647457 1674010 1644766 1664587 1687464
23161 1687464 1746950 1749090 1755156 1747302 1820963 1891358 1854205 1799682 1776396 1743353 1766726 1814018
23149 1814018 1890786 1898123 1937308 1911642 1926811 1971209 1996749 2010707 2031914 2035791 2045726 2027403
23137 2027403 2039139 2047617 2054790 2095480 2121573 2155841 2215862 2244981 2265947 2220934 2180168 2214608
23125 2214608 2250956 2202654 2222906 2238894 2276873 2378969 2362887 2419330 2459696 2473188 2480787
23114 2480787 2535060 2538405 2517224 2512505 2567785 2645001 2684455 2665254 2683557 2707254 2663611 2632744
23102 2632744 2642078 2710156 2772013 2826052 2850303 2802327 2806406 2816814 2862775 2951973 2936098 2917304
23090 2917304 2961828 2982968 3014227 2996573 2999779 3049241 3076360 3164174 3236032 3299184 3366874
23079 3366874 3364500 3372204 3400579 3372220 3366583 3373705 3470246 3502408 3498995 3561107 3595799 3618609
23067 3618609 3574749 3538528 3602760 3619519 3645052 3711938 3806846 3792831 3800314 3868015 3953175
23056 3953175 4008725 4095848 4142325 4108630 4158556 4261140 4249864 4243835 4276952 4303232 4255776
23045 4255776 4286852 4387897 4471383 4527222 4558373 4612957 4721465 4825383 4848995 4838411 4877630
23034 4877630 4907500 4926478 4965008 5157758 5225745 5194176 5233641 5263647 5316240 5386221 5545653
23023 5545653 5622062 5702852 5730751 5724184 5760993 5854818 5913414 5970483 6058106 6117497 6164904
23012 6164904 6196798 6206742 6288005 6382508 6472047 6545307 6632541 6672796 6783655 6895540 7035256
23001 7035256 7195531 7309326 7373419 7471026 7564302 7652442 7786730 7889286 7996050 8030550
22991 8030550 8106433 8212649 8312756 8455393 8584405 8752964 8836079 8885404 8974552 9142293
22981 9142293 9289777 9409825 9516028 9704099 9825353 9941166 10076163 10235798 10419193
22972 10419193 10589144 10815978 10958241 11126641 11303964 11452675 11622938 11783010 11927755
22963 11927755 12099724 12293815 12480840 12647626 12849509 13075766 13277048 13491505 13761769
22954 13761769 13994659 14217220 14500817 14747269 14978128 15208736 15399704 15649058 15956852
22945 15956852 16291121 16575517 16924703 17257534 17498411 17804176 18102243 18417489 18764361
22936 18764361 19158595 19513328 19884872 20305317 20709082 21091144 21447022 21892192 22367907
22927 22367907 22788189 23274324 23795070 24283486 24738804 25287559 25874780 26414099 26964868
22918 26964868 27511739 28078397 28715168 29329754 29957013 30580833 31282586 32032848 32705161
22909 32705161 33411039 34176917 34945310 35691496 36484347 37298601 38138748 38999576 39864629
22900 39864629 40792659 41695394 42657338 43678686 44739110 45720095 46774981 47750406 48816770
22891 48816770 49925449 51081219 52228151 53332886 54550644 55754528 56951216 58149643
22883 58149643 59415556 60682295 61974556 63274606 64628708 65912866 67193643 68432944
22875 68432944 69701824 70968882 72275950 73532281 74708440 75902861 77030169 78111327
22867 78111327 79209473 80283453 81242538 82174103 83145166 84023871 84818770 85523146 86217671
22858 86217671 86872690 87397481 87805815 88166040 88448854 88601055 88654939 88600440 88571100 88436787
22848 88436787 88283877 88014299 87635280 87181519 86666709 86116191 85418092 84646759 83843122
22839 83843122 82986671 82044464 81090396 80120216 79099173 78019830 76957847 75856569 74692205
22830 74692205 73469664 72305173 71066759 69827677 68586005 67293886 66083755 64890042
22822 64890042 63682684 62448210 61193568 59942759 58751488 57568659 56395930 55234857
22814 55234857 54106816 53037179 51947369 50820214 49713393 48665279 47646062 46666240
22806 46666240 45715185 44765389 43783329 42813947 41883595 41003128 40179188 39366899 38560050
22797 38560050 37724500 36947544 36183190 35413351 34654995 33881976 33229441 32661821 32036764
22788 32036764 31306583 30653354 30057616 29475928 28902510 28312988 27734146 27211962 26698517
22779 26698517 26247024 25686952 25172990 24695295 24192057 23737595 23271163 22840905 22420817
22770 22420817 21986489 21581385 21171896 20763888 20380066 20034513 19704484 19373891 19006639
22761 19006639 18693226 18373080 18044984 17698457 17372591 17072588 16782115 16541100 16316820
22752 16316820 16044948 15781431 15533103 15280269 15077260 14878773 14689257 14476181 14223553
22743 14223553 14002342 13854935 13670330 13411503 13169166 12947212 12758478 12518758 12279318
22734 12279318 12116956 11990014 11816971 11672870 11533496 11365218 11208633 10989065 10796646
22725 10796646 10668657 10479018 10312714 10151451 9991222 9865601 9751650 9653744 9522734
22716 9522734 9379020 9245609 9151129 9037706 8911180 8877993 8836315 8699861 8549232 8432225
22706 8432225 8294471 8217146 8135152 8025306 7922025 7833306 7745521 7653098 7597042 7485737
22696 7485737 7383820 7363397 7280944 7160644 7007759 6846323 6741963 6680278 6617472 6602373
22686 6602373 6534106 6490683 6426902 6326440 6184293 6097513 6095582 6044086 5963651 5859985 5732733
22675 5732733 5659180 5657622 5669630 5628213 5557463 5476794 5406895 5374839 5266396 5215333 5165961
22664 5165961 5113840 5118242 5081873 5012967 4968970 4855244 4803722 4736175 4702043 4683312 4596652
22653 4596652 4527240 4534138 4428877 4397400 4341767 4321009 4319329 4282934 4182910 4126297 4036502
22642 4036502 4009991 4016119 4003077 3963652 3960536 3940749 3953230 3978003 3927831 3883573 3792821 3677907
22630 3677907 3660525 3690737 3665002 3669883 3658404 3584070 3553520 3503918 3478393 3467112 3446473
22619 3446473 3399588 3379177 3313498 3298392 3343237 3318000 3284575 3244468 3210911 3223227 3183085
22608 3183085 3117321 3071113 2988149 2974821 2994316 2963224 2957446 2941178 2916607 2855284 2793229
22597 2793229 2834534 2859475 2844129 2805345 2785046 2740093 2738430 2759286 2772121 2749547 2766943
22586 2766943 2772917 2710436 2699869 2681424 2645346 2583610 2566015 2564987 2519901 2463359 2487105 2465748
22574 2465748 2472653 2517359 2551587 2463716 2406231 2343900 2264751 2227204 2260758 2269757 2290813 2319606
22562 2319606 2297689 2262456 2228692 2204704 2169263 2194577 2205418 2182395 2237997 2239046 2164786
22551 2164786 2094242 2050709 2067078 2090298 2024541 2017426 2058697 2037202 2028806 1975157 1950346 1930480
22539 1930480 1928548 1942210 1906033 1863776 1938454 1939527 1965055 1942132 1926412 1881479 1840446 1859341
22527 1859341 1834304 1832833 1781080 1724692 1736230 1800467 1789258 1698852 1654722 1660550 1668184 1701809
22515 1701809 1750389 1732162 1725342 1713375 1673083 1655052 1613696 1579062 1535926 1516299 1550245
22504 1550245 1520446 1487243 1509854 1534019 1572823 1575586 1592049 1607741 1609257 1574969 1520178 1463834
22492 1463834 1445949 1441742 1416390 1428228 1450297 1451906 1485778 1473588 1447027 1517198 1569659 1525395
22480 1525395 1408461 1321223 1322588 1373633 1459147 1396727 1342455 1339048 1303985 1302702 1287097 1299769
22468 1299769 1335250 1278284 1286163 1274633 1225075 1290533 1288640 1333165 1337535 1278109 1246201 1265761
22456 1265761 1274526 1226488 1146030 1111799 1086671 1092808 1116593 1155034 1238773 1230889 1142236 1091109
22444 1091109 1125698 1121986 1166726 1194949 1223022 1250330 1192725 1141484 1169303 1172868 1132271 1142258
22432 1142258 1049668 990299 1035591 1029246 981897 1001762 1063838 1082123 1084167 1073739 1046666 1039404
22420 1039404 1025339 977400 1024798 1079328 1080906 1042770 958457 911203 969473 965275 979858 1000898
22408 1000898 1019841 1044373 1020787 987550 940980 926652 905551 880745 908570 932935 936999
22397 936999 873896 833364 885778 959449 1023363 977961 922511 881085 954877 954669 908633 861353
22385 861353 833636 877245 825592 861255 929487 938229 930807 872727 845631 864091 902162 930642
22373 930642 929496 921443 879824 865218 847036 882347 876760 877003 868358 849077 809359 757091 711702
22360 711702 746899 812965 803180 753891 765050 777006 757366 729711 715885 695191 691049 662525
22348 662525 704820 705215 756977 761985 699602 710507 766969 733340 715387 682060 648926 597967
22336 597967 639604 694009 695835 674426 704056 725390 764577 764291 792561 785258 758012 744838
22324 744838 674275 659895 717507 697938 661578 676615 714158 691170 713326 748607 712946
22313 712946 697536 661958 665990 624885 602600 664236 652546 644073 595381 606209 594504 607222
22301 607222 607164 615398 568233 542411 614826 615958 587061 559848 574195 600021 556940 554274 513975
22288 513975 508669 543466 590205 583362 547588 564851 607702 592230 571843 547745 517788 485950
22276 485950 449450 499934 552950 590150 572804 550903 560666 518921 541520 546992 550491 509134
22264 509134 420213 418892 472146 513995 462933 429235 396989 445040 480474 432778 355786 360385
22252 360385 369394 439101 500126 509204 474029 497742 477365 475310 525102 529333 523729 523940 549633
22239 549633 545849 534451 585045 557677 552354 591036 598829 609360 572530 569001 563820 509718
22227 509718 442163 432609 498537 546794 574054 604192 604517 552636 552875 502725 473234 540102
22215 540102 587003 555763 471104 429425 521460 536406 494595 435560 418981 363109 345490
22204 345490 404398 458523 439391 436161 470866 517252 533921 551168 512197 483747 422280 370862
22192 370862 334787 346143 406143 454374 451855 378642 415237 431848 414024 404158 443081 498887
22180 498887 429228 341511 354884 396892 410486 419284 413715 386909 360811 362689 373988 402869
22168 402869 470493 508764 428730 416371 428262 411202 409857 431668 411815 385245 373513 363244
22156 363244 345345 301040 395592 400414 418514 421025 354618 357299 402766 365128 347249 325651
22144 325651 264038 290430 401411 396921 370544 378634 361186 355397 366952 405246 383263 354726
22132 354726 311520 276656 310017 342274 357572 354280 262661 244755 268781 272932 295727 359097
22120 359097 393386 427199 406603 382945 342816 362718 361600 346144 294619 267853 299068 373063
22108 373063 354759 365577 377041 380789 397527 388981 384199 329210 310027 354220 340293 297982
22096 297982 325469 310440 278717 307134 350558 396665 377458 369737 318751 273773 239581 257735
22084 257735 335733 324840 259319 291579 334979 324101 232722 246502 288758 312647 326695
22073 326695 302333 291163 303959 295643 284046 320432 306011 257313 226223 282207 258544 245763
22061 245763 226128 303980 302363 246218 247745 276577 250893 220032 226229 228433 178135 244121
22049 244121 318309 368353 387919 341487 300009 267723 239375 184411 184563 226209 286233 325603
22037 325603 314872 311572 331798 378570 335944 257298 247726 305002 300968 283998 243537 218182
22025 218182 245458 228115 276141 266903 281015 321423 295410 195848 187891 161000 122734 159460
22013 159460 184158 157668 196797 261693 247156 266381 269583 237036 203125 230398 235421 267066
22001 267066 362959 338764 284262 256678 286550 296643 263469 262436 235867 228673 199038 179152
21989 179152 188998 259688 267334 266362 242862 251513 222626 213201 223627 246929 256541 266202 215701
21976 215701 154601 177071 220567 208541 171536 184507 219642 225536 246795 251519 194345 170652
21964 170652 158965 123055 159160 226776 278926 244334 244138 231510 253125 261036 290059 266516
21952 266516 280893 297268 241846 274459 283850 230998 230664 187855 233908 249565 306391 287065
21940 287065 265088 316722 306475 282486 248813 172712 106320 73711 120842 140038 114104
21929 114104 122275 48681 33752 104979 159739 187409 240600 285451 242551 203969 222053 179229
21917 179229 194309 185784 208501 211344 222993 205579 226030 238008 178302 167209 179159 158272
21905 158272 161358 125222 96279 116357 94325 132842 176536 175515 230997 300027 250852 239401
21893 239401 290135 272570 174530 142829 166252 211332 213398 164996 113746 117103 154274 252109
21881 252109 254135 248091 224243 184640 123161 111440 162351 184028 157563 155668 147556 144398
21869 144398 151258 134383 163197 212765 234119 235624 224242 206820 171897 201516 231477 261718
21857 261718 205225 174325 198222 142609 123677 126083 115111 112044 153225 161526 217283 199753
21845 199753 195999 204072 153683 117659 143788 148983 98466 59160 85970 115072 186721 228330
21833 228330 201108 188631 130776 59579 67066 115957 133543 133021 151833 123531 79454 105658
21821 105658 101971 75905 21497 31986 89264 104523 50102 97505 139530 174048 205163 250552
21809 250552 254657 134701 92459 73043 16229 -798 43395 92949 85924 45239 27839 57061
21797 57061 187451 182220 186496 206346 168547 198706 222041 238012 200629 133448 92547 47746
21785 47746 68414 110147 161182 156273 162199 135781 130504 146998 120138 116751 76920 124270
21773 124270 162443 131164 96193 91016 110088 108422 47363 29822 100911 75830 3001 15575
21761 15575 4374 51018 154616 180188 131974 107647 61786 87982 62909 50588 103634
21750 103634 120187 133616 151239 126992 88160 105368 125205 136175 105872 90567 185395
21739 185395 214210 152525 120489 103401 113114 131976 120576 115495 63725 90393 129101 146863
21727 146863 186902 155467 59447 49217 139997 159037 150211 156596 75621 49925 109167 138938
21715 138938 150224 127413 88916 98626 102007 101537 117382 161673 145663 107671 99167 30588
21703 30588 130746 113942 87512 85018 66406 98811 65300 78102 25542 24932 25764 48476
21691 48476 88601 50557 66939 120339 116444 141898 91276 65699 112138 135100 171109 228620
21679 228620 220839 142028 109589 120722 89878 90154 136785 116416 128744 190697 113886 166332
21667 166332 173661 80233 35888 70598 97326 130806 140411 90435 102800 149522 157988 141812
21655 141812 139446 96961 131064 111437 101027 154204 164772 173489 139937 127905 177509 103879
21643 103879 97380 136592 125043 75390 37971 117502 161037 84053 17287 51523 53725 31132
21631 31132 40761 91330 97775 161318 156911 134931 164450 152216 117307 134074 135599 151628
21619 151628 170269 151306 203626 223937 150814 125639 108531 132175 106610 91328 90091 43173
21607 43173 71984 111422 175213 146847 75921 75423 129868 98557 37010 -13560 -2631 30598
21595 30598 48628 4058 -51284 8832 27118 11017 98699 116239 79930 72871 97668 54675
21583 54675 -17254 23321 111199 161946 159361 130792 99383 58439 41505 70408 16639 30244
21571 30244 46717 33218 77491 63460 1045 45844 127646 129559 79521 68293 54814 83912
21559 83912 106326 70879 104277 105566 67131 67893 24800 14986 43351 46267 29483 -1725 2807
21546 2807 60085 91937 97531 114982 126188 161300 106138 72627 125329 126255 126400 90404 110163
21533 110163 128133 140724 98361 65546 26625 18527 78853 127435 78412 -2348 3932 23373
21521 23373 66911 158596 198165 179540 178533 179908 118051 112690 154400 196132 157754 152218
21509 152218 200087 204973 118801 73782 80784 82686 89842 106084 57445 48849 118142 147780
21497 147780 134783 136612 113773 118137 114498 84370 38132 11603 24098 49459 -21800 -31851
21485 -31851 58003 128032 134006 103450 138663 103256 35809 38412 53153 60798 67080 8885
21473 8885 7576 -21446 -3516 75554 44419 57185 80289 90722 73487 70691 71876 50349
21461 50349 56817 10337 -20323 21883 72297 69171 72912 95582 96602 53810 31785 70405
21449 70405 19257 10005 38890 15236 21903 36208 59503 88715 89470 37244 29930 108102 169597
21436 169597 139156 105185 121898 107423 7687 25783 100129 178882 178848 128572 124569 52840
21424 52840 -1792 -31011 -7942 -6671 51099 56316 18221 24234 81092 107500 68995 72928
21412 72928 84860 75314 78841 85224 117329 156217 192192 174732 76291 90673 108465 102353
21400 102353 128689 65502 27831 31013 63729 23505 53936 38992 68175 110808 136172 96064
21388 96064 57681 88735 141624 113113 105753 61410 37717 59527 44930 97028 104249 40776
21376 40776 51460 54179 57793 100405 157260 122911 73715 105959 75464 13454 -9848 33272
21364 33272 29524 8452 54456 93089 114939 111962 51069 -74741 -125158 -73671 -6004 80231
21352 80231 64003 1888 -43310 -61339 -83418 -22857 6995 58838 103633 84490 56139 -29350
21340 -29350 -72527 -64471 13688 42623 -16147 -51712 -30779 282 87741 113659 131123 126918
21328 126918 145270 89200 6816 26057 54442 62797 77878 11385 -21767 -7333 12304 -23943
21316 -23943 8469 49430 28683 -20417 2920 9527 31016 48592 76529 126969 109713 45172
21304 45172 53677 40499 -6507 44283 60039 55155 77738 54438 2878 -32814 -16399 8330
21292 8330 73969 109086 86302 62614 81130 59541 48308 69333 53707 72928 51574 52605
21280 52605 68838 85322 117203 92600 36035 67782 112094 114223 45796 -20063 -10836 -1029
21268 -1029 18522 75871 107586 82776 63409 51325 21164 27550 19326 43191 105123 89619
21256 89619 38176 49982 96917 127191 135936 104524 71499 56388 39328 1581 45662 45287
21244 45287 2183 -43886 2863 60021 67652 25143 36699 44063 6339 -79004 -62314 -29936
21232 -29936 402 31496 55383 69031 75867 100877 103416 98201 72100 84707 34826 51595
21220 51595 70584 59133 180 4439 27521 58715 38534 -12966 -43265 -81742 -80688 -32141
21208 -32141 32302 -2908 -68991 -38569 18002 -715 680 53441 1419 -50549 20964 41815
21196 41815 67279 73766 33936 57232 66466 -7631 -37833 -63577 -39432 9923 38184 33252
21184 33252 27035 -39588 -96469 -56001 -32605 4873 24706 -36915 11811 118985 117674 80161
21172 80161 23891 -39994 -41922 -72536 -46018 6163 60176 94406 163340 155404 82264 38321
21160 38321 33580 31322 -29193 -97471 -75993 4961 8736 1781 39448 47961 52734 39831 69231
21147 69231 72970 87397 86098 115155 119622 92234 129849 111566 59983 65605 57929 -628 -44465
21134 -44465 -2024 89182 73711 60022 44757 48136 36103 -8857 -22117 -5055 32333 47018
21122 47018 -33194 -63292 2983 43193 67286 55813 64870 35209 20877 50867 15575 2749
21110 2749 11810 -16902 -29416 -22867 -13062 28885 110384 109439 73273 77001 94343 95960 48330
21097 48330 41906 33437 36831 53096 66932 125038 115213 81532 54551 30372 -3119 47674
21085 47674 132399 101936 25863 -12515 -22947 -10095 7091 -3787 5695 32826 39430 14795
21073 14795 -11865 -4627 38191 30006 30371 49158 13479 -77886 -78449 -55708 -54495 -28284 -13537
21060 -13537 -40378 -52246 -7 -11797 -29536 -31734 -33611 -52459 -59444 -50591 -64524 -69223 -38226
21047 -38226 -5495 18135 32422 24007 -36614 -100295 -58064 -45953 -30298 51325 89524 44264
21035 44264 44594 16664 -20593 -37824 -51163 -62017 -60829 -38505 -37853 18175 10052 54000 60039
21022 60039 31273 36450 84072 96286 103566 83563 61918 58786 76892 22179 -31664 -90061
21010 -90061 -82716 -48956 -25363 -59237 -91378 -50765 -20990 -10483 9357 25321 18800 18199
20998 18199 12429 41094 45718 -8650 -21957 -36716 -35260 5200 65975 76522 -9265 -29012
20986 -29012 8146 8600 80962 68475 -32109 -71302 -6644 27205 8277 -34635 -55746 -13772
20974 -13772 -16388 -10613 -50640 -83052 -71299 -35987 -59129 -36716 -80887 -129145 -85918 -33525
20962 -33525 14308 -27704 -77342 -57072 19415 49190 17129 -42073 -46468 -1639 -45820 -36247
20950 -36247 42801 94023 82160 32319 -30215 29990 96268 146890 102198 45166 33236 53436
20938 53436 81302 47496 21954 -35610 -75694 -3441 65710 66153 66508 68002 53139 35514 -62314
20925 -62314 -85353 -36688 -21992 -27303 -2374 21557 59921 6616 -33967 -14425 14559 -15557
20913 -15557 47373 34984 43684 25661 -6380 -44588 -109224 -123111 -125177 -101258 -102124 -74163
20901 -74163 -144761 -210669 -142585 -129442 -76856 -1103 71796 100937 110704 44207 28264 14609
20889 14609 -33698 -71366 -50501 -35829 -68275 -73133 -52452 5064 92361 125761 110464 56682
20877 56682 18247 76245 35378 40222 9553 -17272 2247 -18390 -27334 -71652 -34882 -43450
20865 -43450 -48200 -114052 -127345 -60253 -24327 -5593 -20273 -23270 -52052 -86071 -56890 10961
20853 10961 4696 2884 -64351 -73614 -37950 -23110 -32068 -54160 -116524 -137610 -102471 -46508
20841 -46508 -22611 -45975 -64641 -84048 -38779 2622 25992 725 13471 22606 -27102 -29875
20829 -29875 -54048 -85883 -138110 -157907 -116157 -82304 -126247 -163904 -136497 -92494 -66682 -30491
20817 -30491 -108926 -109328 -55393 -108830 -62541 -21764 31711 -36525 -39834 25855 15129 -4644
20805 -4644 -38064 -56770 -61910 -120049 -110010 -116044 -113359 -72652 -95353 -145971 -129412 -130721 -108340
20792 -108340 -80772 -93206 -132547 -131830 -145234 -153441 -101754 -2517 58188 25787 -65260 -122850
20780 -122850 -89456 -48138 -119963 -120934 -79930 -90604 -68316 36032 1248 -43898 7413 18710
20768 18710 28293 5119 -51759 -47176 -20216 -7326 -47434 -44466 -28084 -5457 -36192 -119084
20756 -119084 -125414 -111519 -129939 -122947 -84689 -14232 -2612 -3647 -13409 -25441 -103544 -73134
20744 -73134 -32074 -22016 -4569 4980 19504 -2018 -10002 -27225 -74495 -79242 -56082 -87418
20732 -87418 -90008 -33929 39533 39063 31963 -17941 -57035 -38716 -44216 -50405 -21629 -4729 -40875
20719 -40875 -88316 -25616 2382 -64528 -131074 -75844 -87866 -63967 -66387 -70811 -55943 -19065
20707 -19065 26543 45028 28859 42114 50946 3787 -1078 -11677 -55220 -97657 -119560 -63365
20695 -63365 -48056 -3277 63025 47092 -15436 -30242 -34918 29899 45764 19998 11671 28348
20683 28348 29478 10765 433 -11367 -6831 16867 13607 1626 -15218 -6002 -50993 -74643
20671 -74643 -66903 -54713 -81019 -87244 -95504 -98131 -76613 -42704 -8409 -16144 -17480 -50981 -87943
20658 -87943 -104387 -99028 -114491 -134905 -132132 -81328 -60313 -6969 49871 53610 66415 32512
20646 32512 24474 71492 49496 -6795 -5538 -26596 -86348 -70663 -58862 -31610 -7193 -19546
20634 -19546 8061 -3325 -7242 -48778 -107110 -82790 -33255 -65505 -133742 -134376 -102226 -65203
20622 -65203 -85832 -68220 -82803 -139761 -189251 -183984 -151487 -106473 -103817 -113749 -123790 -106640
20610 -106640 -93891 -83530 -44819 -45902 -54361 -100587 -163656 -165282 -90623 -40265 30091 60592
20598 60592 57267 28945 30594 3468 -3005 33552 23018 -7328 18734 27672 24072 47986 19516
20585 19516 6418 -7000 -58003 -93523 -94076 -111252 -25945 -40925 -114577 -172757 -162006 -155109
20573 -155109 -154257 -137521 -99326 -63161 -25708 -55616 -11462 -50751 -97191 -62174 -24320 -22135
20561 -22135 -18706 -39031 -104615 -73181 -60505 -43290 10686 -33946 -75134 -85998 -65732 -15861
20549 -15861 34610 56361 108294 105015 58592 15420 1852 80542 74933 46719 89220 50758
20537 50758 36145 4600 -43554 -83897 -95444 -39094 -27192 -9962 -42733 -63115 -73481 -89492
20525 -89492 -136974 -141805 -87457 -23339 30134 70443 -19717 -18048 79599 114642 61668 28393
20513 28393 28399 -44301 -58791 6971 919 -54542 -31302 7702 53528 -8647 -3633 15071 71676
20500 71676 41548 -47304 -105489 -115520 -131894 -185508 -155575 -118925 -106390 -113797 -94352 -59971
20488 -59971 -92258 -72988 -107896 -98261 -61125 -15512 21445 24100 -19936 -24761 -23462 -49134
20476 -49134 -61809 -79074 -94542 -101653 -123769 -124944 -75577 -54788 -28948 -96925 -91581 -57815
20464 -57815 7615 31998 -5236 -1226 -34745 -100934 -76074 -48906 -22718 -28149 -68053 -34896
20452 -34896 -30573 -54055 -71170 -63886 -22051 49163 47495 31749 27407 64037 28798 51557
20440 51557 57888 56256 93505 124608 87464 13701 -17005 -54438 -83859 -107341 -105423 -76192
20428 -76192 -36528 -45917 -29004 -21240 -41941 -32302 -19341 28009 61718 4885 -63868 -43308
20416 -43308 -33375 -21533 -26126 23408 -5571 -51720 -25222 11759 61581 20828 -40244 -23780
20404 -23780 -32337 -27009 -17945 10187 6904 2994 30790 53831 40803 22365 -8019 -1211 54372
20391 54372 38848 24669 42954 37518 7782 -56908 -83430 -57828 -52228 -76956 -51907 -56933
20379 -56933 -52723 358 30684 41570 30076 -20614 -73626 -97580 -137217 -86798 -84543 -42588
20367 -42588 25312 4952 22628 -14640 -97116 -136911 -157887 -70765 -21003 -55301 -84206 -14991
20355 -14991 14131 38705 40290 15293 -71032 -84571 -10333 36588 45923 -5441 -101275 -68432
20343 -68432 -72453 -98993 -124994 -57616 -48606 -55511 27000 68505 79128 16686 33079 130
20331 130 -13640 -50827 -81622 -41388 -70910 -106459 -99293 -43526 -12678 -21457 -68157 -44881
20319 -44881 -28429 -54042 -37612 -40041 20539 4443 -23752 -40594 -68991 -68550 -44687 -54006
20307 -54006 -70079 -136268 -74095 -109774 -146854 -158935 -126214 -68850 -52659 -26064 -68086 -56331
20295 -56331 22406 39869 26840 20064 -5759 -27895 42045 62732 53113 43812 1074 -14204
20283 -14204 -51704 -69146 -83804 -109399 -118746 -101968 -152083 -130566 -107739 -82335 -78507 -54384
20271 -54384 -78945 -53678 -2193 9713 -50948 -110600 -104984 -80301 -55313 -25113 -42340 -102883
20259 -102883 -99425 -139410 -161912 -158628 -161367 -150711 -100522 -105008 -108778 -82765 -108561 -72383
20247 -72383 5926 -32824 -104208 -127607 -43380 6044 -29078 -59161 -56327 -77416 -153604 -156549
20235 -156549 -103940 -54733 -23170 -30221 -34354 -786 -4494 -15150 16114 29784 11694 -5941
20223 -5941 -8154 -46615 -48575 -38866 -17010 -1433 -35391 -31540 -30815 -20247 -27536 -115704 -84347
20210 -84347 -63401 -62335 -61413 -87578 -61586 -54058 -35042 23451 19965 98296 77352 14899 -38749
20197 -38749 -63618 -55939 -19199 -5381 30870 12749 22283 4738 -34860 -91681 -139194 -126196
20185 -126196 -146780 -103507 -87933 -65720 -55590 -73598 -52243 37141 -19181 -45674 3167
20174 3167 -40548 -71454 -100768 -110261 -89830 -76404 -46363 -19674 -6561 29071 19440 -12118
20162 -12118 -22424 -46757 -71294 -43406 -39220 -69996 -59967 -14450 5972 -54192 -36584 -42870
20150 -42870 -91759 -93201 -45240 -38570 21567 97298 96391 38188 -14983 -84921 -98499 -113173
20138 -113173 -91027 -109727 -66104 -12605 20331 -25157 -8518 5713 -19402 -72455 -157053
20127 -157053 -188341 -175780 -152024 -179117 -137399 -60865 -74179 -108336 -59257 -43187 -77809
20116 -77809 -48966 -66644 -115688 -72693 -23833 -53802 -78981 -46463 -14660 -20125 -51207 -34890
20104 -34890 -42645 -68104 -90622 -75412 -58803 -80480 -48599 -28216 -36939 -17402 -13957 -32663
20092 -32663 161 -11431 -53511 -62665 -51186 -51962 -84028 -86764 -39024 15554 -9897 -19561 56783
20079 56783 28894 5352 -30511 -48172 -28012 -2078 -3078 44271 50650 9570 -68020 -92422
20067 -92422 -60262 5216 -49040 -131668 -74951 2272 18425 11593 -16908 -34599 -64433 -74107
20055 -74107 -64096 -43928 -13408 -35434 -27799 -34764 -72306 -95735 -119579 -126243 -82199 -12953
20043 -12953 33104 -7697 -9394 51138 12557 -41856 -116076 -116650 -70492 -5994 -9525 8861
20031 8861 -26647 -87457 -119162 -168478 -172052 -180400 -125663 -129889 -123150 -71107 -24046 9001 14185
20018 14185 5180 17487 -5229 -18700 -49975 -65443 -101842 -100239 -94711 -107285 -61788 -103772
20006 -103772 -195123 -233177 -172027 -104871 -54852 -33969 -57565 -51131 -40402 -107552 -125971 -173856
19994 -173856 -207828 -244098 -224762 -123897 -72264 8803 -11808 -44489 -82520 -90800 -109159
19983 -109159 -102486 -53136 -45782 -77661 -116022 -167213 -134531 -45266 28536 12710 -6270 8085
19971 8085 -4932 -1225 -9696 -45620 -2310 1280 -8478 22520 28727 31731 45843 50472 85125
19958 85125 10939 -42095 -88014 -127259 -131077 -103628 -83875 -55000 -47102 -77051 -99225 -70069
19946 -70069 -62672 -83970 -75996 -68507 -60213 -30788 -78302 -76169 -105944 -155353 -99683 -43407 -86427
19933 -86427 -70280 -42904 -40400 -59406 -31186 -47540 22119 -39148 -136864 -136775 -78740 -83495 -122835
19920 -122835 -97125 -52593 -57112 -74802 -104962 -83359 -93617 -89749 -115075 -124921 -120183 -59030
19908 -59030 -89904 -120543 -85740 -54488 -78225 -131789 -109708 -61440 -822 40455 38119 84679
19896 84679 95162 22313 -18969 -1468 5863 -78762 -144516 -156042 -109928 -79259 -118640 -160586
19884 -160586 -116192 -174426 -192544 -147737 -100682 -131598 -70100 22145 24607 -14396 -42195 -45339
19872 -45339 -29189 -37606 -74407 -56813 -50884 -92727 -50873 4425 15025 29053 -2840 -39581
19860 -39581 -81784 -39301 -32027 -61910 -14629 39550 17223 4092 -28253 -86756 -117124 -87837
19848 -87837 -62443 -96241 -96684 -48331 -24534 -68945 -72634 -71266 -40274 -43898 -44380 -65309 -112248
19835 -112248 -86503 -94127 -106537 -124976 -127065 -36273 -12398 -31185 -56182 -47271 -50723 -53254
19823 -53254 -62890 -87202 -84091 -64440 -72153 -58085 -75130 -132184 -82490 -1768 31143 102989
19811 102989 99121 10605 -28627 -92756 -167246 -195601 -173098 -148238 -158156 -122422 -96646 -66651
19799 -66651 -64360 -83393 -101710 -140247 -118943 -72977 -22991 -91511 -161007 -146475 -178240 -174930
19787 -174930 -96628 -40194 -38408 -45573 -70306 -82317 -103551 -98127 -58560 -54830 -25509 12878
19775 12878 -18839 -11580 -12047 -61878 -47221 -94772 -69998 -40151 -58335 -85568 -138254 -156330
19763 -156330 -160023 -115982 -78914 -61443 -81720 -111147 -95313 -90503 -109596 -46300 39845 38312
19751 38312 8653 18031 65042 38337 -21993 -93269 -138535 -108451 -103545 -29602 -11149 -37672
19739 -37672 -37957 -49612 -74340 -111638 -156281 -134767 -94219 -59420 -101243 -147762 -150214 -99519
19727 -99519 -22505 -10969 -18755 -59441 -108404 -144791 -171931 -220150 -152237 -108449 -114381 -98052
19715 -98052 -19878 -51563 -86983 -52528 -101220 -83803 -85368 -69250 -50597 -92771 -112933 -20391
19703 -20391 30048 4739 -16446 -47748 -54556 -7504 37698 29084 45218 17806 -9572 13171
19691 13171 5592 -79186 -46071 -9388 19660 -56485 -110113 -111025 -144431 -118749 -121542 -59017
19679 -59017 5504 26703 -10937 -5668 6665 3772 -56413 -76285 -56662 -46911 -71308 -77877
19667 -77877 -43437 -36259 -117134 -141071 -123423 -123269 -110594 -80704 -84157 -106206 -122829 -132931
19655 -132931 -90001 -52912 -87190 -122104 -149511 -143845 -153729 -162140 -173505 -219131 -238929 -125637
19643 -125637 -110395 -169161 -110459 -117646 -196707 -170123 -118464 -106048 -77209 -83706 -90849 -87874
19631 -87874 -63080 -46135 -86864 -123882 -178216 -200838 -185835 -176683 -189683 -163222 -127975 -134003
19619 -134003 -125725 -124726 -111216 -128987 -98263 -70924 -119840 -166928 -176790 -151914 -65415 -3492
19607 -3492 -16804 -44792 -84653 -147309 -199198 -199860 -118277 -92136 -84540 -58083 -22245 -20901 -52241
19594 -52241 -73363 -54434 -35240 -76564 -158075 -148901 -108299 -70166 -46721 -95871 -108469 -53031
19582 -53031 -127288 -85497 -62366 -79895 -104063 -165300 -213690 -200442 -207400 -186493 -105627 -84964
19570 -84964 -34568 -57209 -51872 -62306 -73368 -99041 -133983 -179396 -178100 -120827 -78437 -54998
19558 -54998 -41033 -94363 -100035 -54454 -63359 -156504 -148584 -126972 -116112 -136341 -141797 -99304
19546 -99304 -79711 -79720 -100840 -67506 -37239 -60678 -130879 -165310 -164201 -151850 -131643 -192649 -234560
19533 -234560 -234695 -213376 -155255 -194573 -209448 -166589 -172152 -149070 -123292 -100393 -88950 -82451
19521 -82451 -32705 -45208 -101483 -145900 -132437 -106249 -143172 -162854 -103934 -80890 -61417 -60384
19509 -60384 -34267 15887 -33572 -80337 -80677 -80276 -77082 -47511 -52041 -59134 -96279 -70952 -49848
19496 -49848 -67122 -101534 -120849 -123629 -131030 -87246 -59520 -117686 -115525 -116448 -141278 -96619 -48153
19483 -48153 -77750 -92234 -99593 -121344 -75259 -5869 -47353 -42866 -39829 -63155 -99897 -140141
19471 -140141 -151701 -109711 -123320 -132975 -150385 -90137 -52875 -25172 -73461 -122484 -105787 -127006
19459 -127006 -132248 -140501 -203641 -228700 -162586 -73058 -13806 43002 30470 4023 -41345 -86614
19447 -86614 -134782 -103636 -112287 -70424 -38291 -38233 -54594 -91890 -140089 -130607 -124240 -48649 13407
19434 13407 -46705 -37447 -95486 -84353 -76693 -22614 -71524 -104514 -78338 -56203 -48151 -53579
19422 -53579 -110991 -113496 -96152 -139370 -135106 -61953 -20128 11814 24872 -12131 -48034 -24464
19410 -24464 -13831 -23826 -46263 -45940 -30127 -22019 -71751 -81357 -48705 -114530 -147825 -158348 -125058
19397 -125058 -113663 -133027 -168571 -129668 -150076 -147936 -74312 -50821 -107717 -144299 -174012 -192928
19385 -192928 -167978 -59342 9606 -12959 -110147 -131083 -148424 -145346 -153908 -143452 -126122 -107399
19373 -107399 -81542 -68030 -111825 -153875 -137880 -133903 -92870 -120915 -82527 -66140 -109674 -109035
19361 -109035 -100752 -122259 -155843 -130213 -63053 -66060 -27276 -36504 -114175 -124387 -149751 -144749
19349 -144749 -83377 -69658 -91135 -54937 -33403 -61450 -50259 -108688 -160226 -211652 -183826
19338 -183826 -161174 -180203 -176459 -96584 -71860 -66223 -85512 -89146 -90374 -131794 -123160 -100786
19326 -100786 -125853 -115452 -55046 -21282 -51541 -120575 -115526 -91400 -22781 71385 85851 -5449
19314 -5449 -55625 -79984 -61697 -33125 -78121 -124641 -135636 -120497 -104970 -132839 -151810 -143802
19302 -143802 -129123 -119362 -91668 -47913 -50727 -39707 -8258 -62956 -109743 -111683 -117476 -42229
19290 -42229 -8660 472 -47316 -111543 -126066 -93149 -112912 -123182 -91391 -111172 -112488 -128013
19278 -128013 -139636 -93656 -124624 -129408 -146931 -101453 -87028 -71863 -43265 -39412 351 -40786
19266 -40786 -89196 -134485 -136500 -156104 -145979 -81873 -23459 -6831 -39331 -26280 -46689 -65111
19254 -65111 -25130 -41187 -71203 -83479 -89248 -102355 -58146 -50525 -70747 -92930 -47985 -36984
19242 -36984 -35788 -83113 -140747 -139679 -126959 -110210 -149100 -156333 -128019 -102336 -127351 -131149
19230 -131149 -109191 -98503 -74586 -22424 -68022 -123319 -118775 -75508 -48822 13505 -15268 -130510
19218 -130510 -146656 -84510 555 -25135 -64408 -37105 -62426 -138153 -154830 -127414 -55949
19207 -55949 13499 13804 -41774 -46134 -70159 -62668 -95676 -96825 -72757 -113044 -49564 -53813 -82993
19194 -82993 -154690 -118338 -93178 -82693 -86094 -117001 -157824 -192893 -223782 -230400 -203672 -201662
19182 -201662 -155918 -100563 -100792 -103088 -67947 -55591 -95294 -116285 -121775 -144480 -211684 -216254
19170 -216254 -176651 -138174 -117190 -95851 -103306 -133725 -165116 -75878 -73083 -164106 -190969 -139772
19158 -139772 -71826 -53663 -49914 -12498 -1338 -33027 -9938 -25657 -65483 -84448 -49247 -43818
19146 -43818 -38602 6097 33052 -24568 -63957 -51362 -85702 -112793 -91394 -49011 -54606 -87704
19134 -87704 -54493 -12510 35281 35202 37737 56396 9348 -44959 -37436 -59348 6127 83028 106731
19121 106731 46517 70800 82014 77753 109777 130533 153289 246850 360820 468957 655429
19110 655429 851240 913177 851853 734200 684066 650588 672719 726898 823175 872114 894130
19099 894130 825308 729945 460570 242028 154549 53112 39055 44924 79338 78436 57547
19088 57547 21373 34300 3913 33410 97591 77827 46585 51797 57141 82058 43908 -25217
19076 -25217 -56905 -84878 -19754 77709 74183 26582 28893 26892 28747 36108 87555 179976 314434
19063 314434 342890 373806 536315 732189 875448 939400 930782 817644 726237 718098 765873
19052 765873 884563 964510 957329 879047 828474 715454 532577 373574 252977 238653 233215
19041 233215 151049 151587 123365 43765 2083 -24539 -58535 -110674 -114247 -81905 -26731 -19061
19029 -19061 -71390 -49452 10962 -25662 -55312 -65095 -2435 -1178 4727 5170 -68128 -74888 -103967
19016 -103967 -130050 -155747 -143736 -113444 -119556 -188029 -220647 -229519 -189489 -118528 -20547 40252
19004 40252 11263 -17364 -30603 -21383 -24470 -64743 -143166 -180643 -109628 -112337 -164942 -158699
18992 -158699 -133708 -107273 -105343 -95883 -100008 -114714 -130320 -183832 -153454 -134899 -137962 -146997
18980 -146997 -141376 -128981 -143714 -151133 -164920 -158343 -155441 -128249 -59468 -53380 -96759 -104875 -66493
18967 -66493 -64849 -65992 -120732 -124336 -159950 -192510 -186843 -166360 -149409 -160067 -154345 -143640 -104241
18954 -104241 -102777 -94632 -35572 -36529 -70268 -70395 -60361 -73811 -65033 -87691 -77123 -69155 -27185
18941 -27185 -54512 -11883 -8793 -32404 -10373 -55087 -90644 -62258 -33663 -47467 -123827 -207538
18929 -207538 -168620 -81716 -113448 -104026 -11830 -15552 -31881 -61934 -115908 -113545 -116988 -69566
18917 -69566 -31629 -66498 -156013 -133082 -164278 -222495 -244058 -222809 -195931 -162657 -105591 -91371
18905 -91371 -69804 -90445 -49845 -2918 20395 -5922 -60846 -49577 -41900 -129553 -117398 -115635
18893 -115635 -179813 -138141 -116535 -126596 -88592 -92074 -72239 -27697 -44565 -79558 -23815 -61211
18881 -61211 -138031 -89860 -67760 -64075 -57423 -48056 -90126 -137024 -110554 -18093 -41067 -120590
18869 -120590 -151529 -97040 -50985 73773 61388 118508 81324 -15603 -79459 -43243 -103578
18858 -103578 -170123 -137603 -92151 -117483 -98757 -58030 -89970 -116649 -110748 -120997 -99812 -97081
18846 -97081 -72217 -96405 -118012 -145213 -159080 -158428 -127545 -76059 -65872 -118711 -102890 -21611
18834 -21611 -41467 7320 68474 126230 104671 79184 35990 56695 153142 167925 184470 111132
18822 111132 78266 52199 41886 -34639 -76205 -116699 -106573 -39875 -24531 -10053 -39290
18811 -39290 -65525 -38602 -48916 21876 101738 125907 139959 91788 29053 -3493 -37655 -12771
18799 -12771 -14844 -18627 -56448 -371 2253 -52985 -57895 -100452 -66013 -42801 -70613 -44993
18787 -44993 4469 25337 23269 41226 75253 128358 161196 155337 105886 114961 174734 211027
18775 211027 267551 295917 260419 233123 189875 221847 190021 103634 79311 103659 45396
18764 45396 15308 -651 43063 165675 164972 95449 33242 9821 13923 16064 12651 -3695
18752 -3695 -13108 -16655 25638 -4316 -26002 -45766 -59824 -39584 -57522 25949 119847 103028
18740 103028 89794 106468 135082 207575 226015 217347 167606 111642 91817 80520 116502 132255
18728 132255 112043 116149 107943 45202 62766 100980 30466 -37499 -80871 -89021 -77520 -90931
18716 -90931 -88705 -54992 -56616 19199 51627 91474 94098 54607 70193 64778 61261 37395 20065
18703 20065 48912 135289 201069 217027 214600 244502 296023 233623 176468 160692 87792 -5260
18691 -5260 34907 37497 -28493 -3138 27417 -22989 3595 28347 32295 -18792 3505 110948
18679 110948 229211 302703 295175 285981 243194 156285 109102 79225 31421 -45615 -73016 -35396
18667 -35396 -73384 -75609 -77731 -111628 -129507 -78735 -24588 24578 27484 21918 37386 57308
18655 57308 39853 42408 79236 96233 148456 158798 161399 164076 90988 47496 14599 -23878
18643 -23878 22481 74225 188062 322321 437855 637228 783087 850780 830968 744358 598188
18632 598188 448525 381833 320688 248987 239527 245037 243702 224680 238139 192043 181052 229681
18620 229681 282265 321323 361325 418174 441750 502167 635589 756396 880362 1009102 1186459
18609 1186459 1338174 1499898 1745315 2050923 2210658 2316881 2460166 2550401 2776813 3170266
18599 3170266 3787392 4495910 5101218 5581531 5916646 6053254 6066045 6091418 6237148 6589046
18589 6589046 7272009 8372735 9749688 11528180 13976842 17489525 22305845 29037180
18581 29037180 38914273 54452911 80181286 122027995 180093373 236208237 270750720
18574 270750720 289690037 304139930 306342503 280132426 230047728 170437009 120755311
18567 120755311 88295217 68403550 55515808 46331551 39392644 33926329 29518787
18560 29518787 25938774 23132919 20978099 19325940 18083012 17284198 16783016 16295884
18552 16295884 15850075 15374112 14771768 14195917 13895338 13861782 14140580 14532930 14836406
18543 14836406 14700084 14292015 13845768 13627764 13746190 14202168 14984113 16200227 18023521
18534 18023521 20722569 24537152 29774348 36877946 46628110 60995828 83524114 120957537
18526 120957537 182266946 269114194 360157780 429864781 466001743 447979639 382210019
18519 382210019 295616699 212030168 150196349 110789080 86104564 69981892 58725833
18512 58725833 50197552 43250860 37427762 32603883 28730915 25578890 23105337 21210840
18504 21210840 19835226 18852848 18108063 17350186 16294203 15003959 13668292 12417156
18496 12417156 11302617 10370409 9661457 9131453 8670532 8233838 7758413 7239296 6727192
18487 6727192 6275904 5831389 5421791 5094036 4806452 4603933 4398135 4225891 4087954
18478 4087954 3988406 3924666 3921295 3888926 3801414 3652318 3573986 3487776 3314879 3156144 3052506
18467 3052506 2907340 2811673 2716190 2626096 2513671 2409932 2328194 2305245 2258193 2190726 2090340
18456 2090340 2063045 2022142 2052303 2023783 1990063 1933417 1904268 1862135 1812337 1752481 1670257
18445 1670257 1621150 1615744 1505320 1383778 1331100 1303398 1265736 1183704 1123311 1035869 969345
18434 969345 975225 966366 961663 998050 985993 997615 997663 1015540 1055281 1071383 1053737 985478 948709
18421 948709 909928 837208 831945 799774 745044 732060 737808 755198 758025 765847 795682 831564
18409 831564 869665 876173 900738 954676 936553 885044 951573 1018106 1065064 1097020 1105717 1063554
18397 1063554 997838 956414 909322 807481 736001 707520 641271 518526 458399 497010 558119
18386 558119 551570 570228 598264 602430 549863 531723 555534 616585 639451 685344 712693 708150
18374 708150 685138 682174 629593 593096 596898 628192 639523 648774 553061 537172 618316 578956
18362 578956 550072 588441 591773 588486 581090 541479 587968 609575 642751 706262 798314 787695
18350 787695 794590 819697 758621 782701 855300 818506 828858 848863 817255 726252 787755 700733
18338 700733 593947 591306 610868 633973 624654 599893 599739 550762 568343 665019 663270 713069
18326 713069 775579 740408 684350 625390 528323 505174 539782 532659 539596 623648 590739 560256
18314 560256 561909 583201 566229 563811 583268 600118 571042 603141 657988 670999 687566 665627
18302 665627 634047 614169 626775 587323 566531 564199 567565 542980 482371 458478 553612 603620
18290 603620 605609 641438 668678 663255 660692 672780 669811 682401 734356 751820 777556 815725
18278 815725 856414 779543 856835 884630 840680 794264 806090 799406 707122 746250 756338 735092
18266 735092 752831 798463 854503 885104 859050 900329 903495 892638 958159 941704 933180 933477
18254 933477 905516 882395 864823 943042 960807 1013359 1114801 1099986 1087260 1054556 1063669
18243 1063669 1173869 1232053 1275615 1380404 1629060 2067173 2588412 2989128 3019707 2762226
18233 2762226 2415453 2093160 1968450 1920445 1966816 1992612 2004095 2028632 2045434 2013823 1994279
18222 1994279 2061518 2138022 2289196 2425537 2542257 2662881 2803607 3041125 3285083 3556500
18212 3556500 3879950 4316066 4912351 5524053 6267883 7284392 8698455 10649149 13503344
18203 13503344 17671413 23948744 33938684 50855013 78811963 117282675 149375964
18196 149375964 155253206 136068264 103339472 72434851 51193559 38078984 30041710
18189 30041710 24897291 21371349 18696242 16544815 14784952 13427859 12434380 11699527
18181 11699527 11055260 10415156 9699162 9001342 8474012 8154538 7892272 7692693 7628012
18172 7628012 7678798 7756988 7815425 7796729 7883091 8033476 8209320 8512012 8953818 9443300
18162 9443300 10067474 10884354 11977881 13397222 15073353 16994177 19397933 22780413
18154 22780413 27905656 36406601 50992471 75077121 107984729 135912151 143657997
18147 143657997 133526131 116419804 107194489 114374852 132475146 143456290 136232409
18140 136232409 114782658 88283468 66699524 52522900 43868250 38476482 34958968
18133 34958968 32493160 30696936 29380327 28350502 27702653 27439954 27479071 27759169 28229718
18124 28229718 28858682 29685793 30675903 31803930 33141616 34606919 36190034 38001533
18116 38001533 40039399 42310076 44660780 47140372 49853983 52969518 56281206 59611922
18108 59611922 62843008 66107016 69442336 72899315 76384916 79826651 83258924 86820845
18100 86820845 90976332 96327404 104063892 116485767 136178654 159693790 172644502
18093 172644502 167099229 147902823 123872671 103979211 90249327 80736182 73690774
18086 73690774 68031430 63200584 59023112 55292171 51932029 48786278 45877951 43190569
18078 43190569 40733974 38374918 36149330 34162174 32344685 30685749 29086346 27671317
18070 27671317 26319656 25040253 23810197 22692321 21637929 20626164 19685984 18894678
18062 18894678 18140535 17417515 16703209 16141365 15645200 15286576 14998419 14578855 14012244
18053 14012244 13410931 12727171 12169042 11690531 11245138 10833305 10479763 10147785 9882515
18044 9882515 9587515 9309158 9006490 8752322 8439011 8201595 8144552 8127716 8169994 8210126
18034 8210126 8193650 8108837 7887115 7582615 7265558 6966525 6805102 6718342 6760224 6804633
18024 6804633 6766793 6583703 6298050 5975946 5658225 5330959 5121777 4884299 4618842 4462163
18014 4462163 4331856 4201656 4147065 4072792 3911303 3750510 3670073 3591593 3489834 3399723
18004 3399723 3325537 3289504 3273875 3245372 3157120 3080688 3007034 2933750 2838722 2835577 2875866
17993 2875866 2847051 2781125 2740831 2706640 2667644 2668096 2737818 2757571 2788111 2914649 2980379
17982 2980379 2936083 2848893 2748511 2668438 2632997 2595518 2571325 2544577 2596753 2677927 2641151
17971 2641151 2565670 2468366 2409269 2378576 2267017 2142472 2019512 1897566 1768313 1698059
17961 1698059 1663057 1629811 1562261 1567690 1520144 1477901 1446431 1411783 1417769 1445333 1474329 1464053
17949 1464053 1434706 1400549 1368802 1288301 1262483 1266709 1222153 1232655 1208866 1120584 1105971
17938 1105971 1093345 1108077 1128292 1086237 1104976 1113059 1172880 1222347 1208201 1188644 1124569
17927 1124569 1051937 1045694 1023037 1050687 1070339 1064891 1067488 1061477 1024945 977324 970741 965073
17915 965073 959102 922581 939526 949923 921024 900928 907108 913723 926419 943901 928521 892518
17903 892518 848273 823815 804952 851152 844547 813768 818649 816574 808643 806826 808210 825253 801590
17890 801590 793405 779817 796678 746441 708044 749436 767681 800785 834477 854955 765285 735001
17878 735001 746635 743500 723288 669542 625886 613791 633896 643934 665592 733243 714267 711508
17866 711508 665184 647406 641821 616825 601987 659947 651239 681569 753725 739039 724114 719134
17854 719134 753699 718598 683105 689769 724448 729914 642799 614705 646347 716641 774264 824924
17842 824924 756401 707625 686951 606442 554091 579582 682908 706755 655266 663726 587534
17831 587534 579062 594226 557961 547772 563891 542512 523837 483731 491126 508900 512340 502754
17819 502754 500791 487938 457552 495415 533224 533247 546786 558870 550015 546522 494354 476558 445294
17806 445294 435923 486027 479877 448841 449300 435672 454788 449231 435151 436561 467898 426586 376492
17793 376492 358534 369118 414010 410753 431737 429543 424482 445084 469938 429260 392431 416268
17781 416268 451945 459867 460387 417909 399530 428624 455057 421264 393137 330883 299856 289134
17769 289134 325303 365093 374049 361055 407084 441697 392961 417497 378976 337331 346906 379280
17757 379280 392477 416716 414549 338931 316647 411785 437725 456745 425989 404875 378567 288621
17745 288621 294376 369777 327183 346874 335450 298065 286882 321548 295816 261425 227943 213943
17733 213943 225836 258916 224298 204403 327801 399475 436102 494827 437482 368722 318241
17722 318241 312827 280807 275626 269808 328167 325438 323524 308442 271413 224547 235538 286450
17710 286450 273185 304938 338217 334852 375758 397334 324644 315483 378203 377491 339119 313695
17698 313695 284083 325920 358944 332434 318212 349043 365212 369340 311848 256081 229020 225446
17686 225446 189273 203335 219469 205441 238060 324022 356622 288633 267359 274358 214633 175804
17674 175804 223861 256361 342741 452246 465366 530242 610528 647385 748933 786939 756112
17663 756112 695586 657025 652716 563899 497236 458215 465045 443448 426593 384339 321874 266934
17651 266934 220416 218407 184251 240026 290192 312445 328856 264409 193409 195387 226765 200033
17639 200033 257048 279756 276933 291684 285087 293635 310289 287792 254322 249288 256173 280447
17627 280447 232161 243915 258141 278803 287506 333476 321770 336863 391617 529318 622282
17616 622282 709887 832932 908880 935373 910917 881541 776713 704310 625580 537398 519973
17605 519973 484104 409953 411463 409949 386055 379006 342317 281654 231353 252508 235517 222787
17593 222787 209869 184274 163274 228893 233287 241596 214011 208566 242573 227309 155309 127547
17581 127547 203732 283732 212546 143980 191867 260227 248159 217103 183647 128084 167151
17570 167151 237759 242334 238954 252176 291660 333319 432448 508060 547646 577674 569470 496702
17558 496702 392109 307860 293830 284071 250559 198064 256163 270654 211395 130938 131104 153577
17546 153577 169980 142917 155869 204314 188401 193142 180478 160319 176616 246141 305922 291534
17534 291534 213346 157223 153046 211980 190345 185040 145738 94589 70236 70334 94878 121549
17522 121549 110748 116009 138823 148999 178498 148019 131187 110473 144555 117885 84357 79722
17510 79722 73546 106977 153329 68914 50116 51403 76676 153378 266204 235318 212514 177252
17498 177252 161032 105478 105537 99444 100956 122597 177866 195340 207643 195006 170364 174141 140857
17485 140857 158207 175576 121869 55002 79153 115842 123334 154157 217768 218065 212588 213394 181809
17472 181809 158604 105072 103793 130700 173131 187198 162102 100442 56907 75067 116813 117025
17460 117025 141245 106048 77530 68135 116391 132152 87029 121297 114064 89607 45629 27032
17448 27032 89064 92257 64211 28065 27946 16530 66976 71973 77706 49220 92316 107370 91694
17435 91694 95120 140902 123949 96030 91150 139610 171535 157614 181570 107495 107031 108268 115839
17422 115839 78147 51556 100284 84129 71869 96177 77819 91028 161730 147280 147196 174743
17410 174743 150128 172117 190893 156439 152572 125790 84464 70064 85795 119663 88499 102818
17398 102818 164801 165286 214978 260940 267345 248015 205731 123268 66085 12854 14973 90692
17386 90692 131563 91610 45780 59029 90131 132159 74460 88457 93559 70508 51414 119527
17374 119527 100894 123610 149622 163034 129434 131900 29262 -27688 16238 40454 96051
17363 96051 123585 136895 179507 185742 188288 161640 133637 152825 145403 131400 65569 56516
17351 56516 66548 30663 59007 56807 -31486 -90243 -44446 64038 105049 91751 54413 39669
17339 39669 46078 7246 32416 19485 55285 107774 140788 124177 59967 -3134 62373 58209
17327 58209 -19821 32450 46710 126919 119526 70140 47926 -397 -22357 -77801 -87046 -65012
17315 -65012 -50588 -73608 -6291 39952 53632 -9265 -9656 13857 2355 -48431 11331 27405
17303 27405 21069 22506 63262 86817 58772 14213 -13629 459 91041 129108 31199 8712
17291 8712 67494 61175 33164 37106 38172 107544 122125 74084 80293 75318 22765 1239 38875
17278 38875 94065 114377 89567 112979 104472 97850 21602 -12570 17889 39792 -20109 -29326
17266 -29326 -7473 3328 33682 50723 37166 77056 113080 121525 150840 94729 18088 24957
17254 24957 32864 -622 14723 116368 122777 158178 186504 171737 163469 132354 88991 104100
17242 104100 67835 43224 47973 57289 45620 25059 55384 86648 51531 -32467 -45402 -15206
17230 -15206 27612 28657 53804 109999 144952 62450 17225 65991 66663 83108 126176 150468
17218 150468 106978 65979 85721 104979 109347 111387 65765 25235 64665 68520 36172 -8259
17206 -8259 14809 4882 943 45039 53535 4909 -28325 -29397 10542 36517 147949 118776
17194 118776 97331 99800 121792 129433 145642 163498 113577 86448 37013 105762 154300 136920
17182 136920 106024 81690 91947 71014 66374 50356 36799 37393 -509 -2983 24256 5479
17170 5479 62978 71816 85088 10378 -20489 34807 116442 175729 157841 71761 11873 -3736
17158 -3736 -7982 30556 59344 74496 76610 5426 18280 42529 46723 17406 1141 -33838
17146 -33838 -21857 40933 27440 21987 35220 14050 27663 -35571 -75133 -39126 54798 116063
17134 116063 94793 77734 76057 109827 96921 86886 112479 79709 39967 52592 63588 82630
17122 82630 78247 69038 65978 52565 63672 125193 187018 149526 133546 94406 57601 35680
17110 35680 61112 55328 38581 36273 27914 38176 79805 54750 -1923 1689 46791 65204
17098 65204 36222 8177 86886 119645 120976 81675 43919 -42553 -57410 -31942 -11719 7767
17086 7767 7272 -1448 -7034 -30449 38714 19283 -54073 -39209 16793 72038 71162 75043 77859
17073 77859 68255 50336 -7173 -4415 26165 17201 -5483 -52753 -77237 -64387 48167 130433
17061 130433 161204 130301 68012 68512 99598 94435 28371 50981 107556 121990 143275 107814
17049 107814 120356 80757 45930 109801 128367 97952 97766 61856 13778 -42388 -24391 -28649
17037 -28649 -6726 19863 56162 80686 56659 85309 96918 103351 128292 83469 59294 15119
17025 15119 -40672 -40787 -10813 40949 18953 13610 90893 49999 3333 86240 75834 38634
17013 38634 43524 40059 39218 16721 -3246 -20784 -15894 -41963 -71862 -58386 49011 129178
17001 129178 109825 136273 103144 52681 -27806 -38411 -49020 -75611 -64915 -87981 -90723 -54870
16989 -54870 7123 -45011 -37308 -277 -60719 -31115 -3754 10145 24769 27807 75668 114839
16977 114839 67944 92102 51665 -7788 -88804 -89061 -47657 -10002 -14445 -465 56616 73991
16965 73991 85848 91203 87664 105299 137309 104837 12574 -26493 -82532 -46044 53219 46447
16953 46447 31753 34528 67676 52050 7046 6234 -12527 -32349 -82339 -90802 -52087 -28619
16941 -28619 -69829 -38965 -23934 -32938 -35851 11301 66801 54619 73432 10167 -4788 12195
16929 12195 1928 -7307 14668 6641 -27010 -970 57227 106375 81016 4167 -38323 -45865
16917 -45865 -12347 -4003 56046 101644 39642 49527 16291 8477 4263 7475 53578 49757 42284
16904 42284 31705 34041 94978 132335 75101 -19615 -32924 7023 12791 -61639 -50455 -36875
16892 -36875 -8185 44914 85124 60255 15208 15061 8190 28980 28966 28306 37374 21338 26127 53193
16878 53193 39010 -40800 -49792 11706 29928 -9769 -22599 52518 60347 59244 46365 47713
16866 47713 78484 109729 38645 3778 41994 44346 32948 -8728 -9485 -14985 26285 27814 -41932
16853 -41932 -66318 -39302 -69795 -102383 -35554 36839 51527 -54377 -62164 -20569 7790 76935
16841 76935 44485 -18482 -69110 -99550 -81756 -72476 -20037 -34779 -55439 -51332 -12469 -1659
16829 -1659 45772 72040 42092 -8298 32528 84515 76953 16750 22291 89307 54739 24664
16817 24664 7377 50543 56813 9101 -9485 -1958 67505 84453 102534 102466 47397 53933 -647
16804 -647 21092 69011 35153 -48128 -67593 6731 -48587 -25974 47962 77836 82867 66397
16792 66397 67762 22305 8771 38502 75718 94330 100081 123882 86898 55998 18464 -17212
16780 -17212 15087 17430 58102 85851 113080 30759 -45852 -5967 12153 -800 -5054 42161
16768 42161 23566 9301 685 -34004 -77359 -77365 -46233 -20830 -19527 -29142 -5636 14500 14672
16755 14672 13495 15460 -12985 6899 53859 77562 42702 40380 27105 14220 6782 85625
16743 85625 52759 -4498 -69709 -70117 17855 -5457 -18809 16458 63397 12940 -72455 -82986
16731 -82986 7685 22558 -48124 -75856 -3200 20905 17391 -26043 -33174 -11528 36715 63747
16719 63747 56867 2664 -21186 22334 79081 94017 78543 48029 -1956 -65133 -88365 -103928
16707 -103928 -112192 -106325 -70982 -70696 -40388 -24741 -72018 -77169 -37513 -18849 8209 64769
16695 64769 70848 80872 29055 21168 38492 52967 71164 98307 23233 18729 6160 -52345
16683 -52345 -77661 -9132 -51498 -47426 -30921 -3199 -28327 -39820 -63581 -81915 -26482 -34448
16671 -34448 -30763 -39594 -48507 -61605 -14539 -2579 24652 53363 62627 65689 -5265 -9121 3280
16658 3280 76014 53181 11922 31661 92622 56312 31970 8745 -16130 -37838 -8614 42434
16646 42434 61360 36961 -37744 -1233 46630 14082 -34261 -45686 -3750 14492 -62600 -87758
16634 -87758 -40716 9961 39908 24567 23149 -23011 -18766 -20243 -6617 36206 -6376 14440
16622 14440 26698 -41096 -54379 9695 54161 33948 34170 93292 85294 76000 64133 52341
16610 52341 30389 -5046 -35216 14424 -29469 -6665 16060 -9577 -40791 31975 117275 77731
16598 77731 -47530 -150791 -132259 -102267 -92663 -8444 27140 -2522 -41975 -31978 13187 76030
16586 76030 71838 32441 19644 36457 93648 130111 75980 7103 27518 44921 87072 139999
16574 139999 113913 105082 132802 112530 58557 44979 61374 52453 106731 118319 88810 50525
16562 50525 80439 95983 79956 7684 -12863 -15946 -61308 -80680 -69777 -91996 -116452 -130465
16550 -130465 -77450 -72367 -62815 1612 46841 75962 35792 -7507 -14435 5258 -59406 -44688
16538 -44688 18907 52205 83175 52380 100060 95642 52839 51819 40314 -16935 -6247 -23838
16526 -23838 -38659 -12794 6038 -5960 -22884 20217 47179 -2433 -49061 -33511 -8545 -18108
16514 -18108 -16347 44188 77138 110250 19078 -19419 -54284 -60115 -56341 8094 -45501 -60553
16502 -60553 -30102 9028 69647 98517 75670 9479 75345 141502 108529 76941 76064 72777
16490 72777 64519 57067 40958 35777 -3357 30506 133962 171885 141381 118247 118502 112437 70434
16477 70434 36824 60807 10321 5294 -24992 -65518 -37438 23511 76343 119320 103364 55671
16465 55671 32189 9241 5852 16419 -10789 72246 103423 115228 136359 159655 136404 114036
16453 114036 100388 63809 66627 57382 15975 26761 59178 98632 89905 37696 13767 11324
16441 11324 21836 40100 8241 10796 24759 59822 67443 76366 20915 31752 37020 44267 25212
16428 25212 1853 -15833 -38229 -62171 -38224 -45439 9143 9412 -11360 -6182 10139 -6417
16416 -6417 -16786 -20196 -29583 -722 6689 -11656 -55766 -58689 -38616 18166 24033 6929 -22890
16403 -22890 38711 55077 -13042 -59954 22300 71028 13511 -68339 -47512 3603 48194 9859
16391 9859 -9332 957 3544 45996 37141 29308 58995 60936 40599 -25599 -34023 2450 27933
16378 27933 -5640 27600 28421 15391 10435 30847 63870 74372 54688 49973 49533 133435 136526
16365 136526 78428 15923 -68998 -117067 -48636 -62176 -66207 -52985 -39765 -61313 -94250 -71992
16353 -71992 -57402 -90894 -56462 -7261 15143 26031 42278 60957 13384 4527 -72437 -127754
16341 -127754 -87600 -31291 -11559 -230 -14602 31340 126331 180567 97630 6130 9992 9557
16329 9557 -24289 -4371 61126 86047 12277 -24344 -37900 -51542 -36468 1117 49387 -2902
16317 -2902 -9456 14569 20778 -1747 -50309 -28639 -13431 -14727 -54744 -59417 -62364 874 59073
16304 59073 59219 53992 38654 -32116 -48245 -17003 10447 43150 84845 100132 33998 23508
16292 23508 -13296 -41972 -96100 -137548 -72615 -625 8466 -40517 -29371 -38205 -37006 -7240
16280 -7240 31727 36713 21455 48264 51851 71234 47423 -32045 -5576 -27655 -28395 21836 16638
16267 16638 12495 22306 37195 11860 -57820 -92127 -101759 -166043 -173493 -129062 -79043 -70643 -60646
16254 -60646 -71709 -69093 -17794 22890 38587 13358 14667 -15095 -23598 -37776 -75795 -108808
16242 -108808 -36461 -4269 8892 42831 56714 43294 9684 40504 51122 43977 50817 26724
16230 26724 38929 43616 52134 63833 106963 78211 55025 85387 114447 118696 17472 -13892
16218 -13892 -35807 -42434 -52382 -57114 -8281 36888 49002 83152 61632 -18969 -43221 -44139 -51378
16205 -51378 -28369 -17380 -22138 -50918 -79133 -40558 -83085 -48113 -11402 17350 15648 10184
16193 10184 -18234 -53143 -60135 -46067 -100092 -116159 -79431 8106 -13393 -75690 -39915 -62860
16181 -62860 -64780 -33883 -20903 -33806 -15753 16722 -26547 -12044 -8645 -42530 -65923 -81671
16169 -81671 -64936 -68862 -77772 -67764 -13134 -18403 -33748 -43529 -54952 -75476 -33605 16636
16157 16636 34505 -41336 -65888 -74536 -58505 -54907 -35116 24892 37216 73228 98970 28370
16145 28370 23612 4138 -44742 -23021 38240 50582 26489 2617 55360 96847 32333 3395
16133 3395 -72988 -150296 -114609 -60060 -17264 -2592 -73161 -60110 -49027 -52328 -18830 -42559
16121 -42559 -69543 -63244 -55037 -81219 -64871 -75001 -23418 30671 -919 -8540 25833 20313
16109 20313 -36097 -53733 -89993 -78893 -50048 -27618 -8874 -43885 -77228 -51879 -83122 -59425
16097 -59425 -44041 -66151 -7544 52621 31091 56565 55621 21114 -29956 -29096 -14319 35077
16085 35077 37678 54720 46160 51325 41325 13657 -7507 11930 -4818 -4672 20417 -3484 13348
16072 13348 38656 6426 -46504 -7761 18247 -23897 15670 34630 3126 -23669 -74581 -72957
16060 -72957 -113290 -100996 -101997 -97173 -61372 -56678 -42610 -42939 -23656 -46072 -153 -2192 -35266
16047 -35266 -47488 -39568 -40307 -46733 -40504 -31352 1658 -18048 -11042 -31642 3680 26340 44465
16034 44465 -4605 -54314 -60147 -64681 -9909 -12095 -42447 -35283 34703 34553 -4284 -34537 -71618
16021 -71618 -52303 -71488 -61213 -28354 -23572 -55187 5572 38015 54904 2471 -62211 -13874
16009 -13874 33013 46516 9540 -27164 -83474 -53256 23706 20077 -17613 2668 44510 51991
15997 51991 33878 2453 -13122 -53139 -55723 -55228 -23324 -14444 21956 72743 70795 37864 30627
15984 30627 49850 28430 -65064 -56060 -10942 -42242 -107724 -82041 -41113 -39942 -56345 -47443
15972 -47443 5826 -437 -20916 -22863 37242 70815 97449 97978 92592 44272 38546 -1879 -4577
15959 -4577 13830 -35523 -46551 -743 17788 40711 -107 -33624 4766 -10842 -62578 -99501
15947 -99501 -12447 94956 145681 145956 110927 58841 45117 8417 -29140 -51946 25452 72792
15935 72792 39773 -41951 -119981 -108053 -47632 -18205 -44767 -25702 -15513 -74661 -48973 29242
15923 29242 70397 107849 92880 20905 -3861 24705 -58563 -105679 -116902 -115392 -54686 28406
15911 28406 -7572 -69026 -123212 -77550 17835 62666 -10058 31701 -3553 -39302 20895 12971
15899 12971 -26901 -41791 -28080 -85711 -78915 -70108 -64553 -30732 -18171 -14572 13797 43950
15887 43950 78264 67563 44145 24200 -13623 -31264 -42302 -7507 11048 40311 58003 71045
15875 71045 78283 37825 36724 23106 -8592 -52147 -24184 -28045 -47853 27966 81196 -592
15863 -592 29648 51896 73421 70607 107126 143493 52376 -33876 -31289 -20245 15832 52423
15851 52423 7933 -65877 -85178 -55544 -44430 37318 88066 92913 68858 73081 93051 8906
15839 8906 -2523 17041 60393 60831 62594 73772 40007 1625 -50344 -80948 -28835 -31931 -40972
15826 -40972 -40553 -79106 -66223 -30440 26191 55195 5452 28028 70601 782 13759 -47118
15814 -47118 -94617 -51050 -47342 -49461 -20029 27811 66558 82139 28663 -18815 -48655 -49112
15802 -49112 6147 -17672 -64708 -70621 -77857 -35197 13448 18182 -28236 -53267 -56632 -60554 -48815
15789 -48815 -21475 -15681 29027 69991 68752 48239 68589 73429 23589 53031 89840 39787
15777 39787 15467 31017 70648 23370 -6436 -30440 -102801 -83213 -25599 -29473 -6411 -29615
15765 -29615 -21908 11630 55500 17801 29099 18239 77968 111833 162792 211664 302568 534821
15753 534821 967074 1720311 2325576 2358817 2075931 1577433 1014311 594593 399146 369768
15743 369768 308878 216824 129581 61998 71857 80602 85061 83451 80194 57122 31508 20293
15731 20293 10884 -24000 -20656 -46316 -13983 -11769 18699 62874 63749 65882 88473 68308 37904
15718 37904 17397 -14881 -37145 -11327 -19786 3383 -18019 17221 57391 45812 52062 74313
15706 74313 43985 -2109 -18080 34730 46253 65447 102886 93851 91434 51623 35182 72792
15694 72792 7350 -11461 72360 106398 67336 67187 -10533 -42253 -5853 13139 -37592 -30818
15682 -30818 16239 -81228 -127568 -91467 -47864 -17521 -26803 -5826 -25713 37580 38099 58655
15670 58655 67757 57219 -2943 -47328 -125680 -91582 -76150 -18163 -41638 -5335 8525 23595
15658 23595 23650 66726 50990 57204 7028 -40685 -23097 -57690 -29680 48412 111123 65239
15646 65239 36113 46965 30029 -6601 6406 29873 48586 52754 31647 439 -24755 22375
15634 22375 26276 12084 -3539 -34357 -64520 -91239 -68900 -56313 -66115 -115625 -29446 11624
15622 11624 29879 -19556 7791 59928 42480 36935 69719 81160 77179 9070 -76084 -21448
15610 -21448 21895 -2974 34343 34341 21072 -53302 28628 41153 240 19040 88347 115226
15598 115226 57819 51226 -412 -25098 -36539 -75334 -84614 -60499 -57300 569 19530 10443
15586 10443 -11511 754 25967 37136 -2220 -7952 -18346 -97722 -110807 -147703 -137231 -86389
15574 -86389 -11166 -12104 -36294 -18327 24169 25468 -2770 -4410 -42667 -20655 18708 45532
15562 45532 37990 13878 -2394 30577 36034 -3614 -72117 -106793 -71800 -107524 -81508 -88984
15550 -88984 -65604 1182 38694 11003 14725 53521 26235 47 -11430 -69496 -107666 -65899
15538 -65899 -22742 -35648 -25662 -6208 5364 15730 39926 40656 9264 -61238 -66077 -43104
15526 -43104 -23322 -37179 -12150 46154 57469 16632 32613 22548 18612 22178 23862 -24004
15514 -24004 -32238 -37264 7137 66609 54555 14851 -9167 -6149 -49730 -103513 -79786 -56882
15502 -56882 -49426 -5205 3647 37068 61841 70252 31788 2591 -40139 -59512 -68073 -56796
15490 -56796 -54604 546 11166 -73055 -79837 -49855 -43194 -47493 -7145 -6234 60418 14520 -28470
15477 -28470 -42281 -3574 -4472 21838 36703 19586 43824 22466 -247 16423 19814 -6762
15465 -6762 1693 29807 -48251 -131954 -121744 -121197 -104407 -102512 -90097 -57581 -47983 -81261 -82097
15452 -82097 -82013 -93609 -12844 52110 50972 -53391 -82787 -38226 -61354 -96434 -116209 -151311
15440 -151311 -73633 16405 4270 -66649 -51984 25463 -20187 -4707 45649 72289 89271
15429 89271 71515 25792 -3770 17545 -25058 -17633 -42468 -41145 -59244 -80144 -83464 -61468
15417 -61468 -33040 -44583 -5701 34555 -20078 -30559 -46623 -57846 14604 68442 35752 -33575
15405 -33575 38124 108613 177303 180801 118771 32042 13704 14303 66749 38965 -37426 -46586
15393 -46586 -737 26812 730 -66845 -86610 -54210 -19712 -323 -10954 57582 73102 72794
15381 72794 4468 -80082 -78073 -55568 -63706 -83467 -55923 -21606 -12889 -10054 -75305 -66269 -30610
15368 -30610 -62889 -22071 81174 135082 46250 -40975 -22269 74185 103549 42073 14108
15357 14108 26551 78931 56480 -49496 -74014 -29847 31204 28323 48114 -12605 -49292 23065
15345 23065 53948 48318 11901 17986 -7126 -22335 -19683 -52273 -99590 -77293 -88399 -129671
15333 -129671 -152229 -115604 -95104 -97926 -99066 -40472 20423 94249 85978 110170 57908 -14244
15321 -14244 -42933 -47317 -66526 -124364 -58312 -14992 -7859 18192 48335 26643 -11229 -24547
15309 -24547 12971 -12154 -4544 -3880 8911 41036 70578 86666 78609 -25120 -10839 524
15297 524 -75 16475 121 18064 39026 25131 33750 -12023 -29873 -58870 -38696 37245 25627
15284 25627 11558 -27897 -86794 -54269 -57822 -35069 -7171 24900 27719 -4585 -9858 -4283
15272 -4283 19054 72217 25973 29234 4885 -56769 -107320 -126408 -120215 -82340 -104747 -84319
15260 -84319 -14571 4383 -22436 -15004 -11342 -41117 -318 -14989 -5147 37996 74182 68706
15248 68706 43896 23124 -6885 -29772 -35505 -59563 -82889 -102536 -69025 -3177 -27113 -68473
15236 -68473 34470 82736 20875 -80165 -108754 -68810 -23900 -52291 -22583 -14293 -26032
15225 -26032 21514 31548 35443 -9835 -46053 48 2357 -44292 -50059 -60337 9370 50929
15213 50929 37383 25297 27416 -24675 -35912 11681 30694 -4599 30627 25914 -39544 -41474
15201 -41474 -36460 -58124 -101005 -104964 -82902 -55990 5555 2400 -22585 -12324 -22730 -72075
15189 -72075 9758 45230 50837 89299 8242 -45119 -56374 -29970 18104 2998 -8060 -31310
15177 -31310 -4718 -36379 -76288 -58909 11658 39123 -15554 -15018 -8839 90553 86617 52649
15165 52649 6728 -22683 -62448 -41078 4819 -5077 -24459 -20053 30920 86117 124564 75083
15153 75083 4920 -41651 -75251 -29092 20618 94330 134778 122599 68110 29680 53956 -1109
15141 -1109 -110240 -139529 -77616 -41918 -63152 -72864 -19765 9952 -5011 -19460 947 11931
15129 11931 29371 -1638 -3970 77112 92567 35305 31110 8809 15659 25396 3468 42710
15117 42710 82673 120355 102832 52708 23842 1025 -23140 -20535 32356 29182 -9434 33122
15105 33122 55530 66353 32414 3596 -41706 -72276 -49308 -95301 -128602 -91969 -17812 -3994
15093 -3994 23521 -1136 -92737 -123861 -127843 -107055 -24140 -17675 -6221 90252 46247 -33295
15081 -33295 -70074 -109803 -145346 -136048 -116259 -24123 20155 76803 97702 91208 42898 -23737
15069 -23737 -64933 -34419 26159 13871 -24067 -42800 -27127 15957 67761 43357 -3021 -23264
15057 -23264 -27655 -76009 -94599 -97648 -55429 -57043 -89534 -63196 -25081 -47644 -43437 -72542
15045 -72542 -85803 -84404 -100196 -55181 -29884 -68449 -72913 -97720 -64438 -66305 -56104 -6730
15033 -6730 -5779 23197 -10441 -49824 -13109 37521 35534 -22419 -40578 14068 83325 97977
15021 97977 59456 -6975 -45181 -44180 -48742 -103527 -101301 -50867 -13237 -7283 1999 1289 35105
15008 35105 40495 11513 57535 67622 65214 65539 87584 73716 30585 43387 44471 41345 22256
14995 22256 37821 97292 73644 63236 89361 51329 -7743 -53362 -7364 52933 19356 16000
14983 16000 -43620 -29905 -72056 -87225 -60384 -35283 -67664 -63236 -72577 -16401 -18484 -109042
14971 -109042 -111006 -80686 -103425 -42275 -23232 -29074 -25008 -2597 8731 29585 13641 -9011
14959 -9011 -42334 -59235 -50530 -48977 -19631 -24600 -38758 -40959 -26068 -14615 7499 -1425 16600
14946 16600 38318 29998 26613 55475 37128 -38389 -28012 -77961 -44615 12366 72584 66443
14934 66443 31507 -15376 -55487 -92333 -32188 -42238 -61155 -89621 -137867 -161766 -103714 -38908
14922 -38908 23722 -11180 -44343 -70333 -108863 -64501 -36534 -31467 -7049 -17966 -2222 -1331
14910 -1331 17619 8620 -40844 -51393 -70489 -122289 -87262 -39601 -33263 -48646 30683 34257
14898 34257 34991 41587 17075 14322 49533 74982 18543 -39358 -58299 45590 107995 99762
14886 99762 -5405 -98787 -72574 6014 62033 36309 13707 -23001 11995 -14762 -28858
14875 -28858 19117 61567 47173 24759 -1306 -46608 -26411 -50732 -19858 44616 52628 -19450
14863 -19450 -55737 -45400 -56420 -28734 36819 60480 37958 -5200 -1615 21993 15413 30104
14851 30104 -8175 -1561 -10559 10152 69370 108023 95802 56295 47704 68772 61750 61799 32563
14838 32563 15838 5138 34403 2388 -55235 -105181 -75305 -88141 -74132 -120659 -145014 -133196
14826 -133196 -72962 -7146 49513 80362 48045 27589 62527 61563 82302 78831 4373 -22069
14814 -22069 -28049 -82555 -110080 10916 16950 15483 -70813 -106416 -46638 -71720 -38157 9378
14802 9378 3317 -3912 -49042 33164 68414 55697 17444 -46052 -23211 -33733 -34041 -31823 -66578
14789 -66578 -61669 -13210 15838 -23767 -21775 -31856 -29676 5033 -44705 -66551 -128965 -110724
14777 -110724 -97473 -105813 -26617 23466 23339 37759 3850 -22272 44411 31370 11732 58531
14765 58531 38942 -4457 -15189 6725 -6929 -45374 -65454 -59979 -11326 -36791 -24130 -652
14753 -652 -19632 -54584 27275 54415 49991 59818 38028 -32364 -46230 -13213 38845 61100
14741 61100 19483 -45029 -69621 -102364 -61828 -22352 99 -16655 -24292 -57751 -42875 12726
14729 12726 21308 27786 -29933 -72920 -36675 12454 95331 103344 8131 -51378 -49115 -21627
14717 -21627 -43313 -23086 -63680 -108077 -70471 -62341 7421 61503 81273 62320 17323 20686
14705 20686 -1453 -80668 -97630 -72094 -54686 -60912 -32811 49961 32545 -86649 -65141 -53089
14693 -53089 -70464 -105382 -66318 -23721 -9282 34091 50897 56390 52876 61120 70404 792
14681 792 -9171 -17908 56242 44080 36363 -6986 20515 32349 35349 86684 131876 94455 66137
14668 66137 24670 13296 -36472 -99434 -88337 -37884 -13776 -14204 -56236 -74577 -71655 -61589
14656 -61589 -17862 30380 51571 25340 3831 10674 17415 36067 38271 22441 12275 22728
14644 22728 28599 7278 -50263 -95368 -124925 -123936 -148270 -131909 -103324 -122678 -157131 -143405
14632 -143405 -65003 -10945 -84457 -119108 -94890 -55444 -72113 -96554 -122425 -129117 -90978 -98844
14620 -98844 -95538 -66377 -77873 -70827 -27432 8359 91937 70613 -13101 -57390 -54383 -57455
14608 -57455 -46751 -4598 -7526 -10513 14499 -18824 -76417 -78920 -79188 9825 -5543 -29483 -37880
14595 -37880 -72034 -72149 -50803 -21343 15097 7204 16808 -18754 -60936 -84225 -121655 -117661 -102193
14582 -102193 -56081 -3528 78009 117007 43775 53876 62823 34624 -15616 -44422 -33896 -47401
14570 -47401 -70815 -61645 -38066 -13564 30258 43658 -24843 -21761 34291 3135 31927 40838
14558 40838 59792 95368 42777 2286 2747 -25640 -59204 -50268 -36592 -79749 -101542 -123574
14546 -123574 -97131 -52986 -71338 -62886 29662 31408 -8090 -87723 -88742 -42427 22870 30612
14534 30612 66855 -3358 13884 90793 79114 10792 -22551 -16247 8394 -13067 -90625 -95274
14522 -95274 -69605 -57805 -65505 -66131 -34449 -10401 -22206 -67471 -107364 -144779 -101302 13362
14510 13362 24822 5218 27093 43499 75672 114339 127466 106341 96333 82771 42466 -8988
14498 -8988 -32925 -64783 -72013 -36269 -10822 7618 33723 31146 37720 -5363 -20719 2270
14486 2270 -26555 -1879 8862 -24934 11160 59181 92289 91891 29860 -22784 8646 82852
14474 82852 102751 72733 26458 18590 26352 2903 -41996 -16878 -42701 -41960 -30754 -73663
14462 -73663 -103151 -144400 -174510 -150173 -119952 -84382 -105326 -106681 -56250 -17803 6133 36457
14450 36457 8394 36847 19243 23849 4924 9668 45918 129111 120383 89707 100633 133870
14438 133870 133227 32316 3432 22990 24756 15484 15724 26378 20417 -13952 -29146 -24580 -67559
14425 -67559 -38216 -51195 -22306 644 6997 14545 47417 70930 46425 -14344 12086 15435
14413 15435 4000 1811 -14131 -13546 -55571 -56571 -49404 -14601 25854 52789 105844 113337 98552
14400 98552 17113 -29928 511 43928 29276 35276 12653 33382 17841 -76190 -43851 73610
14388 73610 97748 44616 7994 27415 40715 23039 43589 52184 40875 36535 55056 58469
14376 58469 48219 -5932 42076 110427 42663 12247 15290 -17156 -4940 27834 42345 69878
14364 69878 128915 85334 39339 18333 -14522 -5859 -20221 -21482 -23367 44689 8504 -42836
14352 -42836 -4452 -39575 -94924 -153458 -96701 -110839 -116603 -109274 -102799 -104412 -48100 -69274
14340 -69274 -41018 -15568 31107 7790 -1065 -2478 38844 99526 57505 42460 49672 94543
14328 94543 78052 10378 -6535 -25317 -19781 20392 5264 540 47472 62623 -22889 -54030
14316 -54030 1045 12049 16301 -5123 -3445 -26167 -93225 -70783 -120831 -73029 10543 -18235
14304 -18235 -46841 -31608 -11048 -17195 -91895 -72245 -89418 -107810 -15007 43637 44152 44634 -4535
14291 -4535 -39859 -38061 -27091 -22333 59651 43235 63872 32683 -12349 -43665 -60539 -71713
14279 -71713 -63957 -8335 -27892 -50401 -22951 -50822 -56567 -44287 -38950 -37503 33496 11134
14267 11134 -56653 -575 46200 19281 -7359 27239 36448 7733 70961 80446 81200 79142 82985
14254 82985 82558 42222 69320 72137 21668 10001 -72904 -71458 10294 30116 94467 124979
14242 124979 26924 21836 38841 59038 48237 16934 -19135 -13694 11264 850 8478 6023
14230 6023 -31760 -84397 -68431 -19308 -35756 -48320 -21888 -39138 44591 53257 58787 15897
14218 15897 279 2072 17152 65440 75965 90914 38801 34544 84604 64706 89151 86279
14206 86279 43780 -23677 -32767 -9927 -25364 -45621 -53518 -70915 -71394 4429 -7495 -42973
14194 -42973 -42999 885 80580 142172 151100 99397 54755 95810 112585 111993 100073 63665 -26704
14181 -26704 -75307 -42639 -62208 -31919 681 -37698 -56508 -67882 -95979 -41009 -35359 28190
14169 28190 32953 -17354 -3136 430 2835 9933 849 -24498 -91094 -89769 -6702 35248 8312
14156 8312 -3721 24606 6368 23453 54300 93438 74677 4931 -59992 -74643 -39660 2081
14144 2081 41452 77045 107379 115990 117862 120868 67774 45280 93881 69185 74761 82311 47654
14131 47654 29002 -5096 -77268 -31277 110878 99604 66532 63871 92681 53688 88086 102214
14119 102214 48597 16133 37221 61665 16103 -33912 4040 31748 29627 34847 38438 -3059
14107 -3059 -1122 3300 24280 24957 8443 12447 -5661 8775 6472 2050 -35416 -86179 -67991
14094 -67991 -94212 -104661 -139136 -127952 -91388 -57899 -58394 -43658 -7311 26335 84901 79200
14082 79200 37605 69297 65420 69962 21124 -3294 13167 55953 73560 89798 68580 32453
14070 32453 -48316 -49241 -34194 -63912 -126158 -98134 -30470 4612 464 48365 78324 72419
14058 72419 64427 37021 -19146 -49940 -14741 52991 88326 36747 6649 -17335 -47059 -107861
14046 -107861 -132423 -122666 -38803 -21206 -52725 -50820 -17763 14333 87443 107685 99009 12933
14034 12933 6595 10004 41291 51587 82939 63674 81340 116616 93365 33169 -31586 18558
14022 18558 53246 20805 -34982 -14271 -35686 13846 51123 24782 -13850 21079 42914 28844
14010 28844 21334 77633 106136 82754 126832 157511 91235 125922 150973 185279 171085 82228
13998 82228 141539 141756 61585 28252 67353 97598 63045 41324 52269 45411 60922 106743
13986 106743 171397 164318 113800 84665 97354 44820 23789 56428 90137 60341 62823 74577
13974 74577 68670 49772 63574 118235 84720 40918 -35573 -65145 -102126 -53992 -18317 -65970
13962 -65970 -77519 -24150 -9951 -50488 -72652 -50752 -19687 -17804 12618 71827 83224 87536
13950 87536 84115 94338 106529 127078 152911 146094 102508 34116 8529 9499 12099 14360 26864
13937 26864 17184 1633 -47261 -53963 -20376 26009 72041 84370 79902 45610 9001 2105
13925 2105 -3104 13870 28926 -7018 8506 55979 42993 26362 -41790 -68699 -52146 -56862
13913 -56862 -58330 -34917 34179 99854 69851 -3198 48643 40455 34459 62076 83349 65937
13901 65937 87892 132679 134228 136644 107720 69493 15706 10201 10159 12846 13824 29179 53345
13888 53345 53957 1142 -11684 50624 58323 23426 26171 49142 9771 12376 39407 89429 130935
13875 130935 125204 145002 165671 98228 83904 55383 33358 36580 18390 58608 63416 58476
13863 58476 62314 -17124 -102789 -87809 -28470 -32031 -18717 -49368 -117376 -187673 -174613 -132793
13851 -132793 -145828 -141125 -71937 -71837 -96265 -20263 50532 -41841 -117261 -140242 -69388 20567
13839 20567 25470 3263 -37197 -8505 47321 3851 -23392 -20816 69292 62729 71986 113666
13827 113666 69896 54278 60531 53826 28056 61811 109696 55778 15072 -6504 -17729 28986
13815 28986 36261 25385 101615 107084 83876 11638 40835 65359 62550 35572 49809 37711
13803 37711 95366 79858 25642 34878 36822 74705 42560 -8758 16681 57813 73302 86863
13791 86863 93340 125532 114534 155163 188857 148444 30438 -58846 -60583 -79564 -31813 -26573
13779 -26573 -32804 -25861 -5735 17040 -10424 1832 55779 76361 115035 127566 153714 147192
13767 147192 103288 47628 81647 70209 67329 43059 29179 36874 114231 211798 229070 190925
13755 190925 173779 130664 76311 58446 63080 48806 51693 44913 9633 27092 44997 14402
13743 14402 37661 83981 154206 106545 71255 67727 16997 21605 52318 58122 78158 93189
13731 93189 79482 52862 15684 18736 21521 -9795 38720 39728 70727 140676 131275 127659 138670
13718 138670 88655 52629 72848 56387 32524 37553 44525 80389 103943 125503 115625 41706
13706 41706 31203 91117 148030 140713 99243 129637 154270 152819 173729 184326 205865 191376
13694 191376 182587 143739 75710 48174 35876 46915 7372 6263 19420 41018 42058 13445
13682 13445 -12158 -33978 -17767 2050 -15397 -6063 23931 30363 13806 2009 -38111 -63717
13670 -63717 -11251 5723 45908 78072 14611 -36325 21771 56487 41146 68729 83011 57947
13658 57947 2924 23426 -35723 -3156 9777 -12139 -19372 -27276 40952 33492 13652 23421
13646 23421 24192 21724 3698 25543 95358 108639 64825 66834 48406 38497 746 -2795 39960
13633 39960 96946 122121 100652 93616 22395 23091 38364 55971 47165 87629 134590 89318
13621 89318 52069 57183 55399 8962 18689 25498 34241 35177 57779 81992 45626 60981 71519
13608 71519 87256 120112 104960 129946 107810 78621 6355 -82429 -87830 -12018 -5122 -20888
13596 -20888 27742 38132 50373 100090 74673 76144 145214 140496 99423 99631 165959 159368 134269
13583 134269 108177 132547 188287 108392 85944 48215 58796 77667 92445 59649 -3216
13572 -3216 -6637 24839 125609 177095 121058 127897 174092 169574 169536 116127 91287 80295 52714
13559 52714 22952 -20546 -7331 3258 -1650 38033 6747 38571 55811 69465 126500 124048
13547 124048 99917 78733 122378 87264 1260 -5121 25474 22674 65499 139870 121729 74823
13535 74823 83316 148373 188221 147428 87862 82328 108035 98401 122759 101832 113603 156284
13523 156284 172963 146888 86257 109796 145107 153042 138507 136957 133432 130869 93907 157362
13511 157362 172825 74728 65514 121611 118350 106056 133664 237949 208811 132882 102162 63100
13499 63100 28733 20352 -8457 24910 47584 -157 65791 75581 78803 73257 35389 26096 65326
13486 65326 120947 181951 134689 143541 162611 105871 115570 95828 96584 141634 182254 159798
13474 159798 172756 158479 157122 132047 113898 84085 35521 61247 103134 95680 117000 146561
13462 146561 93532 104647 127617 148428 121102 126188 113627 87329 49261 29862 47965 60047
13450 60047 62685 40986 76172 48272 5531 50850 56460 64324 12483 -22100 10697 19048
13438 19048 52088 50884 119492 191802 194760 163647 112489 148058 132417 77562 55720 108370
13426 108370 106181 127390 172877 223911 200142 164338 137955 67125 36387 52689 27064 20075
13414 20075 21995 97223 101910 89576 32082 24678 44624 29074 12750 67703 108498 134843
13402 134843 127300 126745 94039 60064 54160 43162 24617 43863 34324 72331 120323 175085
13390 175085 182228 125520 62170 64594 131883 152154 145685 127377 89420 47416 86694 96940
13378 96940 109877 115910 99240 81575 136306 102263 87208 95576 102568 109932 112467 127678 131582
13365 131582 144257 234469 300924 272706 180019 149629 164203 180697 142875 78746 56250
13354 56250 58014 87468 112179 127944 147539 126501 115147 143739 229406 212789 185360 157500
13342 157500 135162 145689 121066 137568 168878 175011 172147 178788 130934 86011 131629 174562
13330 174562 112408 48355 76640 62556 78366 110397 144842 145621 114001 93156 88527 68941
13318 68941 76359 118165 96520 95513 31314 19802 61758 105105 89845 137657 230668 178414
13306 178414 114033 86301 61657 141056 171522 177535 194283 184504 107756 173713 244133 268388
13294 268388 236727 191276 134227 99770 51383 63193 117252 219840 220073 214227 151305 37233
13282 37233 -5225 1240 29515 80521 153885 131090 87678 137470 149046 122154 115143 97263
13270 97263 49307 41071 52280 61241 29351 52896 75032 126038 146178 169602 189497 180723
13258 180723 175111 173072 195553 168055 156541 158100 208899 163587 148241 108468 82149 48605
13246 48605 92896 170865 224873 180198 110704 84373 143360 162693 149074 112973 114284 189285
13234 189285 160093 88714 107146 155396 171776 204053 180821 173484 155761 168228 193516 185959
13222 185959 119282 114843 143852 149819 134809 156712 183729 151002 132264 156624 132560 110189
13210 110189 94700 85407 107428 114466 126433 115150 102817 77171 74291 117371 128565 137147
13198 137147 170478 178417 200844 209501 208662 181541 207159 225597 232862 248248 229165 195252
13186 195252 155128 171957 199492 181781 155522 155402 162871 224505 240762 300908 273855 170885
13174 170885 139808 161990 192203 297087 341778 326452 327260 286333 201574 185215 209473 200194
13162 200194 160336 179855 188794 172591 163880 210224 255571 197513 178071 213624 207475 213347
13150 213347 161082 151942 165232 191593 175781 133123 119089 98083 164939 205539 193435 181076
13138 181076 172040 175759 205728 205540 184875 205729 229643 231715 267317 279674 272641 322001 331040
13125 331040 279770 255609 246276 246807 292202 311911 392066 327639 202263 186035 225945 259034
13113 259034 235959 212555 237843 235249 108030 116746 164818 236432 237741 226976 264811 264248
13101 264248 222807 216800 178265 219855 255834 215346 198225 215158 195797 159941 180769 169362
13089 169362 212024 225845 160991 169619 113227 128434 148405 73782 58226 175998 193575
13078 193575 218538 335804 350725 344207 280143 260069 323292 288410 225226 191952 217913
13067 217913 225252 168611 213051 285570 301462 255797 194285 194819 213560 204823 221141 242091
13055 242091 248989 234738 239931 248509 235615 171792 182757 266176 320525 333597 344814 335434
13043 335434 266079 227566 229632 298478 349842 374090 358539 347078 326338 338192 348059 312306
13031 312306 268010 231234 321401 312751 256032 256905 209321 207876 248143 261624 298938 283903
13019 283903 211488 211133 171592 194233 244835 181785 178003 239301 252393 265762 350383 401422
13007 401422 391052 329982 251189 227274 253732 301739 280500 237557 225937 265304 304984
12996 304984 325140 314283 265411 308614 356243 341758 296026 300614 268213 324695 357704 348288
12984 348288 367261 333254 275563 311147 314457 304323 348055 364832 340328 288761 314553 265392
12972 265392 267410 318117 316006 328957 371839 388623 416359 418025 350114 287550 276008 376890
12960 376890 399500 347230 362037 367448 326083 286188 306572 350265 344795 370329 379677 353627
12948 353627 341398 346689 347950 348024 329058 301898 303280 240934 216899 233693 285360 324694 300108
12935 300108 237085 251684 270019 300479 395352 381531 317627 304438 364354 340788 290402
12924 290402 256851 281978 233953 242929 325047 350977 317389 266476 342995 438904 394043 325426
12912 325426 301184 260136 279366 370330 448687 430281 354826 354717 344253 330594 319090 334893
12900 334893 357202 314673 316637 351459 367909 402270 362509 361488 359785 345881 367746 363079
12888 363079 365878 368137 383388 440013 435801 376911 333356 390337 427085 434614 415132 381828
12876 381828 397201 391096 376561 356937 349751 352233 374336 408880 432965 414748 389697 379508
12864 379508 361164 351153 339460 311752 343812 380972 349769 373765 429291 487421 414536
12853 414536 379588 371173 389385 381854 397505 373141 380681 353611 389731 448959 520518 544490
12841 544490 499411 460776 463561 440067 517688 548422 497274 479281 483995 463958 427509 402221
12829 402221 413870 434017 494315 467526 410095 451512 503299 505022 472607 410800 344131 344471
12817 344471 366323 331460 315270 367633 376288 390838 438485 474763 473056 459624 462335 476347
12805 476347 429880 361875 403749 429680 447680 424575 411950 413885 428279 459462 444364 478714
12793 478714 510815 507661 497793 468083 472913 499965 554410 560249 543008 529983 518979 526743
12781 526743 514619 509011 574571 545124 567406 503909 482154 443436 499913 509968 557238 545720
12769 545720 598935 642099 593741 513159 506387 558049 564275 619681 604907 500607 499548 510582
12757 510582 536790 574194 618355 627768 613320 584079 558538 583223 589269 580581 529620 471157
12745 471157 504241 586751 609135 601723 614578 662410 620951 560703 562992 559247 543726 557976
12733 557976 584520 644984 676582 669496 622024 581169 528652 535628 631005 637717 627230 623463
12721 623463 634893 590106 511751 482197 513135 567042 603653 589390 602934 695624 717283
12710 717283 678559 594704 531674 578914 593168 582086 563407 648872 655842 594122 590922 545680
12698 545680 583715 620103 652952 697132 731648 694921 711032 666510 648684 656689 715722 685477
12686 685477 638702 617782 625866 614903 623592 655811 697966 656808 636353 645511 693111 724343
12674 724343 731390 723864 694625 669774 662402 649868 650104 662985 660997 724960 739244 712694 702502
12661 702502 666491 662934 698884 705603 654301 620883 647465 677607 642860 629833 581319 608565
12649 608565 691288 718523 724117 696368 656421 626972 642323 641917 613897 611017 631109 714810
12637 714810 726896 702606 767479 772514 744645 685791 720788 747098 751641 770803 744776 720007
12625 720007 673422 623099 661289 728041 782145 853215 874328 846435 806594 716084 695634
12614 695634 720260 754690 796792 806304 764434 743295 766456 754202 745089 748658 703424 707496
12602 707496 682130 767290 857283 820885 788427 797509 826635 871346 882181 835616 757544 731279
12590 731279 764794 730023 656516 687264 788543 892773 901589 825327 811688 804421 794576 809762
12578 809762 788696 781097 822991 818866 753380 722287 708810 677395 730001 739536 746938 787461
12566 787461 766429 845185 828826 771495 733551 810153 836414 849436 816821 838587 818790
12555 818790 796255 863878 875055 860414 884163 851021 869519 895424 925727 833441 804040
12544 804040 849784 853007 858905 875829 901170 880582 858329 825587 788315 823771 841305 838978
12532 838978 891248 891343 845626 857105 878022 848449 835229 787751 810288 814401 843616 898830
12520 898830 961240 988201 945353 913250 931383 912341 940770 952437 972589 995480 877519
12509 877519 794033 770614 864833 943030 906837 774031 771637 824740 846952 840327 820839 866661
12497 866661 935361 884663 867901 880781 933148 915723 855831 849378 867945 856209 863812 807153
12485 807153 776033 793327 810843 808788 898352 928917 954353 931585 899060 958256 1002419 1074698
12473 1074698 1078496 981217 962365 961499 947084 905172 930946 981824 988768 989915 1019914 1011554
12461 1011554 980283 938889 900406 883372 957048 978612 972076 949725 947029 902104 904987 953716
12449 953716 1006889 1025493 1012383 1008625 998352 977499 942810 903642 901183 954699 967064 917762
12437 917762 903658 910676 971497 957303 910057 896454 926364 927115 929059 986083 970999 962290
12425 962290 916658 874792 867313 867562 934254 978189 952254 967231 940600 871882 901270 890492
12413 890492 829572 860897 947188 985162 947485 871562 825578 864484 914276 907885 884337 893917
12401 893917 906744 969741 984404 918155 875541 904881 957638 1005703 1048533 1035859 976243
12390 976243 849968 801686 825156 872646 892810 929821 934818 938816 886562 856568 864410 942045
12378 942045 967291 971723 956847 941204 941779 973419 950515 906398 955421 940505 891561 867480
12366 867480 880453 902852 919168 923948 914354 904082 898047 917686 899179 894153 938283 975745
12354 975745 993608 967553 954809 923174 921758 889056 906075 973040 1006183 1006738 946456 881601
12342 881601 837721 835209 809224 842771 841233 880573 898105 891068 881702 880922 825203 856524 880635
12329 880635 900031 926526 885224 845260 849068 882627 930194 898312 845966 844746 829323 763817
12317 763817 708240 738213 794017 848192 902523 860052 854197 824537 787983 873399 931390 933887
12305 933887 906305 872446 871025 860232 869143 916855 897404 876866 897567 947134 950690 850470
12293 850470 838056 849202 862043 888198 835399 845303 867033 890251 905069 930151 918838 922187
12281 922187 879054 848517 883434 854302 781519 706817 771140 833133 854804 847876 821750 840593
12269 840593 849286 811218 802836 805309 813390 834616 777417 735027 738078 771739 797243 749329
12257 749329 725670 701102 715022 716888 773700 861610 928961 898451 824195 869830 863694 834780
12245 834780 822142 820997 761737 765102 817565 834474 800577 766867 752235 772258 770138 718513
12233 718513 691374 747849 782125 751134 767005 812976 809838 789615 760613 731718 756350 739224
12221 739224 725882 699150 723875 735430 685752 667670 641076 661505 747920 803023 748463
12210 748463 735791 763510 792427 794135 789433 741853 739586 777863 808378 780376 732590 760112
12198 760112 794730 815108 801430 793112 763597 751236 759629 727773 762613 794925 692762 679745
12186 679745 668349 679902 696116 719732 720622 674057 596350 557085 555895 605307 635202 616696
12174 616696 615896 618820 619583 626471 612694 630165 651822 680061 715513 744323 775935 803317 852132
12161 852132 811540 752232 714677 617637 596393 567038 560985 549877 560007 588380 589897 588820
12149 588820 646108 677876 724429 653215 606843 615439 631019 673301 647158 595939 529823 585628
12137 585628 671297 696239 708097 693215 670013 672409 606809 538859 602277 593333 593557 653007
12125 653007 669423 626649 578199 583262 587950 608195 563707 537363 588613 604269 568437 533438
12113 533438 557038 521959 497899 463338 465950 432163 461127 459182 480383 504787 521633 538631
12101 538631 559469 512338 502765 532599 521173 481926 473973 544598 532371 499205 494810 510645
12089 510645 473664 480516 494867 539164 516049 476454 452211 469217 488956 484376 470140 488920
12077 488920 509977 503872 529056 550645 478383 447112 492098 551732 538903 489356 490185 487296
12065 487296 497048 541999 558006 553729 525365 555782 576411 543408 560850 579535 540568 520127
12053 520127 534194 516902 429651 406084 425249 529013 622735 548295 530766 525490 522592 509606
12041 509606 549024 552100 541301 503751 473520 501411 519027 524463 568501 607890 560768 510966
12029 510966 522568 524593 474969 507798 455322 419584 421939 463514 516444 472828 410004 396124
12017 396124 401286 454624 437787 441448 446639 442630 440452 476000 489517 418613 417836 409428 423310
12004 423310 444576 377381 327152 364130 405656 460051 433796 376190 364721 411601 444123
11993 444123 446056 456506 482320 456313 463290 511631 550056 572080 509658 435489 397513 395401
11981 395401 423780 466453 414185 348062 361146 464597 561384 531034 493143 507126 521783
11970 521783 490181 368644 352620 317524 346761 408974 414297 390450 420045 449582 375529
11959 375529 390484 391274 368486 317327 317132 315054 313709 332836 290409 259969 280376 315284 375499
11946 375499 367604 366516 383663 449111 469316 457092 438220 417949 390554 317255 307335 346042
11934 346042 385216 350619 334699 366811 338420 297095 263479 290024 321679 310773 280221
11923 280221 310232 336114 337786 326900 308490 351262 356316 317769 317967 348692 372682 381066
11911 381066 367880 357842 352447 374556 341389 384702 409071 392442 346170 338756 337066 368889
11899 368889 409567 377051 344272 271956 266015 289727 274598 264173 268076 267520 220356 215010
11887 215010 211146 225547 146815 143756 176729 262276 315313 248970 205054 220565 273552 295245
11875 295245 312604 319219 340792 369733 363170 263533 216699 237056 217189 269617 239265 210650
11863 210650 231415 255251 252007 215197 240236 247059 254265 229353 148523 173130 178728 249329
11851 249329 267881 256224 172312 193922 268074 277031 308542 300901 241328 289104 296127 213181
11839 213181 236024 254464 304859 287228 289447 350174 333318 277244 302054 230192 224263 221908
11827 221908 237714 234438 203681 189567 187209 227805 258116 265213 308126 331467 271529 248194
11815 248194 254146 227428 207511 216279 257795 286724 240372 239015 281398 303090 216613 218947
11803 218947 249698 272756 251388 245969 247625 223009 228666 222249 192926 193259 197207 251594 249061
11790 249061 270160 306815 309436 334820 344826 313844 240188 211487 219451 278388 322253 302947
11778 302947 260183 248222 220090 291681 277764 219915 243172 250190 215157 223625 180218 179677
11766 179677 228964 209263 207433 226053 250263 289095 267029 228270 161177 131399 100338 119696
11754 119696 109963 82016 94231 80195 102655 98420 76918 145848 180191 202207 166772 148692
11742 148692 122231 131560 182333 169181 171834 220836 292473 292104 210823 143991 153657 170490
11730 170490 169849 171868 108440 53847 22845 66503 90056 101577 129018 121902 68622 81070
11718 81070 92079 108850 153047 207138 196572 176423 155318 149791 152784 120816 62016 105995
11706 105995 189723 188476 209002 210221 193260 90319 64050 66904 79005 147133 161484 151293
11694 151293 167561 171579 172795 213769 218785 162482 192305 213478 230480 198778 151311 170901
11682 170901 224202 196252 180953 144472 51568 37041 51100 37573 15515 41463 76350
11671 76350 109929 108556 80422 70871 62394 55613 66887 103956 147853 105535 101774 124552 143090
11658 143090 166023 128169 76729 100863 82923 23523 10419 45707 91601 143876 214965
11647 214965 217132 159429 139839 150878 181084 118160 96428 141966 181445 193895 127943 70985
11635 70985 132532 178820 207894 264744 325385 265374 216074 155615 116268 104251 79462 36881
11623 36881 -39931 -54735 -46224 -31527 20331 92013 154762 136070 130912 101596 89990 68276
11611 68276 108590 156638 165430 77802 104924 189560 177591 132809 115577 121295 114855 95484
11599 95484 95003 117501 127224 159783 104426 66931 105894 117986 121030 156339 230310 176430
11587 176430 130393 132116 82449 74557 49633 66209 74271 109407 153312 171164 148930 147576
11575 147576 146865 166242 133753 115752 98228 115585 146101 196392 195634 164015 219298 186201
11563 186201 92207 -2854 -41159 -21330 33988 78241 121120 119234 143419 86772 43675 4677
11551 4677 43136 85552 77669 65574 97120 116190 142531 96124 83130 93039 115969 129441
11539 129441 168232 116542 43169 86713 127895 87123 46571 46897 21930 45576 68712 121376
11527 121376 172459 151678 169894 215449 191006 112888 53849 59794 83072 93856 80765 116029
11515 116029 101272 67127 75639 112872 83321 113853 110633 131453 101451 93752 138243 159422
11503 159422 44856 -1998 23306 80322 100870 148368 117712 5348 -10327 112235 210166
11492 210166 182209 139853 121985 99962 24356 61984 58975 25339 48484 96366 127960 159164
11480 159164 161842 169406 122724 50746 56273 45641 68031 47784 80446 90496 79650 37520
11468 37520 7706 3931 28409 19658 39594 36197 75860 55542 39582 68432 122005 102199
11456 102199 77449 42902 85891 121772 129968 169800 177194 116201 152592 130969 70833 37072
11444 37072 84042 78088 87108 114339 137787 150125 91836 95000 93141 85227 97700 124914 87494
11431 87494 63709 79774 130285 231739 230519 165761 119581 18450 -26106 -17258 8265 71550
11419 71550 65644 36783 11619 22245 25992 40719 13251 11035 27924 15592 19264 -5791
11407 -5791 -1728 -39670 -80129 -89053 -44323 -2030 30448 88608 74114 62473 83694 55879
11395 55879 49223 94457 74634 48819 78753 120196 153355 170301 162192 190078 206298 169183
11383 169183 84528 80057 72600 51710 55150 31242 48295 35032 20520 -23756 -22383 10952
11371 10952 36054 47624 97011 121666 62864 -21355 4393 65502 114109 74478 42572 16637
11359 16637 7947 -6491 23059 71388 42611 -1907 57276 79087 88393 106467 83023 31596
11347 31596 36301 74 -9811 21938 -11532 -84081 -57248 -41439 10529 98012 115767 20731
11335 20731 -101319 -65147 -49488 -46164 27548 35151 16595 -9914 -15624 5279 39024 39327
11323 39327 5087 -21700 -22970 11498 46794 23780 41225 -1667 -6957 31883 16423 -40261
11311 -40261 11359 59428 51315 -3055 -12240 -4807 -39800 -21107 53282 -8030 -18548 -1848
11299 -1848 11738 20988 8927 38235 62697 55007 88653 67045 93902 97369 124989 122986 17811
11286 17811 -34381 -21109 -57467 -84184 -70901 -56141 -93945 -59319 17769 99937 130652 182055
11274 182055 142816 45770 57457 17167 6626 19063 -5887 -11965 -39145 -51558 -2245 74609
11262 74609 120926 77804 -62494 -94906 -75677 -27082 17444 24621 -5163 39871 45278 61790
11250 61790 43602 99045 45486 -23807 -23280 -11906 -66366 -95333 -83184 19137 56273 81608
11238 81608 94442 109276 88032 65214 82132 62875 36589 64106 100277 118991 89701 -45009
11226 -45009 -178406 -176297 -73879 -39794 14207 38588 73570 124596 150473 73826 1680
11215 1680 -18872 -20624 15604 65268 48024 17002 43559 -4482 -43095 -78608 -110858 -71944
11203 -71944 -40098 18511 19722 17684 -10775 12033 83512 52760 36913 78821 50829 18645
11191 18645 -36530 -35779 -40424 -17995 -21409 -43647 67900 122379 101882 42054 61385 22165
11179 22165 6485 31041 36867 88086 59943 3181 5260 22106 20798 29761 -15344 -72071
11167 -72071 -59945 -32836 -12534 21037 -32992 -29291 -51483 -51170 -46293 -37190 7502 83393 43060
11154 43060 -4060 -5939 -37380 -52082 -53901 4460 72471 85608 31448 17872 22306 37654
11142 37654 24148 -10570 -59302 -115699 -85279 -100702 -31575 -1013 -6404 -491 3008 -64618
11130 -64618 -73708 -41887 -9631 -18447 -50420 -91762 -121648 -76255 -75517 -63199 -7337 8287
11118 8287 -86185 -107653 -64249 -36428 -24560 -56095 -61593 23269 43633 30725 -4375 -82435
11106 -82435 -67443 -457 55481 72455 57486 32485 7971 -33685 16495 33810 20626 10330
11094 10330 -16004 -13427 76713 75201 45126 49319 81707 74688 64015 48880 -4729 -28548
11082 -28548 -41084 205 23433 13894 22110 -5018 -30504 -48266 -61792 -4558 36131 25827
11070 25827 -58106 -56453 -79470 -54107 -59952 -92196 -48539 -42494 -92314 -67774 155 31316
11058 31316 23705 11827 -27583 -51104 -105802 -140644 -143217 -140511 -147981 -102568 -120148 -101201
11046 -101201 -23324 6701 27936 57528 63072 65036 98342 55069 23778 88123 149684 173383
11034 173383 224737 226354 128410 107894 139305 198796 209230 207567 270069 268344 274335 256298
11022 256298 253045 298683 323050 344469 306464 336414 382654 452632 512003 549017 564443 549388
11010 549388 539557 475130 361488 238313 211187 183934 179176 276514 434213 494276 463738
10999 463738 446914 383712 257056 247436 275549 269329 245638 200968 184595 186424 182457 173702
10987 173702 215150 243533 225857 222540 112512 72930 70104 129580 127923 109994 102232 72427
10975 72427 16530 2610 20864 22386 47670 6542 -36176 -28438 -53 -8022 -23579 23520
10963 23520 16899 -820 -25319 -18111 36735 29943 3086 -37576 -40414 -35607 17117 8272 -931
10950 -931 1107 -40598 -88269 -100209 -72399 -93705 -120097 -115736 -115497 -89877 -110244 -148017 -185157
10937 -185157 -215508 -132029 -67199 -39003 -85308 -98750 -90298 -62094 42 47573 24807 -1752
10925 -1752 4449 -5885 -26428 -40526 -19391 -77805 -109165 -129175 -179735 -163043 -29208 51216
10913 51216 -10632 -58828 -127438 -143533 -84285 -29711 28946 78736 55120 -29957 -70027 -41084
10901 -41084 -69723 -81882 -74828 -74035 -68865 -41938 -61746 2085 -1419 -40501 -43343 -18970 -30375
10888 -30375 -25802 -34802 -2765 -25349 -6477 9324 27785 58520 27622 -13280 -54136 -32913
10876 -32913 -131786 -199205 -161140 -136565 -135741 -168415 -218536 -201283 -183796 -175930 -159921 -119086
10864 -119086 -72938 -56544 -37025 -33437 -29332 -60395 9183 9018 -19205 -33926 -88543 -41599
10852 -41599 -4863 7664 -15732 -84790 -128104 -116084 -120527 -90964 -36571 -4360 23860 10463
10840 10463 -39573 -22476 -26382 -43692 -15893 -4760 45759 31778 -872 -1572 2102 18099
10828 18099 -27285 -96177 -120452 -55740 -33603 -35553 -63162 -71721 -48746 -11308 -24020 -40688
10816 -40688 -77713 -21777 3397 937 -24221 -66184 -96670 -103741 -104406 -52777 -3694 -19186
10804 -19186 -38112 -63933 -133795 -129379 -132439 -140320 -125351 -106741 -85999 -56811 -70793 -103614
10792 -103614 -91594 -59200 -52212 -12199 -2232 6666 25559 39246 -40647 -71918 -30730 -30195
10780 -30195 -23816 -94222 -93957 -73210 -75973 -66178 -53302 -52005 -72866 -52622 -14655 -54459 -54443
10767 -54443 -45311 -99187 -115085 -75710 -45256 -37306 -42665 -86201 -65859 -46181 -53771 -52102 -143109
10754 -143109 -181660 -151915 -47426 -34541 -58087 -89583 -110614 -71736 -104447 -144783 -130670
10743 -130670 -96787 -127885 -95522 -154064 -203217 -169348 -162633 -138060 -150787 -245620 -179463 -118648
10731 -118648 -135714 -138346 -150890 -228724 -247482 -212979 -183422 -169361 -171552 -164636 -174434 -176122
10719 -176122 -146071 -106748 -98965 -122582 -127673 -120178 -140597 -107604 -138674 -72160 -3228 -70763
10707 -70763 -212158 -258930 -205982 -191250 -186223 -137835 -137945 -142604 -135728 -120143 -104859 -144971
10695 -144971 -192855 -196065 -170141 -156192 -184272 -189174 -184767 -200683 -150938 -102355 -145236 -136770
10683 -136770 -118572 -92774 -158027 -156519 -81915 -138062 -170575 -240996 -272980 -297874 -238427 -254076
10671 -254076 -298216 -239952 -173055 -178860 -187774 -264846 -279087 -219781 -191620 -148684 -110353 -151259
10659 -151259 -208078 -223610 -220330 -193250 -188462 -178015 -181374 -206193 -260919 -229899 -181697 -155534
10647 -155534 -176065 -86441 -7452 32038 23065 136225 259556 307918 313316 348043 302045
10636 302045 155137 75317 60998 95330 191841 181415 198377 253717 301787 422852 543454
10625 543454 756278 1020235 1207208 1401853 1540740 1654251 1813067 1988652 2307539 2776408
10615 2776408 3366759 4148074 5268119 6844949 8937694 11760994 15425309 19819032
10607 19819032 24446468 28446190 30949395 31771936 31370304 30485723 30008601 30676499 33032524
10598 33032524 37504031 44291497 53105509 62336156 69363433 72358625 71180457 67052343
10590 67052343 62134024 58386007 57106183 58848327 64045668 72831497 84090019 94969473
10582 94969473 101855363 102411625 96876588 87475243 77258073 68733572 63195578 60915261
10574 60915261 61879180 65683888 71079518 75942469 77816010 75362153 69061364 60597743
10566 60597743 52098437 45162136 40370493 37659123 36702365 36922429 37817465 38399448 37603301
10557 37603301 35134470 31340188 26786718 22293506 18404646 15280990 12869714 11019336
10549 11019336 9619732 8504498 7592741 6892040 6333779 5801351 5334427 4957248 4678002
10540 4678002 4325703 3999766 3770515 3574547 3401074 3229410 3061559 2886794 2705155
10531 2705155 2593089 2430522 2328625 2214761 2140985 2092351 1986161 1894223 1847341 1814646
10521 1814646 1726091 1731466 1709224 1641806 1581692 1498697 1405526 1363037 1305055 1231015 1193230
10510 1193230 1123850 1077947 1066923 1008516 1000229 1008622 972214 972100 1019175 1031139 1026257 963248
10498 963248 871227 840707 781386 752360 806549 831695 785273 785665 736965 686238 622856 548562
10486 548562 497849 509910 494435 513214 498213 471692 493663 502197 462320 407210 434239 418388
10474 418388 407806 419997 433149 447931 429515 401387 437447 389356 432312 466423 441503
10463 441503 383115 470274 538982 525302 587535 576227 474175 430717 420318 385007 348353
10452 348353 310236 336428 346917 400253 459522 465906 438019 394086 385611 431909 457839 413808
10440 413808 367526 366574 382659 375938 324490 277378 308111 352038 323294 276082 267794 331252
10428 331252 301295 263619 210779 223205 251417 269573 270376 276844 296760 300164 282155 227314
10416 227314 203770 246572 263067 215878 220855 160176 133652 205950 242248 224577 218123 252316
10404 252316 215877 241063 246231 207194 135597 91309 119898 180331 253123 302946 175690
10393 175690 115190 165156 212785 174054 139922 99913 105859 78255 76013 133218 207008 190683
10381 190683 158510 182118 183081 212249 279957 263299 237691 230304 224039 176126 130222 194953
10369 194953 208693 211918 195313 131834 113256 184320 243041 238566 199054 108610 160003 189721
10357 189721 170912 130534 153507 156659 159956 142625 156869 177647 125485 81910 69336 97600
10345 97600 109854 140887 183214 121317 95795 112848 117439 80441 63629 91768 79563 67846
10333 67846 109266 122943 186612 184672 197419 216044 154412 117327 81836 130386 133895 152102
10321 152102 156244 140170 136437 139444 130734 139582 115034 132088 105429 87074 107193 114589 97474
10308 97474 81921 86341 139653 219551 173652 138384 117439 60821 -5111 -66338 -63188 -50424
10296 -50424 9460 26375 65728 50509 31416 54194 48866 19214 -12820 6226 50252 82822
10284 82822 106868 177962 168347 141449 160430 165534 218626 201675 171572 147826 98324 70666
10272 70666 84319 151350 203346 197737 161162 102435 62894 89867 35621 -38918 -6613 90917
10260 90917 78123 76892 62928 100535 104356 34085 26079 26289 1990 -9718 26919 40636 54295
10247 54295 76566 111472 166948 185869 152776 154289 168095 136080 116384 20457 -6975 -25222
10235 -25222 11517 107174 124277 148957 146636 137943 175589 132857 65179 96577 63170 4455
10223 4455 7906 29128 86360 96906 101140 67093 45610 47150 73199 80792 117486 158250 127587
10210 127587 102798 60025 59893 13996 17688 60676 94766 170471 166596 147818 128653 117303
10198 117303 98294 78251 87544 85030 73040 85354 146173 134330 158683 214030 210877 157193
10186 157193 185757 151120 103079 88371 76312 100122 116825 160153 183841 160844 130879
10175 130879 74657 59061 124011 185048 183784 143929 123643 120885 207209 226662 261122 275249
10163 275249 280266 303845 366830 423344 413880 381178 429173 430241 384997 345843 271456 290552
10151 290552 333642 421839 460375 474452 552742 627142 655314 683517 634398 514538 493425
10140 493425 439010 412726 439583 416791 410536 454102 475595 488354 472731 451025 406214 355610
10128 355610 254830 215142 226745 212634 199446 209013 283700 324804 266902 226895 247625
10117 247625 216679 160861 125117 64077 66908 71033 112906 96412 136620 139196 146181 110287
10105 110287 98838 95303 159071 173094 136001 107159 135947 67398 59242 104660 100217 128807
10093 128807 128859 155307 201801 202206 117043 64964 123679 126465 80468 93015 64870 96627 49909
10080 49909 32416 12389 3547 24433 81989 54215 45517 -35615 -25318 25989 12982 49589
10068 49589 28698 5769 -37863 -51433 -94299 -68980 -7709 8075 23753 57632 53545 16287
10056 16287 55958 36350 -5477 -39080 6240 62145 55974 83601 62169 26113 55287 73157
10044 73157 62624 88108 89478 72916 35354 8583 -48640 -2205 32975 95424 126180 93480
10032 93480 82315 85273 47408 64647 57879 29945 19437 -184 -27379 -22279 25199 77833
10020 77833 97210 91972 95757 78668 81805 19615 33620 58653 9995 2210 34332 100349
10008 100349 93352 35038 24625 25800 29949 21377 -22366 -42489 3824 63155 69672 35028
9996 35028 61122 43474 36309 14430 -7949 -30485 -31958 53887 67793 87277 110789 94239
9984 94239 112678 147470 146921 152973 134872 106012 51254 16852 21179 13238 28183 23473 8622
9971 8622 -10713 -23915 17832 72897 45038 31602 26014 -459 48112 50013 22209 25423 78401
9958 78401 138605 104842 46479 -10057 -17773 -931 1122 32920 38290 39710 119060 116289 116328
9945 116328 66131 18464 69207 107739 71782 66430 126576 115430 88287 110718 71143 44611
9933 44611 -7095 -9946 53716 92215 47011 97826 123122 85919 14119 -23455 -5741 -54193
9921 -54193 14842 27222 20740 44221 -19269 -48468 -51385 47615 83856 87114 88461 106766 102387
9908 102387 72003 32544 -19497 5067 11428 31426 6813 12416 39574 73639 134933 115215
9896 115215 93912 109371 102175 85464 47356 32355 59686 9176 -14976 -36929 -11144 56083
9884 56083 14647 -57268 -50509 -33819 -18927 17486 36474 21938 16014 -22825 -72378 -156371
9872 -156371 -117122 -7789 55968 63102 34202 19267 57735 31572 16701 107283 85595 136619
9860 136619 136976 28370 -60279 -102130 -75487 -47701 -49537 -13885 -18688 -9649 28792 -11011
9848 -11011 -30424 -66402 -103277 -23792 -26529 -60964 -105106 -62606 -33584 34069 42804 2345
9836 2345 -5332 30298 38506 47375 42166 28063 83975 48386 43493 75550 106807 167573 170923
9823 170923 100099 28855 10823 44958 105547 51247 -19448 -9534 15868 22295 50857 64967
9811 64967 39291 89412 88824 55919 50362 73006 81818 49500 35511 62375 -34452 -60655 -31465
9798 -31465 2390 31516 35761 47935 22267 12378 20587 18244 -15454 -31767 -63864 -69857 -65826
9785 -65826 -83402 -53067 5985 58183 27351 -15045 -30870 -48836 -30535 -68402 -122319 -109055
9773 -109055 -68765 -30438 -15816 -32700 -78954 -118146 -106677 -48475 69498 146907 204325
9762 204325 237369 267926 235099 182363 143422 30172 16820 32470 60873 72487 73671 69389
9750 69389 84099 105329 204 -95598 -68829 -64070 -34889 -30466 -11026 32916 42476 40080
9738 40080 -10477 -13518 -55279 -43613 -46191 -14258 16270 -20788 -62515 -11758 -22896 28108
9726 28108 70266 -8379 -54695 -32392 -44406 -41645 -30537 35048 65513 -22510 -6539 -18693
9714 -18693 -28746 -7836 30653 37833 79766 80597 109288 81804 2983 -5122 -432 61041 146100
9701 146100 94835 53798 12967 -45104 -88220 -88349 -63397 13687 52088 5215 -41072 -86685
9689 -86685 -63696 -10970 7428 92339 132894 64489 58870 48053 -12740 -18065 3650 -38132
9677 -38132 -17549 6563 34964 -19759 -56339 -32766 52679 113811 61881 25539 1694 -23361
9665 -23361 -61962 -65180 945 51163 70997 74429 110653 72510 96097 122774 23682 -21702
9653 -21702 -820 6890 28578 2991 38524 127971 178880 76398 6817 11399 103986 176631
9641 176631 282081 382194 387063 310083 212037 181427 176023 143500 120684 183090 209199 243130
9629 243130 203377 134656 117952 86953 49051 51745 87512 79224 57954 25423 -24171 -55220
9617 -55220 -67748 -62251 -8894 8818 -2129 40379 67923 103929 78987 40528 33410 51421
9605 51421 -19644 -29015 27772 -15633 -33620 -37563 -59601 -37950 -28039 -53803 -47768 1537 33104
9592 33104 32426 625 28650 13224 17655 36918 69298 20171 -77363 -71446 -56002 -36827 20805
9579 20805 40953 1612 -4606 -17052 -20803 7586 9608 60776 90352 53159 66796 74831 75493
9566 75493 60675 14537 -51873 -70106 -8595 56486 122723 86492 11359 30914 45888 20687
9554 20687 33484 17501 16611 47178 54479 47164 3811 -65078 -26852 20628 26308 34810 119674
9541 119674 96954 42383 25145 39196 30957 -1470 -22057 2552 9527 -1619 -4641 -14583
9529 -14583 -33729 13103 -1579 11025 53732 33426 1460 -808 53323 106435 117109 90767
9517 90767 62081 -920 -7089 11977 1308 -24579 -30255 7401 54124 61251 11238 -23397
9505 -23397 33152 11177 -10716 523 45486 105342 69526 86406 97274 128441 81929 55762
9493 55762 24888 28407 -6342 -73591 -67609 -123625 -165103 -92404 -51656 -53937 -47495 -38891 -43878
9480 -43878 -76642 -116586 -84550 -24966 -3059 -45890 -48412 -36530 -56975 7841 40281 18535
9468 18535 -28529 -17858 -51619 -59764 -2812 21296 20540 -89612 -115332 -98446 -128735 -117285
9456 -117285 -14166 100537 24289 -18811 -8238 39135 63913 40515 -24742 -14916 -10392 7172
9444 7172 51785 29344 16474 -9711 -57761 -40101 -33674 -100257 -83245 -64389 -8794 34243
9432 34243 69873 36652 30990 75624 54027 23672 -2456 9919 61423 49157 -2822 -78906
9420 -78906 -79105 -34134 -30425 -31233 -20961 -4918 8499 43567 18766 -24025 -76266 -111574 -110768
9407 -110768 -58237 56292 144216 102022 83188 77904 113446 152751 140595 159353 142155 71056
9395 71056 34038 30223 30389 25067 79237 71174 12048 11478 34158 11606 11215 1028 -57301 -46420
9381 -46420 -34162 -38219 -34486 -37659 -16857 4197 -10418 -38904 -43801 -12049 20971 19527 32920
9368 32920 15907 7371 37124 62352 73667 59535 47211 36316 17997 8808 -33728 -48865
9356 -48865 -6158 14539 3736 6786 6338 -6424 37376 72803 87511 25847 12514 -35896
9344 -35896 2927 48694 60422 85605 113604 84390 108921 74408 114472 85814 78239 59906
9332 59906 50266 40270 51593 53303 -3755 -45438 -77930 -45669 -79832 -127745 -83190 -61863
9320 -61863 -76400 -120179 -110114 -57596 -49050 -25245 -18327 -39949 -17048 -50292 -34909 -38548
9308 -38548 -78578 -67593 -72768 -56146 -24029 8717 61203 8033 -34434 -66340 -110714 -135658
9296 -135658 -188025 -194566 -99370 -15268 31269 42267 38273 30253 52026 45019 78129 -14610
9284 -14610 -84613 -59667 -27958 48312 2023 -44168 -33111 -9705 -26984 -74593 -112961 -51674
9272 -51674 -38326 -61529 -57894 -16962 -12337 -11502 -64049 -80584 -72991 -63070 28777 46575 41194
9259 41194 68637 55957 52462 46868 43545 -12976 -58670 1374 29552 -38401 -87106 -115037
9247 -115037 -95335 -43811 -10937 32487 -3395 28136 23793 -47090 -82291 -69304 -31190 -5518
9235 -5518 -44842 -74955 -66006 -52565 -62262 -58151 -27875 -12584 -38195 -13862 -18874 6378 3401
9222 3401 28933 5022 23116 10216 -6599 27641 25169 -13595 -57377 -120891 -113143 -9648
9210 -9648 13235 -3927 -17083 -56979 -104995 -35542 21036 -35748 -47644 -29527 -43828 -74078
9198 -74078 -64863 -36990 -68971 -131180 -143187 -126346 -87786 -20512 1496 74124 51771 3412
9186 3412 -3261 54371 14354 -18051 -53476 -30733 3975 26357 -12302 -19382 25988 9380
9174 9380 -27513 -4853 -25992 -70400 -118131 -132401 -69017 26098 37314 22620 52272 16535
9162 16535 6629 76928 63728 44608 19753 27410 43248 52851 2506 -73823 -96785 -78219
9150 -78219 -54826 -51664 -34955 -35021 -22301 -37049 12473 48679 61039 49514 14638 60711 35952
9137 35952 5588 -14590 -26840 -34194 -98695 -71328 30293 24767 8490 -50799 -86008 -25111
9125 -25111 -8423 -35120 -72520 -145745 -125069 -104095 -122885 -128045 -110701 -77896 -41185 -20490
9113 -20490 -6065 34566 58719 43622 88950 88853 35755 7783 47763 62176 7550 -61107
9101 -61107 -24733 -7076 10544 1716 -723 -24630 12794 8568 -7467 11866 59551 31273
9089 31273 84 9091 11187 19 -18105 -15595 18070 -11074 -43365 6872 28015 -33682
9077 -33682 -21202 30076 101921 103900 38201 -18804 -9130 15741 10527 35977 19194 28599 69537
9064 69537 71121 58498 73887 -19229 -33802 -48249 -37000 4366 21188 18418 -31674 -51931
9052 -51931 -27093 15875 -15789 -72261 -71420 -80579 -106596 -86607 -91995 -148653 -135262 -28363
9040 -28363 29606 1536 -15462 -10325 -24985 13196 -1175 -13971 -39144 -45968 -44251 -11186
9028 -11186 -6916 -50481 -46505 13199 23063 -50670 -49479 41277 27062 79219 93395 18278 27853
9015 27853 46351 33443 5966 37923 32421 24125 40923 -2414 -18426 -39148 -59994 -59374 -36177
9002 -36177 -31198 30962 62530 -16690 -36286 -7512 -12686 -31116 -49640 -72475 -56857 -87834
8990 -87834 -96977 -59545 -44952 8538 1481 -26916 23245 28131 23279 41116 78164 742 -64575
8977 -64575 -92095 -93233 -142803 -91148 -66660 -105392 -101342 -83789 -18275 13691 3560 12792
8965 12792 61057 42575 12270 80739 94605 68321 53244 57028 82953 -12397 -4688 28736
8953 28736 44427 67026 49599 23323 -5093 -39511 -54558 -22930 17661 2736 -15251 22769
8941 22769 19443 30538 17918 -30834 7569 40249 6454 8636 21731 21599 -24598 -75743 -66650
8928 -66650 -21675 26234 20548 29924 -26291 -78952 -37715 -7293 -52660 -48284 -15284 -48499
8916 -48499 -107914 -52958 -43987 -43789 -21742 -24505 13028 1083 -22579 -25359 68998 44034 -1304
8903 -1304 9247 -11505 -33906 -36284 -6515 -42353 -102392 -62879 -49436 -75394 -108503 -119564
8891 -119564 -72698 -60825 -84273 -32682 31244 46453 -27700 -19303 3731 -7723 32423 34517
8879 34517 39207 17390 -20178 -27857 -88127 -94574 -50755 1316 -10641 25649 -28177 -54951
8867 -54951 -38425 -48969 -110374 -98266 -72238 -10286 56967 70427 -5732 -18869 -20265 -35917
8855 -35917 -13485 -25900 -38746 -78621 -49460 51928 73349 94137 87070 129146 65582 56003
8843 56003 52854 41136 42452 59838 27960 3637 -38790 -63556 11379 -9340 -27642 23493
8831 23493 40133 35032 56377 64557 44679 32115 -19641 -92471 -139077 -125515 -80483 -20267
8819 -20267 -19660 10 34981 -92 14037 -41774 -94950 -35290 971 24392 66275 91143
8807 91143 87249 92910 89712 53677 -14026 6152 9786 58925 -11732 -30803 42321 78569 75415
8794 75415 75019 66005 79531 108627 82780 32858 -1009 14169 35476 20898 66657 148549
8782 148549 130700 79694 39248 28219 12515 28006 29292 -26048 -51071 -83250 -20251 3816
8770 3816 23867 23053 -3344 -7209 -58989 -68830 -40399 1842 -3305 -51162 -66547 2711 15802
8757 15802 40596 65613 42933 -11240 -52567 -66059 -18834 17691 26991 34247 45644 17422
8745 17422 26545 33094 42911 30121 -516 542 30090 63213 38851 27250 4372 -54912 -89549
8732 -89549 -83957 -91659 -49650 -10837 5392 -4685 -58160 -46501 -97946 -131540 -11255 74060
8720 74060 90753 72231 20313 18450 772 397 31915 8238 -62259 -90054 -71717 1155
8708 1155 -8034 -98813 -109543 -122643 -115456 -46697 2078 65371 24764 -9687 -29651 -63475
8696 -63475 -43634 -10217 -21777 6895 26277 -12350 -28259 -33382 -9891 -44368 -81586 -76597
8684 -76597 -78994 -29669 -7507 55572 69577 41263 8142 51693 46873 28024 86910 59944
$$ [...]
##END NTUPLES=NMR SPECTRUM
##END=
