##TITLE=Analysis number 315544
Compound Code btb 09487
Project Code adrs
Chemist Name ugmt
##JCAMPDX= 6.0         $$ Bruker NMR JCAMP-DX V2.0
##DATA TYPE= NMR SPECTRUM
##DATA CLASS= NTUPLES
##ORIGIN= Bruker BioSpin GmbH
##OWNER= NMR
$$ XWIN-NMR		Version 3.5
$$ Wed Nov 23 10:46:57 2005 GMT Standard Time (UT+0h)  MAYBRIDGE\NMR@NMR_250MHZ
##.OBSERVE FREQUENCY= 250.131544655141
##.OBSERVE NUCLEUS= ^1H
##.ACQUISITION MODE= SIMULTANEOUS (DQD)
##.ACQUISITION SCHEME= undefined
##.AVERAGES= 16
##.DIGITISER RES= 18
##SPECTROMETER/DATA SYSTEM= dpx250
##.PULSE SEQUENCE= zg30
##.SOLVENT NAME= CDCl3
##.SHIFT REFERENCE= (INTERNAL, CDCl3, 0, 16.522)
##AUDIT TRAIL= $$ (NUMBER, WHEN, WHO, WHERE, WHAT)
$$ ##TITLE= Audit trail, XWIN-NMR		Version 3.5
$$ ##JCAMPDX= 5.01
$$ ##ORIGIN= Bruker BioSpin GmbH
$$ ##OWNER= NMR
$$ C:\u/data/dgb/nmr/ADRS/12890/pdata/1/auditp.txt
$$ ##AUDIT TRAIL=  $$ (NUMBER, WHEN, WHO, WHERE, WHAT)
(   1,<2005-11-23 10:46:19.94 +000>,<MAYBRIDGE\NMR>,<NMR_250MHZ>,
      <created by zg, POWCHK disabled, PULCHK disabled
       configuration hash MD5:
       62 19 C7 07 E1 42 D1 B7 37 6C 3D D0 77 39 F9 E6
       data hash MD5: 64K
       9E 72 B1 FB AA A4 94 C4 6B FE 5B 17 7A A6 63 53>)
(   2,<2005-11-23 10:46:37.25 +000>,<MAYBRIDGE\NMR>,<NMR_250MHZ>,
      <Start of raw data processing
       ef LB = 0.3 FT_mod = 6 PKNL = 1 SI = 32K 
       data hash MD5: 32K
       06 97 EA 09 04 3E 62 7C B4 E3 35 35 68 5B EA 6D>)
(   3,<2005-11-23 10:46:42.42 +000>,<MAYBRIDGE\NMR>,<NMR_250MHZ>,
      <apk 
       data hash MD5: 32K
       BD 30 8C DB C7 0E 5E 0B 08 B5 99 AF C5 6F 12 EA>)
(   4,<2005-11-23 10:46:43.58 +000>,<MAYBRIDGE\NMR>,<NMR_250MHZ>,
      <abs ABSG = 5 
       data hash MD5: 32K
       9B D2 2E D2 3E C4 5E BD FC 9C 96 3C 57 81 FD 04>)
$$ ##END=
$$ 
$$ hash MD5
$$ 5A 90 2A 74 F3 E2 B3 6D 8A DA 6F 95 04 8C B2 EA
##$RELAX= 
##$RELAX= 
##$RELAX= 
##$RELAX= 
##$RELAX= 
##$RELAX= 
##$RELAX= 
$$ Bruker specific parameters
$$ --------------------------
##$DU= <C:\u>
##$EXPNO= 12890
##$NAME= <ADRS>
##$PROCNO= 1
##$TYPE= <nmr>
##$USER= <dgb>
##$AMP= (0..31)
100 100 100 100 100 100 100 100 100 100 100 100 100 100 100 100 100 100 
100 100 100 100 100 100 100 100 100 100 100 100 100 100 
##$AQSEQ= 0
##$AQ_mod= 3
##$AUNM= <au_zg>
##$AUTOPOS= <10 >
##$BF1= 250.13
##$BF2= 250.13
##$BF3= 250.13
##$BF4= 250.13
##$BF5= 500.13
##$BF6= 500.13
##$BF7= 500.13
##$BF8= 500.13
##$BYTORDA= 1
##$CFDGTYP= 0
##$CFRGTYP= 5
##$CHEMSTR= <none>
##$CNST= (0..31)
1 1 145 1 1 1 1 1 1 1 1 1 1 1 1 1 1 1 1 1 1 1 1 1 1 1 1 1 1 1 1 1 
##$CPDPRG= <>
##$CPDPRG1= <>
##$CPDPRG2= <>
##$CPDPRG3= <>
##$CPDPRG4= <mlev>
##$CPDPRG5= <mlev>
##$CPDPRG6= <mlev>
##$CPDPRG7= <mlev>
##$CPDPRG8= <mlev>
##$CPDPRGB= <>
##$CPDPRGT= <>
##$D= (0..31)
0 1 0 0 0 0 0 0 0 0.06 0 0 0 0 0 0 0.0002 0 0 0 0 0 0 0 0 0 0 0 0 0 0 
0 
##$DATE= 1132742778
##$DBL= (0..7)
120 120 120 120 120 120 120 120 
##$DBP= (0..7)
150 150 150 150 150 150 150 150 
##$DBP07= 0
##$DBPNAM0= <>
##$DBPNAM1= <>
##$DBPNAM2= <>
$$ [...]
##$SUBNAM7= <"">
##$SUBNAM8= <"">
##$SUBNAM9= <"">
##$SW= 20.6930455092707
##$SWIBOX= (0..15)
0 0 3 0 0 0 0 0 0 0 0 0 0 0 0 0 
##$SW_h= 5175.983436853
##$TD= 65536
##$TD0= 1
##$TE= 294.16
##$TE2= 300
##$TE3= 300
##$TEG= 300
##$TL= (0..7)
0 120 120 120 120 120 120 120 
##$TP= (0..7)
150 150 150 150 150 150 150 150 
##$TP07= 0
##$TPNAME0= <>
##$TPNAME1= <>
##$TPNAME2= <>
##$TPNAME3= <>
##$TPNAME4= <>
##$TPNAME5= <>
##$TPNAME6= <>
##$TPNAME7= <>
##$TPOAL= (0..7)
0.5 0.5 0.5 0.5 0.5 0.5 0.5 0.5 
##$TPOFFS= (0..7)
0 0 0 0 0 0 0 0 
##$TUNHIN= 0
##$TUNHOUT= 0
##$TUNXOUT= 0
##$USERA1= <user>
##$USERA2= <user>
##$USERA3= <user>
##$USERA4= <user>
##$USERA5= <user>
##$V9= 5
##$VALIST= <valist>
##$VCLIST= <CCCCCCCCCCCCCCC>
##$VD= 0
##$VDLIST= <DDDDDDDDDDDDDDD>
##$VPLIST= <PPPPPPPPPPPPPPP>
##$VTLIST= <TTTTTTTTTTTTTTT>
##$WBST= 1024
##$WBSW= 4
##$XGAIN= (0..3)
0 0 0 0 
##$XL= 0
##$YL= 0
##$YMAX_a= 447731
##$YMIN_a= -419701
##$ZGOPTNS= <>
##$ZL1= 120
##$ZL2= 120
##$ZL3= 120
##$ZL4= 120
##$ABSF1= 16.522
##$ABSF2= -4.171173
##$ABSG= 5
##$ABSL= 3
##$ALPHA= 0
##$AQORDER= 0
##$ASSFAC= 0
##$ASSFACI= 0
##$ASSFACX= 0
##$ASSWID= 0
##$AUNMP= <proc_1d>
##$AZFE= 0.1
##$AZFW= 0.1
##$BCFW= 0
##$BC_mod= 0
##$BYTORDP= 0
##$COROFFS= 0
##$CY= 12.5
##$DATMOD= 1
##$DC= 0
##$DFILT= <>
##$DTYPP= 0
##$F1P= 14.0000005364418
##$F2P= -0.99999901652339
##$FCOR= 0.5
##$FTSIZE= 32768
##$FT_mod= 6
##$GAMMA= 0
##$GB= 0
##$INTBC= 1
##$INTSCL= 1
##$ISEN= 128
##$LB= 0.3
##$LEV0= 0
##$LPBIN= 0
##$MAXI= 10000
##$MC2= 0
##$MEAN= 0
##$ME_mod= 0
##$MI= 0
##$NCOEF= 0
##$NC_proc= -2
##$NLEV= 6
##$NOISF1= 0
##$NOISF2= 0
##$NSP= 0
##$NTH_PI= 0
##$NZP= 0
##$OFFSET= 16.522
##$PC= 1
##$PHC0= 83.34964
##$PHC1= 4.787237
##$PH_mod= 1
##$PKNL= yes
##$PPARMOD= 0
##$PSCAL= 4
##$PSIGN= 0
##$REVERSE= no
##$SF= 250.13
##$SI= 32768
##$SIGF1= 0
##$SIGF2= 0
##$SINO= 400
##$SIOLD= 32768
##$SREGLST= <1H.CDCl3>
##$SSB= 0
##$STSI= 32768
##$STSR= 0
##$SW_p= 5175.98343685301
##$SYMM= 0
##$S_DEV= 0
##$TDeff= 65536
##$TDoff= 0
##$TI= <Analysis number 999999
Compound Code 99
Book Reference 9
Project Code 9>
##$TILT= no
##$TM1= 0
##$TM2= 0
##$TOPLEV= 0
##$USERP1= <user>
##$USERP2= <user>
##$USERP3= <user>
##$USERP4= <user>
##$USERP5= <user>
##$WDW= 1
##$XDIM= 32768
##$YMAX_p= 329265816
##$YMIN_p= -112301
$$ End of Bruker specific parameters
$$ ---------------------------------
##NTUPLES= NMR SPECTRUM
##VAR_NAME=  FREQUENCY,     SPECTRUM/REAL,   SPECTRUM/IMAG
##SYMBOL=    X,             R,               I
##VAR_TYPE=  INDEPENDENT,   DEPENDENT,       DEPENDENT
##VAR_FORM=  AFFN,          ASDF,            ASDF
##VAR_DIM=   32768,         32768,           32768
##UNITS=     HZ,            ARBITRARY UNITS, ARBITRARY UNITS
##FACTOR=    0.157963299565203, 1,           1
##FIRST=     4132.6476996994, 0,             0
##LAST=      -1043.33573715361, 0,           0
##MIN=       -1043.33573715361, -112301,     0
##MAX=       4132.6476996994, 329265816,     0
$$ Real data points
##PAGE= N=1
##DATA TABLE= (X++(R..R)), XYDATA
$$ [...]
$$ plain form
16975 23286 4487 -2043 -15154 -12960 5791 12765 7763 -18510 -28322 -17459 -2479 -7840 -15034
16962 -15034 -18180 -14204 -14636 -17706 -5143 -7226 -8348 -26912 -29070 -23966 -18252 -12069 -3903 1389
16948 1389 17496 23298 458 -18393 -17550 -17247 6313 22411 4884 -24457 -18529 -22208 -26799
16935 -26799 -19810 -18688 -13854 -12948 -3920 10301 5171 -11105 -2776 10588 22172 10308 -1117
16922 -1117 -309 4591 -4211 -15717 -24262 -26741 -27391 -12653 -11357 37 14032 15152 23519 19489
16908 19489 -2322 15190 22874 20072 31439 27258 7237 7254 7385 11881 5176 -2230 1700 495
16894 495 -11738 -33078 -23770 -16028 -8982 599 -2563 -4668 -7138 -29525 -25629 -19781 -12383 -9936
16880 -9936 -10220 -9099 -3098 -4196 -9234 -22317 -42004 -52688 -55257 -45451 -26067 -9427 -21188
$$ packed form
16975B3286j8799o530j3111K194J8751O974n002k6273r812J0863J4980n361p194
16962a5034l146L976m32l070J2563k083j122j8564k158N104N714O183Q166N292
16948A389J6107N802k2840j8851Q43L03K3560J6098j7527k9341N928l679m591
16935b6799O989J122M834R06R028J4221n130j6276Q329J3364J1584j1864j1425
16922a117Q08M900q802j1506q545k479o50J4738J296J1394J3995J120Q367m030
16908A9489k1811J7512P684k802J1367m181k0021J7J31M496o705p406L930j205
16894D95j2233k1340R308P742P046R581l162k105k470k2387L896N848P398K447
16880i936k84J121O001j098n038j3083j9687j0684k569R806J9384J6640j1761
$$ plain form
16867 -21188 -40757 -39302 -30385 -36511 -24154 -17357 -6028 -6414 -8446 -5120 6744 9897 -4587
16854 -4587 -4878 5039 4624 -10804 -28355 -17854 -11858 -1163 24942 42498 18356 -1028 -12391
16841 -12391 -24097 -25910 -9174 1750 -3287 -14407 -26333 -28530 -13360 -10838 -13499 -16063 -8286
16828 -8286 -13219 -13646 -8494 -4645 -13722 -21240 -23024 -19506 -18691 -34985 -28521 -30971 -14814 1418
16814 1418 15293 23985 27777 12534 2013 7996 10266 -422 -16954 -12635 -13628 -4682 1553 2678
16800 2678 -370 12818 3468 -10757 -22264 -36829 -36866 -22241 -10603 -2716 -7253 -8386 -470 -732
16786 -732 -9184 -19549 -23232 -30858 -23242 -5914 692 -1634 7759 12903 13948 19142 22177 5204
16772 5204 12105 13623 -12848 -13659 -21582 -32456 -46736 -46150 -32581 -35094 -26701 -10282 370 13495
$$ packed form
16867b1188j9569J455Q917o126J2357O797J1329l86k032L326J1864L153j4484
16854d587k91R917m15j5428j7551J0501N996J0695K6105J7556k4142j9384j1363
16841a2391j1706j813J6736J0924n037j1120j1926k197J5170K522k661k564P777
16828h286m933m27N152L849r077p518j784L518Q15j6294O464k450J6157J6232
16814A418J3875Q692L792j5243j0521N983K270j0688j6532M319r93Q946O235J125
16800B678l048J3188r350j4225j1507j4565l7J4625J1638P887m537j133P916k62
16786g32q452j0365l683p626P616J7328O606k326R393N144J045N194L035j6973
16772E204O901J518k6471q11p923j0874j4280N86J3569k513Q393J6419J0652J3125
$$ plain form
16758 13495 24067 33920 33551 35610 41308 26600 17021 8493 -3935 -4497 -1561 -5176 1131 -2089
16744 -2089 -18238 -18940 -5193 -3922 -3363 -3105 345 -13842 -21002 -27172 -13817 -4458 -2285 15911
16730 15911 -6370 -21745 -22657 -22257 -20198 -29595 -23306 -2015 5115 -546 3261 -2897 -20203 -18285
16716 -18285 4320 -4517 -4791 -14124 -26031 -28802 -14019 -8517 -5637 5395 -196 -3026 15254
16703 15254 10031 11800 19557 10620 -3578 2763 17741 13494 8999 1322 -3140 -3841 -5023 -12317
16689 -12317 -18546 -12433 6112 4120 4034 8498 12109 6988 7515 16366 14880 12205 9868 2600 -3474
16674 -3474 -2817 -939 -2303 8733 23875 25054 23502 7814 -19299 -40121 -22932 -814 7972
16661 7972 12683 6727 -7473 -2948 1653 -4415 14363 16235 6601 4046 2963 -7341 -13840 -9757
$$ packed form
16758A3495J0572R853l69K059N698j4708r579q528j2428n62K936l615O307l220
16744b089j6149p02J3747J271N59K58L450j4187p160o170J3355R359K173J8196
16730A5911k2281j5375r12M00K059r397O289K1291P130n661L807o158j7306J918
16716a8285K2605q837k74r333j1907k771J4783N502K880J1032n591k830J8280
16703A5254n223J769P757q937j4198O341J4978m247m495p677m462p01j182p294
16689a2317o229O113J8545j992q6M464L611n121N27Q851j486k675k337p268o074
16674c474O57J878j364J1036J5142J179j552j5688k7113k0822J7189K2118Q786
16661G972M711n956j4200M525M601o068J8778J872r634k555j083j0304o499M083
$$ plain form
16647 -9757 -13787 -13967 -1802 -4755 -8298 -18327 -27384 -24754 -11443 -7518 -12241 -4310 5618 22702
16633 22702 30113 33415 36076 29378 25676 17162 8915 1840 8006 -4240 -12128 -12876 -10632 -6741
16619 -6741 934 -4424 -6411 -13187 -11236 -601 -13651 -11644 -2195 -5001 -4741 -11902 -16745 -11611
16605 -11611 1793 16418 16355 12880 -9622 -18348 -16846 -10947 -678 5275 -8488 -10250 -15964 -22354
16591 -22354 -25183 -30726 -16495 -14951 -7905 -7613 -4555 19375 15274 -4240 -10726 -16950 -27124 -27487
16577 -27487 -3196 19084 5536 -7492 -19438 -29667 -26902 -33276 -29060 -18605 -14657 -3094
16565 -3094 -7145 -17797 -20228 -16979 -29007 -24878 -14891 -12466 -9654 -19110 -6585 4110 4824 -1464
16551 -1464 10604 19131 19590 18173 10385 610 1956 8820 3285 -4694 7720 6561 -3055 -25308
$$ packed form
16647i757m030j80J2165k953l543j0029r057K630J3311L925m723P931R928J7084
16633B2702P411L302K661o698l702q514q247p075O166j2246p888p48K244L891
16619f741P675n358j987o776J951J0635j3050K007R449k806K60p161m843N134
16605a1611J3404J4625o3l475k2502q726J502N899J0269N953j3763j762n714o390
16591b2354k829n543J4231J544P046K92L058K3930m101j9514o486o224j0174l63
16577b7487K4291K2280j3548j3028j1946j0229K765o374M216J0455L948J1563
16565c094m051j0652k431L249j2028M129R987K425K812r456J2525J0695P14o288
16551a464J2068Q527M59j417p788r775J346O864n535p979J2414j159r616k2253
$$ plain form
16537 -25308 -36522 -22650 -14268 -20607 574 21797 16006 2729 -4166 -6419 -19057 -26742 -29245
16524 -29245 -33138 -33691 -19434 -18913 -32059 -22836 -6440 -12248 -27008 -35508 -36611 -28201 -18438 -17865
16510 -17865 -22069 -20929 -3829 10648 26718 14557 533 -13233 -4888 -9963 -10238 -14710 -34946
16497 -34946 -34779 -33494 -19700 -6415 -12018 -18803 -15944 -2453 12960 4436 600 5658 7970 4173
16483 4173 3750 5055 3962 -5492 -13816 -19714 -19838 -38102 -39138 -21284 -17840 -7668 17563 29908
16469 29908 26721 28112 16444 11024 14966 16254 9198 12578 2679 12815 11734 -3485 -8508 -12953
16455 -12953 5797 24446 11115 -7778 -3398 4465 2151 -1316 12078 3137 -11097 -18533 -23533
16442 -23533 -27426 -31221 -23622 -27900 -18064 -24633 -27200 -24697 -18568 -19702 -26994 -21830 -11626 4858
$$ packed form
16537b5308j1214J3872Q382o339K1181K1223n791j3277o895k253j2638p685k503
16524b9245l893n53J4257N21j3146R223J6396n808j4760q500j103Q410R763N73
16510a7865m204J140J7100J4477J6070j2161j4024j3766Q345n075k75m472k0236
16497c4946J67J285J3794J3285n603o785K859J3491J5413q524l836N058K312l797
16483D173m23J305j093r454q324n898j24j8264j036J7854L444J0172K5231J2345
16469B9908l187J391j1668n420L942J288p056L380r899J0136j081j5219n023m445
16455a2953J8750J8649j3331j8893M380P863k314l467J3394q941j4234p436n000
16442b3533l893l795P599m278R836o569k567K503O129j134p292N164J0204J6484
$$ plain form
16428 4858 12130 11561 6120 -3856 6811 22248 16137 16757 20878 21605 24705 11844 8971 801 -19777
16413 -19777 -25631 -28913 -21020 -21454 -31414 -35593 -23281 -14109 -8788 5864 7283 12740 -1323 -21959
16399 -21959 -13154 -15937 -13725 5904 15903 8514 -12888 -17646 -6257 2494 -4100 -5387 9560
16386 9560 16747 11857 21177 18518 22799 29776 15771 4797 11827 25167 34949 30184 25995 12100
16372 12100 3216 6272 4688 -4326 -9975 -14112 -12786 -6426 -2317 -10242 -26037 -26746 -16593 -5916
16358 -5916 -9662 -22776 -28413 -15963 -21671 -27926 -24585 -9625 -27050 -25651 -23075 -10150 -8131
16345 -8131 -10288 -25488 -4341 10338 -11951 -17328 -29344 -8338 4418 11963 1419 21469
16333 21469 24953 25441 13174 2367 -3705 5787 20182 11619 -2581 -10602 -10588 -3878 -13082 -23070
$$ packed form
16428D858P272n69n441r976J0667J5437o111O20M121P27L100j2861k873q170k0578
16413a9777n854l282P893m34r960m179J2312R172N321J4652J419N457j4063k0636
16399b1959Q805k783K212J9629R999p389k1402m758J1389Q751o594j287J4947
16386I560P187m890R320k659M281O977j4005j0974P030J3340R782m765m189j3895
16372A2100q884L056j584r014n649m137J326O360M109p925j5795p09J0153J0677
16358e916l746j3114n637J2450n708o255L341J4960j7425J399K576J2925K019
16345h131k157j5200K1147J4679k2289n377j2016K1006J2756P545j0544K0050
16333B1469L484M88j2267j0807o072R492J4395q563j4200q021J4O710r204r988
$$ plain form
16319 -23070 -29344 -16030 -4541 -21615 -20271 -20628 -24973 -27755 -13411 10532 10392 -3430 -21973
16306 -21973 -35369 -42487 -45288 -43022 -39118 -41821 -39811 -40329 -22347 -5519 1859 3446 -14413 -17425
16292 -17425 -3530 5287 31312 35821 9988 -12262 -20034 -4269 22063 24229 24992 17300 -8299
16279 -8299 -15592 -2500 4258 -1345 -3212 -631 -9205 12796 25401 -2301 -8324 -11123 -25070
16266 -25070 -22109 -29124 -44055 -16290 903 -4185 2552 10606 21081 17417 6550 -3068 -29364
16253 -29364 -32828 -26418 -17907 -25082 -27122 -22294 -12221 -12613 -23866 -29092 -24068 -28270 -26259 -13181
16239 -13181 -3349 -1029 -6683 -1998 1543 1642 -8383 -2609 1790 7255 -16568 -26856 -5934 12734
16225 12734 15253 -998 -8006 4109 9909 10861 12422 7078 10596 -909 -8723 2787 6816 -9980
$$ packed form
16319b3070o274J3314J1489j7074J344l57m345k782J4344K3943j40j3822j8543
16306b1973j3396p118k801K266L904k703K010n18J7982J6828P378J587j7859l012
16292a7425J3895Q817K6025M509k5833k2250p772J5765K6332K166P63p692k5599
16279h299p293J3092O758n603j867K581q574K2001J2605k7702o023k799j3947
16266b5070K961p015j4931K7765J7193n088O737Q054J0475l664j0867r618k6296
16253b9364l464O410Q511p175k040M828J0073l92j1253n226N024m202K011J3078
16239a3181R832K320n654M685L541R9j0025N774M399N465k3823j0288K0922J8668
16225A2734K519j6251p008J2115N800R52J561n344L518j1505p814J1510M029j6796
$$ plain form
16211 -9980 -2492 3153 -4302 -4800 -1046 -104 5326 6520 3486 -6645 329 6522 -8656 -639 15859
16196 15859 12379 11169 -11824 -19454 -8515 -20521 -25403 -26603 -28328 -29670 -14063 7343 -2130
16183 -2130 -1220 -15189 -32571 -30850 -31323 -21053 3344 20856 22327 19137 4635 12116 12669 4104
16169 4104 -29269 -39241 -35057 -22725 -9786 5924 22773 9842 5317 14360 28254 21329 3969
16156 3969 -3213 -13873 -17369 -16386 -21884 -17028 -15003 -15604 -6595 -6006 8692 23650 20408 17973 9115
16141 9115 855 -4522 -8657 -6767 -4903 6225 -825 -5125 7417 8372 7628 2598 6387 -6626
16127 -6626 -22790 -20533 -2725 7768 8547 6314 9077 3446 3058 1246 -1521 -12419 -8978 -11395
16113 -11395 -24917 -31272 -40903 -35585 -23645 -12094 -4947 -15593 -15594 -24427 -16421 -10064 -13483 -3619
$$ packed form
16211i980P488N645p455m98L754R42N430J194l034j0131O974O193j5178Q017J6498
16196A5859l480j210k2993p630J0939j2006m882j200j725j342J5607K1406r473
16183b130R10j3969j7382J721m73J0270K4397J7512J471l190j4502P481N53q565
16169D104l3373r972M184J2332J2939J5710J6849j2931m525R043J3894o925j7360
16156C969p182j0660l496R83n498M856K025o01R009N89J4698J4958l242k435q858
16141I115q260n377m135J890J864J1128p050m300J2542R55p44n030L789j3013
16127f626j6164K257J7808J0493P79k233K763n631l88j812k767j0898L441k417
16113a1395j3522o355r631N318J1940J1551P147j0646jq833Q006O357l419R864
$$ plain form
16099 -3619 -15004 -23728 -2066 10186 9829 -11572 -2812 5554 -16349 -4291 -5172 9315 14278
16086 14278 11757 16406 5978 -1674 -2435 -8045 -12079 -9165 -5268 14086 11340 19757 21507 19512
16072 19512 21607 1685 -11266 178 2267 806 -14962 -28559 698 12231 -4021 -29362
16060 -29362 -16398 -16055 -26473 -21763 -1502 22036 32063 10938 13140 20871 1200 17540 32604
16047 32604 25697 22705 14833 12838 10282 11493 1839 -13118 -26261 -35584 -23850 -31362 -38740 -24791
16033 -24791 -15419 -6091 -2222 35 -11653 -19397 -11794 -7372 5250 8544 -963 -11742 -19913 -23148
16019 -23148 -10851 7585 -1915 -4871 3480 13402 14920 11364 -4802 -17445 -19398 -585 11664
16006 11664 22704 2714 -8433 -12479 1598 8059 11178 6454 -4301 -18650 -12601 7764 11139
$$ packed form
16099c619j1385q724K1662J2252l57k1401Q760Q366k1903J2058q81J4487M963
16086A4278k521M649j0428p652p61n610m034K914L897J9354k746Q417J750j995
16072A9512K095j9922j2951J1444K089j461j5768j3597K9257J1533j6252k5341
16060b9362J2964L43j0418M710K0261K3538J0027k1125K202P731j9671J6340J5064
16047C2604o907k992p872j995k556J211r654j4957j3143r323J1734p512p378J3949
16033b4791R372R328L869K257j1688p744P603M422J2622L294r507j0779q171l235
16019b3148J2297J8436r500k956Q351R922J518l556j6166j2643j953J8813J2249
16006A1664J1040j9990j1147m046J4077O461L119m724j0755j4349O049K0365L375
$$ plain form
15993 11139 -5743 4445 8580 11015 22767 21747 22530 8020 -1880 -21760 -26330 -26001 -30630 -37363
15979 -37363 -36272 -19717 -22902 -27272 -26237 -32523 -25363 -13092 -1195 7492 10327 -2533 -22474
15966 -22474 -29411 -28056 -10218 -4419 -14722 4980 -9488 -21366 -26627 -20372 -19633 -21367 -15964
15953 -15964 2451 -3949 -14842 -6027 -10751 -36535 -50525 -49102 -26764 -5367 -2743 -1002 -2039
15940 -2039 1320 807 3361 1852 1766 708 -2389 -1247 -12354 -16403 -22209 -32417 -25063 -18892 -18749
15925 -18749 -22494 -993 9945 10849 4530 -1533 -7537 -15723 -14914 2641 8818 10696 3621 9712
15911 9712 25378 25373 19526 17883 -6963 -25413 -17058 -2906 -9095 -2107 20096 1001 -9371 -5602
15897 -5602 4458 9486 -2003 -24303 -40798 -18528 2286 1801 -1618 -7024 -15472 -11749 -5278
$$ packed form
15993A1139j6882J0188M135K435J1752j020P83j4510r900j9880m570L29m629o733
15979c7363J091J6555l185m370J035o286P160J2271J1897Q687K835j2860j9941
15966b2474o937J355J7838N799j0303J9702j4468j1878n261O255P39j734N403
15953a5964J8415o400j0893Q815m724k5784j3990J423K2338K1397K624J741j037
15940b039L359n13K554j509q6j058l097J142j1107m049n806j0208P354O171J43
15925a8749l745K1501J0938R04o319o063o004q186Q09J7555O177J878p075O091
15911I712J5666nn847j643k4846j8450Q355J4152o189O988K2203j9095j0372L769
15897e602J0060N028j1489k2300j6495K2270K0814m85l419n406q448L723O471
$$ plain form
15884 -5278 7175 13316 7456 -2362 18973 25950 25779 21772 11391 8012 10596 16244 13772 7226
15870 7226 15667 13387 5735 -6841 -10483 -6953 -17348 -25791 -24745 -14669 -11949 -6089 -487 -6962
15856 -6962 -9873 5670 5234 -1328 7314 19644 8782 9890 9046 -5132 -13213 -21736 -17428 -26509
15842 -26509 -34397 -42623 -41170 -34764 -18091 -20067 -23254 -28735 -32838 -32759 -20837 -11102 -22066 -25499
15828 -25499 -13447 197 885 -5066 -5859 679 3675 8319 11927 35059 30088 16208 7373 19617
15814 19617 20305 11223 9157 5970 -15370 -25316 -13865 2847 4976 -15804 -23202 -9600 4466
15801 4466 10346 2528 6086 25276 28666 8794 -6851 -21540 -22088 -16861 -23641 -32922 -28334 -23837
15787 -23837 -22830 -17764 -4882 15841 25227 18729 13574 4983 -6936 -10350 -7330 -8131 10397 4097
$$ packed form
15884e278J2453O141n860r818K1335O977j71m007j0381l379K584N648k472o546
15870G226Q441k280p652j2576l642L530j0395q443J046J0076K720N860N602o475
15856f962k911J5543m36o562Q642J2330j0862J108q44j4178q081q523M308r081
15842b6509p888q226J453O406J6673j976l187n481m103P9J1922R735j0964l433
15828b5499J2052J3644O88n951p93O538K996M644L608K3132m971j3880q835J2244
15814A9617O88r082k066l187k1340r946J1451J6712K129k0780p398J3602J4066
15801D466N880p818L558J9190L390j9872j5645j4689n48N227o780r281M588M497
15787b3837J007N066J2882K0723R386o498n155q591j1919l414L020q01J8528o300
$$ plain form
15773 4097 -4521 -3179 -24642 -22833 -11816 -17828 -3315 -9318 -11351 -7974 -13875 -8187 -1516 -13842
15759 -13842 -19042 -16126 -9365 7067 19273 7562 3354 5059 -3583 -7167 -8034 -5515 -7306 -4550
15745 -4550 -16505 -27759 -10037 1988 20060 29151 14128 10027 -824 -9189 -375 14675 31621
15732 31621 20848 898 3716 11238 7133 3936 -80 -5866 -2350 -7713 -7921 -10773 -8221 -7372
15718 -7372 -23214 -26547 -23263 -11843 -11090 -12521 -317 3579 -7466 2108 19211 6691 3312
15705 3312 8167 -5544 -18219 -17238 -4895 -9091 2765 -7707 -16341 -3228 7637 11666 10672
15692 10672 17486 20637 20302 -4745 -10295 6502 13379 5211 -3324 -7789 -8228 -3821 7098 3633
15678 3633 -5679 -1493 12846 8323 12346 13377 6151 -2625 107 -5457 -2792 1173 -16134 -6110
$$ packed form
15773D097q618J342k1463J809J1017o012J4513o003k033L377n901N688O671j2326
15759a3842n200K916O761J6432J2206j1711m208J705q642l584q67K519j791K756
15745d550j1955j1254J7722J2025J8072R091j5023m101j0851q365Q814J5050J6946
15732C1621j0773j9950K818P522m105l197m016n786L516n363k08k852K552Q49
15718g372j5842l333L284J1420P53j431J2204L896j1045R574J7103j2520l379
15705C312M855j3711j2675R81J2343m196J1856j0472q634J3113J0865M029r94
15692A0672O814L151l35k5047n550J6797O877q168q535m465m39M407J0919l465
15678C633r312M186J4339m523M023J031p226q776K732n564K665L965j7307J0024
$$ plain form
15664 -6110 -11674 -33384 -28723 -15698 12264 26990 4400 -1067 -316 4027 -383 -5160 -21572
15651 -21572 -26375 -1077 28588 35938 30246 8963 751 1836 -10798 -7023 -4693 3685 14173
15638 14173 16239 5168 -13476 -9037 406 -12064 -15990 -16797 -3191 6272 -3783 -13686 -24421
15625 -24421 -19412 -15233 -19626 -17001 -9447 7317 10972 11885 10806 -11183 -14907 7614 11760 -2693
15611 -2693 -19265 -25498 -19984 -8649 4953 -10127 -6183 -17356 4183 21306 28003 1431 -27210
15598 -27210 -24199 -10798 1069 -7640 -20746 -15027 -14257 -9948 -14850 -14623 -10822 -24282 -19675 -13919
15584 -13919 -12964 -3685 1663 -7031 -25993 -35201 -27866 -28169 -24047 -17361 -11022 -20134 -31478 -41016
15570 -41016 -37744 -12704 19292 23718 21439 6746 6810 -36 -4623 -8741 4736 937 -10382 -11002
$$ packed form
15664f110n564k1710M661J3025K7962J4726k2590n467P51M343m410m777j6412
15651b1572m803K5298K9665P350n692k1283q212J085j2634L775K330Q378J0488
15638A4173K066j1071j8644M439R443j2470l926q07J3606R463j0055r903j0735
15625b4421N009M179m393K625P554J6764L655R13j079k1989l724K2521M146j4453
15611b693j6572o233N514J1335J3602j5080L944j1173K1539J7123O697k6572k8641
15598b7210L011J3401J1867q709j3106N719P70M309m902K27L801j3460M607N756
15584a3919R55R279N348q694j8962r208P335l03M122O686O339r112j1344r538
15570d1016L272K5040L1996M426k279j4693O4o846m587m118J3477l799j1319o20
$$ plain form
15556 -11002 -18556 -4271 -6010 14213 23328 -933 -21324 -20532 -17404 -31442 -29436 -17956 -9878
15543 -9878 -16087 -15237 -2748 -4222 -12834 -15061 -7202 -8613 -20773 -20990 -25830 -27878 -16971 -8843
15529 -8843 -9214 -24077 -7859 4500 10986 19280 18324 10845 -8857 -22089 -6858 -10617 -27712
15516 -27712 -8555 8875 6024 -17648 -16331 -2336 -25797 -32430 -19356 -9401 -16278 -15953 -22498
15503 -22498 -17140 865 -9475 -17772 -17653 -32736 -31061 -32070 -37080 -46042 -32908 -12471 -8411
15490 -8411 -16946 -5526 12357 17192 5147 10936 1047 -4667 -8433 1502 1750 10836 16058 -2176
15476 -2176 -17285 -17459 -14455 -8317 -13385 -16483 -2266 354 -6296 -8632 1231 3451 18812 17449
15462 17449 8962 -3637 2972 10182 -2564 -10735 -9760 -225 -221 -13669 -9396 -2173 5913 10677 6335
$$ packed form
15556a1002p554J4285j739K0223R115k4261k0391P92L128j4038K006J1480Q078
15543i878o209Q50J2489j474q612k227P859j411j2160k17m840k048J0907Q128
15529h843l71j4863J6218J2359O486Q294r56p479j9702j3232J5231l759j7095
15516b7712J9157J7430k851k3672J317J3995k3461o633J3074R955o877L25o545
15503b2498N358J8005j0340q297J19j5083J675j009n010q962J3134K0437M060
15490h411q535J1420J7883M835j2045N789r889n714l766R935K48R086N222j8234
15476b176j5109j74L004O138n068l098J4217K620o650k336R863K220J5361j363
15462A7449q487j2599O609P210j2746q171R75R535Mj3448M273P223Q086M764m342
$$ plain form
15447 6335 106 -15289 -19673 -33599 -39607 -20765 -9765 -24259 -25006 -17184 5113 21297 29288
15434 29288 12419 -9932 -31371 -34486 -29714 -33956 -19952 -8577 -15607 -12204 -17828 -720 10
15421 10 2369 -5991 -17876 -2343 526 -1636 10145 3153 -5572 2285 -2785 1322 3886 -1868
15407 -1868 -4001 -4551 -3085 -9211 -16842 -13006 -18762 -13451 -1006 9937 16203 29660 25477 17701
15393 17701 3653 6143 1066 11155 12452 8678 8152 9550 6731 -4247 -9482 -11489 -211 9946
15379 9946 24915 8674 -8134 3046 3253 12064 13421 22304 23301 13844 17511 15627 -2137 -5668
15365 -5668 -5240 7883 2735 -7268 -862 -209 -4321 -12793 -16762 -18175 3728 1470 -14511 -337
15351 -337 10391 5721 -2432 842 11296 27248 31191 21239 14764 20995 18976 14959 9968 -5438
$$ packed form
15447F335o229j5395m384j3926o008J8842J1000j4494p47P822K2297J6184P991
15434B9288j6869k2351k1439l115M772m242J4004J1375p030L403n624J7108P30
15421A0K359q360j1885J5533K869k162J1781o992q725P857n070M107K564n754
15407a868k133n50J466o126p631L836n756N311J2445J0943O266J3457m183p776
15393A7701j4048K490n077J0089J297l774n26J398k819j0978n235k007J1278J0157
15379I946J4969j6241j6808J1180K07Q811J357Q883R97r457L667j884j7764l531
15365e668M28J3123n148j0003O406O53m112q472l969j413K1903k258j5981J4174
15351c37J0728m670q153L274J0454J5952L943r952o475O231k019m017m991j5406
$$ plain form
15337 -5438 -13595 -4444 -936 3954 5462 18991 39511 40636 37739 31026 11482 8490 2889 -4529
15323 -4529 -2901 -6015 -2802 7147 12040 8222 21817 29016 26691 25593 14463 -2885 -10721 -2908
15309 -2908 4654 9731 -375 -18466 -16596 -4164 12910 20545 2355 639 16036 -3006 -15860
15296 -15860 -17759 -25370 -27613 -21391 -11646 -22475 -28343 -21035 -10846 -11095 -19876 -11746 4488 -4646
15282 -4646 -15944 -2757 16864 11048 -1854 -11638 -15474 -2069 4082 6317 2927 20555 18213
15269 18213 11692 16181 31182 31091 37745 36645 20136 1729 661 -3765 1145 13085 11638 7808
15255 7808 6916 10500 -7619 -5294 10493 2652 -14688 -2350 -1523 -6021 -16535 -5532 -3309 19908
15241 19908 42116 40983 37551 23831 5596 -13940 -9255 6040 8802 20187 1253 3915 5982
$$ packed form
15337e438q157R151L508M890J508J3529K0520J125k897o713j9544k992n601p418
15323d529J628l114L213R949M893l818J3595P199k325j098j1130j7348p836P813
15309b908P562N077j0106j8091J870J2432J7074P635j8190j716J5397j9042j2854
15296a5860j899p611k243O222R745j0829n868P308J0189k49q781Q130J6234r134
15282d646j1298J3187J9621n816j2902r784l836J3405O151K235l390J7628k342
15269A8213o521M489J5001r1O654j100j6509j8407j068m426M910J1940j447l830
15255G808q92L584j8119K325J5787p841j7340J2338Q27m498j0514J1003K223K3217
15241A9908K2208j133l432j3720j8235j9536M685J5295K762J1385j8934K662K067
$$ plain form
15228 5982 9320 -9547 -18978 -26827 -7402 16098 24322 9990 -1668 3403 -6529 -17351 -12391
15215 -12391 -29077 -12521 1568 8255 11209 14673 -1535 -12626 -11824 -3321 -5687 -21636 -19490
15202 -19490 115 27784 16000 -2557 -22593 -13926 -4621 9198 14444 3123 -4819 -9523 -5806
15189 -5806 -10582 3641 2788 -10012 -1895 -7780 -20267 -28781 -19737 -12614 -9852 8083 9267 -7838
15175 -7838 -25476 -11927 -7052 -11647 -12795 -2638 -4270 3628 -3528 -9780 -5525 -13287 -20252 -3969
15161 -3969 8837 3966 9141 -5943 -6974 -24024 -36970 -28534 -26426 -20074 -9583 -3478 -10971
15148 -10971 -13806 -18343 -21965 -18089 -17805 -19161 -10739 -15998 -16125 -10913 -10052 -6802 7513 1375 -4512
15133 -4512 -15297 -10 2301 -19462 -36021 -32540 -19128 -15561 -18796 -31906 -29102 495 17805
$$ packed form
15228E982L338j8867r431p849J9425K3500Q224j4332j1658N071r932j0822M960
15215a2391j6686J6556J4089O687K954L464j6208j1091Q02Q503k366j5949K146
15202a9490J9605K7669j1784j8557k0036Q667R305J3819N246j1321p942m704L717
15189e806m776J4223q53j2800Q117n885j2487q514R044P123K762J7935J184j7105
15175g838j7638J3549M875m595j148J0157j632P898p156o252M255p762o965J6283
15161c969J2806m871N175j5084j031j7050j2946Q436K108O352J0491O105p493
15148a0971k835m537l622L876K84j356Q422n259j27N212Q61L250J4315o138n887
15133d512j0785J5287K311k1763j6559L481J3412L567l235j3110K804K9597J7310
$$ plain form
15120 17805 20135 11400 2953 1571 20104 20292 -2176 -15253 -24264 -25327 -25182 -25405 -27453 -22361
15106 -22361 -10918 -23255 -23718 -4621 -2777 -13490 -21450 -17276 -25403 -25128 -3092 5242 10398 3403
15092 3403 -8141 -1763 4281 5148 -2159 -148 -2246 -10730 -9466 -6703 -15129 -22130 -13912 -10086 -11073
15077 -11073 -4066 12882 18734 33401 25703 20042 708 -25285 -14169 -4136 7487 -3673
15065 -3673 -5001 16565 18602 2409 -27531 -17957 3569 21534 24216 25752 12895 8333 10782
15052 10782 33912 37135 17462 -3863 243 1178 -9582 -448 -3639 -15894 -10921 6228 428
15039 428 -17484 -14195 -14196 -8683 13478 18971 5566 -1358 7138 21853 9933 -41 -280 945 -11724
15024 -11724 -26598 -18157 6308 9338 -3718 -21854 -20160 -25246 -34190 -17453 659 20980 27785
$$ packed form
15120A7805K330q735q447j382J8533J88k2468j3077r011j063J45k23k048N092
15106b2361J1443j2337m63J9097J844j0713p960M174q127K75K2036Q334N156o995
15092C403j1544O378O044Q67p307K011k098q484J264K763q426p001Q218L826r87
15077a1073P007J6948N852J4667p698n661j9334k5993J1116J0033J1623j1160
15065c673j328K1566K037j6193k9940R574K1526J7965K682J536j2857m562K449
15052A0782K3130L223j9673k1325M106R35j0760R134l191j2255M973J7149n800
15039D28j7912L289jN513K2161N493j3405o924Q496J4715j1920r974k39J225j2669
15024a1724j4874Q441K4465L030j3056j8136J694n086q944J6737J8112K0321O805
$$ plain form
15011 27785 34711 29710 40460 43335 51171 52561 35456 35991 25410 15592 4779 -9209 1912
14998 1912 21618 24433 23827 33786 36546 24586 -5134 -13951 350 18638 19818 16964 13167 19802
14984 19802 8251 -3657 -1798 -3950 7129 15223 19155 16224 11868 6338 -2612 -17782 -13739
14971 -13739 -3252 -4174 4801 -12190 -25708 -18808 7132 29574 12771 -904 -4409 -19024 -6888
14958 -6888 -8371 -8022 -5347 3013 6503 1970 3242 6189 10942 6128 -6490 -20492 -4212 19374
14944 19374 24933 12011 9326 3147 -1987 -871 -2510 -5546 -19853 -12985 -12931 -30848 -31194 -16926
14930 -16926 11301 8584 4581 16487 9708 3798 14417 11320 4436 15653 27490 29019 17051
14917 17051 -6278 -20290 -21045 -10350 -13316 -9909 44 1936 7027 -4484 7539 11386 14286
$$ packed form
15011B7785O926n001J0750K875P836J390j7105N35j0581r818j0813j3988J1121
14998A912J9706K815o06R959K760j1960k9720q817J4301J8288J180k854l797O635
14984A9802j1551j1908J859k152J1079Q094L932k931m356n530q950j5170M043
14971a3739J0487r22Q975j6991j3518O900K5940K2442j6803j3675l505j4615J2136
14958f888j483L49K675Q360L490m533J272K947M753m814j2618j4002J6280K3586
14944A9374N559j2922k685o179n134J116j639l036j4307O868N4j7917l46J4268
14930a6926K8227k717m003J1906o779n910J0619l097o884J1217J1837J529j1968
14917A7051k3329j4012p55J0695k966L407R953J892N091j1511J2023L847K900
$$ plain form
14904 14286 14777 14454 6304 11724 32175 36475 43599 38917 19970 -1801 -1855 6605 6190 18018 9518
14889 9518 13086 14259 3642 -18159 -31330 -43276 -29037 -15580 -8610 -4316 -3340 -15438 -28576
14876 -28576 -27234 -25991 -18026 -7679 -345 9480 984 -25078 -46959 -45867 -36668 -27370 -20708 -7838
14862 -7838 -1407 -1609 -6925 -14370 -5334 864 -5108 -6659 3427 3286 4437 -1232 -201 5564 -7920
14847 -7920 -5073 9488 1296 1469 -10842 -24201 -28022 -28376 -26272 2701 28778 27629 4857 4115
14833 4115 4313 -3371 11131 19012 -1415 -26327 -34364 -25222 -13346 3538 -1429 3628 13298 12127
14819 12127 17000 28709 8612 7207 -2347 -8584 7921 19604 1507 -7727 -3654 -7234 -13127
14806 -13127 -25338 -23337 -29815 -35027 -21569 -12545 -4538 -1675 15847 30908 5847 -19634 -22026
$$ packed form
14904A4286M91l23q150N420K0451M300P124m682j8947k1771n4Q460m15J1828q500
14889I518L568J173j0617k1801j3171j1946J4239J3457O970M294R76j2098j3138
14876b8576J342J243P965J0347P334R825q496k6062k1881J092R199R298O662J2870
14862g838O431k02n316p445R036O198n972j551J0086j41J151n669J031N765j3484
14847g920K847J4561q192J73j2311j3359l821l54K104K8973K6077j149k2772p42
14833D115J98p684J4502P881k0427k4912q037R142J1876J6884m967N057R670j171
14819A2127M873J1709k0097j405r554o237J6505J1683j8097r234M073l580n893
14806a3127j2211K001o478n212J3458R024Q007K863J7522J5061k5061k5481k392
$$ plain form
14793 -22026 -16885 -7730 -9155 -17372 -2092 3465 3961 13826 15912 17677 20096 4420 -16432 -6253
14779 -6253 321 3800 -1256 25435 25733 -1830 -16596 -27902 -10079 -1002 7068 8250 16062 9986
14765 9986 17032 18452 17375 6860 -3677 -12407 -37640 -36217 -12499 -1830 -5815 6339 12026
14752 12026 -2928 -1726 9440 -4032 -11708 -5636 -14855 -34966 -18991 -6621 -2383 -19800 -32740
14739 -32740 -32699 -26562 -4772 1821 11334 10816 23209 37550 31700 17811 14635 11123 -11089 -35468
14725 -35468 -44721 -42210 -46026 -30053 -14050 -12652 -15688 -13327 -10764 -11870 19327 11384 -557
14712 -557 2406 -3658 -6449 -2885 -22136 -4191 665 -9128 5006 23356 11737 11419 -1697 -6684
14698 -6684 460 6687 -6133 -2311 -5640 -22035 -32439 -30237 -18167 -1323 -6225 -12512 -476
$$ packed form
14793b2026N141R155j425q217J5280N557M96R865K086J765K419j5676k0852J0179
14779f253O574L479n056K6691K98k7563j4766j1306J7823R077Q070J182P812o076
14765I986P046J420j077j0515j0537q730k5233J423K3718J0669l985J2154N687
14752A2026j4954J202J1166j3472p676O072r219k0111J5975J2370M238j7417j2940
14739c2740M1O137K1790O593R513n18J2393J4341n850j3889l176l512k2212k4379
14725c5468r253K511l816J5973J6003J398l036K361K563j106L1197p943j1941
14712e57K963o064k791L564j9251J7945M856r793J4134J8350j1619l18j3116m987
14698f684P144O227j2820L822l329j6395j0404K202J2070J6844m902o287J2036
$$ plain form
14685 -476 -7961 -8147 -6161 -1599 -8119 -11444 -3237 -20204 -28741 -27069 -2026 -6640 -190 -5649 -8115
14670 -8115 727 5464 -2014 2523 18754 9248 -3448 3602 23061 18724 8899 14479 7245 -10429
14656 -10429 -22730 -919 8862 12871 33912 20727 7019 17633 28255 24796 17949 25123 30478
14643 30478 24173 32382 16626 3226 4635 -5103 -10750 10398 14167 3734 -2864 6973 1230
14630 1230 12318 7204 578 -4720 -12106 -23196 -24590 -16519 5937 8542 18261 23369 20022 10440
14616 10440 5237 3438 21196 31196 15975 -7415 -565 8542 15368 15591 11511 26363 36815
14603 36815 11136 2204 -13621 -18545 -35152 -32834 -18704 -7313 -12058 -17879 -11893 2575 5582
14590 5582 11782 20018 20679 -8891 -3737 2873 5687 6830 11504 4132 -677 153 18227 25507 19427
$$ packed form
14685d76p485j86J986M562o520l325Q207j6967q537J672K5043m614O450n459k466
14670h115Q842M737p478M537J6231r506j2696P050J9459m337r825N580p234j7674
14656a0429j2301K1811R781M009K1041j3185j3708J0614J0622l459o847P174N355
14643C0478o305Q209j5756j3400J409r738n647K1148L769j0433o598R837n743
14630A230J1088n114o626n298p386j1090j394Q071K2456K605R719N108l347r582
14616A0440n203j799J7758J0000j5221k3390O850R107O826K23m080J4852J0452
14603C6815k5679q932j5825m924j6607K318J4130J1391m745n821N986J4468L007
14590E582O200Q236O61k9570N154O610K814J143M674p372m809Q30J8074P280o080
$$ plain form
14575 19427 13362 13906 18004 11459 -1201 8640 14623 14245 20836 27160 27917 20626 20464 19778 31225
14560 31225 37150 27019 14395 21971 17346 8054 4142 -8395 -7260 -16511 -22496 -16326 -23732 -14673
14546 -14673 -1231 6725 4773 5377 18560 16754 -7481 -17898 -12284 -3552 2409 -5853 -9188 -11901
14532 -11901 -8592 -3193 8344 -1333 3340 -8128 -21466 -7604 17285 -279 -3575 -4908 -7510
14519 -7510 -5177 -10786 -7247 6971 12673 13522 24309 18974 -1110 -15805 7979 15010 15028 7363
14505 7363 -5333 -10936 9864 15105 10014 -4537 7561 20471 9659 -1613 -14479 -10041 -14730
14492 -14730 -19849 -14291 -10627 1105 20210 22770 17682 11774 11855 -3835 -3134 -9478 -8273 -8013 -11336
14477 -11336 -6924 -8692 -2721 7521 16844 30475 21349 20951 7690 -16599 -24267 -16178 -19508 -20071
$$ packed form
14575A9427o065N44M098o545j2660R841N983l78O591O324P57p291j62o86J1447
14560C1225N925j0131j2624P576m625r292l912j2537J135r251n985O170p406R059
14546a4673J3442P956j952O04J3183j806k4235j0417N614Q732N961q262l335k713
14532a1901L309N399J1537r677M673j1468j3338J3862K4889j7564l296j333k602
14519g510K333n609L539J4218N702Q49J0787n335k0084j4695K3784P031J8p665
14505G363j2696n603K0800N241n091j4551J2098J2910j0812j1272j2866M438m689
14492a4730n119N558L664J1732J9105K560n088n908Q1j5690P01o344J205K60l323
14477a1336M412j768N971J0242R323J3631r126l98j3261k4289p668Q089l330n63
$$ plain form
14463 -20071 8709 6721 3188 3642 4049 33426 39175 27861 12154 8041 13208 6538 11041 17066
14449 17066 16826 2760 -2829 7851 22098 22218 13706 8070 11478 17145 16818 772 -13118 -15131
14435 -15131 -23261 -29954 -49201 -41206 -44870 -38403 -29687 -22345 -24610 -33349 -20065 -8366 -2689 6989
14421 6989 421 -5670 -3771 -11634 -26368 -21741 -1158 -4209 -21473 -21524 -5417 12219 -910 -2026
14407 -2026 -9022 -12509 5600 14345 18465 5697 -2524 -7974 4879 2687 -13393 -20828 -5892
14394 -5892 8057 4478 898 8540 13738 12462 9217 5444 -1419 1951 11704 6372 11861 21100
14380 21100 28716 2226 -11404 -16221 -5493 12292 12035 29197 28494 23213 20849 17939 1682
14367 1682 -7179 -17936 -7166 7922 9808 2149 -190 -6626 -11135 1394 -103 -13999 -27621
$$ packed form
14463b0071K8780j988l533M54M07K9377N749j1314j5707m113N167o670M503O025
14449A7066k40j4066n589J0680J4247J20q512n636L408N667l27j6046j3890k013
14435a5131q130o693j9247P995l664O467Q716P342k265q739J3284J1699N677R678
14421F989o568o091J899p863j4734M627K0583l051j7264n1J6107J7636j3129j116
14407b026o996l487J8109Q745M120j2768q221n450J2853k192j6080p435J4936
14394e892J3949l579l580P642N198j276l245l773o863L370R753n332N489R239
14380B1100P616k6490j3630m817J0728J7785k57J7162p03n281k364k910j6257
14367A682q861j0757J0770J5088J886p659k339o436m509J2529j497j3896j3622
$$ plain form
14354 -27621 -41882 -19957 -10364 -449 12962 9934 -16400 -33374 -15055 -1511 -5300 -4843 -746
14341 -746 -10794 -1997 7646 677 1566 -1548 -5440 2538 16325 5830 -4283 -15767 -26758 -2054
14327 -2054 10244 14621 23080 18122 11627 8769 1214 -8502 -4492 -14837 -23387 -11611 -9020 -3449
14313 -3449 -430 -15099 -28538 -10391 -1881 -15278 -23319 -12504 13743 17353 2695 -6052 8047
14300 8047 21686 12390 12981 23220 22487 17562 12656 -9359 -5125 378 -6730 -2305 -7689 -7917 2899
14285 2899 -1817 -1121 366 15537 23923 25968 16886 14178 8590 19837 7689 976 3152 -1645
14271 -1645 -9976 -3531 -6345 -19174 -26040 -31561 -22246 -5558 3666 -18867 -23839 3112 18922
14258 18922 29295 20454 16773 14711 15648 13216 -1241 12139 13927 6514 -1171 11751 6764 3460
$$ packed form
14354b7621j4261K1925R593R915J3411l028k6334j6974J8319J3544l789M57M097
14341g46j0048Q797R643o969Q89l114l892P978J3787j0495j0113j1484j0991K4704
14327b054J2298M377Q459m958o495k858p555r716M010j0345q550J1776K591N571
14313c449L019j4669j3439J8147Q510j3397q041J0815K6247L610j4658q747J4099
14300H047J3639r296N91J0239p33m925m906k2015M234N503p108M425n384k28J0816
14285B899m716O96J487J5171Q386K045r082k708n588J1247j2148o713K176m797
14271a645q331O445k814j2829o866n521R315J6688R224k2533m972K6951J5810
14258A8922J0373q841l681k062R37k432j4457J3380J788p413p685J2922m987l304
$$ plain form
14244 3460 -3569 -1397 -5973 -13724 -16595 -5438 5089 -12231 -17160 -12888 -6444 -19611 -25887 -18104
14230 -18104 -31256 -38029 -13037 6837 22272 20922 14655 4103 -9109 -18972 -34005 -29713 -11057
14217 -11057 -20305 1879 11385 11534 16487 11007 986 3678 15711 12761 12823 8431 16892 30094
14203 30094 31753 15081 11503 -37 -14507 423 3189 3267 -10693 -12780 -9832 430 799 4771
14189 4771 21256 33074 26191 34438 16717 -8302 -7653 1553 -934 9773 14275 20048 16410 2045
14175 2045 -4672 4339 2029 9438 29295 16419 -13619 -17493 -11896 -12177 -3630 -7355 -12375 -11903
14161 -11903 2371 4978 9008 17007 -11446 -24063 -8370 2949 1894 8252 11925 -1840 -4467
14148 -4467 4595 3870 2596 27989 44626 49227 55141 44660 47380 67337 50438 34371 30062
$$ packed form
14244C460p029K172m576p751k871J1157J0527j7320m929M272O444j3167o276P783
14230a8104j3152o773K4992J9874J5435j350o267j0552j3212r863j5033M292J8656
14217a1057r248K2184R506J49M953n480j0021K692J2033k950O2m392Q461J3202
14203C0094J659j6672l578j1540j4470J4930K766P8j3960k087K948J0262L69L972
14189D771J6485J1818o883Q247j7721k5019O49R206k487J0707M502N773l638j4365
14175B045o717R011k310P409J9857j2876l0038l874N597k81Q547l725n020M72
14161a1903J4274K607M030P999k8453j2617J5693J1319j055O358L673j3765k627
14148d467R062p25j274K5393J6637M601N914j0481K720J9957j6899j6067m309
$$ plain form
14135 30062 19444 19269 25671 5709 -17281 -11005 -3870 9118 -386 -11747 -28654 -39342 -38249
14122 -38249 -24242 -11536 -15252 -38002 -28195 -1618 -13158 -20119 6001 13863 4054 -3726 -20538
14109 -20538 -33823 -36117 -27156 -31094 -30596 -14327 1774 5048 -18296 -18755 -3229 6478 23719
14096 23719 30830 13314 -3328 3632 -9860 -8358 2053 9052 11314 -1732 -6828 -14313 -23910
14083 -23910 -25053 -19332 -4427 -5091 7267 15585 16094 20807 22157 11981 -13356 -16351 2907 3083
14069 3083 -17824 -23014 -23001 -17247 -24666 -30292 -22853 -23952 -18697 -10511 1409 -2105 -8225 -203 3016
14054 3016 11490 -20005 -37698 -18286 -11285 627 -4775 -12719 2687 7731 2935 7557 -11648
14041 -11648 189 20169 19520 17489 11018 -1040 1980 16556 28294 23340 3753 -1317 -2078
$$ packed form
14135C0062j0618j75O402j9962k2990O276P135J2988r504j1361j6907j0688J093
14122c8249J4007J2706l716k2750R807K6577j1540o961K6120P862r809p780j6812
14109b0538j3285k294Q961l938M98J6269J6101L274k3344m59J5526R707J7241
14096B3719P111j7516j6642O960j3492J502J0411O999K262j3046n096p485r597
14083b3910j143N721J4905o64J2358Q318N09M713J350j0176k5337k995J9258J76
14069C083k0907n190J3N754p419n626P439j099N255Q186J1920l514o120Q022L219
14054C016Q474l1495j7693J9412P001J1912n402p944J5406N044m796M622j9205
14041a1648J1837J9980o49k031o471j2058L020J4576J1738m954j9587n070p61
$$ plain form
14028 -2078 12366 195 -18810 -12185 5877 6312 19116 24501 21845 11296 55 -7377 -1134
14015 -1134 -3555 -1930 -2790 6068 5735 12142 27953 12327 12079 6318 -3365 -3588 -1862 -3161 -4527
14000 -4527 -21773 -33686 -17643 10252 12597 12010 23689 29864 29704 16156 15686 12099 14925 992
13986 992 -17627 -24477 -22449 -20144 -21688 -38045 -31169 -27253 -8801 221 9796 32673 37763 24854
13972 24854 10085 22970 48024 30945 23284 13097 -6772 -10655 12141 6116 -6661 -17853
13960 -17853 -3101 17991 14725 8049 20673 17971 7024 7071 -11794 -6486 6244 -6945 -17920
13947 -17920 -721 16855 13950 7314 554 11139 21305 19538 18079 914 8941 10141 -1689
13934 -1689 -4640 -2311 -4709 -131 -6326 783 -10180 -23782 -23711 -15574 -7881 -17334 -15887 -20872 -29901
$$ packed form
14028b078J4444j2171j9005O625J8062M35J2804N385k656j0549j1241p432O243
14015a134k421J625q60Q858l33O407J5811j5626k48n761r683k23J726j299j366
14000d527j7246j1913J6043K7895K345n87J1679O175j60j3548m70l587K826j3933
13986I92j8619o850K028K305j544j6357O876L916J8452R022R575K2877N090j2909
13972B4854j4769J2885K5054j7079p661j0187j9869l883K2796o025j2777j1192
13960a7853J4752K1092l266o676J2624k702j0947M7j8865N308J2730j3189j0975
13947a7920J7199J7576k905o636o760J0585J0166j767j459j7165Q027J200j1830
13934a689k951K329k398M578o195P109j0963j3602P1Q137P693r453J447m985r029
$$ plain form
13919 -29901 -25983 -13073 3602 5412 18800 18260 9683 10905 6469 5339 -3475 -18155 -13115 -985
13905 -985 10950 12157 18789 21509 16156 18647 25866 44210 22893 3142 6954 7733 13262 15553
13891 15553 3772 -588 12280 22689 26342 15805 -8047 -31161 -31964 -15728 11979 22188
13879 22188 6160 3263 3910 -12506 -6485 382 18900 23448 22041 35454 21905 15740 10718
13866 10718 -1379 -1197 12102 12480 -4387 -5361 -4692 5603 8952 24548 15680 11644 14028 13685
13852 13685 19093 21155 20810 32121 27803 27421 28748 26470 15663 1265 2948 3263 13573 7560
13838 7560 17588 18758 7748 4768 2033 2883 521 -484 -20298 -12692 -12485 -14310 -745 19901
13824 19901 30674 28168 25779 24232 42046 34370 15563 7906 7329 20551 30029 22203 10611
$$ packed form
13919b9901L918J2910J6675J810J3388n40q577J222m436j130q814j4680N040J2130
13905i85J1935J207O632K720n353K491P219J8344k1317j9751L812P79N529K291
13891A5553j1781m360J2868J0409L653j0537k3852k3114q03J6236K7707J0209
13879B2188j6028k897O47j6416O021O867J8518M548j407J3413j3549o165n022
13866A0718j2097J82J3299L78j6867r74O69J0295L349J5596q868m036K384l43
13852A3685N408K062l45J1311m318l82J327k278j0807j4398J683L15J0310o013
13838G560J0028J170j1010k980k735Q50k362j005j9814P606K07j825J3565K0646
13824A9901J0773k506k389j547J7814p676j8807p657n77J3222R478p826j1592
$$ plain form
13811 10611 -5860 -6279 264 -5046 -20045 -19478 7824 6598 -9895 -10047 -3575 4904 12807 25097
13797 25097 22478 4472 2550 11726 9011 8816 12021 11760 499 -5756 4827 10956 -783 -12788
13783 -12788 -21896 -10622 19908 26916 19319 27962 40672 18998 -5628 -8921 -16462 -11025 2375
13770 2375 -5805 -14967 -12740 -8261 -136 4205 5325 2565 11154 9191 541 7249 4743 -4778 -4527
13755 -4527 -20414 -19580 -14213 -5207 -11382 -35917 -25312 -9481 -3245 -6890 7052 -5540 -22498
13742 -22498 -42916 -44712 -48386 -36548 -26883 -31329 -26780 -5865 15568 27671 30217 15204 -294
13729 -294 -12298 -4153 -3810 -20443 -15146 -7933 -5069 -892 7979 23579 29332 8462 -19964 -26470
13715 -26470 7889 26911 22476 27698 15912 4749 8039 24626 9166 5266 -9106 -10402 -9343
$$ packed form
13811A0611j6471m19O543n310j4999N67K7302j226j6493j52O472Q479P903J2290
13797B5097k619j8006j922R176k715j95L205k61j1261o255J0583O129j1739j2005
13783a2788r108J1274L0530P008p597Q643J2710k1674k4626l293p541N437J3400
13770B375q180r162K227M479Q125M341J120k760Q589j963q650O708k506r521K51
13755d527j5887Q34N367R006o175k4535J0605J5831O236l645J3942j2592j6958
13742b2498k0418j796l674J1838R665m446M549K0915K1433J2103K546j5013j5498
13729b94j2004Q145L43j6633N297P213K864M177Q871J5600N753k0870k8426o506
13715b6470L4359J9022m435N222j1786j1163L290J6587j5460l900j4372j296J059
$$ plain form
13702 -9343 5124 -1777 -17775 -6169 14531 15233 8169 -11466 -13183 -13675 671 -8568 -6517 -339
13688 -339 -11176 -10501 -5348 222 1246 -5600 -2379 8089 6244 -3096 -12971 -13921 -19745 -21909 -33999
13673 -33999 -36058 -9049 -10942 -9409 -3868 207 -14296 -16825 8339 11757 6695 -10656 -15285
13660 -15285 -6077 -8930 -7107 7906 14317 11220 8047 10546 24788 14196 -4781 -9092 2187
13647 2187 24181 9340 3551 9449 5416 4676 -3108 -738 -7916 -10170 699 11638 20388 5023
13633 5023 -6942 6209 8102 10839 13169 23063 38710 39664 29297 25726 26115 919 1200 -14252
13619 -14252 -31655 -22098 -6985 -4890 -19020 -23504 -9686 10581 3936 -19896 -13291 -2676 15766
13606 15766 20521 20366 17271 14966 10047 -10567 -26224 -21604 -11036 -2890 -13671 -28304 -20485
$$ packed form
13702i343J4467o901j5998J1606K0700P02p064j9635j717m92J4346r239K051O178
13688c39j0837O75N153N570J024o846L221J0468j845r340r875r50n824k164j2090
13673c3999k059K7009j893J533N541M075j4503k529K5164L418n062j7351m629
13660a5285R208k853J823J5013O411l097l173K499J4242j0592j8977m311J1279
13647B187K1994j4841n789N898m033p40p784K370p178k254J0869J0939Q750j5365
13633E023j1965J3151J893K737K330R894J5647R54j0367l571L89k5196K81j5452
13619a4252j7403R557J5113K095j4130m484J3818K0267o645k3832O605J0615J8442
13606A5766M755j55l095k305m919k0614j5657M620J0568Q146j0781j4633P819
$$ plain form
13593 -20485 -11995 -2099 6101 13092 21234 32133 24286 16659 27511 22274 15753 13437 9279 4379
13579 4379 12949 23645 24014 14878 9569 3760 5107 11857 8235 3344 14556 14977 4290 3424 2503
13564 2503 -2152 3703 8311 2753 9958 9301 19896 15796 15051 2041 -3156 -9792 -10781 8312 20548
13549 20548 30181 26130 13827 13608 22569 11798 8238 11611 -14155 -27408 -10784 -3412 11938
13536 11938 9014 5267 5689 -16102 -15544 -3017 249 13882 25382 21538 6737 -5048 1348
13523 1348 5319 8053 23925 27679 23547 16025 17086 17948 20672 15978 23841 20349 21824 23085 31835
13508 31835 38282 22081 2539 -11464 -29085 -38604 -29929 -4381 -217 -2022 -7268 -10219 -9547
13495 -9547 -13991 -15031 11418 12904 -3254 -9117 -21091 -17269 -10379 -12804 -24927 -22902 -22492 -20305
$$ packed form
13593b0485Q490R896Q200O991Q142J0899p847p627J0852n237o521k316m158m900
13579D379Q570J0696L69r136n309n809J347O750l622m891J1212M21j0687q66r21
13564B503m655N855M608n558P205o57J0595m100p45j3010n197o636r89J9093J2236
13549B0548R633m051j2303k19Q961j0771l560L373k5766j3253J6624P372J5350
13536A1938k924l747M22k1791N58J2527L266J3633J1500l844j4801j1785O396
13523A348L971K734J5872L754m132p522J061Q62K724m694P863l492J475J261Q750
13508C1835O447j6201j9542j4003j7621r519Q675K5548M164j805n246k951O72
13495i547m444j040K6449J486j6158n863j1974L822O890k425j2123K025M10K187
$$ plain form
13481 -20305 -5298 15115 8672 -7876 -19088 -12248 -589 5561 -6159 -3345 12151 -8682
13469 -8682 -10924 10222 12114 -12702 -7798 17005 10687 17480 10674 5808 -7258 -21106 -18112
13456 -18112 -15181 1192 1440 -6065 -10133 -6387 -19130 -38637 -39466 -28809 -9783 -13498 -11482 -15517
13442 -15517 -14280 -32465 -38339 -27800 -13109 -3482 3860 -3538 6162 32240 43481 47616 23947
13429 23947 7945 1864 -21 2105 357 6310 -8769 -14487 268 13399 11288 13495 21120
13416 21120 19429 6509 9726 8867 15228 20403 11924 -9730 -9311 -18595 -11253 -2655 -16702 -20564
13402 -20564 -31626 -25604 -2162 306 -1898 3239 5573 11405 9379 1279 12849 12943 20838 28570
13388 28570 25652 4072 3050 2269 8275 20556 13185 10083 16440 1413 -12032 2941 3342 -792
$$ packed form
13481b0305J5007K0413o443j6548j1212O840J1659O150j1720K814J5496k0833
13469h682k242K1146J892k4816M904K4803o318O793o806m866j3066j3848K994
13456a8112K931J6373K48p505m068L746j2743j9507q29J0657J9026l715K016m035
13442a5517J237j8185n874J0539J4691R627P342p398R700K6078J1241M135k3669
13429B3947j6002o081j885K126j748N953j5079n718J4755J3131k111K207P625
13416B1120j691j2920L217q59O361N175q479k1654M19r284P342Q598j4047l862
13402b0564j1062O022K3442K468k204N137K334N832k026q100J1570R4P895P732
13388B8570k918k1580j022p81O006J2281p371l102O357j5027j3445J4973M01m134
$$ plain form
13374 -792 -4727 -21439 -40699 -25963 -165 11360 2367 -15058 -16776 -10481 -1916 -6564 7561
13361 7561 18484 -486 -5731 -7812 -18268 -4640 12460 14934 8413 -4827 -3466 -502 6955
13348 6955 3320 -5250 -486 18067 17077 4742 15611 16399 17095 3344 1064 3595 -1330 -2657
13334 -2657 -76 4275 -4350 -25517 -31913 -7913 -279 -6229 -2404 28 -2787 2376 -13888 -14770
13320 -14770 -7439 -4863 -3074 -9489 -1486 15488 2723 -1019 8911 6436 11870 13963 16073 15247
13306 15247 8988 -5530 -5705 699 18978 28145 22104 16031 7295 -7005 7102 18061 22060
13293 22060 39248 38819 14287 6455 6901 3223 1806 14003 16143 1715 12125 17878 21123 6456
13279 6456 2649 17453 32377 23910 -11257 -34344 -36900 -21775 -16794 9110 20340 30338 20776
$$ packed form
13374g92l935j6712j9260J4736K5798J1525q993j7425j718O295Q565m648J4125
13361G561J0923j8970n245k081j0456J3628J7100K474o521j3240J361K964P457
13348F955l635q570M764J8553r90j2335J0869P88O96j3751k280K531m925j327
13334b657K581M351q625k1167o396K4000P634n950L825K432k815N163j6264q82
13320a4770P331K576J789o415Q003J6974j2765l742R930k475N434K093K110q26
13306A5247o259j4518j75O404J8279R167o041o073q736j4300J4107J0959L999
13293B2060J7188m29k4532p832M46l678j417J2197K140j4428J0410N753L245j4667
13279F456l807J4804J4924q467l5167k3087k556J5125M981K5904J1230R998r562
$$ plain form
13266 20776 11280 15127 23711 13707 28763 34563 22666 -5168 -24519 -832 16677 23901 24732
13253 24732 22347 20395 11756 -2576 -146 -12557 -11927 -3280 9319 7620 10947 16246 22628 40307
13239 40307 38122 17287 -7466 -11024 -6647 9442 10262 -6152 -10181 -1775 -3993 -13967 -14006 -5653
13225 -5653 12 -936 4912 -2683 3177 17161 18258 8725 6369 9840 20131 23151 23866 5292
13211 5292 -5320 11413 19267 20448 30759 39016 39079 30001 29941 12255 -5502 -12987 -15117 -5310
13197 -5310 -16551 -23504 -26187 -24689 -1653 9709 10867 8573 4378 -6621 1081 2912 10140 5913
13183 5913 -7099 3171 3916 88 -2310 -359 -7243 -16077 -15003 7811 5180 14098 23135 24354
13169 24354 18518 24099 20278 24637 22508 3559 -95 7213 18607 30466 19791 4859 1646
$$ packed form
13266B0776r496L847Q584j0004J5056N800j1897k7834j9351K3687J7509P224Q31
13253B4732k385j952q639j4332K430j2411O30Q647J2599j699L327N299O382J7679
13239D0307k185k0835k4753l558M377J6089Q20j6414m029Q406k218r974l9Q353
13225e653N665r48N848p595N860J3984J097r533k356L471J0291L020P15j8574
13211E292j0612J6733P854J181J0311Q257O3r078o0j7686j7757p485k130R807
13197e310j1241o953k683J498K3036J1362J158k294m195j0999P702J831P228m227
13183E913j3012J0270P45l828k398J951o884q834J074K2814k631Q918R037J219
13169B4354n836N581l821M359k129j8949l654P308J1394J1859j0675j4932l213
$$ plain form
13156 1646 -6416 -26486 -18889 -10842 -6302 6120 13216 24138 22091 11016 9486 10955 7541 -11502
13142 -11502 -30137 -14806 -7320 -4493 3783 -666 196 7442 6063 5998 7639 13514 20978 14015 -1129
13127 -1129 3416 4011 6967 -2657 -17261 -15408 -4238 -13916 682 16113 20319 19760 24550 11782
13113 11782 13562 15440 21981 19415 10920 11520 18226 13362 -1891 5461 8546 6999 18117 23071
13099 23071 14003 21252 33876 29674 22494 16880 11985 21601 17801 13878 5074 -6596 -3472 1004
13085 1004 13600 19314 20236 22577 17795 -8447 -6860 -12116 -3743 2585 22792 23300 19840 9264
13071 9264 -8569 -1059 9374 14822 7829 -27234 -36285 -24777 477 5340 170 -1630 -4168
13058 -4168 11401 19996 16559 12651 9008 8085 -464 -409 -4728 2889 -1514 -22882 -23159 -8402 5454
$$ packed form
13156A646q062k0070P597Q047M540J2422P096J0922k047j1075j530J469l414j9043
13142a1502j8635J5331P486K827Q276m449Q62P246j379o5J641N875P464o963j5144
13127a129M545N95K956r624j4604J853J1170r678J4598J5431M206n59M790j2768
13113A1782J780J878O541k566q495O00O706m864j5253P352L085j547J1118M954
13099B3071r068P249J2624m202p180n614m895R616l800l923q804j1670L124M476
13085A004J2596N714R22K341m782k6242J587n256Q373O328K0207N08l460j0576
13071I264j7833P510J0433N448o993l5063r051J1508K5254M863n170j800k538
13058d168J5569Q595l437l908l643r23q549N5m319P617m403k1368k77J4757J3856
$$ plain form
13043 5454 14159 4568 -196 2923 635 11999 3751 -10976 -14897 -13481 -14203 -17227 -10732 -7560
13029 -7560 7362 12566 1352 -13475 -12626 10854 28376 30606 23781 12551 24554 31562 24729
13016 24729 17245 -10619 -23498 -17640 -9457 13015 28637 37542 42767 27413 20711 8950 6836
13003 6836 7919 -3477 -9751 -8428 -8406 -4350 -48 3791 -1078 -18918 -27603 -27365 -22583 -15366 -9245
12988 -9245 -1543 6249 8956 -3883 2704 6907 5249 4532 5781 227 -13975 -21217 -8973 -7947
12974 -7947 -4386 17735 6293 7591 22460 20674 17484 15400 4655 -2256 12736 12956 20342 -179
12960 -179 -2320 -3245 -2554 -638 7624 9485 4001 1856 -10034 -14394 5040 28863 5285 5627 2599
12945 2599 -2279 -18756 -38042 -33499 -28959 -24363 1323 12321 22105 21396 6396 160 -11745
$$ packed form
13043E454Q705r591m764L119k288J1364q248j4727l921J416p22l024O495L172
13029g560J4922N204j1214j4827Q49K3480J7522K230o825j1230J2003P008o833
13016B4729p484k7864j2879N858Q183K2472J5622Q905N225j5354o702j1761k114
13003F836J083j1396o274J323K2M056M302L839m869j7840q685K38M782P217O121
12988i245P702P792K707j2839O587M203j658p17J249n554j4202p242J2244J026
12974g947L561K2121j1442J298J4869j786l190k084j0745o911J4992K20P386k0521
12960a79k141r25O91J916Q262J861n484k145j1890m360J9434K3823k3578L42l028
12945B599m878j6477j9286M543M540M596K5686J0998R784p09j5000o236j1905
$$ plain form
12932 -11745 -13006 -6114 -5682 -7232 -7725 -787 -2185 -17370 -8188 12350 12197 12085 9059 -813 4436
12917 4436 19530 7476 -7034 -20945 -40499 -29898 -7102 -6442 -6271 11852 18732 -2290 -12324
12904 -12324 6202 -144 -1862 2505 3229 7584 25385 35670 26510 8470 -6972 2806 6378
12891 6378 13553 25970 21694 5877 -7489 -15688 -4900 6375 11174 15906 23530 16868 1381
12878 1381 -9083 1255 28171 33966 21590 7863 3484 4632 -21813 -15082 -1360 -3734 -20758
12865 -20758 -10818 4019 1334 16101 39569 39210 20935 14679 30379 25179 9301 -4114 -20450
12852 -20450 -18862 -12435 -17381 -32780 -40826 -30074 -13832 933 -430 -2816 11960 17257 4874
12839 4874 -2138 13768 27630 28939 29116 21864 16401 12853 5244 5452 13867 11135 -5303 -11144
$$ packed form
12932a1745j261O892M32j550m93O938j398j5185R182K0538j53j12l026r872N249
12917D436J5094j2054j4510j3911j9554J0601K2796O60J71J8123O880k1022j0034
12904a2324J8526o346j718M367P24M355J7801J0285r160j8040j5442R778L572
12891F378P175J2417m276j5817j3366q199J0788J1275M799M732P624o662j5487
12878A381j0464J0338K6916N795j2376j3727m379J148k6445O731J3722k374j7024
12865b0758R940J4837k685J4767K3468l59j8275o256J5700n200j5878j3415j6336
12852b0450J588O427m946j5399q046J0752J6242J4765j363k386J4776N297j2383
12839D874p012J5906J3862J309J77p252n463l548p609K08Q415k732j6438n841
$$ plain form
12825 -11144 -14929 -22725 -16783 -21698 -22195 -18069 -8383 -248 12676 -496 -13543 -11424 14121 19728
12811 19728 610 -12365 -1158 17881 3594 -20177 -35228 -37975 -19030 5569 17153 22481
12799 22481 30458 17509 4668 6536 3662 -3008 3584 6516 4791 3534 3284 10143 -5026 -17473
12785 -17473 -13291 -16247 -9800 -2820 -4058 -12011 -10241 4448 13082 17451 27848 20935 4875 12423
12771 12423 15567 -6545 -12607 -3052 9087 -13603 -32182 -30952 -18688 -5809 -12474 -16349 -15670
12758 -15670 -8957 -2649 672 -13136 -3712 -1916 -7316 -9400 -4319 15694 14813 765 -3818 4282
12744 4282 8916 7853 17284 11465 -11796 -10890 12196 10558 20558 33948 29167 13780 25169
12731 25169 23108 4323 1186 -4267 -8136 6965 20857 20202 9783 4754 -2214 -20357 -19725 -13122
$$ packed form
12825a1144l785p796N942m915m97M126R686Q135J2924j3172j3047K119K5545N607
12811A9728j9118j2975J1207J9039j4287k3771j5051k747J8945K4599J1584N328
12799B2481P977j2949j2841J868k874o670O592K932j725j257k50O859j5169j2447
12785a7473M182k956O447O980j238p953J770J4689Q634M369J0397o913j6060P548
12771A2423L144k2112o062R555J2139k2690j8579J230J2264J2879o665l875O79
12758a5670O713O308L321j3808R424J796n400k084N081K0013q81j4048m583Q100
12744D282M634j063R431n819k3261R06K3086j638J0000J3390m781j5387J1389
12731B5169k061j8785l137n453l869J5101J3892o55j0419n029o968j8143O32O603
$$ plain form
12717 -13122 -12332 -5617 5740 4170 6286 3349 8108 38882 43218 30302 26339 16639 21374 29956
12703 29956 27904 34172 29143 32069 19068 5372 -11516 -4658 4779 -5149 -4140 -16022 -8179
12690 -8179 3661 12074 7406 9235 20015 23558 8645 -8919 1345 15458 11987 20700 27007
12677 27007 15260 5365 -4937 -17933 -22036 -25052 -21101 -28906 -12500 -2977 14820 16225 7888
12664 7888 -9481 -9196 -21528 -33640 -9814 -4664 -569 -6807 -16623 -20345 -16683 -13807 -21712 -30861
12650 -30861 -28447 -7836 -8819 -6414 2046 -9084 -14928 -6261 4807 -4055 1587 290 9822 14271
12636 14271 16459 15128 4928 -15169 -11653 -4388 5534 -331 9671 5075 7318 -4874 -12477
12623 -12477 -14974 -22472 -34026 -39832 -24655 -6711 14307 16489 2473 -377 -4954 -9433 -5562
$$ packed form
12717a3122P90O715J1357j570K116k937M759L0774M336j2916l963r700M735Q582
12703B9956k052O268n029K926j3001j3696j6888O858R437r928J009j1882P843
12690h179J1840Q413m668J829J0780L543j4913j7564J0264J4113l471Q713O307
12677B7007j1747r895j0302j2996m103l016L951p805J6406R523J7797J405q337
12664G888j7369K85j2332j2112K3826N150M095o238r816l722L662K876p905r149
12650c0861K414K0611r83K405Q460j1130n844Q667J1068q862N642j297R532M449
12636A4271K188j331j0200k0097L516P265R922n865J0002m596K243j2192p603
12623a2477k497p498j1554n806J5177J7944K1018K182j4016k850m577m479L871
$$ plain form
12610 -5562 -12180 -33417 -26344 -6500 7790 8036 5594 -10237 -11452 -15634 -23549 -12962 3179
12597 3179 10 9500 19909 31036 22122 14661 -724 5161 6094 12493 17338 580 -24710 -20757
12583 -20757 -5027 -4 16331 17986 18580 18625 16476 9920 -879 -6731 -13341 -8602 5331 1966
12569 1966 1205 -9608 -20040 -5808 10639 8792 16230 8741 -12553 -17749 -14754 -20462 -6899
12556 -6899 -3802 -337 -6602 3250 19296 -5771 -6385 -155 16988 30465 32111 7704 -9725
12543 -9725 9464 25717 30730 24021 17032 -5795 -274 20071 20358 2747 1703 -5476 -12275 -13174
12529 -13174 -9495 -6125 3818 9242 21523 36891 25790 4744 -168 -13726 -6125 9020 12268
12516 12268 23499 16697 10538 21204 35303 41689 23679 13367 16535 11089 -11066 -17392 -20394
$$ packed form
12610e562o618k1237P073J9844J4290K46k442j5831j215m182p915J0587J6141
12597C179l169R490J0409J1127q914p461j5385N885R33O399M845j6758k5290L953
12583b0757J5730N023J6335J655N94M5k149o556j0799n852o610M739J3933l365
12569A966p61j0813j0432J4232J6447j847P438p489k1294n196K995n708J3563
12556f899L097L465o265R852J6046k5067o14O230J7143J3477J646k4407j7429
12543i725J9189J6253N013o709o989k2827N521K0345K87j7611j044p179o799q99
12529a3174L679L370R943N424J2281J5368j1101k1046m912j3558P601J5145L248
12516A2268J1231o802o159J0666J4099O386j8010j0312L168n446k2155o326l002
$$ plain form
12503 -20394 -1178 134 -5265 -11281 -10266 -6670 -6706 -9060 3141 19177 22693 19898 16811 -395
12489 -395 -4272 819 2396 -12521 -15957 -10121 5186 19009 18998 -6893 -15234 -12990 -9852 306
12475 306 -2755 7864 3190 5710 28532 28912 21691 24376 8634 19829 27540 10360 18919 16131
12461 16131 19015 11698 -2795 -273 -9967 -11899 -18932 -12537 -11529 -18692 -8701 11719 21262 16190
12447 16190 -4243 -18633 2338 9893 9038 16559 5552 13457 12424 819 12386 9590 3141
12434 3141 23254 38336 20741 749 -4443 6579 7027 4786 -6864 -12022 -24358 -29768 -9516
12421 -9516 18823 23430 15323 4816 -14291 -17437 -12425 -25862 -28451 -28275 -38844 -12024 18472
12408 18472 36223 30547 21709 6022 12097 15076 10389 7886 8795 1669 -6621 -3545 4010 -4087
$$ packed form
12503b0394J9216J312n399o016J015L596l6k354J2201J6036L516k795l087j7206
12489c95l877N091J577j4917l436N836J5307J3823j1k5891q341K244L138J0158
12475C06l061J0619m674K520K2822L80p221K685j5742J1195P711j7180Q559k788
12461A6131K884p317j4493K522r694j932p033O395J008p163R991K0420R543n072
12447A6190k0433j4390K0971P555q55P521j1007P905j033j1605J1567k796o449
12434C141K0113J5082j7595j9992n192J1022M48k241j1650n158j2336n410K0252
12421i516K8339M607q107j0507j9107l146N012j3437k589J76j0569K6820L0496
12408A8472J7751n676q838j5687O075K979m687k503R09p126q290L076P555q097
$$ plain form
12394 -4087 -20547 -21099 -14628 -20883 -27582 -18360 -10609 -2122 6222 16157 22836 34052 32461 25410
12380 25410 8526 4065 -1779 -14148 -23698 -33253 -13195 10014 9791 14098 24235 18856 3329
12367 3329 5116 247 13826 15149 24748 48286 36278 4679 4550 15122 23471 23136 13173 17849
12353 17849 33655 20601 7214 -11494 -18796 17657 36266 22831 25611 26180 9320 -960
12341 -960 -9646 9412 13671 -4429 -14251 -3337 3880 14178 20856 1955 4129 13850 11922 -2334
12327 -2334 -12489 -447 27937 34226 26434 33705 19161 -5489 -3474 2968 8727 18863 10978
12314 10978 13527 20360 8941 23787 25450 25460 29124 24861 22278 19151 -7171 -3142 -6006 -8071
12300 -8071 -12210 -17686 -11940 -4888 918 71 636 25 3550 21790 29060 5162 -9022 -7501 -7533
$$ packed form
12394d087j6460n52O471o255o699R222P751Q487Q344R935O679J1216j591p051
12380B5410j6884m461n844j2369r550r555K0058K3209k23M307J0137n379j5527
12367C329J787m869J3579J323R599K3538j2008l1599j29J0572Q349l35r963M676
12353A7849J5806j3054j3387j8708p302L6453J8609j3435K780N69j6860j0280
12341i60q686J9058M259j8100r822J0914P217J0298O678j8901K174R721j928j4256
12327b334j0155J2042K8384O289p792P271j4544k4650K015O442N759J0136p885
12314A0978K549O833j1419J4846J663J0L664m263k583l127k6322M029k864k065
12300h071m139n476N746P052N806q47N65o11L525J8240P270k3898j4184J521l2
$$ plain form
12285 -7533 -13897 -6077 -156 8190 -2797 -14624 -13287 -13254 -14070 -9021 -2464 13250 13306 17862 8196
12270 8196 13179 17260 18157 19460 16018 9883 9157 12997 14664 11794 10264 -1949 -4641 -11166 -106
12255 -106 8449 2790 -8896 -18628 -24536 -23256 -15775 -10290 -11506 -16082 -10688 1226 8417 7249
12241 7249 390 -4233 4650 -8483 -6085 2857 5494 13883 21382 17592 16586 11933 20322 19034
12227 19034 25429 41155 37074 26757 30843 35311 23684 23643 32330 30704 34413 26923 23923 8938
12213 8938 2611 9352 20877 5032 -3300 -4461 -11843 128 6718 6279 8155 -309 -856 24381
12199 24381 7599 -1545 21819 37002 40900 45585 38671 25543 4050 3807 -5620 -10753 -988
12186 -988 -3792 -1483 7246 5364 5555 -2697 17216 17306 753 9832 29993 16636 16431 13464 -3149
$$ packed form
12285g533o364P820N921Q346j0987j1827J337L3q16N049O557J5714N6M556r666
12270H196M983M081Q97J303l442o135p26L840J667k870j530j2213k692o525J1060
12255a06Q555n659j1686r732n908J280P481N485j216m576N394J1914P191j168
12241G249o859m623Q883j3133K398Q942K637Q389P499l790j006m653Q389j288
12227A9034O395J5726m081j0317M086M468j1627m1Q687j626L709p490l000j4985
12213H938o327O741J1525j5845q332j161p382J1971O590m39J876q464n47K5237
12199B4381j6782r144K3364J5183L898M685o914j3128k1493k43r427n133R765
12186i88k804K309Q729j882J91q252J9913R0j6553R079K0161j3357k05k967j6613
$$ plain form
12171 -3149 -10369 8941 22490 29737 13561 -5813 11894 14995 23269 31802 20632 2521 -6486
12158 -6486 -15163 -19161 -15769 7471 16439 7916 7249 -843 8430 6681 -11977 -17271 9269 19268
12144 19268 15536 19335 28966 28129 27324 31734 30010 20750 26846 30063 31217 11544 -14273 -8011
12130 -8011 -1204 -4292 -455 5490 15109 14816 6153 1333 -1006 12235 12405 -3920 -12855 -24643
12116 -24643 -14506 -2397 6918 12084 2375 851 -197 8913 18785 18598 11334 5034 4603 -950
12102 -950 -4784 326 3079 9886 11058 4484 19647 29617 23080 24266 19295 -4137 -17917 -12339
12088 -12339 -6126 3047 -10942 -10189 -971 -4613 -4946 2039 14129 3769 1679 -10595 -87 13321
12074 13321 75 -959 -1685 -9540 7696 35505 38557 32369 3343 -8351 -4488 5952 576
$$ packed form
12171c149p220J9310J3549P247j6176j9374J7707L101Q274Q533j1170j8111r007
12158f486q677l998L392K3240Q968q523o67q092R273j749j8658n294K6540R999
12144A9268l732L799R631q37q05M410j724r260O096L217J154j9673k5817O262
12130h011O807l088L837N945R619k93q663m820k339J3241J70j6325q935j1788
12116b4643J0137J2109R315N166r709j524j048R110R872j87p264o300m31n553
12102i50l834N110K753O807J172o574J5163R970o537J186m971k3432j3780N578
12088a2339O213R173j3989P53R218l642l33O985J2090j0360k090j2274J0508J3408
12074A3321j3246j034p26p855J7236K7809L052o188k9026j1694L863J0440n376
$$ plain form
12061 576 1027 9389 -2067 -8973 360 22620 31022 7854 -20914 -20290 -2542 7116 -977 -9742
12047 -9742 -5669 1881 7354 -369 -12411 -24133 -16603 -3879 6551 2869 8500 15909 5045
12034 5045 13783 30311 27396 28672 2358 -19085 -26650 -25192 -12400 12391 15341 11879 4473
12021 4473 1678 1391 -4306 1523 4395 -1728 -7686 -4846 9392 2806 -11970 -27520 -31654 -29854
12007 -29854 -6682 11779 4250 -2206 13160 12516 19385 14551 6557 -356 5402 17096 8864 -14310
11993 -14310 -14013 -16133 -8165 3794 10880 8228 -10025 -3703 4645 1041 -14803 -11658 -8135 9533
11979 9533 10334 -11509 -32898 -18343 -10107 2939 25013 31446 14372 4972 12185 1467 -7989
11966 -7989 -5745 -12153 929 3694 16494 27394 17947 267 -3698 3195 5589 -5349 4354
$$ packed form
12061E76M51Q362j1456o906R333K2260Q402k3168k8768O24J7748R658q093q765
12047i742M073P550N473p723j2042j1722P530J2724J0430l682N631P409j0864
12034E045Q738J6528k915J276k6314k1443p565J458J2792K4791K950l462p406
12021D473k795k87n697N829K872o123n958K840J4238o586j4776j5550m134J800
12007b9854K3172J8461p529o456J5366o44O869m834p994o913N758J1694q232k3174
11993a4310K97k120P968J1959P086k652j8253O322Q348l604j5844L145L523J7668
11979I533Q01k1843k1389J4555Q236J3046K2074O433j7074r400P213j0718r456
11966g989K244o408J3082K765J2800J0900r447j7680l965O893K394j0938R703
$$ plain form
11953 4354 11068 1943 11045 6681 3594 8260 25178 23012 27228 24450 17586 17212 12591 10309 22884
11938 22884 19519 24493 25710 16324 -3962 -11446 -13774 1764 4181 -1802 -12478 1732 22442
11925 22442 36489 33204 18335 10323 27526 38925 33761 34609 21484 3427 -5909 -15993 -10819
11912 -10819 694 14290 15130 -3923 -2965 2930 1879 -3217 3605 12349 12937 -4804 -21447 -10421
11898 -10421 -14490 -9891 -1048 -17273 -27667 -13264 -11774 10243 11750 -6853 -4623 12519 25766
11885 25766 28313 23437 33028 33406 28199 31047 15443 6432 15450 -10010 -11552 -5233 -9064 -16753
11871 -16753 -15841 -19894 -23377 -27600 -2105 -3953 -18132 -19382 -12265 -3347 7787 3982 -582 -471
11857 -471 10090 -1742 20060 24871 21442 28269 28674 21265 20631 9201 1697 12612 30799 34679
$$ packed form
11953D354O714r125R102m364l087M666J6918k166M216k778o864l74m621k282J2575
11938B2884l365M974J217r386k0286p484k328J5538K417n983j0676J4210K0710
11925B2442J4047l285j4869q012J7203J1399n164Q48j3125j8057r336j0084N174
11912a0819J1513J3596Q40j9053R58N895j051n096O822Q744N88j7741j6643J1026
11898a0421m069M599Q843j6225j0394J4403J490K2017J507j8603K230J7142J3247
11885B5766K547m876R591L78n207K848j5604r011R018k5460j542O319l831p689
11871a6753R12m053l483m223K5495j848j4179j250P117Q918J1134l805m564J11
11857d71J0561j1832K1802M811l429O827M05p409o34j1430p504J0915J8187L880
$$ plain form
11843 34679 5511 -6713 -8922 -25045 -42261 -32156 -9061 -13327 -21310 -8547 6836 5076
11831 5076 4054 14156 -1234 -12617 -975 13525 11873 16538 33041 33261 24230 28103 30004
11818 30004 26551 28580 45403 50026 28805 10 -15570 -14370 3016 11349 17178 8048 4691
11805 4691 12517 9404 15151 12472 -259 -4328 -5402 -1525 8334 13768 14298 11015 3276 8826 8408
11790 8408 3457 20187 31208 30156 19700 9493 -1092 -19559 -17018 -1105 13298 15799 22636
11777 22636 27021 16706 2375 3836 10174 13774 21049 19949 6998 12683 33149 41059 42958
11764 42958 32049 24071 29877 16472 6087 -1514 11505 11496 8599 7487 10097 3539 -11034 -5344
11750 -5344 -2572 -5493 -7174 -11295 -7843 5772 21961 31170 37386 33674 35121 22195 2786 2917
$$ packed form
11843C4679k9168j2224k209j6123j7216J0105K3095m266p983J2763J5383j760
11831E076j022J0102j5390j1383J1642J4500j652M665J6503K20r031L873J901
11818C0004l453K029J6823M623k1221k8795j5580J200J7386Q333N829r130l357
11805D691P826l113N747k679j2731m069j074L877R859N434N30l283p739N550m18
11790H408m951J6730J1021j052j0456j0207j0585j8467K541J5913J4403K501O837
11777B2636M385j0315j4331J461O338L600P275j100j2951N685K0466P910J899
11764D2958j0909p978N806j3405j0385p601J3019rk897j112K610o558j4573N690
11750e344K772k921j681m121L452J3615J6189R209O216l712J447j2926j9409J31
$$ plain form
11736 2917 17757 14541 12428 16272 18010 13634 9367 7794 -16441 -9759 10178 24708 45108
11723 45108 54014 37976 12904 6804 648 5543 16124 23620 37386 27324 25309 25172 18190
11710 18190 15826 9660 12372 10139 11764 22040 32444 24508 8635 966 11401 17498 19805
11697 19805 8470 7679 6672 12775 14120 18957 8339 5897 9730 9783 8995 14625 16156 22397 24082
11682 24082 16009 10805 11860 19225 33287 23084 28303 34893 28406 6470 -4890 -3253 10837
11669 10837 17221 13338 21374 27456 25169 18580 20701 16901 11864 5542 9411 18607 29044 13973
11655 13973 -3197 2021 -905 -8293 -19547 -11393 5853 8168 10737 7369 -6179 -1688 12590
11642 12590 4948 -6580 -7366 -2785 6148 6668 17126 22382 21706 18905 18424 25444 21995 6410 12288
$$ packed form
11736B917J4840l216k113L844J738m376m267j573k4235O682J9937J4530K0400
11723D5108Q906j6038k5072o100o156M895J0581P496J3766j0062k015j37o982
11710A8190k364o166K712k233J625J0276J0404p936j5873p669J0435O097K307
11697A9805j1335p91j007O103J345M837j0618k442L833N3p88N630J531O241J685
11682B4082q073n204J055P365J4062j0203N219O590o487k1936j1360J637J4090
11669A0837O384l883Q036O082k287o589K121l800n037o322L869R196J0437j5071
11655A3973j7170N218k926p388j1254Q154J7246K315K569l368j3548M491J4278
11642A2590p642j1528p86M581Q933N20J0458N256o76k801m81P020l449j5585N878
$$ plain form
11627 12288 2867 5615 15727 16622 19073 14885 -1345 1731 -5273 -10156 6996 17194 15095 14430
11613 14430 27152 41875 47260 51317 36634 19542 16005 16223 14695 14031 11397 10789 12261 8838
11599 8838 1912 19622 17253 4816 18072 22617 29802 40146 46273 28695 22678 20261 8919
11586 8919 5587 6238 1573 -3031 -792 9071 27972 34738 26905 12174 15274 10584 26758 52428
11572 52428 45607 38374 25374 17367 10 -6289 5506 13833 26558 43018 45881 29997 19739
11559 19739 8124 13838 26086 19395 24348 24173 26704 31780 24144 27462 37466 7094 -11635
11546 -11635 -5166 -478 -9472 -16847 -23478 -26591 -3995 8999 15297 13947 9295 16273 23423 16655
11532 16655 6654 -988 12270 4892 3569 20320 32647 41743 37978 20223 5094 12990 19620
$$ packed form
11627A2288r421K748J0112Q95K451m188j6230L076p004m883J7152J0198k099o65
11613A4430J2722J4723N385M057j4683j7092l537K18j528o64k634o08J472l423
11599H838o926J7710k369j2437J3256M545P185J0344O127j7578o017k417j1342
11586H919l332O51m665m604K239R863J8901O766p833j4731L100m690J6174K5670
11572E2428o821p233j3000q007j7357o299J1795Q327J2725J6460K863j5884j0258
11559A9739j1615N714J2248o691M953j75K531N076p636L318J0004l0372j8729
11546a1635O469M688q994p375o631l113K2596J2994O298j350m652O978P150o768
11532A6655j0001p642J3258p378j323J6751J2327R096l765j7755j5129P896O630
$$ plain form
11519 19620 9666 3355 25595 40883 36377 23490 17601 17623 21513 11759 14892 12229 24443 26681
11505 26681 24889 36019 24674 21459 17863 4555 10687 20638 38028 49058 46080 34025 20889
11492 20889 16016 7673 -7734 185 10339 13560 30516 40438 34023 36095 42948 38699 21397
11479 21397 18483 29627 32153 14051 26057 29311 28981 22091 28073 32403 35251 32370 29313 27652
11465 27652 39073 41270 18245 21956 31410 30636 31247 25893 13184 2591 24058 30109 39339 36681
11451 36681 40672 39302 10185 1224 -1856 -7083 -6639 -10929 2644 18257 23828 21195 16814 5602
11437 5602 -4140 -1559 10200 25337 21185 31505 45212 38735 25716 -2354 -5915 -4437 -4925
11424 -4925 1812 -6917 1073 5597 20919 47726 31395 17226 15430 11399 10287 5047 4451 34461
$$ packed form
11519A9620r954o311K2240J5288m506j2887n889K2L890r754L133k663J2214K238
11505B6681j792J1130j1345l215l596j3308O132R951J7390J1030k978j2055j3136
11492B0889m873q343j5407P919J0154L221J6956R922o415K072O853m249j7302
11479B1397k914J1144K526j8102J2006L254l30o890N982M330K848k881l057j661
11465B7652J1421K197k3025L711R454p74O11n354j2709j0593K1467O051R230k658
11451C6681L991j370k9117q961l080n227M44m290J3573J5613N571k633m381j1212
11437E602r742K581J1759J5137m152J0320J3707o477j3019k8070l561J478m88
11424d925O737q729P990M524J5322K6807j6331j4169j796m031j112n240n96L0010
$$ plain form
11410 34461 34190 40592 34415 24108 8508 17459 14820 12223 11741 13465 4261 2549 23813 28641
11396 28641 24742 12372 12689 14970 19139 11244 28622 39171 38044 29840 48362 62158 61651 59676
11382 59676 47101 41821 39933 32487 28155 30740 36391 35846 39744 32315 30845 25171 44529 47032
11368 47032 37753 33880 36789 41068 26545 3956 14771 33109 50816 60816 52408 47609 50327
11355 50327 52314 40700 35576 38603 34589 53190 49517 34015 34964 37383 38311 38925 46106 51173
11341 51173 40595 34470 16994 1015 -6686 -15834 -12515 -13343 -347 21198 31805 15082 1242
11328 1242 -3353 5876 7653 -6025 -16923 -8295 3442 -310 -6328 8316 15351 30295 39808
11315 39808 42367 26936 42764 36545 25667 14933 6318 -2926 4644 16675 5808 3229 12319
$$ packed form
11410C4461k71O402o177j0307j5600Q951k639k597m82J724r204j712K1264M828
11396B8641l899j2370L17K281M169p895J7378J0549j127q204J8522J3796n07j975
11382E9676j2575n280j888p446m332K585N651n45L898p429j470n674J9358K503
11368D7032r279l873K909M279j4523k2589J0815J8338J7707J0000q408m799K718
11355E0327J987j1614n124L027m014J8601l673j5502R49K419R28O14P181N067
11341E1173j0578o125j7476j5979p701r148L319q28J2996K1545J0607j6723j3840
11328A242m595R229J777j3678j0898Q628J1737l752o018J4644P035J4944R513
11315C9808K559j5431J5828o219j0878j0734q615r244P570J2031j0867k579R090
$$ plain form
11302 12319 23610 12898 5928 1458 2410 15328 20002 16891 1844 4493 8761 16517 19442 10039
11288 10039 8455 6291 17800 21069 25506 10391 5050 19679 26192 10195 7079 13746 19934
11275 19934 18619 9780 -439 -10421 424 14959 15104 3953 5841 8710 11804 15222 18720 24243
11261 24243 35839 47353 48992 50481 46137 54611 74373 49581 39814 46625 50720 32082 38116
11248 38116 38736 17339 14618 26340 37252 32161 27614 33583 54632 54404 52853 49533 43810 14736
11234 14736 4817 1112 1067 15029 18159 8070 -4088 -5610 -4134 8430 19793 27121 24634 39454
11220 39454 47605 33113 33661 38585 60877 69008 67481 52085 37902 43646 44298 48282 46356 39116
11206 39116 38042 33460 35455 40888 37371 38552 46413 58066 78366 70505 53514 36124 31086
$$ packed form
11302A2319J1291j0712o970m470R52J2918M674l111j5047K649M268P756K925r403
11288A0039j584k164J1509L269M437j5115n341J4629O513j5997l116O667O188
11275A9934j315q839j0219r982J0845J4535J45j1151J888K869L094L418L498N523
11261B4243J1596J1514J639J489m344Q474J9762k4792r767O811M095j8638O034
11248C8116O20k1397k721J1722J0912n091m547N969K1049k28j551l320n723k9074
11234A4736r919l705m5J3962L130j0089j2158j522J476J2564J1363P328k487J4820
11220C9454Q151j4492N48M924K2292Q131j527j5396j4183N744O52L984j926p240
11206C9116j074m582J995N433l517J181P861J1653K0300p861j6991j7390n038
$$ plain form
11193 31086 26382 25020 24040 22847 29125 34348 17200 18686 31932 34292 44382 58596 55023 58260
11179 58260 49669 29925 15940 19664 23599 29362 26763 42879 45081 51875 34119 21474 20092
11166 20092 16430 14172 14691 19229 22075 17869 9087 20379 11716 10806 12765 14480 -3901 8167
11152 8167 22727 15741 25953 29316 28769 24956 21726 20508 32483 46971 35539 19839 17734
11139 17734 37193 52432 39279 34101 40630 36664 39511 42596 48983 66499 66790 53986 38903
11126 38903 30609 34558 23885 35787 61041 64637 42701 37760 44141 47222 37279 36108 52090
11113 52090 64556 64444 75557 72332 75443 81088 66332 48454 54376 51266 57216 51570 36266
11100 36266 38804 48407 54344 53011 19844 13281 27618 47011 47285 42303 43458 47979 36249 35258
$$ packed form
11193C1086m704j362r80j193O278N223j7148J486J3246K360J0090J4214l573L237
11179E8260q591j9744j3985L724L935N763k599J6116K202O794j7756j2645j382
11166B0092l662k258N19M538K846m206q782J1292q663r10J959J715j8381J2068
11152H167J4560o986J0212L363n47l813l230j218J1975J4488j1432j5700k105
11139A7734J9459J5239j3153n178O529l966K847L085O387J7516K91j2804j5083
11126C8903q294L949j0673J1902K5254L596k1936m941O381L081r943j171J5982
11113E2090J2466j12J1113l225L111N645j4756j7878N922l110N950n646j5304
11100C6266K538R603N937j333l3167o563J4337J9393K74m982J155M521j1730r91
$$ plain form
11086 35258 40350 47700 54814 45097 38406 22509 16862 16886 28844 26370 29110 33227 21407 27536
11072 27536 42911 50708 45728 39242 31379 13705 17688 27251 27556 47531 72263 57106 56221 49018
11058 49018 50013 40229 37322 43578 39550 44375 29254 33682 41201 45466 46090 54171 67582 79047
11044 79047 69736 74484 80454 76034 76645 83489 83520 63016 62210 75811 74278 77752 91158 106377
11030 106377 104224 83227 88824 98625 97125 102867 117239 124805 141363 167017 195840 216288 245888
11017 245888 295718 368172 492859 680987 932426 1061260 1124474 1288381 1603047 1835694
11007 1835694 1771530 1561624 1449658 1441728 1365616 1111089 855459 666702 534699 434084
10997 434084 349857 283637 243411 221084 202157 200592 180612 166506 151422 126646 129095 140883
$$ packed form
11086C5258N092P350P114r717o691j5897n647K4J1958k474K740M117j1820O129
11072B7536J5375P797m980o486p863j7674L983R563L05J9975K4732j5157q85p203
11058D9018R95r784k907O256m028M825j5121M428P519M265O24Q081J3411J1465
11044G9047r311M748N970m420O11O844L1k0504q06J3601j533L474J3406J5219
11030A06377k153k0997N597R801j500N742J4372P566J6558K5654K8823K0448K9600
11017B45888M9830P2454J24687J88128K51439J28834O3214J63907L14666K32647
11007A835694o4164k09906j11966p930p6112k54527k55630j88757j32003j00615
10997D34084q4227o6220m0226k2327j8927j565j9980j4106j5084k4776K449J1788
$$ plain form
10985 140883 128237 107364 87276 88620 88886 79784 80601 88135 102203 110806 111371 106813 109145 104338
10971 104338 104935 84165 68510 72274 84403 96243 96924 108412 120743 124205 113738 105186 112087
10958 112087 107515 97394 102486 102453 115078 111349 101380 89262 95252 85742 75471 85597 90724
10945 90724 83722 88770 100029 107460 102210 106035 99626 84719 76925 72812 71170 72291 69371 76066
10931 76066 82932 88592 88742 95524 90482 88171 83932 77284 50713 55054 77640 84396 97529 83716
10917 83716 63206 57669 44769 39273 30296 38715 24860 11958 13207 20991 26055 46181 61796
10904 61796 65965 89418 107850 121666 103344 111782 118897 107254 86635 80766 90212 97807 101644
10891 101644 97177 105521 111596 121577 108784 118400 117395 97913 93778 103764 117723 118849 106552
$$ packed form
10985A40883j2646k0873k0088J344K66r102Q17P534J4068Q603N65m558K332m807
10971A04338N97k0770j5655L764J2129J1840O81J1488J2331L462j0467q552O901
10958A12087m572j0121N092l3J2625l729r969j2118N990r510j0271J0126N127
10945I0724p002N048J1259P431n250L825o409j4907p794m113j642J121k920O695
10931G6066O866N660J50O782n042k311m239o648k6571M341K2586O756J3133j3813
10917H3716k0510n537j2900n496q977Q419j3855j2902J249P784N064K0126J5615
10904F1796M169K3453J8432J3816j8322Q438P115j1643k0619n869R446P595L837
10891A01644m467Q344O075R981j2793R616j005j9482m135R986J3959J126j2297
$$ plain form
10878 106552 103165 106291 102765 93578 89805 93087 86337 84701 79065 70963 84077 95847 85069
10865 85069 71597 83751 114731 130245 136943 146264 159263 167815 220063 247207 254954 284932
10853 284932 301163 283401 238025 219340 207346 192476 174820 148100 132158 118156 111694 110853
10841 110853 98590 114528 122691 123635 107812 111141 108423 102883 123284 162100 174574 150707 139201
10828 139201 152314 182756 189407 194080 189347 179579 191307 193113 178083 164051 162365 159078 161604
10815 161604 150644 139455 147246 150545 128233 127447 148112 145743 134092 120583 120969 127889 145252
10802 145252 149263 152017 151187 168392 186807 188229 202184 197535 215303 226821 228840 240158 257763
10789 257763 255716 256015 231253 205375 200359 196429 180165 180630 162919 155274 146008 129161 127387
$$ packed form
10878A06552l387L126l526r187l773L282o750j636n636q102J3114J1770j0778
10865H5069j3472J2154L0980J5514O698R321J2999Q552N2248K7144P747K9978
10853B84932J6231j7762m5376j8685j1994j4870j7656k6720j5942j4002o462q41
10841A10853j2263J5938Q163R44j5823L329k718n540K0401L8816J2474k3867j1506
10828A39201J3113L0442O651M673m733r768J1728J806j5030j4032j686l287K526
10815A61604j0960j1189P791L299k2312p86K0665k369j1651j3509L86O920J7363
10802A45252M011K754q30J7205J8415J422J3955m649J7768J1518K019J1318J7605
10789B57763k047K99k4762k5878n016l930j6264M65j7711p645r266j6847j774
$$ plain form
10776 127387 118052 86171 86351 112651 145150 166782 176365 177181 183368 191547 215967 247047 257753
10763 257753 274722 305351 327694 324669 308675 281374 272189 268974 237651 179789 132801 118494
10751 118494 101386 76790 66653 76779 82815 90039 114595 159591 193770 199719 179793 181464
10739 181464 202790 207802 211698 222931 232925 256441 257802 291670 311374 317296 340416 342640 352276
10726 352276 362340 361564 375772 387493 408110 393785 388816 399693 393789 396303 403265 397592 382282
10713 382282 381907 401822 397587 399966 402988 405542 405460 386500 382334 372951 358554 364960 360356 344140
10699 344140 340664 360210 359014 365090 359115 368542 379144 388726 397937 402061 405118 421149 425644
10686 425644 418925 405005 418712 413425 408095 410290 412550 425567 427898 431373 432562 447103 460058
$$ packed form
10776A27387r335l1881J80K6300L2499K1632R583Q16O187Q179K4420L1080J0706
10763B57753J6969L0629K2343l025j5994k7301r185l215l1323n7862m6988j4307
10751A18494j7108k4596j0137J0126O036P224K4556M4996L4179N949j9926J671
10739A81464K1326N012L896J1233R994K3516J361L3868J9704N922K3120K224R636
10726C52276J0064p76J4208J1721K0617j4325m969J0877n904K514O962n673j5310
10713C82282l75J9915m235K379L022K554q2j8960m166r383j4397O406m604j6216
10699C44140l476J9546j196O076n975R427J0602R582R211M124L057J6031M495
10686D25644o719j3920J3707n287n330K195K260J3017K331L475J189J4541J2955
$$ plain form
10673 460058 479907 508296 533728 552441 542011 571320 596964 588613 599224 640047 686338 722830
10661 722830 740187 783885 819185 852215 847632 841015 856808 869812 869252 874908 897908 934583
10649 934583 992297 1032573 1067247 1126497 1217312 1303919 1370604 1445947 1557571 1650892 1743623
10638 1743623 1824755 1907380 2000540 2109756 2231984 2371986 2525759 2711993 2925887 3224294
10628 3224294 3544694 3906505 4356138 5027006 5903299 6777247 7706482 8794071 10031417
10619 10031417 11312461 12646169 14098278 15559319 17018651 18754503 21093214 24093271
10611 24093271 27793297 32806405 40216009 51669870 70730903 104900610 156188121
10604 156188121 192227318 199783025 216244551 269284540 327715923 329265816 286985457
$$ packed form
10673D60058J9849K8389K5432J8713j0430K9309K5644q351J0611M0823M6291L6492
10661G22830J7357M3698L5300L3030m583o617J5793J3004n60N656K3000L6675
10649I34583N7714M0276L4674N9250R0815Q6607O6685P5343J11624R3321R2731
10638A743623Q1132Q2625R3160J09216J22228J40002J53773J86234K13894K98407
10628C224294L20400L61811M49633O70868Q76293Q73948R29235J087589J237346
10619A0031417J281044J333708J452109J461041J459332J735852K338711L000057
10611B4093271L700026N013108P409604J1453861J9061033L4169707N1287511
10604A56188121L6039197P555707J6461526N3039989N8431383J549893m2280359
$$ plain form
10597 286985457 258027316 259071660 252347224 209900350 159202176 123162711 97616426
10590 97616426 76167812 58529603 45619934 36927684 31022908 26970830 24251034 22172509
10582 22172509 20153913 18237590 16847873 15783663 14482109 12905626 11465904 10371336
10574 10371336 9348372 8249103 7241011 6455315 5842941 5319096 4844030 4416064 4082948
10565 4082948 3770343 3474646 3206654 2960479 2751827 2554792 2383453 2216842 2055411
10556 2055411 1916153 1811394 1729929 1677441 1593813 1513792 1451375 1390016 1324734 1236091 1142625
10545 1142625 1059769 989496 904471 847940 813626 762542 734744 676212 630634 601742 586136
10534 586136 589004 566676 533217 516868 500464 501640 474177 443724 425220 421860 415942 409719
$$ packed form
10597B86985457k8958141J044344o724436m2446874n0698174l6039465k5546285
10590I7616426k1448614j7638209j2909669q692250n904776m052078k719796k078525
10582B2172509k018596j916323j389717j064210j301554j576483j439722j094568
10574A0371336j022964j099269j008092p85696o12374n23845m75066m27966l33116
10565D082948l12605k95697k67992k46175k08652j97035j71339j66611j61431
10556B055411j39258j04759q1465n2488q3628q0021o2417o1359o5282q8643r3466
10545A142625q2856p0273q5025n6531l4314n1084k7798n8532m5578k8892j5606
10534E86136K868k2328l3459j6349j6404J176k7463l0453j8504l360n918o223
$$ plain form
10522 409719 396981 370025 339783 307162 303513 303443 288195 269859 258933 235047 189926 170077
10510 170077 174748 174301 174413 166646 165719 165831 151031 144951 133633 126319 146826 132407 127353 126264
10496 126264 106638 101238 104972 101213 80885 82006 100098 78523 42692 35958 41960 41696 51727
10483 51727 76063 60360 50839 57783 68672 89321 98472 109033 120097 116568 119240 141296 175657
10470 175657 185569 188814 176069 164430 136867 106836 95295 92326 89870 99245 110693 96555
10458 96555 73580 70108 72770 96917 137715 160070 154766 151393 158057 163393 160471 131933 114879
10445 114879 102436 65339 22310 -298 -30069 -51037 -70182 -89392 -92631 -85390 -73987 -54680
10433 -54680 -26264 6809 9019 1719 8264 33699 28300 20426 27536 42891 48910 57761 37546
$$ packed form
10522D09719j2738k6956l0242l2621l649p0j5248j8336j0926k3886m5121j9849
10510A70077M671m47J12p767r27J12j4800o080j1318p314K0507j4419n054j089
10496A26264j9626n400L734l759k0328J121J8092k1575l5831o734O002k64J0031
10483E1727K4336j5703r521O944J0889K0649R151J0561J1064l529K672K2056L4361
10470A75657R912L245j2745j1639k7563l0031j1541k969k456R375J1448j4138
10458I6555k2975l472K662K4147M0798K2355n304l373O664N336k922k8538j7054
10445A14879j2443l7097m3029k2608k9771k0968j9145j9210l239P241J1403J9307
10433e4680K8416L3073K210p300O545K5435n399p874P110J5355O019Q851k0215
$$ plain form
10420 37546 16608 8791 11696 12837 13813 7210 -4324 -53903 -60672 -74855 -74371 -89851 -110314
10407 -110314 -112301 -88789 -84384 -68105 -69336 -85035 -83095 -48486 -14442 13138 24739 21213
10395 21213 1563 -28378 -23043 655 -24405 -31519 -28811 -20485 -14726 -19630 -23938 -19188 -11045
10382 -11045 -9322 -15031 -19019 -19145 -33290 -39410 -52398 -47303 -48588 -43782 -54564 -64474 -56615 -46628
10368 -46628 -38893 -40456 -18185 -9390 -10313 -9713 -3794 20463 25746 33165 43302 48515 39948 48800
10354 48800 43385 30828 23907 18663 16462 8487 2846 8902 6877 -5603 12871 18979 23733 29730
10340 29730 25493 33408 14583 -8925 -25341 -36613 -24970 470 11148 16200 18237 1213
10328 1213 -8044 -7154 6688 12832 23292 29550 24415 10297 -18565 -24537 -16276 -9114 -20360 -23026
$$ packed form
10420C7546k0938p817K905J141R76o603j1534m9579o769j4183M84j5480k0463
10407a10314j987K3512M405J6279j231j5699J940L4609L4044K7580J1601l526
10395B1213j9650k9941N335K3698k5060p114K708Q326N759m904m308M750Q143
10382a1045J723n709l988j26j4145o120j2988N095j285M806j0782r910P859R987
10368d6628P735j563K2271Q795r23O00N919K4257N283P419J0137N213q567Q852
10354D8800n415j2557o921n244k201p975n641O056k025j2480J8474O108M754N997
10340B9730m237P915j8825k3508j6416j1272J1643K5440J0678N052K037j7024
10328A213r257Q90J3842O144J0460O258n135j4118k8862n972Q261P162j1246k666
$$ plain form
10314 -23026 -11559 307 -9533 -23143 -14246 -14709 91 -5427 -2719 -10947 -11294 -29304 -35887 -38619
10300 -38619 -27713 -30625 -40701 -14325 3895 18025 26007 46429 40501 39724 56246 69444 72104
10287 72104 52635 41748 38616 26833 30999 16500 22092 22352 6763 -947 -13294 -12357 -7688
10274 -7688 1087 -10500 -23599 -35537 -33850 -29251 -17198 -11077 -8265 -5109 -10084 -5556 -4627 -12752
10260 -12752 -6270 -3832 -14042 -15353 -17024 -19390 -18146 -10480 -9684 -4675 -11343 -18399 -21871 -26969
10246 -26969 -18799 -6873 -3879 -5790 -10638 -22143 -19719 -23834 -49663 -43433 -19039 -14480 -22839
10233 -22839 -32827 -20412 -11318 -14817 -32372 -39769 -26515 -23764 -18061 -19529 -25172 -24921 -29345 -24799
10219 -24799 -14587 -823 3732 6712 5006 8812 16415 35461 54778 63929 47653 46051 54398
$$ packed form
10314b3026J1467J1866r840j3610Q897m63J4800n518K708q228l47j8010o583k732
10300c8619J0906k912j0076K6376J8220J4130P982K0422n928p77J6522J3198K660
10287G2104j9469j0887l132j1783M166j4499N592K60j5589p710j2347R37M669
10274g688Q775j1587j3099j1938J687M599J2053O121K812L156m975M528R29q125
10260a2752O482K438j0210j311j671k366J244P666P96N009o668p056l472n098
10246b6969Q170J1926K994j911m848j1505K424m115k5829O230K4394M559q359
10233b2839r988J2415R094l499j7555p397J3254K751N703j468n643K51m424M546
10219b4799J0212J3764M555K980j706L806P603J9046J9317R151j6276j602Q347
$$ plain form
10206 54398 54789 57216 54110 57426 65114 81990 91796 98567 120726 144505 163756 186732 255715
10193 255715 349835 518842 784841 972104 1034453 1136265 1412345 1718733 1754670 1551202
10183 1551202 1397087 1391020 1341344 1114876 857108 663157 513033 382193 284786 237095
10173 237095 195285 156217 144541 137327 106568 77369 68142 55978 57655 52462 50272 50177 47369
10160 47369 30733 35878 45195 55316 41039 23502 20212 34996 32092 30140 19568 15789 9164
10147 9164 7784 5811 -139 6536 4251 -3706 -1933 18848 36069 44745 37643 39096 12510 9608
10133 9608 14244 3644 -2138 -12103 -10476 -8465 798 8051 10377 270 -8951 -3560 -2275 -19189
10119 -19189 -18047 -13776 -22771 -12409 -707 -3884 1499 13549 11146 -1925 10188 41842 57546
$$ packed form
10206E4398L91K427l106L316P688J6876R806O771K2159K3779J9251K2976O8983
10193B55715R4120J69007K65999J87263O2349J01812K76080L06388L5937k03468
10183A551202j54115o067m9676k26468k57768j93951j50124j30840r7407m7691
10173B37095m1810l9068j1676p214l0759k9199r227j2164J677n193k190r5k808
10160D7369j6636N145R317J0121j4277j7537l290J4784k904j952j0572l779o625
10147I164j380j973n950O675k285p957J773K0781J7221Q676p102J453k6586k902
10133I608M636j0600n782r965J627K011R263P253K326j0107r221N391J285j6914
10119a9189J142M271q995J0362J1702l177N383J2050k403j3071J2113L1654J5704
$$ plain form
10106 57546 78360 83766 93047 82731 79399 81195 59686 37937 34557 34256 41502 44431 26382
10093 26382 7246 -6638 2342 -1350 -5937 649 -839 5017 15589 -469 -2406 570 -13415
10080 -13415 -6155 1095 -3305 -7115 -29198 -24364 -3795 -11530 -3205 -8092 -12182 8144 9585 -6317
10066 -6317 -10838 -8428 -4818 -3204 4151 1210 3891 14112 18611 24198 15643 435 6909 11674
10052 11674 12120 38204 34899 15146 237 -3250 7386 19194 25602 61006 110195 206692 347999
10039 347999 384945 292504 211987 166939 150928 139716 90717 52671 32619 33869 33463 25058
10027 25058 12035 15612 -1627 -27271 -40578 -43832 -27513 -31447 -24347 -16330 -15203 -19763 -26526
10014 -26526 -21453 -1650 16888 15356 18550 17821 -6292 -4100 6006 14437 2357 -3393 -10170
$$ packed form
10106E7546K0814N406R281j0316l332J796k1509k1749l380l01P246K929j8049
10093B6382j9136j3884Q980l692m587O586j488N856J0572j6058j937K976j3985
10080a3415P260P250m400l810k2083M834K0569p735Q325m887m090K0326J441j5902
10066f317m521K410L610J614P355k941K681J0221M499N587q555j5208O474M765
10052A1674M46K6084l305j9753j4909l487J0636J1808O408L5404M9189R6497J41307
10039C47999L6946r2441q0517m5048j6011j1212m8999l8046k0052J250m06q405
10027B5058j3023L577j7239k5644j3307l254J6319l934P100Q017J127m560o763
10014b6526N073J9803J8538j532L194p29k4113K192J0106Q431j2080n750o777
$$ plain form
10001 -10170 -135 14811 -1447 2064 5720 -11546 -14354 1650 -1203 10755 13983 5389 -14593
9988 -14593 -14861 -14191 -11444 -22649 -10484 -18 -725 8481 -772 -18339 -17949 -18818 -35866 -28085 -27758
9973 -27758 -39721 -37731 -36863 -36153 -34686 -29628 -27579 -19935 -25777 -35412 -32419 -19355 -13793 -28953
9959 -28953 -25919 -23516 -27578 -16088 -5831 -11724 -17268 -20940 -7399 5961 -6918 -17811 -8157
9946 -8157 -917 -13230 -22626 -3322 4703 5201 5021 -4050 -11911 -14958 -11992 -803 11336 -7037
9932 -7037 -13096 -21859 -10431 -8422 -4747 -3377 -19404 -23285 -17295 -13758 -15355 -15690 -8003 -7364 4061
9917 4061 -9865 -16191 -13609 -8675 -8993 -6126 -2406 1177 10507 11122 2088 1054 -38 -7694 -6871
9902 -6871 -1934 -12527 -25332 -24088 -26806 -16096 -21240 -21730 1111 3671 4979 -2626 -4059 2180
$$ packed form
10001a0170J0035J4946j6258L511L656j7266k808J6004k853J1958L228q594j9982
9988a4593k68O70K747j1205J2165J0466p07R206r253j7567L90q69j7048P781L27
9973b7758j1963J990Q68P10J467N058K049P644n842r635K993J3064N562j5160
9959b8953L034K403m062J1490J0257n893n544l672J3541J3360j2879j0893R654
9946h157P240j2313r396J9304Q025M98j80r071p861l047K966J1189J2139j8373
9932g037o059q763J1428K009L675J370j6027l881N990L537j597l35P687O39J1425
9917D061j3926o326K582M934l18K867L720L583R330O15r034j034j092p656Q23
9902f871M937j0593j2805J244k718J0710n144m90K2841K560J308p605j433O239
$$ plain form
9888 2180 15938 4396 -2327 10069 30222 21239 14849 13447 16618 10493 -3757 -2483 -1350 12586
9874 12586 17181 6461 -7702 2296 1 -8064 -8376 5102 4226 -8862 -402 10699 17052 4922
9860 4922 -2019 8467 13850 10637 -273 -6013 -9949 -7493 -11885 -1647 -13696 -16382 -1899 -3908
9846 -3908 3185 3753 -12166 -20227 -9756 -10625 -1812 -7690 -12888 11964 25020 19362 19588 20633 -8328
9831 -8328 -21010 -20792 -2810 12563 4807 5237 -6306 1582 14756 984 -2369 4795 11406 16678
9817 16678 18939 8784 3094 -7038 -5035 -4728 2205 -10599 -20244 -4108 -10958 -21853 -30471 -29092
9803 -29092 -35618 -30639 -27307 -15938 -5061 -7157 -11186 -16442 -10571 -17553 -26935 -20054 -22130 -36364
9789 -36364 -40863 -25157 -19178 -26375 -28987 -10081 -12819 -25702 -33911 -15481 -11306 -6374 -957 3916
$$ packed form
9888B180J3758j1542o723J2396K0153q983o390j402L171o125j4250J274J133J3936
9874A2586M595j0720j4163R998k295q065l12J3478q76j3088Q460J1101O353j2130
9860D922o941J0486N383l213j0910n740l936K456m392J0238j2049k686J4483k009
9846c908P093N68j5919q061J0471q69Q813n878n198K4852J3056n658K26J045k8961
9831h328j2682K18J7982J5373p756M30j1543P888J3174j3772l353P164O611N272
9817A6678K261j0155n690j0132K003L07O933j2804r645J6136o850j0895q618J379
9803b9092o526M979L332J1369J0877k096m029n256N871o982r382O881k076j4234
9789c6364m499J5706N979p197k612J8906k738j2883q209J8430M175M932N417M873
$$ plain form
9775 3916 61 -10847 -21872 -32319 -31877 -22542 -21852 -17178 -3694 -11100 6815 -2111 2642 6748
9761 6748 458 15550 21103 13824 10785 -9496 1669 11152 9447 13479 9197 143 -1695 9873
9747 9873 27858 22266 18449 -812 -9454 -5628 -11786 -8731 -9617 -18175 2092 19284 7243 -18455
9733 -18455 -13382 -7952 -8919 -5662 -1418 -128 -12 1400 -10218 -15000 -13297 -24738 -43300 -44836
9719 -44836 -33247 -16864 -27129 -35325 -29401 -13722 -31263 -38865 -37131 -26472 -28320 -22468 -15807
9706 -15807 -12951 -15382 -20274 -15718 -39049 -35676 -13530 -2074 -4406 -10551 -18456 -20313 -5151 -1086
9692 -1086 3400 5617 366 -1821 4521 2211 -7846 -24397 -18366 -14855 -15649 -3268 -3050 -9758 -3237
9677 -3237 -8603 -26228 90 21894 16346 9545 -469 5219 -5198 -30015 -31887 -18940 -766
$$ packed form
9775C916l855j0908j1025j0447M42R335O90M674J3484p406J7915q926M753M106
9761F748o290J5092N553p279l039k0281J1165R483j705M032m282r054j838J1568
9747I873J7985n592l817j9261q642L826o158L055q86q558K0267J7192j2041k5698
9733a8455N073N430r67L257M244J290J16J412j1618m782J703j1441j8562j536
9719d4836J1589J6383j0265q196N924J5679j7541p602J734J0659j848N852O661
9706a5807K856k431m892M556k3331L373K2146J1456k332o145p905j857J5162M065
9692a086M486K217n251k187O342k310j0057j6551O031L511p94J2381K18o708O521
9677c237n366j7625K6318K1804n548o801j0014N688j0417k4817j872J2947J8174
$$ plain form
9664 -766 14049 25310 23429 19292 10349 -4919 -5857 -10291 -16308 -22271 -9876 14849 11250 -1929
9650 -1929 -17364 -5759 -59 47 2979 13859 14646 10386 -2444 5641 15517 20538 13651 6341
9636 6341 7356 -7105 -1905 12428 12621 19512 25659 22837 6769 12526 10220 -2431 1460 58
9622 58 -8834 -22643 -27354 -16891 -9052 -1880 9139 1275 1759 -3712 -5334 695 23482 21827 10050
9607 10050 20554 10875 8183 13651 -122 13106 23901 14066 -736 -6921 -7871 9690 -7665
9594 -7665 -3416 3505 5125 8141 7823 5786 -2213 9255 13480 56 -17043 -12222 -8478 -17020
9580 -17020 -15192 -5096 -7231 3667 17513 15525 2391 8255 6886 2392 2254 16028 16767 15740
9566 15740 2583 -31394 -39104 -31733 -19468 -23015 -10354 3352 3210 11877 3233 2235 6632 9584
$$ packed form
9664g66J4815J1261j881m137q943j5268r38m434o017n963J2395K4725l599j3179
9650a929j5435J1605N700J06K932J0880P87m260j2830Q085R876N021o887p310
9636F341J015j4461N200J4333J93O891O147k822j6068N757k306j2651L891j402
9622E8q892j3809m711J0463P839P172J1019p864M84n471j622O029K2787j655j1777
9607A0050J0504r679k692N468j3773J3228J0795r835j4802o185r50J7561j7355
9594g665M249O921J620L016l18k037p999J1468M225j3424j7099M821L744q542
9580a7020J828J0096k135J0898J3846j988j3134N864j369m494j38J3774P39j027
9566A5740j3157l3977p710P371J2265l547J2661J3706j42Q667q644r98M397K952
$$ plain form
9552 9584 15931 14019 20040 34087 45377 47970 43843 44081 47907 42593 18185 8450 7921 16821 21077
9537 21077 5628 -3494 -7757 -27854 -30156 -30257 -22273 -12605 11470 20085 13523 3713 7201 19055
9523 19055 9732 -1730 -16957 -27343 -21623 -24377 -31843 -27301 -11100 -6867 -26367 -44186 -23836
9510 -23836 -17278 -25904 -13182 16823 21860 9193 5732 13844 2141 -7400 -2821 5 6371 -2768
9496 -2768 -18198 -3965 14462 5388 -9251 -12229 -11963 -21283 -18496 -6563 -3757 -1773 9171 5753
9482 5753 5318 3240 -3224 6194 6997 41637 43318 37401 26430 3659 -13855 -14170 -5070 -3267 -12647
9467 -12647 -21208 -17398 -4527 -5835 8158 8804 6540 15606 18587 9236 8644 26525 13676 8221
9453 8221 -13012 -26735 -19679 -3104 1656 5759 12830 26361 20786 5898 766 -7369 -16142 -8605
$$ packed form
9552I584O347j912O021J4047J1290K593m127K38L826n314k4408r735n29Q900M256
9537B1077j5449r122m263k0097k302j01P984R668K4075Q615o562r810L488J1854
9523A9055r323j1462j5227j0386N720k754p466M542J6201M233j9500j7819K0350
9510b3836O558q626J2722L0005N037j2667l461Q112j1703r541M579K826O366r139
9496b768j5430J4233J8427r074j4639k978K66r320K787J1933K806J984J0944l418
9482E753m35k078o464R418Q03L4640J681n917j0971k2771j7514l15R100J803r380
9467a2647q561L810J2871j308J3993O46k264R066K981r351n92J7881j2849n455
9453H221k1233j3723P056J6575M760M103P071J3531n575j4888n132q135q773P537
$$ plain form
9439 -8605 32864 33915 15627 1758 -8738 291 10591 7579 18794 9602 6705 18280 23284
9426 23284 25998 11134 -1807 -4759 -16430 -16496 -10175 -4805 7091 2040 -7620 -5838 12375 11493
9412 11493 -9279 -15183 -32488 -39743 -41274 -32479 -25960 -27116 -18457 -9838 -11649 -1008 -10060 -16465
9398 -16465 -6780 -16660 -18752 -27227 -21194 -25393 -20634 -14214 -13326 -1796 -6485 -14428 -25663 -32537
9384 -32537 -35787 -50083 -36301 3773 21551 13906 -11398 -10883 -13278 -525 9669 16561 10328
9371 10328 6716 -9567 -31813 -28251 -9319 -4870 -20442 -19066 -9654 -9382 -9165 -12327 -20991 -24776
9357 -24776 -29453 -19831 17015 23375 17600 14573 31746 1045 -17092 -14701 -23063 -20451 -6847
9344 -6847 -1977 4800 14819 10308 11883 -3090 -14112 -30790 -37080 -52586 -41245 -12272 468
$$ packed form
9439h605M1469J051j8288j3869j0496R029J0300l012J1215r192k897J1575N004
9426B3284K714j4864j2941k952j1671o6O321N370J1896n051r660J782J8213q82
9412A1493k0772n904j7305p255j531Q795O519j156Q659Q619j811J0641r052o405
9398a6465R685r880k092q475O033m199M759O420Q88J1530m689p943j1235o874
9384c2537l250j4296J3782M0074J7778p645k5304N15k395J2753J0194O892o233
9371A0328l612j6283k2246L562J8932M449j5572J376R412K72K17l162q664l785
9357b4776m677R622L6846O360n775l027J7173l0701j8137K391q362K612J3604
9344f847M870O777J0019m511J575j4973j1022j6678o290j5506J1341K8973J2740
$$ plain form
9331 468 -9653 -12420 -15055 -12439 -9643 -13708 -15665 -12192 -16679 1024 5999 -14983 -24894 -21710
9317 -21710 -20426 -19905 -6943 19472 10135 -3019 -16119 -25733 -28362 -16636 -12676 -2697 12265
9304 12265 15855 14790 3820 1494 13740 15447 15069 1782 -4676 854 9566 6770 -7255 643
9290 643 19562 13073 18337 24671 20488 12607 -14586 -51935 -46236 -27904 -24450 -19385 -12793 -7194
9276 -7194 4928 10376 -204 -3078 1517 3857 6744 15469 10250 10782 -12782 -28781 -13419 671
9262 671 21785 25267 9612 21608 15471 13213 15363 14710 18754 17394 8922 14862 22090 13188 -1329
9247 -1329 -14220 -16241 -789 14297 8073 -295 -3843 -2380 16504 16139 7972 16689 28093 38085
9233 38085 43933 31994 20374 30834 16458 8138 17755 17395 11929 6501 18720 28550 22524 24649
$$ packed form
9331D68j0121k767k635K616K796m065j957L473m487J7703M975k0982r911L184
9317b1710J284N21J2962K6415r337j3154j3100r614k629J1726L960R979J4962
9304A2265L590j065j0970k326J2246J707l78j3287o458N530Q712k796j4025P898
9290F43J8919o489N264O334m183p881k7193l7349N699J8332L454N065O592N599
9276g194J2122N448j0580k874M595K340K887Q725n219N32k3564j5999J5362J4090
9262F71K1114L482j5655J1996o137k258K150o53M044j360q472N940P228q902j4517
9247a329j2891k021J5452J5086o224q368l548J463J8884l65q167Q717J1404R992
9233C8085N848j1939j1620J0460j4376q320R617l60n466n428J2219R830o026K125
$$ plain form
9219 24649 24096 9658 24042 28213 17154 27271 28378 26301 18792 12578 20067 38571 32323 15725
9205 15725 354 -3446 6675 3863 17236 38365 35971 28884 25143 34370 55254 56435 32156
9192 32156 26946 22669 24760 27304 36791 42383 42139 44389 43139 55016 66797 43164 18572 26279
9178 26279 55864 73272 83135 84297 92326 83388 95181 96876 97720 115715 128913 139610 142661
9165 142661 137233 151788 152943 167979 193408 198608 203637 221152 243120 269042 299992 329241
9153 329241 371495 431860 497542 564864 623504 702191 812033 933350 1074217 1231496 1413134
9142 1413134 1639420 1901733 2193919 2497735 2781301 2990768 3084304 3077669 2961516 2734151
9132 2734151 2457392 2206660 1954865 1710260 1487785 1288473 1127456 995297 875260 755405
$$ packed form
9219B4649n53j4438J4384M171j1059J0117J107k077p509o214P489J8504o248j6598
9205A5725j5371l800J0121k812J3373K1129k394p087l741R227K0884J181k4279
9192C2156n210m277K091K544R487N592k44K250j250J1877J1781k3633k4592P707
9178B6279K9585J7408R863J162Q029q938J1793J695Q44J7995J3198J0697L051
9165A42661n428J4555J155J5036K5429N200N029J7515K1968K5922L0950K9249
9153C29241M2254O0365O5682O7322N8640P8687J09842J21317J40867J57279J81638
9142A413134K26286K62313K92186L03816K83566K09467R3536o635j16153k27365
9132B734151k76759k50732k51795k44605k22475j99312j61017j32159j20037j19855
$$ plain form
9122 755405 657147 577966 525906 483451 442226 402477 380032 361498 343366 293732 254051 228554
9110 228554 220670 208556 188970 168069 156588 158478 150028 128002 112730 104006 105131 102564 94868
9097 94868 75793 47009 37322 57633 67152 73479 70738 62558 52016 47957 64677 73120 70658
9084 70658 64520 52298 33087 28764 26191 41204 57484 56153 58687 49033 52193 43510 43503 56892
9070 56892 63627 74073 72839 71497 73290 55275 36157 24768 14841 19203 31212 9140 3312
9057 3312 1306 17275 34312 28622 6369 20967 37699 26739 32270 33226 25057 5550 7607
9044 7607 8158 22094 15147 37930 36193 25638 29494 23085 9758 2050 7710 29328 18147 2334
9030 2334 -4379 1641 19731 3858 10454 1753 -11178 8110 16319 22088 22155 31906 26344 26815 15250
$$ packed form
9122G55405r8258p9181n2060m2455m1225l9749k2445j8534j8132m9634l9681k5497
9110B28554p884j2114j9586k0901j1481J890q450k2026j5272q724J125k567p696
9097I4868j9075k8784r687K0311R519O327k741q180j0542m059J6720Q443k462
9084G0658o138j2222j9211m323k573J5013J6280j331K534r654L160q683pJ3389
9070E6892O735J0446j234j342J793j8015j9118j1389r927M362J2009k2072n828
9057C312k006J5969J7037n690k2253J4598J6732j0960N531R56q169j9507K057
9044G607N51J3936o947K2783j737j0555L856o409j3327p708N660K1618j1181j5813
9030B334o713O020J8090j5873O596q701j2931J9288Q209N769O7R751n562M71j1565
$$ plain form
9015 15250 13181 23980 18138 18390 33784 7452 8221 12912 9696 11222 4246 12863 8638 21524
9001 21524 43938 35658 28724 19405 -167 6473 12914 22710 34999 38474 18042 1546 243
8988 243 8832 10971 16668 19655 23875 34753 30017 11453 20253 15131 3446 -7984 -17514 -14701
8974 -14701 4127 11579 19184 16985 8609 19317 10318 8229 13884 966 3918 14926 10507 3517
8960 3517 -1770 1401 959 -7017 -6860 7243 -691 -10127 9663 19490 15384 18655 -10585 -36821
8946 -36821 -11589 15550 7343 -1565 -7721 -8815 -12556 -17372 -37397 -28220 -9259 3825 -2241
8933 -2241 10917 21122 21784 12881 -8158 -23790 -28051 -7490 -5058 -23141 -18462 -18012 -19346 -12085
8919 -12085 -4567 -7166 -9721 -12738 -6177 6859 1212 5667 30006 19925 16514 8372 1795 4098
$$ packed form
9015A5250k069J0799n842K52J5394k6332P69M691l216J526o976Q617m225J2886
9001B1524K2414q280o934r319j9572O640O441R796J2289L475k0432j6496j303
8988B43Q589K139N697K987M220J0878m736j8564Q800n122j1685j1430r530K813
8974a4701J8828P452P605k199q376J0708q999k089N655j2918K952J1008m419o990
8960C517n287L171m42p976J57J4103p934r436J9790R827m106L271k9240k6236
8946c6821K5232K7139q207q908o156j094l741m816k0025R177J8961J3084o066
8933b241J3158J0205O62q903k1039j5632m261K0561K432j8083M679M50j334P261
8919a2085P518k599k555l017O561J3036n647M455K4339j0081l411q142o577K303
$$ plain form
8905 4098 -3026 -3350 -7136 -14934 -10353 5209 13195 27979 12913 12878 12166 1991 -3477 -521 -5203
8890 -5203 -970 -7052 -17975 -26957 -4257 4834 5088 8102 11733 5757 -8758 -23021 -20213 -15194
8876 -15194 -13773 -5704 -3295 -3178 -2572 -1881 9589 6318 -11258 -17447 -20437 -3475 -506 6564 28014
8861 28014 17648 11117 8541 -1195 8005 4774 4947 -9316 -16945 -30031 -33911 -25342 -9126 -9817
8847 -9817 3847 4344 10245 -3487 -3257 3308 -4957 -4322 8580 5021 16126 13235 233 -19798
8833 -19798 -6870 963 -5544 -8139 -3383 -3767 10562 19213 13287 15098 10218 -4341 3906 7961
8819 7961 -3995 -5002 17753 20711 12486 5530 9457 19780 9442 4303 3447 10624 -3007 -13153
8805 -13153 -17651 -7117 1424 10242 11478 14689 6396 8651 2616 -1653 -8155 8209 12007 421
$$ packed form
8905D098p124l24l786p798M581J5562P986J4784j5066l5p12j0175n468K956m682
8890e203M233o082j0923q982K2700R091K54L014L631n976j4515j4263K808N019
8876a5194J421Q069K409J17O06O91J1470l271j7576o189k990J6962K969P070K1450
8861B8014j0366o531k576r736R200l231J73j4263p629j3086l880Q569J6216o91
8847i817J3664M97N901j3732K30O565q265O35J2902l559J1105k891j3002k0031
8833a9798J2928P833o507k595M756l84J4329Q651n926J811m880j4559Q247M055
8819G961j1956j007K2755K958q225o956L927J0323j0338n139q56P177j3631j0146
8805a3153m498J0534Q541Q818J236L211q293K255o035m269o502J6364L798j1586
$$ plain form
8791 421 -8615 -5326 3347 15240 2964 -9601 -22737 -15851 -21627 -13023 2579 10947 -3556 -21990
8777 -21990 -31305 -20544 -24669 -30948 -19657 9123 12098 31002 36882 30715 24599 13490 4278
8764 4278 1853 6680 2061 4983 26262 22475 13360 17930 12508 -10413 -12496 -11327 -3262 -10343
8750 -10343 -9103 5422 13123 543 -763 8386 9427 16103 11272 637 -19477 -12383 -12304 -10396
8736 -10396 -15326 -2624 -2924 -25238 -30027 -11019 1959 -1368 3710 -2319 -8256 -24223 -31755 -14429
8722 -14429 -24740 -20023 -28338 -37756 -33682 -43378 -24405 7374 13151 24025 24157 22510 22197 16194
8708 16194 10934 16984 17409 21615 17895 6362 3018 -2358 101 -9502 -5792 -6647 -5055 -1660 3856
8693 3856 -1965 -2366 1388 -1748 -11519 -18 10053 15727 16927 20175 12748 16475 3660 19631
$$ packed form
8791D21r036L289Q673J1893j2276j2565j3136O886n776Q604J5602Q368j4503j8434
8777b1990r315J0761m125o279J1291K8780K975J8904N880o167o116j1109r212
8764D278k425M827m619K922K1279l787r115M570n422k2921k083J169Q065p081
8750a0343J240J4525P701j2580j306R149J041O676m831j0635k0114P094P9J908
8736a0396m930J2702l00k2314m789J9008J2978l327N078o029n937j5967p532J7326
8722a4429j0311M717q315r418M074r696J8973L1779N777J0874J32j647l13o003
8708A6194n260O050M25M206l720j1533l344n376K459r603L710q55J592L395N516
8693C856n821m01L754l136r771J1501J0071N674J200L248p427L727j2815J5971
$$ plain form
8679 19631 32598 31282 22132 24170 29861 22297 7027 -5130 -615 17097 21316 26556 16305
8666 16305 3609 11431 16187 5819 8549 10599 1593 16482 11367 2364 30996 24431 -33
8653 -33 -11588 -6985 -15765 -3836 4381 -6004 1668 9516 9345 1733 -14244 -18307 10348 23184
8639 23184 12270 11687 30384 41952 45254 50026 32819 16667 7966 11664 11361 19852 15664 5041
8625 5041 -3250 -3777 12946 11986 10243 8915 17022 31143 37886 38645 31251 22823 18588 18591 24151 30292
8609 30292 38665 30405 34403 39765 41613 25274 13179 7253 19840 22149 25069 25891 21592 16895
8595 16895 9806 11558 30222 38119 40635 30538 30690 22062 24522 33824 35636 31941 39356 47404
8581 47404 49089 71405 91620 79182 67575 66037 67111 70990 77275 51382 35786 12913 -10218
$$ packed form
8679A9631J2967j316r150K038N691p564j5270j2157M515J7712M219N240j0251
8666A6305j2696P822M756j0368K730K050r006J4889n115r003K8632o565k4464
8653c3j1555M603q780J1929Q217j0385P672P848j71p612j5977m063K8655J2836
8639B3184j0914n83J8697J1568L302M772j7207j6152q701L698l03Q491m188j0623
8625E041q291n27J6723r60j743j328Q107J4121O743P59p394q428m235LN560O141
8609C0292Q373q260L998N362J848j6339j2095n926J2587K309K920Q22m299m697
8595A6895p089J752J8664P897K516j0097J52q628K460R302J812l695P415Q048
8581D7404J685K2316K0215j2438j1607j538J074L879O285k5893j5596k2873k3131
$$ plain form
8568 -10218 12011 26175 28430 35109 16359 13594 20599 28987 35284 21231 20581 24721 20533 -1978
8554 -1978 -17090 -8441 -4436 -19648 -23584 2688 6701 12647 -233 -16535 -17660 -8891 -1731 4425
8540 4425 -9623 -12976 -17991 -34095 -32933 -21695 -11078 552 -1608 -9021 -14782 4846 7396
8527 7396 9727 11080 18394 9690 4259 10610 7115 1921 -2989 -23953 -19007 5093 27000 41488
8513 41488 22239 9153 -2255 3159 1779 20147 13804 12506 16792 25124 13167 -7761 -24549
8500 -24549 -13888 6041 -1189 -10400 4797 5568 7124 11068 9114 6038 17293 5336 12645 17846
8486 17846 -2933 -12836 -2743 6818 23502 18333 3535 -14175 -13729 -13443 -15395 -11060 -15394 -4391
8472 -4391 -2302 5147 5484 15428 20135 23380 23399 16691 9796 9123 15124 16312 28075 24136 16897 2447
$$ packed form
8568a0218K2229J4164K255O679j8750k765P005Q388O297j4053o50M140m188k2511
8554a978j5112Q649M005j5212l936K6272M013N946j2880j6302j125Q769P160O156
8540D425j4048l353n015j6104J162J1238J0617J1630k160p413n761J9628K550
8527G396K331J353P314q704n431O351l495n194m910k0964M946K4100K1907J4488
8513D1488j9249j3086j1408N414j380J8368o343j298M286Q332j1957k0928j6788
8500b4549J0661J9929p230r211J5197P71J556L944j954l076J1255j1957P309N201
8486A7846k0779r903J0093R561J6684n169j4798j7710M46K86j952M335m334J1003
8472d391K089P449L37R944M707L245J9o708o895o73O001J188J1763l939p239j4450
$$ plain form
8456 2447 8153 1644 -5158 6181 21606 29489 25679 -13450 -10428 -12092 6206 19194 16608 16768
8442 16768 13153 2141 -10130 -2794 8657 15252 32443 41918 23538 25332 30098 34882 30123
8429 30123 22447 -1257 -12579 8187 11504 17028 3580 -4349 13286 18408 17855 17877 10331 10515
8415 10515 14858 16801 8842 15426 10005 20239 39940 31112 23671 30491 28317 20023 10069 14121
8401 14121 27887 28291 21585 11209 13322 16074 3382 12914 22236 17100 16839 11066 -3841 -13808
8387 -13808 -14563 3211 3028 -9485 -2158 -12596 -18463 -15992 2270 4108 -4240 -9347 -3635 -14138
8373 -14138 -24862 -25564 -13297 -4960 -11701 -15817 -9871 -8538 -3260 -680 -15034 -21720 -13378 -11230
8359 -11230 11202 22717 25971 21497 8278 -1680 -11877 -21096 -19406 -23943 -20366 -36300 -12302
$$ packed form
8456B447N706o509o802J1339J5425P883l810l9129L022j664J8298J2988k586J60
8442A6768l615j1012j2271P336J1451O595J7191R475j8380J794M766M784m759
8429C0123p676k3704j1322K0766L317N524j3448p929J7635N122n53K2p546J84
8415A0515M343J943p959O584n421J0234J9701q828p441O820k174q294r954M052
8401A4121J3766M04o706j0376K113K752j2692R532R322n136k61n773j4907r967
8387a3808p55J7774j83j2513P327j0438n867K471J8262J838q348n107N712j0503
8373a4138j0724p02J2267Q337o741m116N946J333N278K580j4354o686Q342K148
8359a1230K2432J1515L254m474j3219r958j0197r219J690m537L577j5934K3998
$$ plain form
8346 -12302 -6108 -9713 -17634 -7392 10131 2031 -11786 3024 17450 32348 26990 21358 28028
8333 28028 5331 -22688 -15745 -21265 -16725 -14282 -10576 -3873 486 2380 7039 17755 21687 26079
8319 26079 7193 2217 -7833 -695 -9470 -13390 -21338 -23533 -3756 1219 4109 -2716 -14689 -6138
8305 -6138 -6895 4397 -5550 -15750 -5273 -1863 1616 6658 -3537 -9692 -16494 -10720 -11151 -13550
8291 -13550 -37990 -42189 -48535 -21154 785 9996 20772 15519 8384 -15820 -27580 -18931 -2843
8278 -2843 -1745 -9155 -47412 -50708 -40097 -24984 -15665 -16960 -12351 -11202 3652 -5488 -20354 -21247
8264 -21247 -16336 -13655 -10092 -16052 -16335 -19690 -17291 -13008 -13756 -21735 -15476 -34175 -25441 -12652 -1867
8249 -1867 2060 7805 -4256 -72 -16169 -29288 -37632 -50475 -48402 -39060 -25530 -17814 -9875 -9050
$$ packed form
8346a2302O194l605p921J0242J7523q100j3817J4810J4426J4898n358n632O670
8333B8028k2697k8019O943n520M540K443L706O703M359J894M659J0716L932M392
8319B6079j8886m976j0050P138q775l920p948k195J9777M975K890o825j1973Q551
8305f138p57J1292r947j0200J0477L410L479N042j0195o155o802N774m31k399
8291a3550k4440m199o346K7381K1939R211J0776n253p135k4204j1760Q649J6088
8278b843J098p410l8257l296J0611J5113R319j295M609J149J4854r140j4866q93
8264b1247M911K681L563n960k83l355K399M283p48p979O259j8699Q734J2789J0785
8249a867L927N745j2061M184j6097j3119q344j2843K073R342J3530P716P939Q25
$$ plain form
8235 -9050 17977 30264 24180 16298 1247 -10746 6896 13646 4950 9407 3505 477 -578 9712
8221 9712 14587 -2797 7496 8778 5040 -3212 -11491 2041 10300 8987 -6830 -9625 -1500 -4942
8207 -4942 8314 -1986 -25005 -19138 -25770 -27855 -17032 -21158 -27092 -24076 -46224 -54595 -31191
8194 -31191 -9230 -16366 -3092 17901 22344 20556 27995 26224 29628 18972 624 -6350 -19111
8181 -19111 -16449 -18405 -3738 -7533 -9377 -23002 -19516 -4443 5663 -1128 17393 12282 -14800
8168 -14800 -34155 -24464 -5281 2957 4157 -13723 -20600 -2830 -12233 -27018 -28464 -18934 4659
8155 4659 8282 -4584 -128 -4086 -6777 -8444 -5406 5911 3726 1651 -9255 -6910 -5302 8118
8141 8118 18609 8499 1127 24526 44736 54366 36621 28022 17432 -6213 2558 8966 -3937
$$ packed form
8235i050K7027J2287o084p882j5051j1993J7642O750q696M457n902l028j055J0290
8221I712M875j7384J0293J282l738q252q279J3532Q259j313j5817k795Q125l442
8207d942J3256j0300k3019N867o632k085J0823m126n934L016k2148q371K3404
8194c1191K1961p136J3274K0993M443j788P439j771L404j0656j8348o974j2761
8181a9111K662j956J4667l795j844j3625L486J5073J0106o791J8521n111k7082
8168a4800j9355R691J9183Q238J200j7880o877J7770r403j4785j446R530K3593
8155D659L623j2866M456l958k691j667L038J1317k185k075j0906K345J608J3420
8141H118J0491j0110p372K3399K0210R630j7745q599j0590k3645Q771O408j2903
$$ plain form
8128 -3937 -8479 -9674 -6262 -5527 -819 -2002 -6125 -9186 -332 -4751 -5867 11985 24342 26127 24326
8113 24326 -3507 -19765 -11107 -9485 -8705 11130 22057 16364 10191 13952 -24 5236 9482 -9003
8099 -9003 -1814 3506 -4523 -7534 -11006 -5759 -6575 -11551 -15438 -19765 -14446 -11757 -15671 -8526 -8028
8084 -8028 2095 11226 19561 15421 -11146 -12456 -8451 -21680 -2646 3878 -10348 -29615 -37281
8071 -37281 -34783 -30665 -27239 -15098 -14154 -915 -9113 2374 4698 -12950 -15719 955 5865 15482
8057 15482 9968 8885 9205 10569 -4518 -20499 -30012 -18455 2034 4637 694 3407 576 -363
8043 -363 1899 22408 32377 31942 20062 8781 10166 20597 22337 17388 24362 19319 38367 31342
8029 31342 21665 14441 12070 26554 50856 60360 54327 23638 24174 34077 40044 44353 30121 23053
$$ packed form
8128c937m542j195L412P35M708j183m123l061Q854m419j116J7852J2357J785j801
8113B4326k7833j6258Q658J622P80J9835J0927n693o173L761j3976N260M246j8485
8099i003P189N320q029l011l472N247q16m976l887m327N319K689l914P145M98
8084h028J0123R131Q335m140k6567j310M005j3229J9034O524j4226j9267p666
8071c7281K498M118L426J2141R44J3239q198J1487K324j7648k769J6674M910R617
8057A5482n514j083L20J364j5087j5981r513J1557K0489K603l943K713k831r39
8043c63K262K0509R969m35j1880j1281J385J0431J740m949O974n043J9048p025
8029C1342r677p224k371J4484K4302R504o033l0689N36R903N967M309j4232p068
$$ plain form
8015 23053 -1341 1758 19917 6311 4465 23710 33012 20799 14805 20503 -4362 -9889 -6323
8002 -6323 10248 11589 -16155 -4351 13684 13263 10313 19980 23210 19145 32736 56356 55665 54063
7988 54063 62484 56562 49613 44494 42890 25258 17522 18065 38063 49874 38455 43611 52917 49264
7974 49264 49307 42028 35235 21721 37312 39956 26425 15815 20011 22342 12951 9496 -845 -6866
7960 -6866 72 -1109 -8298 2041 13981 16983 11389 9641 16582 18973 22736 33604 40958 51853
7946 51853 58451 62454 55694 64975 67338 68809 58734 50813 54687 57937 57018 63539 80221 80981 63423
7931 63423 45634 19488 -8568 -11490 -6853 6419 22081 26563 37268 17079 1739 16013
7919 16013 10545 775 14839 14163 -680 -7172 -353 16708 -4324 -12729 -14803 -10196 14284 23378
$$ packed form
8015B3053k4394L099J8159j3606j846J9245R302j2213n994N698k4865n527L566
8002f323J6571J341k7744J1804J8035m21k950R667L230m065J3591K3620o91j602
7988E4063Q421n922o949n119j604j7632p736N43J9998J1811j1419N156R306l653
7974D9264M3p279o793j3514J5591K644j3531j0610M196K331r391l455j0341o021
7960f866O938j181p189J0339J1940L002n594j748O941K391L763J0868P354J0895
7946E1853O598M003o760R281K363J471j0075p921L874L250r19O521J6682P60j7558
7931F3423j7789k6146k8056k922M637J3272J5662M482J0705k0189j5340J4274
7919A6013n468r770J4064o76j4843o492O819J7061k1032q405k074M607K4480R094
$$ plain form
7905 23378 28899 37934 38557 36746 44993 37019 16551 507 -478 16612 21107 -1877 4104 -8058
7891 -8058 -1498 -2317 3449 30371 36990 49711 43034 23992 15846 23114 26346 20590 18456 12570
7877 12570 18688 -2942 -5336 -13503 -900 10009 1312 -7407 -7474 -19149 -28279 -20471 -7177 -22019
7863 -22019 -41903 -41274 -51427 -49323 -36544 -13844 -9541 -12823 -7667 -2514 8657 19571 16457
7850 16457 17115 5837 1093 -1636 -1330 -7754 508 23369 24531 18646 24068 16731 9109 -2787
7836 -2787 -14120 -26310 -11367 5435 -3805 -9915 -10399 -22585 -23945 -17877 -5657 9536 14778
7823 14778 15819 2054 -10109 -11024 -12379 -18127 -24466 -18176 2476 -4954 -25530 -18339 -19456 -15285
7809 -15285 -21624 -24234 -38985 -35004 -17119 -9472 -7370 10651 16635 17891 20861 26583 19996 -4064
$$ packed form
7905B3378N521R035O23j811Q247p974k0468j6044r85J7090M495k2984N981j2162
7891h058O560q19N766K6922O619J2721o677j9042q146P268L232n756k134n886
7877A2570O118k1630k394q167J2603J0909q697q719o7j1675r130P808J3294j4842
7863b2019j9884O29j0153K104J2779K2700M303l282N156N153J1171J0914l114
7850A6457O58j1278m744k729L06o424Q262K2861J162n885N422p337p622j1896
7836b787j1333j2190J4943J6802r240o110m84j2186j360O068J2220J5193N242
7823A4778J041j3765j2163r15j355n748o339O290K0652p430k0576P191j117M171
7809a5285o339k610j4751L981J7885P647K102J8021N984J256K970N722o587k4060
$$ plain form
7795 -4064 -10336 -2139 9524 12368 11278 8850 8961 16925 15590 -1554 -4819 -2489 -3976 -5406 4500
7780 4500 3279 -9832 -4789 -3446 -3457 -4391 -19140 -23204 -18850 -8357 -671 10121 12705 -858
7766 -858 -8624 672 -14454 -3821 4024 4665 -11005 -31092 -25596 -10541 -6767 -15769 -4550 6906
7752 6906 17114 47063 44901 19619 7838 13993 14652 15655 1561 -6351 -3283 2091 8367 -2024
7738 -2024 -179 -8112 1635 10718 21754 34158 36432 29291 25645 14605 -11794 -7023 2576 -14696
7724 -14696 -5631 11530 6703 -17074 -20223 -12165 2558 3508 -3700 -935 11928 8425 7095 7906
7710 7906 381 1269 3145 132 3091 2665 -1238 -15567 -13176 -495 -14711 -33775 -31761 -17711
7696 -17711 -3535 14542 16084 2014 -10455 -9314 8643 22607 12600 4637 1470 5444 6277
$$ packed form
7795d064o272Q197J1663K844j090k428J11P964j335j7144l265K330j487j430R906
7780D500j221j3111N043J343j1r34j4749m064M354J0493P686J0792K584j3563
7766h58p766R296j5126J0633P845O41j5670k0087N496J5055L774r002J1219J1456
7752F906J0208K9949k162k5282j1781O155O59J003j4094p912L068N374O276j0391
7738b024J845p933R747R083J1036J2404K274p141l646j1040k6399M771R599j7272
7724a4696R065J7161m827k3777l149Q058J4723R50p208K765J2863l503j330Q11
7710G906p525Q88J876l013K959m26l903j4329K391J2681j4216j9064K014J4050
7696a7711J4176J8077J542j4070j2469J141J7957J3964j0007p963l167L974Q33
$$ plain form
7683 6277 12613 26608 23045 35008 27219 4786 8024 -6424 -6809 -7321 -10173 -10704 -26412 -19008
7669 -19008 -11637 -11831 -14829 -25445 -34792 -44978 -32534 -27009 -20086 -6382 5077 -20237 -26223
7656 -26223 -24767 -44627 -34534 -12715 1498 -15207 -22859 -11407 4880 4461 6076 8198 19231
7643 19231 8564 -17250 -37597 -22457 -13960 -26721 -23077 -8483 -4792 5202 6371 -8191 -8708
7630 -8708 -5679 -2318 -5334 -13421 -12830 -11171 -16657 -17272 -14606 -17256 -10133 4500 13851 -794 -24714
7615 -24714 -19092 1929 8292 -5854 -31469 -39342 -20520 1815 -672 -9898 -15626 -3236 -3845
7602 -3845 -26220 -32549 -24359 -20576 -11058 -1939 5991 4137 -6968 -16007 -28813 -21382 -26392 -22735
7588 -22735 -21769 -30093 -21108 -3865 8933 1632 -18348 -25708 -36351 -26306 -2021 7268 5944
$$ packed form
7683F277O336J3995l563J1963p789k2433L238j4448l85n12k852n31j5708P404
7669a9008P371j94k998j0616r347j0186J2444N525O923J3704J1459k5314n986
7656b6223J456j9860J0093K1819J4213j6705p652J1452J6287m19J615K122J1033
7643A9231j0667k5814k0347J5140Q497j2761L644J4594L691R994J169j4562n17
7630h708L029L361l016q087N91J659n486o15K666k650P123J4633R351j4645k3920
7615b4714N622K1021O363j4146k5615p873J8822K2335k487r226n728J2390o09
7602c845k2375o329Q190L783R518R119P930j854j1105r039j2806P431n010L657
7588b2735R66q324Q985J7243J2798p301j9980p360j0643J0045K4285R289j324
$$ plain form
7575 5944 -1835 2550 -9704 -14858 -21608 -23256 -9020 -7999 -21243 -21288 -20660 -10164 -2522 -14243
7561 -14243 -16771 2582 21143 23070 8544 3024 653 2684 8640 11567 14235 7912 1235 5132
7547 5132 10622 9474 5711 -7498 -8626 -3608 -8466 -12228 7925 15145 9158 -19 -4655 8187
7533 8187 31802 32008 14987 -11778 -17804 -10303 -1218 5796 4554 15191 3474 -14755 -18128 -913
7519 -913 -6807 -15284 -15177 -9061 -14273 -13171 1723 3591 14552 28755 43563 26519 7509 2416
7505 2416 -233 -5844 17914 33456 23371 18266 9270 19571 29209 14835 1794 2753 -2672 -3268
7491 -3268 -4237 -7681 -6917 -10044 -11526 -2594 6978 14250 13986 18197 14140 721 -3239 -6552 -24891
7476 -24891 -23694 -14270 -23065 -22658 -15758 -17685 -24523 -26824 -19069 -7801 -31 19768 -5829 -22239
$$ packed form
7575E944p779M385j2254n154o750j648J4236J021j3244m5O28J0496P642j1721
7561a4243k528J9353J8561J927j4526n520k371K031N956K927K668o323o677L897
7547E132N490j148l763j3209j128N018m858l762K0153P220n987r177m636J2842
7533H187K3615K06j7021k6765o026P501R085P014j242J0637j1717j8229l373J7215
7519i13n894q477J07O116n212J102J4894J868J0961J4203J4808j7044j9010n093
7505B416k649n611K3758J5542j0085n105q996J0301R638j4374j3041R59n425n96
7491c268r69l444P64l127j482Q932R572P272k64M211m057j3419l960l313j8339
7476b4891J197R424q795M07O900j927o838k301P755J1268P770J9799k5597j6410
$$ plain form
7462 -22239 -12009 -22675 -27606 -18094 -18152 -15115 -22132 -25512 -28798 -23433 -14934 -17632 -10447 -11255 -34920
7447 -34920 -22667 209 -80 2467 -2874 2053 3609 -1957 -12474 -34680 -41032 -32224 -36987 -52660
7433 -52660 -45508 -33256 -31129 -17844 -8219 -6349 4010 -9381 -18685 -5048 5095 8404 -7527
7420 -7527 5765 1686 -2273 -5841 -9647 -21173 -12507 -25611 -34934 -38156 -32930 -23100 1840 8144
7406 8144 -3734 -1276 8608 22059 16967 18637 21472 20815 32460 28196 12036 -1753 3380 -2633
7392 -2633 -14675 -21449 -20447 -15127 -15107 -21570 -20755 -19392 -32894 -32501 -18772 -17311 -19519 -5994 3348
7377 3348 3977 2408 -26773 -35172 -9353 8599 2741 -3159 -13024 -2987 5652 10739 -6635 -22571
7363 -22571 -19671 -7244 -8267 -5592 -6707 3000 3186 -7964 -19047 -28555 -22213 -4283 1013 10286
$$ packed form
7462b2239J0230j0666m931R512n8L037p017l380l286N365Q499k698P185q08k3665
7447c4920J2253K2876k89K547n341M927J556n566j0517k2206o352Q808m763j5673
7433e2660P152J2252K127J3285R625J870J0359j3391r304J3637J0143L309j5931
7420g527J3292m079l959l568l806j1526Q666j3104r323l222N226R830K4940O304
7406H144j1878K458R884J3451n092J670K835o57J1645m264j6160j3789N133o013
7392b633j2042o774J002N320K0o463Q15J363j3502L93J3729J461k208J3525R342
7377C348O29j569k9181q399K5819J7952n858n900r865J0037Q639N087j7374j5936
7363b2571K900J2427j023K675j115R707J86j1150j1083r508O342J7930N296R273
$$ plain form
7349 10286 11301 3037 -3107 -56 -835 -5167 -11140 -12654 -8054 -4686 -8340 -7930 -10101 -7041 -16195
7334 -16195 -17961 -13493 -21854 -25390 -14064 -10816 -1031 -5982 -19067 -9429 2726 -794 -7339 -2501
7320 -2501 -6751 -4226 1161 4258 -5307 -2830 10360 11944 17186 40931 27246 10197 9168 4208
7306 4208 6044 917 -18308 -37388 -34016 -29048 -35158 -15979 -10412 -14778 -14520 -18087 -16931 -11357
7292 -11357 -16152 -1485 3225 539 -6067 -12515 -14292 -17361 -24709 -47775 -44888 -27356 -23278 -12889
7278 -12889 -494 35 5181 12233 4563 -6297 8324 -2631 -2260 -17676 -8353 1091 6981 5416
7264 5416 -910 10261 25512 25537 21694 18391 17187 4471 -1500 383 6 983 16832 12295 18287
7249 18287 27175 15620 21383 25567 13954 -914 9126 756 7190 15495 5673 -9196 -6352
$$ packed form
7349A0286J015q264o144L051p79m332n973j514M600L368l654M10k171L060r154
7334a6195j766M468q361l536J1326L248R785m951j3085R638J2155l520o545M838
7320b501m250K525N387L097r565K477J3190J584N242K3745j3685j7049j029m960
7306D208J836n127j9225j9080L372M968o110J9179N567m366K58l567J156N574
7292a1357m795J4667M710k686o606o448j777l069p348k3066K887J7532M078J0389
7278a2889J2395N29N146P052p670j0860J4621j0955L71j5416R323R444N890j565
7264E416o326J1171J5251K5l843l303j204j2716n971J883l77R77J5849m537N992
7249A8287Q888j1555N763M184j1613j4868J0040q370O434Q305r822j4869K844
$$ plain form
7236 -6352 -7860 -205 7411 15871 12747 9951 12326 5623 -17621 -7255 -619 -6786 -11421 -8033
7222 -8033 -3697 3952 -7506 -14889 -18783 -14499 -21431 -27439 -38940 -26022 -15118 -19889 -13531 8718
7208 8718 18913 10956 -4185 -9675 -11379 -16920 -16050 -13920 -19170 -15535 -17588 -8852 -12713 -11353 -9947
7193 -9947 -1930 -6778 -3890 3466 15504 30136 31512 37497 27487 12564 10000 8790 3555 -3469
7179 -3469 6896 7972 14399 10638 5435 -4847 -15174 -13859 -5155 18373 11753 -9072 -17311 -10992
7165 -10992 12155 13955 2346 -12627 -18339 -10890 8179 13023 5579 7338 -912 -3392 -803 7456
7151 7456 8850 -4182 5131 -1622 -19473 -32997 -32048 -18643 -5270 -11075 -17547 -1191 13414
7138 13414 6002 1017 -18745 -26331 -10866 -6779 -13725 -8172 -11952 -15213 -28558 -27025 -21034 -10653
$$ packed form
7236f352j508P655P616Q460l124k796K375o703k3244J0366O636o167m635L388
7222h033M336P649j1458p383l894M284o932o008j1501J2918J0904m771O358K2249
7208H718J0195p957j5141n490j704n541Q70K130n250L635k053Q736l861J360J406
7193i947Q017m848K888P356J2038J4632J376N985j0010j4923k564j210n235p024
7179c469J0365J076O427l761n203j0282j0327J315Q704K3528o620k0825q239O319
7165a0992K3147J800j1609j4973n712P449J9069M844p444J759q250k480K589Q259
7151G456J394j3032R313o753j7851j3524R49J3405J3373n805o472J6356J4605
7138A3414p412m985j9762p586J5465M087o946N553l780l261j3345J533N991J0381
$$ plain form
7124 -10653 -10698 -20604 -31457 -33839 -28702 -13371 -19409 -22296 -14109 -2675 -17146 -26697 -8912 -12948
7110 -12948 342 -1804 -1750 -20094 -9415 -4068 -6943 -11589 -28638 -26297 -18394 -16849 -8041 -10971
7096 -10971 -8842 -5467 -11327 -12912 -505 -3483 -7770 13848 26979 11280 -7075 -20520 -22411
7083 -22411 -5545 16025 11745 22985 26490 20262 8325 -1335 11838 2522 -7673 -6412 7032
7070 7032 -1580 -25891 -23820 -21930 -17428 -20486 -23108 -18803 574 -2426 -7471 -9833 3891 -4923
7056 -4923 -15768 -20935 84 13459 16230 6522 -4526 -6998 -9935 -21560 -31986 -41907 -26655
7043 -26655 -16602 -13890 -6238 -631 2851 -1 -5373 -7951 -7426 6949 22870 23402 -585 -13192
7029 -13192 -15873 -20137 -449 15211 21496 19655 17943 22026 22449 5884 -12455 -7965 -12935 -11805
$$ packed form
7124a0653m5r906j0853k382N137J5331o038k887Q187J1434j4471r551J7785m036
7110a2948J3290k146N4j8344J0679N347k875m646j7049K341P903J545Q808k930
7096a0971K129L375n860j585J2407k978m287K1618J3131j5699j8355j3445j891
7083b2411J6866K1570m280J1240L505o228j1937r660J3173r316j0195J261J3444
7070G032q612k4311K071J890M502l058k622M305J9377l000n045k362J3724q814
7056d923j0845n167K1019J3375K771r708j1048k472k937j1625j0426r921J5252
7043b6655J0053K712P652N607L482k852n372k578N25J4375J5921N32k3987j2607
7029a3192k681m264J9688J5660O285j841j712M083M23j6565j8339M490m970J130
$$ plain form
7015 -11805 -5749 8503 23274 4115 -15531 -30507 -17950 -7399 -2490 -2569 -7378 -922 14934
7002 14934 18797 24367 10954 13707 16599 26201 38814 28275 -1751 4412 9725 -10524 9668
6989 9668 21459 15085 18071 12647 4898 15871 23239 31290 23306 7724 -6331 -4718 4621 1402
6975 1402 16557 29305 29997 21342 1916 -7702 -28596 -31964 -15980 -13774 -27411 -33548 -18915
6962 -18915 -19417 -1570 -1099 -3886 1267 -3277 -16833 -13376 69 9342 -4740 -1122 14119 9705
6948 9705 -7748 -8946 -17838 -19283 -7962 -15424 -19852 -6697 -235 10901 7478 -686 -9031 4670
6934 4670 18964 20416 13133 23750 25785 10688 3261 11655 6657 3595 -9133 -5612 -4501 -6260
6920 -6260 -7789 -12648 2053 21893 19176 -3422 -8766 -7381 -1434 6307 12168 26582 21370 2459
$$ packed form
7015a1805O056J4252J4771j9159j9646j4976J2557J0551M909p9m809O456J5856
7002A4934L863N570j3413K753K892R602J2613j0539l0026O163N313k0249K0192
6989I668J1791o374K986n424p749J0973P368Q051p984j5582j4055J613R339l219
6975A402J5155J2748O92q655j9426r618k0894l368J5984K206j3637o137J4633
6962a8915n02J7847M71k787N153m544j3556L457J3445R273j4082L618J5241m414
6948I705j7453j198q892j445J1321p462m428J3155O462J1136l423q164q345J3701
6934D670J4294J452p283J0617K035j5097p427Q394m998l062j2728L521J111j759
6920f260j529m859J4701J9840k717k2598n344J385N947P741N861J4414n212j8911
$$ plain form
6906 2459 -6175 3514 25073 21967 10789 17713 15757 5780 -2211 12024 1845 -16033 -11557 -14735
6892 -14735 -21483 -14193 -16160 -34982 -31992 -25035 350 4353 -1227 6467 17826 34373 35946 19856
6878 19856 -5232 -6832 -5576 12938 9545 -1275 -9522 -10964 7595 10545 2094 4325 9165 10865
6864 10865 8717 5255 11304 3890 -16931 -21623 -16619 -9196 -15097 -19091 -25828 -20368 -37961 -42306
6850 -42306 -39314 -32142 -36104 -51294 -50005 -42676 -40954 -40092 -42569 -34204 -16983 -14942 -25430 -25345 -10023
6835 -10023 -7407 -12385 7561 14967 20834 18163 12132 15022 22988 20289 12583 16273 15838 -1222
6821 -1222 383 3619 -23601 -35734 -38991 -36255 -23545 -13118 -22234 -18984 -12247 6071 9879 13004
6807 13004 1497 -6336 -3947 -6092 -27127 -25852 -17629 -43356 -52095 -23952 -5671 5880 -1284
$$ packed form
6906B459q634R689K1559l106j1178O924j956r977p991J4235j0179j7878M476l178
6892a4735o748P290j967j8822K990O957K5385M003n580P694J1359J6547J573j6090
6878A9856k5088j600J256J8514l393j0820q247j442J8559K950q451K231M840J700
6864A0865k148l462O049p414k0821m692N004P423n901l994o737N460j7593m345
6850d2306K992P172l962j5190J289P329J722Q62k477Q365J7221K041j0488Q5J5322
6835a0023K616m978J9946P406N867k671o031K890P966k699p706L690m35j7060
6821a222J605L236k7220j2133l257K736J2710J0427r116L250O737J8318L808L125
6807A3004j1507p833K389k145k1035J275Q223k5727q739K8143J8281J1551p164
$$ plain form
6794 -1284 -16772 4389 27448 30663 6469 -2592 -10718 -30649 -18116 -1937 -3754 15585 21888
6781 21888 21397 19677 12051 17287 12078 18396 9542 -3774 -13105 -21576 -23448 -17699 -21501 -21700 -22164
6766 -22164 -26833 -22977 -5251 -7927 3596 -3832 -280 13043 8469 -4955 -16987 -24074 -30965
6753 -30965 -31949 -20195 -3542 3322 -1960 -5600 -5434 4728 22173 17348 1899 -2495 -4132 -12305
6739 -12305 -13305 -10877 4293 6502 8873 37 -5542 7777 22666 23424 11462 6727 -7326 -5302
6725 -5302 -15293 -21646 -17173 -7224 5653 6920 -17354 -15774 -18841 -19103 -24204 -14828 -13236 -30632
6711 -30632 -41322 -34997 -17937 -26702 -19603 -13062 15668 28150 16220 8599 -4727 -4680 3202 -18373
6697 -18373 -25907 -13366 -8551 -6442 -12451 -16722 -27278 -43103 -27633 -14366 10092 4591 -10279
$$ packed form
6794a284j5488K1161K3059L215k4194r061q126j9931J2533J6179j817J9339O303
6781B1888m91j720p626N236n209O318q854j3316r331q471j872N749l802j99m64
6766b2164m669L856J7726k676J1523p428L552J3323m574j3424j2032p087o891
6753c0965r84J1754J6653O864n282l640J66J0162J7445m825j5449m394j637q173
6739a2305j000K428J5170K209K371q836n579J3319J4889P58j1962m735j4053K024
6725e302r991o353M473R949J2877J267k4274J580l067k62n101R376J592j7396
6711c0632j0690O325J7060q765P099O541K8730J2482j1930p621j3326M7P882k1575
6697a8373p534J2541M815K109o009m271j0556j5825J5470J3267K4458n501j4870
$$ plain form
6684 -10279 -24804 -32840 -44533 -30642 1034 -4070 -19339 -47340 -43789 -32582 -27160 -24678 -11781
6671 -11781 -14720 -13801 -3531 -1715 7721 -1372 5821 18043 16553 9853 -1034 -20651 -22641 2846
6657 2846 6620 3932 21571 36451 42022 29274 6402 -11269 -19391 -15485 -14411 -12630 -9072 -10890
6643 -10890 -5807 -10515 -9119 -8230 -9356 -17616 -7142 7294 19648 25751 30241 15259 2188 -6104
6629 -6104 440 11864 20019 12514 8889 4951 -6345 -2764 -13925 -17335 -26770 -8683 -1208 -13661
6615 -13661 -20250 -12035 -12961 -13775 -11732 -10557 2381 -3365 -784 2706 13340 18270 17520 27949 18564
6600 18564 -16053 -20569 1275 15524 12390 1229 -7162 -16290 -34505 -28209 -23753 -39427 -24867
6587 -24867 -14023 -2192 879 6707 5933 -5883 -7901 6959 15587 26317 31005 12481 -2022
$$ packed form
6684a0279j4525q036j1693J3891L1676n104j5269k8001L551J1207N422K482J2897
6671a1781k939R19J0270J816R436r093P193J2222j490o700j0887j9617j990K5487
6657B846L774k688J7639J4880N571j2748k2872j7671q122L906J074J781L558j818
6643a0890N083m708J396Q89j126q260J0474J4436J2354O103M490j4982j3071q292
6629f104O544J1424Q155p505l625l938j1296L581j1161l410r435J8087P475j2453
6615a3661o589Q215r26q14K043J175J2938n746K581L490J0634M930p50J0429r385
6600A8564l4617m516K1844J4249l134j1161q391r128j8215O296M456j5674J4560
6587b4867J0844J1831L071N828p74j1816k018J4860Q628J0730M688j8524j4503
$$ plain form
6574 -2022 -8074 -9190 1792 15112 21142 18699 13054 10237 19191 28125 33225 34625 19108 7788
6560 7788 -5584 -9939 -3966 5155 -3109 1449 -7622 -23776 -18994 -8314 5132 4392 21917 33070
6546 33070 21609 16745 22492 11683 5292 4950 -9933 -10669 -2599 -6171 -13265 -16342 -14891 2032
6532 2032 3812 -3819 -5779 -10103 -15465 -2203 -4327 6427 -1806 -17940 -14361 9763 8865 -9140
6518 -9140 -4749 761 -10983 -39321 -42620 -30552 -34512 -19552 -7855 -16509 -21086 -21091 -13385 -2901
6504 -2901 -5398 -4692 -1090 2226 -1043 -9971 -24880 -22705 -16616 -5400 -4853 -1984 -13288 -10141 7449
6489 7449 19397 16901 -3636 -14011 -7697 -15013 -15537 -8994 -14434 7795 31415 39056 35113 18188
6475 18188 15489 11590 -3127 -13577 -16239 -27562 -16067 -10616 -9201 -18478 -32667 -31040 -27437
$$ packed form
6574b022o052j116J0982J3320O030k443n645k817Q954Q934N100J400j5517j1320
6560G788j3372m355N973R121q264M558r071j6154M782J0680J3446p40J7525J1153
6546C3070j1461m864N747j0809o391l42j4883p36Q070l572p094l077J451J6923
6532B032J780p631j960m324n362J3262k124J0754q233j6134L579K4124q98j8005
6518i140M391N510j1744k8338l299J2068l960J4960J1697q654m577nP706J0484
6504b901k497P06L602L316l269q928j4909K175O089J1216N47K869j1304L147J7590
6489G449J1948k496k0537j0375O314p316n24O543n440K2229K3620P641l943j6925
6475A8188k699l899j4717j0450k662j1323J1495N451J415r277j4189J627L603
$$ plain form
6462 -27437 -24164 -12418 -8118 -9147 -604 395 -9383 -20119 -11199 -17844 -11394 5832 2009 2845
6448 2845 15772 18409 18010 5307 -20100 -19792 -4774 3464 -9163 -23544 -18492 -11490 -22183 -38722
6434 -38722 -28852 -19302 -19243 -883 -6940 -18549 -15964 -4427 -7190 15709 5823 -11996 -22987 -22647
6420 -22647 -13749 -4834 -9757 -17613 -22591 -16669 -1652 13435 -4652 -4377 -2778 4269 94 -23878
6406 -23878 -21082 -11644 -24640 -22513 -7208 1785 -11826 -6679 2134 1605 -17624 -32549 -25002 -15988
6392 -15988 -7036 2388 20071 28691 17103 10191 7641 10823 3615 -11148 -25052 -12232 -4704
6379 -4704 2227 5941 183 -12745 -22321 -19221 -17902 -17896 -19845 -14940 -2597 11574 18122 469 4307
6364 4307 200 -10923 -13957 -7753 -11386 -6948 1951 7934 -2887 -10562 -347 3153 -16029 -23599
$$ packed form
6462b7437L273J1746M300j029Q543R99r778j0736Q920o645O450J7226l823Q36
6448B845J2927K637l99j2703k5407L08J5018Q238j2627j4381N052P002j0693j6539
6434c8722R870R550N9J8360o057j1609K585J1537k763K2899r886j7819j0991L40
6420b2647Q898Q915m923p856m978N922J5017J5087j8087K75J599P047m175k3972
6406b3878K796R438j2996K127J5305Q993j3611N147Q813n29j9229j4925P547R014
6392a5988Q952R424J7683Q620j1588o912k550L182p208j4763j3904J2820P528
6379d704O931L714n758j2928r576L100J319Oj949M905J2343J4171O548j7653L838
6364D307m107j1123l034O204l633M438Q899N983j0821p675J0215L500j9182p570
$$ plain form
6350 -23599 -11090 -18371 -20036 -7123 9970 14526 3366 1525 610 -5831 -2259 -1397 -5324 6814
6336 6814 24513 31161 28714 8153 -1892 -8346 -15377 -7232 -3934 3375 -3644 -6866 -15797 -15231
6322 -15231 -12818 -16693 -12200 -8243 6175 16919 24258 16093 17771 7537 12308 29374 37566 47233
6308 47233 34003 37549 33718 34530 36281 10731 -2296 -1227 8675 6224 -11970 -2637 16282 18123
6294 18123 6374 -5189 901 -1930 -3023 -6896 -18596 -9891 -11648 -7413 -130 -749 -4531 -1246
6280 -1246 -7178 -11597 -16870 -5334 1919 511 7990 4021 6851 10547 14445 25372 29799 25958
6266 25958 12677 18802 6376 -12553 -22752 -23268 -30107 -36925 -6475 13211 13013 6778 -5631
6253 -5631 -2883 967 -9388 464 -2176 -4517 -15731 -4735 10126 5985 -210 -12220 -13036 -11238
$$ packed form
6350b3599J2509p281j665J2913J7093M556j1160j841r15o441L572Q62l927J2138
6336F814J7699O648k447k0561j0045o454p031Q145L298P309p019l222q931N66
6322a5231K413l875M493L957J4418J0744P339q165J678j0234M771J7066Q192R667
6308D7233j3230L546l831Q12J751k5550j3027J069R902k451j8194R333J8919J841
6294A8123j1749j1563O090k831j093l873j1700Q705j757M235P283o19l782L285
6280a246n932m419n273J1536P253j408P479l969K830L696L898J0927M427l841
6266B5958j3281O125j2426j8929j0199n16o839o818L0450J9686j98o235j2409
6253e631K748L850j0355R852k640k341j1214J0996J4861m141o195j2010q16J798
$$ plain form
6239 -11238 5512 13438 12851 -5021 -4216 -6381 -1224 20276 21244 13021 6989 4215 -10524 -19421
6225 -19421 -12982 -19392 -23141 -24671 -17618 2945 14663 1520 -5265 -9001 -11680 -4563 -7793 738
6211 738 8861 4056 14266 26230 13226 -6466 -19794 -20744 -31434 -17332 -16893 -9824 4240 24943
6197 24943 22314 13601 20169 10521 10281 16182 17094 14073 102 5033 11596 9354 12950 21737 27148
6182 27148 12131 -1926 -3125 11261 9870 -11342 -31358 -26542 -17647 -1619 2503 19132 25124
6169 25124 639 -13987 -140 7054 8555 15091 16519 13171 14267 12978 6506 533 -13287 -4319
6155 -4319 18382 10749 3123 -3650 -19769 -21034 -24859 -25634 -12176 -17398 -27506 -9942 623 -1119
6141 -1119 7381 -3510 -6009 338 -5042 12812 8536 811 11593 11467 16819 21304 -1198 -1467
$$ packed form
6239a1238J6750P926n87j7872Q05k165N157K1500R68q223o032k774j4739q897
6225a9421O439o410l749j530P053K0563J1718j3143o785l736k679P117l230Q531
6211G38Q123m805J0210J1964j3004j9692j3328r50j0690J4102M39P069J4064K0703
6197B4943k629q713O568r648k40N901R12l021j3971M931O563k242L596Q787N411
6182B7148j5017j4057j199J4386j391k1212k0016M816Q895J6028M122J6629N992
6169B5124k4485j4626J3847P194J501O536J428l348J096j289o472n973j3820Q968
6155d319K2701p633p626o773j6119j265l825p75J3458n222j0108J7564J0565j742
6141a119Q500j0891k499O347n380J7854m276p725J0782j26N352M485k2502k69
$$ plain form
6127 -1467 -4594 -889 -17709 -6357 13224 11853 12945 8881 552 -8858 -18964 -27738 -12164 -2479
6113 -2479 567 -2861 -16209 -8804 -3757 -12389 -13226 6232 9102 -2587 -7156 3324 -5043 7294
6099 7294 -4938 2771 7602 6941 -5555 -10057 -7208 -1906 8825 1513 -4348 1637 2511 -4735 458
6084 458 5404 889 -8804 -9466 21052 21449 -10481 -9813 -8360 -5829 820 -20176 -32510 -14461 7107
6069 7107 9057 14026 -1530 -20308 -15834 -5033 10934 23606 28023 28669 22110 6271 -10373
6056 -10373 -15209 -16120 -3020 18774 26295 21242 16049 9639 10969 14655 -6725 -37254 -25762 -2183
6042 -2183 -3469 8030 14519 5039 -22581 -28172 -26331 -31931 -24160 -15380 -19102 -22202 -22280 -14707 -3527
6027 -3527 -10414 2550 -3717 -19982 -15982 -16549 -19904 -6894 13360 17619 25962 34115 42360 44135
$$ packed form
6127a467l127L705j6820J1352J9581j371J092m064q329r410j0106q774J5574R685
6113b479L046l428j3348P405N047q632q37J9458K870j1689m569J0480q367J2337
6099G294j2232P709M831o61j2496m502K849N302J0731p312n861N985Q74p246N193
6084D58M946m515r693o62L0518L97l1930O68J453K531O649k0996j2334J8049K1568
6069G107J950M969j5556j8778M474J0801J5967J2672M417O46o559j5839j6644
6056a0373m836r11J3100K1794P521n053n193o410J330L686k1380l0529J1492K3579
6042b183j286J1499O489r480k7620n591J841n600P771Q780l722l100p8P573J1180
6027c527o887J2964o267j6265M000n67l355J3010K0254M259Q343Q153Q245J775
$$ plain form
6013 44135 27334 -738 -5638 -5390 12644 8866 9195 16788 22965 2113 -2253 11223 26729 19665
5999 19665 3651 -9108 2221 7314 -20108 -20390 976 8851 5686 4406 16640 21716 6796
5986 6796 11 -10471 -9412 6130 5923 -5176 1213 14491 17101 12269 4662 16189 18208 7307
5972 7307 603 -10930 2908 11453 8488 -6140 -6943 -15538 -11596 -14975 -21791 -17207 -18717 -17225
5958 -17225 8627 6400 -11387 -31839 -37644 -19611 -5789 -10013 -8054 -6682 -12398 -994 4348
5945 4348 -1785 -10701 -4327 5356 28589 48969 36289 12846 -6821 -14163 -8840 -7989 -6166 -7236
5931 -7236 7696 -1016 -11008 -2924 -12597 -29193 -26930 -24697 -22494 -27985 -31880 -33728 -43782 -39449
5917 -39449 -9883 12495 20172 23176 30180 21131 19655 20394 2703 -2259 3956 4603 6353 -2355
$$ packed form
6013D4135j6801k8072m900K48J8034l778L29P593O177k0852m366J3476J5506p064
5999A9665j6014j2759J1329N093k7422k82K1366P875l165j280J2234N076j4920
5986F796o785j0482J059J5542k07j1099O389J3278K610m832p607J1527K019j0901
5972G307o704j1533J3838Q545k965j4628q03q595L942l379o816M584j510J492
5958a7225K5852k227j7787k0452n805J8033J3822m224J959J372n716J1404N342
5945D348o133q916O374R683K3233K0380j2680k3443j9667p342N323Q51J823j070
5931g236J4932q712r992Q084r673j6596K263K233K203n491l895j848j0054M333
5917c9449K9566K2378P677L004P004r049j476P39j7691m962O215O47J750q708
$$ plain form
5903 -2355 2574 7874 6301 12607 -3259 -674 4250 -10830 -2794 -4392 -6537 -1047 -2853 -1564
5889 -1564 -1290 8829 9690 19026 32122 47492 35741 14274 5958 -5887 4136 8331 -2801
5876 -2801 -1590 -4715 1602 -6118 -24263 -20108 -5537 6156 18214 10380 -2662 -9507 -5308 -5029
5862 -5029 9978 31669 30223 27632 21653 16670 15029 4237 -18067 -10153 8477 14247 21293 25572
5848 25572 17935 22494 25230 38338 46365 47339 30585 23854 12233 602 13273 27381 16866
5835 16866 13889 16731 -766 8320 13466 9422 3473 6324 6752 7911 18788 12846 18083 14819
5821 14819 19568 30427 19068 1284 -1124 -155 -3210 -2136 -11197 -5077 12064 17231 13293 21404
5807 21404 10855 -14994 -2079 9989 7431 5095 8536 -7206 -14091 -10873 -2290 -10043 -14692
$$ packed form
5903b355M929N300j573O306j5866K585M924j5080Q036j598k145N490j806J289
5889a564K74J0119Q61R336J3096J5370j1751k1467q316j1845J0023M195j1132
5876b801J211l125O317p720j8145M155J4571J1693J2058p834j3042o845M199K79
5862e029J5007K1691j446k591n979m983j641j0792k2304P914J8630N770P046M279
5848B5572p637M559K736J3108Q027R74j6754o731j1621j1631J2671J4108j0515
5835A6866k977K842j7497R086N146m044n949K851M28J159J0877n942N237l264
5821A4819M749J0859j1359j7784k408R69l055J074r061O120J7141N167l938Q111
5807B1404j0549k5849J2915J2068k558k336L441j5742o885L218Q583p753m649
$$ plain form
5794 -14692 -11589 -4018 -1737 4785 9485 10605 7278 11189 7282 -1897 -3585 -2585 2183 5285 34098
5779 34098 43365 31549 18890 16649 21968 18152 19029 -2015 5824 31748 21035 13153 -2044
5766 -2044 7326 8909 4869 17709 10067 2313 -8943 -10107 1370 10724 8351 17194 17836 -7172
5752 -7172 -17754 -9128 -6687 8990 3260 -8990 -12195 -7894 5200 3562 -4412 -25563 -20915 -19227
5738 -19227 -32136 -27217 -25978 -17771 5168 12480 8572 -3878 -5522 -4489 -7564 -3086 -7950 -18372
5724 -18372 -14570 -14391 -574 2791 15507 22969 9252 2611 5848 2253 17908 15609 7912 11495
5710 11495 12886 11048 19498 10513 7385 2085 -11202 -15260 -1997 19845 19447 2327 -18477 -12075
5696 -12075 -15122 -10252 -6081 227 3444 5252 3580 -4266 1561 7033 305 -14209 -2049 924
$$ packed form
5794a4692L103P571K281O522M700J120l327L911l907r179j688J000M768L102K8813
5779C4098R267j1816j2659k241N319l816Q77k1044P839K5924j0713p882j5197
5766b044R370J583m040J2840p642p754j1256j164J1477R354k373Q843O42k5008
5752g172j0582Q626K441J5677n730j2250l205M301J3094j638p974k1151M648J688
5738a9227j2909M919J239Q207K2939P312l908j2450j644J033l075M478m864j0422
5724a8372L802J79J3817L365J2716P462j3717o641L237l595J5655k299p697L583
5710A1495J391j838Q450q985l128n300j3287m058J3263K1842l98j7120k0804O402
5696a2075l047M870M171O308L217J808j672p846N827N472o728j4514J2160K973
$$ plain form
5682 924 577 -4240 -9473 -8350 -5638 -10735 -21054 -28071 -17096 -12375 -6653 -16418 -12539 -12867 -12693
5667 -12693 -21072 -29439 -25707 -9911 -18065 -5913 -8116 -6782 -8669 -3624 -8000 -9912 -8426 -19150
5653 -19150 -23293 -24341 -10164 -8280 -1954 -1913 -13898 -11654 -15701 -18584 -11705 3999 11146 18522
5639 18522 12459 8683 -4439 9015 5553 3297 -4434 -11903 -6545 12974 22848 40387 36101 19434
5625 19434 17429 28904 36518 37598 29411 24254 20287 11971 24472 25074 17871 14102 -22244 -31816
5611 -31816 -33255 -24354 -25897 -2686 155 -5684 -2258 -643 10547 14074 3044 7420 20148 30036
5597 30036 10930 2215 3717 10302 8137 -1786 -8979 -9760 1555 6340 4797 12066 3972 1349
5583 1349 -4452 -2691 -4830 9995 5349 -5602 -13888 13543 23156 25658 13316 20046 12624 727
$$ packed form
5682I24l47m817n233J123K712n097j0319p017J0975M721N722r765L879l28J74
5667a2693q379q367L732J5796q154J2152k203J334j887N045m376j912J486j0724
5653a9150m143j048J4177J884O326M1j1985K244m047k883O879J5704P147P376
5639A8522o063l776j3122J3454l462k256p731p469N358J9519R874J7539m286j6667
5625A9434k005J1475P614J080q187n157l967q316J2501O02p203l769l6346r572
5611c1816j439Q901j543K3211K841n839L426J615J1190L527j1030M376J2728R888
5597C0036j9106q715J502O585k165r923p193p81J1315M785j543P269q094k623
5583A349n801J761k139J4825m646j0951q286K7431R613K502j2342O730p422j1897
$$ plain form
5569 727 -12963 -20772 -8752 2670 -8024 -18977 -17949 -3180 -3150 -17034 -6914 4109 -109
5556 -109 -2287 8299 33048 37497 28817 21456 9407 9181 6805 21865 25080 27760 21246 9427
5542 9427 -8404 -11815 -13288 -16812 -9852 -17621 -10537 12839 19231 3496 -6132 -4115 2992 6511
5528 6511 -429 -11186 -12770 -5329 -5593 -3159 10137 15738 9307 5602 7983 29468 30531 12887
5514 12887 -3946 2101 -528 18060 21399 21345 18611 3065 -2972 -5710 -7436 1389 2879 -3971
5500 -3971 -15931 -19480 -8365 3225 15716 31602 39574 34476 10957 -9580 582 24284 24819
5487 24819 24274 25108 8702 7607 10851 -874 8470 -7378 -1382 3538 3580 12892 2887 7652 7287
5472 7287 -9204 -3768 11067 18409 19443 13099 17064 8802 -5138 1129 3462 3493 6981 7966 16342
$$ packed form
5569G27j3690p809J2020J1422j0694j0953J028J4769L0j3884J0120J1023m218
5556a09k178J0586K4749M449q680p361j2049k26k376J5060L215K680o514j1819
5542I427j7831l411j473l524O960p769P084K3376O392j5735r628K017P107L519
5528F511o940j0757j584P441k64K434J3296N601o431l705K381K1485J063j7644
5514A2887j6833O047k629J8588L339n4k734j5546o037k738j726Q825J490o850
5500c971j1960l549J1115J1590J2491J5886P972n098k3519k0537J0162K3702N35
5487B4819n45Q34j6406j095L244j1725R344j5848N996M920M2R312j0005M765l65
5472G287j6491N436J4835P342J034o344L965q262j3940O267K333L1L488R85Q376
$$ plain form
5457 16342 27347 31284 16977 5079 -400 4585 6537 -10111 -28635 -30617 -32457 -35944 -26827
5444 -26827 -22057 -13269 -13188 -20842 -15350 -3541 -13935 -18104 -8309 -9339 -4463 -1305 5305 3768 -13631
5429 -13631 -15262 -16918 -1837 8322 -1069 -9972 -2843 -2606 -13659 -8263 -16245 -20611 -22391 -22048
5415 -22048 -16959 -13969 -21860 -24706 -14878 5277 8099 -1331 3933 -783 -14051 -11218 -6323 -533
5401 -533 16821 29420 14816 13243 28147 14179 107 -750 -12650 -23218 -28284 -3588 118
5388 118 -1412 5180 15361 18387 6660 -1655 -13649 -23815 -33409 -28752 -29097 -21077 -5552 9375
5374 9375 4087 -11341 -17017 -23130 -18074 -8063 -607 8499 12280 23963 24491 14670 6653 -8017
5360 -8017 -181 6970 -6163 -13582 -7461 -23516 -14685 -19052 -13688 2722 1266 4944 -1130 -2443
$$ packed form
5457A6342J1005L937j4307j1898n479M985J952j6648j8524j982j840l487R117
5444b6827M770Q788Q1p654N492J1809j0394m169R795j030M876L158O610j537j7399
5429a3631j631j656J5081J0159r391q903P129K37j1053N396p982m366j780L43
5415b2048N089K990p891k846R828K0155K822r430N264m716j3268K833M895N790
5401e33J7354J2599j4604j573J4904j3968j4072q57j1900j0568n066K4696L706
5388A18j530O592J0181L026j1727q315j1994j0166r594M657l45Q020J5525J4927
5374I375n288j5428n676o113N056J0011P456R106L781J1683N28r821q017j4670
5360h017P836P151j3133p419O121j6055Q831m367N364J6410j456L678o074j313
$$ plain form
5346 -2443 -4832 6449 11228 22654 14499 4976 -3510 -3226 715 -12715 -23366 -16546 -5355 5267
5332 5267 8289 20924 24697 21304 17736 7070 3593 6938 14567 9080 -3068 -8038 -7623 -8998
5318 -8998 -4119 -14927 -12864 -22323 -32025 -20222 -19716 -14465 11158 7797 -4704 6444 11167 -5137
5304 -5137 -11055 -24444 -12154 -13786 -17782 -13801 -6273 -13780 3952 21816 176 -8114 -563 3251
5290 3251 1894 -18050 -29004 -33147 -30395 -18048 7050 3711 -7059 -17287 -31053 -27306 -16895
5277 -16895 -17545 -12740 -11394 -5190 2020 10922 6730 -1379 -5852 -18003 -22376 -19717 -18905 -7549 -1246
5262 -1246 10538 19324 30665 40414 8187 -28568 -35590 -33201 -19975 -6443 -7318 -4715 -11810 1804
5248 1804 -3210 -8630 -5308 -8493 7554 31692 28422 36893 19924 6651 15127 15536 8218 2993
$$ packed form
5346b443k389J1281M779J1426q155r523q486K84L941j3430j0651O820J1191J0622
5332E267L022J2635L773l393l568j0666l477L345P629n487j2148m970M15j375
5318h998M879j0808K063r459r702J1803N06N251K5623l361j2501J1148M723j6304
5304e137n918j3389J2290j632l996L981P528p507J7732J7864k1640q290P551L814
5290C251j357j9944j0954m143K752J2347K5098l339j0770j0228j3766L747J0411
5277a6895o50M805J346O204P210Q902m192q109m473j2151m373K659Q12J1356O303
5262a246J1784Q786J1341R749l2227l6755p022K389J3226J3532q75K603p095J3614
5248A804n014n420L322l185J6047K4138l270Q471j6969j3273Q476M09p318n225
$$ plain form
5234 2993 14246 21160 15078 -5263 -10268 -4700 -9644 2591 13772 -2437 -2728 -1059 -6678 -6775
5220 -6775 -4712 -7065 -9439 -11940 -18485 -20023 -4834 12246 -9749 -13031 -10731 -13141 -11144 6901
5206 6901 15 -4508 5739 -4904 -11516 -8096 -14913 -38646 -37503 -13401 -11722 -22485 -19113 -4837
5192 -4837 9665 -8461 -22321 -6592 -12493 -13449 -30468 -47279 -53607 -32524 -26524 -41511 -46529
5179 -46529 -39809 -29450 -11530 5156 295 -3548 -22543 -25012 -14298 -11111 -14381 -9045 4716
5166 4716 -6632 -470 -476 -7541 -6062 -13807 8392 7088 -5292 -14325 -10453 -12194 -35642 -27119 -13506
5151 -13506 -18546 -27590 -11459 8230 11944 -5147 -8933 -9914 -18313 -17734 -2397 4630 10187 51
5137 51 -13431 -14230 -9880 -16965 -23408 -13914 -4014 -1602 -2151 -7424 239 2199 -16777 -34240 -28424
$$ packed form
5234B993J1253O914o082k0341n005N568m944J2235J1181j6209k91J669n619r7
5220f775K063k353k374k501o545j538J5189J7080k1995l282K300k410J997J8045
5206F901o886m523J0247j0643o612L420o817k3733J143K4102J679j0763L372J4276
5192d837J4502j8126j3860J5729n901r56j7019j6811o328K1083O000j4987n018
5179d6529O720J0359J7920J6686m861l843j8995k469J0714L187l270N336J3761
5166D716j1348O162op065J479p745K2199j304j2380r033L872j741k3448Q523J3613
5151a3506n040r044J6131J9689L714j7091l786r81q399N79J5337P027N557j0136
5137E1j3482p99M350p085o443R494R900K412n49n273P663J960j8976j7463N816
$$ plain form
5122 -28424 -21638 -5104 5532 15140 5678 -17452 -27112 -35492 -25041 6669 27316 14126 -1234
5109 -1234 -3730 -3764 -13534 -11963 -4372 -2125 6553 -2549 10619 20598 14567 18333 18449 -9742 -10461
5094 -10461 -7815 -2165 13452 8689 11876 -1974 -2112 12177 -480 -5255 3143 -357 11578 10682
5080 10682 17606 11353 23119 36256 32240 21662 22358 18910 25075 29924 8380 -6533 -21360
5067 -21360 -16709 -6580 234 5012 2292 -10180 3878 21735 29302 24003 32400 27232 7284
5054 7284 4996 -9705 -20817 -17104 -2685 5929 13962 21423 27527 32134 2652 -10062 -17438 -18128
5040 -18128 -13340 -11755 -9912 -19912 -24358 -17444 -17529 -9203 4911 18977 33066 20597 1387 6911
5026 6911 5119 -3851 6465 11442 9508 -4744 -776 -5549 -4284 -6386 -26407 -16986 3860 8936
$$ packed form
5122b8424O786J6534J0636R608r462k3130r660q380J0451L1710K0647j3190j5360
5109a234k496l4r770J571P591K247Q678r102J3168R979o031L766J16k8191p19
5094a0461K646N650J5617m763L187j3850j38J4289j2657m775Q398l500J1935q96
5080A0682O924o253J1766J3137m016j0578O96l448O165M849k1544j4913j4827
5067b1360M651J0129O814M778k720j2472J4058J7857P567n299Q397n168j9948
5054G284k288j4701j1112L713J4419Q614Q033P461O104M607k9482j2714p376o90
5040a8128M788J585J843j0000m446O914q5Q326J4114J4066J4089j2469j9210N524
5026F911j792q970J0316M977j934j4252L968m773J265k102k0021R421K0846N076
$$ plain form
5012 8936 14876 17615 7665 -9214 -14693 2717 -51 -6338 -15051 -18991 -17454 -25574 -27867 -25701
4998 -25701 -15290 -7614 -27607 -33453 -24310 -6828 14540 18442 15023 17013 22304 7731 -478
4985 -478 -21016 -21576 -10307 9564 22773 25149 822 -11540 -7511 -9640 -16646 -18284 -13419 -16372
4971 -16372 -12203 1568 2981 3853 27 -1707 5376 8345 5803 4676 1948 -9243 -17463 -25066
4957 -25066 -12136 -5429 -2650 -4364 8601 22763 58526 54663 39894 9642 -4337 708 630
4944 630 4269 11373 2766 -6950 -7578 8030 9879 8564 -7116 -13434 -2384 -4482 -4353 -9781 -8699
4929 -8699 -7306 -60 -4843 -302 5438 7885 16988 7655 5832 21843 28413 20833 11283 4556 -2566
4914 -2566 -2871 -8838 -46533 -31236 -18076 -7573 -882 -3359 -7631 7643 13019 18736 3269 -3952
$$ packed form
5012H936N940K739r950j6879n479J7410k768o287q713l940J537q120k293K166
4998b5701J0411P676j9993n846R143J7482K1368L902l419J990N291j4573q209
4985d78k0538n60J1269J9871J3209K376k4327j2362M029k129p006j638M865k953
4971a6372M169J3771J413Q72l826j734P083K969k542j127k728j1191q220p603
4957b5066J2930O707K779j714J2965J4162L5763l863j4769l0252j3979N045p8
4944F30L639P104q607r716o28J5608J849j315j5680o318J1050k098J29n428J082
4929h699J393P246m783M541N740K447R103r333j823J6011O570p580r550o727p122
4914b566l05n967l7695J5297J3160J0503O691k477m272J5274N376N717j5467p221
$$ plain form
4900 -3952 -13972 -22522 -22133 -21632 -13975 3662 22079 16861 10218 10931 570 -5175 -3742 11895
4886 11895 8480 4821 468 -3330 -10264 -14088 182 3883 9148 24516 27127 17252 14588 16149
4872 16149 40782 36053 23786 25598 17473 12624 6185 5069 5207 -4596 -15573 -19541 -9940 -15260
4858 -15260 -15935 -24846 -30981 -9571 17748 20830 8711 -11549 -5448 -1331 9340 -2075 -8641
4845 -8641 -3311 6560 4004 7332 6860 11204 4956 -11636 -17876 -20699 -15912 -187 5856 655 -2613
4830 -2613 10349 25016 17159 2386 2234 9864 5989 -3090 4617 30971 30290 17249 17983 14268
4816 14268 27852 16741 3789 9992 10523 -12168 -2036 -16014 -2590 17486 25364 9968 494
4803 494 1093 18589 25992 24864 17491 15242 13136 2212 7864 9062 5869 -293 7976 1831 4794
$$ packed form
4900c952j0020q550L89N01P657J7637J8417n218o643P13j0361n745J433J5637
4886A1895l415l659m353l798o934l824J4270L701N265J5368K611r875k664J561
4872A6149K4633m729j2267J812q125m849o439j116J38r803j0977l968R601n320
4858a5260o75q911o135K1410K7319L082j2119k0260O101M117J0671j1415o566
4845h641N330R871k556L328m72M344o248j6592o240k823M787J5725O043n201l268
4830b613J2962J4667p857j4773j52P630l875r079P707K6354o81j3041P34l715
4816A4268J3584j1111j2952O203N31k2691J0132j3978J3424K0076P878j5396r474
4803D94N99J7496P403j128p373k249k106j0924N652J198l193o162Q269o145K963
$$ plain form
4788 4794 -5692 -28838 -41781 -17373 14111 11094 1743 3665 14722 7734 -255 -7232 2866
4775 2866 4928 -6411 -9106 -3366 7197 10720 4705 -13993 -17153 -11974 2312 15294 13996 21611
4761 21611 16086 23718 22275 16526 9241 18192 24862 20310 12101 -912 -16282 -9012 5099 -9677
4747 -9677 -12456 11994 8704 4958 2755 -1304 13271 3050 -18681 -24215 -25145 -25088 -24561 -10549 -21177
4732 -21177 -34748 -25271 -21561 -19498 -3527 4631 8594 -6158 -6085 174 -4051 -13972 -9599 -9644 -19739
4717 -19739 -22499 4939 16689 19607 14324 11421 -369 -2504 -8316 -23364 -28556 -31456 -24357 -22119
4703 -22119 -28890 -26715 -7614 -10249 -14093 -16309 -10041 -7351 -1693 -9225 2492 15991 21010 1903
4689 1903 -23033 -24185 9004 26475 21387 11707 10955 11370 20258 5609 -1551 2535 -6646 9251
$$ packed form
4788D794j0486k3146j2943K4408L1484l017r351J922J1057o988p989o977J0098
4775B866K062j1339k695N740J0563L523o015j8698l160N179J4286J2982j298P615
4761B1611n525P632j443n749p285Q951O670m552q209j3013j5370P270J4111j4776
4747i677k779K4450l290l746k203m059J4575j0221k1731n534r30N7N27J4012j0628
4732b1177j3571R477L710K063J5971Q158L963j4752P3O259m225r921M373m5j0095
4717a9739k760K7438J1750K918n283k903j1790k135n812j5048n192k900P099K238
4703b2119o771K175J9101k635l844k216O268K690N658p532J1717J3499N019j9107
4689A903k4936j152L3189J7471n088r680p52M15Q888j4649p160M086r181J5897
$$ plain form
4675 9251 29443 32846 26122 13667 12721 -2119 -23697 -21559 -20232 -8727 -16818 -22521 -17499 -21501
4661 -21501 -21092 -11823 5791 23865 28358 7635 82 -3823 -10500 -7215 1920 951 1237 8995 18094
4646 18094 18155 21394 22795 16194 18116 30684 46971 30206 -12645 -8486 -8798 -18431 -203 5628
4632 5628 2434 -7114 -9719 -10818 11286 12985 20211 8219 -4744 9239 14014 15206 10408 701
4618 701 2402 11038 13281 4222 -2501 -1735 -5327 -14441 -18531 -9698 -14881 -4719 -369 7801 18303
4603 18303 26352 9223 -177 4041 -3512 -10705 3330 -2362 -2571 8065 7325 1354 622 -396 -3531
4588 -3531 14102 16926 3223 -8594 -20610 -26678 -22808 -2854 6326 20005 6636 745 -7339
4575 -7339 -211 10563 -7251 -23423 -19232 -9945 16066 9960 5707 -13928 -4069 13227 455
$$ packed form
4675I251K0192L403o724j2455r46j4840k1578K138J327J1505q091n703N022m002
4661b1501M09R269J7614J8074M493k0723p553l905o677L285R135r69K86P758R099
4646A8094O1L239J401o601J922J2568J6287j6765m2851M159l12r633J8228N831
4632E628l194r548k605j099K2104J699P226j1992j2963J3983M775J192m798r707
4618G01J701Q636K243r059o723P66l592r114m090Q833n183J0162M350Q170J0502
4603A8303Q049j7129r400M218p553p193J4035n692k09J0636p40n971p32j018l135
4588c531J7633K824j3703j1817j2016o068L870J9954R180J3679j3369n891q084
4575g339P128J0774j7814j6172M191R287K6011o106m253j9635R859J7296j2772
$$ plain form
4562 455 8486 19293 16960 10463 122 9103 10217 -8521 -19023 -22195 -20001 -14535 -24582 -29833
4548 -29833 -26042 -7187 2245 -8148 -7456 168 -713 -10274 -13762 -14088 -30755 -29905 -15059 -5376 14329
4533 14329 23348 7799 -9043 -8227 -3301 -13430 -26208 -18417 -3212 -9294 -2014 972 9780 18153
4519 18153 20083 21850 15933 12431 5749 -21 -3297 -15128 -12605 -7684 729 -2082 -5989 -12716
4505 -12716 -2732 2283 11008 17360 10478 -4617 -6824 -5241 -14428 -14441 -11587 -7046 2126 -2051 9969
4490 9969 6289 -10360 -14211 -2900 4006 655 -3405 -12514 -13288 -6071 -6310 -2450 6968 -4299 -8373
4475 -8373 -11555 -10471 2855 3732 -4134 5870 14927 11956 16087 12689 4758 16691 17816 -3700
4461 -3700 3978 -1439 -17171 -15110 -17879 -12514 8064 -3702 -22730 -14121 1898 13621 20666
$$ packed form
4562D55Q031J0807k333o497j0341Q981J114j8738j0502l172K194N466j0047n251
4548b9833L791J8855R432j0393O92P624q81r561l488l26j6667Q50J4846R683J9705
4533A4329R019j5549j6842Q16M926j0129j2778P791J5205o082P280K986Q808Q373
4519A8153J930J767n917l502o682n770l276j1831K523M921Q413k811l907o727
4505a2716R984N015Q725O352o882j5095k207J583r187j3K854M541R172m177J2020
4490I969l680j6649l851J1311O906l351m060r109p74P217k39L860R418j1267m074
4475h373l182J084J3326Q77p866J0004R057k971M131l398p931J1933J125k1516
4461c700P678n417j5732K061k769N365K0578j1766j9028Q609J6019J1723P045
$$ plain form
4448 20666 15650 -10945 -22655 -26796 -18488 -17047 -11328 -26553 -34971 -25358 -25679 -27678 -8820 -16091
4434 -16091 -750 11486 19230 21280 12804 22786 21015 -4720 -15036 2253 8366 11843 3429
4421 3429 12103 21758 26019 34669 31506 22564 5369 5656 25746 17323 -3350 5347 19465 26126
4407 26126 37237 23930 13638 9208 3431 6546 13135 15373 9268 -12061 -524 13520 25361
4394 25361 21640 25363 19593 4790 -13541 -13913 -17738 -24046 -10945 6050 12404 -4925 -3431 -16098
4380 -16098 -32377 -34145 -735 23487 23289 4207 -6147 6330 10700 -14822 -23742 -2720 1449
4367 1449 -8029 -1228 23968 14037 -3620 -17197 -19014 -2861 11663 -2865 -2734 -16184 -9079
4354 -9079 -5706 -4295 -5018 5808 -1646 7485 6117 7093 5972 -1489 2536 9965 13858 17131 11786
$$ packed form
4448B0666n016k6595j1710m141Q308J441N719j5225q418R613l21j999J8858p271
4434a6091J5341J2236P744K050q476R982j771k5735j0316J7289O113L477q414
4421C429Q674R655M261Q650l163q942j7195K87K0090q423k0673Q697J4118O661
4407B6126J1111j3307j0292m430n777L115O589K238o105k1329J1537J4044J1841
4394B5361l721L723n770j4803j8331l72l825o308J3101J6995O354j7329J494j2667
4380a6098j6279j768L3410K4222j98j9082j0354J2477M370k5522q920K1022M169
4367A449r478O801K5196r931j7657j3577j817J6153J4524j4528J31j3450P105
4354i079L373J411p23J0826p454R131j368R76j121p461M025P429L893L273n345
$$ plain form
4339 11786 9138 17048 2576 8945 16486 18961 8471 3986 -8090 -3117 11464 5653 2740 11267
4325 11267 21868 27956 24393 10366 10781 13001 -6082 -14473 1117 5564 -14272 -11824 -3400 -7434
4311 -7434 -14693 -19597 -14975 2836 -10132 -25856 -25233 -24726 -25888 -27608 -21491 -19595 -19909 -16706 -14903
4296 -14903 -4761 2190 -11051 -24269 -21683 -7768 -5896 5759 10737 9702 14601 39447 33840
4283 33840 13172 9223 16591 31774 28017 11988 -233 -9174 -5446 4433 5392 -157 12052 25517
4269 25517 1183 -27337 -33607 -32341 -28881 -38261 -38468 -31053 -3041 18732 20024 18824 14925 937
4255 937 -11103 -19300 -14658 -10837 -21770 -8688 -15415 -25966 -15684 -14777 -13806 -32595 -48896 -48294
4241 -48294 -35774 -34461 -45992 -44098 -23798 -17436 -8686 9207 12448 5712 9125 -5909 -9282
$$ packed form
4339A1786k648P910j4472O369P541K475j0490m485j2076M973J4581n811k913Q527
4325A1267J0601O088l563j4027M15K220j9083q391J5590M447j9836K448Q424m034
4311g434p259m904M622J7811j2968j5724O23N07j162j720O117J896l14L203J803
4296a4903J0142O951j3241j3218K586J3915J872J1655M978j035M899K4846n607
4283C3840k0668l949P368J5183l757j6029j2221q941L728R879R59n549J2209J3465
4269B5517k4334k8520o270J266L460r380k07P415K8012K1773J292j200l899j3988
4255I37j2040q197M642L821j0933J3082o727j0551J0282R07R71j8789j6301O02
4241d8294J2520J313j1531J894K0300O362Q750J7893L241o736L413j5034l373
$$ plain form
4228 -9282 -691 -4209 4719 -1066 -3754 -4650 3197 12640 29674 15195 -1499 -14008 -11896 -7835
4214 -7835 -7039 -1773 9050 14584 947 5206 16482 30613 28155 35961 20681 1556 10251 35584
4200 35584 26826 -7011 -9136 23386 27164 9574 -5324 -20659 -36430 -23294 -984 6799 -1901
4187 -1901 -6456 -1057 -7152 -6166 -16956 -14333 -1999 752 -15513 -12285 -3852 2379 -2497 -10390
4173 -10390 -6624 10678 32021 30348 19131 -1715 -26075 -11966 3231 5166 2590 -10589 -24195
4160 -24195 -21660 -13805 -29495 -23505 -13696 -9982 -17069 -13053 -9767 -19961 -20524 -10234 12921 10076
4146 10076 -9709 -6033 7016 20299 10578 -2388 -5758 -3378 -15641 -13001 3487 -3207 -10813
4133 -10813 -4604 10313 10509 2480 12081 2654 -4460 -9429 -4335 -5850 -114 1420 7761 20218
$$ packed form
4228i282Q591l518Q928n785k688q96P847R443J7034j4479j6694j2509K112M061
4214g835P96N266J0823N534j3637M259J1276J4131k458P806j5280j9125Q695K5333
4200C5584q758l3837k125L2522L778j7590j4898j5335j5771J3136K2310P783q700
4187a901m555N399o095R86j0790K623J2334K751j6265L228Q433O231m876p893
4173a0390L766J7302K1343j673j1217k0846k4360J4109J5197J935k576j3179j3606
4160b4195K535P855j5690N990R809L714p087M016L286j0194n63J0290K3155k845
4146A0076j9785L676J3049J3283r721j2966l370K380j2263K640J6488o694p606
4133a0813O209J4917J96q029R601r427p114m969N094j515N736J534O341J2457
$$ plain form
4119 20218 24061 22789 27042 42750 44829 3389 -26226 -28890 -878 8892 22024 20164 14346
$$ packed form
4119B0218L843j272M253J5708K079m1440k9615k664K8012R770J3132j860n818
$$ [...]
##END NTUPLES=NMR SPECTRUM
##END=
