##TITLE=Analysis number 313515
Compound Code btb 09904
Book Reference 2
Project Code adrs
Chemist Name stores
##JCAMPDX= 6.0         $$ Bruker NMR JCAMP-DX V2.0
##DATA TYPE= NMR SPECTRUM
##DATA CLASS= NTUPLES
##ORIGIN= Bruker BioSpin GmbH
##OWNER= NMR
$$ XWIN-NMR		Version 3.5
$$ Mon Sep 12 15:59:25 2005 GMT Daylight Time (UT+1h)  MAYBRIDGE\NMR@NMR_250MHZ
##.OBSERVE FREQUENCY= 250.131544655141
##.OBSERVE NUCLEUS= ^1H
##.ACQUISITION MODE= SIMULTANEOUS (DQD)
##.ACQUISITION SCHEME= undefined
##.AVERAGES= 16
##.DIGITISER RES= 18
##SPECTROMETER/DATA SYSTEM= dpx250
##.PULSE SEQUENCE= zg30
##.SOLVENT NAME= CDCl3
##.SHIFT REFERENCE= (INTERNAL, CDCl3, 0, 16.522)
##AUDIT TRAIL= $$ (NUMBER, WHEN, WHO, WHERE, WHAT)
$$ ##TITLE= Audit trail, XWIN-NMR		Version 3.5
$$ ##JCAMPDX= 5.01
$$ ##ORIGIN= Bruker BioSpin GmbH
$$ ##OWNER= NMR
$$ C:\u/data/dgb/nmr/ADRS/9290/pdata/1/auditp.txt
$$ ##AUDIT TRAIL=  $$ (NUMBER, WHEN, WHO, WHERE, WHAT)
(   1,<2005-09-12 15:58:48.30 +100>,<MAYBRIDGE\NMR>,<NMR_250MHZ>,
      <created by zg, POWCHK disabled, PULCHK disabled
       configuration hash MD5:
       62 19 C7 07 E1 42 D1 B7 37 6C 3D D0 77 39 F9 E6
       data hash MD5: 64K
       73 1D E9 E2 FD 6C 21 17 11 32 0C 4F CB F0 47 AA>)
(   2,<2005-09-12 15:59:06.77 +100>,<MAYBRIDGE\NMR>,<NMR_250MHZ>,
      <Start of raw data processing
       ef LB = 0.3 FT_mod = 6 PKNL = 1 SI = 32K 
       data hash MD5: 32K
       35 43 43 66 74 04 67 76 BE 8E 89 8F C9 87 B8 CB>)
(   3,<2005-09-12 15:59:11.64 +100>,<MAYBRIDGE\NMR>,<NMR_250MHZ>,
      <apk 
       data hash MD5: 32K
       FA 7A 9D 0C 88 3A 3E 5A E5 89 CE AB 0D EE BF 87>)
(   4,<2005-09-12 15:59:13.35 +100>,<MAYBRIDGE\NMR>,<NMR_250MHZ>,
      <abs ABSG = 5 
       data hash MD5: 32K
       6D 78 34 2E 0B 24 85 5F BA C1 46 4D 21 5D EE 5B>)
$$ ##END=
$$ 
$$ hash MD5
$$ 9A CD B8 AA 2D E1 9E 95 3F 04 DF 94 23 2F 65 36
##$RELAX= 
##$RELAX= 
##$RELAX= 
##$RELAX= 
##$RELAX= 
##$RELAX= 
##$RELAX= 
$$ Bruker specific parameters
$$ --------------------------
##$DU= <C:\u>
##$EXPNO= 9290
##$NAME= <ADRS>
##$PROCNO= 1
##$TYPE= <nmr>
##$USER= <dgb>
##$AMP= (0..31)
100 100 100 100 100 100 100 100 100 100 100 100 100 100 100 100 100 100 
100 100 100 100 100 100 100 100 100 100 100 100 100 100 
##$AQSEQ= 0
##$AQ_mod= 3
##$AUNM= <au_zg>
##$AUTOPOS= <45 >
##$BF1= 250.13
##$BF2= 250.13
##$BF3= 250.13
##$BF4= 250.13
##$BF5= 500.13
##$BF6= 500.13
##$BF7= 500.13
##$BF8= 500.13
##$BYTORDA= 1
##$CFDGTYP= 0
##$CFRGTYP= 5
##$CHEMSTR= <none>
##$CNST= (0..31)
1 1 145 1 1 1 1 1 1 1 1 1 1 1 1 1 1 1 1 1 1 1 1 1 1 1 1 1 1 1 1 1 
##$CPDPRG= <>
##$CPDPRG1= <>
##$CPDPRG2= <>
##$CPDPRG3= <>
##$CPDPRG4= <mlev>
##$CPDPRG5= <mlev>
##$CPDPRG6= <mlev>
##$CPDPRG7= <mlev>
##$CPDPRG8= <mlev>
##$CPDPRGB= <>
##$CPDPRGT= <>
##$D= (0..31)
0 1 0 0 0 0 0 0 0 0.06 0 0 0 0 0 0 0.0002 0 0 0 0 0 0 0 0 0 0 0 0 0 0 
0 
##$DATE= 1126537127
##$DBL= (0..7)
120 120 120 120 120 120 120 120 
##$DBP= (0..7)
150 150 150 150 150 150 150 150 
##$DBP07= 0
##$DBPNAM0= <>
##$DBPNAM1= <>
$$ [...]
##$SUBNAM7= <"">
##$SUBNAM8= <"">
##$SUBNAM9= <"">
##$SW= 20.6930455092707
##$SWIBOX= (0..15)
0 0 3 0 0 0 0 0 0 0 0 0 0 0 0 0 
##$SW_h= 5175.983436853
##$TD= 65536
##$TD0= 1
##$TE= 295.16
##$TE2= 300
##$TE3= 300
##$TEG= 300
##$TL= (0..7)
0 120 120 120 120 120 120 120 
##$TP= (0..7)
150 150 150 150 150 150 150 150 
##$TP07= 0
##$TPNAME0= <>
##$TPNAME1= <>
##$TPNAME2= <>
##$TPNAME3= <>
##$TPNAME4= <>
##$TPNAME5= <>
##$TPNAME6= <>
##$TPNAME7= <>
##$TPOAL= (0..7)
0.5 0.5 0.5 0.5 0.5 0.5 0.5 0.5 
##$TPOFFS= (0..7)
0 0 0 0 0 0 0 0 
##$TUNHIN= 0
##$TUNHOUT= 0
##$TUNXOUT= 0
##$USERA1= <user>
##$USERA2= <user>
##$USERA3= <user>
##$USERA4= <user>
##$USERA5= <user>
##$V9= 5
##$VALIST= <valist>
##$VCLIST= <CCCCCCCCCCCCCCC>
##$VD= 0
##$VDLIST= <DDDDDDDDDDDDDDD>
##$VPLIST= <PPPPPPPPPPPPPPP>
##$VTLIST= <TTTTTTTTTTTTTTT>
##$WBST= 1024
##$WBSW= 4
##$XGAIN= (0..3)
0 0 0 0 
##$XL= 0
##$YL= 0
##$YMAX_a= 526281
##$YMIN_a= -485923
##$ZGOPTNS= <>
##$ZL1= 120
##$ZL2= 120
##$ZL3= 120
##$ZL4= 120
##$ABSF1= 16.522
##$ABSF2= -4.171173
##$ABSG= 5
##$ABSL= 3
##$ALPHA= 0
##$AQORDER= 0
##$ASSFAC= 0
##$ASSFACI= 0
##$ASSFACX= 0
##$ASSWID= 0
##$AUNMP= <proc_1d>
##$AZFE= 0.1
##$AZFW= 0.1
##$BCFW= 0
##$BC_mod= 0
##$BYTORDP= 0
##$COROFFS= 0
##$CY= 12.5
##$DATMOD= 1
##$DC= 0
##$DFILT= <>
##$DTYPP= 0
##$F1P= 14.0000005364418
##$F2P= -0.99999901652339
##$FCOR= 0.5
##$FTSIZE= 32768
##$FT_mod= 6
##$GAMMA= 0
##$GB= 0
##$INTBC= 1
##$INTSCL= 1
##$ISEN= 128
##$LB= 0.3
##$LEV0= 0
##$LPBIN= 0
##$MAXI= 10000
##$MC2= 0
##$MEAN= 0
##$ME_mod= 0
##$MI= 0
##$NCOEF= 0
##$NC_proc= -4
##$NLEV= 6
##$NOISF1= 0
##$NOISF2= 0
##$NSP= 0
##$NTH_PI= 0
##$NZP= 0
##$OFFSET= 16.522
##$PC= 1
##$PHC0= 128.1598
##$PHC1= 5.715853
##$PH_mod= 1
##$PKNL= yes
##$PPARMOD= 0
##$PSCAL= 4
##$PSIGN= 0
##$REVERSE= no
##$SF= 250.13
##$SI= 32768
##$SIGF1= 0
##$SIGF2= 0
##$SINO= 400
##$SIOLD= 32768
##$SREGLST= <1H.CDCl3>
##$SSB= 0
##$STSI= 32768
##$STSR= 0
##$SW_p= 5175.98343685301
##$SYMM= 0
##$S_DEV= 0
##$TDeff= 65536
##$TDoff= 0
##$TI= <Analysis number 999999
Compound Code 99
Book Reference 9
Project Code 9>
##$TILT= no
##$TM1= 0
##$TM2= 0
##$TOPLEV= 0
##$USERP1= <user>
##$USERP2= <user>
##$USERP3= <user>
##$USERP4= <user>
##$USERP5= <user>
##$WDW= 1
##$XDIM= 32768
##$YMAX_p= 461692672
##$YMIN_p= -97223
$$ End of Bruker specific parameters
$$ ---------------------------------
##NTUPLES= NMR SPECTRUM
##VAR_NAME=  FREQUENCY,     SPECTRUM/REAL,   SPECTRUM/IMAG
##SYMBOL=    X,             R,               I
##VAR_TYPE=  INDEPENDENT,   DEPENDENT,       DEPENDENT
##VAR_FORM=  AFFN,          ASDF,            ASDF
##VAR_DIM=   32768,         32768,           32768
##UNITS=     HZ,            ARBITRARY UNITS, ARBITRARY UNITS
##FACTOR=    0.157963299565203, 1,           1
##FIRST=     4132.6476996994, 0,             0
##LAST=      -1043.33573715361, 0,           0
##MIN=       -1043.33573715361, -97223,      0
##MAX=       4132.6476996994, 461692672,     0
$$ Real data points
##PAGE= N=1
##DATA TABLE= (X++(R..R)), XYDATA
$$ [...]
$$ plain form
13700 -31869 -34105 -32091 -37663 -43547 -47578 -50233 -46793 -35479 -31731 -37331 -41853 -39822 -40900 -39068
13686 -39068 -42501 -44546 -34548 -32129 -29491 -23180 -30803 -35327 -34540 -42223 -50941 -49956 -36189 -31875 -33743
13671 -33743 -36178 -34663 -27200 -33819 -40151 -43417 -45146 -47751 -55480 -56492 -52459 -45578 -47733 -48001 -49189
13656 -49189 -50819 -50867 -45952 -47051 -48431 -40997 -37614 -41412 -38549 -37125 -31325 -29877 -30398 -32056 -36857
13641 -36857 -36240 -38139 -40280 -46265 -47131 -44487 -38854 -45818 -53462 -42835 -40221 -42425 -28198 -19159
13627 -19159 -23011 -33201 -33000 -32616 -37150 -42477 -40178 -49387 -49010 -41841 -43474 -36093 -36170 -38432 -39225 -46853
13611 -46853 -51505 -49927 -43796 -41489 -37817 -40020 -41169 -40193 -42122 -45544 -42641 -43461 -44693 -47956 -54895
13596 -54895 -53161 -53442 -54219 -55295 -47595 -35667 -30294 -25985 -33696 -37574 -44348 -50381 -45656 -39417 -38621
$$ packed form
13700c1869k236K014n572n884m031k655L440J1314L748n600m522K031j078J832
13686c9068l433k045R998K419K638O311p623m524P87p683q718R85J3767M314j868
13671c3743k435J515P463o619o332l266j729k605p729j012M033O881k155k68j188
13656d9189j630m8M915j099j380P434L383l798K863J424N800J448n21j658m801
13641c6857O17j899k141n985q66K644N633o964p644J0627K614k204J4227R039
13627a9159l852j0190K01L84m534n327K299r209L77P169j633P381p7k262p93p628
13611d6853m652J578O131K307L672k203j149R76j929l422K903q20j232l263o939
13596e4895J734k81p77j076P700J1928N373M309p711l878o774o033M725O239P96
$$ plain form
13581 -38621 -30947 -26700 -33242 -34204 -45683 -52826 -57184 -56920 -47108 -31959 -30299 -41583 -45193 -37298
13567 -37298 -29677 -37600 -47536 -48147 -51548 -51237 -50220 -44556 -33537 -25896 -29217 -32821 -36587 -39218 -46322
13552 -46322 -53052 -46121 -42969 -44398 -40277 -46387 -49139 -45151 -40425 -42350 -45373 -46013 -43748 -50270 -53234
13537 -53234 -48605 -33093 -31923 -32877 -38201 -44939 -46724 -41614 -34964 -41237 -43350 -42541 -45290 -39459 -31729
13522 -31729 -29461 -30535 -38819 -37694 -33334 -30086 -31529 -35777 -34261 -30989 -25167 -29498 -37103 -38738
13508 -38738 -37849 -41504 -37552 -31359 -22307 -25770 -33619 -35178 -42541 -37572 -35927 -42451 -47672 -42960 -43262
13493 -43262 -44448 -49948 -53606 -55943 -58037 -50832 -53841 -44833 -38100 -30852 -31811 -31820 -35049 -38170 -47329
13478 -47329 -47673 -42767 -42650 -44476 -47637 -47955 -41658 -42191 -45720 -48400 -52332 -49943 -44124 -45125 -44812 -38907
$$ packed form
13581c8621P674M247o542r62j1479p143m358K64R812J5149J660j1284l610P895
13567c7298P621p923r936o11l401L11J017N664J1019P641l321l604l766k631p104
13552d6322o730O931L152j429M121o110k752L988M726j925l023o40K265o522k964
13537e3234M629J5512J170r54n324o738j785N110O650o273k113Q09k749N831P730
13522c1729K268j074q284J125M360L248j443m248J516L272N822m331p605j635
13508c8738Q89l655L952O193R052l463p849j559p363M969J645o524n221M712l02
13493d3262j186n500l658k337k094P205l009R008O733P248r59rl229l121r159
13478d7329l44M906J17j826l161l18O297n33l529k680l932K389N819j001L13N905
$$ plain form
13462 -38907 -32468 -27744 -24035 -34406 -44420 -39740 -37400 -36541 -50560 -53280 -54027 -46676 -48604 -52504
13448 -52504 -50166 -44984 -40305 -40193 -43295 -39823 -38246 -36998 -43900 -41979 -37913 -33472 -32235 -42607
13434 -42607 -52113 -53314 -53057 -44143 -37257 -30117 -24328 -24529 -30678 -35891 -41722 -42519 -39308 -40317 -42579
13419 -42579 -43280 -41246 -33012 -35721 -43046 -49118 -51769 -36846 -39671 -36373 -37490 -47008 -43938 -30515
13405 -30515 -22987 -23401 -34888 -33350 -36342 -44359 -42011 -41655 -45080 -51346 -47021 -43930 -46302 -49116 -45429
13390 -45429 -43014 -37325 -39037 -43765 -46650 -44268 -46361 -54108 -50646 -45703 -47240 -47157 -46200 -43297 -43379 -46843
13374 -46843 -54877 -62288 -62151 -44791 -41095 -40866 -38861 -49206 -42897 -37022 -38135 -36464 -40717 -47676
13360 -47676 -56139 -53647 -43921 -45894 -45385 -40248 -41940 -51829 -55091 -52479 -51426 -45573 -36081 -47874
$$ packed form
13462c8907O439M724L709j0371j0014M680K340Q59j4019k720p47P351j928l900
13448e2504K338N182M679J12l102L472J577J248o902J921M066M441J237j0372
13434d2607r506j201K57Q914O886P140N789k01o149n213n831p97L211j009k262
13419d2579p01K034Q234k709p325o072k651J4923k825L298j117r518L070J3423
13405c0515P528m14j1487J538k992q017K348L56l425o266M325L091k372k814L687
13390d5429K415N689j712m728k885K382k093p747L462M943j537Q3R57K903q2l464
13374d6843q034p411J37J7360L696K29K005j0345O309N875j113J671m253o959
13360d7676q463K492R726j973N09N137j692r889l262K612J053N853R492j1793
$$ plain form
13346 -47874 -51947 -55699 -51141 -49456 -48662 -41187 -40026 -48327 -49241 -49598 -43687 -42319 -43305 -42548 -43904 -48072
13330 -48072 -47142 -46808 -45486 -43614 -41484 -40694 -41663 -45341 -44431 -39297 -37763 -40571 -40345 -39211 -41354 -35845
13314 -35845 -32802 -32408 -36278 -38573 -41899 -41543 -42043 -42560 -44787 -48923 -51483 -57825 -59501 -55604 -46805
13299 -46805 -49895 -50626 -42264 -40906 -39029 -34943 -40269 -49218 -45913 -42451 -41462 -40065 -45366 -44858 -41291
13284 -41291 -41830 -49188 -55147 -54930 -47262 -42369 -39503 -37543 -40630 -43249 -40979 -45554 -46169 -41166 -43495
13269 -43495 -51482 -56357 -52481 -43632 -42575 -39180 -39770 -46814 -50128 -48404 -40447 -33904 -31290 -36816 -43104
13254 -43104 -40008 -37736 -33389 -30734 -35253 -42470 -42001 -40561 -37599 -42240 -43435 -35798 -30287 -31167 -37666
13239 -37666 -37964 -36215 -39004 -43366 -48503 -51692 -56056 -58986 -50338 -46089 -50993 -48664 -45547 -39288 -35000
$$ packed form
13346d7874m073l752M558J685P94P475J161q301r14l57N911J368r86P57j356m168
13330d8072R30L34J322J872K130P90r69l678R10N134J534k808K26J134k143N509
13314c5845L043L94l870k295l326L56n00n17k227m136k560o342j676L897Q799
13299d6805l090p31Q362J358J877M086n326q949L305L462R89J397n301N08L567
13284d1291n39p358n959K17P668M893K866J960l087k619K270m575o15N003k329
13269d3495p987m875L876Q849J057L395n90p044l314J724P957O543K614n526o288
13254d3104L096K272M347K655m519p217M69J440K962m641j195P637N511q80o499
13239c7666k98J749k789m362n137l189m364k930Q648M249m904K329L117O259M288
$$ plain form
13224 -35000 -45898 -52847 -51920 -42691 -36099 -36536 -47723 -52009 -53977 -48194 -39250 -42520 -53898 -60466
13210 -60466 -48163 -35495 -32102 -32731 -40445 -45383 -45173 -44405 -49451 -55306 -64837 -65571 -60410 -52360 -43648
13195 -43648 -37603 -39229 -43853 -48670 -51069 -47699 -50682 -53189 -52665 -55991 -51338 -45217 -49466 -55407 -52079
13180 -52079 -42713 -32025 -39185 -46856 -45237 -44828 -43876 -47254 -52870 -53530 -51761 -42712 -41410 -39400 -38665
13165 -38665 -42745 -46314 -49880 -49258 -49125 -47072 -46209 -48304 -51650 -52994 -47612 -41500 -39159 -40593 -47732
13150 -47732 -54375 -51299 -45288 -41481 -36630 -32893 -30846 -35717 -39672 -42707 -47401 -46273 -51990 -55181
13136 -55181 -55315 -56962 -49550 -48412 -47340 -44039 -42379 -55069 -70857 -64145 -55727 -59333 -55441 -54019
13122 -54019 -49353 -53000 -58687 -63767 -61274 -56306 -49772 -44077 -45788 -48886 -48602 -41095 -29860 -36600
$$ packed form
13224c5000j0898o949R27R229O592m37j1187m286j968N783Q944l270j1378o568
13210f0466J2303J2668L393o29p714m938K10P68n046n855r531p34N161Q050Q712
13195d3648O045j626m624m817k399L370k983k507N24l326M653O121m249n941L328
13180e2079R366J0688p160p671J619M09R52l378n616o60J769R049J302K010P35
13165c8665m080l569l566O22J33K053Q63k095l346j344N382O112K341j434p139
13150d7732o643L076O011L807M851L737K047m871l955l035m694J128n717l191
13136e5181j34j647P412J138J072L301J660j2690j5788O712Q418l606L892J422
13122e4019M666l647n687n080K493M968O534N695j711l098K84P507J1235o740
$$ plain form
13108 -36600 -47139 -53781 -63015 -68317 -60605 -48291 -48373 -46423 -53990 -64146 -70972 -66686 -63402 -65914
13094 -65914 -68877 -68044 -60474 -44858 -39351 -47415 -45782 -50279 -50171 -47533 -52453 -48101 -44640 -39643 -42882
13079 -42882 -49350 -52563 -48550 -47500 -49270 -49876 -48870 -47623 -51377 -56703 -59231 -52501 -41789 -37946
13065 -37946 -47698 -53393 -53546 -47104 -49422 -53308 -59818 -63657 -58273 -55878 -55562 -54252 -53333 -45754 -42375
13050 -42375 -46201 -52286 -53967 -47307 -49243 -49311 -50746 -52500 -52442 -46453 -39246 -43237 -45199 -43168 -40577
13035 -40577 -41986 -42822 -42574 -43946 -40025 -36942 -36501 -40528 -45572 -41664 -42030 -48103 -53203 -50169 -45039
13020 -45039 -44788 -45487 -50480 -52088 -48002 -46423 -44717 -44871 -45899 -48785 -43366 -40039 -41305 -46107 -38267
13005 -38267 -33399 -33036 -31203 -33547 -32466 -29246 -27286 -35226 -37678 -36588 -42339 -45256 -46272 -50606 -47347
$$ packed form
13108c6600j0539o642r234n302P712J2314q2J950p567j0156o826M286L284k512
13094f5914k963Q33P570J5616N507q064J633m497J08K638m920M352L461M997l239
13079d2882o468l213M013J050j770o06J006J247l754n326k528O730J0712L843
13065c7946r752n695j53O442k318l886o510l839N384K395L16J310R19P579L379
13050d2375l826o085j681O660j936o8j435j754N8N989P207l991j962K031K591
13035d0577j409q36K48j372L921L083M41m027n044L908l66o073n100L034N130
13020d5039K51o99m993j608M086J579J706j54j028k886N419L327j266m802P840
13005c8267M868L63J833k344J081L220J960p940k452J090n751k917j016m334L259
$$ plain form
12990 -47347 -44189 -48392 -45666 -40494 -42642 -41074 -40440 -41256 -37727 -40101 -42046 -43219 -51757 -55036 -52820
12975 -52820 -50325 -48161 -53146 -55470 -57373 -51765 -47398 -47430 -42377 -40867 -40506 -44823 -45276 -44138 -44241 -48998
12959 -48998 -48347 -49314 -49272 -43804 -38665 -46607 -48400 -47963 -51804 -55787 -51386 -49970 -46851 -49916 -53363 -56833
12943 -56833 -60253 -46923 -45409 -50412 -53211 -47871 -42681 -44559 -49593 -50706 -53104 -52703 -40757 -39191
12929 -39191 -37733 -37673 -46947 -56847 -67310 -62311 -57660 -54025 -50150 -48785 -47181 -43913 -36053 -32962 -38574
12914 -38574 -42495 -52051 -53630 -54316 -49968 -38983 -42063 -49446 -42901 -37864 -39934 -43798 -45165 -49845
12900 -49845 -45586 -37748 -41786 -40845 -36423 -40034 -48802 -53922 -48327 -49177 -60282 -66231 -57093 -55912 -59767
12885 -59767 -58268 -55778 -52275 -52355 -53450 -50946 -50757 -52368 -49177 -44578 -46954 -47944 -52790 -57983 -62114
$$ packed form
12990d7347L158m203K726N172k148J568O34q16L529k374j945j173q538l279K216
12975e2820K495K164m985k324j903N608M367l2N053J510L61m317m53J138j03m757
12959d8998O51r67M2N468N139p942j793M37l841l983M401J416L119l065l447l470
12943e6833l420J3330J514n003k799N340N190j878n034j113k398M01J1946J566
12929c9191J458O0r274r900j0463M999M651L635L875J365J604L268P860L091n612
12914c8574l921r556j579o86M348J0985l080p383O545N037k070l864j367m680
12900d9845M259P838m038R41M422l611q768n120N595q50j1105n949R138J181l855
12885e9767J499K490L503q0j095K504J89j611L191M599k376r90m846n193m131
$$ plain form
12870 -62114 -55603 -52436 -52869 -45824 -40231 -34941 -27023 -31452 -36790 -40968 -42942 -47006 -53852 -57900 -50725
12855 -50725 -42499 -44784 -53271 -54256 -63484 -68626 -71035 -65369 -55997 -46454 -37564 -36772 -50100 -59208 -59132
12840 -59132 -49416 -43530 -44907 -49240 -49130 -52716 -54244 -48728 -37962 -37029 -38006 -38582 -39917 -39211 -40052 -42825
12824 -42825 -47429 -49861 -50853 -47658 -45407 -49184 -52886 -57586 -54196 -53148 -58008 -59902 -53478 -51833 -56320
12809 -56320 -52895 -48017 -47670 -52963 -54516 -55087 -59323 -60260 -57937 -52918 -53998 -54516 -51964 -46181 -41684
12794 -41684 -46715 -44630 -46290 -47004 -44166 -47142 -44001 -39652 -34517 -41070 -47598 -50640 -50915 -55078 -62132
12779 -62132 -62479 -58624 -60472 -56942 -55020 -58532 -60481 -58140 -57937 -57933 -61065 -64847 -64322 -59655 -61680 -62317
12763 -62317 -59549 -56414 -55677 -57398 -55914 -45814 -50673 -61033 -63236 -61726 -51819 -53371 -61376 -59766
$$ packed form
12870f2114O511L167m33P045N593N290P918m429n338m178j974m064o846m048P175
12855e0725Q226k285q487r85r228n142k409N666R372R543Q890P92j3328r108P6
12840e9132R716N886j377m333J10l586j528N516J0766R33r77n76j335P06q41k773
12824d2825m604k432r92L195K251l777l702m700L390J048m860j894O424J645m487
12809e6320L425M878L47n293j553n71m236r37K323N019j080n18K552N783M497
12794d1684n031K085j660p14K838k976L141M349N135o553o528l042k75m163p054
12779f2132l47L855j848L530J922l512j949K341K03Ml132l782N25M667k025o37
12763f2317K768L135P37j721J484J0100m859j0360k203J510R907j552q005J610
$$ plain form
12749 -59766 -58202 -56125 -52461 -49494 -50858 -56050 -63103 -62096 -58127 -55297 -55769 -58214 -54090 -55629 -65043
12734 -65043 -65745 -51928 -49265 -54710 -57155 -56610 -54087 -48477 -50740 -55727 -51742 -44730 -48740 -55429 -53632
12719 -53632 -47872 -49706 -55021 -54415 -49883 -49295 -52232 -59154 -60404 -54622 -56773 -56130 -60217 -59318 -54845
12704 -54845 -47085 -41537 -53684 -64177 -68884 -71842 -70495 -60872 -59361 -54382 -46121 -40593 -43367 -44578
12690 -44578 -46139 -56605 -64078 -59861 -56600 -56642 -48950 -51794 -54562 -52663 -50475 -49249 -47503 -49444 -53940
12675 -53940 -60760 -56416 -51723 -50850 -48515 -53598 -55390 -43726 -40737 -49442 -47216 -41476 -40871 -45541 -53174
12660 -53174 -48161 -46709 -43934 -43020 -49796 -51443 -52553 -59099 -49038 -38822 -39956 -43040 -47954 -52747
12646 -52747 -56424 -50678 -52731 -51308 -46264 -44520 -46113 -41741 -36899 -32691 -39110 -43972 -46208 -46900 -47488
$$ packed form
12749e9766J564K077L664K967j364n192p053J007L969K830m72k445M124j539r414
12734f5043p02J3817K663n445k445N45K523N610k263m987L985P012m010o689J797
12719e3632N760j834n315O06M532N88k937o922j250N782k151O43m087Q99M473
12704e4845P760N548j2147j0493m707k958J347R623J511M979Q261N528k774j211
12690d4578j561j0466p473M217L261m2P692k844k768J899K188J226J746j941m496
12675e3940o820M344M693Q73K335n083j792J1664K989q705K226N740O05m670p633
12660e3174N013J452K775R14o776j647j110o546J0061J0216j134l084m914m793
12646e2747l677N746k053J423N044J744j593M372M842M208o419m862k236o92n88
$$ plain form
12631 -47488 -52058 -49251 -50512 -54203 -57194 -57276 -51953 -44098 -36123 -36039 -42501 -49258 -48241 -53004 -52316 -49930
12615 -49930 -49851 -49591 -53873 -58705 -56107 -59291 -59778 -61279 -59400 -58601 -64001 -64783 -67328 -68238 -68103 -73930
12599 -73930 -67347 -57964 -60638 -64832 -64802 -55892 -47997 -47935 -58164 -64102 -64265 -67260 -66534 -59890 -49006
12584 -49006 -37625 -30140 -30473 -29792 -38418 -42504 -44016 -44667 -50567 -58966 -65505 -62167 -59671 -67056 -74430
12569 -74430 -72017 -61161 -53429 -49345 -49260 -47388 -39607 -43804 -46491 -51250 -66359 -70111 -64048 -58284
12555 -58284 -58098 -58998 -62382 -57262 -52526 -39720 -32801 -40329 -46710 -50089 -45497 -40854 -46624 -46060 -40139
12540 -40139 -43995 -48622 -46879 -48772 -48979 -47982 -42819 -45290 -49089 -46158 -44382 -40423 -44058 -47791 -45789
12525 -45789 -42263 -44130 -36316 -36623 -39915 -37347 -38573 -37585 -37772 -34214 -28181 -20959 4772 28372 48987
$$ packed form
12631d7488m570K807j261l691k991q2N323P855P975Q4o462o757J017m763O88K386
12615d9930P9K60m282m832K598l184m87j501J879P99n400p82k545r10J35n827
12599g3930O583R383k674m194L0Q910P895O2j0229n938j63k995P26O644J0884
12584d9006J1381P485l33O81q626m086j512o51n900q399o539L338K496p385p374
12569g4430K413J0856P732M084Q5J872P781m197k687m759j5109l752O063N764
12555e8284J86r00l384N120M736J2806O919p528o381l379M592M643n770N64N921
12540d0139l856m627J743j893k07R97N163k471l799K931J776L959l635l733K002
12525d5789L526j867P814l07l292K568j226R88j87L558O033P222K5731K3600K0615
$$ plain form
12510 48987 66853 79336 70225 69449 66139 51228 38756 28523 12354 -5125 -21582 -23598 -28439
12497 -28439 -35876 -43850 -49856 -46406 -42160 -39097 -39978 -38511 -39033 -44923 -47244 -49774 -46365 -49908 -51180
12482 -51180 -44965 -49633 -49989 -45682 -42312 -36048 -40293 -44851 -46047 -45089 -34363 -21465 -7892 10652
12468 10652 25360 31174 22537 10339 -4830 -18182 -26107 -40559 -56862 -59221 -55814 -50867 -48522
12455 -48522 -48261 -47451 -47603 -49906 -49052 -45412 -56650 -56921 -59527 -60176 -50799 -52906 -53746 -59535 -61972 -64760
12439 -64760 -68744 -67318 -64936 -57471 -52862 -51223 -54979 -55102 -63118 -69002 -69404 -63686 -57129 -53662 -38125
12424 -38125 -30702 -32431 -34869 -40615 -46642 -43446 -47078 -53596 -56849 -52489 -53281 -53931 -49770 -46224 -45728
12409 -45728 -55111 -64380 -64761 -67267 -69718 -70805 -64221 -54375 -53485 -48754 -50414 -47643 -45033 -48829 -49374
$$ packed form
12510D8987J7866J2483r111p76l310j4911j2472j0233j6169j7479j6457k016m841
12497b8439p437p974o006L450M246L063q81J467n22n890k321k530L409l543j272
12482e1180O215m668l56M307L370O264m245m558j196R58J0726J2898J3573J8544
12468A0652J4708N814q637j2198j5169j3352p925j4452j6303k359L407M947K345
12455d8522K61Q10j52k303Q54L640j1238k71k606o49R377k107q40n789k437k788
12439f4760l984J426K382P465M609J639l756j23q016n884m02N718O557L467J5537
12424c8125P423j729k438n746o027L196l632o518l253M360p92o50M161L546M96
12409d5728r383r269l81k506k451j087O584R846Q90M731j660K771K610l796n45
$$ plain form
12394 -49374 -49431 -49393 -47787 -57513 -52655 -50681 -47808 -45391 -49967 -54759 -61507 -61683 -56122 -47688 -47885 -48633
12378 -48633 -43289 -43177 -45383 -41849 -45009 -45594 -50531 -56921 -52061 -48092 -45533 -49446 -61562 -67849 -63231
12363 -63231 -63762 -60105 -54957 -56260 -59778 -61372 -62098 -62483 -64878 -71723 -64270 -56035 -58562 -69984 -67533
12348 -67533 -70864 -73064 -63709 -57788 -51210 -44735 -39023 -44057 -56621 -60057 -63565 -68587 -62547 -66977
12334 -66977 -67572 -62695 -58623 -56461 -55170 -58865 -57119 -60484 -59887 -51198 -48064 -49936 -55796 -54184 -52952
12319 -52952 -60984 -66638 -70139 -67915 -66251 -62410 -62301 -66386 -67009 -59259 -53080 -51097 -53661 -55249 -47565
12304 -47565 -49439 -59867 -54886 -52171 -46084 -49503 -54222 -57436 -57856 -55821 -54285 -51664 -56444 -52847
12290 -52847 -47386 -53482 -51269 -53800 -53128 -54559 -51286 -58200 -61730 -58119 -55824 -53331 -47528 -45191 -45540
$$ packed form
12394d9374n7L8J606r726M858J974K873K417m576m792o748j76N561Q434j97p48
12378d8633N344J12k206L534l160n85m937o390M860L969K559l913j2116o287M618
12363f3231n31L657N148j303l518j594p26l85k395o845P453Q235k527j1422K451
12348f7533l331k200R355N921O578O475N712n034j2564l436l508n022O040m430
12334f6977n95M877M072K162J291l695J746l365N97Q689L134j872n860J612J232
12319e2952q032n654l501K224J664L841J09m085o23P750O179J983k564j588P684
12304d7565j874j0428M981K715O087l419m719l214m20K035J536K621m780L597
12290e2847N461o096K213k531O72j431L273o914l530L611K295K493N803K337l49
$$ plain form
12275 -45540 -42794 -29789 -23885 -12913 -3302 -2847 -5184 -12851 -17072 -22103 -23066 -15541 -710 6940
12261 6940 8035 14947 10287 11541 17601 21476 24572 30276 47340 65257 81028 104222 147686
12248 147686 215186 313625 462637 707271 1045896 1408044 1665175 1712591 1536582 1224049
12238 1224049 889259 628686 442858 306861 213946 145767 97650 71740 54687 33992
12228 33992 17945 9400 2905 -5475 -22360 -29629 -29551 -26697 -26336 -36897 -40506 -32238 -38000 -42844
12214 -42844 -42098 -42601 -38035 -42533 -39615 -38353 -43766 -40199 -37761 -32720 -36115 -45627 -52326 -54188 -46801
12199 -46801 -47490 -55868 -65507 -62974 -61873 -67208 -70064 -61304 -60233 -64496 -60578 -62445 -58593 -52879 -44777
12184 -44777 -47247 -61191 -68160 -64763 -67864 -61663 -53743 -43321 -40622 -47418 -39739 -41984 -43126 -47195
$$ packed form
12275d5540K746J3005N904J0972R611M55k337p667m221n031r63P525J4831P650
12261F940J095O912m660J254O060L875L096N704J7064J7917J5771K3194M3464
12248A47686O7500R8439J49012K44634L38625L62148K57131M7416j76009l12533
12238A224049l34790k60573j85828j35997r2915o8179m8117k5910j7053k0695
12228C3992j6047q545o495q380j6885p269P8K854L61j0561l609Q268n762m844
12214d2844P46n03M566m498K918J262n413L567K438N041l395r512o699j862P387
12199d6801o89q378r639K533J101n335k856Q760J071m263L918j867L852N714Q102
12184d4777k470j3944o969L397l101O201P920J0422K699o796P679k245j142m069
$$ plain form
12170 -47195 -57424 -62640 -64362 -66328 -63239 -57981 -55842 -59913 -61739 -62225 -60855 -57641 -57613 -56552 -59454
12155 -59454 -60351 -59161 -60992 -63608 -65896 -60836 -63267 -64454 -61094 -59051 -54805 -43534 -48678 -55717
12141 -55717 -57965 -55207 -44378 -41535 -50848 -53600 -53583 -45234 -44743 -50321 -53614 -53718 -65972 -75429 -67408
12126 -67408 -64917 -69981 -67909 -65771 -67594 -68496 -64032 -58074 -57563 -61255 -58334 -52892 -53635 -63093 -62298
12111 -62298 -60228 -52713 -54912 -52252 -55435 -53624 -51269 -56000 -64300 -65713 -70331 -67283 -67339 -68900 -64419
12096 -64419 -66603 -68800 -72393 -75063 -72588 -69699 -65451 -63834 -62652 -61042 -61227 -58509 -47793 -48847
12082 -48847 -60168 -62816 -63693 -61176 -61427 -57645 -57690 -57841 -63016 -66961 -70256 -63945 -65653 -69475 -62913
12067 -62913 -61100 -64832 -71536 -71128 -72919 -74198 -70012 -67698 -61450 -53668 -51966 -54383 -56757 -55655 -55841
$$ packed form
12170d7195j0229n216j722j966L089N258K139m071j826m86J370L214K8J061k902
12155e9454q97J190j831k616k288N060k431j187L360K043M246J1271n144p039
12141e5717k248K758J0829K843r313k752J7Q349M91n578l293j04j2254r457Q021
12126f7408K491n064K072K138j823r02M464N958N11l692K921N442p43r458P95
12111f2298K070P515k199K660l183J811K355m731q300j413m618L048n6j561M481
12096f4419k184k197l593k670K475K889M248J617J182J610j85K718J0716j054
12082d8847j1321k648q77K517k51L782m5j51n175l945l295O311j708l822O562
12067f2913J813l732o704M08j791j279M186K314O248P782J702k417k374J102j86
$$ plain form
12052 -55841 -59769 -52540 -48176 -53223 -54710 -66006 -72397 -72710 -66846 -56481 -52546 -48999 -44411 -44887
12038 -44887 -49756 -49435 -53155 -54457 -52378 -58489 -58169 -59301 -66894 -65583 -67531 -66596 -66424 -61564 -64674
12023 -64674 -61362 -54481 -53792 -53380 -46737 -46899 -53787 -60494 -56480 -54788 -54191 -57315 -56267 -53876 -56320
12008 -56320 -64008 -65551 -58885 -65456 -72671 -74562 -70681 -69716 -76404 -81989 -82788 -78688 -78862 -75508 -67148
11993 -67148 -63859 -58003 -56974 -72198 -78574 -74970 -64440 -68972 -65945 -70807 -76608 -73739 -71214 -68304
11979 -68304 -60742 -63302 -71349 -71758 -69847 -70498 -73301 -74732 -73551 -67807 -70095 -69500 -67981 -68555 -70028
11964 -70028 -70563 -71713 -67826 -74778 -74097 -63446 -51515 -40100 -34939 -39145 -44249 -41782 -46776 -54902
11950 -54902 -53149 -58428 -63257 -72654 -72764 -68136 -71669 -72488 -67247 -70545 -72347 -72916 -71266 -75031 -77294
$$ packed form
12052e5841l928P229M364n047j487j1296o391l13N864J0365L935L547M588m76
12038d4887m869L21l720j302K079o111L20j132p593J311j948R35J72M860l110
12023f4674L312O881O89M12O643j62o888o707M014J692N97l124J048K391k444
12008e6320p688j543O666o571p215j891L881R65o688n585p99M100j74L354Q360
11993f7148L289N856J029j5224o376L604J0530m532L027m862n801K869K525K910
11979f8304P562k560q047m09J911o51k803j431J181N744k288N95J519n74j473
11964g0028n35j150L887o952O81J0651J1931J1415N161m206n104K467m994q126
11950e4902J753n279m829r397j10M628l533q19N241l298j802n69J650l765k263
$$ plain form
11935 -77294 -84905 -94057 -92093 -82821 -77321 -64828 -60455 -53566 -49816 -54140 -53252 -55113 -56627 -57252 -53740
11920 -53740 -49793 -51161 -57292 -44621 -33702 -25591 -16894 -11177 -6649 -4692 -9554 -13924 -13061 -19535
11906 -19535 -27527 -28563 -24221 -25245 -27020 -34961 -44721 -47567 -41617 -35311 -39417 -49641 -52042 -52507
11892 -52507 -56818 -56260 -44307 -34394 -31347 -34835 -34502 -23642 -23702 -27156 -35286 -37923 -38920 -40899 -37596
11877 -37596 -31829 -32382 -30241 -30433 -39264 -35496 -34512 -46029 -51309 -45232 -36066 -48270 -54573 -50902 -43799
11862 -43799 -48090 -49362 -47201 -51284 -56066 -60051 -60745 -63591 -61086 -66952 -62881 -61047 -55903 -57907 -61138
11847 -61138 -54894 -44339 -42410 -49663 -52192 -57568 -64473 -62170 -60290 -58994 -61461 -57843 -60276 -62385
11833 -62385 -63163 -70988 -69304 -62235 -57726 -56557 -56997 -57746 -56633 -60659 -70648 -67286 -68163 -63538 -60741
$$ packed form
11935g7294p611r152J964R272N500J2493M373O889L750m324Q88j861j514o25L512
11920e3740L947j368o131J2671J0919Q111Q697N717M528J957m862m370Q63o474
11906a9535p992j036M342j024j775p941r760k846N950O306m106j0224k401m65
11892e2507m311N58J1953R913L047l488L33J0860o0l454q130k637r97j979L303
11877c7596N767n53K141j92q831L768R84j1517n280O077R166j2204o303L671P103
11862d3799m291j272K161m083m782l985o94k846K505n866M071J834N144k004l231
11847f1138O244J0555J929p253k529n376o905K303J880J296k467L618k433k109
11833f2385p78p825J684P069M509J169m40p49J113m026r989L362q77M625K797
$$ plain form
11818 -60741 -56005 -50795 -44040 -41212 -40549 -46209 -53261 -53342 -53415 -55347 -53971 -55976 -54005 -53562 -56298 -55024
11802 -55024 -44833 -42160 -46939 -38550 -24098 -12322 6541 25638 38747 44451 42642 38508 38318
11789 38318 36428 38565 42690 40890 42327 51912 56816 77356 121894 198617 307773 493102 783402
11776 783402 1116520 1371264 1434207 1286808 1011680 736706 531430 413036 378248 412014
11766 412014 501350 618755 738098 812426 796203 694410 544815 403386 285871 198067
11756 198067 143815 101866 74496 77296 84246 86026 87638 96116 108779 102467 95807 79201 56835
11743 56835 37867 18834 7758 1151 2711 6334 17749 24350 25946 26732 33614 35210 41448 50625
11729 50625 64555 78800 93567 108675 108673 96830 91007 87868 101414 137172 184002 230163 258729
$$ packed form
11818f0741M736N210O755K828O63n660p052q1p3j932J376k005J971M43k736J274
11802e5024J0191K673m779Q389J4452J1776J8863J9097J3109N704j809m134j90
11789C8318j890K137M125j800J437R585M904K0540M4538P6723J09156J85329K90300
11776G83402L33118K54744O2943j47399k75128k74974k05276j18394l4788L3766
11766D12014Q9336J17405J19343P4328j6223j01793j49595j41429j17515q7804
11756A98067n4252m1949k7370K800O950J780J612Q478J2663o312o660j6606k2366
11743E6835j8968j9033j1076o607J560L623J1415O601J596P86O882J596O238R177
11729E0625J3930J4245J4767J5108kj1843n823l139J3546L5758M6830M6161K8566
$$ plain form
11716 258729 264238 242235 196758 154638 132694 128451 139122 175059 220698 288471 400315 590016
11704 590016 830743 1047343 1174652 1169598 1031968 820784 617907 454396 352452 272287
11694 272287 213639 167480 128652 97594 77666 69493 60703 49134 32968 12678 3973 -5357
11682 -5357 -16561 -28133 -29415 -27274 -20335 -16227 -15470 -17057 -17552 -15214 -17423 -18224 -26688 -38356 -46476
11667 -46476 -67273 -86132 -96356 -97223 -91260 -92298 -84041 -78458 -72828 -73737 -59999 -46764 -36822 -25903
11653 -25903 -17400 -5885 1361 3823 6993 12818 16058 21459 26229 34066 33181 29074 12660 -4423
11639 -4423 -19347 -28460 -25053 -15668 -15828 -24874 -26245 -24799 -17534 -8522 -1959 -2498 -3074 6534 3995
11624 3995 14976 27206 43898 59354 68985 81661 101695 124829 142011 161874 200104 274778
$$ packed form
11716B58729N509k2003m5477m2120k1944m243J0671L5937M5639O7773J11844J89701
11704E90016K40727K16600J27309n054j37630k11184k02877j63511j01944q0165
11694B72287n8648m6159l8828l1058j9928q173q790j1569j6166k0290q705r330
11682e357j1204j1572j282K141O939M108P57j587m95K338k209q01q464j1668q120
11667d6476k0797j8859j0224q67N963j038Q257N583N630r09J3738J3235R942J0919
11653b5903Q503J1515P246K462L170N825L240N401M770P837q85m107j6414j7083
11639d423j4924r113L407R385j60r046j371J446P265R012O563n39n76R608k539
11624C995J0981J2230J6692J5456R631J2676K0034K3134J7182J9863L8230P4674
$$ plain form
11612 274778 398366 610245 944506 1353671 1700172 1860293 1748740 1432550 1048733 723156
11602 723156 494769 358738 264359 195618 146165 112329 84999 61263 32132 3319 -22375
11591 -22375 -46373 -53998 -47876 -24839 -2924 18051 49396 73653 83565 88076 91549 86454 79064
11578 79064 72367 64246 51068 31345 9604 15872 43868 84593 134077 164834 167970 153356
11566 153356 131180 108430 90934 69853 64731 70760 85253 101540 107502 100071 97719 89805 84560
11553 84560 85879 84033 80117 70490 60328 61477 58173 56811 62353 87231 121765 160741 221099
11540 221099 296657 383588 464125 511462 497161 436479 358472 284791 228823 185502 165466
11529 165466 143760 132654 126684 137930 149855 156851 162252 169822 189898 196394 195291 195659 206723
$$ packed form
11612B74778J23588K11879L34261M09165L46501J60121j11553l16190l83817l25577
11602G23156k28387j36031r4379o8741m9453l3836k7330k3736k9131k8813k5694
11591b2375k3998p625O122K3037K1915K0975L1345K4257R912M511L473n095p390
11578G9064o697q121j3178j9723k1741O268K7996M0725M9484L0757L136j4614
11566A53356k2176k2750j7496k1081n122O029J4493J6287N962p431k352p914n245
11553H4560J319j846l916r627j0162J149l304j362N542K4878L4534L8976O0358
11540B21099P5558Q6931Q0537M7337j4301o0682p8007p3681n5968m3321k0036
11529A65466k1706j1106n970J1246J1925O996N401P570K0076O496j103L68J1064
$$ plain form
11516 206723 232569 250593 269312 287271 300295 309845 336374 364897 401083 438955 465850 470879
11504 470879 473050 477837 503501 553551 610894 671614 730274 785937 852400 930229 1026835 1133255
11492 1133255 1235305 1345862 1458095 1597295 1771402 2006975 2343365 2847068 3644197
11483 3644197 4854908 6412244 8017401 9065516 9249768 8589022 7607233 6772407 6368493
11474 6368493 6413760 6791580 7412701 8214013 9136105 10121009 11137125 12224139 13442079
11465 13442079 14807075 16273563 17804027 19537285 21866608 25434506 31114822 40132173
11457 40132173 54846470 80058651 122771778 185900730 257868719 314323641 332626503
11450 332626503 306262146 249499003 184593137 129884656 91199861 65664404 48832101
$$ packed form
11516B06723K5846J8024J8719J7959J3024R550K6529K8523L6186L7872K6895N029
11504D70879K171M787K5664N0050N7343O0720N8660N5663O6463P7829R6606J06420
11492A133255J02050J10557J12233J39200J74107K35573L36390N03703P97129
11483C644197J210711J557336J605157J048115J84252o60746r81789q34826m03914
11474F368493M5267L77820O21121Q01312R22092R84904J016116J087014J217940
11465A3442079J364996J466488J530464J733258K329323L567898N680316R017351
11457D0132173J4714297K5212181M2713127O3128952P1967989N6454922J8302862
11450C32626503k6364357n6763143o4905866n4708481l8684795k5535457j6832303
$$ plain form
11443 48832101 37385086 29312465 23534778 19381127 16361909 14077582 12176095 10450213
11435 10450213 8864026 7487362 6374947 5518867 4874712 4393873 4013972 3698117 3414514
11426 3414514 3143158 2878518 2626215 2403010 2204970 2019368 1851587 1722118 1633099 1561267
11416 1561267 1494514 1425517 1357504 1299771 1250850 1214226 1202072 1196905 1187499 1189021 1202955 1204139
11404 1204139 1180001 1136827 1073677 994128 916426 836668 760493 702174 653716 604975 582866
11393 582866 564720 553579 539620 522931 514420 506781 495413 479166 456286 433794 414591 403755
11381 403755 390474 376744 364966 367204 375583 372622 358092 343312 341634 331941 315342 293178
11369 293178 267159 246086 231174 209201 186524 176345 175334 175077 178231 183458 179270 174934 176718
$$ packed form
11443D8832101j1447015q072621n777687m153651l019218k284327j901487j725882
11435A0450213j586187j376664j112415q56080o44155m80839l79901l15855k83603
11426C414514k71356k64640k52303k23205j98040j85602j67781j29469q9019p1832
11416A561267o6753o8997o8013n7733m8921l6624j2154n167r406J522J3934J184
11404A204139k4138m3174o3150p9549p7702p9758p6175n8319m8458m8741k2109
11393E82866j8146j1141j3959j6689q511p639j1368j6247k2880k2492j9203j0836
11381D03755j3281j3730j1778K238Q379k961j4530j4780j678r693j6599k2164
11369B93178k6019k1073j4912k1973k2677j0179j011k57L154N227m188m336J784
$$ plain form
11356 176718 169776 165387 160623 155305 145762 139256 133746 138783 146687 142669 134506 131529 124572 134395
11342 134395 139970 150138 162739 170206 162270 154950 149933 129965 102082 85853 82471 114496 161588
11329 161588 214930 259473 286856 298095 288939 271535 256696 237407 210481 181050 150726 133954
11317 133954 133950 150712 163508 185420 203830 223205 234739 234105 226829 231244 235524 236687 231315 233282
11303 233282 242243 253147 277139 314398 392253 525793 754296 1097371 1489946 1789622 1855011
11292 1855011 1662663 1322973 966298 685321 491590 370056 298185 259269 230430 202278
11282 202278 180985 168433 168976 164547 160180 155449 143960 138163 131544 125602 115790 110036 110804 126339
11268 126339 142241 156063 154435 145642 131271 103519 70345 45341 29883 22932 20155 16572
$$ packed form
11356A76718o942m389m764n318r543o506n510N037P904m018q163k977o957R823
11342A34395N575J0168J2601P467p936p320n017j9968k7883j6229l382L2025M7092
11329A61588N3342M4543K7383J1239r156j7404j4839j9289k6926k9431l0324j6772
11317A33954mJ6762J2796K1912J8410J9375J1534o34p276M415M280J163n372J967
11303B33282Q961J0904K3992L7259P7855J33540K28503L43075L92575K99676O5389
11292A855011j92348l39690l56675k80977j93731j21534p1871l8916k8839k8152
11282B02278k1293j2552N43m429m367m731j1489n797o619n942r812n754P68J5535
11268A26339J5902J3822j628q793j4371k7752l3174k5004j5458o951k777l583
$$ plain form
11256 16572 17176 28556 36334 42195 60543 61239 64174 67199 67280 76353 87099 96260 101656 109008 119292
11241 119292 133287 141180 138375 141402 140153 129705 131086 142628 149853 161656 195775 230533 273223
11228 273223 324209 389516 457082 508793 555857 585232 596649 571910 531978 481419 419931
11217 419931 358700 303538 245866 197626 169383 144594 123350 96102 78243 72773 73305 79436
11205 79436 92149 102083 111681 109146 111707 108275 119672 139530 149227 169032 183419 193995 201389
11192 201389 218446 242746 255055 265080 280572 304253 332772 365233 399890 445848 501259
11181 501259 554118 607021 665784 724274 772278 790987 805692 822763 808957 779043 743697
11170 743697 688209 630616 570849 518537 471396 432005 407262 379291 351701 334320 313363
$$ packed form
11256A6572O04J1380P778N861J8348O96K935L025Q1R073J0746R161N396P352J0284
11241A19292J3995P893k805L027j249j0448J381J1542P225J1803L4119L4758M2690
11228B73223N0986O5307O7566N1711M7064K9375J1417k4739l9932n0559o1488
11217D19931o1231n5162n7672m8240k8243k4789k1244k7248j7859n470N32O131
11205G9436J2713R934R598k535K561l432J1397J9858R697J9805J4387J0576P394
11192B01389J7057K4300J2309J0025J5492K3681K8519L2461L4657M5958N5411
11181E01259N2859N2903N8763N8490M8004J8709J4705J7071j3806k9914l5346
11170G43697n5488n7593n9767n2312m7141l9391k4743k7971k7590j7381k0957
$$ plain form
11159 313363 297422 282351 271406 277832 304575 335744 389515 454695 514323 554471 577196 573582
11147 573582 540883 489423 433469 378017 332758 286523 260444 248948 245989 249068 255410 273730
11135 273730 296542 327174 373122 418255 465224 523215 581257 636369 681034 710966 722953
11124 722953 705037 655541 594217 529931 471393 415926 366956 335108 314967 299166 298446 311699
11112 311699 324007 339887 366040 393600 415820 445490 480299 533219 585359 635452 680303
11101 680303 706771 707364 687600 650960 612694 567283 516116 470637 447626 437753 439106 436776
11089 436776 445884 479628 519193 550349 566061 568681 564363 549163 514118 470934 422629 367461
11077 367461 317519 275511 237218 215616 200350 195625 199525 201144 196079 194834 195898 198983 187962
$$ packed form
11159C13363j5941j5071j0945O426K6743L1169N3771O5180N9628M0148K2725l614
11147E73582l2699n1460n5954n5452m5259m6235k6079j1496k959L079O342J8320
11135B73730K2812L0632M5948M5133M6969N7991N8042N5112M4665K9932J1987
11124G22953j7916m9496o1324o4286n8538n5467m8970l1848k0141j5801p20J3253
11112C11699J2308J5880K6153K7560K2220K9670L4809N2920N2140N0093M4851
11101F80303K6468N93j9764l6640l8266m5411n1167m5479k3011r873J353k330
11089D36776R108L3744L9565L1156J5712K620m318j5200l5045m3184m8305n5168
11077C67461m9942m2008l8293k1602j5266m725L900J619n065j245J064L085j1021
$$ plain form
11064 187962 186532 194443 200819 214619 232105 255516 289446 344783 423179 508397 593175 667310
11052 667310 723311 744810 731938 701159 654116 591572 534760 484429 445715 431194 417439
11041 417439 408323 408870 425138 440194 452165 463328 471477 470859 463778 450410 422709 392056 355471
11028 355471 332783 312730 301105 287559 277547 279584 276984 265998 249436 235936 229112 220273
11016 220273 204760 184142 166846 150877 141545 138602 138305 146342 167308 180189 189863 201050 205626
11003 205626 210084 216838 203678 180451 163422 148179 134853 126734 116480 116315 115078 128375 153616
10990 153616 182576 223556 276129 325024 380723 422707 444696 439853 405406 361575 316393 276880
10978 276880 246106 218427 198326 180702 168864 163247 157675 150582 151725 165094 180192 212072
$$ packed form
11064A87962j430P911O376J3800J7486K3411L3930N5337P8396Q5218Q4778P4135
11052F67310N6001K1499j2872l0779m7043o2544n6812n0331l8714j4521j3755
11041D17439r116N47J6268J5056J1971J1163Q149o18p081j3368k7701l0653l6585
11028C55471k2688k0053j1625j3546j0012K037k600j0986j6562j3500o824q839
11016B20273j5513k0618j7296j5969r332k943k97Q037K0966J2881R674J1187M576
11003B05626M458O754j3160k3227j7029j5243j3326q119j0254j65j237J3297K5241
10990A53616K8960M0980N2573M8895N5699M1984K1989m843l4447m3831m5182l9513
10978B76880l0774k7679k0101j7624j1838n617n572p093J143J3369J5098L1880
$$ plain form
10966 212072 294257 427409 561216 540116 418107 321129 254070 217366 203885 199397 200568
10955 200568 207594 205339 202313 197058 194509 194777 203746 219963 231751 245219 253562 245566 244344 244412
10941 244412 239692 233568 225012 222616 222122 221253 216387 221523 219099 224194 225593 228145 227324 233150 230670
10926 230670 219698 215015 214160 217838 218092 223603 228534 227629 227739 238092 242175 254387 265007 266921
10912 266921 270084 284996 300985 314621 322233 328709 331281 326737 315054 306056 304027 312733 329252
10899 329252 342867 366067 382321 393776 412013 428948 445289 459638 469865 482643 495431
10888 495431 516884 531311 539985 550439 562046 572975 580876 585766 599392 607566 611509 623282
10876 623282 641050 666707 702511 729654 768134 810661 854370 892183 938073 995661 1055895
$$ packed form
10966B12072Q2185J33152J33807k1100j22009r6978o7059l6704j3481m488J171
10955B00568P026k255l026n255k549K68Q969J6217J1788J3468Q343p996j222O8
10941B44412m720o124q556k396m94q69m866N136k424N095J399K552q21N826k480
10926B30670j0972m683q55L678K54N511M931r05J10J0353M083J2212J0620J914
10912B66921L163J4912J5989J3636P612O476K572m544j1683q998k029Q706J6519
10899C29252J3615K3200J6254J1455J8237J6935J6341J4349J0227J2778J2788
10888D95431K1453J4427Q674J0454J1607J0929P901M890J3626Q174L943J1773
10876F23282J7768K5657L5804K7143L8480M2527M3709L7813M5890N7588O0234
$$ plain form
10865 1055895 1128048 1223143 1324160 1430703 1548765 1670546 1792678 1921425 2055921 2202983
10855 2202983 2369915 2563372 2797487 3077130 3411227 3814213 4300438 4872320 5521048
10846 5521048 6217016 6934186 7640244 8338307 9032548 9760935 10588673 11635468 13083801
10837 13083801 15221501 18453078 23247053 30009608 38910989 49689291 61688506 73921388
10829 73921388 85170614 94151617 99679031 100990804 97968598 91116585 81438260 70132220
10821 70132220 58412534 47326655 37702760 29976977 24197120 20090867 17266961 15341807
10813 15341807 14044791 13155667 12543206 12128902 11861385 11718008 11683145 11789023 12081539
10804 12081539 12588834 13349859 14413700 15784361 17452761 19394110 21551322 23897916
$$ packed form
10865A055895P2153R5095J01017J06543J18062J21781J22132J28747J34496J47062
10855B202983J66932J93457K34115K79643L34097M02986M86225N71882O48728
10846E521048O95968P17170P06058O98063O94241P28387Q27738J046795J448333
10837A3083801K137700L231577M793975O762555Q901381J0778302J1999215J2232882
10829G3921388J1249226Q981003N527414J311773l022206o852013r678325j1306040
10821G0132220j1719686j1085879r623895p725783n779857m106253k823906j925154
10813A5341807j297016q89124o12461m14304k67517j43377l4863J05878K92516
10804A2081539N07295P61025J063841J370661J668400J941349K157212K346594
$$ plain form
10796 23897916 26434915 29158173 32098486 35342095 39032707 43326591 48385352 54355811
10788 54355811 61433491 69814998 79556577 90460163 102072621 113736118 124665197
10781 124665197 134003511 140857593 144435415 144266366 140367823 133237023 123689367 112698180
10773 112698180 101257702 90289618 80577749 72537085 66195571 61277874 57308633 53816388
10765 53816388 50425358 46847972 42968125 38876674 34731587 30706096 26999546 23795638
10757 23795638 21205433 19245993 17853571 16919600 16318146 15957541 15792923 15751529 15787773
10748 15787773 15852017 15922056 15984057 16071029 16236392 16560313 17200422 18345444 20319105 23562295
10738 23562295 28550522 35603466 44863526 56215354 68902941 81981138 94269522
$$ packed form
10796B3897916K536999K723258K940313L243609L690612M293884N058761N970459
10788E4355811P077680Q381507R741579J0903586J1612458J1663497J0929079
10781A24665197R338314O854082L577822j69049l898543p130800r547656j0991187
10773A12698180j1440478j0968084r711869q040664o341514m917697l969241l492245
10765E3816388l391030l577386l879847m091451m145087m025491l706550l203908
10757B3795638k590205j959440j392422r33971o01454l60605j64618m1394L6244
10748A5787773O4244P0039O2001Q6972J65363L23921O40109J145022J973661L243190
10738B3562295M988227P052944R260060J1351828J2687587J3078197J2288384
$$ plain form
10731 94269522 104382907 111007948 113196302 110638326 103773960 93580275 81298022 68227322
10723 68227322 55559476 44235667 34850777 27554568 22164158 18296621 15528392 13534311
10715 13534311 12050849 10884886 9921718 9095237 8359124 7682817 7084462 6591080 6193477
10706 6193477 5902352 5707456 5571161 5457218 5333229 5156923 4915443 4621135 4273888
10697 4273888 3900010 3530629 3187209 2876440 2619786 2402115 2232186 2100571 1983920
10688 1983920 1887101 1812111 1742790 1682358 1638316 1595619 1544348 1488927 1429936 1387065 1365205
10677 1365205 1346437 1324007 1303035 1277357 1240533 1198584 1154288 1107721 1065094 1022285 985525
10666 985525 950978 923599 910124 912350 927181 964931 1045446 1189247 1414308 1740020 2094704
$$ packed form
10731I4269522J0113385O625041K188354k557976o864366j0193685j2282253j3070700
10723F8227322j2667846j1323809r384890p296209n390410l867537k768229j994081
10715A3534311j483462j165963r63168q26481p36113o76307n98355m93382l97603
10706F193477k91125j94896j36295j13943j23989j76306k41480k94308l47247
10697D273888l73878l69381l43420l10769k56654k17671j69929j31615j16651
10688A983920r6819p4990o9321o0432m4042m2697n1271n5421n8991m2871k1860
10677A365205j8768k2430k0972k5678l6824m1949m4296m6567m2627m2809l6760
10666I85525l4547k7379j3475K226J4831L7750Q0515J43801K25061L25712L54684
$$ plain form
10655 2094704 2368955 2439171 2287450 1979764 1631584 1333048 1121528 972241 866033 787649
10645 787649 733579 691201 663348 646294 628375 608127 584688 558781 540261 519887 501214
10634 501214 482645 462470 443680 426365 412942 396190 384183 377392 366617 366119 377687 384613
10622 384613 385522 386236 399203 405082 419104 428598 434488 432108 429944 430294 415256 399852 387134 387649
10608 387649 394841 406662 416715 416513 421725 415464 408162 403952 388955 378036 379799 380975 373720
10595 373720 370156 372359 379489 384613 383088 378510 378568 376018 362508 350043 334098 321119 308136
10582 308136 290507 282073 276759 270519 260980 258273 260502 264757 256532 246883 244482 242521 244617 254113
10568 254113 265599 301073 360658 413312 410126 364126 308691 270538 247023 235928 216619 206976
$$ packed form
10655B094704K74251P0216j51721l07686l48180k98536k11520j49287j06208p8384
10645G87649n4070m2378k7853j7054j7919k0248k3439k5907j8520k0374j8673
10634E01214j8569k0175j8790j7315j3423j6752j2007o791j0775m98J1568O926
10622C84613R09P14J2967N879J4022R494N890k380k164L50j5038j5404j2718N15
10608C87649P192J1821J0053k02N212o261p302m210j4997j0919J763J176p255
10595C73720l564K203P130N124j525m578N8k550j3510j2465j5945j2979j2983
10582C08136j7629q434n314o240r539k707K229M255q225r649k401j961K096R496
10568B54113J1486L5474N9585N2654l186m6000n5435l8153k3515j1095j9309r643
$$ plain form
10556 206976 195293 194360 199964 205271 210560 208789 216356 229442 239012 251048 263518 284653 300493
10543 300493 298851 296727 288409 266221 239881 226614 218927 207145 199467 203666 211880 229270 250250
10530 250250 275296 301139 331416 366936 394749 401520 413005 411962 409871 408077 420713 442767
10518 442767 492790 588058 722557 893026 1084147 1280511 1482025 1646690 1759480 1811489
10508 1811489 1794824 1694585 1535434 1340698 1132436 930875 740308 587299 478063 404256
10498 404256 355136 323788 308919 306202 314533 344289 358500 362948 349003 330579 322915 315571
10486 315571 312765 296617 266386 239313 219727 194818 174405 161560 153719 144304 135629 130498
10474 130498 133897 143168 153249 148220 142992 149517 159149 161688 163978 160815 148034 137454 130967
$$ packed form
10556B06976j1683r33N604N307N289j771P567J3086R570J2036J2470K1135J5840
10543C00493j642k124q318k2188k6340j3267p687j1782p678M199Q214J7390K0980
10530B50250K5046K5843L0277L5520K7813O771J1485j043k091j794J2636K2054
10518D42767N0023R5268J34499J70469J91121J96364K01514J64665J12790N2009
10508A811489j6665j00239j59151j94736k08262k01561j90567j53009j09236p3807
10498D04256m9120l1348j4869k717Q331K9756J4211M448j3945j8424p664p344
10486C15571k806j6148l0231k7073j9586k4909k0413j2845p841r415q675n131
10474A30498L399R271J0081n029n228O525R632K539K290l163j2781j0580o487
$$ plain form
10461 130967 130413 134560 138721 129618 126650 124575 117207 118355 120526 122490 132262 137076 142980 152341
10447 152341 167548 184126 190224 192767 201230 214759 227711 238912 244628 244804 244085 248976 251465
10434 251465 257897 276583 303121 342479 382616 433618 490606 541670 585683 606359 614078 603073
10422 603073 558361 499385 439545 382261 329868 280592 233071 204898 189293 187961 177391 166195
10410 166195 154378 141873 145728 159202 164252 163094 162411 162355 151291 150368 161626 168155 175316 192021
10396 192021 222321 255735 293280 330891 358367 374813 389922 419281 457747 483564 500879
10385 500879 527080 570461 629279 682457 732069 779921 820636 849491 868774 865998 846171 801765
10373 801765 740779 683580 624578 563196 524432 491788 463667 436580 415494 401597 382726
$$ packed form
10461A30967n54M147M161r103k968k075p368J148K171J964R772M814N904R361
10447A52341J5207J6578O098K543Q463J3529J2952J1201N716J76p19M891K489
10434B51465O432J8686K6538L9358M0137N1002N6988N1064M4013K0676P719j1005
10422F03073m4712n8976n9840n7284n2393m9276m7521k8173j5605j332j0570j1196
10410A66195j1817j2505L855J3474N050j158o83n6j1064r23J1258O529P161J6705
10396A92021L0300L3414L7545L7611K7476J6446J5109K9359L8466K5817J7315
10385E00879K6201M3381N8818N3178M9612M7852M0715K8855J9283k776j9827m4406
10373H01765o0986n7199n9002o1382l8764l2644k8121k7087k1086j3897j8871
$$ plain form
10362 382726 358299 338683 327004 313730 298352 290919 286213 283723 284639 283325 281111 283263 293466
10349 293466 301113 321397 334800 370622 441255 548256 696496 872801 1066724 1259183 1463601
10338 1463601 1674978 1854310 1962409 1989480 1957104 1889995 1805993 1730382 1633824 1506339
10328 1506339 1366731 1229014 1096124 968133 845240 724756 620126 533480 454264 387597
10318 387597 338314 290774 258555 238418 223664 212068 195072 177938 163635 154486 150767 144341
10306 144341 133754 116762 100052 97366 103324 100226 92615 93878 93290 95203 98782 106862 117262
10293 117262 133891 141962 151874 152077 147916 144111 136312 121120 113767 121413 126924 129293 141742 154966
10279 154966 168017 179182 195483 207391 210360 208483 200238 197851 195340 190352 175343 166000 144982
$$ packed form
10362C82726k4427j9616j1679j3274j5378p433m706k490R16j314k214K152J0203
10349B93466P647K0284J3403L5822P0633J07001J48240J76305J93923J92459K04418
10338A463601K11377J79332J08099K7071l2376o7109q4002p5611r6558j27485
10328A506339j39608j37717j32890j27991j22893j20484j04630q6646p9216o6667
10318C87597m9283m7540l2219k0137j4754j1596j6996j7134j4303r149l719o426
10306A44341j0587j6992j6710k686N958l098p611J263n88J913L579Q080J0400
10293A17262J6629Q071R912K03m161l805p799j5192p353P646N511K369J2449J3224
10279A54966J3051J1165J6301J1908K969j877q245k387k511m988j5009r343k1018
$$ plain form
10266 144982 135940 130993 121282 114741 116237 118017 114667 117120 118047 111624 103766 99118 93904 97635
10252 97635 104379 108442 110702 115374 122146 143418 171055 191481 205327 207087 203761 189812 171482
10239 171482 152823 140821 136642 118081 105942 103537 88464 76280 66018 61088 59563 57245
10227 57245 48176 45179 45135 46418 43153 38150 43735 42439 56956 70620 78436 83145 91244 100118
10213 100118 97808 102637 104446 99584 94945 94206 93497 84865 78706 81335 87997 90418 104775 116700
10199 116700 123797 141694 155196 156407 154581 151975 153015 151279 145323 129936 110327 101962 93996
10186 93996 88623 79556 80055 79832 75966 77386 83238 94292 107276 125400 137011 145524 151822 164965
10172 164965 177476 198965 233492 304884 416554 479552 410393 322261 254782 206931 167017
$$ packed form
10266A44982r042m947r711o541J496J780l350K453R27o423p858m648n214L731
10252I7635O744M063K260M672O772K1272K7637K0426J3846J760l326j3949j8330
10239A71482j8659j2002m179j8561j2139k405j5073j2184j0262m930j525k318
10227E7245r069k997m4J283l265n003N585j296J4517J3664P816M709Q099Q874
10213A00118k310M829J809m862m639p39p09q632o159K629O662K421J4357J1925
10199A16700P097J7897J3502J211j826k606J040j736n956j5387j9609q365p966
10186I3996n373r067M99k23l866J420N852J1054J2984J8124J1611Q513O298J3143
10172A64965J2511K1489L4527P1392J11670O2998o9159q8132o7479m7851l9914
$$ plain form
10161 167017 136408 113278 91145 77436 67083 57692 48939 43452 51038 59126 61209 66557 67180
10148 67180 71602 72605 70065 68758 67310 67054 60451 53121 51065 55688 58590 62330 62110 62484 70004
10133 70004 82857 92838 101896 96938 100560 112594 116874 111909 103462 100031 94998 92411 96387 99557
10119 99557 105049 115460 127371 128628 137458 145340 147789 138051 135434 136228 134603 126219 119358 112194
10105 112194 102616 89968 77926 76234 71499 72365 75902 76202 91181 139849 194774 202721 150947
10092 150947 103648 82284 65099 50046 34103 37298 45786 51805 57047 63731 63151 54014 43321
10079 43321 42717 49333 54167 60126 62552 61685 65815 88662 140698 224155 373131 585339 621573
10066 621573 451145 314407 222134 157471 120717 100691 81457 73191 75497 70965 59741 54373
$$ packed form
10161A67017l0609k3130k2133j3709j0353r391q753n487P586Q088K083N348O23
10148F7180M422J003k540j307j448k56o603p330k056M623K902L740k20L74P520
10133G0004J2853R981R058m958L622J2034M280m965q447l431n033k587L976L170
10119I9557N492J0411J1911J257Q830P882K449r738k617P94j625q384o861p164
10105A12194r578j2648j2042j692m735Q66L537L00J4979M8668N4925P947n1774
10092A50947m7299k1364j7185j5053j5943L195Q488O019N242O684n80r137j0693
10079D3321o04O616M834N959K426q67M130K2847N2036Q3457J48976K12208L6234
10066F21573j70428j36738r2273o4663l6754k0026j9234q266K306m532j1224n368
$$ plain form
10054 54373 58132 60605 64912 75616 82138 89293 108843 133112 187297 309682 512221 715618
10042 715618 667891 477791 320929 206146 141537 99613 79318 63555 46293 38630 41913
10031 41913 38174 31693 25202 14565 6926 9223 9438 3489 5326 8568 2367 -3803 -787 1014
10017 1014 -5147 -2629 4189 475 -128 982 6099 11288 13980 16153 22548 30109 39855 61215 106063
10002 106063 147704 145884 105985 73317 54565 46686 33912 23954 24270 13063 7457 616 1679
9989 1679 -1962 -1428 -1925 1794 3319 12173 26977 60942 94114 86329 56488 29602 15596 9191
9975 9191 3770 -4811 -5365 -6975 -7860 -4599 -3011 -149 9342 15041 18220 8883 1555 9085 6796
9960 6796 -441 -1825 -3577 -5473 -1422 -1310 -9074 -8746 -8074 -14787 -14787 -10069 -10025 -16256 -18849 -19249 -16499
$$ packed form
10054E4373L759K473M307J0704O522P155J9550K4269N4185J22385K02539K03397
10042G15618m7727j90100j56862j14783o4609m1924k0295j5763j7262p663L283
10031D1913l739o481o491j0637p639K297K15n949J837L242o201o170L016J801
10017A014o161K518O818l714o03J110N117N189K692K173O395P561R746K1360M4848
10002A06063M1641j820l9899l2668j8752p879j2774r958L16j1207n606o841J063
9989A679l641N34m97L719J525Q854J4804L3965L3172p785k9841k6886j4006o405
9975I191n421q581n54j610q85L261J588K862R491N699L179r337p328P530k289
9960F796p237j384j752j896M051J12p764L28O72o713%M718M4o231k593m00K750
$$ plain form
9943 -16499 -17246 -20916 -22571 -13060 722 5213 -3838 -2091 2452 5555 453 -8992 -12016 -14356 -14093
9928 -14093 -16517 -16593 -9827 -6898 2180 118 -2580 2024 1806 -6464 1261 12940 3929 -1286 -12768
9913 -12768 -12278 -14452 -17845 -17310 -13964 -12099 -11152 -11554 -8728 -12701 -17620 -21438 -24058 -21195 -15018 -7056
9897 -7056 -3143 -3459 -9600 -19987 -23839 -22973 -15986 -14021 -20941 -32133 -32036 -23891 -22151 -26412 -31494
9882 -31494 -30117 -25723 -30744 -24223 -10037 -487 6666 8653 5865 -1907 -9736 -9696 -8502 -5136 -3604
9867 -3604 -5024 -7651 -76 1369 5748 11152 14346 11809 6676 3955 -4367 -12785 -17071 -13738 -8729
9852 -8729 -7848 -3076 6303 8156 10210 9841 8846 14144 14693 8672 7354 13973 20159 24725 43321 66771
9836 66771 115474 209821 316098 368838 310428 227526 157040 95156 60217 39155 24917 12657
$$ packed form
9943a6499p47l670j655R511J3782M491r051J747M543L103n102r445l024k340K63
9928a4093k424p6O766K929R078k062k698M604k18q270P725J1679r011n215j1482
9913a2768M90k174l393N35L346J865R47m02K826l973m919l818k620K863O177P962
9897g056L913l16o141j0387l852Q66O987J965o920j1192R7Q145J740m261n082
9882c1494J377M394n021O521J4186R550P153J987k788p772p829M0J194L366J532
9867c604j420k627P575J445M379N404L194k537n133k721q322q418m286L333N009
9852h729Q81M772R379J853K054l69r95N298N49o021j318O619O186M566J8596K3450
9836F6771M8703R4347J06277N2740n8410q2902p0486o1884l4939k1062j4238j2260
$$ plain form
9824 12657 3970 -5685 -6927 -18802 -21883 -17618 -14145 -1389 -5085 -7122 1214 9445 11950 13210
9810 13210 10972 3210 -1714 -3896 -12207 -14487 -14880 -14897 -17852 -18225 -17627 -12120 -12058 -19336 -16299 -11167
9794 -11167 -14022 -12618 -18272 -24326 -28378 -23818 -18863 -20908 -20015 -25867 -22115 -13771 -7558 67 -3479
9779 -3479 -13421 -14693 -18630 -18683 -15706 -15688 -15592 -10688 -16170 -11431 -5845 -10387 -11621 -1641 3674 2138
9763 2138 7801 3974 15 -1595 -6194 -10784 -9572 -11698 -13531 -9422 -13407 -14586 -8910 -11552 -17464
9748 -17464 -16540 -15440 -18637 -25725 -28817 -22863 -17056 -7566 -11604 -14197 -10284 -7070 -12337 -6150 2120
9733 2120 -1844 -2021 -2862 -4565 -11 -8415 -13098 -11732 141 2607 -1506 -309 -4077 -6711 -3048
9718 -3048 2962 1713 -5777 -7763 1721 1423 -266 1568 -1062 5736 13682 9018 8584 12452 14318
$$ packed form
9824A2657q687r655j242j1875l081M265L473J2756l696k037Q336Q231K505J260
9810A3210k238p762m924k182q311k280l93j7k955l73N98N507O2p278L037N132
9794a1167k855J404n654o054m052M560M955k045Q93n852L752Q344O213P625l546
9779c479r942j272l937n3K977J8R6M904n482M739N586m542j234R980N315j536
9763B138N663l827l959j610m599m590J212k126j833M109l985j179N676k642n912
9748a7464R24J100l197p088l092N954N807R490m038k593L913L214n267O187Q270
9733B120l964j77q41j703M554q404m683J366J1873K466m113J197l768k634L663
9718c048O010j249p490j986R484k98j689J834k630O798P946m664m34L868J866
$$ plain form
9703 14318 14605 11432 9395 3706 572 -500 3311 5332 11480 7252 6353 4004 10813 8641 7937
9688 7937 3199 4074 13826 16901 16582 25035 33058 37769 35889 33751 37450 40277 42515 38033 35939
9673 35939 29496 29987 38642 39922 42368 48871 55042 64777 74564 83647 107344 143918 172274 204142
9659 204142 223301 221707 190185 145250 112817 87932 68844 61276 53712 43201 38164 32514 29758
9646 29758 35423 44426 57223 62839 62930 59050 62832 63257 67846 72211 74262 82258 84653 88799 90069
9631 90069 94924 100205 107208 119485 131993 151566 171036 211937 250337 272886 290867 297320 296711
9618 296711 279709 278062 292005 319578 367721 415399 431471 411679 377071 345484 324727 306907
9606 306907 291204 280372 275408 282556 286462 298514 315282 300625 270538 248081 217139 189349
$$ packed form
9703A4318K87l173k037n689l134j072L811K021O148m228q99k349O809k172p04
9688G937m738Q75R752L075l19Q453Q023M711j880k138L699K827K238m482k094
9673C5939o443M91Q655J280K446O503O171R735R787R083K3697L6574K8356L1868
9659B04142J9159j594l1522m4935l2433k4885j9088p568p564j0511n037n650k756
9646B9758N665R003J2797N616R1l880L782M25M589M365K051P996K395M146J270
9631I0069M855N281P003J2277J2508J9573J9470M0901L8400K2549J7981O453o09
9618B96711j7002j647J3943K7573M8143M7678J6072j9792l4608l1587k0757j7820
9606C06907j5703j0832m964P148L906J2052J6768j4657l0087k2457l0942k7790
$$ plain form
9594 189349 172746 155022 140461 133600 126586 121076 125630 118743 126608 141614 151590 154042 171116
9581 171116 182597 193230 213549 245923 277737 296646 293501 276916 261996 255018 266223 286230
9569 286230 325356 380921 455017 528744 597161 648421 667182 651527 617144 572033 514747 450363
9557 450363 380731 321727 282979 259559 245571 250172 258243 266034 277393 295158 296818 274105
9545 274105 235322 209194 182719 158952 134078 116488 111074 118000 140085 147091 131965 125343
9533 125343 127297 126462 136220 151947 166750 185148 211154 245972 273394 291602 284568 272907 265039
9520 265039 264273 278267 308584 356163 406681 443475 459988 448396 397761 339506 297385 272673
9508 272673 264064 259276 253657 250420 240970 222937 209738 197616 170452 149070 130386 112519 102639
$$ packed form
9594A89349j6603j7724j4561o861p014n510M554o887P865J5006R976K452J7074
9581A71116J1481J0633K0319L2374L1814J8909l145j6585j4920o978J1205K0007
9569B86230L9126N5565P4096P3727O8417N1260J8761j5655l4383m5111n7286o4384
9557D50363o9632n9004l8748k3420j3988M601Q071P791J1359J7765J660k2713
9545B74105l8783k6128k6475k3767k4874j7590n414O926K2085P006j5126o622
9533A25343J954q35R758J5727J4803J8398K6006L4818K7422J8208p034j1661p868
9520B65039p66J3994L0317M7579N0518L6794J6513j1592n0635n8255m2121k4712
9508B72673q609m788n619l237r450j8033j3199j2122k7164k1382j8684j7867r880
$$ plain form
9495 102639 91862 78958 80846 83119 85864 89586 93178 88897 83602 84181 84878 78760 78933 81292 89624
9480 89624 89594 90088 94354 104914 106009 110963 121025 138982 145430 160123 182562 211875 247335 281688
9466 281688 296811 286760 251573 217780 185410 150119 132619 124637 117763 108284 92375 79191
9454 79191 73624 80594 79914 79963 77428 77566 77087 73318 69794 63860 63365 55748 47524 53026 57447 64454
9438 64454 70116 65365 65469 73617 75918 70169 67097 65289 71895 77547 86701 95063 96435 92041 88844
9423 88844 101618 108534 112509 111484 117835 120245 115284 109296 110143 108034 107446 106249 104318 108305 110986
9408 110986 110753 111686 101991 99984 100751 93564 97544 110824 121931 123168 126727 126104 124298 131878 138446
9393 138446 145521 158771 181782 205447 219638 213088 194892 178892 156701 151906 156806 157654 149604
$$ packed form
9495A02639j0777j2904J888K273K745L722L592m281n295N79O97o118J73K359Q332
9480H9624l0M94M266J0560J095M954J0062J7957O448J4693K2439K9313L5460L4353
9466B81688J5123j0051l5187l3793l2370l5291j7500p982o874r479j5909j3184
9454G9191n567O970o80M9k535J38m79l769l524n934m95p617q224N502M421P007
9438F4454N662m751J04Q148K301n749l072j808O606N652R154Q362J372m394l197
9423H8844J2774O916L975j025O351K410m961n988Q47k109n88j197j931L987K681
9408A10986k33R33r695k007P67p187L980J3280J1107J237L559o23j806P580O568
9393A38446P075J3250K3011K3665J4191o550j8196j6000k2191m795M900Q48q050
$$ plain form
9380 149604 151239 151870 150911 153906 163192 162250 165151 165920 163365 169847 181059 185615 186586 191479 190843 195441
9364 195441 200886 198190 208520 223497 235672 237893 236718 241338 254098 272037 275671 282548 288144
9351 288144 280960 278194 276976 286912 310921 331311 350018 366602 374469 375555 369459 367286 368895
9338 368895 380996 383459 383865 378104 366868 359718 358951 375274 395176 414367 426990 435610 441133
9325 441133 445113 461087 466902 464661 450343 440089 427987 414014 407653 405773 413350 433505 451987
9312 451987 472224 500443 539781 570480 591783 617276 632679 647092 662877 688599 722501 771554
9300 771554 822745 869043 892086 891747 897934 916745 939863 989029 1075393 1173372 1268737 1357905
9288 1357905 1448929 1549016 1661246 1779459 1899655 2022921 2153538 2309305 2493476 2722705
$$ packed form
9380A49604J635O31r59K995R286r42K901P69k555O482J1212M556R71M893o36M598
9364A95441N445k696J0330J4977J2175K221j175M620J2760J7939L634O877N596
9351B88144p184k766j218R936K4009K0390J8707J6584P867J086o096k173J609
9338C68895J2101K463M06n761j1236p150p67J6323J9902J9191J2623Q620N523
9325D41133L980J5974N815k241j4318j0254j2102j3973o361j880P577K0155J8482
9312D51987K0237K8219L9338L0699K1303K5493J5403J4413J5785K5722L3902M9053
9300G71554N1191M6298K3043l39O187J8811K3118M9166Q6364R7979R5365Q9168
9288A357905R1024J00087J12230J18213J20196J23266J30617J55767J84171K29229
$$ plain form
9278 2722705 2980700 3273351 3611273 4010875 4528769 5207189 6122992 7477083 9610239
9269 9610239 12944231 17587920 22529862 25617474 26342452 26325386 26018906 24505414 21423772
9260 21423772 17537054 13843524 10905161 8791392 7349851 6395352 5745063 5286274 4963597
9251 4963597 4722524 4543400 4422555 4371702 4381466 4431318 4524330 4675689 4880544 5132322
9241 5132322 5442947 5815205 6274101 6798240 7404900 8132548 9038248 10209629 11762768
9232 11762768 13899280 16949662 21283386 27028340 33666914 39904389 44479395 47047406
9224 47047406 48682632 50603120 54190180 59321615 63647536 64967369 61392341 53598494
9216 53598494 45224618 38861540 35264694 34202432 34752771 35712064 36380556 36592371 36468718
$$ packed form
9278B722705K57995K92651L37922L99602N17894O78420R15803J354091K133156
9269I610239L333992M643689M941942L087612P24978j7066l06480j513492l081642
9260B1423772l886718l693530k938363k113769j441541r54499o50289m58789l22677
9251D963597k41073j79124j20845n0853R764M9852R3012J51359K04855K51778
9241E132322L10625L72258M58896N24139O06660P27648R05700J171381J553139
9232A1762768K136512L050382M333724N744954O638574O237475M575006K568011
9224D7047406J635226J920488L587060N131435M325921J319833l575028p793847
9216E3598494q373876o363078l596846j062262N50339R59293O68492K11815j23653
$$ plain form
9207 36468718 36896399 38940319 41891726 42828790 39558028 33991880 28483901 23755604
9199 23755604 20139555 17512407 15646419 14430559 13807625 13684679 14006862 14734672 15797407
9190 15797407 17037090 18169720 19144520 20353870 22427845 25879220 30859229 37149324
9182 37149324 44140681 49656619 51458830 51004449 50727923 52750475 58410189 68343360
9174 68343360 81322871 93028648 99097972 99221286 96568574 94367692 92996643 90086282
9166 90086282 84224109 77029747 70016367 63041441 55967874 49030938 42519839 36977714
9158 36977714 33018716 31053754 31301588 33696672 37765358 42935975 46950021 45614854
9150 45614854 40066498 33708010 28179042 23705687 20265170 17833310 16241708 15266535
$$ packed form
9207C6468718M27681K043920K951407R37064l270762n566148n507979m728297
9199B3755604l616049k627148j865988j215860o22934j22946L22183P27810J062735
9190A5797407J239683J132630R74800J209350K073975L451375M980009O290095
9182C7149324O991357N515938J802211m54381k76526K022552N659714R933171
9174F8343360J2979511J1705777O069324J23314k652712k200882j371049k910361
9166I0086282n862173p194362p013380o974926p073567o936936o511099n542125
9158C6977714l958998j964962K47834K395084M068686N170617M014046j335167
9150D5614854n548356o358488n528968m473355l440517k431860j591602r75173
$$ plain form
9142 15266535 14782633 14734946 15072183 15830531 17177180 19349492 22554940 26499823 30203448
9133 30203448 33765711 38769804 45291754 51366316 55850552 59347209 60980878 60425184
9125 60425184 59319612 60152934 63800018 68318187 71621171 73107833 71066750 64579936
9117 64579936 56290505 49774760 46595590 45521935 43471087 39540109 35992083 33935950
9109 33935950 32740113 32076161 32305482 32340926 30027806 25979094 21723237 17883261 14766970
9100 14766970 12314778 10397892 8961500 7915393 7187479 6685313 6329931 6083164 5917854
9091 5917854 5816612 5779472 5817709 5925621 6116647 6395919 6744652 7185781 7766737 8535809
9081 8535809 9564099 11013836 13233443 16777295 22254995 29778640 37537165 42148560
$$ packed form
9142A5266535m83902m7687L37237P58348J346649K172312L205448L944883L703625
9133C0203448L562263N004093O521950O074562M484236L496657J633669n55694
9125F0425184j105572Q33322L647084M518169L302984J486662k041083o486814
9117F4579936q289431o515745l179170j073655k050848l930978l548026k056133
9109C3935950j195837o63952K29321L5444k313120m048712m255857l839976l116291
9100A4766970k452192j916886j436392j046107p27914n02166l55382k46767j65310
9091E917854j01242l7140L8237J07912J91026K79272L48733M41129N80956P69072
9081H535809J028290J449737K219607L543852N477700P523645P758525M611395
$$ plain form
9073 42148560 43650667 44182518 42589872 37131825 29736994 23030737 17820317 14019880
9065 14019880 11325459 9402147 7997116 6927256 6086446 5385015 4777057 4237521 3765106
9056 3765106 3353093 3009921 2733741 2520841 2350631 2222541 2110103 1998487 1873653 1758878
9046 1758878 1649101 1552063 1462226 1384044 1328007 1277497 1225970 1174585 1130721 1092842 1063249
9035 1063249 1036770 1008563 973494 952990 944025 933537 935521 958532 986967 1020542 1041885 1034069
9023 1034069 1007577 967965 929273 901495 882538 861548 845950 831557 822221 816712 813520 810714
9011 810714 796847 790263 785702 775093 772807 783839 818346 852522 873964 896922 921293 926494
8999 926494 904779 868727 820876 772626 733845 714681 709785 711088 707758 690212 676065 672763
$$ packed form
9073D2148560J502107N31851j592646n458047p394831o706257n210420l800437
9065A4019880k694421j923312j405031j069860q40810p01431o07958n39536m72415
9056C765106m12013l43172k76180k12900j70210j28090j12438j11616j24834j14775
9046A758878j09777r7038q9837p8182n6037n0510n1527n1385m3864l7879k9593
9035A063249k6479k8207l5069k0504q965j0488J984K3011K8435L3575K1343p816
9023A034069k6492l9612l8692k7778j8957k0990j5598j4393r336n509l192k806
9011H10714j3867o584m561j0609k286J1032L4507L4176K1442K2958K4371N201
8999I26494k1715l6052m7851m8250l8781j9164m896J303l330j7546j4147l302
$$ plain form
8987 672763 685110 718904 758982 803476 858573 898091 920129 927549 933430 936833 931228 905911
8975 905911 862643 829408 802906 772958 746923 727553 696851 667430 642215 633981 618943 613950
8963 613950 619630 627384 641772 661984 683492 707294 747671 817399 894513 971163 1053785 1117040
8951 1117040 1123724 1082860 1021029 947203 886953 847865 832644 837230 863953 898840 937861 980703
8939 980703 1031813 1091732 1164090 1233043 1268813 1287087 1296231 1301513 1319002 1319217 1295879 1292314 1316406
8926 1316406 1348192 1395951 1442782 1499173 1557205 1603574 1660723 1747418 1854240 1979575 2130520
8915 2130520 2304801 2496962 2709436 2971593 3355033 3934212 4829241 6240922 8478584
8906 8478584 11934005 16713739 21746705 24370269 22945718 18989254 14754966 11301664
$$ packed form
8987F72763J2347L3794M0078M4494N5097L9518K2038P420N881L403n605k5317
8975I05911m3268l3235k6502k9948k6035j9370l0702k9421k5215q234j5038m993
8963F13950N680P754J4388K0212K1508K3802M0377O9728P7114P6650Q2622O3255
8951A117040O684m0864o1831p3826o0250l9088j5221M586K6723L4887L9021M2842
8939I80703N1110N9919P2358O8953L5770J8274R144N282J7489K15k3338l565K4092
8926A316406L1786M7759M6831N6391N8032M6369N7149Q6695J06822J25335J50945
8915B130520J74281J92161K12474K62157L83440N79179Q95029J411681K237662
8906H478584L455421M779734N032966K623564j424551l956464m234288l453302
$$ plain form
8898 11301664 8793864 7081650 5939969 5197114 4712564 4401177 4194544 4027967 3889457
8889 3889457 3786612 3720934 3711550 3759656 3853597 3968342 4100112 4281874 4539987 4886823
8879 4886823 5312376 5837003 6523342 7459793 8581934 9661577 10438495 10928820 11394609
8870 11394609 12042434 12862107 13784601 14895644 16548498 19119332 22861027 27927350 34257993
8861 34257993 41471363 49104511 56231026 61386759 63504650 63039454 60565573 55109296
8853 55109296 47059069 38986512 32812135 28786857 26341482 24806200 23314649 21313270
8845 21313270 18968973 16615918 14506773 12816062 11580959 10762487 10301816 10138672 10208124
8836 10208124 10486284 10938578 11596017 12563485 13873175 15307608 16687163 18240290 20341553
$$ packed form
8898A1301664k507800j712214j141681p42855m84550l11387k06633j66577j38510
8889C889457j02845o5678r384M8106R3941J14745J31770J81762K58113L46836
8879D886823M25553N24627O86339R36451J122141J079643P76918M90325M65789
8870A1394609O47825Q19673R22494J111043J652854K570834L741695N066323O330643
8861C4257993P213370P633148P126515N155733K117891m65196k473881n456277
8853E5109296q050227q072557o174377m025278k445375j535282j491551k001379
8845B1313270k344297k353055k109145j690711j235103q18472m60671j63144O9452
8836A0208124K78160M52294O57439R67468J309690J434433J379555J553127K101263
$$ plain form
8827 20341553 23117026 25916360 27850425 28894921 29810273 31518171 34273908 38065919
8819 38065919 42630820 47962645 54369228 61733459 69428533 76493305 81387857 83291061
8811 83291061 83144439 82515132 82505849 83249415 82736884 79077086 73838145 69885102 67224605
8802 67224605 62696971 55468391 48014226 41687902 36484134 31593498 26711098 22631476
8794 22631476 19624208 17506519 16076276 15168264 14647557 14468481 14668169 15229846 16110266
8785 16110266 17184400 18371194 19717826 21459054 23908169 26933368 29706576 31384631
8777 31384631 32201900 33380295 35646510 38821670 42507863 46244659 50233969 54697337
8769 54697337 59031671 62503381 65089657 67443806 70160269 73764006 78238757 82209378
$$ packed form
8827B0341553K775473K799334J934065J044496R15352J707898K755737L792011
8819C8065919M564901N331825O406583P364231P695074P064772M894552J903204
8811H3291061j46622o29307r283P43566n12531l659798n238941l953043k660497
8802F7224605m527634p228580p454165o326324n203768m890636m882400m079622
8794B2631476l007268k117689j430243r08012n20707j79076J99688N61677Q80420
8785A6110266J074134J186794J346632J741228K449115L025199K773208J678055
8777C1384631Q17269J178395K266215L175160L686193L736796L989310M463368
8769E4697337M334334L471710K586276K354149K716463L603737M474751L970621
$$ plain form
8761 82209378 84777724 85882468 85472145 82881968 77368781 68554054 58292418 49387094
8753 49387094 42716026 37445592 32595934 27616796 22967287 19204726 16382582 14307738
8745 14307738 12796480 11709210 10928190 10356726 9940102 9721739 9748768 10064653 10700750
8736 10700750 11659608 12915542 14178964 14955242 15328998 15826188 16566442 17343395 18066682
8727 18066682 18921036 20264094 22186122 24428222 26584297 28662817 31318798 35399741
8719 35399741 41123560 47581140 52816228 55435231 56044890 55173718 52301023 46827870
8711 46827870 39818621 33135376 27898847 24019024 20796625 17729507 14907625 12593056
8703 12593056 10735750 9256134 8093140 7164685 6381268 5729754 5222382 4845838 4568704
$$ packed form
8761H2209378K568346J104744m10323k590177n513187q814727j0261636q905324
8753D9387094o671068n270434m849658m979138m649509l762561k822144k074844
8745A4307738j511258j087270p81020n71464m16624k18363K7029L15885O36097
8736A0700750R58858J255934J263422P76278L73756M97190P40254P76953P23287
8727A8066682Q54354J343058J922028K242100K156075K078520K655981M080943
8719C5399741N723819O457580N235088K619003O09659q71172k872695n473153
8711D6827870p009249o683245n236529l879823l222399l067118k821882k314569
8703A2593056j857306j479616j162994r28455p83417o51514n07372l76544k77134
$$ plain form
8694 4568704 4345116 4149138 3993889 3880407 3806527 3774803 3791744 3864922 3981106 4076615
8684 4076615 4126644 4164714 4243024 4376727 4592890 4933841 5471387 6313899 7609120 9584052
8674 9584052 12435940 16104600 19976145 22800702 23189016 21044796 17500277 13796588
8666 13796588 10699229 8367652 6690076 5510035 4677146 4086592 3635108 3267507 2970976
8657 2970976 2738274 2568660 2435622 2311719 2222454 2170033 2118409 2069528 2036925 2021334 1977581
8646 1977581 1870583 1752127 1648157 1561356 1464519 1373395 1293446 1220540 1164497 1122594 1092931
8635 1092931 1074809 1068764 1057300 1037623 1014095 997492 994510 993198 1001849 995553 982310 965834
8623 965834 953479 954944 970274 971282 956233 939164 924770 914332 913975 925330 930991 918267 906096
$$ packed form
8694D568704k23588j95978j55249j13482p3880l1724J6941P3178J16184R5509
8684D076615N0029L8070P8310J33703K16163L40951N37546Q42512J295221J974932
8674I584052K851888L668660L871545K824557L88314k144220l544519l703689
8666A3796588l097359k331577j677576j180041q32889n90554m51484l67601k96531
8657B970976k32702j69614j33038j23903q9265n2421n1624m8881l2603j5591m3753
8646A977581j06998j18456j03970q6801r6837r1124p9949p2906n6043m1903k9663
8635A092931j8122o045j1464j9677k3528j6603k982j312Q651o296j3243j6476
8623I65834j2355J465J5330J008j5049j7069j4394j0438l57J1355N661j2724j2171
$$ plain form
8610 906096 902285 906712 923714 960914 1037449 1137283 1202196 1192980 1139805 1098131 1088481 1094620 1084350
8597 1084350 1030060 962851 912623 852431 799720 759937 728597 714210 712142 707829 701259 711206
8585 711206 732734 740312 730164 717935 704030 695964 701875 723568 746802 776265 811948 839989
8573 839989 864929 874961 882893 889272 898130 934446 1010877 1127239 1242138 1292886 1293419 1315098
8561 1315098 1390066 1519699 1641434 1700637 1700330 1637831 1549189 1463501 1380667 1269294 1145337
8550 1145337 1035331 938823 849480 772543 720375 684267 653071 631854 616115 610308 609535 608267
8538 608267 616523 634424 658172 679044 688167 702313 719392 724300 714322 698613 684596 686727 688212
8525 688212 697315 720742 762734 860600 1034573 1283835 1590684 1876176 2087988 2156752 2103332
$$ packed form
8610I06096l811M427J7002L7200P6535R9834O4913r216n3175m1674r650O139j0270
8597A084350n4290o7209n0228o0192n2711l9783l1340j4387k068m313o570R947
8585G11206K1528P578j0148j2229j3905q066N911K1693K3234K9463L5683K8041
8573H39989K4940J0032P932O379Q858L6316P6431J16362J14899N0748N33K1679
8561A315098P4968J29633J21735N9203l07o2499q8642q5688q2834j11373j23957
8550A145337j10006r6508q9343p6937n2168l6108l1196k1217j5739n807p73j268
8538F08267Q256J7901K3748K0872R123J4146J7079M908r978j5709j4017K131J485
8525F88212R103K3427M1992R7866J73973K49262L06849K85492K11812O8764n3420
$$ plain form
8514 2103332 2003913 1883421 1746171 1576921 1409287 1263801 1142113 1027825 942328 870258
8504 870258 810052 751408 705300 664929 637102 616881 594124 568191 549683 538135 530624 525227
8492 525227 520188 511885 511810 511914 510505 506250 504370 498896 492715 494467 518522 540004 571190 607474
8478 607474 642972 680640 705037 716777 718765 734877 774177 835477 897023 935694 932525 878938
8466 878938 804314 737737 691934 676027 682769 710756 745628 762339 748123 706787 644764 581435
8454 581435 534709 493289 465832 447501 429407 424371 420798 417556 428877 437374 451558 495917
8442 495917 554783 632571 687260 685861 638354 584987 538464 507518 492576 473240 466160 471079
8430 471079 484708 508407 537826 556535 570586 579907 591119 605641 603865 595353 593656 607764
$$ packed form
8514B103332r9419j20492j37250j69250j67634j45486j21688j14288q5497p2070
8504H70258o0206n8644m6108m0371k7827k0221k2757k5933j8508j1548p511n397
8492E25227n039q303p5J04j409m255j880n474o181J752K4055K1482L1186L6284
8478F07474L5498L7668K4397J1740J988J6112L9300O1300O1546L8671l169n3587
8466H78938p4624o6577m5803j5907O742K7987L4872J6711j4216m1336o2023o3329
8454E81435m6726m1420k7457j8331j8094n036l573l242J1321Q497J4184M4359
8442D95917N8866P7788N4689j399m7507n3367m6523l0946j4942j9336p080M919
8430D71079J3629K3699K9419J8709J4051R321J1212J4522j776q512j697J4108
$$ plain form
8418 607764 637169 659960 681629 701642 708407 709593 702883 685215 666556 642700 607879 573410
8406 573410 552482 530443 504488 489816 479183 480739 490384 501983 519812 556177 613524 723794
8394 723794 875663 981838 982192 888694 767570 663345 589733 537780 499700 470616 452937
8383 452937 455365 476356 512889 547578 572840 597006 621740 648823 656556 665388 680711 703510
8371 703510 733167 761730 793036 810771 818549 816460 798359 773830 741479 716868 673813 626789
8359 626789 580775 530297 485989 454559 431175 420463 412594 409615 422918 446831 483975 526290
8347 526290 581003 636949 647230 604567 543208 478444 441941 418127 402511 383721 376562 372490
8335 372490 362717 361902 371077 395293 426329 461764 486683 499521 517707 535717 552355 572415
$$ packed form
8418F07764K9405K2791K1669K0013O765J186o710j7668j8659k3856l4821l4469
8406E73410k0928k2039k5955j4672j0633J556R645J1599J7829L6365N7347J10270
8394G23794J51869J06175L54r3498j21124j04225p3612n1953l8080k9084j7679
8383D52937K428K0991L6533L4689K5262K4166K4734K7083P733Q832J5323K2799
8371G03510K9657K8563L1306J7735P778k089j8101k4529l2351k4611m3055m7024
8359F26789m6014n0478m4308l1430k3384j0712p869k979J3303K3913L7144M2315
8347E26290N4713N5946J0281m2663o1359o4764l6503k3814j5616j8790p159m072
8335C72490r773q15R175K4216L1036L5435K4919J2838J8186J8010J6638K0060
$$ plain form
8323 572415 593364 634396 682190 719162 746459 738589 696596 637867 575574 498865 426039 355705
8311 355705 292470 249887 217570 204670 215963 245477 278135 305223 323544 345218 357695 360646
8299 360646 355138 350989 342508 337642 329663 327008 327530 330278 346048 375784 405430 432802 462959
8286 462959 488814 496579 491523 483401 480885 481484 485897 490186 491603 496184 494034 481268 457791 442648
8272 442648 427385 416486 404082 386280 362652 326834 292922 273759 256307 254854 274346 307911
8260 307911 354278 409296 472212 520173 546939 556564 560380 565202 573871 576698 567356 555180 525671
8247 525671 508226 520335 562515 622300 683641 738786 770135 771218 766067 758974 754751 757857 766786
8234 766786 789721 815005 844652 873678 900829 927449 948287 973821 1000551 1031487 1061447 1076618
$$ packed form
8323E72415K0949M1032M7794L6972K7297p870m1993n8729o2293p6709p2826p0334
8311C55705o3235m2583l2317j2900J1293K9514L2658K7088J8321K1674J2477K951
8299C60646n508m149q481m866p979k655N22K748J5770K9736K9646K7372L0157
8286D62959K5855P765n056q122k516N99M413M289J417M581k150j2766k3477j5143
8272D42648j5263j0899j2404j7802k3628l5818l3912j9163j7452j453J9492L3565
8260C07911M6367N5018O2916M7961K6766R625L816M822Q669K827r342j2176k9509
8247E25671j7445J2109M2180N9785O1341N5145L1349J083n151p093m223L106Q929
8234G66786K2935K5284K9647K9026K7151K6620K0838K5534K6730L0936K9960J5171
$$ plain form
8222 1076618 1080168 1082335 1106823 1167130 1252377 1354359 1497753 1708762 1977116 2286144 2613961
8211 2613961 2939690 3254692 3528164 3687002 3711341 3663325 3562726 3438887 3374548 3398339
8201 3398339 3495799 3664572 3901888 4198570 4562463 4999417 5525643 6169927 6944882 7844051
8191 7844051 8843183 9954028 11155221 12414948 13670349 14888381 16060524 17287987
8183 17287987 18772053 20712913 23331428 26891977 31943764 39516196 51256524 69399013
8175 69399013 95314574 126988514 159601828 191173892 220085458 235442443 229465735
8168 229465735 209666554 181134823 145184552 110358195 83095912 63607075 49935739
8161 49935739 40167432 32984634 27595804 23586235 20624312 18457690 16867527 15699071
$$ packed form
8222A076618L550K167K4488O0307Q5247J01982J43394K11009K68354L09028L27817
8211B613961L25729L15002K73472J58838K4339m8016j00599j23839o4339K3791
8201C398339R7460J68773K37316K96682L63893M36954N26226O44284P74955Q99169
8191G844051R99132J110845J201193J259727J255401J218032J172143J227463
8183A7287987J484066J940860K618515L560549N051787P572432J1740328J8142489
8175F9399013K5915561L1673940L2613314L1572064K8911566J5356985n976708
8168B29465735j9799181k8531731l5950271l4826357k7262283j9488837j3671336
8161D9935739r768307p182798n388830m009569k961923k166622j590163j168456
$$ plain form
8153 15699071 14866041 14331605 14074390 14067427 14307494 14816595 15626440 16743666 18157220
8144 18157220 19859488 21775329 23797815 25763464 27574842 29301249 31086636 33063940
8136 33063940 35337241 38191714 42088097 47772496 56464543 70162876 92509830 129429875
8128 129429875 187560674 265830716 351177409 427078674 461692672 442318782 386031647
8121 386031647 309749031 234178976 173270252 128920844 97995324 76590130 61468280
8114 61468280 50538326 42500497 36477793 31844030 28100833 25030160 22567192 20471265
8106 20471265 18607767 17068266 15936933 15203636 14814227 14703902 14801306 14978671 15151517
8097 15151517 15355269 15636568 15997324 16405292 16892931 17556555 18456926 19631787 21206239
$$ packed form
8153A5699071q33030n34436k57215o963K40067N09101Q09845J117226J413554
8144A8157220J702268J915841K022486J965649J811378J726407J785387J977304
8136C3063940K273301K854473L896383N684399Q692047J3698333K2346954L6920045
8128A29429875N8130799P8270042Q5346693P5901265L4613998j9373890n6287135
8121C86031647p6282616p5570055o0908724m4349408l0925520k1405194j5121850
8114F1468280j0929954q037829o022704m633763l743197l070673k462968k095927
8106B0471265j863498j539501j131333p33297l89409j10325R7404J77365J72846
8097A5151517K03752K81299L60756M07968M87639O63624R00371J174861J574452
$$ plain form
8088 21206239 23466013 26876263 32235670 40867908 54576059 74517712 98642180 121979452
8080 121979452 142993298 162553713 172816432 165248019 148912582 134351555 117550176
8073 117550176 94796284 72216682 54375429 41455380 32402297 26060434 21522782
8066 21522782 18188147 15629180 13577935 11920653 10586744 9509578 8661321 8016888
8058 8016888 7519179 7072419 6588572 6121024 5716189 5378825 5105004 4889807 4736170 4619338
8048 4619338 4516490 4406814 4272961 4099503 3914767 3747536 3590043 3445599 3335985 3255543
8038 3255543 3199593 3162211 3155713 3174919 3206465 3229427 3238201 3229283 3187432 3115224 3026502 2909397
8026 2909397 2771694 2620011 2482174 2357994 2248840 2152168 2073771 2027088 1976399 1919910
$$ packed form
8088B1206239K259774L410250N359407Q632238J3708151J9941653K4124468K3337272
8080A21979452K1013846J9560415J0262719p568413j6335437j4561027j6801379
8073A17550176k2753892k2579602j7841253j2920049r053083o341863m537652
8066B1522782l334635k558967k051245j657282j333909j077166q48257o44433
8058H016888m97709m46760m83847m67548m04835l37364k73821k15197j53637j16832
8048D619338j02848j09676j33853j73458j84736j67231j57493j44444j09614q0442
8038C255543n5950l7382o498J9206L1546K2962Q774q918m1851p2208q8722j17105
8026B909397j37703j51683j37837j24180j09154r6672p8397m6683n0689n6489
$$ plain form
8016 1919910 1880224 1846952 1824308 1796579 1765668 1741841 1707782 1676898 1636402 1587411 1553254
8005 1553254 1542542 1567600 1616607 1671966 1726932 1760382 1770471 1756569 1724232 1684967 1638356
7994 1638356 1584335 1528293 1481582 1442322 1411986 1395577 1386654 1393216 1409008 1410385 1399699 1369167
7982 1369167 1332829 1288239 1229335 1174484 1131444 1095004 1075047 1067035 1056847 1046156 1031674 1012495
7970 1012495 988468 961812 947868 931824 920574 914638 906668 896197 888833 889294 885089 883202 896363
7957 896363 912581 934421 953433 967898 968718 963780 950010 912129 868472 830534 799589 776088
7945 776088 767129 769844 776001 779877 786077 790813 779710 758326 728865 697252 662369 638593 603770
7932 603770 581459 574422 572095 583038 589220 580615 567624 554686 543635 542680 538765 533534 529543
$$ packed form
8016A919910l9686l3272k2644k7729l0911k3827l4059l0884m0496m8991l4157
8005A553254j0712K5058M9007N5359N4966L3450J0089j3902l2337l9265m6611
7994A638356n4021n6042m6711l9260l0336j6409q923O562J5792J377j0686l0532
7982A369167l6338m4590n8904n4851m3040l6440j9957q012j0188j0691j4482j9179
7970A012495k4027k6656j3944j6044j1250n936p970j0471p364M61m205j887J3161
7957H96363J6218K1840J9012J4465Q20m938j3770l7881m3657l7938l0945k3501
7945G76088q959K715O157L876O200M736j1103k1384k9461l1613l4883k3776l4823
7932F03770k2311p037k327J0943O182q605j2991j2938j1051r55l915n231l991
$$ plain form
7919 529543 542748 559769 578484 589928 597023 602601 596439 584266 571769 563887 559014 554767 549517
7906 549517 534828 519280 497520 484909 483123 475031 463049 456846 464107 469800 468306 463197 454023
7893 454023 444886 436534 428282 426956 426614 417012 402254 394250 383003 374249 362878 359510 365197 379090
7879 379090 388979 402981 408217 416138 420714 428122 423769 429379 431831 427888 428997 429129 431843 425080
7865 425080 422190 415693 406277 396332 387958 386156 385219 378166 370520 368580 357746 349405 352130 349398
7851 349398 339410 321597 304979 304718 307453 308114 320005 340899 353105 350152 353018 355581 353069 349677
7837 349677 339812 327577 311076 297115 305273 308301 312809 312787 303468 301531 305927 306001 311676 302265 291002
7822 291002 279963 282514 282396 281580 288225 286590 285904 292329 294741 300541 301451 300769 291454 277965 261118
$$ packed form
7919E29543J3205J7021J8715J1444P095N578o162j2173j2497p882m873m247n250
7906E49517j4689j5548k1760j2611j786q092j1982o203P261N693j494n109r174
7893D54023r137q352q252j326l42r602j4758q004j1247q754j1371l368N687J3893
7879C79090R889J4002N236P921M576P408m353N610K452l943J109J32K714o763
7865D25080k890o497r416r945q374j802r37p053p646j940j0834q341K725k732
7851C49398r988j7813j6618k61K735O61J1891K0894J2206k953K866K563k512l392
7837C49677r865j2235j6501j3961Q158L028M508k2r319j937M396P4N675r411j1263
7822B91002j1039K551j18q16O645j635o86O425K412N800R10o82r315j3489j6847
$$ plain form
7807 261118 265064 273497 282564 293728 297871 293974 289484 287905 291053 288965 288027 289905 296456 306244
7793 306244 315810 322745 335658 336909 333611 333966 335425 335494 334848 342234 351692 369973 395560 427868
7779 427868 494050 600198 756622 967773 1225429 1463031 1596109 1575238 1417541 1181018
7769 1181018 944328 756992 626525 533433 481510 436912 404161 381106 360891 339331 331853
7758 331853 343003 343418 330228 318313 307364 308053 306961 305872 313108 326918 341165 351949 364839
7745 364839 371414 378978 369880 364209 380615 387893 388744 385714 395020 421461 466970 534854 631779
7732 631779 775280 1022822 1413784 1942105 2536270 3005774 3017848 2574335 1999616 1504548
7722 1504548 1141719 894909 743113 653478 585929 514229 465394 427962 396338 360796 339418
$$ packed form
7807B61118L946Q433R067J1164M143l897m490j579L148k088r38J878O551R788
7793C06244R566O935J2913J251l298L55J459O9o46P386R458J8281K5587L2308
7779D27868O6182J06148J56424K11151K57656K37602J33078k0871j57697k36523
7769A181018k36690j87336j30467r3092n1923m4598l2751k3055k0215k1560p478
7758C31853J1150M15j3190j1915j0949O89j092j089P236J3810J4247J0784J2890
7745C64839O575P564r098n671J6406P278Q51l030R306K6441M5509O7884R6925
7732F31779J43501K47542L90962N28321N94165M69504J2074m43513n74719m95068
7722A504548l62829k46810j51796q9635o7549p1700m8835l7432l1624l5542k1378
$$ plain form
7711 339418 337059 316870 302324 285859 281449 278753 278043 279953 284840 290073 291640 285632 279509 287111
7697 287111 294314 288456 288959 300804 313136 323061 333892 352465 365861 382427 426384 506147 619560
7684 619560 783611 995728 1191145 1313802 1310197 1200364 1030212 838232 670344 534493
7674 534493 438544 375566 333080 304326 275807 257828 242732 227185 218002 209600 203766 198588
7662 198588 203243 201984 214306 215621 210860 220097 219135 215589 209960 202528 192271 185094 187796 189765
7648 189765 195222 190203 184302 180607 175789 171765 164978 166147 175521 180448 174316 166436 159982 151930
7634 151930 148302 146153 132938 131926 133955 133970 136670 144034 142306 136430 132342 122550 118599 123850 128905
7619 128905 133483 136000 139547 139263 139940 142874 152640 156139 156967 152480 158797 164715 161540 153262 150539
$$ packed form
7711C39418k359k0189j4546j6465m410k696p10J910M887N233J567o008o123P602
7697B87111P203n858N03J1845J2332R925J0831J8573J3396J6566M3957P9763J13413
7684F19560J64051K12117J95417J22657l605j09833j70152j91980j67888j35851
7674E34493r5949o2978m2486k8754k8519j7979j5096j5547r183q402n834n178
7662A98588M655j259J2322J315m761R237r62l546n629p432j0257p177K702J969
7648A89765N457n019n901l695m818m024o787J169R374M927o132p880o454q052
7634A51930l628k149j3215j012K029J5K700P364j728n876m088r792l951N251N055
7619A28905M578K517L547k84O77K934R766L499Q28m487O317N918l175q278k723
$$ plain form
7604 150539 145822 139459 140142 140875 134847 134957 131199 130745 134705 139012 133749 128621 125995 125758 126729 133703
7588 133703 128225 118440 111774 113435 113868 112220 109679 110509 113033 109120 106072 109852 116649 110952 106762
7573 106762 110912 107475 110741 111633 108739 108347 119545 125166 118071 112848 114022 116832 109911 104083 105478
7558 105478 106797 110703 115730 114946 110585 110064 117278 118278 113314 112656 109325 112983 117878 116348 107624
7543 107624 104091 107887 103628 100439 100161 113444 118357 121794 122397 121353 118725 116472 118134 119571 118861
7528 118861 113913 112746 114202 112151 103525 106531 101182 99828 104844 98462 100526 104201 101912 105540
7514 105540 97799 97892 97675 97619 97339 103697 105199 105293 100583 102597 101651 100882 105602 105739 111841 109277 106900
7497 106900 108084 103206 95027 92959 96473 102511 105641 107965 109671 96290 94274 95681 98336 98429 93449
$$ packed form
7604A50539m717o363O83P33o028J10l758m54L960M307n263n128k626k37R71O974
7588A33703n478r785o666J661M33j648k541Q30K524l913l048L780O797n697m190
7573A06762M150l437L266Q92k894l92J1198N621p095n223J174K810o921n828J395
7558A05478J319L906N027p84m361n21P214J000m964o58l331L658M895j530q724
7543A07624l533L796m259l189k78J3283M913L437O03j044k628k253J662J437p10
7528A18861m948j167J456k051q626L006n349j354N016o382K064L675k289L628
7514A05540p741R3k17n6k80O358J502R4m710K014r46p69M720J37O102k564k377
7497A06900J184m878q179k068L514O038L130K324J706j3381k016J407K655R3m980
$$ plain form
7482 93449 94630 94564 94661 89935 89313 89377 88475 89634 84668 79245 83892 90831 88106 81561 82112 82743 85660
7465 85660 85257 78150 76399 81797 76384 70371 72216 73839 78725 80364 83999 89127 95818 94541 93136
7450 93136 87057 85810 91360 98239 91577 88832 88382 81592 75559 80624 72018 75062 83116 85192 84020
7435 84020 79834 84437 77647 71755 75251 77539 83335 81473 74008 77727 83426 92205 94477 93473 95075
7420 95075 94763 90816 81468 79267 81192 85250 80997 76979 74949 80156 86900 84044 78503 87465 98330
7405 98330 101055 97769 92964 93693 98903 102422 96653 92957 85396 80680 81175 80924 82890 74849 71717
7390 71717 79951 77133 73137 66989 65553 67781 69928 68724 70460 72639 74769 78847 73406 66944 68300
7375 68300 69280 69812 59048 53435 60912 67020 74197 76451 75163 69214 66530 65370 69177 70687 70055
$$ packed form
7482I3449J181o6R7m726o22O4r02J159m966n423M647O939k725o545N51O31K917
7465H5660m03p107j751N398n413o013J845J623M886J639L635N128O691j277j405
7450I3136o079j247N550O879o662k745m50o790o033N065q606L044Q054K076j172
7435H4020m186M603o790n892L496K288N796j862p465L719N699Q779K272j004J602
7420I5075l12l947r348k201J925M058m253m018k030N207O744k856n541Q962J0865
7405I8330K725l286m805P29N210L519n769l696p561m716M95k51J966q041l132
7390G1717Q234k818l996o148j436K228K147j204J736K179K130M078n441o462J356
7375F8300R80N32j0764n613P477O108P177K254j288n949k684j160L807J510o32
$$ plain form
7360 70055 70948 72043 71228 70728 75563 84858 93324 86976 79081 69966 62948 60547 65923 69392 71299
7345 71299 75950 76671 72687 71141 67188 69752 79443 76394 69151 67425 61469 58793 64954 64604 61046
7330 61046 66010 67425 70001 75849 69837 66586 69108 72156 72823 65425 65525 69615 68837 59898 56087
7315 56087 51341 50172 50999 53236 61829 64663 72962 68277 63717 64362 64202 63553 55157 57499 59177 68592
7299 68592 64469 67244 68123 58397 56585 56603 57066 60539 64174 64668 78957 90070 92920 92741 88677 78899
7283 78899 66209 59600 51930 50286 55011 52948 48068 51881 56980 55999 52174 51580 58820 62245 54856
7268 54856 45524 45402 50539 51019 42342 47902 54028 59401 57357 57775 58225 59867 59768 56582 51194 49794
7252 49794 53242 63569 60816 55343 61372 61473 54189 60989 69817 85955 98685 108460 117319 118856
$$ packed form
7360G0055Q93J095q15n00M835R295Q466o348p895r115p018k401N376L469J907
7345G1299M651P21l984j546l953K564R691l049p243j726n956k676O161l50l558
7330F1046M964J415K576N848o012l251K522L048O67p398J00M090p78q939l811
7315E6087m746j169Q27K237Q593K834Q299m685m560O45j60o49q396K342J678R415
7299F8592m123K775Q79r726j812J8M63L473L635M94J4289J1113K850j79m064r778
7283G8899j2690o609p670j644M725k063m880L813N099r81l825n94P240L425p389
7268E4856r332j22N137M80q677N560O126N373k044M18M50J642r9l186n388j400
7252D9794L448J0327k753n473O029J01p284O800Q828J6138J2730R775Q859J537
$$ plain form
7238 118856 109876 90935 78881 69536 68446 66328 55859 55836 52277 44535 40722 50611 54517 55718
7224 55718 54299 56296 61925 63624 67067 71520 66111 53840 56682 59159 60048 53648 51154 55392 69256
7209 69256 69784 62439 56626 55237 48478 50810 62752 67046 62169 61287 61542 49709 50204 57868 62913
7194 62913 69050 73695 71471 50484 43690 38280 39366 47574 47932 53338 58761 47090 37795 37417 39015
7179 39015 41820 42154 40106 45825 50480 49904 52890 61770 60483 59920 55305 55247 56046 56965 63116 64119
7163 64119 64146 66073 59153 51250 43977 39573 38670 44000 44759 52526 58242 51530 48497 45310 44778 39020
7147 39020 35827 33245 29833 40261 42483 46914 46860 40263 31704 34781 43311 43763 38700 33106 35265
7132 35265 34539 40631 50573 52334 51645 44592 34983 34445 34649 40980 46286 59433 56759 50544 45651
$$ packed form
7238A18856q980j8941j2054r345j090k118j0469k3l559p742l813R889L906J201
7224E5718j419J997N629J699L443M453n409j2271K842K477Q89o400k494M238J3864
7209F9256N28p345n813j389o759K332J1942M294m877q82K55j1833M95P664N045
7194F2913O137M645k224k0987o794n410J086Q208L58N406N423j1671r295l78J598
7179C9015K805L34k048N719M655n76K986Q880j287n63m615n8P99R19O151J003
7163F4119K7J927o920p903p273m404r03N330P59P767N716o712l033l187n32n758
7147C9020l193k582l412J0428K222M431n4o597q559L077Q530M52n063n594K159
7132C5265p26O092R942J761o89p053r609n38K04O331N306J3147k674o215m893
$$ plain form
7117 45651 41622 38762 43006 48271 46850 42938 39995 36253 30310 25252 30191 32610 38205 46461 50090
7102 50090 49401 44465 44671 41791 45723 47507 47879 44833 43832 46667 42010 35409 32998 30565 32855
7087 32855 28436 30976 38818 26624 14062 19304 33543 38147 35112 42378 43078 43436 38705 35913
7073 35913 37373 39190 41815 47545 50288 45669 44748 35920 28093 25755 34778 41830 43128 34246 27755
7058 27755 30164 30223 24407 23296 31113 34136 31283 27860 26960 26792 29978 25154 29446 31214 37767 39744
7042 39744 34139 35663 34595 24065 25759 21158 20966 22948 21618 19463 23655 25460 32469 35046 28935
7027 28935 26491 27265 27264 23243 26120 35396 43102 48142 43820 41237 36903 29531 26295 31125 37626 36429
7011 36429 36094 34714 34599 31539 36558 41073 32662 23685 24027 25209 31390 34433 33375 33377 37971 35474
$$ packed form
7117D5651m029k860M244N265j421l912k943l742n943n058M939K419N595Q256L629
7102E0090o89m936K06k880L932J784L72l046j001K835m657o601k411k433K290
7087C2855m419K540P842j2194j2562N242J4239M604l035P266P00L58m731k792
7073C5913J460J817K625N730K743m619r21q828p827k338R023P052J298q882o491
7058B7755K409N9n816j111P817L023k853l423r00j68L186m824M292J768O553J977
7042C9744n605J524j068j0530J694m601j92J982j330k155M192J805P009K577o111
7027B8935k444P74jm021K877R276P706N040m322k583m334p372l236M830O501j197
7011C6429l35j380j15l060N019M515q411q977L42J182O181L043j058KM594k497
$$ plain form
6995 35474 25032 21330 22341 30440 37563 33204 22455 21160 27487 41085 45550 39983 31907 28622
6981 28622 32657 36570 33182 21762 23259 23325 28720 29250 29624 33880 33888 30058 34045 27700 23973 20157
6965 20157 22390 34061 31601 26133 30659 32525 24715 16461 18226 26675 39922 44257 40518 36463
6951 36463 33479 29455 16540 10852 10234 14539 10982 12837 19809 15861 10786 16650 27078 25647
6937 25647 17980 15340 10958 18193 25964 30557 30386 13120 11548 22324 27678 24749 26711 26518 32970
6922 32970 33329 32164 28801 27607 34243 45196 42977 33346 26394 30288 30272 30796 32160 29507 34551
6907 34551 39368 42652 41861 50614 42633 30529 30466 23669 17749 20399 24193 22324 22035 24231 20626
6892 20626 25211 31334 32833 32396 33737 25379 26470 31935 25936 24342 26656 28336 26477 23570 19635
$$ packed form
6995C5474j0442l702J011Q099P123m359j0749j295O327J3598M465n567q076l285
6981B8622M035L913l388j1420J497O6N395N30L74M256Ql830L987o345l727l816
6965B0157K233J1671k460n468M526J866p810q254J765Q449J3247M335l739m055
6951C6463k984m024j2915n688o18M305l557J855O972l948n075N864J0428j431
6937B5647p667k640m382P235P771M593j71j7266j572J0776N354k929J962j93O452
6922C2970L59j165l363j194O636J0953k219r631o952L894j6N24J364k653N044
6907C4551M817L284p91Q753p981j2104o3o797n920K650L794j869k89K196l605
6892B0626M585O123J499m37J341q358J091N465n999j594K314J680j859k907l935
$$ plain form
6877 19635 17560 24287 23635 21231 26588 30051 30658 28057 24114 26131 27772 31763 35885 45055 40468
6862 40468 41693 33268 20981 21879 25903 28097 27745 31244 28619 26674 16519 19623 24138 22560 19635
6847 19635 11301 11754 13423 18032 22455 18506 16284 17129 24780 24191 25297 28541 31550 31011 34528 34191
6831 34191 33819 38850 46050 47853 46951 41949 33899 35419 37499 41566 51236 70067 98550 132026
6817 132026 177955 229644 244345 208142 155553 108937 83542 69940 61711 55962 55999 51962 46361
6804 46361 33885 21644 20656 23243 19377 19417 23175 23785 24334 31335 30274 27970 33872 35563 32425
6789 32425 31661 28019 22496 20514 13871 15764 18948 15445 13196 12770 12306 9186 13401 26357 18817
6774 18817 19916 22195 24221 23473 14007 7495 11504 18313 16579 17976 32741 34074 21879 18291
$$ packed form
6877A9635k075O727o52k404N357L463O07k601l943K017J641L991M122R170m587
6862D0468J225q425j2287Q98M024K194l52L499k625j945j0155L104M515j578k925
6847A9635q334M53J669M609M423l949k222Q45P651n89J106L244L009n39L517l37
6831C4191l72N031P200J803r02n002q050J520K080M067R670J8831K8483L3476
6817A32026M5929N1689J4701l6203n2589m6616k5395j3602q229n749L7m037n601
6804D6361j2476j2241r88K587l866M0L758O10N49P001j061k304N902J691l138
6789C2425p64l642n523j982o643J893L184l503k249m26m64l120M215J2956p540
6774A8817J099K279K026p48r466o512M009O809j734J397J4765J333j2195l588
$$ plain form
6760 18291 20681 20085 15545 14974 23456 25651 24703 21260 20082 19224 16136 14855 14661 22386 30370 35685
6744 35685 39241 33414 32788 32107 20325 15351 18486 25234 32185 24623 18390 25508 33038 30966 31318
6729 31318 31706 29227 18919 19556 21131 19363 12128 14027 22640 26150 25434 22194 14917 17211 16665
6714 16665 9208 9983 12533 15232 15222 8562 6284 11027 14501 17033 18590 19989 21306 20480 12084 5502
6698 5502 12203 18080 21189 26080 23587 23922 20855 21807 35361 40196 36930 36780 29640 21413 18124
6683 18124 21041 21072 20534 16141 9289 15713 27653 27978 23081 22486 19509 17491 16587 13138 13457 8561
6667 8561 4342 12231 15241 19971 24033 20390 18440 9227 4977 4639 17851 30011 33414 28094 27704
6652 27704 16451 8895 2928 7024 12951 11284 16884 13014 6422 10812 21378 24792 29222 21555
$$ packed form
6760A8291K390n96m540n71Q482K195r48l443j178q58l088j281j94P725P984N315
6744C5685L556n827o26o81j1782m974L135O748O951p562o233P118P530k072L52
6729C1318L88k479j0308O37J575j768p235J899Q613L510p16l240p277K294n46
6714A6665p457P75K550K699j0o660k278M743L474K532J557J399J317q26q396o582
6698E502O701N877L109M891k493L35l067R52J3554M835l266j50p140q227l289
6683A8124K917L1n38m393o852O424J1940L25m897n95k977k018r04l449L19m896
6667H561m219P889L010M730M062l643j950r213m250l38J3212J2160L403n320l90
6652B7704j1253p556n967M096N927j667N600l870o592M390J0566L414M430p667
$$ plain form
6638 21555 19261 15723 12499 8131 12544 12992 12808 12373 12488 15028 14655 17779 28596 25573 11447
6623 11447 12566 13965 11635 12561 16720 22219 24591 25618 22123 20649 26778 26804 21362 23613 19914
6608 19914 11472 10666 21169 30705 32687 22641 17881 17163 19233 23490 21492 17233 18160 20849 17499
6593 17499 24559 32719 26236 23658 18516 14882 13936 16472 24222 25788 24269 26241 28210 28561 27686
6578 27686 22597 22140 32046 37265 37975 30948 26589 24829 27257 30062 27708 26231 31868 39011 28645
6563 28645 25026 24965 23031 13735 9929 18786 28232 30313 20598 16103 14428 14303 24211 31089 25795
6548 25795 22683 23171 27410 17476 9525 6324 8453 8794 625 407 2374 12576 18179 15912 11869
6533 11869 14470 15392 11650 14785 19591 21856 21247 22489 24729 22964 14565 15178 20378 26208 22667
$$ packed form
6638B1555k294l538l224m368M413M48j84m35J15K540l73L124J0817l023j4126
6623A1447J119J399k330R26M159N499K372J027l495j474O129K6n442K251l699
6608A9914q442q06J0503R536J982j0046m760p18K070M257j998m259R27K689l350
6593A7499P060Q160o483k578n142l634r46K536P750J566j519J972J969L51q75
6578B7686n089m57R906N219P10p027m359j760K428K805k354j477N637P143j0366
6563B8645l619o1j934r296l806Q857R446K081r715m495j675j25R908O878n294
6548B5795l112M88M239r934p951l201K129L41q169k18J967J0202N603k267m043
6533A1869K601R22l742L135M806K265o09J242K240j765q399O13N200N830l541
$$ plain form
6518 22667 20753 25391 16550 12049 8530 15412 13629 7957 12995 14782 7889 8182 10207 4161 -61
6503 -61 -2211 -968 -2197 4630 7401 9963 12793 15914 19786 23195 22479 20383 12500 8341 882 -1180
6487 -1180 -1050 -1320 6346 17644 30425 30196 14371 12294 23412 28707 24656 18675 14392 11096 8680
6472 8680 3666 7354 10411 9784 8563 14112 13837 17206 11986 13772 14200 13784 9954 5193 4803 3771
6456 3771 6825 8687 3317 8202 12496 6689 8989 11160 4785 -4616 -7172 -6473 -5670 -910 2836
6441 2836 705 1893 9109 12600 11956 8002 10233 3493 -4329 -1591 9603 10924 12460 21287 15699
6426 15699 8159 6374 8823 16477 15648 18226 15273 13985 8051 7849 2616 9716 18012 14908 7785
6411 7785 12612 21186 24109 21971 23748 14478 5661 2983 968 6487 8492 9808 13081 9368 5762
$$ packed form
6518B2667j914M638q841m501l519O882j783n672N038J787o893K93K025o046m222
6503f1k150J243j229O827K771K562K830L121L872L409p16k096p883m159p459k062
6487a180J30k70P666J1298J2781k29j5825k077J1118N295m051n981m283l296k416
6472H680n014L688L057o27j221N549k75L369n220J786M28m16l830m761l90j032
6456C771L054J862n370M885M294n807K300K171o375r401k556O99Q03M760L746
6441B836k131J188P216L491o44l954K231o740p822K738J1194J321J536Q827n588
6426A5699p540j785K449P654q29K578k953j288n934k02n233P100Q296l104p123
6411G785M827Q574K923k138J777r270q817k678k015N519K005J316L273l713l606
$$ plain form
6396 5762 3946 1498 5774 4087 6913 13825 17200 17381 8709 8300 5637 10803 14938 18660 17520
6381 17520 10178 9641 3270 2602 12039 13617 13964 18489 16607 12710 16354 19594 14334 8302 6862
6366 6862 740 -1134 8320 18515 7010 1438 2426 5785 5259 -493 2983 -2292 -4954 -181 1614
6351 1614 3857 11388 14655 16097 13998 10440 3997 1512 -1686 -1500 8174 10846 8949 4113 6044
6336 6044 10701 20783 19907 14664 3495 5115 6879 4475 -4590 -9816 -275 8393 10713 9230 13802
6321 13802 15722 8229 10292 18413 14125 14255 16384 15024 14333 6706 2460 5133 520 626 582 -5708
6305 -5708 -3731 -1881 2793 5087 9218 15708 12354 4016 4953 11513 7906 15390 15709 6641 3371
6290 3371 -3117 -5525 -7690 -458 3310 11569 11237 9283 4490 5237 6456 11686 5132 4778 5056 8775
$$ packed form
6396E762j816k448M276j687K826O912L375J81q672m09k663N166M135L722j140
6381A7520p342n37o371o68R437J578L47M525j882l897L644L240n260o032j440
6366F862o122j874R454J0195j1505n572R88L359n26n752L476n275k662M773J795
6351A614K243P531L267J442k099l558o443k485l198J86R674K672j897m836J931
6336F044M657J0082q76n243j1169J620J764k404r065n226R541Q668K320j483M572
6321A3802J920p493K063Q121m288J30K129j360o91p627m246K673m613J06m4o290
6305e708J977J850M674K294M131O490l354q338R37O560l607P484L19r068l270
6290C371o488k408k165P232L768Q259l32j954m793P47J219N230o554l54K78L719
$$ plain form
6274 8775 10592 3300 -3900 54 5602 6609 6142 2628 6068 2386 5946 12811 18543 17997 7378
6259 7378 4868 6900 9020 9008 10031 5065 5378 10696 11353 6103 10842 4086 1878 2098 2896 5601
6243 5601 6099 4455 794 3009 12249 8865 7238 6219 4035 -2019 -153 4931 6809 5477 9861
6228 9861 7903 5014 11267 11173 9351 5587 -706 -3309 3747 4666 9137 13881 13756 11277 3407 4585
6212 4585 3338 1730 4658 13828 15376 7265 5959 5973 521 6624 15784 16688 20392 18675 15532 16040
6196 16040 10816 5293 5578 15501 18009 6871 5850 2816 3294 5231 5420 4989 6416 5297 3000
6181 3000 -2944 -3534 4758 5423 4675 2561 6982 13894 11144 8380 10939 5423 1561 -2084 -3685 -4784
6165 -4784 -2469 -2475 391 5603 15892 15419 3776 -4438 -8539 -1516 7691 5937 4796 16796 15789
$$ packed form
6274H775J817p292p200L954N548J007m67l514L440l682L560O865N732n46j0619
6259G378k510K032K120j2J023m966L13N318O57n250M739o756k208K20P98K705
6243E601M98j644l661K215R240l384j627j019k184o054J866N084J878j332M384
6228I861j958k889O253r4j822l764o293k603P056R19M471M744j25k479p870J178
6212D585j247j608K928R170J548q111j306J4n452O103R160R04L704j717l143N08
6196A6040n224n523K85R923K508j1138j021l034M78J937J89m31J427j119k297
6181C000n944n90Q292O65p48k114M421O912k750k764K559n516l862l645j601j099
6165d784K315oK866N212J0289m73j1643q214m101P023R207j754j141J2000j007
$$ plain form
6150 15789 8426 1260 -2068 1576 -1709 -6171 -12600 -16217 -21351 -19784 -14170 -9462 -9208 -1385 4925
6135 4925 11238 18995 16186 16341 19260 15774 11510 6484 5006 5006 6316 10950 13013 284 -528 10039
6119 10039 13355 10473 12653 17827 21871 19390 16432 4200 3875 8353 10707 11367 1278 -6634 -9726
6104 -9726 -11924 -10065 -5812 -3436 4497 -346 -6996 -1930 -3659 -6178 -7951 -6759 1793 5969 11803
6089 11803 16133 17279 11102 9004 7932 13873 11362 3883 -6843 -9694 -6649 -2687 4669 9735
6075 9735 6893 7968 4723 -2632 360 7715 11325 19237 18454 13701 12796 13363 10293 10140 12233 7810
6059 7810 7103 5331 1811 1868 8196 1123 1579 3696 2732 -4591 -7046 -2300 -3653 -1469 1933 6660
6043 6660 5408 -3052 -505 5060 8415 18125 14887 12246 15128 15527 12300 9645 4007 -7722 -6020
$$ packed form
6150A5789p363p166l328L644l285m462o429l617n134J567N614M708K54P823O310
6135D925O313P757k809J55K919l486m264n026j478%J310M634K063j2729q12J0567
6119A0039L316k882K180N174M044k481k958j2232l25M478K354O60j0089p912l092
6104i726k198J859M253K376P933m843o650N066j729k519j773J192Q552M176N834
6089A1803M330J146o177k098j072N941k511p479j0726k851L045L962P356N066
6075I735k842J075l245p355K992P355L610P912p83m753r05N67l070j53K093m423
6059G810p07j772l520N7O328p073M56K117r64p323k455M746j353K184L402M727
6043F660j252q460K547N565L355R710l238k641K882L99l227k655n638j1729J702
$$ plain form
6028 -6020 1886 7238 4279 1014 -1588 -3411 -2235 2152 5693 9078 15007 18444 19555 19801 14859
6013 14859 12997 16319 10932 2038 4101 9210 11002 -1022 -4011 -4409 -4670 -6879 -10005 -10485 -3124
5998 -3124 9702 18869 19467 9558 -3625 4447 5807 8404 13690 11403 12351 21170 19941 19386 17584
5983 17584 11818 8329 9373 6038 4593 -2390 2674 7356 3789 -1685 1232 4017 11491 16864 8714
5968 8714 -4323 -4169 -6286 -342 1875 1371 1680 944 -3582 -6261 -2879 43 -2231 -7412 -7 5305
5952 5305 7430 5115 3845 -4519 -15250 -15754 -10176 -6773 -6296 -12146 -19278 -17263 -6903 -1568 -2902
5937 -2902 -2658 -4416 -4994 -3618 -8293 -14840 -11276 -6148 -3166 -14120 -20154 -23728 -25919 -15421 -5108
5922 -5108 2402 8489 8084 3126 -238 -1172 -2629 -11717 -10665 -10052 -10787 -8524 -942 452 2428 -1414
$$ packed form
6028f020P906N352k959l265k602j823J176M387L541L385N929L437J111K46m942
6013A4859j862L322n387q894K063N109J792j2024k989l98k61k209l126m80P361
5998c124J2826R167N98r909j3183Q072J360K597N286k287R48Q819j229n55j802
5983A7584n766l489J044l335j445o983N064M682l567n474K917K785P474N373q150
5968H714j3037J54k117N944K217n04L09p36m526k679L382K922k274n181P405N312
5952E305K125k315j270q364j0731n04N578L403M77n850p132K015J0360N335j334
5937b902K44j758n78J376m675o547L564N128K982j0954o034l574k191J0498J0313
5922e108P510O087m05m958l364r34j457r088J052O13p35K263P582J394J976l842
$$ plain form
5906 -1414 -5475 15 4877 3317 3996 5053 5683 -8839 -14808 -3465 8599 15869 9195 -2947
5892 -2947 -7550 -7101 -4568 -5287 -10228 -13421 -16427 -14224 -4498 1133 -6549 -9301 -15892 -12275 -10134
5877 -10134 -2111 4964 9948 9451 186 -13814 -18300 -14796 -10016 -4305 1519 900 -4100 -4522 -3725
5862 -3725 -9924 -18872 -28990 -19678 -11408 -4804 6104 9084 12563 11243 6628 11263 11154 597
5848 597 1772 9659 8888 1780 1047 3264 267 -11236 -11307 -377 -1121 2794 9409 672 -5909 -3580
5832 -3580 -7655 -5724 7932 15937 21790 19025 16186 14712 15283 20237 17668 7659 3008 3768 3866
5817 3866 16992 22980 23608 15165 10407 7474 8844 7320 1329 -5655 -10341 -14905 -17135 -3452 1486
5802 1486 136 -3909 -6309 -11028 -8400 -6503 -836 260 -739 -1283 -3583 -5377 -4491 1938 -4524 -2296
$$ packed form
5906a414m061N490M862j560O79J057O30j4522n969J1343J2064P270o674j2142
5892b947m603M49K533p19m941l193l006K203R726N631p682k752o591L617K141
5877a0134Q023P075M984m97r265j4000m486L504M780N711N824o19n000m22P97
5862c725o199q948j0118R312Q270O604J0908K980L479j320m615M635j09j0557
5848E97J175P887p71p108p33K217k997j1503p1J0930p44L915O615q737o581K329
5832c580m075J931J3656Q005N853k765k839j474N71M954k569j0009m651P60R8
5817C866J3126N988O28q443m758k933J370j524n991o984m686m564k230J3683M938
5802A486j350m045k400m719K628J897N667J096r99n44k300j794Q86O429o462K228
$$ plain form
5786 -2296 -1773 -2975 -261 -1200 -2514 -1481 -8140 -7854 -3680 1799 8200 3969 2684 2128 8212 8440
5770 8440 4322 -2703 -4271 -2192 2724 4647 6013 1920 2214 3527 7819 5613 1797 -4942 -4552
5755 -4552 -4826 -2780 -1967 -2496 -1345 -2982 2399 10952 7882 6060 1618 7621 9281 9394 2082 -6139
5739 -6139 -10342 -11519 -10971 -7442 -6412 -419 2683 1022 -1953 -5096 1319 3172 2137 -612 -10571
5724 -10571 -12035 -17478 -16546 -4814 -6976 -14076 -14439 -17033 -15657 -13270 -8215 -6760 -3282 1131 1026
5709 1026 -4641 -410 6131 7831 3207 4840 5389 8230 20622 16257 9647 5590 3161 9360 11611
5694 11611 6501 11314 19751 17287 10912 5658 -4683 -11168 -8091 -6074 -4380 -1481 7206 10166
5680 10166 5487 716 2997 1902 2004 3217 1060 5272 11245 17804 13193 7129 8609 6772 -134
$$ packed form
5786b296N23j202K714r39j314J033o659K86M174N479O401m231j285n56O084K28
5770H440m118p025j568K079M916J923J366m093K94J313M292k206l816o739L90
5755d552k74K046Q13n29J151j637N381Q553l070j822m442O003J660J13p312q221
5739f139m203j177N48L529J030N993L102j661k975l143O415J853j035k749r959
5724a0571j464n443R32J1732k162p100l63k594J376K387N055J455L478M413j05
5709A026n667M231O541J700m624J633N49K841J2392m365o610m057k429O199K251
5694A1611n110M813Q437k464o375n254j0341o485L077K017J694K899Q687K960
5680A0166m679m771K281j095J02J213k157M212N973O559m611o064J480j837o906
$$ plain form
5665 -134 1707 809 4502 2512 -5088 -3352 -1414 618 1252 -256 4751 7078 1519 -7269 -6961 411
5649 411 2107 -4909 -11423 -9354 -9349 -2288 2164 14557 22191 18464 12587 3923 -924 -2034 326 9514
5633 9514 4960 -557 -3600 -8326 -4972 -2869 -3424 -3087 -1375 -7701 -3875 -3186 -6428 -15823 -15953 -5656
5617 -5656 2141 2308 -3090 1226 7080 3033 4913 5941 -617 -3375 3105 1563 -4007 -993 8864
5602 8864 12963 7371 -7099 -13147 -10484 -552 3664 4929 -2034 -4378 2683 3347 -6307 -12565 -10384
5587 -10384 -9548 -14234 -16002 -17251 -12311 -8398 -4650 6320 10744 -572 -10084 -15685 -12447 3094
5573 3094 5470 -1284 -10806 -11345 -14111 -7795 -6714 -6834 -910 6963 8381 112 2831 -1490 -5648
5558 -5648 -4852 -5106 -7470 -10831 -3817 -2669 -6121 -2958 -3383 -4945 952 -4793 -2522 5296 2184 -1216
$$ packed form
5665a34J841q98L693j990p600J736J938K032O34j508N007K327n559q788L08P372
5649D11J696p016o514K069NP061M452J2393P634l727n877q664m847j110K360R188
5633I514m554n517l043m726L354K103n55L37J712o326L826O89l242r395j30J0297
5617e656P797J67n398M316N854m047J880J028o558k758O480j542n570L014R857
5602H864M099n592j4470o048K663R932M216J265o963k344P061O64r654o258K181
5587a0384Q36m686j768j249M940L913L748J0970M424j1316r512n601L238J5541
5573C094K376o754r522n39k766O316J081j20N924P873J418q269K719m321m158
5558e648P96k54k364l361P014J148l452L163m25j562N897n745K271P818l112l400
$$ plain form
5542 -1216 2161 4879 10954 2629 -7401 -12152 -13047 -3893 2390 -2243 -6598 -325 6995 7059 2522
5527 2522 -738 -8093 -17522 -18222 -14111 -10761 7418 15170 18728 17947 10744 -2751 -4614 -1671 -7613
5512 -7613 -12616 -5853 -2363 -3887 -5318 -1866 6635 9849 6354 4673 142 -3960 -3150 -1984 -3058
5497 -3058 -1225 10103 6917 3456 972 1030 2637 -2719 -6176 -3952 -7685 -8971 -7601 -750 -1760
5482 -1760 -3702 -4779 -4922 -8395 -868 3289 8278 6289 4400 4430 758 1224 7699 15241 21255 18383
5466 18383 16426 4653 -163 -6688 -13524 -11151 -7248 -2491 -2159 -9281 -5912 6194 4501 -2200
5452 -2200 -881 3272 4715 9963 9766 -2575 -14569 -17640 -13941 -15069 -14055 -17929 -12475 -15181 -19664
5437 -19664 -14150 -10477 -12475 -6221 -6897 -10326 -12440 -8355 -5308 -9192 -6725 4680 5252 7089 12864
$$ packed form
5542a216L377K718O075q325j0030m751q95R154O283m633m355O273P320O4m537
5527B522l260p355r429p00M111L350J8179P752L558p81p203j3495j863K943n942
5512g613n003O763L490j524j431L452Q501L214l495j681m531m102Q10J166j074
5497c058J833J1328l186l461k484N8J607n356l457K224l733j286J370O851j010
5482a760j942j077j43l473P527M157M989j989j889L0l672M66O475P542O014k872
5466A8383j957j1773m816o525o836K373L903M757L32p122L369J2106j693o701
5452b200J319M153J443N248j97j2341j1994l071L699j128J014l874N454k706m483
5437a9664N514L673j998O254o76l429k114M085L047l884K467J1405N72J837N775
$$ plain form
5422 12864 14660 17286 15372 3061 -4346 -6956 -13150 -18285 -17048 -21626 -11222 -558 -3315 -2768
5408 -2768 2474 1455 1660 -951 -1961 -158 -4574 -4822 -7668 -20187 -23444 -16892 -9008 -6405 -10843
5393 -10843 -19298 -8674 -3800 -2391 908 4079 -1420 -5663 -9132 -13802 -15433 -11615 -12865 -14994
5379 -14994 -13185 -10331 -1537 378 -1737 -6076 -13336 -12880 -10236 -3136 -4804 -11443 -8657 -2840 -8229
5364 -8229 -8300 -3951 -7136 -11776 -10164 -4974 -2584 7430 6478 -3775 -6642 -2510 -2229 1813 -4229
5349 -4229 -10706 -13605 -11926 -8990 -12144 -15859 -14458 -8164 -5035 -12072 -3306 9726 9471 8188 10372
5334 10372 7782 1240 -2532 -1547 623 5059 5892 3982 9044 9462 2949 -808 -202 -3353 -12085 -15789
5318 -15789 -13798 -17349 -15899 -10450 -9667 -6834 -882 -739 1562 3431 -1301 -8130 -8342 -5939 -6246 -4603
$$ packed form
5422A2864J796K626j914j2311p407k610o194n135J237m578J0404J0664k757N47
5408b768N242j019K05k611j010J803m416k48k846j2519l257O552P884K603m438
5393a0843q455J0624M874J409L299L171n499m243l469m670j631L818j250k129
5379a4994J809K854Q794J915k115m339p260M56K644P100j668o639K786N817n389
5364h229p1M349l185m640J612N190K390J0014r52j0253k867M132K81M042o042
5349d229o477k899J679K936l154l715J401O294L129p037Q766J3032k55j283K184
5334A0372k590o542l772R85K170M436Q33j910N062M18o513l757O06l151q732l704
5318a5789J991l551J450N449P83K833N952J43K301J869m732o829k12K403l07J643
$$ plain form
5302 -4603 -9733 -11945 -3723 4474 5232 827 -7719 -9112 -14911 -15703 -7679 -6086 -3826 5708 7748
5287 7748 10751 8235 12567 15207 9679 -429 -6169 302 -5324 -12312 -1928 3614 3674 1105 -4329
5272 -4329 4934 9379 10756 8519 -361 -9079 -13067 -10009 -19596 -20001 -16799 -11774 -3069 -1812 -1805 -3695
5256 -3695 -3684 -5689 -9418 -7528 -2186 4661 1953 -2650 -3455 -4810 -4688 -2409 -10104 -16412 -12693 -9343
5240 -9343 -3272 -1751 2327 -1613 -11073 -10664 -11233 -5034 -12273 -13978 -9506 -2800 -4412 -8273 -7940 -7407
5224 -7407 -8338 -7166 -8080 -3865 -5905 1239 -6323 -1489 -4553 -6478 53 2667 6923 752 -4675
5209 -4675 2625 5512 3252 -878 -11310 -10115 -5407 853 -5218 -8901 -12294 -13971 -16012 -12636 -5567
5194 -5567 -1306 -1693 -13676 -21253 -16863 -6602 3474 7330 1479 -4062 -1486 -2479 -3811 -1482 -1182
$$ packed form
5302d603n130k212Q222Q197P58m405q546j393n799p92Q024J593K260R534K040
5287G748L003k516M332K640n528j0108n740O471n626o988J0384N542O0k569n434
5272d329R263M445J377k237q880q718l988L058r587m05L202N025Q705J257Pj890
5256c695J1k005l729J890N342O847k708m603q05j355J22K279p695o308L719L350
5240i343O071J521M078l940r460M09n69O199p239j705M472O706j612l861L33N33
5224g407r31J172r14M215k040P144p562M834l064j925O531K614M256o171n427
5209d675P300K887k260m130j0432J195M708O260o071l683l393j677k041L376P069
5194e567M261l87j1983p577M390J0261J0076L856n851n541K576r93j332K329L00
$$ plain form
5179 -1182 -925 -6083 -3826 7194 3936 -3350 -6527 -8818 -17587 -13748 -6798 -3199 -5020 -7797 -8926
5164 -8926 -2417 -2513 -1669 -2249 5192 1859 -10123 -10416 -6392 -5828 -10696 -14043 -13487 -12368 -17940 -18129 -11712
5147 -11712 -3733 -2587 -6800 -4710 -1735 -6032 -5759 -9716 -15253 -2608 -3352 -3699 -2824 -3502 -5266 -5717
5131 -5717 -9350 -7072 -2056 -5765 -6155 -6347 -1559 5671 7750 2233 3701 3270 871 -10414 -12853
5116 -12853 -8484 -11082 -18920 -16677 -16622 -22485 -10784 -3956 -7104 -15053 -16761 -11737 -8334 -4314 -10042
5101 -10042 -3795 4152 -3890 -11461 -15127 -7199 -5954 -784 3815 4162 1091 -3829 -2892 -923 -6930
5086 -6930 -11374 -13443 -8695 -6546 -6970 -9869 -10026 -8865 -10540 -6619 -3140 -4431 -3695 -3577 -15419 -17532
5070 -17532 -15816 -11386 -3344 -3187 -9989 -12288 -12414 -14280 -13593 -8594 -2098 697 -6850 -5697 -5418 -5828
$$ packed form
5179a182K57n158K257J1020l258p286l177k291q769L839O950L599j821k777j129
5164h926O509r6Q44n80P441l333j1982k93M024N64m868l347N56J119n572j89O417
5147a1712P979J146m213K090K975m297K73l957n537J2645p44l47Q75o78j764m51
5131e717l633K278N016l709l90j92M788P230K079n517J468m31k399j1285k439
5116a2853M369k598p838K243N5n863J1701O828l148p949j708N024L403M020n728
5101a0042O247P947q042p571l666P928J245N170M599L47l071m920R37J969o007
5086f930m444k069M748K149m24k899j57J161j675L921L479j291P36J18j1842k113
5070a7532J716M430Q042J57o802k299j26j866O87M999O496K795p547J153K79m10
$$ plain form
5054 -5828 -3653 -2250 -1569 -3776 -4393 1190 6692 5075 10654 3648 -1978 -11391 -9892 -11891 -15560
5039 -15560 -11476 -12761 -11747 -13478 -14330 -20617 -23458 -21261 -15528 -9675 -12146 -13037 -23214 -23579 -14183
5024 -14183 -8151 -4543 -713 4037 -2766 -8877 -19360 -20035 -17990 -10104 -12433 -16898 -21455 -22305 -17082
5009 -17082 -10102 -7450 -7158 -9941 -12252 -12896 -24402 -25630 -20195 -14797 -13454 -10586 -13243 -10359 -873
4994 -873 3616 -4902 -6085 3165 6752 -2058 -6344 -1051 4679 1628 -2776 -497 3263 -6760 -20606
4979 -20606 -19031 -16066 -13479 -9188 -9120 -8414 -8025 -8455 -9551 -6841 -8217 -3914 -8089 -15907 -11973 -13048
4963 -13048 -13765 -12945 -10648 -2596 3760 -3292 -5266 -9115 -16920 -10282 -15295 -22249 -20116 -11849 -7481
4948 -7481 -980 -1479 2593 -8754 -23066 -18199 -13337 -15274 -17949 -18897 -14212 -7726 -3226 3983 9517
$$ packed form
5054e828K175J403O81k207o17N583N502j617N579p006n626r413J499j999l669
5039a5560M084j285J014j731q52o287k841K197N733N853k471q91j0177l65R396
5024a4183O032L608L830M750o803o111j0483o75K045P886k329m465m557q50N223
5009a7082O980K652K92k783k311o44j1506j228N435N398J343K868k657K884R486
4994h73M489q518j183R250L587q810m286N293N730l051m404K279L760j0023j3846
4979b0606J575K965K587M291O8P06L89m30j096K710j376M303m175p818L934j075
4963a3048p17Q20K297Q052O356p052j974l849p805O638n013o954K133Q267M368
4948g481O501m99M072j1347j4312M867M862j937k675r48M685O486M500P209N534
$$ plain form
4933 9517 5546 -4868 -4150 7749 14925 17379 9264 5396 7863 5956 -857 -8702 -8834 -8204 -11848
4918 -11848 -12525 -6826 -11085 -17508 -12330 -3147 -5503 -1922 -1406 -3382 -4060 589 7756 8697 8601 8906
4902 8906 -1197 -6022 -5181 -1002 2159 -3990 -14807 -22015 -27039 -29093 -34437 -29719 -16255 -14901
4888 -14901 -18579 -20214 -24060 -23122 -19118 -12253 -20524 -19061 -12924 -5029 -2963 -7660 -8109 2235 -3134
4873 -3134 -8359 -6227 -6720 -10491 -10852 -2160 2313 -2526 2995 -518 -9880 -12272 -10690 -13118 -14231
4858 -14231 -4765 3096 2206 -4771 -6860 -9634 -16304 -19754 -26107 -32074 -27261 -13497 5405 27408
4844 27408 42931 45310 44746 33826 20298 4909 -5438 -4960 -11018 -19084 -18807 -6078 3484 -8415
4830 -8415 -23924 -31290 -27361 -18353 -14233 -13075 -13254 -12581 -8715 -8020 -8283 -6602 -5250 -7715 -16807 -18840
$$ packed form
4933I517l971j0414P18J1899P176K454q115l868K467j907o813p845j32O30l644
4918a1848o77N699m259o423N178R183k356L581N16j976o78M649P167R41r6L05
4902H906j0103m825Q41M179L161o149j0817p208n024k054n344M718J3464J354
4888a4901l678j635l846R38M004O865q271J463O137P895K066m697m49J0344n369
4873c134n225K132m93l771l61Q692M473m839N521l513r362k392J582k428j113
4858a4231R466P861q90o977k089k774o670l450o353n967M813J3764J8902K2003
4844B7408J5523K379n64j0920j3528j5389j0347M78o058q066K77J2729R562j1899
4830h415j5509p366L929R008M120J158j79O73L866O95k63J681J352k465r092k033
$$ plain form
4814 -18840 -11062 -7172 -14469 -27140 -27233 -13822 3625 5073 -13916 -33145 -46792 -43549 -26427
4801 -26427 -249 14894 21195 27879 30579 35879 43877 28643 -5579 -28571 -44890 -46582 -41110
4788 -41110 -28926 -17860 -19664 -29788 -32332 -28694 -16561 -1947 3677 1793 3730 -5258 -9110
4775 -9110 -6251 1650 -1244 -6837 -14561 -17555 -15787 -10796 -8214 -3471 -4856 2360 12586 12001 3501
4760 3501 -11721 -13966 -9461 -2554 -3785 1260 8427 12875 23475 26343 21636 2687 -18459 -30711
4746 -30711 -37583 -38209 -20543 -5198 -8135 -14834 -10176 3016 7621 7358 -1076 -7763 -13425 -13400 -3060
4731 -3060 -163 -800 1400 621 -7389 -13462 -9286 -7285 -12648 -12425 -5828 -2858 -240 -5056 -8569 -9026
4715 -9026 -9363 -12302 -18244 -12541 -9931 -4922 -6332 -9403 -4500 -4400 -1541 -3367 -11958 -10497 -8782
$$ packed form
4814a8840P778L890p297j2671r3J3411J7447J448j8989j9229j3647L243J7122
4801b6427K6178J5143O301O684K700N300P998j5234l4222k2992j6319j692N472
4788d1110J2184J1066j804j0124k544L638J2133J4614N624j884J937q988l852
4775i110K859P901k894n593p724k994J768M991K582M743j385P216J0226n85q500
4760C501j5222k245M505O907j231N045P167M448J0600K868m707j8949k1146j2252
4746c0711o872o26J7666J5345k937o699M658J3192M605k63q434o687n662K5J0340
4731c060K897o37K200p79q010o073M176K001n363K23O597K970K618m816l513m57
4715i026l37k939n942N703K610N009j410l071M903J00K859j826q591J461J715
$$ plain form
4700 -8782 -6612 -575 -3200 -8178 -3983 -457 -10810 -16632 -16924 -13011 -12986 -15602 -16829 -18861 -27950
4685 -27950 -29687 -24312 -20265 -15400 -12298 -14500 -13681 -9664 -6773 -3072 -13842 -19289 -18727 -20064 -15918
4670 -15918 -13235 -11249 -7979 -13944 -14796 -10946 -13738 -27042 -29235 -17301 -10564 -8047 -7902 -5212 -5093
4655 -5093 -2908 -3858 -2415 -3324 -7098 -11179 -15118 -17571 -22316 -29640 -23803 -14707 -12868 -12174 -6480 -1004
4639 -1004 5286 2764 292 -1525 -3538 -1420 -694 2780 4931 557 3771 1446 -203 -3100 -8785
4624 -8785 -16663 -15893 -13508 -3987 -1388 -385 1331 -822 -9589 -7889 -7142 -7366 -6967 -7931 -15096 -20112
4608 -20112 -14124 -5410 -2519 -10489 -19652 -23565 -23908 -22930 -20539 -18700 -11678 -10163 -15260 -11857 -15523
4593 -15523 -17873 -14651 -3123 839 1453 -986 -7340 -20774 -28093 -36352 -36376 -31595 -27620 -15018 -177
$$ packed form
4700h782K170O037k625m978M195L526j0353n822k92L913K5k616j227k032r089
4685b7950j737N375M047M865L102k202Q19M017K891L701j0770n447N62j337M146
4670a5918K683J986L270n965q52L850k792j3304k193J1934O737K517J45K690J19
4655e093K185r50J443r09l774m081l939k453m745p324N837R096J839O94N694N476
4639a004O290k522k472j817k013K118P26L474K151m374L214k325j649k897n685
4624h785p878P70K385R521K599J003J716k153q767J700P47k24L99r64p165n016
4608b0112N988Q714K891p970r163l913l43R78K391J839P022J515n097L403l666
4593a5523k350L222J1528L962O14k439o354j3434p319q259k4M781L975J2602J4841
$$ plain form
4578 -177 3383 4859 13922 8994 -628 -2101 2529 219 1128 -4519 -4482 -7420 -16749 -15604 -20527 -12986
4562 -12986 -5844 -7723 -4842 -6916 -11036 -16272 -12528 -8948 -7518 -12226 -26205 -24123 -16131 -5761
4548 -5761 2174 3274 -3775 -10472 -20968 -11996 -4682 -4572 1147 4270 5911 14475 15941 13065 7264
4533 7264 -9399 -17716 -17814 -15141 -10549 -7649 -10157 -14120 -13810 -8965 -9459 -10057 -9720 -7580 -4026 -1391
4517 -1391 -6703 -8758 -3598 -4652 -13424 -8331 -6297 -7198 -6655 -8241 -7446 -4720 -11357 -15025 -17587 -21624
4501 -21624 -21098 -17965 -2684 -5076 -16990 -22852 -16980 -11608 -15529 -24216 -24194 -21398 -14900 -5590 -8486
4486 -8486 -1276 15 1124 -4251 -12473 -14415 -9030 -9341 -10967 -9404 -6838 -8361 -13351 -19005 -19671
4471 -19671 -20137 -13265 -8992 -10164 -16405 -15495 -15165 -17162 -8329 -8451 -9182 -9217 -11513 -8257 -8196 -6240 -5411
$$ packed form
4578a77L560J476R063m928r622j473M630k310R09n647L7k938r329J145m923P541
4562a2986P142j879K881k074m120n236L744L580J430m708j3979K082P992J0370
4548e761P935J100p049o697j0496Q972P314J10N719L123J641Q564J466k876n801
4533G264j6663q317r8K673M592K900k508l963L10M845m94n98L37K140L554K635
4517a391n312k055N160j054q772N093K034r01N43j586P95K726o637l668k562m037
4501b1624N26L133J5281k392j1914n862N872N372l921q687K2K796O498R310k896
4486h486P210J291J109n375q222j942N385l11j626J563K566j523m990n654o66
4471a9671m66O872M273j172o241R10L30j997Q833j22p31l5k296L256O1J956Q29
$$ plain form
4454 -5411 -3121 -3292 695 -202 -7952 -3841 489 3082 2789 9529 9082 2939 2190 -15064 -30853 -35531
4438 -35531 -32312 -29672 -22148 -24658 -24499 -9220 -6025 -15449 -13314 -9677 -14363 -19596 -20218 -12746 -9314
4423 -9314 -9300 -10631 -17420 -20884 -23138 -27116 -24432 -23270 -18748 -9378 -9782 -17867 -20962 -15311 -9997 -12278
4407 -12278 -14015 -9979 -7685 -14503 -23173 -19991 -20318 -21606 -13542 -10602 -12357 -12830 -12812 -10946 -1822 3050
4391 3050 1383 -364 -577 -9814 -16399 -21522 -20495 -14858 -20545 -15433 -12819 -13189 -9642 -8450 -2064
4376 -2064 -2789 -2777 -12531 -14737 -10242 -9812 -899 1469 -1684 -3783 -14048 -8345 434 -2394 -9254 -16083
4360 -16083 -15106 -10476 -14966 -22150 -17973 -20126 -21951 -22828 -24463 -28157 -26836 -23033 -24467 -28275 -23636
4345 -23636 -15865 -8625 -12272 -18749 -20912 -25630 -23340 -11605 -8517 -6657 2113 9717 8478 -1212
$$ packed form
4454e411K290j71L987q97p750M111M330K593k93O740m47o143p49j7254j5789m678
4438c5531L219K640P524k510J59J5279L195r424K135L637m686n233o22P472L432
4423i314J4j331o789l464k254l978K684J162M522R370m04q085l095N651N314k281
4407a2278j737M036K294o818q670L182l27j288Q064K940j755m73J8J866R124M872
4391C050j667j747k13r237o585n123J027N637n687N112K614l70L547J192O386
4376b064p25J2r754k206M495M30Q913K368l153k099j0265N703Q779k828o860o829
4360a6083R77M630m490p184M177k153j825q77j635l694J321L803j434l808M639
4345b3636P771P240l647o477k163m718K290J1735L088J860Q770P604j239r690
$$ plain form
4331 -1212 -8504 -11437 -5797 5304 9841 7184 8511 7131 -2433 -21666 -26587 -19371 -16726 -18013
4317 -18013 -20386 -19060 -17100 -6446 -163 -3041 -1005 -7425 -7485 -8704 -11584 -10195 -7778 -12989 -9316
4302 -9316 -3438 -5329 -2962 -8933 -15959 -21784 -23882 -20458 -18333 -16686 -15340 -13188 -11226 -13319 -13146
4287 -13146 -8257 -9233 -9775 -8162 -6826 -7463 -9985 -9041 -12884 -12831 -12380 -4956 -1637 -3706 -5605 -12390
4271 -12390 -23078 -19084 -16032 -14211 -1864 4194 698 -652 1134 8087 3889 -3169 1548 3929
4257 3929 -1247 -10142 -19464 -23813 -25875 -28793 -24015 -15825 -18439 -18346 -13737 -10838 -8809 -10516 -8237
4242 -8237 -3700 -3276 -13451 -19526 -13671 -13559 -16740 -12972 -13228 -13815 -17655 -13966 -11865 -14498 -25837
4227 -25837 -35099 -30189 -26334 -28895 -23594 -14424 -15128 -7988 -5679 -11958 -7464 -8546 -17958 -26124 -18924
$$ packed form
4331a212p292k933N640J1101M537k657J327j380r564j9233m921P216K645j287
4317a8013k373J326J960J0654O283k878K036o420o0j219k880J389K417n211L673
4302i316N878j891K367n971p026n825k098L424K125J647J346K152J962k093J73
4287a3146M889r76n42J613J336o37k522R44l843N3M51P424L319k069j899o785
4271a2390j0688L994L052J821J2347O058l496j350J786O953m198p058M717K381
4257C929n176q895r322m349k062k918M778Q190k614R3M609K899K029j707K279
4242h237M537M24j0175o075N855J12l181L768k56n87l840L689K101k633j1339
4227b5837r262M910L855k561N301R170p04P140K309o279M494j082r412q166P200
$$ plain form
4212 -18924 -12802 -9672 -6549 491 5130 -12111 -17958 -13321 -16450 -14885 -12289 -10118 -7564 -13650
4198 -13650 -15669 -17283 -14065 -11210 -18614 -20730 -18981 -21912 -16923 -11153 -6742 -2227 1717 -74 -6805
4183 -6805 -13120 -11156 -3596 -5045 -10056 -10110 -8416 -8430 -16880 -18834 -18034 -11644 -8494 -12406 -10716 -10679 -5180
4166 -5180 -2961 -3842 -356 2142 -3267 -3790 -4955 -4392 -4947 866 -4008 -6676 -3702 -5611 -6933 -11532
4150 -11532 -19332 -19080 -16024 -14332 -17655 -21896 -11325 -4176 7104 4139 -2770 -7868 -7393 3146
4136 3146 6727 -1048 229 -2699 -5699 -404 1665 1348 2370 535 -7678 -9800 -14984 -17667 -17029
4121 -17029 -14049 -15067 -16943 -14829 -14224 -14750 -6434 -3543 -5789 -5235 -9810 -13848 -18475 -23776 -21802
4106 -21802 -24549 -15339 -4736 -10477 -12253 -15668 -21358 -24047 -19576 -22481 -21263 -17979 -18685 -23287 -24663
$$ packed form
4212a8924O122L130L123P040M639j7241n847M637l129J565K596K171K554o086
4198a3650k019j614L218K855p404k116J749k931M989N770M411M515L944j791o731
4183f805o315J964P560j449n011n4J694j4q450j954Q00O390L150l912J690L7N499
4166e180K219q81L486K498n409n23j165N63n55N813m874k668K974j909j322m599
4150a1532p800K52L056J692l323m241J0571P149J1280k965o909n098M75J0539
4136C146L581p775J277k928l000N295K069l17J022j835q213k122n184k683O38
4121a7029K980j018j876K114O05n26Q316K891k246N54m575m038m627n301J974
4106b1802k747R210J0603n741j776l415n690k689M471k905J218L284p06m602j376
$$ plain form
4091 -24663 -30475 -20384 -7569 -9463 -4879 -6776 -10886 -7286 -6762 -4827 -7021 -10070 -10167 -8860 -15739
4076 -15739 -15561 -15610 -10837 -16337 -16849 -14799 -12777 -20490 -23703 -25314 -20221 -17348 -14269 -13445 -6545 -9916
4060 -9916 -16144 -11832 -4120 -5730 -4111 -3847 -12517 -19680 -15719 -12669 -13078 -7691 -4836 -2791 -3082 -1234
4044 -1234 -2220 -14812 -20724 -17649 -18443 -21156 -18659 -5290 1353 8175 4995 2962 -4305 -8391 -14996
4029 -14996 -19769 -17574 -10882 -9027 -4680 -3020 -8224 -10608 -9438 -10675 -10858 -7969 -15937 -18731 -17902
4014 -17902 -16039 -12790 -14634 -15355 -10450 -12065 -9758 -4534 -2077 -1902 -3282 -566 -10716 -16759 -14709
3999 -14709 -11164 -6927 -3884 -7299 -8969 -4577 4746 3295 -4074 -2715 6188 8084 8158 89 -429
3984 -429 -6524 -10687 -12166 -12248 -11290 -9462 -7943 -9029 -7259 -5036 1070 2841 -43 -9526 -10292 -3897
$$ packed form
4091b4663n812J0091J2815j894M584j897m110L600N24J935k194l049r7J307o879
4076a5739J78m9M773n500n12K050K022p713l213j611N093K873L079Q24O900l371
4060i916o228M312P712j610J619K64q670p163L961L050m09N387K855K045k91J848
4044a234r86j2592n912L075p94k713K497J3369O643O822l180k033p267m086o605
4029a4996m773K195O692J855M347J660n204k384J170j237j83K889p968k794Q29
4014a7902J863L249j844p21M905j615K307N224K457J75j380K716j0150o043K050
3999a4709L545M237L043l415j670M392R323j451p369J359Q903J896P4q069n18
3984d29o095m163j479q2R58J828J519j086J770K223O106J771k884r483p66O395
$$ plain form
3968 -3897 93 -3332 -11691 -18797 -19408 -21122 -19455 -18375 -18697 -18137 -12791 -9704 -5404 -6236 -3885 -6104
3952 -6104 -3122 -2809 -2498 -929 -9787 -19223 -21307 -22979 -23539 -14709 -12353 -9477 -10782 -19132 -21429 -25648
3936 -25648 -15330 -11745 -12526 -17637 -19073 -15719 -10197 -3779 -2794 -6539 -651 -1167 -6638 -5813 -6465 -12604
3920 -12604 -11926 -10030 -11805 -15693 -19492 -17517 -16718 -19151 -18174 -13731 -22228 -24548 -21055 -22054 -30585 -28637
3904 -28637 -27238 -21486 -11112 -8775 -9851 -15312 -22603 -29137 -27243 -20312 -16157 -17653 -14018 -11368
3890 -11368 -16059 -12796 -5540 -3743 -10207 -7874 3918 3396 -1091 -5197 -7151 -6535 -1544 -828 4441
3875 4441 4146 -3498 -4804 -6265 -2331 4022 6612 1419 -7445 -12601 -10705 -2643 -6024 -11982 -18075
3860 -18075 -17307 -7795 -11228 -14681 -19370 -13795 -11184 -15735 -17910 -11679 -12996 -13503 -11848 -12251 -3328
$$ packed form
3968c897L990l425q359p106o11j714J667J080l22N60N346L087M300q32K351k219
3952f104K982L13L11J569q858r436k084j672n60Q830K356K876j305q350k297m219
3936b5648J0318L585p81n111j436L354N522O418R85l745N888n16n471Q25o52o139
3920a2604O78J896j775l888l799J975P99k433R77M443q497k320L493r99q531J948
3904b8637J399N752J0374K337j076n461p291o534J894O931M155j496L635K650
3890a1368m691L263P256J797o464K333J1792n22m487m106j954O16M991P16N269
3875D441k95p644j306j461L934O353K590n193q864n156J896Q062l381n958o093
3860a8075P68R512l433l453m689N575K611m551k175O231j317n07J655m03Q923
$$ plain form
3845 -3328 4118 2634 -929 1073 -3865 -5188 -5771 -3324 -1878 -702 -448 -1019 903 -8000 -7651 -11270
3829 -11270 -26748 -26576 -24544 -17623 -11083 -8965 -12550 -16942 -23211 -31863 -29496 -22323 -12137 -11694 -6583
3814 -6583 -8645 -14805 -16412 -7464 -6865 -11444 -15471 -16975 -22568 -21905 -18600 -15767 -16304 -18428 -16199 -17329
3798 -17329 -18168 -14396 -11500 -9741 -17030 -17622 -16906 -11529 -10127 -12980 -18735 -27254 -32656 -31579 -23645
3783 -23645 -11950 -10817 -12356 -18079 -12565 -9900 -10275 -7284 -10588 -15050 -24005 -25469 -24046 -25176 -25574
3768 -25574 -20436 -15580 -22326 -21474 -9089 -3370 4503 5705 -828 -3855 838 284 2703 3825 -171
3753 -171 -9987 -23486 -19865 -13902 -8589 -12768 -15995 -13473 -7972 -9741 -15998 -10524 -7390 -6788 -11190
3738 -11190 -18552 -18604 -21783 -12117 -8192 -8430 -3275 -3775 -7611 -11805 -10527 -6271 161 4088 6404 9485
$$ packed form
3845c328P446j484l563K002m938j323n83K447J446J176K54n71J922q903L49l619
3829a1270j5478J72K032O921O540K118l585m392o269q652K367P173J0186M43N111
3814f583k062o160j607Q948N99m579m027j504n593O63L305K833n37k124K229j130
3798a7329q39L772K896J759p289n92P16N377J402k853n755q519n402J077P934
3783b3645J1695J133j539n723N514K665l75K991l304m462q955j464J423j130l98
3768b5574N138M856o746Q52J2385N719P873J202o533l027M693n54K419J122l996
3753a71r816j3499L621N963N313m179l227K522N501j769o257N474L134O02m402
3738a1190p362n2l179R666L925k38N155n00l836m194J278M256O432L927K316L081
$$ plain form
3722 9485 5656 1426 -754 -5919 -14075 -22936 -24206 -23655 -21265 -17583 -11629 -4035 3148 5150 1773
3707 1773 1599 -2409 -7021 -8142 -15419 -10411 -5659 -4084 -5293 -7266 -11821 -6625 -11033 -17233 -18520
3692 -18520 -8322 3471 9455 2911 -801 -1808 6108 3751 -41 -7736 -7090 -13664 -14395 -7330 -3855
3677 -3855 1363 -162 -11607 -20001 -17419 -13992 -12802 -12760 -10870 -4192 -3937 -5507 -6796 -10028 -7886
3662 -7886 -3402 -7366 -4917 -6347 -13089 -15498 -20684 -26718 -20694 -14421 -7229 -10694 -7092 -7574 -10445
3647 -10445 -12597 -15790 -14041 -5261 -284 1245 2851 4896 1487 2848 -4212 -8557 -10766 -13246 -12762
3632 -12762 -16598 -18785 -14439 -5951 677 8878 8917 9401 8736 -559 -3366 -3061 -12619 -19549 -16228 -15247
3616 -15247 -15588 -10972 -6016 -3800 -2724 -6100 -3207 -5522 -2306 -1349 -3140 -715 -3280 -5335 -11052
$$ packed form
3722I485l829m230k180n165q156q861j270N51K390L682N954P594P183K002l377
3707A773j74m008m612j121p277N008M752J575j209j973m555N196m408o200j287
3692a8520J0198J1793N984o544l712j007P916k357l792p695O46o574p31P065L475
3677c855N218j525j1445q394K582L427J190M2J890O678K55j570j289l232K142
3662g886M484l964K449j430o742k409n186o034O024O273P192l465L602m82k871
3647a0445k152l193J749Q780M977J529J606K045l409J361p060m345k209k480M84
3632a2762l836k187M346Q488O628Q201L9M84o65r295k807L05r558o930L321R81
3616a5247l41M616M956K216J076l376K893k315L216R57j791K425k565k055n717
$$ plain form
3601 -11052 -15001 -13850 -11039 -8444 -10846 -10723 -5778 -5822 -519 -290 -3440 -7744 -5309 2371 5116 -2599
3585 -2599 -9009 -5158 -98 -5868 -15603 -17128 -20681 -27330 -20533 -11598 -7364 -1319 4646 -2671 -11321
3570 -11321 -19318 -18428 -8904 -5818 -12280 -10963 -3442 -5652 -17747 -17886 -25541 -32691 -28939 -28468 -27695
3555 -27695 -26097 -16626 -9761 -15753 -23610 -19710 -19309 -21848 -21536 -25217 -20914 -9939 -3062 -6191 -14336
3540 -14336 -16545 -12409 -9355 -6549 -9780 -8090 -10202 -10814 -8711 -8544 -14674 -12874 -15099 -12337 -15790
3525 -15790 -20210 -10709 -14481 -22439 -24814 -22273 -10829 -5765 -9545 -9974 -9991 -14573 -16213 -10565 -7157
3510 -7157 -7821 -6663 -1834 1708 5116 -61 2898 13614 16683 17986 8568 -4743 -6209 -8268 -2878
3495 -2878 -3950 -3606 -8578 -11740 -7002 -3438 -2640 -4817 -11492 -17867 -11315 -6879 -5198 -3714 -9612
$$ packed form
3601a1052l949J151K811K595k402J23M945m4N303K29l150m304K435P680K745p715
3585b599o410L851N060n770r735j525l553o649O797Q935M234O045N965p317q650
3570a1321p997Q90R524L086o462J317P521k210j2095j39p655p150L752M71P73
3555b7695J598R471O865n992p857L900M01k539L12l681M303J0975O877l129q145
3540a4336k209M136L054K806l231J690k112o12K103J67o130J800k225K762l453
3525a5790m420R501l772p958k375K541J1444N064l780m29j7m582j640N648L408
3510g157o64J158M829L542L408n177K959J0716L069J303r418j3311j466k059N390
3495b878j072L44m972l162M738L564P98k177o675o375O552M436J681J484n898
$$ plain form
3480 -9612 -15468 -9065 -3713 2000 -3626 -7599 -9632 -12167 -10516 576 -1170 -679 5071 1650 -1142
3465 -1142 -269 4765 3076 -1664 -1476 -2415 -5534 -6482 -2527 189 -4063 -11838 -9039 -13461 -17829 -12717
3449 -12717 -12854 -15126 -8740 -97 590 -138 4781 3807 8018 9627 1855 -9945 -11785 -7298 -12676
3434 -12676 -14030 -13078 -13203 -5534 -6363 -8542 -9090 -8858 -7421 -8172 -6963 -9005 -19780 -20339 -9894 -4431
3418 -4431 -7430 -10406 -11596 -15068 -12827 -16780 -21963 -10475 -4450 -3658 -10025 -8078 -2759 -3322 -2858
3403 -2858 -3043 -2568 -3304 -3960 -9558 -10642 -9430 -11565 -12555 -3702 -1241 -4546 -7063 -8413 -5553 -1703
3387 -1703 9474 6785 -5297 -10973 -16345 -17525 -19071 -22539 -23024 -20823 -14019 -11846 -14445 -8367 -3651
3372 -3651 -5691 -8063 -11375 -7944 -10236 -18028 -17086 -12976 -17574 -20383 -17293 -12852 -7561 -4198 -313
$$ packed form
3480i612n856O403N352N713n626l973k033k535J651J1092j746M91N750l421k792
3465a142Q73N034j689m740J88r39l119r48L955K716m252p775K799m422m368N112
3449a2717j37k272O386Q643O87p28M919r74M211J609p772j1800j840M487n378
3434a2676j354R52j25P669q29k179n48K32J437p51J209k042j0775n59J0445N463
3418d431k999k976j190l472K241l953n183J1488O025P92o367J947N319n63M64
3403b858j85M75p36o56n598j084J212k135r90Q853K461l305k517j350K860L850
3387a703J1177k689j2082n676n372j180j546l468m85K201O804K173k599O078M716
3372c651k040k372l312L431k292p792R42M110m598k809L090M441N291L363L885
$$ plain form
3357 -313 -425 -2955 2836 -4993 -3440 -4694 -5081 -599 1631 1580 1952 -6946 -10223 -9480 -4993 -8070 -16158
3340 -16158 -15024 -10034 -14380 -7390 -8883 -16124 -9334 43 5177 2327 -5604 -13311 -14807 -9875 -4184
3325 -4184 -4841 -1787 566 -4290 -6007 94 3244 1929 3153 -595 -4037 -10171 -11868 -3049 1636
3310 1636 -3269 -8746 -414 1296 -7858 -6264 3732 -270 5966 6040 -5636 -6224 -3509 -4946 -4597 -12833
3294 -12833 -15899 -12668 -21509 -21891 -22950 -21145 -19556 -22986 -21177 -19703 -11343 -5277 -7200 -10327 -9371
3279 -9371 -5018 -2649 -4919 -9118 -11531 -11736 -9675 -7090 -5466 -548 1865 4755 4668 604 -5120 -4218
3263 -4218 -8659 -14415 -13722 -10367 -5066 -3948 -9226 -9189 -8132 -11906 -11468 -5876 928 -4748 -12655 -11475
3247 -11475 -8203 -12222 -12355 -13006 -7066 -10405 -12518 -9592 -7313 -3758 6366 2088 -8469 -17365 -15104
$$ packed form
3357c13j12k530N791p829J553j254l87M482K230n1L72q898l277P43M487l077q088
3340a6158J134M990m346O990j493p241O790R377N134k850p931p707j496M932N691
3325d184o57L054K353m856j717O101L150j315J224l748l442o134j697Q819M685
3310A636m905n477Q332J710r154J594R996m002O236P4j1676n88K715j437L49q236
3294a2833l066L231q841l82j059J805J589l430J809J474Q360O066j923l127R56
3279i371M353K369k270m199k413k05K061K585J624M918K413K890q7m064n724R02
3263d218m441n756O93L355N301J118n278L7J057l774M38N592O804n676p907J180
3247a1475L272m019j33o51N940l339k113K926K279L555J0124m278j0557q896K261
$$ plain form
3232 -15104 -8492 -7350 -14614 -23335 -19552 -7549 -3450 5241 8242 7858 8591 1138 -2397 -7519 -12843
3217 -12843 -14738 -11067 -10360 -10382 -2763 -1713 -6706 -10238 -15443 -12618 -12185 -13590 -9715 -7947 -2032 -3559
3201 -3559 382 -1151 -8483 -13016 -7271 3145 5393 -3867 -9994 -16528 -13366 -6883 1921 3744 3380
3186 3380 7139 4576 1989 962 2735 5348 -1295 -587 -1112 -2189 -5489 -11717 -12214 -15651 -20407 -14799
3170 -14799 -8434 -6639 -10260 -11425 -11168 -15101 -22215 -18225 -10970 -9205 -7648 -4929 -836 -4196 -7257
3155 -7257 -7306 -6728 -8425 -11213 -12586 -14018 -13401 -12294 -15383 -15882 -9587 -10420 -6962 -8821 -9202 -2856 -7421
3138 -7421 -7732 -2825 961 1071 3 3968 1462 451 2934 5118 5960 -2985 -1838 -842 -3001 -1990
3122 -1990 -8394 -11954 -11448 -13581 -13096 -9936 1058 4718 5211 2295 -1693 2974 441 -6677 -11058
$$ packed form
3232a5104O612J142p264q721L783J2003M099Q691L001l84P33p453l535n122n324
3217a2843j895L671P07k2P619J050m993l532n205K825M33j405L875J768N915j527
3201c559L941j533p332m533N745J0416K248r260o127o534L162O483Q804J823l64
3186C380L759k563k587j027J773K613o643P08n25j077l300o228m97l437m756N608
3170a4799O365J795l621j165K57l933p114L990P255J765J557K719M093l360l061
3155g257m9N78j697k788j373j432O17J107l089m99O295q33L458j859l81O346m565
3138g421l11M907L786J10j068L965k506j011K483K184Q42q945J147R96k159J011
3122a990o404l560N06k133M85L160J0994L660M93k916l988M667k533p118m381
$$ plain form
3107 -11058 -8701 -9881 -10986 -8620 -14256 -13119 -1766 7608 2332 -4041 -8351 -5956 -875 -669 -3515
3092 -3515 -7423 -13132 -14980 -12636 -11316 -11653 -439 3044 -2767 2941 3688 -2505 -5503 30 2618
3077 2618 1897 2642 -1937 -8385 -6293 -3829 -4847 -3867 -6675 -5775 -5560 -10264 -15673 -10864 -6627 -5480
3061 -5480 -6022 2941 5556 -809 -4030 -1520 -3970 2251 4548 1080 -2014 -8881 -6180 -3663 -11252
3046 -11252 -13399 -3796 1619 -1042 -8385 -13473 -9210 -7304 -10149 -5472 -10034 -18266 -8148 547
3032 547 -1488 -6802 -11918 -22666 -14028 -10511 -15683 -15734 -9934 -8053 -12615 -8411 -1075 -1408 -6927 -6906
3016 -6906 -66 9945 6264 3085 3570 -4676 -520 2911 -7249 -14819 -11112 -13632 -12232 -14576 -12217
3001 -12217 -9295 -15414 -22381 -16572 -20521 -21877 -21332 -17231 -14771 -12375 -11456 -5398 -3224 -3557 -9413
$$ packed form
3107a1058K357j180j105K366n636J137J1353R374n276o373m310K395N081K06k846
3092c515l908n709j848K344J320l37J1214L483n811N708P47o193k998N533K588
3077B618p21P45m579o448K092K464j018R80k808R00K15m704n409M809M237J147
3061e480n42Q963K615o365l221K510k450O221K297l468l094o867K701K517p589
3046a1252k147R603N415k661p343n088M263J906k845M677m562q232J0118Q695
3032E47k035n314n116j0748Q638L517n172n1N800J881m562M204P336l33n519K1
3016f906O840J0011l681l179M85q246M156L431j0160p570L707k520J400k344K359
3001a2217K922o119o967N809l949j356N45M101K460K396R19O058K174l33n856
$$ plain form
2986 -9413 -2822 -91 -5415 -8820 -7579 -7030 -9310 -15125 -18755 -11457 -5725 -6299 -12611 -14335 -10555
2971 -10555 -7923 -11452 -12877 -8139 -695 -4263 -6060 -1711 1149 -1594 -3278 -873 2492 -9086
2957 -9086 -10834 -2394 868 -688 -2230 -13653 -12463 -9673 -6907 -9575 -5389 -3774 -9053 -4228 -8712
2942 -8712 -14482 -13186 -9357 -2240 -328 -883 -4793 -7698 -7831 -8408 -11479 -4645 -609 -1099 -12201 -16362
2926 -16362 -7511 1190 5668 6729 5058 -2991 -10539 -18465 -19320 -18228 -18081 -12843 -10899 -8649 -3868
2911 -3868 -4321 2051 1992 -3364 -4031 -2987 -2581 -6066 -8428 -4796 -2419 -3855 -4320 -6206 -3716 1839
2895 1839 3514 -5387 -5555 -3797 -4957 -5807 -5879 -8367 -12967 -6095 -8780 -10191 -8563 -8513 -3204 -705
2879 -705 339 2863 -6237 -10723 -15324 -22312 -25281 -27033 -13260 -7066 -12514 -12963 -16283 -13721 -13984
$$ packed form
2986i413O591K731n324l405J241N49k280n815l630P298N732n74o312j724L780
2971a0555K632l529j425M738P444l568j797M349K860k743j684K405L365j1578
2957i086j748Q440L262j556j542j1423J190K790K766k668M186J615n279M825m484
2942h712n770J296L829P117J912n55l910k905j33n77l071O834M036m90j1102m161
2926a6362Q851Q701M478J061j671q049p548p926q55J092J47N238J944K250M781
2911c868m53O372n9n356o67J044M06l485k362L632K377j436m65j886K490N555
2895A839J675q901j68J758j160q50p2k488m600O872k685j411J628N0N309K499
2879g05J044K524r100m486m601o988k969j752J3773O194n448m49l320K562k63
$$ plain form
2864 -13984 -13988 -19449 -11702 -7739 -11390 -10131 -3994 -4267 -5036 -4658 -6726 615 561 -3538 -1259 4342 7763
2847 7763 3238 -507 1506 428 -27 -1509 -5609 -3185 -111 2410 4116 -5000 -5480 -1806 -1803 -3917
2831 -3917 -238 3637 837 -4864 -11390 -18832 -22633 -20239 -12328 -8134 -11369 -11512 -7184 -5124 -12238
2816 -12238 -16371 -11586 -2315 -7405 -8986 -9016 -11632 -10175 -9283 -15636 -17373 -21457 -14358 4171 4200 -2953
2800 -2953 -3408 -839 -5663 -6201 -9809 -2806 -4496 -9363 -12608 -10690 -2191 7484 552 -9637 -12264
2785 -12264 -7125 -10399 -13340 -13355 -15203 -10886 -4051 -6940 -7187 -3132 -3083 -7465 -5358 -6885 -5406 -3400
2769 -3400 -3479 -7202 -6832 -11411 -6748 -224 -3046 -4816 -2576 -5485 -10839 -13241 -11144 -9610 -10876 -16735
2753 -16735 -14657 -14947 -17419 -10083 -4616 743 -85 493 2688 5755 6754 3675 -1145 3537 -681 -2272
$$ packed form
2864a3984mn461P747L963l651J259O137k73p69L78k068P341n4m099K279N601L421
2847G763m525l745K013j078m55j482m100K424L074K521J706r116m80L674Lk114
2831c917L679L875k800n701o526p442l801K394P911M194l235j43M328K060p114
2816a2238m133M785R271n090j581l0k616J457Q92o353j737m084P099J8529K9p153
2800b953m55K569m824n38l608P003j690m867l245J918Q499R675o932j0189k627
2785a2264N139l274k941j5j848M317O835k889k47M055M9m382K107j527J479K006
2769c400p9l723L70m579M663O524k822j770K240k909n354k402K097J534j266n859
2753a6735K078k90k472P336N467N359q28N78K195L067R99l079m820M682m218j591
$$ plain form
2737 -2272 -2122 -11732 -11752 -10934 -12730 -9196 -3564 -11093 -15457 -8060 4038 2113 1296 5405 11243 7340
2721 7340 336 -2282 -9464 -15942 -14898 -14083 -18397 -27317 -27546 -19187 -16445 -20988 -15375 -5462 2737
2706 2737 -86 5114 5822 1425 -7532 -15045 -23492 -22799 -20215 -14734 -2821 -703 -1500 -7788 -8850
2691 -8850 -2444 -7063 -11867 -10772 -14105 -13566 -9733 -8137 -11056 -18843 -24279 -20258 -14597 -24559 -25517
2676 -25517 -18044 -7981 -3925 -1351 8830 9857 5874 1141 -5411 -7561 -2597 -891 4515 16312
2662 16312 12612 10283 9541 5860 -2302 -3148 -2823 -3720 -6887 -7236 -8252 -9558 -10892 -8686 -7851 -12063
2646 -12063 -14407 -5401 4767 2765 -6515 -10322 -6395 -2056 -2076 -3173 -3234 -4398 -7972 -5699 20
2631 20 -6167 -5648 262 1877 -3863 -8299 -5423 -9414 -10510 -6140 -398 -6865 -3371 3219 5041 8258
$$ packed form
2737b272J50r610k0Q18j796L534N632p529m364P397J2098j925q17M109N838l903
2721G340p004k618p182o478J044Q15m314q920k29Q359K742m543N613R913Q199
2706B737k823N200P08m397q957p513q447O93K584N481J1913K118p97o288j062
2691h850O406m619m804J095l333N39L833J596k919p787n436M021N661r962r58
2676b5517P473J0063M056K574J0181J027l983m733o552k150M964J706N406J1797
2662A6312l700k329p42l681q162q46L25q97l167l49j016j306j334K206Q35m212
2646a2063k344R006J0168k002r280l807L927M339k0j097o1j164l574K273N719
2631B0o187N19N910J615n740m436K876l991j096M370N742o467L494O590J822L217
$$ plain form
2615 8258 6294 10681 15138 3656 -2551 -348 6046 4969 8272 5426 5268 7313 3032 -7075 -20887
2600 -20887 -18492 -9531 -2002 -2167 -757 707 5602 7426 11794 11057 7551 10532 7467 4851 9649
2585 9649 -2563 -22552 -23555 -12096 -1862 6102 -3905 -9276 -8981 -24991 -28543 -16910 -4531
2572 -4531 2642 -3893 -12349 -12251 -11840 -10953 860 5005 459 -5870 -11866 -10531 -12789 -3426 9819
2557 9819 16267 20373 19053 8606 -225 -1251 -304 -1120 -8234 -10743 -15722 -19124 -9372 -3022 5139
2542 5139 509 -4992 2027 4871 566 3004 -3450 -5432 -6988 -4775 -9820 -16209 -15833 -12668 -10119
2527 -10119 -4989 1427 3577 -9608 -12039 -7133 -96 296 -4742 -6219 -7603 -6368 -3151 -6408 -8740
2512 -8740 -10637 -18279 -21376 -17258 -15848 -4753 7919 13722 5470 -1779 -9095 -9994 -5356 -6216 -6477
$$ packed form
2615H258j964M387M457j1482o207K203O394j077L303k846j58K045m281j0107j3812
2600b0887K395Q961P529j65J410J464M895J824M368p37l506K981l065k616M798
2585I649j2212j9989j003J1459J0234P964j0007n371K95j6010l552J1633J2379
2572d531P173o535q456R8M11Q87J1813M145m546o329n996J335k258R363J3245
2557I819O448M106j320j0447q831j026R47q16p114k509m979l402R752O350Q161
2542E139m630n501P019K844m305K438o454j982j556K213n045o389L76L165K549
2527a0119N130O416K150j3185k431M906P037L92n038j477j384J235L217l257k332
2512h740j897p642l097M118J410J1095J2672N803q252p249p316q99M638q60k61
$$ plain form
2497 -6477 -6011 -10426 -15131 -10093 -3078 -920 -3926 4335 8295 3476 -1583 201 3448 806 -4244
2482 -4244 6884 13580 11274 -3381 -7328 -5540 1069 4591 12930 10533 -3110 -5305 -2946 422
2468 422 4322 2971 -1127 -4295 -8072 -10297 -3399 -4235 -2462 -130 -1753 -7545 -12982 -14050 -15580
2453 -15580 -13190 -11645 -5323 -2169 -527 -5981 -12643 -13147 -441 3291 -494 -3089 -2355 -6499 -6934
2438 -6934 -4180 4394 6708 4030 3677 3456 -2017 -5452 -3661 -9698 -9072 -3784 3833 -1559 419 -2215
2422 -2215 -3299 -1641 -810 -5764 -1845 -3266 -6670 -6108 -4027 -2695 -2423 -2806 3022 17350 15617 13868
2406 13868 11757 8083 8894 8911 1026 -4749 -1338 -2361 -3093 -4370 -9972 -14011 -10720 -471 -977 3149
2390 3149 7020 6554 4657 -366 1305 -4878 -7609 -2624 1006 -2689 75 -1515 -2217 -7819 -1278
$$ packed form
2497f477M66m415m705N038P015K158l006Q261L960m819n059J784L247k642n050
2482d244J1128O696k306j4655l947J788O609L522Q339k397j3643k195K359L368
2468D22L900j351m098l168l777k225O898q36J773K332j623n792n437j068j530
2453a5580K390J545O322L154J642n454o662n04J2706L732l785k595P34m144m35
2438f934K754Q574K314k678l53k21n473l435J791o037O26N288P617n392J978k634
2422b215j084J658Q31m954L919j421l404N62K081J332K72l83N828J4328j733j749
2406A3868k111l674Q11J7p885n775L411j023p32j277n602m039L291J0249n06M126
2390C149L871m66j897n023J671o183k731M985L630l695K764j590p02n602O541
$$ plain form
2375 -1278 -1519 -7328 -7376 -2231 -9547 -11603 -7950 -2230 -1412 -2930 -6891 -15085 -18833 -9027 2431 4372
2359 4372 7745 12026 7501 -1723 -8129 -3476 2036 4273 7384 13593 10525 2261 -949 -3532 -4106
2344 -4106 -11254 -12263 -9235 -3451 1678 -129 248 1901 -4652 -5703 -5925 -6344 -1398 1813 -2143 -9
2328 -9 811 4304 -2703 -3691 6801 3414 -3732 4331 6268 -4082 -7124 -3960 -1478 -10250 -7593 -7547
2312 -7547 -9610 -2792 2830 -4577 -9023 -5804 -9781 -14579 -10850 -15749 -20567 -13660 959 5930 2970
2297 2970 1596 -1642 -9073 -6215 -5393 -1991 5753 6516 4047 1458 5704 3092 -4011 -539 -720 1232
2281 1232 944 -510 -963 -5831 -6866 1312 4586 -5990 -11472 -13294 -14225 -6110 923 1276 -887 -610
2265 -610 440 -6194 -8678 -13932 -17766 -11451 -597 3915 7891 2331 2753 4172 1037 -1685 -7316
$$ packed form
2375a278k41n809m8N145p316k056L653N720Q18j518l961q194l748R806J1458J941
2359D372L373M281m525r224o406M653N512K237L111O209l068q264l210k583n74
2344d106p148j009L028N784N129j807L77J653o553j051k22m19M946L211l956K134
2328iQ20L493p007r88J0492l387p146Q063J937j0350l042L164K482q772K657M6
2312g547k063O818N622p407m446L219l977m798L729m899m818O907J4619M971k960
2297B970j374l238p431K858Q22L402P744P63k469k589M246k612p103L472j81J952
2281A232k88j454m53m868j035Q178L274j0576n482j822r31Q115P033L53k163K77
2265f10J050o634k484n254l834O315J0854M512L976n560M22J419l135k722n631
$$ plain form
2250 -7316 -10887 -6663 -2815 -5964 -12442 -8891 -2348 -3394 -6636 -2593 1231 -4829 -8433 -3912 -1118
2235 -1118 2806 -1041 -829 -7177 -10276 -12134 -8909 2013 1290 -2511 -148 4120 -3119 -12177 -23372
2220 -23372 -30989 -31006 -23947 -15331 -2357 509 -2266 -8900 -9736 -10654 -11837 -2085 280 -4808 899
2205 899 6028 2706 287 -1385 -5589 -8133 1736 4703 2748 -9061 -11684 -16546 -23540 -27280 -28219
2190 -28219 -22345 -13254 -12302 -11597 -1957 5738 5239 -20 954 940 4578 10833 7480 4548 11832 9455
2174 9455 5059 4364 -2726 724 1203 -5451 -11882 -8986 -5134 2187 2533 2115 5646 2310 -7787 -7214
2158 -7214 -3784 -4111 -3563 -4332 -8113 -21928 -26781 -19211 -8894 -5002 -5439 -1774 -2443 -7300 -5150 -455
2142 -455 -8854 -10897 -8203 -7857 867 11647 6531 5543 1627 634 6293 11578 20380 22351 18350 14755
$$ packed form
2250g316l571M224L848l149o478L551O543j046l242M043L824o060l604M521K794
2235a118L924l847K12o348l099j858L225J0922p23l801K363M268p239r058j1195
2220b3372p617j7P059Q616J2974K866k775o634q36r18j183R752K365n088N707
2205H99N129l322k419j672m204k544R869K967j955j1809k623m862o994l740r39
2190b8219N874R091R52P05R640P695m99n259R74j4L638O255l353k932P284k377
2174I455m396o95p090L450M79o654o431K896L852P321L46m18L531l336j0097N73
2158g214L430l27N48p69l781j3815m853P570J0317L892m37L665o69m857K150M695
2142d55q399k043K694L46Q724J0780n116r88l916r93N659N285Q802J971m001l595
$$ plain form
2126 14755 12728 9770 4464 1158 -1044 -3035 -5523 -1013 -3740 -7787 -6282 -1016 19 -6761 -7007
2111 -7007 -170 -456 -11408 -20911 -25370 -27275 -15108 -6535 -4233 -6768 -14086 -10660 -6067 -3512 -11078
2096 -11078 -10904 -6626 -4160 2684 -1415 -3664 -908 -371 -7047 -10983 -9927 -7582 -3338 -1726 -4805
2081 -4805 -1331 -1189 -10185 -11978 -1339 -526 -1442 6724 8394 3823 7406 6476 -1834 -3163 5904 4490
2065 4490 5503 8417 7880 8443 4184 -1253 -39 -515 -2599 834 4612 -2505 -9352 -13530 -10984 -8809
2049 -8809 3570 7141 3410 3051 2211 -3505 -6864 -4893 -2684 2126 9255 16239 15652 15834 7393 3384
2033 3384 -5432 -7667 -1313 1699 937 5894 9464 7359 3909 -2102 -6225 -700 -2882 -2257 2559
2018 2559 11188 7199 8119 10239 9923 16116 16293 16295 12852 13873 9824 10100 9160 8611 4782 6434 1975
$$ packed form
2126A4755k027k958n306l306k202j991k488M510k727m047J505N266J035o780k46
2111g007O837k86j0952r503m459j905J2167Q573K302k535p318L426M593K555p566
2096a1078J74M278K466O844m099k249K756N37o676l936J056K345M244J612l079
2081d805L474J42q996j793J0639Q13r16Q166J670m571L583r30q310j329R067j414
2065D490J013K914n37N63m259n437J214m76k084L433L778p117o847m178K546K175
2049h809J2379L571l731l59q40n716l359J971K209M810P129O984n87J82q441m009
2033C384q816k235O354L012p62M957L570k105l450o011m123N525k182O25M816
2018B559Q629l989R20K120l16O193J77Kl443J021m049K76r40n49l829J652m459
$$ plain form
2001 1975 -1228 -2010 -1773 -7676 -2612 -5436 -7382 -3954 4599 -1461 -4816 -818 -931 3871 15110
1986 15110 6900 216 2782 3462 5104 -37 -585 8758 11074 11061 5641 336 1275 2521 1319 -3427
1970 -3427 -2099 -1396 -881 -609 -5187 3103 9397 9535 9963 8105 12125 10014 2880 2276 -2700 -5346
1954 -5346 -6815 -9339 -5345 -3038 -5779 -1933 3020 6162 -239 2287 5021 9634 9455 1057 -2682
1939 -2682 1034 5764 10433 7349 2996 896 1359 5088 8346 3497 -1326 -2298 3523 4782 6025
1924 6025 8033 3144 -5716 -13395 -12619 -4332 -3016 -621 3182 1334 -5919 3112 5371 2315 3439
1909 3439 1232 -494 -4182 -8301 -3029 1550 -1147 1121 1791 -6173 -11074 -5058 -941 -2920 -6062
1894 -6062 -1175 2722 8670 7881 -1382 -6537 -10559 -705 4670 -850 -14400 -10034 727 2214 1434
$$ packed form
2001A975l203p82K37n903N064k824j946L428Q553o060l355L998j13M802J1239
1986A5110q210o684K566O80J642n141n48R343K316j3n420n305R39J246j202m746
1970c427J328P03N15K72m578Q290O294J38M28j858M020k111p134o04m976k646
1954e346j469k524L994K307k741L846M953L142o401K526K734M613j79q398l739
1939b682L716M730M669l084m353k100M63L729L258m849m823r72N821J259J243
1924F025K008m889q860p679P76Q287J316K395L803j848p253R031K259l056J124
1909C439k207j726l688m119N272M579k697K268O70p964m901O016M117j979l142
1894f062M887L897N948p89r263n155m022R854N375n520j3550M366J0761J487p80
$$ plain form
1879 1434 -1455 -554 9003 16756 19027 10873 4624 1854 1261 2862 13754 17752 8316 4962 2781
1864 2781 2494 3782 -249 -579 -4756 -13554 -4865 -4788 -11607 -4887 1433 2120 155 -2123 5601 12754
1848 12754 9895 3672 1632 -2113 -745 -290 -2692 1524 7542 5005 8792 10906 1663 -2837 -2537
1833 -2537 163 3397 5395 4890 5212 3324 1058 -1431 -3746 -1049 3456 6724 5961 9114 12113 7042
1817 7042 3392 2199 -2019 -4509 -4417 -5013 -8804 -5700 -4535 2349 4573 9055 8691 3548 5921 2850
1801 2850 4489 6446 8098 9892 14310 8107 1368 -2615 -2829 -7841 -11437 -4376 4118 8077 -3238
1786 -3238 -5288 -1733 -397 2593 -790 -1210 -4072 730 3676 1152 -3782 -5541 -667 3226 4962
1771 4962 5833 6637 1277 -3868 1854 7798 3124 -2351 5168 6590 7061 10971 11074 3984 4748 -1347
$$ packed form
1879A434k889R01R557P753K271q154o249k770n93J601J0892L998r436l354k181
1864B781k87J288m031l30m177q798Q689P7o819O720O320O87j965k278P724P153
1848A2754k859o223k040l745J368M55k402M216O018k537L787K114r243m500L00
1833b537K700L234J998n05L22j888k266k489k315K697M505L268p63L153K999n071
1817G042l650j193m218k490R2n96l791L104J165O884K224M482l64n143K373l071
1801B850J639J957J652J794M418o203o739l983k14n012l596P061Q494L959j1315
1786c238k050L555J336K990l383m20k862M802K946k524m934j759M874L893J736
1771D962Q71Q04n360n145N722N944m674n475P519J422M71L910J03p090P64o095
$$ plain form
1755 -1347 -3386 2818 9791 13292 11222 9171 263 -57 10110 13633 15971 17947 17053 13221 14699
1740 14699 9370 5105 15635 17194 11332 6628 5304 9279 11313 11318 15289 15890 14195 6518 -1935
1725 -1935 -12011 -16259 -8480 9748 15475 14027 13882 3737 1685 5608 4331 3885 4170 3218 2335
1710 2335 3762 15178 8502 4667 14490 22039 21746 21081 11202 13139 15470 17431 6866 -2627 227
1695 227 1803 5956 9787 4574 -1692 2090 3770 1251 -267 -2857 -6424 -5539 -1818 4018 8046
1680 8046 7102 4705 1757 -1022 -3563 -4394 -3876 -2592 -4152 -5238 331 14635 4281 -1516 5602
1665 5602 4100 6858 2795 5509 8131 10902 14931 20640 17818 22745 19375 10696 9577 1182 -4333
1650 -4333 -6933 -8098 -1498 7866 5026 7984 5971 6250 8623 4178 -1004 -4032 -1484 -2696 -3907
$$ packed form
1755a347k039O204O973L501k070k051q908l20J0167L523K338J976q94l832J478
1740A4699n329m265J0530J559n862m704j324L975K034NL971O01j695p677q453
1725a935j0076m248P779J8228N727j448j45j0145k052L923j277m46K85r52q83
1710B335J427J1416o676l835R823P549k93o65r879J937K331J961j0565r493K854
1695B27J576M153L831n213o266L782J680k519j518k590l567Q85L721N836M028
1680H046r44k397k948k779k541q31N18J284j560j086N569J4304j0354n797P118
1665E602j502K758m063K714K622K771M029N709k822M927l370q679j119q395n515
1650d333k600j165O600R364k840K958k013K79K373m445n182l028K548j212j211
$$ plain form
1635 -3907 -3138 -5366 -10121 -13276 -15728 -4318 2189 4371 6987 9908 9372 3907 -893 2699 4765
1620 4765 6137 9688 8791 5127 1306 1074 -4617 -3078 7181 8151 3505 10153 16812 23373 24747
1605 24747 23151 18896 15922 12210 4646 -2305 -1219 -1152 -3069 -3743 -8527 -3252 8985 13453 10503
1590 10503 10568 5492 4378 4489 10591 17093 18991 8258 3070 10313 7778 4109 6785 10480 12843
1575 12843 14815 15326 10406 12175 -3091 -10781 -9985 -5640 2935 3551 -4978 -9403 -13306 -13704 -13063 -11137
1559 -11137 -6286 -4215 -1040 -4606 -13402 -7701 -1997 6446 4214 1733 -965 -2606 4766 13003 15156
1544 15156 17899 14932 8347 -345 979 6159 5590 2380 986 -954 3163 4915 6801 11410 6891
1529 6891 1958 -1550 383 7783 11005 11778 15862 13266 13355 9886 6869 1043 -265 3894 7891 3879
$$ packed form
1635c907P69k228m755l155k452J1410O507K182K616K921n36n465m800L592K066
1620D765J372L551q97l664l821k32n691J539J0259R70m646O648O659O561J374
1605B4747j596m255k974l712p564o951J086O7j917o74m784N275J2237M468k950
1590A0503O5n076j114J11O102O502J898j0733n188P243k535l669K676L695K363
1575A2843J972N11m920J769j5266p690P96M345Q575O16q529m425l903l98O41J926
1559a1137M851K071L175l566q796N701N704Q443k232k481k698j641P372Q237K153
1544A5156K743k967o585q692J324N180n69l210j394j940M117J752J886M609m519
1529F891m933l508J933P400L222P73M084k596Q9l469l017n826j308M159L997m012
$$ plain form
1513 3879 -2560 732 7784 14862 22254 25245 22342 15467 10535 6462 3707 4072 12132 16504 18576
1498 18576 14971 10075 6307 2389 -3733 1647 8185 10452 14014 16983 16463 13151 13210 11779 11364 8448
1482 8448 4962 5197 9541 16245 16685 20266 14835 4486 -3102 -5697 -5307 -763 2671 849 1012 4312
1466 4312 -569 10245 23875 19492 19005 20118 14600 455 -694 -608 -3981 3244 8337 14229 18765
1451 18765 16811 8999 5342 6681 15474 18688 15803 12977 5476 5038 3380 8697 9537 3105 7987
1436 7987 16586 15807 19759 18714 17928 4496 1357 7003 13448 9789 309 -4519 -2988 113 6161
1421 6161 7633 8328 12080 11780 7716 2887 9261 10872 8173 4184 5347 -3314 -7591 1121 7107
1406 7107 12779 18906 15593 8956 8044 -2434 1473 4142 688 -452 -6279 -5682 3994 13582 11271
$$ packed form
1513C879o439L292P052P078P392K991k903o875m932m073k755L65Q060M372K072
1498A8576l605m896l768l918o122N380O538K267L562K969n20l312N9j431m15k916
1482H448l486K35M344O704M40L581n431j0349p588k595L90M544L434j822J63L300
1466D312m881J0814J3630m383m87J113n518j4145j149Q6l373P225N093N892M536
1451A8765j954p812l657J339Q793L214k885k826p501m38j658N317Q40o432M882
1436G987Q599p79L952j045p86j3432l139N646O445l659r480m828J531L101O048
1421F161J472O95L752l00m064m829O374J611k699l989J163q661m277Q712N986
1406G107N672O127l313o637r12j0478L907K669l454j140n827N97R676R588k311
$$ plain form
1391 11271 2576 -1357 -4110 -3162 1255 8285 10343 11779 15182 15485 11251 9556 12113 12472 15305
$$ packed form
1391A1271q695l933k753R48M417P030K058J436L403L03m234j695K557L59K833
$$ [...]
##END NTUPLES=NMR SPECTRUM
##END=
