##TITLE=Analysis number 318609
Compound Code btb 09944
Project Code adrs
Chemist Name fudan
##JCAMPDX= 6.0         $$ Bruker NMR JCAMP-DX V2.0
##DATA TYPE= NMR SPECTRUM
##DATA CLASS= NTUPLES
##ORIGIN= Bruker BioSpin GmbH
##OWNER= nmr
$$ XWIN-NMR		Version 3.5
$$ Wed Apr  5 16:00:06 2006 GMT Daylight Time (UT+1h)  MAYBRIDGE\nmr@NMR_250MHZ
##.OBSERVE FREQUENCY= 250.131544655141
##.OBSERVE NUCLEUS= ^1H
##.ACQUISITION MODE= SIMULTANEOUS (DQD)
##.ACQUISITION SCHEME= undefined
##.AVERAGES= 16
##.DIGITISER RES= 18
##SPECTROMETER/DATA SYSTEM= dpx250
##.PULSE SEQUENCE= zg30
##.SOLVENT NAME= DMSO
##.SHIFT REFERENCE= (INTERNAL, DMSO, 0, 16.522)
##AUDIT TRAIL= $$ (NUMBER, WHEN, WHO, WHERE, WHAT)
$$ ##TITLE= Audit trail, XWIN-NMR		Version 3.5
$$ ##JCAMPDX= 5.01
$$ ##ORIGIN= Bruker BioSpin GmbH
$$ ##OWNER= nmr
$$ C:\u/data/dgb/nmr/ADRS/2190/pdata/1/auditp.txt
$$ ##AUDIT TRAIL=  $$ (NUMBER, WHEN, WHO, WHERE, WHAT)
(   1,<2006-04-05 15:59:41.32 +100>,<MAYBRIDGE\nmr>,<NMR_250MHZ>,
      <created by zg, POWCHK disabled, PULCHK disabled
       configuration hash MD5:
       84 BC 41 DB A1 6E 1D 46 DA 25 12 A5 C1 ED C5 3A
       data hash MD5: 64K
       FA B3 C3 F0 01 77 CF 7B 3E F6 9D F2 61 79 0E 27>)
(   2,<2006-04-05 15:59:55.07 +100>,<MAYBRIDGE\nmr>,<NMR_250MHZ>,
      <Start of raw data processing
       ef LB = 0.3 FT_mod = 6 PKNL = 1 SI = 32K 
       data hash MD5: 32K
       DF 1A E2 A1 A0 12 9D 9A 87 54 D4 B1 68 FD 9C C1>)
(   3,<2006-04-05 15:59:56.66 +100>,<MAYBRIDGE\nmr>,<NMR_250MHZ>,
      <apk 
       data hash MD5: 32K
       BC 8B AC 25 60 9B AE B2 96 2A 8A D8 F9 16 59 3D>)
(   4,<2006-04-05 15:59:57.41 +100>,<MAYBRIDGE\nmr>,<NMR_250MHZ>,
      <abs ABSG = 5 
       data hash MD5: 32K
       C4 38 4F 64 C6 1C 6A 50 1E 0C 09 B5 81 D2 A0 A5>)
$$ ##END=
$$ 
$$ hash MD5
$$ 7F B2 72 D5 CD 3B AE A4 A5 E9 BA 3B 42 D6 8B A0
##$RELAX= 
##$RELAX= 
##$RELAX= 
##$RELAX= 
##$RELAX= 
##$RELAX= 
##$RELAX= 
$$ Bruker specific parameters
$$ --------------------------
##$DU= <C:\u>
##$EXPNO= 2190
##$NAME= <ADRS>
##$PROCNO= 1
##$TYPE= <nmr>
##$USER= <dgb>
##$AMP= (0..31)
100 100 100 100 100 100 100 100 100 100 100 100 100 100 100 100 100 100 
100 100 100 100 100 100 100 100 100 100 100 100 100 100 
##$AQSEQ= 0
##$AQ_mod= 3
##$AUNM= <au_zg>
##$AUTOPOS= <54 >
##$BF1= 250.13
##$BF2= 250.13
##$BF3= 250.13
##$BF4= 250.13
##$BF5= 500.13
##$BF6= 500.13
##$BF7= 500.13
##$BF8= 500.13
##$BYTORDA= 1
##$CFDGTYP= 0
##$CFRGTYP= 5
##$CHEMSTR= <none>
##$CNST= (0..31)
1 1 145 1 1 1 1 1 1 1 1 1 1 1 1 1 1 1 1 1 1 1 1 1 1 1 1 1 1 1 1 1 
##$CPDPRG= <>
##$CPDPRG1= <>
##$CPDPRG2= <>
##$CPDPRG3= <>
##$CPDPRG4= <mlev>
##$CPDPRG5= <mlev>
##$CPDPRG6= <mlev>
##$CPDPRG7= <mlev>
##$CPDPRG8= <mlev>
##$CPDPRGB= <>
##$CPDPRGT= <>
##$D= (0..31)
0 1 0 0 0 0 0 0 0 0.06 0 0 0 0 0 0 0.0002 0 0 0 0 0 0 0 0 0 0 0 0 0 0 
0 
##$DATE= 1144249179
##$DBL= (0..7)
120 120 120 120 120 120 120 120 
##$DBP= (0..7)
150 150 150 150 150 150 150 150 
##$DBP07= 0
##$DBPNAM0= <>
##$DBPNAM1= <>
##$DBPNAM2= <>
##$DBPNAM3= <>
$$ [...]
##$SUBNAM6= <"">
##$SUBNAM7= <"">
##$SUBNAM8= <"">
##$SUBNAM9= <"">
##$SW= 20.6930455092707
##$SWIBOX= (0..15)
0 0 3 0 0 0 0 0 0 0 0 0 0 0 0 0 
##$SW_h= 5175.983436853
##$TD= 65536
##$TD0= 1
##$TE= 295.16
##$TE2= 300
##$TE3= 300
##$TEG= 300
##$TL= (0..7)
0 120 120 120 120 120 120 120 
##$TP= (0..7)
150 150 150 150 150 150 150 150 
##$TP07= 0
##$TPNAME0= <>
##$TPNAME1= <>
##$TPNAME2= <>
##$TPNAME3= <>
##$TPNAME4= <>
##$TPNAME5= <>
##$TPNAME6= <>
##$TPNAME7= <>
##$TPOAL= (0..7)
0.5 0.5 0.5 0.5 0.5 0.5 0.5 0.5 
##$TPOFFS= (0..7)
0 0 0 0 0 0 0 0 
##$TUNHIN= 0
##$TUNHOUT= 0
##$TUNXOUT= 0
##$USERA1= <user>
##$USERA2= <user>
##$USERA3= <user>
##$USERA4= <user>
##$USERA5= <user>
##$V9= 5
##$VALIST= <valist>
##$VCLIST= <CCCCCCCCCCCCCCC>
##$VD= 0
##$VDLIST= <DDDDDDDDDDDDDDD>
##$VPLIST= <PPPPPPPPPPPPPPP>
##$VTLIST= <TTTTTTTTTTTTTTT>
##$WBST= 1024
##$WBSW= 4
##$XGAIN= (0..3)
0 0 0 0 
##$XL= 0
##$YL= 0
##$YMAX_a= 312639
##$YMIN_a= -317513
##$ZGOPTNS= <>
##$ZL1= 120
##$ZL2= 120
##$ZL3= 120
##$ZL4= 120
##$ABSF1= 16.522
##$ABSF2= -4.171173
##$ABSG= 5
##$ABSL= 3
##$ALPHA= 0
##$AQORDER= 0
##$ASSFAC= 0
##$ASSFACI= 0
##$ASSFACX= 0
##$ASSWID= 0
##$AUNMP= <proc_1d>
##$AZFE= 0.1
##$AZFW= 0.1
##$BCFW= 0
##$BC_mod= 0
##$BYTORDP= 0
##$COROFFS= 0
##$CY= 12.5
##$DATMOD= 1
##$DC= 0
##$DFILT= <>
##$DTYPP= 0
##$F1P= 14.0000005364418
##$F2P= -0.99999901652339
##$FCOR= 0.5
##$FTSIZE= 32768
##$FT_mod= 6
##$GAMMA= 0
##$GB= 0
##$INTBC= 1
##$INTSCL= 1
##$ISEN= 128
##$LB= 0.3
##$LEV0= 0
##$LPBIN= 0
##$MAXI= 10000
##$MC2= 0
##$MEAN= 0
##$ME_mod= 0
##$MI= 0
##$NCOEF= 0
##$NC_proc= -5
##$NLEV= 6
##$NOISF1= 0
##$NOISF2= 0
##$NSP= 0
##$NTH_PI= 0
##$NZP= 0
##$OFFSET= 16.522
##$PC= 1
##$PHC0= 164.43
##$PHC1= 8.06607
##$PH_mod= 1
##$PKNL= yes
##$PPARMOD= 0
##$PSCAL= 4
##$PSIGN= 0
##$REVERSE= no
##$SF= 250.13
##$SI= 32768
##$SIGF1= 0
##$SIGF2= 0
##$SINO= 400
##$SIOLD= 32768
##$SREGLST= <1H.DMSO>
##$SSB= 0
##$STSI= 32768
##$STSR= 0
##$SW_p= 5175.98343685301
##$SYMM= 0
##$S_DEV= 0
##$TDeff= 65536
##$TDoff= 0
##$TI= <Analysis number 999999
Compound Code 99
Book Reference 9
Project Code 9>
##$TILT= no
##$TM1= 0
##$TM2= 0
##$TOPLEV= 0
##$USERP1= <user>
##$USERP2= <user>
##$USERP3= <user>
##$USERP4= <user>
##$USERP5= <user>
##$WDW= 1
##$XDIM= 32768
##$YMAX_p= 361206688
##$YMIN_p= -1129333
$$ End of Bruker specific parameters
$$ ---------------------------------
##NTUPLES= NMR SPECTRUM
##VAR_NAME=  FREQUENCY,     SPECTRUM/REAL,   SPECTRUM/IMAG
##SYMBOL=    X,             R,               I
##VAR_TYPE=  INDEPENDENT,   DEPENDENT,       DEPENDENT
##VAR_FORM=  AFFN,          ASDF,            ASDF
##VAR_DIM=   32768,         32768,           32768
##UNITS=     HZ,            ARBITRARY UNITS, ARBITRARY UNITS
##FACTOR=    0.157963299565203, 1,           1
##FIRST=     4132.6476996994, 0,             0
##LAST=      -1043.33573715361, 0,           0
##MIN=       -1043.33573715361, -1129333,    0
##MAX=       4132.6476996994, 361206688,     0
$$ Real data points
##PAGE= N=1
##DATA TABLE= (X++(R..R)), XYDATA
$$ [...]
$$ plain form
15631 -253141 -123969 151396 18945 -193029 -224645 -81897 -129220 -419433 -669092 -694433
15621 -694433 -441272 -411012 -328244 -469674 -757648 -571242 -234769 -232940 57329 173989
15611 173989 98484 -170423 -335162 -258589 171198 146881 74378 103099 217136 234017 121115
15600 121115 228231 61934 47202 323439 444451 329467 62010 -182969 -297512 -390731
15590 -390731 -593598 -211904 8953 -95319 -212364 -170238 -70254 70023 48541 54687
15580 54687 -43745 -156408 -109190 178530 262891 392888 504736 260803 202137 389084
15570 389084 384240 297163 -129780 -473745 -540809 -329115 -347362 -200982 -152883 -347362 -379259
15559 -379259 -129884 198076 384852 79353 -30077 370 -47534 124030 151776 65452
$$ packed form
15631b53141J29172K75365j32451k11974l1616J42748m7323k90213k49659k5341
15621f94433K53161L0260Q2768j41430k87974J86406L36473J829K90269J16660
15611A73989p5505k68907j64739P6573M29787k4317p2503K8721J14037J6881j12902
15600A21115J07116j66297j4732K76237J21012j14984k67457k44979j14543r3219
15590c90731k02867L81694K20857j04272j17045M2126R9984J40277k1482O146
15580E4687r8432j12663M7218K87720Q4361J29997J11848k43933n8666J86947
15570C89084m844q7077m26943l43965o7064K11694j8247J46380M8099j94479l1897
15559c79259K49375L27960J86776l05499j09430L0447m7904J71564K7746q6324
$$ plain form
15549 65452 30372 71886 91945 237074 186017 32205 -224356 -345332 -39690 180173
15539 180173 440549 267952 209487 -183699 -394670 -275445 -481281 -407818 -369465 -150182
15529 -150182 -175376 -186807 -94162 -74738 119069 414355 385758 183110 24536 -172613
15519 -172613 -228642 -177557 -224617 -178830 -338152 -528324 -740818 -333576 -152680 -241658
15509 -241658 -259188 -7833 354195 258108 276374 365376 401854 312870 81222 144293 100494
15498 100494 -8976 121565 157405 230556 33480 -220 -173365 -191650 -176033 -193002 -143375
15487 -143375 -131830 27140 179232 231771 17124 -124510 -96668 -207249 -146975 -186038
15477 -186038 -87475 -114406 128902 273534 154053 58361 112740 133533 27635 -28613 163925
$$ packed form
15549F5452l5080M1514K0059J45129n1057j53812k56561j20976L05642K19863
15539A80173K60376j72597n8465l93186k10971J19225k05836P3463L8353K19283
15529a50182k5194j1431R2645J9424J93807K95286k8597k02648j58574j97149
15519a72613n6029N1085m7060M5787j59322j90172k12494M07242J80896q8978
15509b41658j7530K51355L62028r6087J8266Q9002L6478q8984k31648O3071m3799
15498A00494j09470J30541L5840P3151j97076l3700j73145j8285J5617j6969M9627
15487a43375J1545J58970J52092N2539k14647j41634K7842j10581O0274l9063
15477a86038R8563k6931K43308J44632j19481r5692N4379K0793j05898n6248J92538
$$ plain form
15466 163925 176499 3495 -124190 -230976 -230898 265291 278139 42149 -237473 -274036 -211934
15455 -211934 -41035 298752 299834 206561 129220 485656 450017 209426 146831 116013 -54096
15444 -54096 -305342 -213331 -6945 18258 -99867 51101 271933 63025 -181893 -309094
15434 -309094 -162499 -75807 47986 -95316 21583 29404 42439 -25950 -247603 -274803 183696
15423 183696 212543 -119969 -302768 -223476 -74593 111599 81679 -48572 -295554 -302455
15413 -302455 -102524 -29107 -371142 -559828 -534859 -537955 -208834 -201024 -87711 -32226 -24777
15402 -24777 90081 141748 384009 411723 429513 551682 438804 289516 264131 195085 193252
15391 193252 210834 -109542 -314571 -213427 -80355 9126 122307 74608 147347 74090
$$ packed form
15466A63925J2574j73004j27685j06786P8M96189J2848k35990k79622l6563O2102
15455b11934J70899L39787J082r3273p7341L56436l5639k40591o2595l0818j70109
15444e4096k51246R2011K06386K5203j18125J50968K20832k08908k44918j27201
15434c09094J46595Q6692J23793j43302J16899P821J3035o8389k21653k7200M58499
15423A83696K8847l32512j82799P9292J48883J86192k9920j30251k46982o901
15413c02455J99931P3417l42035j88686K4969l096L29121P810J13313N5485P449
15402b4777J14858N1667K42261K7714J7790J22169j12878j49288k5385o9046j833
15391A93252J7582l20376k05029J01144J33072Q9481J13181m7699P2739p3257
$$ plain form
15381 74090 -3785 -168804 -204606 -93288 -144115 -102249 -254062 -98247 8424 73101 18146
15370 18146 -91878 -320986 -308629 41659 106852 126799 367839 132324 -178596 -305399
15360 -305399 -236167 -79443 -74471 76172 76828 -379856 -596206 -484163 -348368 -261938 113030
15349 113030 34069 -226201 -267778 -112432 -97701 -45174 -135528 -114267 21917 111212 51931
15338 51931 69820 52998 306035 317302 -47522 -221326 -425050 -413171 -445419 -389964 -313642
15327 -313642 -335435 -391777 -513814 -437067 -444307 -135104 34615 16383 -129172 -136315 5400
15316 5400 -62961 -149028 -188226 18518 -148964 -440986 -482214 -279331 -549228 -642731 -183937
15305 -183937 -247071 -340890 -465678 -310626 -298833 -235981 -204944 -230087 -382486 -344620 -256911
$$ packed form
15381G4090p7875j65019l5802J11318n0827M1866j51813J55815J06671O4677n4955
15370A8146j10024k29108J2357L50288O5193J9947K41040k35515l10920j26803
15360c05399O9232J56724M972J50643O56m56684k16350J12043J35795Q6430L74968
15349A13030p8961k60270m1577J55346J4731N2527r0354K1261J36184Q9295n9281
15338E1931J7889j6822K53037J1267l64824j73804k03724J1879l2248N5455P6322
15327c13642k1793n6342j22037P6747p240L09203J69719j8232j45555p143J41715
15316E400o8361q6067l9198K06744j67482k92022m1228K02883k69897r3503M58794
15305a83937o3134r3819j24788J55052J1793O2852L1037k5143j52399L7866Q7709
$$ plain form
15294 -256911 -231798 -121742 859 -68273 35386 119457 318698 482897 197716 -231131
15284 -231131 -245154 -196977 -72306 22286 -124232 51835 250092 255815 -2319 127855
15274 127855 227603 -5942 -160131 -17108 93668 200370 83811 33484 -295205 -362989
15264 -362989 -279467 54149 176581 399516 482717 336360 178627 59285 379892 516822
15254 516822 508411 221594 364790 350319 86171 120510 175956 33051 22038 -80484 183596
15243 183596 248146 205946 88478 -87792 -91852 -284170 -252064 -109559 -200971 -62503 -76104
15232 -76104 -48365 239243 571319 106346 204388 116944 43051 -799 -1533 -51206 309615
15221 309615 272749 -49484 -23194 221623 177593 51081 209230 338874 90245 -343723
$$ packed form
15294b56911K5113J10056J22601o9132J03659Q4071J99241J64199k85181m28847
15284b31131j4023M8177J24671R4592j46518J76067J98257N723k58134J30174
15274A27855R9748k33545j54189J43023J10776J06702j16559n0327l28689o7784
15264c62989Q3522L33616J22432K22935Q3201j46357j57733j19342L20607J36930
15254E16822q411k86817J43196j4471k64148L4339N5446j42905j1013j02522K64080
15243A83596O4550m2200j17468j76270m060j92318L2106J42505r1412J38468j3601
15232g6104K7739K87608L32076m64973R8042q7444p3893m3850p34m9673L60821
15221C09615l6866l22233K6290K44817m4030j26512J58149J29644k48629m33968
$$ plain form
15211 -343723 -114000 -135853 -1536 -76380 -272585 -297751 -18931 122049 115792 391970
15201 391970 556882 204896 26084 -68584 -44000 -64612 -160053 -307943 -434206 -339428
15191 -339428 -30068 85649 -389 -270742 -511301 -384879 -221391 -360326 -328299 -242847
15181 -242847 -91023 -23623 201210 454083 527898 297506 316454 129838 51682 -39429
15171 -39429 -283951 -241115 6110 -68516 -265758 -255225 -135576 -62804 61908 18497 -90697
15160 -90697 -87013 -56565 5342 -48642 -206263 -248914 -184999 -25531 89327 -27606 -20471
15149 -20471 -547 82484 190050 153552 27585 -44279 -253001 -486480 -507768 -268018 58804
15138 58804 -50147 -90655 -52164 25412 3410 40462 315222 385023 -74657 -407624 -427257
$$ packed form
15211c43723K29723k1853J34317p4844j96205k5166K78820J40980o257K76178
15201C91970J64912l51986j78812r4668K4584k0612r5441j47890j26263R4778
15191c39428L09360J15717q6038k70353k40559J26422J63488j38935L2027Q5452
15181b42847J51824O7400K24833K52873P3815k30392J8948j86616p8156r1111
15171c9429k44522M2836K47225p4626j97242J0533J19649P2772J24712m3411j09194
15160i0697L684L0448O1907n3984j57621m2651O3915J59468J14858j16933P135
15149b0471J9924Q3031J07566l6498j25967p1864k08722k33479k1288K39750L26822
15138E8804j08951m0508L8491P7576k2002L7052K74760O9801m59680l32967j9633
$$ plain form
15127 -427257 -521657 -538481 -299035 19451 423937 412501 396915 229424 55019 262045
15117 262045 338409 201443 42762 124442 -57240 7401 11781 -33607 -23520 154752 105963
15106 105963 304741 35139 -15654 -90988 -31039 118961 99468 401219 304200 -197992
15096 -197992 -249957 -44628 234841 301442 360578 686869 469323 230715 83408 51781
15086 51781 -209146 -425761 -406959 -427000 -469169 -364761 -132698 181241 246203 268058 199184
15075 199184 357723 470974 282366 225497 106974 119535 126232 -24339 -451989 -503170
15065 -503170 -289737 -61107 52140 -220764 -95791 134502 54560 -128581 -52999 24339
15055 24339 15249 184388 202861 92066 73307 -5100 -210025 -69471 7152 -39218 -304888
$$ packed form
15127d27257r4400j6824K39446L18486M04486j1436j5586j67491j74405K07026
15117B62045P6364j36966j58681Q1680j81682O4641M380m5388J0087J78272m8789
15106A05963J98778k69602n0793p5334N9949J50000j9493L01751r7019n02192
15096a97992n1965K05329K79469O6601N9136L26291k17546k38608j47307l1627
15086E1781k60927k16615J8802k0041m2169J04408K32063L13939O4962K1855o8874
15075A99184J58539J13251j88608n6869j18523J2561O697j50571m27650n1181
15065e03170K13433K28630J13247k72904J24973K30293p9942j83141P5582P7338
15055B4339r090J69139J8473j10795j8759p8407k04925J40554P6623m6370k65670
$$ plain form
15044 -304888 -232498 -44433 -65335 -8724 -114091 -372102 -530457 -306257 -78302 -91434
15034 -91434 -103096 -55049 -62354 -186090 -55316 65017 102098 -4524 61056 21266 91837
15023 91837 366394 473812 610068 511510 664449 678828 442228 326697 498734 253019
15013 253019 157449 125841 213522 -47023 -121697 99626 102946 209772 205503 15858 164236
15002 164236 270792 398430 209505 -297207 -329976 -222538 33062 56139 -215670 -363805
14992 -363805 -259985 -41075 42576 81036 97240 -168288 -303098 -172162 -231651 1869
14982 1869 182319 332509 298890 292758 118719 52446 -51104 -49328 -105503 -320002 -249649
14971 -249649 -95296 -170080 -154393 -74607 -1804 -236200 -210799 21018 106071 20498 -409904
$$ packed form
15044c04888P2390J88065k0902N6611j05367k58011j58355K24200K27955j3132
15034i1434j1662M8047p305j23736J30774J20333L7081j06622O5580l9790P0571
15023I1837K74557J07418J36256r8558J52939J4379k36600j15531J72037k45715
15013B53019r5570l1608Q7681k60545p4674K21323L320J06826m269j89645J48378
15002A64236J06556J27638j88925n06712l2769J07438K55600K3077k71809j48135
14992c63805J03820K18910Q3651L8460J6204k65528j34810J30936n9489K33520
14982A869J80450J50190l3619o132j74039o6273j03550J776n6175k14499P0353
14971b49649J54353p4784J5687P9786P2803k34396K5401K31817Q5053q5573m30402
$$ plain form
14960 -409904 -420659 -168142 -216217 -201282 -220171 -131417 -10314 62048 275440 358434 402002
14949 402002 378553 358906 342094 99738 -104720 -174079 -159618 -367839 -300867 -457838 -491977
14938 -491977 -56924 -125345 -57186 -14847 -101458 -60933 -34634 -108964 -154381 244054 337567
14927 337567 212162 -56804 -150347 80323 -132101 -349365 -126898 -58169 133636 2477
14917 2477 -248459 -317255 -123490 86500 160005 313982 379485 163217 92584 164143 9768
14906 9768 -157274 225109 514079 437393 234068 -130791 -126300 -292644 -20709 235919
14896 235919 304026 189302 244588 149947 -72962 -101960 -295872 -501793 -419618 -307987
14886 -307987 -366485 -560030 -232433 -50547 -262929 -265058 -249502 -221101 -24372 -11866 -227793
$$ packed form
14960d09904j0755K52517m8075J4935j8889Q8754J21103P2362K13392Q2994M3568
14949D02002k3449j9647j6812k42356k04458o9359J4461k08221O6972j56971l4139
14938d91977M35053o8421O8159M2339q6611M0525K6299p4330m5417L98435R3513
14927C37567j25405k68966r3543K30670k12424k17264K22467O8729J91805j31159
14917B477k50936o8796J93765K09990P3505J53977O5503k16268p0633P1559j54375
14906I768j67042L82383K88970p6686k03325l64859M491j66344K71935K56628
14896B35919O8107j14724N5286r4641k22909k8998j93912k05921Q2175J11631
14886c07987n8498j93545L27597J81886k12382k129J5556K8401J96729J2506k15927
$$ plain form
14875 -227793 -14266 229710 214140 399614 509927 231921 352829 256205 313112 487785
14865 487785 618235 564159 417502 328756 339305 446545 120473 -96260 51476 224756
14855 224756 189884 173703 368567 360802 327735 214937 102800 -73997 -215924 -5129
14845 -5129 155515 16167 103895 -6566 -110316 -186191 -421647 -254226 -218615 -197434 38441
14834 38441 21755 -117251 -57915 8853 -55311 75974 -215150 -169842 -206830 -232083 -331085
14823 -331085 -74670 -47367 -138418 92778 119423 32074 -209215 -279415 -41645 167848
14813 167848 117449 176632 127527 361898 505264 556299 271275 -53385 -78473 -218191
14803 -218191 -256742 -461925 -528957 -496833 -197308 -76889 -221384 -23113 -2979 -292866
$$ packed form
14875b27793K13527K43976j5570J85474J10313k78006J20908r6624N6907J74673
14865D87785J30450n4076j46657q8746J0549J07240l26072k16733J47736J73280
14855B24756l4872j6181J94864p765l3067j12798j12137j76797j41927K10795
14845e129J60644j39348Q7728j10461j03750p5875k35456J67421L5611K1181K35875
14834C8441j6686j39006N9336O6768o4164J31285k91124M5308l6988k5253r9002
14823c31085K56415K7303r1051K31196K6645q7349k41289p0200K37770K09493
14813A67848n0399N9183m9105K34371J43366N1035k85024l24660k5088j39718
14803b18191l8551k05183o7032L2124K99525J20419j44495J98271K0134k89887
$$ plain form
14793 -292866 -512608 -463001 -488840 -131656 -6862 2075 -114897 38826 255152 134017
14783 134017 47113 326456 411032 453897 372022 250739 345667 117782 -87604 -178302 28682
14772 28682 -89482 43994 299991 301879 -25722 -156038 -200456 -383542 -45979 -21281
14762 -21281 -372789 -580525 -671831 -578388 -442854 -379694 -119600 95738 314377 332913
14752 332913 197075 -180729 -205521 -74926 -267652 -208986 55418 151479 260223 432634
14742 432634 403393 399332 361990 248869 -109983 -425959 -542599 -471616 -145643 17992
14732 17992 -170713 -3862 371522 474087 2037 -326335 -85875 42173 -119940 -142773
14722 -142773 -28683 -63902 -241594 -270328 -257523 -325501 -160771 -99472 -200448 -301453
$$ packed form
14793b92866k19742M9607k5839L57184J24794Q937j16972J53723K16326j21135
14783A34017q6904K79343Q4576M2865q1875j21283R4928k27885k05386r0698K06984
14772B8682j18164J33476K55997J888l27601j30316m4418j83086L37563K4698
14762b1281l51508k07736r1306R3443J35534O3160K60094K15338K18639J8536
14752C32913j35838l77804k4792J30595j92726N8666K64404R6061J08744J72411
14742D32634k9241m061l7342j13121l58852l15976j16640P0983L25973J63635
14732A7992j88705J66851L75384J02565m72050l28372K40460J28048j62113k2833
14722a42773J14090l5219j77692k8734J2805o7978J64730O1299j00976j01005
$$ plain form
14712 -301453 -412568 -620945 -566484 -252900 -770 149313 45754 -208833 -207449 273525
14702 273525 389295 352983 221138 30751 -94615 -62326 -88150 -101294 -191951 -248679 -496633
14691 -496633 -495051 -322322 -192152 53269 484150 288674 224328 137598 -11923 -161165
14681 -161165 -80883 37937 121995 227633 128213 -5091 232324 156661 55755 238605
14671 238605 -74740 -321065 -522855 -551342 -384508 23494 219213 467310 233578 63356
14661 63356 126066 -109961 -279555 -61579 153742 118639 178540 195005 -9766 -95279 -167068
14650 -167068 -494052 -472326 -111155 -91998 -47605 59424 244690 131248 100075 39928
14640 39928 219904 478096 320970 51561 -32269 -46915 422316 548128 275862 74371
$$ packed form
14712c01453j11115k08377N4461L13584K52130J50083j03559k54587J384M80974
14702B73525J15770l6312j31845j90387j25366L2289k5824j3144r0657n6728k47954
14691d96633J582J72729J30170K45421M30881j95476o4346q6730j49521j49242
14681a61165Q0282J18820Q4058J05638r9420j33304K37415p5663j00906J82850
14671B38605l13345k46325k01790k8487J66834M08002J95719K48097k33732j70222
14661F3356O2710k36027j69594K17976K15321l5103N9901J6465k04771q5513p1789
14650a67068l26984K1726L61171J9157M4393J07029J85266j13442l1173o0147
14640C9928J79976K58192j57126k69409q3830j4646M69231J25812k72266k01491
$$ plain form
14630 74371 113291 289357 375282 449914 266165 121742 52237 306526 372889 76415 -250987
14619 -250987 -238064 15458 208741 98115 77213 67952 -122953 -13952 279642 267276
14609 267276 296051 329097 274167 128657 174892 270351 267339 103426 -58580 -194960 -222570
14598 -222570 -270351 -147946 151818 397987 424321 65770 221961 462456 518308 359282
14588 359282 58652 -5072 192541 318474 469001 402534 260722 69564 204030 342125
14578 342125 365514 298551 -118590 37663 31177 -59696 -134326 -57349 22722 74156 160675
14567 160675 142881 -83027 -20035 226665 407830 704062 745900 647833 184235 -275126
14557 -275126 -278854 -301055 -56824 100303 494400 566544 456095 149405 28091 -32739
$$ packed form
14630G4371L8920J76066Q5925P4632j83749j44423o9505K54289O6363k96474l27402
14619b50987J2923K53522J93283j10626k0902r261j90905J09001K93594j2366
14609B67276K8775L3046n4930j45510M6235R5459l012j63913j62006j36380k7610
14598b22570m7781J22405K99764K46169K6334l58551J56191K40495N5852j59026
14588C59282l00630o3724J97613J25933J50527o6467j41812j91158J34466J38095
14578C42125K3389o6963m17141J56253o486r0873p4630P6977Q0071N1434Q6519
14567A60675j7794k25908O2992K46700J81165K96232M1838r8067m63598m59361
14557b75126l728k2201K44231J57127L94097P2144j10449l06690j21314o0830
$$ plain form
14547 -32739 -314200 -557800 -206302 178419 99273 -104861 -170068 6151 163249 -68988
14537 -68988 -383542 -261068 -205421 96878 214269 321346 347280 208536 269786 305253
14527 305253 20044 -172488 -41852 -128249 -429317 -422534 -131227 35923 256122 221016
14517 221016 118029 228694 415732 541310 358148 -141348 -356278 -303182 -360263 -115081
14507 -115081 161734 246730 132025 -136454 -159066 -233439 -123595 51441 -22595 -134999
14497 -134999 -153826 -143069 107458 140741 95748 283685 285751 361489 369573 340521 396215
14486 396215 70446 252551 301364 221721 153621 335015 306863 35853 -521069 -616436
14476 -616436 -508964 -201127 -24735 -128187 -162000 133121 391724 455887 437549 362825
$$ packed form
14547c2739k81461k43600L51498L84721p9146k04134o5207J76219J57098k32237
14537f8988l14554J22474N5647L02299J17391J07077K5934j38744O1250L5467
14527C05253k85209j92532J30636q6397l01068O783K91307J67150K20199l5106
14517B21016j02987J10665J87038J25578j83162m99496k14930N3096n7081K45182
14507a15081K76815Q4996j14705k68479k2612p4373J09844J75036p4036j12404
14497a34999j8827J0757K50527L3283m4993J87937K066P5738Q084k9052N5694
14486C96215l25769J82105M8813p9643o8100J81394k8152k71010n56922r5367
14476f16436J07472L07837J76392j03452l3813K95121K58603O4163j8338p4724
$$ plain form
14466 362825 365745 118298 -194190 -243969 -575005 -627786 -458775 -269458 -68839 148205
14456 148205 162422 206000 96758 -26829 -240399 -99754 140930 -29660 -239883 129827
14446 129827 272314 555272 396846 184035 50964 164369 188868 101057 -163603 -452687
14436 -452687 -271235 17794 -99131 -270909 -461768 -427642 -140063 -25745 -66591 -16868
14426 -16868 -163742 -382063 -201256 -120655 -75124 126217 -74702 -289429 56873 201266
14416 201266 167693 188628 -42932 149372 603636 653670 440983 223936 149129 77346
14406 77346 55769 31676 -278952 -175586 181981 173159 -224988 -415265 -405056 -179489 360078
14395 360078 635258 340578 220837 116438 -130949 9234 254856 242622 227932 57337
$$ packed form
14466C62825K920k47447l12488m9779l31036n2781J69011J89317K00619K17044
14456A48205J4217M3578j09242j23587k13570J40645K40684j70590k10223L69710
14446A29827J42487K82958j58426k12811j33071J13405K4499q7811k64660k89084
14436d52687J81452K89029j16925j71778j90859L4126K87579J14318m0846M9723
14426a6868j46874k18321J80807Q0601M5531K01341k00919k14727L46302J44393
14416B01266l3573K0935k31560J92304M54264N0034k12687k17047p4807p1783
14406G7346k1577k4093l10628J03366L57567q822l98147j90277J0209K25567N39567
14395C60078K75180k94680j19741j04399k47387J40183K45622j2234j4690j70595
$$ plain form
14385 57337 -121454 -431936 -502380 -195669 52277 67259 86105 61130 -124456 38603
14375 38603 201900 122671 -144206 -144225 -80008 246632 139018 103449 107529 -28315 -121240
14364 -121240 -142492 -268881 -401089 -279037 -128740 -249608 -102243 118125 131657 109717
14354 109717 178755 -29916 -85723 -105482 -95691 -223122 -50498 -37218 -147898 -239274 -79486
14343 -79486 103568 8575 -31298 -87661 73861 76489 107653 400418 254616 66278 -152438
14332 -152438 -535650 -329626 -151651 -121018 75104 322408 351223 259020 172980 42248
14322 42248 149850 -137791 -128608 129895 59084 -28661 -129444 31531 59145 32676 -76245
14311 -76245 -89158 157594 305077 329265 192594 311552 425657 23162 -18745 48276
$$ packed form
14385E7337j78791l10482p0444L06711K47946J4982J8846k4975j85586J63059
14375C8603J63297p9229k66877j9O4217L26640j07614l5569M080j35844r2925
14364a21240k1252j26389j32208J22052J50297j20868J47365K20368J3532k1940
14354A09717O9038k08671n5807j9759R791j27431J72624J3280j10680r1376J59788
14343g9486J83054r4993l9873n6363J61522K628L1164K92765j45802j88338k18716
14332a52438l83212K06024J77975L0633J96122K47304K8815r2203q6040j30732
14322D2248J07602k87641R183K58503p0811q7745j00783J60975K7614k6469j08921
14311g6245j2913K46752J47483K4188j36671J18958J14105m02495m1907O7021
$$ plain form
14301 48276 91001 306730 458111 389917 221843 193941 330926 116405 -116033 173214
14291 173214 395791 233087 -77204 21945 -120728 -160036 -292231 -144625 133156 -55357
14281 -55357 -258977 -63319 19812 177565 156432 -19823 -28651 4065 160646 60213 8691
14270 8691 283945 166757 -169745 -318218 -267606 -121756 -95205 75059 146053 -55112
14260 -55112 -163251 -128782 -201238 -129488 191391 447266 487491 375680 175111 134052 -3121
14249 -3121 -79238 120859 138112 242129 430502 522594 286111 471431 264262 -46995
14239 -46995 -49896 3550 -63576 39690 -216424 -31621 53952 340583 444965 311404 296679
14228 296679 385939 251938 11906 -23554 -159070 -361146 -297318 -98033 157731 323596
$$ packed form
14301D8276M2725K15729J51381o8194j68074k7902J36985k14521k32438K89247
14291A73214K22577j62704l10291R9149j42673l9308j32195J47606K77781j88513
14281e5357k03620J95658Q3131J57753k1133j76255q828L2716J56581j00433n1522
14270H691K75254j17188l36502j48473N0612J45850K6551J70264P0994k01165
14260e5112j08139L4469p2456P1750L20879K55875M0225j11811k00569m1059j37173
14249c121p6117K00097J7253J04017J88373R2092k36483J85320k07169l11257
14239d6995k901N3446o7126J03266k56114J84803Q5573K86631J04382j33561j4725
14228B96679Q9260j34001k40032l5460j35516k02076O3828J99285K55764J65865
$$ plain form
14218 323596 352827 179325 12990 -84294 -128499 173745 251454 352094 186143 40126
14208 40126 -286441 -546526 -288799 -263278 40727 309222 95384 157035 238233 123535
14198 123535 -153686 -123698 -75740 -30192 205084 -39672 -117370 -27423 -60249 -412742 -203899
14187 -203899 -290672 -29888 106058 -63739 -126744 76104 89326 -205321 -405673 -77749
14177 -77749 -107652 -423669 -359915 -325427 89723 228882 -60957 -373996 -473941 -498590 -427904
14166 -427904 -229993 -10247 184063 38931 8182 -138387 -160740 -99010 -36246 -89539
14156 -89539 145792 364190 209515 -34007 -179656 -87369 184175 363453 257123 141319
14146 141319 -75602 -265672 -340189 -273576 106876 500548 375455 54365 -119532 -325863
$$ packed form
14218C23596K9231j73502j66335r7284m4205L02244P7709J00640j65951j46017
14208D0126l26567k60085K57727K5521L04005K68495k13838O1651Q1198j14698
14198A23535k77221K9988M7958M5548K35276k44756p7698Q9947l2826l52493K08843
14187b03899q6773K60784J35946j69797o3005K02848J3222k94647k00352L27924
14177g7749k9903l16017O3754L4488M15150J39159k89839l13039r9945k4649P0686
14166d27904J97911K19746J94310j45132l0749j46569k2353O1730O2764n3293
14156h9539K35331K18398j54675k43522j45649R2287K71544J79278j06330j15804
14146A41319k16921j90070p4517O6613L80452L93672j25093l21090j73897k06331
$$ plain form
14136 -325863 -167075 -176145 -302836 -469865 -240485 -38635 -121026 79977 25636 -192182
14126 -192182 -267758 -60164 -62507 26218 -79550 -179223 -271760 -412055 -393657 -361640 -393195
14115 -393195 -201153 -231966 -150225 -33421 -244973 -433498 -610320 -538640 -406047 -171037
14105 -171037 42078 38014 -39977 -3690 -100436 -150674 -211174 -233514 -235069 -229317 -224317 -338846
14093 -338846 -228061 32510 126549 3004 -131341 -7227 29985 83540 109763 -8778
14083 -8778 252477 435486 341359 279632 346066 100280 66796 45997 -209977 -246865 70072
14072 70072 254444 236613 115460 277758 97635 -26087 11755 139367 367966 -59700
14062 -59700 6390 -92483 -122817 -53673 -141165 -85182 -86156 47196 205886 330741 120598
$$ packed form
14136c25863J58788r070j26691j67029K29380K01850q2391K01003n4341k17818
14126a92182p5576K07594k343Q8725j05768r9673r2537j40295J8398L2017l1555
14115c93195J92042l0813Q1741J16804k11552j88525j76822P1680J32593K35010
14105a71037K13115m064p7991L6287r6746n0238o0500k2340j555N752N000j14529
14093c38846J10785K60571R4039j23545j34345J24114L7212N3555K6223j18541
14083h778K61255J83009r4127o1727O6434k45786l3484k0799k55974l6888L16937
14072G0072J84372j7831j21153J62298j80123j23722L7842J27612K28599m27666
14062e9700O6090r8873l0334O9144q7492N5983r74J33352J58690J24855k10143
$$ plain form
14051 120598 92974 139587 211471 453848 338340 184872 43961 -175785 -386045 -348682
14041 -348682 -227247 -213674 -274723 -319243 -130203 -41757 164805 221696 78779 172277 386803
14030 386803 420426 308506 380745 476683 598071 358184 187908 144618 -140701 -93890
14020 -93890 93859 -26753 155388 198700 316271 268791 -102326 -428317 -315274 -64279
14010 -64279 122663 34727 126738 167066 82097 224759 335583 427850 318981 218917 71977
13999 71977 4233 -276735 -435200 -243353 -423103 -376688 -280420 -279816 -143346 42610 351909
13988 351909 337397 122811 11207 -27627 -45742 -38939 -215204 -337772 -68896 -100339 -197107
13977 -197107 -120454 -222513 -45867 1716 102518 59945 64164 50407 160087 78647 46426
$$ packed form
14051A20598k7624M6613P1884K42377j15508j53468j40911k19746k10260L7363
14041c48682J21435J3573o1049m4520J89040Q8446K06562N6891j42917R3498K14526
14030C86803L3623j11920P2239R5938J21388k39887j70276m3290k85319M6811
14020i3890J87749j20612J82141M3312J17571m7480l71117l25991J13043K50995
14010f4279J86942q7936R2011M0328q4969J42662J10824R2267j08869j00064j46940
13999G1977o7744k80968j58465J91847j79750M6415R6268O04J36470J85956L09299
13988C51909j4512k14586j11604l8834j8115O803j76265j22568K68876l1443r6768
13977a97107P6653j02059J76646M7583J00802m2573M219j3757J09680q1440l2221
$$ plain form
13966 46426 192047 280252 59415 -94866 146068 283002 392971 306747 154654 2608
13956 2608 -41416 45972 310102 117497 56523 48592 96308 -130774 -39090 157308 24246
13945 24246 84772 -52427 -323120 -368917 -264687 -294824 -575157 -333064 -283044 -375162 -405431
13934 -405431 -534455 -468428 -327173 -96857 94178 229007 195477 -52733 -7867 -98391
13924 -98391 9377 48061 -99734 -147653 -348598 -240188 71247 523542 727645 320136
13914 320136 20659 63885 365068 364346 133156 57696 -15160 -64211 74515 78773 141958
13903 141958 29860 42130 -47157 -120494 -18910 310450 251029 124757 -11025 -25645
13893 -25645 -126970 31278 300692 182410 -62066 -17503 224392 149599 214081 137761
$$ packed form
13966D6426J45621Q8205k20837j54281K40934J36934J09969q6224j52093j52046
13956B608m4024Q7388K64130j92605o0974p931M7716k27082R1684J96398j33062
13945B4246O0526j37199k70693m5797J04230l0137k80333K42093N0020r2118l0269
13934d05431j29024O6027J41255K30316J91035J34829l3530k48210M4866r0524
13924i8391J07768L8684j47795m7919k00945J08410L11435M52295K04103m07509
13914C20136k99477M3226L01183p22k31190p5460p2856m9051J38726M258O3185
13903A41958j12098J2270q9287p3337J01584L29360n9421j26272j35782j4620
13893b5645j01325J58248K69414j18282k44476M4563K41895p4793O4482p6320
$$ plain form
13883 137761 169011 254368 237531 82422 171164 161989 -63169 72096 309450 100658 -91361
13872 -91361 178054 119688 2918 -4058 142672 154276 -49190 -39939 54737 85481 37530
13861 37530 -2640 -185513 -423367 -388700 -181080 -223624 -425737 -498044 -568656 -590488 -611186
13850 -611186 -251188 -60740 374361 552108 94723 50060 39811 -209241 -230270 -326968
13840 -326968 -257286 -12060 -36383 -197005 1393 -8674 -36345 58880 8098 58425 25028
13829 25028 -203334 -248067 -243603 -219840 -172322 -46348 61725 254624 287425 379616 262747
13818 262747 209906 138788 160783 -44976 -119610 3921 57894 1462 20056 478056 581008
13807 581008 198311 -52251 -350203 -328355 -248310 -17395 10478 134322 125169 80694 -116751
$$ packed form
13883A37761L1250Q5357j6837j55109Q8742r175k25158J35265K37354k08792j92019
13872i1361K69415n8366j16770o976J46730J1604k03466R251R4676L0744m7951
13861C7530m0170j82873k37854L4667K07620m2544k02113p2307p0612k1832k0698
13850f11186L59998J90448M35101J77747m57385m4663j0249k49052k1029r6698
13840c26968O9682K45226k4323j60622J98398j0067k7671R5225n0782N0327l3397
13829B5028k28362m4733M464K3763M7518J25974J08073J92899L2801R2191j16869
13818B62747n2841p1118K1995k05759p4634J23531N3973n6432J8594M58000J02952
13807E81008l82697k50562k97952K1848Q0045K30915K7873J23844r153m4475j97445
$$ plain form
13796 -116751 -145931 -120347 -241658 -274799 52878 165315 -214125 -544081 -655798 -676480
13786 -676480 -392226 79731 386107 231459 61391 12022 -59145 -348692 -703783 -547677
13776 -547677 -265767 -212368 -229755 -349254 -283391 -179566 -102277 -54599 -106912 -147345 -134053
13765 -134053 45382 80770 -56745 -124841 -114339 42600 -75024 -120258 -255096 -280650
13755 -280650 -223092 -118713 -151171 -116491 158550 48434 -132398 32433 -125976 46696
13745 46696 -78364 -158887 -2130 154581 12204 -341301 -327709 106396 183823 -20087
13735 -20087 67105 82414 296210 197009 76842 157676 262988 250112 134872 187087 382697
13724 382697 361015 473198 436757 307099 422510 493517 362916 72767 -256423 -339404
$$ packed form
13796a16751k9180K5584j21311l3141L27677J12437l79440l29956j11717k0682
13786f76480K84254M71957L06376j54648j70068m9369p1167k89547l55091J56106
13776e47677K81910N3399j7387j19499O5863J03825P7289M7678n2313m0433J3292
13765a34053J79435L5388j37515o8096J0502J56939j17624m5234j34838k5554
13755b80650N7558J04379l2458L4680K75041j10116j80832J64831j58409J72672
13745D6696j25060q0523J56757J56711j42377l53505J3592M34105P7427k03910
13735b0087Q7192J5309K13796r9201j20167Q0834J05312j2876j15240N2215J95610
13724C82697k1682J12183l6441j29658J15411P1007j30601k90149l29190q2981
$$ plain form
13714 -339404 -388744 -461019 -434279 -145860 -27385 -37378 -114557 13265 142262 2727 24202
13703 24202 52970 221355 507550 564037 524464 319456 254158 348470 513380 595013 477160
13692 477160 494341 186854 70006 208883 411274 522568 489926 573038 464108 250264
13682 250264 389534 469612 222459 57187 92323 229653 111746 -35411 157165 -46661
13672 -46661 -357415 -279638 -321326 -434604 -123731 75792 388647 488916 177351 -93042
13662 -93042 139302 147357 -10916 25016 -67325 -174556 -418309 -373877 -377932 -287519 82242
13651 82242 -31739 -284134 -155274 -90935 -138203 -273501 -145648 153101 274055 368736
13641 368736 278370 250636 236149 75741 212262 303516 306388 12370 -121754 77241 122953
$$ packed form
13714c39404m9340p2275K6740K88419J18475r993p7179J27822J28997j39535K1475
13703B4202K8768J68385K86195N6487l9573k05008o5298R4312J64910Q1633j17853
13692D77160J7181l07487j16848J38877K02391J11294l2642Q3112j08930k13844
13682B50264J39270Q0078k47153j65272L5136J37330j17907j47157J92576k03826
13672d6661l10754P7777m1688j13278L10873J99523L12855J00269l11565k70393
13662i3042K32344Q055j58273L5932r2341j07231k43753M4432m055R0413L69761
13651H2242j13981k52395J28860O4339m7268j35298J27853K98749J20954R4681
13641C68736r0366k7734j4487j60408J36521R1254K872k94018j34124J98995M5712
$$ plain form
13630 122953 41793 16519 179261 -187232 -96059 -309077 -214976 -138914 -276220 -148533
13620 -148533 -109404 -100289 -15239 14922 -113022 -140102 -136098 63813 108846 -19110 -100472
13609 -100472 -59585 51710 -98809 -130120 -111246 64026 89695 -25363 360240 376461
13599 376461 234709 149750 182385 231085 143280 105124 -88562 -276635 -19000 183831
13589 183831 277606 280904 306961 330408 213050 127828 58527 -121079 -103707 146805 270182
13578 270182 155210 189513 157442 -299664 -374103 25063 77368 -21712 44401 -23958 -129634
13567 -129634 25998 230301 254992 170320 97239 90366 202854 294842 318264 253008 366827
13556 366827 221007 112498 255573 196854 31829 -33374 -106055 -174747 -338812 -188567
$$ packed form
13630A22953q1160k5274J62742l66493R1173k13018R4101P6062j37306J27687
13620a48533L9129R115Q5050L0161j27944k7080M004J99911M5033j27956q1362
13609a00472M0887J11295j50519l1311J8874J75272K5669j15058L85603J6221
13599C76461j41752q4959L2635M8700q7805l8156j93686j88073K57635K02831
13589A83831R3775L298K6057K3447j17358q5222o9301j79606J7372K50512J23377
13578B70182j14972L4303l2071m57106p4439L99166N2305r9080O6113o8359j05676
13567a29634J55632K04303K4691q4672p3081o873J12488R1988K3422o5256J13819
13556C66827j45820j08509J43075n8719j65025o5203p2681o8692j64065J50245
$$ plain form
13546 -188567 57233 323449 218813 389460 493420 446502 121797 334253 371693 207379
13536 207379 157626 122709 60348 -140482 -320590 -431871 -329440 -299397 -448524 -413783
13526 -413783 -427649 -740369 -505138 -479505 -209958 -54239 -21044 83011 163301 312203
13516 312203 279306 375743 223804 206811 285288 482845 147555 -125542 -5556 -184357
13506 -184357 -358625 -405835 -98926 76854 202741 103606 714 57578 -65790 -46985
13496 -46985 203144 -33684 -86592 -15940 131763 72004 -277514 -509646 -477089 -534790 -650634
13485 -650634 -499395 -273335 -65119 183549 163491 165023 258231 351754 396019 406341 376728
13474 376728 26635 -230796 -184022 -193572 -131973 -253879 -220095 -292461 -360105 -398878 -97018
$$ packed form
13546a88567K45800K66216j04636J70647J03960m6918l24705K12456L7440j64314
13536B07379m9753l4917o2361k00830j80108j11281J02431L0043j49127L4741
13526d13783j3866l12720K35231K5633K69547J55719L3195J04055Q0290J48902
13516C12203l2897R6437j51939j6993P8477J97557l35290k73097J19986j78801
13506a84357j74268m7210L06909J75780J25887r9135j02892N6864j23368J8805
13496d6985K50129k36828n2908P0652J47703n9759l49518k32132L2557n7701j15844
13485f50634J51239K26060K08216K48668k0058J532R3208R3523M4265J0322k9613
13474C76728l50093k57431M6774r550O1599j21906L3784p2366o7644l8773L01860
$$ plain form
13463 -97018 136165 49689 44686 -38221 -113469 -12612 163732 -96045 -458835 -418023 -249075
13452 -249075 -100278 -492832 -917573 -688597 -431282 -320152 -60596 98256 125069 137167
13442 137167 103141 146560 132304 1639 -150796 -104606 -254234 -272747 -271499 -55942 66492
13431 66492 25043 48388 75119 217444 105874 67527 -165087 -244347 -353796 -97068 311769
13420 311769 332308 135967 155502 -197955 -374134 -442978 -432695 -219693 -179991 -368571
13410 -368571 -611507 -422451 -361633 -336258 -273725 -340097 -244261 -279674 -221612 36220 213960
13399 213960 52579 8383 -70541 -126045 -209361 -226586 -93220 -9692 48704 285360 390867
13388 390867 328932 217368 190910 366964 469680 296569 216584 298482 285507 -132246
$$ packed form
13463i7018K33183q6476n003q2907p5248J00857J76344k59777l62790M0812J68948
13452b49075J48797l92554m24741K28976K57315J11130K59556J58852K6813J2098
13442A37167l4026M3419j4256j30665j52435M6190j49628j8513J248K15557J22434
13431F6492m1449K3345K6731J42325j11570l8347k32614p9260j09449K56728M08837
13420C11769K0539j96341J9535l53457j76179o8844J0283K13002L9702j88580
13410c68571k42936J89056O0818K5375O2533o6372R5836l5413N8062K57832J77740
13399B13960j61381m4196p8924n5504q3316j7225J33366Q3528N8396K36656J05507
13388C90867o1935j11564k6458J76054J02716j73111p9985Q1898j2975m17753
$$ plain form
13378 -132246 -636988 -516227 -126509 -75857 40740 253122 258692 259295 253208 558476 185713
13367 185713 -49106 265907 299532 209149 18460 -121526 -292840 -349912 -175271 95895
13357 95895 121872 -150211 -325032 -71800 -75221 173194 146453 210242 155515 -102835 -121609
13346 -121609 -340335 -348561 -220171 74639 56751 -54648 70248 -13377 -145308 -59059
13336 -59059 10933 147036 324133 350437 397830 470212 176692 140555 -153647 -194271 -268339
13325 -268339 -460889 -330527 -184025 -11871 17853 -71729 -39571 144803 -7702 98971
13315 98971 23334 -206355 -79628 -52160 -58488 362379 574103 449411 233423 70175
13305 70175 254439 178700 196609 332800 158164 282213 211006 45156 -5544 -39530 76775
$$ packed form
13378a32246n04742J20761L89718N0652J16597K12382N570O03o087L05268l72763
13367A85713k34819L15013L3625r0383j90689j39986j71314n7072J74641K71166
13357I5895K5977k72083j74821K53232l421K48415k6741O3789n4727k58350j8774
13346a21609k18726q226J28390K94810j7888j11399J24896q3625j31931Q6249
13336e9059O9992J36103J77097K6304M7393P2382k93520l6137k94202m0624p4068
13325b68339j92550J30362J46502J72154K9724q9582L2158J84374j52505J06673
13315I8971p5637k29689J26727K7468o328M20867K11724j24692k15988j63248
13305G0175J84264p5739J7909J36191j74636J24049p1207j65850n0700l3986J16305
$$ plain form
13294 76775 108903 50719 90449 -114243 -184258 -106740 -205128 -154246 -324330 -401985 -215412
13283 -215412 -460425 -577792 -519767 -245717 238811 298933 382516 415595 292297 1401
13273 1401 -188194 -107233 -45368 19339 479820 545714 562260 436332 86068 -85146 -238101
13262 -238101 -213058 -274958 -323137 -312535 51796 164258 -15289 -72118 -106701 -134252 -75287
13251 -75287 83455 -158535 -328131 -345180 -576227 -682968 -591933 -464211 -193048 169562
13241 169562 341894 245725 -49934 -300936 -271880 52457 109864 31629 119938 68470 192707
13230 192707 94105 99116 -5477 -74184 194898 222676 128843 271129 403716 401228 197945
13219 197945 140663 36786 -68855 -98557 -35380 138773 266655 429534 208081 94680
$$ packed form
13294G6775L2128n8184L9730k04692p0015P7518r8388N0882j70084p7655J86573
13283b15412k45013j17367N8025K74050M84528O0122Q3583L3079j23298k90896
13273A401j89595Q0961O1865O4707M60481O5894J6546j25928l50264j71214j52955
13262b38101K5043o1900m8179J0602L64331J12462j79547n6829l4583k7551N8965
13251g5287J58742k41990j69596j7049k31047j06741R1035J27722K71163L62610
13241A69562J72332r6169k95659k51002K9056L24337N7407p8235Q8309n1468J24237
13230A92707r8602N011j04593o8707K69082K7778r3833J42286J32587k488k03283
13219A97945n7282j03877j05641k9702O3177J74153J27882J62879k21453j13401
$$ plain form
13209 94680 11239 366029 585051 312349 235031 184284 111979 246660 365784 372690 -2870
13198 -2870 -262642 -131069 -191717 -201015 -150485 -309926 -221223 -225974 -284663 -131262 -62133
13187 -62133 -138344 -153230 -81467 -53204 11378 -83573 -78619 37312 100939 220878 89176
13176 89176 134168 258155 434188 618654 310940 -32499 -91154 115998 278333 186900
13166 186900 105908 413955 415898 252719 57651 -143459 -31335 -248759 -314711 38210
13156 38210 -67746 -201640 -234706 -28929 86784 -34733 -99291 -267958 -427373 -151289
13146 -151289 -111534 -31797 -134106 -3019 -48474 115333 89816 91521 205842 177239 70130
13135 70130 71358 202453 43831 -30219 -27572 -48232 25635 -180507 -141225 -100466 -186621
$$ packed form
13209I4680q3441L54790K19022k72702p7318n0747p2305J34681J19124O906l75560
13198b870k59772J31573o0648r298N0530j59441Q8703m751n8689J53401O9129
13187f2133p6211j4886P1763K8263O4582r4951M954J15931O3627J19939j31702
13176H9176M4992J23987J76033J84466l07714l43439n8655K07152J62335r1433
13166A86900q0992L08047J943j63179j95068k01110J12124k17424o5952L52921
13156C8210j05956j33894l3066K05777J15713j21517o4558j68667j59415K76084
13146a51289L9755P9737j02309J31087m5455J63807k5517J705J14321k8603j07109
13135G0130J228J31095j58622p4050K647k0660P3867k06142L9282M0759q6155
$$ plain form
13124 -186621 -100034 -124202 39400 314954 272382 -60722 -372461 -603539 -892976 -909876
13114 -909876 -749492 -689409 -190689 14658 -209357 15118 -111535 -340046 -336891 -112130
13104 -112130 164350 218974 66657 41420 54241 94450 -92589 22662 424462 250847
13094 250847 186179 275712 307401 257640 45651 -187039 -188209 -227205 -573866 -508377 -298314
13083 -298314 -270022 -272679 -432813 -431978 -87268 -72956 25279 168060 256126 132947 301333
13072 301333 283716 333080 697282 464030 425651 604625 299100 40014 -300552 -278805
13062 -278805 -294992 -324310 -289499 -68346 102339 -69215 14351 -61160 -123193 -144132 295232
13051 295232 318257 132716 77937 83277 -180322 -161970 11995 -113455 13340 170430
$$ packed form
13124a86621Q6587k4168J63602K75554m2572l33104l11739k31078k89437j6900
13114i09876J60384O0083M98720K05347k24015K24475j26653k28511L155K24761
13104a12130K76480N4624j52317k5237J2821M0209j87039J15251M01800j73615
13094B50847o4668Q9533L1689m9761k11989k32690j170l8996l46661O5489K10063
13083b98314K8292k657j60134Q35L44710J4312R8235J42781Q8066j23179J68386
13072C01333j7617M9364L64202k33252l8379J78974l05525k59086l40566K1747
13062b78805j6187k9318L4811K21153J70685j71554Q3566p5511o2033k0939M39364
13051B95232K3025j85541n4779N340k63599J8352J73965j25450J26795J57090
$$ plain form
13041 170430 112990 215614 210316 -85990 -156030 -35170 -126215 -109142 -46630 387661 482012
13030 482012 307201 247066 58957 -221401 -123185 -213029 -240092 -277387 -444075 -497774 -471740
13019 -471740 -377079 -289053 -105922 184641 95856 137593 151822 94050 196874 289344 20450
13008 20450 1395 -258276 -573086 -491750 -170486 -165459 -357352 -205831 24140 69221 -67309
12997 -67309 101114 170507 112881 121284 26891 -422702 -312931 -69843 -29581 -69644 -359182
12986 -359182 -338827 -299744 -6139 240335 187457 -102526 53984 368040 74020 -80750
12976 -80750 -45432 175996 147732 136343 382532 526375 435963 319247 -31126 -207743
12966 -207743 -67695 -90479 101874 12698 45957 -22435 140437 220906 83194 125302 285117
$$ packed form
13041A70430n7440J02624n298k96306p0040J20860r1045J7073O2512M34291R4351
13030D82012j74811o0135j88109k80358R8216q9844k7063l7295j66688n3699K6034
13019d71740R4661Q8026J83131K90563q8785M1737J4229n7772J02824R2470k68894
13008B0450j9055k59671l14810Q1336L21264N027j91893J51521K29971M5081j36530
12997f7309J68423O9393n7626Q403r4393m49593J09771K43088M0262m0063k89538
12986c59182K0355L9083K93605K46474n2878k89983J56510L14056k94020j54770
12976h0750L5318K21428k8264j1389K46189J43843r0412j16716l50373j76617
12966b07743J40048k2784J92353q9176L3259o8392J62872Q0469j37712M2108J59815
$$ plain form
12955 285117 611800 537681 219745 115797 -92978 -39732 141569 27829 -31062 123111
12945 123111 23836 -174792 -195846 -85213 118821 154117 176677 295482 214501 52687
12935 52687 -217503 3285 46140 204247 312359 374579 264170 60713 294051 313985
12925 313985 191098 63254 59764 90174 1045 -222774 -216352 -67213 138119 268649 240603
12914 240603 -57114 -255977 -374539 -522240 -491657 -300289 -222565 -236315 -87900 41766
12904 41766 86238 45820 -53733 -288705 -385481 -308576 -294831 -113747 -43556 189908 290362
12893 290362 216412 185084 416748 328428 109894 83414 87092 113757 -108690 -475894 -479801
12882 -479801 -227577 -219241 -247564 -226456 3305 20987 -92386 -202772 74439 279177
$$ packed form
12955B85117L26683p4119l17936j03948k08775N3246J81301j13740n8891J54173
12945A23111r9275j98628k1054J10633K04034L5296K2560J18805q0981j61814
12935E2687k70190K20788M2855J58107J08112O2220j10409k03457K33338J9934
12925C13985j22887j27844l490L0410q9129k23819O422J49139K05332J30530k8046
12914B40603k97717j98863j18562j47701L0583J91368P7724j3750J48415J29666
12904D1766M4472m0418r9553k34972r6776P6905J3745J81084P0191K33464J00454
12893B90362p3950l1328K31664q8320k18534k6480L678K6665k22447l67204l907
12882d79801K52224Q336k8323K1108K29761J7682j13373j10386K77211K04738
$$ plain form
12872 279177 272765 293323 235271 435779 252610 -5833 -42043 99492 135818 -128428 -338644
12861 -338644 -585372 -364475 -361323 -370011 -468953 -415683 -406517 -415245 -94844 -176826 -381006
12850 -381006 -614294 -793231 -438814 -95524 7924 99713 -46049 -92880 -20596 195683
12840 195683 451627 579843 636316 378270 13305 6886 356410 164623 -115473 -98205
12830 -98205 68825 73815 -196836 -189361 136985 87957 -116832 117251 153086 289225 54658
12819 54658 219070 351216 44619 -69940 -77396 103503 380629 364445 100891 138879
12809 138879 -12440 -26325 125989 78415 103459 151380 322029 425068 303566 229143
12799 229143 475217 588280 217945 -103301 -36293 -63319 20844 281038 563812 761203
$$ packed form
12872B79177o412K0558n8052K00508j83169k58443l6210J41535L6326k64246k10216
12861c38644k46728K20897L152q688r8942N3270R166q728L20401q1982k04180
12850c81006k33288j78937L54417L43290J03448R1789j45762m6831P2284K16279
12840A95683K55944J28216N6473k58046l64965o419L49524j91787k80096J7268
12830i8205J67030M990k70651P475L26346m9028k04789K34083L5835J36139k34567
12819E4658J64412J32146l06597j14559p456J80899K77126j6184k63554L7988
12809A38879j51319j3885J52314m7574K5044M7921J70649J03039j21502p4423
12799B29143K46074J13063l70335l21246O7008k7026Q4163K60194K82774J97391
$$ plain form
12789 761203 848086 556652 299886 181411 124074 117695 92681 40308 112066 -6059 -151557
12778 -151557 -310654 -412168 -471344 -161448 -111974 -202994 141872 238244 252872 41899
12768 41899 -88201 -107955 -467192 -503139 -189916 -184786 -6367 37780 -74815 -13523 199609
12757 199609 237364 118751 174194 98893 2958 50124 -180047 -233844 -271630 48380 258243
12746 258243 110246 82428 282903 173321 197760 40625 -64902 -109426 -75213 -304300
12736 -304300 -333404 -249315 -204528 174907 356657 300946 324173 327880 246871 -16862 177577
12725 177577 374983 376632 535766 269093 55453 188872 -83867 -328420 -382843 -396962
12715 -396962 -231790 -189894 -15782 160120 -65658 -378726 -472372 -373298 -251424 -114889
$$ packed form
12789G61203Q6883k91434k56766j18475n7337o379k5014n2373P1758j18125j45498
12778a51557j59097j01514n9176L09896M9474r1020L44866R6372J4628k10973
12768D1899j30100j9754l59237l5947L13223N130J78419M4147j12595O1292K13132
12757A99609L7755j18613N5443p5301r5935M7166k30171n3797l7786L20010K09863
12746B58243j47997k7818K00475j09582K4439j57135j05527m4524L4213k29087
12736c04300k9104Q4089M4787L79435J81750n5711K3227L707q1009k63733J94439
12725A77577J97406J649J59134k66673k13640J33419k72739k44553n4423j4119
12715c96962J65172M1896J74112J75902k25778l13068r3646R9074J21874J36535
$$ plain form
12705 -114889 164110 350484 169471 92008 -44939 115563 358989 363961 218536 83754
12695 83754 -284577 -118508 27393 -137809 272722 599722 462103 185832 97925 -90094
12685 -90094 -329176 -351777 -145059 9854 79155 111522 117084 175451 75861 -38520 -90358
12674 -90358 -236507 -220033 -145886 111515 188024 99997 192386 439297 407288 152782 28504
12663 28504 -124326 38634 212209 287395 255472 165591 24718 -332631 -167674 173301
12653 173301 -36203 -104327 -85141 4204 218775 215768 125762 52456 95060 217285 101864
12642 101864 78237 85054 253771 415336 22573 -62483 64174 145896 276201 295068 183932
12631 183932 229552 324522 49890 -387907 -427787 -327068 -114366 -484532 -596760 -438730
$$ packed form
12705a14889K78999J86374j81013p7463j36947J60502K43426M972j45425j34782
12695H3754l68331J66069J45901j65202M10531L27000j37619k76271q7907j88019
12685i0094k39082k2601K06718J54913O9301L2367N562N8367r9590j14381n1838
12674i0358j46149J6474P4147K57401P6509q8027R2389K46911l2009k54506j24278
12663B8504j52830J62960J73575P5186l1923q9881j40873l57349J64957L40975
12653A73301k09504o8124J9186Q9345K14571l007r0006p3306M2604J22225j15421
12642A01864k3627O817J68717J61565l92763q5056J26657Q1722J30305J8867j11136
12631A83932M5620R4970k74632m37797l9880J00719K12702l70166j12228J58030
$$ plain form
12621 -438730 -176934 -97994 -154641 -140199 -4142 -47305 -541123 -446634 -237413 -327659 -422599
12610 -422599 -430275 -80476 -166877 -69122 204849 -21227 -52760 -314071 -415785 -529025
12600 -529025 -580167 -514054 -266754 -236895 -427969 -511030 -354997 -296268 -97852 -44643 -98043
12589 -98043 181972 176238 111553 -70979 -77117 93465 -59307 -103562 159528 371601 342935
12578 342935 122794 165843 157204 280127 171980 340971 265496 277105 184804 161610 193115
12567 193115 635666 548282 493830 690541 496542 400510 274024 179880 337802 460751
12557 460751 557920 256920 -80948 -181953 -9817 157015 278261 323621 105552 -149535
12547 -149535 -319856 -223210 -31997 -181 55526 250578 229893 70558 21325 48326 62922
$$ packed form
12621d38730K61796P8940n6647J4442J36057m3163m93818R4489K09221r0246r4940
12610d22599p676L49799q6401R7755K73971k26076l1533k61311j01714j13240
12600e29025n1142O6113K47300K9859j91074q3061J56033N8729J98416N3209n3400
12589i8043K80015n734o4685j82532o138J70582j52772m4255K63090K12073k8666
12578C42935k20141M3049q639J22923j08147J68991p5475J1609r2301k3194L1505
12567A93115M42551q7384n4452J96711j93999r6032j26486r4144J57922J22949
12557D60751R7169l01000l37868j01005J72136J66832J21246M5360k18069k55087
12547a49535j70321R6646J91213L1816N5707J95052k0685j59335m9233K7001J4596
$$ plain form
12536 62922 -225804 -322698 -269735 -32716 15765 8723 -88165 -123408 -61956 63728 182210
12525 182210 -11309 -16537 -78419 258120 412593 334622 431894 410405 264640 117653 20464
12514 20464 -52385 -129046 -139208 -164354 163568 420382 538292 164226 -188063 -274730 -296694
12503 -296694 99154 455816 329686 -97366 -63473 -266079 -253043 -221293 -101874 -69563
12493 -69563 -229258 -160652 -162575 -64554 37940 -61688 -54474 -260498 -200627 223140 468303
12482 468303 510469 464093 84002 398644 441895 433746 397206 370848 7119 -231088 -108287
12471 -108287 -58894 27843 109198 104980 79649 204131 -22490 20500 150093 383199 410025
12460 410025 194445 79733 169298 309666 371530 336710 282365 302884 205526 37357 6936
$$ packed form
12536F2922k88726r6894N2963K37019M8481p042r6888l5243O1452J25684J18482
12525A82210j93519n228o1882L36539J54473p7971R7272k1489j45765j46987r7189
12514B0464p2849p6661j0162k5146L27922K56814J17910l74066l52289q6667k1964
12503b96694L95848L56662j26130m27052L3893k02606J3036L1750J19419L2311
12493f9563j59695O8606j923R8021J02494r9628P214k06024N9871M23767K45163
12482D68303M2166m6376l80091L14642M3251q149l6540k6358l63729k38207J22801
12471a08287M9393Q6737Q1355m218k5331J24482k26621M2990J29593K33106K6826
12460D10025k15580j14712Q9565J40368O1864l4820n4345K0519r7358j68169l0421
$$ plain form
12449 6936 -22200 35913 148906 268781 322985 83709 175111 92525 -151350 -405729 -283563
12438 -283563 -199875 213485 465873 180061 56628 -299529 -644039 -577316 -390610 -195476
12428 -195476 14061 78491 146060 150769 4555 45320 291814 263065 126216 156858 254816
12417 254816 218238 125856 -49561 -244544 -72691 -183442 -58115 141157 317372 301881
12407 301881 238645 255829 495620 474594 200964 -532 -147673 -32362 -41248 -130348 -35505
12396 -35505 34299 76489 -97237 -79194 -77492 -472 -127391 44361 441982 693066 735477
12385 735477 547419 338693 128407 16944 532253 645554 523118 149570 266215 622003
12375 622003 505574 353622 359666 312149 680090 955257 1325248 1369569 1683545 1841910
$$ packed form
12449F936k9136N8113J12993J19875N4204k39276R1402q2586k43875k54379J22166
12438b83563Q3688M13360K52388k85812j23433l56157l44510O6723J86706J95134
12428a95476K09537O4430O7569M709j46214M0765K46494k8749j36849L0642R7958
12417B54816l6578r2382j75417j94983J71853j10751J25327J99272J76215j5491
12407C01881o3236J7184K39791k1026k73630k01496j47141J15311q886q9100R4843
12396c5505O9804M2190j73726J8043J702P7020j26919J71752L97621K51084M2411
12385G35477j88058k08726k10286j11463N15309J13301j22436l73548J16645L55788
12375F22003j16429j51952O044m7517L67941K75167L69991M4321L13976J58365
$$ plain form
12365 1841910 1829867 1514777 1140301 1124983 1192553 1225677 1309051 1240302 1053094 874728
12355 874728 984959 1262365 1303708 1569249 1662514 1624188 1429307 1333506 1362257 1292174 1296328
12344 1296328 1396586 1165994 1138862 1485162 1542669 1395272 1322094 1344545 1486815 1540364
12334 1540364 1661037 1952784 2109872 2013772 2178146 2454390 2980662 3288168 3625333 4048020
12324 4048020 4265075 4254241 3904342 3321796 2727815 2740024 2893633 2639404 2262871 2160384
12314 2160384 1898525 2040129 2194703 2104971 1742362 1858556 2083868 1904971 1517468 1370944
12304 1370944 1422357 1240056 1315355 1508075 1549344 1415845 1431385 1755792 1837872 1978095
12294 1978095 1876071 1637234 1459651 1439067 1479094 1227783 1323243 1736591 1974277 1898705
$$ packed form
12365A841910j2043l15090l74476j5318O7570L3124Q3374o8749j87208j78366
12355H74728J10231K77406M1343K65541R3265l8326j94881r5801K8751p0083M154
12344A296328J00258k30592k7132L46300N7507j47397p3178K2451J42270N3549
12334A540364J20673K91747J57088r6100J64374K76244N26272L07506L37165M22687
12324D048020K17055j0834l49899n82546n93981J2209J53609k54229l76533j02487
12314B160384k61859J41604J54574q9732l62609J16194K25312j78897l87503j46524
12304A370944N1413j82301P5299J92720M1269j33499J5540L24407Q2080J40223
12294A978095j02024k38837j77583k0584M0027k51311R5460M13348K37686p5572
$$ plain form
12284 1898705 1773175 1944528 2212798 2058907 1287435 1063815 1140308 1322605 1139437 1034979
12274 1034979 1032868 986113 904642 892353 457770 358951 412666 680518 781377 742881 674500
12263 674500 606042 657974 691365 620527 474530 524945 881751 725028 575100 469257
12253 469257 332621 608369 886980 531907 -88674 -259884 17291 62291 55113 85702
12243 85702 27288 -2895 200646 246245 295145 328477 55235 -228572 -566398 -553491 -314537
12232 -314537 -196711 -86546 -14741 159003 13261 37155 -51482 162999 194145 -126899
12222 -126899 121341 304072 230685 306974 26237 -48626 111166 269305 191414 -192401
12212 -192401 -366944 -365017 -73055 139908 248477 328276 225134 59698 -28136 -14447
$$ packed form
12284A898705j25530J71353K68270j53891p71472k23620P6493J82297j83168j04458
12274A034979k111m6755q1471j2289m34583r8819N3715K67852J00859l8496o8381
12263F74500o8458N1932L3391p0838j45997N0415L56806j56723j49928j05843
12253D69257j36636K75748K78611l55073o20581j71210K77175M5000p178L0589
12243H5702n8414l0183K03541M5599M8900L3332k73242k83807l37826J2907K38954
12232c14537J17826J10165P1805J73744j45742K3894q8637K14481L1146l21044
12222a26899K48240J82731p3387P6289k80737p4863J59792J58139p7891l83815
12212a92401j74543J927K91962K12963J08569P9799j03142j65436q7834J3689
$$ plain form
12202 -14447 118915 245774 440622 373145 327927 384635 469854 504662 639853 654073 378898
12191 378898 220649 383370 389147 241147 508541 758796 592767 328935 -89373 -234289
12181 -234289 -78302 26836 79976 258598 242241 263596 333996 347916 352090 500939 761974
12170 761974 641317 636164 667328 388903 241916 350817 421325 507205 499608 576682 263104
12159 263104 134961 232555 187425 50328 240031 348919 41313 -176439 -265555 -224264
12149 -224264 -155434 -53437 63961 205449 237219 300271 247003 143208 323248 488316
12139 488316 489983 180209 -131829 -82618 147162 212252 198632 225081 144763 331017 345347
12128 345347 344174 260505 88986 58476 5411 -152926 29622 -145495 -278772 -408816
$$ packed form
12202a4447J33362J26859J94848o7477m5218N6708Q5219L4808J35191J4220k75175
12191C78898j58249J62721N777j48000K67394K50255j66029k63832m18308j44916
12181b34289J55987J05138N3140J78622j6357K1355P0400J3920M174J48849K61035
12170G61974j20657n153L1164k78425j46987J08901P0508Q5880p597P7074l13578
12159B63104j28143R7594m5130j37097J89703J08888l07606k17752q9116M1291
12149b24264O8830J01997J17398J41488L1770O3052n3268j03795J80040J65068
12139D88316J667l09774l12038M9211K29780O5090j3620K6449q0318J86254J4330
12128C45347j173q3669j71519l0510n3065j58337J82548j75117j33277j30044
$$ plain form
12118 -408816 -366042 -245540 46329 258576 326584 411522 237040 -69733 -27548 278087
12108 278087 127958 37699 -81663 -90479 125585 235874 116551 70905 308144 517272
12098 517272 795731 497641 346417 444606 484005 287185 227305 185199 -69451 22725
12088 22725 174220 263954 209936 144166 99607 95303 28419 -192687 -379166 -214952 153961
12077 153961 383230 690774 590140 395059 243842 249233 464855 610882 706741 816065
12067 816065 795061 578250 414539 405113 370510 496137 571930 633463 472656 399862 477057
12056 477057 669576 581283 440843 760570 740508 771744 775392 804967 911512 818993 825714
12045 825714 1089881 1127401 1087215 782286 650125 855064 823537 730056 754611 720119 732145
$$ packed form
12118d08816M2774J20502K91869K12247O8008Q4938j74482l06773M2185L05635
12108B78087j50129r0259j19362q816K16064J10289j19323m5646K37239K09128
12098E17272K78459k98090j51224R8189L9399j96820n9880m2106k54650R2176
12088B2725J51495Q9734n4018o5770m4559m304o6884k21106j86479J64214L68913
12077A53961K29269L07544j00634j95081j51217N391K15622J46027R5859J09324
12067H16065k1004k16811j63711r426l4603J25627P5793O1533j60807p2794P7195
12056D77057J92519q8293j40440L19727k0062L1236L648K9575J06545r2519O721
12045H25714K64167L7520m0186l04929j32161K04939l1527r3481K4555l4492J2026
$$ plain form
12034 732145 937429 1127382 817864 971968 1207494 1484207 1641433 1381258 972651 738713
12024 738713 667704 378494 148518 148319 220733 357203 479610 600911 766785 694721 721164
12013 721164 464695 293754 417817 757326 789769 723570 762444 872337 1029386 1123171
12003 1123171 1026013 871990 864210 636389 504398 519529 429877 479712 774404 961307
11993 961307 1096740 973250 1087266 1100377 1248108 1407543 1221354 826541 551371 215296
11983 215296 325275 652687 772738 639905 531091 181087 26565 364758 623716 586852
11973 586852 569890 598327 654885 1053825 1223622 1015395 861448 991359 1104949 1176646
11963 1176646 1161419 1367565 1305891 1397416 1322318 1336738 1283256 1043391 1219344 1254560 1496494
$$ packed form
12034G32145K05284J89953l09518J54104K35526K76713J57226k60175m08607k33938
12024G38713p1009k89210k29976j99P2414J36470J22407J21301J65874p2064K6443
12013G21164k56469j70941J24063L39509L2443o6199L8874J09893J57049R3785
12003A123171r7158j54023p780k27821j31991J5131q9652M9835K94692J86903
11993I61307J35433j23490J14016J3111J47731J59435j86189l94813k75170l36075
11983B15296J09979L27412J20051j32833j08814l50004j54522L38193K58958l6864
11973E86852j6962K8437N6558L98940J69797k08227j53947J29911J13590P1697
11963A176646j5227K06146o1674R1525p5098J4420n3482k39865J75953L5216K41934
$$ plain form
11952 1496494 1582315 1237183 1467170 1720696 1702215 1548075 1542856 1874650 2516549 2785902
11942 2785902 2863352 2920883 2886364 3255553 3928910 4448619 4883799 5383574 5888294 6217347
11932 6217347 6811638 7948890 9019980 9984824 11475762 13160962 15258719 17635690
11924 17635690 20589851 24590818 30325143 38131128 49336525 66046882 91888339 131003700
11916 131003700 183449297 239091704 287092412 331108622 361206688 349469772 282043255
11909 282043255 205483442 149966829 113229045 89475772 73701257 62736770 54791667
11902 54791667 49057447 44300969 40355375 37720220 35187948 32845033 30887439 29174431
11894 29174431 27751832 26081122 24901338 24055354 22975296 22107874 21492354 20825114 20346836
$$ packed form
11952A496494Q5821l45132K29987K53526j8481j54140n219L31794O41899K69353
11942B785902P7450N7531l4519L69189O73357N19709M35180M99775N04720L29053
11932F217347N94291J137252J071090R64844J490938J685200K097757K376971
11924A7635690K954161M000967N734325P805985J1205397J6710357K5841457L9115361
11916A31003700N2445597N5642407M8000708M4016210L0098066j1736916o7426517
11909B82043255p6559813n5516613l6737784k3753273j5774515j0964487p945103
11902E4791667n734220m756478l945594k635155k532272k342915j957594j713008
11894B9174431j422599j670710j179784q45984j080058q67422o15520o67240m78278
$$ plain form
11885 20346836 19629248 19230036 18963919 18770916 18542169 18893221 19078456 19069808 19123741 18914803
11875 18914803 18910650 18598969 17587590 16658770 16159915 15737834 14789407 13892198 13196194
11866 13196194 12728174 12139764 11365761 10840505 10648716 10267977 9789563 9539610 9458937
11857 9458937 9419390 8996501 8832606 8448542 8123043 8028868 8181501 7956745 7579052 7586380
11847 7586380 7433485 7318342 7191720 6929688 6660719 6721324 6392225 6053867 5897112 5625576
11837 5625576 5645714 5581197 5650073 5650684 5462264 5434782 5285337 5016659 4706529 4432276 4264771
11826 4264771 3918385 3838504 3929415 4333238 4435682 4350482 4212605 3930685 3786457 3968849
11816 3968849 3730801 3424817 3338307 3389610 3587007 3573057 3606577 3650396 3535492 3258658
$$ packed form
11885B0346836p17588l99212k66117j93003k28747L51052J85235q648N3933k08938
11875A8914803m153l11681j011379r28820m98855m22081r48427q97209o96004
11866A3196194m68020n88410p74003n25256j91789l80739m78414k49953q0673
11857I458937l9547m22889j63895l84064l25499r4175J52633k24756l77693P328
11847G586380j52895j15143j26622k62032k68969O0605l29099l38358j56755k71536
11837E625576K0138o4517O8876O11j88420k7482j49445k68678l10130k74253j67505
11826D264771l46386p9881R0911M03823J02444q5200j37877k81920j44228J82392
11816C968849k38048l05984q6510N1303J97397j3950L3520M3819j14904k76834
$$ plain form
11806 3258658 2946080 2978395 2809949 2720879 2999416 3342142 3047913 2867073 2730404 3004822
11796 3004822 2830992 2657560 2784789 3118214 3299901 3061193 2943115 2748255 2701049 2702681
11786 2702681 2632409 2747243 2929291 2972912 2778915 2392038 2457955 2794801 2932163 2827433
11776 2827433 2847248 2657414 2613245 2542504 2309068 2426221 2278507 2104404 1953470 1973336
11766 1973336 1727885 1662455 1919453 1860368 1790269 1709913 1809110 1735395 1767792 1478679 1323945
11755 1323945 1090848 1313143 1543285 1694760 1376130 1226483 1126595 1196571 1285296 1581114
11745 1581114 1358094 1131088 1085386 943567 987663 1177860 1142918 1113273 1050898 778287
11735 778287 994563 1260760 1141505 980643 1162749 1239845 850076 764468 501107 431771
$$ packed form
11806C258658l12578L2315j68446q9070K78537L42726k94229j80840j36669K74418
11796C004822j73830j73432J27229L33425J81687k38708j18078j94860m7206J632
11786B702681p0272J14834J82048M3621j93997l86877O5917L36846J37362j04730
11776B827433J9815j89834m4169p0741k33436J17153j47714j74103j50934J9866
11766A973336k45451o5430K56998n9085p0099q0356R9197p3715L2397k89113j54734
11755A323945k33097K22295K30142J51475l18630j49647r9888O9976Q8725K95818
11745A581114k23020k27006m5702j41819M4096J90197l4942k9645o2375k72611
11735G78287K16276K66197j19255j60862J82106P7096l89769q5608k63361o9336
$$ plain form
11725 431771 379002 343857 376965 359416 256091 332084 385586 417141 577952 343314 637812
11714 637812 927260 1064236 956801 648218 551763 681726 707770 570603 530384 714682
11704 714682 751103 728040 718607 800661 747951 564041 745772 587950 312499 394038 574631
11693 574631 662037 756335 597494 394863 417754 350936 93655 239588 422102 411144
11683 411144 133221 185011 448981 698762 750030 746888 700189 441675 124748 115133 176109
11672 176109 404871 360817 153633 -31663 203072 558311 502819 290660 481477 584997
11662 584997 335571 199557 207950 245487 432769 581744 828618 887707 699096 434594
11652 434594 354457 353894 280380 211083 214173 285916 306679 475071 367599 318224 370283 -32439
$$ packed form
11725D31771n2769l5145L3108j7549j03325P5993N3502L1555J60811k34638K94498
11714F37812K89448J36976j07435l08583r6455J29963K6044j37167m0219J84298
11704G14682L6421k3063r433Q2054n2710j83910J81731j57822k75451Q1539J80593
11693E74631Q7406R4298j58841k02631K2891o6818k57281J45933J82514j0958
11683D11144k77923N1790K63970K49781N1268l142m6699k58514l16927r615O0976
11672A76109K28762m4054k07184j85296K34735L55239n5492k12159J90817J03520
11662E84997k49426j36014Q393L7537J87282J48975K46874N9089j88611k64502
11652D34594q0137n63p3514o9297L090P1743K0763J68392j07472m9375N2059m02722
$$ plain form
11640 -32439 -112935 94545 -85522 -183578 154232 378803 623399 698049 521129 237993
11630 237993 250532 526742 453954 603089 478493 357758 521156 551544 485322 437292
11620 437292 233327 141716 277856 147539 -28241 59998 132438 159835 84862 143794 84625
11609 84625 -344 -4916 165797 109830 -121893 46067 286303 234202 314986 231672 68421
11598 68421 -918 80480 172862 163436 322616 318421 403554 411033 405950 240847 -11304 -243075
11586 -243075 -36583 -17655 -17517 -214658 -338872 -264871 -175004 7674 150536 442862 507925
11575 507925 507601 463110 340341 571014 587211 504799 434704 288740 300592 166741 -76175
11564 -76175 -282915 -269109 -99078 49066 189190 353468 295474 -24739 109512 116850
$$ packed form
11640c2439q0496K07480j80067r8056L37810K24571K44596P4650j76920k83136
11630B37993J2539K76210p2788J49135j24596j20735J63398L0388o6222m8030
11620D37292k03965r1611J36140j30317j75780Q8239P2440K7397p4973N8932n9169
11609H4625q4969m572J70713n5967k31723J67960K40236n2101Q0784q3314j63251
11598F8421o9339Q1398R2382r426J59180m195Q5133P479n083j65103k52151k31771
11586b43075K06492J8928J38j97141j24214P4001Q9867J82678J42862K92326O5063
11575E07925l24m4491j22769K30673J6197q2412p0095j45964J1852j33851k42916
11564g6175k06740J3806J70031J48144J40124J64278n7994l20213J34251P338
$$ plain form
11554 116850 -7245 3301 108214 89555 142311 32456 -208776 -72967 -9238 -311064
11544 -311064 -244072 -296539 -114495 39836 -1631 180886 163538 116070 88760 -156087 126861
11533 126861 288827 295514 203841 254289 73659 238570 135358 29626 -24399 172341
11523 172341 -32434 -146454 121145 322359 -62614 -307334 -356750 -300065 37687 71894
11513 71894 353545 49166 96382 209206 250613 228224 121074 139564 172090 93390 4343
11502 4343 85337 47979 338662 518256 571462 814495 611736 483056 358476 488246
11492 488246 404315 382498 568052 387916 192841 103970 -48348 -269666 -286896 -79135
11482 -79135 -44307 153171 253454 206352 167412 429377 307463 82252 136878 -28098
$$ packed form
11554A16850j24095J0546J04913j8659N2756j09855k41232J35809O3729l01826
11544c11064O6992n2467J82044J54331m1467J82517j7348m7468k7310k44847K82948
11533A26861J61966O687r1673N0448j80630J64911j03212j05732n4025J96740
11523A72341k04775j14020K67599K01214l84973k44720m9416N6685L37752L4207
11513G1894K81651l04379M7216J12824M1407k2389j07150J8490L2526p8700q9047
11502D343Q0994l7358K90683J79594N3206K43033k02759j28680j24580J29770
11492D88246q3931k1817J85554j80136j95075q8871j52318k21318j7230K07761
11482g9135L4828J97478J00283m7102l8940K61965j21914k25211N4626j64976
$$ plain form
11472 -28098 -12585 -46339 -64912 -43443 -73485 -64614 -73165 232408 290268 -30453 -182127
11461 -182127 -242811 52851 180490 141812 313009 311724 350159 394694 383345 351540 252841
11450 252841 198625 -94496 -133062 -218491 -54788 -65805 -192200 -297516 -265241 -103139
11440 -103139 237070 214196 11990 -59668 -58281 86390 -97445 -234879 -215174 -119356 191623
11429 191623 101761 155868 268257 257616 306116 353173 532523 399327 473603 361363 -63170
11418 -63170 -154049 -83419 -164295 -240072 -145364 -125106 83805 175953 182955 135200 143798 182542
11406 182542 77348 -97597 -280049 -238480 17699 80321 115337 126301 332604 195535
11396 195535 -114211 -77555 157270 244865 149335 105115 274407 145840 -45763 -5662
$$ packed form
11472b8098J5513l3754j8573K1469l0042Q871q551L05573N7860l20721j51674
11461a82127o0684K95662J27639l8678J71197j285L8435M4535j1349l1805r8699
11450B52841n4216k93121l8566q5429J63703j1017j26395j05316L2275J62102
11440a03139L40209k2874k02206p1658J387J44671j83835j37434J9705R5818L10979
11429A91623q9862N4107J12389j0641M8500M7057J79350j33196P4276j12240m24533
11418f3170r0879P0630q0876p5777R4708K0258K08911R2148P002m7755Q598L8744
11406A82542j05194j74945j82452M1569K56179O2622L5016J0964K06303j37069
11396A95535l09746L6656K34825Q7595r5530m4220J69292j28567j91603M0101
$$ plain form
11386 -5662 27268 -48587 -282549 -209982 -305729 -440571 -635383 -619077 -271030 -151954 -257367
11375 -257367 -356988 -219329 -110360 -80272 -11687 219596 115791 154470 226494 116361
11365 116361 -11341 -139067 -184946 -325033 -368128 -255231 -290700 -68573 80709 164987
11355 164987 75388 -203651 -138130 -67934 19554 200298 49239 -292879 -370884 -449868 -231812
11344 -231812 -138660 -380392 -269272 151955 491345 195603 -62523 -75622 89917 243461
11334 243461 150874 274721 427243 402930 371144 246283 302149 378322 592027 502235 58908
11323 58908 -145441 -379021 -422319 -439920 -131258 33206 -51158 77655 188383 135244
11313 135244 188408 332173 500815 702228 354234 -10225 -320759 -498075 -503167 -480013
$$ packed form
11386e662L2930p5855k33962P2567r5747j34842j94812J6306L48047J19076j05413
11375b57367r9621J37659J08969L0088O8585K31283j03805L8679P2024j10133
11365A16361j27702j27726m5879j40087m3095J12897l5469K22127J49282Q4278
11355A64987q9599k79039O5521P0196Q7488J80744j51059l42118p8005p8984K18056
11344b31812R3152k41732J11120M21227L39390k95742k58126j3099J65539J53544
11334B43461r2587J23847J52522k4313l1786j24861N5866P6173K13705q9792m43327
11323E8908k04349k33580m3298j7601L08662J64464q4364J28813J10728n3139
11313A35244N3164J43765J68642K01413l47994l64459l10534j77316n092K3154
$$ plain form
11303 -480013 -346002 -205659 -193630 -312789 -256025 -69186 -174619 -75328 -54898 -121253
11293 -121253 -56075 65354 19926 58682 255423 357502 98369 26898 298501 330389
11283 330389 76033 -201467 -233352 -154468 -27158 -59692 -111850 -101835 -38800 110376 98460
11272 98460 206523 243367 177978 16655 149678 206257 44363 -102513 -131899 -258849
11262 -258849 -262004 -368978 -414536 -92114 94156 13396 43250 334307 126501 -145999
11252 -145999 -245284 -256884 -314784 -191369 -166059 -320909 -298229 -138869 -7001 160992
11242 160992 108027 -42243 -199927 -259207 -122910 219147 286128 125671 -18886 14237
11232 14237 181949 387347 265991 141701 217960 336972 247167 105523 -105106 -193126
$$ packed form
11303d80013J34011J40343J2029j19159N6764J86839j05433R9291K0430o6355
11293a21253O5178J21429m5428L8756J96741J02079k59133p1471K71603L1888
11283C30389k54356k77500l1885P8884J27310l2534n2158J0015O3035J49176j1916
11272I8460J08063L6844o5389j61323J33023N6579j61894j46876k9386j26950
11262b58849l155j06974m5558L22422J86270q0760K9854K91057k07806k72500
11252a45999r9285j1600n7900J23415K5310j54850K2680J59360J31868J67993
11242A60992n2965j50270j57684n9280J36297L42057O6981j60457j44557L3123
11232A4237J67712K05398j21356j24290P6259J19012q9805j41644k10629q8020
$$ plain form
11222 -193126 5818 60989 39712 45610 204023 217851 -57444 74482 236131 176081 15771
11211 15771 -115930 -169351 -225148 -557989 -792958 -786624 -409329 -161549 -139990 -85513 -2341
11200 -2341 -13614 -167829 -246366 11174 172416 -20722 -296300 54793 241288 335224
11190 335224 358902 267669 193509 142022 -32098 -76121 -141245 -12270 48256 114934 177044
11179 177044 -13791 105311 158799 230648 164673 -76520 -294374 -519610 -494216 -263390
11169 -263390 -164752 -184916 -204175 -331091 -293685 -253129 -237664 -114466 -244598 -298640 -155954
11158 -155954 -106831 67127 113605 -197314 -313942 110240 -101363 -55903 -23563 284963
11148 284963 584603 494532 361381 277536 321942 139919 82303 93791 105843 20757 -7256
$$ packed form
11222a93126J98944N5171k1277N898J58413J3828k75295J31926J61649o0050j60310
11211A5771j31701n3421n5797l32841k34969O334L77295K47780K1559N4477Q3172
11200b341j1273j54215p8537K57540J61242j93138k75578L51093J86495R3936
11190C35224K3678r1233p4160n1487j74120m4023o5124J28975O0526O6678O2110
11179A77044j90835J19102N3488P1849o5975k41193k17854k25236K5394K30826
11169b63390R8638k0164j9259j26916L7406M0556J5465J23198j30132n4042J42686
11158a55954M9123J73958M6478l10919j16628M24182k11603M5460L2340L08526
11148B84963K99640r0071j33151q3845M4406j82023n7616J1488J2052q5086k8013
$$ plain form
11137 -7256 -280658 -25073 90127 -147468 -201889 94858 143375 59979 -33337 -19075 7819
11126 7819 -279439 -340165 -4848 -80999 -447486 -227405 152509 98733 127660 54213 -139638
11115 -139638 -28541 35597 -75801 -213240 -77279 77960 36692 -91704 20723 161577
11105 161577 317867 -34449 -228851 -281379 1739 132330 -36324 16634 -21134 -274925
11095 -274925 -197432 85407 416951 542292 294175 273275 209833 204574 460170 361829 34132
11084 34132 -170920 -50342 15336 -35044 -38749 -203852 -13210 331750 593878 802765
11074 802765 737298 365414 -96928 -299188 -365061 -445251 -212433 -252549 -95712 -22368
11064 -22368 -95598 -135469 -160738 -61941 188285 442944 347331 71094 -110126 75280 381828
$$ packed form
11137g256k73402K55585J15200k37595n4421K96747M8517q3396r3316J4262K6894
11126G819k87258o0726L35317p6151l66487K20081L79914n3776K8927p3447j93851
11115a39638J11097O4138j11398j37439J35961J55239m1268j28396J12427J40854
11105A61577J56290l52316j94402n2528K83118J30591j68654N2958l7768k53791
11095b74925P7493K82839L31544J25341k48117k0900o3442n259K55596r8341l27697
11084C4132k05052J20578O5678n0380l705j65103J90642L44960K62128K08887
11074H02765o5467l71884m62342k02260o5873q0190K32818m0116J56837P3344
11064b2368p3230l9871k5269R8797K50226K54659r5613k76237j81220J85406L06548
$$ plain form
11053 381828 204649 -163407 -229707 -291074 30096 450869 510189 392136 427286 430493 703100
11042 703100 654486 538080 426113 259533 311576 413974 581919 893599 1144038 1295136
11032 1295136 989205 659171 718441 1260843 1680309 1578570 1408160 1375118 1585300 1905787
11022 1905787 2601017 2823196 2674521 2658545 2347055 2226753 2029834 1960665 1897075 1767651
11012 1767651 1611660 1526653 1575929 1408205 1477582 1736483 1824495 1738524 1155653 1056763
11002 1056763 797006 531511 1000859 1178901 1305061 1075829 503215 325483 408436 602960
10992 602960 766861 769588 439433 275866 362768 214621 -77366 -110692 -68992 -64612 130895
10981 130895 521562 453295 370404 208022 89713 246153 462719 456068 265785 2203
$$ packed form
11053C81828j77179l68056o6300o1367L21170M20773N9320j18053L5150L207K72607
11042G03100m8614j16406j11967j66580N2043J02398J67945L11680K50439J51098
11032A295136l05931l30034N9270N42402M19466j01739j70410l3042K10182L20487
11022A905787O95230K22179j48675j5976l11490j20302j96919o9169o3590j29424
11012A767651j55991q5007M9276j67724O9377K58901Q8012q5971n82871r8890
11002A056763k59757k65495M69348J78042J26160k29232n72614j77732Q2953J94524
10992F02960J63901K727l30155j63567Q6902j48147k91987l3326M1700M380J95507
10981A30895L90667o8267q2891j62382j18309J56440K16566o651j90283k63582
$$ plain form
10971 2203 102129 285831 170595 -48483 81088 98791 222613 666143 801207 466836
10961 466836 275329 179920 148336 254551 420499 313923 559289 526479 195160 101388
10951 101388 242731 151904 198565 -111538 -9868 28312 -5750 -193103 -297217 -403239
10941 -403239 -324374 93602 202461 75845 420504 291311 359378 397056 348845 312173
10931 312173 404913 427505 288757 207686 353840 -89940 -46909 51843 -11031 -37245 -139139
10920 -139139 -149073 -286269 -595636 -672398 -293722 -5266 327642 160770 41087 289066
10910 289066 298307 133030 507602 864586 750595 731388 760699 370270 206671 -7174
10900 -7174 -143704 -82413 7167 -94178 -275858 -322860 -110476 -32152 88590 146217 177422
$$ packed form
10971B203R9926J83702j15236k19078J29571J7703J23822M43530J35064l34371
10961D66836j91507r5409l1584J06215J65948j06576K45366l2810l31319r3772
10951A01388J41343r0827M6661l10103J01670L8180l4062j87353j04114j06022
10941d03239P8865M17976J08859j26616L44659j29193O8067L7678m8211l6672
10931C12173R2740K2592j38748q1071J46154m43780M3031R8752o2874k6214j01894
10920a39139r934j37196l09367p6762L78676K88456L32908j66872j19683K47979
10910B89066R241j65277L74572L56984j13991j9207K9311l90429j63599k13845
10900g174j36530O1291Q9580j01345j81680m7002K12384P8324J20742N7627L1205
$$ plain form
10889 177422 281095 504242 440681 224944 147667 147391 168991 -41449 -132386 120441 400961
10878 400961 419553 550163 596973 614083 669026 430782 143898 157564 348193 417330 532822
10867 532822 307688 137390 216341 344582 136704 84538 -80060 -68588 -31885 143369
10857 143369 197904 304054 393986 500605 506546 130010 -12003 4206 2075 201752 338560
10846 338560 281964 46453 -91335 162780 370130 355900 158878 161640 367949 618783
10836 618783 409064 423012 676254 1150736 1066762 625198 249030 77966 228700 288037
10826 288037 104410 -78470 -268005 -256237 -155337 -53752 106192 90048 184424 372539
10816 372539 202731 132321 -92301 205756 323668 -192002 -164642 97384 94726 182571
$$ packed form
10889A77422J03673K23147o3561k15737p7277k76K1600k10440r0937K52827K80520
10878D00961J8592J30610M6810J7110N4943k38244k86884J3666J90629O9137J15492
10867E32822k25134j70298P8951J28241k07878n2166j64598J1472L6703J75254
10857A43369N4535J06150Q9932J06619N941l76536j42013J6209k131J99677J36808
10846C38560n6596k35511j37788K54115K07350j4230j97022K762K06309K50834
10836F18783k09719J3948K53242M74482q3974m41564l76168j71064J50734N9337
10826B88037j83627j82880j89535J1768J00900J01585J59944j6144R4376J88115
10816C72539j69808p0410k24622K98057J17912n15670K7360K62026k658Q7845
$$ plain form
10806 182571 34250 23162 -180361 1564 154762 100631 235095 337111 198651 -182811
10796 -182811 -276623 -303916 -202008 -176892 211171 618410 670240 126807 -2346 113981
10786 113981 217845 144624 91002 -170876 -98939 119879 110466 87514 -71574 -62875 98015
10775 98015 73297 348 -267123 6200 224979 127875 113551 207356 258473 102166 -364048
10764 -364048 -688351 -614381 -414214 -235610 57189 154737 628994 747273 758976 606691
10754 606691 298170 116611 278748 410646 401973 272147 365734 281224 -12596 93855
10744 93855 148350 166032 132607 311122 472837 845473 1224827 1030985 750159 648015
10734 648015 778671 982756 998851 1038461 1029793 1074064 1101626 1263418 1391184 1350094 1408759
$$ packed form
10806A82571j48321j1088k03523J81925J53198n4131J34464J02016j38460l81462
10796a82811r3812k7293J01908K5116L88063M07239N1830n43433j29153J16327
10786A13981J03864p3221n3622k61878P1937K18818r413k2952j59088Q699J60890
10775I8015k4718p2949k67471K73323K18779r7104j4324R3805N1117j56307m66214
10764c64048l24303P3970K00167J78604K92799R7548M74257J18279J1703j52285
10754F06691l08521j81559J62137J31898q673j29826R3587q4510k93820J06451
10744I3855N4495J7682l3425J78515J61715L72636L79354j93842k80826j02144
10734F48015J30656K04085J6095L9610q668M4271K7562J61792J27766m1090N8665
$$ plain form
10723 1408759 1632686 1648579 1482308 1513672 1531088 1703968 1799640 1844190 1854161 1898280 1934065
10712 1934065 1662616 1510586 1761216 2053893 2078425 1669137 1428234 1534513 1570201 1537740
10702 1537740 1757924 1892500 1974974 2016401 2133723 1946651 1947113 1897526 1952513 2087487 2233943
10691 2233943 2297341 2182981 2116585 1977374 1885175 1702889 2085802 2356981 2028939 1887270
10681 1887270 1722315 1691037 1615510 1489305 1393680 1231245 1349064 1557788 1415239 1482299
10671 1482299 1521275 1689248 1548296 1211012 1200996 1617447 1632144 1524273 1674041 1843483
10661 1843483 1894888 2172344 2401485 2297926 2431196 2627404 2812928 2999791 3113105 3355109
10651 3355109 3699233 3663727 3534921 3503247 3634582 3812332 3834283 3560076 3231204 3102614
$$ packed form
10723A408759K23927J5893j66271L1364J7416J72880R5672M4550R971M4119L5785
10712A934065k71449j52030K50630K92677K4532m09288k40903J06279L5688l2461
10702A537740K20184J34576Q2474M1427J17322j87072M62m9587N4987J34974J46456
10691B233943O3398j14360o6396j39211r2199j82286L82913K71179l28042j41669
10681A887270j64955l1278p5527j26205r5625j62435J17819K08724j42549O7060
10671A482299L8976J67973j40952l37284j0016M16451J4697j07871J49768J69442
10661A843483N1405K77456K29141j03559J33270J96208J85524J86863J13314K42004
10651C355109L44124l5506j28806l1674J31335J77750K1951k74207l28872j28590
$$ plain form
10641 3102614 3336084 3853995 4257230 4315755 4599162 5089465 5903314 6613549 7215806 7717448
10631 7717448 8385784 9317779 10291632 10993012 11765240 12667100 14229847 16357942 19219582
10622 19219582 23171374 28408456 34659336 42861162 53227499 65905688 79373789 92486578
10614 92486578 104290655 113239791 117926135 118210876 116679964 116861006 121534975 132293184
10606 132293184 149382381 171642087 196426662 220234421 240422914 253263166 254068044
10599 254068044 243660921 229343305 219416116 218157568 227247291 246992493 274509610
10592 274509610 304462822 331642162 352042867 359587959 348355881 320656684 287811619
10585 287811619 261032364 244621796 238975928 242695331 253068420 265510695 276519230
$$ packed form
10641C102614K33470N17911M03235N8525K83407M90303Q13849P10235O02257N01642
10631G717448O68336R31995R73853P01380P72228R01860J562747K128095K861640
10622A9219582L951792N237082O250880Q201826J0366337J2678189J3468101J3112789
10614I2486578J1804077Q949136M686344K84741j530912J81042M673969J0758209
10606A32293184J7089197K2259706K4784575K3807759K0188493J2840252Q04878
10599B54068044j0407123j4317616r927189j258548R089723J9745202K7517117
10592B74509610K9953212K7179340K0400705P545092j1232078k7699197l2845065
10585B87811619k6779255j6410568n645868L719403J0373089J2442275J1008535
$$ plain form
10578 276519230 282704161 279483998 263560299 237724631 209984247 187266144 171761344
10571 171761344 162951298 159629773 159438013 160672038 160771255 158512573 151959194 140894418
10563 140894418 126173299 110544382 96749744 85643066 77326516 70836741 65819538
10556 65819538 61451857 58178223 55527209 52978743 50734765 48657145 46906145 45373207
10548 45373207 43908593 42444508 40971783 39546081 38216887 36983080 35941100 35032375
10540 35032375 33772666 32738964 32009573 31303456 30584780 29856954 29017588 28369185 27671082
10531 27671082 26945289 26157757 25636895 25265302 24729740 24155266 23856665 23395013 22788021
10522 22788021 22668083 22372893 21579064 20712039 20278461 20033228 19574581 18922622 18475368
$$ packed form
10578B76519230O184931l220163j5923699k5835668k7740384k2718103j5504800
10571A71761344q810046l321525j91760J234025R9217k258682o553379j1064776
10563A40894418j4721119j5628917j3794638j1106678q316550o489775n017203
10556F5819538m367681l273634k651014k548466k243978k077620j751000j532938
10548D5373207j464614j464085j472725j425702j329194j233807j041980r08725
10540C5032375j259709j033702p29391p06117p18676p27826q39366o48403o98103
10531B7671082p25793p87532n20862l71593n35562n74474k98601m61652o06992
10522B2788021j19938k95190p93829q67025m33578k45233m58647o51959m47254
$$ plain form
10513 18475368 18149130 17728311 17404972 17474244 17416114 16846660 16355609 15931762 15626186 15370685
10503 15370685 15041591 14719451 14527985 14395428 14017443 13763466 13559989 13438258 13328551
10494 13328551 13046033 12725165 12694755 12577456 12243909 11928659 11753608 11639938 11859588
10485 11859588 11720765 11505893 11153234 10953644 11003043 10964942 10573548 10401928 10479102 10531793
10475 10531793 10241056 10090827 10006346 9667214 9639430 9645685 9617441 9858308 10120414 10030214
10465 10030214 9652429 9477025 9156344 8933683 8963935 9310116 9269164 9138167 8950655 8779127
10455 8779127 8614146 8425169 8453013 8252992 8270480 8192810 7774661 7717585 7714134 7296748
10445 7296748 7026342 6917457 6673360 6643241 6768740 6729071 6641421 6636009 6492829 6362379
$$ packed form
10513A8475368l26238m20819l23339O9272n8130n69454m91051m23847l05576k55501
10503A5370685l29094l22140j91466j32557l77985k53977k03477j21731j09707
10494A3328551k82518l20868l0410j17299l33547l15250j75051j13670K19650
10485A1859588j38823k14872l52659j99590M9399l8101l91394j71620P7174N2691
10475A0531793k90737j50229q4481l39132k7784O255k8244K40867K62106r0200
10465A0030214l77785j75404l20681k22661L0252L46181m0952j30997j87512j71528
10455H779127j64981j88977K7844k00021J7488p7670m18149n7076l451m17386
10445G296748k70406j08885k44097l0119J25499l9669q7650n412j43180j30450
$$ plain form
10435 6362379 6313744 6100243 5989351 5657489 5100995 4863465 4955606 5161193 5257299 5344155
10425 5344155 4989629 4779726 4715965 4718652 4594577 4632153 4650159 4564006 4389458 4319362 4505423
10414 4505423 4155372 3779602 3695049 3507249 3643148 3666133 3711561 3548772 3460950 3213669
10404 3213669 3134392 3266931 3327285 3449555 3555501 3502959 3210190 2842481 2847622 2941027
10394 2941027 2794879 2731922 2763213 2888549 2723116 2513386 2438421 2519395 2614951 2609153 2660581
10383 2660581 2606396 2322505 2374407 2373902 2391124 2463613 2493725 2517027 2351887 2202364 2145481
10372 2145481 2044316 2213320 2303065 2402261 2451115 2280356 2288446 2103062 2027336 2359407
10362 2359407 2437458 2345330 2495023 2664126 2289828 1841007 1805454 1689089 1591766 1644552
$$ packed form
10435F362379m8635k13501j10892l31862n56494k37530R2141K05587R6106Q6856
10425E344155l54526k09903o3761K687j24075L7576J8006q6153j74548p0096J86061
10414D505423l50051l75770q4553j87800J35899K2985M5428j62789q7822k47281
10404C213669p9277J32539O0354J22270J05946n2542k92769l67709N141R3405
10394B941027j46148o2957L1291J25336j65433k09730p4965Q0974R5556n798N1428
10383B660581n4185k83891N1902n05J7222P2489L0112K3302j65140j49523n6883
10372B145481j01165J69004Q9745R9196M8854j70759Q090j85384p5726L32071
10362B359407P8051r2128J49693J69103l74298m48821l5553j16365r7323N2786
$$ plain form
10352 1644552 1728553 1671536 1606120 1540938 1354382 1597876 1847154 1680652 1461571 1469925
10342 1469925 1447057 1311785 816893 661540 949628 1336670 1171877 1038431 1031848 1088054
10332 1088054 931416 1097315 1225725 1169270 1138985 927094 860643 820739 850437 806771
10322 806771 811996 970017 1035658 999376 899880 1102451 1087047 983277 767714 838308 1042596
10311 1042596 1213725 1399027 1079429 883017 634856 295530 603874 711931 716440 841884
10301 841884 985676 1069185 1004606 943520 860111 1014776 1003460 964745 819302 714823 784942
10290 784942 931407 1041697 1034211 1323657 1297457 1013734 782466 362157 518897 787415
10280 787415 855334 868173 725095 614265 331988 448850 534188 416797 247365 278696
$$ packed form
10352A644552Q4001n7017o5416o5182j86556K43494K49278j66502k19081Q354
10342A469925k2868j35272m94892j55353K88088L87042j64793j33446o583N6206
10332A088054j56638J65899J28410n6455l0285k11891o6451l9904K9698m3666
10322H06771N225J58021O5641l6282r9496K02571j5404j03770k15563P0594K04288
10311A042596J71129J85302l19598j96412k48161l39326L08344J08057M509J25444
10301H41884J43792Q3509o4579o1086q3409J54665j1316l8715j45443j04479P0119
10290G84942J46465J10290p486K89446k6200k83723k31268m20309J56740K68518
10280G87415O7919J2839j43078j10830k82277J16862Q5338j17391j69432L1331
$$ plain form
10270 278696 184202 197799 477735 803030 842028 518746 564753 851447 1174608 977406
10260 977406 696510 568342 436349 464985 510254 583454 588116 717554 537506 591594 637236
10249 637236 479204 550627 610345 761147 886719 911878 955367 908966 839580 506004 257874
10238 257874 344994 463296 709638 569761 297146 272848 269086 326974 428019 405303 474412
10227 474412 728614 862595 892976 927249 859156 564767 504493 529913 540814 487654 354144
10216 354144 23371 22153 358053 604144 542279 475969 253467 37202 14677 217986
10206 217986 276899 637719 493738 567406 614666 570009 533063 354821 489002 447081 245668
10195 245668 81132 151532 552412 688307 730263 460354 242950 122265 147244 123628
$$ packed form
10270B78696r4494J3597K79936L25295L8998l23282M6007K86694L23161j97202
10260I77406k80896j28168j31993K8636M5269P3200M662J29438j80048N4088M5642
10249F37236j58032P1423N9718J50802J25572K5159M3489m6401o9386l33576k48130
10238B57874Q7120J18302K46342j39877k72615k4298l762N7888J01045k2716O9109
10227D74412K54202J33981L0381L4273o8093k94389o0274K5420J0901n3160j33510
10216C54144l30773j218L35900K46091o1865o6310k22502k16265k2525K03309
10206B17986N8913L60820j43981P3668M7260m4657l6946j78242J34181m1921k01413
10195B45668j64536P0400M00880J35895M1956k69909k17404j20685K4979k3616
$$ plain form
10185 123628 -5122 386038 724700 980118 802191 537837 479587 584146 596691 796955
10175 796955 1025328 1042062 722358 621549 439727 362212 421276 824503 1000186 1231797
10165 1231797 1578983 2034600 2363457 2154705 1789207 1644016 1545990 1557864 2084487 2298510
10155 2298510 2316961 2452537 2432554 2149487 2097551 2138804 1746663 1461913 1439863 1515216
10145 1515216 1481217 1764217 1727461 1599812 1635132 1704314 1834816 1744560 1367082 1284394
10135 1284394 1109796 865976 1027335 1142179 1007951 968751 807131 885840 900178 787100
10125 787100 583029 252641 32280 274949 456307 337176 357008 607369 463292 372911
10115 372911 314214 407124 378651 633564 610576 327570 433527 559029 473874 448574 371824
$$ packed form
10185A23628j28750L91160L38662K55418j77927k64354n8250J04559J2545K00264
10175G96955K28373J6734l19704j00809j81822p7515N9064M03227J75683K31611
10165A231797L47186M55617L28857k08752l65498j45191r8026J1874N26623K14023
10155B298510J8451J35576j9983k83067n1936M1253l92141k84750k2050P5353
10145A515216l3999K83000l6756j27649L5320O9182J30502r0256l77478q2688
10135A284394j74598k43820J61359J14844j34228l9200j61620P8709J4338j13078
10125G87100k04071l30388k20361K42669J81358j19131J9832K50361j44077r0381
10115C72911n8697R2910k8473K54913k2988k83006J05957J25502q5155k5300p6750
$$ plain form
10104 371824 592899 679417 484132 199965 110586 97226 128665 465511 577607 606972
10094 606972 329110 94823 -53818 -20416 154541 115873 -52268 63063 95736 169714
10084 169714 147789 122996 -91246 73122 261823 105690 -311139 -137943 2226 180376
10074 180376 304018 425552 577252 476222 457378 342371 225072 166907 272660 256569
10064 256569 306609 277376 230528 141475 57810 -146205 194059 411677 327489 232393 367309
10053 367309 331622 31413 -31247 -37078 42636 46166 22519 -1720 64438 -46709 -103041
10042 -103041 -147267 53696 381961 343808 199896 117239 6382 16679 26897 232385
10032 232385 370572 537062 402637 559333 532053 227332 207846 56119 -149348 -134439
$$ packed form
10104C71824K21075Q6518j95285k84167q9379j3360L1439L36846J12096K9365
10094F06972k77862k34287j48641L3402J74957l8668j68141J15331L2673P3978
10084A69714k1925k4793k14242J64368J88701j56133m16829J73196J40169J78150
10074A80376J23642J21534J51700j01030j8844j15007j17299n8165J05753j6091
10064B56569N0040k9233m6848q9053q3665k04015L40264K17618q4188r5096J34916
10053C67309l5687l00209o2660n831P9714L530k3647k4239O6158j11147n6332
10042a03041m4226K00963L28265l8153j43912q2657j10857J0297J0218K05488
10032B32385J38187J66490j34425J56696k7280l04721j9486j51727k05467J4909
$$ plain form
10022 -134439 3482 130408 263378 275358 282719 6208 45313 74663 -88780 -36622 -50449
10011 -50449 18749 160017 65055 358528 450782 472078 554957 823906 777358 597077 455997
10000 455997 341406 269268 -3066 92899 88194 34813 73957 201405 137582 11974 27466
9989 27466 103996 150811 -60090 -430240 -344059 -178611 -235247 -309043 -272283 23429 -43031
9978 -43031 -3770 173900 339612 502234 464315 35822 -31655 -274647 -195809 -94329 20426
9967 20426 -4471 -204306 -202241 -88041 -151158 -97193 48270 233782 365976 285264 192769
9956 192769 142417 123847 83377 13488 4629 -374113 -383400 -106280 -99138 -357333 -195771
9945 -195771 132545 134507 -47181 98836 225732 110848 42234 -65014 74155 263984
$$ packed form
10022a34439J37921J26926J32970J1980P361k76511L9105K9350j63443N2158j3827
10011e0449O9198J41268r4962K93473R2254K1296Q2879K68949m6548j80281j41080
10000D55997j14591p2138k72334R5965m705n3381L9144J27448o3823j25608J5492
9989B7466P6530M6815k10901l70150Q6181J65448n6636p3796L6760K95712o6460
9978d3031L9261J77670J65712J62622l7919m28493o7477k42992P8838J01480J14755
9967B0426k4897j99835K065J14200o3117N3965J45463J85512J32194q0712r2495
9956A92769n0352j8570m0470o9889q859l78742r287K77120P142k58195J61562
9945a95771L28316J962j81688J46017J26896j14884o8614j07248J39169J89829
$$ plain form
9935 263984 219232 158240 120067 447641 1107318 1607651 1796933 1962967 2350339 1863257
9925 1863257 1227573 927981 619291 509793 481138 243096 383804 422402 482125 405418
9915 405418 177639 117426 283158 268412 520868 557423 430467 472860 381097 314848 629281
9904 629281 760290 336431 173046 -59050 31566 131627 278784 -121694 -408085 -351939
9894 -351939 -112242 -424332 -578906 -483766 -100331 -144492 -288163 -274527 -187556 -530785
9884 -530785 -392170 -62668 -171587 -21653 222036 157993 98585 163808 190190 -95369
9874 -95369 -217294 -344191 -323029 -344055 -253223 9997 -112708 -256775 -152762 -479365
9864 -479365 -460749 -406903 -409420 -401730 -293209 -411055 -303611 -255623 -42771 -346484 -329093
$$ packed form
9935B63984m4752o0992l8173L27574O59677N00333J89282J66034L87372m87082
9925A863257o35684k99592l08690j09498k8655k38042J40708L8598N9723p6707
9915D05418k27779o0213J65732j4746K52456L6555j26956M2393r1763o6249L14433
9904F29281J31009m23859j63385k32096R0616J00061J47157m00478k86391N6146
9894c51939K39697l12090j54574R5140L83435m4161j43671J3636Q6971l43229
9884e30785J38615L29502j08919J49934K43689o4043n9408O5223K6382k85559
9874i5369j21925j26897K1162k1026R0832K63220j22705j44067J04013l26603
9864d79365J8616N3846k517P690J08521j17846J07444M7988K12852l03713J7391
$$ plain form
9853 -329093 -335340 -70797 142455 16937 -220898 -419464 -111896 98148 23960 -353441
9843 -353441 -121490 165514 340148 393268 126333 170663 122904 125820 48855 -263987 -243703
9832 -243703 -93473 50325 81764 71965 81467 110250 74760 229269 -55520 -329882 -298799
9821 -298799 -360511 -197836 48467 267876 168207 -172265 -213339 -68950 114628 277918
9811 277918 231694 238559 323508 164057 -127651 -198048 132925 340798 193291 109545 -9994
9800 -9994 22806 273118 280897 251711 149551 -52880 -464474 -600424 -291977 79399 80354
9789 80354 -170177 -166428 -30654 -93419 -302289 -285494 64311 405322 579690 566472 486905
9778 486905 -16894 -318367 -96659 -154895 -31112 82089 38012 -18778 -58794 -326529
$$ packed form
9853c29093o247K64543K13252j25518k37835j98566L07568K10044p4188l77401
9843c53441K31951K87004J74634N3120k66935M4330m7759K916p6965l12842K0284
9832b43703J50230J43798L1439r799R502K8783l5490J54509k84789k74362L1083
9821b98799o1712J62675K46303K19409r9669l40472m1074J44389J83578J63290
9811B77918m6224O865Q4949j59451k91708p0397L30973K07873j47507q3746j19539
9800i994L2800K50312P779k9186j02160k02431m11594j35950L08447L71376R55
9789H0354k50531L749J35774o2765k08870J6795L49805L41011J74368j3218p9567
9778D86905n03799l01473K21708n8236J23783J13201m4077n6790m0016k67735
$$ plain form
9768 -326529 -366312 -357269 -374330 -304381 26188 -17822 -40712 -74972 -40040 -107792 -251695
9757 -251695 -268738 54636 339926 119283 -75336 -312004 -383283 3782 305387 249018
9747 249018 78062 -37107 -363589 -203001 74292 102397 81293 278756 227861 -32573
9737 -32573 -64685 -146514 -33697 194039 242850 275445 163034 162897 142003 235370 91269
9726 91269 -192525 -207611 -198180 -191199 34219 118101 33211 -259948 -170382 -9976 -313122
9715 -313122 -461467 -72107 413 272343 119788 -50220 -43481 17955 18506 85457 98282
9704 98282 -95245 -111814 -293481 -353669 -312119 -387093 -432507 -349947 -425508 -236754 -202554
9693 -202554 -190155 39417 -47115 -275595 -186340 -98865 83800 -48650 -65516 249513 20776
$$ packed form
9768c26529l9783R043j7061O9949L30569m4010k2890l4260L4932o7752j43903
9757b51695j7043L23374K85290k20643j94619k36668p1279L87065L01605n6369
9747B49018j70956j15169l26482J60588K77293K8105k1104J97463n0895k60434
9737c2573l2112q1829J12817K27736M8811L2595j12411j37k0894R3367j44101
9726I1269k83794j5086R431O981K25418Q3882q4890k93159Q9566J60406l03146
9715c13122j48345L89360P2520K71930j52555j70008O739O1436N51O6951J2825
9704I8282j93527j6569j81667o0188M1550p4974m5414Q2560p5561J88754L4200
9693b02554J2399K29572q6532k28480Q9255Q7475J82665j32450j6866L15029k28737
$$ plain form
9682 20776 140214 -79676 -276544 -434974 -224862 -3268 -37197 -288546 -174800 58193
9672 58193 133741 220381 -24589 55089 128926 -3416 -110480 -241418 -204294 -29589 227921
9661 227921 270214 262659 121712 112536 298749 343081 664907 764760 663671 548610 1015418
9650 1015418 1443824 1677148 1695313 1438446 1241956 1356281 1130685 675733 447359 144261
9640 144261 -189536 -360511 -473060 -273680 222161 487275 354192 228518 -147390 -146322
9630 -146322 14405 273419 305369 356675 26717 -374306 -659791 -582060 -482647 -379978
9620 -379978 -388317 -447883 -326667 -93836 74038 32309 -115133 -314679 -133481 -153331 -254879
9609 -254879 -323295 -220058 -234272 -192228 -265661 -169074 107981 362082 374108 390381 248419
$$ packed form
9682B0776J19438k19890j96868j58430K10112K21594l3929k51349J13746K32993
9672E8193P5548Q6640k44970P9678P3837j32342j07064j30938L7124J74705K57510
9661B27921M2293p555j40947r176J86213M4332L21826R9853j01089j15061M66808
9650A015418M28406K33324J8165k56867j96490J14325k25596m54952k28374l03098
9640A44261l33797j70975j12549J99380M95841K65114j33083j25674l75908J068
9630a46322J60727K59014L1950N1306l29958m01023k85485P7731R9413J02669
9620c79978q339n9566J21216K32831J67874m1729j47442j99546J81198j9850j01548
9609b54879o8416J03237j4214M2044p3433R6587K77055K54101J2026J6273j41962
$$ plain form
9598 248419 470389 511663 456442 454928 369402 165603 145517 -7862 -63132 -84636 -59052
9587 -59052 -96324 105942 -130057 -272614 -208305 -251586 -168178 -75970 47161 177890 -32904
9576 -32904 -411905 -338777 -250724 -377186 -120175 -163235 -218771 110507 261331 216974 104760
9565 104760 -293382 -412186 -453195 -295079 -148190 187795 324650 72908 144898 249381
9555 249381 165457 -51820 -18054 119343 -95029 -262099 -345445 -270805 -395118 -548708
9545 -548708 -372308 -364832 -309897 -291112 -72460 -35032 -196478 -241228 -364126 -470688 -522545
9534 -522545 -497860 -652025 -483837 -67582 130823 32952 -153612 -382499 -253723 -31463
9524 -31463 -50029 -237340 -417842 -325968 -136674 99078 314804 242638 64452 20188 4459
$$ packed form
9598B48419K21970M1274n5221j514q5526k03799k0086j53379n5270k1504K5584
9587e9052l7272K02266k35999j42557O4309m3281Q3408R2208J23131J30729k10794
9576c2904l79001P3128Q8053j26462K57011m3060n5536L29278J50824m4357j12214
9565A04760l98142j18804m1009J58116J46889L35985J36855k51742P1990J04483
9555B49381q3924k17277L3766J37397k14372j67070q3346P4640j24313j53590
9545e48708J76400P476N4935J8785K18652L7428j61446m4750j22898j06562n1857
9534e22545K4685j54165J68188M16255J98405r7871j86564k28887J28776K22260
9524c1463j8566j87311j80502R1874J89294K35752K15726p2166j78186m4264j5729
$$ plain form
9513 4459 -15182 -62083 4233 99411 259077 288180 67840 114330 -154766 -166852 267507
9502 267507 418876 217358 287830 241820 518534 506122 449686 556730 581755 457036 294376
9491 294376 349482 369733 157854 -19914 -90556 12116 -71742 -5677 23249 -204462 -284972
9480 -284972 -63525 107149 361162 427067 137211 -21027 -208936 -191834 9359 45193
9470 45193 -54647 176729 328374 420267 404889 684490 724520 441845 416371 528018 526406
9459 526406 423536 522238 696985 692001 726988 721323 745810 789184 1015055 1384110 1841253
9448 1841253 2148655 2075145 1802233 1541987 1519881 1406909 1185983 926542 711654 528094
9438 528094 675315 1206992 1394400 1142023 788133 1028721 1529182 1745822 1782906 1708056
$$ packed form
9513D459j9641m6901O6316R5178J59666K9103k20340M6490k69096j2086M34359
9502B67507J51369k01518P0472m6010K76714j2412n6436J07044K5025j24719j62660
9491B94376N5106K0251k11879j77768p0642J02672q3858O6065K8926k27711q0510
9480b84972K21447J70674K54013O5905k89856j58238j87909J7102K01193L5834
9470D5193r9840K31376J51645R1893j5378K79601M0030k82675k5474J11647j612
9459E26406j02870R8702J74747m984L4987n665K4487M3374K25871L69055M57143
9448A841253L07402p3510k72912k60246k2106j12972k20926k59441k14888j83560
9438E28094J47221N31677J87408k52377l53890K40588N00461K16640L7084p4850
$$ plain form
9428 1708056 1803613 2175773 2499390 2511836 2329962 1901790 1575711 1543642 1595265 1463920
9418 1463920 1371916 1181005 1069008 1226323 1726771 1929573 2116709 2523285 3101621 3659511
9408 3659511 4568468 5106932 5199002 4786483 3785430 3191845 2724220 2391393 2052975 1938864
9398 1938864 2018480 1652307 1654663 1960399 2058576 1715581 1564825 1725663 1870102 2204288
9388 2204288 2302339 2086016 1939923 2145279 2063719 1902801 1938479 1811143 1657436 1419542
9378 1419542 1365251 1703631 1761122 1445503 1082960 904430 814129 994097 1419355 1570239
9368 1570239 1839477 2051465 2390499 2228472 2173677 1904630 1489616 1521568 1369060 1080327
9358 1080327 1045888 983207 728383 769176 823293 1009739 1255685 1299448 1201453 1142643 876883
$$ packed form
9428A708056R5557L72160L23617J2446j81874m28172l26079l2069N1623j31345
9418A463920r2004j90911j11997J57315N00448K02802J87136M06576N78336N57890
9408C659511R08957N38464R2070m12519j001053n93585m67625l32827l38418j14111
9398A938864P9616l66173K356L05736R8177l42995j50756J60838J44439L34186
9388B204288R8051k16323j46093K05356q1560j60918L5678j27336j53707k37894
9378A419542n4291L38380N7491l15619l62543j78530r0301J79968M25258J50884
9368A570239K69238K11988L39034j62027n4795k69047m15014L1952j52508k88733
9358A080327l4439o2681k54824M0793N4117J86446K45946M3763r7995n8810k65760
$$ plain form
9347 876883 396363 276406 326906 375038 442439 409804 506177 583180 493858 571997 607070
9336 607070 881539 844554 477748 262583 -4425 -322962 -82719 140935 278104 250987
9326 250987 112095 64367 182779 406010 612093 693906 224185 -192707 -496367 -225417
9316 -225417 31642 156911 253843 365952 492165 445255 602351 579103 431615 524003
9306 524003 390822 150342 217356 356124 591734 589312 285760 207931 579195 779655
9296 779655 743596 643954 273096 196120 275302 331140 345770 153157 157250 494286 706850
9285 706850 435411 146240 51076 121650 201491 300112 718033 706995 603907 677236 709695
9274 709695 780520 792323 657257 402553 553907 723440 455708 348384 600080 499283
$$ packed form
9347H76883m80520j19957N0500M8132O7401l2635R6373P7003q9322P8139L5073
9336F07070K74469l6985l66806k15165k67008l18537K40243K23654J37169k7117
9326B50987j38892m7728J18412K23231K06083Q1813m69721m16892l03660K70950
9316b25417K57059J25269R6932J12109J26213m6910J57096k3248j47488R2388
9306E24003j33181k40480O7014J38768K35610k422l03552p7829L71264K00460
9296G79655l6059r9642l70858p6976P9182N5838J4630j92613M093L37036K12564
9285G06850k71439k89171r5164P0574P9841R8621M17921j1038j03088P3329L2459
9274G09695P0825J1803j35066k54704J51354J69533k67732j07324K51696j00797
$$ plain form
9264 499283 318091 284597 146429 -33823 -96090 -161526 -80862 139935 360801 297077 122728
9253 122728 253065 232787 295409 266523 91441 566 -332891 -603227 -458934 -182151
9243 -182151 -136513 -170785 -256361 -342682 -374663 -172035 -26537 47918 331589 291860 173589
9232 173589 163638 81981 229680 209553 90302 -7138 5679 39849 235816 206760 62592
9221 62592 -91589 132394 105125 -27242 122878 327020 438358 412638 168322 -66324
9211 -66324 -56616 56285 17895 204857 420011 106111 174955 209738 317795 527975 193392
9200 193392 -163984 -158112 -10519 310750 400829 130061 199675 234119 83092 -338670 -234716
9189 -234716 -45192 88861 170110 -37847 -43455 -11029 14135 147425 115270 115647 35038
$$ packed form
9264D99283j81192l3494j38168j80252o2267o5436Q0664K20797K20866o3724j74349
9253A22728J30337k0278O2622k8886j75082r0875l33457k70336J44293K76783
9243a82151M5638l4272q5576q6321l1981K02628J45498P4455K83671l9729j18271
9232A73589r951q1657J47699k0127j19251r7440J2817L4170J95967k9056j44168
9221F2592j54181K23983k7269j32367J50120K04142J11338k5720k44316k34646
9211f6324R708J12901l8390J86962K15154l13900O8844L4783J08057K10180l34583
9200A93392l57376N872J47593L21269R0079k70768O9614L4444j51027m21762J03954
9189b34716J89524J34053Q1249k07957n608L2426K5164J33290l2155L77q0609
$$ plain form
9178 35038 -139443 -54156 -105381 -272856 -136808 23728 72764 136332 -61819 -192587 -94534
9167 -94534 216681 235697 54808 -268143 -572769 -416721 -420740 -618679 -193686 4887
9157 4887 -121849 -19075 13404 -44864 -376512 -189897 26029 -31635 -81101 -171065 -274344
9146 -274344 -155984 44159 237799 356374 440504 180654 -108752 -132628 -15222 -84948
9136 -84948 -177724 -358125 -257149 -306854 75451 214865 111445 102875 115836 258757 258451
9125 258451 55701 -177623 -150937 -60706 -349430 -405233 -416771 -251564 -92904 -214389
9115 -214389 -3047 -18531 63072 -78827 -135864 -313828 -86078 -53549 -81007 -22464 143676
9104 143676 200198 216522 281809 528562 377191 48244 166900 130570 28342 -109344
$$ packed form
9178C5038j74481Q5287n1225j67475J36048J60536M9036O3568j98151j30768R8053
9167i4534L11215J9016j80889l22951l04626J56048m019j97939M24993J98573
9157D887j26736J02774L2479n8268l31648J86615K15926n7664m9466q9964j03279
9146b74344J18360K00143J93640J18575Q4130k59850k89406k3876J17406o9726
9136h4948r2776j80401J00976m9705L82305J39414j03420q570J2961J42921l06
9125B58451k02750k33324K6686R0231k88724n5803j1538J65207J58660j21485
9115b14389K11342j5484Q1603j41899n7037j77964K27750L2529k7458N8543J66140
9104A43676N6522J6324O5287K46753j51371l28947J18656l6330j02228j37686
$$ plain form
9094 -109344 108401 494003 602793 411541 451283 331299 284429 366045 116568 47458
9084 47458 -67061 -163222 -281026 -171368 -28786 138202 179259 135683 166816 290964 509986
9073 509986 420573 388366 270924 53719 -11320 -198838 -10155 148894 -78296 -273312
9063 -273312 -642953 -495961 -181614 246179 423458 149992 -23227 17677 -168866 152572
9053 152572 500839 372624 144852 -58484 174301 402490 543300 398977 42863 -151412
9043 -151412 -30899 149823 218747 147922 63996 -68089 145431 116744 -63253 -112734 -257877
9032 -257877 -211347 -354658 -482388 -248331 -5429 199614 411531 270018 -110797 -39552
9022 -39552 136313 290649 412335 184365 -78996 -318598 -164726 -113726 -69698 -156031
$$ packed form
9094a09344K17745L85602J08790j91252L9742j19984m6870Q1616k49477o9110
9084D7458j14519r6161j17804J09658J42582J66988M1057m3576L1133J24148K19022
9073E09986q9413l2207j17442k17205o5039j87518J88683J59049k27190j95016
9063b73312l69641J46992L14347M27793J77279k73466j73219M0904j86543L21438
9053A52572L48267j28215k27772k03336K32785K28189J40810j44323l56114j94275
9043a51412J20513J80722O8924p0825q3926j32085K13520k8687j79997m9481j45143
9032b57877M6530j43311j27730K34057K42902K05043K11917j41513l80815P1245
9022c9552J75865J54336J21686k27970k63361k39602J53872N1000M4028q6333
$$ plain form
9012 -156031 -172149 -131397 57388 295914 204302 126049 39723 161334 89386 -35033 13511
9001 13511 -263536 -587177 -587591 -336421 -271804 -20016 -87196 -361992 -179546 3573 339931
8990 339931 334843 221858 102178 135079 559264 833665 706318 468369 353259 193095
8980 193095 152285 270336 12283 -156108 47030 319289 478108 348236 317034 427136
8970 427136 179314 23490 39605 214738 165661 199479 209693 184914 -99001 -134404 -46161
8959 -46161 2231 -338986 -636053 -670235 -295829 -120373 -299536 -399565 -164752 116975
8949 116975 389984 370119 256295 252927 132898 141088 84664 160143 133892 -64815 -27759
8938 -27759 -45227 -133285 47746 450995 603894 572225 516720 543493 439741 301324 180571
$$ packed form
9012a56031j6118M0752J88785K38526r1612p8253q6326J21611p1948j24419M8544
9001A3511k77047l23641m14K51170O4617K51788o7180k74796J82446J83119L36358
8990C39931n088j12985j19680L2901M24185K74401j27347k37949j15110j60164
8980A93095m0810J18051k58053j68391K03138K72259J58819j29872l1202J10102
8970D27136k47822j55824J6115J75133m9077L3818J0214k4779k83915l5403Q8243
8959d6161M8392l41217k97067l4182L74406J75456j79163j00029K34813K81727
8949A16975K73009j9865j13824l368j20029Q190n6424P5479k6251j98707L7056
8938b7759j7468q8058J81031M03249J52899l1669n5505K6773j03752j38417j20753
$$ plain form
8927 180571 263814 36359 -81140 33623 -164577 -636166 -771264 -806781 -501458 -370500
8917 -370500 -136106 -256434 -105974 188795 232868 149437 47954 232577 232936 81718 274965
8906 274965 334696 66772 90665 -146597 -273981 -249297 -92698 -8341 57948 -134602 -300486
8895 -300486 -494079 -300971 -259756 -361423 -400985 -269389 -329228 -226503 122328 139106
8885 139106 122999 246115 203788 269799 256805 125140 40275 5544 187252 157146 78245
8874 78245 153588 288439 359622 392709 385352 352748 250107 39511 -89952 181693 335631
8863 335631 256054 315325 497608 202755 15199 106233 410168 184417 53095 121224
8853 121224 296446 215283 33765 -59471 -47601 72297 354319 70384 56346 131722 -63957
$$ packed form
8927A80571Q3243k27455j17499J14763j98200m71589j35098l5517L05323J30958
8917c70500K34394j20328J50460K94769M4073q3431j01483J84623L59j51218J93247
8906B74965N9731k67924K3893k37262j27384K4684J56599Q4357O6289j92550j65884
8895c00486j93593J93108M1215j01667l9562J31596n9839J02725L48831J6778
8885A39106j6107J23116m2327O6011j2994j31665q4865l4731J81708l0106p8901
8874G8245P5343J34851P1183L3087p357l2604j02641k10596j29463K71645J53938
8863C35631p9577N9271J82283k94853j87556R1034L03935k25751j31322O8129
8853A21224J75222q1163j81518r3236J1870J19898K82022k83935j4038P5376j95679
$$ plain form
8842 -63957 -189554 -133609 41367 -187309 -358289 -360747 -291741 6913 105597 173931 215190
8831 215190 149716 6834 26781 130614 255872 360706 174583 40817 13096 -26410
8821 -26410 -358973 -177805 152213 143745 165198 337898 333817 146792 116454 312741 96482
8810 96482 45477 -73194 -15130 296099 233941 -66331 28318 253702 265684 176470 -21031
8799 -21031 -148161 -72699 183629 296623 15276 -260711 -121982 15669 62864 -136687
8789 -136687 -105765 6981 -134995 -117815 -113060 -201860 -128554 70783 211050 190024 268998
8778 268998 200963 60699 165841 111870 50739 168265 141498 -16104 -179886 -119658 115329
8767 115329 28633 -72864 98928 212650 193786 180512 319039 331773 -46677 -249473
$$ packed form
8842f3957j25597N5945J74976k28676j70980k458O9006K98654R8684O8334M1259
8831B15190o5474j42882J9947J03833J25258J04834j86123j33766k7721l9506
8821b6410l32563J81168L30018q468K1453J72700m081j87025l0338J96287k16259
8810I6482n1005j18671N8064L11229o2158l00272R4649K25384J1982q9214j97501
8799b1031j27130P5462K56328J12994k81347k75987J38729J37651M7195j99551
8789a36687L0922J12746j41976J7180M755q8800P3306J99337J40267k1026P8974
8778B68998o8035j40264J05142n3971o1131J17526k6767j57602j63782O0228K34987
8767A15329q6696j01497J71792J13722j8864j3274J38527J2734l78450k02796
$$ plain form
8757 -249473 -89971 11947 53706 -167681 -313027 -345962 -278037 -120463 -119655 -39532 150582
8746 150582 -27814 -305811 -136826 -325927 -505102 -399689 -152660 -12186 41646 -9049
8736 -9049 -168007 -37689 17725 253317 352198 351861 156732 -45152 -151256 -74149 321626
8725 321626 59111 -38565 -104241 -212313 -316097 -365412 -212670 -194911 -340775 -338859 -187129
8714 -187129 142202 -2818 -113659 85386 6453 177667 352267 378837 68447 -128714
8704 -128714 -301557 -357782 -210671 202563 359569 431624 345333 167343 -66803 -24340
8694 -24340 -141355 -274090 -369392 -356006 -258930 -120922 182142 222307 -83265 -134599 60910
8683 60910 154147 122229 179769 458511 255037 -141459 -335940 -414003 -147076 67518 256254
$$ packed form
8757b49473J59502J01918M1759k21387j45346l2935O7925J57574Q08Q0123J90114
8746A50582j78396k77997J68985j89101j79175J05413K47029J40474N3832n0695
8736i049j58958J30318N5414K35592R8881l37j95129k01884j06104P7107L95775
8725C21626k62515r7676o5676j08072j03784m9315J52742J7759j45864J916J51730
8714a87129L29331j45020j10841J99045p8933J71214J74600K6570l10390j97161
8704a28714j72843n6225J47111M13234J57006P2055q6291j77990k34146M2463
8694b4340j17015j32735r5302J3386R7076J38008L03064M0165l05572n1334J95509
8683F0910R3237l1918N7540K78742k03474l96496j94481p8063K66927K14594J88736
$$ plain form
8672 256254 317283 346856 581824 647205 417132 272648 209051 225262 46506 -246720 -323716
8661 -323716 37745 105919 73255 -171246 -276589 -139865 -3048 -118459 -31519 257858
8651 257858 318911 330031 268911 131747 -195362 -159134 -163129 -195814 -8541 175340 5153
8640 5153 -162344 -48542 158113 647479 737296 539380 232015 151675 107314 138745 151652
8629 151652 206905 186610 92724 212062 215538 19270 -24127 -170305 -262847 -298461 -649197
8618 -649197 -424003 -211942 -408561 -383575 -241332 -108166 -97409 -176735 -154681 11571
8608 11571 73676 -20705 -50084 107872 87831 -168616 -259450 -51801 275134 121340 -144362
8597 -144362 -64654 -182768 -495063 -741465 -479819 58126 60008 -82222 -274774 -291967
$$ packed form
8672B56254O1029K9573K34968O5381k30073j44484o3597J6211j78756k93226p6996
8661c23716L61461O8174l2664k44501j05343J36724J36817j15411Q6940K89377
8651B57858O1053J1120o1120j37164l27109L6228l995l2685J87273J83881j70187
8640E153j67497J13802K06655M89366Q9817j97916l07365q0340m4361L1431J2907
8629A51652N5253k0295r3886J19338L476j96268m3397j46178r2542l5614l50736
8618f49197K25194K12061j96619K4986J42243J33166J0757p9326K2054J66252
8608A1571O2105r4381k9379J57956k0041k56447r0834K07649L26935j53794k65702
8597a44362P9708j18114l12295k46402K61646N37945J882j42230j92552j7193
$$ plain form
8587 -291967 -20421 26673 9334 149988 160747 72504 108390 -6277 75715 114047 -123508
8576 -123508 -201260 -70996 -65474 -271734 -312927 -97566 84479 119628 -39340 -127792 -92509
8565 -92509 -16068 -69601 -287531 43290 292231 515497 630494 587660 328402 211319
8555 211319 11915 -80220 -472 382680 689426 431452 218586 197510 65427 -184559
8545 -184559 -31731 182898 171083 -99288 -329724 -459484 -113907 -114134 -205489 -4929 229413
8534 229413 147321 -67543 -74403 -135566 -129024 -196435 -339195 -72965 441921 582236 450312
8523 450312 315283 329466 234672 171872 234725 113360 -201 -93127 -238786 -59437 150898
8512 150898 202984 81810 24145 181925 -37574 -192258 -144750 -47703 -50784 -303601 -346221
$$ packed form
8587b91967K71546M7094j7339J40654J0759q8243L5886j14667Q1992L8332k37555
8576a23508p7752J30264N522k06260m1193K15361J82045L5149j58968q8452L5283
8565i2509P6441n3533k17930L30821K48941K23266J14997m2834k59258j17083
8555B11319j99404r2135P9748L83152L06746k57974k12866k1076j32083k49986
8545a84559J52828K14629j1815k70371k30436j29760L45577k27r1355K00560K34342
8534B29413q2092k14864o860o1163O542o7411j42760K66230N14886J40315j31924
8523D50312j35029J4183r4794o2800O2853j21365j13561r2926j45659J79349K10335
8512A50898N2086j21174n7665J57780k19499j54684M7508R7047l081k52817m2620
$$ plain form
8501 -346221 -140074 -215579 -327048 -436474 -327777 -351116 -333690 -261325 -225283 -116220 -165390
8490 -165390 -40658 135842 -51346 39045 211150 432942 345366 366351 494848 516035
8480 516035 509879 413476 331244 24170 -36582 117115 258800 40362 -91704 45921 -161944
8469 -161944 -181202 -291986 -148145 26590 -8145 3818 313472 277154 162606 163034 36926
8458 36926 -5853 163636 404117 518749 237461 153820 70077 7387 -51701 143776 469127
8447 469127 618716 480356 234644 9302 -84097 133901 286241 87473 -11082 -37364
8437 -37364 -187671 -106701 -47083 -74331 -139374 13499 128225 309405 193129 176032 267973
8426 267973 272478 304582 215347 174781 -26243 -65822 1508 213497 288962 252863 346254
$$ packed form
8501c46221K06147p5505j11469j09426J08697k3339J7426P2365L6042J09063m9170
8490a65390J24732J76500j87188R0391J72105K21792q7576K0985J28497K1187
8480E16035o156r6403q2232l07074o0752J53697J41685k18438j32066J37625k07865
8469a61944j9258j10784J43841J74735l4735J1963L09654l6318j14548M28j26108
8458C6926m2779J69489K40481J14632k81288q3641q3743o2690n9088J95477L25351
8447D69127J49589j38360k45712k25342r3399K17998J52340j98768r8555k6282
8437c7364j50307Q0970N9618k7248o5043J52873J14726J81180j16276j7097R1941
8426B67973M505L2104q9235m0566k01024l9579O7330K11989P5465l6099R3391
$$ plain form
8415 346254 422426 333068 262807 326139 256657 77559 -60169 -67044 -83683 45351 160618
8404 160618 49964 -127192 -40398 94364 -204099 -106513 70523 5756 -109369 -207511
8394 -207511 -201821 -313821 -501412 -293123 -120341 -339600 -279049 -113201 70444 -192205
8384 -192205 -446891 -427929 -311507 -29214 169357 93995 233103 169504 166587 -106492 -228099
8373 -228099 -138104 123599 106087 -91512 82076 52840 -151867 58678 -21814 -149963
8363 -149963 -58677 -103480 17019 -82700 -163133 -270108 -189106 -455521 -586717 -353188 -68621
8352 -68621 -336071 -773578 -382153 -125630 46078 241528 508456 602961 532306 470534
8342 470534 249127 65165 -73411 -147522 -339200 -366785 -539372 -472488 -170764 -17434
$$ packed form
8415C46254P6172q9358p0261O3332o9482j79098j37728o875j6639J29034J15267
8404A60618j10654j77156Q6794J34762k98463R7586J77036o4767j15125r8142
8394b07511N690j12000j87591K08289J72782k19259O0551J65848J83645k62649
8384a92205k54686J8962J16422K82293J98571p5362J39108o3599k917k73079j21607
8373b28099Q9995K61703j7512j97599J73588k9236k04707K10545q0492j28149
8363a49963R1286m4803J20499r9719q0433j06975Q1002k66415j31196K33529K84567
8352f8621k67450m37507L91425K56523J71708J95450K66928R4505p0655o1772
8342D70534k21407j83962j38576p4111j91678k7585j72587O6884L01724J53330
$$ plain form
8332 -17434 92917 186763 -119746 -47893 -120599 -144277 -34865 174031 169056 -234347 -424498
8321 -424498 -289890 -36418 224655 -16514 -195812 117219 -18188 -127883 -319984 -165168
8311 -165168 98150 190594 32146 -34022 -64712 -75880 -317411 -219003 -237604 -318189 -169677
8300 -169677 -58067 176001 267191 57431 133031 102241 147139 50107 16992 58654 -166968
8289 -166968 -185132 -355746 -265029 -226260 20943 343077 235671 -19378 -57734 34889 281096
8278 281096 369134 162899 74630 203921 -16912 -54511 -174343 -188094 -261747 -197741 53143
8267 53143 65429 -32181 -107040 -249139 -353285 -216148 62272 -8203 -152790 -94527 -128385
8256 -128385 -767 227657 232690 234445 226816 183706 134843 9921 -112817 -417566 -218035
$$ packed form
8332a7434J10351R3846l06509P1853p2706k3678J09412K08896m975m03403j90151
8321d24498J34608K53472K61073k41169j79298L13031j35407j09695j92101J54816
8311a65168K63318R2444j58448o6168l0690j1168k41531R8408j8601q0585J48512
8300a69677J11610K34068R1190k09760P5600l0790M4898r7032l3115M1662k25622
8289a66968j8164j70614R0717L8769K47203L22134j07406k55049l8356R2623K46207
8278B81096Q8038k06235q8269J29291k20833l7599j19832j3751p3653O4006K50884
8267E3143J2286r7610p4859j42099j04146J37137K78420p0475j44587N8263l3858
8256a28385J27618K28424N033J755p629m3110m8863j24922j22738l04749J99531
$$ plain form
8245 -218035 64278 117840 6492 138962 256814 260046 -174958 -162463 -299851 -362093 -226260
8234 -226260 -334221 -410215 -156709 -39639 -80989 32251 -21521 28711 -131413 -298546
8224 -298546 -121621 -10443 25306 -145200 -274533 -72049 7692 73293 -94191 -221505
8214 -221505 -223116 -246492 -24841 206789 201786 184073 132124 286879 308425 -51090 -193692
8203 -193692 -68707 -29241 -28772 -395103 -402134 -19679 -88340 45205 322269 241017 241231 183625
8191 183625 -23107 -13298 297666 467195 244425 48282 33863 -24516 -147391 -72747 -178960
8180 -178960 -356508 -153440 142708 164883 147799 -68337 -287922 -287502 -349809 -395677 -398720
8169 -398720 -531596 -465688 -256946 -109004 -7240 -190667 -212135 -334322 -573277 -342679
$$ packed form
8245b18035K82313N3562j11348J32470J17852L232m35004J2495j37388o2242J35833
8234b26260j07961p5994K53506J17070m1350J13240n3772N0232j60124j67133
8224b98546J76925J11178L5749j70506j29333K02484P9741O5601j67484j27314
8214b21505j611k3376K21651K31630n003j7713n1949J54755K1546l59515j42602
8203a93692J24985L9466M69l66331p031L82455o8661J33545K77064q1252K14n7606
8191A83625k06732R809L10964J69529k22770j96143j4419n8379j22875P4644j06213
8180a78960j77548K03068K96148K2175j7084k16136k19585M20o2307m5868l043
8169c98720j32876O5908K08742J47942J01764j83427k1468j22187k38955K30598
$$ plain form
8159 -342679 -212159 -149447 -365356 -286511 -361962 -423762 -468350 -249306 -152863 -26407 -916
8148 -916 -429999 -571795 -348792 -366541 -294603 23867 13036 -150612 -71952 102842 197952
8137 197952 54506 154941 279474 72177 223013 92230 -333201 -486299 -284783 -193362
8127 -193362 -39340 47696 58387 -82709 -112924 -181660 -116952 -256108 -478033 -437325 -475567
8116 -475567 -484766 -564706 -717835 -717690 -522006 -818475 -889288 -303071 198069 168142 -152998
8105 -152998 -185406 -164708 -48530 151749 182635 179633 254171 520394 620024 157672 -71332
8094 -71332 61625 152963 224440 383604 178481 -263590 -179774 -245296 -455335 -463886 -256926
8083 -256926 -52180 7689 -31786 82024 117821 177129 135627 46714 86710 -126015 -116551
$$ packed form
8159c42679J30520O2712k15909P8845p5451o1800m4588K19044R6443J26456K5491
8148i16m29083j41796K23003j7749P1938L18470j0831j63648P8660J74794R5110
8137A97952j43446J00435J24533k07297J50836j30783m25431j53098K01516R1421
8127a93362J54022Q7036J0691j41096l0215o8736O4708j39156k21925M0708l8242
8116d75567r199p9940j53129J45J95684k96469p0813N86217N01140k9927l21140
8105a52998l2408K0698J16178K00279L0886l002P4538K66223R9630m62352k29004
8094g1332J32957R1338P1477J59164k05123m42071Q3816o5522k10039q551K06960
8083b56926K04746N9869l9475J13810L5797N9308m1502q8913L9996k12725R464
$$ plain form
8072 -116551 35059 94999 -183581 -316655 -296080 -432035 -358144 -473658 -476367 -314505 -510409
8061 -510409 -540131 -580603 -605959 -470714 -512411 -536152 -304659 -339757 -259920 -218989 -86565
8050 -86565 152920 135876 161353 276012 110067 -137136 -170718 -382062 -264603 -155866
8040 -155866 -171619 -126191 -113277 11387 141441 169232 44951 -31203 -80129 27837 -29188
8029 -29188 -250126 -397064 -253892 -191347 -148703 82649 190621 -140616 -440447 -560209
8019 -560209 -280955 -137659 209546 125392 219783 109643 -186446 -36775 150928 323481
8009 323481 141512 191870 307082 153458 68705 72226 149654 94321 115451 292096 209030
7998 209030 175376 390740 543376 639911 445703 257882 406721 311420 434261 519299
$$ packed form
8072a16551J51610N9940k78580j33074K0575j35955P3891j15514k709J61862j95904
8061e10409k9722m0472k5356J35245m1697k3741K31493l5098P9837M0931J32424
8050h6565K39485j7044K5477J14659j65945k47203l3582k11344J17459J08737
8040a55866j5753M5428J2914J24664J30054K7791j24281p6154m8926J07966n7025
8029b9188k20938j46938J43172O2545M2644K31352J07972l31237k99831j19762
8019e60209K79254J43296L47205q4154R4391j10140k96089J49671J87703J72553
8009C23481j81969N0358J15212j53624q4753L521P7428n5333K1130J76645q3066
7998B09030l3654K15364J52636R6535j94208j87821J48839r5301J22841Q5038
$$ plain form
7988 519299 570313 416169 358963 271940 99749 79169 144152 40889 -169487 -279505 -196202
7977 -196202 -65819 -2635 -202047 -496190 -357881 -122433 -101776 -142492 -295396 -334753
7967 -334753 -240608 -719950 -606881 -47966 270459 65660 -154984 -197881 75515 317871
7957 317871 284344 185829 256191 289807 113378 -238146 -166916 34640 -142887 -143282 -22275
7946 -22275 28795 43704 20635 -53970 214067 131123 -21981 -87726 -41353 -258843 -111028
7935 -111028 261450 287248 1464 -350879 -190173 -176122 -34276 433916 687162 504342
7925 504342 283941 265301 91402 138944 79165 -43199 -148487 -287373 -158289 -314673
7915 -314673 -715952 -826789 -751503 -614922 -587372 -201684 24876 79857 3340 179277
$$ packed form
7988E19299N1014j54144n7206q7023j72191k0580O4983j03263k10376j10018Q3303
7977a96202J30383O3184j99412k94143J38309K35448K0657m0716j52904l9357
7967c34753R4145m79342J13069N58915L18425k04799k20644m2897K73396K42356
7957C17871l3527r8515P0362L3616j76429l51524P1230K01556j77527l95J21007
7946b2275N1070J4909k3069p4605K68037q2944j53104o5745M6373k17490J47815
7935a11028L72478K5798k85784l52343J60706J4051J41846M68192K53246j82820
7925E04342k20401j8640j73899M7542n9779j22364j05288j38886J29084j56384
7915c14673m01279j10837P5286J36581K7550L85688K26560N4981p6517J75937
$$ plain form
7905 179277 13494 -287023 -208375 -159384 -180987 -94258 45006 177100 24017 61067 -113941
7894 -113941 109475 384493 163245 -308650 -230584 -281826 -106236 -27889 87119 -75440
7884 -75440 -245826 -52083 -144953 -434352 -317249 -369076 -230465 58649 150004 -68746
7874 -68746 -111766 37812 -137014 -128186 98740 374260 509752 469973 446249 625686 697201
7863 697201 497858 229585 14457 -71074 28442 -205408 -175724 40089 276772 5300
7853 5300 -225925 43564 110623 199935 240379 114113 -47467 -169720 -418217 -399574 -205535
7842 -205535 98599 339293 464019 241942 10143 -33732 -103799 -38706 110885 388559
7832 388559 341333 329451 536275 471126 218211 -98369 -351871 -356092 -251361 -202892 -70170
$$ packed form
7905A79277j65783l00517P8648M8991k1603Q6729J39264J32094j53083L7050j75008
7894a13941K23416K75018k21248m71895P8066n1242J75590P8347J15008j62559
7884g5440j70386J93743r2870k89399J17103n1827J38611K89114R1355k18750
7874f8746m3020J49578j74826Q828K26926K75520J35492l9779k3724J79437P1515
7863F97201j99343k68273k15128q5531R9516k33850K9684K15813K36683k71472
7853E300k31225K69489O7059Q9312M0444j26266j61580j22253k48497J8643J94039
7842b05535L04134K40694J24726k22077k31799m3875p0067O5093J49591K77674
7832C88559m7226j1882K06824o5149k52915l16580k53502m221J04731M8469J32722
$$ plain form
7821 -70170 -161200 -187211 -563310 -813354 -834432 -548058 -232493 118084 54721 24062 112512
7810 112512 -88429 -172168 -82717 20383 479 -373297 -313358 -116479 117250 22616 1586
7799 1586 63934 -146581 -95302 -229964 -229311 -147140 -180344 -209978 -219306 -16792 166164 -9271
7787 -9271 -82099 -126082 -45189 -205798 -460068 -497273 -320502 -47357 275724 364950 232619
7776 232619 215757 428718 306768 47676 75645 333561 353965 211439 178526 -181107
7766 -181107 -301423 -236064 -238747 -397491 -361206 -415400 -165459 -21233 -142648 -292740 -249469
7755 -249469 -115274 -127581 -187828 -241342 6341 126364 20067 63441 95141 111699 -88873
7744 -88873 -98792 -57318 -262152 -455893 -296992 3134 152847 -8789 -35009 4431 133780
$$ packed form
7821g0170r1030k6011l76099k50044k1078K86374L15565L50577o3363l0659Q8450
7810A12512k00941q3739Q9451J03100j9904l73776N9939J96879K33729r4634k1030
7799A586O2348k10515N1279j34662O53Q2171l3204k9634r328K02514J82956j75435
7787i271p2828m3983Q0893j60609k54270l7205J76771K73145L23081Q9226j32331
7776B32619j6862K12961j21950k59092K7969K57916K0404j42526l2913l59633
7766a81107j20316O5359k683j58744L6285n4194K49941J44226j21415j50092M3271
7755b49469J34195j2307o0247n3514K47683J20023j06297M3374L1700J6558k00572
7744h8873r919M1474k04834j93741J58901L00126J49713j61636k6220L9440J29349
$$ plain form
7733 133780 409673 306298 258194 -44197 -122608 -27045 4068 771 -126295 -260161 -322363
7722 -322363 -260981 -215944 -247472 -212211 67066 4305 -242317 -268005 -409021 -278485 -179679
7711 -179679 -273241 -585097 -561855 -230967 29066 -80536 -5289 -288939 -239650 3763
7701 3763 -52759 -294435 -346080 -153315 -60139 128240 180491 23331 -72842 60417 212452
7690 212452 237570 698803 789499 255932 -119946 -93274 116129 23381 -6512 97834 406696
7679 406696 91915 -305777 -266896 -366826 -195022 62862 177808 205297 257514 148742
7669 148742 -764 28406 98545 366502 155698 227194 17363 -238876 -221421 46091
7659 46091 282302 83955 -178871 -319309 -214517 -373436 -407444 -110333 -243534 -92283
$$ packed form
7733A33780K75893j03375m8104l02391p8411R5563L1113l297j27066j33866o2202
7722c22363O1382M5037l1528L5261K79277o2761k46622k5688j41016J30536R8806
7711a79679r3562l11856K3242L30888K60033j09602P5247k83650M9289K43413
7701C763n6522k41676n1645J92765R3176J88379N2251j57160r6173J33259J52035
7690B12452K5118M61233R0696n33567l75878K6672K09403r2748k9893J04346L08862
7679D06696l14781l97692L8881r9930J71804K57884J14946K7489N2217j08772
7669A48742j49506K9170P0139K67957k10804P1496k09831k56239J7455K67512
7659D6091K36211j98347k62826j40438J04792j58919l4008K97111j33201J51251
$$ plain form
7649 -92283 -52766 28620 375126 377623 206818 211585 -188361 -343984 -353600 -235647 -148591
7638 -148591 -151518 -66175 -70121 -326411 -642376 -688749 -350758 -355082 -402480 -415583 -364772 -223187
7626 -223187 -98142 373618 609584 588177 303606 -86341 -102796 -129798 -364294 -126727
7616 -126727 -22828 -191964 -290399 -123193 32112 -33678 -205558 -161816 -307120 -132599
7606 -132599 67701 13771 -201325 -316790 -559951 -460531 -301405 -485510 -671895 -493757
7596 -493757 -470158 -297462 226985 374081 141509 -86247 -124700 35081 6666 -19037
7586 -19037 20240 121754 150235 1855 142037 206605 421560 341971 317855 162339 267446
7575 267446 330945 236831 41906 -90960 -180588 -120057 -19947 146980 5290 -50701 47537
$$ packed form
7649i2283L9517Q1386L46506K497j70805M767l99946j55623r616J17953Q7056
7638a48591k927Q5343l946k56290l15965m6373L37991m324m7398j3103N0811J41585
7626b23187J25045M71760K35966k1407k84571l89947j6455k7002k34496K37567
7616a26727J03899j69136r8435J67206J55305o5790j71880M3742j45304J74521
7606a32599K00300n3930k15096j15465k43161R9420J59126j84105j86385J78138
7596d93757K3599J72696N24447J47096k32572k27756l8453J59781k8415k5703
7586a9037L9277J01514K8481j48380J40182O4568K14955p9589k4116j55516J05107
7575B67446O3499r4114j94925j32866q9628O0531J00110J66927j41690n5991R8238
$$ plain form
7564 47537 -156382 -142411 -38050 155437 300154 148644 -80743 -255142 -321537 -89930
7554 -89930 115464 84056 -76159 50098 -47237 -138465 101246 179359 258599 176647 -233365
7543 -233365 -449773 -425310 -305219 -19346 175725 29814 -76791 -137576 -231779 -151975
7533 -151975 -230357 -275356 -411104 -447090 -242868 -34956 10568 83430 -160229 -230180 195316
7522 195316 254344 76136 -80166 165977 456991 280593 360309 210031 372083 178503
7512 178503 -331131 -381289 -183267 -111577 -203762 -80552 -105645 -376508 -424398 -253278 -12139
7501 -12139 -91289 -231257 -239253 -35062 20470 220622 495899 486822 260688 -55826 -221427
7490 -221427 -203285 160788 175832 55913 -251384 -554506 -676222 -546169 -585092 -471734
$$ packed form
7564D7537k03919J3971J04361J93487J44717j51510k29387j74399o6395K31607
7554h9930K05394l1408j60215J26257r7335r1228K39711P8113P9240q1952m10012
7543b33365k16408K4463J20091K85873J95071j45911j06605o0785r4203P9804
7533a51975p8382m4999j35748l5986K04222K07912M5524P2862k43659o9951M25496
7522A95316N9028j78208j56302K46143K91014j76398P9716j50278J62052j93580
7512A78503n09634n0158J98022P1690r2185J23210k5093k70863m7890J71120K41139
7501a2139p9150j39968p996K04191N5532K00152K75277r077k26134l16514j65601
7490b21427J8142L64073J5044j19919l07297l03122j21716J30053l8923J13358
$$ plain form
7480 -471734 -383890 -78963 297005 267703 149297 210144 77287 243680 134543 -23574
7470 -23574 -217552 -549715 -279622 -114676 -90763 -162023 -242104 -10168 -33794 -128268 -198627
7459 -198627 -77705 30070 324608 332773 406230 352305 237699 358616 419328 371315 194967
7448 194967 39028 76636 24558 107373 87892 2139 -159044 -466791 -594555 -578579 -473594
7437 -473594 -351435 -404138 -410724 -435259 -523326 -384973 -209663 -170905 -69707 -157960 -111231
7426 -111231 -123124 -105241 -79617 29967 90254 -138707 -204610 -104940 164559 47881 -151129
7415 -151129 -364916 -281807 37348 19942 17890 226644 135332 -91659 -304168 -225698 -6230
7404 -6230 -21865 -37574 120006 50814 154901 115641 -38940 16733 -13490 -21149 -83779 54905
$$ packed form
7480d71734Q7844L04927L75968k9302j18406O0847j32857J66393j09137j58117
7470b3574j93978l32163K70093J64946K3913p1260q0081K31936k3626r4474p0359
7459a98627J20922J07775K94538Q165P3457n3925j14606J20917O0712m8013j76348
7448A94967j55939L7608n2078Q2815j9481q5753j61183l07747j27764J5976J04985
7437d73594J22159n2703o586k4535q8067J38353J75310L8758J01198q8253M6729
7426a11231j1893J7883K5624J09584O0287k28961o5903R9670K69499j16678j99010
7415a51129k13787Q3109L19155j7406k052K08754r1312k26991k12509P8470K19468
7404f230j5635j5709J57580o9192J04087l9260j54581N5673l0223p659o2630J38684
$$ plain form
7392 54905 51994 154488 58047 29291 -48105 -127442 -78735 190077 183175 133314 210015 22183
7380 22183 -197854 -39873 39473 145253 118426 185268 310194 149073 -118826 -85760 -86117
7369 -86117 -64865 -211023 1381 -74287 -340869 -451482 -356382 -164075 -234718 -262323 -149303
7358 -149303 -255587 -117513 117469 427006 464068 142976 -16642 81291 193744 238215
7348 238215 83486 178834 45710 176069 371167 194665 -183451 -443768 -469400 -276198
7338 -276198 2181 -67483 -266680 -513793 -509690 -457192 -334169 -319752 -177009 -51559 34979
7327 34979 -100929 -1509 -184878 -253602 -56087 -235371 -191233 -229183 -106738 -287201 -312117
7316 -312117 -241022 -210520 -14069 -151469 -205538 -210352 -229751 -399375 -548053 -398741 -391162
$$ packed form
7392E4905k911J02494r6441k8756p7396p9337M8707K68812o902m9861P6701j87832
7380B2183k20037J57981P9346J05780k6827O6842J24926j61121k67899L3066l57
7369h6117K1252j46158K12404p5668k66582j10613R5100J92307p0643k7605J13020
7358a49303j06284J38074K34982L09537L7062l21092j59618R7933J12453M4471
7348B38215j54729R5348j33124J30359J95098j76502l78116k60317k5632J93202
7338b76198K78379o9664j99197k47113M103N2498J23023J4417J42743J25450Q6538
7327C4979j35908R9420j83369o8724J97515j79284M4138l7950J22445j80463k4916
7316c12117P1095L0502J96451j37400n4069m814j9399j69624j48678J49312P579
$$ plain form
7305 -391162 -441693 8966 101991 117182 188211 473587 298783 38109 -180816 -454655
7295 -454655 -189775 34009 -5888 -80637 2997 340671 455423 404946 207770 181236 317941
7284 317941 197498 36861 -268888 -343433 -236334 -392877 -267528 -224620 -131650 -216465
7274 -216465 -282560 -340607 -71171 -72175 51638 163879 143193 -211265 -251807 -361040 -377133
7263 -377133 -84248 -77399 -140901 -166891 59910 29768 -159289 -161296 -411786 -491971 -356786
7252 -356786 -115890 69796 34303 -184923 -195987 -60388 -66337 67479 315064 257804 22142
7241 22142 152826 306645 226086 121036 -42444 130386 270377 101495 -36719 2375
7231 2375 159346 239129 16285 7957 149328 202752 294863 265537 225350 221259 60272 -65056
$$ packed form
7305c91162n0531M50659R3025J5191P1029K85376j74804k60674k18925k73839
7295d54655K64880K23784l9897p4749Q3634L37674J14752n0477j97176k6534J36705
7284C17941j20443j60637l05749p4545J07099j56543J25349M2908R2970q4815
7274b16465o6095n8047K69436j004J23813J12241k0686l54458m0542j09233j6093
7263c77133K92885O849o3502k5990K26801l0142j89057k007k50490q0185J35185
7252c56786K40896J85686l5493k19226j1064J35599n949J33816K47585n7260k35662
7241B2142J30684J53819q0559j05050j63480J72830J39991j68882j38214L9094
7231B375J56971P9783k22844q328J41371N3424R2111k9326m0187m091j60987j25328
$$ plain form
7219 -65056 160147 223852 37844 -324998 -57056 327768 -66726 -457120 -243702 -338056
7209 -338056 -602116 -464602 -231675 -140620 -253527 -81952 360507 408219 289031 332957
7199 332957 80830 -255570 -424281 -574348 -770766 -719988 -560783 -439695 -274203 -93894
7189 -93894 37880 211262 182402 207348 328318 370140 142369 7952 -11308 267039 306517
7178 306517 424061 247887 264773 118031 -64697 46369 72853 268143 399444 218524
7168 218524 42564 175851 16687 -263390 -427209 -182120 -73720 -134123 -71685 -22482
7158 -22482 -179405 -221897 -65211 123620 117621 -48390 -205414 -196721 63560 53768 -394616
7147 -394616 -453116 -496216 -299007 -99683 40340 34776 -7424 -142443 -223064 39777 12096
$$ packed form
7219f5056K25203O3705j86008l62842K67942L84824l94494l90394K13418r4354
7209c38056k64060J37514K32927R1055j12907J71575M42459M7712j19188M3926
7199C32957k52127l36400j68711j50067j96418N0778J59205J21088J65492J80309
7189i3894J31774J73382k8860K4946J20970M1822k27771j34417j9260K78347L9478
7178C06517J17544j76174J6886j46742j82728J11066K6484J95290J31301j80920
7168B18524j75960J33287j59164k80077j63819K45089J08400o0403O2438M9203
7158b2482j56923m2492J56686J88831n999j66011j57024Q693K60281r792m48384
7147c94616n8500m3100J97209J99324J40023n564m2200j35019q0621K62841k7681
$$ plain form
7136 12096 122517 177897 117554 11885 76394 49898 37089 67751 126048 427087 347669
7125 347669 295087 134255 -48425 -318135 -596081 -434637 -357768 -596144 -593874 -475132
7115 -475132 -321606 19268 -57649 47325 120748 -121103 -121101 -96152 -370719 -305765 -217109
7104 -217109 -384855 -484877 -418728 -200965 -8825 34853 -82312 -246015 -105541 -86192
7094 -86192 -184171 -363769 -444871 -625264 -512894 -405831 -412829 14095 157076 37480 -77668
7083 -77668 -103315 32706 98628 64177 -58401 -106619 -112128 -334097 -327578 79948 222847
7072 222847 292646 76643 -115769 -163571 -348558 -116872 247081 152607 -60317 -69313 315610
7061 315610 577388 348973 277377 359062 304921 207593 -34303 -157161 -27859 146604
$$ packed form
7136A2096J10421N5380o0343j05669O4509k6496j2809L0662N8297L01039p9418
7125C47669n2582j60832j82680k69710k77946J61444P6869k38376K270J18742
7115d75132J53526L40874p6917J04974P3423k41851KK4949k74567O4954Q8656
7104b17109j67746j00022O6149K17763J92140M3678j17165j63703J40474J9349
7094h6192r7979j79598q1102j80393J12370J07063o998M26924J42981j19596j15148
7083g7668k5647J36021O5922l4451j22578m8218n509k21969O519M07526J42899
7072B22847O9799k16003j92412m7802j84987K31686L63953r4474k12924q996L84923
7061C15610K61778k28415p1596Q1685n4141r7328k41896j22858J29302J74463
$$ plain form
7051 146604 186369 65517 -55528 53927 203255 -100359 -79562 59061 -94263 -63367
7041 -63367 -123623 -183459 -492894 -614280 -520800 -338996 -260398 -78081 100800 160212 65963
7030 65963 244018 263387 31772 50825 146470 137668 -90016 -171920 -278942 -385420 -352652
7019 -352652 -251704 -184236 -85133 39570 -294949 -390465 -495572 -589505 -732913 -803847 -548436
7008 -548436 -469837 -252557 -385994 -445302 -272536 101178 27952 -123768 24469 210396
6998 210396 285827 14033 -28625 83139 -72950 -261702 -288476 -264395 25029 98862 160290
6987 160290 -76353 -187053 -38783 119517 38729 117404 277764 237000 72347 148624
6977 148624 181693 66899 -157044 -285382 -269675 -81573 -195958 -57720 -1017 -25598
$$ packed form
7051A46604L9765j20852j21045J09455J49328l03614K0797J38623j53324L0896
7041f3367o0256n9836l09435j21386R3480J81804P8598J82317J78881N9412r4249
7030F5963J78055J9369k31615J9053R5645q802k27684q1904j07022j06478L2768
7019c52652J00948O7468R9103J24703l34519r5516j05107r3933j43408p0934K55411
7008e48436P8599K17280j33437n9308J72766L73714p3226j51720J48237J85927
6998B10396P5431k71794m2658J11764j56089j88752k6774K4081K89424P3833O1428
6987A60290k36643j10700J48270J58300q0788P8675J60360m0764j64653P6277
6977A48624L3069j14794k23943j28338J5707J88102j14385J38238N6703k4581
$$ plain form
6967 -25598 -140056 -84550 -62092 -70568 -45399 -32091 -106245 -95574 -300561 -231681 -13702
6956 -13702 338513 514949 381959 -33034 -266631 -54126 56693 13935 -47604 -252668
6946 -252668 -327789 -154659 -342787 -181436 -11819 -131858 -160214 -172344 -265109 -90710
6936 -90710 45857 -36968 35966 -169950 -231978 -283540 146692 64855 -106845 -68645 54598
6925 54598 -81277 90506 115535 4138 87123 243271 151619 -10755 -32306 313078 -7000
6914 -7000 -368367 -297966 -359890 -430639 -479679 -591911 -333630 -89622 -26363 227844 217487
6903 217487 130265 5420 -193882 -145192 -106398 -192486 -264825 21053 229987 416715 181153
6892 181153 187060 513130 537121 543239 365482 67901 -6149 162138 478793 491562 193166
$$ packed form
6967b5598j14458N5506K2458q476K5169J3308p4154J0671k04987O8880K17979
6956a3702L52215J76436j32990m14993k33597K12505J10819m2758o1539k05064
6946b52668p5121J73130j88128J61351J69617j20039k8356j2130r2765J74399
6936i0710J36567q2825P2934k05916o2028n1562M30232q1837j71700L8200J23243
6925E4598j35875J71783K5029j11397Q2985J56148r1652j62374k1551L45384l20078
6914g000l61367P0401o1924p0749m9040j12232K58281K44008O3259K54207j0357
6903B17487q7222j24845j99302M8690L8794q6088p2339K85878K08934J86728k35562
6892A81153N907L26070K3991O118j77757k97581p4050J68287L16655J2769k98396
$$ plain form
6881 193166 279487 108049 -109110 -157383 -77746 65561 301604 265619 427740 336920 395444
6870 395444 709997 603898 645881 634930 664000 594246 416061 304602 370354 381321 473782
6859 473782 295410 1087 37203 169694 355566 226342 83659 -39770 -217257 -79957
6849 -79957 180675 235925 13287 -203279 -154327 -1549 52045 -257812 -356788 -479321 -548171
6838 -548171 -493737 -290796 -269921 -284741 -121345 -117044 22716 241474 181190 78504 286373
6827 286373 44861 -220477 -379050 -288057 -168037 -174559 -174486 38368 -31100 -251862 -268350
6816 -268350 -62798 86416 32692 212640 250129 404183 466508 136510 88698 85213 102692
6805 102692 205049 254662 309570 477107 421575 210060 57346 8142 -11511 59727 -4220
$$ packed form
6881A93166Q6321j71438k17159m8273P9637J43307K36043l5985J62121r0820N8524
6870C95444L14553j06099M1983j0951K9070o9754j78185j11459O5752J0967R2461
6859D73782j78372k94323L6116J32491J85872j29224j42683j23429j77487J37300
6849g9957K60632N5250k22638k16566M8952J52778N3594l09857r8976j22533o8850
6838e48171N4434K02941K0875j4820J63396M301J39760K18758o0284j02686K07869
6827B86373k41512k65338j58573R0993J20020o522P3K12854o9468k20762j6488
6816b68350K05552J49214n3724J79948L7489J54054O2325l29998m7812l485J7479
6805A02692J02357M9613N4908J67537n5532k11515j52714m9204j9653P1238o3947
$$ plain form
6794 -4220 180684 148364 38854 -31556 -135198 -302358 -400963 -259997 13799 270279 353804
6783 353804 189545 -20640 12168 46726 -30122 -280426 -364975 -244564 -161700 -2697 112493
6772 112493 -48558 -287949 -336107 -454159 -435268 -87654 95185 -21489 -116768 -164124
6762 -164124 -343793 -18225 4326 -127306 -226841 -291277 -166595 -96031 -274540 -541855
6752 -541855 -250501 -261186 -285536 -77450 140221 189275 314031 166261 -105945 -247718
6742 -247718 62578 121870 51448 2608 -12789 102888 412565 455881 78065 -1525 -152772
6731 -152772 -293170 -21377 167859 -52388 43557 -154962 -295855 -191856 -209379 -191005
6721 -191005 -28004 24899 -58456 -67012 -35238 -189961 -226441 -159613 -251551 -352026 -301788
$$ packed form
6794d220J84904l2320j09510p0410j03642j67160r8605J40966K73796K56480Q3525
6783C53804j64259k10185L2808L4558p6848k50304q4549J20411Q2864J59003J15190
6772A12493j61051k39391m8158j18052J8891L47614J82839j16674r5279m7356
6762a64124j79669L25568K2551j31632r9535o4436J24682P0564j78509k67315
6752e41855K91354j0685k4350K08086K17671M9054J24756j47770k72206j41773
6742b47718L10296N9292p0422m8840j5397J15677L09677M3316l77816p9590j51247
6731a52772j40398K71793J89236k20247R5945j98519j40893J03999j7523J8374
6721a91005J63001N2903q3355q556L1774j54723l6480O6828r1938j00475N0238
$$ plain form
6710 -301788 -379869 -261303 -193109 -139387 -201113 109998 213326 102180 -19573 28740 10160
6699 10160 -3867 -27237 -301601 -199457 -86880 42590 168749 202101 41339 -243478
6689 -243478 -185239 55478 198694 246551 139726 163854 197618 25218 -329523 -119898
6679 -119898 244947 197233 190686 187367 305466 372087 184392 -29938 110121 3567 -81956
6668 -81956 93446 182262 166005 142084 186284 92996 -209973 -274895 2636 163338 29301
6657 29301 -294047 -475092 -849280 -536958 -77348 -78435 -263414 -215507 -230365 -267492 -326872
6646 -326872 -398142 -263714 -107194 -11931 -28686 -9997 129955 73648 5949 235863 105175
6635 105175 -67413 -58000 44974 79761 248799 10744 -152977 82140 379983 317887
$$ packed form
6710c01788p8081J18566O8194N3722o1726L11111J03328j11146j21753M8313j8580
6699A0160j4027k3370k74364J02144J12577J29470J26159L3352j60762k84817
6689b43478N8239K40717J43216M7857j06825K4128L3764j72400l54741K09625
6679a19898L64845m7714o547l319J18099O6621j87695k14330J40059j06554q5523
6668h1956J75402Q8816j6257k3921M4200r3288l02969o4922K77531J60702j34037
6657B9301l23348j81045l74188L12322M59610j087j84979M7907j4858l7127n9380
6646c26872p1270J34428J56520R5263j6755J8689J39952n6307o7699K29914j30688
6635A05175j72588R413J02974L4787J69038k38055j63721K35117K97843o2096
$$ plain form
6625 317887 299537 504208 401629 448176 168357 114024 365318 -5397 -97341 66711
6615 66711 186050 175469 181267 416324 319087 209775 -60389 -340623 -172675 -173489 -257482
6604 -257482 -65383 -93887 -135352 -149011 -171003 -306905 -376775 -236403 -18720 205065 270314
6593 270314 2573 -166268 -292200 -316606 -435998 -405575 -225980 10461 122101 -70132
6583 -70132 2068 -73032 -200694 -363745 -370758 -240979 -143491 96738 183209 136434 165631
6572 165631 -71340 -183445 -147333 -355164 -404158 -229122 53064 -41129 -270307 -251181
6562 -251181 -206165 -298477 -188573 -254136 -405808 -485781 -334474 -386317 -462689 -352714 -266133
6551 -266133 -225767 -285377 -247804 -261179 -14147 -31978 -93406 -157122 -216357 -222066 -321029 -159704
$$ packed form
6625C17887j8350K04671j02579M6547k79819n4333K51294l70715r1944J64052
6615F6711J19339j0581N798K35057r7237j09312k70164k80234J67948q14q3993
6604b57482J92099k8504m1465j3659k1992j35902o9870J40372K17683K23785O5249
6593B70314k67741j68841j25932k4406j19392L0423J79595K36441J11640j92233
6583g0132P2200p5100j27662j63051p013J29779R7488K40229Q6471m6775K9197
6572A65631k36971j12105L6112k07831m8994J75036K82186r4193k29178J9126
6562b51181M5016r2312J09904o5563j51672p9973J51307n1843p6372J09975Q6581
6551b66133M0366n9610L7573j3375K47032j7831o1428o3716n9235n709r8963J61325
$$ plain form
6539 -159704 260505 244754 36285 44737 256325 62525 -22921 100672 7504 -217629 -238490
6528 -238490 3330 10480 385393 336940 243750 443669 214123 -263902 -210949 -325937 -479323
6517 -479323 -258977 -221605 -160533 44753 358277 277804 153232 136802 -198652 -146683 -37536
6506 -37536 -4832 170414 132587 84274 140126 425317 429573 279362 152856 386807 474543
6495 474543 347338 313504 193197 282578 357973 50840 -248912 121527 344077 287913
6485 287913 141236 166114 77214 -110798 -334797 -366820 -337661 -89239 62698 -40292
6475 -40292 217493 556541 694370 498414 82770 -130553 -184782 -335972 -441075 -216090
6465 -216090 34771 185793 -65530 -191762 -156127 263621 375097 415448 383807 130874
$$ packed form
6539a59704M20209j5751k08469Q452K11588j93800q5446J23593r3168k25133k0861
6528b38490K41820P150L74913m8453r3190J99919k29546m78025N2953j14988j53386
6517d79323K20346L7372O1072K05286L13524q0473j24572j6430l35454N1969J09147
6506c7536L2704J75246l7827m8313N5852K85191M256j50211j26506K33951Q7736
6495D74543j27205l3834j20307Q9381P5395l07133k99752L70439K22550n6164
6485B87913j46677K4878q8900j88012k23999l2023K9159K48422J51937j02990
6475d0292K57785L39048J37829j95956m15644k13323n4229j51190j05103K24985
6465b16090K50861J51022k51323j26232L5635M19748J11476M0351l1641k52933
$$ plain form
6455 130874 71725 14524 104907 -35299 -257244 9107 61742 -266534 -190096 -68404 -37414
6444 -37414 -221522 -483030 -672673 -453748 -196214 -199298 -51023 -233125 -334867 8134
6434 8134 76698 207825 266259 76799 -43121 56417 -22367 -181315 1780 -24097 -254484
6423 -254484 -474396 -179684 15042 80939 229621 327329 481575 610510 378789 166351
6413 166351 83173 99860 389034 427133 165987 196626 134921 -101309 -268076 -204498 79206
6402 79206 354572 375256 198793 92670 159648 131102 -9539 -121388 -261932 -227082 -358665
6391 -358665 -142398 5705 -13506 21735 -18964 77175 275347 272971 -169436 -590640 -483197
6380 -483197 -286998 -94560 38369 2541 85795 103866 50512 216042 509710 459068 275513
$$ packed form
6455A30874n9149n7201R0383j40206k21945K66351N2635l28276P6438J21692L0990
6444c7414j84108k61508j89643K18925K57534l084J48275j82102j01742L43001
6434H134O8564J31127N8434j89460j19920R9538p8784j58948J83095k5877k30387
6423b54484k19912K94712J94726O5897J48682R7708J54246J28935k31721k12438
6413A66351q3178J6687K89174L8099k61146L0639o1705k36230j66767O3578K83704
6402G9206K75366K0684j76463j06123O6978k8546j40641j11849j40544L4850j31583
6391c58665K16267J48103j9211L5241m0699R6139J98172k376m42407m21204J07443
6380d83197J96199J92438J32929l5828Q3254J8071n3354J65530K93668n0642j83555
$$ plain form
6369 275513 100937 127164 -80094 -26114 7985 -98430 -100970 -147900 53918 -46047 -86868
6358 -86868 -183270 -372377 -390963 -282039 -190198 -123663 -82509 -33397 137819 131148 -175348
6347 -175348 -308168 -238029 -132071 -150260 -307363 -354944 -176122 302055 434326 311623
6337 311623 188237 -47606 -101272 -370058 -360554 -199487 -134128 -69186 -163197 -134459 23247
6326 23247 -73146 59445 42251 -193578 -115964 -194755 -228494 -75729 240558 160979 -96094
6315 -96094 48027 361597 183078 449870 351647 93578 -107869 -152974 -364895 -603520
6305 -603520 -595010 -507352 -109398 207627 207526 130112 14663 131710 -15593 30818 91149
6294 91149 69398 225439 480268 384987 317894 434064 317947 298908 -38037 -35428 31691
$$ packed form
6369B75513j74576K6227k07258N3980L4099j06415k540m6930K01818r9965m0821
6358h6868r6402j89107j8586J08924R1841O6535M1154M9112J71216o671l06496
6347a75348j32820P0139J05958j8189j57103m7581J78822M78177J32271j22703
6337C11623j23386k35843n3666k68786R504J61067O5359O4942r4011K8738J57706
6326B3247r6393J32591j7194k35829P7614p8791l3739J52765L16287p9579k57073
6315i6094J44121L13570j78519K66792r8223k58069k01447m5105k11921k38625
6305f03520Q510Q7658L97954L17025j01p7414j15449J17047j47303M6411O0331
6294I1149k1751J56041K54829r5281o7093J16170j16117j9039l36945K609O7119
$$ plain form
6283 31691 70999 -48084 -562902 -677284 -651429 -539537 -71063 188108 -10874 -165326
6273 -165326 -165485 1455 -27040 -130335 -181974 -53218 4051 -2719 -180197 -164748 71295
6262 71295 -155032 -139632 -254487 -104714 73091 109477 105230 -26848 72332 50495 -255971
6251 -255971 -377772 -285258 -78583 77417 -63999 -4436 132281 -6695 -175893 -184908
6241 -184908 -161647 24870 214410 -43416 -302723 -657414 -689159 -450997 -298432 -341265
6231 -341265 -392708 -420428 -172041 -308338 -505526 -313769 -242769 -187721 -41037 -13759 38338
6220 38338 -304591 -625416 -540364 -658604 -658767 -444976 -452230 -302358 -172462 -96646 52973
6209 52973 11847 -145133 -191443 -468944 -405307 -378322 -250795 -235970 -116856 132251 -178471
$$ packed form
6283C1691L9308j19083n14818j14382K5855J11892M68474K59171j98982j54452
6273a65326j59J66940k8495j03295n1639J28756N7269o770j77478J5449K36043
6262G1295k26327J5400j14855J49773J77805L6386m247j32078R9180k1837l06466
6251b55971j21801R2514K06675J56000j41416N9563J36717j38976j69198r015
6241a84908K3261J86517J89540k57826k59307l54691l1745K38162J52565m2833
6231c41265n1443k7720K48387j36297j97188J91757P1000N5048J46684K7278N2097
6220C8338l42929l20825Q5052j18240j63K13791p254J49872J29896P5816J49619
6209E2973m1126j56980m6310k77501O3637K6985J27527J4825J19114K49107l10722
$$ plain form
6198 -178471 -556565 -456408 -251599 25829 303496 585613 282506 -66179 83079 271729
6188 271729 -41549 -207658 -8170 -45911 -131900 78670 163192 242007 54810 -149591
6178 -149591 -251645 -280062 -27804 208117 159298 157267 32766 -75238 -290985 -162844
6168 -162844 77883 73363 -111946 -81578 -166205 -214277 -65883 101218 124085 -94354 -108002
6157 -108002 -181246 -195702 38514 -53562 -80059 -8001 3500 28457 17365 137152 73416
6146 73416 -82511 -44130 -228764 -386307 -288563 -350444 -439243 -298457 -406122 -92699 33392
6135 33392 30737 -16522 23054 102343 -43967 -234020 -109180 -157452 -428543 -487364 -317196
6124 -317196 -258033 -85014 -109199 -110412 -160637 -483893 -730257 -924277 -1129333 -834153 -648245
$$ packed form
6198a78471l78094J00157K04809K77428K77667K82117l03107l48685J49258J88650
6188B71729l13278j66109J99488l7741q5989K10570Q4522P8815j87197k04401
6178a49591j02054k8417K52258K35921m8819k031j24501j08004k15747J28141
6168a62844K40727m520j85309L0368q4627m8072J48394J67101K2867k18439j3648
6157a08002p3244j4456K34216r2076k6497P2058J1501K4957j1092J19787o3736
6146G3416j55927L8381j84634j57543R7744o1881q8799J40786j07665L13423J26091
6135C3392k655m7259L9576P9289j46310j90053J24840m8272k71091n8821J70168
6124c17196N9163J73019k4185j213n0225l23256k46364j94020k05056K95180J85908
$$ plain form
6113 -648245 -584320 -530716 -285292 -249859 -283765 -334395 -162727 304554 572180 461537 562990
6102 562990 652260 590964 587792 509612 52522 -223864 -382666 -413395 -141411 -135181 -254999
6091 -254999 -306025 -289646 -103008 46371 52501 160654 38096 -352678 -506795 -153278
6081 -153278 16023 197161 104753 105743 273012 245050 241203 7534 -29415 180036 -55534
6070 -55534 10454 350928 186899 81174 324595 224306 185640 114009 41471 -188358 63194
6059 63194 275581 77522 171616 74331 211360 164945 -12888 -152774 -425589 -385420 -195823
6048 -195823 -73902 -51683 -242072 -365250 -137423 157014 282904 328848 362962 553364
6038 553364 546001 353904 158683 -29890 -219027 -351845 -284011 -249296 19521 161053
$$ packed form
6113f48245O3925N3604K45424L5433l3906n0630J71668M67281K67626j10643J01453
6102E62990Q9270o1296l172p8180m57090k76386j58802l0729K71984O230j19818
6091b54999n1026J6379J86638J49379O130J08153j22558l90774j54117L53517
6081a53278J69301J81138r2408R90J67269k7962l847k33669l6949K09451k35570
6070e5534O5988L40474j64029j05725K43421j00289l8666p1631p2538k29829K51552
6059F3194K12387j98059R4094r7285J37029m6415j77833j39886k72815M0169J89597
6048a95823J21921K2219j90389j23178K27827K94437J25890M5944L4114J90402
6038E53364p363j92097j95221j88573j89137j32818O7834L4715K68817J41532
$$ plain form
6028 161053 162716 62829 131512 307103 98814 385016 651935 120922 -179080 -245348 -27032
6017 -27032 170299 246953 31837 -89502 -164414 -68044 -136437 -420964 -303180 -277856 -300472
6006 -300472 -328489 -188358 -151687 -67084 102326 182110 312470 302207 340214 269053 140835
5995 140835 58172 -77757 -251646 -585315 -542516 -475358 -78321 73461 51399 189617
5985 189617 373108 387234 520279 357609 81513 216956 183084 26454 47407 285005
5975 285005 389868 372116 531048 597122 742657 384629 238441 294574 -57341 -129840
5965 -129840 49997 344550 294244 175845 282103 34637 -160847 -227222 -345232 -354475
5955 -354475 -265644 -113703 61241 177439 270248 290628 394622 395638 84012 -55302 -181306
$$ packed form
6028A61053J663r9887O8683J75591k08289K86202K66919n31013l00002o6268K18316
6017b7032J97331P6654k15116j21339p4912R6370o8393k84527J17784K5324k2616
6006c00472k8017J40131L6671Q4603J69410P9784J30360j0263L8007p1161j28218
5995A40835q2663j35929j73889l33669M2799O7158L97037J51782k2062J38218
5985A89617J83491J4126J33045j62670k76096J35443l3872j56630K0953K37598
5975B85005J04863j7752J58932O6074J45535l58028j46188N6133l51915p2499
5965a29840J79837K94553n0306j18399J06258k47466j95484o6375j18010r243
5955c54475Q8831J51941J74944J16198R2809K0380J03994J016l11626j39314j26004
$$ plain form
5944 -181306 -146453 175177 152887 33932 26802 15130 112869 331645 115791 28962 -67805
5933 -67805 -66355 -23114 123423 228263 215449 -119605 -302879 -354134 -290159 83023 121409
5922 121409 183206 212790 341261 385509 106164 121804 41913 80776 75571 -35054 -218390
5911 -218390 -319382 -258263 -25385 -186354 -142669 -53414 217492 424498 341120 89031
5901 89031 -31651 120203 24139 109135 17950 26334 20506 -41988 -272557 -195214 189307
5890 189307 270019 66552 164350 94368 -59288 79538 -95437 -118271 -61246 173513 351504
5879 351504 319964 26039 -121370 230609 183698 -50647 -169654 -134380 -339651 -642309
5869 -642309 -687506 -504567 -562499 -407405 -31586 104962 106546 -8954 -98326 36240 -28942
$$ packed form
5944a81306L4853L21630k2290j18955p130j1672R7739K18776k15854q6829r6767
5933f7805J450M3241J46537J04840j2814l35054j83274n1255O3975L73182L8386
5922A21409O1797K9584J28471M4248k79345J5640p9891L8863n205j10625j83336
5911b18390j00992O1119K32878j60969M3685Q9255K70906K07006q3378k52089
5901H9031j20682J51854r6064Q4996r1185Q384n828o2494k30569P7343L84521
5890A89307Q0712k03467R7798o9982j53656J38826j74975k2834N7025K34759J77991
5879C51504l1540k93925j47409L51979m6911k34345j19007L5274k05271l02658
5869f42309m5197J82939n7932J55094L75819J36548J584j15500q9372J34566o5182
$$ plain form
5858 -28942 -194584 -73903 27439 339507 375925 344658 193278 -139503 -558562 -407378
5848 -407378 -191612 -325250 -594970 -389323 68831 173187 272336 144018 76485 -56119
5838 -56119 -109402 -202263 -192241 -431972 -615990 -733628 -562589 -296191 -148576 18882
5828 18882 228717 373527 336052 277341 26029 -119063 -126674 -145448 -127452 154368 240331
5817 240331 730227 837553 474965 165189 299265 487554 109204 124191 151969 -17342
5807 -17342 -187081 -143615 -330360 -512158 -571269 -301052 -270469 -406591 -214429 -72429
5797 -72429 -118420 -127431 -206833 -183212 -421271 -347169 -71777 283910 446082 547856 468322
5786 468322 272869 173520 34480 -18420 156721 2967 109443 192781 355569 375186
$$ packed form
5858b8942j65642J20681J01342L12068L6418l1267j51380l32781m19059J51184
5848d07378K15766j33638k69720K05647M58154J04356R9149j28318o7533j32604
5838e6119n3283r2861J0022k39731j84018j17638J71039K66398J47615J67458
5828A8882K09835J44810l7475n8711k51312j45092p611j8774J7996K81820Q5963
5817B40331M89896J07326l62588l09776J34076J88289l78350J4987K7778j69311
5807a7342j69739M3466j86745j81798n9111K70217L0583j36122J92162J42000
5797g2429m5991r011p9402K3621k38059P4102K75392L55687J62172J01774p9534
5786D68322j95453r9349j39040n2900J75141j53754J06476Q3338J62788J9617
$$ plain form
5776 375186 251657 -105493 -207778 -240440 -487815 -650416 -357045 -87472 145405 422816
5766 422816 340826 -9877 -113207 -196280 -161844 -110548 -150723 144732 452285 467532 711028
5755 711028 437799 395342 523266 460667 272684 273139 372555 328276 162329 153125 113035
5744 113035 183440 302680 378385 485914 304181 220142 237277 109276 -198115 23542
5734 23542 96452 -238469 -503835 -559780 -437636 -398129 -358593 -18354 102626 -28457 57952
5723 57952 -41776 19218 194336 254546 263214 314225 79409 -288469 -410780 -147010 261258
5712 261258 752029 702118 349755 94219 55260 118153 225508 342548 349274 312644 334538
5701 334538 413133 666785 640016 762836 505867 69963 -57270 24975 -295981 -479161
$$ packed form
5776C75186j23529l57150j02285l2662k47375j62601K93371K69573K32877K77411
5766D22816q1990l50703j03330q3073L4436N1296m0175K95455L07553J5247K43496
5755G11028k73229m2457J27924o2599j87983M55R9416m4279j65947r204m0090
5744A13035P0405J19240P5705J07529j81733q4039J7135j28001l07391K21657
5734B3542P2910l34921k65366n5945J22144L9507L9536L40239J20980j31083Q6409
5723E7952r9728O0994J75118O0210Q668N1011k34816l67878j22311K63770M08268
5712B61258M90771m9911l52363k55536l8959O2893J07355J17040O726l6630K1894
5701C34538P8595K53652k6769J22820k56969m35904j27233Q2245l20956j83180
$$ plain form
5691 -479161 -286855 -344389 -350447 -431379 -395567 -258872 -73637 -246783 -377290 -114359 278851
5680 278851 337617 118828 144024 314956 189033 69286 -108842 -94579 -26366 151517
5670 151517 7419 -160832 -125528 -306798 -292097 -149814 -171134 -302807 -328576 -349059 -334707
5659 -334707 -237955 -408782 -607118 -579956 -535968 -275143 -219097 -105424 -196437 -320268 -210022
5648 -210022 -137805 -23759 -76719 -248662 -39136 57733 86585 325793 514118 337143
5638 337143 230007 -41819 -61966 54074 -180188 68638 75936 68159 -347514 -628103 -315517
5627 -315517 57966 -162493 -229390 76788 122598 369140 535346 421548 219261 201135
5617 201135 91308 165288 105097 85692 -245053 -418998 -276983 -127094 -419686 -455188
$$ packed form
5691d79161J92306n7534o058q0932L5812J36695J85235j73146j30507K62931L93210
5680B78851N8766k18789K5196J70932j25923j19747j78128J4263O8213J77883
5670A51517j44098j68251L5304j81270J4701J42283k1320j31673k5769k0483J4352
5659c34707R6752j70827j98336K7162M3988K60825N6046J13673r1013j23831J10246
5648b10022P2217J14046n2960j71943K09526R6869K8852K39208J88325j76975
5638C37143j07136k71826k0147J16040k34262K48826P298p777m15673k80589L12586
5627c15517L73483k20459o6897L06178M5810K46542J66206j13798k02287j8126
5617B01135j09827P3980o0191j9405l30745j73945J42015J49889k92592l5502
$$ plain form
5607 -455188 -590449 -501094 -409592 -222238 10111 -141350 -270739 -134487 9304 -220690
5597 -220690 -376597 -196132 -30892 -12116 -163824 -119082 122364 357957 307730 96696
5587 96696 -122501 -41531 224180 -49335 -55638 179765 -36713 -267672 4835 186846
5577 186846 247539 289409 153418 -9272 -244045 -340315 -285182 -227243 134731 238906 -128254
5566 -128254 -322554 -166692 -387506 -475266 -380380 -157385 71302 174315 122912 -79781
5556 -79781 1833 -335122 -340474 -228752 -77632 60546 -169431 -169282 -19997 25580 63982
5545 63982 -25335 -127038 -466907 -684710 -631934 -593469 -457461 -567448 -641338 -473812 -383522
5534 -383522 -247966 -30383 258229 270607 340036 117253 117319 117779 287226 196974 160837 314576
$$ packed form
5607d55188j35261Q9355R1502J87354K32349j51461j29389J36252J43791k29994
5597b20690j55907J80465J65240J8776j51708M4742K41446K35593n0227k11034
5587I6696k19197Q0970K65711k73515o303K35403k16478k30959K72507J82011
5577A86846O0693M1870j35991j62690k34773r6270N5133N7939L61974J04175l67160
5566a28254j94300J55862k20814q7760R4886K22995K28687J03013n1403k02693
5556g9781Q1614l36955n352J11722J51120J38178k29977J49J49285M5577L8402
5545F3982q9317j01703l39869k17803N2776L8465J36008j09987p3890J67526R0290
5534c83522J35556K17583K88612J2378O9429k22783O6M60J69447r0252l6137J53739
$$ plain form
5522 314576 360082 396341 312446 125385 213 102148 97441 163135 129591 136494 55448
5511 55448 263759 73853 204669 431184 610186 740105 286653 91996 169303 149662
5501 149662 39441 -13278 41448 227730 400467 199141 52018 -40211 345223 268546
5491 268546 -71234 -3379 -7123 114156 199175 229546 128874 82483 124231 255231 177088
5480 177088 -44213 77091 383878 448195 363817 -158282 -297219 -304249 -142659 -241078 -304233
5469 -304233 -202141 -435480 -703514 -365552 -103572 269721 304160 342154 140135 156498
5459 156498 -60517 -176837 -309329 -243599 -135584 -79335 -141558 62625 37510 -4250 -21946
5448 -21946 87092 318184 260387 125786 -357804 -709447 -473156 -400426 -395351 -357136 -508035
$$ packed form
5522C14576M5506L6259q3895j87061j25172J01935m707O5694l3544O903q1046
5511E5448K08311j89906J30816K26515J79002J29919m53452j94657P7307j9641
5501A49662j10221n2719N4726J86282J72737k01326j47123r2229L85434p6677
5491B68546l39780O7855l744J21279Q5019L0371j00672m6391M1748J31000p8143
5480A77088k21301J21304L06787O4317q4378n22099j38937p030J61590r8419o3155
5469c04233J02092k33339k68034L37962K61980L73293L4439L7994k02019J6363
5459A56498k17015j16320j32492O5730J08015N6249o2223K04183k5115m1760j7696
5448b1946J09038K31092n7797j34601m83590l51643K36291P2730N075L8215j50899
$$ [...]
##END NTUPLES=NMR SPECTRUM
##END=
