##TITLE=Analysis number 318036
Compound Code btb 10239
Project Code adrs
Chemist Name adomenas
##JCAMPDX= 6.0         $$ Bruker NMR JCAMP-DX V2.0
##DATA TYPE= NMR SPECTRUM
##DATA CLASS= NTUPLES
##ORIGIN= Bruker BioSpin GmbH
##OWNER= nmr
$$ XWIN-NMR		Version 3.5
$$ Mon Mar 13 10:35:30 2006 GMT Standard Time (UT+0h)  MAYBRIDGE\nmr@NMR_250MHZ
##.OBSERVE FREQUENCY= 250.131544655141
##.OBSERVE NUCLEUS= ^1H
##.ACQUISITION MODE= SIMULTANEOUS (DQD)
##.ACQUISITION SCHEME= undefined
##.AVERAGES= 16
##.DIGITISER RES= 18
##SPECTROMETER/DATA SYSTEM= dpx250
##.PULSE SEQUENCE= zg30
##.SOLVENT NAME= CDCl3
##.SHIFT REFERENCE= (INTERNAL, CDCl3, 0, 16.522)
##AUDIT TRAIL= $$ (NUMBER, WHEN, WHO, WHERE, WHAT)
$$ ##TITLE= Audit trail, XWIN-NMR		Version 3.5
$$ ##JCAMPDX= 5.01
$$ ##ORIGIN= Bruker BioSpin GmbH
$$ ##OWNER= nmr
$$ C:\u/data/dgb/nmr/ADRS/580/pdata/1/auditp.txt
$$ ##AUDIT TRAIL=  $$ (NUMBER, WHEN, WHO, WHERE, WHAT)
(   1,<2006-03-13 10:35:04.95 +000>,<MAYBRIDGE\nmr>,<NMR_250MHZ>,
      <created by zg, POWCHK disabled, PULCHK disabled
       configuration hash MD5:
       84 BC 41 DB A1 6E 1D 46 DA 25 12 A5 C1 ED C5 3A
       data hash MD5: 64K
       05 2B DD E1 DB C5 62 40 B3 56 4D C0 46 2B F7 92>)
(   2,<2006-03-13 10:35:19.50 +000>,<MAYBRIDGE\nmr>,<NMR_250MHZ>,
      <Start of raw data processing
       ef LB = 0.3 FT_mod = 6 PKNL = 1 SI = 32K 
       data hash MD5: 32K
       7A 09 B3 A6 B2 47 78 DA 39 1E D4 0F B4 9F 06 20>)
(   3,<2006-03-13 10:35:21.42 +000>,<MAYBRIDGE\nmr>,<NMR_250MHZ>,
      <apk 
       data hash MD5: 32K
       FC FE 08 43 C0 01 9F E1 A6 C4 D4 2E E9 77 72 8B>)
(   4,<2006-03-13 10:35:22.50 +000>,<MAYBRIDGE\nmr>,<NMR_250MHZ>,
      <abs ABSG = 5 
       data hash MD5: 32K
       79 9F 14 F6 BD 7D 90 B4 BC 00 80 17 F9 7D 53 99>)
$$ ##END=
$$ 
$$ hash MD5
$$ 7A CA CB 40 B3 95 BE 42 E9 55 9A 98 D8 55 B7 D3
##$RELAX= 
##$RELAX= 
##$RELAX= 
##$RELAX= 
##$RELAX= 
##$RELAX= 
##$RELAX= 
$$ Bruker specific parameters
$$ --------------------------
##$DU= <C:\u>
##$EXPNO= 580
##$NAME= <ADRS>
##$PROCNO= 1
##$TYPE= <nmr>
##$USER= <dgb>
##$AMP= (0..31)
100 100 100 100 100 100 100 100 100 100 100 100 100 100 100 100 100 100 
100 100 100 100 100 100 100 100 100 100 100 100 100 100 
##$AQSEQ= 0
##$AQ_mod= 3
##$AUNM= <au_zg>
##$AUTOPOS= <20 >
##$BF1= 250.13
##$BF2= 250.13
##$BF3= 250.13
##$BF4= 250.13
##$BF5= 500.13
##$BF6= 500.13
##$BF7= 500.13
##$BF8= 500.13
##$BYTORDA= 1
##$CFDGTYP= 0
##$CFRGTYP= 5
##$CHEMSTR= <none>
##$CNST= (0..31)
1 1 145 1 1 1 1 1 1 1 1 1 1 1 1 1 1 1 1 1 1 1 1 1 1 1 1 1 1 1 1 1 
##$CPDPRG= <>
##$CPDPRG1= <>
##$CPDPRG2= <>
##$CPDPRG3= <>
##$CPDPRG4= <mlev>
##$CPDPRG5= <mlev>
##$CPDPRG6= <mlev>
##$CPDPRG7= <mlev>
##$CPDPRG8= <mlev>
##$CPDPRGB= <>
##$CPDPRGT= <>
##$D= (0..31)
0 1 0 0 0 0 0 0 0 0.06 0 0 0 0 0 0 0.0002 0 0 0 0 0 0 0 0 0 0 0 0 0 0 
0 
##$DATE= 1142246103
##$DBL= (0..7)
120 120 120 120 120 120 120 120 
##$DBP= (0..7)
150 150 150 150 150 150 150 150 
##$DBP07= 0
##$DBPNAM0= <>
##$DBPNAM1= <>
##$DBPNAM2= <>
$$ [...]
##$SUBNAM7= <"">
##$SUBNAM8= <"">
##$SUBNAM9= <"">
##$SW= 20.6930455092707
##$SWIBOX= (0..15)
0 0 3 0 0 0 0 0 0 0 0 0 0 0 0 0 
##$SW_h= 5175.983436853
##$TD= 65536
##$TD0= 1
##$TE= 294.16
##$TE2= 300
##$TE3= 300
##$TEG= 300
##$TL= (0..7)
0 120 120 120 120 120 120 120 
##$TP= (0..7)
150 150 150 150 150 150 150 150 
##$TP07= 0
##$TPNAME0= <>
##$TPNAME1= <>
##$TPNAME2= <>
##$TPNAME3= <>
##$TPNAME4= <>
##$TPNAME5= <>
##$TPNAME6= <>
##$TPNAME7= <>
##$TPOAL= (0..7)
0.5 0.5 0.5 0.5 0.5 0.5 0.5 0.5 
##$TPOFFS= (0..7)
0 0 0 0 0 0 0 0 
##$TUNHIN= 0
##$TUNHOUT= 0
##$TUNXOUT= 0
##$USERA1= <user>
##$USERA2= <user>
##$USERA3= <user>
##$USERA4= <user>
##$USERA5= <user>
##$V9= 5
##$VALIST= <valist>
##$VCLIST= <CCCCCCCCCCCCCCC>
##$VD= 0
##$VDLIST= <DDDDDDDDDDDDDDD>
##$VPLIST= <PPPPPPPPPPPPPPP>
##$VTLIST= <TTTTTTTTTTTTTTT>
##$WBST= 1024
##$WBSW= 4
##$XGAIN= (0..3)
0 0 0 0 
##$XL= 0
##$YL= 0
##$YMAX_a= 580421
##$YMIN_a= -381237
##$ZGOPTNS= <>
##$ZL1= 120
##$ZL2= 120
##$ZL3= 120
##$ZL4= 120
##$ABSF1= 16.522
##$ABSF2= -4.171173
##$ABSG= 5
##$ABSL= 3
##$ALPHA= 0
##$AQORDER= 0
##$ASSFAC= 0
##$ASSFACI= 0
##$ASSFACX= 0
##$ASSWID= 0
##$AUNMP= <proc_1d>
##$AZFE= 0.1
##$AZFW= 0.1
##$BCFW= 0
##$BC_mod= 0
##$BYTORDP= 0
##$COROFFS= 0
##$CY= 12.5
##$DATMOD= 1
##$DC= 0
##$DFILT= <>
##$DTYPP= 0
##$F1P= 14.0000005364418
##$F2P= -0.99999901652339
##$FCOR= 0.5
##$FTSIZE= 32768
##$FT_mod= 6
##$GAMMA= 0
##$GB= 0
##$INTBC= 1
##$INTSCL= 1
##$ISEN= 128
##$LB= 0.3
##$LEV0= 0
##$LPBIN= 0
##$MAXI= 10000
##$MC2= 0
##$MEAN= 0
##$ME_mod= 0
##$MI= 0
##$NCOEF= 0
##$NC_proc= -5
##$NLEV= 6
##$NOISF1= 0
##$NOISF2= 0
##$NSP= 0
##$NTH_PI= 0
##$NZP= 0
##$OFFSET= 16.522
##$PC= 1
##$PHC0= 18.99779
##$PHC1= 5.418709
##$PH_mod= 1
##$PKNL= yes
##$PPARMOD= 0
##$PSCAL= 4
##$PSIGN= 0
##$REVERSE= no
##$SF= 250.13
##$SI= 32768
##$SIGF1= 0
##$SIGF2= 0
##$SINO= 400
##$SIOLD= 32768
##$SREGLST= <1H.CDCl3>
##$SSB= 0
##$STSI= 32768
##$STSR= 0
##$SW_p= 5175.98343685301
##$SYMM= 0
##$S_DEV= 0
##$TDeff= 65536
##$TDoff= 0
##$TI= <Analysis number 999999
Compound Code 99
Book Reference 9
Project Code 9>
##$TILT= no
##$TM1= 0
##$TM2= 0
##$TOPLEV= 0
##$USERP1= <user>
##$USERP2= <user>
##$USERP3= <user>
##$USERP4= <user>
##$USERP5= <user>
##$WDW= 1
##$XDIM= 32768
##$YMAX_p= 456781891
##$YMIN_p= -514844
$$ End of Bruker specific parameters
$$ ---------------------------------
##NTUPLES= NMR SPECTRUM
##VAR_NAME=  FREQUENCY,     SPECTRUM/REAL,   SPECTRUM/IMAG
##SYMBOL=    X,             R,               I
##VAR_TYPE=  INDEPENDENT,   DEPENDENT,       DEPENDENT
##VAR_FORM=  AFFN,          ASDF,            ASDF
##VAR_DIM=   32768,         32768,           32768
##UNITS=     HZ,            ARBITRARY UNITS, ARBITRARY UNITS
##FACTOR=    0.157963299565203, 1,           1
##FIRST=     4132.6476996994, 0,             0
##LAST=      -1043.33573715361, 0,           0
##MIN=       -1043.33573715361, -514844,     0
##MAX=       4132.6476996994, 456781891,     0
$$ Real data points
##PAGE= N=1
##DATA TABLE= (X++(R..R)), XYDATA
$$ [...]
$$ plain form
14322 45816 31130 17416 10191 448 -22988 -25827 -29560 -29811 -24960 -7157 -1079 -10023 -3292 -2323
14308 -2323 -18550 -23021 -18361 -9653 -4688 2496 16202 10355 6302 4317 -365 -6044 -12378 -4471
14294 -4471 -17359 -47794 -48010 -40917 -32558 -20945 -8319 8555 18200 14781 10996 -6216 3435
14281 3435 840 -5995 -4624 4571 -2586 -10324 -3681 7574 5417 8830 -4592 -22004 -34628 -36292
14267 -36292 -37361 -26701 -5395 -8864 -248 2207 4490 -4817 1446 6860 -12599 -21419 -22396 -20687
14253 -20687 -17756 -14046 -4450 -11994 -8496 -9668 -5535 -14229 -22142 -38513 -29290 -14978 -7835 -11665
14239 -11665 -17798 -34158 -32819 -10638 5888 -1630 1956 4072 -1321 -8309 -6561 -10910 -22008
14226 -22008 -31566 -22812 -21339 -12261 -18639 -25883 -16883 -13781 -5255 -9084 -1724 -5823 -13778 -20400
$$ packed form
14322D5816j4686j3714p225r743k3436k839l733k51M851J7803O078q944O731R69
14308b323j6227m471M660Q708M965P184J3706n847m053j985m682n679o334P907
14294d471j2888l0435k16P093Q359J1613J2626J6874R645l419l785j7212R651
14281C435k595o835J371R195p157p738O643J1255k157L413j3422j7412j2624j664
14267c6292j069J0660K1306l469Q616K455K283r307O263N414j9459q820r77J709
14253b0687K931L710R596p544L498j172M133q694p913j6371R223J4312P143l830
14239a1665o133j6360J339K2181J6526p518L586K116n393o988J748m349j1098
14226b2008r558Q754J473R078o378p244R000L102Q526l829P360m099p955o622
$$ plain form
14212 -20400 -9838 -9752 -20881 -31656 -27274 -17470 -12317 -9333 -17026 1557 19465 19296 14515 589
14198 589 6666 -122 -5915 -16027 -16505 -14313 -24416 -26281 -29030 -25772 -873 8052 -4221 -16258
14184 -16258 -6152 281 -11815 -22914 -13129 -8224 -12531 -6790 1617 -13384 -28605 -20147 -19862
14171 -19862 -12443 2587 22653 23795 33320 46576 29972 19226 11063 1244 -3729 -4358 15275
14158 15275 16679 22356 7988 1633 4550 3461 1111 1867 19130 22381 24055 21208 3551 4893
14144 4893 11750 18918 22327 14325 3685 -2613 19598 12450 -2313 -7745 -4507 -9367 -657 1960
14130 1960 9223 16202 20036 -2735 -20630 -34496 -27187 -26825 -33639 -33699 -15738 10952 12036 -6860
14116 -6860 -18939 -25910 -10057 -5921 -7839 -4109 2708 9093 20431 12994 -3479 -2657 -19059 -25892
$$ packed form
14212b0400J0562Q6j1129j0775M382R804N153K984p693J8583J7908j69m781j3926
14198E89O077o788n793j0112m78K192j0103j865k749L258K4899Q925j2273j2037
14184a6258J0106O433j2096j1099R785M905m307N741Q407j5001j5221Q458K85
14171a9862P419J5030K0066J142R525J3256j6604j0746q163r819m973o29J9633
14158A5275J404N677j4368o355K917j089k350P56J7263L251J674k847j7657J342
14144D893O857P168L409q002j0640o298K2211p148j4763n432L238m860Q710K617
14130A960P263O979L834k2771j7895j3866P309L62o814o0J7961K6690J084j8896
14116f860j2079o971J5853M136j918L730O817O385J1338p437j6473Q22j6402o833
$$ plain form
14102 -25892 -23657 -22400 -25682 -29607 -34174 -23401 -21307 -16211 -9796 -13090 -21281 -12917 7192 16451
14088 16451 2595 2155 1716 5350 -6029 -14731 -7252 2032 1491 -3600 -4175 4578 6489 18976 26724
14073 26724 31421 39145 34303 15625 8350 15093 9649 18642 23523 34999 33394 19879 6936
14060 6936 -2438 -11873 -27611 -37378 -14029 892 1 8275 28092 32476 7151 435 -2225 -22892
14046 -22892 -42399 -52049 -44029 -29660 -25896 -23211 -17321 -22186 -15318 13247 16719 7561 9282 6089
14032 6089 16167 8774 -15100 -16207 -13575 -23996 -17751 -18903 -26099 -32809 -23553 -32521 -28769 -20862
14018 -20862 -26467 -15116 -12346 -12530 -22018 -5212 13397 27691 22474 6452 -14 -12319 -12062
14005 -12062 -30920 -34250 -23529 -35190 -34711 -27580 -31979 -32466 -23918 -33038 -23375 -28092 -32808 -17842
$$ packed form
14102b5892K235J257l282l925m567J0773K094N096O415l294q191Q364K0109R259
14088A6451j3856m40m39L634j1379q702P479R284n41n091n75Q753J911J2487P748
14073B6724M697P724m842j8678p275O743n444Q993M881J1476j605j3515j2943
14060F936r374r435j5738r767K3349J4921q91Q274J9817M384k5325o716k660k0667
14046b2892j9507r650Q020J4369L764K685N890m865O868K8565L472r158J721l193
14032F089J0078p393k3874j107K632j0421O245j152p196o710R256q968L752P907
14018b0862n605J1351K770j84r488J6806J8609J4294n217j6022o466j2305K57
14005a2062j8858l330J0721j1661M79P131m399m87Q548r120R663m717m716J4966
$$ plain form
13991 -17842 -7506 -11123 -8296 11526 14085 14325 13857 5874 10663 7010 14497 4064 -10388 -4114
13977 -4114 -8345 -14451 -16927 -11343 -22046 -30140 -29104 -29116 -25187 -31460 -33898 -23863 -7504 -1233
13963 -1233 1081 -4714 -8897 6677 5269 -17716 -27857 -21805 -11628 -7060 -19762 -28382 -18462
13950 -18462 -19860 -18753 -7151 -19043 -22419 -11357 -17751 -24597 -10631 -4330 -2212 -14453 -18299
13937 -18299 -9094 -12628 -6596 -1052 -27 -13157 -9681 3232 9693 12115 325 -10650 -13644
13924 -13644 -23545 -21306 -20886 -13567 -3956 -7162 -18908 -11613 -5344 -19203 -13576 -18162 -16066 -21038
13910 -21038 -11447 10418 22714 29404 16629 -9177 -38406 -32573 -16626 -24570 -26438 -8857 8751
13897 8751 8631 -8474 -5895 -10250 -8287 -7954 -6241 -8355 303 3446 11458 -1278 122 4116 9383
$$ packed form
13991a7842J0336l617K827J9822K559K40m68p983M789l653P487j0433j4452O274
13977d114m231o106k476N584j0703q094J036j2L929o273k438J0035J6359O271
13963a233K314n795m183J5574j408k2985j0141O052J0177M568j2702q620R920
13950a8462j398J107J1602j1892l376J1062o394o846J3966O301K118j2241l846
13937a8299R205l534O032N544J025j3130L476J2913O461K422j1790j0975k994
13924a3644r901K239M20P319R611l206j1746P295O269j3859N627m586K096m972
13910b1038R591K1865J2296O690j2775k5806k9229N833J5947p944j868J7581J7608
13897H751j20j7105K579m355J963L33J713k114Q658L143Q012j2736J400L994N267
$$ plain form
13882 9383 7882 -3289 -8624 -17529 -8400 2320 4523 2046 -5394 -5318 -20266 -15533 -1540 973
13868 973 3014 5978 18991 15963 24849 27023 15050 6988 9289 8117 2381 -715 -3605 1868
13854 1868 4834 12871 21113 10061 11269 3605 2547 -3872 -16600 -10440 -1556 -7695 -16104 -755
13840 -755 -7880 -31574 -37732 -34311 -33252 -20260 -11784 -338 -7868 -14951 -14602 -21827 -29773 -19571
13826 -19571 -2511 811 8854 5725 7524 3436 -8379 -21188 -1445 13340 21540 24824 12700
13813 12700 -1315 -5899 4130 13861 4977 -14219 -23678 -16026 -6869 -10653 -4504 2228 6621 -25808
13799 -25808 -38739 -20588 -7837 7388 11007 -9654 -22828 -7021 6104 11328 8112 -421
13787 -421 -4743 -12547 -5102 7854 1422 -10199 -26882 -35197 -23996 -15752 -9921 -8351 -2278 4351
$$ packed form
13882I383j501j1171n335q905R129J0720K203k477p440P6j4948M733J3993K513
13868I73K041K964J3013l028Q886K174j1973q062K301j172n736l096k890N473
13854A868K966Q037Q242j1052J208p664j058o419j2728O160Q884o139q409J5349
13840g55p125k3694o158L421J059J2992Q476J1446p530p083L49p225p946J0202
13826a9571J7060L322Q043l129J799m088j1815j2809J9743J4785Q200L284j2124
13813A2700j4015m584J0029R731q884j9196r459P652R157l784O149O732M393l2429
13799b5808j2931J8151J2751J5225L619k0661j3174J5807J3125N224l216q533
13787d21m322p804P445J2956o432j1621j6683q315J1201Q244N831J570O073O629
$$ plain form
13773 4351 -13367 -23230 -24172 -6259 -10010 4361 3365 -2108 7894 13634 -1489 -1151 10784 20820
13759 20820 31143 9460 7350 8664 -1248 8784 30119 25001 22093 16885 12220 222 7831
13746 7831 14209 12198 4972 12657 -199 -5225 3174 1142 -17066 -33557 -25504 -7261 -104 -13555
13732 -13555 -16698 -11097 -3973 4481 12020 11883 24592 26697 21176 8582 -44 1512 -2940 -3473
13718 -3473 3283 8704 6426 -6776 -10052 -1013 -8420 -8066 -17181 -2787 7473 12630 19668 22814
13704 22814 26976 33116 17853 12955 12337 13089 13569 2741 888 -16462 -12338 -2140 -5727 3443
13690 3443 6049 431 -2621 -1353 9783 -1361 -6090 -13863 -9138 -10470 -19394 -10044 -8433 -9789
13676 -9789 -23537 -23249 -25458 -30317 -14655 -14502 -17015 -4230 5923 -6073 -1756 5570 5853 19076
$$ packed form
13773D351j7718r863r42J7913l751J4371r96n473J0002N740j5123L38J1935J0036
13759B0820J0323k1683k110J314r912J0032K1335n118k908n208m665j1998P609
13746G831O378k011p226P685j2856n026Q399k032j8208j6491Q053J8243P157j3451
13732a3555l143N601P124Q454P539j37J2709K105n521j2594q626J556m452n33
13718c473O756N421k278j3202l276R039p407L54r115J4394J0260N157P038L146
13704B2814M162O140j5263m898o18P52M80j0828j853j7350M124J0198l587R170
13690C443K606n618l052J268J1136j1144m729p773M725j332q924R350J611j356
13676i789j3748K88k209m859J5662J53k513J2785J0153j1996M317P326K83J3223
$$ plain form
13662 19076 10972 -11352 -10364 10748 21571 41756 33205 10934 16234 18231 17195 3736 -10296
13649 -10296 -9906 -10034 -1523 10073 11879 10986 1110 -10982 -24527 -23696 -24225 -7560 21983 29138
13635 29138 16276 14470 13871 1796 6485 12092 9242 3339 4546 16790 24778 33463 46319 51781
13621 51781 35965 27881 10677 2596 19518 18750 20132 16241 10047 9550 -2221 -11055 -12338 5874
13607 5874 13303 -7151 -9719 -7024 -16426 -23362 -24156 -8188 3927 8560 844 136 -278 9491 5599
13592 5599 -20381 -8446 -12952 -37360 -33999 -16158 28421 29546 1369 7382 30897 19733 7425
13579 7425 9735 7063 36 -13063 -5571 -4294 4457 2143 -3419 12503 18800 9275 -2258 -11553
13565 -11553 -8880 -1205 5635 5662 -1419 -3176 9634 19213 19338 7964 -6440 -608 17582 16530
$$ packed form
13662A9076q104k2324R88K1112J0823K0185q551k2271N300J997j036j3459j4032
13649a0296L90j28Q511J1596J806q93r876j2092j3545Q31n29J6665K9543P155
13635B9138j2862j806n99j2075M689N607k850n903J207J2244P988Q685J2856N462
13621E1781j5816q084j7204q081J6922p68J382l891o194m97j1771q834j283J8212
13607E874P429k0454k568K695r402o936p94J5968J2115M633p716p08m14R769l892
13592E599k5980J1935m506k4408L361J7841M4579J125k8177O013K3515j1164j2308
13579G425K310k672p027j3099P492J277Q751k314n562J5922O297r525j1533r295
13565a1553K673P675O840K7p081j757J2810R579J25j1374j4404N832J8190j052
$$ plain form
13551 16530 17126 34996 29651 17968 7022 3562 8085 -4955 8205 12264 -2013 -15808 -12123
13538 -12123 -11149 -1642 23307 47018 46532 39780 26136 17835 23238 26697 25255 1203 -16217 -16384
13524 -16384 -1898 18487 34562 34940 34002 18843 -187 11176 37667 35930 34621 37459 34406
13511 34406 30137 -1306 -9575 -159 -9013 -11418 -11560 -7109 -15396 749 10900 17206 22323 29198
13497 29198 18882 12122 4922 17036 19449 10028 11283 7778 20728 33164 41712 44428 34903
13484 34903 18401 28623 32385 21756 21843 28964 16971 10699 13667 17811 21243 -2627 -1638 7259
13470 7259 8032 16793 26860 21305 21161 29952 38129 41751 31945 20456 25485 19122 15960 9969 10673
13455 10673 19057 24234 7181 -1323 9804 -1997 2893 17360 22574 23713 15887 14406 19589
$$ packed form
13551A6530N96J7870n345j1683j0946l460M523j3040J3160M059j4277j3795L685
13538a2123R74R507K4949K3711m86o752j3644q301N403L459j442k4052j7420j67
13524a6384J4486K0385J6075L78r38j5159j9030J1363K6491j737j309K838l053
13511C4406m269l1443q269R416q854k405j42M451q287J6145J0151O306N117O875
13497B9198j0316o760p200J2114K413r421J255l505J2950J2436Q548K716r525
13484C4903j6502J0222L762j0629Q7P121j1993o272K968M144L432k3870R89Q897
13470G259P73Q761J0067n555j44Q791Q177L622r806j1489N029o363l162n991P04
13455A0673Q384N177j7053q504J1127j1801M890J4467N214J139p826j481N183
$$ plain form
13442 19589 22743 16994 18056 19340 27667 27733 12635 5805 20104 24805 28888 26678 33421 44100
13428 44100 48537 42045 31052 33014 37710 30913 23903 22145 24863 37926 40326 29581 31244 31310
13414 31310 5647 5018 14024 14004 25209 35277 35966 24222 25416 24828 25832 31859 37586 31178 26025
13399 26025 34252 28412 15505 18492 23898 22484 27459 32398 33561 41023 31074 9745 -10658 7312
13385 7312 25649 14099 9770 25539 31119 16081 4871 5453 18588 11702 22648 42421 28979
13372 28979 11708 31445 35000 44267 39533 39648 42576 37016 27074 23635 18251 20704 26688 22658
13358 22658 22171 22774 33788 31234 32072 16758 5685 12200 23828 14988 9603 8765 13492 27732
13344 27732 25353 30550 12819 -3334 291 1865 23746 19945 23404 45093 39818 31089 26109
$$ packed form
13442A9589L154n749J062J284Q327O6j5098o830J4299M701M083k210O743J0679
13428D4100M437o492j0993J962M696o797p010j758K718J3063K400j0745J663O6
13414C1310k5663o29R006k0J1205J0068O89j1744J194n88J004O027N727o408n153
13399B6025Q227n840j2907K987N406j414M975M939J163P462r949k1329k0403J7970
13385G312J8337j1550m329J5769N580j5038j1210N82J3135o886J0946J9773j3442
13372B8979j7271J9737L555R267m734J15K928n560r942l439n384K453N984m030
13358B2658m87O03J1014k554Q38j5314j1073O515J1628q840n385q38M727J4240
13344B7732k379N197j7731j6153L625J574K1881l801L459K1689n275q729m980
$$ plain form
13331 26109 24473 18355 23245 29383 51942 51599 45507 29290 40580 46804 38702 42503 28744 28532
13317 28532 24409 5857 8865 20628 22594 25122 17120 14850 17661 24483 21584 26695 30128 40781
13303 40781 44617 36669 43488 66722 73298 63962 55914 52890 54340 48450 33725 33302 35256 46866
13289 46866 36153 29372 26120 18944 15897 10094 17954 31285 36573 24002 13537 28173 36702
13276 36702 41192 56550 59821 39780 37625 35759 25002 35508 43199 39739 34448 30714 40638
13263 40638 50490 51000 49675 28015 33616 43666 55888 54475 37232 31860 31931 31090 51519 56511
13249 56511 47929 52168 39858 42769 34487 26960 51736 70754 57315 46406 48775 44458 39451
13236 39451 34038 37652 46068 57832 69850 73251 64922 55709 35905 17999 13624 10408 13486
$$ packed form
13331B6109j636o118M890O138K2559l43o092j6217J1290O224q102L801j3759k12
13317B8532m123j8552L008J1763J966K528q002k270K811O822k899N111L433J0653
13303D0781L836p948O819K3234O576r336q048l024J450n890j4725m23J954J1610
13289D6866j0713o781l252p176l047n803P860J3331N288j2571j0465J4636Q529
13276C6702M490J5358L271k0041k155j866j0757J0506P691l460n291l734R924
13263D0638R852N10j325k1660N601J0050J2222j413j7243n372P1q41K0429M992
13249E6511q582M239j2310K911q282p527K4776J9018j3439j0909K369m317n007
13236C9451n413L614Q416J1764J2018L401q329r213j9804j7906m375l216L078
$$ plain form
13223 13486 32206 41116 40056 31186 28084 20457 28895 33962 34640 44251 57407 70018 76685 77311
13209 77311 77976 68222 63739 71377 69884 50927 46278 47047 36275 33007 25556 28014 21048 26581
13195 26581 30678 27725 32927 50671 55470 50745 39939 28388 31819 35557 45817 47487 31113
13182 31113 29178 38395 48514 66183 72100 67416 57584 44544 56219 74017 80712 80130 59952
13169 59952 46409 49957 43997 51504 66656 81839 77795 66406 71966 68420 55971 48676 40869
13156 40869 38833 48221 53333 51814 36886 40225 65373 82386 85418 85064 77856 61249 55929 42399
13142 42399 37059 30574 34381 59371 80166 75046 75404 68070 61270 57652 60910 69981 95926 97373
13128 97373 85867 95964 102174 106212 105123 99299 92135 94131 106401 117310 111795 92263 91567
$$ packed form
13223A3486J8720Q910j060q870l102p627Q438N067O78R611J3156J2611O667O26
13209G7311O65r754m483P638j493j8957m649P69j0772l268p451K458o966N533
13195B6581M097k953N202J7744M799m725j0806j1551L431L738J0260J670j6374
13182C1113j935R217J0119J7669N917m684r832j3040J1675J7798O695n82k0178
13169E9952j3543L548n960P507J5152J5183m044j1389N560l546j2449p295p807
13156D0869k036R388N112j519j4928L339K5148J7013L032l54p208j6607n320j3530
13142D2399n340o485L807K4990K0795n120L58p334o800l618L258R071K5945J447
13128I7373j1506J0097O210M038j089n824p164J996J2270J0909n515j9532o96
$$ plain form
13115 91567 101321 84238 54462 63554 77309 91602 84207 76045 68205 72592 72165 81769 81599 78874
13101 78874 71519 64873 60851 54780 59491 57479 37771 30087 39348 48246 50046 46084 56657 66247
13087 66247 70052 65134 66404 68792 77938 90994 85465 89103 96123 84792 70329 72746 65351 62083
13073 62083 85875 95643 86771 63635 67644 94928 98690 77733 65822 64308 69297 57913 49166
13060 49166 49344 54718 67653 77881 78488 78815 85900 90745 96768 91736 104189 97003 78024 84034
13046 84034 99576 84136 69650 70910 72093 72225 77096 84681 80865 62331 60233 74118 77513
13033 77513 76297 82393 83998 101078 112737 104998 82373 75657 87061 108901 110569 102287 90848
13020 90848 97013 100154 98706 98902 101473 98763 100398 119046 131775 122283 109997 125954 139622
$$ packed form
13115I1567R754j7083k9776R092J3755J4293p395q162p840M387m27R604j70k725
13101G8874p355o646m022o071M711k012j9708p684R261Q898J800l962J0573R590
13087F6247L805m918J270K388R146J3056n529L638P020j1331j4463K417p395l268
13073F2083K3792R768q872k3136M009K7284L762k0957j1911j514M989j1384q747
13060D9166J78N374J2935J0228O07L27P085M845O023n032J2453p186j8979O010
13046H4034J5542j5440j4486J260J183J32M871P585l816j8534k098J3885L395
13033G7513j216O096J605J7080J1659p739k2625o716J1404K1840J668q282j1439
13020I0848O165L141j448J96K571k710J635J8648J2729r492j2286J5957J3668
$$ plain form
13007 139622 140627 132937 111773 101516 93219 89685 104416 111364 114763 111077 107815 94315 92295
12994 92295 92223 107588 95274 92933 118964 109071 88441 97982 101063 97970 101321 95027 88756 99959
12980 99959 103998 100994 103167 108718 102390 100608 120305 121905 118607 104627 103658 108326 116253 122739
12966 122739 128737 124293 128745 131292 130457 126546 116362 114944 123081 130652 126144 138583 144468 142346
12952 142346 138974 133782 127344 139614 164569 163318 164179 167030 166518 167430 154628 131224 120166 133060
12938 133060 142732 145490 136426 148344 151465 144357 132540 136971 138727 144340 164606 155457 152812
12925 152812 155148 137815 123074 119535 124622 132571 142858 148185 161051 143955 138712 147553 153195
12912 153195 143221 134356 134761 120850 113867 117063 128658 140135 139184 139977 128345 129773 144303 135352
$$ packed form
13007A39622J005p690k1164j0257q297l534J4731O948L399l686l262j3500k020
12994I2295p2J5365j2314k341K6031r893k0630R541L081l093L351o294o271J1203
12980I9959M039l004K173N551o328j782J9697J600l298j3980r69M668P927O486
12966A22739N998m444M452K547q35l911j0184j418Q137P571m508J2439N885k122
12952A42346l372n192o438J2270K4955j251Q61K851n12R12j2802k3404j1058J2894
12938A33060R672K758r064J1918L121p108j1817M431J756N613K0266r149k645
12925A52812K336j7333j4741l539N087P949J0287N327J2866j7096n243Q841N642
12912A53195r974q865M05j3911o983L196J1595J1477r51P93j1632J428J4530q951
$$ plain form
12898 135352 127717 121654 130720 146645 160085 165642 170306 165063 163160 160871 147729 156233 159351
12885 159351 151996 140736 152958 172978 179711 188504 199655 189492 171696 168574 183747 187846
12873 187846 180423 168042 169399 168003 178486 168370 158850 144375 142471 138133 137128 145534 160094
12860 160094 167546 161853 164717 159280 159583 165803 155747 147601 147225 160192 178580 185404 191044 189458
12846 189458 180420 180620 174183 173329 168791 168750 168067 175481 188560 200495 204989 189556 192073 191699 174516
12831 174516 174986 170133 153121 147001 156056 173576 201864 223510 218743 192982 194618 213848 215596
12818 215596 192471 200148 228315 240890 231498 208712 210169 212526 217652 221991 227350 222779 208808
12805 208808 203828 191231 189951 205994 220935 227103 244258 244183 239825 236841 225801 232843 239408
$$ packed form
12898A35352p635o063R066J5925J3440N557M664n243j903k289j3142Q504L118
12885A59351p355j1260J2222K0020O733Q793J1151j0163j7796l122J5173M099
12873A87846p423j2381J357j396J0483j0116r520j4475j904m338j005Q406J4560
12860A60094P452n693K864n437L03O220j0056q146l76J2967J8388O824N640j586
12846A89458r038K00o437q54m538m1o83P414J3079J1935M494j5433K517l74j7183
12831A74516M70m853j7012o120R055J7520K8288K1646m767k5761J636J9230J748
12818B15596k3125P677K8167J2575r392k2786J457K357N126M339N359m571j3971
12805B08808m980j2597j280J6043J4941O168J7155p5m358k984j1040P042O565
$$ plain form
12792 239408 243054 246942 249031 246048 235621 236015 228821 219496 228763 221237 209787 216009 226592 244505
12778 244505 248572 260126 250516 228287 240114 243058 240375 246666 247159 235639 227938 230414 235469
12765 235469 261571 257676 250612 244109 254716 263142 247508 236233 230619 227460 230008 237194 238495
12752 238495 266824 281611 254537 262081 271205 263132 266085 260081 256844 265407 265627 263342 269224 278078
12738 278078 277703 285109 276123 266676 261068 267261 272537 272500 292893 289357 283419 286885 298321 315917
12724 315917 304431 289016 278171 286776 285029 305439 320496 331072 314589 304503 320981 334446
12712 334446 316454 313855 319886 311141 312816 312984 309665 309054 327293 345759 346291 335414 332030 337148
12698 337148 325173 330634 336298 331449 340749 348603 345004 356164 346740 351621 355753 365001 363403 371011
$$ packed form
12792B39408L646L888K089k983j0427L94p194r325R267p526j1450O222J0583J7913
12778B44505M067J1554r610k2229J1827K944k683O291M93j1520p701K476N055
12765B35469K6102l895p064o503J0607Q426j5634j1275n614l159K548P186J301
12752B38495K8329J4787k7074P544R124q073K953o004l237Q563K20k285N882Q854
12738B78078l75P406q986r447n608O193N276l7K0393l536n938L466J1436J7596
12724C15917j1486j5415j0845Q605j747K0410J5057J0576j6483j0086J6478J3465
12712C34446j7992k599O031q745J675J68l319o11J8239J8466N32j0877l384N118
12698C37148j1975N461N664m849R300P854l599J1160r424M881M132R248j598P608
$$ plain form
12684 371011 373906 373264 381278 383148 393120 383322 375851 383957 373898 375115 385944 378655 380645 380923
12670 380923 396558 404535 407668 418501 411444 409125 434252 452884 456830 459740 455423 442236 431581
12657 431581 428773 413414 406450 406907 422945 446694 446569 449185 449620 457094 460606 449764 455506 464496
12643 464496 468911 465341 465531 455903 458524 464861 473321 476499 483708 489209 504387 495562 477276 472661
12629 472661 471320 499817 515948 535155 549200 543948 532844 519407 520756 529919 526730 507773
12617 507773 501670 521061 523070 534184 540753 544788 553088 559434 565061 571902 569892 582249 574562
12604 574562 567091 565946 581509 585245 585941 591247 601032 596717 603575 600371 606299 614562 616430 617080
12590 617080 628110 632919 639682 635532 630407 639451 655835 652826 642685 641424 650117 645827 644078
$$ packed form
12684C71011K895o42Q014J870R972r798p471Q106j0059J217J0829p289J990K78
12670C80923J5635P977L133J0833p057k319K5127J8632L946K910m317j3187j0655
12657D31581k808j5359o964M57J6038K3749j25K616M35P474L512j0842N742Q990
12643D64496M415l570J90r628K621O337Q460L178P209N501J5178q825j8286m615
12629D72661j341K8497J6131J9207J4045n252j1104j3437J349R163l189j8957
12617E07773o103J9391K009J1114O569M035Q300O346N627O841k010J2357p687
12604E74562p471j145J5563L736O96N306R785m315O858l204N928Q263J868O50
12590F17080J1030M809O763m150n125R044J6384l009j0141j261Q693m290j749
$$ plain form
12577 644078 644690 649989 661668 683508 695920 692650 700030 690510 690336 693530 703469 715777 698804
12564 698804 705938 703851 708489 724133 724230 689759 682580 702874 733829 742223 746955 750279 749641 738332
12550 738332 756982 777977 769970 764553 767403 773974 800684 824308 839423 843279 831854 823757 830711
12537 830711 840991 851128 859108 876541 881485 893284 906411 905375 903476 899897 907498 928947 943733
12524 943733 942908 943461 947280 962276 971738 973688 984096 983012 967912 968440 988160 1006534 1023370
12511 1023370 1031296 1042944 1060589 1066207 1066623 1078693 1095786 1105446 1120854 1125135 1122767 1131067 1146240
12498 1146240 1163614 1171699 1184086 1186390 1186484 1203000 1214146 1217723 1234027 1244353 1257866 1258812 1269496
12485 1269496 1289852 1304949 1312656 1319798 1334978 1350719 1358228 1366977 1361405 1365439 1382566 1391606 1387106
$$ packed form
12577F44078O12N299J1679K1840J2412l270P380r520j74L194R939J2308j6973
12564F98804P134k087M638J5644R7l4471p179K0294L0955Q394M732L324o38j1309
12550G38332J8650K0995q007n417K850O571K6710K3624J5115L856j1425q097O954
12537H30711J0280J0137P980J7433M944J1799J3127j036j899l579P601K1449J4786
12524I43733q25N53L819J4996R462J950J0408j084j5100N28J9720J8374J6836
12511A023370P926J1648J7645N618M16J2070J7093R660J5408M281k368Q300J5173
12498A146240J7374Q085J2387K304R4J6516J1146L577J6304J0326J3513R46J0684
12485A269496K0356J5097P707P142J5180J5741P509Q749n572M034J7127R040m500
$$ plain form
12472 1387106 1407480 1426925 1438721 1459297 1460166 1462091 1461185 1455767 1467628 1474673 1471732 1485380 1513714
12459 1513714 1538029 1538349 1538609 1564784 1579427 1594721 1597409 1586933 1591515 1608305 1619691 1636299
12447 1636299 1655466 1675690 1694686 1697200 1717821 1731128 1749071 1766813 1777138 1788783 1815762
12436 1815762 1839118 1848019 1854683 1871192 1887907 1889415 1906721 1933025 1940890 1959295 1994423 2040005
12424 2040005 2061953 2095517 2113151 2119765 2145321 2165301 2173275 2189993 2215302 2237519 2278608 2326267
12412 2326267 2341865 2365667 2398799 2418935 2450797 2484558 2508183 2537672 2570079 2603319 2642475
12401 2642475 2669324 2700939 2742586 2806205 2850355 2870246 2897937 2943305 2987785 3021336 3067688
12390 3067688 3113510 3159780 3206381 3241624 3277217 3317931 3354829 3417525 3486578 3545039 3596097
$$ packed form
12472A387106K0374J9445J1796K0576Q69J925r06n418J1861P045k941J3648K8334
12459A513714K4315L20K60K6175J4643J5294K688j0476M582J6790J1386J6608
12447A636299J9167K0224J8996K514K0621J3307J7943J7742J0325J1645K6979
12436A815762K3356Q901O664J6509J6715J508J7306K6304P865J8405L5128M5582
12424B040005K1948L3564J7634O614K5556J9980P974J6718K5309K2217M1089M7659
12412B326267J5598K3802L3132K0136L1862L3761K3625K9489L2407L3240L9156
12401B642475K6849L1615M1647O3619M4150J9891K7691M5368M4480L3551M6352
12390C067688M5822M6270M6601L5243L5593M0714L6898O2696O9053N8461N1058
$$ plain form
12379 3596097 3646014 3707975 3770318 3821330 3889755 3966294 4050811 4128575 4189509 4260727 4345300
12368 4345300 4432818 4511569 4591353 4684818 4774700 4859053 4942620 5031645 5136845 5244040 5347735
12357 5347735 5441463 5545941 5636479 5737298 5833390 5932756 6035483 6140981 6245493 6365117
12347 6365117 6482183 6587193 6703479 6844064 6978044 7116206 7234291 7347980 7490682
12338 7490682 7647228 7787229 7932784 8098001 8262773 8421286 8587833 8760744 8931033
12329 8931033 9107295 9295894 9483067 9690621 9916627 10134994 10352080 10584905 10822212
12320 10822212 11075157 11328067 11587396 11876423 12162247 12448456 12733310 13040178 13360209
12311 13360209 13689535 14051224 14409266 14779967 15172149 15573335 15989055 16416593 16883551
$$ packed form
12379C596097M9917O1961O2343N1012O8425P6539Q4517P7764O0934P1218Q4573
12368D345300Q7518P8751P9784R3465Q9882Q4353Q3567Q9025J05200J07195J03695
12357E347735R3728J04478R0538J00819R6092R9366J02727J05498J04512J19624
12347F365117J17066J05010J16286J40585J33980J38162J18085J13689J42702
12338G490682J56546J40001J45555J65217J64772J58513J66547J72911J70289
12329H931033J76262J88599J87173K07554K26006K18367K17086K32825K37307
12320A0822212K52945K52910K59329K89027K85824K86209K84854L06868L20031
12311A3360209L29326L61689L58042L70701L92182M01186M15720M27538M66958
$$ plain form
12302 16883551 17374304 17857678 18345078 18885848 19444990 20011689 20612277 21232729 21900809
12293 21900809 22589555 23291547 24018444 24781861 25595129 26466937 27365205 28289999 29258697
12284 29258697 30272331 31346815 32461541 33624024 34842739 36116559 37459231 38857302
12276 38857302 40335917 41885000 43497682 45181750 46937686 48783207 50710801 52712927
12268 52712927 54788735 56956654 59221062 61577819 64011672 66528300 69115136 71773087
12260 71773087 74479074 77228662 80024077 82844685 85662957 88456339 91228315 93955023
12252 93955023 96609670 99118601 101463151 103643194 105621448 107371743 108863838 110086089
12244 110086089 110974938 111543116 111798083 111725795 111317015 110576161 109548178 108241977 106663549
$$ packed form
12302A6883551M90753M83374M87400N40770N59142N66699O00588O20452O68080
12293B1900809O88746P01992P26897P63417Q13268Q71808Q98268R24794R68698
12284B9258697J013634J074484J114726J162483J218715J273820J342672J398071
12276C8857302J478615J549083J612682J684068J755936J845521J927594K002126
12268E2712927K075808K167919K264408K356757K433853K516628K586836K657951
12260G1773087K705987K749588K795415K820608K818272K793382K771976K726708
12252I3955023K654647K508931K344550K180043J978254J750295J492095J222251
12244A10086089Q88849N68178K54967p2288m08780p40854j027983j306201j578428
$$ plain form
12235 106663549 104843480 102804211 100604005 98237950 95741456 93135720 90465992 87748445
12227 87748445 85034373 82292055 79532153 76793859 74129963 71510224 68952367 66448926
12219 66448926 64025437 61677977 59403495 57186903 55051222 52994768 51038673 49133134
12211 49133134 47286425 45551381 43893817 42301451 40777180 39317805 37919275 36575448
12203 36575448 35279929 34051338 32867763 31755916 30697753 29651222 28651016 27684750
12195 27684750 26784380 25933573 25100297 24305431 23551649 22812409 22102536 21427075 20772124
12186 20772124 20142647 19534052 18957975 18418406 17910938 17411497 16917245 16434882 15970643
12177 15970643 15525946 15112552 14707005 14317170 13943095 13573963 13212849 12873928 12544614
$$ packed form
12235A06663549j820069k039269k200206k366055k496494k605736k669728k717547
12227H7748445k714072k742318k759902k738294k663896k619739k557857k503441
12219F6448926k423489k347460k274482k216592k135681k056454j956095j905539
12211D9133134j846709j735044j657564j592366j524271j459375j398530j343827
12203C6575448j295519j228591j183575j111847j058163j046531j000206r66266
12195B7684750r00370q50807q33276p94866p53782p39240p09873o75461o54951
12186B0772124o29477o08595n76077n39569n07468m99441m94252m82363m64239
12177A5970643m44697m13394m05547l89835l74075l69132l61114l38921l29314
$$ plain form
12168 12544614 12223407 11930045 11645034 11374054 11114377 10845331 10573568 10320438 10083043
12159 10083043 9860495 9618588 9406435 9227013 9023185 8818182 8624018 8449234 8271192
12150 8271192 8084744 7920049 7759713 7598634 7450015 7310794 7154708 7000600 6872299
12141 6872299 6758574 6621421 6509205 6403623 6270605 6163234 6068715 5962450 5845223 5745984
12131 5745984 5648386 5568644 5492482 5395543 5308818 5217793 5146147 5082307 5017947 4941325 4871563
12120 4871563 4800483 4745813 4690776 4650629 4590654 4529271 4467061 4411387 4362268 4313624 4257079
12109 4257079 4194052 4132708 4094777 4055044 3997003 3941691 3884099 3843747 3786216 3739849 3697781
12098 3697781 3659117 3635568 3600887 3548825 3508897 3469236 3423807 3380860 3352857 3313479 3277574
$$ packed form
12168A2544614l21207k93362k85011k70980k59677k69046k71763k53130k37395
12159A0083043k22548k41907k12153j79422k03828k05003j94164j74784j78042
12150H271192j86448j64695j60336j61079j48619j39221j56086j54108j28301
12141F872299j13725j37153j12216j05582j33018j07371r4519j06265j17227r9239
12131E745984r7598p9742p6162r6939q6725r1025p1646o3840o4360p6622o9762
12120D871563p1080n4670n5037m0147n9975o1383o2210n5674m9119m8644n6545
12109D257079o3027o1344l7931l9733n8041n5312n7592m0352n7531m6367m2068
12098C697781l8664k3549l4681n2062l9928l9661m5429m2947k8003l9378l5905
$$ plain form
12087 3277574 3236386 3185277 3162219 3132210 3082368 3042528 3017702 2985774 2949861 2908016 2866942
12076 2866942 2832272 2803803 2780830 2749989 2706288 2681842 2657813 2635623 2606182 2560004 2539256
12065 2539256 2516626 2478111 2436093 2406684 2390417 2372751 2339010 2303979 2287000 2267697 2244762
12054 2244762 2210921 2181662 2158934 2156503 2136654 2107899 2071306 2031505 2006103 1983576 1974140 1967892
12042 1967892 1953595 1927656 1889700 1862283 1838436 1824088 1805002 1792981 1778028 1752868 1742035
12031 1742035 1732168 1710866 1676352 1664336 1638959 1625621 1608712 1594094 1586663 1554038 1531972 1516503
12019 1516503 1512390 1489451 1465765 1466648 1446992 1423342 1413405 1410954 1400576 1392277 1385497 1367754 1350010
12006 1350010 1335185 1325736 1325794 1312215 1296603 1279204 1278654 1274303 1259252 1234851 1227977 1228584 1227339
$$ packed form
12087C277574m1188n1109k3058l0009m9842l9840k4826l1928l5913m1845m1074
12076B866942l4670k8469k2973l0841m3701k4446k4029k2190k9441m6178k0748
12065B539256k2630l8515m2018k9409j6267j7666l3741l5031j6979j9303k2935
12054B244762l3841k9259k2728k431j9849k8755l6593l9801k5402k2527r436o248
12042A967892j4297k5939l7956k7417k3847j4348j9086j2021j4953k5160j0833
12031A742035r867k1302l4514j2016k5377j3338j6909j4618p431l2625k2066j5469
12019A516503m113k2939k3686Q83j9656k3650r937k451j0378q299o780j7743j7744
12006A350010j4825r449N8j3579j5612j7399n50m351j5051k4401o874O07j245
$$ plain form
11993 1227339 1233088 1229522 1202372 1183435 1175433 1172496 1159858 1147911 1137723 1138091 1143884 1132336 1112559
11980 1112559 1099605 1092459 1088265 1067604 1038902 1041299 1037927 1029791 1020932 1008974 1008118 1009982 1003168
11967 1003168 985086 966690 952758 957835 953320 966738 982185 972013 959771 945497 935099 940557
11955 940557 931928 909143 882404 875286 872653 856802 856029 856036 849377 835150 831798 823050 816094 821588
11941 821588 814822 814902 816586 820623 824139 819739 815048 802307 781972 767771 764149 769245 767056 773858
11927 773858 777613 786636 768314 768093 752396 730027 716388 721733 712036 693103 677276 683917 690799
11914 690799 673092 659596 661914 668609 669755 667880 650746 656074 662209 652830 644144 640122 635752
11901 635752 627765 613820 608001 599396 592492 577068 571143 555520 556842 562483 569833 581337 580670
$$ packed form
11993A227339N749l566k7150j8937q002k937j2638j1947j0188L68N793j1548j9777
11980A112559j2954p146m194k0661k8702K397l372q136q859j1958q56J864o814
11967A003168j8082j8396j3932N077m515J3418J5447j0172j2242j4274j0398N458
11955I40557q629k2785k6739p118k633j5851p73Po659j4227l352q748o956N494
11941H21588o766Q0J684M037L516m400m691j2741k0335j4201l622N096k189O802
11927G73858L755R023j8322k21j5697k2369j3639N345r697j8933j5827O641O882
11914F90799j7707j3496K318O695J146j875j7134N328O135r379q686m022m370
11901F35752p987j3945n819q605o904j5424n925j5623J322N641P350J1504o67
$$ plain form
11888 580670 565718 558459 556044 542239 531744 539300 538172 553098 566917 565410 570802 558285 542395
11875 542395 524891 521262 530461 520391 504167 484496 474579 479841 485012 482122 478661 469948 464610
11862 464610 474428 462760 449036 458517 462212 475490 479857 459629 452640 459043 472363 471726 467125
11849 467125 459734 459445 464721 465244 455305 440128 426049 432971 440667 434272 421003 415132 419036 426057
11835 426057 423607 401649 414011 420510 415728 396750 389359 400236 399830 402020 388418 389130 400621
11822 400621 387840 389238 373389 374105 384590 387858 388422 382114 376378 375655 368228 375674 380050 369833
11808 369833 364642 371648 369409 381497 390708 373182 367993 343719 339640 345967 338919 342594 343770
11795 343770 345895 339060 332168 319602 309986 312451 328608 338536 326710 328386 337269 365271 369407
$$ packed form
11888E80670j4952p259k415j3805j0495P556j128J4926J3819j507N392j2517j5890
11875E42395j7504l629R199j0070j6224j9671r917N262N171k890l461q713n338
11862D64610R818j1668j3724R481L695J3278M367k0228o989O403J3320o37m601
11849D67125p391k89N276N23r939j5177j4079O922P696o395j3269n871L904P021
11835D26057k450k1958J2362O499m782j8978p391J0877m06K190j3602P12J1491
11822D00621j2781J398j5849P16J0485L268N64o308n736p23p427P446M376j0217
11808C69833n191P006k239J2088R211j7526n189k4274m079O327p048L675J176
11795C43770K125o835o892j2566r616K465J6157R928j1826J676Q883K8002M136
$$ plain form
11782 369407 329348 324545 355325 352690 326363 342974 331699 310438 279101 274223 274403 282796 294165
11769 294165 287993 284190 300895 302263 303379 300361 288118 279327 280143 270900 281951 295254 285567
11756 285567 282411 281151 278092 267985 257873 268137 283499 312465 315224 295859 259966 252215
11744 252215 261027 271620 267614 258399 259788 271960 263891 248711 243092 250407 261636 281698 282106
11731 282106 265818 253134 267399 271647 263165 263405 270508 271994 270315 280684 278240 266234 262485
11718 262485 277856 263514 248307 249467 253450 251559 253123 240674 232758 221994 214095 233231 234384
11705 234384 228355 225176 227658 243855 231746 203504 195334 201397 225686 223533 227979 203308 199754
11692 199754 210674 214896 216910 219201 224017 239887 243025 233572 221624 230847 236411 236136 243550 241271
$$ packed form
11782C69407m0059m803L0780k635k6327J6611j1275k1261l1337m878J80Q393J1369
11769B94165o172l803J6705J368J116l018j2243q791Q16r243J1051J3303r687
11756B85567l156j260l059j0107j0112J0264J5362K8966K759j9365l5893p751
11744B52215Q812J0593m006r215J389J2172q069j5180n619P315J1229K0062M08
11731B82106j6288j2684J4265M248q482K40P103J486j679J0369k444j2006l749
11718B62485J5371j4342j5207J160L983j891J564j2449p916j0764p899J9136J153
11705B34384o029l179K482J6197j2109k8242q170O063K4289k153M446k4671l554
11692A99754J0920M222K014K291M816J5870L138r453j1948R223N564k75P414k279
$$ plain form
11678 241271 237454 260404 262830 246092 225958 210548 209743 193799 192716 197089 191740 207243 225364
11665 225364 226419 210359 208313 206617 199121 208012 217193 210056 200839 194063 184895 186591 173954 170737
11651 170737 174488 167062 155546 167508 181095 196696 198956 192598 192532 189208 174224 176576 181173
11638 181173 173208 176085 177095 184536 194110 185855 169675 171011 171305 185357 200640 195717 203687 215150
11624 215150 225216 216595 211575 205554 212663 201394 203481 199845 200415 201534 202848 211712 217230 220198
11610 220198 193831 185679 189134 189127 177937 170528 173029 159301 162779 175367 172648 174268 182824 189608
11596 189608 161315 149793 169531 183637 180241 168907 164516 184903 184376 163562 164523 170614 175352
11583 175352 176921 174125 182404 187496 212788 216114 226207 221984 203004 188032 185830 176455 164016
$$ packed form
11678B41271l817K2950K426j6738k0134j5410q05j5944j083M373n349J5503J8121
11665B25364J055j6060k046j696p496Q891R181p137r217o776r168J696j2637l217
11651A70737L751p426j1516J1962J3587J5601K260o358o6l324j4984K352M597
11638A81173p965K877J010P441R574q255j6180J336K94J4052J5283m923P970J1463
11624B15150J0066q621n020o021P109j1269K087l636N70J119J314Q864N518K968
11610B20198k6367q152L455pj1190p409K501j3728L478J2588k719J620Q556O784
11596A89608k8293j1522J9738J4106l396j1334m391K0387n27k0814R61O091M738
11583A75352J569k796Q279N092K5292L326J0093m223j8980j4972k202r375j2439
$$ plain form
11570 164016 168362 160477 150003 146668 151316 145806 150087 161401 163271 159477 147456 129341 154171
11557 154171 169739 168333 161779 170793 187360 186881 182226 176682 161699 163765 174500 180072 170118
11544 170118 172165 173125 155858 138596 134377 139226 148227 169605 182534 182091 170071 171034 172971 173734
11530 173734 160019 168525 162995 154274 168321 168807 174252 143520 125586 122305 133158 140994 136529
11517 136529 144791 161110 160001 147294 136952 120597 120672 113933 114187 140064 146346 141917 138667 125087
11503 125087 127217 133449 136032 128189 128547 134948 150565 145396 147222 148689 143376 148096 154358 144743
11489 144743 125881 124593 135029 161010 160250 148870 139601 136905 143631 142910 145508 144975 143710 138224
11475 138224 138113 127892 136285 148418 134810 123580 131694 137846 137291 126959 145124 149123 141598
$$ packed form
11570A64016M346p885j0474l335M648n510M281J1314J870l794j2021j8115K4830
11557A54171J5568j406o554R014J6567m79m655n544j4983K066J0735N572r954
11544A70118K047R60j7267j7262m219M849R001K1378J2929m43j2020R63J937P63
11530A73734j3715Q506n530q721J4047M86N445l0732j7934l281J0853P836m465
11517A36529Q262J6319j109j2707j0342j6355P5o739K54K5877O282m429l250j3580
11503A25087K130O232K583p843L58O401J5617n169J826J467n313M720O262r615
11489A44743j8862j288J0436K5981p60j1380r269k696O726p21K598n33j265n486
11475A38224j11j0221Q393J2133j3608j1230Q114O152n55j0332J8165L999p525
$$ plain form
11462 141598 135229 133975 144616 148192 129656 126436 127836 122812 124725 142393 148680 141871 129710
11449 129710 133527 128670 130889 149934 146118 150668 146368 147830 133107 117181 106713 119612 112277
11436 112277 122033 121448 104487 103798 104623 99252 103597 109558 110069 103868 97631 77955 95222 99529
11422 99529 98607 103297 95341 95882 109258 104617 106835 114109 129540 133141 131535 123026 139934 150867
11408 150867 145750 145700 169267 196896 216279 250760 316389 419070 568217 776074 984841
11397 984841 1030308 874010 658000 506353 395524 333684 286464 248836 233097 212609 199581
11386 199581 191518 182858 181829 185189 173562 162779 138612 129463 132986 134076 155984 186654 204318
11373 204318 240405 288202 347563 457320 623253 814387 981546 1000079 853139 643276
$$ packed form
11462A41598o369j254J0641L576j8536l220J400n024J913J7668O287o809j2161
11449A29710L817m857K219J9045l816M550m300J462j4723j5926j0468J2899p335
11436A12277R756n85j6961o89Q25n371M345N961N11o201o237j9676J7267M307
11422I9529r22M690p956N41J3376m641K218P274J5431L601j606q509J6908J0933
11408A50867n117n0K3567K7629J9383L4481O5629J02681J49147K07857K08767
11397I84841M5467j56298k16010j51647j10829o1840m7220l7628j5739k0488j3028
11386A99581q063q660j029L360j1627j0783k4167r149L523J090K1908L0670J7664
11373B04318L6087M7797N9361J09757J65933J91134J67159J8533j46940k09863
$$ plain form
11363 643276 477862 368832 305591 263618 235047 210430 181218 163300 143016 120812 126186
11352 126186 140868 145569 159718 172048 160494 146744 126459 123830 125125 125874 121779 121830 123240
11339 123240 110035 102799 95368 94958 106222 110195 98845 104112 112703 97334 93864 105427 107054
11326 107054 119836 116563 114726 104291 89257 77258 70753 67497 76175 93266 85314 73889 74853
11313 74853 88405 101491 99406 103913 101251 115482 128408 129518 143854 137167 118074 121713 120336
11300 120336 127765 128628 106830 106835 132300 127924 112908 111160 102869 86944 68735 60021 58839 62572
11286 62572 72660 90168 94924 101760 114294 93538 75814 79168 68091 62624 64994 72627 90719
11273 90719 113452 120530 111004 96684 83718 85608 88081 99052 100462 105945 95914 104474 115817
$$ packed form
11363F43276j65414j09030o3241m1973k8571k4617k9212j7918k0284k2204N374
11352A26186J4682M701J4149J2330j1554j3750k0285k629J295P49m095N1J410
11339A23240j3205p236p431m10J1264L973j1350N267Q591j5369l470J1563J627
11326A07054J2782l273j837j0435j5034j1999o505l256Q678J7091p952j1425R64
11313G4853J3552J3086k085M507k662J4231J2926J110J4336o687j9093L639j377
11300A20336P429Q63k1798NK5465m376j5016j748q291j5925j8209q714j182L733
11286F2572J0088J7508M756O836J2534k0756j7724L354j1077n467K370P633J8092
11273I0719K2733P078r526j4320j2966J890K473J0971J410N483j0031Q560J1343
$$ plain form
11260 115817 116474 128182 135738 130403 103679 87936 88157 88329 88826 79403 71543 79467 85792 90184
11246 90184 74874 63956 70097 75134 80781 87818 79749 83472 100811 119027 143237 140469 140800
11233 140800 119467 111279 105392 86341 75877 80123 69116 62487 57246 62380 65827 79547 96146
11220 96146 122993 128184 121787 116051 106099 108371 107663 85901 86262 90531 96105 99847 111517 109927
11206 109927 99182 97271 95753 82262 70698 66022 62994 65284 82939 78865 82127 81030 81630
11193 81630 91775 100996 102916 100725 103657 105794 108523 111194 122600 124722 118045 125168 121361 127359
11179 127359 119342 106218 110161 112076 114903 112207 112440 114119 109853 98362 84011 99018 107624
11166 107624 100435 94699 97544 100513 100224 105583 97903 72990 61986 71941 71785 76916 74434 56239
$$ packed form
11260A15817O57J1708P556n335k6724j5743K21J72M97r423p860P924O325M392
11246I0184j5310j0918O141N037N647P037q069L723J7339J8216K4210k768L31
11233A40800k1333q188n887j9051j0464M246j1007o629n241N134L447J3720J6599
11220I6146K6847N191o397n736r952K272p08k1762L61M269N574L742J1670j590
11206A09927j0745j911j518j3491j1564m676l028K290J7655m074L262j097O00
11193H1630J0145R221J920k191K932K137K729K671J1406K122o677P123l807N998
11179A27359q017j3124L943J915K827k696K33J679m266j1491j4351J5007Q606
11166A07624p189n736K845K969k89N359p680k4913j1004R955j56N131k482j8195
$$ plain form
11152 56239 48991 49327 48464 59664 76152 78828 78159 78463 95078 106131 113201 110014 108369 126384
11138 126384 143518 148345 144946 140600 118532 116489 99054 80768 78861 75263 80696 72611 70008
11125 70008 88038 91452 98582 112894 116704 106741 130677 159081 148785 124071 120641 113532 98559
11112 98559 98019 107603 109104 110060 113840 100349 91764 95906 90235 98200 108904 114350 112839 128392
11098 128392 115331 110323 124044 130397 123017 115661 114375 102463 100747 102196 116942 123038 122292
11085 122292 122272 115156 108732 106594 110647 106938 117535 121648 132589 146097 134881 141870 159751
11072 159751 165319 189052 230210 258820 305991 374114 452794 533138 616434 697248 769177 822408
11060 822408 835717 813395 775420 709173 646004 568690 472013 392300 344084 312848 279022
$$ packed form
11152E6239p248L36q63J1200J6488K676o69L04J6615J1053P070l187j645J8015
11138A26384J7134M827l399m346k2068k043j7435j8286j907l598N433q085k603
11125G0008J8030L414P130J4312L810r963K3936K8404j0296k4714l430p109j4973
11112I8559n40R584J501R56L780j3491q585M142n671P965J0704N446j511J5553
11098A28392j3061n008J3721O353p380p356j286j1912j716J449J4746O096p46
11085A22292k0p116o424k138M053l709J0597M113J0941J3508j1216O989J7881
11072A59751N568K3733M1158K8610M7171O8123P8680Q0344Q3296Q0814P1929N3231
11060H22408J3309k2322l7975o6247o3169p7314r6677p9713m8216l1236l3826
$$ plain form
11049 279022 259094 244883 224960 214270 217044 215743 202504 205760 208239 196119 204528 212203 221953
11036 221953 230178 235042 232850 220576 229457 254325 271324 289684 318193 347915 384845 432702
11024 432702 484383 543604 600727 663365 729223 810578 876304 942564 989532 1032460 1084153
11013 1084153 1104566 1099540 1099408 1059816 993298 928221 865486 802689 759321 723900 688134 643798
11001 643798 620962 612739 579688 527103 484149 463285 435009 402473 359123 323014 299289 271362
10989 271362 248939 244617 237343 211435 194813 192589 201008 220102 235776 237403 228939 235271 241688
10976 241688 238624 251740 266342 271108 307210 357709 417888 493234 584520 681229 789247 883678
10964 883678 951539 976792 958715 886700 783348 685693 602104 531154 451496 393658 346436
$$ packed form
11049B79022j9928j4211j9923j0690K774j301j3239L256K479j2120Q409P675R750
11036B21953Q225M864k192j2274Q881K4868J6999J8360K8509K9722L6930M7857
11024D32702N1681N9221N7123O2638O5858Q1355O5726O6260M6968M2928N1693
11013A084153K0413n026j32l9592o6518o5077o2735o2797m3368l5421l5766m4336
11001F43798k2836q223l3051n2585m2954k0864k8276l2536m3350l6109k3725k7927
10989B71362k2423m322p274k5908j6622k224Q419J9094J5674J627q464O332O417
10976B41688l064J3116J4602M766L6102N0499O0179P5346R1286R6709J08018R4431
10964H83678O7861K5253j8077p2015j03352r7655q3589p0950p9658n7838m7222
$$ plain form
10953 346436 318289 272847 262606 254740 234419 214776 212102 218031 198010 173961 174378 174129 167336
10940 167336 163469 182230 214191 226431 223577 217791 231838 264396 289640 300245 320914 331857
10928 331857 347178 360147 369204 350745 330763 313726 287053 250610 218792 228334 232052 233402
10916 233402 235660 248982 231280 229997 228345 226212 237186 237483 236406 229134 216850 227349 233111
10903 233111 248757 257233 257434 269489 284892 308053 337508 339723 342945 358715 384380 385277 388624
10890 388624 402533 411578 421357 424528 430328 452538 459777 464754 484884 492949 490439 477028 467457
10877 467457 449253 443311 453333 454678 452978 447601 438055 412564 371005 353164 348528 343636 339963
10864 339963 321999 328012 342445 341371 332612 344335 331248 331699 336029 335487 347442 348143 340449 359742
$$ packed form
10953C46436k8147m5442j0241p866k0321j9643k674N929k0021k4049M17k49o793
10940A67336l867J8761L1961J2240k854n786J4047L2558K5244J0605K0669J0943
10928C31857J5321J2969R057j8459j9982j7037k6673l6443l1818R542L718J350
10916B33402K258J3322j7702j283j652k133J0974K97j077p272j2284J0499N762
10903B33111J5646Q476K01J2055J5403K3161K9455K215L222J5770K5665Q97L347
10890C88624J3909R045R779L171N800K2210P239M977K0130Q065k510j3411r571
10877D67457j8204n942J0022J345j700n377r546k5491m1559j7841m636m892l673
10864C39963j7964O013J4433j074q759J1723j3087M51M330n42J1955P01p694J9293
$$ plain form
10850 359742 379172 413914 433141 439396 440316 425872 423700 417652 428595 414081 423589 439349 444608
10837 444608 455895 453842 457932 476630 479049 481602 469588 451934 432722 417833 398914 372772
10825 372772 339984 315535 300110 282324 263753 255575 230890 225184 207174 203024 207927 199254
10813 199254 171293 155930 147039 122549 107558 111531 108226 98490 98991 103220 127124 141828 143243
10800 143243 150739 190728 229929 245576 265133 311879 358358 400909 427451 480229 528466 561792
10788 561792 588540 606491 616428 604245 594179 570928 534683 510967 494602 479078 453007 430730
10776 430730 420699 402651 386918 379944 395866 407418 404926 387471 368087 357945 339938 307151
10764 307151 284215 279849 276188 276087 273551 277668 292023 302073 337665 416728 540993 719650
$$ packed form
10850C59742J9430L4742J9227O255R20j4444k172o048J0943j4514R508J5760N259
10837D44608J1287k053M090J8698K419K553j2014j7654j9212j4889j8919k6142
10825C72772l2788k4449j5425j7786j8571q178k4685n706j8010m150M903q673
10813A99254k7961j5363q891k4490j4991L973l305r736N01M229K3904J4704J415
10800A43243P496L9989L9201J5647J9557M6746M6479M2551K6542N2778M8237L3326
10788E61792K6748J7951R937j2183j0066k3251l6245k3716j6365j5524k6071k2277
10776D30730j0031j8048j5733o974J5922J1552k492j7455j9384j0142j8007l2787
10764C07151k2936m366l661j01k536M117J4355J0050L5592P9063J24265J78657
$$ plain form
10752 719650 1028041 1565851 2267280 2579020 2260367 1701820 1306170 1114847 1051835 1065485
10742 1065485 1137439 1242375 1296845 1252974 1167861 1120654 1121793 1132472 1126533 1095009 1071625
10731 1071625 1073941 1068550 1088471 1119983 1154347 1194109 1237815 1264179 1294956 1333806 1367116 1406166
10719 1406166 1438931 1453585 1463455 1471486 1482230 1479665 1474455 1478247 1490185 1518198 1542162 1545350
10707 1545350 1561606 1605933 1635220 1666415 1716608 1777094 1850406 1918573 2036441 2191625 2367661
10696 2367661 2540222 2728401 2935429 3196219 3512960 3873564 4270848 4758687 5301418
10687 5301418 5905949 6587039 7334548 8123503 8949997 9858072 10896300 12182401 13890856
10678 13890856 16242361 19642629 24644574 31961523 42297034 55848426 72137934 90028056
$$ packed form
10752G19650L08391N37810P01429L11740l18653n58547l95650j91323o3012J3650
10742A065485P1954J04936N4470m3871q5113m7207J139J0679n939l1524k3384
10731A071625K316n391J9921L1512L4364L9762M3706K6364L0777L8850L3310L9050
10719A406166L2765J4654R870Q031J0744k565n210L792J1938K8013K3964L188
10707A545350J6256M4327K9287L1195N0193O0486P3312O8167J17868J55184J76036
10696B367661J72561J88179K07028K60790L16741L60604L97284M87839N42731
10687E301418O04531O81090P47509P88955Q26494R08075J038228J286101J708455
10678A3890856K351505L400268N001945P316949J0335511J3551392J6289508J7890122
$$ plain form
10670 90028056 107960719 124094606 136415520 143108185 143082058 136515558 124693260 109406306
10662 109406306 92490976 75746962 60680405 48312805 38949805 32217919 27538733
10655 27538733 24300439 22005462 20361682 19141906 18180819 17408924 16728661 16160606 15717905
10646 15717905 15399450 15253777 15322451 15663059 16310278 17292758 18652367 20424525 22688932
10637 22688932 25480178 28861704 33017216 38181626 44616203 52480302 61740059 72212795
10629 72212795 83755094 96254953 109581383 123462310 137495107 151129787 163679406
10622 163679406 174441299 182591123 187212794 187609608 183645059 175965559 165718163 154149241
10614 154149241 142395457 131420593 121933721 114195167 107893101 102398421 96970961 91059668
$$ packed form
10670I0028056J7932663J6133887J2320914O692665k6127o566500j1822298j5286954
10662A09406306j6915330j6744014j5066557j2367600r363000o731886m679186
10655B7538733l238294k294977j643780j219776r61087p71895o80263n68055m42701
10646A5717905l18455j45673O8674L40608O47219R82480J359609J772158K264407
10637B2688932K791246L381526M155512N164410O434577P864099R259757J0472736
10629G2212795J1542299J2499859J3326430J3880927J4032797J3634680J2549619
10622A63679406J0761893Q149824M621671L96814l964549p679500j0247396j1568922
10614A54149241j1753784j0974864r486872p738554o302066n494680n427460n911293
$$ plain form
10606 91059668 84432663 77143591 69412498 61515082 53795242 46583048 40153580 34663663
10598 34663663 30136996 26503188 23653407 21469413 19815575 18587952 17700412 17101713
10590 17101713 16741469 16569822 16519915 16589263 16775352 17085052 17572926 18351329 19605670
10581 19605670 21553734 24602320 29369256 36609168 47191850 61547696 79260111 99124932
10573 99124932 119341684 137945431 152766765 161561174 162825088 156456712 143736552
10566 143736552 126644762 107307598 87706398 69670339 54554960 42872029 34383206
10559 34383206 28386576 24145064 21106224 18864741 17127424 15693261 14398566 13159488
10551 13159488 11954843 10774383 9629577 8533490 7545838 6687732 5972282 5364276 4877932
$$ packed form
10606I1059668o627005p289072p731093p897416p719840p212194o429468n489917
10598C4663663m526667l633808k849781k183994j653838j227623q87540n98699
10590A7101713l60244j71647m9907O9348J86089L09700M87874P78403J254341
10581A9605670J948064L048586M766936P239912J0582682J4355846J7712415J9864821
10573I9124932K0216752J8603747J4821334Q794409J263914o368376j2720160
10566A43736552j7091790j9337164j9601200j8036059j5115379j1682931q488823
10559C4383206n996630m241512l038840k241483j737317j434163j294695j239078
10551A3159488j204645j180460j144806j096087r87652q58106p15450o08006m86344
$$ plain form
10542 4877932 4474438 4131923 3850681 3612519 3374827 3144585 2949198 2766122 2608582
10533 2608582 2439016 2296203 2167881 2046488 1924221 1816584 1710607 1593478 1494549 1430783
10523 1430783 1367761 1290902 1214639 1135404 1064748 1011435 973137 920961 864625 805285 743508
10512 743508 686271 627078 576434 548735 539845 530384 479084 426047 394588 380344 360098 356898
10500 356898 366839 384373 407673 438622 461464 499950 550935 608538 649944 664963 683026 693183
10488 693183 699033 698847 689468 681754 677555 682125 683049 698900 708907 709441 697581 697100 666189 634564
10474 634564 609312 576752 545559 517073 522661 502215 491605 477073 451995 439507 433142 425367
10462 425367 404700 398049 390263 387944 390139 388694 385117 374325 357725 327818 313023 310797 299872
$$ packed form
10542D877932m03494l42515k81242k38162k37692k30242j95387j83076j57540
10533B608582j69566j42813j28322j21393j22267j07637j05977j17129r8929o3766
10523A430783o3022p6859p6263p9235p0656n3313l8298n2176n6336n9340o1777
10512G43508n7237n9193n0644k7699q890r461n1300n3037l1459j4244k0246l200
10500C56898R941J7534K3300L0949K2842L8486N0985N7603M1406J5019J8063J0157
10488F93183N850j86r379p714m199M570R24J5851J0007N34j1860m81l0911l1625
10474F34564k5252l2560l1193k8486N588k0446j0610j4532k5078j2488o365p775
10462D25367k0667o651p786k319K195j445l577j0792j6600k9907j4795k226j0925
$$ plain form
10449 299872 324462 372618 423322 469077 531117 606680 674379 727920 779682 786530 765573 757639
10437 757639 739311 705451 671969 654968 631590 607414 583821 571540 549840 526292 496687
10426 496687 474286 478857 462758 448827 422950 409993 405855 406202 408235 400673 397251 388177 390475
10413 390475 380514 370906 358822 347240 346983 338920 301813 284879 282059 285438 263486 227365 206477
10400 206477 207796 204534 200996 197413 194261 211953 211418 201942 187326 200010 193616 192148 221103
10387 221103 235175 226100 223745 233673 226702 225433 239446 235250 232443 223815 211302 223672 238018
10374 238018 253943 251579 254501 261027 249906 223361 203242 212104 200002 196560 181288 185968 174258
10361 174258 170676 159336 164257 157370 139597 130640 130414 134773 127273 129293 135742 127815 127781 131441
$$ packed form
10449B99872K4590M8156N0704M5755O2040P5563O7699N3541N1762O848k0957p934
10437G57639j8328l3860l3482j7001k3378k4176k3593j2281k1700k3548k9605
10426D96687k2401M571j6099j3931k5877j2957m138L47K033p562l422r074K298
10413C90475r961r608j2084j1582k57q063l7107j6934k820L379k1952l6121k0888
10400B06477J319l262l538l583l152J7692n35r476j4616J2684o394j468K8955
10387B21103J4072r075k355R928o971j269J4013m196k807q628j2513J2370J4346
10374B38018J5925k364K922O526j1121k6545k0119Q862j2102l442j5272M680j1710
10361A74258l582j1340M921o887j7773q957k26M359p500K020O449p927l4L660
$$ plain form
10347 131441 129893 121977 117433 120239 131623 128434 146167 143302 134902 142018 143171 133616 131090 113614
10333 113614 84843 58402 63395 84750 103957 111413 106755 107298 126229 131966 142184 152912 154366
10320 154366 172080 190100 188878 186104 173756 165337 183627 184953 179777 173388 158824 133696 144630
10307 144630 156280 147179 131445 120014 124535 141632 131536 149250 166952 160080 149946 145163
10295 145163 137604 134958 122123 127018 116737 114853 131915 129346 129049 148637 144949 146088 157431
10282 157431 159971 163674 165323 172710 186095 209298 253594 314148 384240 450167 545255 650813
10270 650813 710296 755142 794011 800114 789212 757602 705035 619743 528643 443386 362226 309565
10258 309565 267716 255401 219816 186929 184191 186576 191237 181098 170246 179168 172942 183215
$$ packed form
10347A31441j548p916m544K806J1384l189J7733k865q400P116J153r555k526j7476
10333A13614k8771k6441M993K1355J9207P456m658N43J8931N737J0218J0728J454
10320A54366J7714J8020j222k774j2348q419J8290J326n176o389j4564k5128J0934
10307A44630J1650r101j5734j1431M521J7097j0096J7714J7702o872j0134m783
10295A45163p559k646j2835M895j0281j884J7062k569k97J9588l688J139J1343
10282A57431K540L703J649P387J3385K3203M4296O0554P0092O5927R5088J05558
10270F50813N9483M4846L8869O103j0902l1610n2567q5292r1100q5257q1160n2661
10258C09565m1849j2315l5585l2887k738K385M661j0139j0852Q922o226J0273
$$ plain form
10246 183215 169014 162408 161685 161819 179276 187788 205434 199189 201895 235928 268522 274251 294840
10233 294840 343957 389871 434648 499324 573177 647741 718024 796988 877070 953294 1013930
10222 1013930 1054158 1068017 1059775 1045989 1013968 966464 905986 834138 773194 712021 652767
10211 652767 632928 621160 609304 586344 556393 529624 493850 436939 377637 334751 306969
10200 306969 304100 285490 256451 230542 222887 213367 181555 148519 136803 143623 153981 145036
10188 145036 136383 133154 147610 171177 169185 180304 198545 225933 235466 272582 321646 386294
10176 386294 472128 555526 647429 745925 826292 888631 911800 896438 841668 759784 663821
10165 663821 566017 479249 411203 331035 289699 253924 226890 204598 188500 180051 163359 169750
$$ packed form
10246A83215j4201o606p23J34J7457Q512J7646o245K706L4033L2594N729K0589
10233B94840M9117M5914M4777O4676P3853P4564P0283P8964Q0082P6224O0636
10222A013930M0228J3859q242j3786l2021m7504o0478p1848o0944o1173n9254
10211F52767j9839j1768j1856k2960k9951k6769l5774n6911n9302m2886k7782
10200C06969k869j8610k9039k5909p655r520l1812l3036j1716O820J0358q945
10188A45036q653l229J4456K3567j992J1119J8241K7388R533L7116M9064O4648
10176C86294Q5834Q3398R1903R8496Q0367O2339K3169j5362n4770q1884r5963
10165F63821r7804q6768o8046q0168m1336l5775k7034k2292j6098q449j6692O391
$$ plain form
10153 169750 174588 151947 143709 137074 109754 84939 69304 52845 61819 62976 65358 66558 81833
10140 81833 90469 83860 81983 76966 75184 83229 85806 74010 67752 63558 51702 45887 62753 71777
10126 71777 70186 56449 46100 41734 65674 64734 61408 62753 56278 42898 28538 28482 49640 64202
10112 64202 73631 82888 78553 84416 79073 98521 116776 131167 138571 136773 139777 124406 114910
10099 114910 118714 128007 130468 104915 82936 63050 69039 84460 89077 87106 65516 50895 49711
10086 49711 51922 45505 55123 58480 47659 63422 67753 68487 63801 52385 58929 75808 76694 88876
10072 88876 88880 78967 49085 36918 41962 46831 38716 43493 62487 60347 49309 54121 67908 86223
10058 86223 113931 116505 104991 101493 114881 102813 86174 82033 87289 79563 69893 86359 85938
$$ packed form
10153A69750M838k2641q238o635k7320k4815j5635j6459Q974J157K382J200J5275
10140H1833Q636o609j877n017j782Q045K577j1796o258m194j1856n815J6866R024
10126G1777j591j3737j0349m366K3940r40l326J345o475j3380j4360n6K1158J4562
10112F4202R429R257m335N863n343J9448J8255J4391P404j798L004j5371r496
10099A14910L804R293K461k5553k1979j9886N989J5421M617j971k1590j4621j184
10086D9711K211o417R618L357j0821J5763M331P34m686j1416O544J6879Q86J2182
10072H8876Mr913k9882j2167N044M869q115M777J8994k140j1038M812J3787J8315
10058H6223K7708K574j1514l498J3388j2068j6639m141N256p726r670J6466m21
$$ plain form
10045 85938 79259 70959 69822 84812 81311 82243 75655 89324 97400 93250 83331 70718 87464 114939
10031 114939 112817 98105 80065 89317 90647 92158 84775 75142 60229 56816 81050 98572 103103
10018 103103 107788 137146 188064 249008 294263 319123 321213 293596 247712 202348 164557 153185
10006 153185 162762 148727 144391 141426 150496 154286 146303 132937 119887 111738 99495 99854 95447
9993 95447 92238 93500 92211 92823 101821 103272 111272 99742 93284 102436 95049 79594 92605 91566
9979 91566 82020 69538 71777 73363 71477 78815 72060 71749 81712 82774 99488 113728 110031 116002
9965 116002 114179 93514 95059 103917 100075 101097 102991 91477 87466 83170 74992 72958 63728 68126
9951 68126 81000 82008 79524 62445 78743 77103 75738 76442 82165 67980 66476 82726 89834 67069
$$ packed form
10045H5938o679q300j137J4990l501R32o588J3669Q076m150r919j2613J6746K7475
10031A14939k122j4712j8040R252J330J511p383r633j4913l413K4234J7522M531
10018A03103M685K9358N0918O0944M5255K4860K090k7617m5884m5364l7791j1372
10006A53185R577j4035m336k965R070L790p983j3366j3050q149j2243L59m407
9993I5447l209J262j289O12Q998J451Q000j1530o458R152p387j5455J3011j039
9979I1566r546j2482K239J586j886P338o755l11R963J062J6714J4240l697N971
9965A16002j823k0665J545Q858l842J022J894j1514m011m296q178k034r230M398
9951F8126J2874J008k484j7079J6298j640j365P04N723j4185j504J6250P108k2765
$$ plain form
9937 67069 45697 55108 69807 76050 73062 75905 93755 104724 98700 101672 92372 78116 63573
9924 63573 58041 80762 84332 82885 97123 101744 93880 91078 91795 93375 87325 84732 85147 82479 77881
9909 77881 72265 68430 91288 99187 104839 112840 117417 94199 85675 94484 99664 87873 93730 105205
9895 105205 109405 114008 109308 110882 121667 112285 99971 89120 82140 71465 65278 60770 68091
9882 68091 64550 57072 62160 71973 85807 94078 78984 89570 100771 104860 123208 151874 190180
9869 190180 217922 215228 190513 183362 180920 180882 198393 213578 247025 272047 256885 212288 165542
9856 165542 128299 98289 100333 107170 111731 109144 111755 113897 123507 141410 135843 117740 107357
9843 107357 100858 88932 89711 80273 83839 111469 109236 108399 109225 114018 103723 100852 94896 116781
$$ packed form
9937F7069k1372R411J4699O243k988K843J7850J0969o024K972r300j4256j4543
9924F3573n532K2721L570j447J4238M621p864k802P17J580o050k593M15k668m598
9909G7881n616l835K2858P899N652Q001M577k3218q524Q809N180j1791N857J1475
9895A05205M200M603m700J574J0785r382j2314j0851o980j0675o187m508P321
9882F8091l541p478N088R813J3834Q271j5094J0586J1201M089J8348K8666L8306
9869A90180K7742k694k4715p151k442l8J7511J5185L3447K5022j5162m4597m6746
9856A65542l7243l0010K044O837M561k587K611K142R610J7903n567j8103j0383
9843A07357o499j1926P79r438L566K7630k233q37Q26M793j0295k871n956K1885
$$ plain form
9829 116781 135110 160968 163317 147559 128396 117063 117353 116267 109522 107605 104794 84963 76534
9816 76534 70533 81988 92308 106032 102762 99795 96616 103955 95027 97780 92902 89351 94407 93688
9802 93688 101425 103188 103672 95015 97179 115590 120691 123975 118862 115931 111061 99038 88164 90108
9788 90108 83505 76170 74501 91893 98459 107703 115372 118920 125039 113749 130545 133856 126527 130447
9774 130447 137156 135498 146055 143687 133943 116491 109532 118679 103946 102497 99968 110876 109011
9761 109011 120337 121429 115232 122750 115259 133394 145434 137419 129295 141940 135551 125391 132234
9748 132234 147852 152997 148048 132506 138945 140641 149274 146190 134970 124736 122376 111239 117558
9735 117558 131691 119346 117100 92687 88161 102814 106793 103625 108108 97776 106402 142196 154430
$$ packed form
9829A16781J8329K5858K349j5758j9163j1333K90j086o745j917k811j9831q429
9816G6534o001J1455J0320J3724l270k967l179P339q928K753m878l551N056p19
9802I3688P737J763M84q657K164J8411N101L284n113k931m870j2023j0874J944
9788I0108o603p335j669J7392O566R244P669L548O119j1290J6796L311p329L920
9774A30447O709j658J0557k368r744j7452o959R147j4733j449k529J0908j865
9761A09011J1326J092o197P518p491J8135J2040q015q124J2645o389j0160O843
9748A32234J5618N145m949j5542O439J696Q633l084j1220j0234k360j1137O319
9735A17558J4133j2345k246k4413m526J4653L979l168M483j0332Q626L5794J2234
$$ plain form
9722 154430 145300 138529 153345 144831 141653 136272 119016 105935 110144 130224 138324 145112 158259
9709 158259 159315 163559 152038 142877 137162 120608 123745 136421 141902 132051 123700 124212 129827 136624
9695 136624 139702 131221 130195 131237 127680 128676 149517 166443 163149 156172 154384 156797 155757 166375
9681 166375 164437 153767 157430 159313 147557 123955 129346 153139 168786 176992 185902 180307 159382
9668 159382 140871 147949 149695 140095 146988 162165 165413 180797 185427 175173 174757 168251 175537 188937
9654 188937 197303 194576 198587 202744 211056 225841 215424 208314 207846 207607 214547 216326 213783 224710
9640 224710 223090 228705 233624 225386 208816 205830 226268 233497 232192 251175 284203 294689 287762
9627 287762 281920 295679 304174 314819 327259 319537 322440 330956 337412 355121 344408 334743 336086
$$ packed form
9722A54430r130o771J4816q514l178n381j7256j3081M209K0080Q100O788J3147
9709A58259J056M244j1521r161n715j6554L137J2676N481r851q351N12N615O797
9695A36624L078q481j026J042l557R96K0841J6926l294o977j788K413j040J0618
9681A66375j938j0670L663J883j1756k3602N391K3793J5647Q206Q910n595k0925
9668A59382j8511P078J746r600O893J5177L248J5384M630j0254m16o506P286J3400
9654A88937Q366k727M011M157Q312J4785j0417p110m68k39O940J779k543J0927
9640B24710j620N615M919q238j6570k986K0438P229j305J8983L3028J0486o927
9627B87762n842J3759Q495J0645J2440p722K903Q516O456J7709j0713r665J343
$$ plain form
9614 336086 345821 351820 353014 357903 363043 375781 379877 381267 391313 385565 383930 390181 387965 380174
9600 380174 373074 371106 378887 389152 403423 391938 401578 424785 449474 452075 460191 462415 455630
9587 455630 451795 451401 459907 482198 502584 518868 531246 533019 543850 563164 568484 578688 584076
9574 584076 603917 618463 633188 623979 618446 609933 619656 625400 616140 620071 620344 637939 636159 647213
9560 647213 634958 619880 618379 612692 625113 637464 624914 601493 580532 588610 609589 626423
9548 626423 631320 634268 628819 614081 621749 631560 648474 673379 684214 694839 697937 715820 720653
9535 720653 723540 722490 738097 751127 766011 770157 769928 784097 808823 827124 832854 832563 830467
9522 830467 828138 828476 827476 813532 797369 793504 782150 767770 763522 760824 751641 737443 727911
$$ packed form
9614C36086R735N999J194M889N140J2738M096J390J0046n748j635O251k216p791
9600C80174p100j968P781J0265J4271j1485R640K3207K4689K601Q116K224o785
9587D55630l835l94Q506K2291K0386J6284J2378J773J0831J9314N320J0204N388
9574E84076J9841J4546J4725r209n533q513R723N744r260L931K73J7595j780J1054
9560F47213j2255j5078j501n687J2421J2351j2550k3421k0961Q078K0979J6834
9548F26423M897K948n449j4738P668R811J6914K4905J0835J0625L098J7883M833
9535G20653K887j050J5607J3030J4884M146k29J4169K4726J8301N730k91k096
9522H30467k329L38j000j3944j6163l865j1354j4380m248k698r183j4198r532
$$ plain form
9509 727911 721277 708931 701365 703463 681274 660753 646616 631198 615823 616485 632547 638499 642770
9496 642770 632880 613230 594072 592619 594536 612627 623216 633196 648228 629386 618465 617568 628740
9483 628740 640266 647281 660606 669961 702475 712684 709412 714220 714060 720146 726243 716269 710086 706471
9469 706471 692094 663431 639591 614511 580878 564252 568815 567223 561488 552399 517472 513337 528307
9456 528307 533746 535045 520491 523479 535324 543546 530679 525116 513687 513353 531990 538366 527310
9443 527310 536871 551136 549148 521599 509520 507704 506139 510296 519266 528200 541724 557668 541215
9430 541215 529751 545014 534668 495529 478788 467563 465178 458274 466451 460064 442526 428831
9418 428831 417744 423413 440542 448358 466202 492101 496143 495192 471282 455905 456545 460165 459692 449994
$$ packed form
9509G27911o634j2346p566K098k2189k0521j4137j5418j5375O62J6062N952M271
9496F42770r890j9650j9158j453J917J8091J0589R980J5032j8842j0921q97J1172
9483F28740J1526P015J3325R355L2514J0209l272M808j60O086O097r974o183l615
9469G06471j4377k8663k3840k5080l3633j6626M563j592n735r089l4927m135J4970
9456E28307N439J299j4554K988J1845Q222j2867n563j1429l34J8637O376j1056
9443E27310R561J4265j988k7549j2079j816j565M157Q970Q934J3524J5944j6453
9430E41215j1464J5263j0346l9139j6741j1225k385o904Q177o387j7538j3695
9418D28831j1087N669J7129P816J7844K5899M042r51k3910j5377O40L620m73r698
$$ plain form
9404 449994 462083 481025 465280 448408 430619 418351 416291 432728 448465 453239 450404 450555 446732
9391 446732 444423 445432 465651 472484 471325 475714 486254 494234 494164 488440 495830 503900 487531 466122
9377 466122 464035 463523 476219 488914 484904 473700 475464 475966 465967 457787 449269 461040 468122 475280
9363 475280 475837 486796 473982 479074 483023 469623 455665 447513 451947 464696 472434 473415 470324 488684
9349 488684 510161 522827 524710 524580 523725 515313 523055 532993 543800 528744 509146 498328 504768
9336 504768 496412 476952 488612 491768 489846 502829 518645 514774 498868 497762 504786 506830 494705
9323 494705 490198 480893 482445 504360 510169 510893 514999 528741 528341 535282 561105 574808 602754 642453
9309 642453 673249 688726 719291 743431 762410 781339 812173 839884 888878 928420 944037 948614
$$ packed form
9404D49994J2089J8942j5745j6872j7789j2268k060J6437J5737M774k835J51l823
9391D46732k309J009K0219O833j159M389J0540P980p0n724P390Q070j6369k1409
9377D66122k087n12J2696J2695m010j1204J764N02r999q180q518J1771P082P158
9363D75280N57J0959j2814N092L949j3400j3958q152M434J2749P738R81l091J8360
9349D88684K1477J2666J883j30q55q412P742R938J0807j5056j9598j0818O440
9336E04768q356j9460J1660L156j922J2983J5816l871j5906j106P024K044j2125
9323D94705m507r305J552K1915N809P24M106J3742m00O941K5823J3703K7946L9699
9309F42453L0796J5477L0565K4140J8979J8929L0834K7711M8994L9542J5617M577
$$ plain form
9297 948614 967612 986631 1000345 993874 987367 979286 1001652 1029054 1045233 1031869 1025060 1048117
9285 1048117 1096705 1133220 1151250 1176529 1207650 1228115 1261968 1274430 1295545 1342160 1374955
9274 1374955 1399972 1436760 1449701 1454979 1462719 1444432 1444362 1463033 1485708 1530893 1567612 1616501
9262 1616501 1671615 1732757 1798777 1871588 1941358 2021416 2105100 2206799 2321622 2430947 2540938
9251 2540938 2644287 2751709 2910179 3085257 3305532 3569554 3873343 4201102 4593777 5048211
9241 5048211 5541045 6040740 6473000 6789831 7025313 7199824 7391684 7677009 8086634 8675640
9231 8675640 9479294 10466584 11523057 12423778 13048695 13542868 14095822 14711025 15218212
9222 15218212 15521691 15642335 15641925 15518290 15391237 15344133 15381158 15494186 15645352 15820919
$$ packed form
9297I48614J8998J9019J3714o471o507q081K2366K7402J6179j3364o809K3057
9285A048117M8588L6515J8030K5279L1121K0465L3853J2462K1115M6615L2795
9274A374955K5017L6788J2941N278P740j8287p0J8671K2675M5185L6719M8889
9262A616501N5114O1142O6020P2811O9770Q0058Q3684J01699J14823J09325J09991
9251B540938J03349J07422J58470J75078K20275K64022L03789L27759L92675M54434
9241E048211M92834M99695M32260L16831K35482J74511J91860K85325M09625N89006
9231H675640Q03654R87290J056473R00721O24917M94173N52954O15203N07187
9222A5218212L03479J20644m10j23635j27053m7104L7025J13028J51166J75567
$$ plain form
9212 15820919 15983694 16179751 16493262 16960987 17574703 18231153 18806728 19214269 19474345
9203 19474345 19664163 19943344 20392637 20961430 21570125 22175932 22918728 23915413 25219665
9194 25219665 26864010 28783416 30889741 33042205 35086180 36929781 38678349 40421877
9186 40421877 42152028 43781645 45332475 46955705 48667330 50245677 51398196 51964670
9178 51964670 52110687 52123002 52206554 52408136 52753114 53138102 53397044 53330344 52924416 52233479
9168 52233479 51349679 50341739 49192349 47978343 46905727 46195115 45931096 46084268 46502809
9159 46502809 46962348 47339672 47635575 47780582 47764905 47691746 47700724 48002426 48760935 49973562
9149 49973562 51518347 53315818 55421882 57899849 60686788 63668573 66699821 69575972
$$ packed form
9212A5820919J62775J96057L13511M67725O13716O56450N75575M07541K60076
9203A9474345J89818K79181M49293N68793O08695O05807P42796R96685J304252
9194B5219665J644345J919406K106325K152464K043975J843601J748568J743528
9186D0421877J730151J629617J550830J623230J711625J578347J152519N66474
9178E1964670J46017J2315Q3552K01582L44978L84988K58942o6700m05928o90937
9168E2233479q83800j007940j149390j214006j072616p10612k64019J53172M18541
9159D6502809M59539L77324K95903J45007j5677p3159Q978L01702P58509J212627
9149D9973562J544785J797471K106064K477967K786939K981785L031248K876151
$$ plain form
9141 69575972 72179149 74489207 76510307 78162055 79415350 80421571 81300297 81988750
9133 81988750 82415625 82457061 81997616 80937499 79349004 77541845 75920837 74706006 73832143
9124 73832143 73009073 72011476 70752149 69346876 67936151 66646895 65533299 64530549
9116 64530549 63470385 62194623 60672311 58996850 57331123 55814673 54552486 53530866
9108 53530866 52600334 51640631 50771377 50142660 49882330 50033550 50505812 50971830 51225197
9099 51225197 51273878 51261109 51398520 51983918 53299361 55094667 56753440 57837475 58315347
9090 58315347 58470387 58769031 59710572 61508456 63773770 65740268 66835856 67000504 66399179
9081 66399179 65172095 63470493 61443624 59264777 56928532 54204043 51070833 47923472
$$ packed form
9141F9575972K603177K310058K021100J651748J253295J006221Q78726O88453
9133H1988750M26875M1436m59445j060117j588495j807159j621008j214831q73863
9124G3832143q23070r97597j259327j405273j410725j289256j113596j002750
9116F4530549j060164j275762j522312j675461j665727j516450j262187j021620
9108E3530866r30532r59703q69254o28717k60330J51220M72262M66018K53367
9099E1225197M8681j2769J37411N85398J315443J795306J658773J084035M77872
9090E8315347J55040K98644R41541J797884K265314J966498J095588J64648o01325
9081F6399179j227084j701602k026869k178847k336245k724489l133210l147361
$$ plain form
9073 47923472 45140439 42721399 40464388 38298092 36255511 34371116 32546812 30747416
9065 30747416 29095153 27708048 26642833 25860629 25243663 24649744 23960121 23120428 22235814
9056 22235814 21371767 20569211 19857572 19261357 18801770 18524777 18462234 18700173 19306928 20291630
9046 20291630 21542783 22748100 23535085 23839596 23972927 24315009 25094317 26248469 27344517
9037 27344517 27765613 27299580 26094698 24248879 21814175 19154799 16712814 14729752
9029 14729752 13191077 12002508 11056347 10252005 9566605 9004340 8565292 8196962 7888358
9020 7888358 7605195 7316793 7033308 6741735 6440470 6155639 5884606 5613155 5389604 5198521
9010 5198521 5032672 4869761 4699220 4540297 4390640 4223810 4070466 3923007 3781770 3663406
$$ packed form
9073D7923472k783033k419040k257011k166296k042581j884395j824304j799396
9065C0747416j652263j387105j065215p82204o16966n93919o89623q39693q84614
9056B2235814q64047q02556p11639n96215m59587k76993o2543K37939O06755R84702
9046B0291630J251153J205317P86985L04511J33331L42082P79308J154152J096048
9037B7344517M21096m66033j204882j845819k434704k659376k441985j983062
9029A4729752j538675j188569r46161q04342o85400n62265m39048l68330l08604
9020G888358k83163k88402k83485k91573l01265k84831k71033k71451k23551j91083
9010E198521j65849j62911j70541j58923j49657j66830j53344j47459j41237j18364
$$ plain form
9000 3663406 3568140 3493853 3447464 3414122 3389386 3392346 3442362 3511615 3559891 3495342 3328780
8989 3328780 3145643 3001522 2903142 2801672 2710567 2634314 2572698 2501533 2429681 2370363 2334052
8978 2334052 2315157 2312225 2295700 2273315 2247425 2241237 2224107 2197760 2177271 2164831 2158371 2148567
8966 2148567 2135917 2124675 2116404 2101542 2112010 2121551 2125462 2152313 2180208 2212028 2251189 2293051
8954 2293051 2334080 2380709 2426932 2440387 2343832 2182197 2041380 1920902 1846845 1806369 1760759
8943 1760759 1724943 1680669 1630769 1585196 1563019 1555191 1543278 1518633 1488788 1463441 1438891 1415418
8931 1415418 1408491 1408916 1405852 1403906 1417654 1433820 1451911 1474503 1534948 1590769 1628483 1632044 1638446
8918 1638446 1655678 1668546 1651131 1646880 1635045 1647104 1645005 1644849 1630235 1621706 1618856 1598155 1582910
$$ packed form
9000C663406r5266p4287m6389l3342k4736K960N0016O9253M8276o4549j66562
8989C328780j83137j44121r8380j01470r1105p6253o1616p1165p1852n9318l6311
8978B334052j8895k932j6525k2385k5890o188j7130k6347k0489j2440o460r804
8966B148567j2650j1242q271j4862J0468R541L911K6851K7895L1820L9161M1862
8954B293051M1029M6629M6223J3455r6555j61635j40817j20478p4057m0476m5610
8943A760759l5816m4274m9900m5573k2177p828j1913k4645k9845k5347k4550k3473
8931A415418o927M25l064j946J3748J6166J8091K2592O0445N5821L7714L561O402
8918A638446J7232J2868j7415m251j1835J2059k099j56j4614q529k850k0701j5245
$$ plain form
8905 1582910 1577231 1599988 1632531 1660755 1672734 1706996 1766451 1828149 1900873 1997014 2094994 2170112
8893 2170112 2212657 2225165 2257022 2318284 2434147 2609444 2829808 3082813 3386975 3701212
8883 3701212 3955760 4131562 4227965 4236795 4143493 3987283 3834461 3761666 3790506 3911031 4090082
8872 4090082 4297715 4565350 4879893 5162617 5392338 5665730 6014258 6365701 6575538 6618115
8862 6618115 6555557 6473555 6487285 6605625 6803537 7045460 7302850 7554245 7794888 8035499
8852 8035499 8295088 8578060 8938339 9404914 10019696 10812898 11840229 13166001 14782022
8843 14782022 16445522 17752754 18359219 18218076 17556454 16714289 15941549 15330076 14952427
8834 14952427 14766239 14644782 14502013 14351304 14254692 14254756 14343169 14502784 14721301 15080978
$$ packed form
8905A582910n679K2757L2543K8224J1979L4262N9455O1698P2724R6141R7980P5118
8893B170112M2545J2508L1857O1262J15863J75297K20364K53005L04162L14237
8883C701212K54548J75802R6403Q830r3302j56210j52822p2795K8840J20525J79051
8872D090082K07633K67635L14543K82724K29721K73392L48528L51443K09837M2577
8862F618115o2558q2002J3730J18340J97912K41923K57390K51395K40643K40611
8852H035499K59589K82972L60279M66575O14782P93202J027331J325772J616021
8843A4782022J663500J307232O06465j41143o61622q42165p72740o11473l77649
8834A4952427j86188j21457j42769j50709r6612O4Q8413J59615K18517L59677
$$ plain form
8824 15080978 15644900 16457205 17510127 18715268 19882751 20968427 22012347 23036683
8816 23036683 24047692 25055862 26115361 27182794 28171504 29171586 30413098 32210913
8808 32210913 34685480 37775948 41328505 45289123 49765355 54819031 60170438 65237927
8800 65237927 69409656 72343642 73972608 74300098 73428016 71636963 69325315 66887968
8792 66887968 64485314 62050625 59556982 57308988 55723453 55011773 55052285 55401062 55746149
8783 55746149 56177485 57141104 58943579 61641296 65050882 69082629 73750828 79061274
8775 79061274 85000849 91393493 97791992 103369377 107225958 108832760 108329974 106451515
8767 106451515 104203598 102481593 101752449 102083018 103287086 105239468 107867653 111093854
$$ packed form
8824A5080978N63922Q12305J052922J205141J167483J085676J043920J024336
8816B3036683J011009J008170J059499J067433R88710J000082J241512J797815
8808C2210913K474567L090468L552557L960618M476232N053676N351407N067489
8800F5237927M171729K933986J628966L27490q72082j791053k311648k437347
8792F6887968k402654k434689k493643k247994j585535p11680M0512L48777L45087
8783E5746149M31336R63619J802475K697717L409586M031747M668199N310446
8775G9061274N939575O392644O398499N577385L856581J606802n02786j878459
8767A06451515k247917j722005p29144L30569J204068J952382K628185L226201
$$ plain form
8759 111093854 114778894 118672309 122524078 126236196 129960667 134150585 139720558 147447310
8751 147447310 157332402 169120810 182741933 197486321 211472763 223021732 232018356
8744 232018356 239222690 245731430 252835684 261450195 272064631 285286161 301554773 319802038
8736 319802038 336995316 349647598 355747846 355795486 352234500 347663922 343303964 339188900
8728 339188900 335802295 334485293 336093466 339753518 342888120 343078479 340764045 338493289
8720 338493289 337772914 338264620 339359314 340615664 341272122 340384874 338146121 336905783 339755992
8711 339755992 348500387 363888665 386474051 415002233 442644620 456781891 446764012
8704 446764012 412608911 365202884 317117092 275275420 241045559 213586839 191532913
$$ packed form
8759A11093854L685040L893415L851769L712118L724471M189918N569973P726752
8751A47447310R885092J1788408J3621123J4744388J3986442J1548969Q996624
8744B32018356P204334O508740P104254Q614511J0614436J3221530J6268612J8247265
8736C19802038J7193278J2652282O100248M7640l560986m570578m359958m115064
8728C39188900l386605j317002J608173L660052L134602J90359k314434k270756
8720C38493289p20375M91706J094694J256350O56458q87248k238753j240338K850209
8711C39755992Q744395J5388278K2585386K8528182K7642387J4137271j0017879
8704D46764012l4155101m7406027m8085792m1841672l4229861k7458720k2053926
$$ plain form
8697 191532913 173387534 157963747 144603926 132938430 122833197 114221925 106963395
8690 106963395 100705040 95133166 90250529 86236659 83260776 81351625 80542351 80444764
8682 80444764 80357181 79661241 78194327 76118820 73701713 71126732 68425227 65573753 62553841
8673 62553841 59551430 56836834 54616594 52937123 51743359 50899914 50241319 49721620 49358080
8664 49358080 49119549 48852373 48329533 47344973 45764726 43679890 41352530 39130109 37117712
8655 37117712 35199372 33274030 31439254 29814893 28408771 27130018 25951592 24861948
8647 24861948 23779496 22665212 21523979 20429007 19395632 18444810 17576214 16764064 15997714
8638 15997714 15261863 14580304 13954922 13404273 12924938 12521511 12165173 11790203 11355316
$$ packed form
8697A91532913j8145379j5423787j3359821j1665496j0105233q611272p258530
8690A06963395o258355n571874m882637m013870k975883j909151q09274r7587
8682H0444764q7583o95940j466914k075507k417107k574981k701505k851474l019912
8673F2553841l002411k714596k220240j679471j193764q43445o58595n19699l63540
8664D9358080k38531k67176n22840r84560j580247k084836k327360k222421k012397
8655C7117712j918340j925342j834776j624361j406122j278753j178426j089644
8647B4861948j082452j114284j141233j094972j033375r50822q68596q12150p66350
8638A5997714p35851o81559o25382n50649m79335m03427l56338l74970m34887
$$ plain form
8629 11355316 10872589 10359044 9828764 9362370 8984433 8722709 8512894 8279847 8000795
8620 8000795 7713208 7461679 7248038 7062055 6926297 6884847 6937280 6967717 6793739 6356827
8610 6356827 5845369 5424893 5136349 4924993 4756422 4619172 4520155 4426325 4326898 4252637
8600 4252637 4176423 4127865 4114363 4164525 4245787 4262010 4140372 3892735 3621398 3403842 3260245
8589 3260245 3155079 3076347 3022254 2983795 2949630 2946555 3016331 3165879 3355033 3570591 3828702
8578 3828702 4074372 4251248 4227835 4002831 3717168 3445816 3230817 3078318 2958439 2839389
8568 2839389 2723575 2626669 2535006 2445608 2364892 2292349 2228766 2178628 2153760 2153343 2187248 2266915
8556 2266915 2359351 2446123 2526984 2615066 2716678 2745630 2603589 2380544 2181161 2032215
$$ packed form
8629A1355316m82727n13545n30280m66394l77937k61724k09815k33047k79052
8620H000795k87587k51529k13641j85983j35758m1450N2433L0437j73978m36912
8610F356827n11458m20476k88544k11356j68571j37250r9017r3830r9427p4261
8600D252637p6214m8558j3502N0162Q1262J6223j21638k47637k71337k17556j43597
8589C260245j05166p8732n4093l8459l4165l075O9776J49548J89154K15558K58111
8578C828702K45670J76876k3413k25004k85663k71352k14999j52499j19879j19050
8568B839389j15814r6906r1663q9398q0716p2543o3583n0138k4868m17L3905P9667
8556B266915R2436Q6772Q0861Q8082J01612K8952j42041k23045j99383j48946
$$ plain form
8546 2032215 1918590 1819293 1765712 1731405 1708629 1721191 1793006 1911950 2076113 2121608 2015163
8535 2015163 1828218 1670115 1555355 1457273 1406518 1383277 1360715 1331479 1297811 1275417 1275178
8524 1275178 1286753 1278196 1264140 1268320 1238203 1229125 1227914 1236460 1229634 1212949 1187445 1169789 1186583
8511 1186583 1193486 1227020 1300641 1362534 1404852 1390132 1357484 1339061 1301430 1275160 1239009 1214857
8499 1214857 1195425 1179403 1174991 1154352 1152489 1152178 1144554 1133173 1129525 1124583 1103311 1066764 1048052
8486 1048052 1057770 1074556 1076482 1084064 1081646 1088932 1111208 1122356 1126670 1137144 1144327 1152596 1152340
8473 1152340 1154063 1160827 1182363 1224274 1285592 1350128 1429609 1541964 1714240 1948248 2197346
8462 2197346 2393672 2448409 2337175 2144493 1942473 1761336 1621904 1522788 1446490 1385969
$$ packed form
8546B032215j13625r9297n3581l4307k2776J2562P1815J18944J64163M5495j06445
8535B015163j86945j58103j14760r8082n0755k3241k2562k9236l3668k2394k39
8524A275178J1575q557j4056M180l0117r078j211Q546o826j6685k5504j7656J6794
8511A186583O903L3534P3621O1893M2318j4720l2648j8423l7631k6270l6151k4152
8499A214857j9432j6022m412k0639j863l11p624j1381l648m942k1272l6547j8712
8486A048052R718J6786J926P582k418P286K2276J1148M314J0474P183Q269k56
8473A152340J723O764K1536M1911O1318O4536P9481J12355J72276K34008K49098
8462B197346J96326N4737j11234j92682k02020j81137j39432r9116p6298o0521
$$ plain form
8452 1385969 1332346 1297646 1276997 1253962 1216863 1181630 1146081 1121043 1113275 1110124 1075627 1064323
8440 1064323 1053029 1027081 1009403 1001633 997506 1004351 1016050 1011585 1000577 987039 987256 984986 965083
8427 965083 973886 987978 980000 992199 1018963 1028162 1020961 1003484 982455 982667 975318 977162 988011
8414 988011 986744 986548 992065 993950 1021693 1040724 1065722 1105903 1140020 1156156 1163356 1153866 1165278
8401 1165278 1190744 1205729 1247728 1295012 1341556 1327533 1262189 1155645 1056620 986921 924405
8390 924405 889595 871274 866935 869118 877706 888409 854063 834571 835561 842195 835963 806565 805189
8377 805189 811832 845202 878256 907951 938896 975190 998591 1027007 1075906 1117772 1142158 1160020
8365 1160020 1162921 1152635 1146923 1142000 1160076 1205183 1234116 1281924 1309868 1350092 1406081 1485167
$$ packed form
8452A385969n3623l4700k0649k3035l7099l5233l5549k5038p768l151l4497j1304
8440A064323j1294k5948j7678p770m127O845J1699m465j1008j3538K17k270j9903
8427I65083Q803J4092p978J2199K6764R199p201j7477k1029K12p349J844J0849
8414I88011j267j96N517J885K7743J9031K4998M0181L4117J6136P200r490J1412
8401A165278K5466J4985M1999M7284M6544j4023o5344j06544r9025o9699o2516
8390I24405l4810j8321m339K183Q588J0703l4346j9492R90O634o232k9398j376
8377H05189O643L3370L3054K9695L0945L6294K3401K8416M8899M1866K4386J7862
8365A160020K901j0286n712m923J8076M5107K8933M7808K7944M0224N5989P9086
$$ plain form
8353 1485167 1566988 1639214 1697853 1742605 1742206 1721866 1676131 1579052 1469422 1365701 1293502
8342 1293502 1233057 1185265 1138307 1104598 1056269 1039185 1021710 1014387 996575 991098 1000536 1003199
8330 1003199 1036370 1051581 1058325 1067569 1096821 1134325 1171341 1186073 1198094 1192986 1189227 1203153
8318 1203153 1214612 1206033 1202783 1207546 1213090 1254387 1308798 1380843 1456247 1553071 1648885 1720601
8306 1720601 1747806 1719665 1632314 1509019 1393494 1296284 1224830 1182173 1146995 1107774 1068671
8295 1068671 1032540 1005349 981507 956834 939858 914535 888589 845784 798847 748939 729043
8284 729043 730986 722534 706797 689406 697568 698596 699715 715443 724874 738906 748625 726311 700037
8271 700037 681942 666935 650773 631121 628815 652571 678865 702918 728527 759740 751209 731768
$$ packed form
8353A485167Q1821P2226N8639M4752l99k0340m5735r7079j09630j03721p2199
8342A293502o0445m7792m6958l3709m8329j7084j7475p323j7812n477R438K663
8330A003199L3171J5211O744R244K9252L7504L7016J4732J2021n108l759J3926
8318A203153J1459q579l250M763N544M1297N4411P2045P5404R6824R5814P1716
8306A720601K7205k8141q7351j23295j15525r7210p1454m2657l5178l9221l9103
8295A068671l6131k7191k3842k4673j6976k5323k5946m2805m6937m9908j9896
8284G29043J943q452j5737j7391Q162J028J119J5728R431J4032R719k2314k6274
8271G00037j8095j5007j6162j9652k306K3756K6294K4053K5609L1213q531j9441
$$ plain form
8259 731768 677019 634828 604301 602232 628844 661473 687266 694119 662680 625425 584927 549928
8247 549928 530124 512616 483548 498216 517885 531105 516233 520705 529711 554190 564639 578014
8235 578014 592617 605568 632655 655011 661032 689312 722746 756003 772869 801903 844014 879394
8223 879394 910529 966733 1011921 1034411 1039746 1021292 989026 963351 939054 930941 926162 941218
8211 941218 981055 1033030 1076379 1119587 1154787 1166503 1189291 1228381 1268241 1303302 1342981 1403512
8199 1403512 1503187 1643399 1803155 1981728 2184380 2352662 2473129 2558357 2634363 2707118
8189 2707118 2774904 2845361 2924976 3019599 3111218 3213164 3338313 3493560 3665086 3824826
8179 3824826 3954024 4050504 4094568 4129098 4167698 4227044 4308963 4409684 4500187 4627332 4779545
$$ packed form
8259G31768n4749m2191l0527k069K6612L2629K5793O853l1439l7255m0498l4999
8247E49928j9804j7508k9068J4668J9669J3220j4872M472R006K4479J0449J3375
8235E78014J4603J2951K7087K2356O021K8280L3434L3257J6866K9034M2111L5380
8223H79394L1135N6204M5188K2490N335j8454l2266k5675k4297q113m779J5056
8211I41218L9837N1975M3349M3208L5200J1716K2788L9090L9860L5061L9679O0531
8199A403512R9675J40212J59756J78573K02652J68282J20467Q5228P6006P2755
8189B707118O7786P0457P9615R4623R1619J01946J25149J55247J71526J59740
8179C824826J29198R6480M4064L4530L8600N9346Q1919J00721R0503J27145J52213
$$ plain form
8168 4779545 4946095 5135988 5330945 5523278 5692208 5846910 5974202 6108054 6228242 6339724
8158 6339724 6466681 6646000 6881813 7122729 7342396 7555156 7724492 7859027 7957395 8059140
8148 8059140 8209583 8410152 8700215 9083334 9547861 10080663 10673577 11312124 12051837 12938269
8138 12938269 14017150 15227755 16556674 17981352 19513962 21230755 23144194 25142626
8130 25142626 27061870 28821269 30405109 31977693 33811543 36057478 38795517 41966306
8122 41966306 45420665 49296276 54143425 60595118 68429681 76557675 84213073 91336815
8114 91336815 97667989 102849070 106740328 108865815 108764999 106978285 104587481 102078076
8106 102078076 99322669 96332464 93484548 91208509 89736537 89014747 88774339 88803912 88997836
$$ packed form
8168D779545J66550J89893J94957J92333J68930J54702J27292J33852J20188J11482
8158F339724J26957J79319K35813K40916K19667K12760J69336J34535R8368J01745
8148H059140J50443K00569K90063L83119M64527N32802N92914O38547P39713Q86432
8138A2938269J078881J210605J328919J424678J532610J716793J913439J998432
8130B5142626J919244J759399J583840J572584J833850K245935K738039L170789
8122D1966306L454359L875611M847149O451693P834563Q127994P655398P123742
8114I1336815O331174N181081L891258K125487j00816j786714k390804k509405
8106A02078076k755407k990205k847916k276039j471972p21790k40408K9573J93924
$$ plain form
8097 88997836 89306746 89651502 89871095 90046493 90484415 91433520 92850550 94561492 96413039
8088 96413039 98372318 100439024 102618194 104903722 107281028 109624306 111938237 114719482
8080 114719482 118897189 125459759 134917362 147320988 163063252 183846182 213064616
8073 213064616 255271002 310857459 363816915 383716128 359398471 309147172 257745232
8066 257745232 216975189 187482178 166434497 150916407 138709966 128430980 119388062
8059 119388062 111340880 104508333 99124854 95024023 91838310 89238305 87080897 85233140
8051 85233140 83465754 81560811 79399424 77003012 74408576 71724530 69150622 66963546
8043 66963546 65375433 64650268 65020726 66345196 67962268 69312849 70432551 71733844
$$ packed form
8097H8997836L08910L44756K19593J75398M37922R49105J417030J710942J851547
8088I6413039J959279K066706K179170K285528K377306K343278K313931K781245
8080A14719482M177707O562570R457603J2403626J5742264K0782930K9218434
8073B13064616M2206386N5586457N2959456J9899213k4317657n0251299n1401940
8066B57745232m0770043k9493011k1047681j5518090j2206441j0278986r042918
8059A19388062q047182o832547n383479m100831l185713k600005k157408j847757
8051H5233140j767386j904943k161387k396412k594436k684046k573908k187076
8043F6963546j588113p25165L70458J324470J617072J350581J119702J301293
$$ plain form
8035 71733844 73676258 76687732 81050474 86858674 94157837 102434981 109515478 112707272
8027 112707272 111400116 107323185 102524565 97311593 90616238 82584148 74566228 67084947
8019 67084947 59669813 52285233 45488042 39819190 35359168 31978526 29435686 27552601
8011 27552601 26189453 25237030 24527800 23805912 22829173 21522693 20019034 18510145 17134746
8002 17134746 15871799 14652562 13480994 12399734 11418926 10540086 9717092 8948382 8272717
7993 8272717 7699340 7247402 6852964 6521110 6234623 5979423 5759037 5591497 5445637 5318000
7983 5318000 5149397 4928931 4688662 4462894 4250736 4051389 3837602 3607474 3372893 3152540
7973 3152540 2952451 2764900 2597064 2449997 2326633 2214615 2106801 2006723 1914793 1830081
$$ packed form
8035G1733844J942414L011474M362742N808200P299163Q277144P080497L191794
8027A12707272j307156m076931m798620n212972o695355q032090q017920p481281
8019F7084947p415134p384580o797191n668852m460022l380642k542840j883085
8011B7552601j363148r52423p09230p21888r76739j306480j503659j508889j375399
8002A7134746j262947j219237j171568j081260r80808q78840q22994p68710o75665
7993H272717n73377m51938l94438l31854k86487k55200k20386j67540j45860j27637
7983E318000j68603k20466k40269k25768k12158j99347k13787k30128k34581k20353
7973C152540k00089j87551j67836j47067j23364j12018j07814j00078r1930q4712
$$ plain form
7963 1830081 1749196 1684679 1619354 1562904 1529877 1511781 1477883 1424710 1348526 1291150 1245444
7952 1245444 1194342 1133064 1083858 1058097 1057649 1132211 1305874 1514172 1706198 1831366 1884313
7941 1884313 1881481 1834093 1777096 1707025 1651410 1581446 1522224 1472709 1412359 1362457 1317523 1269733
7929 1269733 1213241 1154267 1091122 1054302 1028089 1000567 969955 975327 969346 935211 903203 875293
7917 875293 882006 903406 905087 888280 865866 828962 797362 785228 756153 726686 692091 654705
7905 654705 635571 652895 679298 687571 706680 721965 743147 762216 769940 766713 745635 724638
7893 724638 732213 745946 746746 733332 722219 718161 688187 659680 647071 663173 685749 686082 665072
7880 665072 616618 560497 549012 524789 513422 525835 536706 536871 543631 545854 553145 534806 499831
$$ packed form
7963A830081q0885o4517o5325n6450l3027j8096l3898n3173p6184n7376m5706
7952A245444n1102o1278m9206k5761m48P4562J73663K08298J92026J25168N2947
7941A884313k832m7388n6997p0071n5615o9964n9222m9515o0350m9902m4934m7790
7929A269733n6492n8974o3145l6820k6213k7522l0612N372n981l4135l2008k7910
7917H75293O713K1400J681j6807k2414l6904l1600j2134k9075k9467l4595l7386
7905F54705j9134J7324K6403Q273J9109J5285K1182J9069P724l227k1078k0997
7893G24638P575J3733Q00j3414j1113m058k9974k8507j2609J6102K2576L33k1010
7880F65072m8454n6121j1485k4223j1367J2413J0871J65O760K223P291j8339l4975
$$ plain form
7867 499831 480263 453291 420607 390038 377662 369461 356051 342228 339345 335017 326927 302402
7855 302402 292158 296156 272755 271818 279858 280250 267051 246003 252241 252278 239634 246419 251657 268249
7841 268249 282063 274354 262519 243977 248717 257044 240854 227367 223990 231156 225370 222153 233688
7828 233688 226972 243491 254024 244879 237387 230723 210763 208091 206038 196044 192452 189397 200656
7815 200656 187017 185487 189858 193488 193678 188624 190771 192046 190619 160107 144159 151703 166501 169444
7801 169444 178329 170151 171593 180643 192508 210154 215714 211006 194130 176962 179950 174038 156317
7788 156317 133514 131548 126209 136514 152554 145837 146915 157792 153389 150611 161249 159714 153708
7775 153708 161953 174228 174205 161112 160557 151683 137436 142343 154358 155291 172946 172509 163766 169321
$$ packed form
7867D99831j9568k6972l2684l0569j2376q201j3410j3823k883m328q090k4525
7855C02402j0244L998k3401r37Q040L92j3199k1048O238L7j2644O785N238J6592
7841B68249J3814p709j1835j8542M740Q327j6190j3487l377P166n786l217J1535
7828B33688o716J6519J0533r145p492o664j9960k672k053r994l592l055J1259
7815B00656j3639j530M371L630J90n054K147J275j427l0512j5948P544J4798K943
7801A69444Q885q178J442R050J1865J7646N560m708j6876j7168K988n912j7721
7788A56317k2803j966n339J0305J6040o717J078J0877m403k778J0638j535o006
7775A53708Q245J2275k3j3093n55q874j4247M907J2015R33J7655m37q743N555
$$ plain form
7761 169321 164325 174284 172833 172587 156589 158368 165945 159817 150801 139712 125910 111960 122240
7748 122240 153490 171753 171830 156251 150166 155073 139615 145106 162100 175658 185560 188171 184721
7735 184721 203540 213800 214232 227635 235122 250463 256627 282285 319073 343963 350961 354890 368918
7722 368918 386065 402064 468209 543976 605328 644860 641074 623511 603191 564767 550348 552717
7710 552717 561002 540942 544859 556705 566532 559827 554213 551736 545362 546884 541395 559647 566384 569972
7696 569972 546907 529669 532059 535528 550750 565858 605758 609811 590909 602239 604005 614001 636530
7683 636530 655062 682638 718035 778923 876353 1014102 1209133 1546354 1976974 2358203 2420941
7672 2420941 2155602 1749914 1393476 1142755 968935 869148 789197 706680 653071 613662
$$ packed form
7761A69321m996R959j451k46j5998J779P577o128r016j1089j3802j3950J0280
7748A22240L1250J8263P7j5579o085M907j5458N491J6994J3558R902K611l450
7735A84721J8819J0260M32J3403P487J5341O164K5658L6788K4890O998L929J4028
7722C68918J7147J5999O6145P5767O1352L9532l786j7563k0320l8424j4419K369
7710E52717Q285k0060L917J1846R827o705n614k477o374J522n489J8252O737L588
7696E69972k3065j7238K390L469J5222J5108L9900M053j8902J1330J766R996K2529
7683F36530J8532K7576L5397O0888R7430J37749J95031L37221M30620L81229O2738
7672B420941k65339m05688l56438k50721j73820r9787p9951q2517n3609l9409
$$ plain form
7662 613662 584517 570456 547832 507076 474548 446012 434402 432562 423641 403049 381512 389467
7650 389467 379465 364121 371169 367528 357651 357989 379022 385091 379293 376992 380325 390168 417672 453705
7636 453705 478614 511282 567741 626231 686994 733669 763860 784156 760178 688102 588136 495535
7624 495535 423356 364082 315234 287945 258981 235276 231924 215161 201540 185475 164322 151669
7612 151669 142004 132894 129413 105476 107144 110084 111561 84400 83330 88024 72191 85850 86939
7599 86939 63154 35938 31557 28107 35786 46126 63397 75111 78430 73067 48862 26862 14619
7586 14619 6316 18463 29431 32561 41712 51598 50349 34243 42349 21949 5941 9866 22344
7573 22344 24625 20772 23722 41769 48463 42672 15826 17922 29033 25737 16379 11131 20475 29456
$$ packed form
7662F13662k9145j4061k2624m0756l2528k8536j1610j840q921k0592k1537P955
7650C89467j0002j5344P048l641r877L38K1033O069n798k301L333R843K7504L6033
7636D53705K4909L2668N6459N8490O0763M6675L0191K0296k3978p2076r9966r2601
7624D95535p2179n9274m8848k7289k8964k3705l352j6763j3621j6065k1153j2653
7612A51669r665r110l481k3937J668K940J477k7161j070M694j5833J3659J089
7599H6939k3785k7216m381l450P679J0340J7271J1714L319n363k4205k2000j2243
7586A4619q303J2147J0968L130R151R886j249j6106Q106k0400j6008L925J2478
7573B2344K281l853K950J8047O694n791k6846K096J1111l296r358n248R344Q981
$$ plain form
7559 29456 35774 55431 49951 55863 58291 55352 47136 23953 -11199 -17901 -9805 3250 -3757 1151
7545 1151 9206 28569 39839 52977 49858 39365 29178 24523 27270 25848 24079 2999 -19345
7532 -19345 -37281 -35290 -28628 -19781 -19933 -6039 2341 10783 22628 11008 2272 -11246 -22035
7519 -22035 -30029 -29909 -17435 -24706 -25551 -11525 -4132 -5691 -34172 -36437 -247 20725 46631 60907
7505 60907 85542 102034 103963 74663 64452 56552 41461 22033 21420 4840 -8354 -38870 -39924
7492 -39924 -32068 -7994 10365 25029 16879 -7276 -46480 -52256 -43594 -28902 -6921 -5543 3432
7479 3432 -3297 -20963 -19415 -10132 3255 6789 514 -7730 -5933 -21834 -23812 -17939 2490 25937
7465 25937 12651 -11850 5184 4742 10356 10769 6965 10995 14846 10835 3217 -1878 -15711 -10181
$$ packed form
7559B9456O318J9657n480N912K428k939q216k3183l5152o702Q096J3055p007M908
7545A151Q055J9363J1270J3138l119j0493j0187m655K747j422j769k1080k2344
7532a9345j7936J991O662Q847j52J3894Q380Q442J1845j1620q736j3518j0789
7519b2035p994J20J2474p271q45J4026P393j559k8481k265L6190K0972K5906J4276
7505F0907K4635J6492J929k9300j0211p900j5091j9428o13j6580j3194l0516j054
7492c9924P856K4074J8359J4664q150k4155l9204n776Q662J4692K1981J378Q975
7479C432o729j7666J548R283J3387L534o275q244J797j5901j978N873K0429K3447
7465B5937j3286k4501J7034m42N614M13l804M030L851m011p618n095j3833N530
$$ plain form
7451 -10181 6338 14123 14134 5755 4204 -2942 -7657 -18074 -23859 -17014 9604 16970 22621 19422
7437 19422 12653 3787 4868 12139 11747 3837 -15177 -16620 -19359 -14427 -18338 -3146 2463 -223
7423 -223 -6059 -20130 -15229 12969 9778 7110 18559 40541 47019 28297 8893 -4513 -7778
7410 -7778 -6958 -11299 -10891 -3363 -1407 -1168 -2582 -2090 -424 -3923 -3642 -343 -9652 -10823 -1655 4145
7394 4145 17370 24674 21911 10960 3574 -8357 -20122 -25321 -41988 -48006 -45934 -26198 -18206
7381 -18206 -32714 -45748 -58172 -53504 -27507 -10885 14474 19645 32989 46855 30344 11702
7369 11702 11649 19700 20774 16762 10318 2755 9104 20363 5265 -30973 -39618 -22617 1287 265
7355 265 -8046 -17886 -17696 -26404 -17778 -13411 -20440 -16101 -944 -4845 -18922 -17142 -9959 -8764 -17534
$$ packed form
7451a0181J6519P785J1q379j551p146m715j0417n785O845K6618P366N651l199
7437A9422o769q866J081P271l92p910j9014j443k739M932l911J5192N609k686
7423b23n836j4071M901K8198l191k668J1449K1982O478j8722j9404j3406l265
7410g778Q20m341M08P528J956K39j414M92J666l499K81L299r309j171R168N800
7394D145J3225P304k763j0951p386j1931j1765n199j6667o018K072J9736P992
7381a8206j4508j3034j2424M668K5997J6622K5359N171J3344J3866j6511j8642
7369A1702n3Q051J074m012o444p563O349J1259j5098l6238q645J7001K3904j022
7355B65q311r840J90q708Q626M367p029M339J5157l901j4077J780P183J195q770
$$ plain form
7340 -17534 -21943 -16131 -17312 -7922 2143 31589 26685 26627 15811 4404 -4934 -1117 20875 12043
7326 12043 4006 5202 5582 -17480 -41290 -39183 -40505 -30682 -14578 4339 -625 -16792 -9537 -4896
7312 -4896 -21280 -35675 -44219 -32268 34 16666 14375 4675 -4212 -13561 -35742 -31421 -4647
7299 -4647 16535 30059 29118 15644 14064 4292 -10755 -19799 -22986 -14848 -11110 -12668 15037 21143
7285 21143 7491 3510 18660 29197 25917 18960 5907 818 -22151 -14809 -8835 3658 11224
7272 11224 3286 407 9013 1862 -2495 -4441 1178 5169 1196 6314 -5028 -18737 -17048 -16781
7258 -16781 -13779 -1097 -3054 -15984 -9632 -10022 -8769 -7926 -16679 604 11752 6358 2665 9182
7244 9182 22246 26005 23767 23080 22436 5297 -6316 -8887 1255 -9738 -12435 -2539 -519 -6482
$$ packed form
7340a7534m409N812j181R390J0065K9446m904n8j0816j1407r338L817K1992q832
7326A2043q037J196L80k3062k3810K107j322R823J6104J8917m964j6167P255M641
7312d896j6384j4395q544J1951L2302J6632k291r700q887r349k2181M321K6774
7299d647K1182J3524r41j3474j580r772j5047r044l187Q138L738j558K7705O106
7285B1143j3652l981J5150J0537l280o957j3053n089k2969P342N974J2493P566
7272A1224p938k879Q606p151m357j946N619L991l973N118j1342j3709J689K67
7258a6781L002J2682j957j2930O352l90J253Q43q753J7283J1148n394l693O517
7244I182J3064L759k238o87o44j7139j1613k571J0142j0993k697R896K020n963
$$ plain form
7230 -6482 -31495 -42111 -18074 -6734 -8649 -7296 -3102 -2975 -16580 -15728 -12701 -12579 -4807 -1846
7216 -1846 13885 18325 10490 -9611 -35478 -37065 -32409 -33732 -44301 -55837 -58675 -37619 -24776
7203 -24776 -24064 -35246 -38126 -20137 -15384 -21117 -21285 -14562 -14659 -16674 -4392 7579 29829 25920
7189 25920 12831 -2421 8309 16070 10707 7246 -7633 -16381 -17366 -14797 1449 18108 7938
7176 7938 3428 10165 1701 -11216 5897 18352 10784 2063 13 -17027 -17839 -16920 1933 -1550
7162 -1550 -15579 -6460 -1136 -10894 -13724 -12984 -15465 -18178 -31344 -28981 -22887 -15533 -4807 2229
7148 2229 4923 20166 42001 30359 19711 1907 11354 3514 -3338 -3947 2800 477 6273 5465
7134 5465 10453 11822 2190 9446 23574 21145 15614 10067 1277 -2142 -10088 -5563 -2824 3858 13008
$$ packed form
7230f482k5013j0616K4037J1340j915J353M194J27j3605Q52L027J22P772K961
7216a846J5731M440p835k0101k5867j587M656j323j0569j1536k838K1056J2843
7203b4776P12j1182k880J7989M753n733j68O723r7k015J2282J1971K2250l909
7189B5920j3089j5252J0730P761n363l461j4879q748r85K569J6246J6659j0170
7176G938m510O737q464j2917J7113J2455p568q721k050j7040q12R19J8853l483
7162a550j4029R119N324r758k830P40k481k713j3166K363O094P354J0726P036
7148B229K694J5243K1835j1642j0648j7804R447p840o852o09O747k323N796q08
7134E465M988J369r632P256J4128k429n531n547q790l419p946M525K739O682R150
$$ plain form
7119 13008 10767 -4517 -10016 -170 894 -3726 -10689 -18990 -5215 7464 10242 6255 -3085 -9626
7105 -9626 -8141 -827 779 -7229 -21797 -17269 6965 1819 -6605 -16073 -3970 2398 -213 4322
7091 4322 -8758 -23941 -27717 -15871 -12865 2655 25836 30886 18715 14828 22785 27527 20624
7078 20624 9929 12064 8569 -928 220 6031 -2080 -1992 11009 16524 25125 8584 -7299 -25166
7064 -25166 -26798 -26004 -11683 -2072 3174 2251 -18724 -24064 -16584 -4304 5024 -715 -17502 -21356
7050 -21356 -21370 -20281 -21479 -10350 -18464 -26043 -28967 -23978 -21019 -14760 -2759 -15166 -23036 -22786 -18659
7035 -18659 -13704 546 602 16716 18227 19327 22693 6911 5085 -13435 -18021 -10515 -2917 672
7021 672 -11901 -20905 -27830 -26544 -10821 -6011 -12420 -24042 -27897 -29568 -46799 -37330 -16113 -9427
$$ packed form
7119A3008k241j5284n499R846J064m620o963q301J3775J2679K778l987r340o541
7105i626J485P314J606q008j4568M528K4234n146q424r468J2103O368k611M535
7091D322j3080j5183l776J1846L006J5520K3181N050j2171l887P957M742o903
7078B0624j0695K135l495r497J148N811q111Q8J3001N515Q601j6541j5883j7867
7064b5166j632P94J4321R611N246r23k0975n340P480J2280R328n739j6787l854
7050b1356j4J089j198J1129q114p579k924M989K959O259J2001j2407p870K50M127
7035a8659M955J4250N6J6114J511J100L366j5782j826j8520m586P506P598L589
7021F72j2573r004o925J286J5723M810o409j1622l855j671j7231R469K1217O686
$$ plain form
7007 -9427 -16575 -12842 -798 1654 -3724 -6311 -14109 7168 15921 1585 -10651 -5452 -9953 -30752
6993 -30752 -34401 -28370 -28467 -30190 -24380 -9898 -3151 -10670 -18814 -15612 -10604 -9340 -7600 12576 15691
6978 15691 7168 -7883 -864 15938 6513 1569 5154 -9655 -21757 -27239 -14051 -27841 -28578
6965 -28578 -9817 -6592 -6992 -14072 -21876 -12479 17211 26281 22262 15755 -5247 -5537 27425 29587
6951 29587 -11835 -28632 -33742 -39429 -16550 2892 14057 23620 19982 6579 -9471 -7907 76
6938 76 -2717 -12498 -19925 -13676 -18755 -26094 -20625 -694 10898 6426 5674 907 3371 -9155 -12557
6923 -12557 -19371 -21653 -27633 -42135 -49228 -21711 2438 7036 11875 23219 21250 9770 2034
6910 2034 -19957 -30241 -18299 -21254 -31945 -24594 -24127 -12800 11255 8040 -12605 -24384 -7252
$$ packed form
7007i427p148L733J2044K452n378k587p798K1277Q753j4336j2236N199m501k0799
6993c0752l649O031r7j723N810J4482O747p519q144L202N008J264J740K0176L115
6978A5691q523j5051P019J6802r425m944L585j4809j2102n482J3188j3790p37
6965b8578J8761L225m00p080p804R397K9690R070m019o507k1002k90L2962K162
6951B9587m1422j6797n110n687K2879J9442J1165R563l638j3403j6050J564P983
6938G6k793r781p427O249n079p339N469J9931J1592m472p52m767K464j2526l402
6923a2557o814k282n980j4502p093K7517K4149M598M839J1344j969j1480p736
6910B034k1991j0284J1942k955j0691P351M67J1327K4055l215k0645j1779J7132
$$ plain form
6897 -7252 -8573 -5929 3727 -6952 -13551 -17788 -7005 -10433 -10063 -10727 -14016 -4900 10128 13852 513
6882 513 -2886 -3088 -1996 -1437 -1302 -15405 -5747 7855 15428 10917 4295 -6162 -20099 -21809 -35986
6867 -35986 -43687 -29297 -16041 -21745 -30772 -32823 -33261 -24983 -7937 58 -1521 2679 7933 4391
6853 4391 -1371 -12606 -7586 -6130 -2576 -2918 -10387 -13694 -376 11960 10494 18864 19287 9684 -10335
6838 -10335 -20969 -18632 -12144 -10660 -335 9741 6840 -4972 4488 3457 -8119 -2184 12248
6825 12248 16600 4994 3586 137 -510 12927 12515 -4157 -4734 7219 11466 9829 12180 -1740
6811 -1740 2721 -576 -1367 458 -4033 1855 2644 -9028 -28454 -42774 -25908 -6308 -5674 -11216
6797 -11216 -32316 -31785 -38429 -32422 -19734 -4043 1802 -1439 8021 -6298 -19180 -6973 3508
$$ packed form
6897g252j321K644R656j0679o599m237J0783l428L70o64l289R116J5028L724j3339
6882E13l399k02J092N59J35j4103R658J3602P573m511o622j0457j3937j710j4177
6867c5986p701J4390J3256n704r027k051m38Q278J7046P995j579M200N254l542
6853D391n762j1235N020J456L554l42p469l307J3318J2336j466Q370M23r603k0019
6838a0335j0634K337O488J484J0325J0076k901j1812R460j031j1576N935J4432
6825A2248M352j1606j408l449o47J3437m12j6672n77J1953M247j637K351j3920
6811a740M461l297p91J825m491N888P89j1672j9426j4320J6866J9600O34n542
6797a1216k1100N31o644O007J2688J5691N845l241R460j4319j2882J2207J0481
$$ plain form
6784 3508 9399 10198 13323 5381 -13163 -10764 -18660 -10981 -13356 -35216 -34298 -19088 -21313 -14373 -3614
6769 -3614 1557 -3924 -15098 -20662 -5055 -6104 -2612 -8375 -7046 -2620 -18058 -26131 -21329 -20320
6755 -20320 -32722 -23504 -31479 -35745 -26703 -14929 -20299 -26680 5858 38518 37293 30785 20491
6742 20491 -3012 -8626 -27147 -35554 -24104 -24658 -16556 -10258 -7443 -9441 -17082 -25940 -25700 -26798
6728 -26798 -33380 -37442 -40322 -29114 -10788 -12131 -4920 8847 16645 661 -26401 -35202 -7661
6715 -7661 17252 12471 5336 -8591 -11308 -19102 -19372 -16594 -15988 -6369 -8982 -12070 -9441 -16177 -16057
6700 -16057 -20166 -14308 -17776 -28663 -33677 -28520 -28264 -27056 -27730 -37388 -43253 -34301 -16326 -12693 -22791
6685 -22791 -20665 -7222 -6506 -10309 504 -2779 1239 -5190 -17595 -10012 -4248 72 5811 8738
$$ packed form
6784C508N891P99L125p942j8544K399p896P679k375k1860R18J5210k225O940J0759
6769c614N171n481j1174n564J5607j049L492n763J329M426j5438q073M802J009
6755b0320j2402R218p975m266R042J1774n370o381L2538L2660j225o508j0294
6742B0491k3503n614j8521q407J1450n54Q102O298K815j998p641q858K40j098
6728b6798o582m062k880J1208J8326j343P211J3767P798j5984k7062q801K7541
6715g661K4913m781p135j3927k717p794k70K778O06R619k613l088K629o736J20
6700a6057m109N858l468j0887n014N157K56J208o74r658n865Q952J7975L633j0098
6685b2791K126J3443P16l803J0813l283M018o429j2405P583N764M320N739K927
$$ plain form
6671 8738 17440 18991 13688 4562 -8619 13430 9901 629 -10539 -7720 -6573 9773 21452 4196
6657 4196 1607 -4323 -10530 -12496 -12172 -10578 -15816 -21774 -17046 -17906 -24777 -20354 -20040 -26159 -12202
6642 -12202 -11478 -17959 -21228 -2111 -10915 -27387 -25993 -32879 -15706 -18834 -31397 -30711 -18747 -17102
6628 -17102 -20820 -26721 -40387 -44617 -48424 -30608 -17457 -16671 -4229 5575 -6051 -13706 -17048 -17804
6614 -17804 -34909 -26604 -18190 -6169 6149 13195 18914 7094 -2838 -15400 -13928 -20984 -24857
6601 -24857 -29515 -29620 -34012 -43744 -24267 -25206 -29724 -27304 -26666 -12173 3172 -3182 -8844 12155
6587 12155 10644 -8913 -10786 -7438 -26864 -34897 -35993 -30095 -15656 -10516 -12573 -7326 -12682 -11467
6573 -11467 -8252 7937 19282 9278 -20169 -30882 -24689 -11147 -14781 -15490 -15389 -24487 -24211 -22118
$$ packed form
6671H738Q702J551n303r126j3181K2049l529r272j1168K819J147J6346J1679j7256
6657D196k589n930o207j966L24J594n238n958M728q60o871M423L14o119J3957
6642a2202P24o481l269J9117q804j6472J394o886J7173l128j2563O86J1964J645
6628a7102l718n901j3666m230l807J7816J3151P86J2442R804j1626p655l342p56
6614a7804j7105Q305Q414J2021J2318P046N719j1820r932j2562J472p056l873
6601b4857m658j05m392r732J9477r39m518K420O38J4493J5345o354n662K0999
6587A2155j511j9557j873L348j9426q033j096N898J4439N140k057N247n356J215
6573a1467L215J6189J1345j0004k9447j0713O193J3542l634p09J01r098K76K093
$$ plain form
6559 -22118 -32381 -25899 -15639 -23335 -12989 -4813 -18363 -24331 -22605 -20979 -10874 14941 13049
6546 13049 2942 -4324 3070 -2255 -15850 -10968 12539 17788 15214 2638 -11017 -6783 -11982
6533 -11982 -7280 6090 14958 15678 17043 9542 -1426 -4172 10551 19579 13493 8702 -5861 -10294
6519 -10294 -29949 -42495 -44880 -50668 -50344 -38705 -13510 15730 16802 8778 11377 5979 7591 18838
6505 18838 21415 17775 25728 5462 -5937 -9281 11991 28962 9645 -6512 10565 13612 -351
6492 -351 -777 959 -10142 -16320 -5778 11713 11077 -3865 -7500 5093 7321 -6422 -2596 -2841
6478 -2841 1199 -3772 -27936 -37395 -37610 -25943 -6926 -5236 -8707 -10024 -6502 -4912 -22017 -21145
6464 -21145 -10864 -12613 -20157 -4666 -15908 -25192 -10786 -3878 14193 9871 -13064 -23602 -24989
$$ packed form
6559b2118j0263O482J0260p696J0346Q176j3550n968J726J626J0105K5815j892
6546A3049j0107p266P394n325j3595M882K3507N249k574j2576j3655M234n199
6533a1982M702J3370Q868P20J365p501j0968k746J4723R028o086m791j4563m433
6519a0294j9655j2546k385n788L24J1639K5195K9240J072q024K599n398J612J1247
6505A8838K577l640P953k0266j1399l344K1272J6971j9317j6157J7077L047j3963
6492c51m26J736j1101o178J0542J7491o36j4942l635J2593K228j3743L826k45
6478b841M040m971k4164r459k15J1667J9017J690l471j317L522J590j7105Q72
6464b1145J0281j749p544J5491j1242r284J4406O908J8071m322k2935j0538j387
$$ plain form
6451 -24989 -24315 -26293 -18787 -757 21288 15975 14936 -6430 -27126 -17339 -6191 -14262 -4761 -13047
6437 -13047 -23867 -27645 -14058 -9786 -16118 -14760 -5967 -21588 -19909 -12555 -12848 -17645 -16336 -9974
6423 -9974 -20105 -7509 -6254 7255 14794 5998 -13695 -16984 -11148 -5705 -1299 11423 16218 11823
6409 11823 2721 8844 20858 -1148 -16342 -21986 -41969 -37723 -27452 -20315 -18585 -27675 -14325
6396 -14325 -10853 -9496 -28748 -32020 -23617 -26669 -12041 -4875 -3319 1698 4760 7010 -7848 -13769
6382 -13769 -13516 -15028 -9406 -7830 -8177 -8088 645 17521 10873 3185 -5665 -15192 -13717 -20474 -28200
6367 -28200 -37844 -36473 -32371 -27552 -1265 -8170 -1500 2258 5092 -6316 -20737 -22218 -23667 -15808
6353 -15808 -12158 -7573 -23287 -1134 17096 4687 -2068 11859 10958 9555 -7839 -4798 9974
$$ packed form
6451b4989O74j978P506J8030K2045n313j039k1366k0696R787J1148q071R501q286
6437a3047j0820l778J3587M272o332J358Q793j5621J679P354k93m797J309O362
6423i974j0131J2596J255J3509P539q796j9693l289N836N443M406J2722M795m395
6409A1823r102O123J2014k2006j5194n644j9983M246J0271P137J730r090J3350
6396a4325L472J357j9252l272Q403l052J4628P166J556N017L062K250j4858n921
6382a3769K53j512N622J576l47Q9Q733J6876o648p688q850r527J475o757p726
6367b8200r644J371M102M819K6287o905O670L758K834j1408j4421j481j449P859
6353a5808L650M585j5714K2153J8230j2409o755J3927r01j403j7394L041J4772
$$ plain form
6340 9974 1327 -18539 -25658 -6681 9736 5944 -1885 1074 -5758 -7529 -9586 -20555 -20248 -29915
6326 -29915 -38687 -31625 -33297 -35018 -46323 -34200 -10977 -5549 -13438 -1308 -3616 -15484 -6696
6313 -6696 -2128 -9544 -17766 -3581 7607 14264 11655 -8837 -11009 6128 5071 -2602 10810 6512
6299 6512 12283 7727 16609 18580 31633 27991 19120 19136 1867 -14400 -2293 6625 -2880 -11398
6285 -11398 -11847 -8514 -11307 -8432 -4138 20020 30300 16337 -2663 -11391 -2152 3396 -14004 -16214
6271 -16214 35 4195 10663 17451 21267 26482 10933 -5537 -22478 -25058 -21365 -15594 -18065 -29643
6257 -29643 -19858 -18671 -19846 -27452 -20940 -29193 -30014 -14911 8040 3624 -8807 -11372 -3955 11777
6243 11777 25696 24895 11638 -1131 -1846 22722 19303 5485 3820 5809 602 -2320 -12906 -30151
$$ packed form
6340I974q647j9866p119J8977J6417l792p829K959o832j771k057j0969L07r667
6326b9915q772P062j672j721j1305J2123K3223N428p889J2130k308j1868Q788
6313f696M568p416q222J4185J1188O657k609k0492k172J7137j057p673J3412m298
6299F512N771m556Q882J971J3053l642q871J6j7269j6267J2107Q918r505q518
6285a1398m49L333k793K875M294K4158J0280j3963j9000q728R239N548j7400k210
6271a6214J6249M160O468O788L816N215j5549j6470j6941k580L693N771k471j1578
6257b9643R785J187j175p606O512q253q21J5103K2951m416j2431k565P417J5732
6243A1777J3919q01j3257j2769p15K4568l419j3818j665J989n207k922j0586j7245
$$ plain form
6229 -30151 -44204 -27911 -12168 -11847 -26652 -34035 -17990 114 1360 -7563 -3319 -2169 -17582
6216 -17582 -16674 -5863 -10756 -3944 -8279 -6634 4230 3636 3548 6335 8207 2437 12757 10116 -12581
6201 -12581 -25978 -37592 -27627 -20087 -17944 -11610 -9003 -17529 -30062 -21808 -22597 -26565 -27889 -28886
6187 -28886 -10220 -1279 -18044 -40375 -32452 -26990 -34936 -38704 -52529 -45872 -30199 -11126 -5469
6174 -5469 -4304 8375 -10225 -691 4467 -5485 -17455 -24336 -32816 -27323 -30791 -27377 -22085 -12861
6160 -12861 -9914 -24886 -18683 -4006 -4957 -2608 475 -19141 -24530 -16658 -5906 6509 2895 -739
6146 -739 13409 9984 -1084 -13933 -28566 -35738 -24652 -20187 -20344 -12615 7121 349 -23451 -15576
6132 -15576 5540 -5303 -5894 -4160 -3861 -3978 5084 7486 -2970 2724 -6606 -8709 -29696 -23822
$$ packed form
6229c0151j4053J6293J5743L21j4805p383J6045J8104J246q923M244J150j5413
6216a7582R08J0811m893O812m335J645J0864n94q8K787J872n770J0320k641k2697
6201a2581j3397j1614R965P540K143O334K607q526j2533Q254p89l968j324r97
6187b8886J8666Q941j6765k2331P923N462p946l768j3825O657J5673J9073N657
6174e469J165J2679j8600R534N158r952j1970o881q480N493l468L414N292R224
6160a2861K947j4972O203J4677r51K349L083j9616n389P872J0752J2415l614l634
6146g39J4148l425j1068j2849j4633p172J1086M465j57P729J9736o772k3800P875
6132a5576K1116j0843n91J734K99j17R062K402j0456N694r330k103k0987N874
$$ plain form
6118 -23822 -10152 -1639 6644 13937 19088 34443 44530 42866 35095 28770 16130 13335 6844 -3001
6104 -3001 -6655 -1641 -357 -15630 -20163 -29823 -42089 -38446 -10814 -14573 -6802 223 -1690 6488
6090 6488 11624 -3512 -9224 -22026 -26470 -26381 -22057 -15058 -14386 -17025 -6181 3655 15052 16758 8316
6075 8316 -2275 -718 10988 8809 802 8297 15011 -4260 -11798 -11337 -13166 -23578 -44104 -32398
6061 -32398 -22942 -30711 -38202 -32555 -26050 -24680 -22696 -21204 -14399 -4143 -11749 -651 14988 2033
6047 2033 4999 -38 -1972 -12399 -8529 -13828 -21513 -2083 11578 7968 11065 15586 1958 -10250
6033 -10250 -10916 -11341 -16877 -16788 -24392 -38423 -32002 -13093 -4470 -21573 -31644 -32429 -13434 -228
6019 -228 -10625 3113 4424 1640 -4048 -15073 -20579 -10467 -624 8374 282 -6543 6848 15819
$$ packed form
6118b3822J3670Q513Q283P293N151J5355J0087j664p771o325j2640k795o491r845
6104c001l654N014J284j5273m533r660j2266L643K7632l759P771P025j913Q178
6090F488N136j5136n712j2802m444Q9M324O999O72k639J0844R836J1397J706q442
6075H316j0591J557J1706k179q007P495O714j9271p538M61j829j0412k0526J1706
6061c2398R456p769p491N647O505J370J984J492O805J0256p606J1098J5639j2955
6047B033K966n037j934j0427L870n299p685J9430J3661l610L097M521j3628j2208
6033a0250o66m25n536Q9p604j4031O421J8909Q623j7103j0071p85J8995J3206
6019b28j0397J3738J311k784n688j1025n506J0112R843Q998q092o825J3391Q971
$$ plain form
6005 15819 11265 19995 20647 6881 -11247 -26190 -29974 -31105 -24774 -4799 -14427 -17683 -22941 -20089
5991 -20089 -11814 -17402 -25823 -28452 -13506 -1263 -9297 -18480 2625 10936 -2322 -2284 -2888 -2727 -14469
5976 -14469 -28351 -29669 -33183 -22276 -8534 -10045 -6831 -4252 -14891 -32876 -43492 -29495 -33717
5963 -33717 -29644 -8194 5105 -8784 -7711 -1991 3316 7456 -8514 -14358 -1936 16651 24193
5950 24193 28997 21682 21312 32658 17768 19503 13664 154 -5 -4219 -7624 -2966 4704 9162
5936 9162 5778 3457 83 -45 -6198 -12844 -14128 -8818 -19502 -2156 208 -7058 3916 21323
5922 21323 24161 7838 13924 12835 20301 10132 1027 -14042 -8860 7676 15776 11979 7650 1232
5908 1232 357 1652 -5967 7383 5324 -6053 5771 14930 9021 -6353 -7365 -1127 7874 5923
$$ packed form
6005A5819m554Q730O52j3766j8128j4943l784j131O331J9975r628l256n258K852
5991b0089Q275n588q421k629J4946J2243q034r183K1105Q311j3258L8o04J61j1742
5976a4469j3882j318l514J0907J3742j511L214K579j0639j7985j0616J3997m222
5963c3717M073K1450J3299j3889J073N720N307M140j5970n844J2422J8587P542
5950B4193M804p315l70J1346j4890J735n839j3510j59m214l405M658P670M458
5936I162l384k321l374j28o153o646j284N310j0684J7346K364p266J0974J7407
5922B1323K838j6323O086j089P466j0169r105j5069N182J6536Q100l797m329o418
5908A232q75J295p619J3350k059j1377J1824R159n909j5374j012O238R001j951
$$ plain form
5894 5923 -2973 507 5541 5271 6385 15538 14329 1996 -13465 -25561 -22634 -13201 -14431 -22665
5880 -22665 -22242 -27716 -26206 -3386 -1476 9136 16807 10976 1297 -115 418 4455 10131 6319 5628
5865 5628 -7435 -10391 11297 10330 2679 3931 4022 -14112 -15441 -25417 -36253 -19489 -30663 -32155
5851 -32155 -39364 -38843 -23665 -19399 -14590 -8597 -7202 -15055 -14978 -6239 -7142 -16680 -11717 1589 6557
5836 6557 -6583 -12843 -11281 -9520 -6439 -21660 -24995 -21748 -28259 -32847 -37623 -39228 -47759 -58765
5822 -58765 -39338 -33947 -32118 -30299 -25649 -28143 -30531 -1194 137 -9209 -15883 -15484 -867 6478
5808 6478 8537 10534 6298 3665 -2586 -14516 -23373 -26537 -40644 -47092 -35103 -15473 -7631 -5319
5794 -5319 1908 -3645 -19541 -22951 -22485 -26257 -21131 -6923 -21175 -10958 4107 1517 10992 8736
$$ packed form
5894E923q896L480N034k70J114R153j209j2333j5461j2096K927R433j230q234
5880b2665M23n474J510K2820J910J0612P671n831r679j412N33M037N676l812o91
5865E628j3063k956K1688r67p651J252R1j8134j329r976j0836J6764j1174j492
5851c2155p209N21J5178M266M809N993J395p853P7Q739r03r538M963J3306M968
5836F557j3140o260J562J761L081j5221l335L247o511m588m776j605q531j1006
5822e8765J9427N391J829J819M650k494k388K9337J331r346o674L99J4617P345
5808F478K059J997m236k633o251j1930q857l164j4107o448J1989J9630P842K312
5794e319P227n553j5896l410M66l772N126J4208j4252J0217J5065k590R475k256
$$ plain form
5780 8736 -14641 -25572 -31736 -42128 -34487 -24502 -25125 -22170 -25790 -30250 -16213 -384 -5129 -17363
5766 -17363 -10116 -8127 -14585 -19475 -19859 -14729 -16858 -21790 -3908 15081 4705 -21716 -20042 3580
5752 3580 -7260 -13809 -2136 4458 20384 28296 25132 22089 18553 283 -6942 675 4397 7386
5738 7386 18816 8279 3600 4877 606 5745 -5633 5961 1940 6784 17810 6488 -6741
5725 -6741 -15133 -20988 -10294 -2010 -1722 9577 -6542 5430 32766 32476 29140 11335 -6486 -14119
5711 -14119 -13497 -5059 -12744 -18617 -9859 -15517 -29853 -31622 -36373 -27102 -10147 7240 -1921 -11411
5697 -11411 -6101 -6088 7962 1572 -11584 -13879 -19473 -14889 -7704 -3162 16849 10887 4337 1600
5683 1600 8489 16557 25336 24102 12664 1202 3040 -191 -20145 -37104 -22240 -75 -5422
$$ packed form
5780H736k3377j0931o164j0392P641R985o23K955l620m460J4037J5829m745j2234
5766a7363P247J989o458m890l84N130k129m932J7882J8989j0376k6421J674K3622
5752C580j0840o549J1673O594J5926P912l164l043l536j8270p225P617L722K989
5738G386J1430j0537m679J277m271N139j1378J1594m021M844J1026j1322j3229
5725f741q392n855J0694Q284K88J1299j6119J1972K7336k90l336j7805j7821p633
5711a4119O22Q438p685n873Q758n658j4336j769m751R271J6955J7387r161r490
5697a1411N310J3J4050o390j3156k295n594M584P185M542K0011n962o550k737
5683A600O889Q068Q779j234j1438j1462J838l231j9954j6959J4864K2165n347
$$ plain form
5670 -5422 -20279 -31131 -11743 15896 15151 3599 -8192 -2535 4243 9313 18342 14507 7311 -2351
5656 -2351 -2760 -3049 -800 3635 7137 -1349 -7304 -3553 -4217 -6901 2872 7292 6570 -9714 -6861 -7207
5640 -7207 -25945 -35200 -27656 -10470 -22389 -16148 -12514 -9852 7050 8812 -5181 354 15777
5627 15777 26961 118 -26255 -17112 -9781 -7939 5574 11327 -12545 -20596 -17462 -2098 -2032 -12855
5613 -12855 -18795 -9519 128 -8274 -6928 -14110 -14631 -10471 2676 15100 16348 -3870 -28487 -34598
5599 -34598 -22801 7042 13300 5195 9930 8864 3797 8140 -11545 -30644 -28596 -26055 -17382 -11727
5585 -11727 -17338 -32097 -23376 -15640 -15875 -17504 -10026 -8635 -11795 -7969 2160 -393 -15429 -37765
5571 -37765 -21419 -19636 -19561 -21885 -17907 -4355 9981 6034 13507 13730 13254 -2820 -4551 1450 6130
$$ packed form
5670e422j4857j0852J9388K7639p45j1552j1791N657O778N070R029l835p196r662
5656b351m09k89K249M435L502q486n955L751o64k684R773M420p22j6284K853l46
5640g207j8738r255P544J7186j1919O241L634K662J6902J762j3993N535J5423
5627A5777J1184k6843k6373R143P331J842J3513N753k3872q051L134J5364O6j0823
5613a2855n940R276R647q402J346p182n21M160J3147J2424J248k0218k4617o111
5599c4598J1797K9843O258q105M735j066n067M343j9685j9099K048K541Q673N655
5585a1727n611j4759Q721P736k35j629P478J391l160L826J0129k553j5036k2336
5571c7765J6346J783P5k324L978J3552J4336l947P473K23m76j6074j731O001M680
$$ plain form
5556 6130 15357 6329 4647 8433 12033 578 3479 -3562 -22526 -25051 -21126 -23228 -26012 -23228
5542 -23228 -37385 -34993 -28157 -28025 -17070 -1352 4975 3568 4356 14614 34568 42887 34479 17697
5528 17697 16768 32471 22673 8482 -1305 3202 15276 8198 9873 11790 15695 13319 7212 -17474
5514 -17474 -16222 -10124 -11327 -16514 -12430 -8721 -8720 -11681 -17989 -19031 -18202 5515 17204 5103 -10123
5499 -10123 -13215 -31629 -14726 13950 32399 45715 31459 32284 34210 21285 13262 10343 18048
5486 18048 24375 19613 20908 23112 31552 24996 19270 18948 12801 3879 31 -4661 11119 15015 -13556
5471 -13556 -18024 -9075 -5949 -1867 -4421 -15721 -19185 -24344 -21189 -17931 -6421 7446 18749 26065
5457 26065 17289 15464 27968 29448 6855 -6891 -12529 -8531 -11362 -14324 -16395 -19184 -10521 -2879
$$ packed form
5556F130R227r028j682L786L600j1455K901p041j8964k525L925k102k784K784
5542b3228j4157K392O836J32J0955J5718O327j407P88J0258J9954Q319q408j6782
5528A7697r29J5703r798j4191r787M507J2074p078J675J917L905k376o107k4686
5514a7474J252O098j203n187M084L709Jk961o308j042Q29K3717J1689j2101j5226
5499a0123l092j8414J6903K8676J8449J3316j4256Q25J926j2925q023k919P705
5486A8048O327m762J295K204Q440o556n726l22o147q922l848m692J5780L896k8571
5471a3556m468Q949L126M082k554j1300l464n159L155L258J1510J3867J1303P316
5457B6065q776j825J2504J480k2593j3746n638L998k831k962k071k789Q663P642
$$ plain form
5443 -2879 -9789 -9635 -19411 -26347 -13208 10131 22257 -220 7007 1993 -18147 -20134 -13356 -10517
5429 -10517 8075 10395 15435 -1400 -9925 -11617 -7878 128 -5471 -3123 1081 -11063 -1691 4466
5415 4466 12684 6538 18829 15514 6878 10941 8364 19252 26906 36137 15633 220 -13095 -28677
5401 -28677 -20661 -8346 -6086 -172 2250 -3905 7051 8681 14805 18697 13147 5731 1913 -5848
5387 -5848 -17625 -27934 -29628 -26663 -13951 -21024 -21690 -20620 -16479 -23125 -32457 -34839 -32049 -4915
5373 -4915 20727 23487 20167 8549 19378 22483 19331 19239 3745 -11181 -4273 -1406 15552 31885
5359 31885 35917 26741 20196 15919 4819 -9361 -12578 -4714 -6288 4116 9756 10931 5998 6523
5345 6523 -3113 -8532 -8566 -8161 -21180 -38916 -54038 -48400 -44575 -36615 -35338 -17925 -2743 -12587
$$ packed form
5443b879o910J54r776o936J3139K3339J2126k2477P227n014k0140j987O778K839
5429a0517J8592K320N040j6835q525j692L739Q006n599K348M204j2144R372O157
5415D466Q218o146J2291l315q636M063k577J0888P654R231k0504j5413j3315j5582
5401b8677Q016J2315K260N914K422o155J0956J630O124L892n550p416l818p761
5387e848j1777j0309j694K965J2712p073o66J070M141o646r332k382K790K7134
5373d915K5642K760l320j1618J0829L105l152r2j5494j4926O908K867J6958J6333
5359C1885M032r176o545m277j1100j4180l217P864j574J0404N640J175m933N25
5345F523r636n419l4M05j3019j7736j5122N638L825P960J277J7413J5182r844
$$ plain form
5331 -12587 -22476 -30726 -15365 12652 25670 -3707 -22031 -12324 -17901 -19574 -10474 -17915 -9080
5318 -9080 8334 -10120 -23504 -15362 -5348 13490 13002 7233 8792 2024 9894 18619 29477 21951
5304 21951 4972 -1138 -2028 -4337 -4428 -2434 6024 16520 16394 356 -7880 5446 32220 28716
5290 28716 21763 16545 14433 7715 1428 -7659 3481 -669 6652 96 -21196 -32037 -32134 -24749
5276 -24749 -15994 7600 15388 17845 20228 581 -18720 -22910 -28419 -22444 -16768 -13940 -1532 4354
5262 4354 6681 18373 18617 2027 -5185 -6316 4249 -9388 -24623 -22471 -22813 -30427 -35254 -28706
5248 -28706 -19667 -17371 -8143 -4951 -5338 -9145 -12251 -17180 -7794 -17482 -28452 -24012 -19127 -31391
5234 -31391 -17290 -17765 -10694 5551 -6543 -10110 1285 6185 731 6678 9732 14933 531 -5963
$$ packed form
5331a2587r889q250J5361K8017J3018k9377j8324R707n577j673R100p441Q835
5318i080J7414j8454j3384Q142J0014J8838m88n769J559o768P870Q725J0858p526
5304B1951j6979o110q90k309r1J994Q458J0496j26j6038q236J3326K6774l504
5290B8716o953n218k112o718o287r087J1140m150P321o556k1292j0841r7P385
5276b4749Q755K3594P788K457K383j9647j9301m190n509N975N676K828J2408N886
5262D354K327J1692K44j6590p212j131J0565j3637j5235K152l42p614m827O548
5248b8706R039K296R228L192l87l807l106m929R386r688j0970M440M885j2264
5234c1391J4101m75P071J6245j2094l567J1395M900n454N947L054N201j4402o494
$$ plain form
5220 -5963 903 21600 28854 18458 732 -4191 9261 21235 10427 8722 -3245 -14565 -2481
5207 -2481 -1764 -10810 -6066 18055 33660 34394 25486 19036 13324 2363 -10360 -15739 -5077 5909
5193 5909 8207 7711 23980 38850 32743 26013 21626 16367 20931 34630 41286 36837 27752 -8605
5179 -8605 -21373 -16436 -8457 -25201 -24462 -18233 -14594 -19398 -3285 -1671 -11598 -17883 -23265 -16482
5165 -16482 -9022 -8532 -29311 -27326 -14481 -5938 -11913 -24980 -16515 -8891 -641 2136 -9612 -7420
5151 -7420 -2077 -12486 -28411 -27443 -27679 -24539 -15710 -15195 -28872 -9458 -15126 -30129 -17118 -27401
5137 -27401 -19514 -18085 3951 13907 21258 39764 37417 21529 6238 4619 17023 13550 10525
5124 10525 10345 6864 11085 6613 -12299 -6595 19723 27528 12636 14029 28449 25837 10359 3267
$$ packed form
5220e963O866K0697P254j0396j7726m923J3452J1974j0808j705j1967j1320J2084
5207b481P17r046M744K4121J5605P34q908o450n712j0961j2723n379J0662J0986
5193E909K298m96J6269J4870o107o730m387n259M564J3699O656m449r085l6357
5179h605j2768M937P979j6744P39O229L639m804J6113J614r927o285n382O783
5165a6482P460M90k0779J985J2845Q543n975j3067Q465P624Q250K777j1748K192
5151g420N343j0409j5925R68k36L140Q829N15j3677J9414n668j5003J3011j0283
5137b7401P887J429K2036R956P351J8506k347j5888j5291j619J2404l473l025
5124A0525j80l481M221m472j8912N704K6318P805j4892J393J4420k612j5478p092
$$ plain form
5110 3267 15886 15633 3634 -14063 -9141 -8720 -8381 -12218 6697 12786 17276 21147 14558 16524 20196
5095 20196 18033 20967 8492 6462 11169 -15556 -30700 -14047 2408 -15224 -35041 -31778 -36954
5082 -36954 -36126 -20710 -24710 -18193 -11043 -12926 -12125 -13688 -10756 -17307 -10978 10830 15437 23710 9257
5067 9257 -1269 -5614 -24350 -15105 8287 7751 946 -45 4864 9725 6887 -13575 -7655 12333
5053 12333 10894 -1900 -11963 -10618 559 -5567 6471 7656 12158 -2531 7833 16720 14694
5040 14694 3147 -15516 -7768 9462 19264 21279 24773 39609 30773 26172 28628 20366 6462
5027 6462 18318 9728 14969 12340 5281 -1974 -6665 -8192 -19262 -1229 29615 41921 55861
5014 55861 62229 45901 31688 22135 13970 15603 19214 5215 -9222 3121 15590 20444 17646
$$ packed form
5110C267J2619k53j1999j7697M922M21L39l837J8915O089M490L871o589J966L672
5095B0196k163K934j2475k030M707k6725j5144J6653J6455j7632j9817L263n176
5082c6954Q28J5416m000O517P150j883Q01j563K932o551O329K1808M607Q273j4453
5067I257j0526m345j8736R245K3392n36o805r91M909M861k838k0462N920J9988
5053A2333j439j2794j0063J345J1177o126J2038J185M502j4689J0364Q887k026
5040A4694j1547j8663P748J7230R802K015L494J4836q836m601K456q262j3904
5027F462J1856q590N241k629p059p255m691j527j1070J8033L0844J2306J3940
5014E5861O368j6328j4213r553q165J633L611j3999j4437J2343J2469M854k798
$$ plain form
5001 17646 5828 2338 -13407 -24662 -24345 -23206 1894 -2019 -19052 -28408 -14834 -14626 -8896 -485
4987 -485 16759 28064 30645 25524 22579 11911 6983 15458 25870 19241 8685 8325 10601 13167
4973 13167 14900 33544 30787 26037 15747 -5803 -9378 -17055 -30745 -20703 -13956 -13448 -17436 -27230
4959 -27230 -34260 -31012 -6196 7125 5557 -8523 -8985 -1436 18599 21938 23852 27379 19175 16545
4945 16545 7834 10140 5639 8640 1875 2248 13475 9852 3952 13399 13402 -90 124 -516 -5017 1036
4929 1036 3660 5340 -271 16746 20791 15733 13708 26698 26770 29740 26157 14853 2842 11472
4915 11472 29133 25420 15142 12588 9961 -8429 -1903 18664 19485 22501 19489 7371 -2717
4902 -2717 -2810 21270 23041 23836 10088 9439 18824 14158 2802 5066 14399 19703 15039 8740 4238
$$ packed form
5001A7646j1818l490j5745j1255L17J139K5100l913j7033r356J3574K08N730Q411
4987d85J7244J1305K581n121k945j0668m928Q475J0412o629j0556l60K276K566
4973A3167J733J8644k757m750j0290k1550l575p677j3690J0042O747N08l988r794
4959b7230p030L248K4816J3321j568j4080m62P549K0035L339J914L527q204k630
4945A6545q711K306m501L001o765L73J1227l623n900R447Lj3492K14o40m501O053
4929A036K624J680n611J7017M045n058k025J2990P2K970l583j1304j2011Q630
4915A1472J7661l713j0278k554k627j8390O526K0567Q21L016l012j2118j0088
4902b717r3K4080J771P95j3748o49R385m666j1356K264R333N304m664o299m502
$$ plain form
4887 4238 -1180 -11844 -24911 -30895 -30524 -13930 -16856 -14487 -9655 -14154 -12791 -1665 -3475 -4578
4873 -4578 -1845 10960 20066 14722 13461 -5873 -13548 -7274 -6650 -7615 1537 11441 -7688 -9505 -6330
4858 -6330 -10062 2084 14538 10043 6199 13635 3814 8906 -2310 -9143 -4230 3264 -2359 -1111
4844 -1111 6033 -1510 5235 -1168 3489 1161 476 5612 -10996 -14694 -5728 -5052 -7249 16076 40051
4829 40051 34201 21917 9061 -7839 -22056 -6564 -7214 -3769 -1897 -2254 18525 26866 34000 22579
4815 22579 16043 2644 -9110 -6134 -2569 7697 20767 27143 -1794 -21928 -21645 -6840 6733
4802 6733 4255 2005 -15594 -10699 -16382 -10931 -13013 -5677 -1968 1349 -6295 -22468 -12975 16885
4788 16885 27467 33220 30976 36132 19818 -2107 -17751 -10717 -3806 -2791 11413 13859 20530
$$ packed form
4887D238n418j0664j3067n984L71J6594k926K369M832m499J363J1126j810j103
4873d578K733J2805R106n344j261j9334p675O274O24r65R152R904j9129j817L175
4858f330l732J2146J2454m495l844P436r821N092j1216o833M913P494n623J248
4844a111P144p543O745o403M657k328o85N136j6608l698Q966O76k197K3325K3975
4829D0051n850j2284j2856j6900j4217J5492o50L445J872l57K0779Q341P134j1421
4815B2579o536j3399j1754K976L565J0266J3070O376k8937k0134K83J4805J3573
4802F733k478k250j7599M895n683N451k082P336L709L317p644j6173R493K9860
4788A6885J0582N753k244N156j6314k1925j5644P034O911J015J4204K446O671
$$ plain form
4775 20530 20156 30124 35797 28816 16912 778 3646 15151 27037 26865 13368 10498 8417 2701
4761 2701 -4947 -12658 -14020 -13707 -95 -2434 -3918 -6179 -5678 -7073 4430 3750 -5935 1072 -2861
4746 -2861 -14208 -25496 -24990 -8986 -2213 -10118 -7746 5084 7588 4177 1039 -12070 -17946 -22253
4732 -22253 -27159 -32666 -8928 -5615 2679 10060 15223 15982 26116 12391 25745 19278 7362 18941
4718 18941 35295 37466 34601 23139 17628 15658 15589 7760 4800 7801 7563 10227 12478 2337 -6483
4703 -6483 -15518 -17144 1164 3629 10117 13293 9784 -5790 -17463 -20962 -13042 541 3780 15745
4689 15745 28092 3721 -11414 -15458 -3709 24321 23119 17927 8014 -5859 -13297 -7895 -17666
4676 -17666 -21511 -11847 -12549 -11449 -5191 -1332 5027 -5174 -9045 2645 9946 6198 5872 -5577
$$ packed form
4775B0530l74R968N673o981j1904j6134K868J1505J1886j72j3497k870k081n716
4761B701p648p711j362L13J3612k339j484k261N01j395J1503o80r685P007l933
4746b861j1347j1288N06J6004O773p905K372J2830K504l411l138j3109n876m307
4732b2253m906n507K3738L313Q294P381N163P59J0134j3725J3354o467j1916J1579
4718A8941J6354K171k865j1462n511j970o9p829k960L001k38K664K251j0141q820
4703f483r035j626J8308K465O488L176l509j5574j1673l499P920J3583L239J1965
4689A5745J2347k4371j5135m044J1749K8030j202n192r913j3873p438N402r771
4676a7666l845R664p02J100O258L859O359j0201l871J1690P301l748l26j1449
$$ plain form
4662 -5577 -3582 -7968 -4593 14037 20445 16421 13221 15396 7201 16084 11729 4947 -3501 -3740 -2633
4647 -2633 -9420 2469 15807 23502 28464 32720 22095 12607 11926 -2742 -9508 -7264 15270 21625
4633 21625 16337 3188 21549 24004 20910 9983 20035 8732 10952 2716 -5401 -454 7946
4620 7946 11096 12738 17586 15454 7117 14781 5932 -4807 1485 12337 24468 33607 39300 29890
4606 29890 22915 21548 11493 1963 -3224 -9909 5417 13814 5129 -12880 -9746 -2484 -4069 -8736
4592 -8736 -8196 -6251 -15064 -25404 -19441 -15532 -25933 -26070 -6425 6499 3537 6738 21466 29112
4578 29112 24056 23985 14202 3602 -6477 6184 14594 -2606 -13110 8496 13134 7269 9861 7469
4564 7469 14435 15618 13309 12268 9949 22617 27069 15433 7214 12995 38523 18383 -378 6243
$$ packed form
4662e577J995m386L375J8630O408m024l200K175q195Q883m355o782q448k39J107
4647b633o787J1889J3338P695M962M256j0625r488o81j4668o766K244K2534O355
4633B1625n288j3149J8361K455l094j0927J0052j1303K220q236q117M947Q400
4620G946L150J642M848k132q337P664q849j0739O292J0852J2131R139N693r410
4606B9890o975j367j0055r530n187o685J5326Q397q685j8009L134P262j585m667
4592h736N40J945q813j0340N963L909j0401j37J9645J2924k962L201J4728P646
4578B9112n056p1r783j0600j0079J2661Q410j7200j0504K1606M638n865K592k392
4564G469O966J183k309j041k319J2668M452j1636q219N781K5528k0140j8761O621
$$ plain form
4550 6243 20305 29381 33014 29867 17248 -2325 -14708 3932 9631 14915 10719 4017 9069 18645
4536 18645 25236 17575 17864 23334 32956 31751 14922 10925 4778 -11032 -6048 -195 -709 -5831 -10607
4521 -10607 -16251 -9446 1195 5258 -11440 -27962 -14364 -13979 -1534 -9093 1133 -3867 -20092
4508 -20092 -17985 -4740 10358 20619 8502 5637 18885 13627 2386 2129 -15545 -18624 -6090
4495 -6090 1303 -4403 -12247 -7560 1387 -7870 -20616 -16038 -18272 -7946 6244 18387 22252 12447
4481 12447 -10477 -7673 -10084 -5295 11180 18584 4975 305 206 -15102 -20917 -34458 -31164 -15027
4467 -15027 -4831 9392 12244 -5290 -27080 -16263 -7392 -3792 -6984 -18452 -22679 -10966 -5234
4454 -5234 -5834 -15576 -16788 -28362 -25704 -18724 -8839 -8819 -10308 -4294 9991 12210 -2797 -6304 -3859
$$ packed form
4550F243J4062R076L633l147j2619j9573j2383J8640N699N284m196o702N052R576
4536A8645O591p661K89N470R622j205j6829l997o147j5810M984N853n14n122m776
4521a0607n644O805J0641M063j6698j6522J3598L85J2445p559J0226n000j6225
4508b0092K107J3245J5098J0261j2117k865J3248n258j1241k57j7674l079J2534
4495f090P393n706p844M687Q947r257j2746M578k234J0326J4190J2143L865r805
4481A2447k2924K804k411M789J6475P404j3609m670r9j5308n815j3541L294J6137
4467a5027J0196J4223K852j7534k1790J0817Q871L600l192j1468m227J1713N732
4454e234o00r742j212j1574K658O980R885K0j489O014J4285K219j5007l507K445
$$ plain form
4439 -3859 7329 10189 7494 -317 -6998 -14537 -25086 -14306 1669 -11224 -8320 -1517 12087
4426 12087 10874 10549 10999 1597 1881 10614 26896 13491 10414 19484 16977 4691 7636 12833 18869
4411 18869 16746 12709 16715 40837 38997 26960 18967 4363 -7785 -4451 1863 -11530 -7694
4398 -7694 -5465 12537 28430 31341 40786 30686 15600 2642 -3424 -1533 9479 3053 984
4385 984 -3571 3235 5403 12788 7 -16811 -10035 10143 21290 43097 27857 8566 11186
4372 11186 -9739 -11692 -5867 710 -3342 -9933 -14294 -19319 -16692 -925 5267 1154 -4724 -7952
4358 -7952 -23917 -25096 -17953 4948 36675 33587 23049 20080 6699 -395 -3360 981 -675 -13676
4344 -13676 -14983 1228 1091 6215 4466 -9283 -6332 12480 4063 -7079 -1949 -3713 -7825 -9338
$$ packed form
4439c859J1188K860k695p811o681p539j0549J0780J5975j2893K904O803J3604
4426A2087j213l25M50r402K84Q733J6282j3405l077R070k507j2286K945N197O036
4411A8869k123m037M006K4122j840j2037p993j4604j2148L334O314j3393L836
4398g694K229J8002J5893K911R445j0100j5086j2958o066J891J1012o426k069
4385I84m555O806K168P385j2781j6818O776K0178J1147K1807j5240j9291K620
4372A1186k0925j953N825O577m052o591m361n025K627J5767O192m113n878l228
4358g952j5965j179P143K2901L1727l088j0538k969j3381p094k965M341j656j3001
4344a3676j307J6211j37N124j749j3749K951J8812q417j1142N130j764m112j513
$$ plain form
4330 -9338 -4547 -21074 -32067 -20414 -6511 -1814 9678 13276 10420 16500 28708 16374 8618
4317 8618 -5957 -8600 -5129 -7130 -7631 -143 -8427 2184 6190 2592 -315 9296 24010 4690
4303 4690 5059 9843 -761 10863 15715 12915 -3644 -11041 -11289 -13505 -9269 -6087 -18892 -11963
4289 -11963 -16099 -313 -287 11666 14436 -949 -5065 -7065 -1402 -4364 -9815 -12643 -9890 -10121 -10732
4274 -10732 -17698 -13357 776 -7288 -27730 -17068 7685 17461 30981 23462 16259 15220 10839
4261 10839 970 -16746 -20441 -10301 -7591 -9051 -7265 -3142 -896 -3152 -2644 7213 1898 7191
4247 7191 14041 9933 10153 -1301 -5834 -6450 -3246 15862 22215 10906 -3414 8559 12398 -1642
4233 -1642 14480 18596 25074 36004 42591 35233 32291 14205 -7486 -1775 18864 -828 -21991
$$ packed form
4330i338M791j6527j0993J1653J3903M697J1492L598k856O080J2208j2334p756
4317H618j4575k643L471k001n01P488q284J0611M006l598k907R611J4714j9320
4303D690L69M784j0604J1624M852k800j6559p397k48k216M236L182j2805O929
4289a1963m136J5786K6J1953K770j5385m116k000N663k962n451k828K753k31o11
4274a0732o966M341J4133q064k0442J0662K4753R776J3520p519p203j039m381
4261A0839r869j7716l695J0140K710j460J786M123K246k256N08R857n315N293
4247G191O850m108K20j1454m533o16L204J9108O353j1309j4320J1973L839j4040
4233a642J6122M116O478J0930O587p358k942j8086k1691N711K0639j9692k1163
$$ plain form
4220 -21991 -29558 -34789 -35857 -20635 -6492 -12483 -1344 10420 8326 -2110 -21022 -8244 -4998
4207 -4998 -24622 -27880 -27891 -22354 -31816 -26931 -21227 -4916 6794 12495 9104 5500 -7231 -3726
4193 -3726 -2578 13349 29449 28309 11751 5177 9406 12951 13724 -1344 -21759 -27449 -12331 9173
4179 9173 19907 18967 6113 -10224 -7208 -13249 -10182 -3297 5010 11487 23571 37355 22675 18000
4165 18000 17791 -1784 -13826 -5245 -13515 3403 6703 364 7362 16429 8120 8475 3150 1403
4151 1403 -4436 15477 9848 -1503 -17685 -19346 260 3169 -11034 -15595 -14590 -20593 -21188 -22676
4137 -22676 -17793 -13425 -9652 -10387 -13143 -17436 -6921 -5948 17528 22883 28017 22988 6827 2733
4123 2733 9693 28241 31365 9460 -6015 -323 -4466 -2141 -6887 -4803 960 -6344 -10279 -17465
$$ packed form
4220b1991p567n231j068J5222J4143n991J1139J1764k094j0436j8912J2778L246
4207d998j9624l258j1N537r462M885N704J6311J1710N701l391l604j2731L505
4193c726J148J5927J6100j140j6558o574M229L545P73j5068k0415n690J5118K1504
4179I173J0734r40j2854j6337L016o041L067O885Q307O477J2084J3784j4680m675
4165A8000k09j9575j2042Q581q270J6918L300o339O998R067q309L55n325j747
4151A403n839J9913n629j1351j6182j661J9606K909j4203m561J005o003n95j488
4137b2676M883M368L773p35k756m293J0515R73K3476N355N134n029j6161m094
4123B733O960J8548L124k1905j5475N692m143K325m746K084N763p304l935p186
$$ plain form
4109 -17465 -10423 7772 12710 12012 16858 31306 26142 6355 -22682 -25883 -14666 -25305 -32198
4096 -32198 -35696 -32539 -25446 -7050 -2227 -4735 -13788 -19918 -24618 -10007 1281 2012 -1599 297
4082 297 3176 12316 28843 37301 35336 34917 21654 30188 27427 175 -7289 3292 1701 -2988
4068 -2988 -872 5116 -8461 -9175 -4271 9001 23374 9733 -13688 -9051 15727 11817 -943
4055 -943 -12008 -9935 -10366 -35120 -36873 -6561 11589 13829 11882 8169 -6282 -12713 -19732 -15554
4041 -15554 -1861 10794 9551 4584 9385 14202 22822 15637 19039 22349 17067 17940 12480 -6358
4027 -6358 -19881 -7190 2111 7946 1550 -669 9021 9915 -8770 -20568 -12835 -5782 -4278 -3919
4013 -3919 5341 -4830 3367 6079 -4307 -16931 -12904 6022 25485 37169 20783 4113 20305
$$ packed form
4109a7465P042J8195M938o98M846J4448n164j9787k9037l201J1217j0639o893
4096c2198l498L157P093J8396M823k508r053o130m700J4611J1288P31l611J896
4082B97K879R140J6527Q458j965m19j3263Q534k761k7252p464J0581j591m689
4068b988K116N988j3577p14M904J3272J4373j3641k3421M637K4778l910j2760
4055i43j1065K073m31k4754j753L0312J8150K240j947l713j4451o431p019M178
4041a5554J3693J2655j243m967M801M817Q620p185L402L310n282Q73n460j8838
4027f358j3523J2691R301N835o396k219R690Q94j8685j1798P733P053J504L59
4013c919R260j0171Q197K712j0386j2624M027J8926J9463J1684j6386j6670J6192
$$ plain form
4000 20305 27550 6705 -5553 -80 13254 10065 22266 30306 44499 33795 9394 -3497 -9586
3987 -9586 -8516 -7121 60 4850 8151 18044 23180 21799 9450 -5809 2793 2676 5836 14604 6514
3972 6514 -1130 19826 27028 8039 1859 8064 2796 1945 10287 15203 15658 19138 26895 31358 36404
3957 36404 28576 22185 2477 -12866 -5898 -1444 -521 7838 8519 4841 -2838 -8104 7242 5789
3943 5789 -6314 -21550 1727 22013 18523 4880 -4841 -13476 -7010 259 8235 6207 -1650 -3755
3929 -3755 -9403 -17168 -10720 -9289 2419 5080 -1416 8859 12004 21494 32761 22133 27013 32608
3915 32608 40066 37226 26585 6734 556 -14449 -12391 -1265 18269 13875 7782 -3564 -6245
3902 -6245 -2275 12877 8175 -17981 -23899 -14146 -24500 -20244 -25346 -24384 -25278 4157 13431 10450
$$ packed form
4000B0305P245k0845j2258N473J3334l189J2201Q040J4193j0704k4401j2891o089
3987i586J070J395P181M790L301R893N136j381j2349j5259Q602j17L160Q768q090
3972F514p644K0956P202j8989o180O205n268q51Q342M916M55L480P757M463N046
3957C6404p828o391j9708j5343O968M454R23Q359O81l678p679n266J5346j453
3943E789j2103j5236K3277K0286l490j3643r721q635O466P269P976k028p857k105
3929c755n648p765O448J431J1708K661o496J0275L145R490J1267j0628M880N595
3915C2608P458k840j0641j9851o178j5005K058J1126J9534m394o093j1346k681
3902f245L970J5152m702k6156n918R753j0354M256n102R62q94K9435R274k981
$$ plain form
3888 10450 19620 14472 10707 9850 24252 33572 18925 1211 -6397 -3146 -1086 -8734 -13104 -10921
3874 -10921 -12416 -9342 5518 11721 438 3267 4825 5514 811 2198 3831 -13961 -25888 -7681
3860 -7681 11564 17085 11862 -3249 -2894 -6275 -6117 957 -6787 -9041 -7097 6174 26540 19610
3846 19610 6453 -5094 -10530 -5068 -2401 -15200 -17580 -1748 4873 -10843 -3718 1279 4574
3833 4574 749 -10863 -10523 -21797 -14498 -8306 392 4594 1646 6754 11862 15161 18553 4375
3819 4375 627 11290 8156 2970 15224 21894 19717 12111 19734 20991 6761 13988 20149 36713
3805 36713 28672 17641 12520 22499 12332 8810 5395 -15376 -18298 -18665 -3146 -1271 3943 3442
3791 3442 -4220 7875 7788 3926 1733 -15799 -9991 9856 12840 5011 -1865 -5787 -6278 -7156 -5378
$$ packed form
3888A0450R170n148l765q57J4402R320j4647j7714p608L251K060p648m370K183
3874a0921j495L074J4860O203j1283K829J558O89m703J387J633j7792j1927J8207
3860g681J9245N521n223j5111L55l381J58P074p744k254J944J3271K0366o930
3846A9610j3157j1547n436N462K667j2799k380J5832O621j5716P125M997L295
3833D574l825j1612L40j1274P299O192Q698M202k948N108N108L299L392j4178
3819D375l748J0663l134n186J2254O670k177p606P623J257j4230P227O161J6564
3805C6713q041j1031n121R979j0167l522l415k0771k922l67J5519J875N214n01
3791C442p662J2095q7l862k193j7532N808J9847K984p829o876l922m91q78J778
$$ plain form
3776 -5378 -11057 -5340 -4565 3426 -611 1254 -13320 -13560 -409 2096 -7429 -15113 -3963 -4337 3969
3761 3969 -4980 -17454 -18566 -8909 2884 10191 -59 5817 4020 -1604 -6220 -3914 13632 27952
3747 27952 22773 7026 5365 -2823 -10838 -12479 -20909 -34677 -31209 -21572 -8179 11645 17065 4150
3733 4150 -3629 -6155 -875 730 15 9947 18707 15987 15451 18012 21574 26195 25730 29795 28803 14833
3717 14833 4495 702 8383 20470 19625 9585 7698 9095 16685 20351 15149 5703 15435 18234
3703 18234 -2939 -10856 -12334 -10991 4981 10452 -624 16762 22784 20275 22901 20643 15015 20525
3689 20525 32582 6795 1406 11837 3371 9867 38232 49069 34181 30556 30028 34071 23667
3676 23667 18100 15954 21090 27718 13574 4460 3434 14751 37123 45684 18699 4368 -11460
$$ packed form
3776e378n679N717P75P991m037J865j4574k40J3151K505r525p684J1150l74Q306
3761C969q949j2474j112R657J1793P307j0250N876j797n624m616K306J7546J4320
3747B7952n179j5747j661q188q015j641q430j3768L468R637J3393J9824N420j2915
3733D150p779k526N280J605p15R932Q760k720n36K561L562M621m65M065r92j3970
3717A4833j0338l793P681J2087q45j0040j887J397P590L666n202r446R732K799
3703A8234k1173p917j478J343J5972N471j1076J7386O022k509K626k258n628N510
3689B0525J2057k5787n389J0431q466O496K8365J0837j4888l625n28M043j0404
3676B3667n567k146N136O628j4144r114j026J1317K2372Q561k6985j4331j5828
$$ plain form
3663 -11460 -6990 -7827 1155 -13626 -12382 -6980 -6127 -6294 -5027 -10772 -15342 -15677 -23768 -28269 -26123
3648 -26123 -31754 -26480 -19672 -10534 -11983 522 10593 9094 19455 17637 9483 12445 16019 11117
3634 11117 14392 15254 21123 24004 11884 -9599 -3350 -4489 -10687 -4185 15279 1243 -1758 -4111
3620 -4111 -6426 -6556 630 1804 -3787 -980 2648 14630 11024 -5975 -5470 -16631 -26673 -3775
3606 -3775 22368 27278 13884 9383 11255 14161 10748 29570 23922 10273 9143 19717 21107 6561
3592 6561 -653 11903 15312 15549 7909 3009 807 -7466 -18779 -24586 -8850 -5244 -4135 -11714
3578 -11714 -5679 6027 5164 1326 10000 21497 207 -19859 -15778 -11725 -24315 -29384 -21582 -19538
3564 -19538 -24848 -13093 -6998 -1305 -1190 12912 25454 21606 25754 38006 36184 31029 34982 44366
$$ packed form
3663a1460M470q37Q982j4781J244N402Q53j67J267n745m570l35q091m501K146
3648b6123n631N274O808R138j449J2505J0071j499J0361j818q154K962L574m902
3634A1117L275Q62N869K881j2120k1483O249j139o198O502J9464j4036l001k353
3620d111k315j30P186J174n591K807L628J1982l606j6999N05j1161j0042K2898
3606c775K6143M910j3394m501J872K906l413J8822n648j3649j130J0574J390j4546
3592F561p214J2556L409K37p640m900k202q273j1313n807J5736L606J109p579
3578a1714O035J1706q63l838Q674J1497k1290k0066M081M053j2590n069P802K044
3564a9538n310J1755O095N693J15J4102J2542l848M148J2252j822n155L953R384
$$ plain form
3550 44366 44766 48362 56134 31252 27317 14264 -965 -13251 -19224 -3943 17231 -5764 -11151
3537 -11151 -1570 1473 7596 -6601 -16820 -34302 -32680 -12488 -6184 -3653 13648 22155 14061
3524 14061 -5507 -2895 12082 23594 23498 12781 7489 -913 13946 33979 29896 23061 25768 20943
3510 20943 4115 -7624 3701 20322 39578 43056 32519 26333 17937 27127 20155 16990 23007
3497 23007 10770 -443 -636 14286 29588 22602 1186 -8065 -3125 -5850 52 -874 8858 -1286
3483 -1286 -6893 1198 10346 26349 20519 6338 2694 -2004 7419 14318 6617 -2737 -6327 -5684 -1417
3468 -1417 278 7813 14060 17063 14184 26075 24611 16887 18591 28840 25280 25073 15126 273
3454 273 7123 12015 17679 16743 5541 4760 6290 9730 3659 -7904 -4780 1678 -3786 -20642 -22113
$$ packed form
3550D4366M00L596P772k4882l935j3053j5229j2286n973J5281K1174k2995n387
3537a1151R581L043O123j4197j0219j7482J622K0192O304K531J7301Q507q094
3524A4061j9568K612J4977J1512r6j0717n292q402J4859K0033m083o835K707m825
3510B0943j6828j1739J1325J6621J9256L478j0537o186q396R190o972l165O017
3497B3007j2237j1213j93J4922J5302o986k1416r251M940k725N902r26R732j0144
3483a286n607Q091R148J6003n830j4181l644m698R423O899p701r354l590O43M267
3468a417J695P535O247L003k879J1891j464p724J704J0249l560k07r947j4853
3454B73O850M892N664r36j1202p81J530L440o071j1563L124O458n464j6856j471
$$ plain form
3439 -22113 -11657 -530 6419 342 10610 15871 17019 -1575 -4578 1094 18947 25528 44810
3426 44810 44634 22082 11830 1658 915 -17595 -15219 -4500 -4597 -2954 24296 30469 28708 39846
3412 39846 28944 16410 10004 11707 20441 23868 4158 -10864 453 7955 19444 10199 10140 -4367
3398 -4367 -2067 -1619 1150 -11920 -25947 -9338 -9168 -21444 -16275 -8918 -6355 10079 21184 17897
3384 17897 8832 -166 219 10904 14232 1542 9581 24005 18967 30385 32274 18990 2323
3371 2323 -5635 -8480 10440 13476 16958 18138 8138 2346 -8734 1959 910 -2653 -15825 -14436
3357 -14436 3558 15180 11934 12279 7142 11295 8698 -5307 -13435 -11692 -10690 -11820 759 -1682
3343 -1682 -5248 -2377 -2509 -747 -10437 -7818 -2813 -18218 -16728 -9122 -7597 -7856 -16506 -5714 -11530
$$ packed form
3439b2113J0456J1127O949o077J0268N261J148j8594l003N672J7853O581J9282
3426D4810j76k2552j0252j0172p43j8510K376J0719r7J643K7250O173j761J1138
3412C9846j0902j2534o406J703Q734L427j9710j5022J1317P502J1489r245n9j4507
3398d367K300M48K769j3070j4027J6609J70j2276N169P357K563J6434J1105l287
3384A7897r065q998L85J0685L328j2690Q039J4424n038J1418J889j3284j6667
3371B323p958k845J8920L036L482J180j0000n792j1080J0693j049l563j3172J389
3357a4436J7994J1622l246L45n137M153k597j4005q128J743J002j130J2579k441
3343a682l566K871j32J762r690K619N005j5405J490P606J525k59q650J0792n816
$$ plain form
3328 -11530 -3773 -6433 -24242 -16773 -5930 6096 29146 32219 36535 28783 14614 -8319 7632
3315 7632 19641 31591 31399 20015 9598 14765 19166 24043 528 -12474 -8263 -25554 -23307
3302 -23307 -21944 -17058 -932 17507 22993 21525 17703 9234 13350 21691 35897 44689 49451 43570
3288 43570 33408 -112 -2815 -5064 -6161 6874 29216 17272 20760 18051 12678 4847 -997
3275 -997 4246 18863 29162 31132 27661 7669 13828 9988 14434 20120 10071 10704 30047 33055
3261 33055 8118 75 -5876 -19066 -18943 -9186 7663 11896 12175 7737 6115 -8351 -9407 -2748
3247 -2748 8616 21027 29461 34259 24050 15981 25339 2444 -14145 -12570 -10709 1694 -7454
3234 -7454 7614 13638 15210 9460 8550 10134 14330 20335 24967 15788 -37 -6615 9980 -1397
$$ packed form
3328a1530P757k660j7809P469J0843J2026K3050L073M316p752j4169k2933J5951
3315G632J2009J1950j92j1384j0417N167M401M877k3515j3002M211j7291K247
3302b3307J363M886J6126J8439N486j468l822q469M116Q341J4206Q792M762n881
3288D3570j0162l3520k703k249j097J3035K2342j1944L488k709n373p831n844
3275i97N243J4617J0299J970l471j9992O159l840M446N686j0049O33J9343L008
3261C3055k4937q043n951j3190J23R757J6849M233K79m438j622j4466j056O659
3247b748J1364J2411Q434M798j0209q069R358k2895j6589J575J861J2403r148
3234g454J5068O024J572n750r10J584M196O005M632r179j5825o578J6595j1377
$$ plain form
3220 -1397 -8311 -6054 -1941 10536 7760 12686 -2429 -2296 3301 -7789 -13122 -22030 -23074 -26250
3206 -26250 -21123 -13561 -3529 7523 -3736 -3908 1428 -4674 -1976 8103 7863 3729 -5820 9438
3192 9438 6431 6110 3077 -4048 -6854 253 21099 23683 17833 12401 -1032 8855 20069 10281
3178 10281 18257 18079 -2871 -7711 8859 12081 4270 -2164 8425 12854 9556 2871 6418 11263
3164 11263 14426 16162 6802 -5974 -9908 -16503 -8965 6680 4654 4912 7303 705 -15617 -23064
3150 -23064 -4301 19859 22541 7722 86 -5922 -2715 -9578 -12571 -8231 -3642 -9058 -1561 -1311
3136 -1311 6790 6388 16545 13466 8971 -4029 -12954 -25205 -20242 2246 1158 -6929 -13693 -2479
3122 -2479 7005 -218 14 7316 24164 23445 8791 3295 1209 -6810 -15984 -18808 -7598 -11147 -2081
$$ packed form
3220a397o914K257M113J2477k776M926j5115J33N597j1090n333q908j044l176
3206b6250N127P562J0032J1052j1259j72N336o102K698J0079k40m134r549J5258
3192I438l007l21l033p125k806P107K0846K584n850n432j3433R887J1214r788
3178A0281P976j78k0950m840J6570L222p811o434J0589M429l298o685L547M845
3164A1263L163J736r360j2776l934o595P538J5645k026K58K391o598j6322p447
3150b3064J8763K4160K682j4819p636o008L207o863k993M340M589n416P497K50
3136a311Q101m02J0157l079m495j3000q925j2251M963K2488j088q087o764J1214
3122b479R484p223K32P302J6848p19j4654n496k086q019r174k824J1210l549R066
$$ plain form
3107 -2081 8884 4563 8343 -2829 -10509 -12243 -11302 7323 9740 15353 15590 13369 24122 16254
3093 16254 19870 17535 -4235 -17980 -12913 -15141 -11442 -15517 -17546 -22490 -10978 -6580 1597 4657
3079 4657 -5029 -12144 -3457 -8664 -22493 -25120 -11012 12506 24233 13193 18324 9824 -367
3066 -367 -9091 -1079 2947 6903 2353 -1444 -5577 8911 3033 5692 9494 25092 34448 25224 12329
3051 12329 10185 20635 24128 16060 7817 -501 -5560 -16173 -18060 -9546 -6088 1365 3810 6238
3037 6238 8635 -13329 -18043 -5441 3988 18104 25011 15289 -7982 -6268 6888 22964 36013
3024 36013 31668 36765 40201 18803 -17098 -7296 469 21 8661 5084 7551 1618 -812 -3705
3010 -3705 -3507 1196 3154 8259 9319 3317 -2134 5483 -1281 -15425 -553 17073 20993 29648
$$ packed form
3107b081J0965m321L780j1172p680j734R41J8625K417N613K37k221J0753p868
3093A6254L616k335k1770j3745N067k228L699m075k029m944J1512M398Q177L060
3079D657r686p115Q687n207j3829k627J4108K3518J1727j1040N131q500j0191
3066c67q724Q012M026L956m550l797m133J4488n878K659L802J5598R356r224j2895
3051A2329k144J0450L493q068q243q318n059j0613j887Q514L458P453K445K428
3037F238K397k1964m714J2602R429J4116O907r722k3271J714J3156J6076J3049
3024C6013m345N097L436k1398l5901R802P765m48Q640l577K467n933k430k893
3010c705J98M703J958N105J060o002n451P617o764j4144J4872J7626L920Q655
$$ plain form
2996 29648 31659 22310 4295 -2001 5829 2701 -4155 13467 8564 -4706 -10183 -15940 -24270 -10720
2982 -10720 15689 8029 -2673 6552 9961 2111 1029 2854 19805 19143 8735 20867 25169 18645
2968 18645 -13256 -15877 2834 23785 28039 18377 19319 33124 45666 27564 6375 23524 28816
2955 28816 6425 -588 5909 8602 13490 -5181 -960 14847 16654 18412 19847 9638 4644 -13072
2941 -13072 -2305 5233 45 1113 1782 -539 13366 18093 15154 15858 18549 11781 13752 237
2927 237 -12446 -10079 -2841 -10072 -10645 -2940 -4977 -3726 -18795 -14330 -15806 7717 15497 11229 16771
2912 16771 18509 16459 1307 -9 -6558 -2908 6895 8191 12817 1382 13153 -3270 -30251
2899 -30251 -18634 -11990 -3691 3385 -197 -7986 -2611 10120 1490 -7536 -1462 13771 6564 -9031
$$ packed form
2996B9648K011r349j8015o296P830l128o856J7622m903j3270n477n757q330J3550
2982a0720K6409p660j0702R225L409p850j082J825J6951o62j0408J2132M302o524
2968A8645l1901k621J8711K0951M254r662R42J3805J2542j8102k1189J7149N292
2955B8816k2391p013O497K693M888j8671M221J5807J807J758J435j0209m994j7716
2941a3072J0767P538n188J068O69k321J3905M727k939P04K691o768J971j3515
2927B37j2683K367P238p231n73P705k037J251j5069M465j476K3523P780m268N542
2912A6771J738k050j5152j316o549L650R803J296M626j1435J1771j6423k6981
2899c0251J1617O644Q299P076l582p789N375J2731q630r026O074J5233p207j5595
$$ plain form
2885 -9031 -12756 -16871 -14962 -5239 2170 7909 7839 13432 12420 10597 5588 16308 25132 15849 5945
2870 5945 3881 -8401 -10291 -6764 -10468 -13225 -20601 -13917 -9604 -2674 406 17741 25860 8583
2856 8583 -6164 -29425 -26470 -4945 -1641 -12926 -13995 -2152 -11137 -17066 -6783 -5241 -1649
2843 -1649 3458 10666 2733 -1973 -2568 15081 18111 24125 13373 7026 4662 13461 11556 4857 24302
2828 24302 31862 20766 8053 -8774 -17455 7901 21018 12175 -8042 -13131 -23144 -17626 -7796
2815 -7796 3731 19881 24621 19685 5132 -13550 -13692 -8263 13536 24526 -2699 -5799 13700
2802 13700 15729 -5771 961 14995 5738 -4031 2222 -1729 8618 8922 3828 -12749 -2847 5411
2788 5411 11887 17581 11778 -7072 -1916 9263 6243 -1066 2013 6106 28285 31625 13150 -2437
$$ packed form
2885i031l725m115J909R723P409N739p0N593j012j823n009J0720Q824r283r904
2870E945k064j2282j890L527l704k757p376O684M313O930L080J7335Q119j7277
2856H583j4747k3261K955K1525L304j1285j069J1843q985n929J0283J542L592
2843a649N107P208p933m706n95J7649L030O014j0752o347k364Q799j905o699J9445
2828B4302P560j1096j2713j6827q681K5356J3117q843k0217n089j0013N518R830
2815g796J1527J6150M740m936j4553j8682j42N429K1799J0990k7225l100J9499
2802A3700K029k1500O732J4034r257r769O253l951J0347L04n094j6577R902Q258
2788E411O476N694n803j8850N156J1179l020p309L079M093K2179L340j8475j5587
$$ plain form
2774 -2437 3468 3657 3761 17575 35182 39792 24477 21959 12265 19386 34801 28390 24553 30863
2760 30863 20792 19692 11578 2764 18199 24939 15960 27274 39214 36082 24113 12801 -2643
2747 -2643 6468 3338 205 -3099 -6655 9496 21177 13785 15837 17892 4202 -10352 -2980 -443
2733 -443 -4301 -6531 -15436 -23893 -13460 8915 13106 7415 -7900 2830 3786 -5119 -20637 -18676
2719 -18676 -21406 -12087 3919 8016 -651 8587 13608 32815 28819 20123 10334 1283 -9952 5639
2705 5639 15746 35642 38458 24837 23000 12244 14091 11463 -24 4245 13844 17197 15496 11479
2691 11479 10281 3332 1130 -9319 -9081 -11246 -23629 -24582 -15682 8123 18763 26831 30815 24922
2677 24922 21115 27310 41787 42233 25666 20040 21505 20893 18987 18939 13291 10324 -2250 -13762 -12958
$$ packed form
2774b437N905J89J04J3814J7607M610j5315k518r694P121J5415o411l837O310
2760C0863j0071j100q114q814J5435O740q979J1314J1940l132j1969j1312j5444
2747b643R111l130l133l304l556J6151J1681p392K052K055j3690j4554P372K537
2733d43l858k230q905q457J0433K2375M191n691j5315J0730R56q905j5518J961
2719a8676k730R319J6006M097q667R238N021J9207l996q696r789r051j1235J5591
2705E639J0107J9896K816j3621j837j0756J847k628j1487M269R599L353j701m017
2691A1479j198o949k202j0449K38k165j2383r53Q900K3805J0640Q068L984n893
2677B4922l807O195J4477M46j6567n626J465o12j906m8n648k967j2574j1512Q04
$$ plain form
2662 -12958 -10741 -15493 -15748 -2999 2199 -2771 -5436 267 7429 30701 27520 12499 6545 3877
2648 3877 15983 24486 9240 13277 2743 -7041 587 -4522 -16635 -19748 -20465 -22489 -17869 -9807
2634 -9807 -10186 -10833 -32890 -41503 -24185 -12730 -3318 6301 14167 8753 17663 12847 5840 -1857 5375
2619 5375 19085 25554 29247 44414 30095 12816 4599 -5030 -5435 7028 14687 18116 16063 9903
2605 9903 10103 11238 -5947 -24667 -12472 -15851 -13276 -4117 3578 9633 8976 -717 -7538 5749
2591 5749 14308 6588 9425 7831 8257 13392 20969 18756 23674 12838 10764 4626 16807 26504 27304
2576 27304 28139 30940 24941 21184 21524 15397 9195 19461 8442 1207 14443 8546 15855 16259 9409
$$ packed form
2662a2958K217m752k55J2749N198m970k665N703P162K3272l181j5021n954k668
2648C877J2106Q503j5246M037j0534r784P628n109j2113l113p17k024M620Q062
2634i807l79o47k2057q613J7318J1455R412R619P866n414Q910m816p007p697P232
2619E375J3710O469L693J5167j4319j7279q217r629m05J2463P659L429k053o160
2605I903K00J135j7185j8720J2195l379K575R159P695O055o57r693o821J3287
2591E749Q559p720K837j594M26N135P577k213M918j0836k074o138J2181R697Q00
2576B7304Q35K801n999l757L40o127o202J0266j1019p235J3236n897P309M04o850
$$ [...]
##END NTUPLES=NMR SPECTRUM
##END=
