##TITLE=Analysis number 314054
Compound Code btb 10252
Book Reference 2
Project Code adrs
Chemist Name fudan
##JCAMPDX= 6.0         $$ Bruker NMR JCAMP-DX V2.0
##DATA TYPE= NMR SPECTRUM
##DATA CLASS= NTUPLES
##ORIGIN= Bruker BioSpin GmbH
##OWNER= NMR
$$ XWIN-NMR		Version 3.5
$$ Tue Oct  4 11:05:25 2005 GMT Daylight Time (UT+1h)  MAYBRIDGE\NMR@NMR_250MHZ
##.OBSERVE FREQUENCY= 250.131544655141
##.OBSERVE NUCLEUS= ^1H
##.ACQUISITION MODE= SIMULTANEOUS (DQD)
##.ACQUISITION SCHEME= undefined
##.AVERAGES= 16
##.DIGITISER RES= 18
##SPECTROMETER/DATA SYSTEM= dpx250
##.PULSE SEQUENCE= zg30
##.SOLVENT NAME= DMSO
##.SHIFT REFERENCE= (INTERNAL, DMSO, 0, 16.5194)
##AUDIT TRAIL= $$ (NUMBER, WHEN, WHO, WHERE, WHAT)
$$ ##TITLE= Audit trail, XWIN-NMR		Version 3.5
$$ ##JCAMPDX= 5.01
$$ ##ORIGIN= Bruker BioSpin GmbH
$$ ##OWNER= NMR
$$ C:\u/data/dgb/nmr/ADRS/10310/pdata/1/auditp.txt
$$ ##AUDIT TRAIL=  $$ (NUMBER, WHEN, WHO, WHERE, WHAT)
(   1,<2005-10-04 11:05:06.60 +100>,<MAYBRIDGE\NMR>,<NMR_250MHZ>,
      <created by zg, POWCHK disabled, PULCHK disabled
       configuration hash MD5:
       62 19 C7 07 E1 42 D1 B7 37 6C 3D D0 77 39 F9 E6
       data hash MD5: 64K
       09 41 FB 8F 37 69 16 B4 38 3C 3B F7 A9 73 23 42>)
(   2,<2005-10-04 11:05:17.41 +100>,<MAYBRIDGE\NMR>,<NMR_250MHZ>,
      <Start of raw data processing
       ef LB = 0.3 FT_mod = 6 PKNL = 1 SI = 32K 
       data hash MD5: 32K
       76 EC 3B 3B 49 A1 0D 14 C8 75 7F 6B 89 1B 59 E9>)
(   3,<2005-10-04 11:05:19.26 +100>,<MAYBRIDGE\NMR>,<NMR_250MHZ>,
      <apk 
       data hash MD5: 32K
       0B DE 70 0C E1 39 A5 F7 FD 29 B6 8D C3 7B 21 06>)
(   4,<2005-10-04 11:05:19.95 +100>,<MAYBRIDGE\NMR>,<NMR_250MHZ>,
      <abs ABSG = 5 
       data hash MD5: 32K
       AB 35 3E D2 94 E6 63 1E C6 F2 A6 CB 53 68 FA 75>)
$$ ##END=
$$ 
$$ hash MD5
$$ 56 D7 56 B9 49 42 F3 B2 38 9E 25 4E CF 06 C3 74
##$RELAX= 
##$RELAX= 
##$RELAX= 
##$RELAX= 
##$RELAX= 
##$RELAX= 
##$RELAX= 
$$ Bruker specific parameters
$$ --------------------------
##$DU= <C:\u>
##$EXPNO= 10310
##$NAME= <ADRS>
##$PROCNO= 1
##$TYPE= <nmr>
##$USER= <dgb>
##$AMP= (0..31)
100 100 100 100 100 100 100 100 100 100 100 100 100 100 100 100 100 100 
100 100 100 100 100 100 100 100 100 100 100 100 100 100 
##$AQSEQ= 0
##$AQ_mod= 3
##$AUNM= <au_zg>
##$AUTOPOS= <17 >
##$BF1= 250.13
##$BF2= 250.13
##$BF3= 250.13
##$BF4= 250.13
##$BF5= 500.13
##$BF6= 500.13
##$BF7= 500.13
##$BF8= 500.13
##$BYTORDA= 1
##$CFDGTYP= 0
##$CFRGTYP= 5
##$CHEMSTR= <none>
##$CNST= (0..31)
1 1 145 1 1 1 1 1 1 1 1 1 1 1 1 1 1 1 1 1 1 1 1 1 1 1 1 1 1 1 1 1 
##$CPDPRG= <>
##$CPDPRG1= <>
##$CPDPRG2= <>
##$CPDPRG3= <>
##$CPDPRG4= <mlev>
##$CPDPRG5= <mlev>
##$CPDPRG6= <mlev>
##$CPDPRG7= <mlev>
##$CPDPRG8= <mlev>
##$CPDPRGB= <>
##$CPDPRGT= <>
##$D= (0..31)
0 1 0 0 0 0 0 0 0 0.06 0 0 0 0 0 0 0.0002 0 0 0 0 0 0 0 0 0 0 0 0 0 0 
0 
##$DATE= 1128420305
##$DBL= (0..7)
120 120 120 120 120 120 120 120 
##$DBP= (0..7)
150 150 150 150 150 150 150 150 
##$DBP07= 0
##$DBPNAM0= <>
##$DBPNAM1= <>
$$ [...]
##$SUBNAM7= <"">
##$SUBNAM8= <"">
##$SUBNAM9= <"">
##$SW= 20.6930455092707
##$SWIBOX= (0..15)
0 0 3 0 0 0 0 0 0 0 0 0 0 0 0 0 
##$SW_h= 5175.983436853
##$TD= 65536
##$TD0= 1
##$TE= 296.16
##$TE2= 300
##$TE3= 300
##$TEG= 300
##$TL= (0..7)
0 120 120 120 120 120 120 120 
##$TP= (0..7)
150 150 150 150 150 150 150 150 
##$TP07= 0
##$TPNAME0= <>
##$TPNAME1= <>
##$TPNAME2= <>
##$TPNAME3= <>
##$TPNAME4= <>
##$TPNAME5= <>
##$TPNAME6= <>
##$TPNAME7= <>
##$TPOAL= (0..7)
0.5 0.5 0.5 0.5 0.5 0.5 0.5 0.5 
##$TPOFFS= (0..7)
0 0 0 0 0 0 0 0 
##$TUNHIN= 0
##$TUNHOUT= 0
##$TUNXOUT= 0
##$USERA1= <user>
##$USERA2= <user>
##$USERA3= <user>
##$USERA4= <user>
##$USERA5= <user>
##$V9= 5
##$VALIST= <valist>
##$VCLIST= <CCCCCCCCCCCCCCC>
##$VD= 0
##$VDLIST= <DDDDDDDDDDDDDDD>
##$VPLIST= <PPPPPPPPPPPPPPP>
##$VTLIST= <TTTTTTTTTTTTTTT>
##$WBST= 1024
##$WBSW= 4
##$XGAIN= (0..3)
0 0 0 0 
##$XL= 0
##$YL= 0
##$YMAX_a= 328551
##$YMIN_a= -345685
##$ZGOPTNS= <>
##$ZL1= 120
##$ZL2= 120
##$ZL3= 120
##$ZL4= 120
##$ABSF1= 16.51945
##$ABSF2= -4.173723
##$ABSG= 5
##$ABSL= 3
##$ALPHA= 0
##$AQORDER= 0
##$ASSFAC= 0
##$ASSFACI= 0
##$ASSFACX= 0
##$ASSWID= 0
##$AUNMP= <proc_1d>
##$AZFE= 0.1
##$AZFW= 0.1
##$BCFW= 0
##$BC_mod= 0
##$BYTORDP= 0
##$COROFFS= 0
##$CY= 12.5
##$DATMOD= 1
##$DC= 0
##$DFILT= <>
##$DTYPP= 0
##$F1P= 14.0000005364418
##$F2P= -0.99999901652339
##$FCOR= 0.5
##$FTSIZE= 32768
##$FT_mod= 6
##$GAMMA= 0
##$GB= 0
##$INTBC= 1
##$INTSCL= 1
##$ISEN= 128
##$LB= 0.3
##$LEV0= 0
##$LPBIN= 0
##$MAXI= 10000
##$MC2= 0
##$MEAN= 0
##$ME_mod= 0
##$MI= 0
##$NCOEF= 0
##$NC_proc= -2
##$NLEV= 6
##$NOISF1= 0
##$NOISF2= 0
##$NSP= 0
##$NTH_PI= 0
##$NZP= 0
##$OFFSET= 16.51945
##$PC= 1
##$PHC0= -71.18972
##$PHC1= 19.496
##$PH_mod= 1
##$PKNL= yes
##$PPARMOD= 0
##$PSCAL= 4
##$PSIGN= 0
##$REVERSE= no
##$SF= 250.130000635885
##$SI= 32768
##$SIGF1= 0
##$SIGF2= 0
##$SINO= 400
##$SIOLD= 32768
##$SREGLST= <1H.DMSO>
##$SSB= 0
##$STSI= 32768
##$STSR= 0
##$SW_p= 5175.98343685301
##$SYMM= 0
##$S_DEV= 0
##$TDeff= 65536
##$TDoff= 0
##$TI= <Analysis number 999999
Compound Code 99
Book Reference 9
Project Code 9>
##$TILT= no
##$TM1= 0
##$TM2= 0
##$TOPLEV= 0
##$USERP1= <user>
##$USERP2= <user>
##$USERP3= <user>
##$USERP4= <user>
##$USERP5= <user>
##$WDW= 1
##$XDIM= 32768
##$YMAX_p= 384878915
##$YMIN_p= -562124
$$ End of Bruker specific parameters
$$ ---------------------------------
##NTUPLES= NMR SPECTRUM
##VAR_NAME=  FREQUENCY,     SPECTRUM/REAL,   SPECTRUM/IMAG
##SYMBOL=    X,             R,               I
##VAR_TYPE=  INDEPENDENT,   DEPENDENT,       DEPENDENT
##VAR_FORM=  AFFN,          ASDF,            ASDF
##VAR_DIM=   32768,         32768,           32768
##UNITS=     HZ,            ARBITRARY UNITS, ARBITRARY UNITS
##FACTOR=    0.157963299565203, 1,           1
##FIRST=     4132.00984740709, 0,            0
##LAST=      -1043.97358944592, 0,           0
##MIN=       -1043.97358944592, -562124,     0
##MAX=       4132.00984740709, 384878915,    0
$$ Real data points
##PAGE= N=1
##DATA TABLE= (X++(R..R)), XYDATA
$$ [...]
16825d3892m643K5513K1290r720r283r347J4598j087m31P225q665m512K3840J2774
16811A3660J48p323L668R437p613j131J2159j0688J724j3059L731j2131R557q154
16797f015j6037J935j1777k02K7464J7104Q826J3161J4090l2318l3416p632m332
16784b9149L651P336J7448J9127j9941j3185J5618K6394K738N070j8293j2801
16772D013K516J1657j1772M651P939n48k6779p202J855J3107k621j7135K2148
16759A829J8990o165j4114r205j190r458J8541O381L1J3636p270j2394q189k7013
16745c5590l198J1935J1017J1122R888J4369N951j1721k1276j0455K235J6848
16733A125l470j7068j0661j6384r199k363Q968O326J9104J2341J2090j7038l372
$$ y = [-43892, -48535, -23022, -1732, -11452, -20735, -30082, -15484, -16571, -17002, -9777, -18442, -22954, 886, 13660, 13808, 6485, 10153, 19590, 11977, 10846, 23005, 12317, 14041, 982, 4713, -7418, 2139, -6015, -22052, -20117, -31894, -32096, -4632, 12472, 21298, 34459, 48549, 16231, -17185, -24817, -29149, -25498, -18162, -714, 18413, -1528, -14713, 905, 27299, 30037, 35107, 16814, 4013, 6529, 18186, 6414, 11065, 19004, 18456, -8323, -15525, -13670, -563, -3184, -20319, 1829, 20819, 14654, 540, -8665, -9855, -19313, -772, 5609, 5640, 19276, 12006, -388, -8577, -35590, -38788, -26853, -15836, -4714, 5174, 19543, 25494, 13773, -7503, -17958, -15723, 1125, -2345, -19413, -30074, -46458, -55657, -58020, -49052, -42726, -23622, -11281, 809, -16229, -19601]
16720a9601J5996j6530k6105J5377J1850R323n428j7051K686o772o571j7037K4151
16707c5712K4608J4747R576q694k1934m810K7891j811j7539l7482j9611J2039
16695e8732K7968J1449m002N556l378N607J2646n778r052n97K5627J3441Q593
16682B9348j9091j3376j3640j0136R898K9701J5144L281r016j3965q900M98L616
16669C362p764J354J7924J2467k175k7031n744j3739k2500j0146J3427J0284J9065
16656a1216o101J2920k2561l718K0766J0984j7380m491J0189L3277J5660n032
16644C3297k5350P722j1754N64N232K0M294j1477q13k2218j1411J4426K6301J4158
16630B2991J675l0463j5297Q978L0933J903J465j702j4144k414k413j4113k7505
$$ y = [-19601, -3605, -20135, -46240, -30863, -19013, -9690, -15118, -32169, -29483, -36255, -42826, -59863, -35712, -11104, 3643, 13219, 4525, -17409, -22219, 5672, 3861, -13678, -51160, -70771, -58732, -30764, -19315, -23317, -17761, -21139, -15532, -2886, -8664, -17716, -18313, 7314, 20755, 29348, 10257, -3119, -16759, -26895, -16997, 12704, 27848, 31129, 22113, 8148, -752, -254, 3362, -4402, -3048, 14876, 27343, 25168, -1863, -7607, -21346, -43846, -53992, -40565, -30281, -11216, -17317, -4397, -26958, -30676, -9910, 1074, -16306, -20797, -10608, 22669, 38329, 33297, 7947, 15669, 3915, 4479, 9711, 9731, 14025, 2548, 1735, -20483, -31894, -17468, 8833, 22991, 24666, -5797, -21094, -12116, 18817, 20720, 22185, 20483, 6339, 3925, 1512, -12601, -40106]
16617d0106n862O442K2813k5k818K191J2939q460m803J7797J9218j4675M392j700
16603G343k7611j3175K0111R76O719p873j9201j3460K1401J7298n7J3036j275
16590D232J1409J246j1970J0861j834l829j1482O13P354N072o684Q07K1667K2798
16576E0260j9912k9787j8407L997k496J966k741J2221M713j1847J3016k897l135
16563e049M38j593N345m985R072j5938J859R72J8166J3962J71n096j2286J0208
16549A5246l164j0509n507j605j6811p694K0119P447j0731k7067K849J5892P807
16536a3728r565j104j2846J6120R687M451R642k869J0083r657r013K344P938Q319
16522I802O477L212k3072j3950M586J546L340j8214Q755L1994K4566p181r893
$$ y = [-40106, -45968, -39526, -16713, -16738, -19556, -17365, -4426, -12886, -17689, 108, 19326, 4651, 9043, 7343, -20268, -33443, -13332, -12356, -5637, -13510, -32711, -46171, -24770, -7472, -7529, 5507, 4232, 15641, 16887, 4917, 15778, 13944, 10115, -1367, -754, 6600, 11672, 4988, 5795, 27462, 50260, 30348, 561, -17846, -13849, -16345, -14379, -17120, -4899, -186, -12033, 983, -1914, -5049, -4611, -6204, -859, -5844, 3228, -12710, -10851, -9879, 8287, 22249, 22420, 17324, 5038, 15246, 12082, 1573, -3934, -5539, -22350, -30044, -9925, -2478, -13209, -40276, -37427, -21535, -13728, -23293, -24397, -37243, -21123, -11436, -6985, 2657, -212, 9871, 214, -8799, -6455, 1483, 9802, 16279, 19491, -3581, -17531, -12945, -11399, -8059, -26273, -17518, 14476, 39042, 31861, 21968]
16509B1968K134p19n281j2241O311J2328p882j4874k876J3467k0525L686K5945
16496B1441k0237M044K8599K063j6200p977Q95j0596Q7m683M160M149J121j6465
16482i599k334K8029n206j4097j7400l449n656O770K8710K0454l713l027j817
16469A7665k6550q653M60R832J2196j5153q606Q475j163J0883N233J880j2860
16456f361M454J1216J9509J070k1069l455K618j0652J478j997j1215P969P475
16443A040J7477K846j9823j8270P860J418O276L550k3483r886N02R322j3029j5448
16429d9648K1338J8435l702L831j907O955j773q111j9636J5321J658j5104J5572
16416a6771O791p790k6395K0732L9703N778j2908q974P826K089q222j072J0913
$$ y = [21968, 24102, 23383, 18102, 5861, 12172, 24500, 16618, 1744, -1132, 12335, -8190, -4504, 21441, 1204, 5248, 33847, 35910, 19710, 11733, 12628, 2032, 2119, -2564, 1596, 5745, 6866, -9599, -11933, 16096, 10890, -3207, -20607, -24056, -29712, -22942, 5768, 26222, 22509, 19482, 17665, -8885, -17538, -17078, -7246, 4950, -10203, -18809, -10334, -11497, -614, 4619, 6499, -6361, -1907, 9309, 28818, 29888, 8819, 5364, 7982, -2670, -1192, -3189, -14404, -6435, 1040, 18517, 21363, 1540, -16730, -8870, -7452, -1176, 2374, -21109, -30995, -30493, -21171, -34200, -49648, -28310, -9875, -13577, -9746, -11653, -4698, -6471, -14582, -34218, -18897, -17239, -32343, -16771, -9980, -17770, -44165, -23433, 16270, 22048, 9140, 166, 7992, 10081, 1859, 787, 11700]
16403A1700O886j7277k361J5791j554k0225r565K1444N136q688j9889q528Q515
16390a8615K5856O156o385k385j5717J4894k6994o597K4430O991J868k879L074
16377C697j8980J0637M869k5992N189L7084R055j2486k3456o331J6033L289j564
16364A044L672n482J6382j0340j4508p833K3059j465J2027j4343k1569K129N154
16351a2073K0194j5517k5532j3319K5058O097q928r782J7854K4637l857k5440
16339b0608k0677J3115J2398k32K4477q672o804R88j955j7203R258P164n674R602
16325d823n862J5998R327n319j0506r157j3446J629K1811J4092l281L690j352
16312A2801k8111k672J4616o72j0458j06o777K4965Q978p776j4035k4959j568
$$ y = [11700, 18586, 1309, -1052, 14739, 13185, -7040, -16605, 4839, 9975, 1287, -18602, -27130, -18615, 7241, 13397, 7012, 4627, -11090, 3804, -23190, -29787, -5357, 1634, 3502, 623, 3697, -15283, -4646, 223, -25769, -20580, 16504, 25559, 13073, -10383, -16714, -681, 2608, 1044, 4716, -766, 15616, 5276, -9232, -17065, 5994, 4529, 16556, 2213, -19356, -17227, -12073, 8121, -7396, -32928, -46247, -21189, -15092, -24020, -33802, -15948, 8689, 4832, -20608, -41285, -28170, -15772, -16004, 8473, -199, -7003, -6015, -7970, -25173, -15915, -8751, -14425, -4823, -10685, 5313, 14640, 9321, -1185, -10342, -23788, -22159, -348, 13744, 10463, 14153, 12801, -15310, -17982, -3366, -4038, -14496, -14602, -21379, 3586, 12564, 4788, -9247, -34206, -35774]
16299c5774o495J6417J3279j1148J0776m267O455O513K587m141j1288j7550k309
16286c6945O208N916j6281K683R110j0612k767J4591M878l020n537l10P606L213
16272b1267J0867L652r039J4777n699L119J3422J8800r651l7278k745o212k8389
16259e5643R351L1317P484M233R24k2876K604J1634o894j0873j6838J1282J6808
16246a7487N177r649K5682j9395J2760J452r561j1831q531M835K2432M006j8361
16233a8471K144j2047Q242K627K384J6163j8238n881P562K183K1347K9600k5739
16220A1876j8855L775K832m434R66k0994K4326R874j0812j2183O18K5544q897
16207C636l699R14J756k1569j4373O596O143J8605J4161K326n034j3345J5992
$$ y = [-35774, -42269, -25852, -12573, -23721, -12945, -17212, -10757, -4244, -1657, -5798, -17086, -34636, -36945, -30737, -24821, -41102, -38419, -29309, -39921, -42688, -28097, -23219, -26239, -31776, -32086, -24480, -21267, -10400, -6748, -15787, -1010, -6709, -3590, 9832, 28632, 18981, -18297, -21042, -27254, -55643, -46292, -14975, -7491, -3258, -2334, -25210, -22606, -10972, -17866, -28739, -45577, -34295, -17487, -12310, -21959, 3723, -15672, -2912, -1460, -11021, -22852, -31383, -26548, -4116, -110, -18471, -16327, -28374, -20132, -17505, -15121, 1042, -17196, -23077, -15515, -13332, 8015, 37615, 11876, -6979, -3204, -372, -4806, -3840, -24834, -508, 9366, -1446, -13629, -13011, 12533, 3636, -63, 851, 2607, -18962, -33335, -26739, -20596, -1991, 12170, 14496, 9462, -3883, 12109]
16194A2109q39j6112m315k4472q448J4290J6468K030o981J1037J0716j5392r608
16181a9517j7968j473P710J7982J5903O529k723j9981P535J7208j703j9741J896
16168h343Q872J8585J544j6700M857j4410j9151k46J3203N534L382M267j219J01
16154B76j1032j549j4045K82O315P973l341j3107J1012N484P84J1502j230j0096
16140a0772O79k7353j0546J0220p4q663J4957J6136m414Q20j0789N296n437J1320
16126a8620J3332j1198j1274o230n206r333J395K0950R821Q419J8015J4027O504
16113C0602q057j2392M07P425J3440j1405j9314j9616p193R035J0151m490j0454
16100b1861m283j143J743j6651n877O990K7209K1869r61j072N801m980p450J3397
$$ y = [12109, 11270, -4842, -9157, -33629, -42077, -27787, -11319, -9289, -16270, -5233, 5483, -9909, -19517, -37485, -38958, -31248, -13266, 2637, 9166, 6443, -13538, -6003, 11205, 9502, -10239, -8343, 529, 19114, 20658, 3958, 8815, -5595, -24746, -24992, -11789, -6255, -2873, 1394, 175, 276, -10756, -12305, -26350, -26068, -19753, -11780, -15121, -28228, -17216, -11732, -10948, 554, -676, -10772, -10093, -37446, -47992, -37772, -37846, -46509, -31552, -15416, -19830, -19010, -29799, -24503, -29940, -18620, -5288, -16486, -27760, -33990, -39196, -48529, -47134, -26184, -16363, -7944, 10071, 24098, 30602, 22545, 10153, 10560, 17985, 31425, 20020, 706, -18910, -26103, -17068, -6917, -11407, -21861, -26144, -27287, -25544, -42195, -48072, -41082, -13873, 7996, 7035, 5963, 11764, 6784, -666, 12731]
16086A2731R23o649r133k143J6277m723o294J9817J688j0342J592M031P868j1876
16072A3767j4480p671J6929r37k339l0268m654M708l508O181R393J450j0312l160
16058b4901P246m354J720j246k83J0660R261r642j4839J1219K971m34j965M957
16044i630j3805j593j5276l40J3562J5872o841k2112l4J5817J3225K6133M4k2957
16030g935j1487M737J9871p967p266o397k5344j0555m694k547J010K378K3603
16017c2593L3808K8662J1536L025m0150k014K5357r385k2586j4848n310J4605
16005i893n103N360L3856j042J383j3939j3571l0718j4123J0903J6507K1839J0002
15992A1461K738o2L199n146l659R218m792j3604l2363m656j3060o217J8685l635
$$ y = [12731, 13654, 7005, -2128, -4271, 12006, 7283, 989, 20806, 22494, 12152, 13744, 17775, 25643, 13767, -713, -8384, 8545, 7608, 5269, -24999, -29653, -24945, -28453, -22272, -12879, -11429, -21741, -24901, -17655, -22009, -20289, -21535, -21818, -11158, -1897, -11539, -26378, -15159, -12188, -12622, -14587, -9630, -23435, -25028, -40304, -40644, -27082, -11210, -18051, -40163, -40197, -24380, -11155, 14978, 15022, -7935, -19422, -14685, 5186, -2781, -10047, -16444, -41788, -52343, -57037, -59584, -58574, -56196, -32593, 1215, 29877, 41413, 44438, 4288, 2274, 27631, 18246, -4340, -19188, -24498, -9893, -14996, -9636, 24220, 23178, 24561, 10622, -2949, -33667, -47790, -36887, -20380, 1459, 11461, 14199, 14137, 17336, 12190, 8531, 17749, 12957, -647, -33010, -37666, -50726, -56943, -38258, -41893]
15978d1893R494J4968n306M628P717l775p445n489M273K1844J5268L379j6776
15965H87j2026Q230L629M014L465q8o341l884o347k613n994J960o311L285K0088
15950A954K1011r552j9003r612K0883K0735n012P984j5142q409r472j1589K214
15937a3010J6118rP889j7483j4671K0193m054j0467o112J0085J5803m731j8498
15924a8947j5996p53N998J3217L861j2723p246J2832N526N844J3129j2206k1196
15911b8660o541J307J2160K0840r326P539N684J2749o105L972j2472j9516J7586
15898g83N809j7697J0611j599j7365j7227j1144K8788n970L4340L0571q543k1791
15885H000k1520j1022o310r42k273K0766J5808j3560k7494q481K2422K9129O470
$$ y = [-41893, -32399, -17431, -22737, -18109, -10392, -14167, -21612, -27101, -22828, -984, 14284, 17663, 887, -11139, -2909, 720, 4734, 8199, 8111, 1770, -2114, -8461, -11074, -17068, -15108, -21419, -18134, 1954, 22965, 13413, -5590, -15202, 5681, 26416, 21404, 29388, 14246, 5837, -3635, -15224, -13010, 3108, 3099, 10988, -6495, -21166, -973, -5027, -15494, -21606, -11521, 4282, -449, -18947, -34943, -35696, -29698, -16481, -12620, -25343, -32589, -19757, -14231, -8387, 4742, -7464, -28660, -35201, -33894, -21734, -894, -10220, -2681, 3003, 15752, 9647, 13619, 1147, -18369, -783, 5026, -12671, -2060, -3659, -21024, -38251, -49395, -20607, -26577, 7763, 38334, 29791, 8000, -13520, -24542, -30852, -31794, -34067, -13301, 2507, -11053, -38547, -47028, -24606, 4523, 10993]
15872A0993J7433J5761r453k1473M265P487j6853k0742k1027J0283P057J1828
15860d441j4831P824J6018J4768Q980j4226J2594N858j0360m001q992o598Q79
15847C472M218q569j4166r862n93L417M537R952O746J8370j2545j7338J4598j482
15833G55j4528q558r0m641n394q280R592K8298J6909N247j3889j162k1706k2737
15819d0184m11J384L120K1401p323j946j5505M187J9153L8102K1562j774j2131
15806B9635l8165j8975J5903P521j4042N051M146J5840R686j0306p877J9582J1482
15793B9481P956j2490l4035l098K1322j5278K85n161j679l992J4870J323k1847
15780b2343m550m349J6304j6144k3467K6344J3970m277j69k3107j7501K7522K6559
$$ y = [10993, 28426, 44187, 34734, 13261, 17526, 25013, 8160, -12582, -33609, -23326, -16269, -4441, -19272, -11448, 4570, 19338, 28318, 14092, 26686, 32544, 22184, 18183, 9191, 2593, 3472, 7690, -879, -15045, -24907, -25500, -22083, -17546, -7594, -848, 17522, 4977, -12361, 2237, 755, -13773, -22331, -22421, -27062, -32456, -40736, -31144, -2846, 14063, 19310, 5421, 4259, -17447, -40184, -40595, -39211, -36091, -14690, -22013, -23959, -39464, -35277, -16124, 21978, 43540, 41766, 29635, -8530, -27505, -11602, -4081, -18123, -13072, -8926, 6914, 16600, 6294, -1583, 17999, 29481, 37437, 24947, -9088, -12186, 9136, -6142, -5857, -11018, -12697, -16689, -1819, -496, -22343, -26893, -31242, -14938, -31082, -54549, -28205, -14235, -18512, -18681, -41788, -59289, -31767, -5208]
15767e208O525J1076Q717k836k6P028j2455P030k786j8373k644q132j1734J2055
15753a1763J31j7294N415J2597K3647N472q723m582j7670r548j403O595J921j2775
15739b7980P126K3197P332j5637j4951m138O654R755k6306l917K2855j3284J1216
15726a8078P577j4191j209m581n297m256J0306J2464L628K4119K6177j6983k2436
15713b760J0861N609j2973j366m993N107m581q134J1753J0903k6392k5401J035
15700d1332J3009N389J0162r49j5767J9611O022j8300J2490K6114P180j4992J437
15687A0074o317Q929q600j3757M055j9039J0854J0056k959J211n484N395K3487
15674A7905k444j0334k3797o729P429p618Q204P466J4467J7424k572k4012p682
$$ y = [-5208, 1317, 12393, 21110, 18274, 18248, 25276, 12821, 19851, 17065, -1308, -3952, -12084, -23818, -11763, -11632, -28926, -23511, -10914, 12733, 18205, 9482, 4900, -12770, -22318, -23721, -17126, -15205, -27980, -20854, 2343, 9675, -5962, -20913, -25051, -18397, -8642, -34948, -38865, -16010, -29294, -18078, -10501, -24692, -25901, -30482, -35779, -40035, -29729, -17265, -13637, 10482, 36659, 19676, -2760, 8101, 13710, 737, -629, -5622, -515, -5096, -13230, -1477, 9426, -16966, -42367, -41332, -28323, -22934, -12772, -13721, -29488, -9877, -3855, -22155, -9665, 16449, 23629, 8637, 10074, 3757, 12686, 4086, -9671, -5616, -24655, -13801, -3745, -6704, -5493, -10977, -5582, 17905, 15461, 5127, -18670, -25399, -17970, -25588, -17384, -9918, 4549, 21973, 19401, -4611, -12293]
15661a2293J781R657J2708n909p630j387O646M238l262r253J1454M392j3046j3108
15647a5012K014J4964r926p348L8507O626Q11n385k7308j9617J043J9707j8782
15634a9706k902K3349K1357R883p113o567J6813P53k2753k1350M977j0672j5854
15621b9785N053Q142J1986K2167J9642J041l0348o147r727p363P626q52n403J2033
15607a935J2876M680k3341p829K3025R046j8064q290R429R318R398M752O23j6259
15593G429P553K4234j0137m547L11j261k9345q217K0665J0428j5924j9120J1066
15580f865N003j2064j3286q542n495Q716K4617J6529J2199L449o062N655O202
15567C0056j8249j5384J2759N618R554j2831O994N125O55k7994j2635O841J8189
$$ y = [-12293, -10512, -855, 11853, 5944, -1686, -3073, 3573, 7811, 4549, -4704, 6750, 11142, -1904, -15012, -12998, 1966, -7960, -15308, 23199, 29825, 30636, 25251, -2057, -21674, -20631, -924, -19706, -22608, 741, 22098, 31981, 24868, 18301, 35114, 35867, 13114, -8236, -3259, -13931, -29785, -24732, -16590, -4604, 17563, 37205, 38246, 7898, 1751, -7976, -15339, -7713, -8565, -13968, -1935, 10941, 15621, -7720, -15549, 7476, 16522, -1542, -9832, -403, 8915, 18313, 23065, 23688, 7429, 14982, 39216, 29079, 24532, 24843, 23582, -5763, -13980, 6685, 17113, 1189, -17931, -6865, -1862, -13926, -27212, -35754, -41249, -32533, -7916, 8613, 20812, 24261, 18199, 23854, 30056, 11807, -3577, 9182, 14800, 24354, 11523, 18517, 23642, 24297, -3697, -16332, -9491, 8698]
15554H698k095j1511j965J0061p201k70l243m246k586K109J2995Q375J2517K16
15540B1854J855k0932j8262R665J1187M801l567m097j1750o795j0338q128K5402
15527i105J5278k909j3137P297j595k6851J1461R505J3313j169l595k2924J0662
15514a3769J6843o936l2191r457o07K510K1143j5026q090J8234K3538J721k6871
15501b8958Q79m4R186R279q041R141J2405K739r891J683N74k377j1568J233R411
15486d349P95p713K968Q130J4378M388J997p779k4982j3621j546k535j4217p639
15472e1725J9440J9403q760n644J3910J8127l878k160j8324Q157K8890N718k4891
15459a737j4377K975N461Q256J791q162O189l611r376Q184n207m531j2892M929
$$ y = [8698, 6603, -4908, -6873, 3188, -4013, -4283, -7526, -11772, -14358, -12249, 746, 9121, 21638, 21854, 23709, 2777, -15485, -5820, 5367, 10168, 6601, 2504, -9246, -16041, -26379, -34507, -9105, 6173, 3264, -9873, -2576, -4171, -31022, -19561, -10056, 3257, 2088, -1507, -24431, -13769, 3074, -3862, -36053, -45510, -46117, -43607, -22464, -37490, -45580, -27346, -3808, -2087, -28958, -28079, -28123, -18937, -9658, -17699, -8558, 3847, 6586, -3305, -1622, -1048, -3425, -14993, -13760, -4349, -3554, -11267, -8299, -169, 14209, 18597, 20594, 12815, -12167, -25788, -27334, -29869, -44086, -51725, -32285, -12882, -21642, -27286, -13376, 4751, 873, -1287, -19611, -11454, 17436, 23154, -1737, -16114, -13139, -7678, 578, 2369, -5793, 396, -3215, -12591, -4407, -9614, -14145, -27037, -22108]
15445b2108N088L119P943m195j6953k45Q392P061r095P282K2700q631j3557M586
15431h613J1897m457j1403j0962r720M962r05L383q990J4911J2200o272Q332l829
15417i466O547R102j8132M899J0947J7665k198k6670j8761J2257J9662J1607k8009
15404a0550j1382J6487J3435r911k1228M179j158K1986J222k1134j2354J692K4160
15391d556M55j2864j6284n414L597L6446L0119m531k7273j6167j4276P131J621
15378b1996J4864j1180K193K596N886n327P971p738j065L449J2047p80k6411k0351
15364d5842K5939K5147q012o872N565J7262L238j0430n574r979n334J3716L447
15351B271J1253r6J551K703j738L374n161k5254k2531n056J4738J669K1898K516
$$ y = [-22108, -17020, -13901, -5958, -10153, -27106, -27351, -18959, -11898, -20993, -13711, 8989, 358, -13199, -8613, 3284, -1173, -12576, -23538, -33258, -28296, -29201, -25818, -34808, -19897, -7697, -13969, -5637, -9466, -2919, 6183, -11949, -7050, 3897, 21562, 19364, -7306, -26067, -13810, 5852, 17459, -10550, -21932, -5445, 7990, -1921, -23149, -18970, -20128, 1858, 3080, -18054, -30408, -28716, -4556, -4101, -16965, -33249, -38663, -35066, 1380, 31499, 26968, -305, -16472, -30748, -23617, -21996, -7132, -18312, -16119, -13523, -7637, -12964, -4993, -12731, -13796, -10347, 1700, 920, -25491, -45842, -19903, 5244, -2768, -9640, -4075, 13187, 16425, 5995, 421, -9558, -14892, -1176, 2271, 13524, 13428, 14979, 17682, 15944, 19318, 14157, -11097, -33628, -38684, -23946, -22277, -379, 2137]
15337B137j7091o610j2866p017R443K7577p047q536o561P797J5162L0837k740
15324B4485k2905o565J7779P365p667q722n84J9050R540k3121P749J6997N279
15311C8680j160k4737q860J1644j1756P175J6673q791m918p632o251k4495k4357
15298d8785P74K1945J1362Q937l803M283n112P540J1145j6585j224K2876j922
15285A1431j3035n62j4228j800Q537l1338l0727O241M473J212K2397R927K1023
15272f449j7545o046R210J0813j0366j4295q85J5875o355o811J1766J8454J0476
15259G842J2144j2298m754j3660j236J306j666J3390K3761L4P95J4726j3523j5449
15245A1412k348R395m604m505P58m764j960j0744M848N20o425m5022j2857J3561
$$ y = [2137, -14954, -21564, -34430, -41447, -32004, -4427, -11474, -20010, -26571, -18774, -3612, 27225, 24485, 1580, -4985, 12794, 20159, 12492, 3770, 3186, 22236, 31776, 8655, 16404, 33401, 38680, 37520, 12783, 3923, 15567, 3811, 10986, 27659, 18868, 13950, 6318, 67, -24428, -48785, -48011, -26066, -14704, -5767, -9570, -5287, -10399, -2859, 8286, -8299, -9523, 13353, 11431, -1604, -2166, -16394, -18194, -9657, -40995, -71722, -65481, -61008, -59796, -37399, -27472, -6449, -23994, -30040, -20830, -10017, -20383, -34678, -35563, -19688, -26043, -32854, -21088, -2634, 7842, 19986, 7688, 2934, -10726, -11962, -10656, -12322, 1068, 24829, 24863, 25658, 40384, 26861, 11412, 9064, 18459, 13855, 9350, 10108, 5344, 3384, -7360, -2512, -1992, -8417, -53439, -66296, -52735]
15231e2735n35O135J5915K617p100J5532k0049k861R370J1835J2605O694J1454
15218H877n042j7655j1554J617K3141J1374j5031o123R854M153o541R784j6723
15205i869j8548k0543j4752r842R530M97M2087L1948Q79k235o182j0344n557n202
15191a8133M546j1125n205K906K4168J0325M331p060K2091r012j7600N961j1867
15178e674j5942K0007O322j8302m093J0692m420J5340M153m192J4551K203k943
15165A7702j484q091j2835k2459o294k303j9813K7224J3254J3795l632j9277j1734
15152c5947k0503m979J3063J1084L50K1613L1212m497k5621j2232L718l571O51
15139b5659o655J4922Q69j327K0921J6149J8072p627j7437k1664k8075K739O851
$$ y = [-52735, -53270, -47135, -31220, -28603, -35703, -20171, -40220, -43081, -33711, -21876, -9271, -2577, 8877, 3835, -13820, -25374, -23757, -616, 10758, -4273, -10396, -542, 3611, -2930, 6854, -9869, -28417, -48960, -63712, -73554, -64024, -63527, -21440, 10508, 11387, 9152, 2970, -7374, -12931, -18133, -13587, -24712, -29917, -27011, -2843, 7482, 11813, 4753, 26844, 17832, 232, 6193, -5674, -21616, -1609, 4713, -13589, -17682, -6990, -11410, 3930, 8083, 3891, 18442, 20645, 17702, 16218, 8127, -4708, -27167, -33461, -35764, -55577, -28353, -15099, -1304, -4936, -24213, -35947, -56450, -61429, -48366, -37282, -36932, -15319, 15893, 11396, -14225, -26457, -22739, -26310, -25659, -32314, -17392, -16523, -17850, 3071, 19220, 37292, 29665, 12228, -9436, -37511, -34772, -27921]
15126b7921J2526K0526j1523P665P868N722k7854l8033J7726L5545R887l3035
15114b0901m989m831n648J1870J5063J2458R879J527J8358O19j5172M37r875l44
15100H451J3118j9525r231L881r326m333M10j3672k6583J3782J3248K271M553
15087b2956M450r04L366K1521m909l835O445R364m551q919j3104O204J734N444
15073f50L662Q264k066j8539K16M890m934n593Q850r85k2301l0234l057J0438
15059e2039K6492R305K0576J0835M347j5941k9296r563K106J9924L985j999j3630
15046b4898j161K7464j800J4405J4847j2803q818j5515L331j3689j3257K2525
15034i369P718J3214J5427j0539j4734O40j288j3132j259l272k1843P358r214
$$ y = [-27921, -15395, 5131, -6392, 1273, 9141, 14863, -12991, -51024, -33298, 2247, 12134, -20901, -25890, -30721, -36369, -24499, -9436, 3022, 12901, 14428, 32786, 33405, 18233, 18670, 8795, 8451, 21569, 2044, -7187, -3306, -12632, -16965, -16555, -30227, -56810, -43028, -29780, -27509, -22956, -18506, -19410, -16044, 5477, 568, -3267, 3178, 12542, 7991, -928, -14032, -7828, -6094, -650, 3012, 11276, 9210, -9329, -9113, -4223, -9157, -14750, -5900, -6885, -29186, -59420, -62477, -52039, -25547, -16242, 4334, 15169, 19516, 3575, -25721, -35284, -33178, -13254, -9269, -11268, -24898, -26059, 1405, -395, 14010, 28857, 16054, 7236, -8279, -4948, -18637, -31894, -9369, -1651, 11563, 26990, 16451, 1717, 2357, 1069, -12063, -13322, -16594, -38437, -31079, -40293]
15021d0293L0358L4600P352j5835k3871j7726L683R189J9913K505j8379J376m758
15008a1886k881k2183M952J1166J0081O526J1486Q190l228j997k587R577J4714
14995C1930n093K636j1404k0882j6198P392M624j1303l161L028J3896M803Q150
14982H418N039j5837o507J3673J6908j8765R43P191M984J5243O41j2329j8989
14969F13J1881m27R037l471j4075m18K3148m502Q999k992j3466j3425N745K2791
14955B9438Q052j7664l1966P818m341l435K0093J6626N917j2713j5990pk6459
14942b4631k7508K6321L3812o408K015J1002j3366k6517M069J6583J6792n081
14930G083N004q173Q515J189j3148q726J4157K3925l2577j4604N432J9689q136
$$ y = [-40293, -9935, 24665, 32017, 16182, -7689, -25415, -21732, -12543, 7370, 9875, -8504, -7128, -11886, -14767, -36950, -31998, -20832, -10751, -4225, 7261, 15451, 12223, 10226, 7639, 17216, 31930, 26837, 29473, 18069, -2813, -19011, -11619, -6995, -18298, -21459, -18431, -4535, 268, 8418, 13457, -2380, -8887, 4786, 21694, 2929, 3872, 11063, 16047, 31290, 31931, 19602, 613, 12494, 12067, 21104, 17633, 3558, 3140, 26288, 21786, 30785, 27793, 14327, 902, 6647, 29438, 37490, 19826, -12140, -4322, -8663, -12098, 7995, 24621, 30538, 17825, 1835, 1828, -24631, -52139, -25818, 7994, 1586, 3601, 14603, 1237, -25280, -21211, -4628, 12164, 7083, 12087, 3914, 12429, 13618, 470, -8256, 5901, 29826, -2751, -17355, -11923, 7766, -370]
14917c70j5621n885j866K1704M50j3339J80O362R145L712j868j7339J9341K6631
14903C1237p687k7272J4610J1587J230N322O247q01j4905j0407j4253j3442j0494
14890b9028J89M912q446K2072J6232j8794k0022P39J4997J7228J6051J0576l388
14877B3318j5021j9679j7442O681L703q257k145n136q57J6348J0045j9295j8885
14864d6622K0368K810j5091J2512q85P489J6847J3264q579p474j175r241P862
14851g915J8084J5128K354r754m718J5811R107p049l2316k0133J5916L4714M050
14838C3279j6909j2629R691j9396j8655j392J381j0810N810P876J735j3243L27
14825c2935m627q366k86K0432J0168o530M260L763K3992M386k4305p084L218R66
$$ y = [-370, -15991, -21876, -23742, -2038, -1588, -14927, -14747, -8385, 760, 4472, 2604, -14735, 4606, 31237, 23550, -3722, 10888, 22475, 23705, 29027, 35274, 34473, 19568, 9161, -5092, -18534, -29028, -28839, -23927, -32373, -10301, 5931, -12863, -32885, -32146, -17149, 79, 16130, 26706, 23318, 8297, -11382, -28824, -22143, -18440, -26697, -28842, -33978, -34835, -18487, -8442, -27737, -46622, -26254, -23444, -38535, -26023, -26908, -19419, -2572, 10692, 2113, -5361, -6536, -15777, -7915, 10169, 25297, 27651, 17897, 13179, 28990, 38097, 31048, -1268, -21401, -5485, 29229, 33279, 16370, 3741, 13432, -5964, -24619, -26011, -24630, -35440, -29630, -21754, -20019, -33262, -32935, -37562, -45928, -46214, -25782, -15614, -22144, -17884, -14121, 9871, 14257, -10048, -17132, -13914, -12948]
14811a2948L4146q29l1909K112o869k566M0969J1853N933j121k0278r174l681
14798E638Q176m794j2295l277o352N989J4910R081j5493k0499j8302M110K5698
14785g410K617j3697O294J0972j336j4983j5449R204n183R011J460J5094q22n466
14771i694P237J7691k095n012M205n136l045J2118j3663q112K755M382q837q915
14757a6121J1798J258N763k47L690Q301j6903k0156J8409Q815l832J395k0668
14744a8498O138l473P623K5258M987J227J2870j1231l2068k4036N805P274j0539
14731b8663L1264Q411N74K1961o810l692m422n030q533L958j966q369N821m834
14717c30j2192J1348J5043J5906N311j5471k0890j6326L751K4834K3128r149K2379
$$ y = [-12948, 21198, 20369, -11540, -9428, -16297, -18863, 22106, 33959, 39892, 38771, 18493, 9319, 5638, 13814, 9020, -3275, -6552, -12904, -6915, 7995, 17076, 1583, -18916, -37218, -33108, -7410, -4793, -18490, -12196, -1224, -2560, -17543, -32992, -23788, -28971, -19960, -18500, -3406, -4228, -9694, -2457, 15234, 13139, 8127, 12332, 7196, 4151, 16269, 2606, -5506, -2751, 1631, -7206, -16121, -4323, -3065, 2698, 2451, 6141, 14442, -2461, -22617, -4208, 4607, 775, 2170, -18498, -12360, -15833, -8210, 17048, 22035, 23262, 36132, 24901, -7167, -31203, -25398, -18124, -28663, 2601, 11012, 11586, 33547, 26737, 23045, 18623, 13593, 5060, 9018, 7052, -1317, 4504, -330, -12522, -1174, 13869, 29775, 35086, 19615, -1275, -17601, -13850, 10984, 34112, 24963, 47342]
14704D7342j2930l3577n254j6400p735M1073J8133j5046j7160M807P454L651r930
14691D428k0936L817P523L877R02k0790k2789J244J0412J2865J513p305N186k753
14677b2806Q386m771q48j244O465O950J0503j1273k281j7148O029j231K0992k600
14663d877n825P880l985K2087J7133m277q808k8513L609j5785n949L4237J3874
14650B0801J919j590o875k8202l319L444K736q237J6071J3649J9946R375n072
14637C4646j7855l1207j3769R71J7673j3008k3020N006K7399q882k0708j0623
14625e3377R362J5900j6253J6568J9011J4405L394M484l426J8702J806o552k2911
14612A113K633O957J31q600r142k1572K654M337r571J9448P42l303j583j675j0615
$$ y = [47342, 34412, 835, -4419, -20819, -28554, 12519, 30652, 15606, -1554, 3253, 10707, 14358, 4428, -16508, -12691, -5168, -1291, -389, -21179, -43968, -42724, -32312, -19447, -17934, -25239, -20053, -22806, -14420, -19191, -20039, -21283, -14818, -7868, 2635, -8638, -10919, -28067, -22038, -23269, -2277, -4877, -10702, -2822, -6807, 15280, 32413, 28136, 19328, -9185, -5576, -21361, -27310, 6927, 20801, 22720, 21130, 14255, -13947, -17266, -13822, -11086, -19323, -3252, 10397, 30343, 39718, 34646, 16791, -14416, -28185, -27214, -9541, -22549, -45569, -40563, -13164, -22046, -42754, -53377, -44015, -28115, -44368, -27800, -8789, 5616, 9010, 13494, 10068, 28770, 30576, 24024, 1113, 3746, 10703, 10834, 2234, -6908, -28480, -25826, -21489, -31060, -11612, -10870, -14173, -15756, -17431, -28046]
14597b8046j3203L890N559K4367O595J3055O402j3337l796J1513R255O751k977
14584B6028j5501j1422j0835k1143O899J3122K4513J1869m023k0286j3797l17
14572a4893j8494J6041K1120Q266j2635L716m582J778P264J5483R424q58j2576
14559A9054k5312j276K1493l026K1748J0227j4129j9976k1194j8452K1119N101
14547d623j0024L59q7p46p785K0173L0861J8774j0179o515k6333l0922j5079L5911
14533f215J9494l724k3396R093K1629j6769j9922R947K2451q12k76j1981K233
14520A752o164j4171k64j3821N867J2099J0199R696L477L906j2969L010j9192
14507a6575j7588K3519J3043o085j2801J4565M649q618M829K970Q720L712j1419
$$ y = [-28046, -41249, -37359, -31800, -7433, -838, 12217, 18619, 5282, 1486, 12999, 22254, 29005, 26028, 10527, -895, -11730, -32873, -25974, -12852, 11661, 23530, 19507, -779, -14576, -14893, -33387, -17346, 3774, 12040, -595, 3121, -1461, 317, 7581, 23064, 32488, 31630, 19054, -6258, -7534, 13959, 10933, 32681, 42908, 28779, 8803, -12391, -30843, -9724, -4623, -14647, -14288, -14375, -15121, -22906, -2733, 28128, 46902, 36723, 30208, 3875, -27047, -42126, -6215, 13279, 9555, -13841, -4748, 16881, 112, -19810, -9863, 12588, 11776, 11500, -481, 1752, -4412, -18583, -18847, -32668, -26801, -14702, -4503, 5193, 8670, 12576, -393, 2617, -16575, -34163, -10644, 2399, -3686, -16487, -1922, 2727, -5891, -1062, 1908, 10628, 14340, 2921]
14494B921p318P593k538r95K3704J9726k5808r514M226k2717j6451N133N943M316
14480a1779J4937J5326p715j4238j2590k124j3467O655J3870N780J346k41L640
14467f00J1280k5593j875L1045J4285j3625M263p31j1025L34N722J2876R733l6175
14453h6k8990R237J8639K112l339L583j475j03M390j4995k472O561O785K2872
14439B2719j4501j8033K5604L877p622j2418l303J038r56M436Q342k413j7606
14426a0836j991M602M61L742P891k5165n688J4708k007r188k4742J3025J3174
14413b2014M69p962P630J4081j185M039J5399L972j2492R797J0800J1468m444
14400B9558p173j6109L876J923m407O047N355r420q04M296j8202j0473n312P785
$$ y = [2921, -4397, 3196, 658, -337, 23367, 43093, 17285, 7771, 11997, -10720, -27171, -22038, -16095, -11779, 3158, 18484, 10769, -3469, -16059, -18183, -31650, -24995, -11125, -5345, -3999, -4240, -600, 10680, -14913, -16788, 14257, 28542, 14917, 19180, 18449, 7424, 7758, 13480, 26356, 36089, -86, -29076, -19839, -1200, 912, -2427, 1156, -319, -422, 3968, -11027, -13499, -6938, -153, 22719, 8218, -9815, 15789, 19666, 12044, -374, -3677, -2639, -3595, 841, 9183, 6770, -10836, -12827, -8225, -7764, -4022, 3869, -21296, -26984, -12276, -14283, -23471, -48213, -35188, -22014, -21545, -29507, -21877, -7796, -8981, -4942, 10457, 14429, 1937, 11734, 22534, 34002, 29558, 22385, 6276, 10152, 12075, 7668, 13715, 19070, 9650, 8846, 13142, -5060, -15533, -20845, -13060]
14386a3060J8527J7466k820j6139N003L325N213j1456q631m470L851J8813n698
14373I924K817J3978l263n301j2842j1869n615R8Q046J4598O264m543j9269K450
14359d527M227L952J1671M750q759P277l02q549N250J961J0233K0837M886j3457
14345C9450k8436O49J4063K427k1074q557J3886N491N240J0023L606K862j9759
14332A9871j4081j4508N752j630k475K2239J5387o517q964o899P409p398N532
14319A3718m300j3130m967k3041M078J7405J4284N129J7812l984k0944N993J2754
14306B0807p17j1423k4668J1839K1653l656j8460L159Q989o025k798J2972N449
14293A7121k7446q885J9640K3057l156k647K0119O12k6604j3204l090q563J5728
$$ y = [-13060, 5467, 22933, 20113, 3974, 8977, 12302, 17515, 6059, -2572, -7042, -3191, 15622, 9924, 12741, 26719, 23456, 18155, 5313, -6556, -12171, -12073, -4027, 10571, 16835, 12292, -6977, -4527, -300, 3652, 15323, 20073, 11314, 18591, 18289, 9740, 14990, 16951, 27184, 48021, 52907, 39450, 11014, 11663, 25726, 28153, 7079, -1478, 12408, 17899, 23139, 33162, 36768, 39630, 19871, 5790, -8718, -2966, -4596, -7071, 15168, 30555, 24038, 15074, 8175, 15584, 8186, 13718, 9418, -3712, -8679, -31720, -27642, -10237, 4047, 9176, 26988, 23004, 2060, 8053, 20807, 20090, 8667, -16001, -4162, 17491, 13835, -4625, -1466, 7523, 1498, -1300, 11672, 17121, -10325, -19210, 430, 23487, 20331, 17684, 37803, 38415, 11811, -1393, -4483, -13046, 2682]
14280B682L108r351m699M144N933j4629k0083L72J2543J3390J0557J4423j7821
14267E69N495J8825k6326k7522J67j6763Q757j91M406n884J7160J3475J5641J0231
14253A8040p376j574K925n236k410O588p125m494J4172k0613j4068p451K2714
14240e908K415J7834n063k291j8510q640j211J2134K6543M13N642n452j0049j5027
14226g170j2877m511J1997R606j122k29k301n414J6111q156p802P810M184M292
14212D418j0042K022J4532j2455k5307q049K1249N782R418J1806J0097j5774p307
14199C90k9498q734j67J6403P254L90J6723O290m047N697L318j5006j4012K1449
14185F450p420k4593m66L9812N927Q87p474o479r75M113k3504o295j7216P607
$$ y = [2682, 5790, -3561, -8260, -4116, 1817, -12812, -32895, -32523, -19980, -6590, 3967, 18390, 569, 6064, 24889, -1437, -28959, -28792, -45555, -36798, -36989, -32583, -38467, -21307, -7832, 7809, 18040, 10664, 9090, 12015, 6779, 4369, 10957, 3832, -662, 13510, -7103, -21171, -28622, -5908, -3493, 14341, 9278, 6987, -11523, -20163, -21374, -9240, 17303, 17716, 23358, 17906, 7857, -7170, -20047, -24558, -12561, -2955, -4077, -4306, -6607, -12021, 4090, -4066, -11868, -4058, 126, 4418, -5624, -3602, 10930, -1525, -26832, -34881, -13632, -7850, 1568, 13374, 23471, 7697, 390, -29108, -37842, -38009, -21606, -14352, -13962, 2761, 9051, 5004, 10701, 14019, -987, -14999, 6450, -970, -25563, -26029, 13783, 19710, 20597, 13123, 6644, 5669, 9782, -13722, -20017, -37233, -29626]
14171b9626L6542l637j7506J317l264k43K1463O931K503k94j5740l503Q106R12
14157C961J4671p019l0876P590P992k467j0564O213R031k399K38n606N541J9862
14143A6168L58l166K59O573p440o469J0602P194N830k5615J921n643o119q142
14129a3689J4470J1940n912J7980j2166J5277N634l0339q229k0658j59N562n291
14116b5580K0572J7525l168J3757n79r105Q073J4721M113j4299l818k0948k0911
14103a9647n442Q630K1774J4293j1940o280k3110r579p811L609J9002K0901J558
14090E958j3428l085n449M323j4086M49n55J7618Q718q240L900J2210j231j0101
14076b999q370j3214j9290K6008J8091j707k811j1284R906J4702p018k2747K5794
$$ y = [-29626, 6916, 3279, -14227, -12910, -16174, -16417, 5046, 11977, 14480, 14186, -1554, -5057, 3049, 3961, 18632, 11613, -19263, -11673, -3681, -6148, -16712, -10499, -1468, -3867, -3629, -9235, -3694, 16168, 16526, 13360, 13619, 20192, 12752, 6283, 16885, 24079, 29909, 4294, 6215, 572, -5547, -13689, 781, 12721, 6809, 24789, 12623, 27900, 33534, 3195, -5034, -25692, -25851, -20289, -25580, -5008, 12517, 9349, 23106, 22527, 13422, 21495, 36216, 40329, 26030, 22212, 1264, -19647, -25089, -16459, 5315, 19608, 7668, 1388, -21722, -31301, -39112, -35503, -16501, 4400, 5958, -7470, -10555, -16004, -11681, -25767, -25318, -25873, -8255, 463, -7777, -3877, 8333, 7102, -2999, -11369, -24583, -43873, -17865, 226, -1481, -4292, -15576, -5670, 9032, 2014, -20733, 5061]
14063E061J8039n616q027j1084j287m536J5483J1428o103p687j0870L979J063
14050a57k0531l732N520j4640q12J9653J2446J0176k917l659J6085k45j6345k497
14036a655J0095K3581J0282m649J3501l2343k2527J2072l491Q744N239k070k2466
14023e687k2124J4008L9425O45k144J361j5218k9423n127L0197J5412J9005O18
14010D0948j7639j1473K229k2996j2070O987R854j0106N343P425O860M38N660
13997A1460l692J860L359O902r684r099l833K784j6671j8748O577J186k52K1187
13983f664K6250J1957k3520j000J0199q20j1690p226j8764q465N242O967Q299
13970i235J1226K3264q135L137n807k737o371R277J0323Q23j24j3172J829r264
$$ y = [5061, 23100, 17484, 9457, -1627, -2914, -7450, 8033, 19461, 13358, 5671, -5199, -1220, -157, -20688, -24420, -18900, -33540, -34352, -14699, -2253, 7923, 5006, 1347, 17432, 17187, 842, -1655, 8440, 32021, 42303, 37654, 51155, 18812, -3715, 8357, 4866, 13610, 18849, 16779, -5687, -27811, -13803, 25622, 26267, 24123, 25484, 10266, -19157, -24284, 5913, 21325, 40330, 40948, 23309, 11836, 14065, -8931, -21001, -14014, -4160, -14266, -8923, -1498, 5362, 5800, 11460, 7768, 9628, 12987, 19889, 10205, 1106, -2727, 57, -16614, -35362, -28785, -27599, -27851, -6664, 19586, 31543, 8023, 7023, 17222, 16402, 4712, -2514, -21278, -29743, -24501, -17534, -9235, 1991, 25255, 17120, 20257, 14450, 11713, 5342, 14619, 24942, 25765, 25641, 12469, 14298, 5034]
13956E034Q315L606P50j5542P740J1668P706j7696M868l492j466n468Q322J1173
13942B5518J727m793j2307J6488J0721j9313n613j8423j4106K8443J7829j1464
13930A4707K242J629J6252K3663N843j6899o74j8705k1017Q500l97k703k39j3048
13916h46o235k098o151k079J0540J434O062j482n695J0824n960Q933j267k5461
13902a9481K902O15R171K6727j7952j3723J428J4802K8174l108j5252L271M037
13889B1611J1084R776j9221j0159L655l0047q857M1768K6305j0126k9272J2211
13877A8728J9355j4852k3213L786K5876n387l6227n378K1736K8922K406r319m5221
13864a8788j3641J7378R59K2441P561j4367j194L317L49j0455j2758Q751J1462
$$ y = [5034, 13349, 16955, 17705, 2163, 9903, 21571, 29277, 11581, 16449, 12957, 11491, 6023, 14345, 25518, 27245, 22452, 10145, 26633, 37354, 18041, 12428, -5995, -20101, 8342, 26171, 14707, 16949, 18578, 34830, 58493, 64336, 47437, 46763, 28058, 7041, 15541, 15144, 12441, 12202, -846, -7081, -9179, -15330, -17409, -6869, -5435, 627, -855, -6550, 4274, -1686, 7247, 5980, -19481, -16579, -15964, -6793, 19934, 1982, -11741, -10313, 4489, 32663, 29555, 14303, 17574, 21611, 32695, 42471, 23250, 13091, 16746, -13301, -22158, 19610, 45915, 35789, 6517, 18728, 38083, 23231, 18, 3804, 29680, 24293, -11934, -17312, 4424, 33346, 35752, 26433, -18788, -32429, -15051, -14092, 8349, 15910, 1543, 349, 3666, 4015, -6440, -19198, -10447, 1015]
13851A015m708m26j5346M176J0110J175J1300J1932J0591j2508j2718j606p429
13838d442N918R486P669j1942l065J2810k9908p793J2391K569M017J7501K321
13825A7532k5643K018L896J0106j5512j7269K322J2149K1114N482M363j614R288
13812B8232p533p090N617J0212m032j7949p100J2515r95j7182P891k515R10J2991
13798A3972l1354j6861O621J8897K0552K3724J2151j930k9612j5897J2617N091
13786A7971o947J2645j9j7041p011J2859J6816K287k629O559N330k861r420j2346
13772A6193m645J8181M236r68L05n405j178J2022J5819K324j7920k4750J3903
13759B8117J8278j7058j6189n138J253m596K479K3853J2958o22k3565j2175J413
$$ y = [1015, -3693, -4119, -19465, -15289, -5179, -4004, 7296, 19228, 29819, 17311, 4593, 2987, -4442, 1476, 10962, 18631, 6689, 3624, 16434, -13474, -21267, -8876, -6307, -2290, 15211, 17532, -8111, -6093, -2197, 7909, -7603, -24872, -22550, -10401, 10713, 16195, 20558, 18944, 28232, 20699, 13609, 19226, 29438, 25406, 7457, 357, 12872, 11877, -5305, 2586, 71, 981, 13972, -17382, -34243, -27622, -8725, 11827, 35551, 47702, 45772, 16160, 263, 12880, 17971, 11024, 23669, 23650, 6609, -402, 12457, 29273, 31560, 28931, 35490, 40820, 37959, 28539, 16193, 11548, 29729, 33965, 32997, 33302, 27897, 26719, 38741, 54560, 56884, 38964, 14214, 28117, 46395, 29337, 13148, 8010, 9263, 4667, 7146, 30999, 43957, 43335, 19770, 7595, 9008]
13746I008l772N703R672K3760j6019k0238m010K17J1946o905k3398J5838J4126
13733A5928j727P045n841j111O91j3011K786K008p908j0982k311J354R279J4921
13719A1121j3063o965Q892K1303M525j4599j2198K797J4247O611j6405q504J1712
13706I474k720K165k006p123J0172J5374J934j7636j8641j319J2675J3789q23
13693A5315j1261J8420J1977P267n887k493k3925j5144L538M455J1768J0055q911
13680A5174J482k34L345k2375r812J1366L5304K1704m345j1571o271m86j4318
13667A8963k2616j7845O063J9617K4989J814j1993l243o437J6314o369N737l332
13654B1662l2310m001J0668N997L294K9172J3367k4801j3520k973l647K5762R065
$$ y = [9008, 5236, 10939, 20611, 44371, 28352, 8114, 4104, 4321, 16267, 9362, -14036, 1802, 15928, 14201, 21246, 15405, 14294, 14985, 1974, 4760, 6768, -1140, -12122, -14433, -13079, -3800, 11121, -1942, -8907, -15, 21288, 25813, 11214, -984, 1813, 16060, 22671, 6266, -2238, 9474, 6754, 8919, 6913, -210, 9962, 25336, 27270, 9634, -9007, -10326, 2349, 16138, 15315, 4054, 22474, 34451, 41718, 35831, 33338, 9413, -5731, -2193, 2262, 14030, 24085, 15174, 16656, 16422, 19767, -2608, -12420, -1054, 34250, 55954, 51609, 40038, 33767, 33281, 18963, -3653, -21498, -15435, 4182, 29171, 30985, 18992, 15749, 9312, 25626, 19257, 24994, 21662, -10648, -14649, -3981, 2016, 5310, 34482, 47849, 23048, 9528, 6555, 2908, 28670, 37735]
13641C7735l229L732K3242j8357j4099n926L748P382K0908l357k6363j5299j1678
13628a561R22p761j6928O204N351M876K5693K1811j1592q867j664K776n315n429
13614H516O050p321q914N192J4816k173l657R310o415k0992j546O164J652J997
13600B679K6132J4742J3316j6590j0363q092P300M416J1600J7567n787k4364j1437
13587B1119R506J8379o553j1868J995j5287m581L926k1414J0449K6095J2310o32
13574D3444j8129k1058K3351K7340j3546k8839N726j5178J491k755P749N567M966
13561B0129j3168j0207K49j1654J1540Q376N172O268k467j7817j2871J2609l848
13548g689N909K9248J1315k9852q089p486J2006J3947O214m057r267L774L541
$$ y = [37735, 34506, 38238, 61480, 43123, 29024, 23098, 26846, 34228, 55136, 51779, 25416, 10117, -1561, -639, -8400, -25328, -19124, -13773, -8897, 16796, 38607, 27015, 18148, 16484, 19260, 13945, 8516, 14566, 7245, -1669, 3523, 18339, 16166, 12509, 21819, 15404, -5588, -7134, -970, 682, 2679, 28811, 43553, 56869, 40279, 29916, 21824, 29124, 33540, 45140, 62707, 56920, 32556, 21119, 30625, 49004, 42451, 30583, 32578, 17291, 12710, 16636, -4778, 5671, 31766, 44076, 43444, 25315, 4257, 27608, 54948, 41402, 12563, 18289, 3111, 4602, 1847, 9596, 15163, 20129, 6961, -3246, -2997, -14651, -3111, 5265, 10437, 16705, 14238, -3579, -16450, -3841, -7689, -1780, 27468, 38783, 8931, 842, -6644, 5362, 19309, 25523, 21466, 12199, 15973, 19514]
13535A9514q221J0948l993m560j7719k195J5751K004j7045q780J1914J0913J2276
13522B0807M107k083j3319k426Q292J4880J4453k436k370O220K821j8058k8419
13509B469o431j6873q641p027J5526K6512N696n821L161l343J3560N69k8306Q878
13495g1J3658P820J330P454lm836k9010j5083J5051K3807J0258J1440R562L842
13481E5219k1682K010m948k786j1447j6522r961K6098N736o697J0697P819O846
13468D0382P471m386J6968l13j6903k2668K308j1577k759R273k5774Q655L0208
13455C0885O436P929J2739k429l724q427j0549R459P996l945j4771k3784J4250
13442B2065j594j5685j7608J0177K1189j8000q866Q328p431j5856J5354K8108
$$ y = [19514, 11293, 22241, 18248, 13688, -4031, -6226, 9525, 11529, -5516, -14296, -2382, 8531, 20807, 24914, 22831, 9512, 7086, 15378, 30258, 44711, 42275, 39905, 46125, 48946, 30888, 2469, -3962, -20835, -29476, -36503, -20977, 5535, 11231, 5410, 8571, 5228, 18788, 19357, -8949, -71, 13587, 21407, 22737, 30191, 30188, 25352, -3658, -18741, -3690, 20117, 30375, 41815, 51377, 55219, 33537, 35547, 30599, 27813, 16366, -156, -10117, 15981, 21717, 15020, 25717, 33536, 40382, 47853, 43467, 60435, 60122, 43219, 20551, 22859, 11282, 8523, 17796, -7978, 677, 30885, 37321, 45250, 57989, 55560, 51836, 43409, 32860, 42319, 50315, 46370, 31599, 7815, 22065, 20471, 4786, -12822, -2645, 18544, 544, -8322, 6, -7425, -23281, -7927, 20181]
13430B0181K7029J7038l5426j7343J4965n191J3191Q517N567J118j5560p311K1944
13417D8719K244L264l940o370J7334o941j6941K0358M840L659k3534k092L709
13404D4309r110L655n144J4100M217K376j7343P119k6687K059R803j0494Q842
13391B7702q374K2334j507o933j762M386J3256P945o763m476j7992k2610j489
13378C717K8880J5979j9967o572K575J990j5304j5972N708L05J8799N954j5582
13365A0510m510O053j373J2828K631K449J265o232P362Q861m052l385M976j0728
13351B6655q814j5805J9834P379j496k291M958J3054J7223P696k3064k2339J8746
13338D1736J1875r537k5698m714k605O495J1300q022O106k0881l0095J7047K2575
$$ y = [20181, 47210, 64248, 28822, 11479, 26444, 21253, 34444, 42961, 48528, 49646, 34086, 26775, 48719, 50963, 54227, 50287, 43917, 61251, 54310, 37369, 57727, 62567, 66226, 42692, 40600, 44309, 35199, 38854, 33710, 47810, 52027, 54403, 37060, 44179, 17492, 19551, 29354, 18860, 27702, 19328, 41662, 40155, 33222, 31460, 35846, 49102, 57047, 50284, 45808, 27816, 5206, 3717, 32597, 48576, 28609, 22037, 24612, 26602, 11298, -4674, 1034, 1339, 20138, 26092, 10510, 6000, 12053, 10680, 23508, 26139, 28588, 29853, 23621, 30983, 39844, 35792, 32407, 37383, 26655, 17841, 2036, 21870, 29249, 27753, 25462, 30420, 43474, 60697, 68393, 45329, 22990, 41736, 53611, 44074, 18376, 13662, 11057, 17552, 28852, 20830, 26936, 6055, -24040, -6993, 15582]
13325A5582J306q85k4380J198l878N600K6050j0643k75J3298j7047j212J8348
13312B3062P942J0571J9132K290q187m956j5850P129J89j947j0548K277p502n890
13298A7712M78J2217K4918J4549q511l2061k3145j0593J0738J1942L800j0033
13286A2011p480M612R273k133j0643l786P419M215J75J284J858j1015N528L861
13272A5179l391j0001N437J5513K779j4793J0234M101q695K66j9514o645K4719
13259A5189K5686p10j0592l0475k0724J9453J8619J726l634n694R965K298p102
13246A4005M416J2306J0023j415j162o379P2J4105K4759J1784j1978k7620m799
13233C8117n953J9344j5298j5852K162L476J1102J420j1425j3161J3046N763j6577
$$ y = [15582, 16888, 16003, -8377, -7179, -11057, -5457, 20593, 9950, 9675, 22973, 5926, 4714, 23062, 31004, 41575, 60707, 62997, 54810, 49854, 34004, 41133, 41322, 39375, 28827, 31104, 23602, 17712, 18190, 30407, 55325, 69874, 61363, 29302, 6157, -4436, 6302, 18244, 22044, 12011, 4531, 9143, 18416, 16283, 5640, 1854, 9273, 13488, 13663, 14947, 16805, 5790, 11318, 15179, 11788, 1787, 7224, 22737, 25516, 10723, 20957, 25058, 16363, 16629, -2885, -9530, 15189, 40875, 40165, 29573, -902, -21626, -2173, 16446, 18172, 14538, 8844, 18809, 21107, 14005, 18421, 30727, 40750, 39335, 38173, 31794, 31866, 45971, 70730, 82514, 70536, 42916, 38117, 32164, 51508, 36210, 20358, 22520, 25996, 37098, 38518, 27093, 13932, 26978, 32741, 16164]
13220A6164k1850p899k922K794J6508Q071O622K906p229P815J7510K8760J10j7659
13206D9701l609j0410j3879J2924o972m099L447J718J489O618J0661j349k0959
13193B5281R96K8576o495j4865o114k0704J9659l82k179p671j4067n067R585J0425
13179A6978q52J2499M158q082p717R460J308j3575j3090l138J6763K6685R757
13166E1154k3490K798k731m943q415n28J1148O291p664j8878j848j2604p994j5242
13152c2946R208K3940R619Q18J5875N069q744j1882q387j5257K0317J1497j093
13139A8034k87J7746r326j0381m447O046P203J6171q634j0401J9635K6721j0115
13126E7965J2324M025k1011o402k2325j8980j017l625Q912P945J7615l253l79
$$ y = [16164, -5686, -13585, -16507, -13713, 2795, 10866, 17488, 20394, 13165, 20980, 38490, 67250, 67360, 49701, 46092, 35682, 21803, 34727, 27755, 23656, 27103, 28821, 30310, 36928, 47589, 46240, 25281, 26277, 54853, 48358, 33493, 27379, 6675, 26334, 25952, 23773, 16102, 2035, -3032, 6553, 16978, 16126, 28625, 32783, 24701, 16984, 26444, 27752, 14177, 1087, -2051, 14712, 41397, 51154, 27664, 30462, 27731, 22788, 14373, 13845, 24993, 31284, 23620, 4742, 2894, -9710, -17704, -32946, -23738, 202, 9821, 10639, 26514, 31583, 22839, 10957, 2570, -12687, 7630, 19127, 18034, 17747, 35493, 26167, 15786, 11339, 17385, 24588, 40759, 32125, 21724, 41359, 68080, 57965, 70289, 74314, 53303, 46901, 24576, 5596, 4579, 954, 9866, 17811, 35426, 32173, 31794]
13113C1794J0406N417J7140P644j9557J184k1884j0375L563R29k835K2201N529
13100E1156n879J1434q934k3046O747K493M232r540j2900J6801j0573J472K628
13087B6091k0230l2103l147K2704L6669K8087j0900J4864n258j3966M714m923
13075D2602J511J6622j8961j8985k075J7328j0971n210R536n70k2578q402J3401
13062A3248o629J1319J3443L124k75j3181j0612j8015q617J7450J1039j1152j6309
13049a5167L073K0159j998k231J6792K755O094P917J001k4153l6943p309J0870
13036a9140N177j1920R847J1731J575j0182J6453J4079m296J9013J6584j3325
13024C5596j0675l724K837m932J068Q634j1739q348J7398R895O629Q284j8589
$$ y = [31794, 42200, 47617, 64757, 72401, 52844, 54028, 32144, 21769, 25332, 26261, 23426, 45627, 51156, 45277, 56711, 47777, 24731, 31478, 33971, 38203, 28663, 15763, 32564, 21991, 23463, 26091, 5861, -26242, -29389, -6685, 29984, 58071, 47171, 62035, 56777, 42811, 47525, 42602, 44113, 60735, 41774, 22789, 20714, 38042, 27071, 21861, 31397, 30827, 8249, -153, 13248, 6619, 17938, 31381, 34505, 34230, 21049, 10437, -7578, -16195, 1255, 12294, 1142, -15167, -12094, 8065, 6067, 3836, 20628, 23383, 29477, 37394, 38395, 14242, -22701, -30010, -19140, -13963, -25883, -16036, -4305, -2730, -12912, 3541, 17620, 13324, 32337, 48921, 35596, 24921, 21197, 24034, 19102, 20170, 28804, 17065, 8717, 26115, 36010, 42639, 50923, 32334]
13011C2334p385m907J7042q591j7404o154L1466J294j871l114j1757n895j3194
12998A864M114K633O702m891j0446J0635N209l045Q700j0783Q301K767M361J9312
12984D5433Q222j8943j0708K8378L642k120j1775k6243Q125L1913k626j2153j8
12971D1127j7528L759j8482n48j50j4924Q558j1277J9449J0703j6622j1487J0913
12958C491J5972q987Q026J8794n860n099J3738J2525P984k2701J734J0284j3301
12945C6600k0627r31l314M280j0212Q042R321j82k394Q420N853r046j949j9169
12931D692r034P619K4792p910K34j4638j1092q571L92m425j910O620K2950O908
12917A6627L855J8168j4702p710Q596K601M963m096o943J5010o915q001j2083
$$ y = [32334, 24949, 20042, 37084, 28493, 11089, 4935, 36401, 37695, 35824, 32710, 20953, 15058, 1864, 5978, 8611, 15313, 10422, -24, 10611, 15820, 12775, 21475, 10692, 18993, 21760, 26121, 45433, 53655, 34712, 24004, 52382, 56024, 53904, 42129, 15886, 24011, 55924, 53298, 41145, 41127, 23599, 27358, 8876, 8328, 8178, -6746, 1812, -9465, 9984, 20687, 4065, -7422, 3491, 19463, 10476, 18502, 37296, 31436, 26337, 40075, 52600, 60584, 37883, 39617, 49901, 36600, 15973, 15042, 11728, 16008, 5796, 13838, 23159, 22977, 20583, 29003, 34856, 25810, 23861, 4692, -4342, 3277, 28069, 20159, 20393, 5755, -5337, -13908, -13516, -17941, -19851, -13231, 9719, 16627, 20482, 38650, 23948, 16238, 24834, 27435, 32398, 28302, 21359, 36369, 29454, 21453, 9370]
12904I370J1181J0888k2057j9579l513P258J8273J0324j8870o909P490K0482n85
12891B3753k058l164N713m418N335K2489m971j3135j3392n78J7168J1243M370
12878D8355Q005R446m497R277J1902p019j9022k7908m661j254k764k419m043K887
12864A6285l19J1375r854L948r779j6111K0039J1580j5645R646m091k8573R950
12851a549J8177P533L609o653r622j0722j373l490k120J5287j520N79k986J9556
12837B4706n611J3867J23r221j1869M050K3181j0429l2485k0627K114K6226L1862
12824C5887r50l78j9918M914K336l661O117K2243l236r802O625r404j0611o63
12810A9499q033o601Jo099o468M045L542M495m943n999n262L358R201R86J2919
$$ y = [9370, 20551, 31439, 9382, -10197, -13710, -6452, 11821, 22145, 3275, -3634, 3856, 24338, 23753, 21695, 18531, 24244, 19826, 25161, 47650, 42679, 29544, 16152, 15574, 32742, 43985, 48355, 56360, 65806, 61309, 70586, 82488, 75469, 56447, 28539, 23878, 22624, 19860, 17441, 13398, 16285, 15966, 27341, 17487, 21435, 11656, -4455, 15584, 27164, 11519, 21165, 17074, -11499, -1549, 16628, 24161, 27770, 21117, 11495, 773, -600, -4090, -6210, 9077, 7557, 8136, 5150, 24706, 19095, 32962, 33085, 23864, 11995, 16045, 39226, 28797, -3688, -24315, -22201, 4025, 35887, 34937, 34559, 14641, 19555, 21891, 18230, 24347, 46590, 43354, 33552, 40177, 30773, 20162, 19499, 11466, 4865, 4866, -1233, -7701, -3656, -114, 4381, -562, -6561, -11823, -8465, 736, 1722, 14641]
12795A4641J568O188r190j4129M854K5478o583j2438n698J7887r025K099K1793
12782C7445R877l2893r411J8248K8101J1713p491j1662m683n374l666n026J1013
12769C6191j2418l135r85R309j7452j5763r904r241K4072K2483m301l922l30k331
12755A2273k254p26q832k2069K5698J0457r84J3434k4255k541R704N410j1375
12742C940l826N644J0575J4445o995n707l0956Q094Q961j200O90Q087M37M546
12728A6735O264J3858K3386J2266O02r784j3088j6545k2661M512L595j6345J4094
12715A6889o796l635L913J0975J674J2623K1439N933M129l217j1430N164n764
12702E1897n870j8474N707Q789l7797j97J5450n490m549O254K059j2743j2870
$$ y = [14641, 16209, 22397, 13207, -922, 3932, 29410, 22827, 10389, 4691, 22578, 13553, 15652, 37445, 47322, 14429, 5018, 23266, 51367, 63080, 55589, 43927, 39244, 33870, 30204, 25178, 36191, 23773, 20638, 19653, 28962, 11510, -4253, -14157, -23398, 674, 23157, 18856, 14934, 14604, 12273, 10019, 9293, 461, -21608, 4090, 14547, 13563, 26997, 2742, 201, 9905, 15315, 3940, 114, 5758, 16333, 30778, 23783, 18076, -12880, -4786, 4175, 2975, 3665, 11752, 12189, 16735, 22999, 36857, 60243, 72509, 73111, 63327, 50239, 33694, 11033, 15545, 19140, 2795, 16889, 10093, 6458, 10371, 21346, 23020, 35643, 57082, 63015, 67144, 63927, 52497, 57661, 51897, 46027, 27553, 33260, 42049, 4252, 4055, 19505, 14015, 9466, 15720, 17779, 5036, -7834]
12689g834J8881L8671q592k1310j2780J433J382K84J2294r430j3236J1969J2337
12676B4069M159K997r883P594J9279o515j4921J5431J1107l408r480l650L227
12663D0006N130k688k311j2436O93J927n422P852K1022k2902k2126j2773O702
12650B674J4476K084p103J7699q665j3252J4029r15j8976l273R763m677K612O586
12636A3062j2106M459K7777k864k4409R204J217J9833J1285k6994k178m816j7152
12623c682R867R021j8438l417Q897l033J0181K927k4078P709l792M021J7503m83
12609A3203P607O484p888j0996J5068J7981j8468J183P282P39J9363j6565P42
12596C5735K242Q972j647k3445j4114m446L853p23K1020M279L819q364m069o572
$$ y = [-7834, 11047, 49718, 41126, 19816, 7036, 8469, 9851, 10135, 22429, 12999, -237, 11732, 24069, 28228, 31225, 21342, 28936, 48215, 41700, 26779, 42210, 53317, 49909, 40429, 36779, 40006, 45136, 42448, 40137, 27701, 28394, 30321, 24899, 32751, 53773, 30871, 8745, -4028, 2674, 17150, 19234, 12131, 29830, 21165, 7913, 21942, 21027, 2051, -1222, 8541, 3864, 6476, 13062, 956, 5415, 33192, 30328, 5919, 15123, 16340, 36173, 47458, 20464, 18286, 13470, -3682, 6185, 15206, -3232, -6649, 2248, -785, 9396, 12323, -11755, -4046, -7838, -3817, 13686, 13203, 20810, 27294, 19406, 8410, 23478, 41459, 22991, 24174, 31456, 32195, 51558, 34993, 35735, 37977, 46949, 45302, 21857, 7743, 3297, 7150, 6427, 27447, 31726, 35545, 27181, 23112, 16540]
12582A6540l448M239J317p491J497O947J8423O558O690j3296p695k3093K552K7599
12568C7339J246K403K581n98r095o296p195J164QJ2601j352k2054J3534J8724
12554D3010j3594j6722l034k874L699J223K498P168o667J958N065j3469O9K20
12540H550K4962J5803k0388l530K6239K143r138L635j9496k5528j2004J7409J7844
12527B6501K7821m223m346q020j168r172j5620J344J612L2665j6313j9369o675
12514E037N871J032l648N123o04o066Q195L502J6044J8351K715J7910k6469l2016
12500A4977l6340o537K4484R630J2218K2577n005K618q353o81L0085J5984j1075
12487F4582p540K899p929j0778O129L657j9163n849j8958Q864k5644J3833Q448
$$ y = [16540, 13092, 17331, 18648, 11157, 12654, 19601, 38024, 44582, 51272, 37976, 30281, 7188, 9740, 37339, 38585, 40988, 43569, 42971, 33876, 27580, 20385, 21549, 21557, 34158, 32806, 10752, 24286, 43010, 29416, 12694, 9660, 6786, 10485, 11708, 14206, 21374, 14707, 16665, 21730, 8261, 8330, 8550, 33512, 49315, 28927, 25397, 51636, 53779, 44641, 48276, 28780, 3252, -8752, 8657, 26501, 54322, 50099, 45753, 37733, 36565, 27393, 11773, 13117, 14729, 47394, 31081, 11712, 5037, 10908, 11940, 8292, 13415, 12811, 6745, 14940, 18442, 34486, 52837, 55552, 73462, 46993, 14977, -21363, -27900, -3416, 6214, 18432, 41009, 36004, 38622, 30269, 29588, 59673, 75657, 64582, 57042, 59941, 52012, 41234, 47363, 51020, 31857, 26008, 7050, 15914, -9730, 4103, 12551]
12474A2551j8188J1027L0962m5j5799l2937k1765J8893J3669J7060J7855p689
12462B5594K398Q431k0104j5232J1576r141N14L977M916J858K2731J6471j6403
12449C7586j2942j0091J0763j8577r351K1232j152N55J2195j7462p244P611l976
12436I147R910j940J3708M322R9R593J0463j686M222m1288j3295J2607M1Q845
12422B4748J5603M229j5303k0970j2623K0276q96k4871K3631J9730q134R227o453
12409B8194j7899M377j558j0619J3654j147J469O259N42j1548K0038N928r846
12396B7844K782P389R859r203j3360l105P236j390K650r587k803J1877r080k1
12382B1088m979j0382J1339q160j7128K4591L8857K3674r781N892j5989j884K448
$$ y = [12551, -5637, 5390, 36352, 36307, 20508, -12429, -34194, -15301, -1632, 15428, 33283, 25594, 27992, 36423, 16319, 1087, 12663, 3522, 4036, 8013, 12929, 14787, 37518, 53989, 37586, 24644, 14553, 25316, 6739, -2612, 18620, 17468, 18023, 30218, 12756, 5512, 13123, 9147, 19057, 17117, 30825, 35147, 35246, 44839, 55302, 53616, 57838, 16550, 3255, 15862, 15903, 24748, 40351, 44580, 29277, 8307, -4316, 15960, 15064, -9807, 13824, 33554, 25420, 34647, 28194, 10295, 14672, 13114, 2495, 16149, 15002, 16471, 22730, 23272, 11724, 31762, 37690, 27844, 30626, 38015, 47874, 38671, 25311, 22206, 29442, 28052, 30702, 21115, 18312, 30189, 21109, 21088, 16109, 5727, 17066, 8906, -8222, 16369, 55226, 78900, 69119, 75011, 59022, 57138, 59586]
12369E9586j1659n798R302j3645m505r648O232l393j48J4247Q042j0763k2080
12356A5770j4827m496Q683J7540J1522K3450q117k84r731k9097j6173q713M924
12343i549R324J5410J3598P884k272k2807J2886J0786j076n471m785K321Q072
12330C4321J7277j6206j2899J7366J3827j2363n165j4403j3958M076N83j0579
12318A877Q974N245p353j312J5924J3962J6318L922n506k4345j230l181o336j1298
12304E661M348j9828m516K2816J1414p481r739J7702J9565J6246l0310j7406J9034
12291B7506J7482p96j2923m3896j0607J7158M2232M194J1443J829m1095k5815
12279a3288n28l77R175L351r733q706P85J0279Q368L416J122j3766L464J1602
$$ y = [59586, 47927, 42129, 51431, 37786, 33281, 23633, 29865, 26472, 26324, 40571, 48613, 37850, 15770, 943, -3553, 5130, 22670, 34192, 57642, 49525, 49241, 39510, 10413, -5760, -14473, -9549, -225, 15185, 28783, 36667, 34395, 11588, 24474, 35260, 34184, 28713, 23928, 26249, 34321, 51598, 35392, 22493, 39859, 53686, 41323, 36158, 21755, 7797, 11873, 12456, 1877, 10851, 16096, 8743, 7431, 23355, 37317, 53635, 57557, 52051, 27706, 26476, 23295, 16959, 5661, 10009, -9819, -14335, 8481, 19895, 12414, 2675, 20377, 39942, 56188, 25878, 8472, 27506, 44988, 44192, 31269, -12627, -23234, -6076, 36156, 40350, 51793, 53622, 12527, -13288, -13816, -14193, -5018, -1667, -11400, -20106, -19321, -9042, -674, 2742, 3864, -9902, -6438, 5164]
12265E164p051K546J138m359o976r2o455O887l81K040J0449K8291R946j3190k2633
12250E324j3756k3216P540J4217J1243J0802k938N262O125L258J2234k388k395
12237C1312J477l270r834m491Q315K80K1109k024j7914M243N312N854r960k0093
12223A0316j737J1993o191p493O129R967l609J6946K5562k619j7426j0903M990
12210C5925J603J2779l0771j7267J0108J9414O130o596M510K2107J3518j8163
12198E3297j3791m613J2012O987N524M515J0240K945r594j7388k1875o341J5228
12185C7146j0059j6422N225J2542J1518P32K394j1892j5524l899J2115K070r248
12172A6698q602k2685K3715L3080R875j9381j3733j7411j6235J9339J8633j6424
$$ y = [5164, -1887, 659, 1797, -2562, -9538, -9630, -16085, -9198, -9579, -7539, 2910, 31201, 41147, 27957, 5324, -8432, -31648, -24108, -9891, 1352, 12154, 9216, 14478, 20603, 23861, 36095, 33707, 31312, 32789, 29519, 19685, 15194, 23509, 23789, 44898, 42874, 24960, 29203, 34515, 40369, 30409, 10316, 8579, 20572, 14381, 6888, 13017, 22984, 19375, 36321, 61883, 59264, 41838, 30935, 35925, 37528, 50307, 19536, 2269, 12377, 31791, 37921, 31325, 35835, 57942, 71460, 53297, 39506, 34893, 46905, 53892, 59416, 63931, 74171, 77116, 67522, 50134, 28259, 21918, 37146, 27087, 10665, 15890, 28432, 39950, 40682, 43076, 31184, 15660, 11761, 23876, 25946, 16698, 8096, -14589, 9126, 42206, 52081, 32700, 18967, 1556, -14679, 4660, 23293, 6869]
12160F869j3837K0048k395r710o933J6315J0663J3588o461n863k640j2787k536
12147D321J8357j222k168Q147m355j8472O43j1640M218J8580O269j098m3m066
12133A7471k648p384J3789j720m7O426j1961J3443J0913j1643J131L769m578k0531
12119F430j9065M098J0802K1681N863K062q807K793J0492j4106k041k2261O001
12106C942K7934k089K327j6309k4358K2501L0039N172j2577j929r955L627J082
12093B9407M741J1767j4983j8590j4733l111J552K8784L2031j0738k9812p586
12081H729K1707J5577j1391j2189j6686o069j2373M632j3187p643N224L263J0833
12068i573J3788L051Q797Q119K1789j721j9634k0218L2168K55j7293j1829K6287
$$ y = [6869, -6968, 13080, 10685, 975, -5958, 10357, 21020, 34608, 28147, 22284, 19644, 6857, 4321, 22678, 21456, 19288, 27435, 23080, 4608, 5251, -6389, -2171, 16409, 22678, 21580, 21537, 17471, 14823, 7439, 21228, 19508, 19461, 25887, 13926, 27369, 38282, 26639, 27770, 31539, 26961, 6430, -12635, -8537, 2265, 23946, 29809, 31871, 23064, 25857, 36349, 22243, 20202, -2059, 3942, 31876, 29787, 32114, 15805, -8553, 13948, 43987, 49159, 36582, 34653, 24698, 28325, 29407, 34148, 45915, 30932, 12342, -2391, -5502, -3950, 24834, 56865, 46127, 16315, 8729, 30436, 46013, 34622, 22433, 5747, -322, -12695, -8063, -21250, -28893, -23669, -20406, -9573, 4215, 7266, 16063, 24182, 45971, 44250, 24616, 4398, 36566, 36821, 19528, 7699, 33986]
12055C3986K310k5903p51j3527k3622k021K850K9397O425L082p326r187J4953
12042A0666K587l220j5414J6111Q864j3354k9571K014J4259j2876j9155J1032
12030b8057J2455L85m077K684m181J4729J1820M478o03Q20o12n143k675r490M911
12015b556N038K0740p014j0703N161K416j3630p804l05J5661L700O431q984j4212
12001f061j659K0515j3732p224Q901J260l370L657l969R711L0324n67r709n128
11987B2949j0466m651Q839K6645m360j6687O975O729j0821o08l653M410R743k3965
11973A1079k801J7879j7273q251J9542j0362j8622R388J1836q575j2989J7675
11961H526j5675j2611J3718n214p402n086K5284j176j3880j254K940k98m631j5129
$$ y = [33986, 36296, 10393, 9642, -3885, -27507, -29528, -26678, 2719, 9144, 12226, 4900, -4287, 10666, 13253, 10033, -5381, 10730, 19594, 6240, -23331, -21317, -7058, -19934, -39089, -28057, -15602, -15217, -19294, -16610, -20791, -6062, 5758, 10236, 9633, 10453, 9841, 4698, 2023, -7467, -2556, 2482, 23222, 16208, 5505, 10666, 13082, -548, -8352, -8657, 7004, 10704, 17135, 8151, -6061, -7720, 12795, -937, -8161, 740, 2000, -1370, 2287, -1682, 8029, 38353, 37786, 28077, 22949, 12483, 7832, 16671, 43316, 38956, 22269, 29244, 35973, 25152, 24544, 20891, 25301, 35044, 11079, 8278, 26157, 8884, 633, 20175, 9813, -8809, 579, 12415, 3840, -9149, 8526, -7149, -19760, -6042, -11256, -18658, -23744, 1540, 364, -13516, -14770, -11830, -12128, -16759, -31888]
11947c1888J7095J4070M408r38q90j5638J7429j759j7776O652K819m602K2111
11934A1093M968o361k454N983p127m677j935k292k148K350K4399r492J0537O042
11920B8886l2507M139J0902O615j5948j1835J8562k370j1441k670R407J9525j1372
11907I893M4N801k467k1636J864m728J3296l849O052J0672K117J5402J1625l1395
11893A2691j6945J5494j7852j0833J0197J7615J4232J5778K586j9616j2594L526
11881A4279r644j3986M339J3814p190k694J0126p903l576P265j593L228j706j5364
11867a0605j5566J5722L7336K1482k0216k6634L039l339j0788K84R552K265J8419
11854B0951J2092P986N22j9465k3402J927j069J704K1118R463l2226j3186L2255
$$ y = [-31888, -14793, -723, 3685, 2747, 1857, -13781, 3648, 1889, -15887, -9235, -6416, -11018, 11093, 16061, 9700, 7246, 13229, 6102, 1425, -510, -2802, -4950, -2600, 21799, 12307, 22844, 28886, -3621, 518, 11420, 18035, 2087, -9748, 8814, 6444, -4997, -7667, 1740, 21265, 9893, 9937, 15738, 13271, -8365, -6501, -11229, 2067, -1782, 4270, 14942, 17059, 32461, 44086, 12691, -4254, 11240, -6612, -17445, -7248, 10367, 24599, 40377, 42963, 23347, 10753, 14279, 4635, -9351, -5012, 8802, 1612, -1082, 9044, 1141, -2435, 4830, 3237, 6465, 4759, -10605, -26171, -10449, 26887, 48369, 28153, 1519, 4558, 1219, -9569, -9285, 267, 2532, 20951, 33043, 41029, 41551, 22086, -1316, 611, -458, 1246, 22364, 31827, -399, -13585, 18670]
11841A8670n71k5556j4832k3159M313Q563m671Q12M1808J8759j3623k0681R471
11828f97N395n326R04N690q090k3370Q639J6312k212J6511N028P379Q194J28J6671
11813E1156r678j7037j3275k7719J151K5946Q298k8346j7984J095O759J5119Q855
11800D340j4821n323J2697J1251j7870r877j930J0424L895J4321P042j4493j0182
11787a0526k90P637q160n049Q140K321J7769o857N603n175l4603j1607Q834K6994
11773d969K3288O088j149k4884j5942J4210j0443j6708J0284o54j3604J7523P03
11760a6257k3476o133J4590J2288J6338N279k3834J2085K5030N782j548k4620
11748d476l5133k0653P763J56R717L8401J7205L727k545k3057p109r173j629J1300
$$ y = [18670, 18099, -7457, -22289, -45448, -41135, -32572, -37243, -36431, 5377, 24136, 10513, -10168, -697, 4698, -628, 276, 5966, -2124, -25494, -16855, -543, -2755, 13756, 18784, 26163, 34357, 34485, 51156, 41478, 24441, 11166, -16553, -15402, 10544, 18842, -9504, -27488, -26393, -19634, -4515, 4340, -10481, -15804, -3107, 8144, -9726, -19603, -21533, -11109, -7214, 7107, 14149, -344, -10526, -10816, -3179, -11339, -16388, -8248, -5927, 11842, 4985, 10588, 5413, -29190, -40797, -31963, -4969, 18319, 24407, 23258, -1626, -17568, -3358, -13801, -30509, -20225, -20879, -34483, -16960, -16257, -39733, -45866, -31276, -18988, -2650, 2629, -21205, -9120, 15910, 21692, 20144, -4476, -39609, -60262, -52499, -52343, -42626, -4225, 12980, 16707, 14162, -8895, -16004, -25177, -26806, -15506]
11734a5506p672O223J0048k919J258j0476j20P067K13Q967m941O428j337j3389
11720a6156K6053R687o921l495j2833k4249P133J5036q406k1404n186O241L4010
11707d90R93q613J0043k2750o466J8399o95j5043j4886L282m351J7724K6374J8737
11693B2258J5685k865j9827j8719N554r158l925J0346j0229n334j091Q44j5067
11680c1528j040J735K59J3394M476j2846m300R634J0757L813J6901n24q396L056
11666E391j1788j3124r808K566N40k0745N9J3225M35j5744k0415m19J4522J5799
11652c9506O753l211Q130l673j5587P265L121J9160J3783J5149L238Q574j8099
11639E097k0604J1210q417k789j2898j1256J5964o83r38J374N366k782j1628j1260
$$ y = [-15506, -23178, -16955, -6907, -9826, -8568, -19044, -19164, -12097, -11884, -2917, -7858, -1430, -2767, -16156, 9897, 19584, 12663, 9168, -3665, -27914, -20781, -5745, -14151, -35555, -40741, -34500, -490, 503, -8110, 1933, -20817, -27283, -8884, -9579, -24622, -39508, -36226, -40577, -22853, 3521, 22258, 37943, 35078, 15251, -3468, 2086, -7072, -10997, -651, -10880, -16214, -17305, -16461, -31528, -32568, -30833, -30574, -17180, -12704, -25550, -29850, -20216, -9459, -5646, 11255, 10731, 2335, 5391, -6397, -19521, -29329, -26763, -26223, -46968, -46909, -33684, -33249, -48993, -69408, -69827, -55305, -39506, -32753, -35964, -27834, -31507, -47094, -39829, -36708, -17548, -3765, 11384, 14622, 23196, 5097, -15507, -4297, -12714, -15503, -28401, -39657, -23693, -24376, -25314, -23940, -18574, -21356, -32984, -44244]
11625d4244J592P568K0434J3886j5554n354J4318o56k7608j7981p743J4989j5259
11612f1612J1622L1329K613l1519r719J284K652L1762q539j81N536j8060j1688
11599e4520K5648P644O629J0345k787k0510j9076K315J9257M919l81P697l82R714
11585c488M79k0450n384j3369l067j0425O501M648j9005J4289K9425J8269R64
11572f13j2723j0634p022l630k4282j8585J7387L2571J1407m078j6110j8579K889
11559e2002J1713o377N211k347J1791J769q290R056N622j2746j8849N59M442j4397
11545f4845m323J2124J6726J5878j4615M25M479n741O376J0634q209p871J0983
11532b7979j0751J3535J3685l530m683k4113j6203J3489k230k14M101L885k810
$$ y = [-44244, -42652, -35084, -14650, -764, -16318, -21672, -7354, -8010, -35618, -53599, -61342, -46353, -61612, -49990, -18661, -16048, -47567, -57286, -56002, -53350, -21588, -30127, -30308, -24772, -42832, -54520, -28872, -21228, -14599, -4254, -7041, -27551, -46627, -44312, -25055, -20136, -20517, -12820, -13202, -3488, -3009, -23459, -28843, -42212, -45279, -55704, -49203, -44555, -63560, -49271, -19846, -1577, -613, -13336, -23970, -30992, -34622, -58904, -77489, -60102, -27531, -16124, -20202, -36312, -54891, -52002, -40289, -46666, -41455, -43802, -32011, -30242, -38532, -29476, -23854, -36600, -55449, -54890, -50448, -64845, -69168, -57044, -40318, -24440, -39055, -38630, -34151, -39892, -33516, -22882, -31091, -38962, -27979, -38730, -25195, -11510, -15040, -19723, -43836, -60039, -46550, -48780, -48994, -44893, -41008, -43818]
11519d3818l612k5476R80R829m310J4831M448L019P14M483j0703J7412k0071j4324
11505f6598J7100K3483j6300k2354M90k408n988k342L343J7326R443J0954J516
11492c2335n484m758O071j956J3766Q163j3297N263J0600j8247p714J3155j3355
11479d0128O024J0894j9028r226N758r060J3521K4452r030N669M019l4796l4435
11466h5366N424J7413r549Q814K558J5340J5838N304L421l599j6846j4361K2R428
11452d6159O632j2893k1698L18J0617j6000L711M613q811j2685m167P015K0679
11439f8828K1372K757N500M731N52l100j598j0361k3036j3240Q933K3001o259
11426e9576J2215n233k2762O150L476Q219O703Q885o834j4697J524R860P968o95
$$ y = [-43818, -47430, -72906, -71926, -62097, -66407, -51576, -47128, -44109, -43395, -38912, -49615, -32203, -52274, -66598, -49498, -26015, -42315, -64669, -64179, -66587, -72575, -74917, -71574, -54248, -44805, -33851, -32335, -37819, -42577, -36506, -38462, -24696, -16533, -29830, -24567, -13967, -32214, -39928, -26773, -40128, -34104, -23210, -42238, -51464, -45706, -54766, -41245, -16793, -25823, -20154, -16135, -50931, -85366, -79942, -62529, -72078, -63264, -60706, -45366, -29528, -24224, -20803, -24402, -41248, -55609, -55587, -46159, -39527, -52420, -74118, -73800, -63183, -79183, -75472, -70859, -79670, -92355, -96522, -89507, -68828, -47456, -44699, -39199, -34468, -33916, -37016, -38614, -48975, -72011, -85251, -76318, -53317, -59576, -47361, -52594, -75356, -69206, -65730, -57511, -50808, -41923, -48757, -63454, -61930, -52070, -44102, -44797]
11412d4797j9155r404O073J6469O553M799J3575o192m0044n285J8200k40r28K3317
11398c7059K488p172J1662q067j2278K4633M081R92q598k3085j8049j3830J0384
11385g3898K170J580k3007L903P731l227J3060J6671J2524J66l209J019o33J949
11371d3201J0131j8832j6300R033J3519k2516p703j17R721J4387J5745K556k9
11358c3606k954j2684J7209o921j3624j1479j7106K430M258j4756O149K0005J2466
11345e0613O420q219j0385J5520J2593P319r052L337j5580j2504j2948k495O583
11332g0024J9134N596R523j0371r381k2197j3257k581j5206K375k846J0844q67
11319i9258J4030j17J0283k1596K9480J278o239p376K1112K9060R831O598j4235
$$ y = [-44797, -63952, -73356, -67283, -50814, -44261, -39462, -25887, -32079, -72123, -77408, -59208, -59448, -60376, -37059, -34571, -41743, -30081, -38148, -50426, -25793, -21712, -20720, -29318, -52403, -70452, -84282, -73898, -71728, -70148, -93155, -89252, -81521, -84748, -71688, -55017, -42493, -42327, -45536, -44517, -45150, -43201, -33070, -51902, -68202, -59169, -45650, -68166, -75869, -75986, -66265, -51878, -36133, -33577, -33606, -36560, -49244, -32035, -38956, -52580, -64059, -81165, -78735, -74477, -89233, -83084, -63079, -50613, -44193, -52412, -62797, -47277, -34684, -27365, -36417, -33080, -48660, -61164, -74112, -76607, -70024, -50890, -45294, -35771, -46142, -55523, -77720, -90977, -93558, -108764, -106389, -109235, -98391, -99258, -85228, -85345, -75062, -96658, -67178, -65900, -72139, -79515, -58403, -29343, -19512, -12914, -27149]
11306b7149l0622k4138N11K7026K362j4122J0970N292Q765j0309k094k1014n688
11293h0210n727p87J526r061P856Q62K787M793l27J7116j2187q733O813o401j5760
11278i7440k7787m069J5460J3422P006L957O082q30n61J2045J5255N454j4069
11265f6075M475M711j3683j0707q209K1096K876k260n616j5404j0561J261K3055
11252g5041L0204J5172l656j5746l95L346k4196O608j5990j5156J9858J7068j3694
11239g1618k2263J2390J4064J4742N469j6620j3135q448j5963k888J6078P574
11227h0618K0689K826j9952o952J1738k480J6425P362J546j2558o874j2762J7383
11214f4227q485k241K2670j8498o854P731J474j2161K929J0082L13J650j5782
$$ y = [-27149, -57771, -81909, -81398, -54372, -52010, -66132, -55162, -49870, -41105, -51414, -53508, -74522, -80210, -85937, -86724, -85198, -94259, -86403, -85541, -82754, -77961, -78288, -61172, -73359, -82092, -75279, -81680, -97440, -125227, -129296, -113836, -100414, -93408, -89451, -83369, -84199, -84760, -72715, -57460, -52006, -66075, -61600, -56889, -70572, -81279, -89488, -68392, -65516, -67776, -73392, -88796, -99357, -98096, -75041, -44837, -29665, -33321, -49067, -49462, -46116, -70312, -63704, -79694, -94850, -74992, -57924, -71618, -93881, -81491, -67427, -52685, -47216, -63836, -76971, -85419, -101382, -104270, -88192, -80618, -59929, -57103, -77055, -84007, -72269, -74749, -58324, -50962, -49416, -61974, -68848, -81610, -64227, -72712, -74953, -52283, -70781, -77635, -69904, -68430, -80591, -77662, -67580, -67267, -65617, -81399]
11201h1399k4554k6655Q797J0871K0725O690J557K438q133n597k6Q997K698j0634
11187i4225j5663J342K4396J2099O356r257J1086P463N789L731j2194j5970o806
11174h1853J0116J749j4212K252j7643m296p171l416K4948R902j5967j5786J9124
11161i2253P554k5554O016N913N6r236J5403J4127j802j8044L650o901J0180j1350
11147a02241J1416J931r308R210K2496p104j4206r784P692j4914j0357Q854O756
11134i9559k595J6581o38J5843J0527J5850J4106p284m0999m0984k1128J796N227
11121a33257J9504J345j151J2167J934j6547n20J4161j953m999M83j676k7569
11108a38078L738J9020K0381O228O715R077o068O346P856j0701k851J7047P522
$$ y = [-81399, -105953, -132608, -123811, -112940, -92215, -85525, -83968, -81530, -89663, -95260, -95286, -86289, -83591, -94225, -109888, -108546, -84150, -72051, -65695, -74952, -63866, -56403, -50614, -46883, -59077, -75047, -81853, -71737, -69988, -84200, -81948, -99591, -103887, -111058, -114474, -89526, -79624, -95591, -111377, -92253, -84699, -110253, -104237, -98324, -98268, -107504, -92101, -77974, -79776, -97820, -94170, -101071, -90891, -102241, -90825, -88894, -98202, -88992, -66496, -73600, -87806, -97590, -89898, -104812, -115169, -106315, -99559, -102154, -85573, -86211, -70368, -59841, -43991, -29885, -37169, -78168, -119152, -140280, -138484, -133257, -113753, -112408, -113559, -101392, -99458, -116005, -116525, -102364, -104317, -109316, -108833, -110509, -138078, -134340, -115320, -94939, -88711, -81996, -72919, -78987, -72641, -64785, -75486, -78337, -61290, -53768]
11095e3768K539O360K467K4068L0595N4937N3863R3377J61006J92879K67364L32526
11083A168213L50030K15464j23896l25246l31962k85742k22290j45722r6408n9622
11073A42819k5898k9654m0447l3094k114r600l2348j9421j399Q461L91p817j6952
11060f7073j6671O039J0720k6287j4237l990J6858j1777r3J8486j343r399q142
11047a06909P327P140n558j6159J2046q168l569J8408J684K053P448K9302L440
11034e1515j9142n085K3685J5520j873k3319J194J7018N940n116L602N850j1141
11021d4382o204j5596J4205J0838l446J5070L9855K6256K5435J4447j4036k3699
11009C8743k0759k4053j8742q964K365J5149p749J2302J1035L801p757l2440m6100
$$ y = [-53768, -51229, -44869, -42402, -18334, 12261, 67198, 121061, 214438, 375444, 568323, 835687, 1168213, 1518243, 1733707, 1609811, 1284565, 952603, 666861, 444571, 298849, 202441, 142819, 116921, 87267, 46820, 13726, 11612, 2012, -30336, -49757, -51156, -42695, -42304, -50121, -67073, -83744, -77705, -66985, -93272, -107509, -111499, -94641, -106418, -106511, -88025, -89368, -98767, -106909, -99582, -92442, -98000, -114159, -102113, -110281, -113850, -95442, -93758, -91705, -84257, -54955, -51515, -70657, -75742, -52057, -36537, -38410, -61729, -60535, -43517, -37577, -42693, -39091, -33241, -44382, -50586, -66182, -51977, -41139, -44585, -29515, 10340, 36596, 62031, 76478, 62442, 38743, 17984, -6069, -24811, -33775, -31410, -16261, -24010, -11708, -673, 3128, -4629, -37069, -83169]
10996h3169j4061j2883j4781K654j5967o232J0193J9102J0168m499r291J267m67
10983a17966j4445k5710O049o158j3956J075J2141j2558L288J235J6201Q906l11
10970a42209K713j687K972r275j0679j5136k3367L1648K1446n912m078j5177m85
10957a69226L733J22r408J4474J1124k3750r851J7984K7706J9613r550k3264j710
10944a52003l075r576M412N043k0680q675M478j4526k4572O89R359J0262N087
10931a93777N428j9499k127M365Q300L90n896l6569k872K1963J4450J4481j9828
10918b11191L642J3572K4868J3167l197j4648j3372J5298J0055l1968L893k690
10906a92571M310R561m760k0312p099k532L4504L1937J7891J6719J2445J5537
$$ y = [-83169, -97230, -110113, -124894, -122240, -138207, -144439, -134246, -115144, -104976, -109475, -118766, -117499, -117966, -132411, -158121, -152072, -158230, -172186, -171111, -158970, -171528, -168240, -167005, -150804, -141898, -142209, -139496, -141183, -138211, -147486, -158165, -173301, -196668, -165020, -143574, -149486, -153564, -168741, -169226, -165493, -165371, -174779, -160305, -149181, -172931, -182782, -164798, -137092, -117479, -127029, -150293, -152003, -155078, -164654, -160242, -155199, -175879, -184554, -180076, -194602, -219174, -218485, -209126, -198864, -193777, -188349, -207848, -209975, -205610, -197310, -196920, -202816, -239385, -242257, -220294, -205844, -191363, -211191, -207549, -193977, -169109, -155942, -159139, -173787, -187159, -171861, -161806, -193774, -189881, -192571, -188261, -178700, -183460, -203772, -210871, -213403, -178899, -146962, -129071, -112352, -99907, -84370]
10894h4370Q073J1113L2593L0617K1473n693l315p164k0474j8537j3569j4766
10882f4019k5546j6903k2321j6635j7973j6103n193n45j3988k1414k4149k9323
10870b74112J0343P175N933L838J0490N342j1577N702J172J4449M990j0598k583
10857b29436J761J3985J1826K90k986J182m480N327J1326O174P09j0713j3627
10844b08662j278O040j2724P231k3621l1054j4066J715j9620R982L5107R322K4109
10831b17519P506n1080o5408p9153j07159m9311K8036N7135L5554K6636J9078
10820c95685K776o043J8348M554J099K4926J7037j44m975k5704j5533N890k077
10807c75531R949J0427r678M206J6663o557q628j9146J0113l256j1757J3938P286
$$ y = [-84370, -76297, -65184, -32591, -1974, 19499, 13806, 10491, 3327, -17147, -35684, -49253, -64019, -89565, -106468, -128789, -145424, -163397, -179500, -184693, -185238, -199226, -220640, -244789, -274112, -263769, -256594, -250661, -246823, -236333, -230991, -242568, -236866, -235694, -221245, -216255, -226853, -229436, -227675, -213690, -201864, -201574, -204560, -203378, -207858, -202531, -191205, -185031, -184322, -195035, -208662, -209940, -203900, -216624, -209393, -233014, -264068, -278134, -276419, -296039, -286057, -250950, -241628, -217519, -210013, -261093, -326501, -405654, -512813, -562124, -534088, -476953, -441399, -414763, -395685, -392909, -398952, -380604, -376050, -374951, -350025, -332988, -333132, -338107, -363811, -379344, -373454, -375531, -365582, -355155, -364833, -360627, -343964, -350521, -359149, -378295, -368182, -371438, -383195, -369257, -361971]
10794c61971L147r161O926L444K4517K4126R680j392m984J8216n578j6699r635
10781c19364j4551J2651L777l913j3595m037K6876K476k1838j6039l062K5612
10769c25007P963j8119j5629O514j4583n931m32j3844M118j9363m0931k8885l0148
10756d94277j4659J2385l2919o634R614J193N16K7310J826k2343K4790J4434j0297
10743d89061J2077K445o967k1807r403n937r1J1778p87j3047n349q805j2989J3374
10729e34569P050O610K3058K2095J6878j2162K22k0126o487q462L087O080n249
10716e01975j4951J4085J0540N05K32j5109k3736j5098J5237m339k4328K6357
10704e32580L4736J9971K1407K8927L0017K1016P128L3591N2095L2370J1702P372
$$ y = [-361971, -358824, -367985, -361059, -357615, -333098, -308972, -299292, -300684, -305668, -287452, -293030, -309729, -319364, -333915, -321264, -317487, -321400, -334995, -339032, -312156, -309680, -331518, -347557, -350619, -325007, -317044, -335163, -350792, -344278, -358861, -364792, -365224, -379068, -374950, -394313, -435244, -464129, -494277, -508936, -496551, -529470, -536104, -526490, -525297, -524781, -497471, -495645, -517988, -493198, -478764, -489061, -476984, -474539, -481506, -503313, -512716, -518653, -518744, -506966, -507753, -520800, -526149, -534954, -547943, -534569, -527519, -520909, -497851, -475756, -458878, -471040, -470818, -490944, -497431, -505893, -502806, -496726, -501975, -516926, -502841, -492301, -491796, -491564, -506673, -530409, -545507, -530270, -534609, -558937, -532580, -497844, -477873, -456466, -427539, -397522, -376506, -369378, -335787, -283692, -251322, -239620, -232248]
10692b32248K1491L5025M3030O0654P2565R3264R9533J29345K49183M67956P29666
10681A769464R75284R12281K46886n79213q69291p45206m85204k70315j67743
10672G86943r2712k3255P213K249M7042P2124O3793O6322Q9564J35096J85253
10661A339632J85992K35475L11870L62864L89622M47097O34397Q67822J184412
10652E959183J519936J645224J486020J413647J714803K454986L602586N106033
10644B4902418P206765J0414322J5461221K3636274L6690366N5944705P8293807
10637B52549878Q6344914M5984123l0607994p7826654p6770182n6014589l7594146
10630A06065350k5302215j7477752j2399564r063870o764239n142642l953767
$$ y = [-232248, -210757, -175732, -132702, -72048, 517, 93781, 193314, 322659, 571842, 1039798, 1769464, 2744748, 3657029, 3903915, 3324702, 2455411, 1710205, 1225001, 954686, 786943, 694231, 670976, 678189, 680438, 727480, 799604, 863397, 929719, 1019283, 1154379, 1339632, 1525624, 1761099, 2072969, 2435833, 2825455, 3272552, 3906949, 4774771, 5959183, 7479119, 9124343, 10610363, 12024010, 13738813, 16193799, 19796385, 24902418, 32109183, 42523505, 57984726, 81621000, 118311366, 174256071, 252549878, 338894792, 384878915, 354270921, 276444267, 199674085, 143659496, 106065350, 80763135, 63285383, 50885819, 41821949, 35057710, 29915068, 25961301]
10623B5961301k960297k159196j678677j626115j680203j570357j340711j070210
10615A1875535q60541o38149l76118q6425K39356N58440R24381J230898J175731
10606A4043108O80157m8932o18501q23448o50374k57971K71238R25386J710231
10597A5230894K579935L119497K872995J430732n67996j918571k208187j669564
10589A8869735q20128J38700J197156K368628L485155M126640L435386J037368
10581C3838640j910237l737876l894961l116477k031851r69815K9432J020204
10573A9227059J861779K242593J635800j13120k068411l135172l052490k387110
10565A4210928j614702r25166l48231J49585M70464N28415J72456n08684j215610
$$ y = [25961301, 23001004, 20841808, 19163131, 17537016, 15856813, 14286456, 12945745, 11875535, 11014994, 10376845, 10000727, 9914302, 10153658, 10712098, 11636479, 12867377, 14043108, 14723265, 14674333, 14055832, 13232384, 12582010, 12324039, 12595277, 13520663, 15230894, 17810829, 20930326, 23803321, 25234053, 24666057, 22747486, 20539299, 18869735, 18049607, 18188307, 19385463, 21754091, 25239246, 29365886, 32801272, 33838640, 31928403, 28190527, 24295566, 21179089, 19147238, 18177423, 18206855, 19227059, 21088838, 23331431, 24967231, 24854111, 22785700, 19650528, 16598038, 14210928, 12596226, 11671060, 11322829, 11472414, 11942878, 12471293, 12643749, 12135065, 10919455]
10556A0919455j569672j546347j286146r58419p58086n92796m55097l76080k90874
10547C085938j99122j61072j34388q9678j07700j15405r7095q7878p1693m8909
10537A972998p0541m9161l8832k5771o8457n5213l1506m4144k8652j3617j2356
10526A534748m5084l8726r823j49k0472m3627j6101j1812j0305j2680R65j1602
10514A315332J2592K6632P100k3148O970J376m5745n6870n3690o0700m4659l0364
10502A054826k2038k504j5701j6135j9715j1590n445j1471j7136k1391j9995j6528
10490H75177l6130l3864J5398J34j0273j4523j3356j6421K0814Q389K306J4860
10478H12511J4066m576k0799j0504n996J7829J3113j915J0587k3503k6938J7406
$$ y = [10919455, 9349783, 7803436, 6517290, 5558871, 4800785, 4207989, 3752892, 3376812, 3085938, 2886816, 2725744, 2591356, 2501678, 2393978, 2278573, 2181478, 2093600, 2021907, 1972998, 1902457, 1853296, 1814464, 1788693, 1720236, 1665023, 1633517, 1589373, 1560721, 1547104, 1534748, 1489664, 1450938, 1441115, 1440966, 1420494, 1376867, 1360766, 1348954, 1338649, 1325969, 1326934, 1315332, 1327924, 1354556, 1361656, 1338508, 1345478, 1346854, 1301109, 1244239, 1190549, 1129849, 1085190, 1054826, 1032788, 1030284, 1014583, 998448, 978733, 967143, 961698, 950227, 933091, 911700, 891705, 875177, 839047, 805183, 820581, 820715, 810442, 795919, 782563, 766142, 786956, 795345, 797651, 812511, 826577, 822001, 801202, 790698, 784702, 802531, 815644, 813729, 824316, 800813, 773875, 791281]
10466G91281M951n49J7908n464k4553j8252j7636J1423P377P691l41j733L940
10453G76043p323j609J245K7362Q546K8821O2107L3720m0553j00486p6785q0772
10441F30316l3715j8950O234p858k342Q92K083J6383m749k0962j9828j3359j9783
10428E14362j4823n543K5308R524n198k6833J1622N466k041K272J1966P621j1360
10415E22343j8356k1508K1808J2565q082J117j829j1676l553K603j1086o860L3671
10402E11157K7301j1581l3682k6935M157j2977N15j3071Q635L568J1339k5400
10390D43026k2934J502j5675K133m320r410J6630n979j2572R047P010k53J5098
10377D23303J9566M127j7129k0846q098K916j3137K2177J780l9538k8615K0673
$$ y = [791281, 796232, 795683, 813591, 808127, 783574, 765322, 747686, 759109, 766486, 774177, 773836, 772103, 776043, 768720, 767111, 768356, 795718, 804264, 833085, 895192, 928912, 888359, 787873, 711088, 630316, 596601, 577651, 583885, 576027, 573685, 574577, 576660, 593043, 588294, 567332, 547504, 534145, 514362, 499539, 493996, 519304, 528828, 523630, 496797, 508419, 513885, 511844, 514116, 526082, 533703, 522343, 503987, 482479, 504287, 516852, 508770, 509887, 508058, 496382, 492829, 495432, 484346, 477486, 511157, 538458, 526877, 493195, 466260, 470417, 457440, 457955, 444884, 453519, 457087, 468426, 443026, 420092, 421594, 405919, 408052, 403732, 394322, 410952, 404973, 392401, 401448, 408458, 408205, 423303, 442869, 446996, 429867, 409021, 400923, 403839, 390702, 412879, 414659, 375121, 346506, 367179]
10365C67179O818j6475J7612K1122m394j3170l831q003R49M078N343n538j7967
10352C53723J5798J778o618o756j4796q110L059o664r148K1589L654l152m935
10339C39422j899R989m291J0267l841j5922k5218m649j1402k0452R429N635q323
10326B78745o968J5291M405J7511L6884J7356k6184j7933O83p148K418P075K424
10313C24559L3276j1247j7405l4906j7789P540J4654J4275O169n469K426N712
10301C21795r304k1155Q757l116q659j600n231P068j197q603r105l209M225j3332
10287B57334j6210J3901Q75M512O462J023j011l318n326J5130J246j3893J893
10274B62618J4759K72p095j0112k842j833K317J336j416o160K230J1222K4319
$$ y = [367179, 373997, 357522, 375134, 396256, 391862, 378692, 374861, 366858, 367807, 371885, 377228, 371690, 353723, 369521, 371299, 364681, 357925, 343129, 335019, 338078, 331414, 322266, 343855, 347509, 344357, 339422, 337523, 347512, 343221, 353488, 349647, 333725, 308507, 303858, 292456, 272004, 281433, 287068, 278745, 271777, 287068, 291473, 308984, 345868, 363224, 337040, 319107, 319790, 312642, 315060, 322135, 324559, 357835, 346588, 329183, 294277, 276488, 284028, 298682, 312957, 319126, 313657, 316083, 321795, 312491, 291336, 300093, 296977, 288318, 286718, 281487, 288555, 287358, 278755, 269650, 266441, 270666, 257334, 241124, 255025, 255900, 260412, 266874, 267897, 266886, 263568, 258242, 273372, 274618, 260725, 262618, 277377, 277649, 270554, 260442, 257600, 255767, 258084, 259420, 258004, 251844, 254074, 265296, 289615]
10261B89615O244j5324n603L981K263q149N793Q871j3418J88k610o008K843k339
10247B66347n400P174p578j4615k3741l5131Q216L3415J0981n724m757P147j4389
10234B21945n180m120n998L458o596L833L0539R014l235L732j6504j0645K039
10221B22282J2738k024l6494p744L395J6453J3497M889k2465l926L581J4816K5126
10208B44124m557n919j1149l765j4401L523Q759J9139J1851K181J3911J5268J6591
10195B95556J8509J1616m031L7403O1381P3966R7916J38532K14604K90388L63031
10184A598871L61676J10598k03988l63806l27237k47119j52573j00581r3703p3344
10174E08794n5599m7982k7422j8443L82M748j3168j4633j4409l0817k0077O363
$$ y = [289615, 295859, 280535, 274932, 278913, 281176, 273027, 278820, 287691, 274273, 274461, 271851, 265843, 268686, 266347, 260947, 268121, 260543, 245928, 222187, 187056, 195272, 228687, 239668, 233944, 229187, 236334, 221945, 216765, 212645, 206647, 210105, 203509, 207342, 237881, 246895, 243660, 247392, 230888, 220243, 222282, 235020, 232996, 196502, 188758, 192153, 208606, 222103, 226992, 204527, 200601, 204182, 218998, 244124, 239567, 233648, 222499, 218734, 204333, 207856, 216615, 235754, 247605, 249786, 263697, 278965, 295556, 314065, 325681, 321650, 359053, 420434, 494400, 592316, 730848, 945452, 1235840, 1598871, 1960547, 2071145, 1867157, 1503351, 1176114, 928995, 776422, 675841, 582138, 508794, 453195, 405213, 377791, 359348, 359730, 364478, 351310, 336677, 322268, 291451, 271374, 277737]
10162B77737K8529O682K6092J8203J244j2841o927j8711j0186L448q824j0789
10150B93657M272L9722L4416J4774J8343M676j7507l0852j8633k980k3858r586
10138C06444o145J5330K0648Q321j1962J974O440Q469j8197l9094j0601L830j8231
10125B67226l062J0898J1573R001k2857k0473L694k9453k4404j2942J1767K062
10113B03030j8903j3770q129P405K5909K856p835P954J4988j1691q172J692P908
10100B03242k8828k7397M392J6755q42j0461j7757J148J4319l340q195L399J1921
10087A58356J593j0438j0861p657R330n046L814Q630K64K7200J0377r573N86Q972
10073A85547k2977N05Q818P950k2240Kr70j0469K520R052j3224r560p631L598
$$ y = [277737, 306266, 312948, 339040, 357243, 358487, 345646, 338719, 320008, 309822, 313270, 304446, 293657, 297929, 337651, 372067, 386841, 405184, 409860, 392353, 361501, 342868, 339888, 316030, 306444, 300299, 315629, 336277, 344598, 332636, 334610, 341050, 349519, 331322, 292228, 281627, 285457, 267226, 264164, 275062, 286635, 295636, 272779, 252306, 256000, 226547, 202143, 189201, 200968, 203030, 184127, 170357, 162228, 169633, 195542, 198398, 190563, 198517, 213505, 201814, 193642, 195334, 203242, 174414, 147017, 151409, 168164, 167322, 156861, 139104, 140252, 154571, 151231, 143036, 146435, 158356, 159949, 149511, 138650, 130993, 140323, 135277, 139091, 147721, 147985, 175185, 185562, 175989, 176575, 185547, 162570, 163075, 171893, 179843, 157603, 157605, 156635, 146166, 148686, 157738, 144514, 134954, 127323, 130921]
10059A30921O340Q825P277J1077n676j3688O419K0333k9240j8978O515R312l120
10046A36317n662k437N849M461K765P757R466j7835j6552r763P016K8569J3546
10033A63497O690P100k406k7654J398J4228q320k3305R66K6354M176m249j8698
10020A39777j4001Q70K2183P024n842k0086r408p011j2299J7341J5382J0711p378
10007A37263Q761K779j3188M773R805K5744j3166j6934j5148j1331j9441r573
9995I0344L600J6859K9626L799j907j050j9561j0569j2649k192K4680J6152J3651
9982A50783j6849j0135l927K198J1347o154j3856j273M323O008j7665k808K7686
9969A29678J7560K1493o074p043r402L955k9729l08m015m508L1875J7976j0567
$$ y = [130921, 137261, 146086, 153363, 164440, 158764, 145076, 151495, 171828, 142588, 123610, 130125, 139437, 136317, 130655, 128218, 134067, 138528, 141293, 149050, 158516, 140681, 124129, 114366, 121382, 149951, 163497, 170187, 177287, 174881, 147227, 148625, 162853, 154533, 131228, 132194, 158548, 162724, 158475, 139777, 125776, 126646, 148829, 155853, 150011, 129925, 120517, 113506, 101207, 118548, 133930, 144641, 137263, 146024, 148803, 135615, 140388, 150193, 175937, 162771, 145837, 130689, 119358, 99917, 90344, 93944, 110803, 140429, 144228, 142321, 141271, 121710, 111141, 98492, 96300, 120980, 137132, 150783, 133934, 123799, 119872, 122070, 133417, 127263, 113407, 112134, 116457, 122465, 104800, 101992, 129678, 147238, 168731, 162657, 155614, 146212, 150167, 120438, 120130, 116115, 111607, 143482, 161458, 150891]
9956A50891r445m506M712r179j8648k059P601q420o417k396K101J1511O200m705
9942A17241j2984k816Q096j0689j9118J4302R728N912m950l962p911J01M819n214
9928I2555q313K7350o555j2753K434L4195K7065l507j4918j8600K014N487R223
9915A35677j4632k6213k0503q93m810J4213J4772J8750L566m471j190Q30q192
9902A06904L959J5115K0349l006k2702j4682n657J3625L177L077L928n19j0785
9889A12783j1895n864J5884K6847M216j0695j5265o710l753Q36J6040O941R322
9876A38687r643k0990MM305K794j9140L878J1186K1581j1706l5790K8863J5134
9863A29163q160o822O971L450j8367q72P350R432m111J1738j8138j4342k53p228
$$ y = [150891, 141446, 136940, 141652, 132473, 113825, 111766, 119367, 110947, 104530, 102134, 104235, 115746, 121946, 117241, 104257, 101441, 109537, 98848, 79730, 94032, 103760, 109672, 104722, 100760, 92849, 92950, 97769, 92555, 84242, 111592, 105037, 92284, 94718, 128913, 155978, 152471, 137553, 118953, 120967, 126454, 135677, 121045, 94832, 74329, 73436, 68626, 82839, 97611, 116361, 119927, 115456, 114266, 115096, 106904, 110863, 125978, 146327, 143321, 120619, 105937, 100280, 113905, 117082, 120159, 124087, 123568, 112783, 100888, 95024, 110908, 137755, 141971, 131276, 116011, 109301, 105548, 106384, 122424, 129365, 138687, 129044, 108054, 108058, 112363, 115157, 96017, 99895, 111081, 132662, 120956, 85166, 114029, 129163, 121003, 114181, 121152, 124602, 106235, 105363, 112713, 122145, 118034, 129772, 111634, 97292, 97039, 89811]
9849H9811J0440P389j351l263o888J7461J3461k093o169K2223p271j4032j7164
9836A02554j4773Q779K0701q891l161m998k6675j1245J2888J0230J4560j2356
9824H7613m127J4783R79j183K7838m139m297j0721j7437j894L243J5220J5803
9811A21681q146j5740j4583J9673N316l388k775J0407o352j8890j515q142j176
9798G6370L094O581l114P321J8978o534j4733k394J1368o598p856j0889P903J5977
9784I5474Q308q824j5693K828O586J8402J2328o316n465j468j1721J4475l550
9771A05364o592j3263J7345r493k6186j212O154M489K911j990L12j2545J879J9792
9757H6965j1142j6112l921r926k311o165J6879J7281K6694M420j005J301k2410
$$ y = [89811, 100251, 107640, 106289, 103026, 96138, 113599, 127060, 124967, 118798, 141021, 133750, 119718, 102554, 87781, 96560, 117261, 108370, 105209, 100211, 73536, 62291, 75179, 85409, 99969, 87613, 83486, 98269, 99248, 98065, 125903, 121764, 117467, 106746, 89309, 87415, 90658, 105878, 121681, 113535, 97795, 83212, 102885, 108201, 104813, 102038, 112445, 106093, 87203, 85688, 77546, 76370, 79464, 86045, 82931, 90252, 109230, 102696, 87963, 85569, 96937, 90339, 82483, 71594, 79497, 95474, 103782, 94958, 79265, 82093, 88679, 107081, 119409, 113093, 107628, 106160, 94439, 108914, 105364, 98772, 85509, 102854, 93361, 67175, 65963, 72117, 76606, 79517, 77527, 77839, 65294, 67173, 86965, 75823, 59711, 55790, 45864, 43553, 37388, 54267, 71548, 98242, 102662, 101657, 102958, 80548]
9744H0548r631J5191L158j0140J0102o866J0912j1128k0312O226J0742O778K1428
9731A07008k666k76L673n115k4143o467M220J922m052l37P403q683k145j5775
9717E4567k8533q797J9975K1964Q666j6906o279J9166J8703k595j776j1164K0836
9704H7827K1602Q47l787l948K4j4750p265J250N732o755m1837k8299J9785k308
9690B8118J8955K8276N442P693J621j203J4179J0384j8406L348q958N669M222
9677I9340o869k5290k3971j0627J9685P59o664P16O082J8949m827J3605K5011
9664A05899n872j3857p710n444Q73K0359K2614J318O951j597p672k381k7352J3461
9650I9590Q696M932j1674L718N860N479J875J7226K6205K2247p414k2186l4154
$$ y = [80548, 70917, 86108, 89266, 79126, 89228, 82362, 93274, 82146, 61834, 68060, 78802, 85580, 107008, 104342, 104066, 107739, 102624, 78481, 72014, 76234, 78156, 74104, 73767, 81170, 72487, 70342, 54567, 26034, 17237, 37212, 59176, 67842, 50936, 44657, 63823, 82526, 79931, 78155, 66991, 87827, 109429, 110276, 106489, 102541, 102565, 87815, 80550, 81800, 87532, 80777, 38940, 10641, 30426, 28118, 47073, 75349, 80791, 88484, 90105, 88902, 103081, 113465, 95059, 98407, 89449, 95118, 99340, 92471, 67181, 43210, 32583, 52268, 53027, 46363, 47079, 53161, 72110, 67283, 80888, 105899, 100027, 86170, 78460, 73016, 73889, 94248, 116862, 118180, 125131, 123534, 115862, 113481, 86129, 99590, 108286, 113218, 101544, 105262, 111122, 116601, 118476, 135702, 161907, 184154, 176740, 154554, 120400]
9637A20400p955j4467k5424l954J8308m450l111o182R08K801q093j9312p442j0052
9623C1975J0761L1935K7572j2696j2949o74j7695j7497J7819J3099O271j1310
9611F6611Q111J5813O576n783j2435K144p154j598J7707J4181k3828k7981Q43
9598E3207k835l562J5123J7202J5090p892k6736m458J972j4282Q31o749j2198
9585B4713j004J9701K9485J8086R614j5215j4493N349k1815P806K3340J1027R19
9572I7513n58j5236o140J4499j1632J1985k382j8429j411M163k689K098O536m115
9558G4202k2685k319J5931J5246r590m759K0220R70j126l887L180J577J0010k3607
9544G3363k2914r602J7531N28O63O699J2963M499k3457N748R401j1457j5434k37
$$ y = [120400, 112445, 97978, 72554, 68600, 86908, 82458, 79347, 73165, 74073, 76874, 68781, 49469, 42027, 31975, 42736, 74671, 102243, 89547, 76598, 75924, 58229, 40732, 58551, 71650, 77921, 66611, 74722, 90535, 97111, 91328, 78893, 81037, 73883, 72285, 89992, 104173, 80345, 52364, 53207, 50372, 46810, 61933, 79135, 94225, 86333, 59597, 55139, 57111, 42829, 43660, 36911, 24713, 23709, 43410, 72895, 90981, 100595, 85380, 70887, 76236, 54421, 62227, 85567, 96594, 97513, 96955, 81719, 75579, 90078, 78446, 90431, 88049, 69620, 68209, 72372, 69683, 71781, 78317, 74202, 51517, 49198, 65129, 80375, 70785, 66026, 86246, 87216, 86090, 82203, 85383, 86960, 96970, 73363, 50449, 40847, 58378, 58906, 59569, 66268, 79231, 83730, 60273, 66021, 75422, 63965, 48531, 48294]
9530D8294l122K2397J9876j575p371n995K0931J7986K1905j6404k7564k0128j383
9517F7847j8298p220J530r744J0513J0192j6843j0158Q982K1315O636j2855K323
9504E4220K0719k506M849j0248j5672Q707j2043r247J9103K3437K762n503p616
9491G0962k365o343j859j4291L0037J3218k5672k5131j4813j4281O386N369J0175
9478C1392J1757K2552j0709j2286N343n22J9751K871M551j2217k0345L212k5090
9465B0260J5073K0617l180q363K4767R093k7305j6373j489L914N364J6575Q037
9452F6990K794J805R88L146N061J6615O934j2516j0733r061j1794N670j1033j4619
9438D0247k830O752j4934k8924J7266K9955l19j6594m236p278L640J3788L926
$$ y = [48294, 45172, 67569, 87445, 85870, 78499, 72504, 93435, 111421, 133326, 116922, 89358, 69230, 67847, 49549, 42329, 43859, 34115, 44628, 54820, 37977, 27819, 36801, 58116, 64752, 51897, 54220, 74939, 72433, 77282, 67034, 51362, 60069, 48026, 38779, 57882, 81319, 84081, 78578, 70962, 68597, 62254, 60395, 46104, 76141, 89359, 63687, 38556, 23743, 9462, 15848, 21217, 31392, 43149, 65701, 54992, 42706, 48049, 47527, 67278, 70149, 74700, 62483, 42138, 45350, 20260, 35333, 55950, 52770, 44407, 69174, 78267, 50962, 34589, 33100, 37014, 42378, 58953, 66990, 69784, 71589, 72577, 75723, 80784, 97399, 104333, 91817, 81084, 72023, 60229, 65899, 54866, 40247, 37417, 44169, 29235, 311, 17577, 47532, 47213, 30619, 26383, 19105, 22745, 36533, 40459]
9425D0459J6049j534M473o924Q137R361j7710l3071O564J1544M902R554j5140
9412C6664j8961j993M2630K543j9978P84n963p631J1660J7712K984j0626K3046
9399G2871J009j0820j0964j4569o98K336J3340m228k3962R40L430K3421M504q805
9385D7805M553m273l477q246r395K009L994M365J7303J6964j0339J664m916M761
9371F2772O092k2236M467N123k098k1993Q424K0656k1145j9544p963k7047R254
9358e238P168l118n065K6978K4106r206j1282l737K0707M43k5530k1102M756J3646
9344A3526J9390Q616k183K2694L10j4042N215K338r13J0721L612j4109n684J500
9330E0991j2136o963n643J1150M526O745J1996l803o233k8764p603N406J5407
$$ y = [40459, 56508, 54974, 59447, 52523, 60660, 70021, 52311, 19240, 25804, 37348, 42250, 51804, 36664, 17703, 15710, 58340, 60883, 40905, 41689, 35726, 28095, 39755, 57467, 60451, 49825, 72871, 73880, 63060, 52096, 37527, 36829, 39165, 52505, 48277, 24315, 25255, 28685, 52106, 56610, 47805, 52358, 48085, 44608, 36362, 26967, 28976, 32970, 37335, 54638, 71602, 61263, 62927, 58011, 62772, 68864, 46628, 51095, 56218, 54120, 32127, 40551, 61207, 40062, 20518, 12555, -14492, -5238, 1930, -1188, -6253, 20725, 44831, 35625, 24343, 20606, 41313, 41756, 16226, -4876, -120, 13526, 32916, 41532, 39349, 62043, 62353, 48311, 53526, 55864, 54951, 65672, 69284, 55175, 49491, 50991, 38855, 31892, 26249, 37399, 41925, 48670, 60666, 56863, 50630, 21866, 14263, 19669, 35076]
9317C5076n830Q512n726k653p929j1267j1313K117j7314J0593L0669K8812k217
9304E1530k7381R549J6084J3833J7353L85r568j1411q385k5651l917q183J8310
9291C2548J3326l1p468P110K749p777J1741k801k1360j0589J1680K8694J6917
9278G4739J0385j9026k1351J4251m479j4029K233K457J0742r553m276K616K0157
9265F4866N468k8877k110o173J219J1677Q172R655j528j8436M716J2482j1637
9252D9494p866k449K1985L3345r95l5437k2138N612p192R316O093j3436K435P026
9238D5793K5829J0648k0651k5757L862J0120K2222J405m378o934Q293j0043o069
9225E4340q622L79m614J2321q481j8100L110j9909N676L4870Q702J5464L507k9064
$$ y = [35076, 29246, 37758, 32032, 29379, 21450, 10183, -1130, 987, -16327, -5734, 24935, 53747, 51530, 24149, 33698, 49782, 63615, 80968, 81353, 71785, 60374, 51989, 26338, 22421, 14238, 32548, 45874, 45843, 38375, 45485, 48234, 40457, 52198, 49397, 28037, 17448, 29128, 57822, 74739, 85124, 66098, 44747, 58998, 54519, 40490, 42723, 45180, 55922, 46369, 42093, 44709, 64866, 70334, 41457, 39347, 33174, 34393, 46070, 54242, 63897, 62369, 43933, 48649, 61131, 49494, 41628, 39179, 61164, 94509, 93514, 58077, 35939, 41551, 34359, 43675, 49768, 36332, 38767, 45793, 71622, 82270, 61619, 35862, 39724, 49844, 72066, 73471, 69093, 62159, 70452, 60409, 54340, 45718, 46097, 41483, 53804, 45323, 27223, 30333, 10424, 16100, 50970, 59672, 75136, 78643, 49579]
9211D9579l3580l009P380o695l880J7903R041j0125M443J9601m832k5188J3347
9198C3985K2031n81l173O743J4644j3444m72q184j4809J1232q388n118O533Q050
9184D9049K843k27j5046j1406n525q435J7651K0710R392J2801k7692k0119j982
9171B2014J9950K5707m506N28J2511n506j4958j0998j6912p98j945J2500M756
9158D2343m597k4251L869P706j5087n110J0701P031Q530j7008o271K5171K7312
9145F0339j040n893r877j7264m298J9356J5375p089K851p956m533K1252j0283
9132E0940J892K2948j3976j1848K691j074j3716n591j4526M702J2617J369K308
9119C8736j266k0385k876J3791m840J0188K952J1743J1634P598M371j0825j4434
$$ y = [49579, 15999, 12990, 20370, 13675, 9795, 27698, 36739, 26614, 31057, 50658, 45826, 20638, 33985, 56016, 55435, 52262, 59005, 73649, 60205, 59733, 51549, 36740, 47972, 39584, 34466, 40999, 49049, 51892, 51665, 36619, 25213, 19688, 11253, 28904, 49614, 59006, 71807, 44115, 23996, 22014, 41964, 67671, 63165, 63693, 76204, 70698, 55740, 44742, 27830, 27032, 25087, 37587, 42343, 37746, 13495, 17364, 25070, 9983, 4873, 15574, 22605, 31135, 14127, 7856, 33027, 60339, 59299, 53406, 43529, 26265, 21967, 41323, 56698, 49609, 52460, 44504, 39971, 61223, 50940, 52832, 75780, 61804, 49956, 52647, 51573, 37857, 32266, 17740, 22442, 35059, 36428, 38736, 37470, 17085, 14209, 28000, 23160, 33348, 36300, 48043, 59677, 67275, 71646, 60821, 46387]
9106D6387k4045N57J284J502m516Q364j1056p254N609J9748K2656o297k9145P424
9092C1218j0924q59L4101J0747j829R098j9399j1889J3016j4513r331J517P808
9079C8761o102p41J0304J3130M078j0623o412p158J970M950K114O323K692k2714
9065C0572j2535l346L3490Q638p913k7283n327r867j4228k469l598J2724K1186
9052B0044J7628Q835M975j685q265J1398j7578j3645P739J090j3094P343N828
9039C0613J072J0029j0687n990O172q920J181Q207Q240Q656o368m160p09l993
9025C3343j2395n838R824O232J6174k536p211j3844o027P253K4646j8271k6546
9012D804L0045P497p710j523l058j5209O680J2071J339l480n306m410p70n952
$$ y = [46387, 22342, 22899, 24183, 25685, 21169, 29533, 18477, 11223, 16832, 36580, 59236, 52939, 23794, 31218, 20294, 19435, 53536, 64283, 62454, 71552, 52153, 40264, 53280, 38767, 29436, 30953, 38761, 32659, 31918, 42222, 55352, 59430, 48807, 42395, 35237, 37207, 42157, 44271, 50594, 53286, 30572, 18037, 14691, 48181, 56819, 48906, 21623, 16296, 6429, -7799, -10268, -13866, -1142, 20044, 37672, 46507, 51482, 49797, 41532, 52930, 35352, 21707, 29446, 30536, 17442, 24785, 30613, 31685, 41714, 31027, 25037, 31209, 22289, 23470, 31677, 39917, 48573, 42205, 38045, 37336, 33343, 20948, 15110, 24934, 31166, 47340, 44804, 37593, 23749, 17722, 24975, 49621, 31350, 4804, 34849, 42346, 34636, 33113, 30055, 14846, 21526, 33597, 34936, 31456, 26150, 21740, 20970, 15018]
8998A5018J1986J688j5031q832M638K8482q257M458M478O038J2082l400k3908
8985B9440j3029R370R037M861K991l462O163J4736k1585n57M125q45J4168q405
8971D7008j1309N313j4082j5995J2944R408P318o339l601O657o277m157j6012
8958A0876j4028J4080J0757j820J1481k626M676j9788j5289R303q502J1993K2350
8945C3463J4802n932J4288q60L15p387r601o896k0780l261j5082K148K4210K2323
8931D1750j2692k2396j5508j9499l598J3070j352J7594J014P769N793J6799J5754
8918D4498k3514o937p764J3426L3245k3433k8603M3965K260j8339j0087j0889
8906G828J1943J959J4958k782j3837K156O146o373q492r757J2093J1285R399j180
$$ y = [15018, 27004, 28692, 13661, 4829, 9467, 37949, 29692, 34150, 38628, 44666, 56748, 53348, 29440, 16411, 25781, 34818, 39679, 42670, 39208, 45371, 60107, 38522, 37965, 42090, 41245, 55413, 47008, 35699, 41012, 26930, 10935, 23879, 33287, 40605, 34266, 30665, 37322, 31045, 26888, 10876, -3152, 10928, 21685, 19865, 31346, 28720, 33396, 13608, -1681, 7622, -880, 11113, 33463, 48265, 42333, 56621, 55761, 56076, 48689, 39088, 32192, 11412, 8151, -6931, -4783, 19427, 41750, 29058, 6662, -8846, -28345, -31943, -18873, -20225, -2631, -1617, 6152, 11945, 28744, 44498, 20984, 14047, 6283, 19709, 52954, 29521, 918, 44883, 47143, 28804, 18717, 7828, 19771, 21730, 36688, 33906, 20069, 22225, 28371, 21998, 13506, 3749, 15842, 27127, 36526, 35346]
8892C5346K3619j2876k0668j8293j993J6287N416n987J6237m814n388J1126J1288
8879D9300l057k0830l9635L552L8176K564Q925j3448j0254R974M461m5J2259p707
8865C4235j5836o93n214O934J1875q794M414K691o086J0102j8736N221O56M418
8851B5187j5746p279J5702K330q252l891j019m186j9138J7897K3983j015o472
8838A8101j3261M083l441N001N092O146j3709j2908L967J9704K925Q976P883k1067
8824A7492R17N754K4490M783j2807j1022m403R091R005J219M6K0434J4268L472
8810H2739q083j3300k0402j4914q69P277j3133L604R496l1906j7021j983L887
8797a4608J1624J9248J8188j0580j0936k8207O382K6114O45L095J5758o215l085
$$ y = [35346, 58965, 46089, 25421, 7128, 5135, 21422, 26838, 20851, 37088, 32274, 26886, 38012, 49300, 46243, 25413, -14222, -10670, 27506, 30070, 38995, 25547, 15293, 25267, 29728, 29683, 41942, 34235, 18399, 17706, 12492, 19426, 31301, 22507, 26921, 29612, 23526, 33628, 14892, 20113, 20769, 25187, 9441, 2162, 17864, 20194, 11942, 8051, 7032, 2846, -16292, 1605, 25588, 24573, 18101, 4840, 8923, 5482, 10483, 15575, 21721, 8012, -4896, -929, 18775, 21700, 30676, 38559, 17492, 18409, 24163, 48653, 53436, 40629, 29607, 25204, 34295, 43300, 44519, 44565, 64999, 79267, 82739, 74656, 61356, 40954, 26040, 25171, 32448, 19315, 22919, 32415, 509, -16512, -18495, -14608, -2984, 16264, 34452, 23872, 12936, -15271, -8889, 17225, 17870, 20965, 36723, 30508, 27423]
8784B7423J916j3982K631P586l773r76j5599J2124J3850j6321j0690J6839J7821
8771C8849K353j6320J0026K1690j4457r687J3542j0437j4207q2P819k14J374j3938
8757A6311k1875J768K0855K3037j254l0995m838J9682n397L440O592N261o441
8744B6146j0499k847J7948k658j1563p27P090j9753o505O338J6429K1417n679
8731C5137n758R19n199P899P781k0958L102L0583N965p328k1529j3141r659J3304
8717B1118J264q505r883M803O719O28P218J0794r59l124l72p519j8050q880M7
8702d701R447J2312J8100j3753l2544R740L162j9721N062P889j201J3794K6468
8689C4054O848R674r879j1175J7047r78j5274q81j731R509j0601Q335J0476Q296
$$ y = [27423, 29339, 15357, 17988, 25574, 21801, 20825, 5226, 17350, 31200, 14879, 4189, 21028, 38849, 41202, 24882, 34908, 56598, 42141, 32454, 45996, 35559, 21352, 21270, 29089, 28875, 30249, 16311, -5564, -3796, 17059, 40096, 38842, 7847, 3009, 22691, 17294, 20734, 27326, 32587, 26146, 15647, 12800, 30748, 28090, 16527, 15800, 22890, 3137, -3368, 2970, 19399, 40816, 35137, 29379, 30298, 25099, 32998, 40779, 19821, 22923, 53506, 59471, 52143, 30614, 17473, 7814, 21118, 22382, 13877, 3994, 8797, 15516, 16144, 23362, 34156, 33197, 30073, 29701, 22182, 4132, -4748, -4701, 4746, 17058, 35158, 21405, -11139, -1399, 1763, -17958, -12896, -5007, -6208, 7586, 34054, 40902, 50576, 40697, 29522, 46569, 45591, 30317, 29436, 27705, 37214, 26613, 34948, 45424, 53720]
8675E3720n517m28j3087L232j0961r361k139Q375J3637O429r102k118p537O383
8661C1526q57j4263j4808l689q125L874K9783Q210n725j679L661k5363k309l016
8647b780n406k916o816J1670L0723P258l2627R207J5100K896o370m782K614P620
8633B5391r799m570k782o68l424K832r068j1570K321J6507K9208K3486j7198j5946
8619B4720o466O684K588J697Q626j527j8039k209m476P003N060Q257m056P929
8605C5791N007m162j2682k393l834K034N12j9923P922J3223J599r091Q33J5371
8591C0207r725J8246l00k7107N916J4221k062j3938l688J191R02M568J6262j691
8577C3002O836M288M290j4498q278l678j5122J4103J5497p394M424N367N467P551
$$ y = [53720, 48203, 47775, 34688, 37920, 26959, 17598, 15459, 23834, 37471, 43900, 34798, 32680, 25143, 31526, 30669, 16406, 1598, -2091, -10216, -6342, 23441, 31651, 25926, 24247, 27908, 2545, 236, -2780, -8186, -11102, -17918, -6248, 24475, 31733, -894, 8313, 23413, 26309, 19939, 15157, 17771, 25391, 15592, 11022, 8240, 7572, 4148, 6980, -2088, -13658, -11337, 5170, 34378, 57864, 40666, 24720, 18254, 24938, 27526, 29223, 37849, 36322, 18283, 16074, 11598, 18601, 23661, 31918, 27862, 35791, 40798, 36636, 23954, 21561, 17727, 19761, 20273, 350, 8272, 21495, 23094, 14003, 14836, 30207, 20482, 38728, 38428, 11321, 17237, 31458, 29396, 15458, 11770, 12961, 13863, 18431, 34693, 33002, 39838, 44126, 48416, 33918, 25640, 21962, 6840, 20943, 36440, 29046, 33470, 38837, 44304, 51855]
8563E1855k202o039J5534J7803J0326J2997q020k9576p591Q21J1962j0123j5493
8550D2254j3802o675P509P193q282k647n546n025P412K802j945l354l3147q144
8536b1397K3286L2572n987j6118R173L831j5922o540n521M624K2568O314J1712
8523D2595R059P64J226k0999j715J9162k2141l7720J8705K0786k2728j2898J2469
8510F565J1709j476J3013P784n865r446P184p587N92N718r599l195j691P16O855
8495B1277o061P014J1875J5502K301J8893L649j0829q570J991n390j2234J0571
8482D9989J5281J5414o136k5281P130j2010l2303m586k1685l346J3037Q219O24
8469D347J8385j8356r633Q178N945j0203j1206J0635J8977J1381j57R292J9238
$$ y = [51855, 49653, 43614, 59148, 76951, 87277, 100274, 92254, 62678, 55087, 55908, 67870, 57747, 42254, 28452, 21777, 29286, 36479, 28197, 25550, 20004, 14979, 22391, 25193, 23248, 19894, -13253, -21397, 1889, 34461, 28474, 12356, 21529, 25360, 9438, 2898, -2623, 2001, 24569, 30883, 42595, 51654, 52418, 53644, 32645, 30930, 50092, 27951, -9769, 8936, 29722, 6994, -5904, 6565, 18274, 16798, 29811, 37595, 31730, 22284, 29468, 21881, 22473, 28191, 18592, 15397, 13706, 14422, 21277, 15216, 22230, 34105, 49607, 51908, 70801, 74450, 63621, 55051, 57042, 51652, 39418, 49989, 65270, 80684, 74548, 49267, 56397, 44387, 12084, 7498, -14187, -17533, -4496, 3723, 4347, 22732, 4376, -5257, 2921, 8866, -1337, -12543, -1908, 17069, 28450, 28293, 37585, 56823]
8456E6823O15k9994j1968n559K6496M883j1847j0862J6003J2874K2147j6837k8574
8443B4200m285O257J8858K3779k963K989p194j1638j047J2931Q055j3910K6020
8430H2052K225k8519k042M543j1942k0679q085K1103k1294M23k4778q176K0320
8417E151o257O665J0866J554m195q593P505J3529J3156o856l5950r722L2239M026
8403B3118j9637o67q310K2931J9052J9254J531q816p798j6822r521j2031j3265
8390a0981R403J2977J2647M203K604L572j8490k3403n857J2241J7857K967j4620
8377E120J3768q554j7626p167O946n744o141J429J1618j0012o440J4507q887P300
8363i883J0139M193M604J425J423o020j2843j0826M656K3325R81J698N526n54
$$ y = [56823, 57438, 27444, 15476, 9917, 36413, 41296, 29449, 18587, 34590, 47464, 69611, 52774, 24200, 19915, 26172, 45030, 68809, 65846, 68835, 61641, 50003, 48956, 61887, 69942, 56032, 82052, 84277, 55758, 53716, 58259, 46317, 25638, 17553, 38656, 17362, 17785, -6993, -15169, 5151, -1106, 5559, 16425, 17979, 13784, 5191, 12696, 26225, 39381, 32525, -3425, -13147, 19092, 23118, 3481, 2814, -5496, 17435, 36487, 55741, 57272, 48456, 40658, 23836, 14315, 2284, -10981, -1578, 11399, 24046, 28249, 30853, 34425, 15935, -7468, -13325, -1084, 16773, 19740, 5120, 18888, 10334, -7292, -14459, -7513, -13257, -19398, -17969, -6351, -16363, -22803, -8296, -17183, -9883, 256, 4449, 9053, 10478, 11901, 5881, -6962, -17788, -13132, 10193, 11174, 12872, 18398, 17844]
8349A7844K192K964j2362o400N43P830J7611j0284m540o546N141J755j1501P72
8335E019p24K711J925l201R395P545Q853l943q110n394q394k1218l2861J7732
8321c0665L0110O668m745k703q69p196j0948j251l640K1140J1191O042J8540L089
8307C4763k2924r467K1056J74j4747K438J1206n340j0745L94r097j4619k795N472
8293a4231J7420j1007j1291Q9J8043J400o941k18L412p094k288L660n964o550
8279b1560O411Q650L283k3318j8090J0180J4860R420K3110l579o965L107o402
8266h93k2849R10M3203L836j311J686J2705k2004k226J0585R229l005j5489m188
8252A0189J010j3073m081Q318J9188j888M596N049J4251Q082q613o556K3657r026
$$ y = [17844, 20036, 23000, 10638, 4238, 4781, 12611, 30222, 19938, 15398, 8852, 13993, 15748, 4247, 5019, 4295, 7006, 8931, 5730, 15125, 22670, 31523, 27580, 19470, 14076, 5682, -15536, -48397, -30665, -555, 6113, 1368, -1335, -2204, -9400, -20348, -21599, -25239, -4099, 7092, 13134, 31674, 34763, 11839, 2372, 23428, 23602, 8855, 11293, 22499, 17159, 6414, 6808, -2289, -16908, -19703, -14231, 3189, -7818, -19109, -19020, -977, 423, -6518, -6736, -3324, -10418, -12706, -9046, -15010, -21560, -15149, -6499, -3216, -26534, -44624, -34444, -19584, -10164, 12946, 9367, 2402, 5509, -893, -23742, -22832, 20371, 24207, 22896, 24582, 37287, 15283, 13057, 23642, 32871, 29866, 14377, 10189, 11199, -1874, -5955, 2363, 21551, 19663, 24259, 29308, 43559, 51641, 43028, 36472, 60129, 51103]
8238E1103j3385p778j3104O321J0822l408k9260k6506K284Q322j0829K080O655
8225a6683J5819J714p408L354K5485R18N591L1957n38k4168m954l213J084l0363
8211a405L456k656m221J3673J5364R608o567L748L450j8480j7805J1387J1836
8198B1388j7290j588l991j7947L776R710j0692R335J3956J0740l649N923n2J1458
8184C1077Q425n45j7971j8388m892m463J2760J9035K06k2429k4413l416J1733
8171a3281J2664J7904O068k0307p902l1k3050M026N102J9147l176M416J085l06
8157B359J561j8833j5500p358J2460K9788K4357J0164l671L025j8081n227J5407
8144C0451k0486n490r242k499K420m559q122j3852l933K1504K7245J483n770k4739
$$ y = [51103, 37718, 29940, 16836, 23157, 33979, 30571, 1311, -25195, -22911, -14589, -25418, -23338, -16683, -864, 850, -6558, -3204, 22281, 23199, 28790, 60747, 60209, 36041, 31087, 27874, 28958, -1405, 2051, -605, -4826, 8847, 24211, 33819, 27252, 31000, 34450, 15970, -1835, 9552, 21388, 4098, 2510, -1481, -19428, -15652, -5942, -16634, -7299, 6657, 17397, 13748, 19671, 19619, 31077, 39502, 38957, 20986, 2598, -2294, -6757, 6003, 25038, 25244, 2815, -21598, -25014, -13281, -617, 17287, 23355, 3048, -4854, -4885, -27935, -23909, -18807, 340, -2836, 1580, 2665, 2359, 3920, -14913, -30413, -37771, -25311, 4477, 28834, 38998, 35327, 38352, 20271, 15044, 30451, 9965, 4475, -4767, -7266, -4846, -9405, -17527, -31379, -35312, -13808, 13437, 14920, 9150, -15589]
8130a5589Q376L3342M475j1890k2367o212M025j8759L388l556M419P401l976J0432
8116f491n744J0728K4260J5660o950j9889n597k463j9835R639J0088M835K3101
8103C1342N242k2001q374N287J969J2419J0305K539j7764j8891j5776j4694l1555
8090e9952R062K1689J9449J1386O714l401j5347K1077Q978j6164k0323l071J4339
8077e564l644M631M975j8918R926J7097L148p660q918K647J4925P984M444N218
8063C0291q570m699M451j5373j5413j1852L575K476J0337q349J0341O321J8324
8050B1860J7840o25j8116k494j2681n122L386l283J0920j2995N417j74k431l258
8036a756q026O405R637M071M757l600J043l841j4321j4643p825o006J9777K0929
$$ y = [-15589, -7213, 26129, 30604, 18714, -3653, -9865, -5840, -24599, -21211, -24767, -20348, -12947, -16923, -6491, -12235, -1507, 22753, 38413, 31463, 11574, 5977, 3514, -16321, -6682, 3406, 8241, 31342, 36584, 14583, 6209, 11496, 13465, 25884, 36189, 38728, 20964, 2073, -13703, -28397, -59952, -50890, -29201, -9752, 1634, 8348, 4947, -10400, 10677, 19655, 3491, -16832, -19903, -5564, -9208, -4577, 398, -18520, -8594, 8503, 11651, 3991, -4927, -2280, 12645, 20629, 25073, 30291, 21721, 17022, 21473, 6100, -9313, -21165, -17590, -15114, -4777, -13126, -2785, 3536, 21860, 39700, 39075, 20959, 18465, 5784, 662, 4048, 765, 11685, -1310, 4107, 3933, 1502, -1756, -9782, -3377, 6260, 10331, 15088, 11488, 12531, 8690, -5631, -20274, -28099, -34105, -14328, 6601]
8022F601k787L322J3987J4200O491j5522j0452J3492P588k3811n619r932j762
8009d204J4548j3546O398J2342P605l042j2276K634j9197k4601N42J2828J958
7996a8011L808J1946k432j357R61K2120l526j4280J5119Q286r194J4556K161l2235
7982b078j6578J8082J4508L635m532r919K7112J6334j2281l2414k387K1833q744
7969A2571N386j473j7135n348J3808J0382k578M529o409j045j128Q828k67j6858
7955C263k0792K2172k685q498o483J0446K0087m006J1023J5952l374J8983k924
7942E3164l3772k866J316k741J5391j4819k59o131j3490Q689l739J5208J3030
7929B8981m798r013j5923k415R13K243O637Q049j4905N480N818N854L454m54K1859
$$ y = [6601, 3814, 7136, 21123, 35323, 41814, 26292, 15840, 29332, 36920, 13109, 7490, -2442, -4204, 10344, -3202, 3196, 15538, 23143, 20101, 7825, 10459, -8738, -33339, -32797, -19969, -18011, -14203, -2257, -4689, -6046, -5085, 17035, 13509, -771, 14348, 22634, 13440, 27996, 30157, -2078, -18656, -574, 13934, 17569, 13037, 3118, 30230, 46564, 34283, 1869, -518, 21315, 12571, 17957, 16484, -651, -5999, 7809, 18191, 15613, 20142, 13733, 12688, 11560, 20388, 20121, 3263, -17529, 4643, 1958, -6540, -13023, -2577, 17510, 13504, 24527, 40479, 37105, 56088, 53164, 19392, 16526, 17842, 15101, 30492, 15673, 15414, 9283, -4207, 4482, 743, 15951, 28981, 24183, 15170, -753, -3168, -2255, -12, 6625, 14674, -231, 5249, 11067, 16921, 20375, 19921, 41780]
7914D1780J225m048L468J3827m721J29k4281j5511j0778j1950R401J0856Q745
7901A8142O737L268O12k1624K392Q664J843r409j4428K2323p233k619o987M291
7887E972j7855n279J4456L573K890J0128K4457M076l6700j3376n167J5927K2660
7874B5762J120p559K524J7456j381j4818k3832o276J5302O185m649k144J367J6488
7860B5545o280N8N718k1230j5989M702J2109K8609r798m0712M534J628k850J0913
7846c043j16r926K604n630q695J9692J1180O470N929j1139m663K4693J5479j0521
7832C2314l5413K645J6081O472k4025m654J3430J4189l248j6755k612J1435j1418
7819a559j0705l864j0122R633J6708q976n155J82K043J6535m638j5537j3858J302
$$ y = [41780, 43005, 38957, 42425, 56252, 51531, 51660, 27379, 11868, 1090, -10860, -1459, 9397, 18142, 24879, 28147, 28759, 7135, 9527, 18191, 20034, 10625, -3803, 18520, 11287, 8668, 1681, 5972, -11883, -17162, -2706, 867, 3757, 13885, 38342, 42418, 5718, -7658, -12825, 3102, 25762, 26882, 19323, 21847, 39303, 37922, 23104, -728, -7004, 8298, 14483, 9834, 7690, 9057, 25545, 19265, 19323, 25041, 3811, -12178, -7476, 4633, 33242, 23444, -17268, -12734, -11106, -13956, -3043, -3159, -13085, -10481, -16111, -24806, -5114, 6066, 12536, 18465, 7326, 2663, 27356, 42835, 32314, -3099, -454, 15627, 22099, -1926, -6580, 6850, 21039, 17791, 1036, -1576, 9859, -1559, -12264, -16128, -26250, -16617, 91, -8885, -14040, -13858, -11815, 4720, 82, -15455, -29313, -28011]
7805b8011p630m167J7950r198j0435J1014M233K3402N255L972J95J212R751Q78
7791A8421O975K872k5326Q24J6706K810k9560q397q644R732l159J4569J9505k1520
7777d192L065O596j2947j7270P450R810J1709m699j3562J2053N708j2697n36p832
7763a7344q423N538J1395J0247L8023o689k6024j1904L284L323j5880k424O300
7750a0578o641j0838o31J5324j0301m516m873K5371K929J2250J9894j5720j3024
7737a354m923J1724R43k7746k0412j4081N211L903J8011L9372O234P181K813j8604
7723H272j311m294r656l567J0318J2459k8550J519J6562K2383j0616k2184k0034
7710b8699J9287m895j761j3489j6888M267K7738J8044k5341J2517J1974j485o25
$$ y = [-28011, -35641, -39808, -21858, -31056, -41491, -30477, -26244, -2842, 2413, 6385, 6580, 7792, 17543, 18421, 25396, 28268, 2942, 3766, 20472, 23282, -6278, -14675, -23319, -13587, -16746, -2177, 17328, -4192, -1127, 5469, -7478, -24748, -17298, -7488, 4221, -478, -14040, -1987, 3721, -8976, -9512, -17344, -25767, -20229, -8834, 1413, 39436, 32747, 6723, -5181, -1897, 1426, -14454, -16878, -10578, -17219, -28057, -28688, -13364, -23665, -28181, -33054, -7683, -4754, 7496, 27390, 11670, -1354, -6277, 5447, 6390, -21356, -41768, -55849, -50638, -46735, -28724, 10648, 16882, 24063, 26876, 8272, 6961, 2667, -6989, -10556, -238, 12221, -16329, -14810, 1752, 24135, 13519, -8665, -28699, -9412, -14307, -16068, -29557, -46445, -42178, -14440, 3604, -21737, -9220, 2754, 1269, 644]
7697F44K3292J8278Q217j2638p53q292k1710j8898k193R616j9657P326J1793L882
7683a093l423J771j960j756Q594R971j845q101q454k1587L953L7979N102j16o266
7668A2769p122n655M876j1789j2097k2328J1136R067K3851J5748k279j1492j1625
7655f940m761Q377O789P423O364o535j0964q742k5473l45J2179O658j992Q211
7641i751O369N428J2934Q935L485j2648k1525j7262O79J9750J1533r893k2213
7628b4179k2540m10K6717J9465K358J903k0348l274O321j1662j880J1432j5728
7615c1825J1894J025P72N667P495K2979P030P920j0971l1679j2579O426J5801
7602d5j7827r001J0877R468O502P735K768p885j8163l949o160j193j391K6298
$$ y = [644, 23936, 42214, 50431, 37793, 37040, 28748, 7038, -11860, -14053, -4437, -24094, -16768, -4975, -1093, -4516, -2745, -4705, -6461, 2133, 12104, 10259, 2158, -6296, -27883, -23930, 14049, 19151, 19035, 12769, 5647, -8, 4868, -6921, -19018, -41346, -30210, -21143, 2708, 18456, 16177, 4685, -6940, -11701, -3324, 3465, 10888, 17252, 10717, -247, -8989, -34462, -34807, -22628, -15970, -17962, -9751, -3382, 2046, 14980, 23915, 27400, 14752, -6773, -24035, -23356, -3606, 7927, -1966, -24179, -46719, -47129, -20412, -947, 1411, 3314, -17034, -20308, -13987, -25649, -27529, -16097, -31825, -19931, -18906, -18134, -12467, -4972, 18007, 25037, 32957, 21986, -9693, -22272, -15846, -45, -17872, -26873, -15996, -6528, -26, 7709, 10477, 2592, -15571, -19520, -25680, -26873, -28264, -1966]
7588a966M401K3824O162J932J7671M066j8717k6636j7382P320N309r781Q953J2623
7574A7779k5205l2840j2872N769J9150K8099K5196j5465R82j915l747k920j1051
7561i040J5440J6473m385O164O28j3289n773m785M428j0555j4904n108O159K501
7547a6046J4121J5280j864k793k097R178p316n256r027J893r188m308P006o274
7533a6691J2422J4658o487j8258L391R286L16j3100m981K3522m792p573j3852
7520b2139k642j2363j5649K664J0609J8717N58n573j245o195L10Q95O507O515
7506a9031J9495J0737m922J425j4549r025o952P044J6726J5820q415k9710N181
7493a6176Q189r477r963J2752r313p658J617k762J2323J2989O063o652p730J4555
$$ y = [-1966, 2435, 26259, 32421, 34353, 52024, 56090, 37373, 10737, -6645, 675, 5984, -3797, 5156, 17779, -7426, -40266, -53138, -47369, -28219, -120, 25076, 9611, 10593, 8678, 4931, 2011, -9040, 6400, 22873, 18488, 24652, 25280, 11991, 6218, 1433, 5861, -4694, -19598, -24706, -18547, -16046, -1925, 13355, 11491, 8698, 6601, 15779, 8463, 3207, -5820, -3927, -13115, -17423, -10417, -16691, -4269, 10389, 3902, -14356, -10965, -1679, -1363, -14463, -19444, 4078, -714, -8287, -22139, -24781, -37144, -52793, -50129, -39520, -20803, -20245, -25818, -27063, -33258, -32948, -32053, -25546, -19031, 464, 11201, 6279, 7704, -6845, -15870, -22822, -15778, 948, 16768, 8353, -21357, -16176, -7987, -17464, -27427, -14675, -23988, -31646, -30029, -32791, -20468, -7479, -1416, -8068, -15798, -1243]
7479a243J4238m470n196k6624k6191j5961K3805L4452K286l738n369M00J6533
7466B922O506J5788j1461l2402r713n586J0888K8197J5947O043K50j5336o950
7453E093l851j4138J2602O640J0102p105j9884p425R713k577M785O93j6539k0255
7439d2146J0578k886J5939J9942J2710k1996K67L459J7371Q508q631j7660j1381
7426a5926K350K6083P509j8096k801r166Q861M043m186p324j5940q311N427J6002
7412a1475K927r337l896k130Q932O397q800p031J3469j308j145J0539J0730J1125
7398A8997o459j1405j9604j1994P07p99J7123J5114O946Q326l50J3766j9463k1950
7384a1045j9698j307l033R170K2757K4492P510q962k0085M268J0897L761J071
$$ y = [-1243, 12995, 8525, 3329, -23295, -49486, -65447, -41642, -7190, -4904, -8642, -14011, -13611, 2922, 9428, 25216, 13755, -18647, -28360, -33946, -23058, 5139, 21086, 27129, 27379, 12043, 5093, 1242, -12896, -294, 6346, 16448, 9343, -10541, -17966, -8253, -10830, -6045, -5352, -21891, -42146, -31568, -34454, -18515, 1427, 14137, -7859, -7592, -4133, 13238, 21746, 13115, -4545, -15926, -13576, 12507, 20016, 1920, -881, -10047, -1186, 2857, -1329, -8653, -24593, -32904, -27477, -11475, -8548, -17885, -21781, -23911, -14979, -8582, -17382, -24413, -10944, -12252, -13397, -2858, 7872, 18997, 12538, 1133, -18471, -30465, -29758, -30557, -13434, 1680, 8626, 16952, 16602, 30368, 10905, -11045, -30743, -32050, -35083, -25913, -3156, 21336, 28846, 19884, -201, 4067, 14964, 18725, 19796]
7371A9796L761k0256j6553p230K7834R885j723J9465k916k9952l316J1569N600
7358A5964Q707J6092J422k2297k0521j5185M125M757L0531J4548k2826r691p680
7345b054j052J7800J0504Q621n252j0873j7519n118P505l660k9073m135J7834
7332a6472n397J546j712j145P979r125l873K3134L75K782j968J4606j993K808
7318A1545l90o347j9088o851M671O968R82j595J994J3653K875j8879j0346n746
7304b6554R377P796m159n810J3760J5388n059j5311j5697J3757J1510k467M005
7291E36j291P082j3352l2176P055N612J6281J5698J6217l069j4100r823J839N315
7277A824J2687p137j6676J4046J7248M148k2603j7787K1163M373j5695M43K346
$$ y = [19796, 23557, 3301, -13252, -20482, 7352, 17237, 15514, 34979, 32063, 2111, -1205, 10364, 15964, 24671, 40763, 42185, 19888, -633, -15818, -11693, -6936, 23595, 38143, 15317, 5626, -2054, -3106, 14694, 25198, 33819, 28567, 17694, 175, -4943, 2562, -1098, -30171, -34306, -16472, -21869, -20323, -22035, -23180, -15201, -24326, -28199, -5065, -4690, -1908, -3876, 10730, 8737, 11545, 11155, 4808, -14280, -21131, -16460, -9492, -8510, -10105, -8111, 5542, 8417, -10462, -20808, -26554, -17177, -9381, -13540, -19350, -5590, 9798, 4739, -10572, -26269, -12512, -1002, -3469, 536, -755, 6327, -7025, -39201, -32146, -26534, -10253, 5445, 21662, 18593, 4493, -5330, -3491, 1824, 14511, 7374, -9302, 4744, 21992, 26140, 3537, -14250, 6913, 11286, -4409, -3966, -1620]
7264a620m492j402M306M765m608L632M238k3653J3180N818J4180O778p976j4522
7250a376J5814P928n713N862q558j0852r522K3793Q137p132K064j1984k900p46
7236D815j7303j4593j744P585j5141P996K0198n862l529J4744J8457l1o917L334
7222A2009N494J1294j2114j1777k6887j8017J0555m71j639J1307J1088K4622O334
7209B1798j8172r188J2750K0542j1346N61M644r351j5664l0814M13j1417R343
7196c5901J7016K5619J5398j2385j0652q138L017O072j6165q02K0521N251j2968
7183d117j631J8950j6239j2984J0510J5890J0305j933k5611j134J589j1808j7635
7170c5848M396m04j862k0382P150J8145P023M181K929J0852J9113K5805n638l1045
$$ y = [-1620, -6112, -7514, -3208, 1557, -3051, 581, 4819, -18834, -5654, 164, 14344, 21122, 13146, -1376, 14438, 22366, 16653, 22515, 13957, 3105, -6417, 17376, 25513, 18381, 20445, 8461, 5561, 4815, -12488, -27081, -28825, -21240, -36381, -28385, -8187, -14049, -17578, -2834, 15623, 15592, 8675, 12009, 17503, 28797, 16683, 4906, -21981, -39998, -29443, -29914, -31553, -20246, -9158, 15464, 21798, 3626, -5562, 7188, 27730, 16384, 16945, 21589, 12238, -3426, -34240, -33827, -45244, -35901, -18885, 6734, 22132, 9747, -905, -9043, -6026, 46, -16119, -16921, 3600, 8851, -4117, -5748, 13202, -3037, -16021, -5511, 10379, 20684, 18751, -6860, -7994, -6405, -18213, -35848, -31452, -31856, -33718, -54100, -46950, -28805, -21782, -17601, -14672, -3820, 15293, 41098, 35460, 4415]
7156D415l270j3770n470j0214J4408n311k3172j5293r516J8270L1993J0243J664
7143e023O001k602r090J2264O742j1132j932J1254K6418l3577l7594k056K2587
7130a7740K5301J0343N553j0806k569j7302J518J9062N755m536j3835m047R782
7117F479N728J3393j9044j4432j1964J8346J0573O666p909j2870k3174p031K614
7104c2625K1527J5842j5828j645L254k014j2119Q65j3408J1431K560J3314J5294
7091F448j3878k1143Q398J2460p355O837k464L8J5069k980n534k3589O533K0754
7077d06l881m650R941O677j084j562p175p953J7580m233K326k24k1829J4322J89
7062a962J0757j7166m410n540M033J3317l805J1651j5361j364L934j570j763n142
$$ y = [4415, 1145, -12625, -18095, -28309, -13901, -19212, -42384, -57677, -67193, -48923, -16930, -6687, -5023, 978, -1624, -10714, 1550, 8292, -2840, -4772, 6482, 32900, -677, -38271, -40327, -17740, 7561, 17904, 23457, 12651, 10082, -7220, -5702, 13360, 19115, 14579, 744, -3303, 6479, 12207, 25600, 6556, -7876, -19840, -1494, 9079, 15745, 7836, -5034, -28208, -35239, -32625, -11098, 4744, -11084, -12729, -9475, -11489, -23608, -22743, -36151, -24720, -22160, -8846, 6448, -7430, -28573, -20175, -7715, -15070, -8233, -10697, -10659, 4410, 1430, -4104, -27693, -21160, -406, -4287, -8937, 1004, 7681, 6597, 5035, -2140, -10093, 7487, 3254, 5580, 5356, -16473, -2151, -1962, 8795, -8371, -12781, -18321, -14288, -971, -4776, 6875, -8486, -9850, -5916, -7486, -9249, -14391]
7048a4391K149O398n449j2205m065K22q159M834J4742J3036Q643l271p572j0944
7034a6032j2831l970L619j3544R283N1144J993q995k2784M229m128o074O156L143
7020h791r413j5360P25J475J3871Q490q224n190j3972j0515j4229J003M986J2962
7006d2182J1042k160J6330J7227P806L320o10j9626r263J4775J0964l052l3159
6993b8588L493R231q08j1709k956M66O38j1060J8753J7145L690K49p409p038q575
6978b4478q625K0546J4630Q465N919J729q071j0189m513j7651K2740l017P204
6965D689J673l687K480q430j3614j3167l608K3186J9402q510L628q061l0857r629
6951d4505N177p690j2960J2435M158k4563l7K3405J1636j0297k2952o842J8768
$$ y = [-14391, -12242, -5844, -11293, -23498, -27563, -27341, -35500, -30666, -15924, -2888, 5755, 2484, -5088, -16032, -28863, -32833, -29214, -42758, -33475, 17669, 19662, 10667, -12117, -7888, -12016, -18090, -11934, -8791, -18204, -33564, -32839, -31364, -17493, -9003, -17227, -22417, -36389, -46904, -61133, -60130, -55144, -42182, -31140, -33300, -16970, 257, 8063, 11383, 10773, -8853, -18116, -3341, 7623, 4571, -28588, -25095, -15864, -16672, -28381, -31337, -30871, -30233, -41293, -22540, -5395, -1705, -1456, -8865, -15903, -24478, -33103, -12557, 2073, 10538, 16457, 18186, 10115, -74, -4587, -22238, 502, -2515, 4689, 6362, 2675, 5155, -3275, -16889, -30056, -33664, -10478, 8924, 414, 4042, -4019, -34876, -44505, -39328, -47018, -59978, -47543, -43385, -67948, -67985, -44580, -32944, -43241, -66193, -73035, -54267]
6938e4267K7876O068n654L001J651J012r297l08M359J5822O957o848J3858O594
6924A0824o131J1484p778j5416O989J1322k2221j7130j6482J1811L4972K725j2013
6911g044M253P364J0621j4806k4099J1312K2160J4470j0268j6511o905J218l656
6898a1891J008o615j0245J3350Q584N689j3759P22l47j2470j4511J3025L0095
6885B635P340r981m850j0225q050K030K1977N704J510J1752L447j2115j8777j7343
6871b4946N040J6316K56M845M287l731j0435M678q674J2123P830j0265J5556O472
6857A9352j8587l0507n379K2934n889n641K1274J1048O25m700J134o697l2782
6844c3815O643J3062n612P887M349k2416n305K439q576m945L1054J9496N184J2235
$$ y = [-54267, -26391, -20323, -25977, -22976, -21325, -20313, -29610, -29918, -25559, -9737, -2780, -9628, 4230, 10824, 4693, 16177, 8399, -7017, -28, 11294, -10927, -28057, -44539, -32728, 2244, 4969, -7044, -2791, 4573, 15194, 388, -23711, -12399, 9761, 24231, 13963, -2548, -9453, -8235, -11891, -10883, -17498, -27743, -14393, -5809, -120, -13879, -13157, -13504, -25974, -40485, -27460, 2635, 9975, -6, -4856, -15081, -23131, -21101, 876, 6580, 8090, 19842, 23289, 11174, -7603, -24946, -19906, -3590, -3334, 1511, 5798, 2067, -8368, -3690, -12364, -241, 7589, -2676, 12880, 19352, 765, -29742, -35121, -12187, -18076, -23717, -2443, 8605, 9230, 4530, 5664, -1033, -33815, -27172, -14110, -19722, -11835, -7486, -29902, -35207, -32768, -41344, -46289, -15235, 4261, 9445, 21680]
6830B1680p976j7735L16Q480k3174j4076J531L321J6797K7949R827r820l5446
6817a8326Q471j1213r210K186K3357J3199j9140j1165K1403p635m20J5177O683
6804A3367Q232k2363m590j0624m048o011Q282J6733L355q615k7486O976J3379
6791a3413o050R754m53k5780j156K9586L781m221r52N015R481J0163r495k9670
6777b3410j0754P880N339n7J7387q606j241l642R370K5307j1704j9548K9166J9637
6763C5124r006j5905j4434q016k0135J1414L1854k2100k950r773j280N903J1206
6750h098n879j6462m670J4294K5217J8167j2430j7494n438J1936M388P300p856
6737B975k3078j8371P553K7730R570j0801J5985N178L646J0478K584j340k1k2277
$$ y = [21680, 13704, -4031, -3715, 4765, -18409, -32485, -30954, -27633, -10836, 17113, 26940, 17120, -18326, -9855, -21068, -30278, -28092, -4735, 8464, -10676, -21841, -438, -8073, -8493, 6684, 13367, 21599, -764, -5354, -15978, -20026, -26037, -17755, -1022, 2333, -6282, -33768, -26792, -13413, -19463, -9709, -10162, -35942, -37098, -7512, -3731, -7952, -8904, -3889, 5592, 15755, 6260, -23410, -34164, -26284, -20945, -21002, -3615, -12221, -13462, -17104, -7734, 17573, 5869, -13679, 15487, 35124, 26118, 10213, -4221, -12237, -32372, -20958, 10896, -11204, -14154, -23927, -25207, -19304, -8098, -13977, -30439, -35109, -20815, 4402, 22569, 10139, -7355, -12793, -857, 3531, 10831, 2975, -20103, -38474, -30921, -3191, 6379, -4422, 11563, 16741, 20387, 30865, 33449, 32109, 32088, 9811]
6723I811k3621j1932K1211o203j0668J389M179O996k554R113m50J1272O022K517
6709A7082J926p443l9466j8614J0336J8381j4229p181R742J2779J4927K824p070
6696f006J702j1688M573O991p982M009M388q117k810o602j39K901J598K5555L073
6681A1446N247K4733j8120j1535O95l468j3610j2297m868K3206M761j1277J5523
6668A0436j5602k5192M964K2723l894j7119j5399o207O735j554J5713n133Q898
6655b0631J9661N666n704j9164p959k028K544O9O890K8964m10k2208K849q412
6641a9873k0241r921J2873K894n872k449J9683K181J6693K9651L4669k049j8832
6628C9407j8054j163j462J1323l928j6584J0946M242J6129M26J1368K5423N2819
$$ y = [9811, -13810, -25742, -4531, -10734, -21402, -20013, -15834, -8838, -11392, -2279, -2729, 8543, 14565, 17082, 19008, 11565, -27901, -46515, -36179, -17798, -32027, -39208, -29466, -16687, -1760, 1064, -6006, -4304, -15992, -11419, -4428, -12410, -8401, -4013, -12130, -14940, -21542, -21681, -18780, -17182, 8373, 11446, 16693, 41426, 23306, 11771, 12466, 8998, -4612, -16909, -21777, 1429, 6190, -5087, 10436, -5166, -30358, -25394, -2671, -6565, -23684, -39083, -45290, -38555, -40109, -24396, -29529, -20631, -970, 4696, -1008, -20172, -28131, -30159, -27615, -27546, -20656, 8308, 7898, -14310, -11461, -19873, -40114, -50035, -37162, -34268, -40140, -42589, -22906, -20725, -4032, 25619, 60288, 58239, 39407, 21353, 20190, 18728, 30051, 26123, 9539, 20485, 24727, 40856, 41282, 52650, 78073, 130892]
6615A30892P6884J04525J66270L73124O65385Q52567K88590n56542p59261m97147
6605H45287k75073j51104p7894o0995n3927n1786k8727r130k3618k4929j8903
6594F9201l087j4817p348J7921J6716J8917M87j6473k9710K010k1049j9699j1401
6581A668J1828O767L557j5912j0971j3710N318r091j6910J1313P584K9636R281
6568B0358N832J1037M094j60j3420P14k6587j4891J0075o471j1563q758J0560
6555a9180P249M394p477j0631m225J7649N76K20l76l08N57M176o648l1410J2573
6540c2861q91p594J0487K2894J8864Q923j7176j0930L231j0385M352O304J7266
6527A2484j982J0277o8o464m135J0762p327k6190K968J249o989O347K17j3976
$$ y = [130892, 207776, 312301, 478571, 851695, 1517080, 2369647, 2658237, 2101695, 1342434, 845287, 570214, 419110, 341216, 280221, 226294, 174508, 145781, 136651, 113033, 88104, 69201, 66114, 51297, 43949, 61870, 78586, 97503, 97990, 81517, 51807, 53817, 32768, 13069, 1668, 13496, 20263, 23820, 7908, -3063, -16773, -11455, -20546, -37456, -26143, -18559, 11077, 20358, 26190, 37227, 41321, 41161, 27741, 28455, 1868, -13023, -2948, -9419, -20982, -29740, -19180, -11931, -7537, -15014, -25645, -29870, -12221, -11645, -11425, -11801, -12109, -11552, -7376, -14024, -45434, -32861, -33752, -41346, -30859, -7965, 10899, 19822, 2646, -8284, -5053, -15438, -11086, -4782, 12484, 10502, 20779, 20711, 14247, 10112, 20874, 13547, -12643, -9675, -8426, -15415, -9068, -8851, -22827]
6513b2827J7768J6360o080N425O438j5279r364L975k440j5776m320O008K1477
6500A365K161o951J0050M222O784m17j6871J6098K0576k0223j1975o730k1741
6487b3652P046j3071k1204K1750K5789N847j4658m663m03J9299J395k3963r807
6474c0295j535L004M15J2159k328N745J3084O408q808J0927K757j9534k6058Q816
6460b5243L963M962K467n782L07l519J2941J2833Q95j2467J90o13j0599J2229
6446g436j1886p989N37J5207M222Q966L56j1389k0180r600L0981J8152J5063j5390
6432I614o727O210n513n84n201L9N907j07n983j4877K0172r859R116J1727j2788
6417A146p706R53n872J0103n605m126L790N714J4482J1057q998j8135j504Q192
$$ y = [-22827, -5059, 11301, 5221, 10646, 17084, 1805, -7559, -3584, -6024, -21800, -26120, -20112, 1365, 3526, -3425, 6625, 10847, 17631, 17214, 343, 16441, 37017, 16794, 4819, -1911, -23652, -16606, -29677, -50881, -29131, -3342, 2505, -12153, -16816, -17219, 2080, 3475, -20488, -30295, -31830, -28826, -28411, -16252, -18580, -12835, 249, 6657, -2151, 8776, 11533, -8001, -34059, -25243, -21280, -16318, -13851, -19633, -19326, -22845, -9904, 2929, 3824, -8643, -8453, -9066, -19665, -7436, -19322, -27311, -26774, -11567, -7345, 1621, 1977, -9412, -29592, -39192, -8211, 9941, 25004, 9614, 2887, 9097, 3584, 3000, -2201, -2162, 3745, 3638, -2345, -17222, 2950, -6909, 2207, 13934, 1146, -6560, -5607, -11479, -1376, -6981, -11107, -7317, -1603, 12879, 23936, 14938, -3197, -4701, 3491]
6403C491r374r050j4447R513K0172J4977n273q514j0261R84M517q862K726O51
6389h750J742J6116R475K399j5760J059J405J7738r757j1221m380k18k4775j449
6375b6376J483j4305j6662l522J8086K9760l104q007l13K50J2341j9112l316m071
6361c6868M227n714k771j2796J7881Q789q175l758K1893K1784j2629P08K785l707
6347h351o518k203r34J3159M469K856m240m881j0838J6747j7144j1243l608k409
6333c5138J28L91L801J0552J9239j2134L065K820n989m34j378J5117j1752m983
6319a6695j8409l359j046k94r86J6827J1927q99J0711O27j4016q258J5993k353
6305a0230j7025Q649K8204j4880k5009m354K1121J7851q00l079K966p190k402
$$ y = [3491, -5883, -14933, -29380, -19867, 305, 15282, 10009, 1495, -8766, -7782, -3265, -12127, -9401, -8750, -7008, 9108, 18583, 20982, 5222, 6281, 7686, 25424, 15667, 4446, 66, -152, -24927, -26376, -24893, -39198, -55860, -59382, -41296, -11536, -14640, -22647, -22960, -22710, -10369, -29481, -32797, -36868, -32641, -38355, -41126, -53922, -36041, -27252, -35427, -39185, -17292, 4492, -8137, -7429, -4644, -8351, -14869, -17072, -18006, -4847, -378, 2478, -1762, -6643, -17481, -734, -17878, -29121, -32729, -35138, -35010, -34619, -30818, -20266, -1027, -13161, -10096, -7276, -13265, -13699, -15077, 40, -11712, -16695, -35104, -38463, -39509, -39803, -40789, -23962, -12035, -12934, -2223, -1596, -15612, -23870, -7877, -10230, -27255, -18606, 9598, -5282, -30291, -34645, -13524, 4327, 3527, 448, 3414, -3776, -6178]
6292f178j8137L79K2636k2330j6946l584L565R315P698k428J991J5156J0105K0286
6278B1528n233m315Q184j626j067j3945j0222L273J076M044k263L76l499q547
6264a2236J2717Q368r100P745q279j672p298j6466J034O458M434k6681R360J3279
6250a8337o68L343Q465J1041J1583J712j8706J4906r384j9690l34R757j3403M314
6236a5401J2319J4976o33j7050j090j9909J6430K3340j9761o383J5564R790n962
6223F230p399j7678j7978R156K1611o843k1643m84n583J7035L880O228J6675j0846
6209g639L352j671p434j672P845p768l597K2036P370k0138k432J7125M383K143
6195A1903j0780J4108j836n601j956j3047K7442J7606p622J2730k965k8334j9474
$$ y = [-6178, -24315, -23936, -1300, -23630, -40576, -44160, -40595, -31280, -23582, -26010, -24019, -8863, 1242, 21528, 16295, 11980, 20164, 18538, 17471, 3526, -6696, -3423, -2347, 1697, -566, -190, -3689, -12236, 481, 8849, -251, 7494, -785, -2457, -9755, -26221, -25187, -18729, -14295, -40976, -31616, -18337, -19005, -15662, -7197, 3844, 15427, 17139, -1567, 13339, 3955, -15735, -16069, -6312, -19715, -15401, -3082, 11894, 11261, -5789, -6879, -26788, -10358, 12982, -6779, -13162, 2402, 12192, 6230, -1169, -18847, -36825, -27669, -6058, -12901, -34544, -35028, -40611, -23576, -19696, -13468, 3207, -7639, -4287, -5958, -13392, -15064, -7219, -14987, -18584, 3452, 10822, -9316, -11748, 5377, 9760, 11903, 1123, 15231, 13395, 7794, 5838, -7209, 20233, 37839, 30217, 42947, 39982, 11648, -7826]
6182g826J169j1745k4664j3791M434J4823K7056M1021p185j1276n523K4686Q444
6169C9623k9684j2952l638j051Q339R353n663l55M82l004m533j6400K684j4272
6155c1071R31K7769J3850k0249r260K0786J604m856M052J356m110L464o826j0524
6141a3084Q029R654N723n122j1946m962J0213Q180j5502k1825J1985k185j4737
6128c5579J5421L3380L632J010j3474J999k1851l146K0311J5216k0829j9571j7234
6115d0715N500J1972J0207J7230r480k0466j8328j6005L764J6866m671k852j1321
6102e8299O883K790J3778J6303K0032L978O555l387o058K0901j3551j1125L958
6089B758m038Q70l053J6065J3465N801p962k8528l1473j5005J452K5840J1427
$$ y = [-7826, -6657, -18402, -43066, -56857, -52423, -37600, -10544, 30477, 23292, 12016, 6493, 31179, 39623, 9939, -3013, -6651, -7702, 637, 9990, 4327, 3972, 4454, 1450, -3083, -19483, -16799, -31071, -30140, -2371, 11479, -8770, -18030, 2756, 4360, -496, 3556, 4912, 802, 4266, -2560, -13084, -5055, 4599, 10322, 5200, -6746, -11708, -1495, 6685, -8817, -30642, -18657, -20842, -35579, -20158, 13222, 16854, 17864, 4390, 6389, -15462, -18608, 1703, 16919, -3910, -23481, -40715, -35215, -23243, -13036, 4194, -5286, -25752, -44080, -60085, -56321, -39455, -44126, -46978, -58299, -51416, -48626, -34848, -18545, 1487, 5465, 12020, 8633, 2575, 23476, 9925, -1200, 2758, -1280, -410, -3463, 12602, 26067, 31868, 23906, -4622, -36095, -51100, -49648, -23808, -12381]
6076a2381M283O162J203j3947k0236r74L2914J3319j5869L270K66q708N613P005
6062A920n072P892O123p35r60L783j3475j1176Q33o053J8952P717M959O257P109
6047B8074o005k3219P01M872K1606j181j9833o137j0845j0326m259p129Q219K977
6033b2485N361N926j1811q151J8316J1781m655K829q468j0321P064J4284K839
6020B509o845J878q376J558j702M445k9K213J9710j1299R015m130p666J194M82
6005B957j443j8985M226J4449N997j4522j1553k2079J6709J3458L421P3p30j2621
5991b0643N928l970m973O37j1491l810K3461L585j6120J4327J8696o166q807k3722
5977c3068p107K1571J3625J2704J2824j2798j2870j6587j3507n136M313J5740
$$ y = [-12381, -8098, -1936, -733, -14680, -34916, -35890, -2976, 10343, -5526, -2256, -1990, -10698, -5085, 1920, -3152, 4740, 10863, 10128, 9168, 12951, -524, -11700, -10867, -16920, 2032, 9749, 14708, 20965, 28074, 22069, -1150, -449, 4423, 26029, 24848, 5015, -1122, -11967, -22293, -26552, -33681, -25462, -22485, -17124, -11198, -23009, -31160, -12844, -1063, -5718, -2889, -11357, -21678, -14614, -330, 2509, -4336, -2458, -10834, -9276, -10978, -6533, -6562, -4349, 15361, 4062, 13077, 8947, 1281, 2475, 2957, 1514, -17471, -13245, 1204, 7201, -7321, -18874, -40953, -24244, -10786, -7365, -7292, -8022, -20643, -14715, -18685, -23658, -23021, -34512, -38322, -14861, -11276, -27396, -13069, 5627, -539, -9346, -33068, -40175, -18604, -4979, 7725, 20549, 7751, -5119, -21706, -35213, -40349, -36036, -20296]
5965b0296J4779J045L212p35n687m660k1351j923J7004J4794J0067K4416R562
5952D0227k1974j8818k0476P223K1782L944R160o091o904k4363l3990M990J705
5939d3585J5392R458J2844j3307l800j075J2813L0086R784N986k1104q251j9578
5926a4337r056N075R534J7940J6160R28k2649j5949O334N169q882p276R939P140
5912G0j981J276p277O590n574p058J270J0938J249o159j4274J267J6214k232q549
5897a4230J0245J3518O014o290j2145r16P679j460n493r539K364o383j022M416
5883a3242j1260j4989l363K9332J5353p778j1660l168r624j0873k727k615N165
5870d1449J4078l818R618J8522M533k3398O770K316j7749j4488J5393L0081J5984
$$ y = [-20296, -5517, -4472, -1260, -1995, -7682, -12342, -33693, -35616, -18612, -3818, 6249, 30665, 40227, 18253, -565, -21041, -13818, 7964, 11908, 21068, 14977, 8073, -16290, -50280, -45290, -43585, -28193, -18735, -5891, -19198, -22998, -24073, -11260, 18826, 28610, 34596, 13492, 5241, -14337, -23393, -18318, -8784, 9156, 25316, 26244, 3595, -12354, -6020, -851, -9733, -17009, -7070, 70, -1911, -635, -7912, -1322, -6896, -13954, -12684, -1746, -497, -6656, -20930, -19663, -3449, -5681, -14230, -3985, 9533, 15547, 9257, -2888, -3804, 3875, 2415, -3078, -12617, -10253, -16636, -17658, -13242, -24502, -39491, -42854, -13522, 1831, -5947, -17607, -20775, -30399, -41272, -43999, -46614, -41449, -27371, -31189, -21571, -3049, 1484, -21914, -15144, -12828, -30577, -45065, -29672, 409, 16393]
5857A6393r87K1722j4056k6527K681m031O18p516K659J0499k392j6307L78l283
5843b0149j609R061j8837P09J1900k0503j0347Q733l398K484Q826K8865J8646
5830A4381Q673j0433j0394j8192M039p699m012J8874K1919o740k6770j2071J2544
5817a5881P478k3163o493K6096K744J6582M526M696j9414j4737j219l5946r866
5804f4597J3712O521K1955J0725R270j5944O353O750q818n369J6052K3066n644
5791A4032j7015p899P5p615m394R10j6806M752J944K4984Q795k1316L495p229
5777b3287J1238L833R922Q58o124j5193n798M843K4132j0612J924N016r963M097
5763e114j4385j4943O366J4717N192J5138j277q945q72j1676k051Q02j1603m963
$$ y = [16393, 15406, 37128, 23072, -3455, -774, -4805, -4187, -11703, -9044, 1455, -937, -17244, -16866, -20149, -21758, -12697, -31534, -30825, -18925, -39428, -49775, -41042, -44440, -41956, -33130, -4265, 14381, 23054, 12621, 2227, -15965, -11926, -19625, -23637, -4763, 17156, 10416, -16354, -28425, -15881, -8403, -31566, -38059, -11963, -9219, 7363, 11889, 16585, -2829, -17566, -18785, -54731, -64597, -50885, -44364, -22409, -11684, -2414, -18358, -12005, -5255, -14073, -19442, -3390, 19676, 14032, -2983, -10882, -10807, -18422, -22816, -21906, -38712, -33960, -32016, -7032, 1763, -19553, -16058, -23287, -12049, -8216, 1706, 2564, -3560, -18753, -24551, -19708, 4424, -6188, -4264, 752, -9211, -5114, -19499, -34442, -28076, -13359, -8167, 6971, 5694, -3251, -4123, -15799, -17850, -17048, -28651, -33614]
5749c3614P888J0819Q962K05j0742k2997p235J7082K251J5704J0213J6252j607
5736A3181k0552K169P333M264N627j1405j6066p016J5803k42j354K509R790q780
5722d739J7737J5781j9196k3615L408l856O040L372L926K2850k355j8433j4126
5709a3206Q12O466k4935j0412O947J4723P760M124J8907p05k417j2P360j7054
5695a642r490o907J8072J0677P947j4477n992k437q648O679R690j3722l230m493
5681a7973K852J9764J3012j2869M137N033K055k3086j1118J254J9633p887l9634
5668d4827Q19M4083J7541j8374j6446p456k592P897M464J4894J1909j7013k5294
5655c0395n23J5716m42m739j3277R207n360r95n421p379O643J4352p375J9919
$$ y = [-33614, -25726, -14907, -5945, -5740, -16482, -39479, -46714, -29632, -27381, -11677, -1464, 14788, 13181, -7371, -5202, 2131, 6395, 12022, 617, -15449, -22465, -6662, -6904, -8258, -5749, 4041, -4739, 12998, 28779, 9583, -14032, -10624, -14480, -8440, -5068, -1142, 21708, 19353, 920, -13206, -12394, -5928, -30863, -41275, -34328, -19605, -11845, -7721, 11186, 10481, 8064, 8052, 15412, -1642, -11132, -18039, 33, 10710, 18657, 4180, -1812, -4249, -12897, -6218, 3472, -10250, -13480, -17973, -15121, 4643, 17655, 4786, 8923, 13956, 16011, -7075, -18193, -16939, 2694, -5193, -44827, -44008, 75, 17616, -758, -17204, -24660, -27252, -19355, -14891, 3, 11912, -5101, -30395, -30918, -15202, -15644, -20383, -33660, -24453, -29813, -30808, -36229, -43608, -36965, -22613, -29988, -10069]
5641a0069L938J08j431N685J1812l747j1267P048O42j7194j4165J4113P46J628
5627a2153K635J4898N564J5804p318k041r875k2667o378p088P992Q509j8274o375
5613c6767O535j6013J3924J8659J1140L393L1024p322k2799q249k4007P676J542
5600b1264j0366J0695R677R716l037r035k200J6677r656j8794N758J014J2981
5587g834j8942q416N994J5766P530O592m126k4946r383J1351K2669R861O703P315
5573B0134j2866j3495n171k659R456j864o102R946P804p268p487N548L798J762
5559A536j1542K8980n072k1676q70K0657j3060j2069K2848P948m637j4731l985
5546e673R875J3923p099o445j1943p475K475K839R596j9246j9852o99J4087o273
$$ y = [-10069, -6131, -6023, -7454, -1769, 10043, 6296, -4971, 2077, 2719, -14475, -28640, -14527, -13781, -12153, -9518, 5380, 10944, 26748, 19430, 17389, 7514, -15153, -21531, -28619, -20627, -12118, -30392, -36767, -30232, -46245, -32321, -13662, -2522, 871, 31895, 24573, 1774, -6475, -30482, -22806, -21264, -31630, -20935, -11258, -1542, -4579, -13614, -15814, 863, -8793, -27587, -21829, -20815, -7834, -26776, -35192, -29198, -13432, -5902, 690, -3436, -28382, -37765, -26414, -3745, 6116, 12819, 20134, 7268, -6227, -11398, -14057, -4601, -6465, -12567, -2621, 5183, -2085, -9572, -4024, -226, 1536, -10006, 18974, 13902, -7774, -8644, 12013, -1047, -13116, 9732, 17680, 13043, -1688, -5673, 4202, 18125, 11026, 4581, -7362, -14837, -12362, -9523, 73, -19173, -39025, -39724, -25637, -31910]
5532c1910Q321K4524m141k0156O124J8458J0916o25K2154K2103k5459l5462k946
5519h099K96K392L240Q50m173N691j0340k925p342J4294J7470r765l157J1326
5505I758r662j1517j6439k2062j2992k184J1487K2620o477j0647k0k196P226j0754
5491e3859k817M040j4751N386K1325J2352m18O316J6486j1773j7915J338R82m355
5477c7663j1711j534J5562L1699p361l0577M461K7681J1340j3003J5181q722J047
5464c600M932J4212j4875k3571r606r6L150K5977L0998J0978k563l4468k4365
5451b2897j24K492K667R250k386n32q97k5366j5907P849J1777K4612J1099J1348
5437A2985j5832j5257Q304j630l980k6575N598Q213M207J9500J3696J6165j7972
$$ y = [-31910, -23589, 935, -3206, -23362, -17238, 1220, 12136, 11511, 33665, 55768, 30309, -5153, -8099, -7803, -5411, -2171, -1321, -5494, 197, -10143, -13068, -20410, -6116, 11354, 1589, -1568, 9758, 96, -11421, -27860, -49922, -62914, -65098, -53611, -30991, -37468, -48115, -48135, -50331, -43105, -53859, -56676, -52636, -67387, -62001, -40676, -28324, -28742, -22426, -5940, -17713, -35628, -34290, -33308, -37663, -49374, -50908, -35346, -3647, -11008, -41585, -37124, -9443, 1897, -11106, 4075, -4647, -3600, 1332, 15544, 669, -22902, -32508, -32604, -29454, -3477, 27521, 38499, 35936, 1468, -22897, -23021, -20529, -17862, -8612, -10998, -11530, -12427, -37793, -53700, -45851, -34074, -9462, 1637, 12985, -2847, -18104, -9800, -11430, -15410, -41985, -36387, -28174, -23967, -4467, 9229, 25394, 7422]
5424G422k0844k1988m09k435J0982j7235K052R971Q049J7673n375j5811J4930
5411a3018J501k714N227j7359j6718P62J8032J6559K127J1949Q927p723r207r090
5397a0745n022J2173K5835o402J0774k1009j5154J779K010j869k045N202j4913
5384a9386P482K703N812O072k089r740K5677Q852l9914j0101J9129M612l046l0039
5370c3976M290O484j5306o918n717J0561L525M581J9809N554r764J4279n627k831
5356a1056J0054o86o848j0087o130q059o933K7333J164J0551m774j3904l122J6011
5342f486k1561Q455J1027J1627n841l127r968j6284J4874L4776r223j7881j3227
5329b2839j1354K892J3677j179j0615K7985L604j5069J319J2735j0500r722p204
$$ y = [7422, -13422, -35410, -35819, -38254, -27272, -44507, -42455, -32484, -24435, -6762, -12137, -27948, -13018, -11517, -14231, -9004, -26363, -43081, -42319, -24287, -7728, -5601, 6348, 15275, 7552, -1655, -10745, -15767, -3594, 22241, 15839, 26613, 5604, -9550, -7771, -5761, -7630, -9675, -4473, -19386, -11904, -9201, -3389, 2683, 594, -9146, 16531, 25383, -14531, -24632, -5503, -891, -3937, -33976, -29686, -23202, -38508, -45426, -51143, -40582, -37057, -32476, -12667, -7113, -16877, -2598, -8225, -11056, -1002, -1688, -8536, -18623, -24753, -32812, -39745, -12412, -11248, -697, -5471, -19375, -22497, -6486, -28047, -19592, -8565, 3062, -2779, -5906, -15874, -32158, -17284, 17492, 8269, -9612, -22839, -34193, -31301, -17624, -18803, -29418, -1433, 2171, -12898, -11579, 1156, -9344, -19066, -26270]
5316b6270L1777p638o001k2121L757J6692L1388J7751k2091k1238p832k702j8544
5303c3072o131O370j116P077O724p943r337n05j2746L726K1337K1183j10j3516
5289a8059R373J0408q125m993j51j0869J00O725q411m843L33Q649K587M738O965
5274e573J1211l5K4Q718j0868L377j262j5189N134J5550p763r294n256p855J4901
5259d180j1423j6959J5254K89r627J5293j167j0925q986m850K715j891p50J0871
5245b6336L564J249p100J0796J3779n291o311l305k534K262Q42J0390p943P317
5231h621R882R309n120j9000Q318J6074J340j9627M615J7943M564q730k1604j2543
5217b3200r730k3449K366K0447J4276K7454J3387Q460L081j8730l1785M219M306
$$ y = [-26270, 5507, -2131, -8132, -30253, -26496, -9804, 21584, 39335, 17244, -3994, -11826, -14528, -33072, -39203, -32833, -33949, -26872, -20148, -28091, -37428, -37933, -50679, -46953, -25616, -4433, -4543, -18059, -8686, 1722, -6403, -11396, -11547, -22416, -22316, -15591, -24002, -28845, -28512, -19863, -17276, -12538, -5573, 5638, 5603, 5627, 14345, 3477, 6854, 5592, -9597, -4463, 11087, 3324, -5970, -11226, -19081, -4180, -15603, -32562, -17308, -17019, -26646, -11353, -12520, -23445, -32431, -37281, -34566, -36457, -37207, -26336, -22772, -21523, -28623, -17827, -4048, -9339, -15650, -18955, -21489, -19227, -18385, -7995, -15938, -8621, 1261, 10570, 5450, -13550, -5232, 10842, 12182, -7445, -2830, 15113, 19677, 10947, -10657, -23200, -32930, -56379, -54013, -33566, -19290, 8164, 21551, 30011, 33092, 14362, -17423, -13204, -8898]
5204h898J478J4603J2368l7356l6842J8890J9526J4038j769o964K910q241n16
5191a6773Q644m631O145Q391j5987J2936n09j97j2140o92j900r347J4304p270
5177a9026J2904P010j1192q327N846j238j5953o904L156J9220J0792q988K4194
5164A1494j2517j8731J6543j236j6448l370J7126j1598J2056K0500k343r582J5613
5151A7507k6438L717J1720J4338n073j0453k7832j6530J4328L509J5656k686o677
5138a4914j0559k0467J1142k825j147n246q232P100J3283J2192j19N172M066k712
5124a3266m178n125K9861j844j3572n728J1866l203l131j0380M906J6708L246
5111F160O177R172k2055k699J7913r092n883j2798p28P734j2439M478K388j2647
$$ y = [-8898, -7420, 7183, 19551, -17805, -54647, -35757, -16231, -2193, -3962, -10926, -8016, -16257, -16773, -8129, -12760, -6615, 1776, -14211, -1275, -1784, -1981, -14121, -14813, -16713, -26060, -11756, -19026, -6122, 888, -10304, -18631, -12785, -14023, -29976, -36880, -33724, -14504, -3712, -12700, 11494, -1023, -19754, -3211, -4447, -20895, -24265, -7139, -18737, -6681, 13819, 11476, 1894, 17507, -8931, -5214, 6506, 20844, 15771, 5318, -22514, -39044, -24716, -21207, -5551, -8237, -14914, -25473, -45940, -34798, -37623, -38770, -44016, -52248, -45148, -31865, -19673, -19792, -14620, -10554, -13266, -17444, -22569, 7292, 5448, -8124, -13852, -1986, -5189, -8320, -18700, -13794, 2914, 6160, 12337, 21509, -546, -3245, 14668, 5576, -307, -13105, -13833, -6099, -18538, -14060, -11672, -24319]
5097b4319m939J3610Q659J199M710L243j3938p514J6028n284o082J9197j0710
5084f140p414j1831r027k314J3227o192R142J5988n640m778k588p876J3240K096
5070a0107R032J0223m225j6949k9600m887L715j1196q10K120P339L2179J1693
5057a473k597k2373j2505J7394L6379M5J6928k3011j3614r850j0589k900J549
5044b6617r047r804l815J897j0018J6353K8132N948q822R718j1109J662P946R019
5030A443j1191j7132j0254r569J1490O981j414j8081J0773K3524L560J4327r76
5017C481n028j3429J848n289j3119j4278K6662K6471q028j8344p687j8701k2852
5004f8293J9596M8697J1507j2834k068j1556j0645m601k6804Q081L2497J7935
$$ y = [-24319, -29258, -15648, -6989, -5790, -1080, 2163, -11775, -19289, -3261, -8545, -14627, 4570, -6140, -13554, -25385, -34412, -36726, -23499, -29691, -20549, -4561, -10201, -14979, -17567, -25443, -12203, -10107, -1075, 9148, 4923, -12026, -41626, -46513, -42798, -53994, -54804, -52684, -45345, -13166, -1473, -4070, -26443, -38948, -21554, 14825, 14870, 31798, 8787, -4827, -14677, -25266, -28166, -26617, -35664, -45468, -49283, -47386, -57404, -41051, -12919, -6971, -15793, -6075, -17184, -15522, -7576, 1443, -9748, -26880, -37134, -46703, -35213, -28232, -29646, -47727, -36954, -13430, -9870, 4457, 3481, -1547, -14976, -13128, -18417, -31536, -45814, -19152, 7319, -709, -19053, -26740, -45441, -68293, -48697, 0, 11507, -1327, -3395, -14951, -25596, -30197, -57001, -48920, -16423, 1512]
4992A512n117J624Q590j9925L706R845j68J704l77k81J475J9716j0977k9686O943
4977a1416k181K4359j0622n268l371O014J1487m794J6482J0399k7275j2732J6395
4964G477J6809j0674J57m088J337o402j6990j2011q940J5981J7815o365P151J6404
4950A7661L6707j9792j1458r708q790j1227L32L651N188J977k165k1025M849M181
4936i619k370L740k218j8214J149K6773O072j7158L508J8426N708k7788j7779
4923b9770J8599j331j5136K2354J25M414j376Q807j069l5342J0614l329L542K1557
4909B659j0041q154R243K6127P614j6620K715j270j4499J450L330j239q933N492
4895b126J1045J955p791k5791k907j4963J6561K0149P098N566P72N39j5460j2964
$$ y = [1512, -3605, -1981, 6609, -13316, -9610, 235, 67, 1771, 1394, 1113, 2588, 22304, 11327, -18359, -11416, -13597, 10762, 140, -5128, -8499, -2485, 9002, 4208, 20690, 31089, 3814, -8918, 7477, 24286, 13612, 13769, 9681, 11018, 4616, -12374, -24385, -33325, -17344, 471, -5894, 1257, 17661, 54368, 34576, 23118, 13410, 4620, -6607, -6275, -2624, 2564, 4541, 2376, -18649, -13800, -9619, -11989, -8249, -10467, -28681, -27532, -759, 5313, -11845, -8337, 10089, 15797, -11991, -29770, -11171, -12502, -27638, -5284, -5159, -745, -2121, 6686, 5617, -29725, -19111, -22440, -18898, 2659, -7382, -15536, -6293, 19834, 27448, 10828, 13543, 12273, -2226, -776, 2554, 1315, -7618, -2126, 8919, 10874, 3083, -22708, -25615, -40578, -24017, -3868, 3230, 8796, 9568, 10107, -5353, -18317]
4881a8317j2692m239K23o703J5167J4848k319L013J1869O394Q51k6697m297M721
4867a8178l760M868K795J3605O591j0412j3351O679m697J5138O661j7521R618
4854a964J2362J5326l545j6804N53J896k3373j326n770l192J4392j7896k933J8957
4840a3317K5215J3916j0395q039k6120q350J8258J5982j2965p519L327q479k2767
4827d1253J8578L1367j3817k1964k847M415p67L797n464P821O612k70j011J5091
4813B88J6892J4280R110n740k2668m845k674l988m182o182o583L826M965o409
4799a3910J1252k749j9275j1378L69J845m01J7644L091N734q593J132J727J6682
4785C170N70p296J7508j070k889k0628j5764l549J292M057P564q105q624K5116
$$ y = [-18317, -31009, -35248, -35025, -41728, -26561, -11713, -14032, -11019, 850, 7244, 8095, -18602, -22899, -18178, -21938, -17070, -14275, -670, 5921, -4491, -17842, -11163, -15860, -722, 5939, -11582, -1964, 10398, 25724, 22179, 5375, 5928, 7824, -15549, -16875, -22645, -25837, -11445, -29341, -32274, -13317, 11898, 25814, 15419, 7380, -18740, -27090, -8832, 7150, -5815, -13334, -10007, -18486, -41253, -22675, 8692, -5125, -27089, -29936, -25521, -26288, -22491, -27955, -20134, -13522, -13792, -14803, 288, 17180, 31460, 40570, 34830, 12162, 7317, 4643, 655, -3527, -9709, -16292, -12466, -7501, -13910, -2658, -5407, -24682, -36060, -35691, -33846, -34247, -16603, -13512, -7778, -16371, -15239, -13512, 3170, 3740, -3556, 13952, 12882, 9993, -10635, -26399, -29948, -28656, -24599, -17035, -25140, -33764, -8648]
4771h648J3047n278j8176n83J2341K2318N45j5904j0612J4558Q909k2429k275
4758a2187P349R370J5075j7195K66J6479j5768j2543J098o582M400n561o582j5902
4744c8283K032M7965J5828k1829o077J648j7822q355K3601J4182j6645O618M607
4731G470K565k7948j3076O186O726J3967L476q016j598j0322n380J1175J619J4098
4717I42J2443L634k728Q873J814j564j4719j7132j790N061N122R730N319r846
4703E159j6913n603n318O446N680J1534K768j3169q559O471O815P051J7224J662
4689B1248l0395j1541J5210J2193j9094p334O633L320q948j7278p953R632J9013
4676a5294l176j8306k784n135J6125J2538R870M520P334K259l987J4078j4725
$$ y = [-8648, 4399, -879, -19055, -19638, -7297, 15021, 15566, -338, -10950, 3608, 12517, -9912, -12187, -4838, 4532, 19607, 2412, 2678, 19157, 3389, -9154, -8056, -14638, -10238, -15799, -22381, -38283, -36251, 11714, 27542, 5713, -364, 1284, -16538, -24893, -1292, 12890, -3755, 2863, 7470, 10035, -17913, -30989, -24803, -18077, -4110, -634, -8650, -10248, -20570, -25950, -14775, -13156, 942, 13385, 17019, 14291, 23164, 24978, 23414, 8695, -8437, -10227, -5166, -44, 9686, 15005, 5159, -11754, -17357, -22675, -16229, -10549, 985, 3753, -9416, -17975, -11504, -4689, 2362, 19586, 21248, -9147, -20688, -5478, 6715, -12379, -19713, -13080, -9760, -18708, -35986, -43939, -34307, -15294, -18470, -36776, -39560, -44695, -28570, -16032, -6162, -1642, 5692, 7951, 3964, 18042, 3317]
4663C317q23P439l847K247o8k2185r92p25J7653K5106m208j1158J5448n90k8593
4648a979M932m441l0238k841L1839L5105j4678m146j5986o47J676K0765p569j9777
4634g985N332J2102l069L394J0578K313N3k958j5984j3799p359K7474Q814l785
4620A5121r994m107p740j6628k3073R108J1682J1282Q703k829L356j4337r679
4607b9135K2700o121o707K94J9747J4533p014j5809j5911j158k5029j970P264
4594d4316q990Q341K6117J9703p663l265J7024L0018q269j5247j1430m274j6232
4581a8483k526Q587J090J3672K3146Q018k2189p868m094n726r678j7583l17R990
4567b3961O991o169p103n764k225K9182M394j5278k4982k385K1477J4163p05K0587
$$ y = [3317, 2494, 9933, 6086, 8333, 8265, -13920, -14912, -15637, 2016, 27122, 22914, 11756, 27204, 26614, -1979, 2953, -1488, -31726, -34567, -2728, 32377, 17699, 13553, -2433, -3080, -1404, 19361, 11792, -7985, -2653, 9449, 6380, 9774, 20352, 22665, 22718, 19760, 3776, -10023, -17382, 10092, 18906, 15121, 5127, 1020, -6720, -23348, -46421, -37313, -25631, -14349, -5646, -8475, -5119, -19456, -29135, -6435, -12556, -19263, -18969, 778, 15311, 8297, -7512, -23423, -24581, -49610, -51580, -44316, -53306, -44965, -18848, 855, -6808, -10073, 6951, 36969, 28700, 13453, 2023, -2251, -18483, -21009, -12422, -11332, 2340, 25486, 33504, 11315, 3447, -647, -6373, -16051, -33634, -33951, -23961, -16970, -23139, -30242, -36006, -38231, -9049, -4655, -19933, -44915, -47300, -25823, -11660, -12365, 8222]
4553H222L14R242O056J3994J2457j942j3387j0651k853j2694p070j4309P18L397
4539h506J1150O370j4101N558K0676Q502M087q808p322N854M568j1300n789j1575
4525f36k5958p533N318L2724o013J4J0532j0528k536Q907m694r999j128J9894
4511H364J1520o071k602j200L824j6196j760J5817K405j6284j1778P705J5765
4498I509J0847J0174o320j4347j8838m702N883J8844R995k9265n384K603p761
4485a8762Q125L0135K1205j1738j9006O25j4197M072p146J3233k2233j9165J0134
4472b4718J8616J7122J0543l773j6172j2112j9625L994M529J3633R315J4463j2919
4459B896J588j1468p547j2292p227P293R950L144J9312Q709L53O138J615j6613
$$ y = [8222, 8536, 17778, 23834, 37828, 50285, 48343, 34956, 24305, 21452, 8758, 1688, -12621, -11903, -8506, 2644, 9014, -5087, 471, 21147, 29649, 33736, 24928, 17606, 23460, 28028, 16728, 10939, -636, -26594, -34127, -28809, 3915, -2098, -2084, 8448, -2080, -4616, 4291, -403, -10402, -11530, 8364, 19884, 13813, 11211, 10011, 13835, -2361, -4121, 11696, 14101, -2183, -13961, -6256, 9509, 20356, 30530, 24210, 9863, -8975, -13677, -7794, 11050, 21045, -8220, -13604, -11001, -18762, -10637, 19498, 40703, 28965, 9959, 10584, -3613, 459, -6687, 6546, -15687, -34852, -24718, -6102, 11020, 21563, 17790, 1618, -10494, -30119, -26125, -21596, -7963, 1352, 15815, 2896, 4484, -6984, -14531, -26823, -34050, -26757, -16807, -13663, 5649, 14358, 14711, 20849, 22464, 5851]
4445E851k3999J0687k0383j6156k327J4526J2637L663k7121j0030K6209L851L485
4432a9107R535j0900j3024n211O066K5666m1l125k9050k9050p330K0788P099J8905
4418b8779M1208N028j0135k0855j5208J0850K4833K402k3793k0783M455K5158
4406e619K1626j628k4502N585Q09K606K02N59m680J2228n460k937n380J390R059
4391C858n936O929K317m134j2114P119Q509K961J2307k2832k6512j6760J4116
$$ y = [5851, -18148, -7461, -27844, -44000, -46327, -31801, -19164, -15501, -42622, -52652, -26443, -22592, -19107, -9572, -20472, -33496, -38707, -32641, -6975, -7016, -10141, -39191, -68241, -75571, -54783, -47684, -28779, 12429, 17457, 7322, -13533, -28741, -17891, 6942, 9344, -14449, -35232, -30777, -5619, 16007, 14379, -10123, -4538, -3729, -1123, -921, -362, -5042, 7186, 1726, -1211, -6591, -5201, 3858, -2078, 4851, 7168, 3034, -9080, -1961, 6548, 9509, 21816, -1016, -27528, -44288, -30172]
$$ [...]
##END NTUPLES=NMR SPECTRUM
##END=
