##TITLE=Analysis number 318322
Compound Code btb 10356
Book Reference 196/158
Project Code adrs
Chemist Name jimp
##JCAMPDX= 6.0         $$ Bruker NMR JCAMP-DX V2.0
##DATA TYPE= NMR SPECTRUM
##DATA CLASS= NTUPLES
##ORIGIN= Bruker BioSpin GmbH
##OWNER= nmr
$$ XWIN-NMR		Version 3.5
$$ Thu Mar 23 14:25:02 2006 GMT Standard Time (UT+0h)  MAYBRIDGE\nmr@NMR_250MHZ
##.OBSERVE FREQUENCY= 250.131544655141
##.OBSERVE NUCLEUS= ^1H
##.ACQUISITION MODE= SIMULTANEOUS (DQD)
##.ACQUISITION SCHEME= undefined
##.AVERAGES= 16
##.DIGITISER RES= 18
##SPECTROMETER/DATA SYSTEM= dpx250
##.PULSE SEQUENCE= zg30
##.SOLVENT NAME= CDCl3
##.SHIFT REFERENCE= (INTERNAL, CDCl3, 0, 16.522)
##AUDIT TRAIL= $$ (NUMBER, WHEN, WHO, WHERE, WHAT)
$$ ##TITLE= Audit trail, XWIN-NMR		Version 3.5
$$ ##JCAMPDX= 5.01
$$ ##ORIGIN= Bruker BioSpin GmbH
$$ ##OWNER= nmr
$$ C:\u/data/dgb/nmr/ADRS/1360/pdata/1/auditp.txt
$$ ##AUDIT TRAIL=  $$ (NUMBER, WHEN, WHO, WHERE, WHAT)
(   1,<2006-03-23 14:23:41.17 +000>,<MAYBRIDGE\nmr>,<NMR_250MHZ>,
      <created by zg, POWCHK disabled, PULCHK disabled
       configuration hash MD5:
       84 BC 41 DB A1 6E 1D 46 DA 25 12 A5 C1 ED C5 3A
       data hash MD5: 64K
       9E 6C 23 0B DC 43 B4 11 FE 1A CB 17 3C 01 2B 52>)
(   2,<2006-03-23 14:24:05.80 +000>,<MAYBRIDGE\nmr>,<NMR_250MHZ>,
      <Start of raw data processing
       ef LB = 0.3 FT_mod = 6 PKNL = 1 SI = 32K 
       data hash MD5: 32K
       36 A4 38 25 F4 AD F2 9E 0D FD B8 CC A3 E2 26 2E>)
(   3,<2006-03-23 14:24:15.56 +000>,<MAYBRIDGE\nmr>,<NMR_250MHZ>,
      <apk 
       data hash MD5: 32K
       BA 18 E3 09 29 B8 CF BD C2 5B BC E3 4E AB 8C 33>)
(   4,<2006-03-23 14:24:19.39 +000>,<MAYBRIDGE\nmr>,<NMR_250MHZ>,
      <abs ABSG = 5 
       data hash MD5: 32K
       51 A3 B3 2C E8 49 4B A3 AD 5D 29 B6 A4 97 0B B9>)
$$ ##END=
$$ 
$$ hash MD5
$$ 74 EB B1 DB 2A 62 98 D3 6B CC 38 0C 1E C5 A5 70
##$RELAX= 
##$RELAX= 
##$RELAX= 
##$RELAX= 
##$RELAX= 
##$RELAX= 
##$RELAX= 
$$ Bruker specific parameters
$$ --------------------------
##$DU= <C:\u>
##$EXPNO= 1360
##$NAME= <ADRS>
##$PROCNO= 1
##$TYPE= <nmr>
##$USER= <dgb>
##$AMP= (0..31)
100 100 100 100 100 100 100 100 100 100 100 100 100 100 100 100 100 100 
100 100 100 100 100 100 100 100 100 100 100 100 100 100 
##$AQSEQ= 0
##$AQ_mod= 3
##$AUNM= <au_zg>
##$AUTOPOS= <32 >
##$BF1= 250.13
##$BF2= 250.13
##$BF3= 250.13
##$BF4= 250.13
##$BF5= 500.13
##$BF6= 500.13
##$BF7= 500.13
##$BF8= 500.13
##$BYTORDA= 1
##$CFDGTYP= 0
##$CFRGTYP= 5
##$CHEMSTR= <none>
##$CNST= (0..31)
1 1 145 1 1 1 1 1 1 1 1 1 1 1 1 1 1 1 1 1 1 1 1 1 1 1 1 1 1 1 1 1 
##$CPDPRG= <>
##$CPDPRG1= <>
##$CPDPRG2= <>
##$CPDPRG3= <>
##$CPDPRG4= <mlev>
##$CPDPRG5= <mlev>
##$CPDPRG6= <mlev>
##$CPDPRG7= <mlev>
##$CPDPRG8= <mlev>
##$CPDPRGB= <>
##$CPDPRGT= <>
##$D= (0..31)
0 1 0 0 0 0 0 0 0 0.06 0 0 0 0 0 0 0.0002 0 0 0 0 0 0 0 0 0 0 0 0 0 0 
0 
##$DATE= 1143123817
##$DBL= (0..7)
120 120 120 120 120 120 120 120 
##$DBP= (0..7)
150 150 150 150 150 150 150 150 
##$DBP07= 0
##$DBPNAM0= <>
##$DBPNAM1= <>
$$ [...]
##$SUBNAM7= <"">
##$SUBNAM8= <"">
##$SUBNAM9= <"">
##$SW= 20.6930455092707
##$SWIBOX= (0..15)
0 0 3 0 0 0 0 0 0 0 0 0 0 0 0 0 
##$SW_h= 5175.983436853
##$TD= 65536
##$TD0= 1
##$TE= 293.16
##$TE2= 300
##$TE3= 300
##$TEG= 300
##$TL= (0..7)
0 120 120 120 120 120 120 120 
##$TP= (0..7)
150 150 150 150 150 150 150 150 
##$TP07= 0
##$TPNAME0= <>
##$TPNAME1= <>
##$TPNAME2= <>
##$TPNAME3= <>
##$TPNAME4= <>
##$TPNAME5= <>
##$TPNAME6= <>
##$TPNAME7= <>
##$TPOAL= (0..7)
0.5 0.5 0.5 0.5 0.5 0.5 0.5 0.5 
##$TPOFFS= (0..7)
0 0 0 0 0 0 0 0 
##$TUNHIN= 0
##$TUNHOUT= 0
##$TUNXOUT= 0
##$USERA1= <user>
##$USERA2= <user>
##$USERA3= <user>
##$USERA4= <user>
##$USERA5= <user>
##$V9= 5
##$VALIST= <valist>
##$VCLIST= <CCCCCCCCCCCCCCC>
##$VD= 0
##$VDLIST= <DDDDDDDDDDDDDDD>
##$VPLIST= <PPPPPPPPPPPPPPP>
##$VTLIST= <TTTTTTTTTTTTTTT>
##$WBST= 1024
##$WBSW= 4
##$XGAIN= (0..3)
0 0 0 0 
##$XL= 0
##$YL= 0
##$YMAX_a= 623024
##$YMIN_a= -597967
##$ZGOPTNS= <>
##$ZL1= 120
##$ZL2= 120
##$ZL3= 120
##$ZL4= 120
##$ABSF1= 16.522
##$ABSF2= -4.171173
##$ABSG= 5
##$ABSL= 3
##$ALPHA= 0
##$AQORDER= 0
##$ASSFAC= 0
##$ASSFACI= 0
##$ASSFACX= 0
##$ASSWID= 0
##$AUNMP= <proc_1d>
##$AZFE= 0.1
##$AZFW= 0.1
##$BCFW= 0
##$BC_mod= 0
##$BYTORDP= 0
##$COROFFS= 0
##$CY= 12.5
##$DATMOD= 1
##$DC= 0
##$DFILT= <>
##$DTYPP= 0
##$F1P= 14.0000005364418
##$F2P= -0.99999901652339
##$FCOR= 0.5
##$FTSIZE= 32768
##$FT_mod= 6
##$GAMMA= 0
##$GB= 0
##$INTBC= 1
##$INTSCL= 1
##$ISEN= 128
##$LB= 0.3
##$LEV0= 0
##$LPBIN= 0
##$MAXI= 10000
##$MC2= 0
##$MEAN= 0
##$ME_mod= 0
##$MI= 0
##$NCOEF= 0
##$NC_proc= -5
##$NLEV= 6
##$NOISF1= 0
##$NOISF2= 0
##$NSP= 0
##$NTH_PI= 0
##$NZP= 0
##$OFFSET= 16.522
##$PC= 1
##$PHC0= 180.8119
##$PHC1= -3.417319
##$PH_mod= 1
##$PKNL= yes
##$PPARMOD= 0
##$PSCAL= 4
##$PSIGN= 0
##$REVERSE= no
##$SF= 250.13
##$SI= 32768
##$SIGF1= 0
##$SIGF2= 0
##$SINO= 400
##$SIOLD= 32768
##$SREGLST= <1H.CDCl3>
##$SSB= 0
##$STSI= 32768
##$STSR= 0
##$SW_p= 5175.98343685301
##$SYMM= 0
##$S_DEV= 0
##$TDeff= 65536
##$TDoff= 0
##$TI= <Analysis number 999999
Compound Code 99
Book Reference 9
Project Code 9>
##$TILT= no
##$TM1= 0
##$TM2= 0
##$TOPLEV= 0
##$USERP1= <user>
##$USERP2= <user>
##$USERP3= <user>
##$USERP4= <user>
##$USERP5= <user>
##$WDW= 1
##$XDIM= 32768
##$YMAX_p= 307606357
##$YMIN_p= -403895
$$ End of Bruker specific parameters
$$ ---------------------------------
##NTUPLES= NMR SPECTRUM
##VAR_NAME=  FREQUENCY,     SPECTRUM/REAL,   SPECTRUM/IMAG
##SYMBOL=    X,             R,               I
##VAR_TYPE=  INDEPENDENT,   DEPENDENT,       DEPENDENT
##VAR_FORM=  AFFN,          ASDF,            ASDF
##VAR_DIM=   32768,         32768,           32768
##UNITS=     HZ,            ARBITRARY UNITS, ARBITRARY UNITS
##FACTOR=    0.157963299565203, 1,           1
##FIRST=     4132.6476996994, 0,             0
##LAST=      -1043.33573715361, 0,           0
##MIN=       -1043.33573715361, -403895,     0
##MAX=       4132.6476996994, 307606357,     0
$$ Real data points
##PAGE= N=1
##DATA TABLE= (X++(R..R)), XYDATA
$$ [...]
$$ plain form
15584 -21212 42541 -26543 -83559 -9594 5026 69137 12328 10609 44883 61001 45523 -32845
15572 -32845 -55344 -20456 4042 31549 -5333 -15402 -25028 128330 109247 52562 -18439 -11973
15560 -11973 67003 22051 -7370 86314 103017 72925 9940 -7935 3656 -54808 -3763 83000
15548 83000 46519 8235 -159733 -160631 -106603 -81237 -139082 -90280 -50973 -2747 71891 137851
15536 137851 118275 76471 16471 10435 9910 21666 -28369 -85873 -129549 -174036 -168487 -163093
15524 -163093 -172941 -126961 -100869 -31233 36133 64029 93708 157579 191942 82677 -29716
15513 -29716 -52579 -114930 7852 81 -31711 -115634 -110227 -46398 -13049 -8269 77724 169651
15501 169651 169231 158275 150786 147981 104737 83314 125556 134104 125252 107238 88644 76234 -10225
$$ packed form
15584b1212O3753o9084n7016P3965J4620O4111n6809j719L4274J6118j5478p8368
15572c2845k2499L4888K4498K7507l6882j0069r626J53358j9083n6685p1001O466
15560a1973P8976m4952k9421R3684J6703l0092o2985j7875J1591n8464N1045Q6763
15548H3000l6481l8284j67968q98N4028K5366n7845M8802L9307M8226P4638O5960
15536A37851j9576m1804o0000o036n25J1756n0035n7504m3676m4487N549N394
15524a63093r848M5980K6092O9636O7366K7896K9679O3871L4363j09265j12393
15513b9716k2863o2351J22782p771l1792q3923N407O3829L3349M780Q5993R1927
15501A69651m20j0956p489k805m3244k1423M2242Q548q852j8014j8594j2410q6459
$$ plain form
15488 -10225 36756 51933 64230 105783 136290 142722 82072 54559 -35248 -88273 -186087 -172468
15476 -172468 -206484 -202802 -115804 -31135 37060 -61433 -124570 -45039 121444 106784 72389
15465 72389 27067 8952 144825 191367 195978 202184 191543 143018 19218 -2700 -87696 -88328
15453 -88328 -69362 28176 -16044 -95977 -54910 -23882 -4699 23508 21713 -49182 11335 63799
15441 63799 51902 55469 4633 -51116 -57219 -135762 -86265 -64079 31562 110807 103041 -69991
15429 -69991 -143085 -104512 -96027 8509 107995 56603 49168 15420 -16383 -51136 -71174 -49882
15417 -49882 66351 89715 -8845 -11190 37474 132750 154823 20638 -128575 -124497 -84525
15406 -84525 -132828 -101216 -59243 -4232 -64967 -6294 6785 -17160 -33837 -33627 -24456 6845
$$ packed form
15488a0225M6981J5177J2297M1553L0507O432o0650k7513q9807n3025r7814J3619
15476a72468l4016L682Q6998Q4669O8195r8493o3137P9531J66483j4660l4395
15465G2389m5322j8115J35873M6542M611O206j0641m8525j23800k1918q4996o32
15453h8328J8966R7538m4220p9933M1067L1028J9183K8207j795p0895O0517N2464
15441F3799j1897L567n0836n5749o103p8543M9497K2186R5641P9245p766j73032
15429f9991p3094L8573Q485J04536R9486n1392p435l3748l1803l4753k0038K1292
15417d9882J16233K3364r8560k345M8664R5276K2073j34185j49213M078L9972
15406h4525m8303L1612M1973N5011o0735N8673J3079k3945j6677K10R171L1301
$$ plain form
15394 6845 -66356 -77683 -55857 -29331 -24500 -116636 -100206 79641 136941 118663 66483 34607
15382 34607 14269 16375 -28419 -49360 -121201 -153073 -126368 -189199 -202083 -73632 10633 87090
15370 87090 100251 -7329 -36314 -103875 -24078 9663 -29044 -511 33624 -731 55154
15359 55154 141969 95013 -10197 3590 107325 137170 40134 41886 86347 136416 85961
15348 85961 45881 78263 91267 91622 81014 7417 -53851 -40733 -8376 -30581 -155708 -162681
15336 -162681 -149097 -15397 112688 87992 8062 84857 135967 132496 122888 2384 -18128
15325 -18128 112906 229555 255459 160625 36132 84502 96299 52362 106043 71516 77642
15314 77642 84216 6028 66813 162121 234924 231218 201963 184602 154585 121144 65296 3708
$$ packed form
15394F845p3201j1327K1826K6526M831r2136J6430J79847N7300j8278n2180l1876
15382C4607k0338K106m4794k0941p1841l1872K6705o2831j2884J28451Q4265P6457
15370H7090J3161j07580k8985o7561P9797L3741l8707K8533L4135l4355N5885
15359E5154Q6815m6956j05210J3787J03735K9845r7036J752M4461N0069n0455
15348H5961m0080L2382J3004L55j0608p3597o1268J3118L2357k2205j25127o973
15336a62681J3584J33700J28085k4696p9930P6795N1110l471r608j20504k0512
15325a8128J31034J16649K5904r4834j24493M8370J1797m3937N3681l4527O126
15314G7642O574p8188O0785R5308P2803l706k9255j7361l0017l3441n5848o1588
$$ plain form
15302 3708 -16557 -174052 -57879 -3885 471 -27294 -98791 -102190 61420 89339 65571 -47318
15290 -47318 -53482 31905 146740 110431 -26661 -75575 -28805 -31235 -30982 71601 36284 15359
15278 15359 23510 43744 9462 -157930 -61986 50784 82485 44225 36114 41942 36945 76184
15266 76184 164969 19103 18426 16777 -50462 -59013 -104840 -60353 -2895 -92431 -239170 -149577
15254 -149577 -79395 -154316 -140193 -130157 -168049 -43685 49400 26299 -24408 -73011 -45866
15243 -45866 -47211 -10516 55033 10280 -47294 10715 16190 -1261 26659 78269 116450 92844
15231 92844 89444 19848 -55178 13030 77404 59982 -25618 -114594 -165400 -163093 -5457 -63492
15219 -63492 -141643 -120356 10152 7644 -77955 -102519 14418 95901 115629 70361 45536
$$ packed form
15302C708k0265j57495J16173N3994M356k7765p1497l399J63610K7919k3768j12889
15290d7318o164Q5387J14835l6309j37092m8914M6770k430K53J02583l5317k0925
15278A5359Q151K0234l4282j67392R5944J12770L1701l8260q111N828m997L9239
15266G6184Q8785j45866o77j649o7239q551m5827M4487N7458q9536j46739Q9593
15254a49577P0182p4921J4123J0036l7892J24364R3085k3101n0707m8603K7145
15243d5866j345L6695O5549m4753n7574N8009N475j7451K7920N1610L8181k3606
15231I2844l400o9596p5026O8208O4374j7422q5600q8976n0806K307J57636n8035
15219f3492p8151K1287J30508k508q5599k4564J16937Q1483J9728m5268k4825
$$ plain form
15208 45536 120359 44653 -97666 -107856 -116204 -34315 -2283 -61151 -111957 -123971 -163121 -82904
15196 -82904 29675 133727 26301 -61619 -100771 -105428 -2718 -46505 -31092 -30576 -64083
15185 -64083 10298 -7761 -29472 21604 23774 -18580 51617 -43359 -53558 -28924 116012 96025
15173 96025 22904 -60720 -9266 110146 168280 115862 73715 2491 -39257 -50788 -57185 -176137
15161 -176137 -140358 -117839 -107994 -106606 -160972 -99434 29796 -53419 -129806 -109934 -19567 19191
15149 19191 10900 -14456 25680 78971 65744 88617 26678 -2772 4175 -21769 -21748 18079 111156
15136 111156 4271 -13406 17961 45211 -9883 -110725 -37975 59929 99363 190270 136934
15125 136934 69816 22881 63893 61228 -58743 -87772 -103153 -47226 21815 47435 -43129
$$ packed form
15208D5536P4823p5706j42319j0190q348Q1889L2032n8868n0806j2014l9150Q0217
15196h2904J12579J04052j07426q7920l9152m657J02710m3787J5413N16l3507
15185f4083P4381j8059k1711N1076K170m2354P0197r4976j0199K4634J44936j9987
15173I6025p3121q3624N1454J19412N8134n2418m2147p1224m1748j1531o397j18952
15161a76137L5779K2519R845J388n4366O1538J29230q3215p6387J9872R0367L8758
15149A9191q291k5356M0136N3291j3227K2873o1939k9450O947k5944K1L9827R3077
15136A11156j06885j7677L1367K7250n5094j00842P2750R7904L9434R0907n3336
15125A36934o7118m6935M1012k665j19971k9029j5381N5927O9041K5620r0564
$$ plain form
15114 -43129 -99902 -67056 58575 69800 13696 22784 -14677 65569 140221 128128 93916 40666
15102 40666 -38598 -124565 -109257 -11835 32820 -15259 2866 6079 -59378 -71645 -62677 -213
15090 -213 56656 -40205 -92265 -81317 -28152 -2571 -5984 39495 -62489 16730 3635 -122385
15078 -122385 -64524 71889 84683 96404 102451 6131 -50433 -99006 -96945 -126663 -227774
15067 -227774 -266699 -179800 -115620 -143067 -94580 -44532 -81867 -50884 83619 71976 -436
15056 -436 78673 100543 103625 -41015 -148755 -120157 -64770 -4935 80715 96768 -4660 -96330
15044 -96330 -105922 -88784 29146 121250 53201 -62639 -33214 134762 175132 158399 178793
15033 178793 116476 81947 68169 36368 107410 242041 230862 230869 233394 205540 30008 36923
$$ packed form
15114d3129n6773L2846J25631J1225n6104R088l7461Q0246P4652j2093l4212n3250
15102D0666p9264q5967J5308R7422M4655m8079J8125L213o5457j2267Q968O2464
15090b13N6869r6861n2060J0948N3165K5581l413M5479j01984P9219j3095j26020
15078a22385N7861J36413J2794J1721O047r6320n6564m8573K061k9718j01111
15067b27774l8925Q6899O4180k7447M8487N0048l7335L0983J34503j1643p2412
15056d36P9109K1870L082j44640j07740K8598N5387N9835Q5650J6053j01428r1670
15044i6330r592J7138J17930R2104o8049j15840K9425J67976M0370j6733K0394
15033A78793o2317l4529j3778l1801P1042J34631j1179PK525k7854j75532O915
$$ plain form
15021 36923 52669 36768 78520 91016 7632 97290 175671 235679 277329 264100 189876 175892
15009 175892 150874 147891 205065 120392 115990 199792 268518 263668 266148 348220 542046 727359
14997 727359 1091875 1477226 2142201 3635672 6498245 8315611 7795782 5999368 3677698
14988 3677698 2290708 1601498 1193274 892438 707686 587423 525230 423648 348224 357678
14978 357678 367150 345293 269867 318585 396440 463688 418720 338178 185138 137163 140846 177514
14966 177514 247534 296411 254023 182274 120420 182474 98945 15454 -24138 -11540 21878
14955 21878 -17749 66247 141026 124376 73879 -74537 40383 115219 47947 4457 -19013
14944 -19013 -75978 -136305 -214471 -72330 -70068 -16963 68514 142469 160356 207541 171525 60947
$$ packed form
15021C6923J5746j5901M1752J2496q3384Q9658P8381O0008M1650j3229p4224j3984
15009A75892k5018k983N7174q4673m402Q3802O8726m850K480Q2072J93826J85313
14997G27359L64516L85351O64975J493471K862573J817366n19829j796414k321670
14988C677698j386990o89210m08224l00836j84752j20263o2193j01582p5424R454
14978C57678R472k1857p5426M8718P7855O7248m4968q0542j53040m7975L683L6668
14966A77514P0020M8877m2388p1749o1854O2054q3529q3491l9592J2598L3418
14955B1878l9627Q3996P4779j6650n0497j48416J14920P4836o7272m3490k3470
14944a9013n6965o0327p8166J42141K262N3105Q5477P3955J7887M7185l6016j10578
$$ plain form
14932 60947 -9497 28371 -17249 -38343 -26377 43359 4010 -26846 -65893 -91621 -31126 32154
14920 32154 10772 -43481 -46403 -59468 -20006 -16136 -69343 -132492 -161493 -175112 -95031 -128122
14908 -128122 -166343 -195792 -101780 35934 -34317 -79099 -7247 -45347 -97423 -162495 -231368
14897 -231368 -173963 -125412 -97644 -63938 -91728 -108560 -56200 -76043 -91684 -46243 -51939 -72851
14885 -72851 -11588 -18767 -42656 17719 37982 31695 -456 19354 -38526 -80864 -39021 -45644
14873 -45644 11072 54423 38668 657 64159 -23901 -134658 -217325 -165324 -96946 42465
14862 42465 127968 175121 172719 126716 127754 49510 -64190 -73730 18111 75446 44613 -24962
14850 -24962 38272 52110 -33802 -37273 43588 93687 148406 53872 13094 -1233 -50961 -66833
$$ packed form
14932F0947p0444L7868m5620k1094J1966O9736l9349l0856l9047k5728O0495O3280
14920C2154k1382n4253k922j3065L9462L870n3207o3149k9001j3619Q0081l3091
14908a28122l8221k9449R4012J37714p0251m4782P1852l8100n2076o5072o8873
14897b31368N7405M8551K7768L3706k7790j6832N2360j9843j5641M5441n696k0912
14885g2851O1263p179k3889O0375K0263o287l2151J9810n7880m2338M1843o623
14873d5644N6716M3351j5755l8011O3502q8060j10757q2667N2001O8378J39411
14862D2465Q5503M7153k402m6003J038p8244j13700r540R1841N7335l0833o9575
14850b4962O3234J3838q5912l471Q0861N0099N4719r4534m0778j4327m9728j5872
$$ plain form
14838 -66833 -120735 -155611 -148148 -130306 -2671 45698 -24889 68962 69202 -2515 -60404 -31694
14826 -31694 -540 40107 42447 52768 68268 108630 73435 42968 36727 -28849 -57609 639
14814 639 5689 62428 -1550 5933 69323 9429 2676 -4946 17345 -28875 -384 38629 23959
14801 23959 -51559 -1062 14364 2267 -21254 -124473 -157165 -138746 -113619 -175815 -202232
14790 -202232 -177912 -67501 -14655 -81028 -77823 -87679 -84176 -146704 -103461 -127627 -161795 -116977
14778 -116977 -76629 -75759 -96414 -31634 -15546 -38847 -88740 -83471 -77203 -59329 -111689 -121031
14766 -121031 -110254 -90852 -24335 121107 190126 176714 213942 108640 4318 -4641 82853
14755 82853 93045 -44332 -172330 -128698 -89932 -31510 10975 -17460 -74887 -80326 -74712 -21135
$$ packed form
14838f6833n3902l4876P463J7842J27635M8369p0587R3851K40p1717n7889K8710
14826c1694L1154M0647K340J0321J5500M0362l5195l0467o241o5576k8760N8248
14814F39N050N6739o3978P483O3390n9894o753p622K2291m6220K8491L9013j4670
14801B3959p5518N0497J5426j2097k3521j03219l2692J8419K5127o2196k6417
14790b02232K4320J10411N2846o6373L205r856L503o2528M3243k4166l4168M4818
14778a16977M0348Q70k0655O4780J6088k3301m9893N269O268J7874n2360r342
14766a21031J0777J9402O6517J45442O9019j3412L7228j05302j04322q959Q7494
14755H2853J0192j37377j27998M3632L8766N8422M2485k8435n7427n439N614N3577
$$ plain form
14743 -21135 -24298 33424 65422 55899 63660 -4315 -63014 -22995 12308 -16562 -79582 -83005
14731 -83005 -73737 -80928 -56377 -132829 -150917 -14406 114485 95357 24261 36372 -32890 113605
14719 113605 203089 152375 86912 -24592 -139427 -114712 -96576 -43734 -3097 44269 66878
14708 66878 58765 30255 32685 55754 54261 30302 98770 56505 -10915 9168 -16144 -61716
14696 -61716 -81957 -159912 -130501 -140219 -142215 -194576 -200137 -91336 -27570 -26611 13114 -72311
14684 -72311 -43589 -125639 -60148 -4764 5575 43604 58813 503 -7123 -6543 51521 91819
14672 91819 29572 -7993 44262 81334 106354 71410 84799 33516 -31000 -68768 -54528 35664
14660 35664 -61536 -166939 -134659 48425 14369 -68791 -28540 20584 81534 85255 39426
$$ packed form
14743b1135l163N7722L1998r523P761o7975n8699M0019L5303k8870o3020l423
14731h3005R268p191K4551p6452j8088J36511J28891j9128p1096J2111o9262J46495
14719A13605Q9484n0714o5463j11504j14835K4715J8136N2842M0637M7366K2609
14708F6878q113k8510K430K3069j493k3959O8468m2265o7420K0083k5312m5572
14696f1716k0241p7955K9411r718j996n2361n561J08801O3766R59L9725q5425
14684g2311K8722q2050O5491N5384J0339L8029J5209n8310p626N80N8064M0298
14672I1819o2247l7565N2255L7072K5020l4944J3389n1283o4516l7768J4240R0192
14660C5664r7200j05403L2280J83084l4056q3160M0251M9124O0950L721m5829
$$ plain form
14649 39426 41082 45015 70670 -2162 -31963 -79292 -47405 -36413 -50670 -28328 -85543 -26699
14637 -26699 30590 12014 -17907 -79312 -89958 -35396 -52574 -85408 -189268 -235286 -229811 -112168
14625 -112168 -40086 -68020 7722 55193 67398 33411 -96355 -139773 -174615 -181024 -233136
14614 -233136 -285330 -220922 -3731 201518 181510 176350 99797 44684 19834 3192 -45285
14603 -45285 -98943 -114831 -144684 -142795 -137102 -49328 28677 90933 67893 106888 137869 143821
14591 143821 71642 44255 95795 174155 230989 251921 229159 88225 66728 119872 185637
14580 185637 148596 150526 175319 214201 125896 53509 102483 124446 160619 167866 115114 107063
14568 107063 141435 117616 145057 172296 182817 93406 45489 46904 104447 114620 110253 -3582
$$ packed form
14649C9426J656L933K5655p2832k9801m7329L1887J0992j4257K2342n7215N8844
14637b6699N7289j8576k9921o1405j0646N4562j7178l2834j03860m6018N475J17643
14625a12168P2082k7934P5742M7471J2205l3987j29766m3418l4842o409n2112
14614b33136n2194O4408K17191K05249k0008n160p6553n5113k4850j6642m8477
14603d5285n3658j5888k9853J889N693Q7774P8005O2256k3040L8995L0981N952
14591A43821p2179k7387N1540P8360N6834K0932k2762j40934k1497N3144O5765
14580A85637l7041J930K4793L8882q8305p2387M8974K1963L6173P247n2752q051
14568A07063L4372k3819K7441K7239J0521q9411m7917J415N7543J0173m367j13835
$$ plain form
14556 -3582 -64848 -9034 17389 29441 38364 59746 36676 55210 102712 91903 69293 125329
14544 125329 218710 272042 220126 107458 3982 -26780 21331 10233 14898 -28946 -82507
14533 -82507 -40368 -87741 -139300 -137929 -117902 -123203 -39218 -52745 -100910 -80116 -3206 -51497
14521 -51497 -92915 -75337 -28030 19292 82417 48757 51031 95418 1154 -65492 -61265 -126970
14509 -126970 -121207 -79994 -19182 -995 -9473 24269 24609 102236 37086 -85781 -122901 -84665
14497 -84665 -17294 97204 66535 133064 177645 137247 77783 47533 -11670 -5292 60934 17023
14485 17023 -81560 -181161 -196468 -145562 -127490 -164415 -103997 -20477 87242 41777 -56769
14474 -56769 -40303 -34006 -69866 -55764 15038 99238 7757 -87180 -2051 24422 -157523 -236290
$$ packed form
14556c582o1266N5814K6423J2052Q923K1382k3070J8534M7502j0809k2610N6036
14544A25329R3381N3332n1916j12668j03476l0762M8111j1098M665m3844n3561
14533h2507M2139m7373n1559J371K0027n301Q3985j3527m8165K0794P6910m8291
14521e1497m1418J7578M7307M7322O3125l3660K274M4387r4264o6646M227o5705
14509a26970N763M1213O0812J8187q478L3742L40P7627o5150j22867l7120L8236
14497h4665O7371J14498l0669O6529M4581m0398n9464l0250n9203O378O6226m3911
14485A7023r8583r9601j5307N0906J8072l6925O0418Q3520J07719m5465r8546
14474e6769J6466O297l5860J4102P0802Q4200r1481r4937Q5129K6473j81945p8767
$$ plain form
14462 -236290 -154400 -174570 -166596 -155933 -176793 -188478 -57163 -30055 -27461 9872 84230 11957
14450 11957 -28972 25494 78168 38573 -19852 -19690 141 60788 17974 19043 48044 67048
14438 67048 92543 72690 13477 47673 29167 -8862 -83928 -31075 72912 155011 141357
14427 141357 46538 9166 8193 -34851 -18437 -32719 -69323 -46293 27768 26606 32551 76110
14415 76110 110377 115263 52315 -62436 -89043 -48417 -23427 -78203 -6301 52291 26423 -60280
14403 -60280 -143211 -97920 -37493 -36775 -66042 -16530 -29388 46309 43798 45859 1993 -100066
14391 -100066 -74907 -13713 -59620 -163013 -105290 -24726 -28964 -138687 -126786 2253 -7860
14380 -7860 7967 119136 176226 60720 53739 69112 99898 22421 -95077 -16655 27896
$$ packed form
14462b36290Q1890k0170P974J0663k0860j1685J31315K7108K594L7333P4358p2273
14450A1957m0929N4466N2674l9595n8425J62J9831O0647m2814J069K9001J9004
14438F7048K5495j9853n9213L4196j8506l8029p5066N2853J03987Q2099j3654
14427A41357r4819l7372r73m3044J6414j4282l6604K3030P4061j162N945M3559
14415G6110L4267M886o2948j14751k6607M0626K4990n4776P1902N8592k5868q6703
14403f0280q2931M5291O0427P18k9267M9512j2858P5697k511K061m3866j02059
14391a00066K5159O1194m5907j03393N7723Q0564m238j09723J1901J29039j0113
14380g860J5827J11169N7090j15506o981J5373L0786p7477j17498P8422M4551
$$ plain form
14369 27896 39168 8198 -63100 -44828 -60881 -58176 -152062 -200830 -119361 -120923 -62580 67562
14357 67562 74491 51744 21770 52854 -34719 -70462 -27616 92791 65527 91459 -255 -27521
14345 -27521 -60876 -111405 -141181 -84974 67200 189734 153086 31946 -5600 -26952 12003
14334 12003 6179 19452 101625 44275 -4439 52079 84531 71110 39303 40983 -50426 -43108
14322 -43108 -18891 62515 61254 -34564 -60486 -143887 -217458 -135219 -86912 -69888 -7962 -18184
14310 -18184 -71285 -42808 -30795 42951 51859 -48510 -42994 -93970 -129352 -179193 -128778 -99571
14298 -99571 -87044 -84081 -35003 35937 506 -132699 -207447 -208505 -208668 -96223 -87404 23222
14286 23222 33159 -38799 -47526 -57697 -79386 -183638 -155626 -107787 -123685 -123924 -90878 -88982
$$ packed form
14369B7896J1272l0970p1298J8272j6053K705r3886m8768Q1469j562N8343J30142
14357F7562O929k2747k9974L1084q7573l5743M2846J20407k7264K5932r1714k7266
14345b7521l3355n0529k9776N6207J52174J22534l6648j21140l7546k1352L8955
14334A2003n824J3273Q2173n7350m8714N6518L2452j3421l1807J680r1409P318
14322d3108K4217Q1406j261r5818k5922q3401p3571Q2239M8307J7024O1926j0222
14310a8184n3101K8477J2013P3746Q908j00369N516n0976l5382m9841N0415K9207
14298i9571J2527K963M9078P0940l5431j33205p4748j058j63J12445Q819J10626
14286B3222R937p1958q727j0171k1689j04252K8012M7839j5898k39L3046J896
$$ plain form
14274 -88982 -50555 28676 60363 57754 108720 33267 118830 110952 -12747 -56277 -30322 -10088
14262 -10088 -31030 -61086 -17309 8335 18774 40649 89628 96040 95341 32577 36154 73757
14250 73757 156490 91042 93539 94346 1364 -70409 -143076 -108402 -60232 -116203 -110549 -138327
14238 -138327 -119282 -42467 8178 33620 4336 10512 -7966 -17456 -137105 -127217 -68601 -90487
14226 -90487 -103835 -150120 -141946 -123509 -110290 -150420 -135965 -53236 -46350 3158 15047 45075
14214 45075 53127 49210 73295 64680 43966 -71557 -87730 -66578 -19382 -26332 -55755 -58767
14202 -58767 -136879 -129332 -85872 14064 -38786 -6915 135356 107090 32747 -2351 -14060 -25330
14190 -25330 79875 58122 22716 13159 -48609 -82152 -94503 -31609 -32475 -35027 2488 -47274
$$ packed form
14274h8982L8427P9231L1687k609N0966p5453Q5563p878j23699m3530K5955K0234
14262a0088k0942l0056M3777K5644J0439K1875M8979O412o99o2764L577L7603
14250G3757Q2733o5448K497Q07r2982p1773p2667L4674M8170n5971N654k7778
14238a38327J9045P6815N0645K5442k9284O176j8478r490j19649R888N8616k1886
14226i0487j3348m6285Q174J8437J3219m0130J4455Q2729O886M9508J1889L0028
14214D5075Q052l917K4085q615k0714j15523j6173K1152M7196o950k9423l012
14202e8767p8112P547M3460R9936n2850L1871J42271k8266p4343l5098j1709j1270
14190b5330J05205k1753l5406r557o1768l3543j2351O2894q66k552L7515m9762
$$ plain form
14178 -47274 -88877 -61936 7050 79480 86461 -15027 -84107 -39778 -36437 11823 80554 71494
14166 71494 39094 126357 92650 79029 -6097 1645 -67065 -152191 -175063 -166210 -189675 -61992
14154 -61992 24492 -18799 12686 43986 -29318 -80462 -131514 3958 -32544 -97857 -106251 -151056
14142 -151056 -115851 -130698 -38377 82658 200766 177275 67469 -71539 -103827 -58084 -53763
14131 -53763 -10421 19398 -21290 -22057 -131586 -109694 -143803 -54015 -18161 8850 32336 51466
14119 51466 42528 140037 131072 -19861 -108728 -97716 -117709 -117082 -38739 -82129 -152544 -261678
14107 -261678 -179584 -149585 -6887 55922 -29110 -73329 -38928 -54063 13481 48834 56398
14096 56398 19874 -148042 -167878 -63885 -61602 -32016 -13235 -53394 -159490 -117008 67649
$$ packed form
14178d7274m1603K6941O8986P2430O981j01488o9080M4329L341M8260O8731r060
14166G1494l2400Q7263l3707j3621q5126P742o8710q5126k2872Q853k3465J27683
14154f1992Q6484m3291L1485L1300p3304n1144n1052J35472l6502o5313q394m4805
14142a51056L5205j4847R2321J21035J18108k3491j09806j39008l2288M5743M321
14131e3763M3342K9819m0688p67j09529K1892l4109Q9788L5854K7011K3486J9130
14119E1466q938R7509q965j50933q8867J1012j9993O27P8343m3390p0415j09134
14107b61678Q2094K9999J42698O2809q5032m4219L4401j5135O7544L5353P564
14096E6398l6524j67916j9836J03993K283K9586J8781m0159j06096M2482J84657
$$ plain form
14085 67649 39593 -22426 -105910 -110312 -37097 27339 55356 22896 3928 36091 68874 -27660
14073 -27660 -5959 59505 24298 -120655 -74429 -77845 -125750 -133200 -93821 -51001 -87278 -87224
14061 -87224 -75568 -111043 -119672 -77483 -180847 -153966 -54155 31919 95963 66050 69127 37111
14049 37111 3533 14765 44102 -35789 -87024 -91391 -2734 117762 222910 162107 18305
14038 18305 -27609 93228 59434 25419 130129 18009 -61828 -72812 -21440 -53706 -90843
14027 -90843 -70159 -85256 11837 39155 17970 24329 95788 119536 133244 184336 212629 230355
14015 230355 187266 143513 80391 81754 33238 -92190 -178356 -284221 -300305 -143977 -129470
14004 -129470 -167579 -158045 -203345 -210074 -142223 -94387 37428 40382 -5322 75397 62469 -42451
$$ packed form
14085F7649k8056o2019q3484m402P3215O4436K8017l2460j8968L2163L2783r6534
14073b7660K1701O5464l5207j44953M6226l416m7905p450L9379M2820l6277N4
14061h7224J1656l5475q629M2189j03364K6881R9811Q6074O4044k9913L077l2016
14049C7111l3578J1232K9337p9891n1235m367Q8657J20496J05148o0803j43802
14038A8305m5914J20837l3794l4015J04710j12120p9837j0984N1372l2266l7137
14027i0843K0684j5097R7093K7318k1185O359P1459K3748J3708N1092K8293J7726
14015B30355m3089m3753o3122J363m8516j25428q6166j05865j6084J56328J4507
14004a29470l8109R534m5300o729O7851M7836J31815K954m5704Q0719j2928j04920
$$ plain form
13992 -42451 -9506 36566 105705 126895 83434 58259 63129 39959 147778 79185 41379 59134
13980 59134 13112 30451 -41253 -217811 -205943 -112299 -89303 -59333 14601 37284 39024 101777
13968 101777 29440 48479 114405 132571 95654 -22150 -46497 -79528 -87926 -103995 -79929
13957 -79929 -5247 24138 50346 67605 9806 -25634 48719 69631 37190 56176 83207 120058
13945 120058 82124 78968 68225 18968 53719 121031 54686 -4287 -18405 82566 73092 36554
13933 36554 -18 -21639 37965 24172 -43444 -79462 -37997 -9113 -63120 -16902 -10266 24446
13921 24446 -56366 -104396 -96414 -71684 -31716 -51999 -41105 -25118 3928 56147 80608 41994
13909 41994 4826 -72655 -32427 56279 32287 23033 -31862 -55588 -58542 -61987 -13601 55401
$$ packed form
13992d2451L2945M6072O9139K1190m3461k5175M870k3170J07819o8593l7806J7755
13980E9134m6022J7339p1704j76558J1868R3644K2996K9970P3934K2683J740O2753
13968A01777p2337J9039O5926J8166l6917j17804k4347l3031q398j6069K4066
13957g9929P4682K9385K6208J7259n7799l5440P4353K0912l2441J8986K7031L6851
13945A20058l7934l156j0743m9257L4751O7312o6345n8973j4118J00971r474l6538
13933C6554l6572k1621N9604j3793o7616l6018M1465K8884n4007M6218O636L4712
13921B4446q0812m8030P982K4730L9968k0283J0894J5987K9046N2219K4461l8614
13909D1994l7168p7481M0228Q8706k3992r254n4895k3726k954l445M8386O9002
$$ plain form
13897 55401 139132 72253 11403 72843 44245 -89174 -175936 -75770 -48960 -69213 -42288
13886 -42288 -58730 -65811 -75265 -34417 -88719 -81818 -13162 -102893 -214708 -263871 -236267 -212324
13874 -212324 -187334 -56224 -39676 -114179 -93866 -43925 -7488 11233 -16506 -89764 -84550
13863 -84550 -52705 -63449 -42207 -10064 -18790 45276 -25255 -127076 -247717 -187458 -23656
13852 -23656 181320 173830 99642 6676 -10565 -66360 -41311 24062 36153 -48049 -99609 -138441
13840 -138441 -96376 -78424 -90456 -43181 -88294 -107296 -125853 -57691 -61088 8966 -21932 35061
13828 35061 89361 74557 62697 -38027 -66168 -123160 -177735 -172966 -23007 -15282 -118660
13817 -118660 -84894 -56712 -14195 -39569 -13220 109609 152838 183344 120795 43002 -36038
$$ packed form
13897E5401Q3731o6879o0850O1440k8598j33419q6762J00166K6810k0253K6925
13886d2288j6442p081r454M0848n4302O901O8656q9731j11815m9163K7604K3943
13874b12324K4990J31110J6548p4503K0313M9941L6437J8721k7739p3258N214
13863h4550L1845j0744K1242L2143q726O4066p0531j01821j20641O0259J63802
13852b3656K04976p490p4188r2966j7241n5795K5049O5373J2091q4202n1560l8832
13840a38441M2065J7952j2032M7275m5113j9002j8557O8162l397P0054l0898N6993
13828C5061N4300j4804j1860j00724k8141n6992n4575M769J49959P725j03378
13817a18660L3766K8182M2517k5374K6349J22829M3229L0506o2549p7793p9040
$$ plain form
13806 -36038 -43266 -13086 48072 42042 -1562 -155162 -275974 -232844 -146873 52559 43108 45611
13794 45611 57899 3553 102601 211704 32896 -8643 53603 64367 91140 91579 98034 139246
13782 139246 94535 21547 -23304 -66075 -26102 -40023 -215901 -182330 -109611 47969 -31512
13771 -31512 -18702 -108013 -61064 -52758 -133431 -70001 65152 29561 642 -30988 -29830 -32984
13759 -32984 112 27936 15804 61 39901 60903 52604 -4529 -91757 -109014 -14387 -86286
13747 -86286 -140115 12116 139789 139690 168764 113954 207168 152362 27761 63648 124595 53637
13735 53637 39667 -3436 22152 -12566 79239 128069 170383 210154 224988 212307 160881 138573
13723 138573 111716 37897 -54332 -55166 -64399 -138535 -210533 -260757 -255531 -248166 -207393 -169469
$$ packed form
13806c6038p228L0180O1158o030m3604j53600j20812M3130Q5971J99432r451K503
13794D5611J2288n4346R9048J09103j78808m1539O2246J0764K6773M39O455M1212
13782A39246m4711p2988m4851m2771L9973j3921j75878L3571P2719J57580p9481
13771c1512J2810q9311M6949Q306q0673O3430J35153l5591k8919l1630J158l154
13759c2984L3096K7824j2132j5743L9840K1002q299n7133q7228j7257R4627p1899
13747h6286n3829J52231J27673r9K9074n4810R3214n4806j24601L5887O0947p0958
13735E3637j3970m3103K5588l4718R1805M8830M2314L9771J4834j2681n1426k2308
13723A38573k6857p3819r2229q34r233p4136p1998n0224N226P365M0773L7924
$$ plain form
13711 -169469 -175530 -280538 -236302 -111378 -75362 -74469 -78218 -75027 -52800 -52862 -75 -110211
13699 -110211 -164894 -63623 89757 126720 182178 101641 52560 49404 16586 15654 43399 -27236
13687 -27236 -65424 -55982 -26929 -34117 -26771 -120233 -153820 -53386 -47245 -4637 -1711 -1992 74543
13674 74543 110579 86669 -11262 -36518 -44184 -113621 -106020 -71974 -6579 -105417 -149900 -187204
13662 -187204 -41516 4114 21134 -11751 2009 145292 51471 42083 55400 42541 27214
13651 27214 86758 86922 61895 80457 18473 111234 267002 266879 170772 103103 127466 68409
13639 68409 55756 6386 -101680 -209890 -158799 -43249 20782 -32704 -119406 -120624 -74708
13628 -74708 30592 43987 26771 43399 146931 103769 61466 59249 -58666 -164358 -66204
$$ packed form
13711a69469o061j05008M4236J24924L6016Q93l749L191K2227o2N2787j10136
13699a10211n4683J01271J53380L6963N5458q0537m9081l156l2818r32K7745p0635
13687b7236l8188R442K9053p188P346r3462l3587J00434O141M2608K926k81P6535
13674G4543L6036k3910r7931k5256p666o9437P601L4046O5395r8838m4483l7304
13662a87204J45688M5630J7020l2885J3760J43283r3821r388J3317j2859j5327
13651B7214N9544J64k5027J8562o1984R2761J55768j23r6107o7669K4363n9057
13639F8409j2653m9370j08066j08210N1091J15550O4031n3486q6702j218M5916
13628g4708J05300J3395j7216J6628J03532m3162m2303k217j17915j05692R8154
$$ plain form
13617 -66204 -56494 6776 15131 -3801 -9554 -75974 -138787 -183528 -199587 -147135 -108270 -165692
13605 -165692 -212821 -170976 -83624 26585 -27812 -51866 20360 12420 -53030 -28084 19787
13594 19787 -24982 -66093 -39859 -81675 -24012 6122 50691 82349 55355 -95605 -211423
13583 -211423 -148871 -48627 -785 55916 43785 38095 -5458 53506 42524 -37843 -16565
13572 -16565 104246 77166 75759 133029 187621 116873 30371 -31662 -39710 -43164 -16035 -12642
13560 -12642 16617 18757 -69970 -114162 -40440 28984 -74588 -126823 -137887 -165850 -148572 -4669
13548 -4669 -58131 -83635 59572 160397 120653 55276 61610 21924 -62353 -31094 -132483
13537 -132483 -203903 -224840 -197735 -145810 -131845 -90021 -109077 -53591 -54136 -54923 6855 22293
$$ packed form
13617f6204R710O3270Q355j8932n753o6420o2813m4741j6059N2452L8865n7422
13605a65692m7129M1845Q7352J10209n4397k4054P2226p940o5450K4946M7871
13594A9787m4769m1111K6234m1816N7663L0134M4569L1658k6994j50960j15818
13583b11423O2552J00244M7842N6701j2131n690m3553N8964j0982q0367K1278
13572a6565J20811k7080j407N7270N4592p0748q6502o2033q048l454K7129L393
13560a2642K9259K140q8727m4192P3722O9424j03572n2235j1064k7963J7278J43903
13548d669n3462k5504J43207J00825l9744o5377O334l9686q4277L1259j01389
13537a32483p1420k0937K7105N1925J3965M1824j9056N5486n45p87O1778J5438
$$ plain form
13525 22293 7752 -53288 -144096 -124685 19603 2277 18976 -25395 1524 86443 25932
13514 25932 3951 -61340 49448 130732 91871 -5653 10996 -6839 -35040 -51017 -87339
13503 -87339 -167433 -194212 -103328 -110563 -188274 -211766 -129630 -68258 -61700 -5548 -20764 -83584
13491 -83584 -123099 -150440 -108939 -83903 -25883 -12647 2578 42713 50194 23492 -24814 -68929
13479 -68929 -41681 2358 -23220 18154 31796 -28534 -26256 -4989 -26849 11715 9079 100781
13467 100781 -1942 -159648 -27960 60738 76148 100246 123355 45858 -39150 -73410 -78816
13456 -78816 -100674 -73754 22120 89895 71507 -8565 43639 103656 61930 2986 6380 13579
13444 13579 58007 85912 53083 29061 -21649 -98596 -66626 -121706 -92145 -88910 -60849 19354
$$ packed form
13525B2293j4541o1040r0808J9411J44288j7326J6699m4371K6919Q4919o0511
13514B5932k1981o5291J10788Q1284l8861r7524J6649j7835k8201j5977l6322
13503h7339q0094k6779R0884p235p7711k3492Q2136O1372O558N6152j5216o2820
13491h3584l9515k7341M1501K5036N8020J3236J5225M0135P481k6702m8306m4115
13479f8929K7248M4039k5578M1374J3642o0330K278K1267k1860L8564k636R1702
13467A00781j02723j57706J31688Q8698J5410K4098K3109p7497q5008l4260n406
13456g8816k1858K6920R5874O7775j8388q0072N2204O0017m1726n8944L394P199
13444A3579M4428K7905l2829k4022n0710p6947L1970n5080K9561L235K8061Q0203
$$ plain form
13432 19354 -46122 -60412 31298 55592 -33024 -45042 -16841 10155 36001 23276 -5663 13985
13420 13985 68286 109717 119653 111256 172994 134262 138906 22581 -122585 -43481 26148 81169
13408 81169 66909 91672 92042 60292 52297 67645 91109 101643 27529 -139602 -194791 -170983
13396 -170983 -65634 -69662 -168600 -129553 -8702 11194 -34623 -33954 -141291 -142130 -92294 -41549
13384 -41549 50739 69052 90135 80291 99348 119406 182905 62496 -64810 10675 -5213
13373 -5213 -83364 -154120 -100223 28997 121672 152792 165745 199122 239197 220456 153855 21783
13361 21783 45354 -52323 -59170 -29647 -31931 -89401 -30377 -1439 10676 72256 44363 -21141
13349 -21141 -62732 -70653 -86581 -20040 -28336 -93800 -142411 -155486 -122609 -63319 -131218 -111076
$$ packed form
13432A9354o5476j4290R1710K4294q8616j2018K8201K6996K5846j2725k8939J9648
13420A3985N4301M1431R936q397O1738l8732M644j16325j45166P9104O9629N5021
13408H1169j4260K4763L70l1750p995J5348K3464J0534p4114j67131n5189K3808
13396a70983J05349m028r8938L9047J20851J9896m5817O69j07337q39M9836N0745
13384d1549R2288J8313K1083r844J9057K0058O3499j20409j27306P5485j5888
13373e213p8151p0756N3897J29220R2675L1120J2953L3377M0075j8741o6601j32072
13361B1783K3571r7677o847K9523k284n7470N9024K8938J2115O1580k7893o5504
13349b1141m1591p921j5928O6541q296o5464m8611j3075L2877N9290o7899K0142
$$ plain form
13337 -111076 -144336 -163796 -165788 -170959 -103457 -48896 -83207 -78464 -53297 22512 87923 -9369
13325 -9369 -103715 -60877 59150 -6492 -67610 -24712 54955 31846 11383 -68863 -103679 -86707
13313 -86707 -43695 -69232 -129481 -115334 -64062 -130221 -143689 -115651 -76958 14187 31973 58083
13301 58083 22165 50041 81227 55064 -43620 -73294 -45025 107892 169360 120508 2738
13290 2738 11419 82959 25414 -89991 -21557 40472 64267 57554 89536 118435 122515 68516
13278 68516 42455 93185 146250 157935 113427 182064 114237 60139 156763 133604 22661
13267 22661 -22085 -55806 26187 128560 -4017 -89058 -147589 -112830 -119298 -72310 -21076
13256 -21076 16125 78073 103325 77694 95420 97696 151715 203469 178106 107353 23773 160
$$ packed form
13337a11076l3260j9460j992n171O7502N4561l4311M743K5167P5809O5411r7292
13325i369r4346M2838J20027o5642o1118M2898P9667k3109k0463q0246l4816J6972
13313h6707M3012k5537o0249J4147N1272o6159j3468K8038L8693R1145J7786K6110
13301E8083l5918K7876L1186k6163r8684k9674K8269J52917O1468m8852j17770
13290B738Q681P1540n7545j15405O8434O2029K3795o713L1982K8899M080n3999
13278F8516k6061N0730N3065J1685m4508O8637o7827n4098R6624k3159j10943
13267B2661m4746l3721Q1993J02373j32577q5041n8531L4759o468M6988N1234
13256b1076L7201O1948K5252k5631J7726K276N4019N1754k5363p0753q3580k3613
$$ plain form
13244 160 39932 114865 162031 117842 18126 -18556 21964 70366 99282 -16506 59318 185403
13232 185403 207109 244274 296999 289833 175246 7758 -3845 64437 77312 110234 154933
13221 154933 169775 177816 155131 153862 124840 44519 -26446 -104245 -101209 -77251 54235 160167
13209 160167 95563 15833 75808 -1007 -12732 3798 -111276 -111906 -45446 3861 16599 4929
13197 4929 -60185 -119165 -145898 -59183 -45896 -144465 -124069 -51010 19900 67695 122974 168695
13185 168695 187694 217739 214873 88187 18440 71502 137157 178249 131643 52872 49035 118564
13173 118564 143451 88298 42782 45513 90163 74675 109254 98075 61231 -74751 -144985
13162 -144985 -33458 6447 16048 43174 27474 -75085 -51851 23370 64053 40403 -23954
$$ packed form
13244A60L9772P4933M7166m4189r9716l6682M0520M8402K8916j15788P5824J26085
13232A85403K1706L7165N2725p166j14587j67488j1603O8282J2875L2922M4699
13221A54933J4842Q041k2685j269k9022q0321p0965p7799L036K3958J31486J05932
13209A60167o4604p9730N9975p6815j1725J6530j15074o30O6460M9307J2738j1670
13197D929o5114n8980k6733Q6715J3287r8569K0396P3059P0910M7795N5279M5721
13185A68695J8999L0045k866j26686o9747N3062O5655M1092m6606p8771l837O9529
13173A18564K4887n5153m5516K731M4650j5488L4579j1179l6844j35982p0234
13162a44985J11527L9905R601K7126j5700j02559K3234P5221M0683k3650o4357
$$ plain form
13151 -23954 -59938 -71322 -125654 -7581 70881 127794 237442 329634 256756 300882 577150
13140 577150 797158 805781 643228 551137 493539 426684 309364 280288 241577 206050 74972
13129 74972 -68886 -104916 -114878 -35100 -15233 3174 -48890 -127191 -108267 -112387 -191577 -131130
13117 -131130 -64428 -56974 -163517 -127221 -28676 -63041 -141945 -108935 -68599 -61173 29232 177047
13105 177047 189056 176104 221788 245854 254592 204583 178958 214692 343499 589491 772150
13094 772150 807116 700378 579566 494336 270461 222148 228415 192392 155773 93124 61591
13083 61591 75900 90698 173390 217339 201535 256953 235091 177527 165871 108354 49914 25749
13071 25749 -27897 -143023 -133312 -48052 -68363 -98094 -16247 -15586 29585 110001 136761 16350
$$ packed form
13151b3954l5984j1384n4332J18073P8462N6913J09648R2192p2878M4126K76268
13140E77150K20008Q623j62553r2091n7598o6855j17320k9076l8711l5527j31078
13129G4972j43858l6030r962P9778J9867J8407n2064p8301J8924m120p9190O0447
13117a31130O6702P454j06543L6296R8545l4365p8904L3010M0336P426R0405J47815
13105A77047J2009j2952M5684K4066Q738n0009k5625L5734J28807K45992J82659
13094G72150L4966j06738j20812q5230k23875m8313O267l6023l6619o2649l1533
13083F1591J4309J4798Q2692M3949j5804N5418k1862n7564j1656n7517n8440k4165
13071B5749n3646j15126R711Q5260k0311k9731Q1847O61M5171Q0416K6760j20411
$$ plain form
13059 16350 -46329 -156901 -126201 -56861 1413 161666 141548 83969 169109 254801 275812
13048 275812 187854 115657 192534 269858 267871 89957 -51291 -5905 3514 -38806 64634
13037 64634 -14041 -6355 -55754 -93309 -48138 -88383 -84249 -46765 -68426 -52500 -51391 27105
13025 27105 44048 46744 23278 56683 -16665 15599 115770 171529 84409 14985 -106840
13014 -106840 -139175 -69272 -22350 -28463 15220 24707 -50537 -52223 -30467 -57189 -26711 -46180
13002 -46180 -50619 -16430 29627 44139 61359 2797 -9047 -43968 -4198 -2645 -10139 -37100
12990 -37100 -45490 -64853 -76393 -101056 -134348 -143818 -44876 2838 243 7631 -18706 36057
12978 36057 58627 46405 -80719 -120197 19604 157918 159562 140546 135298 23804 -45273
$$ packed form
13059A6350o2679j10572L0700O9340N8274J60253k0118n7579Q5140Q5692K1011
13048B75812q7958p2197P6877P7324j987j77914j41248M5386R419m2320J03440
13037F4634p8675P686m9399l7555M5171m0245M134L7484k1661J5926J109P8496
13025B7105J6943K696k3466L3405p3348L2264J00171N5759q7120o9424j21825
13014a06840l2335O9903M6922o113M3683R487p5244j686K1756k6722L0478j9469
13002d6180m439L4189M6057J4512J7220n8562j1844l4921L9770J553p494k6961
12990c7100q390j9363j1540k4663l3292r470R8942M7714k595P388k6337N4763
12978C6057K2570j2222j27124l9478J39801J38314J644j9016n248j11494o9077
$$ plain form
12967 -45273 -4848 46199 -1374 -46728 -35014 -17843 -116669 -200981 -181157 -120162 -153348 -153590
12955 -153590 -76650 34713 -67699 -160535 -62318 -17708 14001 56849 30848 -97586 -162706
12944 -162706 -73303 -40176 7232 60917 8202 -22892 -6602 -34738 -140312 -57787 -23098
12933 -23098 -72655 -146189 -96667 -122931 -73493 -63794 -101632 -152554 -152989 -68817 20168 49658
12921 49658 4621 17332 -70877 -157983 -159294 -103859 -6889 -40276 -114928 -164804 -148933 -50414
12909 -50414 11442 42314 41174 11090 41047 63579 -30320 -113964 -54663 -29130 3853 36443
12897 36443 105068 198684 223446 238136 99721 13919 14025 22892 -160371 -207047 -140581 -93812
12885 -93812 26090 94816 26655 -32614 -119941 -102777 -77882 -159323 -109159 -101853 -173567 -173852
$$ packed form
12967d5273M0425N1047m7573m5354J1714J7171r8826q4312J9824O0995l3186k42
12955a53590P6940J11363j02412r2836R8217M4610L1709M2848k6001j28434o5120
12944a62706Q9403L3127M7408N3685n2715l1094J6290k8136j05574Q2525L4689
12933b3098m9557p3534M9522k6264M9438R699l7838n0922m35Q4172Q8985K9490
12921D9658m5037J2711q8209q7106j311N5435R6970l3387p4652m9876J5871R8519
12909e0414O1856L0872j140l0084K9957K2532r3899q3644N9301K5533L2983L2590
12897C6443O8625R3616K4762J4690j38415q5802J06Q867j83263m6676O6466M6769
12885i3812J19902O8726o8161n9269q7327J7164K4895q1441N0164P306p1714k85
$$ plain form
12873 -173852 -70237 79976 -2856 63855 133806 151202 116453 97512 132899 157549 46215
12862 46215 -12164 -42235 -39671 -70463 -33793 65107 47745 80790 179212 125795 -21928 -61306
12850 -61306 -50133 -38240 -3254 27545 121254 82879 51784 -89586 -175728 -108276 909
12839 909 38416 33101 9459 -24310 -8359 -44791 -51703 -98211 -116420 -91535 -8672 81352
12827 81352 60427 2587 -38926 -118310 -109058 -124688 -113517 3145 50383 5899 -7742 -19665
12815 -19665 61267 30904 39652 -26548 -18313 -32966 -107529 -170063 -160153 -148994 -112785 -99449
12803 -99449 -35456 -4553 -44354 -36958 -19718 114817 140413 13231 19384 65479 78748 -41048
12791 -41048 -117842 -159722 -123707 -49940 -8608 57356 10084 40412 25758 -41440 -109946 -55537
$$ packed form
12873a73852J03615J50213q2832O6711O9951J7396l4749j8941L5387K4650j11334
12862D6215n8379l0071K564l0792L6670R8900j7362L3045R8422n3417j47723l9378
12850f1306J1173J1893L4986L0799R3709l8375l1095j41370q6142O7452J09185
12839I09L7507n315k3642l3769J5951l6432o912m6508j8209K4885Q2863R0024
12827H1352k0925n7840m1513p9384R252j5630J1171J16662M7238m4484j3641j1923
12815a9665Q0932l0363Q748o6200Q235j4653p4563o2534R910J1159L6209J3336
12803i9449O3993L0903l9801P396J7240J34535K5596j27182O153M6095J3269j19796
12791d1048p6794m1880L6015P3767M1332O5964m7272L0328j4654o7198o8506N4409
$$ plain form
12779 -55537 -79032 -145117 -124188 -123542 -23280 68290 115200 35876 37640 -8584 -78079 -68654
12767 -68654 -122834 -106419 -58496 -17420 -12037 7857 -108348 -87480 -23675 20107 8182 -75446
12755 -75446 -125753 -131584 -50782 -95931 -110823 208 63594 65703 86548 79214 45601 10613
12743 10613 -40301 1711 35022 65685 145711 137259 -109026 -208164 -140529 -56108 16036 -5508
12731 -5508 -24237 -123979 -136309 -111157 -91761 -90334 -76156 -133482 -150710 -49128 -19334 -101724
12719 -101724 -144797 -83415 8433 -36776 -24803 23424 149058 156893 -22269 -80000 -44346
12708 -44346 -71571 -37747 -11979 38824 -68571 -94343 -117991 -171768 -109788 -105380 -95902 -25735
12696 -25735 -26599 -19147 -53658 -66371 -66319 -34562 1866 40084 154454 136749 43026 -15611 -4224
$$ packed form
12779e5537k3495o6085K0929O46J00262R1570M6910p9324J764m6224o9495R425
12767f8654n4180J6415M7923M1076N383J9894j16205K0868O3805M3782j1925q3628
12755g5446n0307n831Q0802m5149j4892J11031O3386K109K0845p334l3613l4988
12743A0613n0914M2012L3311L0663Q0026q452k46285r9138O7635Q4421P2144k1544
12731e508j8729r9742j2330K5152J9396J427J4178n7326j7228J01582K9794q2390
12719a01724m3073O1382R1848m5209J1973M8227J25634P835j79162n7731L5654
12708d4346k7225L3824K5768N0803j07395k5772k3648n3777O1980M408R478P0167
12696b5735q64P452l4511j2713N2L1757L6428L8218J14370j7705r3723n8637J1387
$$ plain form
12683 -4224 -41695 -79720 -47251 5556 115625 74457 7401 -3869 -20966 -52235 -55418 -28764
12671 -28764 -1442 5014 -23483 30502 123425 64075 -163699 -212297 -135742 -37104 -14741 -83717
12659 -83717 -64526 -42453 -72415 -204508 -258778 -134599 18814 38139 -59318 -50734 28587
12648 28587 23878 -84582 -176170 -34928 -3857 -13786 -40941 -9159 75289 147080 94001 113666
12636 113666 160009 141128 117596 90812 79189 -46722 -5320 59417 -15835 -95292 -75143
12625 -75143 -23394 44973 52009 36987 2351 -34563 6675 26451 -46331 -28635 -20761 -103900
12613 -103900 -125822 -84761 35764 168881 81821 -48335 -69026 -56806 -84846 -61178 19665
12602 19665 15017 -34862 -147045 -143196 -111778 -126794 -172145 -128751 -13697 5013 -132108
$$ packed form
12683d224l7471l8025L2469N2807J10069m1168o7056j1270j7097l1269l183K6654
12671b8764K7322O456k8497N3985R2923n9350k27774m8598P6555R8638K2363o8976
12659h3717J9191K2073k9962j32093n4270J24179J53413J9325r7457Q584P9321
12648B8587m709j08460r1588J41242L1071r929k7155L1782Q4448P1791n3079J9665
12636A13666M6343j8881k3532k6784j1623j25911M1402O4737p5252p9457K0149
12625g5143N1749O8367P036j5022l4636l6914M1238J9776p2782J7696P874q3139
12613a03900k1922M1061J20525J33117q7060j30156k0691J2220k8040K3668Q0843
12602A9665m648m9879j12183L849L1418j5016m5351M3394J15054J8710j37121
$$ plain form
12591 -132108 -166742 -134954 -108565 -52599 6488 120933 89534 114644 35151 -78758 -96642
12580 -96642 -25165 -73002 -72722 4915 53431 33681 26334 5817 -42061 -115184 -73502 -32072
12568 -32072 39008 33899 -96844 -193892 -203786 -103241 -34352 -163543 -195771 -170186 -133454
12557 -133454 -192679 -229604 -94824 -117793 -114170 -70327 -18577 39302 156375 112877 -23433
12546 -23433 -11596 -19143 -104571 -51806 -114932 -164112 -56606 89490 78183 75397 28555 -53892
12534 -53892 -64976 -62452 -138114 -134013 -176261 -97482 145171 248347 137378 -10266 -96169
12523 -96169 -61735 -35635 54727 13434 -59231 -60561 -229191 -212252 -174368 -80081 56127
12512 56127 73737 95722 67161 40768 132213 56252 -9136 95973 49754 -13827 1520
$$ packed form
12591a32108l4634L1788K6389N5966N9087J14445l1399K5110p9493j13909j7884
12580i6642P1477m7837K80P7637M8516j9750p347k0517m7878p3123M1682M1430
12568c2072P1080n109j30743r7048r894J00545O8889j29191l2228K5585L6732
12557a33454n9225l6925J34780k2969L623M3843N1750N7879J17073m3498j36310
12546b3433J1837p547q5428N2765o3126m9180J07506J46096j1307k786m6842q2447
12534e3892j1084K524p5662M101m2248P8779K42653J03176j10969j47644q5903
12523i6169L4434K6100R0362m1293p2665j330j68630J6939L7884R4287J36208
12512E6127J7610K1985k8561k6393R1445p5961o5388J05109m6219o3581J5347
$$ plain form
12501 1520 -65516 -117759 -161525 -171492 -118067 -92962 906 33647 28371 78321 102442 108684
12489 108684 104864 78381 58429 2633 -113646 -101064 -75281 -75306 -187185 -144050 -168571 -115788
12477 -115788 -61701 -38397 -21865 2422 45005 147535 51877 -28996 -50175 -36718 42896
12466 42896 25102 37396 -40752 -28243 30396 125578 27358 13254 77288 21671 62949 95170
12454 95170 217754 239324 182813 178208 65933 25180 -18381 -38623 -51541 -8231 6398
12443 6398 2880 96636 156864 141291 150275 98262 -16174 -100271 -23554 -77602 -132528 -148700
12431 -148700 -108706 -126848 -185891 -139497 -105879 -204757 -198523 -139360 -71672 -23013 -56592 -152347
12419 -152347 -165173 -131128 -111562 -92853 -29792 -65008 -46631 -24679 -105083 -177815 -164310
$$ packed form
12501A520o7036n2243m3766r967N3425K5105R3868L2741n276M9950K4121O242
12489A08684l820k6483j9952n5796j16279J2582K5783k5j11879M3135k4521N2783
12477a15788N4087K3304J6532K4287M2583J02530r5658q0873k1179J3457P9614
12466D2896j7794J2294p8148J2509N8639R5182r8220j4104O4034n5617M1278L2221
12454I5170J22584K1570n6511m605j12275m0753m3561k0242j2918M3310J4629
12443F398l518R3756O0228j5573Q984n2013j14436q4097P6717n4048n4926j6172
12431a48700L9994j8142n9043M6394L3618r8878O234N9163O7688M8659l3579r5755
12419a52347j2826L4045J9566J8709O3061l5216J8377K1952q0404p2732J3505
$$ plain form
12408 -164310 -76602 -121065 -126292 -95811 -5073 -39715 -35462 2787 -64455 -62927 -100885 -33635
12396 -33635 -22252 -57391 -57909 8232 80690 148348 114125 123787 254154 251267 191630 167914
12384 167914 124201 150242 228324 243804 266204 163687 95929 11492 81683 197058 195131
12373 195131 151563 136750 36500 -45698 -167526 -140782 -67369 -78815 -35108 -34513 -62626
12362 -62626 -124941 -86504 -63775 -64218 -114628 -112284 -76532 5193 53389 44981 -25374 -24351 -16007
12349 -16007 -28265 -15880 -5987 -1342 -44497 -98813 -77950 -61984 -116740 -161125 -133991 -59781
12337 -59781 -1564 -8903 40374 -3563 -63227 -47014 29873 -74662 -147210 -125929 -152672 -210348
12325 -210348 -221474 -98824 -68041 -89571 -51413 52211 56974 31113 485 25251 71242
$$ packed form
12408a64310Q7708m4463n227L0481R0738l4642M253L8249o7242J528l7958O7250
12396c3635J1383l5139n18O6141P2458O7658l4223R662J30367k887n9637k3716
12384A67914m3713K6041P8082J5480K2400j02517o7758q4437P0191J15375j927
12373A95131m3568j4813j00250q2198j21828K6744P3413j1446M3707N95k8113
12362f2626o2315L8437K2729m43n0410K344L5752Q1725M8196q408p0355J023Q344
12349a6007j2258J2385R893M645m3155n4316K0863J5966n4756m4385K7134P4210
12337e9781N8217p339M9277m3937n9664J6213P6887j04535p2548K1281k6743n7676
12325b10348j1126J22650L0783k1530L8158J03624M763k5861l0628K4766M5991
$$ plain form
12314 71242 27633 -95979 -93484 -32198 -90803 -40041 -19183 -23089 -49625 -40555 -53430 -116968
12302 -116968 -78913 -40956 -97088 -92450 -94545 -51688 48288 27832 -41807 -138743 -106006 -31292
12290 -31292 -86863 -34095 34256 52267 -22723 -46753 -66241 -120369 -227097 -209717 -172955
12279 -172955 -91066 -24423 -74690 -111419 -181749 -153449 -91685 57064 79841 -57977 -17410
12268 -17410 6661 -83437 -152365 -203568 -142631 -67162 -74281 -80098 -81703 -129821 -169805 -49366
12256 -49366 -9808 -21235 -49372 -135458 -115155 -46234 -48973 36170 9910 -57100 -5197 -40356
12244 -40356 55639 96303 99594 65662 -9665 -47938 -68943 -32704 -16432 -31850 -54124 18701
12232 18701 17235 45332 106200 40012 -66518 -52235 83734 85322 68349 23356 58117 24924
$$ packed form
12314G1242m3609j23612K495O1286n8605N0762K0858l906k6536R070j2875o3538
12302a16968L8055L7957n6132M638k095M2857R9976k0456o9639r6936L2737P4714
12290c1292n5571N2768O8351J8011p4990k4030j9488n4128j06728J7380L6762
12279a72955Q1889O6643n0267l6729p0330K8300O1764J48749K2777j37818M0567
12268a7410K4071r0098o8928n1203O0937P5469p119n817j605m8118l9984J20439
12256d9366L9558j1427k8137q6086K0303O8921k739Q5143k6260o7010N1903l5159
12244d0356R5995M0664L291l3932p5327l8273k1005L6239J6272j5418k2274P2825
12232A8701j466K8097O0868o6188j06530J4283J35969J588j6973m4993L4761l3193
$$ plain form
12220 24924 -46694 -15547 -112021 -43828 56480 140137 146571 76924 -9202 48351 74531 9693
12208 9693 16883 -8350 -87858 -73177 -29487 -883 65612 143156 151736 64475 132904 123169
12196 123169 106616 108282 56945 49381 40013 81804 50580 6850 -63364 28095 157941 25661
12184 25661 -5070 17896 2859 -5647 8223 7674 99426 94220 56854 -2988 -85925 -43462
12172 -43462 -24557 12596 155995 216153 278445 186046 95925 161335 124588 116975 179111 310645
12160 310645 362261 235209 173961 58558 145816 170501 118710 21565 -86876 -137217 -45209
12149 -45209 -44980 15864 19538 58740 24284 4153 50769 8265 12745 16503 -103751 -169508
12137 -169508 -88006 -17930 -12749 32492 73024 110670 87351 -67613 -128764 -129412 37578 207025
$$ packed form
12220B4924p1618L1147r6474O8193J00308Q3657O434o9647q6126N7553K6180o4838
12208I693P190k5233p9508J4681M3690K8604O6495P7544Q580q7261O8429r735
12196A23169j6553J666n1337p564r368M1791l1224m3730p0214R1459J29846j32280
12184B5661l0731K2966j5037q506J3870n49R1752n206l7366n9842q2937M2463
12172d3462J8905L7153J43399O0158O2292r2399r0121O5410l6747p613O2136J31534
12160C10645N1616j27052o1248j15403Q7258K4685n1791r7145j08441n0341R2008
12149d5209K29O0844L674L9202l4456k0131M6616m2504M480L758j20254o5757
12137a69508Q1502P0076N181M5241M0532L7646k3319j54964o1151o48J66990J69447
$$ plain form
12125 207025 295918 369982 357253 270197 277812 235325 167855 81890 152071 152041 107424 113724
12113 113724 224208 291309 126036 41966 28285 -8103 -7698 76301 61699 -1626 -47546
12102 -47546 35213 5271 45703 47700 1884 -11931 -66644 -8422 14081 1071 -10404 10800
12090 10800 49283 2463 -56180 -43207 1830 -82022 -20988 8883 77006 174714 240527 185558
12078 185558 86351 64249 57350 123510 76060 -4917 -76448 -84924 -60179 -42940 104893 167446
12066 167446 109350 95820 56211 116475 201790 99209 10069 -40277 -185922 -217621 -118681
12055 -118681 -66917 40715 48039 103433 61875 12177 -6522 -21451 -117083 -128393 -37505
12044 -37505 -88252 -40397 -89251 -199792 -155410 -24654 86447 81986 70718 73093 143598
$$ packed form
12125B07025Q8893P4064j2729q7056P615m2487o7470q5965P0181l0m4617O300
12113A13724J10484O7101j65273q4070j3681l6388M05Q3999j4602o3325m5920
12102d7546Q2759k9942M0432J997m5816j3815n4713N8222K2503j3010j1475K1204
12090A0800L8483m6820n8643J2973M5037q3852O1034K9871O8123R7708O5813n4969
12078A85558r9207k2102o899O6160m7450q0977p1531q476K4745J7239J47833O2553
12066A67446n8096j3530l9609O0264Q5315j02581q9140n0346j45645l1699R8940
12055a18681N1764J07632P324N5394m1558m9698j8699j4929r5632j1310R0888
12044c7505n0747M7855m8854j10541M4382J30756J11101m461j1268K375P0505
$$ plain form
12033 143598 87624 -24300 16583 127093 89821 59897 -1087 -67024 -61547 -18748 52770
12022 52770 31039 1408 79081 128533 234918 225627 175005 171407 125039 109826 55301 -10410
12010 -10410 5284 48547 -17175 -59374 -173940 -93257 -37780 -206019 -207442 -155293 -162643 -70034
11998 -70034 21621 30482 73734 10185 3740 22575 10182 -21918 96681 -6329 -155669
11987 -155669 -165950 -181574 -93562 -41145 -42541 -39475 93666 76622 69797 37727 -81501 -180252
11975 -180252 -143709 -47035 -66942 -7148 16084 22985 -49122 -145801 -223798 -195669 -169013 -150705
11963 -150705 -31262 -6710 -88164 -12832 62275 35834 -39237 10060 -44152 -145557 -123860
11952 -123860 -134787 -185831 -211442 -215000 -70438 -76589 -5373 43762 41799 7562 -15023 -37151
$$ packed form
12033A43598n5974j11924M0883J10510l7272k9924o0984o5937N477M2799P1518
12022E2770k1731k9631P7673M9452J06385r291n0622l598m6368j5213n4525o5711
12010a0410J5694M3263o5722m2199j14566Q0683N5477j68239j423N2149p350R2609
11998g0034R1655Q861M3252o3549o445J8835j2393l2100J18599j03010j49340
11987a55669j0281j5624Q8012N2417j396L066J33141j7044o825l2070j19228r8751
11975a80252L6543R6674j9907N9794K3232O901p2107r6679p7997K8129K6656J8308
11963a50705J19443K4552q1454P5332P5107k6441p5071M9297n4212j01405K1697
11952a23860j0927n1044k5611l558J44562o151P1216M9135j963l4237k2585k2128
$$ plain form
11940 -37151 -99838 -44352 40477 -12414 -110898 -163002 -64263 -26405 57414 -3108 -34938 34568
11928 34568 69313 -412 80909 213540 250477 160772 54451 32235 14033 45829 -12486
11917 -12486 -83741 -57150 5116 31910 39871 53943 110171 105427 26291 -10518 -12904 79021
11905 79021 122334 121125 53610 8755 55937 -16617 -35133 -124529 -117272 -61020 -51118 10482
11893 10482 -48437 -95586 -153743 -156093 -200144 -117737 -57690 -89610 -120646 -205208 -211778 -258809
11881 -258809 -213337 -80787 -29585 19584 -35503 -56060 -91475 -113624 -25385 54645 869
11870 869 -21077 -62673 -72035 -116528 -54192 15049 -6144 -97843 -128252 -96848 -116075 -51273
11858 -51273 38514 120232 191402 163488 91823 5117 -55422 -85042 -16702 27093 -37064 -24476
$$ packed form
11940c7151o2687N5486Q4829n2891r8484n2104R8739L7858Q3819o0522l1830O9506
11928C4568L4745o9725Q1321J32631L6937q9705j06321k2216j8202L1796n8315
11917a2486p1255K6591O2266K6794P961J4072N6228m744p9136l6809k386R1925
11905G9021M3313j209o7515m4855M7182p2554j8516q9396P257N6252R902O1600
11893A0482n8919m7149n8157k350m4051Q2407O0047l1920l1036q4562o570m7031
11881b58809M5472J32550N1202M9169n5087k0557l5415k2149Q8239Q0030n3776
11870H69k1946m1596r362m4493O2336O9241k1193r1699l0409L1404j9227O4802
11858e1273Q9787Q1718P1170k7914p1665q6706o0539k9620O8340M3795o4157J2588
$$ plain form
11846 -24476 3346 64783 13792 -87779 -64056 87253 155013 126147 132043 201729 137062
11835 137062 43608 -62124 -140409 -84752 -64604 45742 -14089 -45540 62796 108202 162472
11824 162472 99200 121300 202970 36685 56531 125340 79430 176362 198776 184643 56684
11813 56684 79117 56051 -16594 -119023 -38784 -10169 -122884 -104049 -164545 -170113 -26148
11802 -26148 -26777 -186011 -213222 -181661 -177537 -40617 72343 92476 -52220 -46547 5970 99047
11790 99047 131420 116327 144080 83809 -3174 9679 2586 -58660 -136514 -88136 -89742 -145674
11778 -145674 -292737 -273787 -90506 2251 54263 163648 36614 -88304 -186704 -161608
11768 -161608 -134821 -168762 -57327 81254 110866 21805 -44139 -18990 -7970 -31178 -111976
$$ packed form
11846b4476K7822O1437n0991j01571K3723J51309O7760k8866N896O9686o4667
11835A37062r3454j05732p8285N5657K0148J10346n9831l1451J08336M5406N4270
11824A62472o3272K2100Q1670j66285J9846O8809m5910R6932K2414j4133j27959
11813E6684K2433k3066p2645j02429Q0239K8615j12715J8835o0496n568J43965
11802b6148o29j59234k7211L1561M124J36920J12960K0133j44696N673N2517R3077
11790I9047L2373j5093K7753o0271q6983J2853p093o1246p7854M8378j606n5932
11778a45674j47063J8950J83281R2757N2012J09385j27034j24918r8400K5096
11768a61608K6787l3941J11435J38581K9612q9061o5944K5149J1020k3208q0798
$$ plain form
11757 -111976 -130599 -111328 -50441 48006 -52936 -161478 -154994 -74314 20717 -52467 -97578
11746 -97578 -55998 112254 167398 186674 151545 119027 90358 186804 271254 204830 101642
11735 101642 46086 95839 33966 8867 -38875 -151366 -175353 -113535 8515 100588 73220
11724 73220 8732 -27873 -60510 -36529 2053 -3989 -34249 19723 -4880 14404 124517 88160
11712 88160 58358 -21042 -14932 56022 124350 147951 150257 98211 39873 74989 43932 9899
11700 9899 -45273 -62221 -81157 -84034 -26754 -15938 112137 69612 62564 50374 15910 35688
11688 35688 -16258 -18710 -57577 -27368 -34058 -31216 -103091 -186900 -160284 28553 26739 -50373
11676 -50373 -52856 65948 151595 101888 23068 -79087 -64460 -16869 -113835 -119353 -56706 -93895
$$ packed form
11757a11976j8623J9271O0887R8447j00942j08542O484Q0680R5031p3184m5111
11746i7578M1580J68252N5144J9276l5129l2518k8669R6446Q4450o6424j03188
11735A01642n5556M9753o1873k5099m7742j12491k3987O1818J22050R2073k7368
11724G3220o4488l6605l2637K3981L8582o042l0260N3972k4603J9284J10113l6357
11712H8160k9802p9400O110P0954O8328K3601K306n2046n8338L5116l1057l4033
11700I899n5172j6948j8936k877N7280J0816J28075m2525p048j2190l4464J9778
11688C5688n1946k452l8867L0209o690K842p1875q3809K6616J88837j814p7112
11676e0373k483J18804Q5647m9707p8820j02155J4627M7591r6966n518O2647l7189
$$ plain form
11664 -93895 -83570 -111276 -48420 68428 90237 -4799 -45384 -118405 -151092 -91006 -18967
11653 -18967 -5605 -139023 -62375 47830 84518 46195 53412 70925 51089 44137 46148 1729
11641 1729 -29422 -7558 13023 66818 67156 8736 -17419 -1500 30093 78266 44756 -20724
11629 -20724 -57115 -52745 -9544 -59049 -160270 -101010 -83891 -95773 -106849 -134553 -121200 -46169
11617 -46169 1161 41985 62870 80005 50331 69604 -31043 -64661 -13703 30239 -28993
11606 -28993 -59028 -22192 42243 109246 86813 -25771 -19014 26213 -2481 -68075 -44861 -3283
11594 -3283 3276 -15486 47296 98221 -40553 -92426 12054 90064 -2989 -50487 7376 41560
11582 41560 25343 -48153 -47753 56739 15513 -36071 2206 87955 41694 120581 113032 167907
$$ packed form
11664i3895J0325k7706O2856J16848K1809r5036m0585p3021l2687O0086P2039
11653a8967J3362j33418P6648J10205L6688l8323P217J7513j9836o952K011m4419
11641A729l1151K1864K0581N3795L38n8420k6155J5919L1593M8173l3510o5480
11629b0724l6391M370M3201m9505j01221N9260J7119j1882j1076k7704J3353P5031
11617d6169M7330M0824K0885J7135k9674J9273j00647l3618N0958M3942n9232
11606b8993l0035L6836O4435O7003k2433j12584O757M5227k8694o5594K3214M1578
11594c283O559j8762O2782N0925j38774n1873J04480P8010r3053m7498N7863L4184
11582D1560j6217p3496M00J04492m1226n1584L8277Q5749m6261P8887p549N4875
$$ plain form
11570 167907 128691 -10127 71577 73462 109754 42849 39772 62191 41886 3430 -93508 -47061
11558 -47061 -33233 13038 89513 59502 47223 87293 62488 -30178 43139 123541 99883 91507
11546 91507 34050 -106203 -171711 -27601 76320 -103297 -161605 -11339 98401 68365
11536 68365 5047 73474 160940 124526 118678 93292 85620 106394 40334 12086 -456 -20492
11524 -20492 -6315 -65335 -167479 -202827 -208538 -167329 -55349 77203 93954 84359 97202
11513 97202 22488 -160271 -262486 -191253 -107147 -48106 -35171 -102590 -168393 -139720 -91817
11502 -91817 -41059 -47704 37575 65375 122574 163835 157873 55337 18781 61400 139290 235257
11490 235257 107697 65246 71633 26382 -47980 -65076 10637 80122 28426 68725 12955
$$ packed form
11570A67907l9216j38818Q1704J885L6292o6905l077K2419k0305l8456r6938M6447
11558d7061J3828M6271P6475l0011j2279M0070k4805r2666P3317Q0402k3658q376
11546I1507n7457j40253o5508J44110J03921j79617n8308J50266J09740l0036
11536F8365o3318O8427Q7466l6414n848k5386p672K0774o6060k8248j2542k0036
11524b0492J4177n9020j02144l5348n711M1209J11980J32552J6751r595J2843
11513I7202p4714j82759j02215P1233Q4106N9041J2935o7419o5803K8673M7903
11502i1817N0758o645Q5279K7800N7199M1261n962j02536l6556M2619P7890R5967
11490B35257j27560m2451O387m5251p4362j7096P5713O9485n1696M0299n5770
$$ plain form
11479 12955 -34137 -34763 -42421 2721 25883 105530 49820 -102412 -116201 -53047 121398 116856
11467 116856 -80511 -66231 -46004 -41286 -9370 -51177 -167814 -132081 -136360 -56107 32476
11456 32476 32382 72543 110894 169001 186824 292180 221677 66600 7467 -52252 -26045 69185
11444 69185 49860 96577 133440 88439 36733 31904 35224 100185 100591 145788 151810 68138 39134
11431 39134 74350 -29008 -155939 -159881 -93996 -19144 -42408 28820 69143 -56775 -41065
11420 -41065 -84808 -30368 -54303 -152363 -65814 36404 90064 21961 -34582 -135840 -31136
11409 -31136 68988 47953 42408 43898 107180 153560 59297 -55423 -94792 -23935 -24005 80251
11397 80251 167961 81971 33418 -11052 17898 -5198 -31472 101219 7241 -49133 74858
$$ packed form
11479A2955m7092o26p658M5142K3162P9647n5710j52232j3789O3154J74445m542
11467A16856j97367J4280K0227M718L1916m1807j16637L5733m279Q0253Q8583
11456C2476r4M0161L8351N8107J7823J05356p0503j55077n9133n9719K6207R5230
11444F9185j9325M6717L6863m5001n1706m829L320O4961M06M5197O022q3672k9004
11431C9134L5216j03358j26931l942O5885P4852k3264P1228M0323j25918J5710
11420d1065m3743N4440k3935r8060Q6549J02218N3660o8103n6543j01258J04704
11409c1136J00124k1035n545J490O3282M6380r4263j14720l9369P0857p0J04256
11397H0251Q7710q5990m8553m4470K8950k3096k6274J32691r3978n6374J23991
$$ plain form
11386 74858 74955 133047 75652 39603 24018 41095 50333 119220 153592 50185 33475 -4160
11374 -4160 51266 62706 27813 58469 40329 359 11500 50257 132760 158598 165675 37255
11362 37255 -43779 -21932 -48289 -161042 -184562 -131373 -63898 20274 66957 79790 105511
11351 105511 125345 83616 93957 84857 18459 52735 28074 -54036 -125644 -54810 -652 -38835
11339 -38835 -41900 -86210 -8932 104188 139812 130095 134768 160550 63649 18264 69912 -8924
11327 -8924 -14225 34535 29935 153893 184254 176864 190111 232548 249961 206039 160973 104503
11315 104503 57835 40610 77563 98758 165785 190461 186038 187830 215675 76309 11233 79497
11303 79497 103139 161008 116783 55785 -56571 -924 77507 152982 146000 60878 -39649
$$ packed form
11386G4858R7N8092n7395l6049j5585J7077R238O8887L4372j03407j6710l7635
11374d160N5426J1440l4893L0656j8140l9970J1141L8757Q2503K5838P077j28420
11362C7255q1034K1847k6357j12753k3520N3189O7475Q4172M6683J2833K5721
11351A05511J9834m1729J0341r100o6398L4276k4661q2110p1608P0834N4158l8183
11339c8835l065m4310P7278J13120L5624r717M673K5782r6901m5385N1648p8836
11327h924n301M8760m600J23958L0361p390J3247M2437J7413m3922m5066n6470
11315A04503m6668j7225L6953K1195O7027K4676m423J792K7845j39366o5076O8264
11303G9497K3642N7869m4225o0998j12356N5647P8431P5475o982q5122j00527
$$ plain form
11292 -39649 -112540 870 69331 -29601 -140118 -121623 -43831 56318 145523 150695 152720
11281 152720 190786 243452 296911 233337 140472 129710 130925 92344 146941 239055 192857 138420
11269 138420 53916 62179 -35429 -117966 -51954 15895 4694 9302 59122 99328 148668 107847
11257 107847 101781 162400 164328 113956 65899 2270 -15673 -62159 -28607 73394 145352 171837
11245 171837 103991 113619 95636 146405 200282 164447 94208 56499 54243 21220 -18441 -114507
11233 -114507 -115601 -77472 -44394 27551 97770 146948 73698 462 47867 8378 -1713 13240
11221 13240 19448 58057 37747 41490 78023 93933 103893 164324 108730 63462 108392 124275
11209 124275 48595 32562 17188 -133851 -144367 -54986 -46428 7244 41952 35841 -3900 36820
$$ packed form
11292c9649p2891J13410O8461r8932j10517J8495P7792J00149Q9205N172K025
11281A52720L8066N2666N3459o3574r2865j0762J215l8581N4597R2114m6198n4437
11269A38420q4504Q263r7608q2537O6012O7849j1201M608M9820M0206M9340m0821
11257A07847o066O0619J928n0372m8057o3629j7943m6486L3552J02001P1958K6485
11245A71837o7846R628j7983N0769N3877l5835p0239l7709k256l3023l9661r6066
11233a14507j094L8129L3078P1945P0219M9178p3250p3236M7405l9489j0091J4953
11221A3240O208L8609k0310L743L6533J5910R960O0431n5594m5268M4930J5883
11209A24275p5680j6033j5374j51039j0516Q9381Q558N3672L4708o111l9741M0720
$$ plain form
11197 36820 28378 13645 73932 58936 -36753 -138657 -175826 -93749 -48422 -65344 -22774 65733
11185 65733 86991 8374 9028 3840 -59814 99115 117377 18021 -9663 -59979 25548 63719
11173 63719 33800 -20165 -122971 -127497 -53809 -18227 54383 48538 99344 207105 180858 109524
11161 109524 170506 267431 265189 259195 185543 112613 44315 94846 138160 190076 138712 98701
11149 98701 140484 190487 164991 132421 137368 222019 198583 98064 60957 31582 31687 66959
11137 66959 29425 22890 -16441 -55095 -20767 -42443 -28988 -5738 30544 -6083 -37275 33807
11125 33807 14702 -1482 8486 74910 107528 103642 61866 -66065 -74613 -44844 4071 84940
11113 84940 26108 -41968 -19139 12173 105872 136575 77331 68086 86549 134839 168537 150803
$$ packed form
11197C6820q442j4733O0287j4996r5689j01904l7169Q2077M5327j6922M2570Q8507
11185F5733K1258p8617O54n188o3654J58929J8262r9356k7684n0316Q5527L8171
11173F3719k9919n3965j02806m526P3688L5582P2610n845N0806J07761k6247p1334
11161A09524O0982R6925k242n994p3652p2930o8298N0531M3314N1916n1364m0011
11149I8701M1783N0003k5496l2570M947Q4651k3436j00519l7107k9375J05L5272
11137F6959l7534o535l9331l8654L4328k1676J3455K3250L6282l6627l1192P1082
11125C3807j9105j6184R968O6424L2618l886m1776j27931q548K9769M8915Q0869
11113H4940n8832o8076K2829L1312R3699L0703n9244r245J8463M8290L3698j7734
$$ plain form
11101 150803 98233 44860 -2893 24629 -7512 -86083 -135713 -96435 -8126 63044 56038 35054
11089 35054 58910 47654 68022 -61912 -175996 -12975 145594 236963 332868 424044 417844
11078 417844 327011 367901 426966 537384 550715 584884 509067 408858 367415 313611 191620
11067 191620 275207 352492 324327 388675 394874 471259 443651 352738 351224 470732 634279
11056 634279 628001 686155 739268 788281 799657 903132 907039 811700 770902 726218 703159 643891
11044 643891 676946 677979 672561 704013 647176 647628 628118 627895 596946 531042 431573 354250 514929
11031 514929 578372 586360 550713 576902 480184 535508 512275 496360 418444 474904 456841 417465
11019 417465 332000 260966 290943 412389 490486 477494 471272 465806 401205 453099 458126 362597
$$ packed form
11101A50803n2570n3373m7753K7522l2141p8571m9630L9278Q8309P1170p006k0984
11089C5054K3856j1256K0368j29934j14084J63021J58569R1369R5905R1176o200
11078D17844r0833M0890N9065J10418J3331L4169p5817j00209m1443n3804j21991
11067A91620Q3587P7285k8165O4348O199P6385k7608r0913j514J19508J63547
11056F34279o278N8154N3113M9013J1376J03475L907r5339m0798m4684k3059n9268
11044F43891L3055J033n418L1452n6837M52j9510k23l0949o5904r9469p7323J60679
11031E14929O3443P988l5647K6189r6718N5324k3233j5915p7916N6460j8063l9376
11019D17465q5465p1034K9977J21446P8097j2992o222n466o4601N1894N027r5529
$$ plain form
11007 362597 283027 357136 413366 503565 591839 693156 648043 650721 663661 548569 488364
10996 488364 449162 444081 423930 360996 375634 392089 451680 369810 384580 480888 606860
10985 606860 653493 682385 713845 734397 823153 878498 978059 1107143 1258195 1342672 1269652
10974 1269652 1245809 1243445 1241432 1242299 1136733 1008633 960508 1046874 1188849 1219039 1132404
10963 1132404 1152959 1147388 1147970 1223164 1395113 1465897 1455645 1472743 1499645 1536960 1430763
10952 1430763 1396086 1391473 1321245 1304178 1453036 1543536 1510706 1505893 1442150 1329803 1270219
10941 1270219 1294592 1340524 1291711 1223292 1234351 1269755 1280841 1302142 1345343 1459706 1420987
10930 1420987 1418594 1404643 1513514 1565260 1498994 1449932 1447736 1351683 1256574 1156023 1053503
$$ packed form
11007C62597p9570P4109N6230R0199Q8274J01317m5113K678J2940j15092o0205
10996D88364l9202n081k0151o2934J4638J6455N9591q1870J4770R6308J25972
10985F06860M6633K8892L1460K0552Q8756N5345R9561J29084J51052Q4477p3020
10974A269652k3843k364k013Q67j05566j28100m8125Q6366J41975L0190q6635
10963A132404K0555n571N82P5194J71949P0784j0252J7098K6902L7315j06197
10952A430763l4677m613p0228j7067J48858R0500l2830m813o3743j12347n9584
10941A270219K4373M5932m8813o8419J1059L5404J1086K1301M3201J14363l8719
10930A420987k393j3951J08871N1746o6266m9062k196r6053r5109j00551j02520
$$ plain form
10919 1053503 1039003 1000644 923353 890826 846959 865491 897328 868250 880134 759926 778190
10908 778190 844268 839318 792489 830686 767478 733074 711083 742674 774116 728721 646421 538683
10896 538683 544458 425171 317066 299210 359442 403624 423243 408347 406064 325932 299280
10885 299280 415514 472437 406373 392483 599412 626899 571376 554906 508358 521913 583469
10874 583469 606272 581810 619240 614334 503296 511128 493330 489028 552299 542020 443847 314562
10862 314562 270009 352160 481734 614227 549304 525839 597181 670900 588200 555309 545344
10851 545344 581396 614596 701246 614668 550383 604012 612760 765319 854099 885442 999634
10840 999634 1119269 1138088 1272257 1306325 1236901 1143544 1087589 943855 900383 897536 859907
$$ packed form
10919A053503j4500l8359p7291l2527m3867J8532L1837k9078J1884j20208J8264
10908G78190O6078m950m6829L8197o3208l4404k1991L1591L1442m5395q2300j07738
10896E38683N775j19287j08105j7856O0232M4182J9619j4896k283q0132k6652
10885B99280J16234N6923o6064j3890K06929K7487n5523j6470m6548J3555O1556
10874E83469K2803k4462L7430m906j11038P832j7798m302O3271j0279r8173j29285
10862C14562m4553Q2151J29574J32493o4923k3465P1342P3719q2700l2891r965
10851E45344L6052L3200Q6650q6578o4285N3629Q748J52559Q8780L1343J14192
10840I99634J19635J8819J34169L4068o9424r3357n5955j43734m3472k847l7629
$$ plain form
10829 859907 848282 765261 711063 692985 598178 496462 629839 738428 709876 721610 694512
10818 694512 624753 514473 490865 487966 527463 497648 539392 593457 673964 815735 776322
10807 776322 805191 843449 991621 1055096 1151428 1261174 1347177 1256611 1216270 1222871 1195164
10796 1195164 1094929 1052541 1104672 1148421 1146172 1117119 1008534 803089 687878 724128 801662
10785 801662 744227 690380 760923 819895 822878 774981 764402 767186 726127 745460 760204 781313
10773 781313 823332 910970 955704 1009803 1032303 1044342 999762 992444 943877 876140 885785 1020729
10761 1020729 1104814 1255533 1286605 1330839 1324404 1461322 1666850 1729302 1709879 1721838 1657345
10750 1657345 1522425 1562237 1492643 1436581 1510721 1542427 1486849 1382352 1390054 1555183 1581062
$$ packed form
10829H59907j1625q3021n4198j8078r4807j01716J33377J08589k8552J1734k7098
10818F94512o9759j10280k3608k899L9497k9815M1744N4065Q0507J41771l9413
10807G76322K8869L8258J48172O3475R6332J09746Q6003r0566m0341O601k7707
10796A195164j00235m2388N2131M3749k249k9053j08585k05445j15211L6250P7534
10785H01662n7435n3847P0543N8972K983m7897j0579K784m1059J9333J4744K1109
10773G81313M2019Q7638M4734N4099K2500J2039m4580p318m8567o7737R645J34944
10761A020729Q4085J50719L1072M4234o435J36918K05528O2452j9423J1959o4493
10750A657345j34920L9812o9594n6062P4140L1706n5578j04497P702J65129K5879
$$ plain form
10739 1581062 1533613 1571398 1611087 1569670 1577851 1580033 1598857 1667172 1804456 2061284 2498355
10728 2498355 3036833 3763902 4602508 5394606 5932917 5992148 5693286 5104860 4467402 3977012
10718 3977012 3555843 3366135 3279009 3169922 3147992 3155803 3205509 3356510 3497909 3633028
10708 3633028 3913185 4406116 5164322 6265445 7648033 9345473 10960307 11952024 12053743
10699 12053743 11207160 9788383 8089364 6651318 5849484 5322171 4932353 4666870 4518599
10690 4518599 4420474 4314740 4399104 4509440 4728982 4978933 5443406 6075694 6930828 8138919
10680 8138919 9535577 11042982 12623762 14079333 15291062 16643836 18299092 19882257
10672 19882257 20810601 20571558 19403420 17638515 15938759 14708280 14153706 14295468 15113214
$$ packed form
10739A581062m7449L7785L9689m1417Q181K182J8824O8315J37284K56828M37071
10728B498355N38478P27069Q38606P92098N38311N9231k98862n88426o37458m90390
10718C977012m21169j89708q7126j09087k1930P811M9706J51001J41399J35119
10708C633028K80157M92931P58206J101123J382588J697440J614834R91717J01719
10699A2053743q46583j418777j699019j438046q01834n27313l89818k65483j48271
10690D518599r8125j05734Q4364J10336K19542K49951M64473O32288Q55134J208091
10680H138919J396658J507405J580780J455571J211729J352774J655256J583165
10672A9882257R28344k39043j168138j764905j699756j230479n54574J41762Q17746
$$ plain form
10663 15113214 16374545 17999091 19995285 22372811 25145116 28348663 32021038 36001765
10655 36001765 40416742 45944969 53055096 61665984 70724213 78599587 83654311 85024785
10647 85024785 83210900 79839350 76636465 74506725 73483590 73161402 72883776 72728107
10639 72728107 72691716 72698089 72920693 73265441 74026893 75159402 76596133 78743677 82256984
10630 82256984 87686723 94914171 103048515 109738587 113267723 113680518 112416464 110718766
10622 110718766 108863329 106377432 102970862 99107412 94954036 90207463 85079739 80558890
10614 80558890 77535344 76248851 76188716 76883296 78429947 80905261 84121826 88124748
10606 88124748 92866491 98322622 103974373 109376457 114587656 120664147 128230166 136212957
$$ packed form
10663A5113214J261331J624546J996194K377526K772305L203547L672375L980727
10655C6001765M414977N528227P110127Q610888R058229P875374N054724J370474
10647H5024785j813885l371550l202885k129740j023135l22188k77626j55669
10639G2728107l6391O373K22604L44748P61452J132509J436731K147544L513307
10630H2256984N429739P227448Q134344O690072L529136M12795j264054j697698
10622A10718766j855437k485897l406570l863450m153376m746573n127724m520849
10614H0558890l023546j286493o0135O94580J546651K475314L216565M002922
10606H8124748M741743N456131N651751N402084N211199O076491P566019P982791
$$ plain form
10598 136212957 142122942 143626267 139860290 132017173 122652445 113685614 106298535 100846807
10590 100846807 96984631 93941487 90949629 87748684 84266950 80583818 77053379 73876979
10582 73876979 71487525 70257767 70629957 73629744 79804596 88303040 96983259 102925026
10574 102925026 103470942 98855091 91158542 83188776 77051046 73240275 71286353 70637985
10566 70637985 71188423 73291506 77092083 82525822 89057407 96541972 105265145 115258437
10558 115258437 126037368 136463011 146264502 156016310 165604403 173918973 179323369 181866948
10550 181866948 183086498 184493214 186489542 187917225 187752919 186359976 184697972 183173533
10542 183173533 181419707 179470917 177984803 178084074 180494729 185006289 190940228 197752430
$$ packed form
10598A36212957N909985J503325l765977p843117r364728q966831p387079n451728
10590A00846807l862176l043144k991858l200945l481734l683132l530439l176400
10582G3876979k389454j229758L72190K999787O174852Q498444Q680219N941767
10574A02925026N45916m615851p696549p969766o137730l810771j953922o48368
10566G0637985N50438K103083L800577N433739O531585P484565Q723173R993292
10558A15258437J0778931J0425643R801491R751808R588093Q314570N404396K543579
10550A81866948J219550J406716J996328J427683j64306j392943j662004j524439
10542A83173533j753826j948790j486114R9271K410655M511560N933939O812202
$$ plain form
10534 197752430 204944871 212187362 219096067 225884909 233164255 241075512 249860943 259519001
10526 259519001 270644096 283666459 297135209 306208623 305809238 296642018 283584336
10519 283584336 271423430 261816239 254430798 248034644 241619844 234570016 227020810 220103541
10511 220103541 214253497 208779627 203149878 197386246 192110685 187455748 183436425 180519697
10503 180519697 178636091 176306860 172196724 165235553 155599841 144450082 132965046 122379811
10495 122379811 113464942 106023864 99281523 92953646 87421831 82989707 79317390 76176338
10487 76176338 73925337 72889487 73066178 74075373 75075702 76273733 77887677 79253852
10479 79253852 79588610 78551268 76520938 74229559 72739419 72233555 72449576 72376315 70990979
$$ packed form
10534A97752430P192441P242491O908705O788842P279346P911257Q785431R658058
10526B59519001J1125095J3022363J3468750R073414l99385r167220j3057682
10519B83584336j2160906r607191p385441o396154o414800p049828p549206o917269
10511B20103541n850044n473870n629749n763632n275561m654937m019323k916728
10503A80519697j883606k329231m110136o961171r635712j1149759j1485036j0585235
10495A22379811q914869p441078o742341o327877n531815m432124l672317l141052
10487G6176338k251001j035850J76691J009195J000329J198031J613944J366175
10479G9253852L34758j037342k030330k291379j490140n05864K16021p3261j385336
$$ plain form
10470 70990979 67988410 63936362 59907848 56845296 54908498 53970068 53973966 54618734 55645174
10461 55645174 56896867 58578824 61182927 64666273 68845534 74136306 81321043 91341369
10453 91341369 104888338 121786922 139747400 155703201 167564661 174305008 176398612
10446 176398612 174390922 168710678 159624522 147841504 134466107 120963216 108108229
10439 108108229 96280354 85672929 76375721 68795589 63179702 59444092 57213349 56194970
10431 56194970 56051877 56940545 58348979 59851484 60995060 61393335 61416612 61706886 63096121
10422 63096121 65947810 70110734 75139204 80850445 87334852 95255023 105436731 118214419
10414 118214419 132946058 148176760 162033631 173165367 180277825 182021561 177855337
$$ packed form
10470G0990979l002569m052048m028514l062552j936798r38430L898O44768J026440
10461E5645174J251693J681957K604103L483346M179261N290772P184737J0020326
10453I1341369J3546969J6898584J7960478J5955801J1861460O740347K093604
10446A76398612k007690n680244r086156j1783018j3375397j3502891j2854987
10439A08108229j1827875j0607425r297208p580132n615887l735610k230743j018379
10431E6194970j43093Q88668J408434J502505J143576L98275K3277K90274J389235
10422F3096121K851689M162924N028470N711241O484407P920171J0181708J2777688
10414A18214419J4731639J5230702J3856871J1131736P112458J743736m166224
$$ plain form
10407 177855337 168108797 154113918 138198339 122218467 107301201 94195095 83167550
10400 83167550 73915153 66300960 60076616 54823368 50561010 47181041 44541800 42372063
10392 42372063 40574417 38930601 37402916 35891278 34523484 33421681 32873691 32835183
10384 32835183 33167627 33893171 34933996 36173406 37888853 40292715 43671551 48216923
10376 48216923 53712626 60017606 67071794 75254122 84208711 93674940 103461682 112348910
10368 112348910 118886780 123014616 125703831 127940618 130047058 131144961 129973145 126287749
10360 126287749 120232456 112776772 105144494 97884245 91358063 85938616 81612357 78192288
10352 78192288 75352568 72937892 70889173 69478172 68561638 68015879 67712509 67740469 68415901
$$ packed form
10407A77855337r746540j3994879j5915579j5979872j4917266j3106106j1027545
10400H3167550r252397p614193o224344n253248m262358l379969k639241k169737
10392D2372063j797646j643816j527685j511638j367794j101803n47990l8508
10384C2835183L32444P25544J040825J239410J715447K403862L378836M545372
10376D8216923N495703O304980P054188Q182328Q954589R466229R786742Q887228
10368A12348910O537870M127836K689215K236787K106440J097903j171816l685396
10360A26287749o055293p455684p632278p260249o526182n419447m326259l420069
10352G8192288k839720k414676k048719j411001r16534n45759l03370K7960O75432
$$ plain form
10343 68415901 69794042 71799965 74734838 78998769 85083364 93298460 103636438 115698154
10335 115698154 128775263 141859400 154114554 164301602 172671475 179572700 185029345
10328 185029345 189478855 192498639 193650404 192668884 189003983 182594370 174063462 164516387
10320 164516387 155215598 146725682 139041889 132434302 126487728 120553073 114331475 107275766
10312 107275766 99250281 90664829 81779672 73150042 65230821 58302516 52361891 47186152
10304 47186152 42914855 39450145 36479622 33939996 31625770 29415007 27410285 25662649
10296 25662649 24384873 23263204 22283894 21698425 21384702 21099626 20960339 20986031 21167398
10287 21167398 21448560 21448296 21169837 20969192 20681241 20384763 20254598 20123750 20020401 20060859
$$ packed form
10343F8415901J378141K005923K934873M263931O084595Q215096J0337978J2061716
10335A15698154J3077109J3084137J2255154J0187048Q369873O901225N456645
10328A85029345M449510L019784J151765r81520l664901o409613q530908r547075
10320A64516387r300789q489916p683793o607587n946574n934655o221598p055709
10312A07275766q025485q585452q885157q629630p919221o928305n940625n175739
10304D7186152m271297l464710k970523k539626k314226k210763k004722j747636
10296B5662649j277776j121669r79310n85469l13723k85076j39287K5692J81367
10287B1167398K81162k64k78459k00645k87951k96478j30165j30848j03349M0458
$$ plain form
10277 20060859 20340356 20603521 20812858 21084098 21326632 21467437 21641007 22008095 22504484
10268 22504484 23247829 24378863 25852201 27843401 30327919 33612457 38174827 44316100
10260 44316100 52508376 62571489 74011658 86523162 100453376 116838850 136322499
10253 136322499 158113068 180457257 204054660 229508669 253304803 271234415 283637213
10246 283637213 293361812 301583086 307420517 307606357 300769597 290088440 279237515 271299283
10238 271299283 265044048 256547027 245312446 233054833 221756792 211981175 202764878
10231 202764878 193416998 184056880 174806207 164317445 151307195 135733022 119451625
10224 119451625 104834504 93292773 85533392 80854336 77990779 76077620 74953142 75275322
$$ packed form
10277B0060859K79497K63165K09337K71240K42534J40805J73570L67088M96389
10268B2504484P43345J131034J473338J991200K484518L284538M562370O141273
10260D4316100Q192276J0063113J1440169J2511504J3930214J6385474J9483649
10253A36322499K1790569K2344189K3597403K5454009K3796134J7929612J2402798
10246B83637213R724599Q221274N837431J85840o836760j0681157j0850925p938232
10238B71299283o255235q497021j1234581j2257613j1298041r775617r216297
10231B02764878r347880r360118r250673j0488762j3010250j5574173j6281397
10224A19451625j4617121j1541731p759381m679056k863557j913159j124478L22180
$$ plain form
10216 75275322 77794811 82208679 87051982 90658899 91863667 90325653 86443066 81000824
10208 81000824 74600916 68680737 64361044 61839698 60748111 60056066 59396904 59056684
10200 59056684 59125351 59738910 60642082 61871892 63537862 65532900 67650151 70030760 72712840
10191 72712840 75821889 78942420 81323358 82459641 82839237 83560496 84785498 85953876
10183 85953876 87372367 89817816 93568081 96910218 97629206 96141281 94411078 94129771
10175 94129771 95048680 96604520 98845337 102336389 107005356 111643379 114613702 115667863
10167 115667863 116138045 117455578 119709346 121657077 122309682 121150590 118518346 115983389
10159 115983389 114433817 114591404 115959698 117583317 119394375 122128097 126300391 131365231
$$ packed form
10216G5275322K519489M413868M843303L606917J204768j538014l882587n442242
10208H1000824o399908n920179m319693k521346j091587o92045o59162l40220
10200E9056684O8667O13559R03172J229810J665970J995038K117251K380609K682080
10191G2712840L109049L120531K380938J136283L79596P21259J225002J168378
10183H5953876J418491K445449L750265L342137P18988j487925j730203k81307
10175I4129771R18909J555840K240817L491052M668967M638023K970323J054161
10167A15667863M70182J317533K253768J947731O52605j159092k632244k534957
10159A15983389j549572J57587J368294J623619J811058K733722M172294N064840
$$ plain form
10151 131365231 136312964 140888170 145416589 150388712 154734322 156206883 153839640 148832847
10143 148832847 143519499 138252037 130750485 120331565 109046229 99468177 93554577 91987793
10135 91987793 94600226 100425509 108168538 117052167 126474443 135684582 143166749 146991521
10127 146991521 146145727 141405039 134649269 127516103 120728861 114212369 107786492 101617868
10119 101617868 95526782 89624687 83776460 78567316 75004734 73528943 74142563 76008442
10111 76008442 78132994 79885535 81101555 81950303 82298964 81825515 79572444 74566939
10103 74566939 67518677 59804339 52931066 47626863 44151789 42108925 41163733 40574588
10095 40574588 39771237 38408836 36804645 35552381 35142360 35334536 35451301 34771211 32724660
$$ packed form
10151A31365231M947733M575206M528419M972123M345610J472561k367243n006793
10143A48832847n313348n267462p501552j0418920j1285336r578052n913600j566784
10135I1987793K612433N825283P743029Q883629R422276R210139P482167L824772
10127A46991521q45794m740688o755770p133166o787242o516492o425877o168624
10119A01617868o091086n902095n848227n209144l562582j475791O13620J865879
10111G6008442K124552J752541J216020Q48748L48661m73449k253071n005505
10103G4566939p048262p714338o873273n304203l475074k042864r45192n89145
10095D0574588q03351j362401j604191j252264m10021J92176J16765o80090k046551
$$ plain form
10086 32724660 29750263 26385793 23143169 20400596 18131995 16284549 14726662 13424044
10078 13424044 12251690 11324117 10622152 10015604 9367546 8834938 8451048 8111822 7654158
10069 7654158 7346685 7057457 6769020 6458004 6165375 5992507 5864003 5719807 5583252
10060 5583252 5479476 5266182 5055247 4922371 4668175 4428166 4405150 4405872 4322689 4191568
10050 4191568 4205054 4233246 4138648 3966285 3826929 3736975 3606457 3659254 3632173 3443025
10040 3443025 3282540 3170721 3188461 3119182 3027773 2966608 2888955 2816314 2704983 2577774
10030 2577774 2523212 2445609 2405510 2376016 2206908 2129570 2188319 2120215 2091382 2117044 2084154
10019 2084154 2066515 2089973 2050322 2085868 2156703 2093254 2107800 2172164 2193593 2177270 2245348
$$ packed form
10086C2724660k974397l364470l242624k742573k268601j847446j557887j302618
10078A3424044j172354r27573p01965o06548o48058n32608l83890l39226m57664
10069G654158l07473k89228k88437l11016k92629j72868j28504j44196j36555
10060E583252j03776k13294k10935j32876k54196k40009k3016P22q3183j31121
10050D191568J3486K8192r4598j72363j39356q9954j30518N2797k7081j89148
10040C443025j60485j11819J7740o9279r1409o1165p7653p2641j11331j27209
10030B577774n4562p7603m0099k9494j69108p7338N8749o8104k8833K5662l2890
10019B084154j7639K3458l9651L5546P0835o3449J4546O4364K1429j6323O8078
$$ plain form
10008 2245348 2336626 2365260 2280616 2185886 2182691 2164738 1997897 2014750 2047982 1975584 1849021
9997 1849021 1730324 1811725 1824248 1898059 1917319 1870758 1983389 2119478 2177638 2067721 1965976
9986 1965976 1947648 1908304 1961446 1961757 1886182 1873006 1851207 1727142 1704630 1769314 1792250 1943808
9974 1943808 2039144 2273767 2435001 2529459 2582293 2636600 2664954 2680507 2723151 2763381 2738727
9963 2738727 2705811 2577273 2527657 2456939 2273234 2057392 1984400 1941521 1976282 1904502 1824632
9952 1824632 1811445 1759438 1800045 1830847 1883277 1895700 1874083 1838775 1877885 1808146 1759752
9941 1759752 1719665 1679846 1650850 1710619 1824168 1838507 1843586 1911648 2051638 2082862 2170552
9930 2170552 2167416 2237589 2199238 2158708 2259266 2201240 2012194 1874690 1856130 1854821 1912702
$$ packed form
10008B245348R1278K8634q4644r4730l195j7953j66841J6853L3232p2398j26563
9997A849021j18697Q1401J2523P3811J9260m6561J12631J36089N8160j09917j01745
9986A965976j8328l9344N3142L11p5575j3176k1799j24065k2512O4684K2936J51558
9974A943808R5336K34623J61234R4458N2834N4307K8354J5553M2644M0230k4654
9963B738727l2916j28538m9616p0718j83705k15842p2992m2879L4761p1780p9870
9952A824632j3187n2007M0607L0802N2430J2423k1617l5308L9110o9739m8394
9941A759752m0087l9819k8996N9769J13549J4339N079O8062J39990L1224Q7690
9930B170552l136P0173l8351m0530J00558n8026j89046j37504j8560j309N7881
$$ plain form
9919 1912702 1903922 2050584 2081086 2111423 2172604 2221661 2134952 2073345 1965591 1979954 1985722
9908 1985722 1824568 1687385 1585911 1478723 1414529 1325233 1311995 1348408 1326951 1347784 1392221
9897 1392221 1380329 1272084 1299794 1279160 1310049 1433539 1673005 1962386 2091382 2230599
9887 2230599 2292897 2351087 2406293 2462936 2553364 2955606 3615210 4171297 4078371 3577573 2791996
9876 2791996 2218707 1919589 1694213 1590916 1596614 1705955 1684997 1712851 1637333 1617672 1666001
9865 1666001 1785335 1726014 1489726 1292560 1229838 1134897 1054493 952476 1006114 1088761 1190102
9854 1190102 1300080 1334494 1364040 1473005 1571096 1635733 1643400 1591039 1558148 1642563 1782202
9843 1782202 1925412 2066667 2166880 2198443 2169446 2330154 2592194 3100006 3971621 4974406
$$ packed form
9919A912702q780J46662L0502L0337O1181M9057q6709o1607j07754J4363N768
9908A985722j61154j37183j01474j07188o4194q9296j3238L6413k1457K0833M4437
9897A392221j1892j08245K7710k0634L0889J23490K39466K89381J28996J39217
9887B230599O2298N8190N5206N6643R0428M02242O59604N56087r2926n00798p85577
9876B791996n73289k99118k25376j03297N698J09341k0958K7854p5518j9661M8329
9865A666001J19334n9321k36288j97166o2722r4941q0404j02017N3638Q2647J01341
9854A190102J09978L4414K9546J08965R8091O4637P667n2361l2891Q4415J39639
9843A782202J43210J41255J00213L1563k8997J60708K62040N07812Q71615J002785
$$ plain form
9833 4974406 5677895 5709829 5019368 4140544 3487212 3081142 2868970 2667227 2449959 2303207
9823 2303207 2318318 2595754 3147713 3405904 3236165 2908641 2456492 2104687 1971900 1960681
9813 1960681 2009286 2205691 2465670 2510720 2505004 2486888 2372508 2324588 2231915 2082495 1995828
9802 1995828 1858638 1768503 1728707 1736052 1678378 1510718 1478500 1524190 1549424 1557304 1562670 1500538
9790 1500538 1574157 1688465 1758456 1809013 1873327 1797711 1701261 1497469 1529363 1691900 1911939
9779 1911939 2006770 2007842 1786730 1529776 1437928 1519900 1516767 1409754 1355060 1461458 1479032
9768 1479032 1440670 1456248 1416067 1478463 1537987 1477492 1383846 1272595 1260249 1266035 1274530 1219616
9756 1219616 1155647 1135881 1163092 1163478 1247613 1363878 1437101 1386670 1370227 1519228 1652200
$$ packed form
9833D974406P03489L1934o90461q78824o53332m06070k12172k01743k17268j46752
9823B303207J5111K77436N51959K58191j69739l27524m52149l51805j32787j1219
9813A960681M8605J96405K59979M5050n716j8116j14380m7920r2673j49420q6667
9802A995828j37190r0135l9796P345n7674j67660l2218M5690K5234P880N366o2132
9790A500538P3619J14308O9991N0557O4314p5616r6450k03792L1894J62537K20039
9779A911939R4831J072k21112k56954r1848Q1972l133j07013n4694J06398J7574
9768A479032l8362J5578m0181O2396N9524o0495r3646j11251j2346N786Q495n4914
9756A219616o3969j9766K7211L86Q4135J16265P3223n0431j6443J49001J32972
$$ plain form
9745 1652200 1648778 1701838 1769846 1751571 1603076 1607005 1549363 1401450 1354228 1275672 1266208 1229042
9733 1229042 1244771 1255107 1334933 1386199 1433564 1554760 1649078 1770035 1811287 1857299 1950324
9722 1950324 1868573 1830894 1761186 1695466 1742183 1760562 1693663 1580219 1529489 1533155 1563598
9711 1563598 1762743 1842363 1843669 1880688 1908472 1986312 2084017 2201356 2296771 2297453 2194947
9700 2194947 2043255 1963058 1850318 1682422 1523652 1546436 1565953 1541378 1535032 1549948 1561079
9689 1561079 1561039 1635845 1749677 1823001 1904726 1985470 1957414 1819044 1770891 1684839 1469228
9678 1469228 1463288 1512950 1455848 1463160 1443789 1483244 1485622 1404273 1391761 1390288 1373976 1424667
9666 1424667 1495952 1526206 1502800 1447344 1423238 1307435 1251461 1320665 1366646 1349479 1435774
$$ packed form
9745A652200l422N3060O8008j8275j48495L929n7642j47913m7222p8556r464l7166
9733A229042J5729J0336P9826N1266M7365J21196R4318J20957M1252M6012R3025
9722A950324q1751l7679o9708o5720M6717J8379o6899j13444n0730L666L0443
9711A563598J99145P9620J306L7019K7784P7840R7705J17339R5415O82j02506
9700B194947j51692q0197j12740j67896j58770K2784J9517k4575o346J4916J1131
9689A561079m0P4806J13832P3324Q1725Q0744k8056j38370m8153q6052k15611
9678A469228n940M9662n7102P312j9371L9455K378q1349j2512j473j6312N0691
9666A424667P1285L0254k3406n5456k4106j15803n5974O9204M5981j7167Q6295
$$ plain form
9655 1435774 1476219 1398511 1320966 1253722 1328850 1392546 1468958 1627191 1682341 1546607 1509243
9644 1509243 1545170 1594942 1579885 1616517 1773487 1988377 2197185 2282004 2393276 2458737 2571872
9633 2571872 2742593 2850943 2928580 3101793 3550990 4020365 4726083 5504738 6538544 7644607
9623 7644607 8693476 9645427 10860342 12715676 15272096 18139279 20734949 22579356
9615 22579356 23569286 23322942 22349644 21496611 21345896 22103214 23595939 25101740 26140677
9606 26140677 26393279 25551707 24251874 22735688 21260492 20315443 19897709 19575177 19161480
9597 19161480 18620043 18095329 17997020 18395877 19322666 20887802 23015492 25251565 27404441
9588 27404441 29267706 31329939 34089693 37475264 40713292 43029606 44297709 44459402
$$ packed form
9655A435774M0445p7708p7545o7244P5128O3696P6412J58233N5150j35734l7364
9644A509243L5927M9772j5057L6632J56970K14890K08808Q4819J11272O5461J13135
9633B571872J70721J08350P7637J73213M49197M69375P05718P78655J033806J106063
9623G644607J048869R51951J214915J855334K556420K867183K595670J844407
9615B2579356R89930k46344r73298q53033j50715P57318J492725J505801J038937
9606B6140677K52602q41572j299833j516186j475196r45049m17734l22532m13697
9597A9161480n41437n24714r8309L98857R26789J565136K127690K236073K152876
9588B7404441J863265K062233K759754L385571L238028K316314J268103J61693
$$ plain form
9580 44459402 43236433 41060625 38742844 37356853 37309300 38576855 40691530 43043497
9572 43043497 45224191 47360351 49538307 51931499 55092140 59183883 64021006 68775937
9564 68775937 72644381 75360589 77002872 77650069 76892297 74202858 69500853 63371064
9556 63371064 56815911 50941076 46525239 43470889 41095590 38602054 35721592 32559535
9548 32559535 29515708 26940095 25043592 23915818 23337089 23121363 22959756 22495295 21833379
9539 21833379 21078627 20133047 19291339 18684740 18015659 17561085 17436649 17596319 18099946
9530 18099946 18813246 20071175 22158248 25350165 29731870 35332778 42232097 50602685
9522 50602685 60255455 70273531 80336501 90229469 100228098 110984733 122472459 134026574
$$ packed form
9580D4459402j222969k175808k317781j385991m7553J267555K114675K351967
9572D3043497K180694K136160K177956K393192L160641M091743M837123M754931
9564F8775937L868444K716208J642283O47197p57772k689439m702005o129789
9556F3371064o555153n874835m415837l054350k375299k493536k880462l162057
9548C2559535l043827k575613j896503j127774n78729k15726j61607m64461o61916
9539B1833379p54752r45580q41708o06599o69081m54574j24436J59670N03627
9530A8099946P13300J257929K087073L191917M381705N600908O899319Q370588
9522E0602685R652770J0018076J0062970R892968R998629J0756635J1487726J1554115
$$ plain form
9514 134026574 144998292 154729156 161627527 164140314 162236159 157197428 150278484 142272436
9506 142272436 133443949 123704181 113291597 102899023 93147719 84486106 76967057 70943962
9498 70943962 66962050 65235697 65742148 68297275 72969765 79420602 86655187 93774870
9490 93774870 99898330 105393095 111136556 117764130 125237962 132623968 139211107 144534328
9482 144534328 148722028 151652724 152387047 149454834 142329677 131901366 120017932 108913647
9474 108913647 99713132 92037349 84859581 77319564 69704727 62520128 56239289 51006090
9466 51006090 46608606 42764453 39331734 36138902 33445563 31359631 29847338 28946361
9458 28946361 28365592 28094437 28242199 28713434 29691757 31099478 33165523 36023039 39613293
$$ packed form
9514A34026574J0971718R730864O898371K512787j904155n038731o918944q006048
9506A42272436q828487r739768j0412584j0392574r751304q661613p519049o023095
9498G0943962l981912j726353N06451K555127M672490O450837P234585P119683
9490I3774870O123460N494765N743461O627574P473832P386006O587139N323221
9482A44534328M187700K930696P34323k932213p125157j0428311j1883434j1104285
9474A08913647r200515p675783p177768p540017p614837p184599o280839n233199
9466E1006090m397484l844153l432719l192832k693339k085932j512293r00977
9458B8946361n80769k71155J47762M71235R78323J407721K066045K857516L590254
$$ plain form
9449 39613293 43816855 48588074 53677418 59253336 65689981 73068636 81360668 89972565
9441 89972565 97990133 104701308 110067330 114522236 118580225 121910735 123754152 123149204
9433 123149204 119590549 113586880 105877319 97338129 88529733 80042834 72029460 64896188
9425 64896188 58680235 53300076 49139534 46415105 44901571 44669837 45676914 47748624
9417 47748624 50754406 54630314 59163136 64111053 69700971 76059998 83322863 91603605
9409 91603605 100408374 109123843 117040287 123315827 126881229 127612420 126130460 123634207
9401 123634207 121411546 119835722 118309910 116099070 112403868 106660828 98806120 89688290
9393 89688290 80631828 72032588 64037816 56600331 49710582 43875342 39224187 35493687
$$ packed form
9449C9613293M203562M771219N089344N575918O436645P378655Q292032Q611897
9441H9972565Q017568O711175N366022M454906M057989L330510J843417o04948
9433A23149204l558655o003669p709561q539190q808396q486899q013374p133272
9425F4896188o215953n380159m160542k724429j513534k31734J007077K071710
9417D7748624L005782L875908M532822M947917N589918O359027P262865Q280742
9409I1603605Q804769Q715469P916444O275540L565402P31191j481960k496253
9401A23634207k222661j575824j525812k210840l695202n743040p854708r117830
9393H9688290r056462q599240p994772p437485o889749n835240m651155l730500
$$ plain form
9385 35493687 32344761 29418878 26693575 24286367 22392917 20913789 19834979 19023336
9377 19023336 18423757 17780662 17133239 16607124 16079460 15882903 16241771 17138076 18518340
9368 18518340 20352146 22571251 24842492 27192778 29361066 31442737 33592010 35895328
9360 35895328 37845961 39074536 39086177 38103858 36754813 35124100 33240002 31111058 29038172
9351 29038172 26987057 24919234 22916626 20979491 19103343 17173023 15317095 13775315
9343 13775315 12393793 11325090 10704474 10372318 10180182 10198361 10497654 11026207 11881489
9334 11881489 13021840 14702552 16895295 19658645 22631140 25421703 27903577 30233368
9326 30233368 32940256 36319644 40084737 43797704 46783439 48240033 47870505 45837731
$$ packed form
9385C5493687l148926k925883k725303k407208j893450j479128j078810q11643
9377A9023336n99579o43095o47423n26115n27664j96557L58868Q96305J380264
9368A8518340J833806K219105K271241K350286K168288K081671K149273K303318
9360C5895328J950633J228575J1641r82319j349045j630713j884098k128944k072886
9351B9038172k051115k067823k002608j937135j876148j930320j855928j541780
9343A3775315j381522j068703o20616l32156j92136J8179K99293N28553Q55282
9334A1881489J140351J680712K192743K763350K972495K790563K481874K329791
9326C0233368K706888L379388L765093L712967K985735J456594l69528k032774
$$ plain form
9318 45837731 42550305 38762194 34587352 30391928 26468007 23148528 20477943 18203589
9310 18203589 16223863 14493708 12896840 11314142 9834538 8784021 7997020 7348721
9302 7348721 6787014 6194631 5853429 5536762 5176019 4826173 4587964 4535587 4335213 4114852
9292 4114852 3884647 3588364 3310331 3118437 2990847 2906972 2785746 2662357 2516783 2450891
9282 2450891 2479644 2426222 2414263 2237409 2118020 2042703 2032946 1993962 1947364 1874437 1792625
9271 1792625 1761735 1613001 1623474 1611239 1630032 1603195 1551248 1586665 1620653 1701403 1723223
9260 1723223 1623770 1548341 1485828 1368603 1343270 1379984 1357326 1436178 1437292 1442138 1489639 1537644
9248 1537644 1631476 1773245 1734494 1660656 1617896 1729416 1810772 1755291 1743450 1771798 1774501
$$ packed form
9318D5837731l287426l788111m174842m195424l923921l319479k670585k274354
9310A8203589j979726j730155j596868j582698j479604j050517p87001o48299
9302G348721n61707n92383l41202l16667l60743l49846k38209n2377k00374k20361
9292D114852k30205k96283k78033j91894j27590q3875j21226j23389j45574o5892
9282B450891K8753n3422j1959j76854j19389p5317r757l8984m6598p2927q1812
9271A792625l0890j48734J0473j2235J8793k6837n1947L5417L3988Q0750K1820
9260A723223r9453p5429o2513j17225k5333L6714k2658P8852J114M846M7501M8005
9248A537644R3832J41769l8751p3838m2760J11520Q1356n5481j1841K8348K703
$$ plain form
9237 1774501 1785344 1945862 2014174 2143957 2172308 2137035 2105828 2190105 2467247 2605603 2671294
9226 2671294 2661291 2754489 2891112 3011282 3217479 3439101 3697249 4060046 4568699 5102921
9216 5102921 5736018 6538341 7548997 8821256 10528788 12790590 15720580 19611302 24811775
9207 24811775 31673705 40133481 48558341 53740332 53490089 48083188 40107259 32214226
9199 32214226 25738893 20751272 16991643 14238565 12014904 10346503 9088133 8161264
9191 8161264 7405849 6806305 6385977 5935097 5547260 5267991 5027606 4677635 4423375 4353409
9181 4353409 4251868 3960538 3553997 3334251 3100269 2851190 2663206 2631526 2469614 2294716
9171 2294716 2219934 2116716 1937386 1774060 1712479 1739688 1698779 1655018 1554959 1365544
$$ packed form
9237A774501J0843J60518O8312J29783K8351l5273l1207Q4277K77142J38356O5691
9226B671294j0003R3198J36623J20170K06197K21622K58148L62797N08653N34222
9216E102921O33097Q02323J010656J272259J707532K261802K929990L890722N200473
9207B4811775O861930Q459776Q424860N181991k50243n406901p975929p893033
9199C2214226o475333m987621l759629k753078k223661j668401j258370r26869
9191H161264p55415n99544m20328m50880l87837k79269k40385l49971k54260o9966
9181D353409j01541k91330m06541k19746k33982k49079j87984l1680j61912j74898
9171B294716p4782j03218j79330j63326o1581K7209m0909m3761j00059j89415
$$ plain form
9161 1365544 1343635 1352565 1344769 1269211 1234736 1180155 1223098 1327519 1360849 1352957 1342438 1377021
9149 1377021 1478067 1465839 1234347 962894 911377 799351 745818 778558 797284 850102 862517
9138 862517 709171 682619 790080 862579 818513 756948 757315 765421 737199 690905 632697 681881
9126 681881 685959 714187 694355 651110 541885 534889 623202 550503 537290 561058 592499 571172
9114 571172 579233 644230 600145 629128 799457 958218 1057795 911416 887178 873214 931815
9103 931815 942680 1004527 1115547 1294344 1400552 1349593 1298477 1285182 1223126 1071686 1007681
9092 1007681 966041 969310 882650 912843 892679 867223 803798 702801 765949 818161 788983
9081 788983 820112 904733 993046 1169838 1239672 1274925 1283437 1261281 1174560 1175030 1235154 1313253
$$ packed form
9161A365544k1909Q930p796p5558l4475n4581M2943J04421L3330p892j0519L4583
9149A377021J01046j2228k31492k71453n1517j12026n3533L2740J8726N2818J2415
9138H62517j53346k6552J07461P2499m4066o1565L67Q106k8222m6294n8208M9184
9126F81881M078K8228j9832m3245j09225o996Q8313p2699j3213K3768L1441k1327
9114E71172Q061O4997m4085K8983J70329J58761R9577j46379k4238j3964N8601
9103I31815J0865O1847J11020J78797J06208n0959n1116j3295o2056j51440o4005
9092A007681m1640L269q6660L0193k0164k5456o3425j00997O3148N2212k9178
9081G88983L1129Q4621Q8313J76792O9834L5253Q512k2156q6721M70O0124P8099
$$ plain form
9069 1313253 1344243 1384648 1480172 1343054 1118111 1089039 1057593 933145 855214 847164 694342
9058 694342 574640 439601 319158 300803 424485 452644 422466 318246 230054 301602 419537
9047 419537 443988 395202 376451 466220 457647 472634 455766 507038 508946 523377 580737 499165
9035 499165 446187 473396 410123 439899 521378 541207 548079 595844 613553 682913 907115 1018282
9023 1018282 1028098 987894 931546 984947 969996 880768 957214 1085500 1056708 894250 744109
9012 744109 630653 551079 410932 461601 566397 565800 500957 464713 466648 467043 456374 424452
9000 424452 538392 570945 601276 620718 697901 875358 968721 1056543 1214739 1190752 1167192
8989 1167192 1037016 935721 901543 908918 949340 848694 750961 660808 679706 698099 618695
$$ packed form
9069A313253L0990M0405R5524j37118k24943k9072l1446j24448p7931q050j52822
9058F94342j19702j35039j20443j8355J23682K8159l0178j04220q8192P1548J17935
9047D19537K4451m8786j8751Q9769q573J4987j6868N1272J908J4431N7360q1572
9035D99165n2978K7209o3273K9776Q1479J9829O872M7765J7709O9360K24202J11167
9023A018282R816m0204n6348N3401j4951q9228P6446J28286k8792j62458j50141
9012G44109j13456p9574j40147N0669J04796n97o4843l6244J935L95j0669l1922
9000D24452J13940L2553L0331J9442P7183J77457R3363Q7822J58196k3987k3560
8989A167192j30176j01295l4178P375M0422j00646r7733r0153J8898J8393p9404
$$ plain form
8978 618695 572747 540518 454357 359797 397133 422701 501474 471414 426871 381648 309896 260270
8966 260270 246806 301769 238404 208533 291813 316069 341516 323505 235764 184559 165818 195394
8954 195394 211934 165623 183975 175749 170246 128849 130897 146063 176954 250044 307822 494911
8942 494911 564857 509526 556473 579642 501005 451441 495144 428773 303382 332894 330897 334542
8930 334542 376127 405046 317001 248987 92364 50549 114560 122133 202742 296345 257618 186637
8918 186637 199342 256661 288855 273460 267835 340487 434578 396115 412571 518996 568779 563444
8906 563444 547930 433131 339429 368071 439792 463910 349822 375521 367255 253167 182701
8895 182701 196898 239053 299469 290308 233929 150038 108905 101208 128749 200392 289453 286736
$$ packed form
8978F18695m5948l2229q6161r4560L7336K5568P8773l0060m4543m5223p1752m9626
8966B60270j3464N4963o3365k9871Q3280K4256K5447j8011q7741n1205j8741K9576
8954A95394J6540m6311J8352q226n503m1397K048J5166L0891P3090N7778J87089
8942D94911O9946n5331M6947K3169p8637m9564M3703o6371j25391K9512j997L645
8930C34542M1585K8919q8045o8014j56623m1815O4011P573Q0609R3603l8727p0981
8918A86637J2705N7319L2194j5395n625P2652R4091l8463J6456J06425M9783n335
8906E63444j5514j14799r3702K8642P1721K4118j14088K5699q266j14088p0466
8895A82701J4197M2155O0416r161n6379q3891m1133p697K7541P1643Q9061k717
$$ plain form
8883 286736 328363 363353 309259 230213 200424 141316 167375 173073 154154 146301 104482 102155
8871 102155 163320 185721 65594 -32554 -36887 -6028 36872 92809 161520 259000 205648 75151
8859 75151 43524 148243 259077 260127 141607 101401 92250 136775 65605 95748 64280 83605
8847 83605 119775 170197 249996 212599 229051 263104 305759 381764 365891 265674 169298 157467
8835 157467 184126 206878 241345 267463 209786 198372 209788 274203 217862 118141 188409 201674
8823 201674 148800 136608 81063 86179 101615 116062 129628 183426 215904 277061 324776 391368
8811 391368 321533 302691 322800 281438 228375 202857 164679 213307 196399 278049 329937 232269
8799 232269 310435 338004 255665 248166 279943 284756 144867 145490 263764 322914 207073 120361
$$ packed form
8883B86736M1627L4990n4094p9046k9789n9108K6059N698j8919p853m1819k327
8871A02155O1165K2401j20127r8148m333L0859M2900N5937O8711R7480n3352j30497
8859G5151l1627J04719J10834J050j18520m0206r151M4525p1170L0143l1468J9325
8847H3605L6170N0422P9799l7397J6452L4053M2655P6005j5873j00217r6376j1831
8835A57467K6659K2752L4467K6118n7677j1414J1416O4415n6341r9721P0268J3265
8823B01674n2874j2192n5545N116J5436J4447J3566N3798L2478O1157M7715O6592
8811C91368o9835j8842K0109m1362n3063k5518l8178M8628j6908Q1650N1888r7668
8799B32269P8166K7569q2339p499L1777M813j39889O23J18274N9150j15841q6712
$$ plain form
8787 120361 120372 231318 303565 265455 194524 127811 232231 313539 252057 123849 125849 89513
8775 89513 66259 127613 288991 343420 321631 290634 234241 168842 222883 275571 324268 329776
8763 329776 345949 415516 375412 272143 189878 131856 144249 233512 317203 319060 346123 360056
8751 360056 314560 220534 296374 354017 297853 270448 283206 81492 -3635 139674 275768
8740 275768 177836 103648 67672 34647 80341 91354 167142 181472 195831 178643 125567 107206
8728 107206 151191 106098 71696 144698 153689 136017 140566 55624 60669 177541 252026 273493
8716 273493 222570 54263 91207 82041 40356 106326 161803 222195 213392 186464 150502 201219
8704 201219 224597 301681 251598 189251 182165 107901 212862 257666 230628 164006 117886 186507
$$ packed form
8787A20361J1J10946P2247l8110p0931o6713J04420Q1308o1482j28208K000l6336
8775H9513k3254O1354J61378N4429k1789l0997n6393o5399N4041N2688M8697N508
8763C29776J6173O9567m0104j03269q2265n8022J2393Q9263Q3691J857K7063J3933
8751C60056m5496r4026P5840N7643n6164k7405J2758k01714q5127J43309J36094
8740B75768r7932p4188l5976l3025M5694J1013P5788J4330J4359j7188n3076j8361
8728A07206M3985m5093l4402P3002Q991j7672M549q4942N045J16872P4485K1467
8716B73493n0923j68307L6944r166m1685O5970N5477O0392q803k6928l5962N0717
8704B01219K3378P7084n0083o2347p086p4264J04961M4804k7038o6622m6120O8621
$$ plain form
8692 186507 216736 303451 306590 273138 281778 222192 204521 113589 60720 82154 125664 102702
8680 102702 131302 185135 161026 209138 118258 50745 53822 141816 236111 198074 238723 295772
8668 295772 318920 339137 283923 286089 412149 346844 380223 390690 322663 329750 337094 269409
8656 269409 82477 174554 199957 149413 146172 213415 206128 224906 254057 243636 147030 111287
8644 111287 8381 15487 174605 286407 298951 322831 342111 444584 476091 582132 689663
8633 689663 997189 1300678 1335176 1172362 850945 602376 455768 459263 583497 558973
8623 558973 537780 526814 547280 589967 466309 415856 424045 399402 396299 344875 335218 401446
8611 401446 443228 471714 506406 475241 505911 489587 429820 471904 387653 287306 266824
$$ packed form
8692A86507L0229Q6715L139l3452Q640n9586j7671r0932n2869K1434M3510k2962
8680A02702K8600N3833k4109M8112r0880o7513L077Q7994R4295l8037M0649N7049
8668B95772K3148K0217n5214K166J26060o5305L3379J0467o8027P087P344o7685
8656B69409j86932R2077K5403n0544l241O7243p287J8778K9151j0421r6606l5743
8644A11287j02906P106J59118J11802J2544K3880J9280J02473L1507J06041J07531
8633F89663L07526L03489L4498j62814l21417k48569j46608L495J24234k4524
8623E58973k1193j0966K0466M2687j23658n0453Q189k4643l103n1424r657O6228
8611D01446M1782K8486L4692l1165L0670j6324n9767M2084q4251j00347k0482
$$ plain form
8600 266824 245410 283160 341311 377671 471869 523282 527675 587375 602215 670712 756104 1001362
8588 1001362 1478606 2034713 2133743 1893604 1468411 1147044 933150 833502 757887 577252
8578 577252 515161 531531 463848 457131 495064 521530 660006 618203 531617 418833 386806
8567 386806 400556 312672 270781 307470 505894 644981 672191 547431 449122 433924 404085
8556 404085 400112 373773 329887 407719 428095 532619 481079 458289 551501 627954 547559 498160
8544 498160 584393 790269 1077980 1162565 1087348 773804 570853 568476 533053 412370 311127
8533 311127 285128 352891 382221 317944 276018 344587 337664 273586 279712 295653 273185 324986
8521 324986 344947 387993 333242 366695 299553 297601 345775 308264 259873 240713 216537 288698
$$ packed form
8600B66824k1414L7750N8151L6360R4198N1413M393N9700J4840O8497Q5392K45258
8588A001362M77244N56107R9030k40139m25193l21367k13894r9648p5615j80635
8578E77252o2091J6370o7683o717L7933K6466J38476m1803q6586j12784l2027
8567C86806J3750q7884m1891L6689J98424J39087K7210j24760r8309j5198k9839
8556D04085l973k6339m3886P7832K0376J04524n1540k2790R3212P6453q0395m9399
8544D98160Q6233K05876K87711Q4585p5217l13544k02951k377l5423j20683j01243
8533C11127k5999O7763K9330o4277m1926O8569o923o4078O126J5941k2468N1801
8521C24986J9961M3046n4751L3453o7142j952M8174l7511m8391j9160k4176P2161
$$ plain form
8509 288698 401781 563156 750510 795677 653762 454546 401344 248748 165244 211269
8499 211269 244356 255993 210803 152483 142420 168084 196846 254667 219624 218873 303444 336192
8487 336192 277403 233738 53182 -20789 10610 21754 20844 50373 74043 183214 139956 107216
8475 107216 138944 83745 67891 137427 170076 124858 202903 170329 168998 272950 243643 273324
8463 273324 288224 359843 282751 228502 281915 341152 288692 208381 225483 219776 258324 214234
8451 214234 127316 124286 80168 -196 -39221 25529 8314 -44556 40499 157029 235183 230775
8439 230775 174134 159436 102204 2011 40664 175550 171412 116954 63234 11943 64177
8428 64177 93222 159115 51497 -83046 -5455 43492 26065 -66755 -122385 -66050 11019
$$ packed form
8509B88698J13083J61375J87354M5167j41915j99216n3202j52596q3504M6025
8499B11269L3087J1637m5190n8320j0063K5664K8762N7821l5043p51Q4571L2748
8487C36192n8789m3665j80556p3971L1399J1144r10K9529K3670J09171m3258l2740
8475A07216L1728n5199j5854O9536L2649m5218P8045l2574j331J03952k9307K9681
8463B73324J4900P1619p7092n4249N3413N9237n2460q0311J7102n707L8548m4090
8451B14234q6918l030m4118q0364l9025O4750j7215n2870Q5055J16530P8154m408
8439B30775n6641j4698n7232j00193L8653J34886m138n4458n3720n1291N2234
8428F4177K9045O5893j07618j34543P7591M8947j7427r2820n5630N6335P7069
$$ plain form
8417 11019 11513 17126 12541 -7304 -49646 -71011 -94937 -6259 83064 187278 223371 241983
8405 241983 255034 291097 181531 67154 14701 -797 28454 -412 -29312 8472 127536
8394 127536 164516 257266 233208 256080 177588 129950 88421 156695 91707 65711 92633 99432
8382 99432 34115 9709 60210 118571 59953 -83772 -115877 -75860 21542 32038 -30444 -34183
8370 -34183 47683 28258 43722 95389 147382 157679 132999 95669 125615 155147 83170 12342
8358 12342 -48902 41750 59173 -10188 -14162 341 58179 120679 183706 74188 -53154 -47699
8346 -47699 9858 67033 49767 -14616 -33575 -248 30300 34101 24020 -14847 31193 126753
8334 126753 120513 120469 94060 138985 159226 133770 180850 245722 266798 296474 196470 160923
$$ packed form
8417A1019M94N613m585j9845m2342k1365k3926Q8678Q9323J04214L6093J8612
8405B41983J3051L6063j09566j14377n2453j5498K9251k8866k8900L7784J19064
8394A27536L6980R2750k4058K2872p8492m7638m1529O8274o4988k5996K6922O799
8382I9432o5317k4406N0501N8361n8618j43725l2105M0017R7402J0496o2482l739
8370c4183Q1866j9425J5464N1667N1993J0297k4680l7330K9946K9532p1977p0828
8358A2342o1244R0652J7423o9361l974J4503N7838O2500O3027j09518j27342N455
8346d7699N7557N7175j7266o4383j8959L3327L0548L801j0081l8867M6040R5560
8334A26753o240m4k6409M4925K0241k5456M7080O4872K1076K9676j00004l5547
$$ plain form
8322 160923 183702 166676 115868 148978 151367 3929 -8663 76178 82664 71039 40364 75338
8310 75338 88313 44277 129664 42878 18275 17616 52152 151948 189179 215025 168008 110899
8298 110899 108400 129562 131368 36328 -28819 -7766 -61206 -40698 -29391 5233 64229 53065
8286 53065 -49947 -105409 -56952 -16686 59306 60104 79433 173540 222598 163319 123196 127999
8274 127999 38507 -8285 -43300 -68910 -20101 11830 23029 -6795 55547 119963 106002 56374
8262 56374 -3836 -13257 13125 -35109 36539 70587 139766 97805 33131 65957 15390 -44536
8250 -44536 -7905 76942 107087 110911 163448 133415 90868 13380 64976 80440 24167 -55096
8238 -55096 -99042 -126227 -112620 -28621 36975 -13322 6492 10265 12515 73178 94080 90618
$$ packed form
8322A60923K2779j7026n0808L3110K389j47438j2592Q4841O486j1625l0675L4974
8310G5338J2975m4036Q5387q6786k4603o59L4536R9796L7231K5846m7017n7109
8298A10899k499K1162J806r5040o5147K1053n3440K0508J1307L4624N8996j1164
8286E3065j03012n5462M8457M0266P5992P98J9329R4107M9058n9279m0123M803
8274A27999q9492m6792l5015k5610M8809L1931J1199k9824O2342O4416j3961m9628
8262E6374o0210r421K6382m8234P1648L4048O9179m1961o4674L2826n0567n9926
8250d4536L6631Q4847L0145L824N2537l0033m2547p7488N1596J5464n6273p9263
8238e5096m3946k7185J3607Q3999O5596n0297J9814L773K250O0663K0902l462
$$ plain form
8226 90618 78581 95441 103738 63510 127091 142379 60527 28860 95505 55028 -34279 -67059
8214 -67059 -60752 -165836 -185026 -82719 65057 115134 151390 217308 93030 68239 131514
8203 131514 134787 79557 64971 171364 221746 199158 140674 101067 4816 -25792 -32719 29929
8191 29929 73241 107945 163173 240430 207176 142340 181751 58256 -52799 -182737 -67126
8180 -67126 101376 105338 118217 101188 116729 130958 181384 195259 160710 164139 199508 183849
8168 183849 184773 166805 188249 211793 205555 51496 -10611 -75847 -3967 -31194 -72615 -65033
8156 -65033 -20581 41487 -11797 -8833 25688 37247 3430 76416 83163 86768 94559 165826 232291
8143 232291 255638 164984 226753 226183 72360 88965 193137 150141 130767 81013 36837 30051
$$ packed form
8226I0618j2037J6860Q297m0228O3581J5288q1852l1667O6645m0477q9307l2780
8214f7059O307j05084j9190J02307J47776N0077L6256O5918j24278k4791O3275
8203A31514L273n5230j4586J06393N0382k2588n8484l9607r6251l0608o927O2648
8191B9929M3312L4704N5228P7257l3254o4836L9411j23495j11055j29938J15611
8180f7126J68502L962J2879j7029J5541J4229N0426J3875l4549L429L5369j5659
8168A83849R24j7968K1444K3544o238j54059o2107o5236P1880k7227m1421P582
8156f5033M4452O2068n3284K964L4521J1559l3817P2986O747L605P791P1267O6465
8143B32291K3347r0654O1769n70j53823J6605J04172m2996j9374m9754m4176o786
$$ plain form
8131 30051 -45585 -139722 -191014 -212006 -157901 -52424 -330 36149 27308 -90313 -28357 20818
8119 20818 -18456 108536 200946 261411 263967 173266 155804 237747 196377 145548 22974 20237
8107 20237 526 43806 121492 199172 226659 326528 287983 95656 123043 103521 94890 128059
8095 128059 148143 51706 51948 64546 103666 149964 136261 121611 86199 38920 17227 -125564
8083 -125564 -191164 -51469 19527 75132 89784 83657 9776 42767 179471 263694 269723 162751
8071 162751 13894 94755 91836 37530 5021 -28846 -20798 -37403 -64672 40086 111630 148400
8059 148400 194742 185161 118964 90909 58256 39708 -9280 -86709 -55392 45362 63176 112
8047 112 68137 89645 131497 128636 90593 125659 98618 56711 29168 51122 72262 20956
$$ packed form
8131C0051p5636r4137n1292k0992N4105J05477N2094L6479q841j17621O1956M9175
8119B0818l9274J26992R2410O0465K556r0701j7462Q1943m1370n0829j22574k737
8107B0237j9711M3280P7686P7680K7487R9869l8545j92327K7387j9522q631L3169
8095A28059K0084r6437K42J2598L9120M6298j3703j4650l5412m7279k1693j42791
8083a25564o5600J39695P0996N5605J4652o127p3881L2991J36704Q4223O029j06972
8071A62751j48857Q0861k919n4306l2509l3867Q048j6605k7269J04758P1544L6770
8059A48400M6342r581o6197k8055l2653j8548m8988p7429L1317J00754J7814o3064
8047A12O8025K1508M1852k861l8043L5066k7041m1907k7543K1954K1140n1306
$$ plain form
8035 20956 5306 32748 38851 -26817 -26912 1487 47747 73486 47921 52341 45755 14655 57028
8022 57028 18554 61874 37691 -39401 25630 25523 52768 40930 -12402 35833 10357 111231
8010 111231 219199 127885 123375 195653 151574 67473 -22043 151439 345967 380533 289490
7999 289490 202787 167115 239278 234757 102766 -32294 -99517 17415 81660 124631 158587
7988 158587 286312 392701 454656 384076 342536 428472 328834 271310 381403 522559 441655
7977 441655 452283 449371 362817 333550 265260 257231 230116 181394 192569 277303 308023 314138
7965 314138 366008 367182 289983 260700 259154 186654 141156 162540 167451 169986 279809 341851
7953 341851 337110 322465 391780 404231 423901 398739 324337 190789 187346 205785 179065 234791
$$ packed form
8035B0956j5650K7442O103o5668r5K8399M6260K5739k5565M420o586l1100M2373
8022E7028l8474M3320k4183p7092O5031j07K7245j1838n3332M8235k5476J00874
8010A11231J07968r1314m510P2278m4079q4101q9516J73482J94528L4566r1043
7999B89490q6703l5672P2163m521j31991j35060o7223J16932O4245M2971L3956
7988A58587J27725J06389O1955p0580m1540Q5936r9638n7524J10093J41156q0904
7977D41655J0628k912q6554k9267o8290q029k7115m8722J1175Q4734L0720O115
7965C14138N1870J174p7199k9283j546p2500m5498K1384M911K535J09823O2042
7953C41851m741j4645O9315J2451J9670k5162p4402j33548l443J8439k6720N5726
$$ plain form
7941 234791 279095 233860 193525 285737 305050 295854 362835 356466 345042 267860 235390 284683
7929 284683 291695 200986 137549 151825 121250 78280 143265 224343 209411 221469 133839 40540
7917 40540 46855 69050 84803 144518 179639 239415 255856 218851 115714 83895 108263 172442
7905 172442 139665 70132 72810 125722 166235 55577 -4160 3332 66110 138907 217914 202103
7893 202103 131687 109520 89566 113304 236707 169197 171525 204768 214042 200080 256318 227729
7881 227729 139052 32234 2269 -52546 -106 -2093 -101610 -166336 -147785 -142575 -51317 128777
7869 128777 180359 266163 225357 114391 86918 37956 72698 125419 163308 123502 37712
7858 37712 40119 85871 72726 41917 -45001 -38639 40969 35641 109700 92553 96478 93777 170162
$$ packed form
7941B34791M4304m5235m0335R2212J9313r196O6981o369j1424p7182l2470M9293
7929B84683P012r0709o3437J4276l0575m2970O4985Q1078j4932J2058q7630r3299
7917D0540O315K2195J5753N9715L5121N9776J6441l7005j03137l1819K4368O4179
7905A72442l2777o9533K678N2912M0513j10658n9737P492O2778P2797P9007j5811
7893B02103p0416k2167j9954K3738J23403o7510K328L3243R274j3962N6238k8589
7881B27729q8677j06818k9965n4815N2440j987r9517o4726J8551N210R1258J80094
7869A28777N1582Q5804m0806j10966k7473m8962L4742N2721L7889l9806q5790
7858C7712K407M5752j3145l0809q6918O362P9608n328P4059j7147L925k701P6385
$$ plain form
7845 170162 148586 34385 -35968 24051 101767 121810 69296 -69371 -102233 -64997 -59700
7834 -59700 -55619 -28316 17296 26931 30765 98981 69403 2971 -53611 -46761 64717 23948
7822 23948 8450 82980 112032 81566 97487 94979 97541 38608 47341 156957 212923 125671
7810 125671 -9724 -53767 -25054 46582 98091 80760 32595 122593 156770 87527 -34625
7799 -34625 1144 86015 73139 60951 37900 -28121 -31721 -30336 14904 24763 24035 39216 10082
7786 10082 14119 -5635 23895 87177 135389 138520 200794 260986 244117 155442 112089 58739
7774 58739 60419 108674 134130 59927 12712 132019 107349 23275 -10169 24610 -5968 -26579
7762 -26579 -79419 -95414 -38636 -48476 -70468 -41038 18789 -35707 -135928 -78532 -72432 -60180
$$ packed form
7845A70162k1576j14201p0353O0019P7716K0043n2514j38667l2862L7236N297
7834e9700M081K7303M5612R635L834O8216k9578o6432n6582O850J11478m0769
7822B3948j5498P4530K9052l0466J5921k508K562n8933Q733J09616N5966q7252
7810A25671j35395m4043K8713P1636N1509j7331m8165Q9998L4177o9243j22152
7799c4625L5769Q4871j2876j2188k3051o6021l600J385M5240R859p28J5181k9134
7786A0082M037j9754K9530O3282M8212L131O2274O0192j6869q8675m3353n3350
7774E8739J680M8255K5456p4203m7215J19307k4670q4074l3444L4779l0578k0611
7762b6579n2840j5995N6778r840k1992K9430N9827n4496j00221N7396O100J2252
$$ plain form
7750 -60180 -88893 -90039 -167546 -166788 -89858 -45517 -58753 59559 244145 246589 192661 179529
7738 179529 173441 201601 269621 115415 -54670 -26691 65099 22438 -32383 -27406 -8432 -29286
7726 -29286 21713 53595 21189 -51605 -140750 -64021 15488 56335 176678 207732 145130 23239
7714 23239 -84153 -147361 -90404 15280 61001 43093 -6205 -53648 -119436 -164609 -11422
7703 -11422 172430 104847 -19637 27442 3892 -72375 -103202 767 16090 36813 136166
7692 136166 159105 134806 112241 206521 287249 209804 68624 86671 107786 101676 -23328
7681 -23328 -155195 -190812 -109455 -67047 -89112 -142572 -90199 -46444 -18889 6894 88208 93331
7669 93331 79780 -7487 -63604 -75586 -26686 -13586 -12732 -34534 -56372 -133614 -123184 -72142
$$ packed form
7750f0180k8713j146p7507P58P6930M4341j3236J18312J84586K444n3928j3132
7738A79529o088K8160O8020j54206j70085K7979R1790m2661n4821M977J8974k0854
7726b9286N0999L1882l2406p2794q9145P6729P9509M0847J20343L1054o2602j21891
7714B3239j07392o3208N6957J05684M5721j7908m9298m7443o5788m5173J53187
7703a1422J83852o7583j24484M7079k3550p6267l0827J03969J5323K0723R9353
7692A36166K2939k4299k2565R4280Q0728p7445j41180J8047K1115o110j25004
7681b3328j31867l5617Q1357M2408k2065n3460N2373M3755K7555K5783Q1314N123
7669I3331j3551q7267n6117j1982M8900J3100Q54k1802k1838p7242J0430N1042
$$ plain form
7657 -72142 -85263 1513 72313 1159 95425 184864 106951 58244 -44514 -83170 23776
7646 23776 30951 94932 169530 190943 146805 9812 -35935 -2646 -32030 -134770 -171537 -175702
7634 -175702 -50707 85335 47149 20227 -17175 -80854 -74659 -26906 113017 115291 19101
7623 19101 74554 116914 96029 91376 99768 100117 142871 151805 164328 140660 137008 184965 136098
7610 136098 68092 28198 26202 34718 -29903 -94439 -161220 -153890 -82450 -77481 -99511 -63023
7598 -63023 17993 -7574 -51937 20949 -11979 -34875 -5095 -53322 -124770 -119137 -70385 -71241
7586 -71241 -55765 -25041 -51756 -33087 45210 100801 34979 73403 107294 95762 163710 73923
7574 73923 23112 119759 112487 36460 -12852 31694 -19332 -103941 -148274 -110522 -87377 -102690
$$ packed form
7657g2142j3121Q6776P0800p1154R4266Q9439p7913m8707j02758l8656J06946
7646B3776P175O3981P4598K1413m4138j36993m5747L3289k9384j02740l6767m165
7634a75702J24995J36042l8186k6922l7402o3679O195M7753J39923K274r6190
7623A9101N5453M2360k0885m653Q392L49M2754Q934J2523k3668l652M7957m8867
7610A36098o8006l9894j996Q516o4621o4536o6781P330P1440M969k2030L6488
7598f3023Q1016k5567m4363P2886l2928k2896K9780m8227p1448N633M8752q56
7586g1241J5476L0724k6715J8669P8297N5591o5822L8424L3891j1532O7948q9787
7574G3923n0811R6647p272p6027m9312M4546n1026q4609m4333L7752K3145j5313
$$ plain form
7562 -102690 -99448 -74392 -15359 -5534 -75219 -71893 -73674 1039 25957 67845 136689 96541
7550 96541 91721 22155 75790 164947 141706 -352 -46452 -11286 17558 60029 12301 -17097
7538 -17097 -49044 -108104 -168824 -116657 -59644 -128173 -204110 -215346 -137606 -15814 -1184 -32449
7526 -32449 -73605 -103451 -115996 -205764 -198610 -116072 -58817 78840 107085 12548 18960 36381
7514 36381 8658 -43587 -88945 -31239 40934 66047 70159 121101 152360 122945 79948 39253
7502 39253 35636 -5536 17379 147001 128026 54778 -63779 -14087 -21684 -62978 -59134 4542
7490 4542 30678 38264 79041 110828 124650 115899 -43952 -139795 -1072 170987 177064 53681
7478 53681 -55000 -103336 -198279 -232487 -279293 -223787 -137264 -91055 -125217 -241571 -236138 -165244
$$ packed form
7562a02690L242K5056N9033R825o9685L326j781P4713K4918M1888O8844m0148
7550I6541m820o9566N3635Q9157k3241j42058m6100L5166K8844M2471m7728k9398
7538a7097l1947n9060o0720N2167N7013o8529p5937j1236P7740J21792J4630l1265
7526c2449m1156k9846j2545q9768P154Q2538N7255J37657K8245r4537O412J7421
7514C6381k7723n2245m5358N7706P2173K5113M112N0942L1259k9415m2997m0695
7502C9253l617m1172K2915J29622j8975p3248j18557M9692p597m1294L844O3676
7490D542K6136P586M0777L1787J3822q751j59851r5843J38723J72059O077j23383
7478E3681j08681m8336r4943l4208m6806N5506Q6523M6209l4162j16354N433P0894
$$ plain form
7466 -165244 -139306 -69220 -8936 64040 87912 12639 49269 60018 9273 -10087 -28721 -12057
7454 -12057 11328 22810 -77642 -176666 -115507 -97246 -109425 -108044 -18752 -12184 2248 -77321
7442 -77321 -48755 14754 67623 37371 -71027 -67167 -9938 51196 88670 137042 88616 70838
7430 70838 -9218 -5107 8492 85352 126925 7857 -98137 -116862 -6109 152034 169174
7419 169174 66657 66717 136857 165309 7295 -51262 -2084 -42330 -56372 -29785 1610 -17254
7407 -17254 -56794 56017 144428 101219 -5158 -11484 -21124 31898 128715 169703 77120 -75937
7395 -75937 -82392 -87479 -14476 17123 17741 29763 -18719 11336 57892 136083 181230 102807 -12065
7382 -12065 -57907 15136 89155 161149 156670 189406 201544 115642 171202 228193 167325 63262
$$ packed form
7466a65244K5938P0086O0284P2976K3872p5273L6630J0749n0745j9360j8634J6664
7454a2057K3385J1482j00452r9024O1159J8261j2179J381Q9292O568J4432p9569
7442g7321K8566O3509N2869l0252j08398L860N7229O1134L7474M8372m8426j7778
7430G0838q0056M111J3599P6860M1573j19068j05994j8725J10753J58143J7140
7419A69174j02517O0P0140K8452j58014n8557M9178m0246j4042K6587L1395j8864
7407a7254l9540J12811Q8411m3209j06377o326r640N3022R6817M0988r2583j53057
7395g5937o455n087P3003L1599O18J2022m8482L0055M6556P8191M5147p8423j14872
7382a2065m5842P3043P4019P1994m479L2736J2138q5902N5560N6991o0868j04063
$$ plain form
7370 63262 49366 99025 117659 164728 132684 13117 -51760 -89595 -95527 10204 4115 -25661
7358 -25661 17014 -10256 -83250 -80502 -53458 -35120 93382 160841 146306 79703 115162 167658
7346 167658 192349 142151 135919 149146 175333 198408 128121 89747 -25332 12729 92388 138628
7334 138628 116441 33960 -34553 18085 -6006 -71918 -25389 53644 89344 4540 -69937 20136
7322 20136 -39488 -187139 -217719 -104242 -75496 -106087 -129579 -105013 -61263 -106256 -178374
7311 -178374 -178442 -39696 28465 -20451 -7118 -91750 -104025 -81192 -119119 -141212 -25692 19559
7299 19559 -80944 -94873 -61199 -123076 -141595 -66937 4478 -2487 -130533 -175615 -139049 -99106
7287 -99106 -109931 -170584 -138551 4130 99508 117571 142185 76316 -128173 -165777 -42442
$$ packed form
7370F3262j3896M9659J8634M7069l2044j19567o4877l7835n932J05731o089k9776
7358b5661M2675k7270p2994K748K7044J8338J28502O7459j4535o6603L5459N2496
7346A67658K4691n0198o232J3227K6187K3075p0287l8374j15079L8061P9659M6240
7334A38628k2187q2481o8513N2638k4091o5912M6529P9033L5700q4804p4477R0073
7322B0136n9624j47651l0580J13477K8746l0591k3492K4566M3750m4993p2118
7311a78374o8J38746O8161m8916J3333q4632j2275K2833l7927k2093J15520M5251
7299A9559j00503j3929L3674o1877j8519P4658P1415o965j28046m5082L6566L9943
7287i9106j0825o0653L2033J42681R5378J8063K4614o5869k04489l7604J23335
$$ plain form
7276 -42442 -29644 84337 97136 124158 165818 72912 119803 188677 215956 161566 138456 65142
7264 65142 87893 -2 -27648 -27997 -126812 -88397 37518 108475 48353 47630 60300 -12272
7252 -12272 -67191 -27601 140780 194667 155060 99251 -7200 -83501 2198 -63643 -46031
7241 -46031 97873 86859 62351 -39715 -50359 -43150 32136 164833 157937 102502 98245 98579
7229 98579 63773 112284 128690 45504 9430 -54054 -86321 -71198 -24554 -10324 -1371 16457
7217 16457 -13501 -76237 -97733 -132760 -46770 113487 140330 164376 157557 222331 231845 137129
7205 137129 92010 64253 -57455 -106212 -85576 -8120 82933 91020 115440 77218 55612 125902
7193 125902 138515 70186 52474 -9996 -175806 -206053 -155122 -84011 -16439 124065 207560
$$ packed form
7276d2442J2798J13981J2799K7022M1660r2906M6891O8874K7279n4390k3110p3314
7264F5142K2751q7895k7646l49r8815L8415J25915P0957o0122p23J2670p2572
7252a2272n4919L9590J68381N3887l9607n5809j06451p6301Q5699o5841J7612
7241d6031J43904j1014k4508j02066j0644P209P5286J32697o896n5435m257L34
7229I8579l4806M8511J6406q3186l6074o3484l2267J5123M6644J4230Q953J7828
7217A6457k9958o2736k1496l5027Q5990J60257K6843K4046o819O4774R514r4716
7205A37129m5119k7757j21708m8757K0636P7456R1053Q087K4420l8222k1606P0290
7193A25902J2613o8329j7712o2470j65810l0247N0931P1111O7572J40504Q3495
$$ plain form
7182 207560 148507 52231 59899 -19725 -46431 33766 113285 57733 -11853 -32155 -69068 -118482
7170 -118482 -95244 53413 42385 -4878 -86958 -149117 -64130 51025 150354 185339 86263
7159 86263 -14392 -58248 76420 65397 36478 46660 1193 -49947 -63708 -99854 -57919
7148 -57919 -49561 -73678 -153615 -169666 -109505 -171419 -162404 -100856 5465 -66762 -21491 91075
7136 91075 75082 42796 -65666 -28492 15450 6064 -750 -4347 -42142 -122893 -66559 9788
7124 9788 24976 -62567 -107348 -109236 -50777 -49506 -54183 -93038 -151709 -114261 -56534 -83598 -58510
7111 -58510 -27701 -61237 -63356 -132980 -143572 -163626 -169234 -95864 20342 42759 45439 75657
7099 75657 9589 -6488 34284 -11194 54619 53647 -73277 -144164 -147243 -78360 -75238 -86908
$$ packed form
7182B07560n9053r6276P668p9624k6706Q0197P9519n5552o9586k0302l6913m9414
7170a18482K3238J48657j1028m7263q2080o2159Q4987J15155R9329L4985r9076
7159H6263j00655m3856J34668j1023k8919J0182m5467n1140j3761l6146M1935
7148e7919Q358k4117p9937j6051O0161o1914R015O1548J06321p2227M5271J12566
7136I1075j5993l2286j08462L7174M3942r386o814l597l7795q0751N6334P6347
7124I788J5188q7543m4781j888N8459J271m677l8855n8671L7448N7727k7064K5088
7111e8510L0809l3536k119o9624j0592k0054n608P3370J16206K2417K680L0218
7099G5657o6068j6077M0772m5478O5813r72j26924p0887l079O8883L122j1670
$$ plain form
7087 -86908 15233 108312 32715 5940 -45045 -108062 -114935 -58134 -22655 19394 -5661 45404
7075 45404 47119 67708 -7343 68041 -25298 -46542 31700 28256 52256 59831 -7584 -87346
7063 -87346 -45927 -84927 -101302 -8384 79294 67468 -12872 -121975 -123599 -42078 3041 -57649
7051 -57649 -122086 -69360 -119007 -108193 -74719 -62545 -40447 -83160 -83022 -124621 -123525 -49472
7039 -49472 -1842 -46858 -69034 -83675 -104424 -165606 -161556 -57498 156364 172318 108153 6155
7027 6155 -87524 -89189 -81457 -6210 12090 -54313 -130461 -31828 51681 110723 112479 4900
7015 4900 10497 -12314 -15495 33123 50808 110288 64407 39948 -12323 -44358 -137598 -85433
7003 -85433 -88443 -49485 -39539 -26094 -33818 -88854 -224663 -213344 -66658 -12837 -52034 -75412
$$ packed form
7087h6908J02141R3079p5597k6775n0985o3017o873N6801L5479M2049k5055N1065
7075D5404J715K0589p5051P5384r3339k1244P8242l444K4000P575o7415p9762
7063h7346M1419l9000j6375R2918Q7678j1826q0340j09103j624Q1521M5119o0690
7051e7649o4437N2726m9647J0814L3474J2174K2098m2713J38m1599J096P4053
7039d9472M7630m5016k2176j4641k0749o1182M050J04058K13862J5954o4165j01998
7027F155r3679j665P732P5247J8300o6403p6148R8633Q3509N9042J756j07579
7015D900N597k2811l181M8618J7685N9480m5881k4459n2271l2035r3240N2165
7003h5433l010L8958R946J3445p724n5036j35809J1319J46686N3821l9197k3378
$$ plain form
6991 -75412 -99145 -173895 -231711 -150304 -61673 24238 96940 26295 37578 73067 -22968 -57744
6979 -57744 -100003 -171417 -201608 -30266 54667 19139 -10431 -23328 -75446 -109905 -129286 -93088
6967 -93088 4450 72482 79533 -30082 -7576 -40291 -19532 3341 -66055 -34803 -34634 -58805
6955 -58805 -162663 -165987 -102471 -41364 -33297 52112 71884 19691 77117 74134 38304 54143
6943 54143 50299 74308 51284 54490 70310 29079 -59730 -70307 13653 49125 32310 -7403
6931 -7403 -80280 14946 7669 -47287 -139765 -212267 -251596 -182772 -136507 -74352 -70593 -104069
6919 -104069 -69502 -157419 -142679 -124962 -133045 -167550 -114593 14539 14716 -45276 -12836 35991
6907 35991 -55500 -139838 -35440 59127 177618 180894 138511 54517 30052 20959 2192 49532
$$ packed form
6991g5412k3733p4750n7816Q1407Q8631Q5911P2702p0645J1283L5489r6035l4776
6979e7744m2259p1414l0191J71342Q4933l5528k9570j2897n2118l4459j9381L6198
6967i3088R7538O8032P051j09615K2506l2715K0759K2873o9396L1252J69k4171
6955e8805j03858l324O3516O1107Q067Q5409J9772n2193N7426k983l5830J5839
6943E4143l844K4009k3024L206J5820m1231q8809j0577Q3960L5472j6815l9713
6931g403p2877R5226p277n4956r2478p2502l9329O8824M6265O2155L759l3476
6919a04069L4567q7917J4740J7717q083l4505N2957J29132J77n9992L2440M8827
6907C5991r1491q4338J04398R4567J18491L276m2383q3994k4465r093j8767M7340
$$ plain form
6895 49532 119746 113734 118322 146642 158796 156807 117076 -715 -10323 46567 21663 92312
6883 92312 85434 -39151 -31580 66891 120799 78999 30134 9850 -79851 -125353 -105896 -18019
6871 -18019 69459 96269 40345 38476 -10579 -4377 104465 139453 30814 -34800 -57718 -62054
6859 -62054 -73072 -119871 -16017 23882 -42370 -71311 -120453 -140114 -127669 -94498 -52403 1773
6847 1773 -317 -31762 -36061 -63508 -179532 -166839 -164933 -150245 -199928 -133899 -61918 12255
6835 12255 50649 84151 167664 133758 23041 -59997 -16848 59658 149452 130095 108135 -15254
6823 -15254 -51242 -44195 21849 -27559 43787 -34773 -69694 -38946 -17001 -54025 -144519 -191198
6811 -191198 -138786 -51737 24665 -19725 -28914 8015 -29172 -76945 -46305 -82728 -142462 -130829
$$ packed form
6895D9532P0214o012M588K8320J2154j989l9731j17791r608N6890k4904P0649
6883I2312o878j24585P571R8471N3908m1800m8865k0284q9701m5502J9457Q7877
6871a8019Q7478K6810n5924j869m9055O202J08842L4988j08639o5614k2918m336
6859f2054j1018m6799J03854L9899o6252k8941m9142j9661J2445L3171M2095N4176
6847A773k090l1445m299k7447j16024J2693J906J4688m9683O6029P1981P4173
6835A2255L8394L3502Q3513l3906j10717q3038M3149P6506Q9794j9357k1960j23389
6823a5254l5988P047O6044m9408P1346p8560l4921L0748K1945l7024r0494m6679
6811a91198N2412Q7049P6402m4390r189L6929l7187m7773L0640l6423n9734J1633
$$ plain form
6799 -130829 -101076 -192707 -192093 -97542 -27023 -42382 -51298 -76967 -59198 -150772 -222170 -111511
6787 -111511 -149998 -150666 -201901 -191635 -106648 -71563 -63689 -101242 -51510 -63251 -175269 -134156
6775 -134156 -153299 -44449 -40264 -75148 -25873 53202 129427 70753 -11919 -60776 -49533 -486
6763 -486 71877 135841 147999 46394 82289 54110 126667 102304 84365 6740 -66392 -141289
6751 -141289 -145326 -106073 -105884 -38328 72786 62524 -14477 -13046 50479 86305 114944 152039
6739 152039 195246 173754 107759 21857 90404 101485 83519 68596 41647 47427 95425 131591
6727 131591 99246 34867 63921 139359 144668 110975 57587 -49362 -37919 62912 177406
6716 177406 313580 295319 258927 256055 186537 130689 165748 87345 -56202 -78490 -40167
$$ packed form
6799a30829K9753r1631O14R4551P0519j5359q916k5669J7769r1574p1398J10659
6787a11511l8487o68n1235J0266Q4987L5085P874l7553M9732j1741j12018M1113
6775a34156j9143J08850M185l4884M9275P9075P6225n8674q2672m8857J1243M9047
6763d86P2363O3964J2158j01605L5895k8179P2557k4363j7939p7625p3132p4897
6751a41289m037L9253J89O7556J11114j0262p7001J431O3525L5826K8639L7095
6739A52039M3207k1492o5995q5902O8547J1081j7966j4923k6949N780M7998L6166
6727A31591l2345o4379K9054P5438N309l3693n3388j06949J1443J00831J14494
6716A77406J36174j8261l6392k872o9518n5848L5059p8403j43547k2288L8323
$$ plain form
6705 -40167 -75617 -124727 -203861 -236793 -100966 -44339 -39175 46707 194100 254126 417335
6694 417335 516512 389236 258744 122259 -6523 -128003 -209845 -209294 -121374 -80399 -64024
6683 -64024 -36733 -52623 14820 63001 76211 199025 157923 106414 -51695 -102555 -30128
6672 -30128 114856 87170 -35381 -43610 -34717 40716 52970 -12453 52289 24842 5815 59590
6660 59590 125907 159043 115744 48583 -25526 -39857 -18373 -32088 -58967 -77610 -149523 -160642
6648 -160642 -21060 -42479 -106496 -96290 -42912 25036 71867 47368 -21126 16300 4757
6637 4757 21335 -21390 94381 64711 43502 8621 -10230 -76250 -180961 -183548 -148490 20015
6625 20015 88335 120390 11585 -71133 -46965 -9283 72057 -9467 -74555 1845 1403 -26157
$$ packed form
6705d0167l5450m9110p9134l2932J35827N6627N164Q5882J47393O0026J63209
6694D17335R9177j27276j30492j36485j28782j21480q1842N51Q7920M0975J6375
6683f4024K7291j5890O7443M8181J3210J22814m1102n1509j58109n0860P2427
6672c0128J44984k7686j22551q229Q893P5433J2254o5423O4742k7447j9027N3775
6660E9590O6317L3136m3299o7161p4109j4331K1484j3715k6879j8643p1913j1119
6648a60642J39582k1419o4017J0206N3378O7948M6831k4499o8494L7426j1543
6637D757J6578m2725J15771k9670k1209l4881j8851o6020j04711k587L5058J68505
6625B0015O8320L2055j08805q2718K4168L7682Q1340q1524o5088P6400m42k7560
$$ plain form
6613 -26157 26929 25444 80934 35142 -19645 15996 106712 178142 170167 79580 81880 114280
6601 114280 68081 39080 97635 19167 -73224 -70425 -66656 -37591 -12912 -63585 -104910 -66087
6589 -66087 -14730 -46333 -145893 -111867 -104868 -66360 43785 -44681 -202091 -278426 -277480 -226159
6577 -226159 -180841 -110714 -76008 4120 -8515 -117063 -174160 -159051 -202585 -134863 -100404
6566 -100404 -83574 -45400 -624 27444 69751 65346 39364 -27144 -62471 29282 136989 88202
6554 88202 -53504 -133852 -144615 -76707 -92296 -30561 40233 201298 308472 192342 91934
6543 91934 57943 -21097 -79853 -124714 -78552 -29882 80614 8736 -175447 -135313 -89688
6532 -89688 16007 21007 -30432 -131392 -100234 -52507 -147866 -266832 -170865 -86062 -25551
$$ packed form
6613b6157N3086j485N5490m5792n4787L5641R0716P1430p975r0587K300L2400
6601A14280m6199k9001N8555p8468r2391K799L769K9065K4679n0673m1325L8823
6589f6087N1357l1603r9560L4026O999L8508J10145q8466j57410p6335R46N1321
6577b26159M5318P0127L4706Q0128j2635j08548n7097J5109m3534O7722L4459
6566a00404J6830L8174M4776K8068M2307m405k5982o6508l5327R1753J07707m8787
6554H8202j41706q0348j0763O7908j5589O1735P0794J61065J07174j16130j00408
6543I1934l3991p9040n8756m4861M6162M8670J10496p1878j84183M0134M5625
6532h9688J05695N000n1439j00960L1158M7727r5359j18966R5967Q4803O0511
$$ plain form
6521 -25551 -10648 -34677 -85973 -5307 37549 40594 36673 10208 10133 20740 53222 132925 100324
6508 100324 -55625 -118098 -75498 -73698 -74277 -81867 -74325 -42275 -121259 -130593 -99566 -137559 -97205
6495 -97205 -50749 -83259 -145145 -101485 -104974 -114239 -76779 -114048 -43638 46126 91295 125353
6483 125353 113137 86883 44456 -60158 -91294 -84571 -103450 -125030 -136772 -148471 -129396 -113166
6471 -113166 -138584 -139525 -123165 -165704 -177234 -124586 -12593 -31362 -65069 -38427 -8903 7387
6459 7387 -26119 -91919 63427 76463 -54634 -62975 -12508 -107939 -102768 -57437 -94689 -122182
6447 -122182 -117890 9144 24099 77691 85442 127538 225588 193743 204072 167674 126337 156933
6435 156933 93137 44031 6427 9167 -6588 -93684 -111550 -72481 -104464 -122976 -86244 -237173
$$ packed form
6521b5551J4903k4029n1296Q0666M2856L045l921k6465p5J0607L2482P9703l2601
6508A00324j55949o2473M2600J800n79p590P542L2050p8984r334L1027l7993M0354
6495i7205M6456l2510o1886M3660l489r265L7460l7269P0410Q9764M5169L4058
6483A25353j2216k6254m2427j04614l1136O723j8879k1580j1742j1699J9075J6230
6471a13166k5418r41J6360m2539j1530N2648J11993j8769l3707K6642K9524J6290
6459G387l3506o5800J55346J3036j31097q341N0467r5431N171M5331l7252k7493
6447a22182M292J27034J4955N3592P751M2096R8050l1845J0329l6398m1337L0596
6435A56933o3796m9106l7604K740j5755q7096j7866L9069l1983j8512L6732j50929
$$ plain form
6423 -237173 -198284 -150977 -69413 -61018 -70091 -107156 -115731 -125183 -92512 -139477 -108454 -5670
6411 -5670 114776 165771 164319 119108 80368 86699 49409 -4718 -48125 -17832 3331 62778
6399 62778 186932 239994 101962 -21891 -76461 -127713 -131582 -159642 -91393 -28263 -54830
6388 -54830 -37514 5007 -70182 -65462 -54295 -38144 9789 -26617 39926 74166 4256 2653
6376 2653 -7881 9289 43503 3310 -71157 -70025 -62967 -75153 -58251 -56112 -2310 33767 59331
6363 59331 24433 36558 45174 87405 111014 17933 -64294 -34481 -33381 123845 178288 81213
6351 81213 77250 -7742 35336 -2566 -10529 -110322 -137333 -56447 34177 112329 136665 64984
6339 64984 7065 1958 81890 89008 -19167 -124782 -130782 -162238 -150643 -117574 -167147 -202717
$$ packed form
6423b37173L8889M7307Q1564Q395r073l7065q575r452L2671m6965L1023J02784
6411e670J20446N0995j452m5211l8740O331l7290n4127m3407L0293K1163N9447
6399F2778J24154N3062j38032j23853n4570n1252l869k8060O8249O3130k6567
6388e4830J7316M2521p5189M720J1167J6151M7933l6406O6543L4240o9910j603
6376B653j0534J7170L4214m0193p4467J132P058j2186J6902K139N3802L6077K5564
6363E9331l4898J2125Q616M2231K3609r3081q2227K9813J100J57226N4443r7075
6351H1213l963q4992M3078l7902p963r9793k7011Q0886R0624P8152K4336p1681
6339F4984n7919n107P9932P118j08175j05615o000l1456J1595L3069m9573l5570
$$ plain form
6327 -202717 -213869 -296281 -363660 -296954 -211017 -119348 75210 42076 -12624 -35931 -57402
6316 -57402 44317 58956 -10502 -3750 -20439 -96362 -69422 -35476 -100704 -228303 -149538 -58865
6304 -58865 -55369 -40860 -4787 -68158 -131021 -101980 -24191 -16291 -77050 -127084 -123711 -123410 -184052
6291 -184052 -136954 -73533 -46961 -59104 -73135 -98819 -39470 47898 47260 101308 45769 -39130
6279 -39130 -2664 36746 39569 -82010 -103683 -91204 -122501 -86567 -82972 -119278 -103722 -141939
6267 -141939 -143891 -62382 -129384 -118395 -10398 6372 4194 72422 145079 105163 25658 20399
6255 20399 -21408 -24707 -21701 23876 -6036 -46631 8079 115051 113089 6465 47425 66681
6243 66681 57254 -450 29115 29374 -108877 -89135 -41569 -79621 -144686 -92865 -51404 88538
$$ packed form
6327b02717j1152q2412o7379O6706Q5937R1669J94558l3134n4700k3307k1471
6316e7402J01719J4639o9458O752j6689p5923K6940L3946o5228j27599P8765R0673
6304e8865L496J4509L6073o3371o2863K9041P7789P900o0759n0034L373L01o0642
6291a84052M7098O3421K6572j2143j4031k5684N9349Q7368o38N4048n5539q4899
6279c9130L6466L9410K823j21579k1673J2479l1297L5934L595l6306J5556l8217
6267a41939j952Q1509o7002J0989J07997J6770k178O8228P2657l9916p9505n259
6255B0399m1807l299L006M5577k9912m0595N4710J06972j962j06624M0960J9256
6243F6681r427n7704K9565K59j38251J9742M7566l8052o5065N1821M1461J39942
$$ plain form
6231 88538 183844 122981 92018 96869 72764 134684 125169 63167 -18058 -21268 -71336 -85623
6219 -85623 6679 -49953 -112509 -154019 -92289 -85339 -97729 -140185 -136532 -130907 -78467 -67133
6207 -67133 -125660 -160371 -129234 -80637 -16895 -33751 11972 -24274 -85261 -116718 -160799 -247993
6195 -247993 -273980 -263914 -207950 -192850 -135125 -124920 -137168 -170425 -126824 -80218 -72219 -56433
6183 -56433 59404 -84532 -218694 -266414 -148511 -72065 26045 67887 199768 111778 47294
6172 47294 19954 93950 151639 141535 93363 127413 183530 161038 189485 106114 -42859 -79568
6160 -79568 -75968 -97348 -107378 -37195 6834 1143 17897 65519 58583 97005 54940 -53826
6148 -53826 -84146 -48152 -24895 39229 60606 -1957 -84482 -59695 -15927 -6905 -67643 15382
$$ packed form
6231H8538R5306o0863l0963M851k4105O1920r515o2002q1225l210n0068j4287
6219h5623R2302n6632o2556m1510O1730O950j2390m2456L653N625N2440J1334
6207f7133n8527l4711L1137M8597O3742j6856M5723l6246o0987l1457m4081q7194
6195b47993k5987J0066N5964J5100N7725J0205j2248l3257M3601M6606P999J5786
6183e6433J15837j43936j34162m7720J17903P6446R8110M1842J31881q7990o4484
6172D7294k7340P3996N7689j0104m8172L4050N6117k2492K8447q3371j48973l6709
6160g9568L600k1380j0030P0183M4029n691J6754M7622o936L8422m2065j08766
6148e3826l0320L5994K3257O4124K1377o2563q2525K4787M3768R022o0738Q3025
$$ plain form
6136 15382 119171 123815 46810 5402 27837 137585 168756 147188 135292 97025 43428 3393
6124 3393 22150 12185 -16352 56240 38559 -8313 49357 89535 78397 -19516 -57546 -12903
6112 -12903 -95260 -169791 -120391 -55067 -16761 -49075 -99440 -72535 -4324 44510 -15649 -184538
6100 -184538 -232415 -151471 -149929 -107310 -37719 -44706 6202 2646 -42955 -151153 -101528 16730
6088 16730 29485 -12742 -550 -123910 -81357 -89046 -160468 -184702 -176992 -100242 -74668 -132228
6076 -132228 -184050 -165807 -174278 -111194 -92467 -20241 32341 23168 -44912 -111814 -98012 -46845
6064 -46845 -45163 26686 1149 -131095 -216964 -146713 -43734 -3822 -64563 -143555 -152043 -90807
6052 -90807 -33875 -31440 9326 -100198 -90916 -94427 -38843 -30719 11274 -37032 -72235 -140359
$$ packed form
6136A5382J03789M644p7005m1408K2435J09748L1171k1568j1896l8267n3597m0035
6124C393J8757r965k8537P2592j7681m6872N7670M0178j1138r7913l8030M4643
6112a2903q2357p4531M9400O5324L8306l2314n0365K6905O8211M8834o0159j68889
6100a84538m7877Q0944J542M2619O9591o987N0908l556m5601j08198M9625J18258
6088A6730J2755m2227J2192j23360M2553p689p1422k4234P710P6750K5574n7560
6076a32228n1822J8243q471O3084J8727P2226N2582r173o8080o6902J3802N1167
6064d6845J682P1849k5537j32244q5869P0251J02979L9912o0741p8992q488O1236
6052i0807N6932K435M0766j09524R282l511N5584Q124M1993m8306l5203o8124
$$ plain form
6040 -140359 -197406 -201094 -159225 -230552 -236112 -45134 153214 164643 37577 -12204 -21919 31175
6028 31175 37415 -25480 -45359 -101210 -55455 -98048 -179622 -250368 -125109 -61208 -20069 77480
6016 77480 -15349 -25080 70578 113128 12518 32341 86669 44168 -104014 -127057 -155076 -147965
6004 -147965 -168467 -95057 -66332 8566 -19801 -39109 -22440 -5109 23126 20472 -21459 -62385
5992 -62385 -70865 3300 67377 38019 1039 55106 98492 133303 99609 71709 53450 49746
5980 49746 9396 -30866 -26422 61243 151064 69469 42016 95866 123010 164948 109155 2214
5968 2214 -65859 -62252 -50154 -98731 -55774 31649 63467 109947 82506 60060 89902 84232
5956 84232 67731 100783 -9497 16187 92163 187050 176180 99832 35180 15203 -35036 -8018
$$ packed form
6040a40359n7047l688M1869p1327n560J90978J98348J1429j27066m9781r715N3094
6028C1175O240o2895j9879n5851M5755m2593q1574p0746J25259O3901M1139R7549
6016G7480r2829r731R5658M2550j00610J9823N4328m2501j48182k3043k8019P111
6004a47965k0502P3410K8725P4898k8367j9308J6669J7331K8235k654m1931m0926
5992f2385q480P4165O4077k9358l6980N4067M3386L4811l3694k7900j8259l704
5980D9746m0350m0262M444Q7665Q9821q1595k7453N3850K7144M1938n5793j06941
5968B214o8073L607J2098m8577M2957Q7423L1818M6480k7441k2446K9842n670
5956H4232j6501L3052j10280K5684P5976R4887j0870p6348o4652j9977n0239K7018
$$ plain form
5944 -8018 80044 91033 -23555 -12338 97962 47183 -14613 -104 -14048 -32002 -99907 -79185
5932 -79185 -67593 -50160 -2623 -7225 15284 -69885 -23867 41461 -19630 -44535 -6833 48439
5920 48439 174161 187007 96804 -45464 -92648 -95661 -134101 -198527 -155632 -115918 -129165 -87710
5908 -87710 -43545 -21344 -22073 -92026 -121167 -236641 -272633 -238225 -250381 -191137 -114292 -81425
5896 -81425 -81512 -20617 -31605 -37189 -75893 -33168 14818 103124 78936 27445 -87434 -171948
5884 -171948 -114151 -78356 -89010 10662 101139 21816 -27006 15122 9415 -2291 -58676 -95133
5872 -95133 -100029 -54367 -122071 -196211 -43087 22407 6524 -58609 -66198 -53855 44710 -31774
5860 -31774 -38726 -5356 -77696 -85960 -117393 -133191 -79863 -53969 23488 18572 -34270 -13447
$$ packed form
5944h018Q8062J0989j14588J1217J10300n0779o1796J4509j3944j7954o7905K0722
5932g9185J1592J7433M7537m602K2509q5169M6018O5328o1091k4905L7702N5272
5920D8439J25722J2846r0203j42268m7184l013l8440o4426M2895L9714j3247M1455
5908h7710M4165K2201p29o9953k9141j15474l5992L4408j2156N9244P6845L2867
5896h1425q7O0895j0988n584l8704M2725M7986Q8306k4188n1491j14879q4514
5884a71948N7797L5795j0654R9672R0477p9323m8822M2128n707j1706n6385l6457
5872i5133m896M5662o7704p4140J53124O5494j5883o5133p589J2343R8565p6484
5860c1774o952L3370p2340q264l1433j5798N3328K5894P7457m916n2842K0823
$$ plain form
5848 -13447 -9914 52724 -24112 -171832 -283559 -232961 -147820 -182080 -222094 -116870 -78240
5837 -78240 -85581 -87154 -77561 -8392 87675 64624 12095 3770 13796 -57295 -16680 115322
5825 115322 54972 -61843 -25631 950 -48014 8535 4657 39764 68092 -41203 -99587
5814 -99587 -57072 -15362 -42614 -9078 -605 -1370 51896 69689 28923 -14963 -15312 57035 -16307
5801 -16307 15436 9671 -129077 -119888 5412 -21933 -130832 -196510 -226043 -269236 -200331 -152053
5789 -152053 -99307 -79123 -93115 29675 130356 80209 -26721 -43897 35412 2463 -25767
5778 -25767 37471 -44461 -169102 -248406 -166356 -179883 -173505 -150394 -142272 -161802 -69820 18969
5766 18969 -49521 -89061 -64035 -30808 62622 37845 -42715 -71301 -1739 27313 -13271 -81072
$$ packed form
5848a3447L533O2638p6836j47720j11727N0598Q5141l4260m0014J05224L8630
5837g8240p341j573R593O9169R6067k3051n2529q325J0026p1091M0615J32002
5825A15322o0350j16815L6212K6581m8964N6549l878L5107K8328j09295n8384
5814i9587M2515M1710k7252L3536Q473p65N3266J7793m0766m3886l49P2347p3342
5801a6307L1743n765j38748R189J25300k7345j08899o5678k9533m3193O8905M8278
5789a52053N2746K0184j3992J22790J00681n0147j06930j7176P9309l2949k8230
5778b5767O3238q1932j24641p9304Q2050j3527O378K3111Q122j9530R1982Q8789
5766A8969o8490l9540K5026L3227R3430k4777q0560k8586O9562K9052m0584o7801
$$ plain form
5754 -81072 -94828 -132610 -106202 -198 -2513 -50951 4757 -7394 -67406 -155879 -91168 -63627
5742 -63627 -51032 74517 119265 22040 -78085 -115044 -97701 -58034 -57960 -24677 -68112 -49513
5730 -49513 46518 45215 -9841 -8355 27967 -21355 -105488 -42754 72760 63969 107844 108204 40523
5717 40523 -84812 -114860 -45981 14936 -53411 -90738 -79580 23470 5872 34558 86882
5706 86882 113940 66884 -13461 -15433 78681 41066 81689 94430 947 -24897 -63925 -40160
5694 -40160 -32048 -114914 -112282 -78482 974 47447 22510 75493 133340 170088 59839 2075
5682 2075 -30633 3491 -33262 -66742 -144174 -178678 -146365 -178254 -184064 -132402 46692 114827
5670 114827 31275 -25343 78868 46212 5359 46895 -15847 -101214 -161348 -108302 -83546
$$ packed form
5754h1072j3756l7782K6408J06004k315m8438N5708j2151o0012q8473O4711K7541
5742f3627J2595J25549M4748r7225j00125l6959J7343L9667P4L3283m3435J8599
5730d9513R6031j303n5056J486L6322m9322q4133O2734J15514q791M3875L60o7681
5717D0523j25335l0048O8879O0917o8347l7327J1158J03050j7598K8686N2324
5706H6882K7058m7056q0345j972R4114l7615M0623J2741r3483k5844l9028K3765
5694d0160Q112q2866K632L3800P9456M6473k4937N2983N7847L6748j10249n7764
5682B075l2708L4124l6753l3480p7432l4504L2313l1889n810N1662J79094O8135
5670A14827q3552n6618J04211l2656m0853M1536o2742q5367o0134N3046K4756
$$ plain form
5659 -83546 -2333 -50886 -184789 -164894 -136017 -89764 -54219 548 -24385 -136441 -130560 -17519
5647 -17519 -48605 -94063 29399 113696 114222 89368 72150 133574 131275 131655 189237 49106
5635 49106 -7748 -66637 -63150 -66264 -88408 -34696 21904 129571 70803 44870 84026 14107
5623 14107 -74134 -112160 -120497 -219039 -204826 -195972 -107710 -102590 -104474 -103600 -82427 36666 -63588
5610 -63588 -76297 -28567 -90463 -179451 -132253 -51304 -61338 -105440 -139363 -118172 -83783 -77724
5598 -77724 -51821 -2082 46382 -26911 -63504 -26482 -6180 27786 -59149 -54308 -68302 -43305
5586 -43305 -48354 -23406 -12399 9796 23961 -37192 -9523 -11892 -13022 -36910 -141072 -125470
5574 -125470 -67362 -13580 -25295 -73656 27622 38287 58753 34653 7487 -106272 -186571
$$ packed form
5659h3546Q1213m8553j33903J9895K8877M6253L5545N4767k4933j12056N881J13041
5647a7519l1086m5458J23462Q4297N26k4854j7218O1424k299L80N7582j40131
5635D9106n6854n8889L487l114k2144N3712N6600J07667n8768k5933L9156o9919
5623A4107q8241l8026q337r8542J4213Q854Q8262N120j884Q74K1173J19093j00254
5610f3588j2709M7730o1896q8988M7198Q0949j0034m4102l3923K1191L4389O059
5598g7724K5903M9739M8464p3293l6593L7022K0302L3966q6935M841j3994K4997
5586d3305n049K4948J1007K2195J4165o1153K7669k369j130k3888j04162J5602
5574a25470N8108N3782j1715m8361J01278J0665K0466k4100k7166j13759q0299
$$ plain form
5563 -186571 -141968 -8468 24620 -56695 -21062 100804 48137 -50169 -36640 -7067 -80697
5552 -80697 -68661 -37306 53875 98140 156419 184333 73468 26840 -23678 -137022 -162064
5541 -162064 -33926 86293 121462 160275 280532 241002 118418 99489 -9885 -53182 -147980
5530 -147980 -241046 -145158 17801 -29272 -161833 -168246 -116700 -137983 -43096 -13624 5515
5519 5515 61809 10642 -69587 -23989 -101357 -136691 -95339 -56146 8181 26644 27257 16116
5507 16116 -12963 -10130 -74278 -16091 36184 67642 64605 -17845 -26358 39552 -21108 -46987
5495 -46987 -41360 -26259 -25046 29265 24592 71405 155104 147614 60976 -106376 -205422 -177149
5483 -177149 -104422 -43865 9664 76020 53532 -51049 -75532 -69688 -34767 -12486 -22429 -1743
$$ packed form
5563a86571M4603J33500L3088q1315L5633J21866n2667r8306J3529K9573p3630
5552h0697J2036L1355R1181M4265N8279K7914j10865m6628n0518j13344k5042
5541a62064J28138J20219L5169L8813J20257l9530j22584j8929j09374m3297r4798
5530a47980r3066R5888J62959m7073j32561o413N1546k1283R4887K9472J9139
5519E515N6294n1167q0229M5598p7368l5334M1352L9193O4327J8463O13j1141
5507A6116k9079K833o4148N8187N2275L1458l037q2450q513O5910o0660k5879
5495d6987N627J5101J213N4311m673M6813Q3699p490q6638j67352r9046K8273
5483a77149P2727O0557N3529O6356k2488j04581k4483N844L4921K2281r943K0686
$$ plain form
5471 -1743 -74463 -98356 -37437 15519 22312 100500 16908 -107261 -129857 -98099 -130344 -123761
5459 -123761 -4988 15166 -54472 -58391 -14022 58915 25313 -14037 -63069 -116043 -60889 49831
5447 49831 50962 5238 -25625 -313 57224 -26693 -175440 -185053 -45893 26151 -108700 -103370
5435 -103370 -108145 -122396 -50961 10450 -50604 -93863 2505 1142 -49833 53476 148670 162798
5423 162798 117171 68883 67379 163318 229748 222482 153761 40203 49359 81594 51556 -23065
5411 -23065 -65773 8085 -14440 -38672 -4885 45973 43450 71508 93621 76187 112617 63153
5399 63153 56339 36053 92426 42671 -9241 -79021 40304 110254 -3567 -6216 31002 19274
5387 19274 -74216 -146947 -112321 -129047 -147308 -99534 -80208 -135192 -144297 -52711 -1866 66015
$$ packed form
5471a743p2720k3893O0919N2956O793P8188q3592j24169k2596L1758l2245O583
5459a23761J18773K0154o9638l919M4369P2937l3602l9350m9032n2974N5154J10720
5447D9831J131m5724l0863K5312N7537q3917j48747r613J39160P2044j34851N330
5435a03370m775j4251P1435O1411o1054m3259R6368j363n0975J03309R5194J4128
5423A62798m5627m8288j504R5939O6430p266o8721j13558R156L2235l0038p4621
5411b3065m2708P3858k2525k4232L3787N0858k523K8058K2113j7434L6430m9464
5399F3153o814k0286N6373m9755n1912o9780J19325O9950j13821k649L7218j1728
5387A9274r3490p2731L4626j6726j8261M7774J9326n4984r105R1586N0845O7881
$$ plain form
5375 66015 8654 -29635 -114144 -94220 -92001 -27276 -1053 -8197 20583 32712 -28113 1079
5363 1079 69858 59405 -60056 -122630 -118317 -74771 -149052 -158479 -167321 -202328 -225461 -125986
5351 -125986 -138121 -112048 -65137 -73955 -121706 -67690 51482 100659 -49753 -147272 -144516 -84889
5339 -84889 -54675 -30510 -12266 -67195 26245 95560 129761 210128 156897 109961 125614 45991
5327 45991 32235 1330 -141941 -215071 -302307 -317421 -205313 -113923 -25451 -33821 -49802 -100534
5315 -100534 -84567 -44860 -40365 -49489 -89085 -55773 8113 6417 -15299 -51980 -113918 -130205
5303 -130205 -206760 -173223 -73734 9999 117202 137737 19078 -20675 -27519 -35259 111536
5292 111536 101739 47231 61191 -2570 50357 57793 18552 -32074 -53551 6267 -82715 -80708
$$ packed form
5375F6015n7361l8289q4509J9924K219O4725K6223p144K8780J2129o0825K9192
5363A079O8779j0453j19461o2574M313M3546p4281r427q842l5007k3133R9475
5351a25986j2135K6073M6911q818m7751N4016J19172M9177j50412r7519K756N9627
5339h4889L0214K4165J8244n4929R3440O9315L4201Q0367n3231m6936J5653p9623
5327D5991j3756l0905j43271p3130q7236j5114J12108R1390Q8472q370j5981n0732
5315a00534J5967L9707M495r124l9596L3312O3886j696k1716l6681o1938j6287
5303a30205p6555L3537R9489Q3733J07203K0535j18659l9753o844p740J46795
5292A11536r797n4508J3960o3761N2927P436l9241n0626k1477N9818q8982K007
$$ plain form
5280 -80708 -90515 -152047 -141074 -130524 -129328 -29769 -3750 -23078 53601 110257 125699 39599
5268 39599 35913 77178 121292 149333 33642 -22192 -28652 -11750 -63467 -173622 -107031 -57922
5256 -57922 -51337 -18738 -10276 6101 64462 -15187 -36069 30128 29535 23475 31203 28871 -29423
5243 -29423 -69206 -31900 -26465 77813 97163 90717 121636 79596 52504 -73078 -43411 -13670
5231 -13670 -72443 -75503 -92730 -92911 -45447 -16140 456 -15200 -5892 28216 86235 153988 73893
5218 73893 106243 91771 34680 69953 53396 98098 54978 62637 52070 -8461 5812 -50541
5206 -50541 -77960 -12611 -9167 -42876 -44305 -40838 -3929 17661 96059 149070 140793 83290 74480
5193 74480 93863 13742 99277 64008 30344 67417 121273 54239 -20643 -45881 1658 -39091
$$ packed form
5280h0708r807o1532J0973J0550J196R9559K6019j9328P6679N6656J5442q6100
5268C9599l686M1265M4114K8041j15691n5834o460J6902n1717j10155O6591M9109
5256e7922O585L2599Q462J6377N8361p9649k0882O6197n93o060P728k332n8294
5243b9423l9783L7306N435J04278J9350o446L0919m2040k7092j25582K9667K9741
5231a3670n8773l060j7227j81M7464K9307J6596j5656R308L4108N8019O7753q0095
5218G3893L2350j4472n7091L5273j6557M4702m3120P659j0567o0531J4273n6353
5206e0541k7419O5349L444l3709j429L467L6909K1590P8398N3011q277n7503q810
5193G4480J9383q0121Q5535l5269l3664L7073N3856o7034p4882k5238M7539m0749
$$ plain form
5181 -39091 -25870 -103653 -130068 -106952 -62731 -64560 -42062 -57056 -139938 -99573 -192988 -6688
5169 -6688 69061 -37179 -78781 -136505 -139425 -78884 -39514 -82955 -77276 1224 87720 108942
5157 108942 104274 -20786 -91513 -105149 -160813 -172290 -101539 -13367 -7212 28260 -50466 -83488
5145 -83488 -85966 -98326 -185434 -174832 -146735 -170203 -100288 -46683 -35377 -136120 -136156 -190786
5133 -190786 -111733 -81569 -54369 -12520 35558 52320 28486 45743 53034 45037 55764 26709
5121 26709 9322 106629 23035 -39172 -15348 -117711 -132633 -178030 -206782 -119220 -68952 -67193
5109 -67193 -106043 -85630 -123095 -114750 -150125 -186851 -187166 -38704 38304 17178 140673 101678
5097 101678 66245 39546 100165 116943 214818 170115 -9216 -29643 -48210 -93083 -76792
$$ packed form
5181c9091J3221p7783k6415K3116M4221j829K2498j4994q2882M0365r3415J86300
5169f688P5749j06240m1602n7724k920O0541L9370m3441N679P8500Q6496K1222
5157A08942m668j25060p0727j3636n5664j1477P0751Q8172O155L5472p8726l3022
5145h3488k478j2360q7108J0602K8097k3468O9915N3605J1306j00743l6n4630
5133a90786P9053L0164K7200M1849M8078J6762k3834J7257P291p997J0727k9055
5121B6709j7387R7307q3594o2207K3824j02363j4922m5397k8752Q7562N0268J759
5109f7193l8850K0413l7465Q345l5375l6726l15J48462P7008k1126J23495l8995
5097A01678l5433k6699O0619J6778R7875m4703j79331k0427j8567m4873J6291
$$ plain form
5086 -76792 45196 153273 60593 -22920 -44583 -91034 -84016 -98690 -85543 -38964 -41282 -47417
5074 -47417 24282 46101 -37584 -56916 -12078 -20721 -118572 -110033 16612 78821 8656 -691
5062 -691 82186 76604 52896 -35148 -102461 -102687 -164521 -144361 -167410 -133124 -43191 -15550 41550
5049 41550 26031 5777 95546 80210 40378 33982 -89550 -281528 -203360 -124240 -59931 -17754
5037 -17754 -36085 -7434 -67478 -50341 -42959 24353 67318 93497 -23502 -29537 -16440 -20266
5025 -20266 -96075 -60451 -102810 -83655 -22854 -50381 -150846 -163545 -146812 61041 110313
5014 110313 43699 -11010 34983 10713 -14467 -25773 -12161 20321 -40994 59293 158064
5003 158064 155072 115859 92181 121924 242197 197077 -1293 -14956 -90596 -125930 -66917
$$ packed form
5086g6792J21988J08077r2680q3513k1663m6451P018j4674J3147M6579k318o135
5074d7417P1699K1819q3685j9332M4838q643r7851Q539J26645O2209p0165r347
5062f91Q2877n582k3708q8044o7313k26o1834K0160k3049L4286Q9933K7641N7100
5049D1550j5519k0254Q9769j5336l9832o396j23532j91978P8168P9120O4309M2177
5037a7754j8331K8651o0044J7137P382O7312M2965K6179j16999o035J3097l826
5025b0266p5809L5624m2359J9155O0801k7527j00465j2699J6733K07853M9272
5014A10313o6614n4709M5993k4270k5180j1306J3612L2482o1315J00287R8771
5003A58064k992l9213k3678K9743J20273m5120j98370j3663p5640l5334N9013
$$ plain form
4992 -66917 -23816 -9260 33798 116685 58945 -84961 -120701 -63754 -37416 -11770 46583 27021
4980 27021 -62711 -69817 -55286 -19520 -28494 -45677 -7481 56568 178983 114937 73892 -1698
4968 -1698 -64185 -46806 -13740 -5931 -86324 -131171 -27007 -91526 -126817 -91664 -59010 -139660
4956 -139660 -144551 -2498 -34920 -120344 -154152 -88439 -137006 -105743 -76019 -4967 60082 183010
4944 183010 235875 202447 196422 25713 -77985 -81628 -28719 60941 79589 17026 6874 66781
4932 66781 67425 7491 -21617 14196 -78589 -163830 -145545 -83432 -80367 -136439 -71419 -31054
4920 -31054 -14328 -16600 -80654 -152076 -140887 -146130 -87620 71600 42018 -42850 -43987 -61010
4908 -61010 43557 -15580 -15628 6472 67486 52164 71349 134577 103393 107815 70484 36868
$$ packed form
4992f6917M3101J4556M3058Q2887n7740j43906l5740N6947K6338K5646N8353j9562
4980B7021q9732p106J4531L5766q974j7183L8196O4049J22415o4046m1045p5590
4968a698o2487J7379L3066P809q0393m4847J04164o4519l5291L5153L2654q0650
4956a39660m891J42053l2422q5424l3808O5713m8567L1263K9724P1052O5049J22928
4944A83010N2865l3428o025j70709j03698l643N2909Q9660J8648o2563j0152N9907
4932F6781O44n9934k9108L5813r2785q5241J8285O2113L065n6072O5020M0365
4920c1054J6726k272o4054p1422J1189n243N8510J59220k9582q4868j137j7023
4908f1010J04567n9137m8K2100O1014j5322J9185O3228l1184M422l7331l3616
$$ plain form
4896 36868 68770 107348 52701 108043 80329 -34635 -10179 17656 -69029 -147409 -214074 -142277
4884 -142277 -76147 -33873 23010 23141 -23616 -63834 -40065 -16467 -11088 -33591 5567 -46240
$$ packed form
4896C6868L1902L8578n4647N5342k7714j14964K4456K7835q6685p8380o6665P1797
4884a42277O6130M2274N6883J31m6757m0218K3769K3598N379k2503L9158n1807
$$ [...]
##END NTUPLES=NMR SPECTRUM
##END=
