##TITLE=Analysis number 319592
Compound Code btb 10358
Project Code adrs
Chemist Name fudan
##JCAMPDX= 6.0         $$ Bruker NMR JCAMP-DX V2.0
##DATA TYPE= NMR SPECTRUM
##DATA CLASS= NTUPLES
##ORIGIN= Bruker BioSpin GmbH
##OWNER= nmr
$$ XWIN-NMR		Version 3.5
$$ Fri May 19 14:40:54 2006 GMT Daylight Time (UT+1h)  MAYBRIDGE\nmr@NMR_250MHZ
##.OBSERVE FREQUENCY= 250.131544655141
##.OBSERVE NUCLEUS= ^1H
##.ACQUISITION MODE= SIMULTANEOUS (DQD)
##.ACQUISITION SCHEME= undefined
##.AVERAGES= 16
##.DIGITISER RES= 18
##SPECTROMETER/DATA SYSTEM= dpx250
##.PULSE SEQUENCE= zg30
##.SOLVENT NAME= DMSO
##.SHIFT REFERENCE= (INTERNAL, DMSO, 0, 16.522)
##AUDIT TRAIL= $$ (NUMBER, WHEN, WHO, WHERE, WHAT)
$$ ##TITLE= Audit trail, XWIN-NMR		Version 3.5
$$ ##JCAMPDX= 5.01
$$ ##ORIGIN= Bruker BioSpin GmbH
$$ ##OWNER= nmr
$$ C:\u/data/dgb/nmr/ADRS/4810/pdata/1/auditp.txt
$$ ##AUDIT TRAIL=  $$ (NUMBER, WHEN, WHO, WHERE, WHAT)
(   1,<2006-05-19 14:40:18.44 +100>,<MAYBRIDGE\nmr>,<NMR_250MHZ>,
      <created by zg, POWCHK disabled, PULCHK disabled
       configuration hash MD5:
       84 BC 41 DB A1 6E 1D 46 DA 25 12 A5 C1 ED C5 3A
       data hash MD5: 64K
       A3 E8 27 A6 E2 8D 5B B0 4B 25 47 12 F5 A9 D4 9D>)
(   2,<2006-05-19 14:40:35.61 +100>,<MAYBRIDGE\nmr>,<NMR_250MHZ>,
      <Start of raw data processing
       ef LB = 0.3 FT_mod = 6 PKNL = 1 SI = 32K 
       data hash MD5: 32K
       61 C3 1C 2A 7E 64 E3 9B 5D D1 19 BE A3 DE BB 5B>)
(   3,<2006-05-19 14:40:40.06 +100>,<MAYBRIDGE\nmr>,<NMR_250MHZ>,
      <apk 
       data hash MD5: 32K
       14 3D 17 33 7D 2D 62 69 4F 98 69 C3 18 E0 5A E4>)
(   4,<2006-05-19 14:40:41.84 +100>,<MAYBRIDGE\nmr>,<NMR_250MHZ>,
      <abs ABSG = 5 
       data hash MD5: 32K
       3A 4E FF 74 73 BC 4A 71 C2 E9 13 96 5B 71 96 97>)
$$ ##END=
$$ 
$$ hash MD5
$$ 15 19 9A 67 85 DD 0D 27 69 EA D8 1A CD 38 B7 F2
##$RELAX= 
##$RELAX= 
##$RELAX= 
##$RELAX= 
##$RELAX= 
##$RELAX= 
##$RELAX= 
$$ Bruker specific parameters
$$ --------------------------
##$DU= <C:\u>
##$EXPNO= 4810
##$NAME= <ADRS>
##$PROCNO= 1
##$TYPE= <nmr>
##$USER= <dgb>
##$AMP= (0..31)
100 100 100 100 100 100 100 100 100 100 100 100 100 100 100 100 100 100 
100 100 100 100 100 100 100 100 100 100 100 100 100 100 
##$AQSEQ= 0
##$AQ_mod= 3
##$AUNM= <au_zg>
##$AUTOPOS= <42 >
##$BF1= 250.13
##$BF2= 250.13
##$BF3= 250.13
##$BF4= 250.13
##$BF5= 500.13
##$BF6= 500.13
##$BF7= 500.13
##$BF8= 500.13
##$BYTORDA= 1
##$CFDGTYP= 0
##$CFRGTYP= 5
##$CHEMSTR= <none>
##$CNST= (0..31)
1 1 145 1 1 1 1 1 1 1 1 1 1 1 1 1 1 1 1 1 1 1 1 1 1 1 1 1 1 1 1 1 
##$CPDPRG= <>
##$CPDPRG1= <>
##$CPDPRG2= <>
##$CPDPRG3= <>
##$CPDPRG4= <mlev>
##$CPDPRG5= <mlev>
##$CPDPRG6= <mlev>
##$CPDPRG7= <mlev>
##$CPDPRG8= <mlev>
##$CPDPRGB= <>
##$CPDPRGT= <>
##$D= (0..31)
0 1 0 0 0 0 0 0 0 0.06 0 0 0 0 0 0 0.0002 0 0 0 0 0 0 0 0 0 0 0 0 0 0 
0 
##$DATE= 1148046017
##$DBL= (0..7)
120 120 120 120 120 120 120 120 
##$DBP= (0..7)
150 150 150 150 150 150 150 150 
##$DBP07= 0
##$DBPNAM0= <>
##$DBPNAM1= <>
##$DBPNAM2= <>
##$DBPNAM3= <>
$$ [...]
##$SUBNAM7= <"">
##$SUBNAM8= <"">
##$SUBNAM9= <"">
##$SW= 20.6930455092707
##$SWIBOX= (0..15)
0 0 3 0 0 0 0 0 0 0 0 0 0 0 0 0 
##$SW_h= 5175.983436853
##$TD= 65536
##$TD0= 1
##$TE= 295.16
##$TE2= 300
##$TE3= 300
##$TEG= 300
##$TL= (0..7)
0 120 120 120 120 120 120 120 
##$TP= (0..7)
150 150 150 150 150 150 150 150 
##$TP07= 0
##$TPNAME0= <>
##$TPNAME1= <>
##$TPNAME2= <>
##$TPNAME3= <>
##$TPNAME4= <>
##$TPNAME5= <>
##$TPNAME6= <>
##$TPNAME7= <>
##$TPOAL= (0..7)
0.5 0.5 0.5 0.5 0.5 0.5 0.5 0.5 
##$TPOFFS= (0..7)
0 0 0 0 0 0 0 0 
##$TUNHIN= 0
##$TUNHOUT= 0
##$TUNXOUT= 0
##$USERA1= <user>
##$USERA2= <user>
##$USERA3= <user>
##$USERA4= <user>
##$USERA5= <user>
##$V9= 5
##$VALIST= <valist>
##$VCLIST= <CCCCCCCCCCCCCCC>
##$VD= 0
##$VDLIST= <DDDDDDDDDDDDDDD>
##$VPLIST= <PPPPPPPPPPPPPPP>
##$VTLIST= <TTTTTTTTTTTTTTT>
##$WBST= 1024
##$WBSW= 4
##$XGAIN= (0..3)
0 0 0 0 
##$XL= 0
##$YL= 0
##$YMAX_a= 395939
##$YMIN_a= -490953
##$ZGOPTNS= <>
##$ZL1= 120
##$ZL2= 120
##$ZL3= 120
##$ZL4= 120
##$ABSF1= 16.522
##$ABSF2= -4.171173
##$ABSG= 5
##$ABSL= 3
##$ALPHA= 0
##$AQORDER= 0
##$ASSFAC= 0
##$ASSFACI= 0
##$ASSFACX= 0
##$ASSWID= 0
##$AUNMP= <proc_1d>
##$AZFE= 0.1
##$AZFW= 0.1
##$BCFW= 0
##$BC_mod= 0
##$BYTORDP= 0
##$COROFFS= 0
##$CY= 12.5
##$DATMOD= 1
##$DC= 0
##$DFILT= <>
##$DTYPP= 0
##$F1P= 14.0000005364418
##$F2P= -0.99999901652339
##$FCOR= 0.5
##$FTSIZE= 32768
##$FT_mod= 6
##$GAMMA= 0
##$GB= 0
##$INTBC= 1
##$INTSCL= 1
##$ISEN= 128
##$LB= 0.3
##$LEV0= 0
##$LPBIN= 0
##$MAXI= 10000
##$MC2= 0
##$MEAN= 0
##$ME_mod= 0
##$MI= 0
##$NCOEF= 0
##$NC_proc= -6
##$NLEV= 6
##$NOISF1= 0
##$NOISF2= 0
##$NSP= 0
##$NTH_PI= 0
##$NZP= 0
##$OFFSET= 16.522
##$PC= 1
##$PHC0= 161.4675
##$PHC1= 8.080435
##$PH_mod= 1
##$PKNL= yes
##$PPARMOD= 0
##$PSCAL= 4
##$PSIGN= 0
##$REVERSE= no
##$SF= 250.13
##$SI= 32768
##$SIGF1= 0
##$SIGF2= 0
##$SINO= 400
##$SIOLD= 32768
##$SREGLST= <1H.DMSO>
##$SSB= 0
##$STSI= 32768
##$STSR= 0
##$SW_p= 5175.98343685301
##$SYMM= 0
##$S_DEV= 0
##$TDeff= 65536
##$TDoff= 0
##$TI= <Analysis number 999999
Compound Code 99
Book Reference 9
Project Code 9>
##$TILT= no
##$TM1= 0
##$TM2= 0
##$TOPLEV= 0
##$USERP1= <user>
##$USERP2= <user>
##$USERP3= <user>
##$USERP4= <user>
##$USERP5= <user>
##$WDW= 1
##$XDIM= 32768
##$YMAX_p= 447066896
##$YMIN_p= -1284860
$$ End of Bruker specific parameters
$$ ---------------------------------
##NTUPLES= NMR SPECTRUM
##VAR_NAME=  FREQUENCY,     SPECTRUM/REAL,   SPECTRUM/IMAG
##SYMBOL=    X,             R,               I
##VAR_TYPE=  INDEPENDENT,   DEPENDENT,       DEPENDENT
##VAR_FORM=  AFFN,          ASDF,            ASDF
##VAR_DIM=   32768,         32768,           32768
##UNITS=     HZ,            ARBITRARY UNITS, ARBITRARY UNITS
##FACTOR=    0.157963299565203, 1,           1
##FIRST=     4132.6476996994, 0,             0
##LAST=      -1043.33573715361, 0,           0
##MIN=       -1043.33573715361, -1284860,    0
##MAX=       4132.6476996994, 447066896,     0
$$ Real data points
##PAGE= N=1
##DATA TABLE= (X++(R..R)), XYDATA
$$ [...]
26986 16843 39055 150845 197948 170748 132458 -209252 -188126 -275381 -129476 -69071 65700
26975 65700 -165590 -363258 -109571 193296 -57212 -299188 -14469 -36553 -225013 -184349
26965 -184349 -319511 -47094 -31706 -76021 -136827 -22969 -48595 55265 102314 -166321
26955 -166321 -361282 -486645 -620180 -494277 -292644 276657 417558 142127 150325 -60721
26945 -60721 -315026 -461370 -170719 -178031 -262467 -397986 -610449 -573082 -155824 -183898 -56787
26934 -56787 192333 276793 -95263 -204840 -252442 -296152 -55204 -126829 84916 361012
26924 361012 194593 -9335 171982 128410 31884 268174 441723 378529 204936 263625
26914 263625 -28012 -458792 -628319 -371354 -76839 329154 377439 315527 25465 -95380
26904 -95380 134577 162777 167328 210728 479442 533730 364456 358256 42028 -244384 25611
26893 25611 -28192 -279335 -377052 -541812 -559567 -462169 -132033 181137 -28268 -281070
26883 -281070 -157023 -329250 -633617 -764054 -566226 -148658 165978 235359 279773 336567
26873 336567 466997 512132 346809 293343 60691 -329596 -685749 -470118 -295066 -314813
26863 -314813 91672 -60996 -308917 -256775 -17087 -56133 98956 112253 -133879 -115279
26853 -115279 -69363 92426 307609 135229 -392703 -566642 -449002 -269001 -275702 -279973
26843 -279973 -434125 -429614 -159468 -89006 191897 210142 264436 116257 -155545 -206923 217472
26832 217472 301320 64799 -119825 -34319 169978 423613 357844 -24520 -159328 95168
26822 95168 147247 10841 -69768 515220 700817 34473 -290069 -14555 112552 -12745
26812 -12745 101274 429449 83750 5990 -49137 235319 11954 -111281 -50145 -97999
26802 -97999 41047 144015 61376 -191945 -234950 -361437 -664497 -925113 -661772 -551943
26792 -551943 -430562 -313565 -151625 102222 410644 547794 435873 135036 138285 -31013
26782 -31013 194937 207205 584403 495688 374080 196198 -185472 -307578 -126509 138879
26772 138879 -237077 -513491 -298676 -140827 -156347 -273834 8410 105962 122866 12140
26762 12140 34824 235708 220249 246293 273738 196665 60974 -513255 -646827 -318622 -215112
26751 -215112 11633 91316 154060 166498 173041 221739 -90724 -231356 -9784 -125283 -247024
26740 -247024 -10437 88064 343105 601884 506236 309813 494216 348720 -14266 157973
26730 157973 135907 8630 -66389 132707 -264072 -504563 -490694 -226788 103333 351993
26720 351993 244090 78574 134127 189815 149236 -95546 -266082 -347548 -123572 -190280
26710 -190280 -105055 335318 197519 363712 415604 210044 -52894 242402 380562 624493
26700 624493 587304 275298 325084 360432 71577 55621 197902 390128 394124 411159 201060
26689 201060 77826 -368215 -321944 -254890 -413934 -131524 -144261 -206335 -282 -170379
26679 -170379 -597318 -764133 -401351 -344420 -490866 -377903 -273412 -159518 -90116 -145143
26669 -145143 -313818 -484363 -565486 -746027 -1042010 -621204 -37329 285045 10021 113552
26659 113552 40561 182241 145000 213306 212223 256463 576925 296800 52420 148729 463478
26648 463478 53536 36193 211111 344689 398934 152297 127067 46195 173173 138397
26638 138397 201499 598418 428450 509271 502429 406400 376314 287013 647408 756245 447005
26627 447005 279545 762755 845052 340533 -31345 -437324 -390455 -379576 -175342 -90843
26617 -90843 -217762 -70436 -105303 -659122 -712196 -585822 -522145 -186701 -130842 30798
26607 30798 284624 118922 108557 51222 97620 17847 -19395 -62749 116063 247707 10849
26596 10849 -154095 -111453 35692 157882 154756 -344698 -560292 -300351 -402797 -589760
26586 -589760 -7442 87052 81464 237084 207686 40235 -124229 -192987 389236 164040
26576 164040 -258519 -393668 -415825 -371320 -564428 -530265 -275118 7771 129666 111406
26566 111406 12884 -85837 122114 268559 421783 207689 46930 -221023 -715447 -770428
26556 -770428 -640043 -382832 -416348 -260405 81088 51822 -273797 -355479 -176452 -192272
26546 -192272 -263328 -99859 -254383 -120337 -60624 -118512 -65619 -186368 -222462 -103979
26536 -103979 20409 -82153 -75781 51176 195031 18839 -255525 -301264 -151769 -365588
26526 -365588 -449422 -430599 -283146 -153145 -106975 -134422 32781 -228934 -361087 -270972
26516 -270972 -20880 284794 490115 339800 -280083 -249572 -61269 7914 51223 29346
26506 29346 176349 456088 330610 -27116 157014 -103200 -469972 -428961 -304724 -273039
26496 -273039 -328653 -61480 21334 62638 7634 140195 -16586 -188591 -198365 210746 511008
26485 511008 453682 149848 -196504 -31341 71539 130917 45880 84262 335150 173376
26475 173376 -183695 -108739 -33384 23104 -180903 -187002 -284635 -471570 -169700 52125 136020
26464 136020 150269 33779 -257437 -405298 -124703 276426 187898 257698 254003 48360
26454 48360 -69637 -164673 -137551 -67946 135521 548439 702644 325709 236299 440043
26444 440043 243070 -59931 -257527 -247366 -284793 -249542 -392438 -353272 -402272 -330309 -205026
26433 -205026 -229982 -234456 -115967 267907 406316 674698 444029 789750 801663 284498
26423 284498 -50261 -18671 -160741 -319780 83031 149895 -122774 -184219 95675 483799
26413 483799 662535 558069 481890 428671 237189 166650 -14496 -41022 328325 291610
26403 291610 52445 58763 -50613 -217798 -321560 -231591 -9969 57906 115376 -226129
26393 -226129 -384001 -186561 -312735 -214808 130667 289424 395329 340016 -49725 -318667
26383 -318667 -468275 -483384 -145134 -200827 -544460 -406278 -66444 148494 552064 666962
26373 666962 378589 29102 -472657 -86297 75683 -132058 -16166 332454 150651 -106061
26363 -106061 -385283 -78187 167435 300535 264581 153426 61945 236 262093 410070
26353 410070 425223 515422 687632 474244 372260 264645 275311 105410 -159629 320020
26343 320020 347583 256720 -52627 50003 427251 723339 351702 307019 101162 -80056
26333 -80056 -104200 16927 -82758 -209705 -242815 -156570 186934 228527 149185 242385 289348
26322 289348 25445 101032 36298 -459049 -381413 -392645 -701382 -464075 -181633 -299340
26312 -299340 -336416 -223216 -306363 -485180 -898305 -918506 -669264 -583259 -539436 -470828 -235498
26301 -235498 -12921 193537 368415 583859 664078 412969 338087 105885 -80970 -158418
26291 -158418 -104671 -211875 -166837 -165333 -257971 -153093 54696 113275 -214192 -233366 -118104
26280 -118104 336679 580355 376598 330881 226609 -31360 125982 276325 24979 -83220
26270 -83220 131282 240295 54617 -41179 -70636 53937 93346 183177 400920 598966
26260 598966 411682 -207450 -523235 -167007 98070 295044 207376 82378 139575 200445
26250 200445 59289 250593 143172 342789 636762 428915 23211 -230339 -295816 -166498
26240 -166498 -37487 248041 183362 -31047 67176 172839 181887 -3981 99487 -141474
26230 -141474 -417302 -110023 -82438 2981 134212 341584 15640 -423414 -355246 -303966
26220 -303966 -199338 -167985 -306557 -412370 -377314 -218156 3097 298462 477692 346717
26210 346717 485615 337267 -153753 -303839 -316541 -242567 -367763 -423352 -282815 -123599
26200 -123599 -207775 -282297 -298520 49014 99880 129538 303986 245984 381342 278177 207871
26189 207871 -117847 -634813 -761860 -254007 -244910 -80823 163543 18789 -18246 162568
26179 162568 178670 -20739 -299723 -103630 127517 -14019 -164474 -572160 -542723 -242202
26169 -242202 22120 130212 107567 239435 365935 403254 144478 175785 462653 607890
26159 607890 510537 565702 306603 275657 33094 49381 85268 -36994 -58443 39659 170357
26148 170357 235869 150797 157377 -23115 72812 274810 271983 148288 65495 258410 131056
26137 131056 241311 198041 277079 424782 316220 34437 168670 523522 407121 -11142
26127 -11142 -73095 56275 158203 319060 345482 554063 257418 -176796 -417464 -98410
26117 -98410 154295 85729 -200751 -283341 -590802 -554046 -408483 -316079 -520362 -644971
26107 -644971 -668907 -392458 -318742 -11860 121722 -71559 -398237 -798271 -816516 -448245
26097 -448245 -142028 236899 190855 -42584 -157000 -130123 -329979 -381848 -284920 -250964
26087 -250964 -460382 -346966 -137212 -304007 -333726 -381780 -166597 -130461 -157967 73195
26077 73195 415327 337878 557712 669043 596612 576773 380263 -120024 -214158 -383477
26067 -383477 -319040 -189552 -91326 264308 31838 -219729 99303 73777 115312 433446
26057 433446 321114 169692 206586 -75772 -55600 -4778 -54224 -128518 -374413 -495294
26047 -495294 -491794 -59619 289911 435459 436287 396591 439442 514845 278690 -37323 -68485
26036 -68485 209723 119132 116402 -346592 -528271 -278520 -54354 127590 150710 -34940
26026 -34940 -30283 -139803 33656 143834 218468 57888 -217817 67403 57028 -21398 -248688
26015 -248688 -109536 135668 132661 -297675 -390217 -487044 -483289 -413387 -180732 111829 144701
26004 144701 18993 159726 446607 428206 -51986 -657383 -823156 -374483 -99293 175218
25994 175218 752024 492396 159547 -44910 -272068 -32226 -49500 -238416 -240197 -79302
25984 -79302 -137104 -139905 -202861 -294062 -28756 3501 -217273 -87381 58087 15029 -8201
25973 -8201 -255866 54942 561333 840317 792140 158418 -96883 64595 174290 99934
25963 99934 -385076 -503049 -434381 -537543 -622826 -323524 -52556 -204744 -189487 -17912
25953 -17912 15971 -198778 -267926 -425429 -590474 -368695 -460799 -288507 -567206 -479243
25943 -479243 -144226 95461 -179778 -52971 -76009 4291 -86495 -385683 -404279 -695860
25933 -695860 -673472 -302902 -284891 -225058 -158511 -330754 -174769 -267151 -593609 -528136 -144646
25922 -144646 -53756 -69960 119184 156967 135574 391878 109776 -409718 -2694 277223
25912 277223 435253 172048 -55508 181467 428076 514177 82780 -108522 216564 290266
25902 290266 459080 505229 345748 12458 -347389 -275426 -75013 42544 -57917 215363
25892 215363 456654 340630 291194 401707 526461 527420 538606 250515 334538 225697 301860
25881 301860 501141 601854 361430 171477 291642 36766 -705584 -1046852 -1177102 -878671
25871 -878671 -387211 -248287 -236002 -507598 -863951 -574889 -232521 107400 351491 272370
25861 272370 205949 -271266 -400428 -417572 -301153 -482848 -403937 -219850 -225991 -413873
25851 -413873 -366920 -284691 -163749 -257105 -271836 261454 457065 435010 428973 360168 101385
25840 101385 115507 215911 121394 62138 -240 135226 76284 -121343 186223 239765 126760
25829 126760 238034 4223 -101329 239646 506300 586983 489448 488655 558192 537456 -54155
25818 -54155 -389310 -199436 -366816 -591956 -508418 -265091 76644 197861 215910 269340
25808 269340 161950 49275 -71277 -159099 -252710 70456 469443 433358 367231 354748
25798 354748 99836 109791 215284 95930 -440527 -701973 -530085 634 340677 373547
25788 373547 205301 -106809 -57806 -98479 29243 292324 176993 22870 85131 193719
25778 193719 228416 311923 369599 -159295 -403986 -405825 -241053 182716 339376 71832
25768 71832 179263 243694 293276 610167 974406 737555 589831 661192 329942 97305
25758 97305 18151 -250832 -261396 -369492 88342 353048 38384 -83896 -199896 5255
25748 5255 -47149 -314511 -333679 -367872 -420612 -78583 141054 -245411 -598517 -712023 -567247
25737 -567247 -284910 -4614 -23479 -9379 27614 -5932 215098 1979 37886 77450 -51943
25726 -51943 -80446 139376 -12098 -494272 -348123 83363 266024 178440 352189 543892
25716 543892 151287 202586 418330 894160 732448 552103 439555 359261 434526 334643
25706 334643 -17014 -173539 -98047 -134381 -115080 -67310 -113388 -89668 91807 208889 -35782
25695 -35782 -141269 -117875 -132178 -172881 27606 14966 -165085 51515 470801 439578 396269
25684 396269 108240 -34291 -20518 -202989 -356162 128079 433211 384639 190512 382922
25674 382922 433058 509635 924839 575164 359440 267685 58744 -289048 -387864 -475258
25664 -475258 -404077 -212239 -279617 -174288 322617 405200 27444 342379 513213 633979
25654 633979 577509 405135 191760 -228783 -360826 -333167 -441237 -302654 109 296408
25644 296408 396263 132393 -31414 172100 62294 71413 431791 513837 133608 -76826
25634 -76826 537763 648776 318803 65786 276655 319243 85273 124010 373924 558395
25624 558395 373406 -198443 -114203 -87754 -108261 -279676 -66441 166273 218060 77341
25614 77341 164041 159726 -107746 160372 211653 225105 187998 355506 258712 323924 220252
25603 220252 80516 69051 356495 446157 481302 351111 650333 720187 685356 576616
25593 576616 790915 829656 674943 603504 560686 557656 285562 97453 344926 527239
25583 527239 164566 -267219 -226486 -154490 -245096 46871 208186 118092 -363060 -478038
25573 -478038 -583773 -748502 -606016 -279597 54261 182488 -113544 -236199 -201565 -120932
25563 -120932 172664 387862 128424 -127126 -100591 291967 117172 21074 73724 426245
25553 426245 242047 -319656 -811523 -813822 -627738 -955046 -1096337 -720033 -784650 -793985
25543 -793985 -506270 -175968 -41708 376463 -271946 -494444 -335529 -493720 -220191 -148589
25533 -148589 17612 39146 -72560 -184345 -33572 -48188 -52719 58818 109319 181105 -219046
25522 -219046 -198957 -182212 66989 245203 50508 43964 186179 -81300 4208 -62480 -23307
25511 -23307 84229 -125809 -415379 -334332 -298911 -396916 -3248 178962 -34740 -222705
25501 -222705 118126 442755 503520 113067 84487 280306 599351 544507 89566 -71448
25491 -71448 -2880 165976 171932 271327 295561 -119032 -438266 -491367 -236272 49721 373854
25480 373854 562177 582260 206747 33352 -169411 -313649 1231 508745 595226 198046
25470 198046 199584 310497 287102 385034 341798 -70551 -193652 -143432 -238894 -214775 -53099
25459 -53099 -446230 -526299 -176629 -94297 206440 433761 456621 446037 192945 -104267
25449 -104267 -54766 106180 269180 216837 -15247 -244825 -463908 -456215 -52690 -35815
25439 -35815 -326240 -510538 -550852 -446689 -287473 -177974 -167861 -177563 56842 149367 369324
25428 369324 209412 99696 -43902 428543 470857 339973 338561 204621 52612 -170340
25418 -170340 -307143 4146 311002 528064 321776 24238 -41250 -77934 170334 373377
25408 373377 420864 476932 427524 201143 -160925 16762 415453 390895 556148 328461
25398 328461 213827 294861 44761 -263617 -457968 -242735 -313995 -417747 -263191 -327636
25388 -327636 -309247 22578 292720 199831 -192748 -150667 -91321 368784 325195 -92013
25378 -92013 -265694 -124941 -102413 -147926 -332859 -123401 117007 111794 55709 -241580 -691684
25367 -691684 -601082 -415554 -224561 -224300 -461190 -753782 -701739 -516291 -733576 -597473
25357 -597473 -288510 -89618 -2249 168315 286131 248336 -23481 58231 931 65949
25347 65949 319412 309452 673367 763776 660273 897784 790607 410198 102418 203001
25337 203001 353488 519468 -12210 -56336 -187950 -131705 -23318 -61724 209794 329368
25327 329368 -20980 343661 399302 341818 567845 661246 539800 63050 -336640 -518518
25317 -518518 -418501 -270818 -52345 19041 -270517 -561273 -468130 -488253 -213957 -42535
25307 -42535 141852 75795 -103902 -92922 47175 46967 388297 538967 601663 301092 295650
25296 295650 277124 388394 548364 564162 333115 5562 -300969 -361008 -326785 -320345 -97023
25285 -97023 21760 -179042 -204067 -53107 -52778 -307100 -652077 -399903 -119994 -73498 -129510
25274 -129510 -319929 -254846 -48210 -242211 -170789 -25408 -214294 -422093 -516589 -230533
25264 -230533 -143452 31454 82987 -42326 -196335 -483577 -290114 -337581 -602478 -639538
25254 -639538 -503072 -234507 -73087 227148 182913 -39394 -172338 -245370 -273784 -405862
25244 -405862 -562396 -627385 -593117 -559264 -498685 -707675 -757238 -583821 -309883 -79390
25234 -79390 -335239 -1041315 -1178347 -588239 -656714 -515221 -346196 -10092 -12425 -172099
25224 -172099 -375469 -274495 -83686 256118 344728 181897 236798 369622 195250 157181
25214 157181 164960 -310599 -504558 -181473 -164050 -152407 -375861 -663307 -806852 -498763
25204 -498763 -206664 47027 -2570 49533 121524 213438 -32937 -86650 59252 37626 -201093
25193 -201093 -329278 -377195 -775462 -561050 -439321 -109763 151639 -16166 167980 -51528
25183 -51528 -114563 -192253 81643 -18067 -85011 125063 -4050 -385747 -682651 -502642
25173 -502642 -190289 234909 181942 208925 -13320 -212777 -328424 -398740 -530702 -233236
25163 -233236 75485 261188 -28958 -473578 -488991 -300280 -55628 -22674 -256074 -137455
25153 -137455 -6806 -177955 -78762 134243 147793 -152661 -2943 105926 -68520 -278423
25143 -278423 -501029 -687559 -474295 -565836 -443840 -498764 -397384 -250352 41418 -1953
25133 -1953 -19127 186319 34716 -124157 5656 -173817 -229357 -140797 -145551 -173645 -155413
25122 -155413 -411932 -142769 188984 67642 296837 294632 306197 323771 450992 716011
25112 716011 955504 716878 278144 255302 221663 313314 247897 -179615 -193519 -531591
25102 -531591 -557670 -231882 280092 660486 484865 171004 -173583 -516031 -483216 -562548
25092 -562548 -493931 -210966 75911 22551 57298 222073 245303 435906 316535 116421
25082 116421 70074 -27852 -50705 -131639 -255231 -86376 102336 428107 746457 526565
25072 526565 -14058 -332126 186579 198094 -360487 -292245 -191479 -83370 -256899 197769
25062 197769 155201 61066 195276 117605 -69756 -114115 -2931 11750 -10739 32145 -144067
25051 -144067 -384688 -196533 -240393 -344624 -350482 -138543 279034 328728 398688 218371
25041 218371 397451 377536 273349 74016 179926 239908 8323 -167821 -265459 -380821
25031 -380821 -381676 -229083 -87003 52224 131129 222816 313158 340907 330914 415154 705750
25020 705750 856501 585558 -17952 -417269 -487079 -589569 -570361 -492253 -391002 -223341
25010 -223341 109057 -133436 -305613 -389895 -459834 -489024 -348514 -72544 3664 39075
25000 39075 -99917 -135538 -104701 -27248 -262492 -439698 -383259 -299239 -48590 -152091 -252840
24989 -252840 -237878 -309561 -113673 -166688 43941 218034 110312 -34255 -199069 -276957
24979 -276957 -449984 -595350 -250579 156517 82511 -15258 128405 -54994 196476 369886
24969 369886 154903 -207895 -576079 -1071310 -1088340 -847085 -386193 -434514 -419177 -408325
24959 -408325 -248850 -83529 29894 229676 113004 -8187 -240668 -415693 -400366 -330190
24949 -330190 35527 288615 -34498 -558676 -388209 -405326 -375423 -285572 36987 196100
24939 196100 188589 -232979 -410971 -234432 -223813 -161538 -4308 175657 -39451 -493673
24929 -493673 -420304 -365648 62575 267196 487054 448141 490173 314624 60213 193596
24919 193596 132381 -41852 -126470 -202678 -122282 -184803 -439334 -227011 -83959 -55690 -231910
24908 -231910 -467952 -521602 -496649 -672849 -565500 -224378 -119080 -14045 252956 52651
24898 52651 -204838 -543062 -523307 -69087 -95136 5252 231617 154029 -62713 60470
24888 60470 -195964 -330129 -449503 -668341 -710830 -527536 -274255 110375 365445 414606
24878 414606 55672 24046 115500 -5881 -325629 -397940 -314950 96509 -184237 -609037
24868 -609037 -942497 -901886 -748341 -677565 -661664 -550253 -266863 -229548 -124060 329597
24858 329597 221879 -405578 -467334 -482812 -748014 -776540 -797658 -255994 136962 198460
24848 198460 264698 90506 217561 13787 -101851 -303720 -632182 -491785 -208844 -238838
24838 -238838 -223435 -124691 -169766 -188966 -208947 17772 17871 -29006 48471 218153 266715 350591
24826 350591 364276 122816 -298246 -122039 431296 505983 270834 251091 431431 742539
24816 742539 810146 663548 384678 157564 197639 146360 3734 -14754 -109100 78161
24806 78161 -31674 -169905 -88101 -175132 -152973 -96146 176834 328392 353022 472074 558849
24795 558849 248155 -139868 -357141 -279614 18570 -80598 -155090 -132642 323807 302705
24785 302705 -103125 -387163 -493871 -226920 -160600 -249592 -330149 -486398 -121342 -117762
24775 -117762 -183951 37072 -218726 -591197 -168289 142020 14150 -3910 195520 105846
24765 105846 -84066 -402145 -434418 -429772 -411710 -241634 -138693 -215763 -385670 -257737
24755 -257737 -161055 -163714 308455 316415 -238353 -288267 -197127 -106601 81315 46154 -125716
24744 -125716 -14584 53180 -108608 -246104 -67794 318767 650517 647214 147820 -184691
24734 -184691 -129262 5435 -215103 -356788 -208228 112216 573490 916230 922502 698963
24724 698963 496130 601620 688547 471775 56513 -210271 -245381 -66542 235232 128513
24714 128513 -135635 -235345 -235705 -151668 -87763 2778 -99359 -11260 362000 245435 207290
24703 207290 253323 -29374 -368669 -338598 467 324082 94257 -140816 -264349 -344710
24693 -344710 -595029 -674060 -485986 -301851 35356 484334 311083 28149 -128983 -145494
24683 -145494 -315843 -103720 91196 249496 358377 83980 -85274 113849 304590 247430
24673 247430 324627 376725 158989 108219 224545 195295 156330 1797 -380800 -333002 -165004
24662 -165004 -264879 28478 -142928 -280789 -175300 -210439 -225798 -348261 -705841 -839616
24652 -839616 -628259 -423641 -181370 209182 197596 -212620 -256873 -237430 64406 293933
24642 293933 334549 201691 240143 60439 -139563 -314799 -445469 -509030 -741815 -445548
24632 -445548 -343978 -489528 -440834 -295887 -316783 -537729 -753977 -415123 -330910 -617739
24622 -617739 -406793 -46268 -68837 -40304 58449 -59778 -201991 -436501 -340261 -313477
24612 -313477 -504729 -365906 -116423 -123926 11436 -220177 -331027 -175619 -85212 11244
24602 11244 -58715 -331475 -230014 -49167 147489 251091 85188 -102627 167299 488879
24592 488879 642456 506286 482417 281539 198337 -52853 44886 36389 -813 170795 243415
24581 243415 625103 592850 578099 453019 464191 358964 300702 -107238 -313638 -211197
24571 -211197 -257455 -235310 -351176 -422744 -430974 -76735 31102 80722 275140 240532 129940
24560 129940 -16423 238492 640315 404507 185162 199910 -74836 -75287 154352 221947
24550 221947 404330 407171 392019 70112 -150113 -284083 -368077 -363787 -90506 -49670 -45113
24539 -45113 -200705 -317844 -16257 40809 -63382 166545 348562 296838 -83032 -439995
24529 -439995 -366629 38999 214834 -415535 -757264 -530054 -531465 -526895 -327867 -237348 -153763
24518 -153763 57814 12892 -274003 -195320 -368836 -384501 -774230 -770144 -448752 -566375
24508 -566375 -427412 -342955 -287280 -702981 -735025 -558910 -647722 -236293 198515 372452
24498 372452 214749 1741 -244664 -332788 -78866 -51686 -39642 -130902 -479086 -419567
24488 -419567 -423964 -477129 -346860 -186905 -221721 88890 391846 243314 -42474 -116485
24478 -116485 196854 388696 84812 74695 78316 346870 419906 -72215 -339680 -103271
24468 -103271 -59846 -21088 -216988 -274196 -39132 161279 9521 -135781 252578 381042
24458 381042 -32718 -247861 -320346 -410230 -425002 -176105 -200753 -423231 -275493 -138258
24448 -138258 25246 149592 -54643 -151168 -23941 374021 121534 22593 62534 -345718
24438 -345718 -333800 152037 417363 -70261 -112922 -156129 -347566 53538 299484 481261
24428 481261 240738 270803 38229 -455684 -595986 -72892 105387 26120 -23366 -284401
24418 -284401 -554109 -321145 -61636 -117114 16349 205406 390388 434413 108501 -22548
24408 -22548 -245056 -106422 -147900 -373027 -218492 -109104 -649739 -620866 -611418 -754612
24398 -754612 -724766 -222956 -245821 -263450 29806 220543 118467 -82561 -481259 -608734
24388 -608734 -448859 -317100 -312999 -237481 -307158 -298936 -388656 -459387 -381007 -338310 -383185
24377 -383185 -599843 -670762 -599405 -444535 -258885 -332916 -316184 -407644 -542108 -144649
24367 -144649 337795 396465 85008 -234600 -258838 -540219 -615733 -566492 -663030 -592759 -286014
24356 -286014 -118137 84197 72351 -250404 -633965 -594271 -187208 168628 92711 165288
24346 165288 277943 378311 223536 -20738 -252910 34276 129478 -58610 -62409 -141578
24336 -141578 -85382 -184899 -546772 -652111 -270268 -121642 157721 379584 166166 -54866
24326 -54866 -56712 193113 66294 -455325 -643621 -646553 -467749 -216798 -115757 -127594 -12935
24315 -12935 -106661 -89503 22092 428616 384276 397556 440119 39546 -170147 19372 416907
24304 416907 356856 457078 412736 200617 63087 -12213 65835 188459 181773 157228 277441
24293 277441 -167082 -181687 -103872 -100460 35167 328705 544316 489795 -40785 -351526
24283 -351526 -457786 -643576 -680813 -688832 -428767 -450541 -608212 -535656 -291398 -135313
24273 -135313 -143198 -80292 -195984 -326276 -366418 -411701 -464731 -420733 -568991 -814252 -477101
24262 -477101 -273228 -262927 -36237 -93031 -470935 -833222 -735703 -317433 65721 26299
24252 26299 -338381 -237941 -6997 87878 17257 498422 655185 575325 459775 140628
24242 140628 115419 165334 200571 219317 164651 9763 -302265 -404794 -78013 507660
24232 507660 426744 32827 -173710 -222723 -235297 -194285 -373056 -421791 -532654 -659255
24222 -659255 -508352 -325424 -106011 -128286 -299419 -333559 -296257 -324595 -351643 -205751
24212 -205751 21375 55515 -45857 -380423 -308271 -261936 -289070 -191068 -325877 -587520
24202 -587520 -561052 -282281 93398 117982 121481 101373 64603 -193341 -580988 -525189 -888586
24191 -888586 -632119 -338478 -204081 -250908 313275 368180 88294 197901 185346 7354
24181 7354 8541 -246377 -204650 -167399 -20181 83844 -11553 -456864 -506503 -430265 -420118
24170 -420118 -161120 109682 336807 428863 402978 234080 184758 274923 410743 65024
24160 65024 -283168 -412643 -70732 -391588 -468216 -559182 -167132 -274054 -276470 -128341
24150 -128341 48305 45499 407845 387982 435245 422954 577634 266543 41032 -221515
24140 -221515 -505249 -446578 -83369 195373 -13247 -491830 -469191 -63587 40623 -264768
24130 -264768 -393933 -359785 -420643 -402310 -61436 125768 130762 -198330 -300776 -148767
24120 -148767 5457 -75170 -253579 -402163 -521079 -215062 -135986 -243243 -191198 -37883
24110 -37883 -26089 225206 -27116 -433017 -372024 -245151 -58534 176798 42544 -346494
24100 -346494 -571268 -306988 -106781 -88517 -290748 -199176 -26834 165372 -119033 -514781
24090 -514781 -413777 -363320 -396535 -473221 -461620 -385783 -200159 -96985 -90826 -232312 -259042
24079 -259042 2636 271649 236202 63173 -334229 -181041 -132668 31042 470524 258324
24069 258324 46688 -170794 -296269 -282523 -100358 -117790 -222063 136769 274871 48545
24059 48545 -156453 -492492 -351876 -138402 -139162 68016 57631 -226372 -218387 67431 -112758
24048 -112758 -241256 -277147 -253003 -54391 52433 85579 -298877 -492061 -215613 -7291
24038 -7291 691920 661317 346615 239711 183099 -256428 -642175 -799222 -562942 -251972
24028 -251972 242126 -87199 -325495 -339672 -266273 -64885 137987 42028 175726 378461
24018 378461 408988 84329 -179071 -84975 220853 504428 301650 33821 198878 233081
24008 233081 120751 131624 195842 -85400 -411784 -387639 -156801 -157828 -501866 -453960 -26181
23997 -26181 387451 474756 521577 257344 -28057 -294704 -449112 -513152 -551133 -191882
23987 -191882 110382 121388 33450 203562 174226 -52191 -242501 -104686 -79965 248408
23977 248408 468444 49921 -280219 -452659 -607270 -409931 -310692 75873 587759 223343
23967 223343 56862 85999 -95178 -73241 34717 78258 159904 -136871 -288052 -546003
23957 -546003 -307720 -17480 129903 265711 292609 -70069 -589611 -670016 -453930 -402699
23947 -402699 -431018 -414480 -460026 -413049 -417837 -606210 -719308 -822126 -1050283 -1098170 -954121
23936 -954121 -905688 -757166 -456480 -454625 -237935 -180069 -313291 -604700 -649298 -503048
23926 -503048 -262934 -195639 89004 547188 733755 659310 205001 -195722 -490628 -723949
23916 -723949 -928746 -603862 -428244 -240557 -147003 239363 193439 79277 -66463 -378822
23906 -378822 -138729 121169 255752 317890 182262 16920 91323 -111059 21262 29190
23896 29190 54561 108689 34184 60278 -34230 258196 311339 261805 -127622 -308217 -272220
23885 -272220 -435410 -464602 -158960 78957 -109962 -595355 -855497 -583905 -338096 -483258
23875 -483258 -536264 -306136 -239561 -590212 -563682 -194373 -322250 -279963 -274204 -254424 -399666
23864 -399666 -724199 -599229 -467871 -315211 120753 286321 130935 -90463 6738 -31749
23854 -31749 -56394 124819 184372 34557 109801 249395 299681 482499 659255 401616
23844 401616 147075 301340 402634 229753 -158271 -558871 -629478 -191825 -63323 -282997
23834 -282997 -360750 -438414 -443247 -272502 -143179 -94116 -271638 -434964 -414985 -160830 -246926
23823 -246926 -189096 33331 -150327 -64347 -106161 -264501 -94397 -255009 -366316 -452088
23813 -452088 -504020 -667939 -801291 -789164 -446036 -233555 19862 111369 -15825 -10338
23803 -10338 -38535 -277664 -453169 -525543 -369831 -265174 -40453 -143040 -201648 -67942
23793 -67942 -186865 -701093 -776247 -386164 -495838 -732141 -643615 -449535 -318863 -260764
23783 -260764 -461778 -383251 67594 -48649 -331762 -621620 -630658 -549568 -401484 -160116
23773 -160116 -11041 -117104 -234199 -220469 -418412 -565917 -457022 -399399 -194211 323489
23763 323489 415606 399021 19927 -349368 -434899 -438445 -610627 -722274 -666329 -553358 -475156
23752 -475156 -328270 19469 -90284 -291293 -258875 -85442 350499 279235 115595 160831
23742 160831 97512 169723 462897 194045 9357 -394690 -440022 -209172 -146739 -318987
23732 -318987 -451425 -43381 79390 -162516 -317152 -490808 -349585 -78433 -172881 -298692
23722 -298692 -299881 -150851 -160371 175231 456111 490024 337761 274544 -151253 -369751 -332489
23711 -332489 -20556 -116963 63560 -136535 -545717 -172500 439516 570599 364480 255972
23701 255972 -146530 -183236 120508 194974 -107614 71234 -74254 -137133 -76997 -176482
23691 -176482 -151567 145138 -49351 -271302 -353382 -388507 -184078 -144948 35738 272718
23681 272718 213045 -73637 -257771 -184646 -103873 10968 -101761 -97577 -141864 -584687 -895921
23670 -895921 -688417 -342788 -177681 -368422 -506324 -454684 -99175 6733 -318932 -308535
23660 -308535 -483230 -581256 -615890 -514899 -268763 -163177 -250760 -151753 -290379 -563399
23650 -563399 -433797 -287083 -249536 -258686 -300318 -70572 -85550 -368067 -798786 -807644 -586209
23639 -586209 -371472 -250124 -108680 -51004 -107485 -60942 -423763 -398476 -481373 -359640
23629 -359640 -249281 60539 74346 -209273 -312200 -517528 -480892 -367546 -480336 -492132
23619 -492132 -246358 80159 77704 -288663 -328420 -84938 119811 229035 55300 -448732
23609 -448732 -452593 -46548 380942 678100 355262 -44230 -339909 -475729 -402141 -364271
23599 -364271 -442421 -595939 -769345 -911436 -651246 -434942 -185423 -50135 214050 129133
23589 129133 171567 242221 149661 161896 199465 65628 253666 625484 610408 425052 -22218
23578 -22218 -373689 42704 136064 244206 380778 261622 156157 141983 -55404 -435698
23568 -435698 -458726 -229601 -106091 -241930 -277089 51069 -315071 -522905 -424766 -631609
23558 -631609 -664152 -736075 -661739 -603767 -405139 -70189 -125383 -132240 -407001 -459817 -280792
23547 -280792 -182088 -274365 -381505 -375364 -456979 -348538 -263474 -473186 -405455 -328081 -363052
23536 -363052 21944 430357 741028 633383 287465 175306 244066 209933 322090 200040
23526 200040 370737 464176 680989 352434 9226 -166515 -229820 -202342 91592 -28578
23516 -28578 -173494 -80122 -208953 -258611 -75481 -37290 -36705 -69184 -200953 331057 415588
23505 415588 107471 -240376 -439096 -746043 -751238 -462612 -423317 -605437 -334878 371723
23495 371723 674128 845034 590592 325850 94414 -267687 -176100 -190314 -413546 -454513
23485 -454513 -455874 -331499 -372447 -263631 -328350 -810349 -373095 -10024 326009 321537 -81531
23474 -81531 -156908 82794 2925 22476 -128903 -175989 -386563 -352217 -232179 -173389 -28147
23463 -28147 72210 337488 412552 349002 194681 -162307 -205718 -216069 -171349 -114413 -209890
23452 -209890 7326 19298 -44716 -290072 121679 333854 206876 -79521 126793 -157550
23442 -157550 -245700 -284728 -693747 -638540 -328014 -242136 -144516 -409789 -353807 -151091 -20511
23431 -20511 -200999 -188545 -408012 -502887 -328795 69666 303900 459778 823448 817399
23421 817399 472844 324112 39968 60387 319340 168315 -28224 -100660 -258519 -596906
23411 -596906 -908245 -673663 -506089 -112034 -22388 -265966 -429616 -446798 8560 316160
23401 316160 409379 119774 -192378 -339408 -295306 131831 495183 486198 341876 126852
23391 126852 171146 123020 41986 218133 60585 180303 421530 508889 462114 359592
23381 359592 201778 -43423 -183533 -304035 -324702 -454178 -415822 638 55857 -254471
23371 -254471 -225162 -357268 118851 397980 482398 217072 55527 207478 271751 110645
23361 110645 135219 -192465 -248789 -96794 -138758 -331569 -229684 -471555 -213040 -163831
23351 -163831 -452328 -286495 192447 219104 95167 136291 -108390 -288963 -398993 -61589
23341 -61589 45908 -229107 -182019 -108345 113187 119736 -148719 204127 356028 198659
23331 198659 -11843 -150082 -130124 -256579 -205516 -112842 217137 -168064 -429432 -421275
23321 -421275 -557865 -480460 -621346 -372421 -2398 113602 88238 295359 233904 -65279
23311 -65279 -410962 -208918 133723 174459 -255839 -173858 -78756 -252345 -18719 69042
23301 69042 -101293 -123988 -181060 74500 -112045 -302455 53498 232195 80631 -101809
23291 -101809 52739 -147255 -103140 -135191 165951 78838 353852 247965 -195224 -537891
23281 -537891 -266674 -50013 118937 310723 167570 -98631 -97630 -253874 -338273 -257032
23271 -257032 -148485 29017 -249184 -590836 -547334 -122787 -205113 -526904 -728729 -724218
23261 -724218 -300215 -120466 -138077 -427515 -429019 -627663 -694614 -652735 -638379 -98524 7841
23250 7841 139465 -167002 -604617 -821070 -639315 -339026 -251442 -477111 -427646 -684733
23240 -684733 -898736 -1133277 -1018083 -676522 -618157 -325537 -314589 174207 183247 -233006
23230 -233006 -86334 85388 162448 320785 237161 5262 96996 64986 24056 -144588
23220 -144588 -200445 -365808 -395309 -474030 -397070 -50295 328748 265620 311947 154657 90648
23209 90648 -24014 -123299 -122261 -247898 83822 230268 35055 -542348 -896984 -854423
23199 -854423 -673891 -301852 -233754 169027 -14641 -329455 -589282 -622996 -937520 -968748
23189 -968748 -767234 -343408 -258089 -660788 -823871 -438919 -123744 -70071 -94612 -129592
23179 -129592 -7157 65080 215792 289207 520494 170567 -293757 -525203 -219072 64502
23169 64502 151266 35683 -327732 -644028 -710314 -585871 -445409 32225 -196602 -336988
23159 -336988 -308912 -164820 -257586 -242372 36587 82200 -72196 -69983 205236 204500 388169
23148 388169 379988 360894 -15744 -247981 -450405 -456094 -343141 -329774 -501699 -508838 -321273
23137 -321273 -197750 -36369 -68408 -238041 -242677 -130042 195791 129187 -91193 -80580
23127 -80580 -311679 -707350 -621790 -664111 -401416 -163872 -118733 25466 53900 244561
23117 244561 452016 496826 554251 544233 541397 138762 59293 371113 450125 214620 2164
23106 2164 -497768 -266817 43669 -117600 -133248 49128 -75197 -339647 -381235 -328467
23096 -328467 -71287 40833 29275 -128716 -178088 -250040 -43096 527051 566127 506189
23086 506189 270562 -27720 -418829 -340441 -420269 -330700 30866 306130 -43186 90713
23076 90713 206582 -192146 -722912 -348507 -105535 -195638 -477427 -439713 -443344 -301601
23066 -301601 -407788 -573528 -458546 -76009 393783 169983 -16589 -95327 -41160 167638
23056 167638 389835 265221 -73208 -308261 -156015 -58459 -72679 208971 111135 -167377
23046 -167377 68735 378966 502947 269319 -184074 -160093 -359422 -384305 -326472 -663413
23036 -663413 -564597 -185708 -48098 191065 229166 412051 385039 519492 519099 439937 134003
23025 134003 181423 260141 212187 -168287 -144084 -313874 -629116 -1099852 -884225 -549482
23015 -549482 -179064 -198622 -399940 -133498 398417 249 -636866 -774477 -533789 -158493
23005 -158493 -188528 130518 187350 267780 335312 -165144 -294193 -314532 -645628 -638847 -383911
22994 -383911 -455506 -368865 112232 247157 151407 -278550 185895 520648 356769 102700
22984 102700 120061 -67957 -175144 -111300 7542 4686 46246 -179550 -287389 -149567
22974 -149567 -54811 221111 246198 -54993 -401332 -458536 -223259 -509343 -521718 -846298
22964 -846298 -483679 86807 -182976 -582384 -657367 -610231 -636041 -569928 -104917 -134126
22954 -134126 -151318 108199 119430 115295 32080 -228955 -438654 -275403 -192457 -288656 -344295
22943 -344295 77143 53981 -104797 -375213 -369750 -232219 -289433 -419670 -197843 134240
22933 134240 263323 189259 337577 191961 42342 147152 76577 -253172 -246536 -83674
22923 -83674 -101836 -46478 25036 141976 70251 277948 93373 -295504 -178484 -98606 234904
22912 234904 426923 112948 -344482 -667820 -524218 -524464 -210732 -152984 -179806 72074
22902 72074 276403 348877 300592 49775 -247465 -351929 -250940 -420348 -478234 -465280
22892 -465280 -328243 -176903 -262941 -10400 8989 -230047 -537259 -446498 -287268 -257135
22882 -257135 -385490 -343118 -6237 170097 109173 263915 661010 229835 -28531 111095
22872 111095 -9217 -196029 -195169 101037 268897 523869 127049 -322914 -581113 -562643
22862 -562643 -392100 -154190 -147012 -321081 55189 75503 -238732 -220949 51549 -13427
22852 -13427 -109606 -258877 -251156 -19359 40429 -208977 -461597 -434399 183983 59873 -70330
22841 -70330 36247 -149157 -351509 -585904 -149967 -44833 -6538 168160 135151 -157997
22831 -157997 -180217 -270852 -504328 -366546 -308938 -331724 -159849 125005 32265 -306840
22821 -306840 -399418 -285058 -300915 -128471 152165 294703 269160 384125 80988 -69146
22811 -69146 -122339 -170237 -172947 19597 -96362 -419139 -477350 -97153 153772 37868 -23696
22800 -23696 -254545 -122776 -223822 -534291 -483414 -336969 14673 263823 267355 107014
22790 107014 -109634 -167560 -222655 -96204 294316 219602 84171 -88432 -165666 -189372
22780 -189372 -449085 -497666 -424178 -330359 -269085 -108312 -125698 -486750 -315380 69102
22770 69102 50848 18672 -86826 -77867 -87582 -183651 76423 107069 26276 18392 -149513 64535
22758 64535 233911 65632 -199932 119426 -101336 -259312 -899350 -441101 27921 368047
22748 368047 576709 411441 360418 302259 455612 457114 70476 62035 -124848 106873 78680
22737 78680 511 -15750 -128621 115076 130082 -94724 -175309 -80709 173282 53776 64461
22726 64461 -63394 -86789 76036 -27810 -471263 -622844 -473934 -586581 -860366 -693741
22716 -693741 -257908 88501 172329 -648 -305955 -578423 -534302 -408262 -133422 -288174
22706 -288174 -530699 -470357 -28588 -114688 21616 -141280 -250158 -178916 137699 405641
22696 405641 180736 141140 69256 296373 376595 -8628 -103429 -156740 -345151 -171737
22686 -171737 -52616 -248505 -302599 -43468 -432275 -391399 -335068 -437113 -263100 -26428
22676 -26428 262731 195337 -24149 -281578 -234332 -141624 -234443 -144745 127134 248536 154791
22665 154791 -139484 -212251 -86149 544654 210960 -159456 -382918 -433716 -114625 -150884
22655 -150884 180405 -54752 -13916 291486 270847 -86810 -12966 106062 69724 22859
22645 22859 28968 268770 186489 -147378 -421281 -544750 -405276 -82717 105902 113475 161819
22634 161819 64036 -46434 -163399 41188 235976 188564 -349096 -445511 -360973 -333994
22624 -333994 -154899 -66573 -20671 68415 -183201 -390604 86313 65752 -183743 -202074
22614 -202074 -22155 97655 223498 257672 174133 -116946 -334995 -572917 -482279 -403873
22604 -403873 -171275 93776 -177138 -252494 -27141 231994 -23080 -700 -41079 -86026
22594 -86026 -368661 -488275 -293085 -330882 -244734 -146847 16739 193089 329964 57543
22584 57543 -307033 -655820 -598909 -275759 -148746 -161828 67813 82271 261067 102143
22574 102143 242067 225267 -109331 133433 315854 348793 410225 317424 282719 64697
22564 64697 -96908 -114701 -55201 -182091 -189194 -146115 -134068 -389072 -416626 -324537 -188770
22553 -188770 -17534 -250501 -665936 -482239 -194264 38643 234730 -4698 -389440 -361270
22543 -361270 34210 303517 632542 584504 399903 168826 -176564 32657 248136 351741
22533 351741 369192 363089 247349 -34404 -173201 -523673 -550093 -626143 -487718 -328162
22523 -328162 -423372 -464047 -173600 17523 6917 -147202 -265143 222230 616457 556215
22513 556215 292010 42976 -201517 -483236 -514152 -200085 -153910 -412828 -605422 -226383
22503 -226383 -494040 -633244 -691913 -539358 -404586 -631806 -618600 -384982 -58209 -161037
22493 -161037 -139339 357605 655992 665896 627710 626526 632490 243344 -317933 -299810 -251861
22482 -251861 -124073 -173986 38307 290902 16908 -468021 -500037 -471763 -457060 -215959
22472 -215959 74123 -129274 54737 59171 -170177 -371533 -386104 -395643 -2760 96856 29660
22461 29660 1838 42196 110909 123648 108933 77919 50019 -49934 115150 457020 744294
22450 744294 801939 454012 -67591 -24459 490194 432834 167173 231125 205610 -83384
22440 -83384 235519 221190 248109 330161 196034 -73006 -211921 -99199 129060 -50556
22430 -50556 -351124 -138589 -17224 88265 105958 162146 143849 -111794 -102265 46808 48256
22419 48256 381152 478739 429563 255015 133807 101614 211403 406627 473882 333089
22409 333089 104961 -80796 -182426 -390343 -638010 -722463 -446684 67058 37562 -173757
22399 -173757 -221657 -183549 -196304 109983 278213 454352 395972 324790 205602 52530
22389 52530 -34442 188063 621898 237897 -208160 -293488 -223956 24445 -49629 -145022 -374613
22378 -374613 -476216 -306112 -128358 -134151 -245891 -456558 -397405 -302724 -217596 -305567 -281909
22367 -281909 -107331 123063 278596 151989 178953 99232 136879 331108 448942 225309
22357 225309 -107238 31888 -185909 -193239 -223388 -134982 -117692 -93553 -240992 43168 372167
22346 372167 452254 238832 277877 384649 465558 297054 161153 -40244 196126 485671
22336 485671 339675 -122615 -165323 -125404 -136574 -120722 -28863 -225159 -70654 -25592 174884
22325 174884 242843 -38428 35153 232689 560957 223566 -157181 -315917 -265362 -21370
22315 -21370 95360 155542 204627 395042 238125 69822 15036 -9534 8961 -81299 -340478
22304 -340478 43523 115712 68079 45961 -15883 -156095 -312502 -334420 -357484 -489816 -471170
22293 -471170 -261213 -20823 -344250 -396963 -394785 -44862 160185 332199 434836 416750
22283 416750 445676 630921 744580 606724 694077 714501 251218 -71474 -138968 -295546
22273 -295546 -351495 -44575 -164451 -363926 -391484 -142605 28740 282700 331254 323566
22263 323566 200587 150996 124181 406396 253211 156867 469279 250944 186911 -135118
22253 -135118 -157337 -186455 -268776 -59128 -172087 -425052 -207062 144608 163200 144073
22243 144073 -174543 98351 -12271 -164848 92372 254459 127938 489392 709163 474451
22233 474451 292071 -199806 -319364 187002 622429 500022 122753 -180763 -230591 -270918
22223 -270918 -687064 -821619 -286361 -90037 -48405 79459 236577 508148 41506 -555102
22213 -555102 -673411 -593012 -237433 -201297 -151813 -76729 145953 235916 207847 -62639 -402923
22202 -402923 -252168 217680 436728 559177 672014 692233 622716 379640 15811 -288886
22192 -288886 -184820 4768 228162 248863 -148249 -188436 -246783 -127066 -176136 -173670 36862
22181 36862 -161198 -86245 179048 45988 -92120 -182848 -4613 -116180 -274000 -152565
22171 -152565 -246077 -290804 -40802 41675 -13442 79177 -242192 -616636 -389794 -253601
22161 -253601 -313962 -209129 -171312 -212746 -100270 124354 -47668 -165753 -88148 -100892
22151 -100892 -178443 -98299 131161 346602 -23315 -108079 50697 165122 226864 25666
22141 25666 -177081 -46686 195232 270320 155927 9498 -115504 -250279 354957 371942
22131 371942 541290 709686 450880 190779 92272 -34225 -69827 -220098 -139776 -62155
22121 -62155 34442 166514 109155 -82936 -140340 -569306 -443596 97772 -359986 -329587
22111 -329587 -263373 23458 -92841 -141099 -80334 -94605 -207172 -470793 -762265 -483446
22101 -483446 14011 255300 431105 466975 640095 813591 928657 677368 631901 423465
22091 423465 406180 679523 451800 317670 300600 -99114 -379392 -476540 -530232 -40663
22081 -40663 147258 161786 375559 481983 248559 297958 -14388 -285184 -251869 -70038
22071 -70038 297158 129339 137952 413613 375017 445951 664075 739843 535756 281778 143563
22060 143563 186327 150034 76628 214245 171753 238040 574149 378898 212008 11936
22050 11936 219547 285185 173807 281752 411349 401116 705772 751507 505334 196569
22040 196569 51134 236563 382555 308868 224829 258263 247313 463551 255284 -315467
22030 -315467 -393736 -334167 -169598 237227 459708 530114 361934 215805 422347 788061
22020 788061 752393 615079 418593 -287859 -493901 -487795 -662199 -319033 -240913 -397039
22010 -397039 21016 330810 242595 -112300 -245887 -418373 -824563 -740749 -32085 233230
22000 233230 472378 183550 -222495 -285613 -210800 -473623 -695944 -753628 -580190 -483419
21990 -483419 -59955 54768 -52039 -31771 -26007 44633 33930 206487 511558 142245
21980 142245 199596 60887 -23874 -22702 307202 90703 111057 95555 143053 82565 -151445
21969 -151445 -15894 276420 125672 -133816 33722 238438 100373 -221121 -76983 -73853
21959 -73853 -309102 -208244 57703 162700 453376 478802 326690 235420 36740 -12877
21949 -12877 104487 30948 224443 488362 497379 559552 407264 453780 492493 512142 138213
21938 138213 37750 403928 601091 429109 468076 565130 687445 970164 969160 635599
21928 635599 200840 -410873 -616199 -451291 -302268 -286980 -234391 -370748 -156212 7535
21918 7535 -64676 -20900 -123158 -143089 197272 450038 453514 121529 161499 20723 -206785
21907 -206785 -267392 -346168 -454914 -260848 -243168 -54512 281834 623297 743105 494603
21897 494603 427088 306866 149421 235037 274412 197448 81004 373940 804464 646982
21887 646982 267937 280781 140219 373308 572298 537202 713358 589401 588795 687196 586154
21876 586154 444462 545796 564806 527599 264842 -247402 -188017 -305333 -115917 336095
21866 336095 689888 862766 765785 638738 428420 506502 813795 944305 808933 503063
21856 503063 158394 16535 347280 404278 294091 483811 322063 92740 -32969 209649
21846 209649 501006 630136 563650 867056 802072 391594 -104402 -419263 -577265 -566195
21836 -566195 -392798 55883 488756 442119 650829 615105 578796 332162 110288 -4382
21826 -4382 541263 496674 411018 367794 633654 523723 123089 -147551 -90879 -20730 241681
21815 241681 395024 263240 145645 25110 17772 330612 654194 440115 14867 -59149
21805 -59149 116390 317141 645725 505589 160198 46316 99025 -19780 186296 440610
21795 440610 565302 248933 198016 307861 517072 505079 487635 595239 885369 809527
21785 809527 234608 194825 381839 626349 727764 713158 612905 852836 621996 193614
21775 193614 -91208 -76020 44908 -16898 -11388 284885 476201 596506 290276 89239
21765 89239 33048 138416 283046 207949 279788 501571 567644 390843 281171 192396 368723
21754 368723 208577 383114 556293 670699 523369 186302 10605 71783 567454 814733
21744 814733 782281 626948 408520 582436 937835 709112 517738 398513 430562 230743
21734 230743 25632 196363 313508 352380 202141 107586 318975 358766 522240 727053
21724 727053 706678 549601 321386 376148 667106 479462 360154 221734 169184 19311
21714 19311 179162 107899 48688 270287 254484 621430 886215 865852 729910 815382 422383
21703 422383 345316 235376 193510 225722 380281 363725 85072 374283 647910 622848
21693 622848 685850 691972 409702 377189 637600 929644 897009 804757 463570 477738 519079
21682 519079 763861 636050 322092 483207 589069 934077 1154072 879087 930998 657196
21672 657196 394036 415484 201182 371223 496025 445710 588470 813577 923958 831586
21662 831586 595189 341471 36876 739863 1189199 759370 338044 73730 220736 232614
21652 232614 486266 695316 739776 542065 198789 140776 236781 540699 660050 285193
21642 285193 467693 374412 304750 403771 409339 807643 747001 661015 756941 995160 994858
21631 994858 667188 540921 732238 640604 528907 447114 390126 97593 47370 1374
21621 1374 155497 437353 108785 181694 355268 679513 1005360 965473 777585 632870
21611 632870 897517 1241385 1598171 1453890 1195491 987523 804765 576247 829175 839253
21601 839253 785172 489638 471204 503789 621996 902755 1219650 968844 802166 793210
21591 793210 1113355 1319736 973238 681835 537210 360794 506888 510191 300042 178288
21581 178288 155374 186545 414809 473515 470664 692558 630865 596470 818188 1156614 1156603
21570 1156603 1052015 1230238 1139957 1191358 1086014 1363854 1512342 1365626 1274959 1087084
21560 1087084 837296 639416 790715 959969 966418 848263 870891 740069 820857 1172353
21550 1172353 1272987 1243461 1509881 1444118 1499697 977220 628554 634676 662374 570131 599588
21539 599588 1239971 1717777 1551582 1350249 1193078 915292 588229 383451 813855 828472
21529 828472 667643 356812 261849 542571 514237 691180 905501 769692 1026098 1084419
21519 1084419 883648 850003 615324 767807 938763 957248 826258 621415 531586 651422
21509 651422 1137471 1205692 1479495 1498826 1625679 1577916 1330345 1320425 1581629 1525083 1658219
21498 1658219 1624853 1392034 1506122 1578851 1310242 1435791 1832286 2222495 2052792 1982671
21488 1982671 1811897 1491620 1390361 1429564 1523217 1632644 1883244 1709865 1466803 1456303
21478 1456303 1498754 1635837 1351511 1495171 1353759 1372547 1599316 1698060 1887857 1744660
21468 1744660 1434176 1535269 1805313 1859224 1805467 1454647 1318525 1402010 1460577 1336615
21458 1336615 1347598 1784619 2111942 2049565 1726009 1782328 1969358 1607181 1475089 1539906
21448 1539906 1538625 1741684 1642907 1404771 1541982 1984498 1892478 1605146 1491337 1498873
21438 1498873 1599397 1978681 2247952 2441029 2534355 2392867 2126406 2165252 2453936 2495448
21428 2495448 2256977 2027980 1831010 1868565 2134528 2116167 2073885 1985296 2027575 2047239
21418 2047239 1981343 2120089 2216341 2668076 2825674 3067574 2967838 2417312 2093096 2302614
21408 2302614 2492998 2300185 2165328 2264265 2401926 2517078 2892283 3146888 2680279 2184412
21398 2184412 2498396 2881703 2894844 3061668 3478712 3127420 2959705 2813017 2606996 2733495
21388 2733495 2903428 3260826 3490706 3829466 3941547 3791676 3545860 3408219 3548826
21379 3548826 3578880 3604373 3771001 3972004 4194649 4085542 3999933 3522401 3696019 3817525
21369 3817525 4003174 4209860 3937680 4051347 4244423 4158653 3926753 3858476 3886874 3575435
21359 3575435 3584116 3724857 3683620 3799959 4182003 4586411 4530354 3918856 3825566 3791094
21349 3791094 3769309 3718858 4031481 4441876 4700051 4668800 4795745 4943414 5017867 5074888
21339 5074888 5239914 5071602 5255410 5288383 5165767 5299126 5012776 5239150 5414804 5266002
21329 5266002 5296180 5287679 5186586 5194311 5175895 5508436 5308902 5113724 5050391 5107271 5524713
21318 5524713 5818282 5874979 5815687 5824180 5778030 5582063 5531740 5723738 6072932 6169302 5985660
21307 5985660 6095941 6218749 6195426 6186463 6130717 6081175 6213147 6678781 7120334 7138817
21297 7138817 6950571 7148298 6912705 7139188 7788984 7878733 7712616 7795457 7720004 7766900
21287 7766900 7828133 7910583 7827420 8034228 8563335 8895713 8618782 8439027 8537849 8988055
21277 8988055 9332100 9189877 9135213 9125782 9451114 9643041 9486697 9798988 10208958 10172176
21267 10172176 10222685 10415240 10220766 9995239 9844359 10116035 10553358 10640902 11195284 11725952
21257 11725952 12009518 12296544 12082617 12393593 12326225 12081156 12432505 12403665 12812173 13376860
21247 13376860 13509305 13610416 13985558 14593877 14889192 15158388 15288050 15264726 15158504
21238 15158504 15180575 15681453 16281780 16806459 17123079 17581428 17770668 18076250 18534926
21229 18534926 19272857 19789043 20325559 20502406 21009590 21624151 21728568 21784144 22350083
21220 22350083 22878551 23261491 23715567 24117129 24890283 25494501 26087577 26728707 27227949
21211 27227949 27886280 28502830 28764531 29479346 29992365 30403813 31202735 31876319 32802354
21202 32802354 33483010 34037925 34909472 35901453 36649585 37342855 38148276 38985116 40111096
21193 40111096 41552987 42748596 43758822 44666213 45634499 46690811 48313751 49699272
21185 49699272 50718428 52121045 53410765 54541256 55948162 57723522 59734007 61634157
21177 61634157 63464851 65563717 67751195 69912587 71959202 74421678 77228816 79431089
21169 79431089 81413860 83449237 85884734 88618222 91900277 94885318 97641178 100799246
21161 100799246 104051918 106780837 109849874 113350484 116565377 119849635 123450925 127117588
21153 127117588 130602127 133986913 137165863 140200772 143093293 146054699 148961348 151952947
21145 151952947 154382885 156507294 158904319 161025609 163065769 164749644 166356823 167682554
21137 167682554 168770490 169612719 170278721 171302767 171961903 172353626 172623045 173010571 173454071
21128 173454071 174123984 174530035 175026056 175359652 175174765 175639496 176252229 176600088 176630164
21119 176630164 176953148 177142437 177347445 177629652 178385344 179082074 179219179 179328610 179267838
21110 179267838 178901430 178434042 178169740 177799326 177017221 176344630 175295989 173875733 171901811
21101 171901811 169841064 168149840 166050059 163701733 161184944 158617538 156162925 152969389
21093 152969389 149845361 146627671 143458253 140313491 137451748 134541553 131053980 127713154
21085 127713154 124674283 121712691 118626715 115978220 113183403 110388664 107226068 104235244
21077 104235244 101456576 98674187 96123087 93935267 91579402 89012302 86672627 84248092
21069 84248092 82262558 79988545 78045983 75750107 73740253 71878597 70045361 68414071
21061 68414071 66710638 65006029 63437066 61813113 60192525 58807274 58232152 57049602
21053 57049602 55490980 54387153 53054193 52049937 50863845 49732328 48811926 47691869
21045 47691869 46651311 45293162 44183725 43346986 42484499 41724009 41039867 40275070 39287834
21036 39287834 38517913 37593094 36977377 36173201 35348835 34797185 34353211 33744664 33054806
21027 33054806 32506973 31914534 31258194 30518663 29956985 29575148 28956444 28685194 28217503
21018 28217503 27586482 26951035 26171234 25469699 25282965 24962594 24608516 24097937 24025832
21009 24025832 23925478 23318791 22932580 22405114 22007264 21851127 21543761 21545811 21442831 20761836
20999 20761836 20098653 19676117 19300939 18780995 18243582 17863595 17581418 17202329 17079109
20990 17079109 16722700 16199244 16395110 16482976 16227849 15809853 15370525 14810756 14426118
20981 14426118 14090720 13852296 13856020 14084969 13790395 13343363 12824752 12840319 12787746 12673332
20971 12673332 12679007 12629583 12503010 12354651 11837620 11363823 11599051 11497830 11065035 10942428
20961 10942428 10667826 10557181 10534084 10291112 9981109 9833565 9963905 9971527 9947700 9663375
20951 9663375 9401835 9274493 8838480 9020688 9444800 9485012 9189935 8980549 8793092 8698610
20941 8698610 8646896 8755562 8956775 8734710 8325915 8520784 8538011 8347683 8061388 7755257
20931 7755257 7589977 7361056 7379315 7875755 8155679 7844601 7547731 7443677 7238331 7641652
20921 7641652 7665554 7618683 7694753 7748773 7448754 7368250 7335742 7201454 6959912 6989218 7041225
20910 7041225 6769549 6570089 6405653 6380394 6411848 5978292 5721008 5990789 6281075 6339623
20900 6339623 6209175 6465528 6432274 6152020 5594689 5583173 5773679 5790560 5830702 5695169
20890 5695169 5545718 5581373 5518712 5508831 5404020 5547549 5264179 5159774 4945940 5161523
20880 5161523 5262495 5205438 5140346 4836398 4704676 4827991 4492347 4097677 4437300 4756758
20870 4756758 4956866 5062950 4914312 4690911 4201229 4336598 4761949 4734295 4418116 4270632
20860 4270632 4063346 4086023 4421920 4502878 4392295 4272254 3900382 3581191 3406825 3690883
20850 3690883 3433272 3101224 3336853 3469108 3556331 3700721 3428131 3586019 3662855 3527734
20840 3527734 3362089 3270965 3269661 3311562 3369469 3094557 2497892 2686642 2809692 2926492
20830 2926492 3127614 2701497 2671771 3009724 3011938 2949991 2692613 2639166 2726257 2752554 2723819
20819 2723819 2808882 2886325 2936558 2786202 2353946 2309755 2493672 2697946 2770580 2506361
20809 2506361 2312611 2304951 2128279 2064346 2310796 2645361 2352337 2128036 2023458 1880126
20799 1880126 1753987 2027027 2378630 2457643 2252024 1961565 2023404 1830237 1680373 1623180
20789 1623180 1645741 1829526 2056509 2113137 2174089 1850641 1648041 1753206 1615682 1871907
20779 1871907 1949455 2118753 2142469 1809843 1641462 1985015 2247417 1872501 1466875 1518140
20769 1518140 1585074 1745717 1745720 1622426 1374369 1021113 1028341 1068069 1308534 1552583 1514021
20758 1514021 1209535 1092500 1034382 1074749 1545955 1706379 1419425 1110750 1039454 1326599
20748 1326599 1148415 1167954 1535858 1996895 1934013 2017112 1814570 1701038 1682405 1686670
20738 1686670 1850865 2126406 1872607 1823487 1979226 2045997 1899553 1508153 1442052 1623859
20728 1623859 1834833 2066801 1885045 1723615 1507741 1745714 1261751 987970 1294059
20719 1294059 1307510 1204944 1052192 1167614 1566194 1967708 1865142 1711609 1450853 923429
20709 923429 571295 631715 798562 772928 863168 614510 645809 658542 531445 565377 686344
20698 686344 668239 623715 671954 905268 972439 788372 801837 878620 773240 525360 311498
20687 311498 395845 290424 699010 1031130 901174 627648 720453 1133926 1192969 1325830
20677 1325830 1309203 913453 824004 1217848 1042353 784523 629023 438404 486804 1024087
20667 1024087 1121751 1366629 1517397 1246093 929247 1073954 1138232 974816 960133 1344252
20657 1344252 1290248 1277174 953094 954390 688648 406456 675246 788760 682215 982292
20647 982292 1330207 1206410 886758 495114 505163 484225 535785 293280 309608 570374
20637 570374 429501 268924 -111125 49877 283351 505173 706129 705097 838069 841640
20627 841640 856875 688015 732826 875548 1027352 685298 345704 390136 655197 842350
20617 842350 1173806 950480 888995 1125442 1303130 1197447 927204 650007 723411 739059
20607 739059 874804 647155 324853 312168 550266 682926 682587 769687 1087037 1205977
20597 1205977 1323962 884298 641455 590907 352053 357126 574240 731180 826509 866903
20587 866903 613416 519542 779978 628101 427153 529171 702949 702302 720499 636505 527890
20576 527890 653587 653978 647407 663148 688199 444382 222905 241848 354373 334111 347731
20565 347731 528276 389984 617864 937087 724622 645356 912983 1094120 1013723 890122
20555 890122 739792 921782 1030541 796289 831602 674848 670887 494765 341258 247601
20545 247601 429836 469591 673768 763955 1020405 920594 439901 111051 304781 234370
20535 234370 395676 797977 997327 977078 684449 262244 267815 398966 557550 735726
20525 735726 888804 1063235 1098530 1155916 1239506 1412214 1520920 1291124 1119160 1005544
20515 1005544 844368 695799 335173 486321 870021 643809 573234 833260 1035106 913494
20505 913494 975039 775544 847975 617896 782446 825381 701500 730854 784989 912191
20495 912191 925025 903912 702640 842316 941894 812214 492165 393804 712151 1011587
20485 1011587 1335684 1427886 1493309 897777 690141 796915 954770 1026218 768809 589806
20475 589806 724320 990706 1035335 1018941 829620 756322 735408 1166371 1392023 1073165
20465 1073165 775287 783981 976865 1037134 790615 1009461 1146484 931469 927257 1118620
20455 1118620 1039585 850882 1072428 1425109 1494158 1333423 1449774 1598959 1631087 1618265
20445 1618265 1478464 1261065 1028274 1006105 1002018 1050728 1285611 1282807 1218459 1424769 1320258
20434 1320258 965276 774993 795443 771295 861225 909171 899793 848139 1188380 1343301 1437423
20423 1437423 1457827 1337468 1318202 1213415 1499586 1312187 1144005 1502572 1676980 1805375
20413 1805375 1859506 1821628 1808259 1783833 1470826 1437153 1798749 1745267 1851918 1845587 2129773
20402 2129773 2590668 2578170 2643576 3104255 3032743 3134476 3268156 3409983 3906182 4087127
20392 4087127 3813262 4013195 4317338 4586962 4812555 4902811 5172157 5680306 6271496 6982594
20382 6982594 7520469 8053016 9146768 10232043 11610255 13762027 16839215 20565451
20374 20565451 26468805 35324213 46481993 57792028 68295189 78161392 89329924
20367 89329924 100427298 108794039 112297704 112412402 114012922 119700359 127066547 131041925
20359 131041925 129952274 127288716 127554386 130971480 133133022 130521005 123303808 115295231
20351 115295231 109466551 104450915 96882585 85523779 73406447 63546627 57875135 56628425
20343 56628425 58693297 64597102 73978165 84226746 93554793 102089796 112353132 123289019
20335 123289019 131530273 134813394 134150404 134243234 138704506 145258794 148030159 145236268
20327 145236268 140354478 138362382 140123639 141479100 138866646 131535065 123190476 116499867
20319 116499867 110207377 101212058 88302456 73886471 61848362 52649868 46448600
20312 46448600 42063552 38753388 36524335 34445958 32431719 30676426 29305385 27861360
20304 27861360 26859354 26292311 25418186 24285968 23351179 22281722 21464698 20855768 20149937
20295 20149937 19355660 18823480 18396062 17695903 16893159 16688981 16410852 15832364 15457786
20286 15457786 14872973 14227489 13842424 13511129 13102359 12757013 12548002 12212327 11967828
20277 11967828 11512946 11038400 10692777 10333752 9677393 9387477 9152958 9166893 8935160
20268 8935160 8431384 8183887 7861897 7898409 7886355 7417800 6903497 7024373 6923673 6874056
20258 6874056 6736249 6409731 5742962 5420990 5489966 5439693 5508619 5531847 5447613 5488776
20248 5488776 5273008 5292207 5068677 4738695 4578360 4428956 4392260 4235869 4206416 4458670
20238 4458670 4192802 4077407 4081778 3911378 3718325 3474615 3246536 3196111 3380789 3558953
20228 3558953 3276600 3156063 2982950 2745347 2436555 2670448 2883900 2669611 2670237 2606554
20218 2606554 2594116 2195289 1925406 2184408 2242810 2218189 2385250 2488310 2723910 3072273
20208 3072273 2516895 1863024 1821652 1952272 2240045 2128303 2325289 2318158 2031675 1878014
20198 1878014 1910045 1853751 1810867 1663670 1687184 1565506 1453228 1430987 1581897 1556064
20188 1556064 1558290 1361135 1415185 1497939 1613714 1580026 1108276 900500 1290074 1457478
20178 1457478 1403669 1015325 1568848 1617962 1303870 1496977 1498785 1335809 1423277 1035500
20168 1035500 936432 1296183 1435693 1356303 1449832 1371022 1182135 1010998 1381863 1606317
20158 1606317 1321727 1350388 1626819 1488711 1377367 1149023 971998 1315944 1447489 1262362
20148 1262362 963922 1315475 1335320 1356729 1266505 1175218 863779 845311 970648 840985
20138 840985 911159 1085495 957440 698283 794851 775865 629076 657627 710024 871623
20128 871623 869962 628280 330079 65259 16616 -34133 85483 161703 180811 274580 317366
20117 317366 544162 719835 652682 477336 522998 761187 911661 1293102 1348908 968781
20107 968781 908155 1065018 959816 809998 705542 621250 1008051 1188219 957532 534197
20097 534197 375266 460994 277348 149765 44511 204573 470132 311278 261622 617642
20087 617642 704654 579417 54636 -142081 227911 362649 596424 751527 560973 629834
20077 629834 423748 -209708 -312815 -187091 73629 274387 304911 321157 204326 34617
20067 34617 -53048 -87022 41282 95669 135945 83934 -3986 165593 376606 189933 154354
20056 154354 615983 489125 389191 556679 691641 602071 626295 200513 296224 746883
20046 746883 424550 228917 254529 163623 109193 4278 -11731 400495 691515 537757
20036 537757 338893 373807 541546 219851 -17132 73544 183105 178928 209132 552281
20026 552281 378063 453472 232493 -210172 78280 522576 328628 249615 166448 41403
20016 41403 87865 357462 518248 521002 329488 227978 -300724 -466938 -160467 -27754
20006 -27754 -137057 -101704 22254 153641 92978 80425 124400 192548 207903 378473 473908
19995 473908 579957 500729 77274 51063 335739 306743 136698 279147 235427 -154765
19985 -154765 -161415 149085 340604 383959 419413 550316 483618 408462 644232 164958 -217477
19974 -217477 -211122 -358709 -349045 -276453 1772 -407106 -291614 -174877 -303075 -482266
19964 -482266 -633469 -309895 -62990 -169239 -306703 -487435 -304720 -240274 332448 783777
19954 783777 628545 377159 43228 109938 -101584 -360233 -62679 60710 27177 142811
19944 142811 137828 245474 329685 337476 444528 380087 26876 75712 -97132 -74279 -44440
19933 -44440 196718 442204 83213 -258043 -119713 267080 -165138 -36200 224244 428373
19923 428373 426801 557960 716302 348099 27943 102737 206560 409010 269306 154512
19913 154512 -207376 -191758 -34609 253460 435702 378890 148101 -69278 -22858 215927
19903 215927 193673 333252 429655 393125 69328 17347 311950 718944 820679 505346
19893 505346 487917 493033 154819 -81925 -63643 -195770 92455 401760 396409 360966 289075
19882 289075 131172 141042 144114 401902 98873 -114875 -187838 -192418 40877 -188299 -304457
19871 -304457 12214 268148 293802 -116335 -407851 -90152 197536 107855 311721 316349
19861 316349 190388 268586 380343 419328 207610 50944 131440 294957 -84726 -176142
19851 -176142 247652 111530 183517 -42068 45186 223586 369017 428573 448571 532712
19841 532712 459918 771383 734121 220081 -78003 -294833 -429048 -256672 -6631 -116187
19831 -116187 -240364 -456600 -282994 -408899 -372992 52592 116278 129136 278441 361027
19821 361027 388600 409680 540186 149069 112805 492850 948090 838554 634845 377053
19811 377053 437498 533494 403269 474378 810416 722712 357995 279089 320491 264599 306847
19800 306847 411630 413262 188449 188077 498163 531726 418872 131105 237648 499189 1274251
19789 1274251 1066319 1071486 1374896 1464122 1207026 1007277 713606 845185 984642 677809
19779 677809 593978 729967 692427 924894 1033499 777959 758023 849761 888483 846510 796403
19768 796403 711096 832064 1000985 901375 865554 952464 1278286 1274312 1474364 1535720 1303656
19757 1303656 1088243 1036212 800621 609885 827926 1002014 1257826 1076576 759142 534013
19747 534013 368539 350522 483591 489297 260502 486856 809254 655657 370901 244738
19737 244738 433590 378933 534747 253587 242207 639381 1129096 790040 613144 501686
19727 501686 366818 545533 625837 608472 682728 818411 980262 838396 616469 538640
19717 538640 535460 479005 654681 766640 606000 367043 426020 713890 965543 1081819
19707 1081819 1095398 1090876 943570 723963 631897 785629 1005451 931597 775140 845100
19697 845100 470412 311194 498066 687965 569382 312518 252471 -102673 49289 215999
19687 215999 431053 343752 308475 709792 891180 616758 682933 768687 844204 623694
19677 623694 227138 -230290 -283237 -147257 -107962 -74950 163460 600518 653435 660321 804979
19666 804979 791283 1037049 1121752 810704 785505 971041 765608 511247 560291 340615
19656 340615 485973 577219 554821 773884 893237 867320 518341 483213 796611 680317
19646 680317 304244 216866 249418 658022 922177 849000 797485 623133 806923 896974
19636 896974 1035656 720840 843841 1072648 1108834 876851 616413 716783 868343 918235
19626 918235 786710 855514 843531 726010 654097 470043 640513 804849 402365 152081
19616 152081 171487 317255 126769 -38324 -43298 -49337 35287 94435 140992 50966 270349
19605 270349 391317 479013 368090 -107895 -126103 167409 180924 -420309 -406178 206413
19595 206413 550699 389741 389786 631049 768058 674154 779834 790421 712999 636337 724924
19584 724924 898730 786673 365440 275405 673269 830466 705382 840895 880065 763850
19574 763850 488519 323547 361140 628963 696224 889943 934304 506280 121861 -131362
19564 -131362 -140589 -22642 189054 208895 384597 516864 496071 520263 440587 578750 581892
19553 581892 232552 226556 202775 448634 333713 379481 175280 -186757 348236 626425
19543 626425 588125 258170 459789 836672 731249 237100 67932 -38624 -99366 -270412
19533 -270412 -302003 -205385 -180102 -87821 161534 300579 40240 116461 283747 469465
19523 469465 399478 601836 760104 502472 242810 310566 649738 668096 532964 233176
19513 233176 -96423 -104817 -68247 81281 247543 248733 212384 50833 -35285 312648 646926
19502 646926 721755 1002509 984288 514058 274994 234315 159564 -118146 -226805 195173
19492 195173 394899 212645 462569 501155 311642 246022 411931 535044 799683 844531
19482 844531 517713 347547 294094 335938 523239 548146 680468 404059 89394 143127
19472 143127 577589 533541 391647 204099 404378 278726 426730 380333 147201 229154
19462 229154 607048 737047 564482 445959 631401 455681 306952 422468 518339 317678
19452 317678 209794 168035 -15652 134424 289770 232475 506897 541561 452106 684850
19442 684850 931029 646995 337583 597897 778833 864297 959716 781874 902067 906536
19432 906536 1042526 964526 813515 1011826 443036 140616 165863 118498 205184 368351
19422 368351 961471 944047 848012 715556 338308 72246 458988 793232 770951 783043
19412 783043 595983 481890 814724 958377 896915 795468 752260 554982 -90054 -230443
19402 -230443 59928 299970 664495 643613 533746 382536 234467 376223 474351 623717
19392 623717 799292 851603 490235 494923 663087 252604 452575 591459 546653 315745
19382 315745 -88125 -22414 -63322 -160664 -59324 61487 315693 689673 589613 610292
19372 610292 855578 852748 1006768 761019 858827 984565 880801 811153 717781 940360
19362 940360 1105514 1223652 1309741 1166790 810027 903804 758377 760204 582779 418104
19352 418104 626921 854301 976193 829322 583099 378714 480881 293305 384307 809110
19342 809110 599637 352894 422811 462321 378224 741388 989731 563512 596041 950917
19332 950917 810791 869811 633244 617301 454077 48433 297926 634605 669412 757611
19322 757611 803583 761172 620813 927593 860318 732807 618433 516929 709605 667724
19312 667724 569346 597911 864625 1215055 1441099 1429414 1118181 1056263 1091148 758306
19302 758306 58790 154290 453889 636334 777991 844380 734932 501324 530428 746028
19292 746028 1078277 1022979 844889 877488 1088182 1033897 1184651 1325545 1279421 1239743
19282 1239743 1467308 1271925 1260432 1327689 1277401 1189226 1033239 906457 659066 572225
19272 572225 1005932 1196955 1139386 1006831 1160041 1126097 1266689 1012147 711860 574778
19262 574778 736625 951600 1196911 726774 595598 990851 1279981 1045451 864253 862905
19252 862905 877894 985270 1194694 1277352 1153005 1217408 1025053 555841 427709 888444
19242 888444 1050646 1013759 572172 787158 1077087 1410956 1385713 1281985 1376017 999762
19232 999762 1128856 943323 714758 1200841 1520898 1686739 1590709 1320438 1244381 1326017
19222 1326017 1499526 1867257 1663193 1789269 1968347 1848486 1569705 1752891 2073063
19213 2073063 1994308 1702701 1667401 1851489 1946839 1969414 1980760 1897414 1787651 1873935 2175306
19202 2175306 2132109 2190654 2285357 2357641 2533691 3080016 3321262 3342832 3188677 3245516
19192 3245516 3188488 2959331 3118092 3416223 3535383 3924968 4264128 4733178 5324143 6173610
19182 6173610 7274526 8274961 9614955 11813957 15254408 20346093 28156988 37232189
19174 37232189 45586646 51261764 55109048 59034772 61731242 60223277 54120935 47043772
19166 47043772 43083468 44118927 49270906 55562391 59515862 61619100 63548660 64842287
19158 64842287 62816433 55264436 44672053 35394270 29092957 24868598 22294064 20658630
19150 20658630 19153439 18080743 17273576 16524491 15810664 15770720 15754457 15708651 15494532
19141 15494532 15354217 15842007 16390365 17065188 18005425 18935938 19892762 20901372 22502847
19132 22502847 25286133 29527962 35374774 44124640 57372487 74362785 92164288 108152247
19124 108152247 121635849 132807296 139811859 140786219 135252799 125575257 114518539 108230501
19116 108230501 109642216 117126003 126950061 136144468 142284391 144773178 143372938 136203124
19108 136203124 122842545 104229633 85034540 69589836 58608739 51110173 46028851
19101 46028851 42573570 39671198 36935580 34708020 32997114 31403417 29898802 28836603
19093 28836603 27976196 27047352 26518341 26177929 25887358 25458389 25311230 25620887 25804130
19084 25804130 26186494 26902363 28326880 31139049 35967188 43125388 54243589 67702723
19076 67702723 78653935 85316030 90114139 94866740 97068931 92101578 81315594 71843850
19068 71843850 67565442 70133604 77293459 84817453 89293885 91304509 92990735 93880475
19060 93880475 89071296 76832057 62316477 50252431 41956712 36307320 32150784 29006551
19052 29006551 26809615 25058809 23651678 22394714 21321248 20373985 19124176 18325052
19044 18325052 17444530 16594004 16214954 16101275 15130156 14540492 14240051 14327708 14034292
19035 14034292 13201091 12750150 12582284 12499906 11920904 11580391 11223243 10652719 10009188
19026 10009188 9753283 9748246 9907816 9729965 9408999 9065586 9047652 8823641 8728843 8706701
19016 8706701 8421244 8361378 8134556 7987328 7543592 7459862 7498855 7397519 7222132 6598107
19006 6598107 6550330 6772175 6271048 6046991 5847554 5494250 5321295 5677012 5883156 5771796
18996 5771796 5853777 5831320 5713577 6144510 5707681 5473934 5803972 5592470 5426035 5003781
18986 5003781 4820236 4580727 4415326 5029970 5137232 4883884 4708700 4289790 3861043
18977 3861043 3731591 4097750 4573551 4423373 4547363 4751990 4336250 3972967 4110338
18968 4110338 4163058 4102973 4223197 4439615 4217154 4167562 3809595 3564790 3938676 4113994
18958 4113994 3970193 4055826 4179416 4091394 4086425 4032957 3949289 3955538 3874321 3870639 3658668
18947 3658668 3398645 3515240 3640311 3753804 3737939 3645156 3657668 3398142 3478602 3320002
18937 3320002 3253894 3080210 2968397 3008800 3326627 3721191 3503503 3414749 3724184 3511269
18927 3511269 3212227 3566864 3946883 4056000 4123978 4106697 4000211 4018766 4119798 4131213
18917 4131213 4284670 4282196 4126756 3862102 3692704 3893589 3868292 3954508 4248229 4637727
18907 4637727 4598930 4713353 4519497 4357963 4036098 3984597 3708882 3564948 3406981 3514014
18897 3514014 3545584 3253392 3448222 3386534 3596879 4013196 3543398 3071965 3267653 3666559
18887 3666559 3870310 3973421 4045048 3973692 3918628 3954882 3615934 3588753 3740844 3980776
18877 3980776 3956681 4294919 4212661 4354738 4821834 5215464 5055620 4943443 4764511 4528235
18867 4528235 4758528 4999857 4813183 4598823 4515419 4535417 5001785 5254292 4901842 4848835
18857 4848835 4641992 4752733 4843953 4579347 4096517 4190272 4519678 4608687 4443329 4402044
18847 4402044 4507718 4118033 4063813 4291201 4143059 3952171 4184610 4516989 4912899 4693497
18837 4693497 4338484 4015516 4109797 4474228 4616065 5041173 5011949 4762877 4897620 5067651
18827 5067651 4686594 4635978 5013908 5008796 4691437 4710220 4874510 4756446 4738984 5058331
18817 5058331 5475612 5496003 5202768 4797406 4753911 5069866 5168559 5245013 5200208 5276424
18807 5276424 5124767 4874935 5028562 5309968 5265733 5243787 5182977 4832696 4702439 4517002
18797 4517002 4635721 4789069 4964322 5260224 4997244 4941204 5094850 5215450 5411737 5690367
18787 5690367 5913236 5988277 5721254 5367607 5019522 4824030 4880381 4784134 4951612 5055122
18777 5055122 4955280 4678266 4643590 4939037 5002651 5093436 5046784 4879618 5068471 5487170
18767 5487170 5698237 5918505 5559186 5182713 5497037 5540207 5667106 5393845 5313358 5466211
18757 5466211 5805563 5739407 5933821 6372414 6412716 6447536 6390751 6154781 6181589 6115475
18747 6115475 6252484 6497199 6739935 6411091 6371012 6256475 6177864 6536418 6741838 6955510
18737 6955510 7036475 7058009 7078289 7033817 7179075 7012925 6841482 6563739 6616317 7094298
18727 7094298 7188125 7384599 7566423 7454988 7471316 7855242 7850319 7789698 7862221 7689570
18717 7689570 7889211 8173704 8197225 7916640 7927518 8318819 8566797 8679963 8412373 8473246
18707 8473246 8529148 8610982 8668438 8791310 8846791 8913683 8848105 9000775 9005842 8768713 8751763
18696 8751763 9092876 9086590 8823115 9007365 9367204 9439357 9460938 9714029 10136009 10487054
18686 10487054 10483778 10209374 10351334 10697892 10956389 10922891 10696102 10744028 10907211 10646531
18676 10646531 10519790 11100715 11725348 11841914 11731540 12318281 13038771 13090506 13251724
18667 13251724 13457698 13702044 14041929 14157797 14079015 13990919 14177498 14404835 14943902 15375654
18657 15375654 15495384 16039730 16761044 17196722 17669262 18203811 19010540 19634684 19954103
18648 19954103 20544176 21835739 23030087 24695915 26223035 27832536 30376834 34079895
18640 34079895 38320430 43714046 49861695 56994647 65683186 76686383 90099989 105907835
18632 105907835 122450464 137861463 152523871 165801433 176842951 184203234 187406645
18625 187406645 188638491 191507092 199238554 212603097 230309400 250539387 271593339
18618 271593339 293130736 315154962 334219800 346650336 350925028 348261241 341742705
18611 341742705 334642466 327641922 318435462 306169981 290642423 273609747 257097468
18604 257097468 242763581 229427079 214444187 197904684 180289018 163321309 149825298
18597 149825298 140616297 135783801 134851054 136998981 142052419 149245281 157822416 167128022
18589 167128022 176238649 185402186 194079554 201618649 209041787 217168500 227910758 242525041
18581 242525041 260195310 278989505 296536112 311397168 322810777 330907574 336090804
18574 336090804 338974366 341737937 345804082 352463039 362299349 374005148 385664381 394712535
18566 394712535 398286433 393563416 379305647 357396894 333126785 311685444 295066735
18559 295066735 282026814 269253838 254820727 239500764 224469276 211564597 200632904
18552 200632904 190015969 179234785 167225252 154641308 142763764 132204585 123016653
18545 123016653 115416641 108960788 103294267 98727714 95408431 92700666 89716332 87512876
18537 87512876 85477129 83715296 81941898 80376797 78827543 77243930 75806148 74419132
18529 74419132 73291041 72394997 71189510 70239272 69512240 68391826 67606105 67067198 66991065
18520 66991065 66607763 65998215 65234913 64755771 64530403 64586371 64553612 64103734 63964590 63674259
18510 63674259 63436646 63624796 63378276 62993269 62818970 62528831 62191938 61919704 61864608
18501 61864608 61844963 61726378 61915844 61795184 61664673 61414693 61239578 60962181 60619125
18492 60619125 60660767 60894873 60743463 60770744 60979924 61245760 60889450 60926372 61087683 61540509
18482 61540509 61710154 61986270 62403171 62415541 62609571 62411833 62506116 62737461 62825258 62610102
18472 62610102 62344061 62506279 62734738 63025135 63055229 63210804 63504411 63808982 63976177
18463 63976177 64246340 64580003 64995424 65443149 65991801 66734077 67324046 67780317 68302806
18454 68302806 68823386 69386803 70310006 71239126 71978425 73636283 75949914 78551593 81866277
18445 81866277 87169119 95166571 106268268 119287619 130924873 140919774 149698855 157985133
18437 157985133 164823644 168672751 169414031 168294323 166379355 164176941 162894847 160761361
18429 160761361 154347083 143841744 132321417 122677156 116518101 113532957 112561334 113986731
18421 113986731 117820266 124715563 133647915 141620661 148061475 154641320 161323190 167577448
18413 167577448 172278922 176420179 182154149 190663436 200311224 210354677 220638100 231124837
18405 231124837 240573537 247877126 252566075 256558899 259734964 261778113 261074396 256871238
18397 256871238 248861455 238525155 229628532 224439557 223179333 224766684 228701008 234176365
18389 234176365 238207530 239138420 236752761 232504795 227358475 222231699 217559949 212941663
18381 212941663 206531970 198184233 189382955 182323930 177539409 174468114 172612263 171879351
18373 171879351 173633601 178132946 185824863 198048931 214965664 235945952 260713476
18366 260713476 288644476 321574762 358619432 394274246 421715935 438246886 445786525
18359 445786525 446534823 439104739 421327314 396001764 368966343 345337040 327199884
18352 327199884 314026174 303310094 291438259 276238799 259131201 242773203 228105402
18345 228105402 216254858 206925274 199125707 192570121 187294265 182539469 177033735 170578569
18337 170578569 163731055 157595844 152840142 149447197 147575401 147806237 150162861 155650016
18329 155650016 163770553 174178475 185383864 196946198 209702534 224310344 240512404
18322 240512404 257776306 274647158 290902960 307528548 327648291 349469291 367425194
18315 367425194 378184038 383126592 385273408 385981432 385114162 383281883 378877931 367574036
18307 367574036 350924062 335299232 320784452 302032908 276865216 250926528 231105040
18300 231105040 220152075 216451583 215596616 213803496 210836832 207546391 201759902 190654223
18292 190654223 175279919 160040698 148902889 142822386 140388654 139045441 137337851
18285 137337851 135780430 133979411 131060556 126136243 118854082 111927996 106718987 102858827
18277 102858827 100416456 99282756 99959945 102890778 108348029 115791438 123160717 129243501
18269 129243501 134680209 140857464 146819888 149577904 147971370 143018908 137640174 134435177
18261 134435177 130975010 125105662 116015790 105713705 96536816 89369428 83622962 78587913
18253 78587913 74356288 70770551 67582163 64772756 62639586 60907148 59696767 58397732
18245 58397732 57436849 56325769 55591990 55216167 55163466 55779225 56008206 55673640 55527944
18236 55527944 55580842 55233424 54092195 53314981 53106368 53169634 53176060 53563124 53988122 53699954
18226 53699954 53262831 52257992 51321410 51991121 52983171 53359581 53388188 53559012 53770042
18217 53770042 52804945 50442916 47469173 44952513 43076668 41834153 40897033 40071812
18209 40071812 39462916 38408879 36605150 34575998 32955928 31432517 30275320 29248702
18201 29248702 28488184 27702113 27155869 26258136 25639860 25079116 24687911 24369763 24406169
18192 24406169 24005511 23256754 22888651 22648234 22222293 21785319 21548454 21057998 20883335
18183 20883335 20551612 20259664 20192291 19861426 19364006 18714662 18461807 18541921 18461948 18119748
18173 18119748 17309401 16891370 17024807 17070352 17136133 16784541 16785518 16620256 15934726 15552656
18163 15552656 15736341 15250644 14807632 14664264 14448835 14583630 14524529 14302169 13858030
18154 13858030 13824337 13943452 13765506 13749671 13778303 13477117 12988113 13047409 12740269 12528677
18144 12528677 12536136 12555802 11893771 11665101 11786719 11899189 11940964 12081085 11923479 11673632
18134 11673632 11402576 11066016 10975355 11016382 11092400 10954399 10730466 10770001 11039831 11195164
18124 11195164 11244953 11003837 10650762 10420175 10354542 10488748 10621636 10166303 10098913 10339461
18114 10339461 10667176 10588195 10546688 10425211 10296080 10366910 10309522 10483397 10420995 10187810
18104 10187810 10112993 9876301 10051041 10119240 9982545 9647956 9483899 9572286 9330038 8894828
18094 8894828 9009854 8925362 8895190 9146892 9351826 9247769 9076104 8844184 8557505 8570360
18084 8570360 8483393 8002080 8009069 8067184 8140679 7991683 8054949 7963754 7679720 7554754 7552015
18073 7552015 7609184 7634679 7567917 7746257 8195302 8519226 8349575 7969992 7992645 8031471
18063 8031471 7765492 7299292 7124499 7422955 7463593 7381494 6997351 6702669 6786180 6674760
18053 6674760 6403572 6175014 6349512 6419326 6116860 6212552 6365719 6294619 6365818 5925622
18043 5925622 6040872 6154191 6221489 6300499 6335483 6193522 6103336 5836451 5402138 4914894
18033 4914894 4897248 5311602 5550977 5297713 5133260 5041665 5191852 5082886 4967071 5014636
18023 5014636 5125869 5126941 4733353 4649766 5096680 5015330 4457176 4238978 4211604 4069029
18013 4069029 4306872 4460031 4534145 4785637 4834483 4777848 4491177 4265527 4327689 4297211
18003 4297211 4480186 4382144 4195735 4050358 3915362 3751060 3966760 4281404 4458045 4487469
17993 4487469 4396881 4233038 4201583 4163846 4078311 4029466 3923292 3982625 3860076 3697500
17983 3697500 3801587 3859894 3554630 3463396 3740852 3813210 3537242 3718388 4220534 4129938
17973 4129938 4035680 3770062 3735333 3960330 3643914 3574326 3658967 3608351 3774819 3719935
17963 3719935 3329517 3099060 3013970 3265043 3148731 3008042 3015297 2978443 3255658 3182325
17953 3182325 2859817 3050642 3204412 3038386 2946512 2799446 3105584 3425740 3171276 3097369
17943 3097369 3371682 3041697 2454125 2727089 2829347 2810723 2871061 2738502 2854890 2995664
17933 2995664 2770368 2484682 2348234 2301942 2237548 2284846 2318336 2261928 2419710 2786618
17923 2786618 3073019 2814952 2507107 2436660 2600624 2725945 3139241 3288564 3103665 2787773
17913 2787773 2639637 2659786 2464379 2412584 2476616 2510412 2649673 2659534 2887876 3078537
17903 3078537 2951096 3193470 3547942 3496858 3272577 3087998 2852330 2892965 3006033 3286441
17893 3286441 3284306 3332119 3098549 3039459 3112483 3499813 3447284 3666116 3948415 3964674 3612258
17882 3612258 3128253 2911611 3120073 3365368 3104923 2867415 2614862 2640229 3251128 3519314
17872 3519314 3411068 3205971 2773994 2542084 2650627 2784871 2893788 2997547 3063545 3407817
17862 3407817 3594708 3381485 3184610 3030405 3063798 2731145 2797933 3056344 3151029 3162784
17852 3162784 3538555 3797111 3283042 3380955 3738461 3834724 3314902 3348688 3733044 3690137
17842 3690137 3270937 2994756 2981796 2875546 2987192 2951012 2825444 2891318 3045612 3450983
17832 3450983 3538214 3157425 3120541 3091792 3118770 2770426 2780415 3015345 2901301 2544177
17822 2544177 2550303 2798768 2296215 2315403 2537147 2543389 2587196 2887371 2699243 2387703
17812 2387703 2295552 2338520 2276207 2255715 2620664 2679898 2590492 2419066 2399960 2603853 2533718
17801 2533718 2652982 2791955 2743571 2514835 2191561 2333984 2170935 2148446 2145123 1791659
17791 1791659 1370850 1769953 2153470 2222584 2368243 2432091 2190210 2092903 1534968 1488027
17781 1488027 1889939 1905156 1815372 1950997 2300239 2275001 1970946 1827965 2052622 1931036
17771 1931036 1848357 1805111 1928175 2282937 2686190 2485738 2260631 2132835 1997392 2174036
17761 2174036 1953337 1615540 2256373 2673122 2286982 2102495 1561378 1569690 1689850 1894568
17751 1894568 1759524 1887425 1838372 1740061 1965077 1856920 1599502 1470124 1375694 1436867
17741 1436867 1544160 1625917 1652811 1747792 1883595 1780372 1406504 1558790 1740329 1991554
17731 1991554 1661607 1363814 1094249 740237 676621 1106305 1522019 1446389 1360106 1274832
17721 1274832 1002237 1173749 1240451 1575873 1779698 1915442 1871942 1862710 1736949 1653078
17711 1653078 1319925 1331925 1373225 1444850 1446964 1544680 1486100 1201455 1434031 1526702 1393676
17700 1393676 1008607 912562 911966 894833 1194111 1624692 1566444 1510932 1603779 1417975 1355029
17689 1355029 1497451 1519083 1400169 1122838 666261 687374 1002239 1280338 1289108 1220615
17679 1220615 1218647 1164614 1340526 1234959 1198697 1205881 1195414 1218904 1328690 1331466 1426848
17668 1426848 1854832 1677631 1382277 1704868 1529785 1238575 1223282 1204728 1298069 1005945
17658 1005945 900265 1352966 1455269 1152224 964362 799403 1108234 1147276 682617 893163
17648 893163 1087744 1139546 1162296 1348135 1249159 1485123 1769366 1516239 982232 605710
17638 605710 660374 894542 1134166 1270626 1047467 988985 1026793 925074 851128 999861
17628 999861 1291406 1314056 898957 590252 680626 690817 643808 689364 919302 877201 865424
17617 865424 1000130 1238677 1150502 830723 667284 618620 755451 481991 566733 861494
17607 861494 1385898 1235944 700703 789302 602618 355580 288920 283267 738563 1264632
17597 1264632 1205678 865053 798878 741910 906018 907610 1020331 1000903 674993 570583
17587 570583 727814 907076 963251 742802 757951 955370 985031 740626 445309 22586
17577 22586 120240 356297 482539 366325 363378 278097 565533 539645 529810 480091 594407
17566 594407 683230 753464 584535 322567 645040 736373 666066 759413 616446 484930
17556 484930 377387 406500 513630 711029 473260 330062 917695 822663 451878 438160
17546 438160 375625 552209 579186 582059 721397 561967 483656 213095 154143 280088 435238
17535 435238 390783 237937 199704 588538 578450 451920 626613 945459 815588 751852
17525 751852 505948 320319 475559 436063 435485 286252 262651 43513 100066 268913 275948
17514 275948 853713 1164035 999562 437908 -57998 180535 729422 1018304 1201039 1357677
17504 1357677 1156245 1041915 1186859 1293755 1273496 1134407 716693 493914 487834 597731
17494 597731 591007 668191 593189 600706 776417 864809 791408 715148 734547 1017557 804770
17483 804770 573194 966882 860587 685198 740482 926414 909111 923977 655129 765678
17473 765678 839556 906840 1131218 1281026 1119735 1037241 1056953 1087896 882643 698243
17463 698243 626469 206948 272088 524177 762141 537580 196115 264075 611466 736608
17453 736608 538314 376647 571281 405892 444774 834228 1070053 831456 571812 282822
17443 282822 161950 304441 341524 370286 397682 258101 289604 193216 258953 403289 588227
17432 588227 772248 829104 896081 1123067 961729 597763 672412 867998 845334 576683
17422 576683 458434 391861 262541 492796 574894 624579 810068 772830 649066 540934
17412 540934 573157 582073 505907 455323 215395 305572 326981 207999 456707 915378 869342
17401 869342 622458 544273 785347 569355 412677 602291 538777 414013 671220 702009
17391 702009 611766 636009 607413 819403 379558 319252 490913 687331 792680 -68956
17381 -68956 -372416 -7161 245959 259055 83108 144706 362051 486162 434581 392422
17371 392422 419761 314758 8167 226116 246070 275992 287737 118473 -186429 93100
17361 93100 205340 346881 579280 525234 520488 901972 985352 642772 141463 222519 324075
17350 324075 595608 879301 882979 635100 379155 514175 443701 701574 415166 302791
17340 302791 348761 212286 90934 -45458 177905 463743 426610 442469 179760 -127788
17330 -127788 21114 222289 581701 597299 369268 387373 508362 490841 474169 550244
17320 550244 723158 459313 389859 410343 510629 490057 732990 1079531 850802 715908
17310 715908 584027 737283 672836 454979 462308 541181 642993 752594 653898 475966
17300 475966 99035 -66137 274227 653971 840883 503187 135323 116386 45759 -76311
17290 -76311 -114093 -374563 -266218 -190234 -62667 94878 302060 210447 148510 164056 20087
17279 20087 178049 632530 596780 60237 52732 130343 86801 117033 405165 477241 294155
17268 294155 -52101 -247334 -279804 -203048 -131795 -116910 204944 805341 1071282 1057061
17258 1057061 742676 619636 1107016 1327110 999272 586680 413417 615958 680482 803029
17248 803029 582844 225670 -57826 192295 424403 216882 190791 -26821 45462 273509
17238 273509 680346 482971 497857 509949 410166 403774 554386 804873 890611 850461 621345
17227 621345 897940 1046618 877363 685593 590531 652772 441945 374928 379409 490674
17217 490674 322694 678924 700922 379483 139634 158825 531510 593798 199044 114485
17207 114485 131321 112107 74788 172759 88634 187752 150585 68665 -8624 -125463 94265
17196 94265 270856 376589 128948 74236 540168 519797 369256 258682 392490 894500
17186 894500 869434 341619 84698 128076 523388 451647 501639 700178 830338 487070
17176 487070 350687 185393 132114 424794 598111 608344 550080 673105 641516 553823
17166 553823 562406 331881 299482 394388 282380 178035 292387 536318 638722 645962 249596
17155 249596 13632 -134458 -188187 -2517 -28471 115926 151078 436858 642940 485117
17145 485117 62299 191945 253831 165924 186885 523198 341878 535766 711047 853289
17135 853289 1172346 1099850 896020 747779 593816 263343 276997 438078 -150610 -302184
17125 -302184 101847 491124 488799 94074 76820 94748 129296 161604 223521 -190503 -458265
17114 -458265 -196774 135253 130372 -4307 158010 529173 595148 537110 687422 367162
17104 367162 495273 684732 694633 565555 627076 257180 226564 185108 310922 605240
17094 605240 659557 716600 750964 607348 83482 24940 181118 204556 -160744 -263943
17084 -263943 -268474 -287116 -571258 -736412 -288653 235044 200205 -98589 -222114 -121350
17074 -121350 164533 229203 551834 762159 533812 357550 -17169 -298820 -223424 121251
17064 121251 271522 168271 328277 588500 684451 685899 542532 165253 -163516 1187
17054 1187 20872 84012 13719 -39417 -128921 -44293 108414 162698 -1336 117583 153864
17043 153864 -40422 -222151 -446310 -803061 -831401 -568124 -284244 -27107 -34341 -249287
17033 -249287 -238444 -215939 -445790 -308816 -64587 59613 249718 525515 192308 48974
17023 48974 -139553 -528698 -1919 297486 -300360 -427483 -132162 67964 138771 332029
17013 332029 466758 340945 636933 512399 25454 -235413 -261254 -173396 -123342 -398081
17003 -398081 -469403 -94863 481007 539910 372162 346094 356550 375451 169221 295190
16993 295190 624114 667897 626105 406429 379400 227782 200758 -67750 -281614 -416774
16983 -416774 -566883 -670197 -469456 -332904 -145762 299250 660829 521687 205318 39597
16973 39597 88183 197142 410574 471822 422834 543511 493053 431567 651401 787195 736631
16962 736631 510635 256588 39587 106268 425620 538355 501655 631450 535963 427011
16952 427011 455689 444294 391096 134600 -162175 116062 424238 746286 772482 554585
16942 554585 391507 125980 327772 380199 154767 88213 329449 492177 338996 72094
16932 72094 -6004 33435 -102689 56351 123242 246021 93575 -112848 17782 519379
16922 519379 653423 659055 531926 487062 400333 43370 -531067 -381653 -63772 3668
16912 3668 -111195 -38103 -256992 -72600 -270225 -123858 69124 -498245 -778315 -790969
16902 -790969 -432100 -279123 -374098 -353147 -38558 189878 -35082 -69146 63247 29413
16892 29413 37102 -140046 -281243 -128757 -309019 -132652 83838 30202 -124195 33180
16882 33180 323151 611401 108164 -213393 -169198 -208167 -147013 -233113 -137285 -182025 -117139
16871 -117139 -241190 -71518 338022 306614 348536 277029 -57691 -89126 -344574 -387704
16861 -387704 -417495 -287232 40045 -32174 110326 123830 321509 580441 576214 302013
16851 302013 66025 402890 339165 -48164 -10496 205488 178222 150623 205877 326741
16841 326741 98631 83220 -45231 108647 296652 6421 -403394 -592023 -527153 -119573
16831 -119573 88517 283851 240294 -90602 -454599 -330536 38537 323900 86200 -293495
16821 -293495 -444924 -526483 -396398 114303 326101 219762 468262 751018 670364 279838
16811 279838 317110 61221 -274432 -99703 78617 96207 680341 433256 238593 69198
16801 69198 15203 89245 79910 -93612 -256792 -141374 106558 -223800 -752403 -614728
16791 -614728 59709 284042 294740 -200819 -430244 -512970 -409842 -321890 -262872 -199891
16781 -199891 -383010 -416118 -211854 -71819 38876 217594 277589 -17777 -159528 -154925
16771 -154925 89586 338901 500985 613938 506113 412529 203769 25121 121226 501000
16761 501000 395932 45501 126985 604384 875643 805698 480755 238235 238957 180404 -58661
16750 -58661 -132074 -128788 123627 160233 -304819 -214269 69560 23649 -127873 -205252 -235421
16739 -235421 -443181 -281183 -37518 121281 172538 202521 309303 426901 486677 262215
16729 262215 246693 239279 102540 289179 437226 471059 447567 456861 196615 106509 175279
16718 175279 258314 217345 227579 252510 207328 481259 344220 495614 528877 313710 269906
16707 269906 73055 -10640 124048 168692 104094 10154 209656 359062 124375 532
16697 532 -321243 -347672 109756 663573 479976 169820 7022 58629 276654 437351
16687 437351 481998 95 -133539 -116087 -62556 -281456 -182165 -67437 -231823 194510
16677 194510 554688 257588 100109 240303 44150 119526 424355 27601 -28939 -227309
16667 -227309 -480111 -609714 -210542 200522 536894 466171 325936 450609 451501 406317
16657 406317 534870 408276 228944 213579 626266 775299 736124 562053 270365 -31631
16647 -31631 -191351 -294390 73499 -4258 -229264 -213866 -142603 -205886 -324295 -359937 -524851
16636 -524851 -623608 -389161 -163256 22853 49119 -53158 -97394 118174 -66813 -94773
16626 -94773 -15733 -282261 -189373 -300512 -276740 -133109 -153724 -75379 171694 408570 280942
16615 280942 -16407 -271456 -58785 386366 538212 547817 695085 838472 543130 330647
16605 330647 400290 171191 196877 182425 522431 604114 307652 -14522 -260631 -97835
16595 -97835 -165763 87673 -236851 -301225 -373754 -35763 312998 292269 357330 224312 116220
16584 116220 440312 504060 118053 110344 232234 85111 -43892 71557 146216 91531
16574 91531 -67606 -416507 -625135 -488985 -405139 -301650 -267530 -228862 -455091 -421513
16564 -421513 -266565 -250223 -138920 37109 129587 338777 464899 230852 283198 228693
16554 228693 63199 102799 51530 45641 -184729 -148409 158625 206857 190834 630141 375176
16543 375176 101293 162030 250829 182860 89724 -30401 -163322 88328 60075 -241014
16533 -241014 -103361 -183513 26933 144405 161227 139649 -30717 -412728 -48520 285168
16523 285168 579189 723688 432588 80210 267168 69924 222534 212527 -106323 -348120
16513 -348120 -180453 -356479 -352818 -413371 -158096 -100405 -38019 99515 -64337 -240611
16503 -240611 -185159 68042 215054 127745 209703 171220 39049 -194466 -242107 -485602
16493 -485602 -270142 -260844 -14637 300007 -49318 -197942 74988 -53399 -379944 -156454
16483 -156454 -127792 -369398 -614800 -434141 -557023 -432047 -323851 -469411 -238736 -189428
16473 -189428 -27612 -321586 -520648 -528340 -403856 -707363 -711359 -305666 -307591 -134094 -161652
16462 -161652 -241694 33896 -155117 -2027 -76979 -102404 -138812 -141553 44232 138663 19897
16451 19897 -68701 207263 254087 268453 647992 639089 207383 -9214 -192659 -278415 -275349
16440 -275349 -242086 -214747 -484590 -661170 -983177 -940835 -496088 -326218 -305139 -559345
16430 -559345 -746390 -434131 -269562 -234943 -271712 -147630 -66771 -207575 -336696 43337
16420 43337 530501 697228 317188 50635 148184 49269 -55513 -296099 -153733 102492
16410 102492 -167098 -505244 -203117 238531 505826 707277 776688 345745 232324 522361
16400 522361 385898 290006 420070 480655 393187 73967 160401 134409 97037 226017 37831
16389 37831 -232346 -2232 174042 -234888 -375836 -368477 -233604 32730 223874 192054
16379 192054 239608 268422 256850 418722 90064 -157317 -171545 -41305 64768 163837
16369 163837 421490 319069 228690 288352 48432 -218010 -278924 -161086 -198096 -59542
16359 -59542 -91083 -42024 -231671 55020 134902 343415 214025 49424 132719 -93220
16349 -93220 83743 286354 -24966 -142864 -242192 -150703 -35596 36793 -180069 -405719
16339 -405719 -234902 24936 108139 -93410 -266938 -258930 -40879 233094 475985 543985
16329 543985 371120 387022 359988 130470 -109267 35581 147628 -10859 -102941 -120084
16319 -120084 -216434 -282248 -44007 -32277 -179622 -52567 439386 439761 479154 418713 250086
16308 250086 306550 239091 113957 141261 359652 -72766 -820 194264 79569 -13598
16298 -13598 -41615 -213175 -378804 -82470 10708 51519 48155 156794 414988 328658 231154
16287 231154 -43064 204362 106919 -34789 -40294 -178989 -289926 -253149 -122004 89741
16277 89741 115524 -112208 100693 497226 562104 461915 311555 193348 12923 -101508
16267 -101508 248624 299556 466105 520413 730672 631867 650669 356749 138191 155543
16257 155543 -160105 210827 450760 420016 161883 198965 146417 87761 7461 -152330
16247 -152330 -13770 150440 219564 232333 423816 453785 520256 588055 495722 520492 416654
16236 416654 203613 -66125 -172631 -379871 -126303 246061 487835 382482 278191 308223
16226 308223 -13218 -243275 -430827 -534948 -190679 7204 125696 253588 -5681 -23556
16216 -23556 -41407 3349 -35842 -40602 -30723 -230643 -245968 -297614 -112943 11809 190019
16205 190019 285331 810099 719862 754019 955796 815313 348603 10666 7106 350015
16195 350015 710300 801973 708024 515698 550444 454367 667484 549430 476087 907304
16185 907304 686819 481166 538306 366749 130122 128541 310636 80002 -271847 -120237
16175 -120237 509056 1038824 1040228 475327 306405 414200 383310 293057 476716 598165
16165 598165 620397 827888 676620 290319 130940 257560 242599 200824 89222 -43082
16155 -43082 -217458 97102 513530 617545 508977 295924 -170669 -97947 372922 445950
16145 445950 246528 193044 46586 11757 -186761 -264656 206838 426435 412723 279237
16135 279237 504333 526959 224455 381341 460761 79469 -369731 -457428 -188315 75269
16125 75269 237340 176123 81804 292068 418746 112098 -193427 -144985 226835 299234
16115 299234 271500 275487 27004 129852 175929 188695 375679 479158 420131 271861 -15301
16104 -15301 -164943 -152709 -77984 -84571 -83976 159110 -84550 -155112 113065 412331 432404
16093 432404 111077 65456 677407 501815 426200 720969 360614 151532 59842 -10209
16083 -10209 8750 -416504 -384204 -363499 -314592 -101443 -7205 105563 266199 205490 230365
16072 230365 219621 207815 92517 -149649 -259724 -448664 -416000 -424474 -483020 -241210 -218825
16061 -218825 -303976 -5192 -24196 -84855 -10713 -209699 -308483 -382140 -347534 -257967 -154011
16050 -154011 63767 381392 534857 167574 -396802 -491802 -366572 24332 335880 73597
16040 73597 -51561 -96998 20926 -6622 -112553 -117728 69120 -153718 -350332 -214047
16030 -214047 -40018 148561 -37146 -236066 -178413 -148622 34343 -58827 -144720 -300262
16020 -300262 -349832 -470472 -477532 -217848 -38499 -17240 140745 101312 249118 165653 103102
16009 103102 550178 569117 485229 110101 -244761 -53270 101353 -117332 -364863 -560269
15999 -560269 -642766 -219914 -275127 -283001 181083 249967 175573 121985 127061 92163 461969
15988 461969 780010 744297 232854 151003 -61060 196088 250072 255775 514782 455281 482689
15977 482689 245093 -10772 4515 272145 266723 222985 -93268 127612 149977 188786 779460
15966 779460 637713 25671 70567 -203955 -715653 -416344 -320265 -337249 -212196 -71612
15956 -71612 134795 148462 -35922 27161 -21454 224123 469895 -48606 -541750 -430113
15946 -430113 -41146 -96337 -119966 232272 231404 80992 72481 -7914 -187962 -19677 -37483
15935 -37483 174814 30896 151457 -112570 -235743 -136620 -184039 62319 4737 106428
15925 106428 382259 409577 563622 529989 336945 -69372 -143127 -258027 -244232 -11438
15915 -11438 75132 106336 223744 24364 -230069 -30364 -159533 -200988 -123438 -45173 91651
15904 91651 228926 151863 -13466 187608 61788 121499 145947 356376 162306 -127671
15894 -127671 -19342 6148 -17247 -116523 -283794 -821810 -492237 -235186 -286659 265146
15884 265146 458876 584727 537316 713541 785373 1129890 988364 820494 281436 69376
15874 69376 102721 338036 502940 424181 141907 231588 -107221 -215741 -317351 -409164
15864 -409164 -116916 496157 771390 516866 608644 661206 543126 651888 751100 793615
15854 793615 631312 686520 940203 1089022 857295 689918 789450 1056813 967554 974820
15844 974820 983270 873703 966157 1086755 1158965 1442721 1394639 1311876 1379379 1387854 1502782
15833 1502782 1401398 1381672 1603210 1623790 1785750 2005523 2058859 2106157 1864365 1820354
15823 1820354 1985513 2011261 2291566 2139838 2235534 2295466 2231667 2265586 2693195 3199867
15813 3199867 3534166 3748578 3982481 4111798 4525303 4998208 5316781 5950718 6347028
15804 6347028 6754330 7144936 7671517 8567729 9563439 10439464 11133929 11803334 12076337
15795 12076337 12820348 14119285 15380144 16734548 18047319 19156050 20078481 21235353
15787 21235353 22398636 23326997 24049793 24888224 25886312 26203931 25929636 26225568 26878420
15778 26878420 27111361 27225352 27091357 27219051 27865471 28177546 28586943 29188503 30251894
15769 30251894 30912339 31718602 32678901 34169010 35594649 37531534 39674598 42087963
15761 42087963 44912950 48012205 51258725 54887164 58778842 63077389 67615362 71846303
15753 71846303 76149514 80323199 83628617 86271343 87965652 88999313 89649741 89680213
15745 89680213 88779146 87081883 85108509 82412794 80403216 78471362 76109344 73888058
15737 73888058 71845388 70164537 68853744 67300221 66076691 65313674 64959558 65134611
15729 65134611 65523542 66175528 66492845 67332273 68574526 70090747 72194316 74562780 77072302
15720 77072302 80199634 83607626 86912004 89574068 91977264 94068202 95675173 96388607
15712 96388607 96359133 96023471 94427128 91755560 88516295 85096683 81548266 77279752
15704 77279752 73357836 69465976 65632641 62427908 59622338 56744666 54074203 51466882
15696 51466882 49279740 47640602 46169259 44722453 43259367 42076819 41258062 40250716
15688 40250716 39050086 38443977 37980397 38020073 38157765 38160675 38018013 37749747 37313514 36750445
15678 36750445 36400964 35978140 35374339 34682508 33965591 33228559 32630310 31573783 30337129
15669 30337129 29012076 28041317 26884796 25301558 24046650 22807647 21729229 20598921
15661 20598921 19672768 18811280 17652621 16846738 16147351 15270953 14822817 14367725 13621606
15652 13621606 13385586 12703935 12040485 11129499 10595727 10468939 10619011 10123774 9857082
15643 9857082 9685805 9063358 8893726 8811289 8634826 8486579 8099070 7951041 8159700 8004975
15633 8004975 7592918 6851605 6111247 6073775 6229785 6204139 6387264 6209812 5534135 5191462
15623 5191462 5394633 5517407 4939587 4391637 4260816 4650539 4565695 4560247 4280963 4215015
15613 4215015 4239661 4455607 4477515 4173838 4194182 4171884 4085846 3776341 3931450 3955398
15603 3955398 3605157 3301381 3253855 3295407 3245121 3220343 2989948 2837620 2689512 2781204
15593 2781204 3053113 2937913 2490565 2384733 2634053 2459608 2342831 2034366 2006047 2226252
15583 2226252 1990751 1381503 1500220 1755902 2125845 2187398 2126196 2088029 2063748 1967410
15573 1967410 2036162 2025187 1839924 1756680 1826807 1892183 1745292 1427913 1425744 1815628 1944618
15562 1944618 1452405 1149560 1137994 1442926 1790469 1819847 1761907 1582719 1546455 1767244
15552 1767244 1552938 1458020 1430766 1203021 1463228 1338608 1346605 1250225 1013374 974501
15542 974501 1120852 1141865 1119529 1350410 1270068 1060396 951828 708862 542651 670311
15532 670311 1060235 1349728 894010 569277 971713 1435924 1592112 1100921 390103 474857
15522 474857 692550 696198 667887 1230306 1190828 1188067 901022 876800 858978 692999 927078
15511 927078 786244 353932 387757 642581 744778 883957 964023 909047 819027 449350
15501 449350 227576 240516 156432 150353 270384 257888 381316 247886 2839 -647 223540
15490 223540 517213 863767 576927 113754 295087 232839 232387 290633 235224 185539 361278
15479 361278 150438 169551 260289 463262 485360 664192 311089 258277 644715 563116
15469 563116 596763 755232 365149 364906 337385 395513 673156 713061 801866 635714 581173
15458 581173 725037 686183 181347 561460 944700 936274 412709 78261 -142703 136571
15448 136571 6399 163219 20428 -59556 -272174 -74458 -84547 46088 185773 441204
15438 441204 322725 230561 535471 446198 268644 149746 -5061 -58560 -294752 -173957
15428 -173957 -210576 -160274 -101447 -219472 175118 208963 143709 287571 67025 265475
15418 265475 98942 -452403 -243379 -284209 -325562 -381774 -495488 -378692 -508907 -248021
15408 -248021 -245519 5750 -25551 -46326 72915 160298 88636 90075 32569 184420 21212
15397 21212 -279284 -27117 -11664 252450 142675 245718 152252 -18832 50300 190741
15387 190741 84612 67201 -92182 -172592 36451 275190 508460 365889 -130018 -77610
15377 -77610 317798 404900 522364 669025 365607 258174 242446 538005 301619 -58430
15367 -58430 -391124 -170523 -126461 -34080 256648 375341 210762 226913 186413 299233
15357 299233 282655 -59210 -33965 282809 358813 170395 239593 644141 734857 672040 274464
15346 274464 -263864 -353652 -87334 -175812 -123974 271808 244489 -124673 -39195 17340 -200629
15335 -200629 -58782 -157762 -75208 191 -422139 -373960 -155490 -145770 140128 603879 523056
15324 523056 268350 251561 43753 278959 471741 393605 -17106 222038 775474 713254
15314 713254 173325 123162 230467 148565 38357 96167 59203 53977 -25258 -282252 -72410
15303 -72410 -256972 -271265 -393384 -372101 -225992 54720 443021 663667 417574 195137
15293 195137 268397 55740 -48358 50781 128786 501395 704077 802063 918772 968254
15283 968254 994916 761551 399016 180775 273686 396489 620219 440517 437349 359719
15273 359719 230113 -144588 -423726 -59579 231439 396219 380010 -2690 -28712 161973
15263 161973 7613 -1725 104156 196116 129396 116385 -236593 -191613 -103959 30698 365331
15252 365331 641938 937204 553388 588933 630409 466447 252794 184878 302297 140357
15242 140357 -102624 -352148 -335903 -341572 -209047 -98195 41392 112237 168515 27275
15232 27275 171527 283586 107724 87951 -256098 -193723 -130459 -260407 -167970 -261463 -485248
15221 -485248 -286877 253975 469769 424767 161542 329140 726035 500647 495486 509739
15211 509739 686061 339489 -62472 53973 193383 -268067 -198345 -405742 -506064 -131400
15201 -131400 38903 357741 354164 171650 216014 232357 280054 459666 226746 -159389
15191 -159389 -477936 -139076 -191848 -49371 -66466 -337056 -274813 -346614 -489674 -213217
15181 -213217 -244005 -185201 -52724 -189336 -440572 -605239 -551090 -417172 -337259 -368196
15171 -368196 -11807 92834 12176 143568 -19280 -280917 -201041 -317327 -211291 201967
15161 201967 336200 493860 523616 285818 82300 113034 87016 -114159 -362135 -382529
15151 -382529 -255476 -472005 -530539 -181032 -1455 -228079 -82926 -151214 -329158 -232836
15141 -232836 -87120 80855 -319099 -431638 -106090 -51913 -53946 -40562 -399445 -411237
15131 -411237 -185341 -366492 -509137 -674333 -398455 -446388 -810137 -486669 44310 37587
15121 37587 -83095 -173217 -261627 -71992 198086 -25242 55832 252390 365463 203128
15111 203128 -30087 -108925 -219604 -191395 -189668 -128981 -174073 -219919 96167 275908 185223
15100 185223 248003 371408 528385 354636 498882 545719 547839 495154 169068 73095 12352
15089 12352 -110049 -470327 -665899 -657652 -287441 -240216 -552993 -124857 13844 -398241
15079 -398241 -447491 -485051 -477616 -430074 -399389 -343957 -415019 -581382 -559373 -511201 -448442
15068 -448442 -31491 -203929 -306314 -270423 -227806 -383116 -301302 -147401 157129 289861
15058 289861 30243 30235 73973 189215 398748 282206 -54401 -75743 -162285 -255280 -323363
15047 -323363 -112400 -157067 -179581 -187302 -500829 -902209 -964232 -660320 -117559 104402
15037 104402 -20239 -273900 -189322 -275839 -326282 -195865 39252 169724 -78838 30125
15027 30125 18824 -128414 -261260 -97963 -166660 -325438 -532640 -502227 -63022 125615
15017 125615 42554 72591 -54467 -97209 -324188 -50529 129122 206125 219000 368670
15007 368670 398511 196726 90582 383735 400825 205885 89082 -257907 -312868 -258545
14997 -258545 -98284 15874 -150364 -86139 195496 300145 331641 76958 -172080 -126633
14987 -126633 79736 376 12315 -142760 -540674 -554549 -35729 286349 268684 357440
14977 357440 269612 64019 -130912 -342869 -303803 -252342 77704 497105 225771 48052
14967 48052 140582 122653 -72709 -185563 -92406 278303 321793 -230801 -97849 398468
14957 398468 140932 28366 216683 379556 -39198 330605 566876 459519 163943 -146976
14947 -146976 -288504 -223456 50548 145858 282878 350750 247941 167079 106003 -95583
14937 -95583 -214329 129218 168224 249582 99135 -14939 270269 355905 516992 106616
14927 106616 -85454 -177434 -286557 -123237 -151927 -65299 -252938 -67069 60670 42920
14917 42920 -2887 6228 33864 297593 444743 142351 -88705 -182920 42978 -298003 -708
14906 -708 3627 -210729 201052 230970 -83288 -418439 -439571 -417863 -465857 -402771 -148021
14895 -148021 125486 136887 412564 416702 237873 118384 142154 320253 89736 -153692
14885 -153692 -244419 -199343 -266484 59490 129522 -232619 -470564 -739 590190 291233
14875 291233 88828 154351 20340 45246 105764 79340 -139604 -299203 -4152 -72505
14865 -72505 -22548 -131882 -406977 -648866 -674739 -626082 -481170 -389505 -412 297998
14855 297998 305390 487158 420732 607992 477797 -91831 250773 347013 257588 290681 755683
14844 755683 782013 597811 618678 165542 469450 417798 261895 459574 428936 131047
14834 131047 -24250 59149 -36904 -198694 -31580 331852 355213 468767 243348 327151
14824 327151 204768 87324 153346 -136147 -435282 -374529 -305567 -209795 -285881 -226311 -643539
14813 -643539 -630189 -494014 -255276 -477210 -462346 -525631 -685632 -781718 -644017 -597824
14803 -597824 -83385 177042 -115271 -61775 -129046 -289569 -205030 -138693 13674 106825
14793 106825 -366866 -690050 -588205 -531542 -437600 -47522 480713 388529 110 -283209
14783 -283209 -511806 -356397 -182616 -82810 12368 67835 -170041 -113485 -242602 -225411
14773 -225411 -173590 -155064 8597 -21185 232069 349575 3702 -423425 -306415 -206577
14763 -206577 -152493 -81172 -195443 -156335 -265952 -206072 -191281 -161396 -117735 -104494 -507366
14752 -507366 -330803 -287065 -368964 -149431 226344 -29176 -84343 -8426 -42797 93603
14742 93603 -76978 72768 -3886 -178040 -281228 -203424 -222368 -286692 -311167 -371286 -673798
14731 -673798 -934551 -865740 -789839 -774250 -671038 -266768 -68690 84670 -120529 -159113
14721 -159113 -231782 -291128 -121184 119159 418357 107843 -3197 174963 35898 -53185
14711 -53185 42656 220146 498523 419049 -12495 -113143 -48938 4257 -207807 -96374
14701 -96374 228887 210461 -76398 -15101 -62107 -266393 -148971 -422986 -584494 -1055930
14691 -1055930 -1173799 -944537 -477114 -247179 -334920 -443726 -341121 -351068 -511439 -330068
14681 -330068 -118565 27320 -38300 48623 -58122 -252279 -410542 -456200 -169045 101738
14671 101738 26172 198073 215909 223038 481723 223570 -170402 -116382 63742 -73920
14661 -73920 -317886 -198957 -260672 -281873 -439161 -128862 -152129 -251047 -6124 -266939
14651 -266939 -570591 -338137 -88511 -69398 -168562 -32377 -12397 -73976 -131405 -40263 47885
14640 47885 160157 231811 286644 -116367 -197861 -95483 36984 -191914 -535314 -429063
14630 -429063 -294312 -375761 -364229 -488711 -277111 -22312 83949 32924 14042 -224887
14620 -224887 -391468 -412202 -217954 -139890 -67239 18554 221797 131336 -232895 -457324
14610 -457324 -351938 -573918 -310347 -109391 -115042 -35344 -310393 -436952 -335161 -50203
14600 -50203 436354 776229 709913 480977 142723 -213406 -467444 -409556 -473506 -433321
14590 -433321 -177074 -81652 -137812 -138015 -66710 -414611 -323135 -354251 -431130 -128686 72512
14579 72512 256337 444096 370538 157086 4642 139651 147151 260892 62839 -84383
14569 -84383 -244928 -211210 -485091 -466607 -492579 -206064 -4680 -349289 -528220 -53159
14559 -53159 328589 227540 413879 365046 31947 -415772 -654269 -289174 -97236 -422128
14549 -422128 -653468 -818661 -678685 -377059 -189682 71297 55896 361300 374819 336297
14539 336297 205152 203104 30349 -92135 -62022 26994 -189449 -337786 -329279 260231 562511
14528 562511 343424 185796 -125187 -310243 -168693 -92044 387692 246923 48319 75489
14518 75489 149213 372490 625265 678559 371791 48359 -231012 -419888 -249087 -118027
14508 -118027 -437885 -221766 73748 91925 131112 187408 -123123 -288272 -328554 -359178
14498 -359178 -309079 -55950 383955 740148 621060 450427 151251 -216403 -256837 -326397
14488 -326397 -145475 -306899 -178559 -153718 13246 -98436 -64132 -111429 -230388 -272348
14478 -272348 47967 436383 382397 141693 -107485 -82478 120892 -10513 79791 83742
14468 83742 -11166 156270 -29759 -21923 163110 630555 446843 -112957 -250304 85299
14458 85299 204277 410080 617268 649629 259179 -153573 -319657 -341124 -48153 -83660
14448 -83660 49016 -206462 -270025 -246161 -163786 -451754 -585371 -296146 -167034 -143495
14438 -143495 202264 79730 -142181 -22130 -275664 -533918 -699147 -410990 -280780 -325514
14428 -325514 -564519 -479537 -295103 -414404 -348838 -58783 -31402 60768 166432 278686
14418 278686 416900 352159 211816 251453 238064 410936 181854 -92133 13941 334629
14408 334629 542431 467327 572295 225602 -63396 -418931 -647677 -850377 -472972 -352699
14398 -352699 -469179 -273829 373 212582 94546 138115 -170034 -437500 -241639 -104049
14388 -104049 -157931 -71053 -40839 -124874 300528 445429 430948 367586 81714 30852 238001
14377 238001 366501 95109 381439 623897 765759 525950 56056 194106 85056 -9962
14367 -9962 -45693 -70147 -86393 80933 -90507 -68640 -26191 -24640 -13953 41147 -60684
14356 -60684 153596 -105746 -104319 124717 -178711 -323988 -398840 -511644 -333285 7175
14346 7175 -152421 -170340 -142123 -154993 -97648 -202623 -245247 -466209 -533552 -553064 -782963
14335 -782963 -193600 -256403 -257850 57884 277298 -159045 -467079 -152982 -129398 -620220
14325 -620220 -825858 -375815 147419 331045 331852 338778 239902 -161069 -421436 -323148 -212687
14314 -212687 -272123 -232755 -441914 -425863 -440098 -360176 -175264 7798 93734 347734 370373
14303 370373 123406 262127 462217 278155 257989 42927 -182250 -102260 -54035 -60197
14293 -60197 354874 130189 -3970 -97312 -149257 169973 363979 549385 561508 604266
14283 604266 235766 131821 171129 290600 -21246 -128472 -169495 -112423 -49097 190383
14273 190383 204917 -87122 71149 73222 116136 532957 418373 482621 361963 454811 441386
14262 441386 405421 260959 204646 -89700 -78131 60767 -148965 -404742 -603507 -457445
14252 -457445 -357060 -502788 -456271 -368213 -493179 -972164 -1031627 -599856 -266682 -37521
14242 -37521 10914 -76377 -250627 -360222 -445108 -395484 -211330 -234283 -356566 -296335 126569
14231 126569 440842 187520 -96752 -166007 192861 402779 265100 91477 123960 277543
14221 277543 588736 600381 392100 325653 265043 228618 -116299 -383669 -551436 -636054
14211 -636054 -770751 -737991 -527611 -196809 -215067 -221839 31844 -104817 -68929 51187
14201 51187 43759 115067 61285 -239061 -299012 -60797 -200331 -141721 -124353 -204052 -148685
14190 -148685 -363784 -105150 387029 627607 90108 -268213 -325883 -447387 -675584 -447005
14180 -447005 -84099 -193047 -313266 -106825 -312373 -126936 234260 -165416 -662007 -44577
14170 -44577 469921 109696 -46057 -190806 -112782 -135344 -139994 -176152 -311510 -19417 138534
14159 138534 286239 102880 198377 82296 -172371 -321468 -491543 -525457 -379531 -316201
14149 -316201 -695561 -511510 -497247 -727675 -687736 -581011 -411957 -501673 -615871 -565790
14139 -565790 -245854 -283446 136839 441038 212910 166621 70984 14668 85380 -175706
14129 -175706 -281684 -156447 -150753 -140253 7416 239179 35479 -347851 -348753 -210028 38335
14118 38335 -84241 -217223 -466491 -650114 -488017 -761682 -830059 -871064 -882340 -481011
14108 -481011 -479397 -607161 -310242 -70747 29091 -169298 -287411 -388822 -295072 -14579
14098 -14579 -45455 -63305 -369186 -647689 -662502 -421610 -594619 -381049 -363124 -576064
14088 -576064 -323839 -45479 -73039 -340849 -461200 -425894 -361006 -400626 -7523 327997
14078 327997 451071 345291 -83070 -160592 -108026 -153116 -270227 -299844 -340251 -161918
14068 -161918 -72805 39594 -109982 -185945 -175000 -49611 -332857 -295449 -203046 -171036 -18953
14057 -18953 246817 224226 -63876 -331434 -107373 -298210 -904995 -985824 -738471 -333697
14047 -333697 -157892 -220661 -255365 -172002 171289 332868 13504 -66694 -42685 -461131
14037 -461131 -558746 -332265 133841 224397 492160 656696 210387 162757 298182 465725
14027 465725 511315 448762 665499 388202 -3599 -106780 1902 71197 284720 -196721
14017 -196721 -507857 -154016 -63103 -79996 165236 89227 -81462 -191241 -344783 -302522
14007 -302522 -351715 -329952 -383388 -178710 -150886 -78003 130448 292922 292650 222279 171534
13996 171534 163107 63564 -114213 27792 -80408 -185624 -78295 -131434 13861 -270948
13986 -270948 -583719 -531840 -383667 -118473 -102760 2008 -36605 71983 -229506 -153678
13976 -153678 -245417 -211340 -130733 19136 305636 327637 277745 227523 186208 135380 -74642
13965 -74642 -225863 -403798 -428401 -395125 -192861 62672 178398 76098 -284184 -413809
13955 -413809 -315704 -484265 -341972 -18732 84947 135879 209443 -47192 -319417 -187266
13945 -187266 -279971 -276115 -481180 -565261 -510658 -246800 -53122 -86519 321452 540845 354429
13934 354429 327129 150317 -21198 -195000 -165068 -100680 -110037 -43941 -83099 -205966 -55815
13923 -55815 -32338 -324325 -274881 -346522 -616062 -863346 -798931 -436754 -32743 -258966
13913 -258966 -260105 -45717 -422786 -603848 -425872 -199277 -271027 -381713 -434426 -256791
13903 -256791 178023 -40175 -160478 -6880 -108941 -138062 -134524 63544 14867 -290874
13893 -290874 -587927 -660190 -426531 -557923 -671993 -477307 -524323 -447242 -124809 69397
13883 69397 -12179 -213258 -131689 -174124 -339761 -345612 -334449 -314819 -390439 -499724 -421184
13872 -421184 -303366 -209836 -242158 -242624 43668 181784 162567 101018 -192050 -477446 -400227
13861 -400227 -113988 59120 -84268 -102380 -23718 -237009 -357650 -404946 -497619 -849792
13851 -849792 -735904 -451211 -181754 40128 -170974 135635 170597 211163 61714 -175113
13841 -175113 -484987 -156547 30226 103940 54799 -74224 -273352 -540140 -627569 -200954
13831 -200954 182395 192821 58402 49180 -289272 -618516 -436155 -337411 -347378 -461081 -490630
13820 -490630 -653646 -635610 -181931 269993 513347 214713 -76286 -5676 -11725 -407739
13810 -407739 -401083 -4240 334434 361368 56283 164697 238911 168337 86918 241208 190234
13799 190234 96036 -286777 -427490 -207016 -186675 -74979 12225 84060 -59236 49521
13789 49521 76584 400041 639957 431168 304575 -81317 -462463 -652661 -442707 -46365
13779 -46365 241698 -119413 -434066 -443703 -177832 -158472 -244068 -223156 -448604 -438344 -188654
13768 -188654 -2027 65052 103412 -4302 -64190 87907 335807 460410 265929 28491
13758 28491 -239626 -15777 35769 66797 303469 85842 -54696 -115352 -93937 12466
13748 12466 73182 -23516 -91922 -111522 48690 173095 131649 -30550 -266111 -473871 -779620
13737 -779620 -792817 -741260 -552370 -276068 -486321 -383035 -149325 165206 297347 -51723
13727 -51723 -60983 -190163 -331205 -9459 107691 -184838 -309220 -201588 -110166 -45121
13717 -45121 52982 -41795 -68267 80524 115323 110498 400685 522271 489697 508147 506123
13706 506123 294873 123696 -13965 -224270 -367115 -40521 299379 109797 -11369 50159
13696 50159 -24897 143934 71540 82953 290649 265963 208918 249416 31132 -412078 -373690
13685 -373690 -165363 14833 -430751 -715933 -547671 70633 368983 409770 486118 586730
13675 586730 518596 517259 149795 -74347 -26951 101513 -236393 -478445 -335464 -99455
13665 -99455 -215490 -159007 -142543 -360310 -457616 -332502 -339473 230219 238020 -48874 -51246
13654 -51246 -267893 -64056 129635 75938 -166701 -101409 -2351 -356415 -279281 -391814
13644 -391814 -629692 -539325 -344579 -204692 -187618 -326939 -297035 -421688 -659201 -822172
13634 -822172 -993918 -1088702 -880060 -543099 -102765 -216851 -302456 -109805 -88773 -326331
13624 -326331 -566693 -810277 -262192 -119249 -237955 -326503 -378875 -159379 -12770 -83531
13614 -83531 -27524 -241910 -34455 -244860 -324708 -115373 -210095 -55545 -35390 60778 359815
13603 359815 458845 292560 -154539 107031 -76274 187294 4088 -181098 -348669 -202074
13593 -202074 89844 93346 -91603 -169306 -430364 -433982 -405178 96669 717909 891021 613963
13582 613963 395909 44636 -137769 98296 261751 -120192 -150233 30088 122854 321420
13572 321420 359970 190101 -290034 -817256 -884913 -551681 -340666 -389988 -306319 -276779
13562 -276779 -390333 -212682 191833 167922 -1003 -229723 -352232 -523241 -127000 27891
13552 27891 186520 265781 369006 499417 370726 457327 643534 283908 94302 127252
13542 127252 43352 -58662 -20794 253365 187197 -74127 -41207 -143181 -422519 -591329
13532 -591329 -604834 -99581 148523 -122955 -263698 -203086 -221806 -242185 -320609 -112112
13522 -112112 -96220 -197474 -243458 -497594 -335255 -542491 -651180 -477105 -452624 -357167
13512 -357167 -204376 -57997 168225 312303 481146 457310 139307 225410 334937 114432
13502 114432 -9983 55920 -210994 -254139 -156627 -25536 161687 17924 2759 97529
13492 97529 171321 319063 204355 -416549 -518667 -208727 -100640 -262607 -506132 -471322
13482 -471322 -646305 -311022 11093 -4719 -429606 -718551 -733051 -580618 -139718 -58893
13472 -58893 140475 59728 -157127 -398958 -405281 -525663 -433790 -327189 -477917 -508980 -108804
13461 -108804 176995 -197449 -145279 -302223 -488994 -629557 -285451 -77754 47452 100920
13451 100920 2023 32383 244014 395801 294120 397097 189456 -131451 46539 321721
13441 321721 605698 505567 148591 149029 385225 500841 357059 391899 507908 -68775
13431 -68775 -307092 -601276 -680123 -431208 110859 124644 -44503 -47743 260087 99626
13421 99626 292311 189931 358108 331245 447448 772962 997660 385327 -41138 -23531
13411 -23531 -152592 -162220 -77160 -264212 -299324 -178677 -231636 -560440 -653364 -425315 -238581
13400 -238581 -346437 -513959 -670308 -636630 -597518 -537384 -606361 -502137 -881715 -1201630
13390 -1201630 -965642 -933410 -601163 -639001 -388013 -122698 307602 488981 106912 -597479
13380 -597479 -685497 -675557 -631680 -358766 -161447 -355683 -705168 -576801 -558947 -433896
13370 -433896 -453534 -271387 -77121 -457995 -547697 -307634 -243619 -111620 167441 655963
13360 655963 648564 270856 107300 80310 13723 149263 112408 185140 239160 387404 267067
13349 267067 -123155 -313083 -321998 -238803 86745 338568 377669 352644 155565 -57600
13339 -57600 -225154 -87002 -159512 -430390 -389738 -442267 -367603 -454481 -674969 -530377 -37581
13328 -37581 416074 452796 201832 -156813 -172193 109609 224052 152186 -186461 -568914
13318 -568914 -440688 93750 529913 421947 163086 188988 160165 -326581 -272778 -180505
13308 -180505 -157319 -282107 -236127 -344318 -512730 -374936 -511065 -553489 -324235 -375750
13298 -375750 -545329 -653727 -529199 -175552 -206688 -125959 -302248 -238695 -91448 -89128
13288 -89128 45508 -62261 -155760 -309525 14700 -9633 -30087 -57112 234658 223679 -93658
13277 -93658 -98201 -10937 264371 258194 -114346 -45610 -20515 -225885 -194720 113741 4015
13266 4015 -69569 90291 184556 -18136 -213556 -443762 -473631 -599382 -517144 -502609 -301128
13255 -301128 -318615 -475090 -847164 -644124 -150766 -16894 57478 -27106 82601 -220913
13245 -220913 -313362 -237290 -289649 -253744 -489479 -437928 -210296 -164189 -98299 -198012 -360726
13234 -360726 -549806 -347152 -246976 -435010 -448288 -686225 -783223 -841106 -760726 -822971
13224 -822971 -563629 -575940 -692206 -318606 -356800 -539804 -484278 -119524 45286 -48385
13214 -48385 43016 106495 88323 222634 84475 -39300 105672 65561 -12428 -33774 -279868
13203 -279868 -428600 -206257 -224178 67219 464594 541067 256096 -72520 -538898 -786106
13193 -786106 -617883 -142101 65008 84738 -231468 -220929 -114152 86236 -12285 -105259
13183 -105259 -306885 -394707 -348780 -272360 -387624 -338565 47396 262651 264894 428071 386196
13172 386196 130855 -227824 -376009 -404684 -165920 -10575 187727 34331 -236476 -558098
13162 -558098 -380786 253312 302794 -114041 -159169 57171 407855 589353 346520 -81215
13152 -81215 -433619 -593265 -412470 22891 -32053 -604246 -657599 -772989 -819809 -492941
13142 -492941 -212626 -415413 -418509 -380287 -293662 -109230 -46086 26270 208369 292345 100176
13131 100176 -54702 -13257 222423 -237841 -523523 -381400 -108941 -207374 -190667 -399079
13121 -399079 -232149 63022 -233658 -60985 84623 125948 131152 -146533 -397703 -507692
13111 -507692 -437217 -248704 -182865 -157336 60946 235845 650249 953931 990537 689517
13101 689517 371143 -18710 -208997 -148257 64567 -398695 -527152 -279724 168102 305182
13091 305182 7391 -421900 -593846 -539090 -205431 -365496 -470601 -489138 -138394 122649
13081 122649 66808 -121544 -471768 -532167 -329819 -284807 -219817 -368192 -501731 -518450
13071 -518450 -597042 -389959 -331692 -298978 -333643 -192404 -442569 -651579 -429039 -192670
13061 -192670 -48818 233724 69951 -158884 -387057 -31781 133411 101250 -328730 -137944
13051 -137944 -116511 -306933 -245692 -76466 -90128 -169980 -416937 -338845 -414479 -419274 -286567
13040 -286567 47776 252212 -203269 -515408 -467821 -322803 -174532 -133128 -44380 153945
13030 153945 87074 -245846 -551428 -730340 -1099670 -855233 -264410 -18488 6054 19610
13020 19610 -409416 -179647 72522 -12122 -231825 -515604 -623308 -679849 -629446 -86765
13010 -86765 -150895 -137845 -278451 -25913 112278 336569 233484 133977 -17833 56883
13000 56883 -165141 -200916 -59419 95431 20690 104787 180691 -108908 103288 175850 128966
12989 128966 -268497 -371678 -211804 -159495 -118703 -136734 25367 217407 82761 11284
12979 11284 -48124 -177189 -137296 -152508 -211716 -76871 -308519 -411403 -634934 -557753 -333706
12968 -333706 -312287 -515657 -448573 -47780 256584 287519 274753 6819 -250295 -495333
12958 -495333 -350290 81427 372156 336747 141477 127291 16227 -20982 56758 37485
12948 37485 -425898 -147948 -207334 -175365 -325171 -275007 -201954 -163221 -320370 -429878 -248268
12937 -248268 19736 -150276 97452 155445 -12744 -117610 -237507 -99524 -148647 -137259
12927 -137259 -252019 -309579 -303714 -54653 -155251 -41725 83769 103060 -8533 360898
12917 360898 379371 79465 -29768 -86839 -253310 -326337 -413454 -533626 -587174 -317442
12907 -317442 -442823 -757960 -704747 -425301 -223841 -240094 -408415 -448862 -217907 -178068
12897 -178068 -291560 -528819 -624985 -322490 106130 -61693 30861 -123014 -115472 233401
12887 233401 113962 -106891 -231381 -90591 84939 87081 277103 553246 304132 536326
12877 536326 638689 227547 118354 -111880 39596 -43392 -206985 -141817 -285701 -349687
12867 -349687 -414417 -15800 -99187 -252155 -426608 -346288 -42379 70880 224596 136691
12857 136691 160868 -130880 -532776 -367903 -278431 -477954 -209301 114997 172303 47591
12847 47591 -185585 -58388 -49436 -211978 -534986 -611791 -361472 -92463 -12254 -277420
12837 -277420 -320786 -277437 -151244 -193556 -203943 -253799 -77379 -62671 -153920 -113422 170212
12826 170212 261800 237940 186134 -144941 -197492 -95614 -88678 29987 599867 850382 482340
12815 482340 -116694 -326695 -125086 -131899 -371591 -564537 -405672 -315870 -208049 -191302
12805 -191302 -183695 -175597 -322710 -86903 134290 194171 43599 130489 123531 56207 116097
12794 116097 332205 626413 572485 300670 -37696 -262093 -447694 -462483 -232182 -189530
12784 -189530 130879 312398 211095 -276103 -225821 139011 23553 36073 -394225 -686423
12774 -686423 -466385 74811 581824 600554 482860 382729 227971 57207 101526 -8820
12764 -8820 200064 72660 -334165 -174421 -1231 -213404 -330047 -424742 -365319 -558565
12754 -558565 -508886 -830504 -787982 -232455 206137 -138130 -186785 -402464 -476336 -508813
12744 -508813 -542753 -455981 144590 224956 270590 -19041 -465612 -304089 -70298 -238412
12734 -238412 -417540 -213050 -174273 -354378 -156355 -79513 -256207 -613679 -622635 -360390
12724 -360390 324994 404032 -50903 -182725 -45316 28784 -320495 -118308 336723 -140174
12714 -140174 -354379 -471435 -291547 -267107 -3515 -152580 -223122 -33995 -107154 -46292
12704 -46292 -194836 -473739 -822393 -1017822 -472859 -69321 -216893 -129821 197448 76026
12694 76026 222002 715826 537665 401028 517757 345253 190245 190888 -249735 -298319
12684 -298319 -77133 85639 -34064 -180736 -295582 -132015 -80793 -269733 -517023 -179103
12674 -179103 -84283 -68458 -42634 -277440 -429058 -385750 -301839 -481275 -374023 -227482
12664 -227482 -183665 88901 116422 1005 -235554 -171822 -76324 316728 140690 -387323
12654 -387323 -391791 -99215 205663 2115 64384 196658 61468 -109522 -261656 -274959
12644 -274959 -75429 -252845 -482483 -373653 -253712 -25026 197646 467046 429487 461060
12634 461060 590844 359863 12790 -328513 -291201 21016 341154 541032 544991 276221
12624 276221 -43727 -210726 -343968 -296806 -186086 -202120 -360551 -334666 -80951 177006
12614 177006 34060 -149984 -192675 -424352 -613434 -462679 -87158 27610 -75046 -434518
12604 -434518 -517513 -578255 -580216 -354434 -82157 130373 326935 224488 -124145 -261962
12594 -261962 -523357 -721428 -379743 -87132 -44061 10862 133026 224815 418598 -72936
12584 -72936 -132222 122588 -4848 -336533 -316404 -265018 -489145 -461234 -308693 -51476
12574 -51476 234715 12001 44243 290665 612493 659879 416852 112899 -254388 -404705
12564 -404705 -100852 -83789 -246447 -103834 -92707 -286789 41825 617662 361968 79878
12554 79878 83524 -64749 -122676 -356178 -314417 -431279 -365759 -50292 -257876 -329353 -78201
12543 -78201 -138664 -409720 -203869 -90373 -349025 100484 173538 -143653 -313063 127276
12533 127276 222278 248098 357336 -27157 -59953 -155005 -353034 -579674 -685139 -306609
12523 -306609 -169155 -6316 218586 632603 642112 493057 129551 -293154 -630155 -858133
12513 -858133 -358195 36466 65942 4765 62340 113041 -142700 -290166 -149806 247424
12503 247424 -31648 33811 -210068 -463234 -179736 -193156 -208648 -237289 -442755 -272306
12493 -272306 193142 195746 86226 54588 -97505 -382300 -296384 59180 172725 337923
12483 337923 138015 370946 409496 261200 136861 174261 -117545 -508527 -694545 -108622
12473 -108622 293905 307579 317286 504569 311547 185475 199812 341242 174686 41572
12463 41572 261343 66626 -365611 -586574 -435534 -185507 -95100 131312 391759 237578
12453 237578 230480 267598 -174124 -283844 -270665 -520692 -447571 -447112 -675590 -568305 -94810
12442 -94810 113390 -90628 36466 -77813 -69301 -132023 -16939 127246 121872 -181719 -504631
12431 -504631 -654605 -573330 -717352 -517255 -393275 -449590 -200641 24451 -137754 -634696
12421 -634696 -607383 -73940 160987 38093 85136 588501 735765 206595 144155 62717
12411 62717 -3384 182255 270428 -63496 -253109 -317637 -219061 33969 29948 22380 162259
12400 162259 57171 29905 82157 68822 4726 -408879 -658424 -426725 -304839 -338337
12390 -338337 -214327 60679 165664 -53079 -234989 -680827 -491182 -328461 -193673 20750
12380 20750 2744 -10631 -188996 -258329 -86894 -60563 -56344 333870 328693 -8830 252416
12369 252416 172665 -79038 -107466 -380888 -482193 -342661 -162153 -46424 78592 211605
12359 211605 -45044 -296985 -353110 -223214 30549 295662 454120 110181 -74587 -1956
12349 -1956 41000 68373 319290 115246 -107377 -162703 -270696 -188499 -39913 -108626 -156576
12338 -156576 -88742 53568 20829 -58359 -137107 -409366 -261715 -110270 -245690 -405876
12328 -405876 -288338 17789 2511 -418439 -646976 -413434 -27716 -47294 12798 559337
12318 559337 776900 415553 -74506 -330985 -294344 -122819 -74321 -449159 -562205 -317574
12308 -317574 -96824 -311367 -308325 -234713 -120264 218903 471659 135027 -353247 -444003
12298 -444003 -323992 -527780 -659404 -482429 -210759 140619 -62043 -300406 -414701 -300551
12288 -300551 -213056 -248091 -318381 -284499 170572 407209 69082 -405862 -386054 -652507
12278 -652507 -869331 -744725 -516720 -333487 -725609 -589879 -137426 52737 53951 -124383
12268 -124383 -84800 -14230 -135790 -231861 -64414 26531 52543 -65568 -165952 221507
12258 221507 420082 467252 417900 -80666 -233410 -226818 -356814 -545516 -371789 20625
12248 20625 264466 169643 198462 29069 -74121 222347 517146 296507 -44111 -472372
12238 -472372 -196607 -36959 210302 407925 385640 284146 230599 215232 -116418 -190719
12228 -190719 -186247 -297546 -173957 43561 163166 -254088 -587527 -180127 83065 81829
12218 81829 162004 12977 -147465 -194409 179773 320961 -99748 -372534 -59004 208124
12208 208124 181415 611683 539905 265428 226570 374738 578676 567651 323789 200396
12198 200396 -25021 -34319 96203 180125 179620 187375 180941 -33055 -180838 -225841 -359770
12187 -359770 -274999 -347946 -366266 -290115 -231696 -138804 -285203 -188493 -169242 -48577 186378
12176 186378 438168 460508 19743 -353437 -585593 -770373 -576723 -257194 139315 307662
12166 307662 23987 -212657 -320565 -714248 -491822 -260425 -394188 -254239 -364042 -298235
12156 -298235 -244015 -405575 -240610 265200 113866 -491371 -600076 -476434 -83615 262665
12146 262665 42663 -437825 -667725 -224898 -12446 99332 537139 505164 329492 134080
12136 134080 49399 -60537 7469 69328 -116328 -277881 -299512 -199487 -134075 -557875
12126 -557875 -873574 -1034572 -945180 -776993 -519532 -363615 -43787 -34027 -190719 -15740
12116 -15740 312468 474018 286709 171853 353753 387457 717093 624182 106608 -78312
12106 -78312 -48001 51176 -23499 -377483 -490367 -329944 -388643 -230157 -50680 -160701
12096 -160701 -212335 -200266 97418 328864 354411 380154 517802 510844 239550 264423 146963
12085 146963 302797 320179 207995 322384 227960 -37832 -39344 -79138 -7843 116788 318986
12074 318986 27654 -113717 -327042 -491453 -282283 -15457 209218 91340 -74530 -48799
12064 -48799 94003 116544 -142084 -7611 184434 145415 126444 -65228 -248274 -40210
12054 -40210 36844 -46354 -18591 -97548 -147101 -159989 65840 110104 165590 11782 -146266
12043 -146266 -402205 -378232 -375127 45038 323307 218038 -77686 -41363 198609 162093
12033 162093 -4784 -270237 -265996 -132469 2724 233830 272671 74702 -112051 -338574
12023 -338574 -333512 -111429 82959 127148 15158 245725 144581 -219152 -198137 -245896
12013 -245896 -342697 -446223 -713794 -699881 -440153 -526243 -597265 -403465 -133340 -162779
12003 -162779 -131366 -306151 -328627 -201347 75757 88577 178725 85424 -111420 -266731
11993 -266731 -271690 -381842 -429164 -170635 -4978 -192504 -181515 5741 217951 354970
11983 354970 258356 -32258 -56500 -12539 -205727 -403506 -523584 -487637 -425631 -555772
11973 -555772 -700634 -582778 -825794 -508529 -25979 104733 7966 93198 263201 221831
11963 221831 62276 110315 99531 61447 32765 52002 132392 307347 99628 18564 190102
11952 190102 341307 175226 -76250 -91612 -289119 -620200 -974739 -1095403 -787469 -780467
11942 -780467 -601064 -318294 -522959 -823961 -845402 -822663 -608490 -480597 -495767 -551987
11932 -551987 -465754 -362905 -531088 -467031 59432 -55200 -7859 -26626 -16101 294013
11922 294013 267764 138841 -12482 85662 117291 73092 448640 418443 440114 358919 543838
11911 543838 339247 -4962 -82568 -524222 -571973 -156629 8851 15716 -51266 -134923 59878
11900 59878 257134 -12723 -37404 -89846 175750 294046 260780 192138 179927 387982 527748
11889 527748 379095 285522 -87634 -328518 -493835 -185411 -83585 -381033 -352388 -341269
11879 -341269 -418625 -279239 -511102 -204375 32105 24724 -71319 -47596 -201714 -451951
11869 -451951 -390346 -569595 -527317 -184270 -60145 -153308 -311 -256787 -272765 -417387
11859 -417387 -436649 -366652 -32208 191245 266441 287328 175156 201847 80960 -259387
11849 -259387 -237633 -206489 -242251 -552451 -593701 -474209 -404329 21889 127587 109893 -411668
11838 -411668 -537641 -480409 -374068 -506550 -559729 -408738 -30438 166546 35644 -187246
11828 -187246 -424742 -300760 -191718 -273908 -227754 -90120 98080 506436 389799 18107
11818 18107 -62076 85912 164067 458590 464926 164132 -168313 -7570 -183460 -433519
11808 -433519 -608488 -227410 -342464 -280020 63661 35098 372300 535944 2572 153760
11798 153760 121546 -61106 -304362 -259804 -436580 -350143 -611173 -543861 -120426 162136
11788 162136 59112 -100344 -35330 -217475 -402555 -272534 41792 111492 -201553 -209020
11778 -209020 -418311 -329609 -208585 -449524 -618743 -869742 -997459 -836209 -769936 -685352
11768 -685352 -1030386 -1078761 -716966 -223992 -459903 -640462 -410178 -110949 -19043 65352
11758 65352 245719 188007 391744 167990 29842 32466 67862 -2384 64341 -159930 -411486
11747 -411486 -440631 -141188 -7152 35240 -211461 -229319 -114917 155795 504219 169100
11737 169100 -79587 12897 -310167 -699675 -939272 -408551 -118320 -497481 -587751 -716074
11727 -716074 -545630 -521147 -429407 -390686 -491204 -438483 -530997 -323161 123621 5748
11717 5748 138305 116097 -17216 -247201 -175602 21136 -218918 -502582 -364457 -425437
11707 -425437 -418570 -112378 -22036 -158455 -289481 -387204 -593091 -497921 -135601 -87001 -410492
11696 -410492 -467781 -348935 -20459 99158 -64665 -29696 108658 -42279 -288587 -259440
11686 -259440 -170543 -363835 -537163 -318988 -219954 -356656 -307847 -92674 -69846 -254967
11676 -254967 -683987 -1058168 -804067 -543447 -253557 -221416 -89621 -102133 -423512 -623050
11666 -623050 -394643 -165436 48268 526404 688745 388117 295699 -27659 -196366 -240129
11656 -240129 -147477 -202432 -278573 -356110 -387380 -124292 64977 209226 427716 386771 81270
11645 81270 -156697 -338926 196507 264324 -131243 -418486 -341344 -74210 -80798 -201208
11635 -201208 -561268 -694336 -808438 -955332 -631204 -342991 46798 213646 240453 106641
11625 106641 -24068 -99852 -353472 -185729 -79950 -203304 -121618 -282339 -102870 -193441
11615 -193441 -291740 -359722 -293017 -303641 -400365 -211844 -58809 109969 43064 -252024 -322946
11604 -322946 -1678 149409 83277 121000 -37502 -187570 43545 253656 227187 -64907
11594 -64907 -364598 -405410 -265648 44761 72083 59948 98486 -47349 -538731 -677243
11584 -677243 -523328 -328048 -173990 44259 510107 852812 540980 289 -128413 46922
11574 46922 -39440 -48359 -156488 -98795 111113 299500 156852 -99214 -496505 -327512
11564 -327512 -126022 -71849 -187669 -208385 -322882 -400171 -30263 119113 71105 -87660
11554 -87660 -212265 -170929 -50140 -165528 -63117 -224750 -323690 -283924 -185929 -268954 -379117
11543 -379117 -406343 -534581 -497694 -657923 -654624 -688495 -340499 -624229 -865084 -605313
11533 -605313 -423390 -114569 -294225 -624595 -352172 205732 211394 425774 469239 163847
11523 163847 174488 87047 134728 -283716 -408942 -487775 -484616 -381689 -244559 -430147 -518914
11512 -518914 -642083 -517581 -450668 -136342 -12797 19560 -190402 -493689 -623475 -287764
11502 -287764 172943 185003 21052 350810 410768 39088 -276927 -553245 -606109 -532045
11492 -532045 35510 524590 493296 62497 -106484 -142795 -81817 -51690 -362422 -438895
11482 -438895 -69398 168854 484730 -281243 -632446 -809425 -670304 -455211 -77652 62749
11472 62749 118169 12483 34326 -71983 -136610 -56438 -120742 -241971 -91618 -94512 19507
11461 19507 175556 318986 438664 251708 -278176 -394057 -163911 -148248 -370742 -423786
11451 -423786 -399021 -174768 -287853 -650293 -772648 -798517 -975983 -897023 -453334 -6842
11441 -6842 123241 8615 -101359 -695030 -850812 -288720 -442025 -480757 -461313 -670849
11431 -670849 -665918 -311258 -225951 45841 294914 418950 377909 228696 488027 452313
11421 452313 505919 237586 380790 550432 564107 428857 166654 159704 130978 -259414
11411 -259414 -379972 -547704 -323611 -73081 -83336 48563 328428 130513 5037 -89434
11401 -89434 -154216 -123860 -344670 -582041 -528337 -279661 -371968 -206813 -150018 -165109 -302194
11390 -302194 -287516 -58455 -55734 11207 -205965 -159066 57977 190973 224808 29452 -230850
11379 -230850 -327231 -250878 117917 382635 229020 226656 206286 244826 93048 30739 114308
11368 114308 7508 -210453 -343333 52779 430804 563852 362937 314988 82153 42610
11358 42610 59476 295849 20191 -275687 -68080 166291 54052 63230 -220633 -275039
11348 -275039 -395962 -313242 -269322 -322600 -302014 -65845 -205321 -618815 -431469 -222914
11338 -222914 -206491 -162084 265521 392181 350683 -55736 -110449 199055 316482 273507
11328 273507 271369 221894 281681 170632 -274944 -339780 -232563 -36878 279618 283888 78710
11317 78710 18914 104162 230453 248473 291166 190505 58121 33253 3133 -184989 -443347
11306 -443347 -303480 -168348 -18064 11495 174839 -6500 -52393 -195081 -87852 -189
11296 -189 -191594 -272601 -183641 -158779 -2094 53696 -40320 -94786 -160191 -38053 -340742
11285 -340742 -446267 -295103 -287808 -155656 -81402 -4619 141898 623323 183323 -122824
11275 -122824 -20706 -95979 -412591 -411088 -567819 -661630 -700977 -234211 -273490 -61057 134180
11264 134180 19048 77076 270220 564824 272027 66722 435899 616156 430674 179988
11254 179988 301812 132519 -83435 -191393 31830 -123004 -278416 -247390 -257686 -525432
11244 -525432 -603881 -471063 -583201 -484473 -246439 -108199 44219 138229 -85256 -157525
11234 -157525 -181748 -111159 -303596 -407171 -157644 -150611 -187466 215851 225912 -19442 -279140
11223 -279140 -301645 -163073 88101 -206667 -28328 -184806 -13754 -193181 -204719 -20905
11213 -20905 219004 233325 402120 -21527 23826 -113877 -73826 45697 267703 5445
11203 5445 -115328 -72769 -18913 -48544 9453 46197 -144786 -132416 -58305 33955 -94855
11192 -94855 -235612 -291572 -519322 -346453 -167272 -66551 -52050 51824 -252511 -105892
11182 -105892 242560 76443 -93373 -14789 -254575 -267475 -105481 61614 194898 222391
11172 222391 -119575 -187906 -190697 -118593 -151900 -431960 -358364 -284387 -180957 -420341 -362176
11161 -362176 -562119 -336690 -116511 -67157 -394024 -405246 -355960 -268410 230483 51266
11151 51266 -292742 -69905 92070 97115 -200024 -306177 -530198 -730567 -458589 -231134
11141 -231134 100017 168542 75849 269140 346685 -44546 13548 44961 299689 311243 -119413
11130 -119413 -292430 -302256 -132174 -135999 -589591 -572917 -174124 15894 -18302 -323922 -319875
11119 -319875 -412739 -411244 -336275 -220049 -300986 3052 316533 509641 594456 659535 323315
11108 323315 306010 250120 400425 79142 -82140 131729 10482 255048 254892 270932 299568
11097 299568 310636 231959 430815 464282 366057 60229 -74707 409543 326667 61952
11087 61952 -167 -116904 -66886 13339 -142605 -192888 -5095 170570 89556 -4396 133442
11076 133442 471068 496241 717164 548920 103623 1250 -5744 65489 88537 -180422
11066 -180422 -75981 220611 152676 433388 680387 342698 77474 470741 593307 388725
11056 388725 265337 414277 305258 150886 70418 61455 14518 -30469 321790 621256
11046 621256 718680 1035379 867124 1203588 1339290 1522464 1158691 772750 1022074 1100547
11036 1100547 1382351 1375949 1567842 1530758 1612828 1786117 1600280 1421378 1567239 1871920
11026 1871920 2107714 1811182 2013680 2137969 2316928 2272222 2511398 2469081 1955918 1538924
11016 1538924 1587787 1741291 1633148 1459125 1633709 2158151 1957909 1799618 1801992 1666387
11006 1666387 1239924 1177454 1100438 841916 1017147 942678 815624 816967 754883 573620
10996 573620 635827 938410 919896 689996 867897 832644 875209 900785 944153 587978 -213632
10985 -213632 -531001 -282133 -34905 259337 407789 430751 233443 176128 244982 342258
10975 342258 235834 423822 270841 103730 223472 362608 203517 49650 -105051 -153316
10965 -153316 109655 186171 -150784 -336881 -169410 236690 591348 951628 713317 320440
10955 320440 312351 294231 249071 496710 183507 -248967 -531261 -785618 -566423 -590686
10945 -590686 -813138 -467682 -481303 -532108 -479930 -569734 -592548 -871217 -461856 -16448
10935 -16448 2475 -103110 -56326 2716 150243 130073 -459651 -455202 -195772 186709 333214
10924 333214 507184 325432 198305 181607 122211 200651 -353275 -535190 -401790 -159867
10914 -159867 62637 -150642 -310606 -2071 34485 253162 -32218 -185233 -197107 31186
10904 31186 77275 40683 89552 -141173 -138582 183341 298383 341661 536420 326621 172323
10893 172323 127181 -11183 -147832 -92284 144085 394292 321584 825 -24157 -76956
10883 -76956 69073 358156 17995 -251923 -591751 -674627 -639709 -558504 -290096 -371173
10873 -371173 -327490 -392041 -568635 -832617 -572165 -89155 204741 -75600 -420326 -572721
10863 -572721 -204933 -140774 -285515 -337324 -174976 338813 730775 499482 102736 -197290
10853 -197290 222729 331346 21752 -60312 277327 343287 303323 361451 27685 -291844
10843 -291844 -137235 -287920 -194855 -125506 -418 -438228 -661464 -636486 -753117 -629578
10833 -629578 -319117 -58641 38040 201238 112824 289570 402830 466828 422696 23564
10823 23564 93524 427878 200573 154219 -10621 -212837 -187138 -261114 -386059 -662554
10813 -662554 -535180 -234833 -217085 -200579 -49311 24330 116702 5255 -163115 -622066
10803 -622066 -994475 -945511 -509652 -372030 -521771 -528581 -2635 452413 324815 283291
10793 283291 161666 36570 193255 382080 103325 -114675 -260994 -154370 34465 245246
10783 245246 91713 26694 179746 -268780 -391039 -41002 -231125 -217739 -228775 -221922
10773 -221922 -295728 -93551 175772 64842 109160 -192729 -307614 -13934 81619 -328782
10763 -328782 -439734 -420152 -560720 -430067 -164153 -149666 -181819 -117680 -199765 -401966
10753 -401966 -410497 -336208 -592513 -624464 -751525 -612419 -261342 -455990 -677523 -576610
10743 -576610 -724266 -601478 -463765 -410033 -166681 -121655 -98878 -15631 17753 -166854
10733 -166854 -395500 -437205 -351476 -369472 -429326 -508379 -619044 -495250 -100230 98424
10723 98424 100303 -9387 300422 411533 131503 66445 354482 760345 637002 559425
10713 559425 382362 96839 118872 439342 432560 99166 62658 227326 162411 226566 256291
10702 256291 75788 -138737 -172811 274229 448333 390268 363925 154734 -72657 -214269
10692 -214269 142259 88402 109041 883735 1318265 1232103 1189168 1299715 711750 365293
10682 365293 558579 539222 710949 694701 606685 931682 932174 923288 1187869 1239538 1011698
10671 1011698 818343 794713 830343 693247 555276 771829 615012 140599 259057 456455
10661 456455 591978 927425 756906 1068230 1437363 2112636 2141623 2197780 2410037 2596408
10651 2596408 3096362 2972594 2880684 2529827 2409794 2541702 2285350 1890328 2038858 2042259
10641 2042259 2129268 2323013 2702209 3149814 3716616 4248042 4923102 5954516 7146687
10632 7146687 8201326 9276698 10238539 11222171 11932090 12813769 14372207 16424379 20022470
10623 20022470 25086465 31672335 40529406 52408643 67099238 83793823 99733477
10616 99733477 113903414 126353318 136805157 143461426 145810001 145547632 147313272 155113850
10608 155113850 171552706 197018771 227019823 255126639 278862138 298568232 312775947
10601 312775947 317702874 310275099 295165671 283213055 283593385 299704431 329443781
10594 329443781 365112629 397006771 421097563 438550055 447066896 438949896 410893117
10587 410893117 372455353 338192775 317573946 312651857 320169512 333417727 344485475
10580 344485475 350822470 353342989 349098194 333190740 304603714 270707786 241267628
10573 241267628 221442392 210626749 206720711 206038529 204830016 202104814 197157805 189086440
10565 189086440 176449601 159393776 140181238 122065446 107616937 96438144 87904876
10558 87904876 81522365 76333365 71859323 68193534 64726585 61441529 58720987 56324020
10550 56324020 54141430 52305927 50331967 48404902 46688459 44940150 43513275 42073466
10542 42073466 40885175 39432934 38301123 37186655 36162273 34834474 33338376 32237189
10534 32237189 31435224 30714266 29944987 29115666 28423904 27325928 26523371 25900891 25391027
10525 25391027 24681268 24001259 23237590 22762630 22224885 21265348 20785400 20424928 19662795
10516 19662795 19145063 19128066 18691091 18199016 17582112 16836069 16329300 15836350 15691581
10507 15691581 15594772 15336373 14752165 14080519 14047110 14023548 13404588 13262596 13113472 12453150
10497 12453150 12149029 12122451 11802646 11096965 10762390 10489490 10291280 10012996 10087666 10001481
10487 10001481 9860076 9760260 9497050 9106414 9052834 8532884 8149492 7997581 7985138 7789132
10477 7789132 7530348 7279521 7227939 7166699 7145525 6877730 6608548 6306179 6533667 6522963
10467 6522963 6422178 6388494 6152550 6235036 6061288 5778089 5719404 5540197 5126601 4625852
10457 4625852 4837826 5389728 5191186 5340931 5310101 5357043 5292798 5239860 4934315 4700833
10447 4700833 4875561 4775681 4769715 4645715 4565353 4329773 4313591 4438825 4459778 4189416
10437 4189416 4105399 3734141 3476667 3198292 2892327 3101227 3320771 3327780 3405345 3424575
10427 3424575 3382667 3563341 3809797 3986594 4032403 3934150 3833118 3409618 3038830 2520325
10417 2520325 2249456 2051665 2006700 2231278 2557979 3069188 3140857 2835993 2484787 2284111
10407 2284111 1927424 1729380 1919332 1691458 1485977 1639640 2041947 2106898 2106633 2007817
10397 2007817 1775881 1585602 1455103 1399809 1540733 1634377 1586564 1614637 1651166 1397779
10387 1397779 1364843 1291965 810513 566442 814983 947724 1210511 1178402 1010464 1123684
10377 1123684 756094 388302 384458 909124 851142 786179 851605 624294 516159 673696
10367 673696 948042 909378 1194378 1084143 892015 942409 1120294 1008086 841179 900105
10357 900105 1015196 1072726 1203282 1545016 1662881 1483715 1013294 992315 998713 956819
10347 956819 1031178 619361 508332 436183 522314 669345 542024 589472 615793 762288
10337 762288 1035129 1043230 960657 960901 1046657 915314 994302 925270 678571 436050 477304
10326 477304 587712 239315 214613 404640 755451 708549 543681 373333 275984 326661
10316 326661 519498 286093 555197 346570 396817 560012 282794 353790 612013 671686
10306 671686 835011 800790 711417 610311 684875 873619 937067 621851 410727 167658
10296 167658 502639 760168 559358 646245 793937 999106 1001735 1334742 1539174 1207772
10286 1207772 707494 398634 364831 872279 724220 679927 747832 907677 803104 722573
10276 722573 821236 570852 538689 835282 1026391 954194 795586 688915 811483 959988
10266 959988 881731 487301 131980 369657 349100 163537 115573 104721 419251 389558
10256 389558 272423 499753 546944 530729 489114 408765 400279 75469 -190842 14013 172681
10245 172681 618756 377471 301640 375556 148324 3968 48907 40892 78472 221944 529084
10234 529084 753955 726501 472592 581996 832210 523518 209953 169798 249768 248684
10224 248684 165933 219579 160548 151659 25171 46237 34670 -126743 -8377 295373 860958
10213 860958 1008350 715582 547957 174842 58710 -291068 -520152 -297199 -85154 -104069
10203 -104069 -5235 265878 776524 788424 749662 778511 591944 288976 300361 513884
10193 513884 408370 276065 -35546 -211582 -404376 -377586 -71648 164543 447543 796879
10183 796879 746022 829717 819162 1144029 1244019 1176779 976522 1212958 1042512 784089
10173 784089 687705 761510 1025288 1191129 1598634 2213305 2182729 2156944 2202588 2463839
10163 2463839 2732942 2301074 1782664 1501025 1359098 1569879 2109261 2471306 2579044
10154 2579044 2399418 2038436 1955048 1752330 1861001 1715921 1488502 1223957 1319706 1846887
10144 1846887 2260589 1802943 1942181 2547773 2319017 1958057 1699892 1857058 1700846
10135 1700846 1265300 961908 952371 1023446 1301889 1160504 1283815 1576973 1662958 1509487
10125 1509487 1276520 940697 662469 575383 603433 784317 726334 366495 283418 6101
10115 6101 -423313 -223465 217877 745214 985694 1135899 930044 641989 420159 295495
10105 295495 437806 506884 411441 356672 234743 37104 324244 307789 334147 416981 428568
10094 428568 628472 319993 223337 423298 498797 600874 495393 516542 71289 34007
10084 34007 322621 516081 576946 609001 490519 110241 -96913 -138894 78468 426057
10074 426057 479366 213145 274094 390034 437925 815015 863583 728354 507842 629911
10064 629911 375246 103037 134968 68864 264555 96495 -226823 -134279 -47247 149588
10054 149588 151601 170573 301122 125027 255138 282755 403393 717924 725209 500669 543384
10043 543384 706855 383381 103101 427203 496458 595224 642150 412454 71391 132784
10033 132784 267742 384739 450954 263734 34387 103329 -91218 -125428 -146811 187257
10023 187257 257487 14307 44539 -55137 20540 124587 -48772 71278 235118 89516
10013 89516 -20415 -58911 -159066 -154203 -311061 64453 302864 267296 -53460 9690 -150696
10002 -150696 -328983 -474498 -616947 -456263 -429347 56847 470814 613700 508889 380697
9992 380697 301503 -87034 -273753 -315308 -425791 -210855 187422 436159 563679 151778
9982 151778 -296286 -53180 -182835 -145771 -175669 -229171 -211494 -232595 -246777 -179494 194188
9971 194188 119599 105831 -133882 -506082 -311028 -217028 -286387 -635843 -753640 -629470
9961 -629470 -472381 -484906 -489575 -531831 -390416 -356804 -400797 -360639 -5072 210442 321204
9950 321204 453983 480280 299253 138547 9763 268122 219345 35420 -207403 -327708
9940 -327708 -259433 178342 191291 68859 175895 263353 710349 720876 650700 812316 825869
9929 825869 988593 941700 765854 1110498 1474975 1314327 1100426 375930 172665 -25836
9919 -25836 -110654 -146977 -71941 -103842 -405891 -388719 118145 566610 501387 383734 102205
9908 102205 -89423 120179 164640 196473 292911 154684 -38202 208790 479896 664141
9898 664141 1044138 889747 524034 540247 495318 350689 530955 768673 730971 647559
9888 647559 449387 103939 180249 -28469 -155379 71454 413351 348365 300557 48766
9878 48766 54254 -214586 -296582 -182324 -60284 63657 -119820 -17789 125982 219058 235850
9867 235850 -121527 -283945 -189577 124367 677515 762601 784840 952843 887223 977944 446311
9856 446311 -98399 -186105 -189591 -145554 -267309 -230537 -206103 -125822 -112191 -15231 -102485
9845 -102485 -234958 -191048 -149917 -4061 238064 134944 -65961 211640 323078 223338
9835 223338 380650 516806 646077 231938 -183961 -27415 73673 344511 520852 628214
9825 628214 771768 709733 784965 721372 466743 102403 -250499 -288315 -116721 -10677
9815 -10677 129441 453095 538194 175281 9393 -116222 44195 -87323 -218169 -78027
9805 -78027 184641 70217 133906 307588 720433 643117 421285 601489 294795 -283663
9795 -283663 -138856 281760 240416 207393 446244 845215 629919 450431 412567 637255
9785 637255 625513 413462 258932 148348 189001 406096 507200 377796 67996 179820
9775 179820 264671 403643 536326 181493 -126099 -473017 -123935 318173 382838 596373
9765 596373 702730 334333 95027 193273 75861 -84433 81584 147735 457292 860150
9755 860150 836475 658278 440642 212226 220959 254559 147470 -44835 -9255 147018 86075
9744 86075 -143748 39012 24128 -146447 -226138 110283 129841 -60848 -243634 -213353 -7659
9733 -7659 161487 172050 224760 -68471 -229570 -285187 -206812 -204590 113700 264962 -128866
9722 -128866 -169019 -218471 116611 273806 165781 287495 226930 225318 266087 343551 195388
9711 195388 417221 496499 395928 404168 479781 328589 89480 -174309 -429282 -525801 -201349
9700 -201349 357208 533235 555813 183233 285021 478476 392984 379225 660805 732947
9690 732947 670624 659215 498400 144832 -102918 62894 267664 308852 281829 292231 11413
9679 11413 -58132 178581 199559 -152353 -113194 -298906 -95323 171296 260290 194988 106106
9668 106106 15154 308661 400224 248292 245660 228063 321869 119259 15501 -60435 -162446
9657 -162446 -390521 -508068 -154421 189614 330100 585149 815199 1147989 1020563 1541059
9647 1541059 1656427 1118264 969395 866723 802228 687308 405490 203012 51402 77620
9637 77620 145123 -222661 -472728 144504 515410 391106 246251 194054 185854 -38152 -272207
$$ [...]
##END NTUPLES=NMR SPECTRUM
##END=
