##TITLE=Analysis number 315153
Compound Code btb 11564
Project Code adrs
Chemist Name fudan
##JCAMPDX= 6.0         $$ Bruker NMR JCAMP-DX V2.0
##DATA TYPE= NMR SPECTRUM
##DATA CLASS= NTUPLES
##ORIGIN= Bruker BioSpin GmbH
##OWNER= NMR
$$ XWIN-NMR		Version 3.5
$$ Wed Nov  9 12:24:33 2005 GMT Standard Time (UT+0h)  MAYBRIDGE\NMR@NMR_250MHZ
##.OBSERVE FREQUENCY= 250.131544655141
##.OBSERVE NUCLEUS= ^1H
##.ACQUISITION MODE= SIMULTANEOUS (DQD)
##.ACQUISITION SCHEME= undefined
##.AVERAGES= 16
##.DIGITISER RES= 18
##SPECTROMETER/DATA SYSTEM= dpx250
##.PULSE SEQUENCE= zg30
##.SOLVENT NAME= DMSO
##.SHIFT REFERENCE= (INTERNAL, DMSO, 0, 16.522)
##AUDIT TRAIL= $$ (NUMBER, WHEN, WHO, WHERE, WHAT)
$$ ##TITLE= Audit trail, XWIN-NMR		Version 3.5
$$ ##JCAMPDX= 5.01
$$ ##ORIGIN= Bruker BioSpin GmbH
$$ ##OWNER= NMR
$$ C:\u/data/dgb/nmr/ADRS/12060/pdata/1/auditp.txt
$$ ##AUDIT TRAIL=  $$ (NUMBER, WHEN, WHO, WHERE, WHAT)
(   1,<2005-11-09 12:24:03.88 +000>,<MAYBRIDGE\NMR>,<NMR_250MHZ>,
      <created by zg, POWCHK disabled, PULCHK disabled
       configuration hash MD5:
       62 19 C7 07 E1 42 D1 B7 37 6C 3D D0 77 39 F9 E6
       data hash MD5: 64K
       E5 E3 5F 9B E3 F2 92 E8 0F 03 8F EC 03 0D F1 A2>)
(   2,<2005-11-09 12:24:18.78 +000>,<MAYBRIDGE\NMR>,<NMR_250MHZ>,
      <Start of raw data processing
       ef LB = 0.3 FT_mod = 6 PKNL = 1 SI = 32K 
       data hash MD5: 32K
       2F D1 6E 3E 3F C3 61 CE C5 AE 7C B4 01 A2 EB 31>)
(   3,<2005-11-09 12:24:22.39 +000>,<MAYBRIDGE\NMR>,<NMR_250MHZ>,
      <apk 
       data hash MD5: 32K
       D2 EB 1A 3D E1 21 7E 57 80 F0 9C 56 41 34 7F 81>)
(   4,<2005-11-09 12:24:23.43 +000>,<MAYBRIDGE\NMR>,<NMR_250MHZ>,
      <abs ABSG = 5 
       data hash MD5: 32K
       99 6C C2 B4 83 BE FF 67 1F 60 8F AB 19 4A D6 C2>)
$$ ##END=
$$ 
$$ hash MD5
$$ 04 26 FF ED 72 D6 0D BE 05 74 5C E3 8E 36 7D 35
##$RELAX= 
##$RELAX= 
##$RELAX= 
##$RELAX= 
##$RELAX= 
##$RELAX= 
##$RELAX= 
$$ Bruker specific parameters
$$ --------------------------
##$DU= <C:\u>
##$EXPNO= 12060
##$NAME= <ADRS>
##$PROCNO= 1
##$TYPE= <nmr>
##$USER= <dgb>
##$AMP= (0..31)
100 100 100 100 100 100 100 100 100 100 100 100 100 100 100 100 100 100 
100 100 100 100 100 100 100 100 100 100 100 100 100 100 
##$AQSEQ= 0
##$AQ_mod= 3
##$AUNM= <au_zg>
##$AUTOPOS= <28 >
##$BF1= 250.13
##$BF2= 250.13
##$BF3= 250.13
##$BF4= 250.13
##$BF5= 500.13
##$BF6= 500.13
##$BF7= 500.13
##$BF8= 500.13
##$BYTORDA= 1
##$CFDGTYP= 0
##$CFRGTYP= 5
##$CHEMSTR= <none>
##$CNST= (0..31)
1 1 145 1 1 1 1 1 1 1 1 1 1 1 1 1 1 1 1 1 1 1 1 1 1 1 1 1 1 1 1 1 
##$CPDPRG= <>
##$CPDPRG1= <>
##$CPDPRG2= <>
##$CPDPRG3= <>
##$CPDPRG4= <mlev>
##$CPDPRG5= <mlev>
##$CPDPRG6= <mlev>
##$CPDPRG7= <mlev>
##$CPDPRG8= <mlev>
##$CPDPRGB= <>
##$CPDPRGT= <>
##$D= (0..31)
0 1 0 0 0 0 0 0 0 0.06 0 0 0 0 0 0 0.0002 0 0 0 0 0 0 0 0 0 0 0 0 0 0 
0 
##$DATE= 1131539042
##$DBL= (0..7)
120 120 120 120 120 120 120 120 
##$DBP= (0..7)
150 150 150 150 150 150 150 150 
##$DBP07= 0
##$DBPNAM0= <>
##$DBPNAM1= <>
##$DBPNAM2= <>
$$ [...]
##$SUBNAM7= <"">
##$SUBNAM8= <"">
##$SUBNAM9= <"">
##$SW= 20.6930455092707
##$SWIBOX= (0..15)
0 0 3 0 0 0 0 0 0 0 0 0 0 0 0 0 
##$SW_h= 5175.983436853
##$TD= 65536
##$TD0= 1
##$TE= 295.16
##$TE2= 300
##$TE3= 300
##$TEG= 300
##$TL= (0..7)
0 120 120 120 120 120 120 120 
##$TP= (0..7)
150 150 150 150 150 150 150 150 
##$TP07= 0
##$TPNAME0= <>
##$TPNAME1= <>
##$TPNAME2= <>
##$TPNAME3= <>
##$TPNAME4= <>
##$TPNAME5= <>
##$TPNAME6= <>
##$TPNAME7= <>
##$TPOAL= (0..7)
0.5 0.5 0.5 0.5 0.5 0.5 0.5 0.5 
##$TPOFFS= (0..7)
0 0 0 0 0 0 0 0 
##$TUNHIN= 0
##$TUNHOUT= 0
##$TUNXOUT= 0
##$USERA1= <user>
##$USERA2= <user>
##$USERA3= <user>
##$USERA4= <user>
##$USERA5= <user>
##$V9= 5
##$VALIST= <valist>
##$VCLIST= <CCCCCCCCCCCCCCC>
##$VD= 0
##$VDLIST= <DDDDDDDDDDDDDDD>
##$VPLIST= <PPPPPPPPPPPPPPP>
##$VTLIST= <TTTTTTTTTTTTTTT>
##$WBST= 1024
##$WBSW= 4
##$XGAIN= (0..3)
0 0 0 0 
##$XL= 0
##$YL= 0
##$YMAX_a= 403061
##$YMIN_a= -350913
##$ZGOPTNS= <>
##$ZL1= 120
##$ZL2= 120
##$ZL3= 120
##$ZL4= 120
##$ABSF1= 16.522
##$ABSF2= -4.171173
##$ABSG= 5
##$ABSL= 3
##$ALPHA= 0
##$AQORDER= 0
##$ASSFAC= 0
##$ASSFACI= 0
##$ASSFACX= 0
##$ASSWID= 0
##$AUNMP= <proc_1d>
##$AZFE= 0.1
##$AZFW= 0.1
##$BCFW= 0
##$BC_mod= 0
##$BYTORDP= 0
##$COROFFS= 0
##$CY= 12.5
##$DATMOD= 1
##$DC= 0
##$DFILT= <>
##$DTYPP= 0
##$F1P= 14.0000005364418
##$F2P= -0.99999901652339
##$FCOR= 0.5
##$FTSIZE= 32768
##$FT_mod= 6
##$GAMMA= 0
##$GB= 0
##$INTBC= 1
##$INTSCL= 1
##$ISEN= 128
##$LB= 0.3
##$LEV0= 0
##$LPBIN= 0
##$MAXI= 10000
##$MC2= 0
##$MEAN= 0
##$ME_mod= 0
##$MI= 0
##$NCOEF= 0
##$NC_proc= -3
##$NLEV= 6
##$NOISF1= 0
##$NOISF2= 0
##$NSP= 0
##$NTH_PI= 0
##$NZP= 0
##$OFFSET= 16.522
##$PC= 1
##$PHC0= 73.49373
##$PHC1= -0.8321077
##$PH_mod= 1
##$PKNL= yes
##$PPARMOD= 0
##$PSCAL= 4
##$PSIGN= 0
##$REVERSE= no
##$SF= 250.13
##$SI= 32768
##$SIGF1= 0
##$SIGF2= 0
##$SINO= 400
##$SIOLD= 32768
##$SREGLST= <1H.DMSO>
##$SSB= 0
##$STSI= 32768
##$STSR= 0
##$SW_p= 5175.98343685301
##$SYMM= 0
##$S_DEV= 0
##$TDeff= 65536
##$TDoff= 0
##$TI= <Analysis number 999999
Compound Code 99
Book Reference 9
Project Code 9>
##$TILT= no
##$TM1= 0
##$TM2= 0
##$TOPLEV= 0
##$USERP1= <user>
##$USERP2= <user>
##$USERP3= <user>
##$USERP4= <user>
##$USERP5= <user>
##$WDW= 1
##$XDIM= 32768
##$YMAX_p= 397986146
##$YMIN_p= -305120
$$ End of Bruker specific parameters
$$ ---------------------------------
##NTUPLES= NMR SPECTRUM
##VAR_NAME=  FREQUENCY,     SPECTRUM/REAL,   SPECTRUM/IMAG
##SYMBOL=    X,             R,               I
##VAR_TYPE=  INDEPENDENT,   DEPENDENT,       DEPENDENT
##VAR_FORM=  AFFN,          ASDF,            ASDF
##VAR_DIM=   32768,         32768,           32768
##UNITS=     HZ,            ARBITRARY UNITS, ARBITRARY UNITS
##FACTOR=    0.157963299565203, 1,           1
##FIRST=     4132.6476996994, 0,             0
##LAST=      -1043.33573715361, 0,           0
##MIN=       -1043.33573715361, -305120,     0
##MAX=       4132.6476996994, 397986146,     0
$$ Real data points
##PAGE= N=1
##DATA TABLE= (X++(R..R)), XYDATA
$$ [...]
$$ plain form
25091 57719 42423 11458 18433 14492 17352 28126 21879 40993 29518 -53336 -34913 -19412
25079 -19412 -37791 -25288 -50735 -6295 57013 37399 19918 25334 28422 -505 -22175 -2251
25067 -2251 7667 -6373 -4030 -15452 -31031 -53509 -61524 -79413 -52773 -12656 27462 58177
25055 58177 51599 30531 31076 36615 46254 47391 55286 44234 29586 52334 25740 -10334 9420
25042 9420 -2277 -41691 -89269 -80130 -62416 -34414 10229 49877 6228 17922 12720 6680
25030 6680 13852 35421 60729 52608 15219 -146 17315 23151 -6129 -36692 -23770 -12031
25018 -12031 11452 21839 51455 55968 54061 52804 21755 38026 31612 13047 5435 -15480 -52176
25005 -52176 -25927 -8785 -6234 6930 16624 24092 6448 -18542 -30772 -53128 -57473 -59713 -49207
$$ packed form
25091E7719j5296l0965O975l941K860J0774o247J9114j1475q2854J8423J5501
25079a9412j8379J2503k5447M4440O3308j9614j7481N416L088k8927k1670J9924
25067b251R918j4040K343j1422j5579k2478q015j7889K6640M0117M0118L0715
25055E8177o578k1068N45N539R639J137P895j1052j4648K2748k6594l6074J9754
25042I420j1697l9414m7578R139J7714K8002M4643L9648m3649J1694n202o040
25030F680P172K1569K5308q121l7389j5365J7461N836k9280l0563J2922J1739
25018a2031K3483J0387K9616M513j907j257l1049J6271o414j8565p612k0915l6696
25005e2176K6249J7142K551J3164R694P468j7644k4990j2230k2356m345k240J0506
$$ plain form
24992 -49207 -29566 1516 -12328 2951 6416 26116 30775 21468 34421 31748 -7526 -29764
24980 -29764 -14581 -18849 -34804 -23313 21461 22931 14266 23174 51169 -1478 -27898 -31317 -30258
24967 -30258 -48449 -20552 7430 -705 -33005 -39422 -14503 -30928 -29849 -16917 12975 14971
24955 14971 12953 11750 21458 14050 37026 9595 -28784 -11029 47108 44533 -1703 -33379 -4525
24942 -4525 -5209 -47698 -11549 32971 -1743 -41011 -49497 -63690 -59199 -40112 -57805 -84079 -61976
24929 -61976 -56156 -59709 -42710 17427 46470 37685 14323 2254 -11633 -21013 -2419 60479
24917 60479 84748 78695 40308 19273 33580 17842 12061 613 26656 45923 44003 -3098
24905 -3098 21721 23850 -4831 -30290 -48899 -25161 -23960 -41085 -42803 -49001 -40051 -33042 14141
$$ packed form
24992d9207J9641L1082j3844J5279L465J9700M659r307J2953k673l9274k2238
24980b9764J5183m268j5955J1491M4774J470q665Q908K7995n2647k6420l419J059
24967c0258j8191K7897K7982q135l2300o417K4919j6425J079J2932K9892J996
24955A4971k018j203R708p408K2976k7431l8379J7755N8137k575m6236l1676K8854
24942d525o84m2489L6149M4520l4714l9268q486j4193M491J9087j7693k6274K2103
24929f1976N820l553J6999O0137K9043q785k3362j2069j3887r380J8594O2898
24917F0479K4269o053l8387k1035J4307j5738n781j1448K6043J9267j920m7101
24905c098K4819K129k8681k5459j8609K3738J201j7125j718o198Q950P009M7183
$$ plain form
24892 14141 7085 32083 28507 -6685 -14747 -7306 14673 -5496 1409 17583 19527 12835 -29134
24879 -29134 -47682 -35701 -19472 -36372 -32638 6871 -5872 -18831 -38479 -27919 41561 101404
24867 101404 94540 49518 29016 23252 31704 37413 14909 15681 65370 60643 61117 68503 45309
24854 45309 15361 -20744 -15844 -64777 -81835 -35587 27202 24056 -15835 -41886 -35039 -4594
24842 -4594 -14841 -26652 -15127 -27344 -46359 -42658 -38310 -23004 -32288 -22698 12423 -14473 -43393
24829 -43393 -16055 -18015 -62260 -73525 -29855 -399 -25396 -36338 -61778 -50188 -36880 -26032
24817 -26032 -20030 -49213 -52935 -28104 -12524 10963 -37851 -71771 -84087 -55976 -38828 -39882
24805 -39882 -41737 -11866 14323 21618 22220 18074 -952 5 14329 5879 16045 6707 10594 -1534
$$ packed form
24892A4141p056K4998l576l5192q062P441K1979k0169O905J6174J944o692m1969
24879b9134j8548J1981J6229j6900L734L9509j2743j2959j9648J0560O9480N9843
24867A01404o864m5022k0502n764Q452N709k2504P72M9689m727M74P386k3194
24854D5309k9948l6105M900m8933j7058M6248O2789l146l9891k6051O847L0445
24842d594j0247j1811J1525j2217j9015L701M348J5306r284R590L5121k6896k8920
24829d3393K7338j960m4245j1265M3670K9456k4997j0942k5440J1590J3308J0848
24817b6032O002k9183l722K4831J5580K3487m8814l3920j2316K8111J7148j054
24805c9882j855K9871K6189P295O02m146j9026R57J4324q450J0166r338L887j2128
$$ plain form
24791 -1534 -11622 15456 -4426 -1395 -18975 -51381 -3638 9914 -27246 -25552 -27499 -38104
24779 -38104 -34767 -53505 -25609 -8120 -34286 -55886 -60728 -73895 -32734 -29719 -62312 -87882
24767 -87882 -101079 -62415 -75493 -49903 24725 54676 62956 17504 -23874 -14999 -2759 26883
24755 26883 -5746 -38068 -33570 -41616 -25776 -14136 -46495 -61021 -46564 -22474 -18898 39049
24743 39049 -6270 -13419 2143 57350 32907 48683 67161 55364 60437 39258 37718 24955
24731 24955 36185 23587 32028 -4813 -23072 -9117 22147 29130 2218 -20732 -55155 -40166
24719 -40166 -47051 -80233 -57468 -67803 -69244 -39687 -23135 -34241 -26055 -42550 -42330 -69947 -72935
24706 -72935 -85075 -53572 -14816 28903 51113 52338 46948 11251 -36817 -54110 -35368 14029
$$ packed form
24791a534j0088K7078j9882L031j7580l2406M7743J3552l7160J694j947j0605
24779c8104L337j8738K7896J7489k6166k1600m842j3167M1161L015l2593k5570
24767h7882j3197L8664j3078K5590P4628K9951Q280m5452m1378Q875J2240K9642
24755B6883l2629l2322M498q046J5840J1640l2359j4526J4457K4090L576N7947
24743C9049m5319p149J5562N5207k4443J5776J8478j1797N073k1179j540j2763
24731B4955J1230j2598Q441l6841j8259J3955L1264O983k6912k2950l4423J4989
24719d0166o885l3182K2765j0335j441K9557J6552j1106Q186j6495K20k7617k988
24706g2935j2140L1503L8756M3719K2210J225n390l5697m8068j7293J8742M9397
$$ plain form
24694 14029 -5069 -23375 -27007 -11224 -9846 3321 61132 50358 16184 25 21368 13039
24682 13039 27715 42425 8372 -30832 -52034 -70747 -43183 -59600 -61453 -27587 -36524 -66148
24670 -66148 -59595 -57193 -68243 -94157 -149020 -110089 -70539 -50391 -45424 -50125 -39370 -39850 -30889
24657 -30889 7988 16729 25788 7314 -18798 -55522 -54506 -47453 -7228 31092 40009 44472 24827
24644 24827 2085 -15567 -10891 1225 -9119 -11069 -27004 -31834 -29231 16620 23484 3424 89
24631 89 -20711 -4250 5522 -17994 -7015 -7903 -43045 -77394 -58440 -38911 -49140 -65105 -69836
24618 -69836 -51818 -60305 -63990 -18152 4791 38237 46445 47594 55655 46140 -1035 -25545 12310
24605 12310 38746 24003 7993 -15899 -64350 -116765 -134000 -91344 -49662 -14191 10648 59166
$$ packed form
24694A4029j9098j8306l632J5783J378J3167N7811j0774l4174j6159K1343q329
24682A3039J4676J4710l4053l9204k1202j8713K7564j6417j853L3866q937k9624
24670f6148O553K402j1050k5914n4863L8931L9550K0148M967m701J0755m80Q961
24657c0889L8877Q741R059j8474k6112l6724J016P053M0225L8320Q917M463j9645
24644B4827k2742j7652M676J2116j0344j950j5935m830K603M5851O864k0060l335
24631H9k0800J6461R772k3516J0979q88l5142l4349J8954J9529j0229j5965m731
24618f9836J8018q487l685M5838K2943L3446Q208J149Q061r515m7175k4510L7855
24605A2310K6436j4743j6010k3892m8451n2415j7235M2656M1682L5471K4839M8518
$$ plain form
24593 59166 59315 35272 51343 38868 -17540 -67372 -74595 -58947 -11473 16203 -25389 -17377
24581 -17377 17490 9721 -9514 -35645 -56512 -62948 -65855 -62036 -67128 -54077 -26385 5637 23882
24568 23882 3742 -19086 -34810 -22528 -7190 -5347 -22447 -19368 -14199 9891 13895 -23283
24556 -23283 -35548 168 -1370 -53437 -62102 -30455 -60135 -74306 -19368 -12676 -37513 -75792
24544 -75792 -84839 -77346 -25589 -9160 -16068 -26217 -7676 4184 6536 -39912 -50013 -60097
24532 -60097 -46669 -63374 -75290 -78858 -75382 -14602 34136 45152 37229 19559 4555 -22105
24520 -22105 -14577 -11016 -8016 29199 14103 2822 -21474 8716 21227 1562 -45435 -56122
24508 -56122 -53343 -47534 -68678 -36917 -42034 -54822 -2967 49560 39645 5206 -11318 18198
$$ packed form
24593E9166J49k4043J6071j2475n6408m9832p223J5648M7474K7676m1592Q012
24581a7377L4867p769j9235k6131k0867o436k907L819n092J3051K7692L2022J8245
24568B3882k0140k2828j5724J2282J5338J843j7100L079N169K4090M004l7178
24556b3283j2265L5716j538n2067q665L1647k9680j4171N4938O692k4837l8279
24544g5792r047P493N1757J6429o908j0149J8541J1860K352m6448j0101j0084
24532f0097J3428j6705j1916l568L476O0780M8738J1016p923j7670j5004k6660
24520b2105P528L561L000L7215j5096j1281k4296L0190J2511j9665m6997j0687
24508e6122K779N809k1144L1761n117j2788N1855N2527r915l4439j6524K9516
$$ plain form
24496 18198 37190 21050 22802 34563 10166 10992 15071 24922 -5422 -51273 -82579 -89446 -63804
24483 -63804 10146 8118 -36876 -57376 -60529 -37657 -3896 6269 -21436 -57798 -63592 -121486
24471 -121486 -144942 -107775 -67908 -94750 -116038 -125491 -82465 -50285 -57189 -57940 -54540 -17772
24459 -17772 -8589 -70788 -98806 -113037 -79514 -37487 -55179 -111127 -88898 -61301 -26301 -3681
24447 -3681 -24160 -45976 -67553 -97323 -98962 -134009 -141975 -109344 -43352 -7140 2274 2139 -17405
24434 -17405 -41507 -58594 -5999 4504 -30479 -31918 -43607 -50668 -70652 -57463 -27756 -7072
24422 -7072 8493 -2176 -73608 -43714 -57686 -74298 -68255 -30273 35753 42730 -49443 -85044
24410 -85044 -45318 9182 -364 26430 49053 20024 19599 8486 -15557 6093 2409 5755 -18907
$$ packed form
24496A8198J8992j6140J752J1761k4397Q26M079R851l0344m5851l1306o867K5642
24483f3804P3950k028m4994k0500l153K2872L3761J0165k7705l6362n794n7894
24471a21486k3456L7167L9867k6842k1288r453M3026L2180o904p51L400L6768
24459a7772R183o2199k8018j4231L3523M2027j7692n5948K2229K7597L5000K2620
24447c681k0479k1816k1577k9770j639l5047p966L2631O5992L6212R414j35j9544
24434a7405k4102j7087N2595J0503l4983j439j1689p061j9984J3189K9707K0684
24422g072J5565j0669p1432K9894j3972j6612O043L7982O6026O977r2173l5601
24410h5044L9726N4500r546K6794K2623k9029m25j1113k4043K1650l684L346k4662
$$ plain form
24397 -18907 -49041 -63029 -24169 38019 44364 22750 -50767 -35511 -34235 -67157 -69260 -45787
24385 -45787 -23041 -23995 12754 4412 -39345 -59356 -48086 -34605 -49789 -51748 -52910 -49756 -44251
24372 -44251 -34557 -24179 -18266 -19011 -8519 -40690 -51480 -55195 -58784 -30538 -29372 2860 24966
24359 24966 29403 15316 13403 18901 -10005 -32800 -59504 -62947 -17429 17442 4187 -25224
24347 -25224 -44518 -46360 -70763 -31598 -40619 -41880 -8781 33090 43952 26322 7909 -9283
24335 -9283 -50597 -61944 -66287 -29472 -24764 -19721 2755 15700 -12359 2127 105 -37631 -31575
24322 -31575 -14651 -28905 -78181 -55524 -38381 -70918 -45631 -31718 -46468 -11302 -2091 9594
24310 9594 -15526 -36237 -50730 -45437 -41213 -46902 -50812 -38254 -21174 -53567 -35188 -3974 3054
$$ packed form
24397a8907l0134j3988L8860O2188O345k1614p3517J5256J276l2922k103K3473
24385d5787K2746r54L6749q342m3757k0011J1270J3481j5184j959j162L154N505
24372d4251R694J0378N913p45J0492l2171j0790l715l589K8246J166L2232K2106
24359B4966M437j4087j913N498k8906k2795k6704l443M5518L4871j3255k9411
24347b5224j9294j842k4403L9165r021j261L3099M1871J0862j7630j8413j7192
24335i283m1314j1347m343L6815M708N043K2476J2945k8059J4486k022l7736O056
24322c1575J6924j4254m9276K2657J7143l2537K5287J3913j4750L5166R211J1685
24310I594k5120k0711j4493N293M224n689l910J2558J7080l2393J8379L1214P028
$$ plain form
24297 3054 -25851 -67509 -69839 -81077 -75752 -23942 -6406 -39526 -46987 -44515 -72375 -39394 -13166
24284 -13166 -14753 -7077 -12530 1445 1742 -13069 10445 35744 35079 -2929 -23974 -48025 -50726
24271 -50726 -45480 -30277 -47584 -58578 -54248 -85210 -42955 -2575 -18299 -47378 -40498 -56064
24259 -56064 -81408 -116914 -86161 -63596 -47946 -22178 -43577 -44595 -33197 -67062 -79882 -91204
24247 -91204 -86540 -78706 -38901 -23588 -51007 -88220 -117836 -98900 -56636 -41138 -72865 -90336
24235 -90336 -64002 -67415 -78472 -94405 -81705 -22996 -7046 -46039 -24037 -626 28088 25355
24223 25355 -34905 -48030 -63235 -83746 -64211 -33528 -49736 -38657 -7526 -38942 -46003 -26283
24211 -26283 16167 35873 46452 61543 37337 11898 7820 2029 -32817 -55277 -60700 11979
$$ packed form
24297C054k8905m1658k330j1238N325N1810J7536l3120p461K472k7860L2981K6228
24284a3166j587P676n453J3975K97j4811K3514K5299o65l8008k1045k4051k701
24271e0726N246J5203j7307j0994M330l0962M2255M0380j5724k9079O880j5566
24259e6064k5344l5506L0753K2565J5650K5768k1399j018J1398l3865j2820j1322
24247i1204M664P834L9805J5313k7419l7213k9616J8936M2264J5498l1727j7471
24235i0336K6334l413j1057j5933J2700N8709J5950l8993K2002K3411K8714k733
24223B5355o0260j3125j5205k0511J9535L0683j6208J1079L1131l1416p061J9720
24211b6283M2450J9706J0579J5091k4206k5439m078n791l4846k2460n423P2679
$$ plain form
24199 11979 7072 -48555 -58735 -23154 -37198 -57075 -40120 -34275 -36019 -58484 -75533 -98350
24187 -98350 -53561 -22864 -8410 2620 -21484 -5440 11483 -22873 -65258 -71412 -69934 -20554
24175 -20554 -20172 -46799 -34678 -74887 -71318 -34731 -33961 -19356 -29130 -38381 -49702 -56413 -85579
24162 -85579 -92734 -72022 -64386 -36878 -12962 5324 -11134 -7101 12027 -8548 -18484 -21884 -48355
24149 -48355 -39919 -32652 -72172 -83774 -33121 11966 -13304 -59017 -78994 -69712 -76324 -83636 -75451
24136 -75451 -54835 -42236 642 -11654 -26609 -33501 -50239 -75925 -68907 -37282 -16772 28358
24124 28358 71932 18262 15270 54102 60682 24751 -8942 -4046 -3969 -69094 -32308 -25686 -34474
24111 -34474 -31665 -8400 21019 49289 28274 7153 7411 4399 -5870 26122 43023 8283
$$ packed form
24199A1979m907n5627j0180L5581j4044j9877J6955N845j744k2465j7049k2817
24187i8350M4789L0697J4454J1030k4104J6044J6923l4356m2385o154J478M9380
24175b0554L82k6627J2121m0209L569L6587P70J4605r774r251j1321o711k9166
24162h5579p155K0712P636K7508K3916J8286j6458M033J9128k0575r936l400k6471
24149d8355Q436P267l9520j1602N0653M5087k5270m5713j9977R282o612p312Q185
24136g5451K0616J2599M2878j2296j4955o892j6738k5686P018L1625K0510M5130
24124B8358M3574n3670k992L8832O580l5931l3693M896P7o5125L6786O622q788
24111c4474K809K3265K9419K8270k1015k1121K58l012j0269L1992J6901l4740
$$ plain form
24099 8283 -5334 37226 9823 -20004 -15861 13583 54598 43350 -19949 -62509 -40809 -22015
24087 -22015 -27391 -15923 -42633 -34493 -15852 -23262 -73668 -133998 -150325 -112584 -58947 -65884
24075 -65884 -93521 -68181 -17442 -42078 -35438 -40797 -53160 -62749 -63457 -47791 -28326 -25325 -40819
24062 -40819 -77245 -83491 -98451 -84948 -58109 -59077 -48032 -81341 -71100 -48310 -24305 -19590
24050 -19590 -12409 8207 21337 -29796 -72063 -74771 -60593 -64976 -66962 -60986 -55288 -42483 -38511
24037 -38511 -9016 -19574 -38415 -32869 -21992 -50663 -93359 -58405 10925 32034 -37690 -86153
24025 -86153 -40332 7554 -4838 -5219 -13263 -47986 -53669 -94769 -86748 -69504 -17398 19719 -8488
24012 -8488 -7699 -31594 -9032 -9603 -57007 -50885 4617 4858 11780 40260 39764 6317 -50504 -64424
$$ packed form
24099H283j3617M2560k7403k9827M143K9444M1015j1248o3299m2560K1700J8794
24087b2015n376J1468k6710Q140J8641p410n0406o0330j6327L7741N3637o937
24075f5884k7637K5340N0739k4636O640n359j2363r589p08J5666J9465L001j5494
24062d0819l6426o246j4960J3503K6839r68J1045l3309J0241K2790K4005M715
24050a9590P181K0616J3130n1133m2267k708J4178m383j986N976N698J2805L972
24037c8511K9495j0558j8841N546J0877k8671m2696L4954O9330K1109o9724m8463
24025h6153M5821M7886j2392l81q044l4723n683m1100Q021J7244N2106L7117k8207
24012h488P89k3895K2562n71m7404O122N5502K41O922K8480m96l3447n6821j3920
$$ plain form
23998 -64424 -55993 -78521 -57415 -29034 17023 -422 15861 54746 34098 -1939 -22617 -28423
23986 -28423 -62235 -84342 -61024 -53780 -97252 -73528 -47082 -48218 -71816 -59627 -56679 -53631
23974 -53631 -14540 5405 30795 85110 72582 76581 58787 -17515 -54507 -44072 -40065 -42317
23962 -42317 -26780 -3171 4809 31976 26883 9629 -12468 -82038 -125143 -123292 -86073 -28723
23950 -28723 -17374 -59879 -78653 -59245 -18041 -20545 -17602 -34800 -56559 -54719 -54405 -75283 -101584
23937 -101584 -100203 -60223 -100809 -96173 -51302 -36765 -27918 -38341 -31656 -43178 -45399 -37933 -15668
23924 -15668 -37063 -51649 -44853 -63110 -80123 -67112 -81743 -71960 5497 5651 -86639 -151190
23912 -151190 -124236 -68266 -45231 -41122 -54132 -52536 -41369 -37296 -61428 -70766 -56152 -23785
$$ packed form
23998f4424Q431k2528K1106K8381M6057j7445J6283L8885k0648l6037k0678n806
23986b8423l3812k2107K3318P244m3472K3724K6446j136k3598J2189K948L048
23974e3631L9091J9945K5390N4315j2528L999j7794p6302l6992J0435M007k252
23962d2317J5537K3609P980K7167n093j7254k2097o9570m3105J851L7219N7350
23950b8723J1349m2505j8774J9408M1204k504K943j7198k1759J840L14k0878k6301
23937a01584J381L9980m0586M636M4871J4537Q847j0423O685j1522k221P466K2265
23924a5668k1395j4586O796j8257j7013J3011j4631R783P7457J54r2290o4551
23912a51190K6954N5970K3035M109j3010J596J1167M073k4132r338J4614L2367
$$ plain form
23900 -23785 6206 -19151 -65881 -58263 -49360 -45401 -6454 -24141 -73488 -80368 -95556 -78131
23888 -78131 -47569 -63550 -70227 -55929 -59985 -39559 -13006 -48859 -45951 -56823 -67115 -109725
23876 -109725 -86656 -23082 -9998 15936 -24902 -44913 -44373 -40979 -64586 -50568 -36119 -37266
23864 -37266 -58596 -19393 -19900 -37412 -52433 -31454 -28297 -68725 -59601 -57291 -45867 -87296 -94205
23851 -94205 -81602 -113207 -136010 -108458 -70672 -757 9102 -53760 -78958 -52137 -41080 -25424
23839 -25424 -24266 -44866 -54709 -49706 -46758 -61623 -73115 -36405 -21674 -31188 -62557 -47085 -3877
23826 -3877 -5290 -1823 -20191 -52588 -74501 -57699 -29976 -29323 13951 5704 -27822 -58035 -88944
23813 -88944 -100164 -113512 -63195 -30810 -34701 -54573 -51406 -33639 -77331 -82219 -28592 5977
$$ packed form
23900b3785K9991k5357m6730P618Q903L959L8947j7687m9347o880j5188J7425
23888g8131L0562j5981o677J4298m056K0426K6553l5853K908j0872j0292m2610
23876a09725K3069O3574J3084K5934m0838k0011N40L394k3607J4018J4449j147
23864c7266k1330L9203n07j7512j5021K0979L157m0428R124K310J1424m1429o909
23851i4205J2603l1605k2803K7552L7786O9915R859o2862k5198K6821J1057J5656
23839b5424J158k0600r843N003K948j4865j1492L6710J4731r514l1369J5472M3208
23826c877j413L467j8368l2397k1913J6802K7723O53M3274q247l3526l0213l0909
23813h8944j1220j3348N0317L2385l891j9872L167J7767m3692m888N3627L4569
$$ plain form
23801 5977 13398 5174 21563 2061 -29096 -53720 -57615 -66935 -90633 -61576 -40939 -36150 -65286
23788 -65286 -82496 -52093 -16856 -14506 21702 62567 46790 4002 -594 -580 -16363 -8884 -20129
23775 -20129 -36833 -71398 -91844 -46720 15090 -34089 -28868 -3072 -24986 -71227 -80621 -84834
23763 -84834 -72589 -101960 -114395 -103401 -87855 -52469 -36809 -13503 -44933 -63654 -61183 -37138
23751 -37138 -32271 -29687 -51968 -76320 -54501 -57921 -75413 -62318 -41610 -12907 -459 5864
23739 5864 6330 26512 53362 39054 6489 19293 26080 23732 -23132 -67826 -31718 -17311 -18718
23726 -18718 -26311 -9135 4338 -27671 -18432 4301 18391 34734 45356 49463 59928 23374
23714 23374 -29736 -34518 -28693 -23064 -4491 -28141 -33040 -13365 608 8649 18642 26046 -19830
$$ packed form
23801E977P421q224J6389j9502l1157k4624l895r320k3698K9057K0637M789k9136
23788f5286j7210L0403L5237K350L6208M0865j5777m2788m596J4j5783P479j1245
23775b0129j6704l4565k0446M5124O1810m9179N221K5796k1914m6241r394m213
23763h4834J2245k9371j2435J0994J5546L5386J5660K3306l1430j8721K471K4045
23751c7138M867K584k2281k4352K1819l420j7492J3095K0708K8703J2448O323
23739E864M66K0182K6850j4308l2565J2804O787k348m6864m4694L6108J4407j407
23726a8718p593J7176J3473l2009R239K2733J4090J6343J0622M107J0465l6554
23714B3374n3110m782N825N629J8573k3650m899J9675J3973Q041R993P404m5876
$$ plain form
23701 -19830 -2749 -2709 26252 17175 -23269 -80984 -70068 -61999 -34041 3595 -3933 -16420 -2509
23688 -2509 23959 -21174 -27591 -6463 1900 -7220 -18891 -61763 -46854 -43256 -66925 -81287 -41514
23675 -41514 -23564 -22091 -40629 -27009 -22472 -17316 -2063 51286 44714 17466 -14617 -14098 18139
23662 18139 17479 11438 -8794 -73986 -137675 -104189 -66382 -2369 23999 31035 8435 -19464
23650 -19464 -6946 -27385 -39231 -38109 -29342 -24895 -46616 -75451 -60839 -42808 -68110 -116169
23638 -116169 -83827 -60572 -23461 -17626 -18504 10918 18527 -14595 -24475 7688 -6531 -19383
23626 -19383 -50527 -21889 -47271 -79071 -93912 -92895 -83386 -82944 -87258 -73814 -55005 -39496 -28738
23613 -28738 -9023 -39917 -73733 -79809 -73739 -78813 -70201 -48990 -21202 -28991 -40801 -72491 -66528
$$ packed form
23701a9830J7081M0K8961r077m0444n7715J0916Q069K7958L7636p528j2487J3911
23688b509K6468m5133o417K1128Q363r120j1671m2872J4909L598k3669j4362L9773
23675d1514J7950J473j8538J3620M537N156J5253N3349o572k7248l2083N19L2237
23662A8139o60o041k0232o5192o3689L3486L7807O4013K6368P036k2600k7899
23650a9464J2518k0439j1846J122Q767M447k1721k8835J4612J8031k5302m8059
23638a16169L2342K3255L7111N835q78K9422P609l3122r880L2163j4219j2852
23626a9383l1144K8638k5382l1800j4841J017R509M42m314J3444J8809J5509J0758
23613b8738J9715l0894l3816o076O070n074Q612K1211K7788p789j1810l1690N963
$$ plain form
23600 -66528 -79998 -65185 -48511 -31542 6295 15555 -40704 -27958 8956 -33375 -62505 -47732
23588 -47732 -28542 3087 15654 -11379 -28263 -33966 -78375 -110503 -106093 -72166 -55298 -43203
23576 -43203 -50272 -43982 -47265 -88859 -109715 -60758 -12666 14366 28006 22993 7407 -2873
23564 -2873 -11949 -9391 -30977 -30768 -47381 -36875 2934 -4970 -46331 -60882 -42597 9139 62324
23551 62324 20831 -18474 -33998 -30002 -24976 -66622 -76972 -104748 -117316 -133787 -106837 -50327
23539 -50327 -61277 -91251 -103119 -79449 -52430 -19956 -14742 -14982 -8714 -37074 -60188 -84061
23527 -84061 -113559 -140852 -99654 -79521 -95104 -88664 -75121 -56008 -70042 -53543 -52659 -45142
23515 -45142 -23290 -26092 -63062 -88909 -63076 -13932 14454 20660 25916 43946 25205 13251
$$ packed form
23600f6528j3470J4813J6674J6969L7837R260n6259J2746L6914m2331k9130J4773
23588d7732J9190L1629J2567k7033j6884n703m4409l2128M410L3927J6868J2095
23576d3203p069O290l283m1594k0856M8957M8092K7032J3640n013j5586j0280
23564b873r076K558k1586K09j6613J0506L9809p904m1361j4551J8285N1736N3185
23551F2324m1493l9305j5524L996N026m1646j0350k7776j2568j6471K6950N6510
23539e0327j0950k9974j1868K3670K7019L2474N214k40O268k8360k3114k3873
23527h4061k9498k7293M1198K0133j5583O440J3543J9113j4034J6499Q84P517
23515d5142K1852k802l6970k5847K5833M9144K8386O206N256J8030j8741j1954
$$ plain form
23503 13251 -50490 -99445 -81582 -76554 -83933 -62576 -95063 -119387 -79731 -59156 -95133 -110579
23491 -110579 -97020 -71831 -52322 -49233 -70034 -93779 -76330 -63492 -57993 -93571 -83456 -64947
23479 -64947 -55190 -43440 -23323 -33731 -56385 -102043 -45854 -42851 -33079 -32232 -50791 -39535 -13943
23466 -13943 -59229 -71072 -84464 -82461 -24420 -42701 -84569 -118455 -124921 -87798 -56521 -39974
23454 -39974 -34302 -53391 -37017 -80371 -107571 -84702 -72411 -60907 -96356 -92370 -80033 -51275
23442 -51275 -3801 -20503 -88836 -83164 -79939 -88850 -81431 -74974 -46351 -63109 -51450 -33085 -44125
23429 -44125 -39978 -54159 -65920 -46065 -43601 -64106 -103116 -122822 -105053 -51479 -46887 -43469
23417 -43469 -11935 -35078 -55831 -46714 -38164 -50833 -48905 -59465 -100983 -112856 -109823 -61368
$$ packed form
23503A3251o3741m8955J7863N028p379K1357l2487k4324L9656K0575l5977j5446
23491a10579J3559K5189J9509L089k0801k3745J7449J2838N499l5578J0115J8509
23479f4947R757J1750K0117j0408k2654m5658N6189L003R772Q47j8559J1256K5592
23466a3943m5286j1843j3392K003N8041j8281m1868l3886o466L7123L1277J6547
23454c9974N672j9089J6374m3354k7200K2869J2291J1504l5449L986J2337K8758
23442e1275M7474j6702o8333N672L225q911P419O457K8623j6758J1659J8365j1040
23429d4125M147j4181j1761J9855K464k0505l9010j9706J7769N3574M592L418
23417d3469L1534k3143k0753R117Q550j2669J928j0560m1518j1873L033M8455
$$ plain form
23405 -61368 -17484 -15477 -4748 -2135 -34430 -23054 20174 35070 30415 27821 -392 -13332
23393 -13332 -11318 -16385 -16636 -10013 -50045 -53873 -34888 -31418 -70210 -74836 -54325 -48335 -24707
23380 -24707 -9722 -34548 -104219 -80271 -30814 -29919 -52109 -53263 -42876 -28417 -2574 -16159
23368 -16159 -35182 -30549 -55512 -90528 -94334 -70142 -68030 -77648 -24161 16737 25919 11318 3021
23355 3021 -29800 -54658 -42230 -30738 -25461 -29031 -39280 -60896 -56527 -31943 -53985 -91029
23343 -91029 -93554 -88058 -117439 -108829 -106779 -47840 -15778 -30022 -87955 -103659 -74003 -51472
23331 -51472 -41024 -35368 -15893 14622 18169 28029 17802 -20605 -18593 -18123 -32494 8918 11800
23318 11800 -30978 -36091 -4903 8195 -5963 -25031 -20382 -14642 -11130 -24213 -27676 -54719 -17458
$$ packed form
23405f1368M3884K007J0729K613l2295J1376M3228J4896m655k594k8213j2940
23393a3332K014n067k51O623m0032l828J8985L470l8792m626K0511N990K3628
23380b4707J4985k4826o9671K3948M9457Q95k2190j154J0387J4459K5843j3585
23368a6159j9023M633k4963l5016l806K4192K112r618N3487M0898R182j4601q297
23355C021l2821k4858J2428J1492N277l570j0249k1616M369K4584k2042l7044
23343i1029k525N496k9381Q610K050N8939L2062j4244n7933j5704K9656K2531
23331e1472J0448N656J9475L0515L547R860j0227l8407K012M70j4371M1412K882
23318A1800m2778n113L1188J3098j4158j9068M649N740L512j3083l463k7043L7261
$$ plain form
23305 -17458 -31083 -40816 -42847 -22849 -24787 -20122 -11094 -16300 -51002 -35539 -31845 -13688 4572
23292 4572 -2008 -6766 -49534 -39779 -15581 8625 -7642 -55488 -54952 -47613 -78503 -83687 -76063
23279 -76063 -94861 -56125 -37764 -51529 -62474 -77925 -92493 -74974 -55395 -71624 -24955 -69046
23267 -69046 -124360 -99696 -59016 -81212 -72237 -77677 -70155 -26730 22254 -8248 6243 3695
23255 3695 21393 33159 -30474 -59568 -50671 -9029 -29513 -38399 -19689 -32833 -13215 -22123
23243 -22123 -52419 -48992 -64999 -62839 -30741 -30938 -43867 -20697 6350 -10384 -24996 -59162
23231 -59162 -65024 -46344 -8628 -31691 -24038 2250 -18471 -6650 18528 -28092 -55850 -61793
23219 -61793 -31223 -59904 -47581 -49037 -35458 -41806 -92046 -65215 -35359 -31069 -36160 -70844
$$ packed form
23305a7458j3625r733k031J9998j938M665R028n206l4702J5463L694J8157J8260
23292D572o580m758m2768R755K4198K4206j6267m7846N36P339l0890n184P624
23279g6063j8798L8736J8361j3765j0945j5451j4568J7519J9579j6229M6669m4091
23267f9046n5314K4664M0680k2196Q975n440P522M3425M8984l0502J4491k548
23255C695J7698J1766o3633k9094Q897M1642k0484q886J8710j3144J9618q908
23243b2123l0296L427j6007K160L2098j97j2929K3170K7047j6734j4612l4166
23231e9162n862J8680L7716k3063P653K6288k0721J1821K5178m6620k7758n943
23219f1793L0570k8681J2323j456J3579o348n0240K6831K9856M290n091l4684
$$ plain form
23207 -70844 -110130 -84758 -59958 -62871 -64380 -73972 -64280 -60945 -37053 -5988 -28279 -56671 -97885
23194 -97885 -121046 -105847 -70875 -26861 -28920 -49821 -12296 -4969 -8091 5799 -13665 -74098
23182 -74098 -79706 -76198 -61530 -63740 -56271 -73498 -98397 -103229 -97910 -32265 -32039 -52844 -69000
23169 -69000 -70699 -56446 -86666 -78078 -83632 -60035 -59813 -56630 -65728 -56831 -18496 -20053 -39931
23156 -39931 -39620 -42389 -38867 -18622 -37599 -36939 -17315 -50096 -85096 -39670 -2634 3414 57874
23143 57874 60895 3195 -3028 -8589 -4303 -6136 -9373 -1512 33297 22989 4786 33091 42941
23130 42941 11695 -41697 -84674 -90661 -73026 -76878 -21707 -12469 -20624 -34006 -33732 -8808 -29760
23117 -29760 -54929 -44425 -42927 -85645 -57312 -21620 -4794 -32818 -47336 -38946 -35959 -53183
$$ packed form
23207g0844l9286K5372K4800k913j509r592R692L335K3892L1065k2291k8392m1214
23194i7885k3161J5199L4972M4014k059k0901L7525P327l122J3890j9464o0433
23182g4098n608L508J4668k210P469j7227k4899m832N319O5645K26k0805j6156
23169f9000j699J4253l0220Q588n554K3597K22L183r098Q897L8335j557j9878
23156c9931L11k769L522K0245j8977O60J9624l2781l5000M5426L7036O048N4460
23143E7874L021n7700o223n561M286j833l237P861L4809j0308j8203K8305R850
23130D2941l1246n3392m2977n987J7635l852N5171R238q155j3382K74K4924k0952
23117b9760k5169J0504J498m2718K8333L5692J6826k8024j4518Q390K987j7224
$$ plain form
23105 -53183 -81205 -56561 -42650 -21887 -42353 -88907 -42762 -10289 -13966 -29616 -67442 -95759
23093 -95759 -99824 -73948 -61107 -47675 -19069 -40164 -79216 -51917 -67873 -62806 -51267 -13139
23081 -13139 -36135 -85095 -51778 -17381 -53747 -99004 -99843 -89986 -64445 -43078 -67576 -82460
23069 -82460 -86078 -77338 -107428 -119156 -106536 -100068 -90567 -90768 -70127 -48581 -92367 -94026 -81114
23056 -81114 -96709 -100343 -88183 -102956 -65952 -36262 -17842 -34864 -46042 -30285 -25810 -73148
23044 -73148 -77949 -61670 -55822 -75181 -68111 -48341 -71813 -82235 -80929 -61585 -73611 -63478
23032 -63478 -72567 -70371 3954 -13269 -51529 -47547 -84201 -116986 -100467 -82000 -72226 -76737 -60652
23019 -60652 -54542 -84095 -87543 -41729 -1198 -17295 -74822 -110799 -98876 -105993 -78794 -41932
$$ packed form
23105e3183k8022K4644J3911K0763k0466m6554M6145L2473l677j5650l7826k8317
23093i5759m065K5876J2841J3432K8606k1095l9052K7299j5956N067J1539L8128
23081a3139k2996m8960L3317L4397l6366m5257q39R857K5541K1367k4498j4884
23069h2460l618Q740l0090j1728J2620O468R501k01K0641K1546m3786j659J2912
23056h1114j5595l634J2160j4773L7004K9690J8420j7022j1178J5757M475m7338
23044g3148m801J6279N848j9359P070J9770k3472j0422J306J9344j2026J0133
23032f3478r089K196P4325j7223l8260L982l6654l2785J6519J8467R774m511J6085
23019f0652O110k9553l448M5814M0531j6097n7527l5977J1923p117K7199L6862
$$ plain form
23007 -41932 -59006 -93722 -66713 -15661 -44763 -71681 -56960 -54428 -66767 -54146 -11589 47295
22995 47295 45593 48868 46935 18086 6365 15031 -29410 -64883 -43812 -33784 -14765 -25175
22983 -25175 -53706 -83033 -65598 -61677 -61856 -39668 -53058 -82753 -26380 2022 -11713 35514
22971 35514 54552 47591 20909 13624 -37112 -65414 -34846 -11825 -48193 -46996 -18406 -3905
22959 -3905 -12012 -22578 6625 -1008 -48709 -107668 -109548 -119188 -96194 -88369 -63381 -66818 -103587
22946 -103587 -80732 -85561 -56978 -40699 -34299 -52709 -26834 35672 53442 32626 13830 17250
22934 17250 -19806 -40818 -30956 -19194 -527 44581 27105 -9625 -11034 -8461 18820 -4336
22922 -4336 -3064 21958 1704 22001 11749 -47953 -78839 -61201 -50345 -45145 -50330 -41623 -41807
$$ packed form
23007d1932j7074l4716K7009N1052k9102k6918J4721K532j2339J2621M2557N8884
22995D7295j702L275j933k8849j1721Q666m4441l5473K1071J0028J9019j0410
22983b5175k8531k9327J7435L921j79K2188j3390k9695N6373K8402j3735M7227
22971C5514J9038o961k6682p285n0736k8302L0568K3021l6368J197K8590J4501
22959c905q107j0566K9203p633m7701n8959j880r640K2994P825K4988l437l6769
22946a03587K2855m829K8583J6279O400j8410K5875O2506J7770k0816j8796L420
22934A7250l7056k1012R862J1762J8667M5108j7476l6730j409K573K7281k3156
22922d336J272K5022k0254K0297j0252n9702l0886J7638J0856N200n185Q707j84
$$ plain form
22909 -41807 -35002 -25705 -20335 6291 -4380 -81163 -62339 -32788 -37168 -16888 6434 -11125
22897 -11125 -44207 -54619 -27724 -41939 -56897 -44776 -20950 -44654 -110450 -129193 -130543 -141053
22885 -141053 -114317 -102158 -99430 -57474 -56434 -25362 -1225 -13602 -9846 -7895 -29043 -26534
22873 -26534 -44069 -66478 -57798 -49103 -45696 -46455 -83763 -94980 -96672 -114618 -128368 -76089 -20810
22860 -20810 -33156 -52345 -39326 -6708 -26963 -75174 -75678 -66727 -96730 -46428 -31542 -85527
22848 -85527 -72336 -5762 -20735 -27654 -7771 -22998 -34016 -26198 -63248 -64976 -55833 -38816
22836 -38816 -48573 -31989 -32641 -15029 -39512 -33308 -26223 -7409 -19163 -13916 -59122 -61944 -3852
22823 -3852 6086 46296 66622 47759 16731 19696 32320 24988 -42196 -24992 15847 -17486
$$ packed form
22909d1807O805R297N370K6626j0671p6783J8824K9551m380K0280K3322j7559
22897a1125l3082j0412K6895j4215j4958J2121K3826k3704o5796j8743j350j0510
22885a41053K6736J2159K728M1956J040L1072K4137j2377L756J951k1148K509
22873b6534j7535k2409Q680Q695L407p59l7308j1217j692j7946j3750N2279N5279
22860b0810j2346j9189J3019L2618k0255m8211n04Q951l0003N0302J4886n3985
22848h5527J3191O6574j4973o919J9883j5227j1018P818l7050j728R143J7017
22836c8816r757J6584o52J7612k4483O204P085J8814j1754N247m5206k822N8092
22823c852R938M0210K0326j8863l1028K965J2624p332o7184J7204M0839l3333
$$ plain form
22811 -17486 -44148 -55508 -78087 -88731 -37161 -25530 -69328 -81562 -60500 -15830 -22288 -53846
22799 -53846 -86362 -77653 -78214 -88760 -77023 -87386 -89558 -82330 -48175 -65103 -95547 -58457 -27737
22786 -27737 -24237 -16808 5175 24461 5553 17904 -2959 -40418 -77594 -77407 -41416 -3669
22774 -3669 -13605 -23651 -4391 -26177 -39383 -49018 -67357 -78147 -70584 -31549 -38396 -88440 -146371
22761 -146371 -164960 -129420 -95328 -44600 -38804 -87870 -113083 -82744 -53723 -7658 37787 22833
22749 22833 6853 -33618 -60054 -71929 -50734 -57492 -81716 -70496 -71171 -82356 -75762 -81201 -112899
22736 -112899 -79876 -49913 -29368 -22881 -20710 -21326 -28060 -26660 -42418 -15622 -12017 695 -28926
22723 -28926 -58452 -37758 -62314 -104405 -101873 -79494 -56455 -84088 -108756 -64346 -10421 14803
$$ packed form
22811a7486k6662j1360k2579j0644N1570J1631m3798j2234K1062M4670o458l1558
22799e3846l2516Q709n61j0546J1737j0363k172P228L4155j6928l0444L7090L0720
22786b7737L500P429K1983J9286j8908J2351k0863l7459l7176J87L5991L7747
22774c669r936j0046J9260k1786j3206r635j8339j0790P563L9035o847n0044n7931
22761a46371j8589L5540L4092N0728N796m9066k5213L0339K9021M6065M5445j4954
22749B2833j5980m0471k6436j1875K1195o758k4224J1220o75j1185O594n439l1698
22736a12899L3023K9963K0545O487K171o16o734J400j5758K6796L605J2712k9621
22723b8926k9526K0694k4556m2091K532K2379K3039k7633k4668M4410N3925K5224
$$ plain form
22711 14803 5137 8510 -24116 -3679 -11357 -11965 19987 -717 -18651 15405 40430 28717 4428
22698 4428 -39145 -72992 -116234 -84913 -55522 -61869 -89439 -112217 -99122 -122981 -135764 -84306
22686 -84306 -30609 -46140 -56167 -70427 -80331 -104721 -110453 -79790 -70411 -91800 -66904 -78742
22674 -78742 -79465 -50423 -34647 -45540 -23713 -18582 -33139 -66752 -80958 -47172 -44149 -26653
22662 -26653 -50233 -36491 -17059 -1790 -9448 -20423 8262 -14892 -52909 -43048 -66582 -80626
22650 -80626 -107198 -59600 -57093 -30421 -26549 -43695 -24869 -48165 -83639 -82934 -72190 -97881
22638 -97881 -45088 -27850 -58819 -45822 24593 55722 40403 334 -13344 -19555 -46318 -76162
22626 -76162 -87065 -67946 -39484 -75315 -53154 -33537 -35332 -55561 -79040 -50047 -42200 -49908
$$ packed form
22711A4803r666L373l2626K0437p678o08L1952k0704j7934L4056K5025j1713k4289
22698D428m3573l3847m3242L1321K9391o347k7570k2778J3095k3859j2783N1458
22686h4306N3697j5531j0027j4260r904k4390n732L0663R379k1389K4896j1838
22674g8742p23K9042J5776j0893K1827N131j4557l3613j4206L3786L023J7496
22662b6653k3580J3742J9432J5269p658j0975K8685k3154l8017R861k3534j4044
22650h0626k6572M7598K507K6672L872j7146J8826k3296l5474P05J0744k5691
22638i7881N2793J7238l0969J2997P0415L1129j5319m0069j3678o211k6763k9844
22626g6162j0903J9119K8462l5831K2161J9617j795k0229k3479K8993P847p708
$$ plain form
22614 -49908 -71006 -96040 -90596 -96071 -86399 -81820 -47839 30739 58738 28983 30513 59204 63043
22601 63043 18986 -11870 -41067 -78099 -62831 -26862 -36647 -72376 -30346 14842 -2196 -3513
22589 -3513 -19130 -16370 -3276 -26541 -24853 -33500 -536 20649 6404 21036 -747 -84792
22577 -84792 -98875 -60731 -47178 -43093 -46342 -47210 -82316 -103463 -77551 -43588 -18099 -27206 -13573
22564 -13573 17692 10113 -32528 -52431 -40252 -15045 9492 7912 -47615 -36885 -41469 -46431
22552 -46431 -52545 -67629 -84272 -123583 -85419 -60471 -25327 -10195 -30970 -54781 -65789 -69595
22540 -69595 -40649 -10218 -22217 -50966 -62520 -77822 -52724 -46779 -71645 -38678 2184 41175
22528 41175 24745 -13552 -43084 -52420 -65473 -77403 -71984 -90148 -87545 -102499 -52617 -26601
$$ packed form
22614d9908k1098k5034N444n475R672M579L3981P8578K7999k9755J530K8691L839
22601F3043m4057l0856k9197l7032J5268L5969r785l5729M2030M5188j7038j317
22589c513j5617K760J3094k3265J688q647L2964K1185j4245J4632k1783q4045
22577h4792j4083L8144J3553M085l249q68l5106k1147K5912L3963K5489r107J3633
22564a3573L1265p579m2641j9903J2179K5207K4537j580n5527J0730m584m962
22552d6431o114j5084j6643l9311L8164K4948L5144J5132k0775k3811j1008l806
22540f9595K8946L0431j1999k8749j1554j5302K5098N945k4866L2967M0862L8991
22528D1175j6430l8297k9532r336j3053j1930N419j8164K603j4954M9882K6016
$$ plain form
22516 -26601 -9679 -39777 -91866 -97944 -30343 -17178 -30621 2659 -15440 -43615 -34669 -13164
22504 -13164 4450 -17509 -25672 -49092 -80437 -54479 -57108 -43539 -6935 10291 -15271 -32696
22492 -32696 -41523 -34074 1313 10586 -49177 -27846 -37987 -35771 -37101 -30522 -14697 -6975 -63687
22479 -63687 -110637 -115600 -86270 -46545 -41253 -76682 -86129 -73930 -57543 -91986 -80721 -59991
22467 -59991 -40479 -23079 -14613 -60601 -99328 -110846 -98115 -51942 5298 47944 55740 42104
22455 42104 14415 -36037 -87249 -67146 -38149 -33803 -46283 -42058 -52126 -49977 -20862 -24941
22443 -24941 -49619 -53265 -29610 -30568 -13635 14033 -2146 -77841 -129066 -95718 -55630 -40174
22431 -40174 -42835 -41884 -91959 -119382 -99991 -36724 -19047 -14068 -14780 -20610 -38673 -61277 -86328
$$ packed form
22516b6601J6922l0098n2089o078O7601J3165j3443L3280j8099k8175Q946K1505
22504a3164J7614k1959q163k3420l1345K5958k629J3569L6604J7226k5562j7425
22492c2696q827P449L5387R273n9763K1331j0141K216j330O579J5825P722n6712
22479f3687m6950m963K9330L9725N292l5429r447J2199J6387l4443J1265K0730
22467e9991J9512J7400Q466m5988l8727j1518J2731M6173N7240M2646P796j3636
22455D2104k7689n0452n1212K0103K8997M346j2480M225j0068K149K9115m079
22443b4941k4678l646K3655r58J6933K7668j6179p5695n1225L3348M0088J5456
22431d0174k661R51n0075k7423J9391O3267J7677M979p12n830j8063k2604k5051
$$ plain form
22418 -86328 -60346 -22711 -405 -55632 -50635 -49281 -55300 -53916 -33568 -10083 -16253 -18198 -48249
22405 -48249 -97456 -76659 -49435 -68368 -34015 -1615 -1985 -16853 -22554 -28923 -61568 -52979 -55003
22392 -55003 -65219 -62267 -58855 -39543 -5461 -14010 -34784 -33063 -42152 -28555 -27055 -36645 -43063
22379 -43063 -65416 -75710 -92936 -120385 -104401 -79318 -12748 -6831 -15411 -19471 -15401 -39336
22367 -39336 -56426 -75508 -69793 -58645 -75236 -98076 -41119 -13696 -38708 -36765 -52328 -114224
22355 -114224 -92885 -21968 5570 3958 13093 43951 35093 9715 5572 18877 21425 -30240
22343 -30240 -73621 -92886 -85868 -44574 -41441 -59126 -55701 -73110 -35248 -37934 -79267 -85021 -61784
22330 -61784 -34353 -66841 -85930 -66038 -62098 -51511 -60972 -97019 -64706 -2163 -15138 -73303
$$ packed form
22418h6328K5982L7635K2306n5227M997J354o019J384K0348K3485o170j945l0051
22405d8249m9207K0797K7224j8933L4353L2400l70j4868n701o369l2645Q589k024
22392e5003j0216K952L412J9312L4082q549k0774J721r089J3597J500r590o418
22379d3063k2353j0294j7226k7449J5984K5083O6570N917q580m060M070k3935
22367c9336j7090j9082N715J1148j6591k2840N6957K7423k5012J943j5563o1896
22355a14224K1339P0917K7538j612R135L0858q858k5378m143J3305K548n1665
22343c0240m3381j9265P018M1294L133j7685L425j7409L7862k686m1333n754K3237
22330f1784K7431l2488j9089J9892L940J0587r461l6047L2313O2543j2975n8165
$$ plain form
22318 -73303 -48754 -52063 -76075 -87312 -82506 -52521 -24749 -24568 -29656 -66365 -34103 -16717 -15397
22305 -15397 -25626 -48541 -37275 -11393 -23775 -61902 -74248 -32577 4134 -13602 -2564 -33213
22293 -33213 -60109 -75327 -53436 -80024 -96918 -68525 -75386 -116422 -134449 -94722 -82458 -84038
22281 -84038 -92071 -109032 -100879 -95293 -98788 -63971 -70656 -76904 -28877 -16962 -22842 -40475 -65910
22268 -65910 -54504 -23726 5536 -20775 -37761 -24880 -16495 -32190 -4223 27313 13714 -2706
22256 -2706 -39857 -44104 -21068 -44434 -84498 -88644 -72568 -67263 -97742 -93037 -56192 -74001 -94751
22243 -94751 -102445 -91733 -56899 -28853 -56497 -65007 -27797 -44607 -26184 -27829 -31289 -75261
22231 -75261 -83403 -50765 -41411 -20931 -4287 -27778 -36097 -45600 -52059 -30685 -31845 -59021 -82179
$$ packed form
22318g3303K4549l309k4012j1237M806K9985K7772J81n088l6709L2262J7386J320
22305a5397j0229k2915J1266K5882j2382l8127j2346M1671L6711j7736J1038l0649
22293c3213k6896j5218K1891k6588j6894K8393o861m1036j8027L9727J2264j580
22281h4038q033j6961Q153N586l495L4817o685o248M8027J1915n880j7633k5435
22268f5910J1406L0778K9262k6311j6986J2881Q385j5695K7967L1536j3599j6420
22256b706l7151m247K3036k3366m0064m146J6076N305l0479M705L6845j7809k0750
22243i4751p694J0712L4834K8046k7644q510L7210j6810J8423j645l460m3972
22231g5261q142L2638R354K0480J6644k3491q319r503o459K1374j160k7176k3158
$$ plain form
22218 -82179 -56592 -44977 4539 1049 5678 4225 22972 67314 77387 27739 13335 28193
22206 28193 15939 -4999 -41164 -48777 -40971 -24144 19282 23508 -5470 -49277 -31070 11728
22194 11728 -21423 -84319 -67161 -8782 -17827 -60810 -74135 -75346 -98996 -70073 -47580 -49685
22182 -49685 -34625 -19113 -31658 -46820 -26608 -1051 -8849 389 947 -6923 -20567 -39141 -54387
22169 -54387 -47970 -48185 -36269 -38542 -48947 -54795 1623 12628 -24928 -33787 -25624 -19328 -13298
22156 -13298 -21597 -54208 -64695 -81311 -75033 -56265 -16537 -23391 -48556 -44439 -23262 -50338
22144 -50338 -63253 -72692 -100853 -89681 -67868 -42170 -38403 -28890 -35020 -68692 -59833 -47092 -29548
22131 -29548 -32113 -51815 -67000 -21562 -30631 -23616 -7059 -22354 -3270 2876 18742 -18075
$$ packed form
22218h2179K5587J1615M9516l490M629j453J8747M4342J0073m9648j4404J4858
22206B8193j2254k0938l6165p613P806J6827M3426M226k8978m3807J8207M2798
22194A1728l3151o2896J7158N8379r045m2983j3325j211k3650K8923K2493k105
22182d9685J5060J5512j2545j5162K0212K5557p798R238N58p870j3644j8574j5246
22169e4387O417k15J1916k273j0405n848N6418J1005l7556q859Q163O296O030
22156a3298q299l2611j0487j6616O278J8768L9728o854k5165M117K1177k7076
22144e0338j2915r439k8161J1172K1813K5698L767R513o130l3672Q859J2741J7544
22131b9548k565j9702j5185M5438r069P015J6557j5295J9084O146J5866l6817
$$ plain form
22119 -18075 -44045 -47274 -57986 -41440 -29586 -75536 -67200 -53473 -89516 -75797 -41331 -50497
22107 -50497 -52364 1688 -2579 6250 -11350 -16360 11648 39577 4983 -32317 -30976 -7680 -15850
22094 -15850 -32387 -68549 -122247 -141675 -116462 -80175 -30513 -25430 -50090 -51881 -44653 -44687 -8459
22081 -8459 12557 -823 -45455 -78245 -50112 -77245 -91925 -68205 -12979 15229 -11335 -23907
22069 -23907 -16381 10541 42438 46434 28688 2108 1252 -25023 -71435 -86996 -81224 -71477 -56773
22056 -56773 -95935 -130268 -140282 -149958 -106222 -82896 -82739 -99242 -116728 -86371 -79751 -87138 -85503
22043 -85503 -59843 -40436 -19702 -6546 -1523 -45804 -54490 -28274 -14365 -18764 -29834 -37797
22031 -37797 -66692 -108304 -74556 -69443 -92226 -88095 -60174 -37708 18463 -6365 -32636 -20242
$$ packed form
22119a8075k5970l229j0712J6546J1854m5950Q336J3727l6043J3719L4466r166
22107e0497j867N4052m267Q829j7600n010K8008K7929l4594l7300J341K3296q170
22094a5850j6537l6162n3698j9428K5213L6287M9662N083k4660j791P228l4L6228
22081h459K1016j3380m4632l2790K8133k7133j4680K3720N5226K8208k6564j2572
22069b3907P526K6922L1897L996j7746k6580q56k6275m6412j5561N772R747J4704
22056e6773l9162l4333j0014r676M3736K3326J57j6503j7486L0357O620p387J635
22043h5503K5660J9407K0734J3156N023m4281q686K6216J3909m399j1070p963
22031c7797k8895m1612L3748N113k2783M131K7921K2466N6171k4828k6271J2394
$$ plain form
22019 -20242 -18320 -34582 -59638 -77658 -83036 -34916 -854 -22327 -63706 -78231 -81314 -43115
22007 -43115 -38243 -21157 4911 -36777 -49007 -56405 -39555 -3946 4029 11426 -16460 -32867
21995 -32867 -54687 -54047 -44918 -71491 -118207 -99383 -76168 -73137 -75183 -58319 -44675 -46429 -63472
21982 -63472 -58120 -55193 -38443 368 9908 -56944 -120850 -123499 -82273 -62466 -40109 -78136
21970 -78136 -65677 -41836 -28483 -16425 7619 6294 -50464 -46335 -9127 4695 -7394 -26954
21958 -26954 -14690 -11963 -6747 -9386 3103 25270 33758 33090 -1580 -45111 -52466 -36361 -14367
21945 -14367 -44241 -77589 -91371 -94578 -109734 -94046 -82457 -77824 -107765 -94173 -87723 -137600
21933 -137600 -147768 -126248 -111849 -120437 -81516 -60504 -34271 -52352 -73899 -82681 -41760 -22151
$$ packed form
22019b0242J922j6262k5056j8020n378M8120L4062k1473m1379j4525l083L8199
22007d3115M872J7086K6068m1688j2230p398J6850L5609P975P397k7886j6407
21995c2867k1820O40R129k6573m6716J8824K3215L031k046J6864J3644j754j7043
21982f3472N352K927J6750L8811R540o6852o3906k649M1226J9807K2357l8027
21970g8136J2459K3841J3353J2058K4044j325n6758M129L7208J3822j2089j9560
21958b6954J2264K727N216k639J2489K2167Q488o68l4670m3531p355J6105K1994
21945a4367k9874l3348j3782l207j5156J5688J1589M633k9941J3592O450m9877
21933a37600j0168K1520J4399q588L8921K1012K6233j8081k1547q782M0921J9609
$$ plain form
21921 -22151 16324 29297 -19247 -9706 24114 17042 -9750 -31418 -32776 -39059 -34462 -42825 -24581
21908 -24581 -12125 14650 -20268 -28715 8472 -7156 -45289 -21604 11725 9251 12602 2786
21896 2786 -3100 -34804 -44935 -39567 -25435 -3337 7604 19648 52254 54097 55639 73019 56170
21883 56170 35351 -31744 -43446 -39729 -50170 -22307 -2058 -13979 -36666 -58651 -61812 -44431
21871 -44431 -34277 -17972 -43847 -75176 -72413 -50504 -638 10167 -26781 -37577 -71883 -58423
21859 -58423 -33162 -46241 -68501 -52344 -31119 -73295 -78082 -31743 -41276 -52487 -41810 -11064
21847 -11064 -27955 -50819 -33180 -10614 -21737 -26065 -58439 -45254 -49376 -57486 -47648 -45935 -33603
21834 -33603 -47376 -65870 -38805 -25007 -46016 -51260 -31064 -56211 -61696 -61201 -54270 -73138 -69294
$$ packed form
21921b2151L8475J2973m8544R541L3820p072k6792k1668j358o283M597q363J8244
21908b4581J2456K6775l4918q447L7187j5628l8133K3685L3329k474L351r816
21896B786n886l1704j0131N368J4132K2098J0941J2044L2606J843J542J7380j6849
21883E6170k0819o7095j1702L717j0441K7863K0249j1921k2687k1985l161J7381
21871d4431J0154J6305k5875l1329K763K1909M9866J0805l6948j0796l4306J3460
21859e8423K5261j3079k2260J6157K1225m2176m787M6339r533j1211J0677L0746
21847a1064j6891k2864J7639K2566j1123m328l2374J3185m122q110R838J713J2332
21834c3603j3773j8494K7065J3798k1009n244K0196k5147n485M95O931j8868L844
$$ plain form
21821 -69294 -38197 -28495 -11602 -47708 -72650 -84284 -93526 -79385 -57079 -22061 -46389 -53362
21809 -53362 -34982 -44357 -56336 -57803 -63289 -56072 -18204 4648 21183 13256 -29736 -62940 -81671
21796 -81671 -89967 -97049 -91366 -37994 5301 5348 -21188 -33047 -36188 -31102 -19507 -2151 -22448
21783 -22448 -47518 -26297 -42665 -47056 -71051 -69284 -75283 -54082 -84016 -93060 -62462 -32020
21771 -32020 -42400 -94933 -109137 -126096 -123577 -70699 -14324 -10542 -11201 4819 -14976 -29185
21759 -29185 -27143 -17759 -2383 6179 -65130 -83427 -38003 -33218 -38547 -37653 -22597 -57399 -88791
21746 -88791 -60440 -48568 -98611 -105154 -62119 -25487 10134 33549 34161 4993 -22104 -34725
21734 -34725 -27070 -37233 -32546 -27739 -39907 -42999 -53693 -35384 -35526 -33707 -51943 -66666 -25997
$$ packed form
21821f9294L1097R702J6893l6106k4942j1634r242J4141K2306L5018k4328o973
21809e3362J8380r375j1979j467n486P217L7868K2852J6535p927m2992l3204j8731
21796h1671q296p082N683N3372M3295M7k6536j1859l141N086J1595J7356k0297
21783b2448k5070K1221j6368m391k3995J767n999K1201k9934r044L0598L0442
21771c2020j0380n2533j4204j6959K519N2878N6375L782o59J6020j9795j4209
21759b9185K042R384J5376Q562p1309j8297M5424M785n329Q94J5056l4802l1392
21746h8791K8351J1872n0043o543M3035L6632L5621K3415O12k9168k7097j2621
21734c4725P655j0163M687M807j2168l092j0694J8309j42J819j8236j4723M0669
$$ plain form
21721 -25997 -10319 -59 -12915 -12537 -54367 -74578 -96286 -65149 5157 -10686 -40426 -35344
21709 -35344 -34121 -17997 -8551 -10576 -29452 -9109 -26923 -367 16307 -59021 -86649 -57222
21697 -57222 -61170 -76221 -103968 -95581 -78294 -37079 -45992 -38739 -45923 -31811 5432 28915 4929
21684 4929 1271 1448 -25202 -38253 -60833 -72558 -65493 -55717 -69139 -64759 -69250 -61499 -45700
21671 -45700 -45302 -12335 24183 22531 -10698 -21314 -50242 -77874 -74422 -71337 -59500 -46944 -41851
21658 -41851 -7905 -6438 -23599 -8450 4914 36691 31699 -20612 -27655 -3843 -28145 -53977
21646 -53977 -39432 -25834 -47277 -44370 -29874 -40361 -38318 -41997 -16701 -15836 -30223 -46234 -24394
21633 -24394 -24015 -41851 -35940 -31507 4233 -13404 -14857 -7484 -21935 -27704 -46698 -28157 -20215
$$ packed form
21721b5997J5678J0260j2856L78m1830k0211k1708L1137P0306j5843k9740N082
21709c5344J223J6124R446k025j8876K0343j7814K6556J6674p5328k7628K9427
21697e7222l948j5051k7747Q387J7287M1215q913P253p184J4112L7243K3483k3986
21684D929l658J77k6650j3051k2580j1725P065R776j3422M380m491P751J5799
21671d5700L98L2967L6518j652l3229j0616k8928k7632L452L085J1837J2556N093
21658d1851L3946J467j7161J5149J3364L1777m992n2311p043K3812k4302k5832
21646e3977J4545J3598k1443K907J4496j0487K043l679K5296Q65j4387j6011K1840
21633b4394L79j7836N911M433L5740j7637j453P373j4451n769j8994J8541P942
$$ plain form
21620 -20215 -11395 1252 2270 12275 -37045 -51188 -42749 -29384 -40952 -24137 1059 -2450
21608 -2450 -18149 -42210 -51758 -53791 -53290 -23472 -9956 14378 -31380 -35662 -57281 -54842 -47525
21595 -47525 -33257 -13670 -26798 -45084 -51312 -43144 -11619 -27422 -39946 -42974 -8268 -22515
21583 -22515 -53901 -39866 -16972 -25732 -25845 -4268 -36528 -65311 -29234 -28683 -11731 -28423 -62699
21570 -62699 -60435 -98975 -84218 -89531 -51481 -12192 15438 -22550 -46797 -60845 -68644 -50886
21558 -50886 -30180 490 -30901 -86156 -76437 -25459 -9646 682 18221 45704 56692 36873
21546 36873 3479 -22419 -38736 -78516 -106883 -121339 -89416 -53994 -42150 -36551 -63242 -43745
21534 -43745 -1324 6921 -513 -4625 -26710 -36326 -61862 -63446 -72946 -86911 -57412 -46505 -41451
$$ packed form
21620b0215Q820J2647J018J0005m9320j4143Q439J3365j1568J6815K5196l509
21608b450j5699k4061r548k033N01K9818J3516K4334m5758m282k1619K439P317
21595d7525J4268J9587j3128j8286o228Q168L1525j5803j2524l028L4706j4247
21583b2515l1386J4035K2894q760j13K1577l2260k8783L6077N51J6952j6692l4276
21570f2699K264l8540J4757n313L8050L9289K7630l7988k4247j4048p799J7758
21558e0886K0706L0670l1391n5255R719N0978J5813J0328J7539K7483J0988j9819
21546C6873l3394k5898j6317l9780k8367j4456L1923L5422J1844N599k6691J9497
21534d3745M2421Q245p434m112k2085r616k5536j584r500j3965K9499J0907N054
$$ plain form
21521 -41451 -29833 -13511 13152 40305 27844 24413 18682 -2934 -10015 3595 -12834 6317
21509 6317 45943 44270 32126 -6929 -26051 -20064 -22129 -11364 -35521 -43958 -34187 18354 -6056
21496 -6056 -10148 6418 19265 22688 21846 11546 18921 22575 33290 39944 17967 4917 7396
21483 7396 -29803 -66419 -87747 -56215 -24221 -31990 -20704 -46563 -62904 -70603 -43039 -50897
21471 -50897 -33730 -11916 19472 21126 -2439 -48176 -61157 -51854 -29667 -14162 -10702 -107
21459 -107 43449 54040 829 -30289 -29353 -69173 -69494 -43169 12220 -11846 -27468 -3731 -29184
21446 -29184 -19744 -31285 -79910 -67023 -25074 -35056 -5540 -19498 -58614 -40099 -31971 -31913 -64492
21433 -64492 -56359 -52816 -47584 -8571 33397 29566 -9813 -12106 3486 -123 4190 -6253 -44235
$$ packed form
21521d1451J1618J6322K6663K7153j2461l431n731k1616p081J3610j6429J9151
21509F317L9626j673j2144l9055j9122N987k065J0765k4157q437R771N2541k4410
21496f056m092J6566J2847L423q42j0300P375L654J0715O654k1977j3050K479
21483G396l7199l6616k1328L1532L1994p769J1286k5859j6341p699K7564p858
21471e0897J7167K1814L1388J654k3565m5737j2981R303K2187J5505L460J0595
21459a07M3556J0591n3211l1118R36l9820l21K6325N5389k4066j5622K3737k5453
21446b9184R440j1541m8625J2887M1949r982K9516j3958l9116J8515Q128N8l2579
21433f4492Q133L543N232L9013M1968l831l9379k293J5592l609M313j0443l7982
$$ plain form
21420 -44235 -42230 -62884 -41802 -45818 -24435 -13172 -15405 -39179 -61686 -54551 -79692 -59294
21408 -59294 -38380 -57127 -108442 -103713 -75944 -95595 -102696 -80013 -87844 -85572 -89933 -80517 -63338
21395 -63338 -71466 -80966 -76786 -72821 -62229 -59553 -81447 -85163 -82216 -82623 -96605 -77292 -73850 -28925
21381 -28925 1645 -2993 -34688 -31409 -29927 -27916 -25723 -8232 -7896 -47370 -82472 -101575 -60566
21368 -60566 -39749 -36001 -48652 -34158 -5179 -24090 -50446 -27185 22405 47669 30910 30691
21356 30691 945 9770 14229 12280 13524 27269 14223 -2062 -42369 -39210 4257 3610 -26330
21343 -26330 -13875 21142 28652 25834 -6891 -2031 -2469 6665 -9803 6279 -3963 -41500 -53864
21330 -53864 -11874 15180 29110 6348 7516 24670 11690 43333 20188 -19437 -9861 -37247
$$ packed form
21420d4235K005k0654K1082m016K1383J1263k233k3774k2507P135k5141K0398
21408e9294K0914j8747n1315M729K7769j9651p101K2683p831K272m361R416J7179
21395f3338q128r500M180L965J0592K676k1894l716K947m07j3982J9313L442M4925
21381b8925L0570m638l1695L279J482K011K193J7491L36l9474l5102j9103M1009
21368f0566K0817L748j2651J4494K8979j8911k6356K3261M9590K5264j6759k19
21356C0691k9746Q825M459j949J244J3745j3046j6285m0307L159M3467o47k9940
21343b6330J2455L5017P510k818l2725M860m38R134j6468J6082j0242l7537j2364
21330e3864M1990K7054J3930k2762J168J7154j2980L1643k3145l9625R576k7386
$$ plain form
21318 -37247 -28402 380 -14180 -7492 10454 -21671 -8285 -34520 -47627 -67086 -34523 -65880
21306 -65880 -43805 23040 41591 16128 -18942 2838 36911 5948 -29336 -3657 -18287 -24806
21294 -24806 -32860 -17174 -21524 -53380 -16382 -15239 -5252 -8441 -30819 -33837 -21209 9493 7152
21281 7152 -12498 -61755 -60602 -65575 -78063 -52913 -38056 17933 15672 -5367 -23350 -31304 -28397
21268 -28397 -28419 -12877 -33570 -31596 68 -8957 3061 -2504 -36850 -35979 -63714 -72456 -53087
21255 -53087 -53909 -62255 -81823 -61746 -42253 -64285 -63291 -36556 -68467 -64242 -57885 -49604 -63775
21242 -63775 -71561 -37977 10670 18835 18895 -4893 7590 -33949 -58323 -38923 -15720 -23509 -25012
21229 -25012 -23888 2467 14370 -17199 -2240 -3669 -29229 -38606 -4481 15035 20297 -9329
$$ packed form
21318c7247Q845K8782j4560O688J7946l2125J3386k6235j3107j9459L2563l1357
21306f5880K2075O6845J8551k5463l5070K1780L4073l0963l5284K5679j4630o519
21294b4806q054J5686m350l1856L6998J143R987l189k2378l018J2628L0702k341
21281G152j9650m9257J153m973j2488K5150J4857N5989k261k1039j7983p954K907
21268b8397k2J5542k0693J974L1664r025J2018n565l4346Q71k7735q742J9369
21255e3087q22q346j9568K0077J9493k2032R94K6735l1911M225O357Q281j4171
21242f3775p786L3584M8647Q165O0k3788J2483m1539k4374J9400K3203p789j503
21229b5012J124K6355J1903l1569J4959j429k5560r377L4125J9516N262k9626
$$ plain form
21217 -9329 -65426 -103345 -132600 -103679 -49249 -26215 -25001 -25207 -31721 -64265 -78001 -76887 -61189
21204 -61189 -72163 -71606 -60507 -41353 -12081 15400 2011 -56759 -72367 -41642 -25478 -2073
21192 -2073 7339 -11955 12858 -1540 -11546 -32119 -52826 -51614 -26767 -46300 -56031 -17108
21180 -17108 239 2350 -43388 -39302 -33756 -41102 -2492 39479 52908 51242 40320 25907 -19985
21167 -19985 -74300 -58028 -51092 -43264 2243 42677 60431 12624 -13023 7180 3320 -723
21155 -723 -2592 -16320 -22982 -49556 -66619 -80035 -92395 -66002 -46122 -57873 -45268 -66200
21143 -66200 -62954 -26651 -46008 -52775 -69956 -101349 -86328 -24290 1920 -10049 -30903 -21399
21131 -21399 -3150 -19522 -40906 -27714 -13567 -19347 -44074 -75793 -76598 -30798 25161 35416
$$ packed form
21217i329n6097l7919k9255K8921N4430K3034J214k06o514l2544j3736J114J5698
21204f1189j0974N57J1099J9154K9272K7481j3389n8770j5608L0725J6164K3405
21192b073R412j9294K4813j4398j0006k0573k0707J212K4847j9533r731L8923
21180a7108J7347K111m5738M086N546p346L8610M1971J3429j666j0922j4413m5892
21167a9985n4315J6272O936P828M5507M0434J7754m7807k5647K0203l860m043
21155g23j869j3728o662k6574j7063j3416j2360K6393J9880j1751J2605k0932
21143f6200L246L6303j9357o767j7181l1393J5021O2038K6210j1969k0854R504
21131b1399J8249j6372k1384J3192J4147n780k4727l1719q05M5800N5959J0255
$$ plain form
21119 35416 -7204 -8096 -29793 -58354 -65283 -36029 -18480 -22612 -29424 -41799 -59204 -6561 -18551
21106 -18551 -45924 -51260 -46502 -12662 -19527 -21478 -16679 -2701 24990 13023 -32444 -29871 -35423
21093 -35423 -26941 -55655 -65261 -43946 -32859 5317 -12974 -52691 -60158 -33812 -9506 32212
21081 32212 44622 28177 16187 11740 -1391 -35087 -29590 -23565 -34695 -41318 -41701 -15644 16462
21068 16462 17643 -17305 -17099 -23479 -45972 -25955 -35123 -15549 -44122 -24565 -309 16716 6776
21055 6776 -12653 -17280 -34656 -20301 18673 62290 64989 72556 104126 56780 6016 -9781
21043 -9781 -21956 -17561 -40452 -45487 -49063 -36394 -33916 -37541 -48568 -90017 -77574 -23654 -21131
21030 -21131 -13503 29206 28288 -9091 -3560 -9710 19085 446 -2098 27377 47184 14400 -14906
$$ packed form
21119C5416m2620q92k1697k8561o929K9254J7549m132o812j2375j7405N2643j1990
21106a8551k7373n336M758L3840o865j951M799J3978K7691j1967m5467K573n552
21093c5423Q482k8714r606K1315J1087L8176j8291l9717p467K6346K4306M1718
21081C2212J2410j6445j1990m447j3131l3696N497O025j1130o623l83K6057L2106
21068A6462J181l4948K06o380k2493K0017r168J9574k8573J9557K4256J7025r940
21055F776j9429m627j7376J4355L8974M3617K699P567L1570m7346n0764j5797
21043i781j2175M395k2891n035l576J2669K478l625j1027m1449J2443N3920K523
21030b1131P628M2709r18l7379N531o150K8795j8639k544K9475J9807l2784k9306
$$ plain form
21017 -14906 -48048 -45951 -36785 -15670 828 -6724 -30363 -29151 -34555 -79347 -87713 -59757 -62552
21004 -62552 -60474 -80067 -90869 -56653 -35555 -53650 -49362 -72438 -86030 -49156 -53734 -58032
20992 -58032 -23494 6905 15632 -369 -8826 -2533 -11867 -26897 -41802 -16794 15621 -6854
20980 -6854 -33740 -37473 -65902 -48753 1463 -750 -23596 -11480 -31793 -37388 -65321 -52961
20968 -52961 -50852 -30247 -1813 -9118 -6137 -24900 -13597 -6557 -14601 -36221 -35519 14651 15292
20955 15292 -6990 2434 -715 31687 66367 73011 46567 46484 -16644 -42120 -37894 -66068 -70568
20942 -70568 -53363 -41833 -45491 10415 23114 -10092 -31592 -32916 -39265 -3486 -14748 -30700
20930 -30700 -31952 -49939 -45994 16262 21794 -45796 -53861 -51288 -64836 -55326 -30872 -25640 12432
$$ packed form
21017a4906l3142K097R166K1115J6498p552k3639J212n404m4792q366K7956k795
21004f2552K078j9593j0802L4216K1098j8095M288k3076j3592L6874m578m298
20992e8032L4538L0399Q727j6001q457O293r334j5030j4905K5008L2415k2475
20980f854k6886l733k8429J7149N0216k213k2846J2116k0313n595k7933J2360
20968e2961K109K0605K8434p305K981j8763J1303P040q044k1620P02N0170O41
20955A5292k2282R424l149L2402L4680O644k6444q3o3128k5476M226k8174m500
20942g0568J7205J1530l658N5906J2699l3206k1500j324o349L5779j1262j5952
20930c0700j252j7987L945O2256N532o7590q065K573j3548R510K4454N232L8072
$$ plain form
20917 12432 4326 -2287 -33305 -49208 -19213 -39315 -66816 -61524 -45460 -31718 -95865 -83923
20905 -83923 -65946 -58927 -1272 67512 114449 90728 46053 30776 37481 55925 17602 -3752
20893 -3752 -3584 -21026 14550 10939 -24757 -7252 -4792 -39037 -49126 -36409 -20224 -27695 -20427
20880 -20427 -35889 -24349 -8784 -5618 -22854 14193 42788 42998 62571 67386 83497 81465 39713
20867 39713 14354 20849 62534 35424 7700 32823 22031 -14174 -22262 -10702 -48270 -68146
20855 -68146 -95397 -57779 22255 11574 17184 11722 4823 -12272 -18910 10357 -2651 16893
20843 16893 22122 655 -40849 -74984 -55998 -35392 -30534 -66754 -46332 -21431 -28397 -7337
20831 -7337 14624 -24906 -42667 -9435 25269 8525 10417 2695 20682 -1015 -32159 -13844
$$ packed form
20917A2432q106o613l1018j5903K9995k0102k7501N292J6064J3742o4147J1942
20905h3923J7977P019N7655O8784M6937k3721m4675j5277O705J8444l8323k1354
20893c752J68j7442L5576l611l5696J7505K460l4245j0089J2717J6185p471P268
20880b0427j5462J1540J5565L166j7236L7047K8595K10J9573M815J6111k032m1752
20867C9713k5359O495M1685k7110k7724K5123j0792l6205q088J1560l7568j9876
20855f8146k7251L7618Q0034j0681N610n462o899j7095o638K9267j3008J9544
20843A6893N229k1467m1504l4135J8986K0606M858l6220K0422K4901o966K1060
20831g337K1961l9530j7761L3232L4704j6744J892p722J7987k1697l1144J8315
$$ plain form
20819 -13844 -3399 10331 13553 10253 39265 23008 -3298 -12782 -50336 -35228 9412 29770
20807 29770 32487 -9332 9984 24000 -28086 -65868 -48858 -616 21783 23610 -16053 -21427
20795 -21427 -37135 -48625 -16402 47253 34503 4573 -19210 -11731 9971 -11743 -30928 -16952
20783 -16952 4117 -16301 -79965 -77757 -78083 -42809 6216 29121 35342 14732 17739 -12528 998
20770 998 21081 29965 944 -13687 19772 -8355 -40272 -39102 -34609 -40437 -47065 -48585 -31458
20757 -31458 -53281 -44947 1326 2021 -17173 5271 -23296 -19610 8228 -7440 -31849 -45439
20745 -45439 -27572 1509 53946 66580 22807 -2880 -22741 -28298 -53341 -70480 -105848 -97612
20733 -97612 -60444 -28221 -42591 -42944 11719 16745 -25136 -24188 -30483 -24537 18332 20617 -27524
$$ packed form
20819a3844J0445J3730L222l300K9012j6257k6306r484l7554J5108M4640K0358
20807B9770K717m1819J9316J4016n2086l7782J7010M8242K2399J827l9663n374
20795b1427j5708j1490L2223O3655j2750k9930k3783P479K1702k1714j9185J3976
20783a6952K1069k0418o3664K208l26L5274M9025K2905O221k0610L007l0267J3526
20770I98K0083Q884k9021j4631L3459k8127l1917J170M493n828o628j520J7127
20757c1458k1823Q334M6273O95j9194K2444k8567L686K7838j5668k4409j3590
20745d5439J7867K9081N2437J2634m3773k5687j9861n557k5043j7139l5368Q236
20733i7612L7168L2223j4370l53N4663N026m1881R48o295N946M2869K285m8141
$$ plain form
20720 -27524 -20871 10836 13432 -10163 -19041 22688 16852 -23265 -42833 -34107 -44303 -14849 -16103
20707 -16103 -16523 -38854 -36848 -16200 -1670 1736 -25270 -18395 -15819 13652 2494 -30714 -53572
20694 -53572 -85063 -86716 -55394 -38033 -4907 20248 11584 -13538 -14514 -13244 -30458 -34394 2436
20681 2436 21349 8187 31189 25464 9452 10942 21324 36788 50194 49279 27648 -4290 2356
20668 2356 -24325 -64996 -32447 -25027 -47216 -40740 -3892 -24606 -68828 -78233 -68435 -89696 -96913
20655 -96913 -35556 -9059 -15260 12546 -17531 -38171 -51838 -62289 -67346 -25717 -12490 -61157
20643 -61157 -49491 22138 26585 15464 4452 5182 -11015 -43479 -32103 7737 57496 81601
20631 81601 22473 -47648 -109176 -98667 -90450 -56413 -46129 -62240 -51667 -34616 -69742 -68291
$$ packed form
20720b7524O653L1707K596k3595q878M1729n836m0117j9568Q726j0196K9454j254
20707a6103m20k2331K006K0648J4530L406k7006O875K576K9471j1158l3208k2858
20694e3572l1491j653L1322J7361L3126K5155q664k5122r76J270j7214l936L6830
20681B436J8913j3162K3002n725j6012J490J0382J5464J3406r15k1631l1938O646
20668B356k6681m0671L2549P420k2189O476L6848k0714m4222r405R798k1261p217
20655i6913O1357K6497o201K7806l0077k0640j3667j0451n057M1629J3227m8667
20643f1157J1666P1629M447j1121j1012P30j6197l2464J1376L9840M9759K4105
20631H1601n9128p0121o1528J0509Q217L4037J0284j6111J0573J7051l5126J451
$$ plain form
20619 -68291 -66891 -37220 -4578 37370 -10265 -303 46269 53539 40777 8075 37879 35456
20607 35456 12846 17957 -6353 -56674 -58377 -52929 -23776 -30560 -66743 -32669 -8657 13753
20595 13753 -6136 -16865 -3772 20249 -1382 -25606 -22579 -55155 -43935 -15162 -16621 -37769
20583 -37769 -64775 -54349 -22415 -20832 -2512 16074 -2507 -13006 6281 23008 -1907 -7077
20571 -7077 5255 8312 -5080 -43932 -15837 -7780 -61786 -44101 -7884 -727 -49783 -61762
20559 -61762 -64475 -1675 17680 20592 -3008 15198 5065 -31187 -41573 -13929 12671 -9026
20547 -9026 4237 17281 2359 26447 35584 55119 23709 11943 33050 -21454 -81713 -80885
20535 -80885 -66228 -50373 -60277 -98434 -77367 -74778 -43340 -32109 -19748 -8279 21404 54064
$$ packed form
20619f8291J400K9671L2642M1948m7635R962M6572P270j2762l2702K9804k423
20607C5456k2610N111k4310n0321j703N448K9153o784l6183L4074K4012K2410
20595A3753j9889j0729J3093K4021k1631k4224L027l2576J1220K8773j459k1148
20583c7769k7006J0426L1934J583J8320J8586j8581j0499J9287J6727k4915n170
20571g077J2332L057j3392l8852K8095Q057n4006J7685L6217P157m9056j1979
20559f1762k713O2800J9355K912k3600J8206j0133l6252j0386K7644K6600k1697
20547i026J3263J3044j4922K4088R137J9535l1410j1766K1107n4504o0259Q28
20535h0885J4657J5855r904l8157K1067K589L1438J1231J2361J1469K9683L2660
$$ plain form
20523 54064 66798 43558 12167 13202 13413 38460 31616 3896 -20871 -9466 -44762 -53443 -23964
20510 -23964 18770 43837 56676 64430 60768 39714 29091 2196 -21338 -24120 -23948 -30183 -48244
20497 -48244 -37554 -30853 -17037 -22556 -55565 -43134 -35946 -12088 7680 -13001 -44917 -28626
20485 -28626 -33104 -48117 -58569 -51291 -36855 -28783 12723 34392 25985 9757 922 -7811 2800
20472 2800 17363 41339 40819 2839 2426 17816 31883 -4846 13375 49810 17871 -31494 -31054
20459 -31054 -36347 -16194 -5259 -13468 2722 47361 21577 40669 52482 33167 1203 -41584
20447 -41584 -62503 -47062 -13139 -3503 13051 24406 49695 61796 67940 28980 47713 47247
20435 47247 35564 2728 -44820 -20089 8677 1294 4306 11861 2774 39117 75925 67172 33607
$$ packed form
20523E4064J2734k3240l1391J035K11K5047o844k7720k4767J1405l5296q681K9479
20510b3964M2734K5067J2839P754l662k1054j0623k6895k3534k782J72o235j8061
20497d8244J0690O701J3816n519l3009J2431P188K3858J9768k0681l1916J6291
20485b8626m478j5013j0452P278J4436Q072M1506K1669q407j6228q835q733J0611
20472B800J4563K3976n20l7980m13J5390J4067l6729J8221L6435l1939m9365M40
20459c1054n293K0153J0935q209J6190M4639k5784J9092J1813j9315l1964m2787
20447d1584k0919J5441L3923R636J6554J1355K5289J2101O144l8960J8733m66
20435D7247j1683l2836m7548K4731K8766p383L012P555r087L6343L6808q753l3565
$$ plain form
20422 33607 8087 44499 71814 31061 -12887 -8494 7343 -7057 17752 45441 63872 51653
20410 51653 42583 51097 50622 38305 21006 -16308 43949 67401 76833 45964 -3137 -14892 -18095
20397 -18095 -31537 1963 11513 19099 -26844 -78663 -74819 -77726 -87837 -35644 31086 24208 25477
20384 25477 9906 3888 43654 39751 19310 9323 6021 7863 -32577 -47252 -2496 13891 34357
20371 34357 27970 8397 -1484 -15084 -8902 15716 21422 23560 32991 -4820 -13091 -35278 -32529
20358 -32529 -26291 -14017 -3264 41183 57643 46949 38525 70943 65112 54447 9450 5975
20346 5975 -4728 -35366 14086 54857 44833 -19074 4327 38918 9860 -6346 -6817 1860
20334 1860 9538 -4848 -26991 -59182 -7707 85583 66942 23145 18883 -7481 -24505 -42641
$$ packed form
20422C3607k5520L6412K7315m0753m3948M393J5837j4400K4809K7689J8431j2219
20410E1653r070Q514m75j2317j7299l7314O0257K3452R432l0869m9101j1755l203
20397a8095j3442L3500R550P586m5943n1819L844k907j0111N2193O6730o878J269
20384B5477j5571o018L9766l903k0441r987l302J842m0440j4675M4756J6387K0466
20371C4357o387j9573r881j3600O182K4618N706K138R431l7811q271k2187K749
20358c2529O238J2274J0753M4447J6460j0694q424L2418n831j0665m4997l475
20346E975j0703l0638M9452M0771j0024o3907K3401L4591k9058j6206m71Q677
20334A860P678j4386k2143l2191N1475R3290j8641m3797m262k6364j7024j8136
$$ plain form
20322 -42641 5963 40820 64940 42665 28077 71807 75961 68557 61368 53491 61004 97706 93669
20309 93669 80960 71822 67623 16901 -4358 -8246 -32474 -6855 34401 52959 33801 45856
20297 45856 74519 89162 108362 88133 64252 48605 14219 13450 42488 58399 42879 56362
20285 56362 34352 -10493 -42214 -1433 31553 -5580 -38617 13422 68593 92137 107859 107887
20273 107887 62610 48363 62902 75571 58737 58600 67351 55719 48415 31018 25365 59456
20261 59456 59765 76627 108750 88426 39269 10012 -9916 -41615 -29065 -12799 -31327 -29932
20249 -29932 -47069 -67305 -67782 -4922 22454 31740 30292 32997 19230 5103 -28453 -22981 -32229
20236 -32229 -52925 -79154 -31608 51500 4556 -15431 27857 69061 93298 84046 36671 46292
$$ packed form
20322d2641M8604L4857K4120k2275j4588M3730M154p404p189p877P513L6702m037
20309I3669j2709r138m199n0722k1259l888k4228K5619M1256J8558j9158J2055
20297D5856K8663J4643J9200k0229k3881j5647l4386p69K9038J5911j5520J3483
20285E6362k2010m4845l1721M0781L2986l7133l3037N2039N5171K3544J5722K8
20273A07887m5277j4247J4539J2669j6834j37Q751j1632p304j7397n653L4091
20261E9456L09J6862L2123k0324m9157k9257j9928l1699J2550J6266j8528J395
20249b9932j7137k0236m77O2860K7376R286j448K705j3767j4127l3556N472r248
20236c2229k0696k6229M7546Q3108m6944j9987M3288M1204K4237r252m7375R621
$$ plain form
20224 46292 59739 28908 25434 971 3002 -4773 -11761 29750 35501 3725 10695 18326 35038
20211 35038 27562 -14324 -33817 -42702 -56406 -73642 -49123 -22863 -622 -24949 -39277 -17512
20199 -17512 824 -29806 188 -3227 -10978 18885 -19600 -80758 -51517 -11696 -11595 -4424 15067
20186 15067 23910 43892 35064 38573 44240 56373 39660 -14220 -11305 -9717 6074 -5226 -14162
20173 -14162 -15117 -22461 -40502 -17515 13937 -37725 -42370 -29684 -78560 -99469 -45832 -7025
20161 -7025 10382 27151 46880 49137 43372 55022 53428 56715 49034 16435 19833 13319 -8875
20148 -8875 -22355 -9581 33251 50468 51869 45999 59632 69344 61790 52193 49479 -12320 -23578
20135 -23578 -10788 -11703 24637 42509 41419 38329 32878 21411 -32655 -34194 -23584 6639 -22571
$$ packed form
20224D6292J3447l0831l474k4463K031p775o988M1511N751l1776O970P631J6712
20211C5038p476m1886j9493q885j3704j7236K4519K6260K2241k4327j4328K1765
20199a7512J8336l0630K9994l415p751K9863l8485o1158K9241L9821J01P171J9491
20186A5067Q843J9982q828L509N667J2133j6713n3880K915J588J5791j1300q936
20173a4162r55p344j8041K2987L1452n1662m645J2686m8876k0909N3637L8807
20161g025J7407J6769J9729K257n765J1650j594L287p681l2599L398o514k2194
20148h875j3480J2774M2832J7217J401n870J3633R712p554r597k714o1799j1258
20135b3578J2790r15L6340J7872j090l090n451j1467n4066j539J0610L0223k9210
$$ plain form
20122 -22571 -19373 -15760 -22678 29989 31808 5574 25354 16047 10068 66227 101176 63803 59061
20109 59061 27771 35223 26121 15144 25689 36747 33286 19952 -6323 -10479 7643 12250 26928
20096 26928 24597 22647 23065 14355 -5294 -17314 -17687 -26221 -42325 -27218 4321 20959 42543
20083 42543 56695 67342 103202 84034 34556 25070 -5152 -6421 17691 59707 88223 42526
20071 42526 -4157 -8655 13373 35194 29670 5019 9087 40548 29072 34177 55254 47195 24770
20058 24770 61609 42182 58357 94005 75748 103392 139203 85688 54963 63936 66782 59714
20046 59714 54208 54138 60395 60167 68879 72686 42554 30614 45777 49470 17185 6839 10243 24710
20032 24710 32268 37269 22693 -3498 27970 87792 49687 23785 26135 39399 42206 28984
$$ packed form
20122b2571L198L613o918N2667J819k6234J9780r307n979N6159L4949l7373m742
20109E9061l1290P452r102j0977J0545J1058l461j3334k6275m156J8122M607J4678
20096B6928k331j950M18q710j9649j2020l73q534j6104J5107L1539J6638K1584
20083D2543J4152J0647L5860j9168m9478r486l0222j269K4112M2016K8516m5697
20071D2526m6683m498K2028K1821n524k4651M068L1461j1476N105K1077q059k2425
20058B4770L6839j9427J6175L5648j8257K7644L5811n3515l0725Q973K846p068
20046E9714n506p0O257k28Q712L807l0132j1940J5163L693l2285j0346L404J4467
20032B4710P558N001j4576k6191L1468N9822l8105k5902K350J3264K807j3222
$$ plain form
20020 28984 -13199 -20533 -45430 -22263 -8270 40905 34994 -38471 -27488 -19418 -5339 12430
20008 12430 29318 37699 30408 89347 86592 40537 32414 41345 -23304 -87185 -58711 -11338 -1522
19995 -1522 19993 86493 74956 47240 51073 -24762 -48405 185 29698 48660 71169 71224 74007
19982 74007 55762 51459 38889 35004 46805 66437 62349 5501 -33151 5179 28252 34126
19970 34126 33004 27179 54863 52034 66187 76307 51497 28594 41992 32791 40680 51161 51418
19957 51418 64336 68584 123201 104313 50070 59968 50488 61794 72172 57327 42943 24070
19945 24070 49977 87692 74075 84362 102152 48679 39798 50124 84976 114581 77097 65104
19933 65104 57570 50373 32350 32612 26035 -4119 -29353 -26907 7809 38836 63043 86043 89931
$$ packed form
20020B8984m2183p334k4897K3167J3993M9175n911p3465J0983Q070J4079J7769
20008A2430J6888Q381p291N8939k755m6055q123Q931o4649o3881K8474M7373R816
19995a522K1515O6500j1537k7716L833p5835k3643M8590K9513J8962K2509N5K783
19982G4007j8245m303j2570l885J1801J9632m088n6848l8652L8330K3073N874
19970C4126j122n825K7684k829J4153J0120k4810k2903J3398r201P889J0481K57
19957E1418J2918M248N4617j8888n4243R898r480J1306J0378j4845j4384j8873
19945B4070K5907L7715j3617J0287J7790n3473q881J0326L4852K9605l7484j1993
19933F5104p534p197j8023K62o577l0154k5234K446L4716L1027K4207K3000L888
$$ plain form
19920 89931 72973 55780 72222 83536 82205 56861 54411 85723 125894 124511 121616 135624
19908 135624 132542 104991 116463 135433 111755 110718 119539 83200 62051 71030 86491 70202
19896 70202 54189 62695 80911 65628 68457 56075 58677 59422 47769 77585 135223 142715 97419
19883 97419 81072 64544 49811 105455 127011 145342 155324 124382 112922 70813 30750 38654
19871 38654 34081 58544 122483 111627 120568 150569 190797 251437 282401 297326 308920 329988
19859 329988 366028 415301 476191 552885 639753 822860 1007855 1196343 1314743 1380544 1377012
19848 1377012 1286866 1158536 963288 777391 599808 476494 393044 338607 302281 242054
19838 242054 158951 171434 193797 185154 160121 143850 137293 72299 94783 93133 85082 54762
$$ packed form
19920H9931j6958j7193J6442J1314j331k5344k450L1312M0171j383k895J4008
19908A35624l082k7551J1472J8970k3678j037Q821l6339k1149Q979J5461j6289
19896G0202j6013Q506J8216j5283K829j2382K602P45j1653K9816N7638P492m5296
19883I7419j6347j6528j4733N5644K1556J8331R982l0942j1460m2109m0063P904
19871C8654m573K4463O3939j0856Q941L0001M0228O0640L0964J4925J1594K1068
19859C29988L6040M9273O0890P6694Q6868J83107J84995J88488J18400O5801l532
19848A377012r0146j28330j95248j85897j77583j23314q3450n4437l6326o0227
19838B42054q3103J2483K2363q643k5033j6271o557o4994K2484j650q051l0320
$$ plain form
19826 54762 2685 5405 31809 49992 73167 103929 104804 66032 54777 57279 83952 107582
19814 107582 117764 102227 75091 66759 23840 20836 61388 82779 141209 150961 102835 58287
19802 58287 50094 28359 52392 92435 78522 43881 47757 75427 69433 67996 68304 30673 50780
19789 50780 49579 51464 36457 21117 45199 72168 69739 45935 64323 65397 88479 125758
19777 125758 120827 69595 44446 53452 53345 46671 40204 64845 66715 62454 83879 102350 118411
19764 118411 104331 121303 124556 105390 91417 28716 56036 81204 53991 55009 33757 78941
19752 78941 87254 130168 130849 112757 70069 27079 22969 92974 157300 121036 117816 108443 86166
19739 86166 120868 125894 115732 128389 151597 162672 126196 115576 117232 91680 120350 116066
$$ packed form
19826E4762n2077K720K6404J8183K3175L0762Q75l8772j1255K502K6673K3630
19814A07582J0182j5537k7136q332m2919l004M0552K1391N8430R752m8126m4548
19802E8287q193k1735K4033M0043j3913l4641L876K7670n994j437L08l7631K0107
19789E0780j201J885j5007j5340K4082K6969k429k3804J8388J074K3082L7279
19777A25758m931n1232k5149R006j07o674o467K4641J870m261K1425J8471J6061
19764A18411j4080J6972L253j9166j3973o2701K7320K5168k7213J018k1252M5184
19752G8941Q313M2914O81j8092m2688m2990m110P0005O4326l6264l220r373k2277
19739H6166L4702N026j0162J2657K3208J1075l6476j0620J656k5552K8670m284
$$ plain form
19727 116066 90345 41489 84014 123302 110533 104858 100251 122247 135672 142433 110557 85657
19715 85657 83105 101497 95744 83952 77104 63662 57362 75980 87279 56629 37252 798
19703 798 -314 -603 32121 19766 25400 47659 43185 55516 104555 131626 102252 125341 158030
19690 158030 112952 103848 79752 63513 104278 121230 77435 89060 76167 87883 111752 100602
19678 100602 86259 96296 94644 71274 127908 167290 168851 110217 72101 94406 106747 83177
19666 83177 70075 54826 90548 115604 107915 108442 123367 112128 80170 75443 52979 63479
19654 63479 85976 59300 67877 64720 69987 28470 20316 43156 81804 123103 97076 60574
19642 60574 70220 95236 61232 29944 55582 85008 97215 94425 81665 124774 173356 169658
$$ packed form
19727A16066k5721m8856M2525L9288j2769n675m607K1996J3425O761l1876k4900
19715H5657k552J8392n753j1792o848j3442o300J8618J1299l0650j9377l6454
19703G98j112k89L2724j2355N634K2259m474J2331M9039K7071k9374K3089L2689
19690A58030m5078r104k4096j6239M0765J6952m3795J1625j2893J1716K3869j1150
19678A00602j4343J0037j652k3370N6634L9382J561n8634l8116K2305J2341k3570
19666H3177j3102j5249L5722K5056p689N27J4925j1239l1958m727k2464J0500
19654F3479K2497k6676Q577l157N267m1517q154K2840L8648M1299k6027l6502
19642F0574R646K5016l4004l1288K5638K9426J2207k790j2760M3109M8582l698
$$ plain form
19630 169658 182247 163160 90428 76005 60342 68693 81018 88318 77355 91385 94410 78396
19618 78396 25562 35024 111985 162332 177458 175019 155707 143819 159968 169265 217103 260478
19606 260478 230977 207957 229839 224908 202167 130838 93363 93895 108513 174926 232877 231952
19594 231952 222834 224527 171641 179043 187397 122054 129032 139133 138123 159355 206603 218373 235074
19581 235074 206028 195783 183077 172305 193099 210370 228570 263029 241893 212000 171892
19570 171892 150312 134212 95888 123332 158521 200625 219764 302036 384690 392066 369636 368075
19558 368075 334251 325861 357748 367153 345693 341578 291380 283442 295489 299781 290320 250516 255703
19545 255703 235725 223352 212252 176818 204293 250412 254777 237485 205402 152728 184456 201377
$$ packed form
19630A69658J2589j9087p2732j4423j5663Q351J2325P300j0963J4030L025j6014
19618G8396n2834R462P6961N0347J5126k439j9312j1888J6149R297M7838M3375
19606B60478k9501k3020K1882m931k2741p1329l7475N32J4618O6413N7951r25
19594B31952r118J693n2886P402Q354o5343O978J0101j010K1232M7248J1770J6701
19581B35074k9046j0245j2706j0772K0794J7271J8200L4459k1136k9893m0108
19570A71892k1580j6100l8324K7444L5189M2104J9139Q2272Q2654P376k2430j561
19558C68075l3824q390L1887R405k1460m115n0198p938J2047M292r461l9804N187
19545B55703j9978j2373j1100l5434K7475M6119M365j7292l2083n2674L1728J6921
$$ plain form
19533 201377 185846 200776 211289 233804 251537 258968 252262 253653 210818 206623 234298 252679
19521 252679 254613 262193 263223 250589 245553 253265 212413 234669 205272 140832 134691 152936 196425
19508 196425 250926 285164 283684 221336 204127 235861 253878 212902 214592 265556 333936 333008
19496 333008 310094 268299 242246 247567 265920 266464 247419 217967 195701 228255 283607 268246
19484 268246 280536 288816 279746 337797 396618 409526 384415 357969 357135 330948 349136 349882 309195
19471 309195 319430 343940 317622 365110 366174 364556 310969 334739 373098 380560 365700 358970
19459 358970 349996 308726 281861 290490 318730 352644 391862 393117 340952 320797 364147 376272
19447 376272 413912 456299 451651 440637 438699 454877 485762 518204 552619 579435 642331 675829
$$ packed form
19533B01377j5531J4930J0513K2515J7733P431o706J391m2835m195K7675J8381
19521B52679J934P580J030j2634n036P712m0852K2256k9397o4440o141J8245M3489
19508A96425N4501L4238j480o2348j7209L1734J8017m0976J690N0964O8380r28
19496C33008k2914m1795k6053N321J8353N44j9045k9452k2266L2554N5352j5361
19484B68246J2290Q280r070N8051N8821J2908k5111k6446q34k6187J8188P46m0687
19471C09195J0235K4510k6318M7488J064j618n3587K3770L8359P462j4860o730
19459C58970q974m1270k6865Q629K8240L3914L9218J255n2165k0155M3350J2125
19447C76272L7640M2387m648j1014j938J6178L0885L2442L4415K6816O2896L3498
$$ plain form
19435 675829 681857 697971 711565 649251 566093 534332 526903 517169 517612 502298 478257 482575 505722
19422 505722 563075 605030 621422 605718 573520 587360 612348 625914 624677 580799 539711 578029
19410 578029 643854 682558 664655 631029 631023 658577 679548 684143 694227 704141 692385 715539 716393
19397 716393 713060 747684 782924 816848 839685 865727 878306 865605 870897 866128 883677 905163
19385 905163 901541 926341 930952 950477 1008009 1020944 1028383 1033309 1055383 1059494 1085153 1152049
19373 1152049 1184804 1229587 1220226 1256491 1307446 1345095 1355030 1396598 1446705 1425647 1411995 1478115
19361 1478115 1551088 1643995 1702689 1726462 1780992 1845580 1922306 1981258 2078705 2168562 2266936
19350 2266936 2350361 2484513 2634017 2820881 3033146 3309636 3649946 4090592 4645837 5138803
$$ packed form
19435F75829O028J6114J3594o2314q3158l1761p429r734M43j5314k4041M318K3147
19422E05722N7353M1955J6392j5704l2198J3840K4988J3566j237m3878m1088L8318
19410E78029O5825L8704j7903l3626oK7554K0971M595J0084R914j1756K3154Q54
19397G16393l333L4624L5240L3924K2837K6042J2579j2701N292m769J7549K1486
19385I05163l622K4800M611J9525N7532J2935P439M926K2074M111K5659O6896
19373A152049L2755M4783r361L6265N0955L7649R935M1568N0107k1058j3652O6120
19361A478115P2973R2907N8694K3773N4530O4588P6726N8952R7447Q9857R8374
19350B266936Q3425J34152J49504J86864K12265K76490L40310M40646N55245M92966
$$ plain form
19340 5138803 5460894 5601590 5594580 5569492 5632955 5740389 6029553 6562896 7248017 7916178
19330 7916178 8532689 9081223 9571964 10203747 11136583 12390959 13880422 15518679 17363864
19321 17363864 19524942 22136903 25335237 29535982 35192643 43302700 55182332 73239455
19313 73239455 102306412 151366888 234050111 344584320 397986146 356974942 294580657
19306 294580657 243060392 186922801 128470787 85529138 59184536 43095533 32960166
19299 32960166 26243693 21568940 18244376 15784521 13690117 11885837 10324628 9017327
19291 9017327 8031949 7456725 6957642 6336002 5636527 4906499 4255440 3712486 3303402
19282 3303402 3053225 3074850 3255193 3394399 3316983 2996738 2532532 2102925 1730571 1404496
$$ packed form
19340E138803L22091J40696p010k5088O3463J07434K89164N33343O85121O68161
19330G916178O16511N48534M90741O31783R32836J254376J489463J638257J845185
19321A7363864K161078K611961L198334M200745N656661Q110057J1879632J8057123
19313G3239455K9066957M9060476Q2683223J10534209N3401826m1011204o2394285
19306B94580657n1520265n6137591n8452014m2941649k6344602j6089003j0135367
19299C2960166o716473m674753l324564k459855k094404j804280j561209j307301
19291I017327r85378n75224m99083o21640o99475p30028o51059n42954m09084
19282C303402k50177K1625J80343J39206p7416l20245m64206m29607l72354l26075
$$ plain form
19272 1404496 1135277 905736 764890 696413 651261 573111 510715 449527 418403 391225 359296
19261 359296 322220 240384 192269 169614 179763 158040 115945 115270 117849 90137 73144 9823
19249 9823 -31241 -17503 -38058 -74065 -80716 -76939 -83694 -39327 -46640 -60601 -77608 -74815 -84013
19236 -84013 -103633 -60682 -59099 -55954 -30687 -75957 -91204 -83408 -114158 -164878 -203055 -269795
19224 -269795 -262765 -210048 -163643 -124306 -127333 -134620 -169749 -210253 -234904 -220497 -169048 -144351
19212 -144351 -175091 -191717 -159921 -104687 -128100 -172442 -176464 -154801 -97601 -92210 -138449 -125582
19200 -125582 -98584 -117190 -162807 -188259 -189499 -204643 -236895 -235258 -180545 -155911 -159956 -184406
19188 -184406 -158666 -111934 -65345 -65265 -65332 -116293 -205365 -210240 -208369 -192284 -211375 -232596 -225917
$$ packed form
19272A404496k69219k29541j40846o8477m5152p8150o2396o1188l1124k7178l1929
19261C59296l7076q1836m8115k2655J0149k1723m2095o75K579k7712j6993o3321
19249I823m1064J3738k0555l6007o651L777o755M4367p313j3961j7007K793r198
19236h4013j9620M2951J583L145K5267m5270j5247P796l0750n0720l8177o6740
19224b69795P030N2717M6405L9337l027p287l5129m0504k4651J4407N1449K4697
19212a44351l0740j6626L1796N5234k3413m4342m022K1663N7200N391m6239J2867
19200a25582K6998j8606m5617k5452j240j5144l2252J637N4713K4634m045k4450
19188a84406K5740M6732M6589Q0o7n0961q9072m875J871J6085j9091k1221O679
$$ plain form
19175 -225917 -243538 -242887 -225341 -236510 -209105 -194773 -208702 -193689 -196026 -222540 -225733 -222564
19163 -222564 -229584 -182097 -165113 -159930 -189362 -166407 -158821 -175407 -148874 -132723 -134560 -111549
19151 -111549 -108960 -98448 -93393 -98462 -116187 -125247 -105560 -133079 -174943 -211577 -222295 -248451
19139 -248451 -267109 -262426 -284985 -297751 -271861 -251324 -254282 -240001 -182272 -201294 -210052 -215446
19127 -215446 -256874 -281698 -305120 -280050 -287874 -246595 -251745 -260348 -279088 -257123 -188041 -195475
19115 -195475 -208449 -212407 -192870 -164412 -148996 -159881 -180536 -163675 -154500 -143179 -134923 -148054
19103 -148054 -181806 -210850 -218936 -215668 -195687 -200597 -217605 -185965 -147348 -159725 -145341 -161261
19091 -161261 -204462 -221589 -207811 -150249 -128086 -124065 -108930 -108054 -133335 -122082 -150207 -137221
$$ packed form
19175b25917j7621O51J7546j1169K7405J4332j3929J5013k337k6514l193L169
19163b22564p020M7487J6984N183k9432K2955P586j6586K6533J6151j837K3011
19151a11549K589J0512N055n069j7725r060J9687k7519m1864l6634j0718k6156
19139b48451j8658M683k2559j2766K5890K0537k958J4281N7729j9022q758n394
19127b15446m1428k4824k3422K5070p824M1279n150q603j8740K1965O9082p434
19115a95475j2974l958J9537K8458J5416j0885k0655J6861R175J1321Q256j3131
19103a48054l3752k9044q086L268J9981m910j7008L1640L8617j2377J4384j5920
19091a61261m3201j7127J3778N7562K2163M021J5135Q76k5281J1253k8125J2986
$$ plain form
19079 -137221 -130351 -150844 -162278 -117969 -79239 -55829 -57832 -46205 -55781 -98436 -132269 -155700
19067 -155700 -174226 -169709 -181319 -212121 -207310 -194730 -166921 -139846 -87823 -106002 -107659 -107321
19055 -107321 -117388 -134128 -163406 -157231 -122216 -86682 -56981 -86519 -101601 -141958 -151417 -131806
19043 -131806 -112337 -88218 -108561 -111358 -124403 -128218 -147588 -171936 -176725 -142873 -172927 -156660
19031 -156660 -119696 -113989 -125538 -146010 -148328 -156592 -199789 -227132 -204870 -215439 -223447 -195382
19019 -195382 -192063 -196487 -155725 -150106 -170094 -185722 -203862 -165697 -114062 -144030 -151597 -149430
19007 -149430 -98845 -75024 -106952 -149267 -144495 -90768 -68603 -81761 -105864 -128920 -130344 -100867
18995 -100867 -71868 -57797 -87474 -88221 -69751 -69786 -53398 -33454 -39807 -42268 2676 55041 68642
$$ packed form
19079a37221O870k0493j1434M4309L8730K3410k003J1627r576m2655l3833k3431
19067a55700j8526M517j1610l0802M811J2580K7809K7075N2023j8179j657L38
19055a07321j0067j6740k9278O175L5015L5534K9701k9538j5082m0357r459J9611
19043a31806J9469K4119k0343k797j3045l815j9370k4348m789L3852l0054J6267
19031a56660L6964N707j1549k0472k318q264m3197k7343K2262j0569q008K8065
19019a95382L319m424M0762N619j9988j5628j8140L8165N1635k9968p567K167
19007a49430N0585K3821l1928m2315M772N3727K2165j3158k4103k3056j424K9477
18995a00867K8999J4071k9677p47J8470l5J6388J9944o353k461M4944N2365J3601
$$ plain form
18982 68642 -23084 -111340 -122623 -91327 -61475 -43761 -95628 -97215 -72553 -71426 -70703 -103667
18970 -103667 -109585 -91861 -97189 -106908 -95589 -74423 -100938 -118829 -95000 -87873 -100712 -102286
18958 -102286 -124137 -106012 -100930 -109863 -115911 -128403 -125008 -119895 -159935 -177422 -164787 -199767
18946 -199767 -176195 -168879 -152943 -126989 -143910 -117224 -137243 -123057 -49710 -13481 -19680 -19931
18934 -19931 -57099 -102767 -110133 -95749 -73237 -107541 -137175 -121886 -117789 -148008 -204163 -172030
18922 -172030 -144244 -133044 -119129 -115241 -124776 -85874 -88588 -97737 -106372 -87597 -107370 -106568 -106757
18909 -106757 -104100 -95862 -116437 -142198 -150261 -139888 -129615 -63605 -63281 -62735 -85566 -92917 -94500
18896 -94500 -87881 -116680 -131023 -112401 -123007 -99608 -98909 -88487 -94487 -119157 -106974 -108415 -150364
$$ packed form
18982F8642r1726q8256j1283L1296K9852J7714n1867j587K4662J127P23l2964
18970a03667n918J7724n328r719J1319K1166k6515j7891K3829P127j2839j574
18958a02286k1851J8125N082q933o048j2492L395N113m0040j7487J2635l4980
18946a99767K3572P316J5936K5954j6921K6686k0019J4186P3347L6229o199k51
18934a9931l7168m5668p366J4384K2512l4304k9634J5289M097l0219n6155L2133
18922a72030K7786J1200J3915L888r535L8902k714r149q635J8775j9773Q02j89
18909a06757K657Q238k0575k5761q063J0373J0273O6010L24N46k2831p351j583
18896i4500O619k8799j4343J8622j0606K3399O99J0422o000k4670J2183j441m1949
$$ plain form
18883 -150364 -164338 -161385 -141224 -123927 -136709 -157707 -214030 -211890 -142262 -83300 -59593 -63244
18871 -63244 -77581 -95803 -97232 -69035 -90219 -97904 -108100 -97341 -144505 -126885 -116077 -101525
18859 -101525 -157508 -175428 -136709 -130065 -127049 -155693 -148810 -140935 -131369 -134922 -106270 -66893 -67011
18846 -67011 -85415 -76999 -36894 -60201 -61593 -39744 -40890 -21353 -21824 -38391 -49777 -48184 -73119
18833 -73119 -68617 -79627 -62810 -48323 -17750 -10433 -72976 -131587 -141889 -80696 -84220 -118038
18821 -118038 -91819 -84127 -141400 -159688 -149990 -141100 -136291 -133721 -126789 -54597 -27817 -22144 -40032
18808 -40032 -33017 -30709 -54219 -91246 -82637 -58925 -60608 -68005 -88092 -79427 -92070 -71997 -30407
18795 -30407 -29594 -31555 -41213 -45710 -20838 -16969 -40464 -62932 -77009 -32696 -15168 -30465 3651
$$ packed form
18883a50364j3974K953K0161J7297j2782k0998n6323K140O9628N8962K3707l651
18871f3244j4337j8222j429K8197k1184p685j0196J0759m7164J7620J0808J4552
18859a01525n5983j7920L8719O644L016k8644O883P875R566l553K8652L9377j18
18846f7011j8404Q416M0105k3307j392K1849j146J9537m71j6567j1386J593k4935
18833g3119M502j1010J6817J4487L0573P317o2543n8611j0302O1193l524l3818
18821a18038K6219P692n7273j8288R698Q890M809K570O932P2192K6780N673j7888
18808d0032P015K308k3510l7027Q609K3712j683p397k0087Q665j2643K0073M1590
18795c0407Q13j961r658m497K4872L869k3495k2468j4077M4313J7528j5297L4116
$$ plain form
18782 3651 10610 -30605 -37422 5528 51151 36337 81917 149834 194675 215620 225001 279748
18770 279748 328265 390258 471846 579083 712769 912406 1083859 1154380 1192994 1197100 1069042
18759 1069042 884494 733220 602017 474763 331679 250854 175536 131128 84279 51462
18749 51462 60470 27064 35228 51192 22362 17680 23604 34113 61774 67023 50641 36888 73186
18736 73186 149586 206488 215303 140934 87753 61321 21016 11614 303 -38521 -68303 -100109
18724 -100109 -96144 -105724 -132165 -164637 -130999 -113038 -114489 -102846 -98198 -93964 -130167 -116213
18712 -116213 -56204 -54363 -54097 -33033 -41317 -46845 -43932 -63319 -88209 -57761 -27820 -50137 -62511
18699 -62511 -103717 -133706 -125185 -91317 -99104 -102488 -103556 -69596 -55744 -59292 -122420 -132048 -100143
$$ packed form
18782C651O959m1215o817M2950M5623j4814M5580O7917M4841K0945R381N4747
18770B79748M8517O1993Q1588J07237J33686J99637J71453P0521L8614M106j28058
18759A069042j84548j51274j31203j27254j43084q0825p5318m4408m6849l2817
18749E1462R008l3406Q164J5964k8830m682N924J0509K7661N249j6382j3753L6298
18736G3186P6400N6902Q815p4369n3181k6432m0305r402j1311l8824k9782l1806
18724a00109L965r580k6441l2472L3638J7961j451J1643M648M234l6203J3954
18712a16213O0009J841K66K1064q284n528K913j9387k4890L0448K9941k2317j2374
18699f2511m1206k9989Q521L3868p787l384j068L3960J3852l548o3128r628L1905
$$ plain form
18686 -100143 -107101 -129997 -134214 -145050 -69547 -26140 -21539 -40923 -68896 -72080 -81532 -92176
18674 -92176 -100431 -72756 -80081 -59654 -71724 -77580 -26230 -6116 -37635 5543 31405 11433
18662 11433 -29502 -51285 -28504 -48341 -70769 -80101 -86827 -53307 -52552 -60994 -85263 -86545 -115707
18649 -115707 -115039 -102095 -110347 -118788 -104555 -97622 -142087 -180048 -168570 -134736 -130056 -132350 -91634
18636 -91634 -49016 -68064 -47655 -13542 32393 41605 32300 -8903 -41514 -93990 -80722 -101360
18624 -101360 -100089 -88230 -61182 -36554 -68481 -89316 -74796 -88953 -116403 -99119 -94076 -92012
18612 -92012 -83837 -82806 -61813 -70306 -100810 -104536 -105614 -118907 -104401 -99413 -117094 -104829 -78105
18599 -78105 -81332 -86594 -61365 -66309 -61363 -93920 -116430 -106868 -98374 -80889 -90329 -88634 -82736
$$ packed form
18686a00143o958k2896m217j0836P5503M3407M601j9384k7973l184r452j0644
18674i2176q255K7675p325K0427j2070n856N1350K0114l1519M3178K5862j9972
18662A1433m0935k1783K2781j9837k2428r332o726L3520P55q442k4269j282k9162
18649a15707O68J2944q252q441J4233O933m4465l7961J1478L3834M680k294M0716
18636i1634M2618j9048K0409L4113M5935R212r305m1203l2611n2476J3268k0638
18624a01360J271J1859K7048K4628l1927k0835J4520j4157k7450J7284N043K064
18612i2012Q175J031K0993q493l0504l726j078j3293J4506M988j7681J2265K6724
18599g8105l227n262K5229m944M946l2557k2510R562Q494J7485r440J695N898
$$ plain form
18586 -82736 -61149 -39332 -71554 -108689 -98380 -94280 -81125 -92669 -64653 -59169 -69101 -95833
18574 -95833 -116934 -110427 -107075 -93997 -57924 -69209 -83882 -59699 -68071 -117840 -146509 -156349
18562 -156349 -163326 -105486 -77347 -110630 -70182 -67985 -63846 -26627 -38142 -34550 -49706 -62605
18550 -62605 -90298 -135728 -137993 -112623 -137987 -127161 -98460 -121174 -117810 -60938 -8725 -12685
18538 -12685 -52594 -87476 -82252 -38699 -24932 -39642 -86813 -111774 -68100 -34422 -20549 -4614
18526 -4614 -26836 -49871 -63531 -56794 -18114 -17369 -36668 -57403 -61761 -32637 -61065 -91296 -142275
18513 -142275 -128434 -106701 -117709 -114951 -138415 -132004 -77259 -47354 -116482 -108776 -130182 -115215
18501 -115215 -86751 -116170 -70300 -77786 -114482 -148297 -152131 -128306 -88527 -100058 -141421 -152827
$$ packed form
18586h2736K1587K1817l2222l7135J0309M100J3155j1544K8016N484r932k6732
18574i5833k1101O507L352J3078L6073j1285j4673K4183q372m9769k8669r840
18562a56349o977N7840K8139l3283M0448K197M139L7219j1515L592j5156j2899
18550f2605k7693m5430k265K5370k5364J0826K8701k2714L364N6872N2213l960
18538a2685l9909l4882N224M3553J3767j4710m7171k4961M3674L3678J3873J5935
18526d614k2222k3035j3660O737L8680P45j9299k0735m358K9124k8428l0231n0979
18513a42275J3841K1733j1008K758k3464O411N4745K9905o9128P706k1406J4967
18501a15215K8464k9419M5870p486l6696l3815l834K3825L9779j1531m1363j1406
$$ plain form
18489 -152827 -123413 -67306 -35362 -33999 -9239 -53335 -87937 -125103 -170941 -146409 -95278 -91366
18477 -91366 -63741 -85148 -119908 -62107 18268 -1927 -36639 -60093 -77542 -97414 -98655 -88256
18465 -88256 -89573 -83218 -109474 -81607 -67691 -24901 -24735 -32768 -41768 -36048 -70601 -87550 -71744
18452 -71744 -17518 -16193 -50694 -4655 -31919 -84719 -56059 -59690 -94119 -62826 -71042 -97024
18440 -97024 -84529 -150944 -196510 -175117 -141939 -113130 -129951 -138214 -138923 -164437 -146260 -96878
18428 -96878 -82121 -115370 -164059 -131327 -96588 -87133 -64637 -75910 -54880 -56357 -119533 -164943
18416 -164943 -128233 -104628 -114500 -126940 -146151 -171041 -143403 -99697 -45975 -43123 -30085 -43663
18404 -43663 -67010 -66824 -96516 -88799 -79015 -104497 -110869 -74736 -59514 -47705 -50246 -85234 -71359
$$ packed form
18489a52827K9414N6107L1944J363K4760m4096l4602l7166m5838K4532N1131L912
18477i1366K7625k1407l4760N7801Q0375k0195l4712k3454j7449j9872j241J0399
18465h8256j317O355k6256K7867J3916M2790J66q033r000N720l4553j6949J5806
18452g1744N4226J325l4501M6039k7264n2800K8660l631l4429L1293q216k5982
18440i7024J2495o6415m5566K1393L3178K8809j6821q263p09k5514J8177M9382
18428i6878J4757l3249m8689L2732L4739R455K2496j1273K1030j477o3176m5410
18416a64943L6710K3605r872j2440j9211k4890K7638M3706N3722K852J3038j3578
18404d3663k3347J86k9692P717R784k5482o372L6133J5222J1809k541l4988J3875
$$ plain form
18391 -71359 5762 23869 21726 -10709 -17216 -44739 -92860 -82626 -48054 -11662 -13099 -74398
18379 -74398 -82291 -48247 -21680 -38308 -47141 -42321 -62830 -63148 -60333 -69999 -24786 21399 6499
18366 6499 -107252 -129091 -91271 -95996 -69454 -45489 -63023 -92554 -106214 -73492 -67088 -57156
18354 -57156 -25829 -22962 -40341 -80554 -69542 -33174 -23444 -58100 -43745 -29952 -35935 -81687
18342 -81687 -72968 -44457 -17361 -40145 -43490 -7621 -55894 -105385 -109531 -77117 -29687 -39018
18330 -39018 -31336 -30007 -32890 -68020 -58488 -4658 -14880 -23893 -79418 -72842 -66579 -41066 -26400
18317 -26400 -87793 -96979 -57915 -60813 -53264 -84548 -73743 -38140 -66557 -34879 867 14421
18305 14421 -45045 -97650 -70665 -80173 -84893 -42022 -19058 -32573 -65075 -65869 -32833 -718
$$ packed form
18391g1359P7121J8107k143l2435o507k7523m8121J0234L4572L6392j437o1299
18379g4398p893L4044K6567j6628q833M820k0509l18K815r666M5213M6185j4900
18366F499j13751k1839L7820m725K6542K3965j7534k9531j3660L2722O404R932
18354e7156L1327K867j7379m0213J1012L6368R730l4656J4355J3793n983m5752
18342h1687Q719K8511K7096k2784l345L5869m8273m9491m146L2414M7430r331
18330c9018P682J329k883l5130R532N3830j0222r013n5525O576O263K5513J4666
18317b6400o1393r186L9064k898P549l1284J0805L5603k8417L1678L5746J3554
18305A4421n9466n2605K6985r508m720M2871K2964j3515l2502p94L3036L2115
$$ plain form
18293 -718 -8259 -851 6624 34698 -29469 -55154 -51021 -43705 -11118 6566 -12796 -33500 -51707
18280 -51707 -45932 -44949 -61435 -64778 -38046 -29718 -15212 -17838 -52673 -50316 -47621 -35582 -11284
18267 -11284 2841 -791 -38669 -55031 -82168 -59487 -34997 -40374 -8399 -14975 -34736 -77897
18255 -77897 -82784 -66734 -61068 -52168 -91168 -115082 -117772 -95902 -85635 -89739 -73551 -55594 -55690
18242 -55690 -20466 -11741 -47017 -64121 8639 47072 68796 53896 250 -10847 3736 29351
18230 29351 12072 -17283 -21338 -7285 -72968 -70272 -26277 -38872 -26908 -35784 -71694 -48263
18218 -48263 10762 31360 -8007 -41554 -34026 19734 25518 16411 49588 63541 8637 -57640
18206 -57640 -82262 -131295 -122641 -95804 -78226 -41261 15023 7825 -13713 -18534 -12398 -6338 -38934
$$ packed form
18293g18p541P408P475K8074o4167k5685M133P316L2587J7684j9362k0704j8207
18280e1707N775R83j6486l343K6732Q328J4506k626l4835K357K695J2039K4298
18267a1284J4125l632l7878j6362k7137K2681K4490n377L1975o576j9761m3161
18255g7897m887J6050N666Q900l9000k3914k690K1870J0267m104J6188J7957r6
18242e5690L5224Q725l5276j7104P2760L8433K1724j4900n3646j1097J4583K5615
18230B9351j7279k9355m055J4053o5683K696M3995j2595J1964q876l5910K3431
18218d8263N9025K0598l9367l3547P528N3760N784r107L3177J3953n4904o6277
18206e7640k4622m9033Q654K6837J7578L6965N6284p198k1538m821O136O060l2596
$$ plain form
18193 -38934 -80664 -77431 -61480 -53105 -35587 1847 -10645 -20790 -25603 -18679 -16104 8016 11631
18180 11631 33142 26142 -30055 -32437 -28535 7158 4769 -7143 -15114 -41427 -46335 -48497 -101916
18167 -101916 -121655 -81290 -30166 9594 -5237 -50143 -93332 -134597 -136308 -89141 -85529 -133168
18155 -133168 -110083 -69406 -61764 -32303 20951 37415 16516 -18697 -70028 -64315 -35555 -28815
18143 -28815 -6376 -9530 -22850 -56594 -47217 -15338 3584 -6853 30107 31681 56186 41991
18131 41991 -6180 -48478 -94606 -80188 -72255 -54910 -62972 -41731 -19273 -31568 -24933 -4719
18119 -4719 -2498 -36248 -64615 -63593 -53221 -44133 -22821 -14124 -13303 -11531 -9747 -61545 -69818 -38892
18105 -38892 -32560 13043 33123 -12423 -49207 -51428 -43940 -6624 2184 -36565 -56823 -66875
$$ packed form
18193c8934m1730L233J5951Q375J7518L7434j2492j0145m813O924K575K4120L615
18180A1631K1511p000n6197k382L902L5693k389j1912p971k6313m908k162n3419
18167a01916j9739M0365N1124L9760j4831m4906m3189m1265j711M7167L612m7639
18155a33168K3085M0677P642K9461N3254J6464k0899l5213n1331N713K8760O740
18143b8815K2439l154j3320l3744R377L1879J8922j0437L6960J574K4505j4195
18131D1991m8171m2298m6128J4418P933J7345q062K1241K2458j2295O635K0214
18119d719K221l3750k8367J022J0372R088K1312Q697Q21J772J784n1798q273L0926
18105c8892O332M5603K0080m5546l6784k221P488L7316Q808l8749k0258j0052
$$ plain form
18093 -66875 -51605 -21292 -34691 -63106 -47130 -47355 -45641 -58336 -78171 -65589 -52613 -24223
18081 -24223 -50489 -38616 -26013 -5411 34479 50239 31486 9768 -70411 -70535 -11606 -5214
18069 -5214 -32681 17068 38280 4257 -2142 -9120 -28803 -43675 -68978 -104615 -74092 -46165
18057 -46165 -56039 -33759 -24557 39368 13371 -12075 -7800 -17134 -29421 -41368 -32521 14705 -4341
18044 -4341 -33117 -9789 -18124 -23482 -31349 -10766 -9631 -25426 -34775 -16984 -3878 19508 67260
18031 67260 71488 75760 64551 5820 10915 25253 17517 -29342 -22639 -18830 -43954 -42745 -19194
18018 -19194 -37907 -72644 -86200 -80027 -77511 -108675 -94413 -85599 -72530 -46430 -49727 -15641
18006 -15641 45830 76628 60960 -11386 -83933 -125572 -99799 -61466 -32271 -32066 -59334 -18954
$$ packed form
18093f6875J5270L0313j3399k8415J5976k25J714j2695j9835J2582J2976K8390
18081b4223k6266J1873J2603K0602L9890J5760j8753k1718q0179j24N8929O392
18069e214k7467M9749K1212l4023o399o978j9683j4872k5303l5637L0523K7927
18057d6165r874K2280R202O3925k5997k5446M275r334j2287j1947Q847M7226j9046
18044d341k8776K3328q335n358p867K0583J135j5795r349J7791J3106K3386M7752
18031F7260M228M272j1209n8731N095J4338p736m6859O703L809k5124J209K3551
18018a9194j8713l4737j3556O173K516l1164J4262Q814J3069K6100l297L4086
18006a5641O1471L0798j5668p2346p2547m1639K5773L8333K9195K05k7268M0380
$$ plain form
17994 -18954 -3234 -18661 -37662 7107 33211 9765 -12830 -47292 -95492 -64357 -57592 -88611
17982 -88611 -73392 -14583 57080 72177 10195 -14153 4092 28999 11499 11300 32003 20371
17970 20371 -8897 -30331 -44856 -53487 -77592 -97211 -78425 -56067 -31522 -33015 -71521 -57101
17958 -57101 -61700 -119657 -134568 -122350 -123198 -111875 -86666 -51108 -13918 -19487 -20785 -53872 -48071
17945 -48071 -5597 29398 44536 20974 -33064 -40589 -36591 -56056 -36036 -54673 -59774 -15452
17933 -15452 -35332 -60129 -9644 42982 15283 20891 37329 -15601 -33721 -54489 -61546 1675
17921 1675 60725 33296 22399 56466 68561 77967 88256 52554 4548 9751 93865 113426
17909 113426 83680 67027 43503 11570 6017 35035 51968 19131 -13904 1411 38413 20485
$$ packed form
17994a8954J5720j5427j9001M4769K6104k3446k2595l4462m8200L1135O765l1019
17982h8611J5219N8809P1663J5097o1982k4348J8245K4907j7500j99K0703j1632
17970B0371k9268k1434j4525q631k4105j9619J8786K2358K4545j493l8506J4420
17958e7101m599n7957j4911J2218q48J1323K5209L5558L7190n569j298l3087N801
17945d8071M2474L4995J5138k3562n4038p525L998j9465K0020j8637n101M4322
17933a5452j9880k4797N0485N2626k7699N608J6438n2930j8120k0768p057O3221
17921A675N9050k7429j0897L4067J2095R406J0289l5702m8006N203Q4114J9561
17909A13426k9746j6653k3524l1933n553K9018J6933l2837l3035J5315L7002j7928
$$ plain form
17897 20485 2927 -51665 -82897 -93087 -87559 -70929 -39967 -15776 -26544 -33044 -41903 -40382
17885 -40382 -1529 -3905 19115 28147 49290 27849 -5973 -35690 -50260 -71918 -76708 -50846
17873 -50846 -44120 -51075 -45911 -71082 -58955 -43884 -26066 -45785 -83550 -42669 22607 19647
17861 19647 -4688 -32218 -29699 6602 23200 -8156 -11981 -23784 -24442 -5495 12866 11055 -23163
17848 -23163 -21746 -4012 30494 40663 -10280 -32570 318 -18331 -86654 -102552 -86385 -63893
17836 -63893 -73099 -69503 -30644 14145 57180 85121 50472 -23858 -91709 -114750 -88659 -75365
17824 -75365 -30664 6850 26671 31542 41643 -11631 -82 52487 102906 45866 -20627 -70693
17812 -70693 -76923 -69304 -34853 -16772 4597 -14298 -55981 -70619 -57847 -33949 -24842 -18570
$$ packed form
17897B0485j7558n4592l1232j0190N528J6630L0962K4191j0768o500q859J521
17885d0382L8853k376K3020R032K1143k1441l3822k9717j4570k1658m790K5862
17873e0846O726o955N164k5171J2127J5071J7818j9719l7765M0881O5276k960
17861A9647k4335k7530K519L6301J6598l1356l825j1803o58J8947J8361j811l4218
17848b3163J417J7734L4506J0169n0943k2290L2888j8649o8323j5898J6167K2492
17836f3893r206L596L8859M4789M3035K7941l4649p4330o7851k3041K6091J3294
17824g5365M4701L7514J9821M871J0101n3274J1549N2569N0419n7040o6493n0066
17812g0693o230P619L4451J8081K1369j8895m1683j4638J2772K3898R107O272
$$ plain form
17800 -18570 11230 26199 38571 22172 -35667 -42516 -35249 -343 19196 -20996 -66615 -65140
17788 -65140 -32184 20525 23850 -17623 -53394 -51763 -41171 -74955 -113454 -108157 -100211 -74897
17776 -74897 -45911 -27167 -26758 -56474 -33072 31558 62431 77090 62294 24037 4178 2644
17764 2644 10021 40272 -1024 -6914 2246 -16064 -38027 -39918 -74655 -70070 -19755 13229 36242
17751 36242 31191 48471 59064 43436 45147 26659 -4464 8278 -1809 -23340 -46490 -47385
17739 -47385 -46198 -18535 21687 31210 -18290 -8534 19658 -17298 -29458 -40345 -46524 16075
17727 16075 -1950 -13614 -25991 -66706 -60530 -45881 -46244 -22966 -2951 24440 36756 16052
17715 16052 -25717 -24113 -35437 -4545 34047 24385 9908 17803 44355 14111 -9353 -46363
$$ packed form
17800a8570K9800J4969J2372j6399n7839o849P267L4906J9539m0192m5619J475
17788f5140L2956N2709L325m1473l5771J631J0592l3784l8499N297P946K5314
17776g4897K8986J8744M09k9716K3402O4630L0873J4659j4796l8257j9859j534
17764B644P377L0251m1296n890R160j8310k1963j891l4737M585N0315L2984K3013
17751C6242n051J7280J0593j5628J711j8488l1123J2742j0087k1531k3150q95
17739d7385J187K7663M0222R523m9500R756K8192l6956j2160j0887o179O2599
17727A6075j8025j1664j2377m0715O176J4649l63K3278K0015K7391J2316k0704
17715A6052m1769J604j1324L0892L8592r662j4477P895K6552l0244k3464l7010
$$ plain form
17703 -46363 -45210 -15699 3294 22389 6388 33489 13129 17087 22743 9242 -5976 -9286
17691 -9286 -15699 -37257 -36218 -29556 -26347 -51538 -84627 -86625 -89085 -66643 -37929 -33515 -75734
17678 -75734 -98368 -96264 -125681 -137435 -72088 -8584 3834 11058 21785 22345 16066 -3648 -9492
17665 -9492 -10215 -35782 -36986 -21820 -25186 -35412 -16091 -10824 -4567 -7858 19720 16947 -5413
17652 -5413 -12928 16974 13062 20687 27533 7991 14406 60020 72367 72313 67081 47713 16020 -45437
17638 -45437 -54830 -10152 5071 -21659 -31394 -15106 6468 -11795 -44190 -10422 -5516 17620
17626 17620 -8503 9551 40727 18028 -4094 -10984 1897 -26538 -26243 -42835 -70590 -65738
17614 -65738 -66988 -54130 -12275 -49253 -67366 -27894 1476 -14876 -3122 -11251 -59443 -84608
$$ packed form
17703d6363J153K9511J8993J9095j6001K7101k0360L958N656j3501j5218l310
17691i286o413k1558J039O662L209k5191l3089j998k460K2442K8714M414m2219
17678g5734k2634K104k9417j1754O5347O3504J2418P224J0727N60o279j9714n844
17665i492p23k5567j204J5166l366j0226J9321N267O257l291K7578k773k2360
17652e413p515K9902l912P625O846j9542O415M5614J2347n4n232j9368l1693o1457
17638d5437r393M4678J5223k6730r735J6288K1574j8263l2395L3768M906K3136
17626A7620k6123J8054L1176k2699k2122o890J2881k8435K95j6592k7755M852
17614f5738j250J2858M1855l6978j8113L9472K9370j6352J1754q129m8192k5165
$$ plain form
17602 -84608 -96292 -105483 -75406 -64710 -61406 -49801 4705 -1667 -38215 -26123 -9499 -10279 -40943
17589 -40943 -18894 -71 1494 22745 10013 11214 -44611 -56020 -32924 -38435 -14910 17664
17577 17664 -12748 -14714 -39782 -36757 -52509 -61007 -59518 6113 44150 36961 12523 -20812 527
17564 527 -10650 -18866 -22546 18326 14255 8807 3270 19980 9923 -17752 -45850 -30715 16326
17551 16326 46397 95708 112124 86577 97679 50313 49649 58405 6295 -38161 -1075 -23226
17539 -23226 -44796 -16057 -328 40408 7462 -18573 -38221 -23472 30676 49305 47492 88567
17527 88567 121015 83600 43849 12248 -11076 -8972 -31734 -60695 -71954 -76295 -38771 -33434
17515 -33434 -8277 14081 -3713 -11728 -57225 -92133 -71085 -24342 2658 -43472 -42387 -3253
$$ packed form
17602h4608j1684r191L0077J0696L304J1605N4506o372l6548J2092J6624p80l0664
17589d0943K2049J8823J565K1251j2732J201n5825j1409K3096n511K3525L2574
17577A7664l0412j966k5068L025j5752q498J489O5631L8037p189k4438l3335K1339
17564E27j1177q216l680M0872m071n448n537J6710j0057k7675k8098J5135M7041
17551A6326L0071M9311J6416k5547J1102m7366o64Q756n2110m4456L7086k2151
17539b3226k1570K8739J5729M0736l2946k6035j9648J4749N4148J8629j813M1075
17527H8567L2448l7415l9751l1601k3324K104k2762k8961j1259m341L7524N337
17515c3434K5157K2358j7794q015m5497l4908K1048M6743K7000m6130J085L9134
$$ plain form
17503 -3253 -19827 -63332 -69727 -49549 -27330 -2475 -17255 -42044 -30078 -15402 8389 -1911
17491 -1911 -30972 -30159 -24831 -17043 -15717 -23176 -20606 -2557 -12529 -22554 -19395 -75350 -87175 -29880
17477 -29880 39521 41038 49697 8781 -47289 -28803 -4658 -13022 -18518 -20077 -23946 -41269 -84238
17464 -84238 -85483 -60266 -66142 -52610 -39880 -50904 -22644 8807 -2916 22425 40841 27542
17452 27542 18292 3507 36929 31409 2694 174 2480 -17780 -11914 -15753 51020 92685 45880
17439 45880 -53165 -55489 748 -9811 -15991 -22066 -20758 -22674 -9407 27056 41598 13429 29910
17426 29910 32789 48277 68570 27546 30921 39444 32029 66237 102055 80066 28609 4089
17414 4089 -25920 8207 6483 -30985 -18874 13144 -10805 -16864 -39812 -32308 -26847 -40484 -72657
$$ packed form
17503c253j6574m3505o395K0178K2219K4855j4780k4789J1966J4676K3791j0300
17491a911k9061Q13N328P788J326p459K570J8049r972j0025L159n5955j1825N7295
17477b9880O9401J517Q659m0916n6070J8486K4145q364n496j559l869j7323m2969
17464h4238j245K5217n876J3532J2730j1024K8260L1451j1723K5341J8416j3299
17452B7542r250j4785L3422n520k8715k520K306k0260N866l839O6773M1665m6805
17439D5880r9045k324N6237j0559o180o075J308j916J3267L6463J4542k8169J6481
17426B9910K879J5488K0293m1024L375Q523p415L4208L5818k1989n1457k4520
17414D089l0009L4127j724l7468J2111L2018k3949o059k2948P504N461j3637l2173
$$ plain form
17401 -72657 -44533 -27798 -23080 -17362 -4828 -7419 2862 25425 60993 93146 126236 125683 94033
17388 94033 28201 12206 -5285 8798 44672 19197 -6132 -9329 9317 39650 70945 28029
17376 28029 -13283 -40114 -29890 -20856 -37033 -14685 -4410 26093 37928 7123 32968 43052
17364 43052 33995 9585 38948 40707 39045 25628 30593 16862 -19555 -69352 -81771 -26656
17352 -26656 6955 3401 2694 343 12889 36982 -908 15863 29213 13118 19829 14332 -22708
17339 -22708 -6872 16395 39808 54252 30463 -1108 -24388 18641 50544 46899 21187 46795
17327 46795 31598 -5270 -5985 -20583 -49083 -9302 -24152 -5594 -2104 -6956 -21648 -25829 -37462
17314 -37462 -80959 -17625 -22248 -32218 -21862 -16703 -17472 -28837 -10289 -23912 25407 36529 41752
$$ packed form
17401g2657K8124J6735M718N718J2534k591J0281K2563L5568L2153L3090n53l1650
17388I4033o5832j5995j7491J4083L5874k5475k5329l197J8646L0333L1295m2916
17376B8029m1312k6831J0224R034j6177K2348J0275L0503J1835l0805K5845J0084
17364D3052r057k4410K9363J759j662j3417M965j3731l6417m9797j2419N5115
17352b6656L3611l554p07k351J2546K4093l7890J6771J3350j6095O711n497l7040
17339b2708J5836K3267K3413J4444k3789l1571k3280M3029L1903l645k5712K5608
17327D6795j5197l6868p15j4598k8500L9781j4850J8558L490m852j4692m181j1633
17314c7462m3497O3334m623r970J0356N159p69j1365J8548j3623M9319J1122N223
$$ plain form
17301 41752 56985 68602 57760 27384 -3240 1675 10571 26473 -17579 -62544 -71234 -58536
17289 -58536 -23171 -9010 -28096 -23126 11774 16906 12686 44557 48899 23903 -68402 -93136
17277 -93136 -50983 38623 56755 -19054 -50043 -18606 2630 9244 -2393 -16376 -33453 -17213
17265 -17213 -1289 -13879 -26335 -13529 -59956 -51601 13959 46766 22774 -6510 -9723 4220
17253 4220 17804 -21381 -31386 -12036 573 -16975 1453 26423 44922 52144 58359 65243
17241 65243 37397 -2812 -57550 -65180 -34058 -3681 49508 34712 30791 37626 67550 69609
17229 69609 63819 42467 67709 80856 61669 57974 13440 -32428 -18495 -7922 29117 10792
17217 10792 -34044 -2683 -15912 10545 34034 34693 6065 7820 35744 11481 4986 16192
$$ packed form
17301D1752J5233J1617j0842l0376l0624M915Q896J5902m4052m4965q690J2698
17289e8536L5365J4161j9086M970L4900N132m220L1871M342k4996r2305k4734
17277i3136M2153Q9606J8132p5809l0989L1437K1236O614j1637j3983j7077J6240
17265a7213J5924j2590j2456J2806m6427Q355O5560L2807k3992k9284l213J3943
17253D220J3584l9185j0005J9350J2609j7548J8428K4970J8499P222O215O884
17241F5243k7846m0209n4738p630L1122L0377N3189j4796l921O835K9924K059
17229F9609n790k1352K5242J3147j9187l695m4534m5868J3933J0573L7039j8325
17217A0792m4836L1361j3229K6457K3489O59k8628J755K7924k4263o495J1206
$$ plain form
17205 16192 23543 39567 29369 17032 34960 49512 50112 24140 18486 46424 17765 -26352
17193 -26352 -41431 -14499 -5114 -12831 12026 8953 -22006 -2355 -5003 -23365 -20195 -27854 -13630
17180 -13630 -10953 -12988 -41948 -51122 -34357 -13872 -22827 -35771 -75009 -82828 -45776 22227 72729
17167 72729 112346 117845 82544 64852 45856 10271 20696 8934 -51548 -35305 -23982 13813
17155 13813 19390 -518 11973 22354 12001 28022 15094 -3313 29816 14305 -8356 -23796
17143 -23796 10385 -25155 -28812 -49223 -22621 26055 35089 41930 6901 37961 46290 21035
17131 21035 5708 -17040 -28041 -18903 -27209 -24573 -2202 42937 56092 66408 83279 79596
17119 79596 62544 39595 22588 6952 40671 68715 56429 28047 58698 62982 13668 -13186
$$ packed form
17205A6192P351J6024j0198j2337J7928J4552O00k5972n654K7938k8659m4117
17193b6352j5079K6932R385p717K4857l073l0959J9651k648j8362L170p659J4224
17180a3630K677k035k8960r174J6765K0485q955j2944l9238p819L7052O8003N0502
17167G2729L9617N499l5301j7692j8996l5585J0425j1762o0482J6243J1323L7795
17155A3813N577j9908J2491J0381j0353J6021j2928j8407L3129j5511k2661j5440
17143b3796L4181l5540l657k0411K6602M8676R034O841l5029L1060Q329k5255
17131B1035j5327k2748j1001R138q306K636K2371M5139J3155J0316J6871l683
17119G9596j7052k2949j7007j5636L3719K8044j2286k8382L0651M284m9314k6854
$$ plain form
17107 -13186 -8815 -173 22065 11723 -24941 -4327 -11325 -26577 -20693 -214 29111 68107
17095 68107 66685 52049 62803 64478 29531 11288 1031 13625 -3463 160 20382 7713
17083 7713 2418 -26109 8119 15198 -11011 4496 21778 11925 4738 20314 -15922 -24612 -14602
17070 -14602 -12812 -25060 -5417 15008 -8477 -25836 -26910 -61793 -47923 -68496 -47841 -58273
17058 -58273 -65183 -53678 -21551 20676 33120 11734 -1920 34328 57157 20351 -13875 -34284
17046 -34284 -19571 16138 53610 59572 36405 -17014 -39063 -21885 7313 25254 76624 62243
17034 62243 16744 5731 31169 84240 83995 58501 58219 49673 40291 65531 27304 -35203 -23258
17021 -23258 29868 60407 78095 105287 80740 71773 50390 28328 54960 100077 91109 45165
$$ packed form
17107a3186M371Q642K2238j0342l6664K0614o998j5252N884K0479K9325L8996
17095F8107j422j4636J0754J675l4947j8243j0257J2594j7088L623K0222j2669
17083G713n295k8527L4228P079k6209J5507J7282r853p187J5576l6236q690J0010
17070a4602J790j2248J9643K0425k3485j7359j074l4883J3870k0573K0655j0432
17058e8273o910J1505L2127M2227J2444k1386j3654L6248K2829l6806l4226k0409
17046c4284J4713L5709L7472N962k3167n3419k2049J7178K9198J7941N1370j4381
17034F2243m5499j1013K5438N3071k45k5494k82q546r382K5240l8227o2507J1945
17021b3258N3126L0539J7688K7192k4547q967k1383k2062K6632M5117q968m5944
$$ plain form
17009 45165 7770 5866 29363 32287 31133 63476 71414 85962 107573 106277 90635 72662 54604
16996 54604 13617 28369 15947 17699 12729 -10893 -1950 12912 4728 -26460 -51815 -67789
16984 -67789 -40236 17209 56185 62593 42895 27568 20310 22738 19141 22770 2034 -37479 -50592
16971 -50592 -33340 -9653 37091 52493 58481 55042 63665 78094 34468 23127 25114 34011 32575
16958 32575 36848 15713 40507 21749 -885 -41351 -26023 20306 44028 41560 19763 13677
16946 13677 11045 25641 -3655 -12837 19589 56665 31058 18662 -6292 21289 38318 49124
16934 49124 38745 32025 13717 -4015 -46614 -71309 -34287 -31060 -39199 -13164 -13842 -925 2215
16921 2215 -7669 -21366 -22903 28659 7931 28409 37389 35590 53343 58437 47215 45608 57272
$$ packed form
17009D5165l7395j904K3497K924j154L2343P938J4548K1611j296j5642j7973j8058
16996E4604m0987J4752j2422J752m970k3622Q943J4862q184l1188k5355j5974
16984f7789K7553N7445L8976O408j9698j5327p258K428l597L629k0736l9513j3113
16971e0592J7252K3687M6744J5402N988l439Q623J4429m3626j1341J987Q897j436
16958C2575M273k1135K4794j8758k2634m0466J5328M6329K3722k468k1797o086
16946A3677k632J4596k9296r182L2426L7076k5607j2396k4954K7581J7029J0806
16934D9124j0379o720j8308j7732m2599k4695L7022L227q139K6035o78J2917L140
16921B215r884j3697j537N1562k0728K0478Q980j799J7753N094j1222j607J1664
$$ plain form
16908 57272 48620 110084 121006 80059 68272 49151 11029 41239 47041 46684 54017 79742 66056
16895 66056 47568 15542 -26540 -66392 -46097 -43870 -16963 20808 42447 17911 310 -9717
16883 -9717 -26112 -41007 -32581 -4334 1630 3111 60460 51042 -18102 -74508 -80034 -69612 -46909
16870 -46909 -75902 -55451 -8675 14850 38633 12843 -6255 -17342 -7339 19718 50606 54557
16858 54557 24683 16270 7598 11024 -11856 21645 57999 68415 106546 83108 33260 -2363
16846 -2363 13005 16136 10564 15059 13421 4123 -15305 3906 51588 39175 29946 35002 48502
16833 48502 50687 13771 2264 13031 -12532 -11662 -11395 2373 12874 20556 817 -2669 -15269
16820 -15269 6415 39265 32931 9675 -11691 -23931 -6704 10451 27185 50772 80019 72381
$$ packed form
16908E7272q652O1464J0922m0947j1787j9121l8122L0210N802l57P333K5725j3686
16895F6056j8488l2026m2082l9852K0295K227K6907L7771K1639k4536j7601j0027
16883i717j6395j4895Q426K8247N964J481N7349r418o9144n6406n526J0422K2703
16870d6909k8993K0451M6776K3525K3783k5790j9098j1087J0003K7057L0888L951
16858E4557k9874q413q672L426k2880L3501L6354J0416L8131k3438m9848l5623
16846b363J5368L131n572M495j638r298j9428J9211M7682j2413r229N056J3500
16833D8502K185l6916j1507J0767k5563Q70K67J3768J0501P682j9739l486j2600
16820a5269K1684L2850o334k3256k1366j2240J7227J7155J6734K3587K9247p638
$$ plain form
16808 72381 24165 -1971 -3085 22763 48374 44891 23068 35805 59814 64377 33473 -17426
16796 -17426 -11427 -27985 -92771 -88163 -71279 -56824 -41855 -47477 -38662 39492 94118 87050 35716
16783 35716 2279 44440 70586 72418 25243 13764 58777 42548 37132 6686 -14686 -35280
16771 -35280 4141 18347 11075 -2433 39289 -6734 -53668 -68419 -41684 18488 58619 58618 33674
16758 33674 28099 29305 53449 36926 73999 56543 60322 83933 88772 32605 18435 49309
16746 49309 85756 36774 4898 9246 -13902 -42316 -35231 -8215 53633 54028 19972 12178 25192
16733 25192 18101 47422 19194 56579 97165 61829 64028 64763 29431 18808 55267 66093
16721 66093 82614 73560 34133 16760 15923 -2668 21460 61000 55382 3268 -7688 35425
$$ packed form
16808G2381m8216k6136j114K5848K5611l483k1823J2737K4009M563l0904n0899
16796a7426N999j6558o4786M608J6884J4455J4969n622Q815P8154N4626p068n1334
16783C5716l3437M2161K6146J832m7175j1479M5013j6229n416l0446k1372k0594
16771c5280L9421J4206p272j3508M1722m6023m6934j4751K6735O0172M0131jk4944
16758C3674n575J206K4144j6523L7073j7456L779K3611M839n6167j4170L0874
16746D9309L6447m8982l1876M348k3148k8414P085K7016O1848L95l4056p794J3014
16733B5192p091K9321k8228L7385M0586l5336K199P35l5332j0623L6459J0826
16721F6093J6521r054l9427j7373q37j8591K4128L9540n618n2114j0956M3113
$$ plain form
16709 35425 56031 9345 12147 51511 40982 14898 19448 16861 11831 46756 50506 14467 22756
16696 22756 12275 -2677 21516 67400 80369 104344 71362 35213 -2628 -27923 -36605 -18117
16684 -18117 8821 24838 19063 18921 16240 -4770 -12260 -16003 -9876 9079 -994 -15257 -13033
16671 -13033 -11085 -41299 -30674 13227 2315 -44096 -45983 -38100 -10092 1782 -13152 30519
16659 30519 66719 63898 73724 62360 34490 -12923 30744 27630 16455 -7065 25532 40072
16647 40072 25064 30365 55558 74681 33713 19218 40890 40009 8640 6844 -1113 -14660 26348
16634 26348 33331 -834 -7312 31494 84421 67979 60742 76948 64031 35504 3804 -41333
16622 -41333 -17206 25261 699 -19211 -3011 56450 48370 19286 5381 -24728 -28483 -15017
$$ packed form
16709C5425K0606m6686K802L9364j0529k6084M550k587n030L4925L750l6039Q289
16696B2756j0481j4952K4193M5884J2969K3975l2982l6149l7841k5295q682J8488
16684a8117K6938J6017n775j42k681k1010p490l743O127J8955j0073j4263K224
16671a3033J948l0214J0625M3901j0912m6411j887P883K8008J1874j4934M3671
16659C0519L6200k821R826j1364k7870m7413M3667l114j1175k3520L2597J4540
16647D0072j5008N301K5193J9123m0968j4495K1672q81l1369j796p957j3547M1008
16634B6348O983l4165o478L8806N2927j6442p237J6206j2917k8527l1700m5137
16622d1333K4127M2467k4562j9910J6200N9461q080k9084j3905l0109l755J3466
$$ plain form
16610 -15017 2802 73728 94147 94870 66113 63213 67813 87806 97137 86878 82299 66099 83560
16597 83560 103305 107569 83772 109655 130702 119102 119810 106084 52977 62558 97877 53257
16585 53257 -4877 -20076 7572 43722 92681 54783 16618 22204 -3698 26986 52952 62161
16573 62161 86063 113639 127208 108536 127688 121254 104735 72571 25226 3575 11258 -6557
16561 -6557 -7677 19366 39765 52272 84168 108296 130767 95901 67979 47567 51733 39706
16549 39706 15808 11116 -21624 -36471 13059 47592 41302 -5712 12891 45032 47454 70198
16537 70198 78706 50480 40151 38253 25186 36738 48726 68424 91286 114632 102855 91812
16525 91812 78966 54280 65328 69753 75197 65257 38977 52617 20804 10757 62339 100704
$$ packed form
16610a5017J7819P0926K0419P23k8757k900M600J9993R331j0259m579j6200J7461
16597H3560J9745M264k3797K5883K1047j1600P08j3726n3107R581L5319m4620
16585E3257n8134j5199K7648L6150M8959l7898l8165N586k5902L0684K5966R209
16573F2161K3902K7576J3569j8672J9152o434j6519l2164m7345k1651P683j7815
16561f557j120K7043K0399J2507L1896K4128K2471l4866k7922k0412M166j2027
16549C9706k3898m692l2740j4847M9530L4533o290m7014J8603L2141K422K2744
16537G0198Q508k8226j0329j898j3067J1552J1988J9698K2862K3346j1777j1043
16525I1812j2846k4686J1048M425N444r940k6280J3640l1813j0047N1582L8365
$$ plain form
16513 100704 91171 122653 104397 74668 103646 95788 58397 33612 27176 68538 58469 39945
16501 39945 40692 25436 38454 7819 -16618 -7503 -1257 -24103 11414 28070 6712 14829 39895
16488 39895 71212 40058 23732 35871 8802 10844 19582 61909 81568 61499 33989 35599
16476 35599 33684 42289 56665 89188 77010 52886 49564 60664 63677 58228 47278 42904 50920
16463 50920 74494 70703 102967 98098 100245 102447 84080 55580 37193 18987 23281 16721 28181
16450 28181 54478 64229 111365 67219 55220 47336 38378 58183 74136 100303 84115 96171
16438 96171 126901 132965 109096 84562 132756 171387 129484 139948 105458 53148 -5019 11639
16426 11639 51369 76582 98756 121333 99213 68161 76371 101565 101295 101172 134695 124023 88047
$$ packed form
16513A00704r533L1482j8256k9729K8978p858l7391k4785o436M1362j0069j8524
16501C9945P47j5256J3018l0635k4437R115O246k2846L5517J6656k1358Q117K5066
16488C9895L1317l1154j6326J2139k7069K042Q738M2327J9659k0069k7510J610
16476C5599j915Q605J4376L2523j2178k4124l322J1100L013n449j0950m374Q016
16463E0920K3574l791L2264m869K147K202j8367k8500j8387j8206M294o560J1460
16450B8181K6297R751M7136m4146j1999p884q958J9805J5953K6167j6188J2056
16438I6171L0730O064k3869k4534M8194L8631m1903J0464l4490n2310n8167J6658
16426A1639L9730K5213K2174K2577k2120l1052Q210K5194k70j23L3523j0672l5976
$$ plain form
16413 88047 46088 59887 46873 73072 76394 93878 59079 37989 63661 52341 9828 15426
16401 15426 40866 111988 109408 63791 48340 78555 100577 74223 78649 89197 80984 35716
16389 35716 29840 11943 18728 -6438 -44552 -19181 9933 3220 22232 40119 25967 24973 60450
16376 60450 67933 36805 44899 72131 75716 71187 102904 89083 102156 90882 58485 51046 81502
16363 81502 88663 88602 103748 102385 75941 74296 108786 131746 80611 77781 105633 105007 64336
16350 64336 77186 109263 104083 99603 91483 59272 60147 73441 85893 93102 112616 102804 126767
16337 126767 59290 54722 103481 94040 54747 53924 87484 126094 102896 62965 36946 38448
16325 38448 86771 68407 35435 52495 118307 157405 145562 62223 25802 61996 94694 127579
$$ packed form
16413H8047m1959J3799j3014K6199L322J7484l4799k1090K5672j1320m2513N598
16401A5426K5440P1122k580m5617j5451L0215K2022k6354M426J0548q213m5268
16389C5716n876j7897O785k5166l8114K5371K9114o713J9012J7887j4152r94L5477
16376F0450P483l1128Q094K7232L585m529L1717j3821J3073j1274l2397p439L0456
16363H1502P161o1J5146j363k6444j645L4490K2960n1135k830K7852o26m0671
16350F4336J2850L2077n180m480q120l2211Q75J3294J2452P209J9514r812K3963
16337A26767o7477m568M8759r441l9293q23L3560L8610k3198l9931k6019J502
16325C8448M8323j8364l2972J7060O5812L9098j1843q3339l6421L6194L2698L2885
$$ plain form
16313 127579 80850 40616 11720 10851 56805 52733 19212 15359 81220 82046 90694 97990 103001
16300 103001 106151 114918 101238 93198 90267 72583 68523 90738 107470 84596 90787 64214 92096
16287 92096 131789 114934 76708 101334 112570 97486 55495 39669 71136 106951 117584 142649
16275 142649 127659 108999 130683 114256 99547 114611 70493 14081 3607 26218 69626
16264 69626 54470 21332 17408 11254 41981 89637 120632 75322 32466 46766 78508 75840
16252 75840 93224 111471 113505 82069 68337 55470 59048 65619 49357 72410 133251 147897
16240 147897 165714 151149 130362 113130 89704 74179 50412 83650 106574 147101 130233
16229 130233 99473 49077 55372 63960 92183 111112 68554 64621 78347 82600 88089 87446 93686
$$ packed form
16313A27579m6729m0234k8896q69M5954m072l3521l853O5861Q26Q648P296N011
16300A03001L150Q767j3680q040k931j7684m060K2215J6732k2874O191k6573K7882
16287I2096L9693j6855l8226K4626J1236j5084m1991j5826L1467L5815J0633K5065
16275A42649j4990j8660K1684j6427j4709J5064m4118n6412j0474K2611M3408
16264F9626j5156l3138l924o154L0727M7656L0995m5310m2856J4300L1742k668
16252G5840J7384J8247K034l1436j3732j2867L578O571j6262K3053O0841J4646
16240A47897J7817j4565k0787j7232k3426j5525k3767L3238K2924M0527j6868
16229A30233l0760n0396O295Q588K8223J8929m2558l933J3726M253N489o43O240
$$ plain form
16216 93686 95434 121533 113366 106877 104136 79238 44408 16959 71242 88153 38212 50462
16204 50462 67860 61727 43092 51645 56544 29297 64241 116726 84574 39088 6621 -604
16192 -604 61967 128560 138341 105215 64987 59205 25028 3538 63481 68471 84299 102269 110666
16179 110666 70825 79016 56080 26147 34720 38470 31636 100008 119184 66996 55282 67621
16167 67621 26585 26147 44634 60247 43805 76899 90072 80943 79371 58974 39944 46652 47653
16154 47653 33902 47489 60952 51561 48968 46948 78732 77751 81192 81081 92981 109131 122160
16141 122160 129105 131311 117479 120909 138320 164386 187545 159592 130076 108536 79565 48682
16129 48682 29055 31707 13248 22189 63399 74689 84922 58911 76495 91606 92530 80731
$$ packed form
16216I3686J748K6099q167o489k741k4898l4830k7449N4283J6911m9941J2250
16204E0462J7398o133j8635Q553M899k7247L4944N2485l2152m5486l2467p225
16192f04O2571O6593R781l3126m0228n782l4177k1490N9943M990J5828J7970Q397
16179A10666l9841Q191k2936k9933Q573L750o834O8372J9176n2188j1714J2339
16167F7621m1036m38J8487J5613j6442L3094J3173r129j572k0397j9030O708J001
16154D7653j3751J3587J3463r391k593k020L1784r81L441j11J1900J6150J3029
16141A22160O945K206j3832L430J7411K6066K3159k7953k9516k1540k8971l0883
16129D8682j9627K652j8459Q941M1210J1290J0233k6011J7584J5111R24j1799
$$ plain form
16117 80731 80166 101687 122380 91894 104459 65405 45007 47429 57540 60907 48883 69799
16105 69799 73904 101213 86617 58390 89922 140350 132097 119466 133843 132915 128420 121552 122438
16092 122438 120643 102397 88930 104195 123988 92051 121072 126836 144618 138511 130404 154204
16080 154204 145643 126317 115610 88148 60451 41206 21325 -14487 -19430 54623 135158 145384
16068 145384 163860 149688 145890 136237 102027 75599 80561 84142 65193 63266 68235 96515 94910
16055 94910 109726 115985 86279 41997 23274 9778 9095 43844 46852 72508 83909 91496 87546
16042 87546 109528 109984 86814 100390 77043 52803 13183 5132 23803 65650 99696 79376
16030 79376 36524 17684 68197 71167 104357 102632 69234 109677 148967 163480 145234 105164
$$ packed form
16117H0731n65K1521K0693l0486J2565l9054k0398K422J0111L367j2024K0916
16105F9799M105K7309j4596k8227L1532N0428q253j2631J4377r28m495o868Q86
16092A22438j795j8246j3467J5265J9793l1937K9021N764J7782o107q107K3800
16080A54204q561j9326j0707k7462k7697j9245j9881l5812m943P4053Q0535J0226
16068A45384J8476j4172l798r653l4210k6428M962L581j8949j927M969K8280j605
16055I4910J4816O259k9706m4282j8723j3496o83L4749L008K5656J1401P587l950
16042H7546K1982M56k3170J3576k3347k4240l9620q051J8671M1847L4046k0320
16030G9376m2852j8840N0513K970L3190j725l3398M0443L9290J4513j8246m0070
$$ plain form
16018 105164 74222 97174 120888 108913 95746 81341 35649 53225 72413 117851 89866
16007 89866 70673 29466 -10718 40723 57482 80778 86028 77493 101293 103376 102904 91877 64025
15994 64025 52415 47031 43123 25046 33651 61702 93475 118432 136825 128639 95686 97765 113545
15981 113545 90663 57430 77435 87596 48448 52191 47059 66674 68894 84763 110864 101861
15969 101861 114117 131351 129968 118687 114091 115742 132259 162456 150419 112100 112592 182874
15957 182874 158028 99030 54552 25113 18521 41299 64302 62299 64938 79263 74785 110640
15945 110640 126110 149342 179455 139381 88532 69774 97068 163472 168211 166249 186741 114859
15933 114859 112636 122895 170210 184283 129671 116978 125025 112110 107288 110720 123089 87517
$$ packed form
16018A05164l0942K2952K3714j1975j3167j4405m5692J7576J9188M5438k7985
16007H9866j9193m1207m0184N1441J6759K3296N250q535K3800K083m72j1027k7852
15994F4025j1610n384l908j8077Q605K8051L1773K4957J8393q186l2953K079J5780
15981A13545k2882l3233K0005J0161l9148L743n132J9615K220J5869K6101r003
15969A01861J2256J7234j383j1281m596J651J6517L0197j2037l8319M92P0282
15957A82874k4846n8998m4478k9439o592K2778K3003k003K639J4325m478L5855
15945A10640J5470K3232L0113m0074n0849j8758K7294O6404M739j962K0492p1882
15933A14859k223J0259M7315J4073n4612j2693Q047j2915m822L432J2369l5572
$$ plain form
15921 87517 73006 80388 115484 132310 111289 65579 52562 68185 107438 114421 84816 57462
15909 57462 60642 99015 124691 91500 86916 65904 103521 121805 118562 77968 88998 112361
15897 112361 95326 90631 117088 118837 115291 86038 63940 106974 106832 90535 97518 113343 98246
15884 98246 60455 75165 92655 88059 82053 101897 115054 95592 86638 111303 136281 128227
15872 128227 90561 72269 69568 70381 91377 94186 142875 153151 159298 120471 97835 96143 53300
15859 53300 45820 57515 70588 120003 133189 109602 129452 143628 70926 25408 76839 108816
15847 108816 120926 140789 147236 103859 89859 158504 199206 163306 135331 102926 79231 59011
15835 59011 69683 68313 99759 117132 110232 102390 139932 121949 91258 109105 131931 134446
$$ packed form
15921H7517j4511P382L5096J6826k1021m5710j3017J5623L9253O983k9605k7354
15909E7462L180L8373K5676l3191m584k1012L7617J8284l243m0594J1030K3363
15897A12361j7035m695K6457J749l546k9253k2098M3034j42j6297O983J5825j5097
15884I8246l7791J4710J7490m596o006J9844J3157j9462q954K4665K4978q054
15872A28227l7666j8292k701Q13K0996K809M8689J0276O147l8827k2636j692m2843
15859E3300p480J1695J3073M9415J3186k3587J9850J4176p2702m5518N1431L1977
15847A08816J2110J9863O447m3377j4000O8645M0702l5900k7975l2405k3695k0220
15835E9011J0672j370L1446J7373o900p842L7542j7983l0691J7847K2826K515
$$ plain form
15823 134446 112207 100523 124602 107913 95598 87634 115866 131775 124152 137676 135802 114713
15811 114713 128650 136393 166502 200558 173844 155588 136237 129485 112496 122243 123421 143984
15799 143984 180127 193360 174647 167241 117150 82634 125280 134163 103309 108712 113212 137623
15787 137623 103625 66276 69174 93128 114613 123618 99759 135354 160317 168230 173626 154985
15775 154985 126553 160966 112540 77042 81093 115572 110881 120959 115267 135609 112845 124965
15763 124965 129952 86837 77071 121398 120852 82769 77266 84950 116541 142953 141843 96180 69756
15750 69756 64242 99377 132731 120154 124146 114040 107136 105454 144407 171408 133842 89202
15738 89202 61040 81666 94036 75656 61670 87247 79082 103844 177247 175400 120640 127821
$$ packed form
15823A34446k2239j1684K4079j6689j2315p964K8232J5909p623J3524j874k1089
15811A14713J3937P743L0109L4056k6714j8256j9351o752j6989R747J178K0563
15799A43984L6143J3233j8713p406n0091l4516M2646Q883l0854N403M500K4411
15787A37623l3998l7349K898K3954K1485R005k3859L5595K4963P913N396j8641
15775A54985k8432L4413m8426l5498M051L4479m691J0078n692K0342k2764J2120
15763A24965M987m3115r766M4327n46l8083n503P684L1591K6412j110m5663k6424
15750F9756n514L5135L3354j2577L992j0106o904j682L8953K7001l7566m4640
15738H9202k8162K0626J2370j8380j3986K5577q165K4762P3403j847n4760P181
$$ plain form
15726 127821 149979 118085 77326 105946 159695 153013 148623 130369 105583 91032 110011 80962
15714 80962 78733 116551 129908 121974 132858 145533 164667 167190 135996 133413 108630 71508
15702 71508 95594 122532 132250 135745 143858 156652 171785 170297 131009 64783 41597 67574
15690 67574 106954 79540 71789 66060 96947 114618 137697 123144 126052 126321 118988 206238 200256
15677 200256 189544 175805 162785 98599 51111 90923 141230 119272 115320 99834 112386 107918
15665 107918 102235 127208 155510 173306 181825 211781 235187 250189 183012 158033 198483 180795
15653 180795 157860 117663 102587 103504 99144 96865 137714 147236 134342 156454 124074 109236
15641 109236 136562 116375 154917 170037 130444 95930 103989 91246 70149 122365 148230 128163
$$ packed form
15726A27821K2158l1894m0759K8620N3749o682m390j8254k4786j4551J8979k9049
15714H0962k229L7818J3357p934J0884J2675J9134K523l1194k583k4783l7122
15702G1508K4086K6938R718L495Q113J2794J5133j488l9288o6226k3186K5977
15690F7574L9380k7414p751n729L0887J7671K3079j4553K908K69p333Q7250n982
15677B00256j0712j3739j3020o4186m7488L9812N0307k1958l952j5486J2552m468
15665A07918n683K4973K8302J7796Q519K9956K3406J5002o7177k4979M0450j7688
15653A80795k2935m0197j5076R17m360k279M0849R522j2894K2112l2380j4838
15641A09236K7326k0187L8542J5120l9593l4514Q059j2743k1097N2216K5865k0067
$$ plain form
15629 128163 110602 103245 97437 99232 96005 95379 113770 115668 116872 112154 131372 168359 163965
15616 163965 149334 118604 80540 96598 115686 85910 88948 120586 156664 184912 192658 177871
15604 177871 152144 141461 172476 178115 160268 155130 124396 111984 147036 161745 164028 145179
15592 145179 109941 107698 118209 146081 167165 160199 158487 168708 114791 104869 120265 62385
15580 62385 26554 50183 56129 129219 211536 222658 144543 116607 111605 128237 140052 139052
15568 139052 107589 95845 121772 133505 112452 117329 145671 145178 131851 126557 149327 131509
15556 131509 148029 138415 119059 112400 94095 94734 135088 132666 66113 65033 136051 159349 138578
15543 138578 138945 123467 97158 98968 94718 87222 115552 111260 134491 141859 147784 120539 110830
$$ packed form
15629A28163j7561p357n808J795l227o26J8391J898J204m718J9218L6987m394
15616A63965j4631l0730l8064J6058J9088k9776L038L1638L6078K8248P746j4787
15604A77871k5727j0683L1015N639j7847n138l0734j2412L5052J4709K283j8849
15592A45179l5238k243J0511K7872K1084o966j712J0221n3917r922J5396n7880
15580F2385l5831K3629N946P3090Q2317J1122p8115k7936n002J6632J1815j000
15568A39052l1463j1744K5927J1733k1053M877K8342m93j3327n294K2770j7818
15556A31509J6520r614j9356o659j8305O39M0354k422o6553j080P1018K3298k0771
15543A38578L67j5478k6309J810m250p496K8330m292K3231P368N925k7245r709
$$ plain form
15530 110830 112939 100413 112089 121060 101858 94875 137013 170721 179433 181185 160776 149149
15518 149149 128020 90318 114006 134956 160044 144737 124945 90477 85350 126189 133127 152986
15506 152986 132734 131392 159272 185866 156382 88305 93604 157754 141748 123810 121248 106738
15494 106738 121633 146174 178899 162398 158853 178322 194318 229186 208950 164664 123361 112868
15482 112868 123167 100675 124514 140507 136805 135880 154499 121285 130021 173856 183385 177669 163790
15469 163790 162449 171534 122057 114748 121938 108952 112416 118266 67188 72934 71545 97915 128253
15456 128253 163719 139280 128192 138042 141702 150093 192874 197705 150086 132045 123311 96739
15444 96739 83806 123134 146584 111636 73176 49626 54112 43422 67563 80660 74986 112182
$$ packed form
15530A10830K109j2526J1676Q971j9202o983M2138L3708Q712J752k0409j1627
15518A49149k1129l7702K3688K0950K5088j5307j9792l4468n127M0839O938J9859
15506A52986k0252j342K7880K6594k9484o8077N299O4150j6006j7938k562j4510
15494A06738J4895K4541L2725j6501l545J9469J5996L4868k0236m4286m1303j0493
15482A12868J0299k2492K3839J5993l702r25J8619l3214Q736M3835R529n716j3879
15469A63790j341R085m9477p309P190j2986L464N850n1078N746j389K6370L0338
15456A28253L5466k4439j1088R850L660Q391M2781M831m7619j8041q734k6572
15444I6739j2933L9328K3450l4948l8460k3550M486j0690K4141J3097n674L7196
$$ plain form
15432 112182 162608 171488 146758 111117 146223 189123 139087 165606 154733 147389 110718 108708
15420 108708 117864 172300 175137 113434 129759 178858 221058 184989 127919 122112 138138 168175
15408 168175 187154 176064 186516 181493 203789 187525 200859 215458 218605 175941 162259 173485
15396 173485 165067 148609 151393 173524 165317 152317 139996 156144 139867 147731 152885 156354 171149
15383 171149 204518 181801 146305 110448 146686 162290 181663 180139 171188 164939 145790 108906
15371 108906 130197 151997 213956 225422 197983 158169 138207 81481 48960 110282 121396
15360 121396 145843 158288 150421 118884 125288 162163 180168 189931 167731 161906 183753 183955 205965
15347 205965 220242 232766 229881 211960 217616 225239 220998 225016 240158 245205 244643 230195 203765
$$ packed form
15432A12182N0426Q880k4730l5641L5106M2900n0036K6519j0873p344l6671k010
15420A08708R156N4436K837o1703J6325M9099M2200l6069n7070n807J6026L0037
15408A68175J8979j1090J0452n023K2296j6264J3334J4599L147m2664j3682J1226
15396A73485q418j6458K784K2131q207j3000j2321J6148j6277P864N154L469J4795
15383A71149L3369k2717l5496l5857L6238J5604J9373j524q951o249j9149l6884
15371A08906K1291K1800O1959J1466k7439l9814j9962n6726l2521O1322J1114
15360A21396K4447J2445p867l1537O404L6875J8005R763k2200n825K1847K02K2010
15347B05965J4277J2524k885j7921N656P623m241M018J5142N047n62j4448k6430
$$ plain form
15334 203765 169616 134670 123101 151790 175357 163959 176008 172520 179944 201944 181407 166967
15322 166967 155008 162750 171314 170741 147968 186775 177746 179880 174925 180256 156570 161595 138055
15309 138055 135425 168435 198915 203223 206014 174460 163587 151042 149184 178345 212795 224511
15297 224511 206809 193230 193647 193943 192962 202109 194609 193710 180854 174509 142959 122167 117756 122045
15283 122045 172709 218592 192493 154981 136945 129177 150756 160531 127822 134158 135865 157631
15271 157631 200843 214244 244415 250192 205398 183686 206558 249890 283885 300320 302831 255308
15259 255308 229941 204291 211631 202061 175716 187124 244448 263382 257532 271381 257478 243550
15247 243550 221330 227190 223404 194075 178467 202228 183016 211895 229449 231935 200592 151401
$$ packed form
15334B03765l4149l4946j1569K8689K3567j1398J2049l488P424K2000k0537j4440
15322A66967j1959P742Q564n73k2773L8807r029K134m955N331k3686N025k3540
15309A38055k630L3010L0480M308K791l1554j0873j2545j858K9161L4450J1716
15297B24511j7702j3579M17K96r81R147p500q99j2856o345l1550k0792m411M289
15283A22045N0664M5883k6099l7512j8036p768K1579R775l2709O336J707K1766
15271A57631M3212J3401L0171N777m4794k1712K2872M3332L3995J6435K511m7523
15259B55308k5367k5650P340r570k6345J1408N7324J8934n850J3849j3903j3928
15247B43550k2220N860l786k9329j5608K3761j9212K8879J7554K486l1343m9191
$$ plain form
15235 151401 163820 179365 192497 207016 237259 260011 280776 250973 214348 184562 168850
15224 168850 162390 160093 198230 258529 268639 210523 187688 139155 170186 254940 290390 258796
15212 258796 212582 175748 192499 184940 214610 196910 188601 184860 165208 189952 216966 200864
15200 200864 223318 217470 233049 220034 192230 163818 151391 159957 139971 128281 103164 131536
15188 131536 222270 311796 270518 208040 178589 220757 200160 191217 218693 193808 184775 202917
15176 202917 236253 250233 220276 187249 188391 221972 221534 208699 208777 240681 218201 192961 220873
15163 220873 235931 208259 171281 176847 196313 204219 197788 199592 222048 200095 214479 194450
15151 194450 188675 224178 238510 215853 199155 201554 200759 193388 180934 206841 236631 235648 221470
$$ packed form
15235A51401J2419J5545J3132J4519L0243K2752K0765k9803l6625k9786j5712
15224A68850o460k297L8137O0299J0110n8116k2835m8533L1031Q4754L5450l1594
15212B58796m6214l6834J6751p559K9670j7700q309l741j9652K4744K7014j6102
15200B00864K2454n848J5579j3015k7804k8412j2427Q566j9986j1690k5117K8372
15188A31536R0734Q9526m1278o2478k9451M2168k0597q943K7476k4885r033J8142
15176B02917L3336J3980k9957l3027J142L3581m38j2835P8L1904k2480k5240K7912
15163B20873J5058k7672l6978N566J9466P906o431J804K2456k1953J4384k0029
15151A94450n775L5503J4332k2657j6698K399p95p371j2454K5907K9790r83j4178
$$ plain form
15138 221470 201941 228974 233727 191380 166758 168007 206846 234071 184427 195115 184770 165040
15126 165040 184135 209576 250743 220442 166506 176396 211904 242599 223420 206343 207878 235125
15114 235125 219502 209742 178154 185056 169034 153461 126536 121498 129714 183408 209335 191785
15102 191785 182745 220602 251901 279504 281358 254834 222925 218990 216792 260082 264344 236741
15090 236741 208248 196012 196402 201584 192215 246025 268808 229299 188019 148560 143772 143676 146033
15077 146033 157942 182329 167299 160964 170086 167129 183929 180498 212443 229003 210550 198289
15065 198289 239101 238046 242798 255718 226573 189209 183210 196426 229385 206730 173507 152948
15053 152948 158930 200165 276904 313737 267661 243731 256346 241013 207163 177478 161675 175155
$$ packed form
15138B21470j9529K7033M753m2347k4622J249L8839K7225m9644J0688j0345j9730
15126A65040J9095K5441M1167l0301n3936R890L5508L0695j9179j7077J535K7247
15114B35125j5623r760l1588O902j6022j5573k6925n038Q216N3694K5927j7550
15102A91785r040L7857L1299K7603J854k6524l1909l935k198M3290M262k7603
15090B36741k8493j2236L90N182r369N3810K2783l9509m1280l9459m788r6K357
15077A46033J1909K4387j5030o335R122k957J6800l431L1945J6560j8453j2261
15065A98289M0812j055M752J2920k9145l7364n999J3216L2959k2655l3223k0559
15053A52948N982M1235P6739L6833m6076k3930J2615j5333l3850k9685j5803J3480
$$ plain form
15041 175155 202573 194663 166034 175206 208172 207259 210778 193868 189549 228175 225497 201598 204856
15028 204856 218781 262202 231671 183331 148936 158539 214475 252143 273281 233650 202192 158425
15016 158425 169017 181431 192251 231428 236125 232265 252951 239731 261510 255819 254086 209845
15004 209845 218796 263337 235989 174208 174251 172244 173940 208949 206799 225986 182907 121918 147799
14991 147799 186514 198551 199813 244917 244972 235027 232856 242589 265045 272670 247138 219091 223995
14978 223995 232509 180923 181429 210754 196832 181281 186837 214258 208487 155516 122334 131407 165397
14965 165397 186291 226329 222678 193576 190914 210040 257966 273701 272275 292933 240870 218987
14953 218987 228428 221745 216622 213397 209686 215993 208464 205270 210975 205761 221736 229268 258097 266091
$$ packed form
15041A75155K7418p910k8629R172L2966r13L519j6910m319L8626k678k3899L258
15028B04856J3925M3421l0531m8340l4395R603N5936L7668K1138l9631l1458m3767
15016A58425J0592J2414J0820L9177M697l860K0686j3220K1779n691j733m4241
15004B09845Q951M4541k7348o1781M3k007J696L5009k150J9187m3079o0989K5881
14991A47799L8715J2037J262M5104N5r945k171R733K2456P625k5532k8047M904
14978B23995Q514n1586N06K9325j3922j5551N556K7421n771n2971l3182R073L3990
14965A65397K0894M0038l651k9102k662J9126M7926J5735j426K0658n2063k1883
14953B18987R441o683n123l225l711O307p529l194N705n214J5975P532K8829P994
$$ plain form
14939 266091 295565 335718 311217 278797 285322 265436 224584 222942 253611 229968 213597 215137
14927 215137 192311 191185 229268 257996 213883 166567 152805 173856 167891 179667 197027 222661
14915 222661 231820 232314 236479 215368 203968 158417 126686 154073 206079 231168 242156 248864
14903 248864 289467 324305 317242 314462 277147 266774 272655 230717 211787 201435 182935 198375
14891 198375 231943 254743 275492 250627 220991 221120 215475 219034 264147 308889 313039 304485 284504
14878 284504 275197 248717 270930 294465 283306 276418 271873 242035 247187 260177 223019 208196
14866 208196 194627 224722 211943 211622 248653 277508 309692 322600 307353 341156 362655 328338
14854 328338 305257 251981 179857 186804 253347 345149 336732 299204 319602 302978 251916 255453
$$ packed form
14939B66091K9474M0153k4501l2420O525j9886m0852j642L0669k3643j6371J540
14927B15137k2826j126L8083K8728m4113m7316j3762K1051n965J1776J7360K5634
14915B22661R159M94M165k1111j1400m5551l1731K7387N2006K5089J0988O708
14903B48864M0603L4838p063k780l7315j0373N881m1938j8930j0352j8500J5440
14891A98375L3568K2800K0749k4865k9636J29n645L559M5113M4742M150q554j9981
14878B84504r307k6480K2213K3535j1159o888m545k9838N152J2990l7158j4823
14866B08196j3569L0095j2779l21L7031K8855L2184J2908j5247L3803K1499l4317
14854C28338k3081n3276p2124O947O6543R1802q417l7528K0398j6624n1062L537
$$ plain form
14842 255453 216432 195579 167122 187642 220858 239519 200416 233524 253913 247479 258308 263939
14830 263939 312454 308110 297123 252765 228077 224537 273036 323714 333850 273523 237808 248961
14818 248961 229488 220102 261883 310965 295996 231007 209991 208696 254293 274190 294688 263571
14806 263571 236811 231473 232423 256444 262730 311200 339942 333112 325473 297208 288674 275849 266932
14793 266932 275726 275398 273203 301854 319126 284268 279234 296840 319757 330121 324072 321076 281272
14780 281272 284809 300318 316589 273467 277717 284200 337564 305447 250754 280097 285490 311886
14768 311886 384904 347436 275407 280033 281633 286366 305590 322381 316375 315716 306528 275666 298976
14755 298976 246995 214243 217919 253496 259468 256254 250931 269965 250837 235076 271058 286498
$$ packed form
14842B55453l9021k0853k8457K0520L3216J8661l9103L3108K0389o434J0829N631
14830B63939M8515m344j0987m4358k4688l540M8499N0678J0136o0327l5715J1153
14818B48961j9473r386M1781M9082j4969o4989k1016j295M5597J9897K0498l1117
14806B63571k6760n338R50K4021O286M8470K8742o830p639k8265q534j2825q917
14793B66932Q794l28k195K8651J7272l4858n034J7606K2917J0364o049k996l9804
14780B81272L537J5509J6271m3122M250O483N3364l2117n4693K9343N393K6396
14768C11886P3018l7468p2029M626J600M733J9224J6791o006o59r188l0862K3310
14755B98976n1981l2752L676L5577N972l214n323J9034j9128j5761L5982J5440
$$ plain form
14743 286498 253266 229607 237810 258342 283501 308055 307373 309372 290873 282757 296362 296918 263906
14730 263906 263997 225849 200031 215466 265170 313105 296900 286704 306901 339975 326691 319531
14718 319531 321719 319915 301043 291997 261857 251710 238554 233804 231757 251573 264438 278769
14706 278769 269995 243435 219441 223793 251912 266367 247409 250147 281756 284408 276871 246599
14694 246599 317198 377564 339126 295935 294641 270344 262388 251159 243521 288816 302190 281370
14682 281370 274585 241789 248450 264730 246313 242164 230038 207423 212513 231516 246118 267460
14670 267460 280362 316005 329262 291631 265374 290031 298658 308187 299896 306409 304116 301358 291955
14657 291955 300766 316472 336213 341909 358587 332501 317573 329468 320491 339584 316634 291557
$$ packed form
14743B86498l3232k3659Q203K0532K5159K4554o82J999j8499q116J3605N56l3012
14730B63906R1l8148k5818J5435M9704M7935j6205j0196K0197L3074j3284p160
14718C19531K188j804j8872r046l0140j0147j3156m750k047J9816J2865J4331
14706B78769q774k6560k3994M352K8119J4455j8958K738L1609K652p537l0272
14694B46599P0599O0366l8438m3191j294k4297p956j1229p638M5295J3374k0820
14682B81370o785l2796O661J6280j8417m149j2126k2615N090J9003J4602K1342
14670B67460J2902L5643J3257l7631k6257K4657Q627R529q291O513k293k758r403
14657B91955Q811J5706J9741N696J6678k6086j4928J1895q977J9093k2950k5077
$$ plain form
14645 291557 310805 279426 273097 256838 292795 307805 292377 236185 232360 308385 345507 314364
14633 314364 309126 318265 303852 279398 260218 289285 294026 247566 242576 265937 238455 290422
14621 290422 309069 279758 294823 285191 297317 328031 378722 371629 350095 324926 324403 353331
14609 353331 374647 349303 318260 319688 257417 262480 251796 233091 275014 284903 251432 248034
14597 248034 308515 331246 298329 304368 336774 361867 345226 305282 300539 286468 278147 278983
14585 278983 330678 347472 330286 345670 317868 297670 291221 310969 339779 369900 358699 338858
14573 338858 316572 329179 324373 304246 332278 350212 380691 392932 348120 332165 326838 318524
14561 318524 341110 338084 339198 359838 360095 374296 366347 334866 294679 265798 303984 297561 253547
$$ packed form
14645B91557J9248l1379o329j6259L5957J5010j5428n6192l825P6025L7122l1143
14633C14364n238R139j4413k4454j9180K9067M741m6460m990K3361k7482N1967
14621B90422J8647k9311J5065r632J2126L0714N0691p093k1534k5169n23K8928
14609C53331K1316k5344l1043J428o2271N063j0684j8705M1923R889l3471l398
14597B48034O0481K2731l2917O039L2406K5093j6641l9944m743j4071q321Q36
14585B78983N1695J6794j7186J5384k7802k0198o449J9748K8810L0121j1201j9841
14573C38858k2286J2607m806k0127K8032J7934L0479J2241m4812j5955n327q314
14561C18524K2586l026J114K0640K57J4201p949l1481m0187k8881L8186o423m4014
$$ plain form
14548 253547 229592 226103 227286 253257 251291 270413 253919 247952 287268 315834 295930 281563
14536 281563 308121 334227 357279 336659 302189 295955 315573 344393 328789 321615 328261 358586
14524 358586 355512 348622 368493 367635 368071 329931 320360 337953 292768 282612 307925 302328 272616
14511 272616 296941 315332 302029 292824 315783 335320 323846 282731 279300 279033 268567 268255 294184
14498 294184 305404 295155 293271 292376 287366 296643 328602 372525 377402 323733 296530 319562 294863
14485 294863 293616 282776 293025 286291 304459 319988 288402 262570 269427 322809 347161 357557
14473 357557 354685 317221 306745 321680 349822 367045 353748 319445 369566 398536 388327 369582
14461 369582 362186 336047 304423 326676 310698 314656 306266 293457 278262 291866 318091 348162
$$ packed form
14548B53547k3955l489J183K5971j966J9122j6494n967L9316K8566j9904j4367
14536B81563K6558K6106K3052k0620l4470o234J9618K8820j5604p174O646L0325
14524C58586l074o890J9871q58M36l8140r571J7593m5185j0156K5313n597k9712
14511B72616K4325J8391j3303r205K2959J9537j1474m1115l431k67j0466l12K5929
14498B94184J1220j0249j884q95n010R277L1959M3923M877n3669k7203K3032k4699
14485B94863j247j0840J0249o734J8168J5529l1586k5832O857N3382K4352J0396
14473C57557k872l7464j0476J4935K8142J7223j3297l4303N0121K8970j0209j8745
14461C69582p396k6139l1624K2253j5978L958q390j2809j5195J3604K6225L0071
$$ plain form
14449 348162 367631 326243 329387 350208 321796 297848 309778 358080 421240 418596 428009 415773
14437 415773 419928 439733 464357 419895 414897 389548 353387 365936 371935 362489 342602 331498
14425 331498 320392 306657 315807 332188 321916 345571 377230 371604 342170 322981 332885 311395
14413 311395 309897 298947 319430 347500 345013 339922 338855 363267 372007 380247 329042 347371 387133
14400 387133 386472 391989 336365 310502 322750 286817 267354 301705 319424 362508 349436 370377
14388 370377 381663 404669 401509 393740 381657 396967 370165 362703 358104 362347 370705 405189 433849
14375 433849 412549 398273 380585 360500 351235 368384 383338 409582 378837 362871 353025 350146
14363 350146 366090 419480 428199 420463 436176 438089 413578 389682 408948 451568 489678 492913
$$ packed form
14449C48162J9469m1388L144K0821k8412k3948J1930M8302O3160k644R413j2236
14437D15773M155J9805K4624m4462m998k5349l6161J2549N999r446j9887j1104
14425C31498j1106j3735R150J6381j0272K3655L1659n626k9434j9189R904k1490
14413C11395j498j0950K0483K8070k487n091j067K4412Q740Q240n1205J8329L9762
14400C87133o61N517n5624k5863J2248l5933j9463L4351J7719M3084j3072K0941
14388C70377J1286K3006l160p769j2083J5310k6802p462m599M243Q358L4484K8660
14375D33849k1300j4276j7688k0085r265J7149J4954K6244l0745j5966r846k879
14363C50146J5944N3390Q719p736J5713J913k4511k3896J9266M2620L8110L235
$$ plain form
14351 492913 430687 376240 391631 399701 356964 380454 400475 408407 391296 392754 410675 433540
14339 433540 405311 383502 389423 377311 330976 347182 401821 419045 426848 451399 432816 461835
14327 461835 470826 451742 431295 418321 404594 425865 415137 415148 403668 387053 370826 357587
14315 357587 368180 402811 404237 418950 385703 361775 349379 328788 350841 359489 344949 391785
14303 391785 415353 445918 450309 414867 421287 428937 425001 420131 427244 447343 465922 466398 445654
14290 445654 440244 413468 392406 412000 410941 444590 456563 433838 397914 376676 385072 424376
14278 424376 434007 403219 351544 339014 339181 345301 380789 410921 406073 405156 390604 362583 373095
14265 373095 439729 503116 463622 406141 364433 376991 379310 388285 424802 430450 440744 425349
$$ packed form
14351D92913o2226n4447J5391Q070m2737K3490K0021P932j7111J458J7921K2865
14339D33540k8229k1809N921j2112m6335J6206N4639J7224P803K4551j8583K9019
14327D61835Q991j9084k0447j2974j3727K1271j0728J1j1480j6615j6227j3239
14315C57587J0593L4631J426J4713l3247k3928j2396k0591K2053Q648j4540M6836
14303C91785K3568L0565M391l5442O420P650l936m870P113K0099J8579M76k0744
14290D45654n410k6776k1062J9594j059L3649J1973k2725l5924k1238Q396L9304
14278D24376R631l0788n1675j2530J67O120L5488L0132m848r17j4552k8021J0512
14265C73095O6634O3387l9494n7481m1708J2558K319Q975L6517N648J0294j5395
$$ plain form
14253 425349 414851 404265 416426 450905 477446 499247 500823 453409 404777 389275 382805 396887
14241 396887 434766 448400 434737 464530 452886 460036 489008 525200 544156 480073 483006 495232
14229 495232 464291 489177 488913 482561 494096 454793 387109 367924 386867 440816 477348 469839
14217 469839 479902 487795 486436 480854 474870 454793 426133 418794 415417 421130 441668 459835 424722
14204 424722 396747 422148 424708 433739 448991 449783 448198 435690 415385 411339 403672 431426 503108
14191 503108 504752 503563 487718 430444 422800 469800 469640 483284 471805 436414 481963 530794
14179 530794 525908 499196 476798 479572 512359 537837 545726 510210 491500 444448 394013 409695
14167 409695 438522 446274 437735 397654 408516 391477 354735 384675 464917 467832 444239 404390
$$ packed form
14253D25349j0498j0586J2161L4479K6541K1801J576m7414m8632j5502o470J4082
14241C96887L7879J3634j3663K9793j1644P150K8972L6192J8956o4083K933J2226
14229D95232l0941K4886k64o352J1535l9303o7684j9185J8943N3949L6532p509
14217D69839J0063P893j359n582n984k0077k8660p339l377N713K0538J8167l5113
14204D24722k7975K5401K560R031J5252P92j585j2508k0305m046p667K7754P1682
14191E03108J644j189j5845n7274p644M7000j60J3644j1479l5391M5549M8831
14179E30794m886k6712k2398K774L2787K5478P889l5516j8710m7052n0435J5682
14167D09695K8827P752q539m0081J0862j7039l6742K9940Q0242K915k3593l9849
$$ plain form
14155 404390 399315 408825 430990 433264 464376 473570 429095 439345 413225 396502 396243 389556 451981
14142 451981 467740 479553 464155 469675 475235 470128 411204 397816 412651 430479 416402 407041
14130 407041 410052 402597 429733 468802 453435 454642 462545 470149 443577 398355 421050 480587
14118 480587 502191 475602 478763 480304 464855 492115 488802 436976 446028 483723 512507 489793
14106 489793 469993 447656 455406 507633 505370 503165 494555 501814 501401 490097 463378 470441 455123
14093 455123 473512 504255 490110 490942 515043 495300 479098 472590 463708 439177 387975 413552
14081 413552 453569 500659 489430 461710 469902 476356 438242 489688 515126 533725 519345 514431
14069 514431 553452 588197 607047 590313 537358 479917 461170 472593 476582 464347 437362 435271
$$ packed form
14155D04390n075R510K2165K274L1112R194m4475J0250k6120j6723k59o687O2425
14142D51981J5759J1813j5398N520N560n107n8924j3388J4835J7828j4077r361
14130D07041L011p455K7136L9069j5367J207P903P604k6572m5222K2695N9537
14118D80587K1604k6589L161J541j5449K7260l313n1826R052L7695K8784k2714
14106D89793j9800k2337P750N2227k263k205q610P259m13j1304k6719P063j5318
14093D55123J8389L0743j4145Q32K4101j9743j6202o508q882k4531n1202K5577
14081D13552M0017M7090j1229k7720Q192O454l8114N1446K5438J8599j4380m914
14069E14431L9021L4745J8850j6734n2955n7441j8747J1423L989j2235k6985k091
$$ plain form
14057 435271 463920 494453 511947 501349 508038 494761 471908 484280 485056 457391 454180 492519
14045 492519 528484 527053 513746 499635 476121 481237 470841 473485 458579 471381 504473 522497
14033 522497 550443 549388 529993 524116 505655 498293 502037 539087 594883 572345 530229 497244
14021 497244 521723 525232 509207 543077 536921 527557 535267 548975 553341 569612 557537 539870
14009 539870 523988 493873 522183 521839 483964 493216 510307 477904 489798 505654 533068 555949
13997 555949 517787 489042 488977 526807 545041 555163 533231 548975 537016 491510 474269 491051
13985 491051 507085 515094 531791 542791 550408 520409 531363 523361 477342 457882 450093 436254
13973 436254 447193 485033 505643 527814 542988 537050 490586 487386 493635 540443 593797 599357
$$ packed form
14057D35271K8649L0533J7494j0598O689j3277k2853J2372P76k7665l211L8339
14045D92519L5965j431j3307j4111k3514N116j0396K644j4906J2802L3092J8024
14033E22497K7946j055j9395n877j8461p362L744L7050N5796k2538m2116l2985
14021D97244K4479L509j6025L3870o156r364P710J3708M366J6271j2075j7667
14009E39870j5882l0115K8310l44l7875R252J7091l2403J1894J5856K7414K2881
13997E55949l8162k8745o5L7830J8234J0122k1932J5744j1959m5506j7241J6782
13985D91051J6034Q009J6697J1000P617k9999J0954q002m6019j9460p789j3839
13973D36254J0939L7840K0610K2171J5174n938m6464l200O249M6808N3354N560
$$ plain form
13961 599357 584086 599137 594115 629082 612804 555207 510018 539278 528559 541163 584953 563429
13949 563429 534158 486376 485623 511652 484571 490552 456422 446168 451866 461092 474412 516035
13937 516035 528401 548499 572188 571520 560467 598718 617694 605148 587476 580745 600851 577867
13925 577867 577706 548813 521421 569958 606122 615558 612342 621048 581673 524436 510808 514121 519697
13912 519697 528502 571806 613404 576542 564201 600295 612233 631024 667532 659360 629758 611768
13900 611768 572326 538011 532250 526774 509672 558153 545653 561370 580516 601062 601985 601776 576272
13887 576272 564532 588746 588574 544111 544720 569899 567124 565036 576049 593133 611809 591210 570055
13874 570055 616354 636901 636010 622664 599968 571100 567180 558591 553037 529382 497810 516582
$$ packed form
13961E99357j5271J5051n022L4967j6278n7597m5189K9260j0719J2604M3790k1524
13949E63429k9271m7782p53K6029k7081N981l4130j0254N698R226J3320M1623
13937E16035J2366K0098K3689o68j1053L8251J8976j2546j7672o731K0106k2984
13925E77867j61k8893k7392M8537L6164R436l216Q706l9375n7237j3628L313N576
13912E19697Q805M3304M1598l6862j2341L6094J1938J8791L6508q172k9602j7990
13900F11768l9442l4315n761n476j7102M8481j2500J5717J9146K0546R23k09k5504
13887E76272j1740K4214j72m4463O09K5179k775k088J1013J7084J8676k0599k1155
13874E70055M6299K0547q91j3346k2696k8868l920q589n554k3655l1572J8772
$$ plain form
13862 516582 522103 542741 611766 630267 644672 637372 630770 618156 585616 529458 489211 503919
13850 503919 530000 534127 525514 524308 551663 579533 593343 603836 612171 602104 594567 605513
13838 605513 597734 606561 587590 563747 575895 600808 601624 612364 649674 679929 666260 681537
13826 681537 701443 671778 632751 597716 611757 636692 622382 641645 631751 594714 636903 632970
13814 632970 649039 642160 615340 606277 635207 636115 595575 559396 576389 628818 672124 647281
13802 647281 624103 625212 659896 689115 724953 725908 691604 691330 720469 707157 696014 672508
13790 672508 631358 615277 644966 643627 651042 650445 645114 633822 608105 607102 630498 639901 652157
13777 652157 651659 651759 665345 677274 611797 600076 597272 601920 655750 708279 718154 675300 641708
$$ packed form
13862E16582N521K0638O9025J8501J4405p300o602j2614l2540n6158m0247J4708
13850E03919K6081M127q613j206K7355K7870J3810J0493Q335j0067p537J0946
13838F05513p779Q827j8971k3843J2148K4913Q16J0740L7310L0255j3669J5277
13826F81537J9906k9665l9027l5035J4041K4935j4310J9263r894l7037M2189l933
13814F32970J6069o879k6820r063K8930R08m0540l6179J6993N2429M3306k4843
13802F47281k3178J109L4684K9219L5838R55l4304k74K9139j3312j1143k3506
13790F72508m1150j6081K9689j339P415n97n331j1292k5717j003K3396R403J2256
13777F52157m98J00J3586J1929o5477j1721k804M648N3830N2529R875m2854l3592
$$ plain form
13764 641708 666898 690668 659480 655184 619243 599962 647012 643962 646417 642312 656245 661548
13752 661548 682977 684376 663335 668052 678740 648410 663821 657751 669563 730296 738683 745038
13740 745038 728153 697584 651793 682372 684950 699057 693571 672112 650580 665479 664250 657556
13728 657556 672989 660605 643207 658134 658431 664324 642896 619960 659670 704624 695496 685427
13716 685427 653107 671630 703681 708706 650938 616883 564104 578304 608037 629807 661652 698644
13704 698644 686255 675585 728982 699258 661355 637324 622113 629927 634175 632964 708535 736748
13692 736748 711027 648810 653788 668812 685067 693459 707958 742366 714083 679778 640637 613974
13680 613974 620711 627320 703522 782936 787868 743378 711161 706475 739593 716976 744906 769553
$$ packed form
13764F41708K5190K3770l1188m296l5941j9281M7050l050K455m105J3933N303
13752F61548K1429J399k1041M717J0688l0330J5411o070J1812O0733Q387O355
13740G45038j6885l0569m5791L0579K578J4107n486k1459k1532J4899j229o694
13728F57556J5433j2384j7398J4927K97N893k1428k2936L9710M4954r128j0069
13716F85427l2320J8523L2051N025n7768l4055n2779J4200K9733K1770L1845L6992
13704F98644j2389j0670N3397k9724l7903k4031j5211P814M248j211P5571K8213
13692G36748k5721o2217M978J5024J6255Q392J4499L4408k8283l4305l9141k6663
13680F13974O737O609P6202P9414M932m4490l2217m686L3118k2617K7930K4647
$$ plain form
13668 769553 763976 715717 694636 714024 759473 771537 747955 728335 744064 739719 729176 746341
13656 746341 753208 758014 760403 733383 726247 731144 744469 791441 771325 740781 738658 783809 772394
13643 772394 768934 770726 751060 712600 739665 713619 695717 666476 687173 714642 701658 738766
13631 738766 782727 754470 680548 711730 735054 769646 784099 742252 711405 700730 727164
13620 727164 734027 737272 793673 828507 807299 777180 774477 750939 745618 712681 696854 713385
13608 713385 781148 796786 809917 803675 786026 774531 756815 778886 809781 818267 758945 761500
13596 761500 796581 825556 809105 789139 805297 799611 742104 754945 771880 789946 776725 774676
13584 774676 783719 754161 731571 716503 750414 737168 738890 759388 725704 749096 766141 780891
$$ packed form
13668G69553n577m8259k1081J9388M5449J2064k3582j9620J5729m345j0543J7165
13656G46341O867M806K389k7020p136M897J3325M6972k0116l0544k123M5151j1415
13643G72394l460J792j9666l8460K7065k6046j7902k9241K0697K7469j2984L7108
13631G38766M3961k8257p3922L1182K3324L4592J4453m1847l0847j0675K6434
13620G27164O863L245N6401L4834k1208l0119k703k3538n321l2937j5827J6531
13608G13385O7763J5638J3131o242j7649j1495j7716K2071L0895Q486n9322K555
13596G61500L5081K8975j6451j9966J6158n686n7507J2841J6935J8066j3221k049
13584G74676R043k9558k2590j5068L3911j3246J722K0498l3684K3392J7045J4750
$$ plain form
13572 780891 769236 749628 727589 715013 718908 742589 748324 755197 758692 776414 795885 824264
13560 824264 830934 834283 813830 821275 817255 809741 824140 812505 806763 804458 796061 793228 745443
$$ packed form
13572G80891j1655j9608k2039j2576L895K3681N735O873L495J7722J9471K8379
13560H24264O670L349k0453P445m020p514J4399j1635n742k305q397k833m7785
$$ [...]
##END NTUPLES=NMR SPECTRUM
##END=
