##TITLE=Analysis number 313590
Compound Code btb 12826
Project Code adrs
Chemist Name perepichka
##JCAMPDX= 6.0         $$ Bruker NMR JCAMP-DX V2.0
##DATA TYPE= NMR SPECTRUM
##DATA CLASS= NTUPLES
##ORIGIN= Bruker BioSpin GmbH
##OWNER= NMR
$$ XWIN-NMR		Version 3.5
$$ Tue Sep 13 11:55:22 2005 GMT Daylight Time (UT+1h)  MAYBRIDGE\NMR@NMR_250MHZ
##.OBSERVE FREQUENCY= 250.131544655141
##.OBSERVE NUCLEUS= ^1H
##.ACQUISITION MODE= SIMULTANEOUS (DQD)
##.ACQUISITION SCHEME= undefined
##.AVERAGES= 16
##.DIGITISER RES= 18
##SPECTROMETER/DATA SYSTEM= dpx250
##.PULSE SEQUENCE= zg30
##.SOLVENT NAME= DMSO
##.SHIFT REFERENCE= (INTERNAL, DMSO, 0, 16.522)
##AUDIT TRAIL= $$ (NUMBER, WHEN, WHO, WHERE, WHAT)
$$ ##TITLE= Audit trail, XWIN-NMR		Version 3.5
$$ ##JCAMPDX= 5.01
$$ ##ORIGIN= Bruker BioSpin GmbH
$$ ##OWNER= NMR
$$ C:\u/data/dgb/nmr/ADRS/9420/pdata/1/auditp.txt
$$ ##AUDIT TRAIL=  $$ (NUMBER, WHEN, WHO, WHERE, WHAT)
(   1,<2005-09-13 11:54:57.88 +100>,<MAYBRIDGE\NMR>,<NMR_250MHZ>,
      <created by zg, POWCHK disabled, PULCHK disabled
       configuration hash MD5:
       62 19 C7 07 E1 42 D1 B7 37 6C 3D D0 77 39 F9 E6
       data hash MD5: 64K
       1A E0 7F B2 5C B3 90 28 1A CE D4 A5 B6 A5 5D D1>)
(   2,<2005-09-13 11:55:14.46 +100>,<MAYBRIDGE\NMR>,<NMR_250MHZ>,
      <Start of raw data processing
       ef LB = 0.3 FT_mod = 6 PKNL = 1 SI = 32K 
       data hash MD5: 32K
       1A 96 2B 32 2D 9D 62 B0 64 BF 9C AD 56 CB 8C 6C>)
(   3,<2005-09-13 11:55:16.24 +100>,<MAYBRIDGE\NMR>,<NMR_250MHZ>,
      <apk 
       data hash MD5: 32K
       FB 38 BB 9D C5 7D E5 3B AE 37 24 CA 72 15 1F DE>)
(   4,<2005-09-13 11:55:17.02 +100>,<MAYBRIDGE\NMR>,<NMR_250MHZ>,
      <abs ABSG = 5 
       data hash MD5: 32K
       CC E7 FD B2 EB 64 F3 34 DE 8D 06 18 D3 C1 C1 1C>)
$$ ##END=
$$ 
$$ hash MD5
$$ D0 CC EF D2 53 4F 54 06 C2 2B DA 55 25 BC 40 F7
##$RELAX= 
##$RELAX= 
##$RELAX= 
##$RELAX= 
##$RELAX= 
##$RELAX= 
##$RELAX= 
$$ Bruker specific parameters
$$ --------------------------
##$DU= <C:\u>
##$EXPNO= 9420
##$NAME= <ADRS>
##$PROCNO= 1
##$TYPE= <nmr>
##$USER= <dgb>
##$AMP= (0..31)
100 100 100 100 100 100 100 100 100 100 100 100 100 100 100 100 100 100 
100 100 100 100 100 100 100 100 100 100 100 100 100 100 
##$AQSEQ= 0
##$AQ_mod= 3
##$AUNM= <au_zg>
##$AUTOPOS= <20 >
##$BF1= 250.13
##$BF2= 250.13
##$BF3= 250.13
##$BF4= 250.13
##$BF5= 500.13
##$BF6= 500.13
##$BF7= 500.13
##$BF8= 500.13
##$BYTORDA= 1
##$CFDGTYP= 0
##$CFRGTYP= 5
##$CHEMSTR= <none>
##$CNST= (0..31)
1 1 145 1 1 1 1 1 1 1 1 1 1 1 1 1 1 1 1 1 1 1 1 1 1 1 1 1 1 1 1 1 
##$CPDPRG= <>
##$CPDPRG1= <>
##$CPDPRG2= <>
##$CPDPRG3= <>
##$CPDPRG4= <mlev>
##$CPDPRG5= <mlev>
##$CPDPRG6= <mlev>
##$CPDPRG7= <mlev>
##$CPDPRG8= <mlev>
##$CPDPRGB= <>
##$CPDPRGT= <>
##$D= (0..31)
0 1 0 0 0 0 0 0 0 0.06 0 0 0 0 0 0 0.0002 0 0 0 0 0 0 0 0 0 0 0 0 0 0 
0 
##$DATE= 1126608897
##$DBL= (0..7)
120 120 120 120 120 120 120 120 
##$DBP= (0..7)
150 150 150 150 150 150 150 150 
##$DBP07= 0
##$DBPNAM0= <>
##$DBPNAM1= <>
##$DBPNAM2= <>
$$ [...]
##$SUBNAM7= <"">
##$SUBNAM8= <"">
##$SUBNAM9= <"">
##$SW= 20.6930455092707
##$SWIBOX= (0..15)
0 0 3 0 0 0 0 0 0 0 0 0 0 0 0 0 
##$SW_h= 5175.983436853
##$TD= 65536
##$TD0= 1
##$TE= 295.16
##$TE2= 300
##$TE3= 300
##$TEG= 300
##$TL= (0..7)
0 120 120 120 120 120 120 120 
##$TP= (0..7)
150 150 150 150 150 150 150 150 
##$TP07= 0
##$TPNAME0= <>
##$TPNAME1= <>
##$TPNAME2= <>
##$TPNAME3= <>
##$TPNAME4= <>
##$TPNAME5= <>
##$TPNAME6= <>
##$TPNAME7= <>
##$TPOAL= (0..7)
0.5 0.5 0.5 0.5 0.5 0.5 0.5 0.5 
##$TPOFFS= (0..7)
0 0 0 0 0 0 0 0 
##$TUNHIN= 0
##$TUNHOUT= 0
##$TUNXOUT= 0
##$USERA1= <user>
##$USERA2= <user>
##$USERA3= <user>
##$USERA4= <user>
##$USERA5= <user>
##$V9= 5
##$VALIST= <valist>
##$VCLIST= <CCCCCCCCCCCCCCC>
##$VD= 0
##$VDLIST= <DDDDDDDDDDDDDDD>
##$VPLIST= <PPPPPPPPPPPPPPP>
##$VTLIST= <TTTTTTTTTTTTTTT>
##$WBST= 1024
##$WBSW= 4
##$XGAIN= (0..3)
0 0 0 0 
##$XL= 0
##$YL= 0
##$YMAX_a= 242174
##$YMIN_a= -227794
##$ZGOPTNS= <>
##$ZL1= 120
##$ZL2= 120
##$ZL3= 120
##$ZL4= 120
##$ABSF1= 16.522
##$ABSF2= -4.171173
##$ABSG= 5
##$ABSL= 3
##$ALPHA= 0
##$AQORDER= 0
##$ASSFAC= 0
##$ASSFACI= 0
##$ASSFACX= 0
##$ASSWID= 0
##$AUNMP= <proc_1d>
##$AZFE= 0.1
##$AZFW= 0.1
##$BCFW= 0
##$BC_mod= 0
##$BYTORDP= 0
##$COROFFS= 0
##$CY= 12.5
##$DATMOD= 1
##$DC= 0
##$DFILT= <>
##$DTYPP= 0
##$F1P= 14.0000005364418
##$F2P= -0.99999901652339
##$FCOR= 0.5
##$FTSIZE= 32768
##$FT_mod= 6
##$GAMMA= 0
##$GB= 0
##$INTBC= 1
##$INTSCL= 1
##$ISEN= 128
##$LB= 0.3
##$LEV0= 0
##$LPBIN= 0
##$MAXI= 10000
##$MC2= 0
##$MEAN= 0
##$ME_mod= 0
##$MI= 0
##$NCOEF= 0
##$NC_proc= -6
##$NLEV= 6
##$NOISF1= 0
##$NOISF2= 0
##$NSP= 0
##$NTH_PI= 0
##$NZP= 0
##$OFFSET= 16.522
##$PC= 1
##$PHC0= -85.42489
##$PHC1= 8.503736
##$PH_mod= 1
##$PKNL= yes
##$PPARMOD= 0
##$PSCAL= 4
##$PSIGN= 0
##$REVERSE= no
##$SF= 250.13
##$SI= 32768
##$SIGF1= 0
##$SIGF2= 0
##$SINO= 400
##$SIOLD= 32768
##$SREGLST= <1H.DMSO>
##$SSB= 0
##$STSI= 32768
##$STSR= 0
##$SW_p= 5175.98343685301
##$SYMM= 0
##$S_DEV= 0
##$TDeff= 65536
##$TDoff= 0
##$TI= <Analysis number 999999
Compound Code 99
Book Reference 9
Project Code 9>
##$TILT= no
##$TM1= 0
##$TM2= 0
##$TOPLEV= 0
##$USERP1= <user>
##$USERP2= <user>
##$USERP3= <user>
##$USERP4= <user>
##$USERP5= <user>
##$WDW= 1
##$XDIM= 32768
##$YMAX_p= 450574300
##$YMIN_p= -1269466
$$ End of Bruker specific parameters
$$ ---------------------------------
##NTUPLES= NMR SPECTRUM
##VAR_NAME=  FREQUENCY,     SPECTRUM/REAL,   SPECTRUM/IMAG
##SYMBOL=    X,             R,               I
##VAR_TYPE=  INDEPENDENT,   DEPENDENT,       DEPENDENT
##VAR_FORM=  AFFN,          ASDF,            ASDF
##VAR_DIM=   32768,         32768,           32768
##UNITS=     HZ,            ARBITRARY UNITS, ARBITRARY UNITS
##FACTOR=    0.157963299565203, 1,           1
##FIRST=     4132.6476996994, 0,             0
##LAST=      -1043.33573715361, 0,           0
##MIN=       -1043.33573715361, -1269466,    0
##MAX=       4132.6476996994, 450574300,     0
$$ Real data points
##PAGE= N=1
##DATA TABLE= (X++(R..R)), XYDATA
$$ [...]
15542e88193Q236Q1861r4121N5749J50056J40853r7908J70809Q1122R4082N3961
15531E6507J74512O6444j73290k69162l20561j95721J67395J95829K65519J65286
15521A32758L28434l57183l05302K71981J40779j11466p0393J11053R0025K29398
15511D60084j65113j60199j78481j55724j47124M51470M9738l97354k32370n6967
15501e32040k79960l2149J99763N73228m6983l6519K75327N189m7171J8157J57276
15490B54118j10234m63257k43102m20369J07626L60503J57324M560K18646J66541
15480C2356k96092k1475K29156Q4549l10939j92772K07596K37179l4810k79686
15470c44938Q829J94268k02726J7559L83527M0494j2499j26313n8077k46766j73978
$$ plain form
15542 -588193 -579957 -498096 -592217 -536468 -386412 -245559 -343467 -172658 -91536 2546 56507
15531 56507 231019 297463 124173 -144989 -465550 -661271 -493876 -298047 -32528 132758
15521 132758 461192 104009 -201293 70688 211467 100001 29608 140661 230686 460084
15511 460084 294971 134772 -43709 -199433 -346557 104913 154651 -242703 -475073 -532040
15501 -532040 -812000 -844149 -644386 -71158 -118141 -154660 120667 125856 78685 96842 254118
15490 254118 143884 -319373 -562475 -982844 -875218 -514715 -357391 -352831 -134185 32356
15480 32356 -263736 -285211 -56055 28494 -282445 -475217 -267621 -30442 -65252 -344938
15470 -344938 -336109 -141841 -344567 -327008 56519 97013 84514 -41799 -99876 -346642 -520620
15459e20620M6859R11L23276K8936j95059j54445o1525K12786J88904r739Q1550
15448e8166l34087m53562n9808K54358K87129K13737J32674K28553k44433L0125
15438c480k96813k11102k9982q7506N7339K02538j87559j03243J13453L49019
15428a97336J70908k44322j63316M82809K87495L4028q7792J4789o3551j82866
15418E0846r7099o3253L41512o372R8141j14472j04277L3698n8573J34836J715
15407B16702l88975k49183l6351J96518n9923k63012Q0003J34315j5543Q0971
15397c04478p6183P0394J75986K39443j89230j88678q8846L90055r2739q3603
15387a47879k48047j0946Q2911j32020L69902K79035k20033k49093J52076K12930
$$ plain form
15459 -520620 -473761 -472850 -149574 -120638 -315697 -470142 -531667 -318881 -129977 -139716 -58166
15448 -58166 -392253 -845815 -905623 -651265 -364136 -150399 -17725 210828 -33605 -3480
15438 -3480 -300293 -511395 -541377 -628883 -571544 -369006 -556565 -659808 -546355 -197336
15428 -197336 -26428 -270750 -434066 48743 336238 370266 282474 297263 233712 50846
15418 50846 -46253 -109506 232006 225634 323775 209303 105026 138724 80151 214987 216702
15407 216702 -172273 -421456 -457807 -261289 -321212 -584224 -504221 -369906 -385449 -304478
15397 -304478 -380661 -310267 -134281 105162 -84068 -272746 -361592 28463 -64276 -147879
15387 -147879 -395926 -406872 -323961 -455981 -86079 192956 -27077 -276170 -124094 88836
15377H8836j1875j79032q5525p9796k56864l9033L2351R0469K31955K10695k78315
15366b76134o7756Q6330K17944j3668m36827j97037Q0787O3443K32970k22332
15356e32280j89898L26272M1937l321M12526L93848j59743j98187k25702J73385
15346C8837Q0002k15572J4178Q2969R1142k05186j98404J2196Q7203j33041M5760
15335b99916K14149o2264J83902n7842j32328q1429r5256l29161k03381K74478
15325e89048M83520J56707j33564k46734K3264K1624k86981l78452J1715N82804
15315c55145J45912j92327J18779J40138l24532m8937J09815J09475K30436N7185
15305i201N0700L5892R4471L82023l27945m31365k27225K08614p657K79779j30108
$$ plain form
15377 88836 76961 -102071 -187596 -267392 -524256 -563289 -530938 -440469 -208514 2181 -276134
15366 -276134 -343890 -257560 -39616 -53284 -490111 -687148 -606361 -542918 -309948 -532280
15356 -532280 -722178 -395906 -353969 -357290 55236 449084 289341 91154 -134548 38837
15346 38837 118839 -96733 -82555 414 91556 -113630 -312034 -299838 -212635 -345676 -299916
15335 -299916 -85767 -148031 35871 -21971 -154299 -235728 -330984 -660145 -863526 -589048
15325 -589048 -105528 51179 -82385 -329119 -305855 -284231 -571212 -949664 -937949 -355145
15315 -355145 -209233 -401560 -282781 -142643 -467175 -516112 -406297 -296822 -66386 -9201
15305 -9201 41499 77391 171862 553885 225940 -205425 -432650 -224036 -231693 48086 -82022
15294h2022j08234k36093J33461K33615N4675J88348N52117k07305k93511m0725
15284A94326j3223O7351j68647l1712J7319K05391L26417J4073j97283k09383
15274B04629k25964k09576M7266J90698l42787K20580J38989j52048L8798K00016
15264A10601o6172j27720l19754J60437j4456j0338J73280K95776m2413q0616
15254G8625L8390k58323J13833N1273J12715N0955k5490l55685o3034N5387j17134
15243c18488J43262K10904R4553j64851j06340J30079j571k28608j78705k33484
15233f53249J50184J67911L55749P4704L0533o4230L9038J56427j10441k62411
15223a15785J1179J35328Q75j4640L90485k20514K4907J31987J51464M9660m96393
$$ plain form
15294 -82022 -190256 -426349 -292888 -59273 -4598 183750 735867 528562 235051 194326
15284 194326 181103 248454 79807 48095 65414 270805 597222 611295 414012 204629
15274 204629 -21335 -230911 -183645 7053 -335734 -115154 23835 -128213 -89415 110601
15264 110601 44429 -83291 -403045 -242608 -257064 -267402 -94122 201654 159241 78625
15254 78625 117015 -141308 -27475 23798 136513 187468 161978 -193707 -256741 -201354 -318488
15243 -318488 -175226 35678 130231 -34620 -140960 -10881 -12452 -241060 -419765 -653249
15233 -653249 -503065 -335154 20595 95299 125832 61602 100640 257067 146626 -115785
15223 -115785 -104606 30722 31597 16957 407442 186928 211835 343822 495286 544946 48553
15212D8553k38799k96220J0842K21834J1403J77005k03230p9420N492J9072L05807
15201a7661m6663J23482P7095n5223K3847K15815j07530k39569j19678K01215
15191E5130K29216L86203p9654k98617L7769J29833K10527L44612L06505N2342
15181A373866M5389k35819J42186L1011j72855l47851k34249k47048j91403N681
15171A68908K69002l72700p3472J15358m2092k8499m2971Q8354J489p9226j53242
15160a49091k74058j65140M6962K68148K19614L47404K567N3937Q3497k38245
15150A95595m42021K14588K86732j47258j49374K85890L81831K39158p7628l59537
15140D27976k8395N5602l921K33051L84980j56628j89785j04312J44038J88684
$$ plain form
15212 48553 -190246 -486466 -475624 -253790 -242387 -65382 -268612 -348032 -342540 -323468 -17661
15201 -17661 -64324 59158 136253 81030 104877 320692 213162 -26407 -146085 55130
15191 55130 284346 670549 590895 292278 330047 459880 670407 1015019 1321524 1373866
15181 1373866 1419255 1183436 1325622 1356633 1183778 835927 601678 354630 163227 168908
15171 168908 437910 65210 -8262 107096 65004 36505 -6466 81888 83377 4151 -149091
15160 -149091 -423149 -588289 -541327 -273179 -53565 293839 296406 350343 433840 195595
15150 195595 -246426 -31838 254894 107636 -41738 244152 625983 865141 787513 427976
15140 427976 399581 455183 451262 684313 1069293 912665 722880 618568 762606 951290
15130I51290j84017j57620k37036K24817J61973Q1097o3931N9654J44285K44966
15120A225478P4231K18087P1656K20870k30847l69668l16944r7061p6562k62567
15110D56673k30071N9259R7421J21443j52866k41101r3565k54180M2397L07601
15100A13011n6802M6296o002M8812J17122k06397l6263r7059j73858K8844K36609
15089A4313M38230Q2082k53521k30323P338R8885J88842J3708o3130J3564M6654
15078C56642L01203j30123O549J97820K9884l46850j88002J92714L35772q2312
15068F73297q3699O5340L05788L26806k10369l96837p54917o1525J8956k33298
15058c50458L2768M31187k34456l67367n119N03699L94959O7195j84652j12378
$$ plain form
15130 951290 767273 609653 372617 597434 759407 840504 776573 836227 980512 1225478
15120 1225478 1299709 1517796 1589452 1810322 1579475 1209807 892863 795802 719240 456673
15110 456673 226602 285861 383282 504725 351859 110758 17193 -236987 -194590 113011
15100 113011 56209 102505 96503 145315 262437 56040 19777 -77282 -251140 -222296 14313
15089 14313 452543 534625 281104 50781 58119 157004 345846 359554 296424 309988 356642
15078 356642 657845 527722 534271 732091 761975 415125 227123 419837 755609 673297
15068 673297 589598 654938 960726 1287532 1077163 680326 -74591 -136116 -117160 -350458
15058 -350458 -317690 113497 -120959 -488326 -493445 10254 405213 472408 287756 175378
15048A75378j91825l6153K18552j37295K36842n1615J45816j27394j02626l6072
15038I3608j57936j43588K76953L09862M14786k26960j97291l11488l17194J40661
15028a18587J17184l4202l5381L06700J83542r6454j86442k56574j74176k25755
15018e20145K51451L75200L51192k01170j08229l52209R2157J2037k8408P9047
15008d9077J67628Q4837M9560k40783j39246j43196L87076Q2223K47418J8818
14998D65258m11517o2940K10913Q6171j26260J56095r754j30725k83046N1625
14988e4180L46459K28509k24301j66107k3903J31534k63092j91769Q0817K38425
14978A02392k66452l44375J87968k170p9360R1408q3834Q2237p5629j44473J75523
$$ plain form
15048 175378 -16447 -52600 165952 28657 265499 213884 359700 232306 129680 93608
15038 93608 -64328 -207916 69037 378899 793685 566725 369434 57946 -259248 -118587
15028 -118587 -1403 -35605 -70986 235714 419256 322802 136360 -120214 -294390 -520145
15018 -520145 -268694 106506 457698 256528 148299 -203910 -111753 -99716 -128124 -49077
15008 -49077 118551 203388 252948 12165 -127081 -270277 116799 199022 446440 465258
14998 465258 53741 -9199 201714 287885 161625 317720 307966 177241 -105805 -54180
14988 -54180 292279 520788 296487 130380 106477 238011 -25081 -216850 -136033 102392
14978 102392 -164060 -508435 -320467 -322637 -401997 -310589 -394423 -312186 -387815 -532288 -356765
14967c56765R2627l8639l34395m53962L76263O44897J26777p465j84044q9908
14957b24614K27079j6996k30109j20546k68267k79110j62682k7440N0418M39881
14947f12386J10491j73977K16338j06593J24874J97181K42177m2760L4252L4394
14937B3991J17969j60741l53735q5805K14664J13204m0677l01855K4151R829L10579
14926a28426L43998k33834l95938j9065o5820o1599j73857R4491J73627K0607
14916d45816Q0365o6093J81764L20629r9732l04154j7069N9311J36751J28235
14906b5809M4873j41637J32511j81092k57891L43578k6052J38640N0362k92204
14896b14721m3673l89250p5146J77534L61259J61450o8892J5093n449J57019K52124
$$ plain form
14967 -356765 -264138 -302777 -637172 -1091134 -714871 -69974 56803 49338 -134706 -224614
14957 -224614 2465 -14531 -244640 -365186 -633453 -912563 -1075245 -1102685 -1052267 -612386
14947 -612386 -501895 -675872 -459534 -566127 -441253 -244072 -1895 -44655 -10403 23991
14937 23991 141960 -18781 -372516 -458321 -243657 -130453 -171130 -472985 -448834 -439005 -128426
14926 -128426 215572 -18262 -414200 -433265 -499085 -560684 -734541 -640050 -466423 -445816
14916 -445816 -365451 -431544 -249780 70849 -28883 -333037 -350106 -290795 -154044 -25809
14906 -25809 19064 -122573 9938 -171154 -429045 -85467 -111519 27121 77483 -214721
14896 -214721 -258394 -647644 -722790 -545256 -183997 -22547 -91439 -76346 -81795 75224 327348
14885C27348O2279r0157k04878k6443J60642k06342j9141j56461k50386L03645
14875i9894p5052l11098k41020K36428J09273L7592j55925q0497L13026M93686
14865B26519K98124n5513m4387j23347j81478n17988n6268k9495j28902K61977
14855c50758N22521j96185j19336J16087Q910J12039K09594k60155l83049l05275
14845f45607O2269q9801j04095K12008L93085K83525j09801j520J93698J66762
14835C60523m18951m42587q4017m8387K47904L79147M21330K1507J27923r9163
14825D65229l52508j58563m5305J76887J67616K1722k58814j31441j75419j35487
14815d26083J85506M49214J00999j92983j44249j5891k2717j07738k10386J62797
$$ plain form
14885 327348 389627 299470 94592 68149 228791 22449 3308 -153153 -403539 -99894
14875 -99894 -174946 -486044 -727064 -490636 -381363 -343771 -499696 -580193 -267167 226519
14865 226519 524643 469130 424743 301396 119918 -398070 -454338 -483833 -612735 -350758
14855 -350758 171763 -24422 -143758 -27671 -18761 93278 302872 42717 -340332 -645607
14845 -645607 -583338 -673139 -777234 -565226 -172141 111384 1583 63 193761 360523
14835 360523 -58428 -501015 -585032 -633419 -385515 -6368 414962 436469 564392 465229
14825 465229 112721 -45842 -91147 85740 253356 275078 16264 -115177 -290596 -426083
14815 -426083 -240577 208637 309636 116653 -27596 -43487 -66204 -173942 -384328 -221531
14805b21531L5824P3301j37477l55466J58112O68034J85084j96922k57006q7826
14795a35873o7229J72884o5981k39924N9718j19768j52502J2661J53454L2105
14785c50455L68941K60283J28088j48845k40917k77596J02871n02714L3622L06667
14775c20055q1073J05398R6574r5430m8102l8995L48221M2879q7872J52239L04730
14764C78514J10311k05378m82491l93787j21374M39241K51818j79626N0519L6713
14754a15540M20361J40983j6768l41930K79232j44113J34781K55310j83130k66656
14744A62530R0951P289l79268m99361O9812L76540L83233J74726k7663n00956
14734a42167j22784j64243P8161j72805k3816M65842J27191n1407n6914j73603
$$ plain form
14805 -221531 -185707 -112406 -249883 -605349 -447237 220797 405881 208959 -48047 -135873
14795 -135873 -203102 -30218 -96199 -336123 -276405 -396173 -548675 -536014 -382560 -350455
14785 -350455 18486 278769 406857 258012 17095 -260501 -157630 -660344 -626722 -320055
14775 -320055 -401128 -295730 -199156 -294586 -342688 -381683 -33462 9417 -78455 73784 378514
14764 378514 488825 283447 -199044 -592831 -714205 -274964 -23146 -202772 -152253 -115540
14754 -115540 304821 445804 429036 87106 366338 222225 357006 612316 429186 162530
14744 162530 253481 260770 -118498 -617859 -548047 -171507 211726 386452 358789 -142167
14734 -142167 -264951 -429194 -351033 -523838 -547654 -81812 45379 -6028 -62942 -236545
14724b36545L35690j14219k34180J78804K5836P4086j4235j6346j391m866j61461
14713a68827m64912J39463K71568J07035p8101n7386l8405K23506L17447K1733
14703B73121k41824k5077n2271l94508J84458L83190j19784J04662k04988j20652
14693b13673j8307M59383j4500k72110M13663J55308j47619k9676j33919m2511
14683A56039j8779O5186q4169K23009P3695q3069N637m6749K62124K28584k80833
14672E00675k82742k78367m0129K06743j65197o4834J20617k15419m50743j00474
14662g69870L27019K54125J66024R7797m2795J23004Q7656M2297K23184l01481
14652B06960Q6075l0827j30659j25165k59779N3969L09454p9390N0617L19316
$$ plain form
14724 -236545 99145 -15074 -249254 -70450 -44614 29472 15237 -1109 -2500 -7366 -168827
14713 -168827 -633739 -494276 -222708 -115673 -193774 -251160 -289565 -66059 251388 273121
14703 273121 31297 6220 -46051 -440559 -256101 127089 7305 111967 -93021 -213673
14693 -213673 -231980 227403 212903 -59207 354456 509764 362145 332469 198550 156039
14683 156039 137260 202446 118277 341286 414981 331912 337549 290800 552924 781508 500675
14672 500675 217933 -60434 -100563 106180 -59017 -123851 -3234 -218653 -669396 -769870
14662 -769870 -442851 -188726 -22702 75095 32300 155304 242960 285257 508441 206960
14652 206960 293035 262208 131549 6384 -253395 -199426 110028 30638 81255 400571
14642D00571j57109l23740j32661j07265q020L42652j52206j74680K1177j04664
14632c95945J82173M17509K40884L8739j9699n41905k86753J71092M5046m15960
14622e64819Q3075L85353K95812j17198r1707m4312l34029k87030R5103L54919
14612b24833L28569l3743l3937J46220Q3873Q6655K3156O2057k84329j62265J66273
14601A57696K65353k41428r5751k99124l29803L9600K20751J94729K29178p2994
14591F8207L8177J43836k14275J53919j78475j63627j4398J27602l9932K40558
14581A61592J42812p4934k83358k48583j15041o9978j584J18241J51801j21402
14571c40434j05502k1335J98757K06209J36822O3970k86183q6069J04964J15851
$$ plain form
14642 400571 243462 -80278 -212939 -320204 -328224 14428 -137778 -312458 -291281 -395945
14632 -395945 -213772 203737 444621 483360 463661 -78244 -364997 -193905 -148859 -564819
14622 -564819 -481744 -96391 199421 82223 -9484 -53796 -387825 -674855 -579752 -224833
14612 -224833 103736 69993 36056 182276 266149 352804 375960 438017 153688 -8577 157696
14601 157696 423049 181621 85870 -213254 -543057 -503457 -282706 -87977 141201 68207
14591 68207 106384 250220 35945 189864 11389 -152238 -166636 -39034 -78966 161592
14581 161592 304404 229470 -53888 -302471 -417512 -487490 -489074 -370833 -219032 -340434
14571 -340434 -445936 -467271 -268514 -62305 74517 138487 -147696 -233765 -128801 -12950
14561a2950o1488J35714n5927J41799j95994p6904K99887N763j6068j48595p2655
14550e7418K37129j00250k34187j43203q547k4597L0869J49427K63983k06519
14540i3313j42616j16223p9970K02545R8447M3865r3049J29492n2585j31104j87754
14529d22265K23984o5800k01524j6332j00626M7042J76302K20629j47683N53M43104
14518A57384K39247l38478k49692N2373l1732n7305o2552l01769N6758J92060
14508c43706j7413J58915J48561L4613N6758l0725K82663N038k06013J1887l1642
14497F8936j50264L1619L0756J06241P1563m01140L679K87419R9961j29947n9412
14486d0589j38854O4912J82434j19896P33Q5122O1991p0876m50295k28266J62578
$$ plain form
14561 -12950 -74438 61276 5349 147148 -48846 -125750 174137 179900 163832 15237 -57418
14550 -57418 179711 79461 -154726 -297929 -306476 -331073 -300204 -150777 113206 -93313
14540 -93313 -235929 -352152 -432122 -229577 -131130 -87265 -180314 -50822 -103407 -234511 -422265
14529 -422265 -198281 -264081 -465605 -481937 -582563 -535521 -359219 -138590 -286273 -285720 157384
14518 157384 396631 58153 -191539 -139166 -170898 -228203 -290755 -592524 -535766 -343706
14508 -343706 -361119 -202204 -53643 -19030 37728 7003 289666 294704 88691 100578 68936
14497 68936 -81328 -49709 -18953 87288 158851 -242289 -238610 48809 148770 18823 -40589
14486 -40589 -179443 -114531 67903 -51993 -51260 33862 95853 24977 -425318 -653584 -491006
14475d91006J5473J00867J95457J22678o9540l02619L56720M53834Q6570m80626
14465a2192j22533J08901J95473J4769j56881J73466p038j17760L1533k04187
14455i6449l04552k03866L24660O9349j64744J98933J55307j53693J8167j30458
14445b87346K67673L08759l05949l36040J75144M7973j58016K24851r6254J89056
14435B9851R5066K89443n815l48393j31426k98965K428K79293L40059J14451k76986
14424H9006j96156l2319n8358O6893m2804J68510l95789r9357P9917J13274J00732
14413b06451k89430o5695K10557J45047R6899J55672j22275k27671Q8129L61549
14403A46331K52813m5953k94580K2804q8911M0573J55879J5951j83454N9573K68372
$$ plain form
14475 -491006 -475533 -374666 -179209 -56531 -126071 -428690 -71970 381864 468434 -12192
14465 -12192 -134725 -25824 169649 184418 27537 201003 193965 76205 107738 -96449
14455 -96449 -401001 -604867 -280207 -210858 -375602 -176669 -21362 -175055 -156888 -287346
14445 -287346 -19673 289086 -16863 -352903 -177759 -129786 -287802 -62951 -159205 29851
14435 29851 124917 414360 408545 60152 -71274 -370239 -367811 -88518 251541 365992 89006
14424 89006 -107150 -139469 -197827 -130934 -173738 -5228 -401017 -500374 -420457 -307183 -206451
14413 -206451 -495881 -561576 -351019 -205972 -109073 46599 -75676 -303347 -215218 146331
14403 146331 399144 353191 58611 81415 -7496 33077 188956 204907 21453 81026 349398
14392C49398J27171j53360j35829J87074J13769k6992l33435j49470J4892J71754
14382A64972L50896Q2752m97025m1067l66532J8139j11091L3765J46864K02362
14372a5965j13807k67125l1653L37230J58217m73280k78216J76643j37973L17690
14362c28239K11966K33924r0572L653o0016J38531J00898o5885k30610L3352J0768
14351d2230m6821k940o0601J39972j162L30263K45015j23222k26479j89897l8370
14340a6472K1323J17826k68692r9999Q20O4946J46484K8256Q0707R6139R283J38975
14328C19596J9769l8188j20812l44216j48562P9625K06929K7459k12040j98390
14318d08830J31745K77874J0095k22756o0229J52402J78492k17221J5805l1272
$$ plain form
14392 349398 476569 323209 187380 374454 488223 461231 127796 -21674 -6782 164972
14382 164972 515868 598620 101595 60528 -306004 -287865 -398956 -365191 -218327 -15965
14372 -15965 -129772 -396897 -428550 -91320 66897 -406383 -684599 -507956 -645929 -328239
14362 -328239 -116273 117651 27079 30732 -29284 109247 210145 144260 -86350 -52998 -42230
14351 -42230 -89051 -91991 -152592 -12620 -13782 316481 561496 438274 211795 21898 -16472
14340 -16472 4851 122677 -146015 -246014 -245194 -180248 -33764 -5508 75199 171338 180621 319596
14328 319596 339365 301177 180365 -163851 -312413 -232788 -25859 1600 -210440 -408830
14318 -408830 -277085 789 10884 -211872 -272101 -119699 58793 -158428 -142623 -173895
14308a73895J01536l0981k01562R0991L1565m319j39571k0269k02190l9994J20613
14297d68076j30074R7417O6624K1031r0344k5125K01708L53248K72223o3212j52503
14286H2917k05678p6058J32265M0135r9640j61469l76442l67191n0186L99008
14276f82339M534K56914M71925K19948k20677l7268J1752k29536k17579r4744
14266e17070K61978K66986j46057l84418j15260J61877K05178L1648j73339l671
14256d12148J00085r4984L6686M38295J88686j4054l14185k30163o5356P2537
14246b94601m1745n1788J39001J96190K51641q1130l72443o8945m4093n7453o5390
14235d90756K70046J95291K66879n3747n7720M7014k96276k71746M3029J98091
$$ plain form
14308 -173895 -72359 -103340 -304902 -213911 -182346 -186665 -326236 -346505 -548695 -588689 -468076
14297 -468076 -598150 -500733 -434109 -413078 -503422 -528547 -326839 26409 298632 235420 82917
14286 82917 -122761 -198819 -66554 -26419 -126059 -287528 -663970 -1031161 -1081347 -682339
14276 -682339 -677805 -420891 51034 270982 50305 13037 24789 -204747 -422326 -517070
14266 -517070 -255092 11894 -134163 -518581 -633841 -471964 -266786 -235138 -408477 -412148
14256 -412148 -312063 -407047 -370361 67934 256620 242566 -71619 -301782 -367138 -294601
14246 -294601 -336346 -388134 -249133 -52943 198698 117568 -254875 -323820 -367913 -425366 -490756
14235 -490756 -220710 -25419 241460 187713 129993 177007 -119269 -391015 -347986 -149895
14225a49895K0586J28312j1210j90624k55664K52608j2624k01939l9501N5263
14215d04688J68550L05326j16164j47242j71145K39096k87652k53803J57308M02159
14205a08255L99994o9763j45364R3509L54631N9223l71603j46024J1689j11255
14195c3218P5403j05776J34005l10166k35574m9057j47565J64229Q0109L72110
14185e5500J07294j74103J2899N6533Q440j35133K69893k53617k07449J39316
14175b31427n5624o2934L8001j495j01482l1806L09038L45221M25440k3262m97832
14164A11838m12759m01607K05928J52524j79124P6263j75961n9348j31939J35305
14154f78880M12007J80263k44378R2177J20994O1412N13281P5434k3193m0966
$$ plain form
14225 -149895 -129309 -997 -12207 -202831 -458495 -205887 -218511 -420450 -459951 -404688
14215 -404688 -236138 69188 -46976 -194218 -365363 -126267 -413919 -667722 -510414 -108255
14205 -108255 291739 221976 76612 170121 524752 583975 212372 66348 78037 -33218
14195 -33218 42185 -63591 70414 -239752 -475326 -524383 -671948 -507719 -427610 -55500
14185 -55500 51794 -122309 -109410 -52877 -44437 -179570 90323 -163294 -370743 -231427
14175 -231427 -287051 -349985 -311984 -313479 -414961 -446767 -137729 207492 632932 609670 111838
14164 111838 -300921 -702528 -496600 -344076 -523200 -446937 -622898 -682246 -814185 -678880
14154 -678880 -266873 -86610 -330988 -238811 -117817 -56405 456876 532310 509117 468151
14144D68151M9381n2120j33872l60805m5295j38561J01015L42K02460J70621K6733
14133B88050k98794k3758K59720j32142m41221l56607J31018o1464j17291K81943
14123d70546K81278L04370n2806j45760n4205P7421M2091Q7714j45643j29143
14113b05229n64624J02019L91199J75530P8245K51060L7805m1988q3475P3279
14103B13821o6671n33207J91645J74555o8161J84333j20745j7783m6387J6184
14093g2416N2959j33J5755M2319L3026J63128j06287k05994j43367k5364k55094
14082e01468K15195L9870k9377K42226Q0549Q7834j09645j613o70J45297J64685
14071C32883k78336l13880J33258L5962q2195k8333J28005K7188K28124P6271
$$ plain form
14144 468151 517532 465412 331540 -29265 -74560 -213121 -112106 -111764 90696 261317 288050
14133 288050 -10744 -34502 225218 93076 -348145 -704752 -573734 -635198 -752489 -470546
14123 -470546 -189268 115102 62296 -83464 -137669 -60248 -18157 69557 -76086 -205229
14113 -205229 -769853 -667834 -276635 -101105 -22860 228200 266005 224017 140542 213821
14103 213821 147150 -386057 -194412 -19857 -88018 96315 -24430 -42213 -88600 -72416
14093 -72416 -19457 -19590 -3835 38484 71510 234638 128351 -77643 -221010 -246374 -501468
14082 -501468 -286273 -246403 -275780 -33554 46995 134829 25184 23571 22901 168198 332883
14071 332883 54547 -259333 -126075 -90113 -172308 -200641 -72636 -45448 182676 258947
14061B58947j99653l87056o0866J9004K66229r11j47030J98948J03133q6215N9697
14050B4227K8358K30230o8450L130l57449K0278k463R9982R6103j73573R8883
14039g44j44133l33036q6711N26274L538j62183j57625k4363m6571K63813j60238
14028c21979j97421M1087L1862R8610M1340J0116R7873j07842K12709K10028P9112
14017A95495j29028l48057k64908q8277K39035J19056k31722p5451J3925O6954
14007e02978M40214L20958k21508j44979R7310l72530N6787N00415J23994m22157
13997a24474k10956q7761j69614K85763K75088o4632K35043r1706l17069j13530
13987c83848L23982K6808j57075j02145l2229o682J63061K4282J18193J17128
$$ plain form
14061 258947 59294 -327762 -388628 -369624 -103395 -104306 -251336 -52388 50745 -35470 24227
14050 24227 52585 282815 214365 217495 -139954 -119676 -122139 -22157 73946 -99627 -744
14039 -744 -144877 -477913 -564624 -38350 -34812 -196995 -354620 -378983 -425554 -161741 -321979
14028 -321979 -519400 -478313 -446451 -347841 -306501 -296385 -198512 -306354 -93645 116383 195495
14017 195495 66467 -281590 -546498 -634775 -395740 -276684 -508406 -583857 -569932 -502978
14007 -502978 -62764 258194 36686 -108293 -10983 -383513 -326726 173689 297683 -124474
13997 -124474 -335430 -423191 -592805 -307042 -31954 -96586 138457 46751 -270318 -383848
13987 -383848 -59866 -33058 -190133 -292278 -324507 -331189 -168128 -143846 -25653 91475
13977I1475k95541j63826J36487N07128M0754j32845j16216k81887j96275J7554
13967c93192J69662M12843Q5007k20315j08764J3692j44257J13951N9881J3488
13957A996L3912j35878j7921P8412j33744J36386Q3883J39759r589k98418k64459
13946c85661m7416J02736L07166J25177O6443k29787K27066L4633l86498l26301
13936e12442k33689K843K52922J93774J14734J8996J37899k6211L1137O3781M47078
13925D90822L68101m87957j33689J49079j2003m3529j73227j98307N8539n3840
13915c6011J9754R5787K13100K75360k20706l30653j54973j01973J04076L31389
13905A95150j21913Q6327j6834n0989q7712K77885j45834n46560J49198k642j59057
$$ plain form
13977 91475 -204066 -367892 -231405 275723 316477 183632 67416 -214471 -410746 -393192
13967 -393192 -223530 189313 274320 54005 -54759 -41067 -185324 -71373 -11492 1996
13957 1996 35908 -99970 -117891 -39479 -173223 -36837 47046 186805 177216 -121202 -385661
13946 -385661 -433077 -330341 -23175 102002 168445 -61342 165724 200357 -186141 -512442
13936 -512442 -746131 -743288 -490366 -296592 -181858 -162862 -24963 -51174 -20037 43744 490822
13925 490822 858923 370966 237277 386356 374353 330824 157597 -40710 17829 -36011
13915 -36011 -16257 79530 292630 567990 347284 16631 -138342 -240315 -136239 195150
13905 195150 73237 159564 142730 91741 4029 281914 136080 -410480 -261282 -263924 -422981
13894d22981n2876J5518k90808L36922J34540j19492J55501J92546o9702p1299
13884a92131J38191K0590L6990o6584j00292R480J37523q4111n6214j65947k3641
13873c46146k21194L51551L85606o0327p2834K3896J38736q4708q1597j5673R8307
13862A15617j533m3438k5823K31601j1330J26785O9118Q8559k92080j99533j71418
13851a13475J42858M89957j78791k67247j31789n8691L6673k31335j65084J08211
13841c68713K66635M1519p5280L52240J77625j7159q0397L79270j31052p45546
13831b00858l52094P5532L30688J03830J56179k28760k21857L01632L92096j55964
13821B00424j51344k58643j25765q1878P0581R9525K03212J2722Q8371l9468m94476
$$ plain form
13894 -422981 -475857 -460339 -751147 -414225 -279685 -399177 -243676 -51130 -120832 -192131
13884 -192131 -53940 -33350 3640 -62944 -163236 -153756 -16233 -100344 -156558 -322505 -346146
13873 -346146 -567340 -215789 169817 109490 36656 60552 199288 114580 32983 17310 115617
13862 115617 114084 70646 44823 276424 265094 391879 460997 549556 257476 57943 -113475
13851 -113475 29383 519340 340549 73302 -58487 -117178 -80505 -311840 -476924 -368713
13841 -368713 -102078 -60559 -135839 216401 394026 376867 296470 675740 544688 -200858
13831 -200858 -552952 -477420 -146732 -42902 113277 -115483 -337340 -35708 356388 200424
13821 200424 49080 -209563 -335328 -417206 -346625 -247100 -43888 -31166 57205 17737 -476739
13810d76739j14462J31424P1103K68250N27936K55251m19696l60018J16393J25248
13800A24690j1865j8949P7051J2313J35766J01995m12617l6272K34087q8083J6267
13789A34383L23035J19894O520n9015j36908j58217J66247P5781l31055o5175
13779G5490k0435j48947k0697J20400J38129k5548p9893J54818j34142n85860
13769e26685N4363J05945R7432J12983j71007J47104j40503J73799K89114o0754
13759H1791k89033R4844J93777J06177P6934l06j52615J33059m3176p5941K7848
13748A53359j90297j31820l25555J46912K73205j93502L27931J77269k80523m3931
13738h6952j28674n0548J61561P5953J05828o194j47098n0526k61940r4509J90773
$$ plain form
13810 -476739 -591201 -459777 -388674 -120424 407512 662763 243067 -116951 -558 124690
13800 124690 112825 93876 170927 183240 319006 421001 8384 -27888 206199 118116 134383
13789 134383 457418 577312 583832 524817 387909 229692 395939 471720 140665 75490
13779 75490 55055 -93892 -114589 5811 143940 118392 38499 193317 59175 -526685
13769 -526685 -472322 -366377 -268945 -155962 -326969 -179865 -320368 -146569 142545 81791
13759 81791 -207242 -112398 81379 187556 264490 264184 111569 244628 201452 125511 153359
13748 153359 -36938 -168758 -494313 -347401 -74196 -267698 60233 237502 -43021 -86952
13738 -86952 -215626 -266174 -104613 -28660 77168 70974 -76124 -126650 -388590 -483099 -292326
13727b92326K86122L96125Q2903k7597j8760k34359l25661M6464J65029l8008
13717C9932M7248k34701k43674M4385K44825L4947p3882J76796L77247m9559k13968
13706A49596O931m5050o9918K03626p3306k16808J23820r0741j28493K086p3227
13695b11484K891K07675j17886J16956k65691J50410L27745j14580l14273q2815
13685c01052L0197J87947q3642J16220K56543k19746k19092N2057J12886L94353
13675C26671M6373j92366J27879p9063j83865J53929j3578k97419j39459M4516
13665b06382J89997R2594m38187j88051K30618m8910L78184J6311J41830n4389
13655A13615j67685P5294L77332o8148j86457J83456M24519J51194m7774j92176
$$ plain form
13727 -292326 -6204 389921 472824 445227 426467 192108 -133553 -87089 77940 39932
13717 39932 87180 -147521 -391195 -346810 -101985 -67038 -140920 35876 413123 363564 149596
13706 149596 156527 111477 41559 245185 171879 -44929 78891 -11850 -140343 -138257 -211484
13695 -211484 -208593 -918 -118804 -1848 -267539 -117129 210616 96036 -218237 -301052
13685 -301052 -270855 -82908 -166550 -50330 206213 -13533 -232625 -180568 -67682 326671
13675 326671 373044 180678 308557 229494 45629 199558 185980 -111439 -250898 -206382
13665 -206382 -16385 76209 -361978 -550029 -319411 -368321 9863 26174 168004 113615
13655 113615 -54070 21224 398556 330408 143951 327407 751926 903120 855346 663170
13645F63170j81872j17555k85921q9364J36526R4040j39088j46343Q0975J06959
13635A21527j961K15897k50077k92220l85739J44192J90842k09548K9454J486
13625d36147Q9902j35288J02928j08110k95525M93618J79345r5739k27536o0477
13615d93029R1882L85854K88162J9835K79692q5550m1653M1067k91864l81125
13605a86729J25590L58227r7631m9297M4659K48462L4778m07617p1978p0499j38163
13594b10198o2477M8497Q7642j80749M07995J76018n50157j33016l3340j83336
13584f33121M17213M45529K4038o7270j74148j48469k2376j56710n7337J28875
13574b43776O7363L91863K0184K21783k9723j50454L4848l88805k14101L87481
$$ plain form
13645 663170 481298 363743 77822 -11542 124984 219024 79936 -66407 14568 121527
13635 121527 119566 335463 85386 -206834 -592573 -448381 -257539 -467087 -437633 -436147
13625 -436147 -346245 -481533 -378605 -486715 -782240 -288622 -109277 -205016 -432552 -493029
13615 -493029 -401147 -15293 272869 292704 572396 486846 445193 486260 194396 -186729
13605 -186729 -61139 297088 199457 150160 194819 443281 478059 70442 -1536 -72035 -210198
13594 -210198 -272675 -224178 -136536 -317285 90710 266728 -283429 -416445 -449785 -633121
13584 -633121 -215908 229621 253659 186389 12241 -136228 -158604 -315314 -372651 -243776
13574 -243776 -176413 215450 235634 457417 427694 277240 312088 -76717 -290818 96663
13564I6663p7216q5052j95571j43985K07710K77297k71157k09990L5336J75471
13554a90494K10312J44545J07974K6735Q2871j29845o3803P5775q2115J99992
13544C81947j4715q0029J4608j06675l4274m3782m6939K9921N2667o6499j01931
13533a5701l72180K70724J31141j09405R296L5781J29856P2228j74566K96723
13523B73897K27451j37430k35626j69727L5624m6849o1727L0161j34332j22352
13513c40910K22158n2367R8559M00922j08733n52372J19251L56163P0840M9403
13503B62914l15216j90729L1735L59153l0731j48202q829k27380j13759M14788
13493C3744J42302K24023M9028m3249n09357k40221k95051j33899k2084R7562
$$ plain form
13564 96663 19447 -65605 -261176 -405161 -197451 79846 -191311 -401301 -365965 -190494
13554 -190494 19818 164363 272337 299072 381943 252098 188295 264070 181955 381947
13544 381947 367232 287203 301811 195136 160862 117080 70141 100062 152729 86230 -15701
13533 -15701 -387881 -117157 13984 -95421 -86125 -50344 79512 151740 -22826 273897
13523 273897 501348 363918 128292 -41435 -5811 -52660 -114387 -84226 -218558 -340910
13513 -340910 -118752 -171119 -72560 328362 219629 -332743 -213492 142671 213511 262914
13503 262914 -52302 -243031 -211296 147857 117126 -31076 -39905 -267285 -381044 33744
13493 33744 176046 400069 449097 405848 -103509 -343730 -638781 -772680 -794764 -697202
13483f97202J43123L01384J48675J09497J4934j60337j9777k1644J76075J73621
13473A68349j78385j38910j99127Q3685J87657J04910m5636k4300j90481K70869
13463C8631J64097J55827l44972k96949k88188K28067K10050j67693l7006j3853
13453c51989J71968J65927O9089J1548j18723K86837q1035L8524l4726J00557
13443B57977O6145k42204l04968K45253K29431K4875k7673k10344p6584R6106
13433E8014M64393m2506j28603K180q5026j26635j47557p4668P1423R5854l0672
13422E6197j71056j01987L80497K18945q9962P159J4159n9717L9557j34605j8669
13411A40518j52578p7873j98474j17988p7633L11393J74797J5703J30952k1892
$$ plain form
13483 -697202 -554079 -252695 -104020 5477 20411 -139926 -159703 -181347 -5272 168349
13473 168349 -10036 -148946 -348073 -264388 -76731 28179 -17457 -41757 -232238 38631
13463 38631 202728 358555 13583 -283366 -571554 -343487 -133437 -301130 -338136 -351989
13453 -351989 -180021 -14094 54995 66543 -52180 234657 153622 192146 157420 257977
13443 257977 324122 81918 -223050 22203 251634 276509 248836 38492 -38092 58014
13433 58014 522407 479901 351298 353478 268452 141817 -5740 -80408 -8985 86869 56197
13422 56197 -114859 -216846 163651 382596 292634 299793 313952 254235 293792 159187 140518
13411 140518 -12060 -89933 -288407 -406395 -484028 -172635 2162 17865 148817 126925
13401A26925M8427K521j92620j75879J85644J96903J58577p1765j06464k38394
13391f6125N9209j58489J12062J4163J97488L31999P0536J6206l57971R5626J04742
13380D19446P3484m9873j30031k30464j01873J87095N9286k27026j58845o5917
13370b24718M0922j32370j27451J76588j73889j50236j63119J51372K57717L7907
13360c07277p2804l16982m9322L3767L9113M48706J82363m4476n17498r6790K99337
13349d01863l2187m0740L40872K73688K96359K14201L2305j54684j29619Q3410
13339D81742K43756j47602J45002N386m88241k70659p1006j31957q1r8829K13056
13328a19433K09797J55577k65207J89187K91441k4187k00178k61595J5536j4190
$$ plain form
13401 126925 175352 177873 -14747 -190626 -4982 191921 350498 278733 172269 -66125
13391 -66125 -6916 -165405 -53343 -39180 158308 490307 560843 577049 219078 314704 419446
13380 419446 492930 443057 313026 82562 -19311 167784 227070 44 -158801 -224718
13370 -224718 -183796 -316166 -443617 -267029 -440918 -591154 -754273 -602901 -345184 -307277
13360 -307277 -380081 -697063 -746385 -712618 -673505 -224799 -42436 -86912 -604410 -701200 -401863
13349 -401863 -434050 -474790 -133918 139770 436129 650330 682635 527951 398332 481742
13339 481742 725498 577896 722898 728284 240043 -30616 -101622 -233579 -233660 -332489 -119433
13328 -119433 90364 245941 -19266 169921 461362 437175 236997 -24598 -9062 -23252
13318b3252K00419j63467K4285O6685J10396q0027k51202J01352R3574M59217
13308E37980l61894k45710j77622O0852R7476k2986M62577J82970J74287K80104
13298I88034P1681k08471n41941P5336K96796p8057k5347Q4780j87968l55035
13288A19808j22051j51809K27918o2384j06877j63648N9687N12610K96338O2242
13278F71834j26227k39806K1138J09955j47316k4051j89022j43542k3864J56516
13268F5615k2326p2143j98619Q4528J38580j47713R2973J50850K68826J28714
13258D89285p6112j03751M23131k39145m13859j37079L41708J80621K34514j09588
13248E89725k95328r9473O4012N2745l9359J88938Q293p0350K88489j43357k32441
$$ plain form
13318 -23252 177167 13700 37985 104670 215066 135039 -116163 -14811 78763 537980
13308 537980 176086 -69624 -247246 -186394 -88918 -111904 350673 533643 707930 988034
13298 988034 1059715 851244 309303 384639 681435 603378 578031 662811 474843 119808
13288 119808 -2243 -154052 73866 11482 -95395 -259043 -199356 313254 609592 671834
13278 671834 545607 305801 326939 436894 289578 265527 76505 -67037 -90901 65615
13268 65615 43289 -28854 -227473 -142945 -4365 -152078 -59105 91745 360571 489285
13258 489285 413173 309422 732553 493408 79549 -57530 284178 464799 699313 589725
13248 589725 294397 194924 258936 311681 272322 461260 469553 399203 687692 544335 311894
13237C11894J65911j26302l35978N984Q8049K17579n6794O7456J16665L27392
13227G81856P625n84713m4930J21574J93341K11963K52141P9383k45431l5796
13217G37013j86669l45215l91983p4966L18386J07108q9782q3239p4374K67100
13207A83379o5271J43166J11112K47134O2726j57508J42196J47241k82505k25079
13197C06591K64414J23662m8491p3904j5447K93896K76479R1042r8100J5503l40360
13186G95285m45567O7919Q2109o3761L9637P9504L02546J05287K2309J77829m8379
13175A114718J69121N7417N1839K0445n2251l00354j82482K55537M06676K02931
13165A743597J2578L0825j73005J35368q9578l88658n5113J32190L4823J57365
$$ plain form
13237 311894 477805 351503 15525 21509 109558 327137 270343 337799 454464 781856
13227 781856 789481 204768 159838 281412 474753 686716 938857 1018240 772809 737013
13217 737013 550344 205129 -186854 -261820 56566 163674 73892 -9347 -83721 183379
13207 183379 118108 261274 372386 619520 682246 524738 666934 814175 531670 306591
13197 306591 571005 694667 646176 572272 556825 850721 1127200 1218242 1120142 1135645 795285
13186 795285 349718 417637 499746 435985 475622 555126 857672 962959 985268 1163097 1114718
13175 1114718 1283839 1341256 1393095 1413540 1361289 1060935 878453 1133990 1540666 1743597
13165 1743597 1756175 1787000 1613995 1749363 1659785 1271127 1216014 1348204 1383027 1540392
13155A540392K83001j45150k27040P8143K04010m5956J15995l6894k70987k20732
13145A274782j61123o1619k13170J34944J2057j13260p7744K75770O40207j59588
13135A551256k833L17322k28515k52528l35052J96809J44195l07761k72151n1832
13125G58910L06755J74658R2317K1449j27800J77233K727q7451j82859j84638
13115I51301J21799J27533k05489k74324M240M9298K45962q8779p5376k69510
13105E86655n9608J49721j6994m1727K62088o7992l92072J65385M56701k7739
13095A014418j64520j31263J8880J6548L8649J86208k50599o124K30903J34259
13085A087359j75141j5055j18284n4089J16970O0178j74389j46716j72402L40263
$$ plain form
13155 1540392 1823393 1678243 1451203 1529346 1733356 1687400 1803395 1766501 1495514 1274782
13145 1274782 1113659 1052040 838870 973814 985871 872611 794867 1070637 1710844 1551256
13135 1551256 1548423 1865745 1637230 1384702 1049650 1246459 1390654 1082893 810742 758910
13125 758910 1065665 1240323 1332640 1354089 1226289 1403522 1406249 1318798 1135939 951301
13115 951301 1073100 1200633 995144 720820 725060 774358 1020320 931541 856165 586655
13105 586655 527047 676768 659774 618047 880135 812143 420071 585456 1042157 1014418
13095 1014418 849898 718635 737515 754063 792712 978920 728321 722197 953100 1087359
13085 1087359 912218 897163 778879 724790 841760 901938 727549 580833 408431 748694
13075G48694K09271k06298J55354k58176J8028J30914l66072j16945K20045q345
13065E26470k40815J14823k5248j37986k23087l0181L24274M2957K23609P2892
13055F47708J20973J5695p8144j85018j17145R3589N2986l16359j77963l4630
13045B1692L27323K6031J4542k43705l71126j02444j26411m74938J31900L29691
13035d67445O56520M33019l36832m91356K73437J63299M7462k4807L03978j12727
13025D44548n46284j29127L9840Q5675J00948J85245m9255M8382J37473J22012
13015D39457j35518L9333M5846j32039k08554k08926N424J78291m3533J63562
13005A43343K22908j19002j16388k72120k741j31802j28962J52382J92841l23634
$$ plain form
13075 748694 957965 751667 907021 648845 666873 797787 431715 314770 534815 526470
13065 526470 285655 400478 375230 237244 14157 -16024 308250 351207 574816 647708
13055 647708 768681 784376 706232 521214 404069 497658 550644 234285 56322 21692
13045 21692 349015 375046 389588 145883 -225243 -327687 -454098 -929036 -797136 -467445
13035 -467445 189075 622094 285262 -206094 67343 230642 278104 253297 557275 444548
13025 444548 -101736 -230863 -191023 -105348 -4400 180845 131590 179972 317445 439457
13015 439457 303939 343272 389118 257079 48525 -160401 -154977 23314 -20219 143343
13005 143343 366251 247249 130861 -141259 -144000 -275802 -404764 -252382 -59541 -383175
12995c83175j93158J75222Q5834Q5763K71035q6576n4175m4627j04152J69806
12985g8203K46725n9788j05625J6893M2499r7149j10243J88539Q5460m5425q5598
12974a915L13109p2175k10583J42701j5369J99310Q0769o7454k7878k85754J8811
12963G3572R9527m6809j25233j06135j97457j05505J95773J30936N8764J13009
12953I0442p5138P9872O4728j93787k85390J60451M04842J28952n2552O2247L7676
12942D22343m4497j44403O8960K86783J84996j90869j85842k4923n6705j59053
12932A56790j19679n0888L8179j20482j58226L14442N1149k45037j33635j42750
12922d10137K25435L87893O7975k96689j2330j23289k86926J63531O01777Q5090
$$ plain form
12995 -383175 -576333 -401111 -315277 -229514 41521 -45055 -99230 -143857 -248009 -78203
12985 -78203 168522 108734 3109 20002 62501 -34648 -144891 43648 129108 83683 -1915
12974 -1915 311194 239019 28436 171137 155768 355078 435847 368393 340515 54761 73572
12963 73572 173099 126290 1057 -105078 -302535 -408040 -212267 -81331 -22567 90442
12953 90442 15304 95176 159904 -33883 -319273 -158822 246020 374972 322420 384667 422343
12942 422343 377846 233443 302403 589186 774182 583313 397471 372548 315843 156790
12932 156790 37111 -13777 24402 -96080 -254306 60136 111285 -133752 -267387 -410137
12922 -410137 -184702 203191 271166 -25523 -37853 -161142 -448068 -284537 317240 402330
12912D02330j60099p6616K01465j71803k30568K1075J2395j07841m67434P0678
12902e06418j06684K12372L31518P9070K52627J52304l1948K0232O1734J8424
12892D83231l31381j52081J68491N1325P5671M03120R9731j35124k22609m4698
12882C95676q3799o8180r6953k9668K4415j04255m1763l52714R1952N4966k6978
12871b37301N2064j32521J26669L43664o9059n058r7543o7857p1016k1811k7589
12860b07358M11790o4m42261j44958J3761K89151P4542p4740k45704j63498K77628
12849b11711L65288l782j87446J44050K50424J8288R2071M974J22893j01206j38217
12838C55626L5276m57836l9542K48670J22035j14795K28354J30566l79229M3489
$$ plain form
12912 402330 242231 165615 367080 195277 -35291 -14216 -1821 -109662 -577096 -506418
12902 -506418 -613102 -400730 -69212 9858 262485 414789 382841 403073 464807 483231
12892 483231 151850 -231 168260 219585 295256 698376 798107 662983 440374 395676
12882 395676 311877 243697 146744 117076 141491 37236 -4527 -357241 -265289 -210323 -237301
12871 -237301 -185237 -317758 -191089 152575 83516 78458 -19085 -86942 -157958 -179769 -207358
12860 -207358 204432 204368 -237893 -382851 -369090 -79939 -5397 -80137 -325841 -489339 -211711
12849 -211711 153577 149795 -37651 106399 356823 375111 467182 472156 595049 493843 355626
12838 355626 390902 -66934 -106476 142194 264229 149434 377788 508354 129125 172614
12828A72614M7515j1369O0172j65848K59792k84608N788k53571j29771p5573P9934
12817b94925R9403J2774j82710J59846k09274L0185n212q2631J82083q0604N2374
12806c18691n0756K20313L30183j90681r6020J2592q7471J49759Q6034q7312o8834
12795a00884n7397J29600L02384m636j72739j14584J58218q6091j62746k02811
12785c11686J91703J76220P7120j40567L28254j45527k8320J26264R7007j37574
12775B32894j45295j3582k58196k15575J91840K64163n2491k29344J4597l63624
12765e74613J09516L09414L24362N0439k86347J73503L28728J69090k60373j47631
12755A96088j85658k04973Q912Q7794O0546j25111Q7072q0127N268K01110j42088
$$ plain form
12828 172614 220129 208760 268932 103084 362876 78268 84056 -169515 -299286 -374859 -294925
12817 -294925 -195522 -182748 -365458 -205612 -414886 -384701 -389913 -472544 -290461 -371065 -318691
12806 -318691 -369447 -149134 181049 -9632 -105652 -93060 -180531 -30772 55262 -32050 -100884
12795 -100884 -158281 -28681 273703 269067 96328 -18256 139962 53871 -108875 -311686
12785 -311686 -119983 56237 133357 -7210 321044 175517 147197 273461 370468 232894
12775 232894 87599 74017 -184179 -399754 -207914 56249 3758 -225586 -210989 -574613
12765 -574613 -465097 -155683 168679 219118 -67229 106274 435002 604092 343719 196088
12755 196088 10430 -194543 -185631 -97837 -37291 -162402 -75330 -155457 -150189 50921 -91167
12744i1167j61263k97921J51974K51259K74789n1606l45061L6447Q4663L99397
12734B51511k9953l61871n40415j84968K24637L16900J11340K5222P5186K39213
12724A26802K53418J13939j66923j38419m2388k21641K5582J34119O7438k9420
12714A22507J59165n053j05390P6496n2331j73662K10677l4085k70293Q5032P1721
12703H4784L2727N5990j23808j78360r5109J77326k78542m4622K11904K49890
12693I2180l2939j43833P3791m241j48608j84187R7153K96043J31790Q808J47942
12682C33899R192k72821j21843M056J63488K2925n2675N5265K7817j36951P1410
12671A03762k2040J5332j00244L67316K84195k67779l05155J42354l1728j54435
$$ plain form
12744 -91167 -252430 -550351 -398377 -147118 127671 76065 -268996 -232549 -147886 251511
12734 251511 221558 -140313 -680728 -865696 -641059 -324159 -212819 -187597 -112411 126802
12724 126802 380220 494159 327236 188817 146429 -75212 -49630 84489 151927 122507
12714 122507 281672 276619 171229 247725 195394 21732 232409 198324 -71969 13063 84784
12703 84784 117511 173501 49693 -128667 -223776 -46450 -324992 -369614 -157710 92180
12693 92180 59241 -84592 -10801 -15042 -163650 -347837 -250684 45359 177149 185957 333899
12682 333899 343091 70270 -51573 -47517 115971 138896 86221 141486 169303 32352 103762
12671 103762 81722 97054 -3190 364126 648321 380542 75387 217741 186013 31578
12661C1578J90014J74525j94356j19959K68484O0864k39785l34618J00111P4855
12651A1713J24536L18393m4913l70422j00216J40271J77869R0153J24051j49491
12641C21944j38257J43133J02455O6571j92771l1255L01230o264j56462j87257
12631B23067j48151r2794K68636L4736j95833r7515L6269K35692j17202m1516
12621A05389K45170M7006j20119K10700N7074q343j37760k32804m0549j92909
12611f7145R8783J71950O4371R5071L0958j36177J13827J39393k01861j904J92887
12600E00153N7464k11277k15936j28844K78374J62311l87643k46528K21094N13032
12590E42200J0611R7796j6099o4952k67343J72627J10203k47388j58974j40337
$$ plain form
12661 31578 221592 396117 201761 81802 350286 411150 171365 -163253 -63142 11713
12651 11713 136249 454642 409729 39307 -60909 79362 257231 347384 471435 321944
12641 321944 183687 326820 429275 495846 303075 271820 573050 566786 410324 223067
12631 223067 74916 -17878 250758 285494 89661 -7854 28415 264107 146905 105389
12621 105389 350559 397565 277446 488146 545220 536877 399117 166313 125764 -67145
12611 -67145 31638 203588 267959 363030 393988 257811 371638 511031 309170 307266 500153
12600 500153 557617 346340 130404 1560 279934 442245 54602 -191926 29168 542200
12590 542200 552811 650607 634508 569556 302213 474840 585043 337655 178681 38344
12580C8344n4315L66105J17888m63252j3072J87996j76701m89874K074J43370
12570c41437K67522K12757j49978j69778P6988L43979M95832j2210k44930j17384
12560C61361m0589j2665O6879K75878j16318k97753j20925j16582q3300L8746
12550d5268Q6636k60145j63728L8805K63050P3381j20965j40258N49073L24679
12540F05260j19741J40623J44586q8578m9320l26165J61951N27777N6333j35515
12530I17211m45504O6763l1150k11413p6684k55127j22021L61212J03607r5957
12520B10937l24386k11865R5719L85072K75973k4927n9237o9208j60415P0488
12510A88151k9391J37274N9128j11164l2370Q0541N85407L0690l31319l81711
$$ plain form
12580 38344 -15971 350134 468022 4770 -8302 179694 2993 -486881 -484807 -341437
12570 -341437 -73915 138842 -11136 -180914 -103926 240053 735885 723675 478745 361361
12560 361361 320772 308107 374986 650864 534546 236793 115868 -714 -84014 -45268
12550 -45268 41368 -218777 -382505 -343700 -80650 -7269 -128234 -268492 280581 605260
12540 605260 485519 626142 770728 682150 632830 306665 468616 996393 1052726 917211
12530 917211 471707 538470 507320 295907 219223 -35904 -157925 203287 306894 210937
12520 210937 -113449 -325314 -229595 155477 431450 406523 347286 278078 117663 188151
12510 188151 158760 296034 355162 243998 211628 292169 877576 908266 576947 195236
12500A95236j50662j38274O7174N3949o550J72635K72553j22796k46767k13872
12490a17374j5930J54297K10393P2196j22257k13673Q6300M80165K59442N8011
12480H51570k352l2811L44534J25317l13157k40997l4443j41436j82486q6554
12470B87185k2851k36824m7851J45325L66260N714M34891J0327l74357m98806
12460F9013j45361J21805J70617M4067J31156J2144n8113k369J29074K18055k55449
12449D34639k11880l24118l32910q224J02157M26225M37505J18629l18235p4547
12439B49241L34452Q877p6072o6630L52858M5713j47540K6104o6627m6936L6238
12428F49678q9168K0883O6540j8378k32619m9939l0496K97834j56528k37170J38525
$$ plain form
12500 195236 44574 -93700 -26526 27423 20873 193508 466061 343265 96498 -117374
12490 -117374 -133304 20993 231386 303582 181325 -32348 53952 534117 793559 851570
12480 851570 849218 816407 1160941 1286258 973101 732104 697661 556225 373739 287185
12470 287185 264334 27510 -20341 124984 491244 496958 931849 942176 567819 69013
12460 69013 -76348 45457 216074 260141 391297 403441 345328 342959 472033 690088 434639
12449 434639 222759 -101359 -434269 -442493 -340336 85889 523394 642023 323788 249241
12439 249241 583693 592570 516498 449868 802726 848439 700899 727003 660376 613440 649678
12428 649678 560510 581393 647933 629555 396936 346997 316501 614335 457807 220637 359162
12417C59162M41867M48503r956k97202k75521j97610L36843l9428K817l66608
12407D02867k71538J11930L4578K48312M9623l4803J24580o133m0943J18443J44615
12396H81531J56214J64671k80598J04393l62525n12839P7691m1290j85490J5208
12386A6966J0299L79032K75725L22457L8797m23314r7165O2625k8440l36993k05024
12375A4965p8924K66256L22344J64949P9899k78006o4309J71970j8523j28513
12365D52108n7837k42632j9133L52633r7244j97285L04347J15975p3673J57426
12355F94685p0787M1780J06607K87471k13690l35353R1763N0211k4908r6694J73751
12344G04836l2007j68871K05717K8945k10809n9768L16391K10553l60506J65510
$$ plain form
12417 359162 801029 1249532 1239576 942374 666853 469243 806086 766658 769475 402867
12407 402867 131329 243259 277837 526149 575772 540969 665549 659416 618473 736916 881531
12396 881531 1037745 1202416 921818 1026211 663686 150847 228538 187248 1758 16966
12386 16966 27265 406297 682022 1004479 1043276 619962 522797 585422 556982 219989 14965
12375 14965 -63959 202297 524641 689590 769489 491483 427174 599144 580621 452108
12365 452108 394271 151639 132506 485139 387895 190610 494957 610932 537259 694685
12355 694685 623898 665678 772285 1059756 846066 510713 602476 652687 627779 531085 704836
12344 704836 672829 503958 709675 738620 527811 468043 784434 994987 634481 799991
12334G99991J22975J6078k85402j33077j6656q390J76563j16929l38477J59725
12324C76401J41501j09761M06247M30943P3458l71958j44317J01760M00141K26037
12314A530452m6645k1323O2885P4393m17444l34791j1791l2338K87897K92903
12304A384198r3165l63976N0670L04956O0871l75980P7748J81370n7588k73331
12294H95773o5747m1000j24319j62049J66412k79956j68220N6819N67119K58622
12284A103454M2202L0938K50430j00322j12998L90997k82347l22808j87756K2914
12274H34704K55769L83389m6506K11678K3720j38706k20583J0281j7952m3677
12264A252117o076J76337l1508j56939J39287L19521L31006N2728q6881l88558
$$ plain form
12334 799991 922966 939044 653642 520565 503909 495519 672082 555153 216676 376401
12324 376401 517902 408141 814388 1245331 1318789 946831 802514 904274 1304415 1530452
12314 1530452 1483807 1462484 1525369 1599762 1182318 847527 835736 803398 1091295 1384198
12304 1384198 1291033 927057 977727 1282683 1343554 967574 1045322 1226692 1169104 895773
12294 895773 830026 789026 664707 502658 669070 389114 220894 277713 844832 1103454
12284 1103454 1145656 1176594 1427024 1326702 1213704 1604701 1322354 999546 811790 834704
12274 834704 1090473 1473862 1427356 1639034 1662754 1524048 1303465 1313746 1295794 1252117
12264 1252117 1246041 1422378 1390870 1233931 1373218 1692739 2023745 2076473 1989592 1601034
12254A601034m01035N3119Q7049K71432j42641Q5045j08300k04640j85564K04362
12244A259861M69302J02700k5519j40466q8265j0742r0360p1189j2355J31718
12234A524685L7629j0859J92262J3765j2912l64385p1942R4645j46158l3787l7820
12223A185123m805J53542m1290j52162m104j35544J76044r282j70853K74291M23021
12212A693981J58658J53127l75933l70739k45918J24053J92664J77323L33353
12203A840569o336j96336k50530J58923K77704j36970q7895L4287k28510K10760
12193A615666L24984J7761J75756M43689P4547j31323P657r5927q9450J50076
12183B493436K5069o951m15702j42556J00217P6604j5407k86174l4309K54018
$$ plain form
12254 1601034 1199999 1253118 1340167 1611599 1468958 1554003 1445703 1241063 1055499 1259861
12244 1259861 1729163 1831863 1806344 1665878 1577613 1566871 1476511 1405322 1392967 1524685
12234 1524685 1562314 1551455 1743717 1757482 1744570 1380185 1308243 1402888 1256730 1222943 1185123
12223 1185123 1180318 1333860 1292570 1140408 1136304 1000760 1176804 1167522 996669 1270960 1693981
12212 1693981 1852639 2005766 1629833 1259094 1013176 1137229 1329893 1507216 1840569
12203 1840569 1834233 1637897 1387367 1546290 1823994 1687024 1599129 1633416 1404906 1615666
12193 1615666 1940650 1958411 2134167 2577856 2652403 2521080 2528737 2432810 2343360 2493436
12183 2493436 2518505 2511554 2095852 1953296 2053513 2130117 2114710 1828536 1794227 2048245
12173B048245J47485j21380k22891R9981L14757o5161Q745J16257J44537N54781
12163C025356J22017r8589j84970O1283J8826J8099k32154j68792M56445P6508
12153C094029M335K1646j08912k42461J01640K87948K41553J78357k40012k00815
12143C137308l2453J35871J04190M3883q9137l31712m5548P3083K32692j0198
12133C217979k45407K87223L44397Q0470m69610J63417J65211m53867l3722L18452
12123C374543J90684J61227J48307j46816j57637K31735M50721O3639k64234k02879
12113C849290k42600m0273J30453o0542l33819M2552K06474L93569J95475J33495
12103D274074k18095l89344R1656m4669L15882K79323K24123L18701L96911q0708
$$ plain form
12173 2048245 2195730 2074350 1851459 1951440 2266197 2201036 2209781 2326038 2470575 3025356
12163 3025356 3147373 3048784 2863814 2925097 2943923 2962022 2729868 2561076 3017521 3094029
12153 3094029 3098364 3120010 3011098 2768637 2870277 3158225 3399778 3578135 3338123 3137308
12143 3137308 3104855 3240726 3344916 3388799 3299662 2967950 2922402 2995485 3228177 3217979
12133 3217979 2972572 3259795 3604192 3684662 3215052 3378469 3543680 3089813 3056091 3374543
12123 3374543 3565227 3726454 3874761 3727945 3570308 3802043 4252764 4316403 4052169 3849290
12113 3849290 3606690 3566417 3696870 3636328 3302509 3345061 3551535 3945104 4140579 4274074
12103 4274074 4055979 3666635 3758291 3713622 4029504 4308827 4532950 4851651 5248562 5167854
12093E167854l28591n09901k13220J77321J67545L04749J66194j6470r5387j82167
12083D637927K24331j28311j72148M24572N03657k19831j75707J24757j49158
12074E070089L34886J15222j90627K28409k74524q9291K185M68578L40859j39617
12064E866169j87770l2573J06087K62134j10656M8427K92951J8846J91989p0727
12054F384877n76768M4153L40143L02878L9045r2448l2419L05375L87385J27973
12044G230194L61758L61269n8333j0811K28151m8815l55150O5226L61564j39545
12034G995508j22359L61173M60150K87790K9331m6945J84386L35840j4787J79748
12024I649835J29342K11627K18842R1694K65709J8306K92280J13767M99571M16506
$$ plain form
12093 5167854 4839263 4329362 4116142 4293463 4461008 4765757 4931951 4915481 4820094 4637927
12083 4637927 4862258 4733947 4561799 4986371 5490028 5270197 5094490 5219247 5070089
12074 5070089 5404975 5520197 5329570 5557979 5283455 5194164 5196349 5664927 6005786 5866169
12064 5866169 5678399 5645826 5751913 6014047 5903391 5951818 6244769 6263615 6455604 6384877
12054 6384877 5808109 5852262 6192405 6495283 6534328 6441880 6409461 6714836 7102221 7230194
12044 7230194 7591952 7953221 7894888 7884077 8112228 8063413 7708263 7773489 8135053 7995508
12034 7995508 7873149 8234322 8694472 8982262 9011593 8964648 9149034 9484874 9470087 9649835
12024 9649835 9779177 9990804 10209646 10301340 10567049 10585355 10877635 10991402 11490973 11907479
12014A1907479J76746K48859L54495K66525M62547N6558K97097Q1528J41748J72856
12004A4166438K40354M68697N02288M08061M83018M72490N04653L32110K31321
11995A7809430M08001L64275N42998N72895M13069J09202N44842J048125M07199
11986B2220036L16607N69218Q55801P09329O25185Q12379P14586N39143P40712
11977B8102996Q13568R72581P00994Q96908Q71487P32298P95985R32324J317015
11968C6136156J238142J291674J201883J524295J387067J221617J259839J390262
11960D6650935J472416J500715J617716J631189J587626J437664J408825J715615
11952E9022701J852337J770867K289662K327572J994061J579693J695018J871125
$$ plain form
12014 11907479 12084225 12333084 12687579 12954104 13416651 13473209 13770306 13851834 13993582 14166438
12004 14166438 14406792 14875489 15377777 15785838 16268856 16741346 17245999 17578109 17809430
11995 17809430 18217431 18581706 19124704 19697599 20110668 20219870 20764712 21812837 22220036
11986 22220036 22536643 23105861 23961662 24670991 25296176 26108555 26823141 27362284 28102996
11977 28102996 28916564 29889145 30590139 31487047 32358534 33090832 33886817 34819141 36136156
11968 36136156 37374298 38665972 39867855 41392150 42779217 44000834 45260673 46650935
11960 46650935 48123351 49624066 51241782 52872971 54460597 55898261 57307086 59022701
11952 59022701 60875038 62645905 64935567 67263139 69257200 70836893 72531911 74403036
11944G4403036J964228J647618J645159J587858J928620K015967J597524J454929
11936H8244939J877039J634387J401322J302755J314630R43284P48979O44876
11928I8112211N20834N81165N68218Q2432m3217l63727r51534o27065j124625
11919I6754692j106532j289703j202152j226814j275070j471929j651548j354908
11911H6176036k191914k007521j525579j652033j898033k028942k066042k244865
11903G0561107k013409j672249j666886k003907j816366j808239j458293j640770
11895E6480988j608092j394932j452280j106333j671275j869042j280712r63434
11887D5134888j266275j316583j330248r47961r74647j070988j259895j320333
$$ plain form
11944 74403036 76367264 78014882 79660041 81247899 83176519 85192486 86790010 88244939
11936 88244939 90121978 91756365 93157687 94460442 95775072 96718356 97467335 98112211
11928 98112211 98633045 99214210 99782428 99864860 99821643 99457916 98506382 97879317 96754692
11919 96754692 95648160 94358457 93156305 91929491 90654421 89182492 87530944 86176036
11911 86176036 83984122 81976601 80451022 78798989 76900956 74872014 72805972 70561107
11903 70561107 68547698 66875449 65208563 63204656 61388290 59580051 58121758 56480988
11895 56480988 54872896 53477964 52025684 50919351 49248076 47379034 46098322 45134888
11887 45134888 43868613 42552030 41221782 40273821 39299174 38228186 36968291 35647958
11879C5647958r09109p73940q54100j080440j120091p41299p49479q85585n60635
11870B7973280p24781n13687n73528o21184j002499n58758l65820l99302n33654
11861B2680067l67427m24902q25026m06249l49396p49795m99038n62887k73001
11852A8222346n81618k49134j68268o00719n86035j97997j28425k91847j89988
11843A5228315r5546j60060l55015k50362k7919k80915m53175l32079j44534l65632
11833A2763078l36622l77239m17481j41468j56640k54229n52456k15077L20606
11824A0632472M649j18404l69542m10940j16378k66073j35012p0527j37820j97229
11814H815196j3n1486k11957p1583J49133j08491r1773m57410m99895O3742o7492
$$ plain form
11879 35647958 34738849 33964909 33110809 32030369 30910278 30168979 29419500 28533915 27973280
11870 27973280 27248499 26734812 26161284 25540100 24537601 23978843 23613023 23213721 22680067
11861 22680067 22312640 21887738 21062712 20656463 20307067 19557272 19058234 18495347 18222346
11852 18222346 17640728 17391594 17223326 16622607 16036572 15838575 15710150 15418303 15228315
11843 15228315 15132769 14972709 14617694 14367332 14339413 14058498 13605323 13273244 13128710 12763078
11833 12763078 12426456 12049217 11631736 11490268 11333628 11079399 10526943 10311866 10632472
11824 10632472 10637121 10518717 10149175 9738235 9621857 9355784 9220772 9150245 9012425 8815196
11814 8815196 8815183 8763697 8551740 8480157 8629290 8520799 8429026 7971616 7471721 7535463 7467971
11803G467971m05091q3029N1617j64115N4313M487n23137o602N7024j05437K3791
11792F371792l1393l71509K02699M0463P6033k54236R0110r1915J83944j2989
11782F202999k29422j35449j97323J82690j70059o41211L4246K31623j48884l91613
11772D737597N5131j81668J88455j3133l34976j06846j69324K45915j4647j97346
11762D209158k29418J9106Q0282j55406n5654k433q1183k35048J91863L49886
11752D091153K12238j9994l9176K35733j87636r369j60466k99061j1179N8184
11742C870427M7172j85276L5368J18488j90244l49711Q8602K17459j29145Q398
11732C531538k65981O6808K59953J61514l10485l82712Q8501P0938j78486J21671
$$ plain form
11803 7467971 7062880 6979851 7031468 6867353 6921666 6926153 6403016 6396414 6453438 6348001 6371792
11792 6371792 6340399 5968890 6171589 6212052 6288085 6033849 6123959 6032044 6215988 6202999
11782 6202999 5973577 5838128 5640805 5823495 5653436 5012225 5046471 5278094 5129210 4737597
11772 4737597 4792728 4611060 4799515 4786382 4451406 4344560 4175236 4421151 4406504 4209158
11762 4209158 3979740 3998846 4079128 3923722 3868068 3865635 3784452 3549404 3741267 4091153
11752 4091153 4303391 4283397 4244221 4479954 4292318 4282949 4122483 3823422 3812243 3870427
11742 3870427 3917599 3732323 3767691 3886179 3695935 3346224 3434826 3652285 3523140 3531538
11732 3531538 3265557 3332365 3592318 3753832 3443347 3060635 3149136 3220074 3041588 3163259
11722C163259j92179K8075J79120J72696j54375J08717M1280l15540j43798l51380
11712B535875j11727O6172p3966J5915L13002K77236m8089k99109j73350N732
11702B507691M7081K72873j59494j22349J6162J28136p5965K6798k2336q2426
11692B536171j2141L2408l2747K40L4112N9133r9140j49960J76622J75751K57059
11681B977508K89762R541k76390o2896J90023J01300p522P5859M54490J18627
11671C870302R6686M39588K46512M81809M04948L1341K83068K95220K99947M63613
11661F913034L98606O91656P75271O44901P67551P16012Q47351J354620J651769
11652A4760771J643477J368515J906865J968484J815570J631090J049549O05837
$$ plain form
11722 3163259 2971080 2999155 3178275 3350971 3196596 3305313 3346593 3031053 2887255 2535875
11712 2535875 2424148 2490320 2416354 2432269 2745271 3022507 2974418 2675309 2501959 2507691
11702 2507691 2554772 2827645 2668151 2545802 2561964 2690100 2614135 2640933 2618597 2536171
11692 2536171 2524030 2556438 2523691 2523931 2558043 2617176 2518036 2368076 2544698 2720449 2977508
11681 2977508 3267270 3276811 3000421 2937525 3127548 3228848 3221326 3297185 3751675 3870302
11671 3870302 3966988 4406576 4653088 5134897 5539845 5571186 5854254 6149474 6449421 6913034
11661 6913034 7311640 8003296 8778567 9423468 10191019 10907031 11754382 13109002 14760771
11652 14760771 16404248 17772763 19679628 21648112 23463682 25094772 26144321 26750158
11644B6750158l23834p51732j135885k002282k162478j860158j939428j524094
11636A5050267j772390j189561r11830j484416j342399p68434p31457m97243l23989
11627F028548m13867m55106k55553l12307n24855n56772r8830j20693M531j12189
11617C182907l91926k39252N1888k62825j8342J8008j91273k1937J63103J29751
11607B420102J20314J67796j22628p809M5852j91122l89936p6639j78433J51914
11597A939411J42584j19365k11411J28627J71623L47385k67826m15774p254K49643
11587A957643J0040j45755q3400j27603J52183j24560l12636q5874K76698L26936
11577A843672k44886l66998L65300O7083k44772j18439L2381n4243l13341n9474
$$ plain form
11644 26750158 26426324 25674592 24538707 22536425 20373947 18513789 16574361 15050267
11636 15050267 13277877 12088316 11176486 9692070 8349671 7581237 6849780 6352537 6028548
11627 6028548 5614681 5159575 4904022 4591715 4066860 3510088 3411258 3290565 3295096 3182907
11617 3182907 2790981 2551729 2603617 2340792 2322450 2340458 2149185 2127248 2290351 2420102
11607 2420102 2540416 2708212 2585584 2577775 2623627 2432505 2042569 1965930 1787497 1939411
11597 1939411 2081995 1962630 1751219 1879846 2051469 2398854 2131028 1715254 1708000 1957643
11587 1957643 1967683 1821928 1738528 1610925 1763108 1638548 1325912 1240038 1516736 1843672
11577 1843672 1598786 1231788 1597088 1664171 1419399 1300960 1333341 1279098 965757 906283
11567I06283K44890O09758J02163k50135O7762j78181j39689K30362K84065Q6921
11557A964199o5514l93713j29731r4414J32223J84379k01563j28277M508q922
11547A263175J92192q5297K5533j22366P8159j03206L33096J47720k28745K12515
11537A712776P733k7601J75095j2166R3666M3037j00676P6681J22672L35461p9127
11526B347551k5068l47778m11373K3508K59053j01312l95608K317j8912j05056
11516A227322m9846J46910L43034j24313j42156J4448l9790L0191m5525k78369
11506A081906P7585K28095M4515J05102K9335Q2324L3912m9349l5406k51258l7750
11495A309011K06281J24714k81787l4083K48123Q819J01720j25322Q9661K0706
$$ plain form
11567 906283 1151173 1760931 1863094 1612959 1680721 1502540 1362851 1593213 1877278 1964199
11557 1964199 1898685 1504972 1375241 1280827 1413050 1597429 1395866 1267589 1272097 1263175
11547 1263175 1455367 1370070 1395603 1273237 1351396 1248190 1581286 1729006 1500261 1712776
11537 1712776 1720509 1692908 1868003 1855837 1949503 1992540 1891864 1968545 2091217 2426678 2347551
11526 2347551 2322483 1974705 1563332 1586840 1845893 1744581 1348973 1351290 1332378 1227322
11516 1227322 1177476 1324386 1667420 1543107 1400951 1415399 1375609 1405800 1360275 1081906
11506 1081906 1159491 1387586 1432101 1537203 1566538 1648862 1682774 1633425 1598019 1346761 1309011
11495 1309011 1515292 1640006 1358219 1324136 1572259 1581078 1682798 1557476 1647137 1667843
11485A667843N9018J28k37386j42009L01070R6289N8192l19594l27296j91224
11475I65031k19081l69044l25544L01053K95739R828q88J69431j48627J03284
11465G81182j1564r5026M7347K08738j98010o9495J35075K68722k32248k46287
11455E88434L17211o3809k16322J7604J51080J15350m06312q7131K48953K71673
11445I36731j86819J52590J38306K45833q3568m38524k91435m9696K98605J08971
11435H30994q118R2745r0636M8160J0486M49935K02905L1330l84133m06091q2232
11424F95345J78076n1651R0168l7595J97023L7357k40995j71798P1715j09839
11414F57806j69679R3856K46024O1455l03775k75794J03433P7568J21428P700
$$ plain form
11485 1667843 1726861 1726989 1489603 1347594 1648664 1744953 1803145 1483551 1156255 965031
11475 965031 745950 376906 51362 352415 648154 657982 657094 826525 677898 781182
11465 781182 769618 674592 721939 930677 732667 663172 798247 1066969 834721 588434
11455 588434 905645 841836 625514 643118 794198 909548 503236 416105 665058 936731
11445 936731 749912 902502 1040808 1286641 1203073 764549 473114 423418 722023 830994
11435 830994 822876 915621 824985 873145 883631 1333566 1536471 1567801 1183668 777577 695345
11424 695345 873421 821770 911938 874343 1071366 1108723 867728 695930 767645 657806
11414 657806 488127 581983 828007 889462 585687 309893 413326 490894 612322 620022
11404F20022k63221o8416K15626N4661j2330N5305L9620k26823Q4226k38365K4027
11393B84332L86471L86667J65682j05861l30101j38572K17936N0963O9518j25058
11383H61977J04447P841J05988J67997k39399l46607k51440j16917K17194P8122
11373E89203M3390R8234m3634J33031n628j0081k09249m6175J8456m1987k31690
11362B93870m52987J49596L56445p7944p0324J11924K44773L7003r6333L3454
11352E29477j22821l53365J49938J44388k41807j86105o6521q0705J51567L48382
11342B72428J76545P660k25373k03386L48874P3901K91648m6551m74409j36540
11332H4797K2770J05993J17253O7399Q0682N9661M7524K38361K99032m6013j8807
$$ plain form
11404 620022 356801 288385 504011 558672 546342 601647 641267 414444 498670 260305 284332
11393 284332 670803 1057470 1223152 1117291 787190 648618 866554 917517 987035 861977
11383 861977 966424 974265 1080253 1248250 1008851 662244 410804 293887 511081 589203
11373 589203 632593 730827 687193 820224 814596 804515 595266 549091 567547 525560 293870
11362 293870 -159117 -9521 346924 268980 198656 310580 555353 592356 496023 529477
11352 529477 406656 53291 203229 347617 105810 -80295 -146816 -227521 -75954 272428
11342 272428 448973 456633 231260 27874 376748 450649 742297 695746 221337 84797
11332 84797 107567 213560 330813 398212 478894 538555 586079 824440 1123472 1077459 1058652
11321A058652q5416J37619J6606l41489L094r882P9923J8109m07619k18485n9369
11310A91743J11065l5408M8059k13900M5818j1790K85399l7653o6373q1019M1364
11299B77305j0578l13311J86233M9194L5765l7551j69828J38905Q0069J0579l435
11288B43347k48076l1561J91006L25468m8795j56681k66854q0054J76664N25480
11278F29944n8636j61555Q2870j44940j97944k03748J85811L65456K5977R86k9467
11267D94754n294Q8808J98933k69032k74639l69875K90959k402j80741l78386
11257d06915o278K40885J67514J56119j31532n3845J65475m0064p2165J7061o2414
11246b6159J5077L39896j47185J37057O5555n2071k18513J55270J25146k04966
$$ plain form
11321 1058652 973236 1110855 1127461 785972 789066 779184 859107 877216 469597 251112 191743
11310 191743 302808 267400 315459 101559 147377 135587 420986 383333 316960 235941 277305
11299 277305 266727 -46584 139649 188843 224608 187057 17229 156134 236203 246782 243347
11288 243347 -4729 -36290 154716 480184 431389 274708 7854 -72200 104464 629944
11278 629944 571308 409753 492623 347683 149739 -54009 131802 497258 523235 524221 494754
11267 494754 489460 578268 777201 508169 233530 -136345 154614 152212 -28529 -406915
11257 -406915 -413193 -172308 -4794 151325 19793 -34052 131423 91359 19194 36255 -26159
11246 -26159 -11082 328814 181629 318686 384241 332170 113657 268927 394073 189107
11236A89107j8874l45402r3375L35510R1014J79539p4888k70529k35023L18074
11226G5153L92105K16705L6224j79938m8027J67335l01039J10532J44128j69931
11216D43247k42210p9085j67581q0828l4975m5510L0525K9242K80223K44675j23432
11205B54291l3788J3956J13848N1041l77463P8275M35778j21069j34588N131j85168
11194A00244j07788l49142M3744M06653K73010J195J20445k3766m55594o3221
11184e4220N2593j18480K10599n6386k91545K31647q8924k08p3584N3053p3597
11173b09052j08628K04309J40746k18628J38862L99652l7012k37400j09892J36099
11163I9056j397q9289p7036j13921P3020M6093K13996K40489R2815K24532o7891
$$ plain form
11236 189107 170233 -175169 -268544 66966 157980 337519 262631 -7898 -242921 75153
11226 75153 467258 683963 720187 540249 492222 659557 358518 469050 613178 443247
11216 443247 201037 121952 -45629 -126457 -161432 -206942 -176417 -147175 133048 377723 254291
11205 254291 220503 234459 348307 399348 21885 100160 535938 414869 280281 285412 100244
11194 100244 -7544 -356686 -312942 93711 366721 367916 488361 464595 9001 -54220
11184 -54220 -1627 -120107 90492 34106 -257439 -25792 -114716 -114924 -188508 -135455 -209052
11173 -209052 -317680 -113371 27375 -191253 -52391 347261 310249 72849 -37043 99056
11163 99056 97659 8370 -68666 -182587 -109567 -63474 150522 391011 483826 708358 640467
11152F40467m27542j06800K21823j75983J00535M6594j02881k85064k60551j21126
11142d70528L46166M12574l0859j60267m0544K71511J03437k29655K466l7989
11132A66312L83k48916n4542r987j80910J26757j0752K8276M9877J58406k20690
11121a95786n4457K54889J72854k50234j56302R4689L57013K48686J35964k56285
11111C51031j78705L2470o1489j52139r99m60J51048k37597J25541K99299m5719
11100B82281j42346J62833N4592j05297n7020l92248j72051K25713K4911q0855
11090a99487K02570J30148l27001o3914p2464m3434K26750L24209J13922J54498
11080D45797R1331k28627k74865o1256n8165m3461n3442P0307m268j6496j22106
$$ plain form
11152 640467 212925 106125 327948 151965 252500 299094 196213 -88851 -349402 -470528
11142 -470528 -124362 288212 257353 97086 56542 328053 431490 201835 204301 166312
11132 166312 166695 -82221 -136763 -146750 -327660 -200903 -211655 -183379 -133502 24904 -195786
11121 -195786 -250243 4646 177500 -72734 -229036 -134347 222666 471352 607316 351031
11111 351031 172326 204796 143307 -8832 -9831 -10291 140757 -96840 28701 328000 282281
11100 282281 139935 302768 357360 252063 195043 -197205 -369256 -143543 -118632 -199487
11090 -199487 3083 133231 -193770 -257684 -330148 -373582 -146832 177377 291299 445797
11080 445797 537128 308501 33636 -27620 -85785 -129246 -182688 -112381 -116649 -133145 -255251
11069b55251K03175Q8617j1607k2050J31301p7538l01763K49772J8064q4310R6257
11058C4667L60506J08447l98484k48469J39216K56744j67675k13706j00165J45717
11048h3202K02169J30189K07415R9448J60336K42096k39669k4593q0498q3079
11038E30612K47918j95874J10234K58964O7383J27089K69806L45589L140Q3675
11028A848536l79860p4487R0423M6181j08308J52505L8973l2556K33204L60034
11018B174645K23371j71201j06751l00384m3366Q6717m06659j17792O1202P1875
11008A471657N5968l97072j69766Q183r3284k52797j72331r6388N24877K83279
10998A162326l01300r7593j06656M20055J19237m69063l11883r5479l943n7258
$$ plain form
11069 -255251 -52076 36541 24934 2884 134185 56647 -245116 4656 22720 -61590 34667
11058 34667 395173 503620 105136 -143333 -4117 252627 84952 -128754 -228919 -83202
11048 -83202 118967 249156 456571 556019 716355 958451 718782 694189 613691 530612
11038 530612 778530 582656 692890 951854 1019237 1146326 1416132 1761721 1764861 1848536
11028 1848536 1468676 1394189 1484612 1530793 1422485 1574990 1613963 1581407 1814611 2174645
11018 2174645 2398016 2226815 2120064 1819680 1776314 1863031 1456372 1338580 1399782 1471657
11008 1471657 1527625 1130553 960787 968970 875686 622889 450558 354170 879047 1162326
10998 1162326 861026 763433 656777 1076832 1196069 727006 415123 319644 315701 258443
10988B58443q4481J43085J64093m1830m22070k26854k0339j85071J34383K62283
10978a8358k09652K5888L10015J24172m8791k578j06645K79674J19133k80731
10968A92127k62939k5257N6088J94780Q6210Q1872r9509k83456k11979K09087
10958f2976K09690l8997M4554R9550l18750l01869J73234N35437j03884n09523
10948b73534O6033J22192l6793L1325l42562j15611K5163L7052K95611N9273Q0846
10937e1005r3709k00242J07231j06090n5051K30910J46214j82113j27539k4618
10927c56012J60798O1674J49202M01600K8840j93431j28437j54162l84854k86192
10917g00974J68302J01976M0785k72830R3534K3534J13138L2126J12303p3733
$$ plain form
10988 258443 173962 317047 481140 439310 17240 -209614 -229953 -415024 -280641 -18358
10978 -18358 -228010 -202122 107893 232065 183274 180696 74051 353725 472858 192127
10968 192127 -70812 -96069 -39981 154799 241009 322881 223372 -60084 -272063 -62976
10958 -62976 146714 107717 152271 251821 -66929 -368798 -195564 339873 235989 -273534
10948 -273534 -207501 -85309 -122102 -90777 -433339 -548950 -523787 -486735 -191124 -131851 -51005
10937 -51005 -144714 -344956 -237725 -343815 -398866 -167956 -21742 -203855 -331394 -356012
10927 -356012 -195214 -133540 15662 417262 446102 252671 124234 -29928 -414782 -700974
10917 -700974 -532672 -430696 -389911 -662741 -569207 -545673 -432535 -400409 -288106 -361839
10907c61839m6442J94925j34321p5751L40612J24718j42050O1576j09888j11037
10897b59497L7256J66099J12513o4518l44595K8919k25386j35790K37891J90153
10887b56955n8687R4802N8700P5291k1836j78056J40477N2172J36448J03788p057
10876A39087Q201k4007P5206k05810n1821K52402M4192K70740O0965L0239n29220
10865G0174k97266L24396J55946K7472L11743k29795k12126M5533R9319j87152
10855A08244j94639J01760j02883M59478J1985j68154J16855M0531p3001K0759
10845C20935j9403M4365k63187l31228k08884L12674J46480k40383L939L5750
10835a98942j52698K50674J37881J60989J84540Q2924l03075m70188K01521L26223
$$ plain form
10907 -361839 -408281 -213356 -347677 -423428 -82816 41902 -100148 -38572 -148460 -259497
10897 -259497 -222241 -56142 56371 -8147 -352742 -323823 -549209 -684999 -447108 -256955
10887 -256955 -315642 -220840 -162140 -86849 -108685 -286741 -146264 -94092 42356 146144 139087
10876 139087 147288 123281 198487 -7323 -59144 193258 237450 508190 569155 599394 70174
10865 70174 -227092 97304 253250 280722 592465 362670 150544 196077 295396 108244
10855 108244 -86395 15365 -87518 371960 383945 215791 332646 373177 300176 320935
10845 320935 301532 345897 82710 -248518 -457402 -144728 1752 -238631 -234692 -198942
10835 -198942 -351640 -100966 36915 197904 382444 465368 162293 -307895 -106374 219849
10825B19849j01426o3008M3021K17437l75651O381j49538M92141L91552j74527
10815E06231j59578O9670J41070l32989l96012m39253j59965K79980K34358L63926
10805A07438r8996q2460k12410J96822K79859r9827l92438M5820J04135n963j02589
10794b60609J47753K44588j60283J49015k29724M8666N18121L1447k19422j79622
10784H9930j49991J69807j85603P4148L0142J20230M273J12680K8761k00938k71409
10773a77970j3614J10599j62346k53860R8919K30054K8189j56751K5773J11594
10763a59413J45294k38597o9986R0581k22017o00798k14530K05778L22036L62986
10753c78666K38923k26073r6505M19291J60838m08121P3125j1965p1780N9961
$$ plain form
10825 219849 118423 55415 98436 315873 -59778 -53397 -202935 289206 680758 506231
10815 506231 346653 416323 557393 224404 -171608 -610861 -770826 -490846 -256488 107438
10805 107438 8442 -74018 -286428 -89606 190253 90426 -302012 -256192 -152057 -158020 -260609
10794 -260609 -112856 131732 -28551 120464 -109260 -60594 457527 488974 269552 89930
10784 89930 -60061 109746 -75857 -1709 28433 148663 152936 265616 294377 93439 -177970
10773 -177970 -191584 -80985 -243331 -497191 -398272 -168218 -140029 -296780 -271007 -159413
10763 -159413 -14119 -252716 -322702 -232121 -454138 -1054936 -1269466 -1063688 -741652 -378666
10753 -378666 -139743 -365816 -462321 -43030 117808 -290313 -217188 -229153 -300933 -240972
10743b40972N988m1137j10624j54071l1963K12943J37330K30759P8777k50161
10733a63131k19620r7452Q000K37142K61021J68247j04924j17037J66207K35459
10723C73912J9542j76232j69037r3894L1314l1740l7647k20903K2457K13069k7470
10712i6629K99127r5544L61297O1254j47590l33993j26587Q762j51310K24468
10702C255O4750j04741l8595j29531j38651k9103J44227k4801K24444J21838m68710
10691c75618k11435K25328k7310R473l8419j12949P4240J24560J96181J43161
10681G212P4127l28919n4783K43578J52172l80684j43627K24455M58836J8745
10671B71112o7397M7713J7657l00111l7009l0769J63338K69715P3358j40131k1268
$$ plain form
10743 -240972 -234984 -276121 -386745 -540816 -572779 -359836 -222506 8253 87030 -163131
10733 -163131 -382751 -480203 -472203 -235061 25960 194207 89283 -27754 138453 373912
10723 373912 393454 217222 48185 -45709 -14395 -46135 -83782 -304685 -282228 -69159 -96629
10712 -96629 202498 106954 468251 529505 381915 47922 -78665 -69903 -221213 3255
10702 3255 68005 -36736 -75331 -204862 -343513 -372616 -228389 -253190 -28746 93092 -375618
10691 -375618 -587053 -361725 -389035 -379562 -417981 -530930 -456690 -332130 -135949 7212
10681 7212 81339 -247580 -302363 -58785 93387 -287297 -430924 -206469 252367 271112
10671 271112 203715 251428 269085 -31026 -68035 -98804 64534 334249 407607 267476 246208
10660B46208L60812L06838N3860o3571L73145J81792L6010J44868k91442l37294
10650A011226R1866M74336R0482L45825K55433L74976K16060L7628l05244j26126
10640B466462M30237N99307L93344K8377J65784N20190J048686R64153R94071
10631G610611R99532J341388J531828J528699J846989J677681J915282J808276
10623B0260286K574306L609878M784374N900309P615842R365388J2536502J5218065
10615H1864950J7448424J8640140J7323713J2692608O299568P83707j101615n1453
10607A53900042L938157R595261J6793411K4729219L1422786L4437350K9975165
10600C04791391J6997444K4013j2543552j6580272j2885152n331533M492542J6157033
$$ plain form
10660 246208 607020 913858 967718 904147 1277292 1459084 1495094 1639962 1348520 1011226
10650 1011226 1103092 1577428 1667910 2013735 2269168 2644144 2860204 2897832 2592588 2466462
10640 2466462 2896699 3496006 3889350 3917727 4083511 4603701 5652387 6616540 7610611
10631 7610611 8610143 9951531 11483359 13012058 14859047 16536728 18452010 20260286
10623 20260286 22834592 26444470 31228844 37129153 44744995 54110383 66646885 81864950
10615 81864950 99313374 117953514 135277227 147969835 154269403 155053110 153951495 153900042
10607 153900042 157838199 167433460 184226871 208956090 240378876 274816226 304791391
10600 304791391 321788835 321812848 309269296 292689024 279803872 274472339 278964881 295121914
10592B95121914K8017419L7013619L8753053L0302221R427733j6031177l3237914
10585C89366868l8148244l4207915k5214931j3869197k890094P723154J4726209
10578B97485850J5902652R257450n163438k1285781l1386035l3170171k8847742
10571B02792785k2065045j4708533q525473l201942L47071Q06942k055943p949325
10563A45440537j4125889j7890788j8119310j6204324j3476178j0896036q647928
10556D6080084o847473n820412m736018l449070k503859k205516k170201j572793
10548A6774742j443609j117675r35422p99017q87232p13140o68889n72038m91075
10539I146645k35585n10513l44954l22226j82290k59329o64073m77023l66486
$$ plain form
10592 295121914 323139333 360152952 398906005 429208226 438635959 422604782 389366868
10585 389366868 351218624 317010709 291795778 277926581 275036487 282759641 297485850
10578 297485850 313388502 322645952 317482514 296196733 264810698 231640527 202792785
10571 202792785 180727740 166019207 157493734 154291792 154638863 155445805 153389862 145440537
10563 145440537 131314648 113423860 95304550 79100226 65624048 54728012 46080084
10556 46080084 39232611 33412199 28676181 25227111 22723252 20517736 18347535 16774742
10548 16774742 15331133 14213458 13278036 12479019 11591787 10878647 10209758 9637720 9146645
10539 9146645 8911060 8400547 8055593 7733367 7551077 7291748 6627675 6150652 5784166
10530E784166l07716k98683r5545j13454m24754R2321J99247r4005o03974j71274
10520C966329L09994J9346O9981l18408k85363n7250k13994k3948k50827J00867
10510C316727j89520l79189N7586O19667J94072l3362j52239J138k12036Q7480
10500C310324N913k41465k58148l35187J64677L80236M3942K40377O0180k2116
10490C348733j63429j91066l09540j57096M85j14770j28134j75323K10343K46545
10480B566748j89423O7939J4449m7253k9374j09904n3734j96929k41470J47167
10470A928216K52621j21908L38988L38754r7395p69884n04592k17442J63941L25218
10460A636517O39625j423j02490k73759l2167R1093n05052m35773k88232O6048
$$ plain form
10530 5784166 5476450 5177767 5082222 4968768 4544014 4636335 4835582 4741577 4137603 3966329
10520 3966329 4276323 4295669 4365650 4047242 3761879 3704629 3490635 3466687 3215860 3316727
10510 3316727 3127207 2748018 2805604 3425271 3619343 3585981 3433742 3434880 3222844 3310324
10500 3310324 3316237 3074772 2816624 2481437 2646114 3026350 3070292 3310669 3370849 3348733
10490 3348733 3185304 2994238 2684698 2527602 2528087 2413317 2285183 2109860 2320203 2566748
10480 2566748 2377325 2445264 2459713 2412460 2383086 2273182 2219448 2022519 1781049 1928216
10470 1928216 2180837 2058929 2397917 2736671 2639276 1869392 1364800 1147358 1311299 1636517
10460 1636517 2276142 2274719 2172229 1898470 1866303 1957396 1452344 1016571 728339 794387
10450G94387J72218N9808K5193K79358K42940o8787k51958l00560j11452j98147
10440F43000k05975K13403O214j26516K41859R8414j83974j32430n2357J67369
10430F69007J09443p6492j80526j93691L59184J73731p0316L57303j94208R3716
10420A047151L4719M8461N0345k10753j95813J05033L87324P410k26813k24656
10410H22408M6782J8277J21210K20505N1085k15920j34834n7929K45033J39531
10400A256148l35462r7517j5608K72610J90259o8417k8430k53517l27742J84748
10390G77072J69167j51623K31461Q6866q1645l48014j21101K32360o9864l26136
10380C98543K15382L75419K62324L2473m53715n7465j1710L73888K61715O1003
$$ plain form
10450 794387 966605 1026413 1051606 1330964 1573904 1505117 1253159 952599 841147 643000
10440 643000 437025 650428 656642 530126 771985 870399 686425 553995 501638 669007
10430 669007 778450 701958 521432 327741 686925 860656 790340 1147643 953435 1047151
10420 1047151 1081870 1130331 1180676 969923 774110 879143 1266467 1273877 1047064 822408
10410 822408 869190 887467 1008677 1229182 1280267 1064347 929513 871584 1116617 1256148
10400 1256148 920686 823169 807561 1080171 1270430 1202013 1173583 920066 592324 777072
10390 777072 946239 794616 1026077 1112943 1031298 683284 562183 794543 724679 398543
10380 398543 613925 989344 1251668 1284141 830426 772961 761251 1135139 1396854 1457857
10370A457857L3313j26102k49194l43613k73824k30620q3481J9803O2448M39989
10360G06576k09735j70209K64906J55709P8515J10164J27891J41515N839l21138
10350H90033k56839P4094R530p6281L12850j26883n30090r0656L26946J19722
10340F52426R039j45253R7598o0026m16854J53269M8840j15669K65354L40850
10330H29574m5642l8454m09055p7035K9856L00417K31360o6751j1212j20770k01610
10319D20678m84542k9815L02845L49233l34591l00542j6247J32481J45624N7645
10309B42769Q2806K82173K09655j12691j59185k17174l05088J79215K85756K32396
10299G20632j90404l89586P9694r4894R7286K8334L7512P7946P57J05922j9443
$$ plain form
10370 1457857 1491170 1365068 1115874 772261 498437 267817 184336 204139 266587 706576
10360 706576 496841 326632 591538 747247 825762 935926 1063817 1205332 1211171 890033
10350 890033 633194 707288 716818 640537 953387 826504 296414 205758 532704 652426
10340 652426 661465 516212 613810 553784 136930 290199 339039 223370 488724 829574
10330 829574 783932 745478 336423 259388 289244 589661 821021 754270 743058 622288 420678
10319 420678 -63864 -93679 209166 558399 223808 -76734 -92981 39500 185124 242769
10309 242769 325575 607748 817403 704712 545527 328353 23265 202480 488236 720632
10299 720632 530228 140642 220336 125442 222728 251062 288574 366520 367277 473199 453756
10288D53756J36362o9649j47306j89805k36337R968M11243N34654l1856j49898
10278G21132k44777j41468q3287k94487O4863M52990k2726P0464K86542j41158
10268F68088j87851l7328m5116k42255L06545J27952l6865M15290o758k85713
10258F75989j47727o5704K56321K94708l37875m49304N0324J60029n3659l9887
10248C43215o9263O1270n7334r405j50318k1377j61618j06497J21589L96310M00309
10237G46881j9559q4388l37045k97295j30810Q9605L46392R3574n1000J565o9047
10226B88873L6437j5734N8540J09185J09777k35754j90477R0406M67587r9409
10216F19431k97179o3461J80742j73340k03515k29156p702j1692j73938J12552
$$ plain form
10288 453756 590118 520469 373163 183358 -52979 -43011 368232 902886 871030 721132
10278 721132 476355 334887 251600 -42887 21976 474966 452240 522704 809246 668088
10268 668088 480237 442909 397793 155538 462083 590035 553170 968460 961702 675989
10258 675989 528262 462558 718879 1013587 675712 226408 276732 436761 383102 343215
10248 343215 273952 335222 277888 268483 118165 96788 -64830 -171327 -49738 346572 746881
10237 746881 727322 642934 305889 8594 -122216 -32611 313781 407355 356355 357920 288873
10226 288873 325310 309576 368116 477301 587078 351324 160847 251253 718840 619431
10216 619431 322252 258791 439533 266193 62678 -166478 -174180 -185872 -359810 -247258
10206b47258J7256o9753j13569J71129K69986L14759j92994n2339N06351R0685
10196F94253o3976q1106m64272o9740Q0584j03322j75169o7440M66319K5341J36310
10185C77782J99413k47551l82217J35455L78947j3025j54119j53438j02922M24172
10175D62497K28332p920J59734K80579m2364j20231L18226K06093J53161M18108
10165B056215j4685k1075m9246L61858k26409k48046K7349k74742k34128J5319
10155A392410R8439M96414N08566J62469n9611p9281k17600m56817n02672J02497
10145A444814J50057L23259J73718Q8917j48956j27113P272J22805l675k55867
10135A775231l54066j7634o4298m17584L4315O694j27094r121j5275j13462j70913
$$ plain form
10206 -247258 -230002 -299755 -413324 -242195 27791 342550 149556 97217 603568 694253
10196 694253 630277 549171 84899 15159 95743 -7579 -182748 -250188 216131 241472 377782
10185 377782 577195 329644 -52573 82882 461829 448804 294685 141247 38325 462497
10175 462497 690829 682909 842643 1123222 1080858 960627 1278853 1484946 1638107 2056215
10165 2056215 2041530 2020455 1971209 2333067 2106658 1858612 1885961 1611219 1377091 1392410
10155 1392410 1490849 1987263 2495829 2658298 2598687 2519406 2301806 1844989 1342317 1444814
10145 1444814 1594871 1918130 2091848 2180765 2031809 1904696 1911968 2034773 2031098 1775231
10135 1775231 1421165 1403531 1339233 921649 955964 962658 835564 826443 811168 697706 526793
10124E26793J07745P6783J75647k48654N9016K17916l76510n45637k83533j71602
10114d62036L60503N83115K45546k47631l64334n7886N6470K01324L67719R7588
10104G80378j00978n6847j63967m96479k85841M69382P3978k46799J11803K01332
10094B85962K43186k10798k45678O5418J19665j88452n7005k47408j6204j1342
10084b62656n8359J66647L63588L69523o1147k32508l64537M16610J93925j17704
10074D13382q1449k87472j0276M87544o067k04520k67681P1484k52889k26385
10064c64329k26418l9752M24938M96380l42088N5976j99048L17404K7583m6958
10054A03688J7756J92534M00875R2671k13670m52175l40068j28558M08536K23611
$$ plain form
10124 526793 634538 711321 886968 638314 697330 915246 538736 -6901 -290434 -462036
10114 -462036 -101533 481582 727128 479497 115163 57277 113747 315071 682790 780378
10104 780378 679400 622553 458586 -37893 -323734 145648 219626 -27173 84630 285962
10094 285962 529148 318350 72672 138090 257755 69303 12298 -235110 -251314 -262656
10084 -262656 -321015 -154368 209220 578743 517596 285088 -79449 337161 531086 413382
10074 413382 331933 44461 34185 521729 515662 311142 43461 114945 -137944 -364329
10064 -364329 -590747 -630499 -205561 290819 -51269 4707 -194341 123063 150646 103688
10054 103688 121444 313978 714853 807524 593854 141679 -198389 -326947 81589 305200
10044C05200o7379j99989K6722j23259k4702K15128K41524k6758N5751Q475p5200
10033C35513k77866L1907K14888K1238J48645n2418o027l2593l83010k01603L95910
10022A94584J14700Q7726M3361k7197m0812k36438r6108K02439L6371j41046j15650
10011B1930q8789J66724n934j62060j38524P4015J90275l1774K89923p1498L46888
10000E91176R8240m42916m57136N290K9312L99888R7013j05942j71350J97720
9990B41295J09540k56928k32909J37758K37232K12955j12758m43239m1913P5580
9980g3387J08106K80172J13047L8729K18893k50421k12236N540l66170K8227K42552
9969A33052k16256K07857Q6092J9804K158P0747k52232L062K58377q3168K0703
$$ plain form
10044 305200 237821 37832 64554 -58705 -83407 131721 373245 346487 402238 410713 335513
10033 335513 57647 89554 304442 325680 474325 421907 415880 383287 277 -201326 194584
10022 194584 309284 397010 440371 413174 372362 135924 39816 242255 278626 137580 21930
10011 21930 -66859 99865 93931 -68129 -206653 -132638 57637 25863 315786 244288 591176
10000 591176 689416 246500 -210636 -205346 -176034 223854 320867 214925 43575 241295
9990 241295 350835 93907 -139002 -1244 235988 448943 336185 -107054 -148967 -73387
9980 -73387 34719 314891 427938 466667 685560 435139 222903 228443 -137727 -109500 133052
9969 133052 -83204 124653 210745 230549 232707 303454 51222 54284 312661 229493 250196
9958B50196O6581j2360k70812J42183P0836k69828K30728N17625J2420l74927
9948C62642l87141p5735l4204N7203j23675L43339J93820k28157j11946r723J87478
9937A73901R1269k31477p9383K14322O8875m6317K08423L38991m94888j14764
9927A28952J61886p555j43421J49842k0338k13811K65144j09953j74431J03933
9917A40248K27868R0043J17269q8870J72025P8942m19196l92649K5637K33832
9907A85149J87803J71032k83377j51019J07299L2500l05403j81429K52309J23709
9897A38573k6822O7359j46691o8904O9764M24235K79481k00809l55196l40217
9887a59227K53952J67105O8256L53188n0823m28787K3307k14253R1012R857K85159
$$ plain form
9958 250196 316777 304417 33605 175788 246624 -23204 207524 725149 737569 362642
9948 362642 -24499 -100234 -134438 -77235 -200910 142429 336249 108092 -3854 -13577 173901
9937 173901 265170 33693 -45690 168632 237507 191190 399613 738604 243716 128952
9927 128952 290838 283283 139862 289704 269366 55555 320699 210746 36315 140248
9917 140248 368116 458159 575428 486558 658583 737525 318329 -74320 -48683 185149
9907 185149 372952 543984 260607 109588 216887 249387 -56016 -237445 14864 138573
9897 138573 111751 179110 32419 -36485 33279 457514 736995 536186 180990 -159227
9887 -159227 94725 261830 330086 683274 632451 203664 226971 12718 103730 113587 398746
9876C98746J4653l98664J10030j0117k81828M0595K83248k76833j49276J33043
9866a36403K40407J22627j00394K25057k21907j29394M24912J80806n7723n17553
9856C0435k26792P7956L61817j65145k93871j96370J34210n5418j84553L35869
9846a81862J3977K6599j25995L98321L30659J11695k45080K29295q5193j5564
9836D56852j63074J61697O5853L1158k46485l76887q5212K2445L343J3098M0022
9825g7190P3666L11544L05988l59895K03216J14986n20159m91838K94084J85237
9815C9639m3746K4207l5621J14590K0989j17086l0790n8165J7350J92063j6866
9804A06564N816Q8714K27950j76483q196k5535r8813j61572K22131L36086k86
$$ plain form
9876 398746 413399 14735 124765 114648 -167180 -126585 156663 -120170 -269446 -136403
9866 -136403 104004 226631 126237 351294 129387 -7 424905 605711 547988 30435
9856 30435 -196357 -118401 243416 78271 -215600 -411970 -277760 -333178 -517731 -181862
9846 -181862 -167885 -141286 -267281 131040 461699 573394 328314 557609 472416 456852
9836 456852 293778 455475 521328 552486 306001 -70886 -156098 -133653 -130310 -117212 -77190
9825 -77190 -3524 308020 614008 254113 457329 572315 52156 -439682 -145598 39639
9815 39639 -4107 20100 -15521 99069 120058 2972 -27818 -85983 -68633 123430 106564
9804 106564 112380 201094 429044 252561 244365 218830 120017 -41555 180576 516662 516376
9793E16376j43512N6837p4961K114M7497K4872k32700k27475m7573j22650k8440
9782b29615J46454r8515o446o1146n2205q468K50564J86260J34975j84172J91228
9771B68914k71089k2768J94791j12673P9232l6781J41270j40714j52626K9345
9761b3099k76587J58048L31520k3631j08290j46883k7297K3961K60333r7370k58179
9750a87474l06257J24658P8467J97625J59362l00167l2057L17452J90999J24873
9740C67481R1637k26101Q7525J15948m8099j61926K84452m2760j58759j82364
9730A27034k31068q9463j7691K83918K58815r052o0448k61303j24848N2012Q155
9719f3939N4872o3481k16469j66283k51509K38304O32935J10176q0088K43200
$$ plain form
9793 516376 372864 429701 354740 356854 404351 429223 196523 -30952 -78525 -201175 -229615
9782 -229615 -83161 -181676 -188122 -249268 -301473 -309941 -59377 126883 261858 77686 268914
9771 268914 -2175 -24943 169848 57175 136407 99626 240896 100182 -52444 -23099
9761 -23099 -299686 -141638 189882 166251 57961 -88922 -116219 -92258 168075 70705 -187474
9750 -187474 -493731 -369073 -290606 -92981 66381 -233786 -265843 51609 242608 367481
9740 367481 459118 233017 320542 436490 388391 226465 510917 468157 309398 127034
9730 127034 -104034 -193497 -211188 72730 331545 322493 262045 742 -124106 -72094 -63939
9719 -63939 -9067 -72548 -289017 -455300 -706809 -468505 164430 274606 194518 437718
9709D37718J00948l03303k18536j60183m0700O7406J94658P1235P4194J30425
9699C53862p2393j55262j06018J95044K04869r9255j28666J64784M43519o3354
9689G37130j18651k60395k05253l0423j45618j06844k02424L4455M18665p3012
9679D7630j63071J50395J26330K6899l9196k21591O4582O815j99688k8360L45242
9668A15987K51859l03221l1345K79952L4147j08081k18378m88203k20645R7943
9658e89985L90318O21320J72277K51883P80131O09543K70285l19568r67156n93805
9648F25243O2427p1545k49160r7775J47865j86626m6294J67767J88213L43025
9638H83140k99279n37680l40803J00169M27195N4377j31197P3218J23745j32212
$$ plain form
9709 437718 538666 235363 16827 -143356 -184056 -116650 78008 149243 223437 353862
9699 353862 281469 126207 20189 215233 420102 320847 192181 356965 800484 737130
9689 737130 618479 358084 152831 122408 -23210 -130054 -332478 -298023 120642 47630
9679 47630 -115441 34954 161284 188183 148987 -72604 -8022 -1207 -200895 -229255 115987
9668 115987 367846 64625 33280 313232 347379 239298 20920 -467283 -687928 -589985
9658 -589985 -199667 421653 593930 845813 1625944 2235487 2505772 2186204 1219048 625243
9648 625243 687670 616125 366965 269190 417055 230429 184135 351902 540115 883140
9638 883140 583861 46181 -294622 -194453 232742 287119 155922 229140 352885 220673
9628B20673j03777j67158j88515O5811K9044J22894m73638m9460J14580J20275
9618c09271k03633r6854L20340K62865J75687J59253j54393N3022J90803k01419
9608A96400k60910q6146l5850j49828K36922K72492j29887n0214P5661K40295
9598C08935J52425n11797j32069J65203j53518n0374K19964j4306K3264o4234
9588e6507m6719J5895K54862J93680k64699j27322L21517M035j87758K18160K64718
9577E89862M9971n1125k41757r6297M5666j48227P1933J33161j44465j23784j41668
9566e6730m7778K75002m6074R9439R2809l00323J48546p247J666p6275M6293l09988
9554a80660p9470n196J22135J79779l3422m9958k60696J68971J95798K07973j91971
$$ plain form
9628 220673 116896 -50262 -238777 -172966 -143922 -21028 -494666 -544126 -429546 -309271
9618 -309271 -512904 -609758 -289418 -26553 149134 308387 153994 207016 397819 196400
9608 196400 -64510 -150656 -186506 -336334 -99412 173080 43193 -7021 68640 308935
9598 308935 461360 -50437 -182506 -17303 -170821 -221195 -1231 -15537 7727 -56507
9588 -56507 -103226 -87331 167531 361211 96512 -30810 290707 294742 106984 325144 589862
9577 589862 639833 588708 346951 250654 296320 148093 220026 353187 208722 84938 -56730
9566 -56730 -104508 170494 124420 223859 316668 16345 164891 157644 159310 83035 129328 -180660
9554 -180660 -260130 -265326 -143191 36588 3166 -46792 -307488 -138517 57281 265254 73283
9543G3283k74553q5022L24791j55740l19993J17045J08252J21157J1275r2342
9533a71847J07729k80631l10725K34657K97856o05J29155k16257k1399l83590
9523f15657J4244L74984L75076l26024k40463K0112K7157J05929J44534p1541
9513a91649n4032L12070L44910j61619K93911j71827k62549r9379J61587K1618
9503A93041j81697p23352j17621J90811M90K67337O177J359J01644J59004j883
9492a04690k14141L1443R3823K8659j19577M4790J22379K7292K60824k59210M4060
9481d4348N08848K6125K9071j40340n5248L31500J36181k95036j00323j11278
9471B85152k66826j38232k5429j14209j42409o5998r9513K09271K29808j1558
$$ plain form
9543 73283 -201270 -286292 38499 -117241 -437234 -320189 -211937 -90780 -79505 -171847
9533 -171847 -64118 -344749 -655474 -420817 -122961 -123566 5589 -210668 -232067 -615657
9523 -615657 -601413 -226429 148647 -177377 -417840 -397728 -370571 -264642 -120108 -191649
9513 -191649 -245681 66389 411299 249680 543591 371764 109215 9836 171423 193041
9503 193041 11344 -712008 -829629 -638818 -638328 -370991 -364814 -363455 -261811 -102807 -104690
9492 -104690 -318831 -287388 -193565 -164906 -284483 -239693 -117314 -90022 170802 -88408 -44348
9481 -44348 464500 490625 519696 379356 324108 655608 791789 496753 396430 285152
9471 285152 18326 -119906 -145335 -259544 -401953 -467951 -567464 -358193 -128385 -139943
9461a39943j72683M85O9684K24251Q527L3294j34110K54615J85016j46086j9625
9450A63425m8628J4589j01528j17240N4262N6005m0201J0152N1266m4044Q2079
9439H0137J05873K9528j84459k64280K01692J18906K9522K0495k24277j08503
9429a95366n615j82187O7468L3076m17093J01477J93407J1036L74272L82471k98311
9418F4635r5429K82131n3107l08316J18881K40518K76832j80239m35870k80422
9408c70386M43817J04376K65366J39404j0685J3329k16683o68943K46916L12262
9398B58773j11124j46593J59171p1254j38424j12184R4646k2878L44736J38128
9388C92997l73601l77328O0313L45231N780o2582L29971k83497q6360K7780K8385
$$ plain form
9461 -139943 -312626 -312141 -242457 -18206 -9679 23615 -110495 144120 329136 183050 163425
9450 163425 114797 129386 27858 -89382 -35120 20885 -19316 -9164 42102 -1942 80137
9439 80137 186010 215538 31079 -233201 -31509 87397 116919 137414 -86863 -195366
9429 -195366 -200981 -383168 -315700 -282624 -699717 -598240 -404833 -393797 -19525 362946 64635
9418 64635 -30794 251337 198230 -110086 8795 249313 526145 345906 -89964 -370386
9408 -370386 73431 177807 443173 582577 571892 585221 368538 -300405 -53489 258773
9398 258773 147649 1056 160227 88973 -49451 -161635 -66989 -89867 254869 392997
9388 392997 19396 -357932 -297619 47612 53392 -9190 320781 37284 -49076 -21296 7089
9377G089R167J92288j64439n6239K0136J46482K50995k1452O6201n0605n39673
9366a40050j58901K74910K60717p5460p8365K51081j25645j50863r952l9537j5723
9355g788K30865M7982N9140j21932n3831k8915J7091K98438j07750L4829m0819
9344C27310r7544j30873J2605J49469p5274l19726j90472L09642P626J95095k08498
9333b0640Q8782K59413j41964k94463K7863j61577J0129j6166J04498K9394J16284
9322A553J29786k41771L45980q4732M3737J10067k6215k67595j17508J99646J84462
9311B77410M1971q2661k3525O0777j91884p1876P8936o2181K10140k43095k88636
9300b94624m545K95467K04478k15892j62090L32448K05278l4744J63400L8379
$$ plain form
9377 7089 16256 208544 44105 -12134 8002 154484 405479 384027 450228 399623 -140050
9366 -140050 -298951 -24041 236676 161216 82851 333932 208287 57424 47472 7935 -7788
9355 -7788 223077 271059 330199 208267 154436 125521 142612 441050 333300 368129 327310
9344 327310 229766 98893 111498 260967 185693 -134033 -324505 -14863 -7237 187858 -20640
9333 -20640 68142 327555 185591 -108872 -81009 -242586 -232457 -248623 -144125 -114731 1553
9322 1553 131339 -110432 235548 150816 194553 304620 278405 10810 -106698 92948 277410
9311 277410 319381 236720 213195 273972 82088 10212 89148 26967 237107 -5988 -294624
9300 -294624 -299169 -3702 200776 -15116 -177206 155242 360520 325776 489176 527555
9290E27555J4219J07633m27638p657J25822R2485l08218r0686n8940J76905k0093
9279A31387j53430k55194l48474J46263R261j76876n8244L91576N0842k53003
9269e15892J14458P1832Q6051J85300J54426l9625k52463K12233K99781k94755
9259B1346k59376J9864L23867J07001L4478j77163l43699K52104Q59j75145k68171
9248d64035L094O6318J80056L02960j85932J96749k2889j78839r6822K13545K39145
9237B53350j68650j37388j99909j15121n9314L87987j3009j07498l3892k58097
9227d51541l58340L66645L13256j63679p3789K1857P3498K02848L86951J78797
9217D96503j80336m02012j61183r1708L56681K70886P8053j58502m3487J67696
$$ plain form
9290 527555 541774 649407 221769 214112 339934 432419 124201 33515 -25425 151480 131387
9279 131387 -22043 -277237 -625711 -479448 -470187 -647063 -705307 -313731 -262889 -515892
9269 -515892 -401434 -329602 -243551 -58251 96175 56550 -195913 16320 316101 21346
9259 21346 -238030 -218166 105701 212702 247180 70017 -273682 -21578 -20719 -195864 -464035
9248 -464035 -460941 -394623 -214567 88393 -97539 99210 76321 -102518 -199340 14205 253350
9237 253350 84700 -52688 -252597 -367718 -427032 -39045 -52054 -159552 -193444 -451541
9227 -451541 -809881 -443236 -129980 -293659 -367448 -345591 -272093 -69245 317706 496503
9217 496503 316167 -85845 -247028 -338736 17945 288831 366884 208382 164895 332591
9207C32591N1052m76793l02805L18773Q0523J2111M1096J10232J74360J13832
9197D54972k55994j01397K71477j90219r9729L2174J7631m2533j21854L3506L98049
9186C96083J552N9909K07132m0853p0060r4664m39817k47126L7493J51286L1158
9175g907l42290L8207J49433l11617j80865K39451j7700K35854p10J86379j38778
9164a50543p4569m11362p6446K70933J37211R1226R2171K98580M20879j34864
9154D63216m92270j03425J05837J62834P6959k30924n1194k3908K43016j4813
9144A35328k00781j00832j46400Q5514K23238P2009r668R361N6207q1431l5251
9133G294k10540l5171M8546k0968K29276j6353l04283m48251j14399P1315J80139
$$ plain form
9207 332591 383643 -93150 -395955 -77182 3341 15452 56548 166780 341140 454972
9197 454972 198978 97581 369058 178839 79110 111284 128915 86382 -35472 -1966 396083
9186 396083 397635 457544 664676 623823 553763 459099 19282 -227844 -190351 -39065 -7907
9175 -7907 -350197 -311990 -162557 -474174 -655039 -415588 -433288 -197434 -198144 -11765 -150543
9164 -150543 -225112 -636474 -712920 -441987 -304776 -213550 -121379 177201 598080 463216
9154 463216 -29054 -132479 -26642 136192 213151 -17773 -68967 -92875 150141 135328
9144 135328 -65453 -166285 -312685 -227171 -3933 68076 58408 67769 123976 42545 7294
9133 7294 -203246 -238417 -189871 -210839 18437 2084 -302199 -750450 -864849 -793534 -613395
9122f13395N02156K42984K45096J6188R7592l13037k40719r8295r3870j27757
9112c83057j24316Q1779p0743o255L80632J87087j8525l24956j55477L6333J7091
9101c80407j75087N6088J84832k13913J88809K51602M7488o7957R0972J37806
9091A20233M74134m4135m18227j43404J957l03248k18607K6234K01674N6748Q0542
9080a66099p861J26970L44857J64863j11444j71043k53308k59150k68740j41283
9070g42238q3638N50668P4607l4145l036K25448j74890M8952j14180k53902K19880
9059b86474K50949J88087j40961j28839N6703q1816j27183P4970J00852P9510
9049a4202L28003P641k76402k77187j35735J10877K97676k20279k31963r556K86465
$$ plain form
9122 -613395 -111239 131745 376841 393029 490621 177584 -63135 -161430 -255300 -383057
9112 -383057 -507373 -425594 -496337 -502592 -121960 65127 46602 -278354 -433831 -397498 -380407
9101 -380407 -555494 -499406 -314574 -528487 -339678 -88076 -40588 -108545 -17573 120233
9091 120233 594367 550232 132005 -11399 -9442 -312690 -531297 -505063 -303389 -246641 -166099
9080 -166099 -173960 -46990 297867 462730 351286 180243 -73065 -332215 -600955 -742238
9070 -742238 -825876 -275208 -200601 -234746 -237782 -12334 -187224 -138272 -252452 -506354 -286474
9059 -286474 -35525 152562 11601 -117238 -60535 -142351 -269534 -194564 -93712 -14202
9049 -14202 313801 321442 45040 -232147 -367882 -257005 40671 -179608 -411571 -421127 -134662
9038a34662M72281r7994K0064J76345k10k27777k07716R3933K31868j92507k86979
9027a53354J7180j37526j99311j493K18187K16364l5824l19378j83281L32202
9017b46234O4716j42894J22437O7358k37114l20393K07740J16622K13287Q9949
9007f4526p1020Q6305k51490j81596M1126J52780K34920J34573m25378K63346
8997h0960K62775J16592p5494J16800l8423r1630j66438p6579K3159k39632J82571
8986f7259N1091l4166Q8731K31659J72876j54652J51731o24981k94343J58770
8976c20543j21759k45337P9543L76159N39317q7154l97997Q7848K74997J21086
8966C06160r5573l15863J55539J80178O4355l53488m05999J58961j56408j07843
$$ plain form
9038 -134662 337619 239625 259689 436034 435824 208047 331 94264 326132 133625 -153354
9027 -153354 -136174 -273700 -473011 -474504 -256317 -39953 -75777 -395155 -578436 -246234
9017 -246234 -181518 -324412 -201975 -134617 -371731 -692124 -484384 -367762 -154475 -64526
9007 -64526 -135546 -49241 -300731 -482327 -441201 -288421 -53501 81072 -344306 -80960
8997 -80960 181815 298407 222913 339713 301290 209660 43222 -33357 -10198 -249830 -67259
8986 -67259 -16168 -50334 38397 270056 442932 288280 440011 -184970 -479313 -320543
8976 -320543 -442302 -687639 -608096 -231937 307380 220226 -177771 -89923 185074 306160
8966 306160 210587 -105276 50263 230441 294796 -58692 -464691 -305730 -462138 -569981
8956e69981J64517K43199J79923J43247j60557k9790M1190K67970r0767J7107
8946B06058j35902L55606l9167o7872j28313k05706Q8467Q8784j8310J33897L3094
8935C10636j50470k39953N7490M32683J26541j63704j65677j4722J98955j87832
8925B03947o173j81095J73359l0817K51956L3937j00003j50890m81884j84057
8915d71720K02234M37646N8703k51505m5796P7231o1388j94869J62768o626J93244
8904I9922J29446j1479J34235K9392n1526K28508O2159l01321l92998j60585K07952
8893b6295l58234j16083N29400K06630J95006J0341j87372k02340R2589J05090
8883B48732J10274m35465n15134J11856L11225J10276j81942q1089L8643L5102
$$ plain form
8956 -569981 -405464 -162265 17658 160905 348 -29442 11748 279718 188951 206058
8946 206058 70156 425762 386595 318723 190410 -15296 73171 161955 143645 277542 310636
8935 310636 160166 -79787 -22297 410386 536927 373223 207546 192824 391779 203947
8925 203947 197774 16679 190038 159221 411177 445114 345111 194221 -287663 -471720
8915 -471720 -269486 168160 226863 -24642 -70438 6793 -54595 -249464 -86696 -93322 99922
8904 99922 229368 217889 352124 381516 329990 558498 620657 319336 -73662 -234247 -26295
8893 -26295 -384529 -500612 28788 235418 430424 440765 253393 51053 143642 248732
8883 248732 359006 -76459 -591593 -479737 -168512 -58236 -240178 -321267 -282624 -247522
8873b47522J32750K25530L32856k29309m83520J05126K36076J71430k0077J19708
8863C43048r6707k64315J37498J71079J48350M11272k46174o02917j18871r2238
8853b09975j04336J54204J58170k69863k13975j33225J82260l4166j84035J05031
8843e49910J66968M33116K52766O2264l41546L7332J16445j11342m28009o9102
8833d31018L076N8118p1082L14023L17767J8429j90288k1391j14780L49664M24230
8822F56748j31440j25389l137j4229j7640K6117j89027k32800o8557K51413j00105
8811E1954q9433k31603J14838j04657m22363O4796K53065n5650j32100K37566
8801c13587K58567Q0207j70580l66900L61147K55833l42826J80716m1528N7006
$$ plain form
8873 -247522 -114772 110758 443614 214305 -269215 -164089 71987 243417 223340 343048
8863 343048 246341 -17974 119524 290603 438953 850225 604051 1134 -117737 -209975
8853 -209975 -314311 -160107 -1937 -271800 -485775 -619000 -436740 -470906 -654941 -549910
8843 -549910 -382942 50174 302940 365204 23658 60990 177435 66093 -361916 -431018
8833 -431018 -427942 -369824 -440906 -126883 190884 209313 19025 -2366 -117146 232518 656748
8822 656748 525308 399919 396782 382553 364913 391030 202003 -30797 -99354 152059 51954
8811 51954 -37479 -269082 -154244 -258901 -681264 -616468 -363403 -419053 -551153 -313587
8801 -313587 -55020 25187 -145393 -512293 -151146 104687 -238139 -57423 -98951 -41945
8791d1945j5404j73721M3495Q8239K67644m4602l98695K2440K38378K39835n8154
8780A67510J04167L6652R4085M0612j42886k41514j46629M3533Q0225j96821l832
8769a64898J91860l3552k14790r775R3502K71886j08182k08094j77240J5315J79158
8758a64810p7712j71772j2176J23782K98674J92993q3092l55845r8217j53119
8748e01294J3061K1246K92770K27619j97641j41400K361q8253K839j8817j8151
8737d05660r79J57069L10543k38665j8273K4262k31087K00103J12077o7240Q1404
8726g6446j24462j26385R9695r0843K60348M7169P8202m2523k21431L7485q1859
8715b41050m21581K620r6138K44711K57615N3257N0873k37312O8701j6396j53690
$$ plain form
8791 -41945 -57349 -231070 -187575 -99336 168308 123706 -274989 -252549 -14171 225664 167510
8780 167510 271677 308329 402414 443026 300140 58626 -88003 -44470 35755 -161066 -164898
8769 -164898 26962 -6590 -221380 -231155 -137653 134233 26051 -182043 -359283 -343968 -164810
8758 -164810 -242522 -414294 -426470 -302688 -4014 188979 105887 -249958 -348175 -501294
8748 -501294 -488233 -466987 -174217 53402 -144239 -285639 -283278 -371531 -368692 -387509 -405660
8737 -405660 -406639 -249570 60973 -177692 -195965 -171703 -402790 -202687 -90610 -157850 -76446
8726 -76446 -200908 -327293 -227598 -318441 -58093 -10924 67278 24755 -196676 -159191 -241050
8715 -241050 -662631 -660011 -756149 -511438 -253823 -200566 -149693 -387005 -318304 -334700 -488390
8704d88390L04971j71260k7617q7392K24944O2352J28651L52777J6691p6361n61426
8693c22060p0398J82722N2633M8457K49507m9531k7205J02950J3348j70291p030
8682C102o9172l58744J58938L2728L189J80258J79382l1007J27519J7328Q5625
8671C29146j09660J13269M4110J81302P79k12334M835Q8168L8323m1100o7256
8660C69582P0568j42846k72617j35996m6765q7142j08927k80680K30204L74906
8650b9713j74979J67902K69256l11499l15589q197K71391k97293J57158K82927
8640A1364j05894o0773n1023k60K09169N2245J06248l67757J00449L07823J60629
8629C62220J32934j45668l67697L0030l09632l692L93444p5812k51276K7131J04794
$$ plain form
8704 -488390 -183419 -354679 -382296 -469688 -244744 -182392 -53741 299036 315727 239366 -322060
8693 -322060 -392458 -209736 -157103 -108646 140861 91330 64125 167075 180423 10132 3102
8682 3102 -66070 -424814 -265876 -233148 -229959 -49701 129681 98674 226193 243521 329146
8671 329146 219486 332755 376865 558167 558946 346612 351447 439615 477938 436838 369582
8660 369582 440150 297304 24687 -111309 -158074 -245216 -354143 -634823 -404619 -29713
8650 -29713 -204692 -36790 232466 -79033 -394622 -402819 -131428 -428721 -271563 11364
8640 11364 -94530 -155303 -206326 -206586 2583 54828 161076 -206681 -106232 201591 362220
8629 362220 495154 349486 -18211 11819 -297813 -301505 91939 16127 -235149 -208018 -103224
8618a03224j7229q5793j43139k8134J72894M06j20294q1805N9093N16351K23772
8607C92898l75778P6130K06505l7195j6589j66115m11256O3970J79689m3247k10047
8596c41035J23099R579k28169q2211K1253j34416K15612P5310k0300K71955N45455
8585D56132J76572l76733k72586J63915r3736j47490N3086M07291K69340q9194
8575E46597k11991o8137J67430J4980j80153k35713k13972k15253P82557K29534
8565F15879R8713j20697k26924l0156k23173j25015K22815L93722q013l12102
8555B85049k26312l2391j45823k84177J14809L86717N57424O5086l63903j36746
8545B19733q6024q3259n2059L66264K49212k96098m76392J19K57150k26150k4554
$$ plain form
8618 -103224 -120453 -206246 -349385 -377519 -204625 -204219 -324513 -406318 -347225 169126 392898
8607 392898 17120 93250 299755 262560 245971 79856 -331400 -267430 -87741 -130988 -341035
8596 -341035 -217936 -208357 -436526 -518737 -497484 -631900 -416288 -340978 -361278 -89323 456132
8585 456132 632704 255971 -16615 147300 53564 -93926 -40840 366451 635791 546597
8575 546597 334606 266469 433899 448879 268726 33013 -180959 -396212 386345 615879
8565 615879 714592 593895 366971 336815 113642 -11373 211442 605164 597151 285049
8555 285049 58737 26346 -119477 -403654 -288845 97872 655296 720382 356479 219733
8545 219733 133709 50450 -1609 364655 613867 317769 -158623 -158504 98646 -127504 -152058
8534a52058J0951K5779j52377j32735K95706K85916R9732m33906k15065J9324
8524c48733j8304K60044M24487L49113q0324l04929j90974K55182l07409k34865
8514a96712k21128N8625j9993k26415q400L02941J257J21071K45262p032K02739
8503B52215J89712r0486R5358J39690J10349l58979j90997k9920Q2415m17861
8493b18504k31708L37231J65047j95307J85988k42957j05210P4399K52653q5698
8483f4066l0935j21245k08961K7319K05147n3943J09801J71996j87236k94697
8473d46820L80679l9909K59900J4777j63305j19727J26659j00310o0175m3177
8463a91408J25076J8992l0114K67460J61376J53708K9119m9306k31805j8374K66405
$$ plain form
8534 -152058 -141107 -115328 -267705 -400440 -104734 181182 280914 -152992 -368057 -348733
8524 -348733 -367037 -106993 317494 666607 586283 281354 90380 345562 38153 -196712
8514 -196712 -417840 -359215 -379208 -605623 -614023 -311082 -309825 -188754 56508 49476 252215
8503 252215 441927 351441 446799 586489 696838 337859 146862 116942 199357 -218504
8493 -218504 -450212 -112981 52066 -143241 42747 -200210 -305420 -231021 21632 -64066
8483 -64066 -95001 -216246 -425207 -397888 -192741 -246684 -136883 35113 -152123 -446820
8473 -446820 -66141 -106050 153850 168627 5322 -114405 12254 -88056 -148231 -191408
8463 -191408 -66332 -47340 -77454 190006 351382 505090 534209 484903 253098 234724 501129
8452E01129k7050j57251k48920j94722K65481k39738m2903K29867L43979L73244
8442H03116R5183n7401l28971J4673O4859k36929l07730l79167O277J60547N81155
8431D15612j08846p1413j54975k5928J54455M24o9127j20686Q2026m100l9377
8420E8065p4017q2369J08277M5274J78040Q8580j14642L1524k02182j33562L845
8409i3167L6078K32294L69751J18736m03113k89188k73286j2245K22470K75611
8399A83941M05241j89519m94258k81874M8948q3092k9952M67232N26590R0109
8389F43366K19246j48575m08537j31495N4600k96788r9408K06964j29557p6120
8379a66304l73723k74618K40017J38367n6023j3135j5835K30767j00819j08217
$$ plain form
8452 501129 474079 316828 67908 -126814 138667 -101071 -143974 85893 429872 803116
8442 803116 898299 840898 511927 526600 591459 354530 46800 -332367 -326090 -165543 415612
8431 415612 306766 235353 80378 54450 208905 209329 140202 19516 101542 97442 58065
8420 58065 -15952 -98321 9956 55230 233270 321850 207208 238732 36550 -97012 -93167
8409 -93167 -57089 175205 544956 663692 260579 -28609 -301895 -314140 -91670 183941
8399 183941 589182 399663 -94595 -376469 -327521 -410613 -440565 26667 553257 643366
8389 643366 862612 714037 305500 174005 228605 -68183 -167591 39373 -90184 -166304
8379 -166304 -540027 -814645 -574628 -436261 -492284 -505419 -521254 -290487 -391306 -499523
8369d99523J82499L25246J73279l26859k63260K92396K76861J10494l05910J49782
8359A15005R7342J43299k5155k91929j81957J47510l3945Q9780L2114j30631R5105
8348E6538K98415j26998j12080j32876j08440p9193k17530j17325K0828O5540
8338d53121k0638P3326L95708K24029l01899j81366q9230M7633J34356J43158
8328b8044K4694K69060O5488k27140l24362J72730P1035N7103R6336K97723o0445
8317D14178m86757j52789L15324O3790P3678k2588R4935J74234j81802l35792
8307d3589j66367M98k10264J68000K94379L95111j38347l01785j21213j52194
8297b75771J62042j7520J38748M45366j07644l81285j71842l458L20885K47633
$$ plain form
8369 -499523 -317024 8222 181501 -145358 -408618 -116222 160639 271133 -34777 115005
8359 115005 212347 355646 330491 38562 -143395 4115 -29830 59950 92064 -38567 56538
8348 56538 354953 227955 115875 -17001 -125441 -204634 -422164 -539489 -518661 -453121
8338 -453121 -473759 -400433 -4725 219304 -82595 -263961 -353191 -305558 -171202 -28044
8328 -28044 -3350 265710 331198 104058 -220304 -47574 23461 80564 176900 474623 414178
8317 414178 -72579 -225368 89956 153746 227424 204836 299771 474005 292203 -43589
8307 -43589 -209956 -209458 -419722 -251722 42657 437768 299421 -2364 -123577 -275771
8297 -275771 -113729 -131249 7499 452865 345221 -36064 -207906 -211364 109521 357154
8287C57154j41065l30331K56556j57066j41557j44722j3450q0081J58533j71954
8277d07983l9111j27707r2147K60615K10439J62547L48996j53273j84547J68252
8267A46081L8048k50852j79799j76388J23032K15512n8993k05394K1109J01520
8257b26124K14385j16227j47158j90828K44519K16289l4773l02375k08654K281
8247e48665J13184L92537j78105r1428L32859P6049r1673K57773J28445k34580
8237A56396k24300J46772j67236j10185Q4825J76976M412K90739k05487k08827
8227e5915N9717n4079o761J08673J82490j56417O4196J01468k09271l72372R1043
8216b47228J1590j69294L96123K44827O0239Q5964n4891N5666O431l53347Q415
$$ plain form
8287 357154 216089 -114242 142314 -14752 -156309 -301031 -314481 -394562 -236029 -407983
8277 -407983 -447094 -574801 -666948 -406333 -195894 -33347 315649 162376 -22171 146081
8267 146081 184129 -66723 -246522 -422910 -299878 -84366 -143359 -348753 -327644 -226124
8257 -226124 -11739 -127966 -275124 -465952 -221433 -5144 -39917 -342292 -550946 -548665
8247 -548665 -435481 -42944 -221049 -312477 20382 96431 4758 262531 390976 156396
8237 156396 -67904 78868 -88368 -198553 -113728 63248 67660 358399 152912 -55915
8227 -55915 3802 -50277 -57038 51635 234125 77708 141904 243372 34101 -338271 -247228
8216 -247228 -235638 -404932 -8809 236018 296257 382221 327330 382996 389427 36080 44495
8205D4495m5502q7590n4791j00148J03117K89976p2921m9500p1268j74975k26358
8194d45465j20625J77484M03432J29683k9658j74847J8372Q894j82018j31690
8184c46438J02292P0165J25970j81087J1064j54954K23569K02541k20902l7580
8174b05360J34291M38987J49195l85491l72145Q2427l8022K48973n6356o6697
8164g0198j0765l5841L05668j735j75176m8596j54803l17166Q3727J63052k41108
8153e02941K56663K79341K21176K23418J13150m10799m0753J8892N560k34163
8143g0456j95149j2589K24141K41760j9073R5734K11458j21516k76224O0244K5618
8132A63948j58644l18169J95754L12763J1156J03741K09763j8158m10627m21572
$$ plain form
8205 44495 -1007 -88597 -143388 -243536 -140419 149557 76636 27136 -44132 -219107 -445465
8194 -445465 -566090 -388606 14826 144509 114851 -59996 -41624 -32730 -214748 -346438
8184 -346438 -244146 -173981 -48011 -229098 -218034 -372988 -149419 53122 -167780 -205360
8174 -205360 -71069 367918 517113 131622 -240523 -158096 -196118 52855 -3501 -70198
8164 -70198 -80963 -116804 188864 187129 11953 -36643 -191446 -508612 -424885 -261833 -502941
8153 -502941 -246278 33063 254239 477657 590807 180008 139255 158147 163707 -70456
8143 -70456 -265605 -278194 -54053 187707 168634 264368 475826 354310 78086 138330 163948
8132 163948 5304 -312865 -117111 195652 206808 310549 520312 502154 91527 -330045
8122c30045q1047j06136K6395L92855N33318M2584k0692r4307j83787k66070L7276
8111d9656j2448L0698m5501M5359K60395j16120m7363O1340q0673p9040K2048
8100a0961J69891m9283l60050j13636J23991J91169L06826j35020m0094M23833
8090E06666q6177k99816j99042j28778J27361K011L16694L4977N7617k19015k89169
8079a76671J27208J68985K39806L9803k93217p7717j23572k25728p4856K29490
8069a66469J63018j32803q8071J36532K98688K07299r4496j59891k48189K5070
8059e9312J33258J02515K15938j42618p9522L3673Q4920K51314j03798J93579
8049F29947P6134k90783k83483m1486l6337J4038k3477L11788K06105k36883n72545
$$ plain form
8122 -330045 -411092 -517228 -490833 -97978 435340 477924 457232 362925 179138 -86932 -49656
8111 -49656 -62104 -31406 -76907 -31548 228847 112727 65364 126704 46031 -33009 -10961
8100 -10961 158930 109647 -250403 -364039 -240048 -48879 257947 122927 82833 506666
8090 506666 420489 120673 -78369 -207147 -79786 -77775 238919 273896 331513 112498 -176671
8079 -176671 -49463 119522 359328 399131 105914 28197 -95375 -321103 -395959 -166469
8069 -166469 -3451 -136254 -224325 -87793 210895 418194 323698 163807 -84382 -59312
8059 -59312 73946 176461 392399 249781 170259 203932 288852 540166 436368 629947
8049 629947 706081 415298 131815 90329 53992 68030 44553 356341 562446 325563 -246982
8038b46982k95214J81803M16397K37256j60426j3058J81565K34196k52741m27653
8028a44857q2060p1471l11198L7549K96934L02870m1052J19789k28588r8892K74743
8017E3767o614j46601j12634j94332K9937K11527J67712j08217o7247j83665K60418
8006i5949M3902j76573K14417J29917M9069m9097l7724M4046M9710l30950l4425
7995a93657J06634L63332k9331J10581k40193l36675O8908k38783k18039K47966
7985c59257L3058n8931J64355J8832R1573L42281J10624j61582k7616K78567o9112
7974C62792m99582l44468J4398J02022l6272J9758j2515K76596n0346m88230o9203
7963g25050R5469L21989L83404J07164j25861J82407n0010l28960m3978J01106
$$ plain form
8038 -246982 -542196 -360393 56004 293260 132834 119776 301341 535537 282796 -144857
8028 -144857 -226917 -298388 -609586 -572037 -275103 27767 -13285 106504 -122084 -220976 53767
8017 53767 47153 -99448 -212082 -406414 -376477 -164950 2762 -105455 -172702 -356367 -95949
8006 -95949 -52047 -228620 -14203 115714 164783 115686 77962 122008 171718 -159232 -193657
7995 -193657 -87023 276309 246978 357559 117366 -219309 -150401 -389184 -607223 -359257
7985 -359257 -326199 -385130 -220775 -201943 -110370 231911 342535 180953 153337 431904 362792
7974 362792 -136790 -481258 -466860 -364838 -401110 -381352 -393867 -117271 -167617 -655847 -725050
7963 -725050 -629581 -307592 75812 182976 57115 239522 189512 -139448 -183426 -82320
7953h2320J24243K24899P1056J15175o8293N3867m02659j64773K05412J49881
7943B26488j67701o3303k54110L4112j20370N1519J63018o3271N2035K48643k15903
7932a08843j18362K32516M10602K8752M8995k80282p5069J97708J75436j31791
7922C79662m9188J05129K5165k05786l08546k5827P0663j06647l62099P2052K03289
7911b02133L62025J85388l53633o838j78321J35178J82179n3422k19709Q2496
7901f6790K74122l63290q6268K06183K2885L8512L59771J08252j16788k16087
7891A60502K8338l8628L30874j50831k00618K03197J93332j10787j59848q8977
7881A66554j52141o6981K45226J34798J10103n8151j78006l49199q5420K41794
$$ plain form
7953 -82320 41923 266822 337878 453053 384760 438627 35968 -128805 76607 226488
7943 226488 58787 -4516 -258626 -224514 -344884 -293365 -130347 -193618 -141583 107060 -108843
7932 -108843 -227205 5311 415913 444665 493660 213378 138309 336017 511453 379662
7922 379662 330474 435603 460768 254982 -53564 -79391 -8728 -115375 -477474 -405422 -202133
7911 -202133 159892 345280 -8353 -15191 -193512 -58334 123845 70423 -149286 -66790
7901 -66790 207332 -155958 -242226 -36043 -13158 25354 385125 493377 376589 160502
7891 160502 188840 150212 481086 330255 129637 332834 526166 415379 255531 166554
7881 166554 14413 -52568 192658 327456 437559 379408 201402 -147797 -233217 8577
7871H577J84704J09872j26418l0956K78026K9490j14096l51102k36324j48927
7861c97154N533J94213J7218J67571J51981j10817P4826l5899j9170n5682J80410
7850A73030k15990l3610J67074J6866j40678m8122L2051J32980K88k31827j65052
7839c12990J62287K5926l83428K76245L9542o0031K32813K52732N8399j76938
7829A14557m00675j76824L56459L35957j1518k05083l12758p1230N8194J85055
7819a27866O7198M3452K25023j87176j12358K09267K1851l22893k52574j17118
7809e53194J84159K17898M00906k24204m19532Q2726L17096K52883j52755k64996
7799a59013j7498m832m3322j6329J59013j53207j45502Q158L10450K35046p1669
$$ plain form
7871 8577 193281 303153 176735 145779 423805 453295 339199 -11903 -248227 -397154
7861 -397154 -391621 -197408 -180190 -12619 139362 28545 103371 67472 48302 -7380 173030
7850 173030 -42960 -76570 90504 107370 -33308 -81430 -49379 83601 83889 -147938 -312990
7839 -312990 -150703 -124777 -508205 -231960 -192418 -252449 -19636 233096 291495 114557
7829 114557 -286118 -462942 -106483 229474 217956 12873 -299885 -371115 -312921 -127866
7819 -127866 -60668 -17216 207807 20631 -91727 117540 139391 -183502 -436076 -553194
7809 -553194 -369035 -151137 249769 25565 -393967 -311241 5855 258738 105983 -159013
7799 -159013 -176511 -181343 -224665 -240994 -81981 -235188 -380690 -372532 -62082 172964 101295
7788A01295J26095J33433k46546l35162j8093J03563k25272k5904n7430J49199
7778b94822j6378j72268J09953j57309k65988j46093J35354K94989J90052R4408
7768b28102J72594j15354M2801J75395L76040J37464k15718o7445Q4583k14636
7758A47622j53591j70728K59499R9420o8055r1240J16882J08120L30064j51458
7748D26535k25123p5729k09042m3448r3716K33385O6114J9167J41771N8999p7411
7737B21502j19137k77178j61386j18737K64339J06120j1099j53414j85936j02400
7727e37326J27385L72807q4719k18112P4012J4101J79811R3333J37012k37696
7717g9392j1796K37704N3589r9287o3458k27460j60945J07489J20820p4091r2423
$$ plain form
7788 101295 227390 360823 114277 -220885 -238978 -135415 -360687 -386591 -444021 -294822
7778 -294822 -311200 -483468 -373515 -530824 -796812 -942905 -807551 -512562 -322510 -228102
7768 -228102 -55508 -170862 -128061 47334 423374 560838 345120 277675 362258 147622
7758 147622 -5969 -176697 82802 182222 114167 22927 139809 247929 577993 426535
7748 426535 201412 125683 -83359 -126807 -220523 12862 78976 98143 239914 298913 221502
7737 221502 102365 -174813 -336199 -454936 -190597 -84477 -95576 -248990 -434926 -537326
7727 -537326 -409941 -37134 -121853 -339965 -265953 -251852 -72041 21292 158304 -79392
7717 -79392 -91188 146516 200105 100818 37360 -190100 -351045 -243556 -122736 -196827 -289250
7706b89250m6647r5837M0911J09596j42195n3123K39614m7211j46929O0984J96062
7695a74025J6567K1552K63502j57319Q0164j62401q3233j26465j2629j15574Q9957
7684c59904N1761o1697M9461J27070N5469k6127l22938N7868J31394K14797M0468
7673d2378k31226K4111J52480l16977j32688k8496j7580P0778K7822p5563k0195
7662e89912Q4160K71481J72935l5983J7203Q6350j24194j31984j16633j70309
7652e36886O2997P0948Q797N6635J34742R0627J94676J59770l19477O7358M44960
7641D35147K857m50567j22604K28854P8926k52736k56849K91706Q9255j75736
7631a31747K13590l0857l31920j32502j18291j99449K16079J93546l9428j92809
$$ plain form
7706 -289250 -335897 -431734 -390823 -281227 -423422 -476545 -236931 -284142 -431071 -370087 -174025
7695 -174025 -157458 -135906 127596 -29723 50441 -111960 -195193 -321658 -334287 -449861 -359904
7684 -359904 -308143 -369840 -320379 -193309 -137840 -163967 -486905 -429037 -297643 -82846 -42378
7673 -42378 -273604 -249493 -97013 -413990 -546678 -575174 -592754 -521976 -494154 -569717 -589912
7662 -589912 -505752 -234271 -61336 -97319 -80116 6234 -117960 -249944 -366577 -536886
7652 -536886 -473889 -402941 -394144 -337509 -202767 -112140 82536 242306 -77171 -9813 435147
7641 435147 438004 -12563 -135167 93687 172613 -80123 -336972 -45266 43989 -131747
7631 -131747 81843 50986 -280934 -413436 -531727 -731176 -515097 -321551 -360979 -553788
7621e53788j30438J90206K70769R3428K18276M956j37516J45594l5404j05153
7611c9070J20772K31902J35720r0907l22682j79627O6611K46962j7711r3530o4502
7600f062j17147k45947j35432L35098K1673R3196L9892n3941J4826r6623r372
7589a59839j51809L44454J79846J185k52604k11552N3607K82643j87234k3677
7579a24980K89081Q8458P7292K2099j22771l94513j90071L26525j29836j21290
7569b80006M2093J41476R5654p9153J58236L3118K16486K01977l65705k72185
7559a08009K36534N7296L64332l8875j48199J55706o9321r7194j59712K7410k189
7548B17779n6335P8139J70471j43572k19515k43707k6940J9878Q6389l1865Q6626
$$ plain form
7621 -553788 -684226 -494020 -223251 -129823 88453 93409 -44107 101487 66083 -39070
7611 -39070 81702 313604 449324 358417 35735 -143892 -77281 169681 151970 58440 -6062
7600 -6062 -123209 -369156 -504588 -169490 -147817 -54621 -14729 -68670 -53844 -150467 -159839
7589 -159839 -311648 32806 212652 213837 -38767 -250319 -196712 85931 -101303 -124980
7579 -124980 164101 252559 329851 351950 229179 -165334 -355405 -28880 -158716 -280006
7569 -280006 -237913 -96437 -783 -79936 78300 111418 327904 529881 164176 -108009
7559 -108009 128525 185821 550153 511278 363079 518785 449464 352270 192558 219968 217779
7548 217779 161444 239583 410054 266482 46967 -196740 -223680 -203802 -117413 -149278 -62652
7537f2652J77563J8105p8343m04586N3721J70007p5138k98003Q7653n9730L19865
7526a51538J0662j41744j7010M9037p9878L9354K4685l074R884o6712J08680L56651
7514A38997K39384O7060l31455k69489L2314K16627k57955k3932J99499j5998
7504d948k22161k97710j54458R4630J00294J93901R1464O7799N1654K9283J9435
7493c0817Q6532k87394j51884O4806l4594j0852k25308q9987J49924L92m4311
7482e73493L35870L07238n3263k14449j1941j64869k34437Q7604L26331M76927
7472B81518J27402m25933k38899K01454j5903k59602R7360M9697L10830r305j85151
7461f6532j69816j10636L2756J50190J34961K2524K45977J07398k99446n9251
$$ plain form
7537 -62652 114911 133016 54673 -349913 -296192 -126185 -201323 -499326 -411673 -471403 -151538
7526 -151538 -140876 -282620 -299630 -250593 -330471 -291117 -266432 -269506 -259622 -326334 -217654 138997
7514 138997 378381 445441 113986 -155503 -123189 93438 -164517 -188449 11050 -4948
7504 -4948 -227109 -524819 -679277 -584647 -484353 -290452 -198988 -131189 -79535 -50252 -30817
7493 -30817 55715 -231679 -383563 -318757 -353351 -364203 -589511 -679498 -529574 -529182 -573493
7482 -573493 -237623 69615 16352 -198097 -210038 -374907 -609344 -521740 -195409 281518
7472 281518 408920 -17013 -255912 -54458 -70361 -329963 -232603 -182906 127924 118619 -66532
7461 -66532 -236348 -346984 -314228 -164038 -29077 -6553 239424 346822 47376 -11875
7451a1875J91947m68961q8746M43683j20246j58242J56296j45120j71535J25301
7441b47498q6275m0518J9295o7309o5049r3337j65021L16097K93836J28161j30877
7430a38495j61182k71732L09817J29383l17K29986J12565l6903j54679K89959
7420C08402J09703l26296m3592J94857j71647j08145M8280J26680r9181j69999
7410a30938k02646O432L78092K77223K74181l40149m27000j85868J37431L40660
7400A27418q42l55462K2115l34740r6480L14935j2694J32002J59089k19690j46916
7389d11265r2160j75288K88070L11273O7836R1672j37528o936K79183K75084r8257
7378C91684m13163L5484o4935l33117j54359M74738Q1421J1502P4669j73082n11235
$$ plain form
7451 -11875 180072 -288889 -377635 66048 -54198 -212440 -56144 -201264 -372799 -247498
7441 -247498 -333773 -374291 -354996 -422305 -487354 -580691 -745712 -429615 -135779 -7618 -138495
7430 -138495 -299677 -571409 -261592 -132209 -132526 97460 210025 173122 18443 308402
7420 308402 418105 91809 48217 243074 71427 -36718 11562 138242 39061 -130938
7410 -130938 -333584 -327152 50940 328163 602344 262195 -164805 -350673 -213242 127418
7400 127418 126576 -228886 -206771 -541511 -637991 -323056 -335750 -203748 -44659 -264349 -411265
7389 -411265 -503425 -678713 -390643 -79370 -11534 80138 -57390 -64326 214857 489941 391684
7378 391684 -21479 14005 -50930 -384047 -538406 -63668 17753 29255 103924 -69158 -580393
7367e80393K08543M44830o8285j57992M8362L41447J96013j7314j44177j99261
7357G1773J51722J47326r1889Q3524L3683P6537P1543j33143o00473m65163J04551
7346e50009J46528L56389O5382Q5190k51082j89585o595M5291l4201L1336K39391
7335f1965J63115k98321k67654J50174Q6618K9158K41466K5036j05091p6245O6037
7324d7672m9350l8060R8304k08348K40018J75159J09436r0009k63732L22188J46593
7313C94527K6608j60467k9617N44111j4461o7064q2619l22918l47054N4835J10174
7302A06055j05260j19450J28776j47829q6076J13878J69298K01592P4757l36128
7292c87j70550j13174j95643k53505M59612K22667J46454K1954k75204k67075
$$ plain form
7367 -580393 -371850 72980 4695 -153297 -104935 236512 432525 415211 271034 71773
7357 71773 223495 370821 278932 362456 396139 472676 544219 411076 -189397 -654560 -550009
7346 -550009 -403481 -47092 18290 103480 -147602 -337187 -343782 -298491 -332692 -301356 -61965
7335 -61965 101150 -197171 -464825 -314651 -228033 -198875 42591 67627 -37464 -113709 -47672
7324 -47672 -97022 -135082 -36778 -245126 -5108 170051 279487 189478 -74254 247934 394527
7313 394527 421135 260668 231051 775162 760701 693637 611018 288100 -58954 -4119 106055
7302 106055 795 -118655 10121 -137708 -223784 -109906 59392 260984 335741 -387
7292 -387 -170937 -284111 -479754 -733259 -273647 -50980 95474 117428 -157776 -424851
7282d24851J22152M91382k73629l3390J08955n945R8928K26776j36699j33821
7272C9858j32596N955j10594L53064J06771P9923q5269k13663K8619k20420n7047
7261b05399K11821K44682o9852r5682p0721k66350m38575l6017L08656M6216K51050
7250a20171J70596j05778J71892J46308m4321L0210l5982m7651j46042l17919
7240b98858N8075K20441k8848l12488j44356O3975Q1042L21191R1047r8595K29479
7229A82105J18628k41835m35224p1737j26298K38638L01135J25920M45j28282
7219c6505J6652K46939J88493j95655n9231J83600K40993m13377q9967J09555
7209A91497m9661j16571J17927k12165l34069l31226J12064J15053K77230Q7031
$$ plain form
7282 -424851 -302699 188683 -84946 -118336 -9381 -15326 83602 310378 173679 39858
7272 39858 -92738 -86783 -197377 155687 262458 342381 257112 43449 72068 -148352 -205399
7261 -205399 6422 251104 181252 85570 14849 -251501 -690076 -726093 -417437 -371221 -120171
7250 -120171 50425 -55353 116539 262847 218526 248736 212754 165103 19061 -298858
7240 -298858 -240783 -20342 -49190 -361678 -506034 -442059 -361017 -39826 51221 -47374 182105
7229 182105 300733 58898 -376326 -448063 -574361 -335723 -34588 91332 91777 -36505
7219 -36505 -19853 227086 415579 219924 160693 344293 585286 171909 81942 191497
7209 191497 141836 25265 143192 -68973 -403042 -734268 -622204 -507151 -229921 -142890
7199a42890Q8067Q5939L27448k39408j50648L0182j3179L3571K35368l50576l51190
7188d47316l4476M567O5062j46701j50242K9477J90006N2673J69652K07503Q3987
7177B4192j72462j1171m9731j6729k56331l6001O8308K79383n1571J31077L28945
7166B37909m2551l30176k15808J20816J79052K13798k10999k10047k10536O357
7156d62185K56626J3665j50211J64265K44355j74686q6271j79889j09155K19516
7146b63970K02892J73386R8107k55837j17903l4451L12330k88540J03797R6147
7136B5958n0488M6348j5733k3667n9957k00943K06342K59084k86687j95470k04712
7125d99925M5497p4636l11733K54800L20979j26846k54691J11795K26568J16236
$$ plain form
7199 -142890 -54823 31116 358564 119156 -31492 -1310 -14489 19082 254450 -96126 -447316
7188 -447316 -481792 -477225 -412163 -558864 -709106 -679629 -489623 -436950 -267298 -59795 24192
7177 24192 -148270 -159441 -209172 -225901 -482232 -518233 -449925 -170542 -222113 -91036 237909
7166 237909 195358 -134818 -350626 -229810 -50758 163040 -47959 -258006 -468542 -462185
7156 -462185 -205559 -191894 -342105 -177840 66515 -108171 -194442 -374331 -483486 -263970
7146 -263970 -61078 112308 210415 -45422 -163325 -197776 114554 -173986 -70189 25958
7136 25958 -24530 21818 6085 -17582 -77539 -278482 -72140 186944 -99743 -295213 -499925
7125 -499925 -454428 -529064 -840797 -585997 -265018 -391864 -646555 -534760 -308192 -191956
7115a91956J15251J6710K61222j12118n41272l20207K07538M7649K2263M37753
7105e7167J7156m7898j80535J68550J69866L3535n6688K39504j30074j07093K11224
7094B60380J15721j04236k24895l4310n6724j64246K6542J53132J67281p6033
7084F2612k09791J6524J74847J83316k45208k16711j60805j53133L0116J23676
7074c94557K76542L65194P7159k48237n7440n7487j17366k36350m1689q0194l1509
7063e45934J46242J82294J49091l6476J23555J63168R0821l38568O947J74685
7053A15825P5253R2831Q3703j42183k7379K11562R0341m37338k16555P4566K67838
7042A88464m0967l21136R2418K81701Q8252j38961k61918l4256j57813J6128K17452
$$ plain form
7115 -191956 -76705 -59995 201227 89109 -452163 -772370 -564832 -517183 -494920 -57167
7105 -57167 -40011 -87909 -268444 -99894 69972 103507 46819 286323 156249 49156 260380
7094 260380 376101 271865 46970 12660 -44064 -208310 -181768 -28636 138645 62612
7084 62612 -147179 -130655 44192 227508 -17700 -234411 -395216 -548349 -518233 -394557
7074 -394557 -118015 247179 324338 76101 18661 -38826 -156192 -392542 -434231 -514425 -545934
7063 -545934 -399692 -217398 -68307 -104783 18772 181940 272761 -65807 -58860 115825
7053 115825 191078 283909 367612 225429 198050 409612 499953 62615 -153940 -79374 188464
7042 188464 147497 -173639 -81221 200480 288732 149771 -112147 -146403 -304216 -288088 -70636
7031g0636J42052O8722J01116r7923k8047J34279m5164M7703j86354k63590j41389
7020c39231j3692N6167J14375J47029J55492q9617k97820J704j13827K3916M6856
7009c08648J44339J48334J06596q5772j1611J98105p7398K25695K25165k30766
6999C34039n33282Q949J74884K65501K73645k09190j37729n00799k9901J93618
6989a60265L59752M20129j77315l83573m1497m42774m35511K57426K02676J07506
6979b93446o4447j28712K71412N9864q6977j16414J27638K33452j02533k42904
6969c43067k74672P8296l8378q3755K57824J13383K95656k10823j96840J01243
6959c01133K796J18940J76315K93190q9474m6507j9471l56035L3787J04837Q7636
$$ plain form
7031 -70636 71416 140138 241254 143331 115284 249563 204399 252102 65748 -197842 -339231
7020 -339231 -352923 -296756 -182381 -35352 120140 30523 -267297 -265593 -379420 -355504 -308648
7009 -308648 -164309 -15975 90621 4849 -6762 191343 113945 339640 564805 334039
6999 334039 -199243 -190294 -15410 250091 523736 314546 176817 -323982 -353883 -160265
6989 -160265 199487 619616 442301 58728 17231 -425543 -861054 -603628 -400952 -293446
6979 -293446 -357893 -486605 -215193 -155329 -242306 -358720 -231082 2370 -100163 -343067
6969 -343067 -617739 -539443 -577821 -661576 -403752 -290369 5287 -205536 -402376 -301133
6959 -301133 -298337 -179397 -3082 290108 200634 154127 134656 -221379 -187592 -82755 4881
6948D881J28686p832p8555o7751K31192L53575J98262P352j80512k42698j76674
6937A69926j91021j68358J63591J73113n4270J30684J69172J38978j72563k42767
6927A16485k45195Q4151Q5401l9271J17677l1466j51959k73498j09803K95744
6917a51734M94743k2217k3422R8097M06933J60827q4368l25263k12837J72959
6907E13718k71970l27764k84789J19776L39853L19884N1184l38321k42908K5426
6897i5911O4361K84566k96202j52697l80423k48855K0302M07376J08190J27656
6887a61637K14511n3800k68363K473K42076J42582R169K36794l90797l89268J04078
6876c12182L18418j14914j54500J25008j64929k38989r7377K88124M64416j5510
$$ plain form
6948 4881 133567 125735 47180 -20571 210621 564196 762458 769810 589298 346600 169926
6937 169926 -21095 -189453 -25862 147251 92981 223665 392837 531815 359252 116485
6927 116485 -128710 -44559 40842 1571 119248 87782 -64177 -337675 -447478 -151734
6917 -151734 343009 320792 297370 395467 802400 963227 878859 553596 340759 513718
6907 513718 241748 -86016 -370805 -251029 88824 408708 459892 121571 -121337 -95911
6897 -95911 -31550 253016 -43186 -195883 -576306 -825161 -804859 -397483 -289293 -161637
6887 -161637 52874 -926 -269289 -266816 -24740 117842 127011 363805 -26992 -416260 -312182
6876 -312182 6236 -108678 -263178 -138170 -303099 -542088 -639465 -351341 113075 97565
6866I7565K4431J86573m87125k6570L18309N9854K3532r8557o3868k11832K842
6855a74846P9201J11854K8296J0052m3218k25664j18513K75767M232j22061J05968
6844f8932n2005K22130K76217k42340m0658j45309l1608J09625r4507j00328j63588
6833c31303j81508Q4281j39465q379J01445K1799j69762J13858L10172k9113K23
6822b27752p9597k1368q6131j11476L07675M17303L41696j60592n19103j39930
6812b79275k23052N8520M24844r2909M6826K45617J25771j28467J81128j68494
6802A90509J6911K27117j64201O6341J15367p4614J31305j74832m27452n9957
6792a53506K75966j27225j88801k1824K79654L03632J46529k03287k55851q2582
$$ plain form
6866 97565 121996 308569 -178556 -205126 113183 173037 196569 98012 34144 -177688 -174846
6855 -174846 -95645 16209 44505 54557 11339 -214325 -332838 -57071 -52839 -174900 -68932
6844 -68932 -120937 101193 377410 135070 94412 -50897 -82505 27120 -67387 -167715 -331303
6833 -331303 -512811 -428530 -567995 -576374 -474929 -453130 -622892 -509034 -198862 -227975 -227752
6822 -227752 -307349 -328717 -414848 -526324 -218649 198654 540350 379758 -139345 -279275
6812 -279275 -502327 -443807 -18963 -111872 -65046 180571 306342 177875 359003 190509
6802 190509 207420 434537 270336 336677 452044 377430 508735 333903 -93549 -153506
6792 -153506 122460 -4765 -193566 -215390 64264 367896 514425 311138 55287 -27295
6782b7295p261j60j67035l4959k45742L0750L63105L83712L32460j33271o0066
6771D34238l47784o9412O9913J80603L10483N160J20859k10182k30539K05181
6761D68520j94452l97190L4346J28204R552J36431J4547k64781m9999l8738p7373
6750b30933J04297J52337Q217j4154l06351l36529r0026L06951L09683j37016
6740b33524m9280n2875J52436O3426m1372J01450L07162K32740j33098q337j81831
6729A56897m4712k51474k25459L69776R0742K000q8311O2194M2501n4415q5746
6718b6007N3058L5812O453k26074N8851J14668l53110j81629P6553J39633M2355
6707b59437J63355L57395J45568l00497l01696J46746M44918j71842J73724J7843
$$ plain form
6782 -27295 -34556 -34716 -201751 -236710 -482452 -451702 -88597 295115 627575 494304 434238
6771 434238 86454 17042 86955 267558 578041 583201 704060 493878 263339 468520
6761 468520 274068 -123122 -88776 39428 48980 185411 199958 -64823 -114822 -153560 -230933
6750 -230933 -126636 25701 33918 19764 -286587 -623116 -713142 -406191 -96508 -233524
6740 -233524 -282804 -335679 -183243 -119817 -161189 -59739 247423 480163 347065 338728 156897
6729 156897 112185 -139289 -364748 5028 95770 97770 9459 71653 114154 59739 -26007
6718 -26007 27051 62863 69316 -156758 -97907 16761 -336349 -517978 -441425 -301792 -259437
6707 -259437 -96082 261313 406881 106384 -195312 -48566 396352 224510 398234 416077
6697D16077n68587k14526J2763J23025K99099l9270q3260L52564K46242J49158
6687F93285q3340l39874q8831J78936k1893J16533K45660n0276l24243k26239
6677I9718j88099J72199j50093k82636o7465l2906L4898O3024Q2023M35306J43610
6666C09579o8009j66175m1738K07959r28j70596J16776l66844n96343J40566O2089
6655e73664L174j77420L46996L75122M69030r1564j29180l7886j90922Q5816k29810
6644a50308r1563K08747K08194O9136R9647j1944r2660j17567J26450j49504k26004
6633a27376j96343K90533n6620j51048l6413K56870K34216j37328n9897r3368
6623g6774j79320k14517j9167J29704K55192M7584P9375M9103K41601k9925j63852
$$ plain form
6697 416077 -152510 -367036 -354273 -231248 67851 28581 -54679 297885 544127 693285
6687 693285 609945 270071 181240 360176 338283 454816 700476 650200 325957 99718
6677 99718 -88381 83818 -66275 -348911 -416376 -449282 -414384 -351360 -269337 165969 309579
6666 309579 241570 75395 33657 241616 240688 70092 186868 -179976 -776319 -635753 -573664
6655 -573664 -570490 -747910 -400914 -25792 443238 351674 222494 184608 -6314 79502 -150308
6644 -150308 -241871 -33124 175070 244206 343853 331909 239249 121682 248132 98628 -127376
6633 -127376 -323719 -33186 -89806 -240854 -277267 -20397 213819 76491 16594 -76774
6623 -76774 -256094 -470611 -489778 -360074 -104882 -57298 22077 71180 312781 282856 119004
6612A19004M007r3214J72340M74534K7841m40410j48898j57664k42112J01626
6602a82946k68346j62995K27997J32214M3534J59962M43610J08334k21124k30527
6592D9713j7102j00501L3855j41721K30968o8184j5444R6192j85397m9483j37827
6581c04931j38533M06154l2865j41089J59780O1151j9656o5164r4483l0014L29773
6570A30123K22143l21183k62852k9440q1837J22022L82225n2n1116Q5374j21872
6559G3535l55068k42014J17477L73830L6582J07824J32625P0720n0743k38945
6549B5823J960K53968J74690k01517k0116Q9971K77708k59574k91181J3197M4266
6538A09195r0916P8973P8285p4768J44347K6854J31388K18732m39628j64962O6853
$$ plain form
6612 119004 123011 29797 202137 676671 704512 264102 115204 -42460 -284572 -182946
6602 -182946 -451292 -614287 -386290 -254076 -210542 -50580 393030 501364 280240 49713
6592 49713 32611 -67890 -34035 -175756 55212 -12972 -28416 67776 -117621 -167104 -304931
6581 -304931 -443464 -37310 -70175 -211264 -51484 9667 -9989 -75153 -169636 -199650 130123
6570 130123 352266 31083 -231769 -261209 -343046 -221024 161201 161149 110033 195407 73535
6559 73535 -281533 -523547 -406070 -32240 4342 112166 244791 315511 264768 25823
6549 25823 27783 281751 456441 254924 234808 324779 602487 342913 51732 64929 109195
6538 109195 18279 97252 175537 100769 245116 271970 403358 622090 182462 17500 84353
6527H4353j28503j6600q3534k72755j12217Q7816L36162Q5498J27302k27902P3644
6516d6736j66360j49570m3199J27950J72268K75523P9072k26754l16348M2825
6506b51329K92035J12039O9070k27206k62133R2451K28121k1550J64430Q3362
6496B79290j38889J39690p4785k64779j89477q6402J14900j40423k74997J28211
6486e07661K16985L85268J65401J77896l81459k54902j44339K82224N3546l02664
6476c09705q2330j38069J06310r1765K62284J74526m4965Q5033j06600r0078K28226
6465g133k67244j45256J01976K10447J24872Q7014K4306J82371j08136k38378
6455c5161j47384N3916j8429l076J16229J09794J24398l33760j46093j46727L97380
$$ plain form
6527 84353 -44150 -60750 -144284 -417039 -529256 -441440 -105278 -19780 107522 -120380 -46736
6516 -46736 -213096 -362666 -405865 -277915 -105647 169876 248948 22194 -294154 -251329
6506 -251329 40706 152745 221815 -5391 -267524 -175073 53048 31498 195928 279290
6496 279290 140401 280091 205306 -59473 -248950 -335352 -220452 -360875 -635872 -507661
6486 -507661 -290676 94592 259993 437889 56430 -198472 -342811 -60587 -7041 -309705
6476 -309705 -392035 -530104 -423794 -515559 -253275 -78749 -123714 -38681 -145281 -235359 -7133
6465 -7133 -274377 -419633 -317657 -107210 17662 104676 128982 311353 203217 -35161
6455 -35161 -182545 -128629 -147058 -150134 -33905 75889 200287 -133473 -279566 -426293 -28913
6444b8913K70469j1126j05404l38463J33682K58511K6328M8487l1712J34403j50141
6433B06121j55583o0916r1074l78180k22750J88957n114J67046L38495j56321
6423a69319k6853j30395J13895q3428J49353L53886q0556p3013L5414k74666k84528
6412d70210J51242J39705l64220Q602O1910N6831L69701j6004k5160R2438J24830
6401A29665K58174j03704j09901j7895l2050j54289m46252L63937J87153j28958
6391e4120r2520L6708Q0383J21686k22070j47470k47375J41899K53289R6963j93356
6380b25983j26586P8202j08011N5219J28K00265K74901L14468q5154P2727n5670
6369C94506l1922P4540Q1097l54396m72650J06008J03376N982p0027J4162J75730
$$ plain form
6444 -28913 241556 230430 125026 -213437 -79755 178756 205084 253571 221859 356262 206121
6433 206121 50538 -10378 -101452 -479632 -702382 -513425 -518539 -351493 -12998 -169319
6423 -169319 -196172 -326567 -212672 -296100 -146747 207139 126583 53570 88984 -185682 -470210
6412 -470210 -318968 -179263 -543483 -534881 -472971 -416140 -46439 -62443 -87603 4835 129665
6401 129665 387839 284135 174234 156339 124289 -30000 -476252 -112315 74838 -54120
6391 -54120 -146640 -109932 -29549 92137 -129933 -277403 -524778 -382879 -129590 -32627 -225983
6380 -225983 -352569 -274367 -382378 -327159 -327031 -126766 148135 462603 377449 450176 394506
6369 394506 362584 437124 518221 163825 -308825 -202817 -99441 -93459 -163486 -149324 26406
6358B6406l53410J29874K544O7114L34283k8880k54867k10512M2149J41416K1419
6347h2464J51053K9212L1451J88859l65286l21363J73600j38275j08003K77899
6337a63317K02051j4575j61865K10381k03146m37456o713J36757J23984j23058
6327d36957J19243O5094k40480k6692K80926m9716J72625M513l94603N288L08700
6316a92059K70805J83966j19719J09206k5151k13599k60609J41145M74031J88000
6306E56016k32900l26896m40488j57973J28577L14996Q5503J10263J58799J88168
6296C84065m9851k54422j78898j94349n2934O256J5583K07586K49948k47534j52472
6285b67022K41914K72723O3831K75639J48516k13459k94708L5073J37001q6144
$$ plain form
6358 26406 -327004 -197130 -194586 -127472 206811 177931 -76936 -287448 -245299 -103883 -82464
6347 -82464 68589 97801 129252 318111 -47175 -368538 -194938 -333213 -441216 -163317
6337 -163317 38734 24159 -137706 72675 -130471 -567927 -574640 -437883 -313899 -436957
6327 -436957 -317714 -252620 -493100 -519792 -238866 -288582 -115957 -111444 -506047 -500759 -192059
6316 -192059 78746 262712 142993 252199 227048 13449 -247160 -106015 368016 556016
6306 556016 323116 -3780 -444268 -602241 -473664 -158668 -73165 37098 195897 384065
6296 384065 334214 79792 -99106 -293455 -346389 -340133 -324550 -116964 132984 -114550 -267022
6285 -267022 -25108 247615 311446 587085 735601 522142 227434 262507 399508 313364
6275C13364l17736o9804K05841j06188J36006R7600P2592P1863l87652k61901
6265b46015m5903O9548k2869M4081J27057L1159J74911R3912K02427R3646m42043
6254G9911r343k0983K964l726J73q5009j34175j47491M30912J43907N2995J21638
6242D31773j53196k61751j68042L70263J27766k98508r0639K07425j85801j20709
6232a41419k80029j08054O7380N9154J24435J24896k8844r5462J65848K48212
6222A36117K48384O9721J9828j77425k24454p3994m22048j96409O344J96481K93091
6211a24364J07469J28721M3376K3567L12184K06063r4087m21080K5291K2753j77614
6200E2279J85217j14872M087K61627K16640j33284K02590j06892l02736k28826
$$ plain form
6275 313364 -4372 -74176 131665 25477 161483 259083 331675 403538 15886 -246015
6265 -246015 -291918 -222370 -245239 -201158 -74101 -42942 131969 225881 428308 521954 79911
6254 79911 70568 49585 52549 48823 48996 -36013 -170188 -317679 113233 257140 310135 431773
6242 431773 278577 16826 -151216 219047 346813 48305 -42334 165091 -20710 -141419
6232 -141419 -421448 -529502 -462122 -402968 -278533 -153637 -182481 -277943 -112095 136117
6222 136117 384501 454222 474050 296625 72171 -1823 -423871 -620280 -613936 -417455 -124364
6211 -124364 -16895 111826 155202 178769 490953 697016 602929 181849 207140 229893 52279
6200 52279 237496 122624 126711 388338 604978 471694 674284 567392 264656 35830
6190C5830k07467m6090L38701k17635n797p0933j87011J97520J6634l76986N799
6179e17435j50743j0373q219L11079J58546j42945r4434J73527L97798M8224k4185
6168A40840O0116J57803k07R5597J69498j94750j95960O0860J05394j64082j12288
6157A22821l02330k97739L8835K54947K49344K25470n0256J49055l09012k46963
6147a65828L2978J90278m6258J2703j65253k54030K17556L50972l30394j03478
6137b60754K77483M30953J25308l78459j33912n1196j11378l14288J75310M42071
6127B01138j55298l31776m37505L2946J22616k8141L9537J36751K10533J65411
6117d3788m12668l6886M83803J04506j06558Q1969o1253n1488J87557j62380n1237
$$ plain form
6190 35830 -171637 -217727 120974 -96661 -102458 -173391 -360402 -162882 -146248 -523234 -517435
6179 -517435 -668178 -678551 -686770 -375691 -217145 -360090 -454524 -280997 116801 165025 140840
6168 140840 200956 358759 358552 454149 623647 428897 232937 293797 399191 235109 122821
6157 122821 -179509 -477248 -438413 -183466 65878 291348 241092 390147 81135 -165828
6147 -165828 -132850 57428 11170 23873 -141380 -395410 -177854 173118 -157276 -260754
6137 -260754 16729 447682 572990 194531 60619 9423 -101955 -416243 -240933 201138
6127 201138 45840 -285936 -723441 -690495 -567879 -596020 -556483 -419732 -209199 -43788
6117 -43788 -456456 -493342 -9539 94967 -11591 70378 9125 -42363 145194 -17186 -68423
6106f8423m8243k58926j8305L7071j40054K56687J73010k01630j74149J99364
6096b43598J94290L14628J79297k31032Q1798j25975l42407P8186k05631n9744
6086c60188J69566J29455j39732K04448J16010O8430p2658k63865K5480m1878
6076a64932j51556O354N5505P3436K70892N7791k87305j15804J74308R7280q6154
6065g0185J38651k95252L069L38720m7437r8154K1783l67216r3270k52085o0084
6054g81460J90806K83782j69990J70798J15149J36466k25800k73168j32601k3039
6044g09057K47667P8570J01930K09275J28061j20798l00984j17987J37429L24199
6034b1695N33752J84791L374j21909m06868q6672m4114M7643n4209O9835M589
$$ plain form
6106 -68423 -116666 -375592 -393897 -356826 -496880 -240193 -67183 -268813 -442962 -243598
6096 -243598 -49308 265320 444617 213585 295383 169408 -172999 -94813 -300444 -360188
6086 -360188 -190622 -61167 -200899 3549 119559 187989 115331 -148534 -123054 -164932
6076 -164932 -316488 -310134 -254629 -181193 89699 147490 -139815 -255619 -81311 15969 -70185
6065 -70185 68466 -226786 -223717 115003 67566 -30588 -8805 -376021 -469291 -721376 -781460
6054 -781460 -590654 -306872 -476862 -306064 -190915 -54449 -280249 -553417 -686018 -709057
6044 -709057 -461390 -382820 -280890 -71615 56446 -64352 -365336 -483323 -345894 -21695
6034 -21695 512057 696848 700222 578313 171445 84773 40659 88302 34093 103928 108517
6023A08517j17275j95767k24102J44037J94675J51896J49054L65940l10581j63673
6013A02721l40732J14290k94886j68498L94979M90652J47625m02264m95599J01097
6003c50615L48235n2382o4135L80924k8499j96429k3206j93691k6239R3068K4534
5992h8435N8504J5299n1269k18956M59380J89944k07345j93441R9635k64677j05861
5981c07222M6330p6205J07013p0183k09503J24378j20704O4474L06983O42006
5971E07367J9478q080J71167Q9545K3686k82853n66834k2853O0101K51346j29764
5960A12306j45418K4577k59811l49768O2108L26358N44730l6943j44352j23703
5950A0084P3730Q4294K44505m0471k001o6668m1581N4410p4720j59317K269j16901
$$ plain form
6023 108517 -8758 -204525 -428627 -284590 -89915 61981 211035 576975 266394 102721
6013 102721 -238011 -123721 -418607 -587105 -192126 298526 446151 43887 -451712 -350615
6003 -350615 -2380 -54762 -118897 262027 233528 37099 13893 -179798 -206037 -112969 -88435
5992 -88435 -29931 -14632 -65901 -284857 174523 364467 157122 -36319 63316 -201361 -307222
5981 -307222 -260892 -337097 -230084 -300267 -509770 -385392 -506096 -441622 -134639 507367
5971 507367 526845 518765 689932 779477 803163 520310 -46524 -69377 -9276 242070 112306
5960 112306 -33112 -8535 -268346 -618114 -556006 -229648 315082 278139 133787 10084
5950 10084 83814 168108 412613 372142 370141 303473 261892 316302 241582 82265 84534 -32367
5938c2367Q1360P2043P3295K5783j87773m80805j38618N1097L13053L07774j0044
5927G4798k40035k5989l0237N2763O4848N3557r2788k38019J41461L80965k53491
5916a12167j26606J99758k03582k9299l45865j28170Q3208K07447K70776K39920
5906E5420l7739q8437K92654K51021k98996k05464K38509K56889j84521k18494
5896F0842q1048n2783P1377n9412J305K4127K21632j26810n41660k41552J61843
5885e62139K96423p6627K31013J29908m5593J78284L5850j08604P1952j47232
5875C235m30921k827J39970L79128k14476O06J5276J59221J83279K42730j52761
5864C22460K71212N775j21992k97508j83210j37302L47287j60767j74858N727
$$ plain form
5938 -32367 48993 121036 194331 220114 32341 -448464 -587082 -535985 -222932 84842 74798
5927 74798 -165237 -191226 -221463 -168700 -103852 -50295 -143083 -381102 -239641 141324 -112167
5916 -112167 -238773 -39015 -242597 -271896 -617761 -745931 -662723 -455276 -184500 55420
5906 55420 17681 -70756 221898 472919 173923 -31541 206968 463857 279336 60842
5896 60842 -20206 -72989 -1612 -61024 -59719 -35592 186040 59230 -482430 -723982 -562139
5885 -562139 -265716 -342343 -111330 18578 -27015 151269 187119 78515 150467 3235
5875 3235 -427686 -430513 -290543 88585 -125891 -125285 -110009 49212 232491 475221 322460
5864 322460 593672 599447 477455 179947 -3263 -140565 206722 45955 -128903 -123176
5854a23176j76475m20499j64052K61985K69178O5806P4948K34043R4863K06904
5844C23525q7971k42899q594j1952Q2161m7816J16879J73975N8370n4308j34789
5833A66581j67676k42973l00012l5725m67920L4214K54310M34059J27621P0568
5823a26953K03637k7618j27278Q9850r4268k33910J14408J05315J46687j09669
5813e9799J07516J46784p0009n63774J30187L42758Q0953N736M8726J22851J6539
5802C08468l21933n0149j2972K52409L67201L1724m96880n30749Q5030J27383
5792b40468J32727Q1307L5108J24662M5951l50914l04393j48655K43886J08303
5782b72486j58597R2750L49100J94052K00372p2851m83308j00666k31095m7192
$$ plain form
5854 -123176 -299651 -720150 -884202 -622217 -353039 -287233 -212285 21758 116621 323525
5844 323525 235554 -7345 -15939 -27891 54270 6454 123333 297308 355678 301370 166581
5833 166581 -1095 -244068 -544080 -579805 -1047725 -1013511 -759201 -325142 -197521 -126953
5823 -126953 76684 49066 -78212 11638 -82630 -316540 -202132 -96817 49870 -59799
5813 -59799 47717 194501 124492 -439282 -309095 33663 114616 120352 169078 291929 308468
5802 308468 -13465 -63614 -76586 175823 543024 574748 77868 -452881 -367851 -240468
5792 -240468 -107741 -26434 8674 133336 179287 -171627 -476020 -624675 -380789 -272486
5782 -272486 -431083 -338333 10767 204819 405191 332340 -150968 -251634 -482729 -529921
5772e29921o47L28784K62526k4877K77862k28963J48110J41817j84262k57876
5762f7447N1907N7113k5886j9459j2564J03793l59842Q8338M01359m0148L9173
5751B16337K90860J39386j82262k18869k49856n15128l05738M87809L05086L2036
5741c39M0879j44396p0893J50631J48724m6798k46135J33715K92880q3871l67038
5730a92641J74607L91021K7797l03686q1728J30711n8374k46933j26162M72974
5720A87586J48617j62495j00688j9940l20658K8633J43320L00561M0791j24553
5710A21174J425K3030p6684l25695p8788L3034K6358J27628M25972R1653p2589
5699B96518K0875j33563j42821l64934P5920L12112K28146j11048r5887j30995
$$ plain form
5772 -529921 -530568 -201784 60742 35865 313727 84764 232874 374691 190429 -67447
5762 -67447 -15540 41573 15687 -3772 -16336 87457 -272385 -184047 217312 177164 216337
5751 216337 507197 646583 464321 245452 -4404 -519532 -825270 -337461 -32375 -339
5741 -339 40540 -103856 -174749 -24118 124606 77808 -168327 -34612 258268 174397 -192641
5730 -192641 -18034 372987 400784 97098 15370 146081 87707 -159226 -285388 187586
5720 187586 336203 173708 73020 53080 -267578 -238945 -95625 204936 245727 121174
5710 121174 122599 145629 68945 -256750 -335538 -302504 -276146 -148518 277454 369107 296518
5699 296518 317393 183830 41009 -323925 -248005 64107 292253 181205 85318 -45677
5689d5677K27196M3191r8031j54848k65212j53759J17630J91138J3120O0446N53278
5678D88472j27544l45485N3065j75237l91973j21591N09996J7215j54993j35375
5668c83450j34530k4896J43682O0461q2860O1526R7438J81249J20901p8181k76816
5657c15476l9975J62899J33091q1317J18719k0116K067m6712j11889m4656j40360
5646c83725M08930n4075J18762K04863K17460r5140j26297j64497n5716l32544
5636b61979K16813K14801l57651k48806j73979N5920K05656o0130J45164J77399
5626h6792M49651j60294j97725N1471M36950J52733m4980l91683k66928M1747
5616a5850N0937m23980R0055K05758J8398k23162n608q5860k0841K88413K85898
$$ plain form
5689 -45677 181519 224710 126679 -28169 -293381 -447140 -329510 -138372 -125252 -64806 488472
5678 488472 360928 15443 68508 -106729 -498702 -620293 -110297 -93082 -248075 -383450
5668 -383450 -517980 -542876 -399194 -338733 -421593 -360067 -262629 -81380 39521 -38660 -315476
5657 -315476 -355451 -192552 -59461 -140778 -22059 -42175 -40108 -86820 -198709 -243365 -383725
5646 -383725 25205 -28870 89892 294755 512215 417075 290778 126281 70565 -261979
5636 -261979 -45166 169635 -188016 -436822 -610801 -554881 -349225 -409355 -264191 -86792
5626 -86792 362859 202565 4840 56311 493261 645994 601014 209331 -57597 -15850
5616 -15850 35087 -388893 -298838 -93080 -74682 -297844 -303452 -389312 -410153 -121740 164158
5605A64158q4911j24647K3919J18926l52K06610j40640k46398Q1508j4767J73191
5594A56597l63299j05682Q8509J665j45185L2486R6419R5409K55173J19551l10655
5583g9012l4893Q8345k31861r1255L86123J30791j63486n2793k6102m8988R1265
5572c1866K6011j5304J09545p0834O6591N4168q2894r56P6403J22219K02797k4948
5560D30932j88660J03521o1215M1141l06716l50968k22956M7948m3358R1999p3112
5549e31444m922M45751J48922n925n3920O9822J4804N3647O5406L6243O5575N097
5537C09056k53407j91696M49145J24100l25353j48823R0568q556l68006N8082
5527b64890J33012J0698j06035o7473p1787J49995j0483k42437L1519J45733j44715
$$ plain form
5605 164158 79247 -45400 -21481 97445 97093 303703 163063 -83335 -1827 -16594 156597
5594 156597 -206702 -312384 -223875 -222210 -367395 -334909 -238490 -143081 112092 231643 -79012
5583 -79012 -113905 -25560 -257421 -348676 37447 168238 4752 -48041 -74143 -123131 -31866
5572 -31866 -5855 -21159 88386 17552 84143 138311 55417 54461 130864 253083 455880 430932
5560 430932 242272 345793 284578 325719 19003 -331965 -554921 -506973 -550331 -458332 -531444
5549 -531444 -536366 -90615 58307 52382 -1538 68284 83088 136735 202141 238384 303959 309056
5537 309056 55649 -136047 313098 437198 111845 -36978 53590 45034 -322972 -264890
5527 -264890 -131878 -121180 -227215 -294688 -366475 -216480 -226963 -469400 -437881 -292148 -436863
5516d36863K07863K48860j14121j42806p4178J76194j22399j88870L39720K68269
5506A61669j54526l05268p317R5490p6706L3606L5588R4465J20769k30527j52642
5495c85399o8841K24365L15886J15174j60311j54929l04124K07828M63349N7219
$$ plain form
5516 -436863 -229000 19860 -94261 -237067 -311245 -135051 -257450 -446320 -106600 161669
5506 161669 7143 -298125 -305442 -209952 -286658 -253052 -217464 -122999 -2230 -232757 -385399
5495 -385399 -454240 -229875 86011 201185 40874 -114055 -418179 -210351 252998 310217
$$ [...]
##END NTUPLES=NMR SPECTRUM
##END=
