##TITLE=Analysis number 317218
Compound Code btb 13291
Project Code adrs
Chemist Name stores
##JCAMPDX= 6.0         $$ Bruker NMR JCAMP-DX V2.0
##DATA TYPE= NMR SPECTRUM
##DATA CLASS= NTUPLES
##ORIGIN= Bruker BioSpin GmbH
##OWNER= nmr
$$ XWIN-NMR		Version 3.5
$$ Mon Feb 13 09:12:46 2006 GMT Standard Time (UT+0h)  MAYBRIDGE\nmr@NMR_250MHZ
##.OBSERVE FREQUENCY= 250.131544655141
##.OBSERVE NUCLEUS= ^1H
##.ACQUISITION MODE= SIMULTANEOUS (DQD)
##.ACQUISITION SCHEME= undefined
##.AVERAGES= 16
##.DIGITISER RES= 18
##SPECTROMETER/DATA SYSTEM= dpx250
##.PULSE SEQUENCE= zg30
##.SOLVENT NAME= CDCl3
##.SHIFT REFERENCE= (INTERNAL, CDCl3, 0, 16.522)
##AUDIT TRAIL= $$ (NUMBER, WHEN, WHO, WHERE, WHAT)
$$ ##TITLE= Audit trail, XWIN-NMR		Version 3.5
$$ ##JCAMPDX= 5.01
$$ ##ORIGIN= Bruker BioSpin GmbH
$$ ##OWNER= nmr
$$ C:\u/data/dgb/nmr/ADRS/15910/pdata/1/auditp.txt
$$ ##AUDIT TRAIL=  $$ (NUMBER, WHEN, WHO, WHERE, WHAT)
(   1,<2006-02-13 09:12:04.27 +000>,<MAYBRIDGE\nmr>,<NMR_250MHZ>,
      <created by zg, POWCHK disabled, PULCHK disabled
       configuration hash MD5:
       84 BC 41 DB A1 6E 1D 46 DA 25 12 A5 C1 ED C5 3A
       data hash MD5: 64K
       6C FE 77 FA 24 5F 45 12 BF F6 51 D4 CF 8B DA 16>)
(   2,<2006-02-13 09:12:22.56 +000>,<MAYBRIDGE\nmr>,<NMR_250MHZ>,
      <Start of raw data processing
       ef LB = 0.3 FT_mod = 6 PKNL = 1 SI = 32K 
       data hash MD5: 32K
       55 2F 81 B9 7F 87 FD 2B B5 73 A0 FA 05 11 92 7A>)
(   3,<2006-02-13 09:12:27.47 +000>,<MAYBRIDGE\nmr>,<NMR_250MHZ>,
      <apk 
       data hash MD5: 32K
       A2 43 9F DB 51 A2 83 D4 55 71 C4 58 E5 D4 DC EF>)
(   4,<2006-02-13 09:12:28.70 +000>,<MAYBRIDGE\nmr>,<NMR_250MHZ>,
      <abs ABSG = 5 
       data hash MD5: 32K
       E3 6F 37 FD 0B 42 23 BE 9D 1B 42 AD B4 6E 83 69>)
$$ ##END=
$$ 
$$ hash MD5
$$ 90 35 07 AD A3 AB 51 93 99 50 ED 10 F7 33 F8 D8
##$RELAX= 
##$RELAX= 
##$RELAX= 
##$RELAX= 
##$RELAX= 
##$RELAX= 
##$RELAX= 
$$ Bruker specific parameters
$$ --------------------------
##$DU= <C:\u>
##$EXPNO= 15910
##$NAME= <ADRS>
##$PROCNO= 1
##$TYPE= <nmr>
##$USER= <dgb>
##$AMP= (0..31)
100 100 100 100 100 100 100 100 100 100 100 100 100 100 100 100 100 100 
100 100 100 100 100 100 100 100 100 100 100 100 100 100 
##$AQSEQ= 0
##$AQ_mod= 3
##$AUNM= <au_zg>
##$AUTOPOS= <6 >
##$BF1= 250.13
##$BF2= 250.13
##$BF3= 250.13
##$BF4= 250.13
##$BF5= 500.13
##$BF6= 500.13
##$BF7= 500.13
##$BF8= 500.13
##$BYTORDA= 1
##$CFDGTYP= 0
##$CFRGTYP= 5
##$CHEMSTR= <none>
##$CNST= (0..31)
1 1 145 1 1 1 1 1 1 1 1 1 1 1 1 1 1 1 1 1 1 1 1 1 1 1 1 1 1 1 1 1 
##$CPDPRG= <>
##$CPDPRG1= <>
##$CPDPRG2= <>
##$CPDPRG3= <>
##$CPDPRG4= <mlev>
##$CPDPRG5= <mlev>
##$CPDPRG6= <mlev>
##$CPDPRG7= <mlev>
##$CPDPRG8= <mlev>
##$CPDPRGB= <>
##$CPDPRGT= <>
##$D= (0..31)
0 1 0 0 0 0 0 0 0 0.06 0 0 0 0 0 0 0.0002 0 0 0 0 0 0 0 0 0 0 0 0 0 0 
0 
##$DATE= 1139821919
##$DBL= (0..7)
120 120 120 120 120 120 120 120 
##$DBP= (0..7)
150 150 150 150 150 150 150 150 
##$DBP07= 0
##$DBPNAM0= <>
##$DBPNAM1= <>
##$DBPNAM2= <>
$$ [...]
##$SUBNAM7= <"">
##$SUBNAM8= <"">
##$SUBNAM9= <"">
##$SW= 20.6930455092707
##$SWIBOX= (0..15)
0 0 3 0 0 0 0 0 0 0 0 0 0 0 0 0 
##$SW_h= 5175.983436853
##$TD= 65536
##$TD0= 1
##$TE= 294.16
##$TE2= 300
##$TE3= 300
##$TEG= 300
##$TL= (0..7)
0 120 120 120 120 120 120 120 
##$TP= (0..7)
150 150 150 150 150 150 150 150 
##$TP07= 0
##$TPNAME0= <>
##$TPNAME1= <>
##$TPNAME2= <>
##$TPNAME3= <>
##$TPNAME4= <>
##$TPNAME5= <>
##$TPNAME6= <>
##$TPNAME7= <>
##$TPOAL= (0..7)
0.5 0.5 0.5 0.5 0.5 0.5 0.5 0.5 
##$TPOFFS= (0..7)
0 0 0 0 0 0 0 0 
##$TUNHIN= 0
##$TUNHOUT= 0
##$TUNXOUT= 0
##$USERA1= <user>
##$USERA2= <user>
##$USERA3= <user>
##$USERA4= <user>
##$USERA5= <user>
##$V9= 5
##$VALIST= <valist>
##$VCLIST= <CCCCCCCCCCCCCCC>
##$VD= 0
##$VDLIST= <DDDDDDDDDDDDDDD>
##$VPLIST= <PPPPPPPPPPPPPPP>
##$VTLIST= <TTTTTTTTTTTTTTT>
##$WBST= 1024
##$WBSW= 4
##$XGAIN= (0..3)
0 0 0 0 
##$XL= 0
##$YL= 0
##$YMAX_a= 174736
##$YMIN_a= -214186
##$ZGOPTNS= <>
##$ZL1= 120
##$ZL2= 120
##$ZL3= 120
##$ZL4= 120
##$ABSF1= 16.522
##$ABSF2= -4.171173
##$ABSG= 5
##$ABSL= 3
##$ALPHA= 0
##$AQORDER= 0
##$ASSFAC= 0
##$ASSFACI= 0
##$ASSFACX= 0
##$ASSWID= 0
##$AUNMP= <proc_1d>
##$AZFE= 0.1
##$AZFW= 0.1
##$BCFW= 0
##$BC_mod= 0
##$BYTORDP= 0
##$COROFFS= 0
##$CY= 12.5
##$DATMOD= 1
##$DC= 0
##$DFILT= <>
##$DTYPP= 0
##$F1P= 14.0000005364418
##$F2P= -0.99999901652339
##$FCOR= 0.5
##$FTSIZE= 32768
##$FT_mod= 6
##$GAMMA= 0
##$GB= 0
##$INTBC= 1
##$INTSCL= 1
##$ISEN= 128
##$LB= 0.3
##$LEV0= 0
##$LPBIN= 0
##$MAXI= 10000
##$MC2= 0
##$MEAN= 0
##$ME_mod= 0
##$MI= 0
##$NCOEF= 0
##$NC_proc= -5
##$NLEV= 6
##$NOISF1= 0
##$NOISF2= 0
##$NSP= 0
##$NTH_PI= 0
##$NZP= 0
##$OFFSET= 16.522
##$PC= 1
##$PHC0= 104.1612
##$PHC1= 3.435684
##$PH_mod= 1
##$PKNL= yes
##$PPARMOD= 0
##$PSCAL= 4
##$PSIGN= 0
##$REVERSE= no
##$SF= 250.13
##$SI= 32768
##$SIGF1= 0
##$SIGF2= 0
##$SINO= 400
##$SIOLD= 32768
##$SREGLST= <1H.CDCl3>
##$SSB= 0
##$STSI= 32768
##$STSR= 0
##$SW_p= 5175.98343685301
##$SYMM= 0
##$S_DEV= 0
##$TDeff= 65536
##$TDoff= 0
##$TI= <Analysis number 999999
Compound Code 99
Book Reference 9
Project Code 9>
##$TILT= no
##$TM1= 0
##$TM2= 0
##$TOPLEV= 0
##$USERP1= <user>
##$USERP2= <user>
##$USERP3= <user>
##$USERP4= <user>
##$USERP5= <user>
##$WDW= 1
##$XDIM= 32768
##$YMAX_p= 522188261
##$YMIN_p= -1006845
$$ End of Bruker specific parameters
$$ ---------------------------------
##NTUPLES= NMR SPECTRUM
##VAR_NAME=  FREQUENCY,     SPECTRUM/REAL,   SPECTRUM/IMAG
##SYMBOL=    X,             R,               I
##VAR_TYPE=  INDEPENDENT,   DEPENDENT,       DEPENDENT
##VAR_FORM=  AFFN,          ASDF,            ASDF
##VAR_DIM=   32768,         32768,           32768
##UNITS=     HZ,            ARBITRARY UNITS, ARBITRARY UNITS
##FACTOR=    0.157963299565203, 1,           1
##FIRST=     4132.6476996994, 0,             0
##LAST=      -1043.33573715361, 0,           0
##MIN=       -1043.33573715361, -1006845,    0
##MAX=       4132.6476996994, 522188261,     0
$$ Real data points
##PAGE= N=1
##DATA TABLE= (X++(R..R)), XYDATA
$$ [...]
23082e65332L31444k0649K13454N4344k57194l57152J2824L0976J55371J6787
$$ -565332 -233888 -254537 -41083 13261 -243933 -601085 -588261 -557285 -401914 -385127
23072c85127R7268J50428l6393L60267k80388j28733R8127J92587K10847Q5633
$$ -385127 -287859 -137431 -173824 186443 -93945 -222678 -124551 68036 278883 364516
23062C64516j6856j05540q5310M2478k13905o2204j71324r7916M8171J4676K38181
$$ 364516 347660 242120 156810 199288 -14617 -76821 -248145 -346061 -297890 -283214 -45033
23051d5033K79796j09175m0393j00464l08462j27697K22157J5308o0831K19722
$$ -45033 234763 125588 85195 -15269 -323731 -451428 -229271 -213963 -274794 -55072
23041e5072j05411K5761m8465k10331j68037j3098K50730J49081j4058P9618l4114
$$ -55072 -160483 -134722 -183187 -393518 -561555 -574653 -323923 -174842 -188900 -109282 -143396
23030a43396K0161k74925o2380J68307K97741J22339r7880j86358R5301J66529
$$ -143396 -123235 -398160 -460540 -292233 5508 127847 29967 -156391 -61090 105439
23020A05439J45681J14309k16080j97213j46360j55950Q1510J25845K11505j7087
$$ 105439 251120 365429 149349 -47864 -194224 -350174 -268664 -142819 68686 51599
23010E1599K76103m8881m21411Q7887J81J0959p3007N9034K05929j93401n210
$$ 51599 327702 278821 -142590 -54703 -54522 -43563 -116570 -57536 148393 -45008 -50218
22999e0218J96313L0810J14917M8669j73237J7148L0099M5238J15775k38368k07654
$$ -50218 146095 176905 291822 340491 167254 184402 214501 259739 375514 137146 -70508
22988g0508J02803r3835n9105R0355p8658Q503K18380K043Q3092L00696K4260
$$ -70508 32295 -61540 -120645 -30290 -108948 -100445 117935 119978 203070 503766 528026
22977E28026l00878m349K16080j65399m91981k1948N7241P7602L21557o6364J18636
$$ 528026 227148 222799 438879 273480 -218501 -240449 -183208 -105606 215951 149587 268223
22966B68223m05383k98308j63376K3146N57236J23953l0640J65641o2718n3030
$$ 268223 -137160 -435468 -598844 -575698 -18462 105491 74851 240492 177774 124744
22956A24744L4011K38979J66103j11303j41876N6235O6290k1442k59093P139J42667
$$ 124744 158755 397734 563837 452534 310658 366893 433183 411741 152648 159787 302454
22945C02454k63011K22p7046j59692m5264K526J02327J291j31760p7875K90210
$$ 302454 39443 39665 -37381 -197073 -242337 -239811 -137484 -136193 -267953 -345828 -55618
22934e5618K09963j93550j24517N0771j81579l22415q1836l403L17501M76761
$$ -55618 154345 -39205 -163722 -112951 -294530 -616945 -698781 -702184 -384683 92078
22924I2078j1790j18850k04271j78373J00826J88186J08738K16472j13450j70688
$$ 92078 80288 -38562 -242833 -421206 -320380 -132194 -23456 193016 79566 -91122
22914i1122q5340j301j5932l844q7426M01301N65895k4005M1704l17923k22698
$$ -91122 -176462 -177763 -193695 -197539 -284965 116336 682231 658226 699930 382007 159309
22903A59309P2585j14641m95609l05918L97271L94772k9305l92510p1352J04609
$$ 159309 231894 117253 -378356 -684274 -287003 107769 78464 -314046 -385398 -280789
22893b80789J29789J22847L8737l3477j33837R7115J00231n8102j44309j56459
$$ -280789 -151000 -28153 10584 -22893 -156730 -59615 40616 -17486 -161795 -318254
22883c18254N3837K14448K38013j32999k37473l5759K465P0063N6400j928j5710
$$ -318254 -264417 -49969 188044 55045 -182428 -218187 -215722 -145659 -89259 -91187 -106897
22872a06897K83160N2686j58889N2566k21687k4338q3353Q1567j7126J19119n9822
$$ -106897 176263 228949 70060 122626 -99061 -123399 -206752 -125185 -142311 -23192 -83014
22861h3014J13156m7833r4784j57714J17619J91376P7040K3943l14750k05739
$$ -83014 30142 -17691 -112475 -270189 -152570 38806 115846 139789 -174961 -380700
22851c80700M18446j963j03279P4248k113k5469O8323K76162M1257p2864n81263
$$ -380700 37746 35783 -67496 6752 4639 -20830 47493 323655 364912 292048 -289215
22840b89215n3639K83873p8302p3294J36638P1604p0548l53407r022J84399o6827
$$ -289215 -342854 -58981 -137283 -210577 -73939 -2335 -72883 -426290 -435312 -250913 -317740
22829c17740j57948k97293j13314J63795m8793J09719M17792L3644J57764j47659
$$ -317740 -475688 -772981 -886295 -722500 -771293 -661574 -243782 -210138 -52374 -200033
22819b00033p1409L6460J64861J04450L23430J49939k51891j75104k55439J10985
$$ -200033 -271442 -234982 -70121 34329 357759 507698 255807 80703 -174736 -63751
22809f3751K67654j57239k71596j87667R6698L90147K12843J64466n2076k20462
$$ -63751 203903 46664 -224932 -412599 -315901 74246 287089 451555 399479 179017
22799A79017j98388J11163p0987J43837n0168l38256J42924J79912N9520j31981
$$ 179017 -19371 91792 20805 164642 114474 -223782 -80858 99054 158574 26593
22789B6593j43767p6115j99147j53969J57015J88974K31938K58578j58777k29563
$$ 26593 -117174 -193289 -392436 -546405 -389390 -200416 31522 290100 131323 -98240
22779i8240J83913J60720J65491m26326q9091O4779J38403j1910K00180m0922
$$ -98240 85673 246393 411884 -14442 -103533 -38754 99649 87739 287919 246997
22769B46997k34783K8080r1390l51787j50996J54912K37567J30535l33490j70520
$$ 246997 12214 40294 -51096 -402883 -553879 -398967 -161400 -30865 -364355 -534875
22759e34875J83831J55111K65690L0186Q1348L760q4720O0352L04882j94373k51999
$$ -534875 -351044 -195933 69757 99943 181291 185051 100331 160683 465565 271192 19193
22748A9193m8249k5816k62770m8589L12441m670O9567J65665J29175n0107j76021
$$ 19193 -29056 -54872 -317642 -366231 -53790 -58460 11107 176772 305947 255840 79819
22737G9819J10156m9362j18808k0747j77118o0493o7205K50853L30649K1053k43823
$$ 79819 189975 140613 21805 1058 -176060 -236553 -303758 -52905 277744 298797 54974
22726E4974l40342J7749j4173K75676M0031k35845K05920J32758j06570N0065
$$ 54974 -285368 -267619 -281792 -6116 33915 -201930 3990 136748 30178 80243
22716H0243n3584j73825j42803O6339n1696M1308J99543k01725J68557j8419k03467
$$ 80243 26659 -147166 -289969 -223630 -275326 -234018 -34475 -236200 -67643 -86062 -289529
22705b89529j17153J52617L25558J37328l08730j5086j6543P8483J99279K49993
$$ -289529 -406682 -254065 71493 208821 -99909 -114995 -131538 -53055 146224 396217
22695C96217r4034k36481k76666l75141J73187Q3566k2799k39016O5182L67985
$$ 396217 302183 65702 -210964 -586105 -412918 -329352 -352151 -591167 -525985 -158000
22685a58000L23309J52656r0058Q6515n0502l77950l9966L34210k62372Q132J05799
$$ -158000 165309 317965 227907 314422 263920 -114030 -153996 180214 -82158 -74026 31773
22674C1773L9568k74647J30491p3990r8076J01084J03274O4693r7161j60016n802
$$ 31773 71341 -203306 -72815 -146805 -244881 -143797 -40523 24170 -72991 -233007 -238809
22663b38809M4437K6493J39275J59894o4494q746r9467n8278k57261k8218J16905
$$ -238809 -194372 -167879 -28604 131290 66796 58050 -41417 -99695 -356956 -385174 -268269
22652b68269R2121J43450M476p3617k8522L1224L60955k61247M8955K36o875Q4508
$$ -268269 -176148 -32698 -28222 -101839 -130361 -99137 261818 571 49526 49762 42887 127395
22640A27395j02300o0686J0235j22124j57591R0378J72986J87682J7994P3748
$$ 127395 25095 -35591 -25356 -147480 -305071 -214693 -41707 145975 163969 237717
22630B37717j67838O3339K23988l2409k22228m02566l721L33211L19896L4550
$$ 237717 69879 133218 357206 324797 102569 -299997 -303718 29493 349389 383939
22620C83939R7777q5249J04145K4929j72136l32886p6184m7180p5409k8059K20479
$$ 383939 481716 396467 500612 525541 353405 20519 -55665 -102845 -178254 -206313 14166
22609A4166K21874J99604k24972l74618j59631k7219J20464j29731j52907J73312
$$ 14166 236040 435644 210672 -163946 -323577 -350796 -230332 -360063 -512970 -339658
22599c39658J63020r5235j16181J1161q0916M1049r09K048J85746M8600p2542
$$ -339658 -176638 -271873 -388054 -376893 -457809 -416760 -417669 -415621 -229875 -181275 -253817
22588b53817Q1892K00609j61102j45611J35233K47417J7820o0604m00341l6664
$$ -253817 -171925 28684 -132418 -278029 -142796 104621 122441 61837 -338504 -375168
22578c75168J32845L15075J15046K63849K16616j30294n77682j72854Q3146l6848
$$ -375168 -242323 72752 187798 451647 668263 537969 -39713 -212567 -129421 -166269
22568a66269J82552L08609k43689j78159J61532q3428m8272J92251J7134P4238
$$ -166269 16283 324892 81203 -96956 64576 -18852 -67124 125127 142261 216499
22558B16499o6507j88513J3990R8040N1224j42276J42872j80990q1464J47678
$$ 216499 149992 -38521 -24531 73509 124733 -17543 125329 -55661 -137125 10553
22548A0553K8578J26562l8054l69574m03562K24709K95927m943l5925J1136L22906
$$ 10553 39131 165693 127639 -241935 -645497 -420788 -124861 -129804 -165729 -154593 168313
22537A68313J52209j46994j7073p4485j51261K3638j41447k21865J52412M33449
$$ 168313 320522 173528 156455 81970 -69291 -45653 -187100 -408965 -256553 176896
22527A76896M48938j88453l25623m93799k83885K94827L72161j51895j08262J37228
$$ 176896 625834 437381 111758 -382041 -665926 -371099 1062 -150833 -259095 -121867
22517a21867J42355J50376o5114j15505j5729K790k00985j1720O2602Q8961Q799
$$ -121867 20488 170864 105750 -9755 -25484 -22694 -223679 -235399 -172797 -83836 -75037
22506g5037K31312K99595N544O6816k26672j78069L0560L9765R1932j90678J06982
$$ -75037 156275 455870 461414 528230 301558 123489 154049 193814 285746 95068 202050
22495B02050K26014J48430N620n4871k96039p2634J00985K42886J4555J39154
$$ 202050 428064 576494 582114 527243 231204 158570 259555 502441 516996 656150
22485F56150m6829n65331j02462K89723J52121j5251l09731J5012P6260M2865
$$ 656150 609321 43990 -58472 231251 383372 368121 58390 73402 149662 192527
22475A92527k37290j07447j76037J969J36945J15948K19414j98570k38523n5936
$$ 192527 -44763 -152210 -328247 -326278 -189333 -73385 146029 -52541 -291064 -347000
22465c47000K46904L94051j69613n5874j20904O8130K4318L29531J76609j34280
$$ -347000 -100096 293955 124342 68468 -52436 15694 40012 369543 546152 411872
22455D11872J5232K16213k69032l34328J3489j23058m1815j22981j55760J15155
$$ 411872 427104 643317 374285 39957 53446 -69612 -111427 -234408 -390168 -275013
22445b75013J35878J4460L28408N300k911j85311r6619J33500N7409l0884R4360
$$ -275013 -139135 -124675 203733 209033 206122 20811 -75808 57692 115101 84217 178577
22434A78577P8617j4604J2869J76066J60782j27707m19225k99813J1358P6194
$$ 178577 257194 242590 255459 431525 592307 464600 45375 -254438 -243080 -166886
22424a66886R6531q5666k89075j56319J02206L94301L06705J28924k87667k53595
$$ -166886 -70355 -156021 -445096 -601415 -499209 -104908 201797 330721 43054 -210541
22414b10541Q5037J46496J7712j34314r2356o012k7376J61719K41792K89562n4675
$$ -210541 -125504 20992 38704 -95610 -187966 -193978 -221354 -59635 182157 471719 417044
22403D17044l2261m97079K62108J61053j43210K5171j35928J58621k40023k45367
$$ 417044 384783 -112296 149812 310865 167655 192826 56898 215519 -24504 -269871
22393b69871K46416K12935k67489k5148P8089J31256K92577K39094q7213k55721
$$ -269871 -23455 189480 -78009 -103157 -25068 106188 398765 637859 550646 294925
22383B94925k73548l80248k05702j26178K89514K31076R6945K9266J75901R5180
$$ 294925 21377 -358871 -564573 -690751 -401237 -170161 -73216 -43950 131951 227131
22373B27131J47946j54719n2791K01054K28244K31141k55173r7032m17402j98113
$$ 227131 375077 220358 167567 368621 596865 828006 572833 475801 58399 -139714
22363a39714j35668J24994j1693j2100N0845k34015K1996J96913Q318K08567j34330
$$ -139714 -275382 -150388 -162081 -174181 -123336 -357351 -335355 -138442 -130124 78443 -55887
22352e5887j50218J04418K5054R9249K80961q1833m7369j8874m9571p9113k25057
$$ -55887 -206105 -101687 -76633 22616 303577 221744 174375 155501 105930 26817 -198240
22341a98240J73980P3196j10475M4979k8347j04464M014N1568K9273M3160N8593
$$ -198240 -24260 48936 -61539 -16560 -44907 -149371 -145357 -93789 -64516 -21356 37237
22330C7237R4932O2581k9912O2058Q2159k1033j21454j03028j52189O4706J20468
$$ 37237 132169 194750 164838 226896 309055 288022 166568 63540 -88649 -23943 96525
22319I6525n5959L4323k19865J9468K60748J9721J05449L6714k42389k0933J82526
$$ 96525 40566 74889 -144976 -125508 135240 154961 260410 297124 54735 33802 216328
22308B16328M0064o8368k65225j14191J97587j53581Q2093j9367r152J65336R0890
$$ 216328 256392 188024 -77201 -191392 6195 -147386 -65293 -84660 -93812 71524 162414
22297A62414j44302j32368k03945J58823J57189L3264J62649L60085k76261j44200
$$ 162414 18112 -114256 -318201 -159378 -2189 31075 193724 553809 277548 133348
22287A33348R9248J12066o410k09964k51156n1107J10496p0189k8648q438K7563
$$ 133348 232596 344662 338252 128288 -122868 -173975 -63479 -133668 -162316 -170754 -143191
22276a43191K4482o6556L2159P9649j30130n2565L21487q380M2495j67165J32267
$$ -143191 -118709 -185265 -153106 -73457 -203587 -256152 65335 56955 99450 -67715 64552
22265F4552R8779j49843q2300j02069k04591K18011l7262p501J02482m5732K32591
$$ 64552 163331 13488 -68812 -170881 -375472 -157461 -194723 -202224 -99742 -145474 87117
22254H7117J64605l6643P2910j51564k2331j40764l15734N6761p3152J45399o3671
$$ 87117 251722 215079 287989 136425 114094 -26670 -342404 -285643 -358795 -213396 -277067
22243b77067j0203K1629M5376l37287J05837L7256L09555M74190K16792j84450
$$ -277067 -287270 -265641 -220265 -557552 -451715 -414459 -104904 369286 586078 401628
22233D01628k20555M7376j27760j69841j86402K14619M25445q3634l09537r6494
$$ 401628 181073 228449 100689 -69152 -255554 -40935 384510 300876 -8661 -105155
22223a05155J18934K53824M2343J37247m14129l02346J6864J14873p4098J27735
$$ -105155 13779 267603 309946 447193 33064 -269282 -252418 -137545 -211643 -83908
22213h3908k21931K0552q756q7574J55847L05920P2559m1929j88024J40137K3333
$$ -83908 -305839 -285287 -294043 -381617 -225770 80150 152709 110780 -77244 62893 86226
22202H6226j48024L19805Q0797k85927k15435P4038P2817k49201K17308J68588
$$ 86226 -61798 258007 338804 52877 -162558 -88520 -15703 -264904 -47596 120992
22192A20992O823J77846m3842K7134L3542k00152k32819r2186p4124m9797J40718
$$ 120992 127815 305661 261819 288953 322495 122343 -110476 -202662 -276786 -326583 -185865
22181a85865K25769R3342r2608j1955K57590j34422l86367j20984K98724Q5408
$$ -185865 39904 133246 40638 28683 286273 151851 -234516 -355500 -56776 28632
22171B8632K07478m6239P9920k52766n32699k8148J86434J45887n5552L39455
$$ 28632 236110 189871 269791 17025 -515674 -543822 -357388 -211501 -267053 72402
22161G2402K68527j48959K3673l1433R4629R8885q7435k05420o517j9842J49945
$$ 72402 340929 191970 215643 184210 278839 377724 290289 84869 78352 58510 208455
22150B08455J0259p3508O6842J1225n02j59724N7492k2191m5204O4495O3706j80553
$$ 208455 218714 145206 212048 223273 222771 63047 120539 98348 53144 117639 181345 792
22138G92l88980K16061J88485j50389n2080J30513L69470J7573n3325J30990Q4571
$$ 792 -388188 -172127 16358 -134031 -186111 -55598 313872 331445 278120 409110 493681
22127D93681L5953l25802k09408l2737k03130j4232J11234J0686q6855M4017J0434
$$ 493681 529634 203832 -5576 -38313 -241443 -255675 -144441 -133755 -220610 -176593 -166159
22116a66159J65655L33517K78375j89628N7486k16516k30649L6555k87697j53408
$$ -166159 -504 333013 611388 421760 479246 262730 32081 68636 -219061 -372469
22106c72469K9958j13482j56360O7236J48240O5585O1350M4613J60278k46013
$$ -372469 -342511 -455993 -612353 -545117 -396877 -331292 -269942 -225329 -65051 -311064
22096c11064j87179J91868J79260m1039j03068j10656J58959J31077j3272j28517
$$ -311064 -498243 -306375 -127115 -168154 -271222 -381878 -222919 -91842 -105114 -233631
22086b33631j40729K30050o6600j05057n2123l0027P0705Q9433j15322j83613
$$ -233631 -374360 -144310 -210910 -315967 -368090 -398117 -327412 -237979 -353301 -536914
22076e36914O6464L92796Q1826j60433L26423k99628l53724K22314K19120j16350
$$ -536914 -470450 -77654 4172 -156261 170162 -129466 -483190 -260876 -41756 -158106
22066a58106K29268M56463K52944j10204k47325j93974L4460o1130j38795k78071
$$ -158106 71162 527625 780569 670365 423040 229066 263526 202396 63601 -214470
22056b14470J25034K04895n7367m5642j0551j12619k79526Q3875K08597L24464
$$ -214470 -89436 115459 58092 12450 1899 -110720 -390246 -306371 -97774 226690
22046B26690L23112o8223l45986l05059J21056J37180J51244m0762j02462j34997
$$ 226690 549802 481579 135593 -169466 -48410 88770 240014 199252 96790 -38207
22036c8207J4285q6006o7042L11160J18202K6912J09886j06766n5237J13725J83450
$$ -38207 -23922 -109928 -176970 134190 252392 279304 389190 282424 227187 340912 524362
22025E24362K7245m03920q6761K91829k8241j40969r9476r6403n233M0655O3536
$$ 524362 551607 147687 60926 352755 324514 183545 84069 -12334 -17567 23088 86624
22014H6624r8966J22311O5223R3076J5683j53263k45794N2354k3011n0145K34604
$$ 86624 -12342 109969 175192 268268 283951 130688 -115106 -62752 -85763 -135908 98696
22003I8696Q9682n7945k29424M2994Q9383K7175j1919o0186j99938j48063j76370
$$ 98696 188378 130433 -98991 -55997 33386 60561 48642 -11544 -211482 -359545 -535915
21992e35915P6107J40121L12557J64663O4100p7170o171k63263k09150J1365L75962
$$ -535915 -459808 -319687 -7130 157533 221633 144463 138292 -124971 -334121 -322756 53206
21981E3206J23993o9692j55238J31869r9570l36496P8871j2352K09472J04267
$$ 53206 177199 107507 -47731 84138 -15432 -351928 -273057 -285409 -75937 28330
21971B8330R8220k02394m72093k36294J50113Q3234N6406j7831j40854J19835
$$ 28330 126550 -75844 -547937 -784231 -634118 -550884 -494478 -512309 -653163 -533328
21961e33328J91888r548K67672K07714K50917n04074j51785J05571O8910J89368
$$ -533328 -341440 -350988 -83316 124398 375315 -128759 -280544 -174973 -106063 83305
21951H3305R7733k12087j1762r5354L5072j51682M4088K64353P8657k59665k48457
$$ 83305 181038 -31049 -42811 -138165 -103093 -254775 -210687 53666 132323 -127342 -375799
21940c75799L23726n7822O933J01397j38005R5934N8323k7807j07634l9321P7580
$$ -375799 -52073 -109895 -102962 -1565 -139570 -43636 14687 -13120 -120754 -160075 -82495
21929h2495R3472j17266r5751O5895K04194P1388k7588l67339j3713l0721R621
$$ -82495 10977 -106289 -202040 -136145 68049 139437 111849 -255490 -269203 -299924 -290303
21918b90303K70467j9052J4898k2187O5240k42991j56085J99688J67452m6600
$$ -290303 -19836 -38888 -23990 -46177 19063 -223928 -380013 -180325 -12873 -59473
21908e9473Q4636J96042N0588l1157j14227j30490N3077O9289Q2134l22178k21885
$$ -59473 25163 221205 271793 240636 126409 -4081 48996 118285 200419 -121759 -343644
21897c43644j93758J6972J64835K14384K11716O5426k46317O002M5045J20977
$$ -343644 -537402 -520430 -355595 -141211 70505 135931 -110386 -104384 -59339 61638
21887F1638K30123j02138l45172l10577l175j30216L36514K27950q2285j45700
$$ 61638 291761 189623 -155549 -466126 -469301 -599517 -263003 -35053 -117338 -263038
21877b63038J6779K08322L8291m4038j89323O6196K51989L50243K20860J12168
$$ -263038 -246259 -37937 354 -43684 -233007 -166811 85178 435421 656281 768449
21867G68449j50138l25089n29209q2556K14104q9406j30503Q1873J52559o479
$$ 768449 618311 293222 -235987 -318543 -104439 -193845 -324348 -242475 -89916 -96395
21857i6395P2483j61146k1272J50985l9203J19015J42447O4821J43305j59663
$$ -96395 -23912 -185058 -206330 -55345 -94548 24467 166914 231735 375040 215377
21847B15377l54502j9999j6688j95730J64826Q1367j40909K1582J26273q359m4367
$$ 215377 -139125 -159124 -175812 -371542 -206716 -125349 -266258 -244676 -118403 -126762 -171129
21836a71129J47327O2971N0769q4343K01510J72817r6895j21143J9202K21954
$$ -171129 -23802 39169 89938 5595 207105 379922 283027 161884 181086 403040
21826D03040l1495Q3766N1106k88573o8487j74430J04564K17271k21148O9343
$$ 403040 371545 455311 506417 217844 149357 -25073 79491 296762 75614 144957
21816A44957J96113k29567K5810k17285k49350M61366K26008k69343k8435m4782
$$ 144957 341070 111503 137313 -79972 -329322 132044 358052 88709 60274 15492
21806A5492j48086j36328k5645K79999K92606J37474j39140k13817r9654j6738
$$ 15492 -132594 -268922 -294567 -14568 278038 415512 276372 62555 -37099 -53837
21796e3837k5080r6762l4497n2355K7223L44733j988j81165J01819M4321J71147
$$ -53837 -78917 -175679 -210176 -262531 -235308 109425 107437 -73728 28091 72412 243559
21785B43559L0435j25764J8135J86882j91520J32731J06785k4415m84629J15287
$$ 243559 273994 148230 166365 353247 161727 294458 401243 376828 -107801 7486
21775G486J71966q207M824O1931J47421j52642m39067j43029j01761K28587J21569
$$ 7486 179452 171245 176069 238000 385421 232779 -206288 -349317 -451078 -222491 -100922
21764a00922J16936o017k08355K4958J30463l3903j98271l25081j23802J28799
$$ -100922 16014 9997 -198358 -173400 -42937 -76840 -275111 -600192 -723994 -595195
21754e95195L50946L0833j17134K21133K29866k9989l78746k77919L14456k5894
$$ -595195 -244249 -213416 -330550 -109417 120449 90460 -288286 -566205 -251749 -277643
21744b77643j23942K56783K46485O0399k75005l32355j25826L9663L45090M60076
$$ -277643 -401585 -144802 101683 162082 -112923 -445278 -571104 -531441 -186351 273725
21734B73725j27887J6736k4642P8010K5790l4235N5044j40324k9282l6306J40899
$$ 273725 145838 162574 137932 215942 241732 207497 262541 122217 92935 56629 197528
21723A97528k28183K1988P5215j51384k30363j8758K02996N1002J1918r4774K29183
$$ 197528 -30655 -8667 66548 -84836 -315199 -333957 -130961 -79959 -68041 -162815 66368
21712F6368K2553k59154l75480r6372J70864p9888n996L38771J56316p3313K02982
$$ 66368 88921 -170233 -545713 -642085 -471221 -551109 -557105 -218334 -62018 -135331 67651
21701F7651j90440j60419j0768N308k454J11301L4102J35268J58344M9660k10316
$$ 67651 -122789 -283208 -293976 -288668 -291122 -179821 -145719 -10451 147893 197553 -12763
21690a2763k91634j1788O9065r745L29780o8300j8656L21365m0897l74643l31736
$$ -12763 -304397 -316185 -247120 -256865 72915 4615 -14041 307324 266427 -108216 -439952
21679d39952J34068J16351M9746j2315K619J54273o0499j1396K00258q4943l0676
$$ -439952 -305884 -189533 -139787 -152102 -149483 4790 -55709 -67105 133153 48210 17534
21668A7534o4967j5616O8570n9373j37044j44984K03755j29565j66889J67286
$$ 17534 -47433 -63049 5521 -53852 -190896 -335880 -132125 -261690 -428579 -261293
21658b61293O3214R0340J86115k83477q4600J62316K33328k65216j31321J33258
$$ -261293 -198079 -107739 78376 -205101 -289701 -127385 105943 -159273 -290594 -157336
21648a57336J81618j37222n0221K52026K43294n7497j4208k83415q4986Q6323
$$ -157336 24282 -112940 -163161 88865 332159 274662 260454 -22961 -107947 -21624
21638b1624K23594l4726k51992j44752o0753J57401L2146p2388j36917j02011
$$ -21624 201970 167244 -84748 -229500 -290253 -132852 -100706 -173094 -310011 -412022
21628d12022J04673K14241L5311n6519Q7864J46263M2889K3647r877K8205O6727
$$ -412022 -307349 -93108 -57797 -114316 -26452 119811 162700 186347 176470 204675 271402
21617B71402k66729k52911J59539k40811j11326L27268L28724o2407p6449j81866
$$ 271402 4673 -248238 -88699 -329510 -440836 -113568 215156 152749 76300 -105566
21607a05566r7230K04689N8878m330o2247j97784J34439r8151l1079K4988K01964
$$ -105566 -202796 1893 60771 56441 -5806 -203590 -69151 -167302 -198381 -173393 28571
21596B8571J07284m9511k62565l7391r919l2942k71611k3120L11879M34488j957
$$ 28571 135855 86344 -176221 -213612 -223531 -256473 -528084 -551204 -239325 195163 193206
21585A93206k1560R2501k15287p0693r4692J09605q9764j40368r0886m4631M22799
$$ 193206 171646 264147 48860 -21833 -116525 -6920 -96684 -237052 -327938 -372569 50230
21574E0230L55854K38445j28163k08108j63990J2639J47104o6515l4046q3614
$$ 50230 406084 644529 516366 308258 144268 156907 304011 237496 203450 119836
21564A19836J30099j48373l96838N7034J12218P6861K2257K3734j1963P2273P7625
$$ 119836 249935 101562 -295276 -238242 -126024 -49163 -26906 -3172 -15135 57138 134763
21553A34763m0322o9782J78713k22500k52119K50556K79823J81687O5262j5212
$$ 134763 94441 24659 203372 -19128 -271247 -20691 259132 440819 506081 490869
21543D90869K33421k33494l20087k85101l17338j09312p6250J27285K93524K7235
$$ 490869 724290 490796 170709 -114392 -431730 -541042 -617292 -490007 -196483 -169248
21533a69248n0026p4837O4594o0150K2799J73120N6536j48928J94104j89379j48874
$$ -169248 -219274 -294111 -229517 -289667 -266868 -93748 -37212 -186140 7964 -181415 -330289
21522c30289J84831n407k82747r1970K79618l1825j79174K30892K08537L7291
$$ -330289 -145458 -150865 -433612 -525582 -245964 -277789 -456963 -226071 -17534 19757
21512A9757j65804J58822o9996Q4510n6669l12031Q8504O4130j38633n2325J17163
$$ 19757 -146047 12775 -57221 27289 -29380 -341411 -252907 -188777 -327410 -379735 -262572
21501b62572P4579L53285J64761r5733r7704R1436l30979k7317J27126K33613
$$ -262572 -187993 165292 330053 234320 136616 228052 -102927 -130244 -3118 230495
21491B30495j22616k32759M4419Q5690k99130j42014Q8141N9382J22322P4503
$$ 230495 107879 -124880 -80461 5229 -293901 -435915 -347774 -288392 -166070 -91567
21481i1567Q0780J2588j27139k81806K87584k37573j20588K7819L9117K64130
$$ -91567 -10787 1801 -125338 -407144 -119560 -357133 -477721 -449902 -410785 -146655
21471a46655M5234M3546J63182l0106j39974K34957q1467l43893N5027J17295
$$ -146655 -101421 -57875 105307 75201 -64773 170184 88717 -255176 -200149 -82854
21461h2854J6040k7916K4977J09648J60674k6612q7673K16294m5372p1648k55829
$$ -82854 -66814 -94730 -69753 39895 200569 173957 86284 302578 257206 185558 -70271
21450g0271J55957p5479n6817m9545k75374p6352L60441n0222N0527L8957J86300
$$ -70271 85686 10207 -46610 -96155 -371529 -447881 -87440 -137662 -87135 -48178 138122
21439A38122K48440N2642N0422p3602k39425n7522k9660J77499K30538J20227
$$ 138122 386562 439204 489626 416024 176599 119077 89417 266916 497454 617681
21429F17681J41777l28018l48165l01548R9461M1479K168q7277J7438k15977L59545
$$ 617681 759458 431440 83275 -218273 -118812 -77333 -75165 -162442 -145004 -360981 -1436
21418a436J52833K3270L05361k24870k28919j74138j78601J81279J18270p3680
$$ -1436 151397 174667 480028 255158 26239 -147899 -326500 -145221 -26951 -100631
21408a00631j95855J29953K35010k32264K54558J36821j43522j13857m6441n96
$$ -100631 -296486 -166533 68477 -163787 90771 227592 84070 -29787 -76228 -76824
21398g6824J1783R9868J53965p6887L8480m3711J41313M76952k35498M1303k26098
$$ -76824 -65041 34827 188792 111905 150385 106674 247987 724939 489441 530744 304646
21387C04646j72408q0141M1775l82278r3764N8936K85750J35444j07231j36311
$$ 304646 132238 52097 93872 -288406 -382170 -323234 -37484 97960 -9271 -145582
21377a45582M2696p9558p2987o5327J72753L22864k70881P6302J91959j86312
$$ -145582 -102886 -182444 -255431 -320758 -148005 174859 -96022 -19720 172239 -14073
21367a4073P8312r2676j24109n9928J00274J56543l2637k2793j23302j51642L81005
$$ -14073 64239 -28437 -152546 -212474 -112200 44343 11706 -11087 -134389 -286031 94974
21356I4974K80542J24628n082k10584o6072k17522j40802k45360J79278J50516
$$ 94974 375516 500144 495062 284478 218406 884 -139918 -385278 -206000 -55484
21346e5484K85859J93206r8232j47561l37850k51822J72453K05032j1026K76225
$$ -55484 230375 423581 325349 177788 -160062 -411884 -239431 -34399 -45425 230800
21336B30800k3888n76259j0740M91582L17691j69768j41642K3957r1283L6576
$$ 230800 206912 -369347 -380087 111495 429186 259418 117776 141733 50450 87026
21326H7026M2101j65469K71999K80221n0319p3856l8174k27176l93229j84045
$$ 87026 129127 -36342 235657 515878 465559 391703 353529 126353 -266876 -450921
21316d50921J63731K65061r0200l50832o8408P871r220L31084p22j31029K24421
$$ -450921 -287190 -22129 -112329 -463161 -531569 -523698 -532918 -201834 -202556 -333585 -109164
21305a09164k15834j91109M12806K13823O2100j20503l6970j70833J99415N3752
$$ -109164 -324998 -516107 -103301 110522 172622 52119 15149 -155684 43731 97483
21295I7483k39234j21124j41916J37773J48224J07224q997J87135l23747j4289
$$ 97483 -141751 -262875 -404791 -267018 -118794 -11570 -20567 166568 -157179 -171468
21285a71468J8979j63192J41013L05315J2148j95315Q0086q006N500N9218O2188
$$ -171468 -152489 -315681 -174668 130647 142795 -52520 27566 19560 25060 84278 146466
21274A46466l04694j95580K38633N1040J84126L02427J92811N6873j49837k31894
$$ 146466 -158228 -353808 -115175 -64135 119991 422418 615229 672102 522265 290371
21264B90371K2216j94224l47976j16786K2090J32809M52043K00146j79084k01720
$$ 290371 312587 118363 -229613 -346399 -324309 -191500 260543 460689 281605 79885
21254G9885j34536P7414J84427j0940K05728Q17j26448K08754Q6080k90352j99727
$$ 79885 -54651 22763 207190 196250 401978 402795 276347 485101 571181 280829 81102
21243H1102k13213p156K1060k48655p829J43215k8082k56180m5113Q24K32299
$$ 81102 -132111 -139267 -118207 -366862 -374691 -231476 -259558 -515738 -560851 -560027 -327728
21232c27728K67448J99892M0921k42064o6647J32257P1571K06228K22086j16179
$$ -327728 -60280 139612 180533 -61531 -128178 4079 75650 281878 503964 387785
21222C87785J20099j39898j94926k64258R361q0974J77059N1136K00416K02305
$$ 387785 507884 367986 173060 -91198 -81837 -162811 14248 65384 265800 468105
21212D68105m4238k7908K8754q4138l9015l77179k9031L35392Q4934j37003L7704
$$ 468105 423867 395959 424713 340575 301560 -75619 -104650 230742 315676 178673 216377
21201B16377J58408k40557p5053k04910L5251K9702j82478J15557K0382J44101
$$ 216377 374785 134228 59175 -145735 -110484 -80782 -263260 -147703 -127321 16780
21191A6780R0623N1254m0889J37506j76866k38945k29031J16461L89860j25330
$$ 16780 107403 158657 117768 255274 78408 -160537 -389568 -273107 116753 -8577
21181h577P7267l7058l23780r3015l1123J86640K05784m48974o3884P5899O2072
$$ -8577 68690 31632 -292148 -385163 -416286 -229646 -23862 -472836 -536720 -460821 -398749
21170c98749R5297N17986p0990l76156K55800J25274R1615K28956o4873n002j83193
$$ -398749 -303452 214534 143544 -232612 23188 148462 240077 469033 404160 399158 215965
21159B15965q7593n8711j4770q4728K6687K35767R897K85686j22931l11061k49333
$$ 215965 128372 69661 54891 -29837 -3150 232617 242514 528200 405269 94208 -155125
21148a55125J32287K26918M71457L19026n3456q0358k0848j71769n45937j93022
$$ -155125 -22838 204080 675537 994563 941107 860749 839901 668132 122195 -70827
21138g0827j46641l6916m0846P3450K31172k27431j52970N0244K49480J25336
$$ -70827 -217468 -254384 -295230 -221780 9392 -218039 -371009 -320765 -71285 54051
21128E4051m5155L207K5361L5612M7680k05733l9357r4088J46112K49268j8628
$$ 54051 8896 12103 37464 73076 120756 -84977 -124334 -218422 -72310 176958 158330
21117A58330l7583J95261l8203j13041k34981l24368k99447Q1701N51820K39572
$$ 158330 120747 316008 277805 164764 -70217 -394585 -694032 -612331 -60511 179061
21107A79061n21211j66260J27815K22778J55997r9646j01264O9340R2280j1982
$$ 179061 -342150 -508410 -380595 -157817 -1820 -101466 -202730 -133390 -41110 -53092
21097e3092j42900R6199J08070l15304K6786Q1324J69087P9349j10771j70772
$$ -53092 -195992 -99793 8277 -307027 -280241 -198917 -29830 49519 -61252 -232024
21087b32024R5819M16039K3660j57239j6416K63238q4013j57590k43443K24020
$$ -232024 -136205 279834 303494 146255 129839 393077 309064 151474 -91969 132051
21077A32051J02235k35110J34568J22761m35866K4366P1090j16806K28854R9756
$$ 132051 234286 -824 133744 256505 -179361 -154995 -83905 -200711 28143 127899
21067A27899p0340N9900J07254Q2313l53492k29310o8865n9952J70644K69388
$$ 127899 57559 117459 224713 307026 -46466 -275776 -344641 -404593 -233949 35439
21057C5439l9822J54349R4656m7109J0045k2115q0699j69461l7931J26815L1931
$$ 35439 -4383 149966 244622 197513 207558 185443 104744 -64717 -102648 24167 56098
21046E6098O1861J92661k18416j01280r9841k09926j05399J91721j349N5045j50078
$$ 56098 117959 310620 92204 -9076 -108917 -318843 -424242 -232521 -233870 -178825 -328903
21035c28903N5600K69941j8365k2754j50610k8710M1429q4892j16539M38099K18640
$$ -328903 -273303 -3362 -21727 -44481 -195091 -223801 -182372 -267264 -383803 54296 272936
21024B72936n3165j80237k6602O8869J88303k22962m9771J19675m5644k10275
$$ 272936 219771 39534 12932 81801 270104 47142 -2629 117046 71402 -138873
21014a38873N1862J17919J75896J05831O9217m7298m6377J69588J01431k33143
$$ -138873 -87011 30908 206804 312635 381852 334554 288177 457765 559196 326053
21004C26053K1098R9232J71349J00421l54775k40918j58409j25317j65952j35425
$$ 326053 347151 446383 617732 718153 363378 122460 -35949 -161266 -327218 -462643
20994d62643J36848L65162N2713o4667k20423K05939j56805K6970l8333J27519
$$ -462643 -325795 39367 92080 27413 -193010 12929 -143876 -116906 -155239 -27720
20984b7720J12203q7641J28359K29769j04767l8581R168k33121r8035L6796n6649
$$ -27720 84483 -3158 125201 354970 250203 211622 220790 -12331 -110366 -73570 -130219
20973a30219R3324m0217M71199j31299l68144L1036j0151M90837K2929k49914
$$ -130219 -36895 -77112 394087 262788 -105356 -74320 -84471 406366 429295 179381
20963A79381R1225j00865k1577L85713L3200j33091j50672o7346p617K29739N5349
$$ 179381 270606 169741 148164 533877 567077 433986 283314 215968 208351 438090 493439
20952D93439j29846l84467K0018J73774J59007R9112j52467k76951N095m9343
$$ 493439 363593 -20874 -856 172918 331925 431037 278570 1619 6714 -42629
20942d2629J10615K9353m8801K06805K15391N529j12299j62760l12890j125J24510
$$ -42629 67986 97339 48538 255343 470734 476263 363964 201204 -111686 -112811 11699
20931A1699L1729L906k47075J28394J47913k0980j16187K49879k33149q6289J98055
$$ 11699 43428 47334 -199741 -71347 76566 55586 -60601 189278 -43871 -130160 67895
20920F7895l78554j45055J35429N8877P8501j81399K03663J67981K44629K82055
$$ 67895 -310659 -455714 -320285 -261408 -182907 -364306 -160643 7338 251967 534022
20910E34022k43393n77503O2310M25374r6635J57014Q3689l02642k47417M7990
$$ 534022 290629 -286874 -224564 200810 104175 261189 344878 42236 -205181 -157191
20900a57191J54317J91280j47088P7607J27833k64928P7272j0666j83002l23330
$$ -157191 -2874 188406 41318 118925 246758 -18170 59102 48436 -134566 -457896
20890d57896J36025J05781M4410J16047K09887j58530k24899K41879K01837P2819
$$ -457896 -321871 -216090 -171680 -55633 154254 -4276 -229175 12704 214541 287360
20880B87360k80412l70529O7038J58579P2147k40j29236J80485L35315p6505r6943
$$ 287360 6948 -363581 -296543 -137964 -65817 -66057 -195293 -14808 320507 244002 147059
20869A47059P4373k88409K6932j88032l2133L93630L43323j0278L2220l14892
$$ 147059 221432 -66977 -40045 -228077 -260210 133420 476743 466465 498685 183793
20859A83793m64163J28447K09948j34537k62001R1488M21312L6606j1446K59730
$$ 183793 -280370 -151923 58025 -76512 -338513 -247025 174287 210893 199447 459177
20849D59177k40285l25747j42823k2888r3086P3670R8008K19376R7539j44282
$$ 459177 218892 -106855 -249678 -272566 -365652 -291982 -193974 25402 122941 -21341
20839b1341J12142o9254k36527j32712n7600J29177O2201J80863M8161n0814J8807
$$ -21341 90801 21547 -214980 -347692 -405292 -276115 -213914 -33051 15110 -35704 -16897
20828a6897J35258J78775j3549k63885q4396P5070q9474n1244J13410j61056j758
$$ -16897 118361 297136 283587 19702 -64694 10376 -79098 -130342 -16932 -177988 -179746
20817a79746j70612K49595J44986k25793j71322J35402J9398k31869J07704K61339
$$ -179746 -350358 -100763 44223 -181570 -352892 -217490 -198092 -429961 -322257 -60918
20807f0918M3983J40216j12403k97484k56911J09690K65573Q6134L921j27659
$$ -60918 -16935 123281 10878 -286606 -543517 -433827 -168254 -82120 -78199 -205858
20797b05858k88624M88558L50493k47183k98797N9317J31931r217K05136o9011
$$ -205858 -494482 -5924 344569 97386 -201411 -142094 -10163 -19380 185756 116745
20787A16745m748J06302k44J7821J62572n8048l49070j66179J37235O6682J16680
$$ 116745 111997 218299 218055 235876 398448 340400 -8670 -174849 -37614 29068 145748
20776A45748K07964p4654L4927j00236k02913R8462j27930p527K27505J40495
$$ 145748 353712 279058 313985 213749 10836 109298 -18632 -26159 201346 341841
20766C41841m0583P2122j32339k60617j14258j258j18223M8342m2653J83689J33947
$$ 341841 301258 373380 241041 -19576 -133834 -135092 -253315 -204973 -247626 -63937 70010
20755G0010j24418J12831k43217J12432r5162J53427R3626p5013k60002R0053
$$ 70010 -54408 58423 -184794 -72362 -167524 -14097 79529 4516 -255486 -165433
20745a65433J78078M8192m2947L1934j3160L56368Q8298k60832j49351J37358
$$ -165433 12645 60837 17890 49824 36664 393032 481330 220498 71147 208505
20735B08505n8934O7608M7689j3609j95927j974r5119M7073Q6940l39165k21497
$$ 208505 149571 217179 264868 251259 55332 53358 -41761 5312 92252 -246913 -468410
20724d68410J25979l7769j01767j87825K06872K37529Q3064k14937L6074K99426
$$ -468410 -342431 -380200 -481967 -669792 -462920 -225391 -142327 -357264 -321190 -21764
20714b1764n8573j8211p6559M2949l6896k50028J0402J80304l962O05M3134R53
$$ -21764 -80337 -98548 -175107 -132158 -169054 -419082 -408680 -228376 -232338 -231733 -188599 -187646
20702a87646J38931j46824j3496J70849M8226l22674P5360J96466M2624l8616
$$ -187646 -48715 -195539 -209035 -38186 10040 -312634 -237274 -40808 1816 -36800
20692c6800j12766P2097K26124K60070q9460r3508l4793q4122O6116j27444r5627
$$ -36800 -149566 -77469 148655 408725 319265 225757 190964 106842 172958 45514 -50113
20681e0113k52706j46683q6671P9452p642J15413K6766L04848R010o500j72935
$$ -50113 -302819 -449502 -536173 -456721 -464363 -348950 -322184 -17336 -8326 -14826 -187761
20670a87761l7163J4127r75p1543K80658L06338k70672k05829n5415k04978j43306
$$ -187761 -224924 -210797 -211772 -283315 -2657 303681 33009 -172820 -228235 -433213 -576519
20659e76519j84547R4176K45051J76479r7608o8081L7456M4765l9330n2041N9227
$$ -576519 -761066 -666890 -421839 -245360 -342968 -411049 -373593 -328828 -368158 -420199 -360972
20648c60972R4151o3176R7607J76189J69234n164K54212k01210O1865j90591k31387
$$ -360972 -266821 -329997 -232390 -56201 113033 107869 362081 160871 222736 32145 -199242
20637a99242O627J48798p3190J29253K70645n4790L24762K0334k42130k41216
$$ -199242 -192615 -43817 -117007 12246 282891 228101 552863 573197 331067 89851
20627H9851j15059k88234k25968J197l3637J2282O0111L92379P1931k9796J24281
$$ 89851 -25208 -313442 -539410 -538213 -571850 -559568 -499457 -107078 -35147 -64943 59338
20616E9338n3908j30523O960L24420o6369l3533j67923P9984Q5492K1527j39674
$$ 59338 5430 -125093 -118133 206287 139918 106385 -61538 18446 103938 125465 -14209
20605a4209o2575J8848P6104m4828K21266M1610l31383r1760r9M22674J64875
$$ -14209 -76784 -57936 18168 -26660 194606 236216 -95167 -186927 -187026 235648 400523
20594D00523P4651m32300j75881L5183n5953J79372P3552L5682j29994r0941M6594
$$ 400523 475174 42874 -133007 -97824 -153777 25595 99147 134829 4835 -86106 -39512
20583c9512J9081n253O9151L46557q5091q5638J35387q4089j90127n3701K38230
$$ -39512 -20431 -25684 43467 390024 304933 219295 354682 270593 80466 26765 264995
20572B64995K07246J40843l24724l33047j28305j53385K26076p427q5710J46268
$$ 264995 472241 613084 288360 -44687 -172992 -326377 -100301 -107728 -193438 -47170
20562d7170J69304j53456N8011P0365M1580j63027L84271J6629m8428L6222j84499
$$ -47170 122134 -31322 26689 97054 138634 -24393 359878 376507 328079 364301 179802
20551A79802k98761r7581K16589J23743j39679j25860j49094l8425M9641j33836
$$ 179802 -118959 -216540 49 123792 -15887 -141747 -290841 -329266 -279625 -413461
20541d13461q2759J54438J13603L1502o377l87866K25465K78812J32644Q7089
$$ -413461 -496220 -341782 -228179 -196677 -203054 -590920 -365455 -86643 46001 133090
20531A33090K5301j05902j81637r5234J30928J97124M3681N0772m7546j47864
$$ 133090 158391 52489 -129148 -224382 -93454 103670 147351 198123 150577 2713
20521B713N8386K49963j09197j41172j55278k22118k30126Q368J80350J71203
$$ 2713 61099 311062 201865 60693 -94585 -316703 -546829 -538461 -358111 -186908
20511a86908K29761J04946j03084O5848l1928P3708O2513k37223j05458M3929
$$ -186908 42853 147799 44715 110563 78635 152343 214856 -22367 -127825 -83896
20501h3896P4425L4470l04169l03596J45234K81456j53838J14943J82447L0642
$$ -83896 -9471 24999 -279170 -582766 -437532 -156076 -309914 -194971 -12524 18118
20491A8118R7541j73739k62825m4960p6890J33227N2956R3784K65494L42796J13209
$$ 18118 115659 -58080 -320905 -365865 -442755 -309528 -256572 -162788 102706 445502 558711
20480E58711k37233k52609j6545R7668L1175k4338k08256N1083L63201j85914
$$ 558711 321478 68869 52324 149992 181167 156829 -51427 -344 362857 176943
20470A76943j33753k46506O1206K27581L386N2685j31916k17888j16933J01530
$$ 176943 43190 -203316 -142110 85471 88857 141542 9626 -208262 -325195 -223665
20460b23665J49993R2996R1397J82094j32975k95976N1727P8862K98624J63798
$$ -223665 -73672 19324 110721 292815 159840 -136136 -84409 -5547 293077 456875
20450D56875j19365O1268k64937n9141q1395o4039j80683J80711l23546l0627
$$ 456875 337510 398778 133841 74700 -6695 -70734 -251417 -70706 -394252 -424879
20440d24879J56868J2413M2905K30845L98533J23139j47906n5860m5868K4869
$$ -424879 -268011 -255598 -212693 18152 416685 539824 391918 336058 290190 315059
20430C15059K4857k3889j21827j72106J09955l1262k26051j05555J65634r4842
$$ 315059 339916 316027 194200 22094 132049 100787 -125264 -230819 -65185 -160027
20420a60027q716J34303K99648k03640n68741O0248K16470j19245m3807J99539
$$ -160027 -168743 -34440 265208 61568 -507173 -446925 -230455 -349700 -393507 -193968
20410a93968L41900J87366k8966k47723j3888k70460K05241M45675j20180R8756
$$ -193968 147932 335298 306332 58609 44721 -225739 -20498 425177 304997 403753
20400D03753K04828j32977q062j65689O18k16816p9813L15425L55152O04667J19203
$$ 403753 608581 475604 467542 301853 302471 85655 5842 321267 676419 1281086 1400289
20389A400289k15966l64517j68574J67254N8760l28615j95333n2021k04471r863
$$ 1400289 1184323 819806 651232 818486 877246 548631 353298 301277 96806 86943
20379H6943k15540J75131K22709J0736j40879j79566K11968K49067j53798k16080
$$ 86943 -128597 46534 269243 279979 139100 -40466 171502 420569 266771 50691
20369E0691N6967J88785j04464m6419J27572j80552k38779O2397K81303J6322
$$ 50691 107658 296443 191979 145560 273132 92580 -146199 -83802 197501 213823
20359B13823j20159R550p0309K63055o2437k65576o4844K5374r2596j76352J4995
$$ 213823 93664 103214 32905 295960 233523 -32053 -96897 -71523 -164119 -340471 -325476
20348c25476j5029n7988N0026J16492l9798M2642n3896j22853K64590J36786J75373
$$ -325476 -340505 -398493 -348467 -231975 -271773 -229131 -283027 -405880 -141290 -4504 170869
20337A70869K68786l3204k4235O5597j77815J5813Q0227j14354L1666k26276k07238
$$ 170869 439655 406451 382216 447813 269998 285811 366038 251684 283350 57074 -150164
20326a50164j16524k5519L5626m7116M903L88018L70877m43903j20041K43791
$$ -150164 -266688 -292207 -256581 -303697 -298794 89224 460101 16198 -103843 139948
20316A39948K12325j10189o8802p7405J40700j29456k52648L6941q1203j02621
$$ 139948 352273 242084 173282 95877 236577 107121 -145527 -108586 -189789 -292410
20306b92410L23616M3000p0894R8348l48249j74438J04502J28254K78760J85046
$$ -292410 31206 74206 3312 101660 -246589 -421027 -316525 -188271 90489 275535
20296B75535L1465J45944o5214j82087M4276N8550j50895J13210M7589l77847
$$ 275535 307000 452944 387730 205643 249919 308469 157574 270784 318373 -59474
20286e9474l19685o709J09762Q7068o8696J80642J21131P8559k10125J71854M6668
$$ -59474 -379159 -385868 -276106 -189038 -257734 -77092 44039 122598 -87527 84327 130995
20275A30995j4172p2933k83793j515J42351J55291K5170n9311p5182P5325J91378
$$ 130995 116823 43890 -239903 -241418 -99067 56224 81394 22083 -53099 22226 213604
20264B13604J14589k425L19845l18120l30405k01453o996L27484J40954k03685
$$ 213604 328193 325768 645613 327493 -2912 -204365 -211361 116123 257077 53392
20254E3392J58848R2550j9615k54804j93309J19162J96486J79058O2216j79390
$$ 53392 212240 304790 285175 30371 -162938 -43776 152710 331768 393984 214594
20244B14594j05685j05910k91656p0559P7008J25644J14973J83359j53925M9233
$$ 214594 108909 2999 -288657 -359216 -282208 -156564 -41591 141768 -12157 37076
20234C7076n3260l92813J4070K27431J85281l23210J09751P8802K9550Q315j20501
$$ 37076 -16184 -408997 -394927 -167496 17785 -305425 -195674 -116872 -87322 -79007 -199508
20223a99508l43149K85337L2514r7856R833K15864m2470l405J5311N5454l7982
$$ -199508 -542657 -257320 -224806 -322662 -312829 -96965 -139435 -142840 -127529 -72075 -110057
20212a10057j03981k7258J48337N53790J81770M449M58159N73848L98708j74205
$$ -110057 -214038 -241296 -92959 460831 642601 647050 1105209 1679057 2077765 1903560
20202A903560k62565n39026m70669j80919q9025P6064j29736j03846k4237j30549
$$ 1903560 1640995 1101969 631300 450381 361356 437420 307684 203838 179601 49052
20192D9052k6690k909J54889j51023j34639L21129r6223l28674q4272N29k5130
$$ 49052 22362 19453 174342 23319 -111320 209809 113586 -215088 -299360 -298831 -323961
20181c23961m5791j8301J01368P7081N0722J45556R8231k29298n078L23091J18552
$$ -323961 -369752 -388053 -286685 -209604 -158882 -13326 84905 -144393 -149471 173620 292172
20170B92172j16069k17841Q8967K36899J19291m2351k98239j0665j05729N1523
$$ 292172 176103 -41738 47229 284128 403419 361068 62829 52164 -53565 -2042
20160b042Q9972L9631J33171J44934K43775m3472l56859j53493p546j10248k60297
$$ -2042 87930 127561 260732 405666 649441 605969 249110 95617 88071 -22177 -282474
20149b82474Q6354K37858k5141j00774j19044J29372j3593m9580J46345J29331
$$ -282474 -196120 41738 16597 -84177 -203221 -73849 -87442 -137022 9323 138654
20139A38654j12022q5221R0232J22546N2019J3805k79483j22663J37057L16537
$$ 138654 26632 -58589 31643 154189 206208 220013 -59470 -182133 -45076 271461
20129B71461L08244J20713j79574j81229j80258K6521J97805K3792j771q6701
$$ 271461 579705 700418 520844 339615 159357 185878 383683 407475 405704 319003
20119C19003P4142j3684K4897j45272j11048N3846O673j48864m46020R407J32928
$$ 319003 393145 379461 404358 259086 148038 201884 208557 59693 -386327 -376920 -243992
20108b43992L32753K31821j64551k93595k18791q1538N3105K80087J02537k3778
$$ -243992 88761 320582 156031 -137564 -356355 -437893 -384788 -104701 -2164 -25942
20098b5942m4403M39570L2606k70602j81405P7542Q5408k9146j63422q5860k00442
$$ -25942 -70345 369225 401831 131229 -50176 27366 112774 83628 -79794 -165654 -366096
20087c66096P9000L16497R8720L0385L7882j11411l84150M1202L63399M1723l68594
$$ -366096 -287096 29401 128121 158506 196388 84977 -299173 -257971 105428 147151 -221443
20076b21443q0464K45100k01610j49831J67988K25944K35900J58964j54308k45599
$$ -221443 -301907 -56807 -258417 -408248 -240260 -14316 221584 380548 226240 -19359
20066a9359j96263j4399J97901j45903J9822L5363J128P2563L02787j28010M1127
$$ -19359 -215622 -230021 -32120 -178023 -158201 -122838 -121710 -49147 253640 125630 166757
20055A66757p127l50549k23840O0132r8968J28548K71311J00172j1853R6097M6951
$$ 166757 159630 -190919 -414759 -354627 -453595 -325047 -53736 46436 34583 130680 177631
20044A77631L0572r0185j21550n7477L54924J76844n456k22404l06017J64113
$$ 177631 208203 118018 -3532 -61009 293915 470759 465303 242899 -63118 100995
20034A00995J44177J13879k35845m88707k39364l441L37258K85978K48888O2028
$$ 100995 245172 359051 123206 -365501 -604865 -608306 -271048 14930 263818 325846
20024C25846j40110k78589L13169J72070O1099J6050J15714R867l9376j00626
$$ 325846 185736 -92853 220316 392386 453485 469535 585249 595116 555740 455114
20014D55114j99574q5137J81205k60532j14670r8904m247j46216R6495p9251M5900
$$ 455114 255540 170403 351608 91076 -23594 -122498 -126745 -272961 -176466 -255717 -209817
20003b09817J28560K5471Q4532J27475j43442q949J33139O9393q7800k68446K04400
$$ -209817 -81257 -55786 28746 156221 12779 3830 136969 206362 118562 -149884 54516
19992E4516J27897k17534j4437j70576R3501k620Q4307K56527J26787p3224j07527
$$ 54516 182413 -35121 -49558 -220134 -126633 -129253 -44946 211581 338368 265144 157617
19981A57617M935j33890l8993j1062J40625K64940j85877k71429o0935P1061J04319
$$ 157617 162552 28662 -10331 -21393 119232 384172 198295 -73134 -134069 -63008 41311
19970D1311q6953J07973J97570o2942j13465N6142p70o8838p9314m0358K66846
$$ 41311 -45642 62331 259901 196959 83494 139636 138866 70028 -9286 -49644 217202
19959B17202J75315l4012K3459R9632j4522j6259j23615j13096j32969R3499j08819
$$ 217202 392517 358505 381964 481596 467074 450815 327200 214104 81135 174634 65815
19948F5815K51962k02858j28334K03125Q7299o7017l58794j14357J5499n8716
$$ 65815 317777 114919 -13415 189710 277009 209992 -148802 -263159 -247660 -306376
19938c06376O059J61670K10541M8737k84532j77177j1857K50131Q8017J70528
$$ -306376 -300317 -138647 71894 120631 -163901 -341078 -352935 -102804 -14787 155741
19928A55741m9860k8941J43862J05511j7388j45125j32241J67252P0293M9266
$$ 155741 105881 76940 220802 326313 308925 163800 31559 198811 269104 318370
19918C18370k0141n2075j0778l6022j00398N3070n1428j07504Q9127j19171J16957
$$ 318370 298229 246154 235376 199354 98956 152026 100598 -6906 82221 -36950 80007
19907H0007m563k48754j01596K31655j37377K75687j30427K0666J23961j15363
$$ 80007 75444 -173310 -274906 -43251 -180628 95059 -35368 -14702 109259 -6104
19897f104q3013M7479j30096o6365O6520L88651k22927j74433l8155K07601l4806
$$ -6104 -89117 -41638 -171734 -238099 -171579 217072 -5855 -180288 -218443 -10842 -45648
19886d5648k434K50035r7980L940n3068j46068l0241J22845N4100j8549k42635
$$ -45648 -48082 201953 103973 107913 54845 -91223 -121464 1381 55481 36932 -205703
19875b05703J50547K482K37132K24356k06458n2245J54167m8942k72504j11234
$$ -205703 -55156 -52674 184458 408814 202356 150111 304278 255336 -17168 -128402
19865a28402r836K22636L0201l3829k4057k00567j32591R6704m4516j04273m3927
$$ -128402 -138238 84398 114599 80770 56713 -143854 -276445 -179741 -224257 -328530 -372457
19854c72457p0110L27035P7547K20046l5839R5422M5436l36460k37413K58357
$$ -372457 -442567 -115532 -37985 182061 146222 241644 287080 -49380 -286793 -28436
19844b8436J32473K7434J1017l28643m5058j37815K3898K03044J84192l8899L85305
$$ -28436 104037 131471 142488 -186155 -231213 -369028 -345130 -142086 42106 3207 388512
19833C88512J03003J8682N8396j06053J5759r6693j27359j20724R0094l8223k16001
$$ 388512 491515 510197 568593 462540 478299 381606 254247 133523 223617 185394 -30607
19822c0607M4362K17404r7904l76707k83486M3351K18282J87736n547j21295L1511
$$ -30607 13755 231159 133255 -243452 -526938 -483587 -265305 -77569 -83116 -204411 -172900
19811a72900j47168L05969J07634l16598L68527L09936p1733k30103p8092j05316
$$ -172900 -320068 -14099 93535 -223063 145464 455400 383667 153564 75472 -29844
19801b9844j52545j76184J10133K81675K86751P4855o8322l14812j71607J73359
$$ -29844 -182389 -358573 -248440 33235 319986 394841 326519 11707 -159900 13459
19791A3459n3214k08219N0276L3375J36729J49997M4195J15659j0105m91443J22015
$$ 13459 -39755 -247974 -197698 -164323 -27594 122403 166598 282257 272152 -219291 -97276
19780i7276j7580o8573j30660r7113K0303L1233K43583j76755k30867K02417J92200
$$ -97276 -114856 -183429 -314089 -411202 -390899 -359666 -116083 -292838 -523705 -321288 -129088
19769a29088L43728P2066k56123J22068k8699J7380K16280R5554J22770j46542
$$ -129088 214640 286706 30583 152651 123952 141332 357612 453166 575936 429394
19759D29394m5882k82949L0901k2503k7933j833K35827j4585J70332j3557j95194
$$ 429394 383512 100563 131464 108961 81028 79195 315022 300437 470769 457212 262018
19748B62018K70995J34520k10359l28963j98707r6158q3782Q5224L8751k56582
$$ 262018 533013 667533 457174 128211 -70496 -166654 -250436 -165212 -126461 -383043
19738c83043k96949m8768L09226J73529j10337Q9146j65718Q9724K04831L37267
$$ -383043 -679992 -728760 -419534 -246005 -356342 -267196 -432914 -343190 -138359 198908
19728A98908j86124o3659k6188M10177R4121l14384o029K32278J20347L6564j44628
$$ 198908 12784 -50875 -77063 333114 427235 112851 106822 339100 459447 496011 351383
19717C51383l77293n7654l4494j8519r7011j1866P1823j46154j7074J37643J4529
$$ 351383 -25910 -83564 -118058 -136577 -233588 -245454 -173631 -319785 -336859 -199216 -184687
19706a84687K02681J87095k24046k05763J75709J79381M3089N1595p766l68121
$$ -184687 17994 205089 -18957 -224720 -49011 130370 173459 225054 217288 -150833
19696a50833k34183O6616j6556J33208l130R6015J86235o0977J41381j70026p747
$$ -150833 -385016 -318400 -334956 -201748 -204878 -108863 77372 16395 157776 -12250 -19997
19685a9997k16725p9239J47366K05322k57461m8073M47730M23959j14812M0607
$$ -19997 -236722 -315961 -168595 36727 -220734 -268807 178923 602882 488070 528677
19675E28677J33549k13820j94453k78549l28197m5182j92366l30650k4244M09652
$$ 528677 662226 448406 253953 -24596 -352793 -397975 -590341 -920991 -945235 -535583
19665e35583L51723R228K3494k46136J19304L27922j83494Q2257N3916o6364k15756
$$ -535583 -183860 -174632 -151138 -397274 -277970 49952 -133542 -51285 2631 -63733 -279489
19654b79489m772K37003K4552o0457k93614n3542K26497L31437j16106k62532
$$ -279489 -284261 -47258 -22706 -83163 -376777 -430319 -203822 127615 11509 -251023
19644b51023k03603p3024m6053K76517j23523J51473K17549K05986K2697J58641
$$ -251023 -454626 -527650 -573703 -297186 -420709 -269236 -51687 154299 176996 335637
19634C35637j61k42273j30978K68210J05687K66317M3837k61760p4768j31287
$$ 335637 335476 93203 -37775 230435 336122 602439 646276 384516 309748 178461
19624A78461j16087Q2222l10956Q131j79478J35311o706K58028K30944M70303
$$ 178461 62374 144596 -166360 -158229 -337707 -202396 -209102 48926 279870 750173
19614G50173K46993l68548l40934O5721K57969j21902m77873j78366O7805N1844
$$ 750173 997166 628618 287684 353405 611374 489472 11599 -166767 -98962 -47118
19604d7118m9872K56496L85942r986k59299J47047K95807n1243j52618j61261
$$ -47118 -96990 159506 545448 535462 276163 423210 719017 667774 515156 353895
19594C53895j25295n297J07546O6068m04158k32989J6646j3659j6490J8398K04439
$$ 353895 228600 223303 330849 396917 -7241 -240230 -223584 -237243 -253733 -235335 -30896
19583c0896k62581p8926K05342J70446n9422q2231k36725j83957K66962J56236
$$ -30896 -293477 -372403 -167061 3385 -56037 -138268 -374993 -558950 -291988 -135752
19573a35752J70204p4867L9694L56003L7144j0706J09056K83583P7446N2579Q470
$$ -135752 34452 -40415 -721 355282 392426 381720 490776 774359 851805 904384 912854
19562I12854o1842J03959L43145J37847j56697l05646l54640l01428j58120q1705
$$ 912854 851012 954971 1298116 1435963 1279266 973620 618980 317552 159432 77727
19552G7727p3N6549J43285N1382n6481J85458j702q9384j62689J65344q6979P3204
$$ 77727 77654 134203 277488 328870 272389 457847 456145 366761 204072 369416 282437 355641
19540C55641k5722m02399j89847K43128n010j93528j50525L92115J62075J00396
$$ 355641 329919 -72480 -262327 -19199 -24209 -217737 -368262 23853 185928 286324
19530B86324o0709j74043k13109j65562P9996j02529J39115L3848J31998j34671
$$ 286324 225615 51572 -161537 -327099 -247103 -349632 -210517 -176669 -44671 -179342
19520a79342r5644J47040N4757o3128j61932O339k88121O8272K78269K01968K75614
$$ -179342 -274986 -127946 -73189 -136317 -298249 -291910 -580031 -511759 -233490 -31522 244092
19509B44092K41285n8066j31795L4423j52739r3414j9380l2710j7324j65627j05550
$$ 244092 485377 427311 295516 329939 177200 83786 64406 31696 14372 -151255 -256805
19498b56805j3638O6826M6222K19200J15743J00556L3455L2299j65312j1876P7655
$$ -256805 -270443 -203617 -157395 61805 177548 278104 311559 343858 178546 166670 244325
19487B44325K14295J3299k18819n98600l9649J43249j54256L59017M19521j43964
$$ 244325 458620 471919 253100 -345500 -385149 -241900 -396156 -37139 382382 238418
19477B38418p9882p5713n1602k12258P0543J81256L81764J15906k9716K37656
$$ 238418 158536 82823 31221 -181037 -110494 70762 452526 568432 538716 776372
19467G76372j48466j93880l4964K4560J85451j84660j27277l1636J70095K49997
$$ 776372 627906 434026 399062 423622 609073 424413 297136 265500 435595 685592
19457F85592K76194j84080l29079N3947K50496M74158L22364N3110j7089j39245
$$ 685592 961786 777706 448627 502574 753070 1227228 1549592 1602702 1585613 1446368
19447A446368q6641k12112j60814l1784O0668q9080l6088M13686L62854M7205
$$ 1446368 1359727 1147615 986801 955017 1015685 926605 890517 1304203 1667057 1714262
19437A714262J09592J33385j20712o09097l80644k04496m02560l61460O7996L48601
$$ 1714262 1823854 1957239 1836527 1227430 846786 642290 239730 -121730 -53734 294867
19427B94867p4712J14950J00147N1028m1340j7132M2993K18314J04520j20702
$$ 294867 220155 335105 435252 486280 444940 427808 470801 689115 793635 672933
19417F72933k24711l07850J26534k17541l51939L9585J53064j14994n2779j39296
$$ 672933 448222 140372 266906 49365 -302574 -262989 -109925 -224919 -277698 -416994
19407d16994J48028K63598L47764m25951n54139j20498K43315N34675k26550J15892
$$ -416994 -268966 -5368 342396 -83555 -637694 -758192 -514877 19798 -206752 -90860
19397i0860j3319J22586l1363j19514J30488K51628q877M1318J38922K6520j63283
$$ -90860 -104179 18407 -12956 -132470 -1982 249646 240769 282087 421009 447529 284246
19386B84246j59055K19222M89368J9424j38729k21584J54167j82959l51551Q3858
$$ 284246 125191 344413 833781 853205 714476 492892 647059 464100 112549 196407
19376A96407m8432j80480j03734K55043J65235J8336J16088K2822l0090K0510
$$ 196407 147975 -32505 -136239 118804 284039 302375 418463 441285 411195 431705
19366D31705k11835L5471n1460o1385j78431m74308J04021K74860K1667K47973
$$ 431705 219870 255341 203881 142496 -35935 -510243 -406222 -131362 -109695 138278
19356A38278K73907J21300j75694k91391r3322k7998k99947K33166J01622Q9499
$$ 138278 412185 533485 357791 66400 -26922 -54920 -354867 -121701 -20079 69420
19346F9420l3218J40423K94966Q0454m0167P1801j94739l97236o116K32453l0764
$$ 69420 36202 176625 471591 552045 511878 583679 388940 -8296 -14412 218041 187277
19335A87277q3424R8828q8372j8961K82298k3154j33823o6622l06521l18214L0079
$$ 187277 103853 202681 114309 95348 377646 354492 220669 154047 -152474 -470688 -440609
19324d40609J85618J22978J33701O0156k9640J32979J6422j64290M0687r0714
$$ -440609 -254991 -132013 1688 61844 32204 165183 181605 17315 58002 -32712
19314c2712M754n9231k899K98979N1040j70115K12075j26086k80470j18950J61322
$$ -32712 -27958 -87189 -90088 208891 259931 89816 301891 175805 -104665 -223615 -62293
19303f2293M0997L9267J6799o6102J11765L88761P8653j16193J18281j82377l15624
$$ -62293 -21296 17971 34770 -31332 80433 469194 547847 431654 549935 367558 51934
19292E1934j14955J48025k54110J76231Q7634j07373J08032j39521k80428K47333
$$ 51934 -63021 85004 -169106 7125 94759 -12614 95418 -44103 -324531 -77198
19282g7198J64401P9448m0020K7430j58847l6253O551J04085K20465j86283L1202
$$ -77198 87203 166651 126631 154061 -4786 -41039 -34488 69597 290062 103779 134981
19271A34981J17625J67462o7526K8188l31684j75067k22960J84753J50253q9982
$$ 134981 252606 420068 352542 380730 49046 -126021 -348981 -164228 -13975 -103957
19261a03957j38797p2550L76086K1020k6295p4890j1696K21119j00995J08706
$$ -103957 -242754 -315304 60782 81802 55507 -19383 -31079 190040 89045 197751
19251A97751L91537L7070j7009J65513N9465L9735M91669L59798l31737j46790
$$ 197751 589288 626358 609349 774862 834327 874062 1365731 1725529 1393792 1247002
19241A247002M6259p2087j41822l29026k05969J18847J15764L59337K67442j52478
$$ 1247002 1293261 1221174 1079352 750326 544357 663204 778968 1138305 1405747 1253269
19231A253269p0143k69201k31188j06949q36N9102o3264k60794j84787k9097j82211
$$ 1253269 1183126 913925 682737 575788 574952 634054 570790 309996 125209 96112 -86099
19220h6099Q6649J48211q4604k07452J27186K07722k21018j26537K60448K79055
$$ -86099 550 148761 64157 -143295 -16109 191613 -29405 -155942 104506 383561
19210C83561j46864r0832J7247j40938p0015J87163N4339Q6999k92716K1301K44044
$$ 383561 236697 145865 163112 22174 -47841 139322 193661 280660 -12056 9245 253289
19199B53289J55031M1269m7069L96863M86245J26591j09328l47948m16489m6335
$$ 253289 408320 449589 402520 799383 1285628 1412219 1302891 954943 538454 492119
19189D92119K52827K26909R9795k95845J49627K51839M82787J75862N5471m55281
$$ 492119 744946 971855 1071650 775805 925432 1177271 1660058 1835920 1891391 1436110
19179A436110l11835k96758l68465m6240p6557j88271M5996M4231M9642J02937
$$ 1436110 1124275 827517 459052 412812 336255 147984 193980 238211 287853 390790
19169C90790Q3301J59242L26934K91121j33509p1482J4683j54866l16266l54450
$$ 390790 474091 633333 960267 1251388 1117879 1046397 1061080 906214 589948 235498
19159B35498p1710J37278L3600M1747K87970N3735j28997J82849p3087l75077
$$ 235498 163788 301066 334666 376413 664383 718118 589121 771970 698883 323806
19149C23806k89948K53984j18202n4292L6238j12169J4308O5645K6296R4617j6640
$$ 323806 33858 287842 169640 115348 151586 39417 53725 119370 145666 240283 223643
19138B23643P9304K93665j15131k40490J2192m190r387J65834j51669q5213O6377
$$ 223643 302947 596612 481481 240991 253183 248993 239606 405440 253771 168558 234935
19127B34935J07148K35273N08637O06283M20055K46430j64023p39410p43857k69398
$$ 234935 342083 577356 1085993 1692276 2112331 2358761 2194738 1455328 711471 442073
19117D42073j33498n7111K33557o2302J53102l2464k82167r0461J91612R7134
$$ 442073 308575 251464 485021 422719 575821 543357 261190 170729 362341 459475
19107D59475K57074J69438J65371J53446K13447J98207K62795J61929p6114j91722
$$ 459475 716549 885987 1051358 1204804 1418251 1616458 1879253 2041182 1965068 1773346
19097A773346L8787J6379l46593m99998n4140N1385o2157j11641k25477J07708
$$ 1773346 1812133 1828512 1481919 981921 927781 979166 917009 805368 579891 687599
19087F87599k60435k45208L84253j48256j68166J78205R8610l08676j51887K9603
$$ 687599 427164 181956 566209 417953 249787 427992 526602 217926 66039 95642
19077I5642J41278r7919J6118P9913j10105j20080J51208n1037J99257L36512
$$ 95642 236920 139001 155119 235032 124927 4847 156055 105018 304275 640787
19067F40787O2147N321K63124J73861L41147K34871n2933J46597k2943m25290
$$ 640787 702934 708255 971379 1145240 1486387 1721258 1668325 1814922 1791979 1366689
19057A366689o73128k30085O3940j67837K3753J26609J74921j47802j85042j10128
$$ 1366689 693561 463476 527416 359579 383332 509941 684862 537060 352018 241890
19047B41890j49100L4589r3498J73567J51801k32966Q3096J26720j2690L02742
$$ 241890 92790 127379 33881 207448 359249 126283 209379 336099 323409 626151
19037F26151L1620j55799K88946j5852j04878j11049j91781m2837J19922J52648
$$ 626151 657771 501972 790918 775066 670188 559139 367358 324521 444443 597091
19027E97091R4296P2323J58054K36506l03171Q2631J61214k06636k51862J91421
$$ 597091 691387 763710 921764 1158270 855099 937730 1098944 892308 640446 831867
19017H31867k5175L9988N034l7755r9228r5154N1702K66047n7555j79988L85877
$$ 831867 806692 846680 851714 813959 714731 619577 671279 937326 879771 699783 1085660
19006A085660j62578n9409j03076K65876K97560l10067j0631J14039N81337L75593
$$ 1085660 923082 863673 760597 1026473 1324033 1013966 1003335 1117374 1698711 2074304
18996B074304k21130k99604p8084j08025j11560k16484q2923R397O93238Q79151
$$ 2074304 1853174 1553570 1475486 1367461 1255901 1039417 956494 965891 1659129 2538280
18986B538280J45113k69870l90446n3825M13264J70386j0558k46033k45421l31791
$$ 2538280 2683393 2413523 2023077 1969252 2382516 2552902 2542344 2296311 2050890 1719099
18976A719099j73226j29499l8840j3749R1872M81064n0105j31296K96720L10249
$$ 1719099 1545873 1416374 1377534 1363785 1455657 1936721 1886616 1755320 2052040 2362289
18966B362289J55517Q2824p5196K13162J67081J19493j77353j21866j63321L49708
$$ 2362289 2517806 2600630 2525434 2738596 2905677 3025170 2847817 2725951 2562630 2912338
18956B912338K48360J12176L2092N7422K88739Q8193l00981k35178o5385l48059
$$ 2912338 3160698 3272874 3304966 3362388 3651127 3739320 3438339 3203161 3137776 2789717
18946B789717k3633K28815M34767Q0502K82645O96116M56364M92251N08976P25682
$$ 2789717 2766084 2994899 3429666 3510168 3792813 4488929 4945293 5437544 5946520 6672202
18936F672202Q15130P12151O00083O40865O15877P65883P21694R15791J827164
$$ 6672202 7487332 8199483 8799566 9440431 10056308 10822191 11543885 12459676 14286840
18927A4286840K214774K616460L151597L624409M332667N829751P782008J1832332
$$ 14286840 16501614 19118074 22269671 25894080 30226747 36056498 43838506 55670838
18919E5670838J9419302L2724670N6202760P8540307O1418570K9014627J7972153
$$ 55670838 75090140 107814810 164017570 242557877 303976447 332991074 350963227
18912C50963227L009932l4623092n7726397o0507774l6940860p079594K2610039
$$ 350963227 353973159 319350067 261623670 201115896 164175036 157095442 179705481
18905A79705481N7837534Q1565899N1850806J5702251M285796j4836507n4040545
$$ 179705481 237543015 319108914 370959720 386661971 390947767 376111260 322070715
18898C22070715p5621807p6002971n3025954l1420996j8875669j2194841q728018
$$ 322070715 246448908 170445937 117419983 85998987 67123318 54928477 46200459
18891D6200459o421659n194918m151648l184151k962817k799164k236759j555472
$$ 46200459 39778800 34583882 30432234 27248083 24285266 21486102 19249343 17693871
18883A7693871j210697j395418j262683j056065j118324j269389j354945r80906
$$ 17693871 16483174 15087756 13825073 12769008 11650684 10381295 9026350 8045444
18875H045444p12204m92756l58934k33313l39356l87254l04191k33717l95275
$$ 8045444 7333240 6840484 6481550 6248237 5908881 5521627 5217436 4983719 4588444
18866D588444n75827k46495j29717J23050P0118O4796K90752k34652k47511j3797
$$ 4588444 4012617 3766122 3636405 3759455 3829573 3894369 4185121 3950469 3702958 3689161
18856C689161j29368k90112o257q9818J48916K49388J32753J82645m19441m92072
$$ 3689161 3559793 3269681 3263424 3173606 3322522 3571910 3704663 3887308 3467867 2975795
18846B975795m13441l62293m38055l43503j52032L7332j03034o864p1705Q505
$$ 2975795 2562354 2200061 1762006 1418503 1266471 1303803 1200769 1193905 1122200 1130705
18836A130705M2841k3298M0333q9472p3888K9832q1758j44336j3147l2672Q4999
$$ 1130705 1173546 1150248 1190581 1101109 1027221 1057053 975295 830959 817812 785140 870139
18825H70139j37872j09641J3944j95657K0888J22230J35349K01833J53944L58148
$$ 870139 732267 622626 636570 440913 461801 584031 719380 921213 1075157 1433305
18815A433305j02438M2940n7777R7407M23845k1123M5503M20055N78792N88913
$$ 1433305 1330867 1373807 1316030 1413437 1837282 1816159 1861662 2281717 2860509 3449422
18805C449422L33640l7731l86496j85763k95692l16457k46434k78477Q6382m6707
$$ 3449422 3783062 3745331 3358835 3173072 2877380 2560923 2314489 2036012 2122394 2075687
18795B075687P8482K22277j15991l70095n67163l53503k4240K20630k6039j08727
$$ 2075687 2154169 2376446 2260455 1890360 1323197 969694 945454 1166084 1140045 1031318
18785A031318J88248J32938q8617L2130J6426k61641K9806R2769J13448K47600
$$ 1031318 1219566 1352504 1263887 1296017 1312443 1050802 1080608 1173377 1286825 1534425
18775A534425J9170j89338k9993K79207L2611o0039L1393Q2723K55908N00062
$$ 1534425 1553595 1364257 1334264 1613471 1646082 1586043 1617436 1700159 1956067 2456129
18765B456129K90194P89335O94949k98024l78777n64716p26045r8156L18714J14242
$$ 2456129 2746323 3535658 4230607 3932583 3553806 2989090 2263045 2164889 2483603 2597845
18755B597845J03232K1754m39767k16205J13400L24184O25301M64545J06252L1250
$$ 2597845 2701077 2722831 2283064 2066859 2180259 2504443 3129744 3594289 3700541 3731791
18745C731791j9591l1411L22699L09674M40914N58698K20994M8100L64980J236622
$$ 3731791 3712200 3680789 4003488 4313162 4754076 5312774 5533768 5581868 5946848 7183470
18735G183470Q69902O22678Q37613J340897J848113K330566L003639L404985N078021
$$ 7183470 8053372 8676050 9513663 10854560 12702673 15033239 18036878 21441863 26519884
18726B6519884Q330795J3632157K3090146M0435559O1549462M9866442k103049
$$ 26519884 34850679 48482836 71572982 112008541 173558003 223424445 221321396
18719B21321396l5367571n0196653l9300308k2142783j0103631j749463O122279
$$ 221321396 185953825 135757172 96456864 74314081 64210450 62460987 68583266
18712F8583266J7616854L5306907N1998116L3095892j2577303l8662552m7718082
$$ 68583266 86200120 121507027 173505143 206601035 194023732 155361180 107643098
18705A07643098l4707687k0356210j2097647p795756n465434m272494k652761
$$ 107643098 72935411 52579201 40481554 32685798 27220364 22947870 20295109
18698B0295109j569007j187131q58583j086367j357449q17527l35416L77129O6452
$$ 20295109 18726102 17538971 16680388 15594021 14236572 13419045 13083629 13460758 13527210
18689A3527210m43088m49607J16709M77512Q38787R36847P97627J279004J918634
$$ 13527210 13084122 12634515 12751224 13228736 14067523 15004370 15801997 17081001 18999635
18680A8999635K633003K750333M053955O012636R446415J5964316K6963702M6699192
$$ 18999635 21632638 24382971 28436926 34449562 43895977 59860293 86823995 133523187
18672A33523187P3437556P0979714R304969l8947211o3055314n4638165l2198083
$$ 133523187 206960743 277940457 287245426 248298215 185242901 130604736 98406653
18665I8406653j5548886m119646P092753K0751999M1551175O6181640N3978928
$$ 98406653 82857767 78738121 85830874 106582873 148134048 214315688 268294616
18658B68294616o400427m5746040o3932060n1119652l0822905j8118299j1123860
$$ 268294616 261894189 216148149 152216089 101096437 70273532 52155233 41031373
18651D1031373p763922n852644m039871k901028k257509j580382j627310j563692
$$ 41031373 33267451 27414807 23374936 20473908 18216399 16636017 15008707 13445015
18643A3445015j355613j281685p46807o10365l71988o34648q02823p75875n55979
$$ 13445015 12089402 10807717 10060910 9450545 9078557 8443909 7641086 6865211 6309232
18634F309232j15906k38024m76851n59578l38941k45329n19053m33776k92675
$$ 6309232 6193326 5955302 5478451 4918873 4579932 4334603 3815550 3381774 3089099
18625C089099l56596j77682k39975j21745J85622j3768j42840j34955k39434l51174
$$ 3089099 2732503 2554821 2314846 2193101 2378723 2364955 2222115 2087160 1847726 1496552
18615A496552k32143j37237j38722j90533J79423J96770l01286j77868J06844
$$ 1496552 1264409 1127172 988450 797917 977340 1174110 872824 694956 801800
18606H01800L49649l6766j93472r8890L6944J3272j8747j53126K21679L20572
$$ 801800 1151449 1114683 921211 822321 859265 872537 853790 700664 922343 1242915
18596A242915p334q2248j28512r3671N4616J88092j30066k30203k27378m9876
$$ 1242915 1235581 1153333 1024821 931150 985766 1173858 1043792 813589 586211 536335
18586E36335j22745p7484J12808Q0232j39068j33331O6292r7983j37944K9908
$$ 536335 413590 336106 448914 529146 390078 256747 323039 225056 87112 117020
18576A17020K75952j62679l40999K31353M43289J22680q8673j85912j3395j7015
$$ 117020 392972 230293 -110706 120647 563936 686616 597943 412031 398636 381621
18566C81621K12307m7792J36410q1246j43784P791L8489N7269P9868j9778j62452
$$ 381621 593928 546136 682546 601300 457516 465307 503796 561065 640933 621155 458703
18555D58703j54150P518l6562n6337j13910J9990K41568J24442m4552J46579J01345
$$ 458703 304553 312071 275509 219172 105262 125252 366820 491262 446710 593289 694634
18544F94634O8287J80060j64238l14228j59288J2788o760m1866n0176j87195J7424
$$ 694634 762921 942981 778743 464515 305227 318015 311255 269389 219213 32018 49442
18533D9442L76338J01438m3190p7531K24595Q7638l06783J55754J62127J37300
$$ 49442 425780 527218 484028 406497 631092 718730 411947 567701 729828 867128
18523H67128k36486k70296j4295k589K05388j75378k73002K16686K21576J17687
$$ 867128 630642 360346 346051 343462 548850 373472 100470 317156 538732 656419
18513F56419K41833k2619L65901J51272l07581j10429k19172m23649n543P4608
$$ 656419 898252 875633 1241534 1392806 1085225 974796 755624 331975 326432 401040
18503D01040j44023l57182j33103n5075J69334L25269l4035p7313J37323J08143
$$ 401040 257017 -100165 -233268 -288343 -119009 206260 172225 94912 232235 340378
18493C40378n5129j60904K5435l9529K02022J48609j05820j94269P4171J61638
$$ 340378 285249 124345 149780 110251 312273 460882 355062 160793 234964 396602
18483C96602J0807J38920P5267J36339J00718O971k04041j58726J8679K88701
$$ 396602 407409 546329 621596 757935 858653 865624 661583 502857 521536 810237
18473H10237j15576l30640l29459l37318m8950J58171K19685L6778k7679J3584
$$ 810237 694661 364021 34562 -302756 -351706 -193535 26150 62928 35249 48833
18463D8833J61036O6221O9848l6055j1998L35401J17769J8698m2795m7590k57611
$$ 48833 209869 276090 345938 309883 297885 633286 751055 769753 726958 679368 421757
18452D21757j68474K36575K10383j89411n9073K2458O1323l8334J96532k176l72796
$$ 421757 253283 489858 700241 510830 451757 474215 535538 497204 693736 691560 318764
18441C18764k4381J50039J52541J19047J18799r7594j95389j26250j26670q4437
$$ 318764 294383 444422 596963 716010 834809 737215 541826 415576 288906 204469
18431B04469m4197r0141l07743j28254L88979J54971M8858R8899J84943q0156
$$ 204469 160272 70131 -237612 -365866 23113 178084 226942 325841 510784 430628
18421D30628L45340L3823l98409O2842N167L5369L0395j37037r1459L60637O8177
$$ 430628 775968 809791 411382 474224 479391 514760 545155 408118 316659 677296 745473
18410G45473J63557q2793p760M02209L0515l32430q311K30724q4628r4521k15667
$$ 745473 909030 826237 818477 1220686 1251201 918771 910460 1141184 1056556 962035 746368
18399G46368k47783k67139J09674K97426L01613l30927q4936M859K58720K07236
$$ 746368 498585 231446 341120 638546 940159 609232 524296 529155 787875 995111
18389I95111j57354j67398J13439J77234J84681J38435l4771J97245R3351J26926
$$ 995111 837757 670359 783798 961032 1145713 1284148 1249377 1446622 1539973 1666899
18379A666899N4003J25074J77664M34760N04378L95545M40414K90476J48395J13023
$$ 1666899 1720902 1845976 2023640 2458400 2962778 3358323 3798737 4089213 4237608 4350631
18369D350631p6338q9253m1091J20829N64336O02233O15865O74192L31196L23312
$$ 4350631 4274293 4185040 4143949 4264778 4829114 5431347 6047212 6721404 7052600 7375912
18359G375912K44885L11302M33975L55277K46742J88779J74088K5260J5202O24454
$$ 7375912 7620797 7932099 8366074 8721351 8968093 9156872 9330960 9356220 9371422 9995876
18349I995876O84448J264939J741575K002888K087875K599516L542920M879635
$$ 9995876 10680324 11945263 13686838 15689726 17777601 20377117 23920037 28799672
18341B8799672O787606R909843J4707406K3788434L9662183O6139783R2400444
$$ 28799672 35587278 45497121 60204527 83992961 123655144 189794927 282195371
18334B82195371P2911195K8300215J3377727k50823m2445451p2562047q2565704
$$ 282195371 355106566 383406781 396784508 396533685 354088234 281526187 198960483
18327A98960483o4607659l9740045k3714117j5360986j0618456p330150n601126
$$ 198960483 134352824 94612779 70898662 55537676 44919220 37589070 31987944
18320C1987944m383042l484751k977606k266635j479666j062289j179514n70233
$$ 31987944 27604902 24120151 21142545 18875910 17396244 16333955 15154441 14584208
18312A4584208m8652k91652n18069o14566o08955m24994n1766Q2142J66949K52401
$$ 14584208 14535556 14243904 13725835 13111269 12502314 12077320 12025554 12107696 12274645 12527046
18302A2527046N48239J80075n2819k79800K77991O59404J326580J375334J845342
$$ 12527046 13075285 13255360 13202541 12922741 13200732 13860136 15186716 16562050 18407392
18293A8407392K451505L427364M356869O610486J0449479J6646060K7250094M6306717
$$ 18407392 20858897 24286261 28643130 35253616 45703095 62349155 89599249 135905966
18285A35905966O9303968O3980779K6817044J1466835L623098k6156639n3620128
$$ 135905966 205209934 269190713 296007757 307474592 311097690 284941051 231320923
18278B31320923o5189109n4507572l4614845k0325271j2840080q426328o218917
$$ 231320923 166131814 111624242 77009397 56684126 43844046 35417718 29198801
18271B9198801m818097l758152k864689k531639k202746j643965j450817q21733
$$ 29198801 24380704 20622552 17757863 15226224 13023478 11379513 9928696 9106963
18263I106963m89200l7516j62023m03991m87807l82044n81225n11440m75133J97150
$$ 9106963 8617763 8580247 8418224 8014233 7526426 7144382 6563157 6051717 5576584 5773734
18253E773734J21513p7613j7481l94615m55855o53204n27174n96910l45135j42417
$$ 5773734 5895247 5817634 5800153 5405538 4949683 4296479 3769305 3172395 2827260 2684843
18243B684843k55525n31570m66515o2671j03766l5826O472Q0239O6555P2748r2853
$$ 2684843 2429318 1897748 1431233 1368562 1264796 1228970 1235442 1315681 1382236 1454984 1362131
18232A362131K20399L02528q9886l15394k06335J03584j49487k01457r6152m6602
$$ 1362131 1582530 1885058 1795172 1479778 1273443 1377027 1227540 1026083 929931 883329
18222H83329j40960r3587J54944m9499k22531p4175K42543k22984J18539K68400
$$ 883329 742369 648782 803726 754227 531696 457521 700064 477080 595619 864019
18212H64019q8573J57634J63598q0519l07897l6395p8103j6677L29207J95577
$$ 864019 775446 933080 1096678 1016159 708262 671867 593764 577087 906294 1101871
18202A101871K28778m384j66946Q5437o957j28289j48998q1990P0487K10163K5247
$$ 1101871 1330649 1326265 1159319 1244756 1237799 1109510 960512 878522 949009 1159172 1184419
18191A184419k07976j09854n0609K96491L34307M51756L35311L33047o020o70401
$$ 1184419 976443 866589 815980 1112471 1446778 1898534 2233845 2566892 2560872 1890471
18181A890471n69704k84016j46249j89062L05114K24236K86760M48467K94388
$$ 1890471 1320767 1036751 890502 701440 1006554 1230790 1517550 1966017 2260405
18172B260405K45147m2381j68298p20905m71041M2517j81237k55373L04532N0754
$$ 2260405 2505552 2463171 2294873 1573968 1102927 1145444 964207 708834 1013366 1064120
18162A064120R4187J40720k45058j10690J97778J18901K05770k09375j08787J4363
$$ 1064120 1158307 1299027 1053969 943279 1141057 1259958 1465728 1256353 1147566 1161929
18152A161929q577j9265j83171K23260N2093p8642K80293L659n17863k43448L76221
$$ 1161929 1153352 1134087 950916 1174176 1226269 1147627 1427920 1431579 913716 670268 1046489
18141A046489L85145o2504j81518P78L79331L34491M33680K73886L42265L80978
$$ 1046489 1431634 1369130 1187612 1188390 1567721 1902212 2335892 2609778 2952043 3333021
18131C333021m9773L03684K59682M4027J21630N65164P91900Q09400N99045P15181
$$ 3333021 3283248 3586932 3846614 3890641 4012271 4577435 5369335 6178735 6777780 7492961
18121G492961P03624M73400P81155J290588J462122K003252K980312M028000N281826
$$ 7492961 8196585 8669985 9451140 10741728 12203850 14207102 17187414 21215414 26497240
18112B6497240P313220J0877604J7240927K9307135N3699499J01769656J65081682
$$ 26497240 33810460 44688064 61928991 91236126 144935625 246705281 411786963
18105D11786963J10401298l4178086q5833277j34595203j04121286n7626584l1225968
$$ 411786963 522188261 488010175 402176898 267581695 163460409 105833825 74607857
18098G4607857j8448521j2379326q624384o106239m781983l862126l431745k696016
$$ 74607857 56159336 43780010 35155626 29049387 24267404 20405278 16973533 14277517
18090A4277517j991708j563557r77779q94776q06161o38867o90599k04634n41948
$$ 14277517 12285809 10722252 9744473 8849697 8043536 7404669 6714070 6509436 5967488
18081E967488o97976j55351j84319j39605j81107k78240k82935l97494l15363
$$ 5967488 5269512 5114161 4929842 4790237 4609130 4330890 4047955 3650461 3335098
18072C335098o5743k60846k96281m19497j28601m5622P998J19825k25528l70010
$$ 3335098 3269355 3008509 2712228 2292731 2164130 2118508 2126506 2246331 2020803 1650793
18062A650793l14020j31541r9217J35093M4259k95745r0215j59216k4357K68856
$$ 1650793 1336773 1205232 1106015 1241108 1285367 989622 899407 740191 715834 984690
18052I84690j34928k16532N360k40960K1773M5472O5679J41999j12879k24643
$$ 984690 849762 633230 638590 397630 419403 464875 530554 672553 559674 335031
18042C35031j55004K10484J43526M3203k27342j94285J74727P823l1565M44377
$$ 335031 180027 390511 534037 577240 349898 155613 330340 338163 306598 750975
18032G50975K55021j00357l50867j92649j03245K66031k61986l719K91522L89443
$$ 750975 1005996 905639 554772 362123 258878 524909 262923 259204 550726 940169
18022I40169k25316m18259r7217K68630L16509o8842k84893r7628j2278J29846
$$ 940169 714853 296594 199377 468007 784516 715674 430781 333153 320875 450721
18012D50721j81348m6304J11660K09416o4087L10495L9433j43904j56167m4955
$$ 450721 269373 223069 334729 544145 480058 790553 829986 686082 529915 484960
18002D84960k5329k51284o2066N0807J02467K13853l2197k71651k57676K26905
$$ 484960 459631 208347 146281 197088 299555 513408 481211 209560 -48116 178789
17992A78789j84460j17255Q4818O6080j47486j54631K62916K8343j01811R409
$$ 178789 -5671 -122926 -38108 27972 -119514 -274145 -11229 17114 -84697 -75288
17982g5288j6337N9156j20905j2822J89711J79729L72169n4755j92178r639M3951
$$ -75288 -91625 -32469 -153374 -166196 23515 203244 575413 520658 328480 318841 362792
17971C62792k51599J27842K23144Q7663M1771k81198r0353p8237O5344k09542
$$ 362792 111193 239035 462179 549842 591613 310415 220062 141825 207169 -2373
17961b373j30383j57443K24085K10075m2431J65105j26119l94887j74271l3874
$$ -2373 -132756 -290199 -66114 143961 101530 266635 140516 -254371 -428642 -462516
17951d62516j0317J35041J55463J44297n3566J3852n236K07643K42530L1874j93483
$$ -462516 -472833 -337792 -182329 -38032 -91598 -77746 -82982 124661 367191 399065 205582
17940B05582q5691q8304K67704j56451N7840j27949M6758O5630N169J19257L8516
$$ 205582 119891 31587 299291 142840 200680 72731 119489 185119 190288 309545 348061
17929C48061j7752j46794n1257J40740m6622n1825k03606l9374P0658l11551M3235
$$ 348061 330309 183515 132258 272998 226376 174551 -29055 -68429 2229 -309322 -266087
17918b66087R3867J66426l1179j42567l86659o0831Q2971O3105K09698M6728J62372
$$ -266087 -172220 -5794 -36973 -179540 -566199 -627030 -544059 -480954 -271256 -224528 -62156
17907f2156J97767m2240k56593J55165L26682k13837k63782j12596k12712K38422
$$ -62156 135611 93371 -163222 -8057 318625 104788 -158994 -271590 -484302 -245880
17897b45880J30416P2815J24048P6165p404j96058L5344j74288J55972j40327
$$ -245880 -115464 -42649 81399 157564 150160 -45898 -10554 -184842 -28870 -169197
17887a69197K6159J39452j79215j21667R4825j96695J54923m1947m9303R1092
$$ -169197 -143038 -3586 -182801 -304468 -209643 -406338 -251415 -293362 -342665 -251573
17877b51573J36118J3483J42756J29236o1709o5035P5024l45514l4300k7015R8654
$$ -251573 -115455 -101972 40784 170020 108311 43276 118300 -227214 -261514 -288529 -189875
17866a89875r8171K40611o0598o7384K90955N2686k01013j91448k52841n6826
$$ -189875 -288046 -47435 -108033 -175417 115538 168224 -32789 -224237 -477078 -533904
17856e33904K44847p3907K85546L10854k4282j02133k09556Q071J47502N3485
$$ -533904 -289057 -362964 -77418 233436 209154 107021 -102535 -94464 53038 106523
17846A06523L92455J01779k05448l75009k10209j07282J65384o4211O714K43606
$$ 106523 498978 600757 395309 20300 -189909 -297191 -131807 -196018 -189304 54302
17836E4302L07832J05287L005P1957k24790j83711J0382J25980L7508j81522j98668
$$ 54302 362134 467421 470426 542383 317593 133882 144264 270244 307752 126230 -72438
17825g2438k37735J67960J46541m5748Q4093J22949J74445K7036P7284J85370
$$ -72438 -310173 -142213 4328 -41420 42673 165622 340067 367103 444387 629757
17815F29757K59211N10831M16771j11299l317n6965m09099o28405l78527j29048
$$ 629757 888968 1399799 1816570 1705271 1701954 1644989 1235890 607485 228958 99910
17805I9910l0365n4548l136k4063j41896j74970J41194L00990j47686P5336j43662
$$ 99910 69545 14997 11861 -12202 -154098 -329068 -187874 113116 -34570 40766 -102896
17794a02896n9484k54250j75920J19046J69461Q7602K09954J06814M4360j06317
$$ -102896 -162380 -416630 -592550 -473504 -304043 -216441 -6487 100327 144687 38370
17784C8370k37110j4801j40107L3428K56638K83101l4803k04683k97365N8684
$$ 38370 -198740 -213541 -353648 -320220 -63582 219519 184716 -19967 -317332 -258648
17774b58648J41392Q7659K07715L72938j66543q2762J2536P6361J15491M18034
$$ -258648 -117256 -29597 178118 551056 384513 301751 314287 390648 506139 924173
17764I24173L01235K53131j5590L46377J29727l62413p47194n68957k36661j12102
$$ 924173 1225408 1478539 1462949 1809326 1939053 1576640 829446 260489 23828 -88274
17754h8274o4075Q8469K18845p2940j3602J5601n8852q8230k35127j79545L17583
$$ -88274 -152349 -63880 154965 82025 68423 84024 25172 -63058 -298185 -477730 -160147
17743a60147Q5231N5663R8886P9900M2k73679L6166j0239J40856K05223R3088
$$ -160147 -74916 -19253 79633 159533 159575 -114104 -77938 -88177 52679 257902 350990
17732C50990K39823k07448k98437l37604J70738K56308k65803j10247K81878k07138
$$ 350990 590813 383365 84928 -252676 -81938 174370 -91433 -201680 80198 -126940
17722a26940J1026K35769l32424O7330Q8658n951n7414J4868P6774M1387k2228
$$ -126940 -115914 119855 -212569 -145239 -56581 -62532 -119946 -105078 -28304 13083 -9145
17711i145k01062j68614m1702M05445O5511j92629k0922J72161J40784J29536
$$ -9145 -210207 -378821 -420523 -15078 50433 -142196 -163118 9043 149827 279363
17701B79363K06913k5269k24620k40619l7862M4043P6911k93398j75414J15102
$$ 279363 486276 461007 236387 -4232 -42094 1949 78860 -214538 -389952 -274850
17691b74850k78953o601R0578K33297M8633j81554J233J9116J30492J88623N8928
$$ -274850 -553803 -560404 -469826 -236529 -187896 -369450 -368217 -349101 -218609 -29986 28942
17680B8942N0805j49590K889j48328K33107K4996r8695k1571P4542J63731j4194
$$ 28942 79747 -69843 -66954 -215282 17825 42821 -55874 -77445 -2903 160828 146634
17669A46634j63222m6787N0913k38492K26712o8801k95740o8395N6709K2410O9915
$$ 146634 -16588 -63375 -12462 -250954 -24242 -93043 -388783 -457178 -400469 -378059 -308144
17658c08144l193J63653M7784J2379k18361L4830J25387o5284p8727j36410J26356
$$ -308144 -311337 -147684 -99900 -87521 -305882 -271052 -145665 -210949 -289676 -426086 -299730
17647b99730k21327r2354J3266J6498R7043L52252K73558K1007R0517j00238j89121
$$ -299730 -521057 -613411 -600145 -583647 -486604 -134352 139206 160213 250730 150492 -38629
17636c8629j8456n9911N9429L65887K46701k09944k24893Q3217l15773l0189N2758
$$ -38629 -57085 -116996 -57567 308320 555021 345077 120184 203401 -112372 -142561 -89803
17625h9803L42591L48999J48410k13081j86514k14541m6311l21210l256o861l9404
$$ -89803 252788 601787 750197 537116 350602 136061 89750 -231460 -234716 -241577 -280981
17614b80981P3433L6964M7814k8683j05212M152K56297J61862j9201J45161j12282
$$ -280981 -207548 -170584 -122770 -151453 -256665 -252513 3784 165646 146445 291606 179324
17603A79324r9695L7252P6580j17324l63710n4364p0119J08758J64259L3440O1339
$$ 179324 79629 116881 193461 76137 -287573 -341937 -412056 -303298 -139039 -105599 -44260
17592d4260Q1329j6413l8064o9274m5320O4802R5745j21379O1763K84748q4061
$$ -44260 37069 20656 -17408 -86682 -132002 -67200 28545 -92834 -31071 253677 169616
17581A69616n964O8993k64790j94662l1403K81211M40818l37800k74653m3628
$$ 169616 163652 232645 -32145 -226807 -258210 23001 463819 126019 -148634 -192262
17571a92262Q1143K5489n3723K7114k6583L0155k50758R7276J49812j2389P3635
$$ -192262 -111119 -85630 -139353 -112239 -138822 -108667 -359425 -262149 -112337 -124726 -51091
17560e1091j8098k00059j0207J37597J29490J1536L86016k0596m10269m0505J17932
$$ -51091 -69189 -269248 -279455 -141858 -12368 -832 385184 364588 -45681 -86186 31746
17549C1746j24537m6529j5285J04381K53046M45468J82312k98560j32485J28810
$$ 31746 -92791 -139320 -154605 -50224 202822 648290 830602 532042 399557 528367
17539E28367j72871m03077q6545N4386O6368r9132j56594o9881L1670J39335K03168
$$ 528367 355496 -47581 -134126 -79740 -13372 -112504 -269098 -338979 -307309 -167974 35194
17528C5194K08095l07765k5312o6736J05495j03971o5026j3226K90003j6668q9074
$$ 35194 243289 -64476 -89788 -156524 -51029 -155000 -220026 -233252 56751 40083 -48991
17517d8991K80224J74525J02302k50370j00948J19654r2985j93271k44177J19055
$$ -48991 231233 405758 508060 257690 156742 276396 183411 -9860 -254037 -134982
17507a34982J12016l05764k63979P0969J00538M425j1062K05380j12298J81192
$$ -134982 -22966 -328730 -592709 -521740 -421202 -416777 -427839 -222459 -334757 -153565
17497a53565j10001j35794O9509K12390J11055j44897J16632K35614l42275p895
$$ -153565 -263566 -399360 -329851 -117461 -6406 -151303 -34671 200943 -141332 -149227
17487a49227K07336j0632k48250K2150P5702r2929j95544q6520J93486J03732
$$ -149227 58109 47477 -200773 -178623 -102921 -195850 -391394 -477914 -284428 -180696
17477a80696J76707J0242j72266P2210k12597J31166R9592J84460R6086o0264
$$ -180696 -3989 6253 -166013 -93803 -306400 -175234 -75642 108818 204904 144640
17467A44640J65878k33333k89838M6664Q1837J80090r4564J66787N8615k57138
$$ 144640 310518 77185 -212653 -165989 -84152 95938 1374 168161 226776 -30362
17457c0362j55631k8387j83689J53308Q5981l86217j91651L69331O6002k43526
$$ -30362 -185993 -214380 -398069 -244761 -158780 -544997 -736648 -367317 -301315 -544841
17447e44841K0495M2193k928P9150L97845O66975N57751O38256R06440K06146
$$ -544841 -524346 -482153 -485081 -405931 -8086 658889 1216640 1854896 2761336 2967482
17437B967482l44888p12498p20956l16731l12197k69317l90714k19227J46804
$$ 2967482 2622594 1910096 1189140 872409 560212 290895 -99819 -319046 -172242
17428a72242J68984R3929j10337m8754M6957J21112n1172k9080O4904k48555P1934
$$ -172242 -3258 90671 -19666 -68420 -21463 99649 48477 19397 84301 -164254 -92320
17417i2320J00260j25265k04671J56791K87397N5537j32632j22763J16392L2290
$$ -92320 7940 -117325 -321996 -165205 122192 177729 45097 -77666 38726 71016
17407G1016j21121L3897K5247J0040l4262k39751k031m8674K54603J71949K71675
$$ 71016 -50105 -16208 9039 19079 -15183 -254934 -256965 -305639 -51036 120913 392588
17396C92588J22477j150l46264j20931j9736L395l0112l357m879P8286l27119
$$ 392588 515065 513915 167651 46720 26984 30379 267 -3090 -7969 70317 -256802
17385b56802j2267J42344J31023J30845K806R9844j06794k1588J77496J49399
$$ -256802 -269069 -126725 4298 135143 137949 237793 130999 109411 286907 436306
17375D36306k29503n6576J04313M984k42172K56785q9291j35855K11184Q4730
$$ 436306 206803 150227 254540 259524 17352 274137 184846 48991 260175 344905
17365C44905k08849j45664O4756m5967j50189k8817R1644k11727j41106K79193
$$ 344905 136056 -9608 55148 9181 -141008 -169825 -78181 -289908 -431014 -151821
17355a51821K99263M3492j68099j04681k13559J1773R0205j28735M8038q0890
$$ -151821 147442 190934 22835 -81846 -295405 -283632 -193427 -322162 -274124 -355014
17345c55014r6700O9898J07735M5950j05819k47338K07403K4553r1041O9575n9400
$$ -355014 -451714 -381816 -274081 -228131 -333950 -581288 -373885 -349332 -440373 -370798 -430198
17334d30198J00101k3884K56860J12688k42828j90592p3174K41733j14038L16277
$$ -430198 -330097 -353981 -97121 15567 -227261 -417853 -491027 -249294 -363332 -47055
17324d7055K10059r1952l49927k56562L44537L71925o4931j14875J18884n9744
$$ -47055 163004 71052 -278875 -535437 -190900 181025 116094 1219 120103 60359
17314F0359n9032O2168K25532k4903j23828j88203r46J87957K66698j17308n8865
$$ 60359 1327 63495 289027 264124 140296 -47907 -48853 139104 405802 288494 229629
17303B29629j30735M5032M0397J71152Q5496j35505J40399l4638m10511k25418
$$ 229629 98894 143926 184323 355475 440971 305466 445865 411227 716 -224702
17293b24702o6143J05958j17479j09719L70564J00937J87834R1683R3178j75208
$$ -224702 -290845 -184887 -302366 -412085 -41521 59416 247250 338933 432111 256903
17283B56903o22276o9806L07863j85312n0691J37020k0951k30869J28604J88445
$$ 256903 -365373 -435179 -127316 -312628 -363319 -226299 -247250 -478119 -349515 -161070
17273a61070J00361j35376K25067m5083k5098Q166N4910L85482l9081k06724j34870
$$ -161070 -60709 -196085 28982 -16101 -41199 -33033 21877 407359 368278 161554 26684
17262B6684J66800j32486p6639J1974j92724q7952P0673J30953q3710m6897q113
$$ 26684 193484 60998 -15641 -3667 -196391 -284343 -213670 -82717 -166427 -213324 -221437
17251b21437L26547J99615j0243J17468N6670l28625m27836j35230J58476J29451
$$ -221437 105110 304725 294482 411950 468620 139995 -287841 -423071 -264595 -135144
17241a35144J54471K6012o5337l31081K1264J64283L41890J50953P0585o3738
$$ -135144 19327 45339 -19998 -351079 -329815 -165532 176358 327311 397896 334158
17231C34158j06649k3956j44401p8992k29404j52198M08298L75763j25057j3446
$$ 334158 227509 203553 59152 -19840 -249244 -401442 6856 382619 257562 244116
17221B44116k50271j39662k19568J28392K72544Q7472j36028k81262j53932Q5844
$$ 244116 -6155 -145817 -365385 -236993 35551 123023 -13005 -294267 -448199 -362355
17211c62355J02090J68012r2755j65876J54973j6194N8112L8245O3190l30292
$$ -362355 -260265 -92253 -185008 -350884 -195911 -212105 -153993 -115748 -52558 -382850
17201c82850J50934J12173J3640k2385J26975O2575j04741l29319J89466K83632
$$ -382850 -231916 -119743 -106103 -128488 -1513 61062 -43679 -372998 -183532 100100
17191A00100K73645R217k48617k34802j4599l3130l265J2922j18782j21097Q2265
$$ 100100 373745 382962 134345 -100457 -115056 -148186 -151451 -138529 -257311 -378408 -296143
17180b96143J70145J82560J22800k33063k72816J3822J04145Q3418k804l36260
$$ -296143 -125998 56562 179362 -53701 -326517 -312695 -208550 -125132 -127936 -464196
17170d64196Q9993r523Q270K1507J3715j14899K05601n353j6546Q9367J85022
$$ -464196 -374203 -383726 -375456 -353949 -340234 -455133 -249532 -254885 -271431 -182064 2958
17159B958n2596R8341P7490K2274k93919l72555K50769J3521m4109j21674k4239
$$ 2958 -49638 48703 126193 148467 -145452 -518007 -267238 -253717 -297826 -419500 -443739
17148d43739K04662R2864J07013j50140j91037j3228J32705N1564K72225J93552
$$ -443739 -239077 -146213 -39200 -189340 -380377 -393605 -260900 -209336 62889 256441
17138B56441j00694r7365l5027j02437j69388j03008n6399j92933K76884L00760
$$ 256441 155747 58382 23355 -79082 -248470 -351478 -407877 -600810 -323926 -23166
17128b3166n953k76587k4899o4195J19190J30378Q6164j30900k81581l2677N8225
$$ -23166 -29119 -305706 -330605 -394800 -275610 -145232 -59068 -189968 -471549 -504226 -446001
17117d46001K6398m5910j30105q728J26311L93570O7941n7792j12790k81116M7551
$$ -446001 -419603 -465513 -595618 -604346 -478035 -84465 -16524 -74316 -187106 -468222 -420671
17106d20671J60883K72570J30658K19870o2615P9275K27316l20820m17782L8129
$$ -420671 -259788 12782 143440 363310 300695 379970 607286 286466 -131316 -93187
17096i3187n8152j59620N1664j457L581l1833p322L06143p5837m9664N2355j12744
$$ -93187 -151339 -310959 -259295 -260752 -257171 -289004 -296326 9817 -66020 -115684 -63329 -176073
17084a76073J19512L3354P8746R5729j45709j17247k48672P2619J74855r6012
$$ -176073 -56561 -23207 55539 151268 5559 -111688 -360360 -287741 -112886 -208898
17074b08898K11114m3031J955J60260j54777k89416P6459j81088l4369k6390K53965
$$ -208898 2216 -40815 -38860 121400 -33377 -322793 -246334 -427422 -461791 -488181 -234216
17063b34216J75726J409m6386k78650j59070L0829Q1028Q4712L7950M2445j27929
$$ -234216 -58490 -57081 -103467 -382117 -541187 -510358 -429330 -344618 -306668 -264223 -392152
17052c92152k64474j42331L98390J84822j13638J81476j73640L1167J65355k7862
$$ -392152 -656626 -798957 -400567 -215745 -329383 -147907 -321547 -290380 -125025 -152887
17042a52887P5326J60631r8994o9885J0961K12430O7390k0645l48787J08951K54474
$$ -152887 -77561 83070 -15924 -85809 -74848 137582 204972 184327 -164460 -55509 198965
17031A98965R0351N3355r9250j10941k27442r1467K91392K21347j14490k49388
$$ 198965 289316 342671 243421 132480 -94962 -186429 104963 326310 211820 -37568
17021c7568J12231l5287r9079J058J91552p411k58534J98594K3688m13348p4976
$$ -37568 74663 39376 -59703 -58645 132907 125496 -133038 65556 89244 -324104 -399080
17010c99080K83055L46607m8469l39091k39747k4641k0666n8535J13136L1090
$$ -399080 -116025 230582 182113 -156978 -396725 -421366 -442032 -500567 -387431 -356341
17000c56341O0352j39193J49656K93217l425j59252N8437J05529J26800L914R1040
$$ -356341 -295989 -435182 -285526 7691 4266 -154986 -96549 8980 135780 139694 230734
16989B30734k83821l02537R9563j07875M9451J33972J90715k31679j68686K6578
$$ 230734 -53087 -355624 -256061 -363936 -314485 -180513 10202 -221477 -390163 -363585
16979c63585J10591J04066J15056j21907k38370p6823j77976J99363K81576p4955
$$ -363585 -252994 -148928 -33872 -155779 -394149 -470972 -648948 -449585 -168009 -242964
16969b42964J4623r7681k07749k03420R6149K21487L06869K08668J10889M4679
$$ -242964 -228341 -326022 -533771 -737191 -641042 -419555 -112686 95982 206871 251550
16959B51550k67814k73693J70533K46096j48925k17040k01814K83071N2507l6275
$$ 251550 -16264 -289957 -119424 126672 -22253 -239293 -441107 -158036 -105529 -141804
16949a41804K6850K3416r3899N0137K26568o7332j16720j89001k62844r6687J14029
$$ -141804 -114954 -91538 -185437 -135300 91268 23936 -92784 -281785 -544629 -641316 -527287
16938e27287O4831K03042j13001r1891R4522j7326j58167J08652J90266k6779
$$ -527287 -462456 -259414 -372415 -464306 -369784 -387110 -545277 -436625 -246359 -273138
16928b73138j48468r0098j08502K49217J05857k6902m16090J34201J2242j0366
$$ -273138 -421606 -511704 -620206 -370989 -265132 -292034 -708124 -573923 -561681 -572047
16918e72047j26692K49640K47573L0941j41644J28486J24462j53366J86484n1705
$$ -572047 -698739 -449099 -201526 -170585 -312229 -183743 -59281 -212647 -26163 -77868
16908g7868k07304K458L16483O5782r2725Q3048P0599l52116l4889J83830K05212
$$ -77868 -285172 -282714 33769 99551 6826 89874 160473 -191643 -226532 -42702 162510
16897A62510o2705k87115j96428p0987K56232L05965q1798J40017K3051j91389
$$ 162510 99805 -187310 -383738 -454725 -198493 107472 25674 165691 188742 -2647
16887b647k59780K12298L90134l6468k32222p1936J47734j08672q6122q1016m7776
$$ -2647 -262427 -50129 340005 303537 71315 -621 147113 38441 -47681 -128697 -176473
16876a76473l01766l1113M07197j90450j03678K28731K09235J40122j43185j54163
$$ -176473 -478239 -509352 -102155 -292605 -396283 -167552 41683 181805 38620 -115543
16866a15543m5551O2872j62205k8527R9300K54425M9643k37881k19717n5187k71817
$$ -115543 -161094 -98222 -260427 -288954 -189654 64771 114414 -123467 -343184 -398371 -670188
16855f70188J09740J43719Q1142P6078K15128J4081p7334l94145j26756K91890
$$ -670188 -560448 -416729 -335587 -259509 -44381 -30300 -107634 -501779 -628535 -336645
16845c36645K87407L60231n109j2427O9152R4914k243j75035l64401j68094K32081
$$ -336645 -49238 310993 305884 293457 362609 457523 455280 280245 -84156 -252250 -20169
16834b0169j90322l15874l7323K80739J80485K5514P3218m4857J72668J27323
$$ -20169 -210491 -526365 -563688 -282949 -102464 -76950 -3732 -48589 124079 251402
16824B51402j01688J0175j49510K53927n8419l39800M5604q8071j4634J60986
$$ 251402 149714 159889 10379 264306 205887 -133913 -88309 -176380 -191014 -30028
16814c0028K04033j15921j10134P6373J61520J23574k3653j29646P6428J67922
$$ -30028 174005 58084 -52050 24323 185843 309417 285764 156118 232546 400468
16804D00468k79930r7728r7479k58433J70225J25472Q1700J86348N4051k34070
$$ 400468 120538 22810 -74669 -333102 -162877 -37405 44295 230643 284694 50624
16794E0624j48131O1637K1025j2239k4233K19038j88584J9716n6819J14872J51794
$$ 50624 -97507 -35870 -14845 -27084 -51317 167721 -20863 -1147 -57966 56906 208700
16783B08700n0485N9692J66553q0369k40289r0937M9835Q9352k0185p0518o3443
$$ 208700 158215 217907 384460 304091 63802 -27135 22700 112052 91867 21349 -42094
16772d2094j65950k55035J83092K12367M2863l80398j85105R8432J2755K15565
$$ -42094 -208044 -463079 -279987 -67620 -24757 -405155 -590260 -491828 -479073 -263508
16762b63508J72412J5236j1093K02860J77295n5054j08888p8272n3437L0082o3964
$$ -263508 -91096 -75860 -86953 115907 293202 238148 129260 50988 -2449 27633 -36331
16751c6331k64540J30871K00929j21566j06402n460k45368m3724M8901j22530
$$ -36331 -300871 -170000 30929 -90637 -197039 -202499 -447867 -491591 -442690 -565220
16741e65220q5963P1896Q6654m2645L42934J70169l568j57178j04554n399l6861
$$ -565220 -651183 -579287 -492633 -535278 -192344 -22175 -25743 -182921 -287475 -292874 -329735
16730c29735m7226N3773K28781J57988o0948N082j48112J4438N0125J32997q0583
$$ -329735 -376961 -323188 -94407 63581 2633 7715 -140397 -125959 -75834 57163 -23420
16719b3420Q1199J87343j60877j5897R2399K71858j04688j88197k15570k84703
$$ -23420 57779 245122 84245 68348 160747 432605 327917 139720 -75850 -360553
16709c60553O7464j3228K00726N2050o5856o0667M742J17757J98842L3441k19590
$$ -360553 -293089 -306317 -105591 -53541 -119397 -180064 -175322 -57565 141277 174718 -44872
16698d4872j6260n4592J85777q7299j38951L4765j39168l1890O4259L59443J43385
$$ -44872 -61132 -115724 70053 -17246 -156197 -121432 -260600 -292490 -228231 131212 274597
16687B74597m0992r5622K9445m6018q5148k47254j56892K6083K38216L50535l3785
$$ 274597 233605 137983 167428 121410 36262 -210992 -367884 -341801 -103585 246950 213165
16676B13165n9942K86314l04545l25051n1113J12890K9316j7646K09827K6673
$$ 213165 153223 439537 134992 -190059 -241172 -128282 -98966 -116612 93215 119888
16666A19888k48385m3166Q5699J70010j59829k76268O1090J26717K67449J57897
$$ 119888 -128497 -171663 -85964 84046 -75783 -352051 -290961 -164244 103205 261102
16656B61102Q4383k19018j75365R0676J66811j60641l78620k60335J37301M94190
$$ 261102 345485 126467 -48898 41778 208589 47948 -330672 -591007 -453706 40484
16646D0484p0262Q1326K74061j03268k39459J0562P009j34850j02767j10446K5561
$$ 40484 -29778 51548 325609 222341 -17118 -6556 453 -134397 -237164 -347610 -322049
16635c22049M80850K32881M3261p6953m11703l16974P218j61461K55095L59108
$$ -322049 158801 391682 434943 357990 -53713 -370687 -363469 -524930 -269835 89273
16625H9273K17945N443n21121J85136L32249O308j9539J38042k67183J72315J1914
$$ 89273 307218 312661 -208460 -23324 308925 315233 295694 433736 166553 338868 350782
16614C50782j2490j6798k98357j50446K21398j64121k70501J08658J69454L60313
$$ 350782 338292 321494 23137 -127309 94089 -70032 -340533 -231875 -62421 297892
16604B97892j4534r6592Q3519K8658q4485M6833k29558r7249q2135k4984k14766
$$ 297892 283358 186766 270285 298943 214458 261291 31733 -65516 -147651 -172635 -387401
16593c87401Q0072n3922K3396K9035j972j13357J56331J94937O2423k83279r4753
$$ -387401 -307329 -361251 -337855 -308820 -310792 -424149 -267818 -72881 -10458 -293737 -388490
16582c88490P1368n5472L05669L35432k01888J4706k307r4511J40062J49794M8556
$$ -388490 -317122 -372594 -66925 268507 66619 81325 79018 -15493 124569 274363 322919
16571C22919Q6519j65323j12941J02795l3981j01658j86492J9187K97042J83452
$$ 322919 409438 244115 131174 233969 199988 98330 -88162 -68975 228067 411519
16561D11519j35601l6199l36863L9033l1096r102J75211q9348r9209K68242J02958
$$ 411519 275918 239719 -97144 -58111 -89207 -98309 76902 -12446 -111655 156587 259545
16550B59545J14655P5610k79807J41782j66718K9478p6731N4736K33024n2933
$$ 259545 374200 449810 170003 311785 145067 174545 97814 152550 385574 332641
16540C32641M6138M6362J06815k25447l4585J53905j54888r1833j36751n9019
$$ 332641 378779 425141 531956 306509 271924 425829 270941 179108 42357 -16662
16530a6662j3680k14616k29741k44721J53390L21496K63915K3785M5610j39155
$$ -16662 -30342 -244958 -474699 -719420 -566030 -244534 19381 43166 88776 -50379
16520e0379k54595L1287R7949p1509M2725m6945O138J01951p0765M18664O3855
$$ -50379 -304974 -273687 -175738 -247247 -204522 -251467 -245329 -143378 -214143 204521 268376
16509B68376k32095m0358J1273J67188J98448l09385k8872k78062N2031L82668
$$ 268376 36281 -4077 7196 174384 372832 63447 34575 -243487 -191456 191212
16499A91212j05212n6467J57222O2182j31210l9518M7755r5298K73404j6811j56699
$$ 191212 86000 29533 186755 248937 117727 78209 125964 30666 304070 287259 130560
16488A30560j62179j51095m0633M6069n549L04030K17002q7946j41141J40520
$$ 130560 -31619 -182714 -223347 -177278 -182827 121203 338205 250259 109118 249638
16478B49638J80693q1621j24078Q0736j32801l25081k1864r2997M08060J54811
$$ 249638 430331 348710 224632 305368 172567 -152514 -174378 -267375 140685 295496
16468B95496k25214O1111Q6168j03963j98587J89710L31673o0330o2600k80199
$$ 295496 70282 131393 217561 113598 -84989 104721 436394 376064 313464 33265
16458C3265j75065p0820p565q1507j54050K03172K15210L14400Q9210N8606Q9683
$$ 33265 -141800 -212620 -220185 -301692 -455742 -252570 -37360 277040 366250 424856 514539
16447E14539j60007k77206j08872j19827J91893j5588J67545J0877k3515J18364
$$ 514539 354532 77326 -31546 -151373 40520 24932 192477 203354 179839 298203
16437B98203r6811j78297q6270K31073M4873J88325K06800j64135m00194k06268
$$ 298203 201392 23095 -63175 167898 212771 401096 607896 443761 43567 -162701
16427a62701K68672K47408j91822o3423p7083J68815J85578K6726k72054J602
$$ -162701 105971 353379 161557 98134 21051 189866 375444 402170 130116 131718
16417A31718K5112o960k4103j80768j56989J04311J54154k9980l85441j80616
$$ 131718 156830 149870 125767 -55001 -211990 -107679 46475 16495 -368946 -549562
16407e49562j39128r6008L50004n3209k3381J45691J20104K60121J29739j31967
$$ -549562 -688690 -784698 -434694 -487903 -511284 -365593 -245489 14632 144371 12404
16397A2404j61681j99414J1562k01314K49767M10628l12183k794N6987J36038
$$ 12404 -149277 -348691 -337129 -538443 -288676 121952 -190231 -193025 -136038 0
16387@r625K6952N8105J4238r9010K29203k39437j52441J34730J16123j17013
$$ 0 -9625 17327 75432 89670 -9340 219863 -19574 -172015 -37285 78838 -38175
16376c8175j83777r9504P3542K52252J99648j43227j49890p633j3219j77010J29877
$$ -38175 -221952 -321456 -247914 4338 203986 60759 -89131 -96764 -109983 -286993 -157116
16365a57116K42856J5024j92148j84291k9941L65725P6294n0892j94528j32635
$$ -157116 85740 100764 -91384 -275675 -305616 60109 136403 85511 -109017 -241652
16355b41652M79618Q0885k1721M6591k00264j45984K85229j48808L3095R849l33503
$$ -241652 237966 318851 297130 343721 143457 -2527 282702 133894 166989 176838 -156665
16344a56665P3371J06918k77105L7937Q3137P7851M2677q1237k5400J16061j2412
$$ -156665 -83294 23624 -253481 -215544 -132407 -54556 -11879 -93116 -118516 -2455 -14867
16333a4867P0724J33959k33007j49713O6784O6663M2113J0220p8821L0434o2962
$$ -14867 55857 189816 -43191 -192904 -126120 -59457 -17344 -7124 -85945 -55511 -118473
16322a18473j87670J51282n3752k69526l16969J68654o161J68712M61950K59820
$$ -118473 -306143 -154861 -208613 -478139 -795108 -626454 -632615 -463903 -1953 257867
16312B57867j55040M5117k56208o588q1161J15680k9754K7588J58214k48486k47212
$$ 257867 102827 147944 -108264 -114852 -196013 -80333 -110087 -82499 75715 -172771 -419983
16301d19983K446K34187L77452j47942j13664j63294J6321r159p3904M816L65067
$$ -419983 -417537 -183350 194102 46160 -67504 -230798 -214477 -223636 -297540 -292724 72343
16290G2343K99880L4778l49305K4074n7961N2562L52841o2137k41022J38827k94846
$$ 72343 372223 407001 57696 81770 23809 76371 429212 367075 126053 264880 -29966
16279b9966j09252K19386k07961J41276n3061J90868N0270n0933J49054k14215
$$ -29966 -139218 80168 -127793 13483 -39578 151290 201560 150627 299681 85466
16269H5466j57973J74301K39316k09330O2857L8278k02719k69553J99954J14530
$$ 85466 -72507 101794 341110 131780 194637 232915 30196 -239357 -39403 75127
16259G5127O2215k70979j32323R8658J58566N1327k27185K3898M3414m2681J7238
$$ 75127 137342 -133637 -265960 -167302 -8736 42591 -184594 -160696 -117282 -159963 -142725
16248a42725j9391N6290K49796j60402j21897J9259J2390r0672L7083P7067j6591
$$ -142725 -162116 -105826 143970 -16432 -138329 -119070 -106680 -197352 -160269 -83202 -99793
16237i9793j99552K8385J98298K37083p4217K34567k14684o13022q1661K2271
$$ -99793 -299345 -270960 -72662 164421 90204 324771 110087 -502935 -584596 -562325
16227e62325o1238R955L37436K19181o3073K3622J34109j06080q1359K34988R5168
$$ -562325 -623563 -613608 -276172 -56991 -120064 -96442 37667 -68413 -149772 85216 180384
16216A80384n3392R7599K44853k76184k61569j37335p9134k7911O1751K85381
$$ 180384 126992 224591 469444 193260 -68309 -205644 -284778 -312689 -250938 34443
16206C4443L0839j3798J34665J78247L2457j19890l71229j21178R8080j14020
$$ 34443 65282 51484 186149 364396 396853 276963 -94266 -215444 -117364 -231384
16196b31384j8030R6400J2961q2335J81278k6010o6823J54940j8492P1111K51330
$$ -231384 -249414 -153014 -140053 -222388 -41110 -67120 -133943 20997 2505 73616 324946
16185C24946P2403j59057l30700n7072l9570K36758P6823N2876K82081L2230N0453
$$ 324946 397349 238292 -92408 -149480 -189050 47708 124531 177407 459488 491718 542171
16174E42171n9679j21009j90149l3912L31407P9595k04087l86092j7399N8138
$$ 542171 482492 361483 171334 137422 468829 548424 344337 -41755 -59154 -1016
16164a016M8777L2354K87135k8291k9951J98908J30139Q6653k09144j34337l30837
$$ -1016 47761 80115 367250 338959 309008 507916 638055 724708 515564 381227 50390
16153E0390m15670K15998J23703r7788K606K67628r071q2030J52886J20642o1250
$$ 50390 -365280 -149282 -25579 -123367 -120761 146867 137796 55766 208652 329294 268044
16142B68044q8257J24781r7189L6725j85525O2440J26293k6252k2188o5654N8851
$$ 268044 179787 304568 207379 244104 58579 121019 247312 221060 198872 133218 192069
16131A92069q4889j9974j6291J365J11571R0864p3923k0697J9654k89039p5312
$$ 192069 107180 87206 70915 72280 183851 274715 200792 180095 199749 -89290 -164602
16120a64602j99901k35491K19136K18675R4018j88741k5914r5254N5268J33707
$$ -164602 -364503 -599994 -380858 -162183 -68165 -256906 -282820 -378074 -322806 -189099
16110a89099J91973k4050J58357P5128l68859j46399K39167J36430q6509R3015
$$ -189099 2874 -21176 137181 212309 -156550 -302949 -63782 72648 -13861 79154
16100G9154J72718j29577m8488J2217j49448j14804J43402J7061k53848j9023
$$ 79154 251872 122295 73807 86024 -63424 -178228 -34826 -17765 -271613 -290636
16090b90636K50255J91978J28569k65267l13188Q8080J43730m4203j02600k74664
$$ -290636 -40381 151597 280166 14899 -298289 -210209 -66479 -110682 -213282 -487946
16080d87946m2709J97060N7983j71705m27570K25391J93384L44314J20198k39034
$$ -487946 -530655 -333595 -275612 -447317 -874887 -649496 -456112 -111798 8400 -230634
16070b30634j406J28829J755L31576J87421j16927k2161j28990k75345J57054
$$ -230634 -232040 -103211 -101456 230120 417541 300614 278453 149463 -125882 31172
16060C1172K55107j23038j48381l35646Q9570K80020L3052j05350J13463R1532
$$ 31172 286279 163241 14860 -320786 -231216 48804 81856 -23494 89969 181501
16050A81501l8847k31503K3797J33078o409j23804k83953K7039M65563L90663
$$ 181501 142654 -88849 -65052 68026 61617 -62187 -346140 -319101 146462 537125
16040E37125R6516K7156j77620k26971l56364K9976J31084M9169n3619k61680
$$ 537125 633641 660797 483177 256206 -100158 -70182 60902 110071 56452 -205228
16030b05228n6356N8761K42722k53743j66274j8117J62295K70246K9551q3271
$$ -205228 -261584 -202823 39899 -213844 -380118 -398235 -235940 34306 63857 -19414
16020a9414r6411k7397K47795J82573k75476l3271k13294p945K6995K89518J04848
$$ -19414 -115825 -143222 104573 287146 11670 -21601 -234895 -242840 -215845 73673 178521
16009A78521K09640J6629m40056J19564K91086L464o97461l09807J12324M74612
$$ 178521 388161 404790 -35266 84298 375384 378848 -318613 -628420 -516096 -41484
15999d1484L47983J83273j73346n0849j0052r5368o7705J37245J79426o8532k904
$$ -41484 306499 489772 316426 265577 255525 160157 92452 229697 409123 340591 337687
15988C37687O4759J40880k00374j25941J55541Q6199n1680J21982m7590k34921
$$ 337687 402446 543326 342952 217011 372552 458751 407071 529053 481463 246542
15978B46542Q5003K8430l41468j54612K23564J34848K79260j39937M2383k44790
$$ 246542 331545 359975 18507 -136105 87459 222307 501567 361630 404013 159223
15968A59223q1209Q4358M40792J76960n71895m29695K36765k01588R6399j5318
$$ 159223 78014 162372 603164 780124 208229 -221466 15299 -186289 -89890 -105208
15958a05208K4432J07617K27448k19641k89224K16870J44692q6580L0824K4630
$$ -105208 -80776 26841 254289 34648 -254576 -37706 106986 20406 51230 75860
15948G5860m5906j83544R2488L49406k42189p1859K34190m0037m84396r2458J66407
$$ 75860 29954 -153590 -61102 288304 46115 -25744 208446 168409 -315987 -408445 -242038
15937b42038p618k5356M0819k2226k45843k3684J09031J72253J41975o406Q2230
$$ -242038 -249656 -275012 -234193 -256419 -502262 -525946 -416915 -244662 -102687 -109093 -26863
15926b6863j54081N5732j67181M9958J61430J2419k56646k48307J12203K92998
$$ -26863 -180944 -125212 -292393 -242435 -81005 -68586 -325232 -573539 -461336 -168338
15916a68338J8003k95128N4607M07690J45521j12026j20770j81094R6582j4642
$$ -168338 -150335 -445463 -390856 16834 162355 50329 -70441 -251535 -154953 -169595
15906a69595M2987K65675O7530P0325J05141j86491k93565j77030J59001K6648
$$ -169595 -126608 139067 206597 276922 382063 195572 -97993 -275023 -116022 -89374
15896h9374k17565k9591K2158j07565J6033J15590n3320K3078j87687l5019L06858
$$ -89374 -306939 -336530 -314372 -421937 -405904 -290314 -343634 -320556 -508243 -543262 -236404
15885b36404J86037J14127J27636j84224l1766J00487p024j89096n3639j12212
$$ -236404 -50367 63760 191396 7172 -24594 75893 68869 -120227 -173866 -286078
15875b86078O9837L2833j52280j36163J31702N61874M01155j18554j66193k18674
$$ -286078 -216241 -183408 -335688 -471851 -340149 221725 622880 504326 338133 119459
15865A19459j21310j48862k19164R2527L74643J12302k19770k48627Q75L1028
$$ 119459 -1851 -150713 -369877 -277350 97293 209595 -10175 -258802 -257927 -226899
15855b26899K15609j8121J094m02796l49205N37746N03110j42437j85351r4086
$$ -226899 -11290 -29411 -28317 -431113 -780318 -242572 260538 118101 -67250 -161336
15845a61336q6174j01306m8673K29603K88157K2500p9294q5867K93980J94690
$$ -161336 -247510 -348816 -397489 -167886 120271 142771 63477 -22390 271590 466280
15835D66280k41806r8125J86445P7422r4296n5602j41345k75823m0415K7017L6792
$$ 466280 224474 126349 312794 390216 295920 240318 98973 -176850 -217265 -190248 -153456
15824a53456J70051M09065j9673j07193j24487K9176l65136J3493M5830K4955
$$ -153456 16595 425660 405987 298794 174307 203483 -161653 -148160 -102330 -77375
15814g7375J62864N7947l22367r3867K05657R7417R5341L9740n5653p9801j565
$$ -77375 85489 143436 -178931 -272798 -67141 30276 125617 165357 109704 29903 28338
15803B8338l1224q1279k80665K63533J56456j11991j90069L3539j53148k10354
$$ 28338 -2886 -84165 -364830 -101297 55159 -56832 -246901 -213362 -366510 -576864
15793e76864k39738l088J98784k8414J29006K60562J87679k34178p5482K22526
$$ -576864 -816602 -819690 -620906 -649320 -520314 -259752 -72073 -306251 -381733 -159207
15783a59207j16257j53158J69643M7824n8357j24255j92724n9051J38031L21700
$$ -159207 -275464 -428622 -258979 -211155 -269512 -393767 -586491 -645542 -507511 -185811
15773a85811q3829q4713l7566j57571P3897K83890K6619k9029j05755L0670N4907
$$ -185811 -269640 -354353 -391919 -549490 -475593 -191703 -165084 -194113 -299868 -269198 -214291
15762b14291N9775j51108j07128j37112J96011J43179M8009J53604k04185m9143
$$ -214291 -154516 -305624 -412752 -549864 -353853 -210674 -162665 -9061 -213246 -262389
15752b62389k4562r6036N9935J52812O5902o3554k1082k40781K17187K58999j67504
$$ -262389 -286951 -382987 -323052 -170240 -104338 -167892 -188974 -429755 -212568 46431 -121073
15741a21073j84261k3137n4442L20485j22856k15706K13303M37510Q2132q7424
$$ -121073 -305334 -328471 -382913 -62428 -185284 -400990 -187687 249823 331955 244531
15731B44531k20802o8553L8879r5280n5203M3715P5717O2593K2475J27490m2682
$$ 244531 23729 -44824 -5945 -101225 -156428 -112713 -36996 25597 48072 175562 132880
15720A32880P4805L1143p2331m0629k66872j22470j18597k3543J02257K35523
$$ 132880 207685 238828 166497 125868 -141004 -263474 -382071 -405614 -303357 -67834
15710f7834K93074Q3977j55371Q0401M658Q5531j052k79868j07681O8583q535
$$ -67834 225240 309217 153846 234247 238905 324436 323384 43516 -64165 4418 -4117
15699d117L7568J32929J75531j22014j57883k59981J19395p1622j02620K02675
$$ -4117 33451 166380 341911 219897 62014 -197967 -78572 -150194 -252814 -50139
15689e0139j10229l13520j71676L2366K57588M05100N9963l86651j82470q340
$$ -50139 -160368 -473888 -645564 -613198 -355610 49490 109453 -277198 -459668 -468008
15679d68008J90009J57761M8951k71369J3605L5141k21318O4420J87382J01204
$$ -468008 -277999 -120238 -71287 -342656 -329051 -293910 -515228 -450808 -263426 -162222
15669a62222J64014j61856J13400J5688K22197q338j22363j34390J93906M0078
$$ -162222 1792 -160064 -46664 -30976 191221 182883 60520 -73870 120036 160114
15659A60114M2883J31188K93007o4155j19604J03713j83805j23859l66988j94284
$$ 160114 202997 334185 627192 563037 443433 547146 363341 239482 -127506 -321790
15649c21790J74066J73085j09688j84122j52165J34736J99444j16504j52476L8618
$$ -321790 -147724 25361 -84327 -268449 -420614 -285878 -86434 -202938 -355414 -316796
15639c16796J86870K62841P9566L6201k0976q9374k40827Q9974M11023r0028l22953
$$ -316796 -129926 132915 212481 248682 227706 138332 -102495 -12521 398502 308474 -14479
15628a4479k24867J1280p1874m1109L61021K60459j1090k92839R5623N1333j42166
$$ -14479 -239346 -228066 -299940 -341049 19972 280431 269341 -23498 72125 123458 -18708
15617a8708o1221O9182o1827k73354m8392P0695j09305k61214K38295L13641l3464
$$ -18708 -79929 -10747 -72574 -345928 -394320 -323625 -432930 -694144 -455849 -142208 -175672
15606a75672j14674n9936J98013P4338J15416O4944j77368J98115j76790l3511
$$ -175672 -290346 -350282 -152269 -77931 37485 102429 -74939 123176 -53614 -87125
15596h7125K51216K40204r1518O2769K7470m11469k54920P8201N5306k4048J45760
$$ -87125 164091 404295 312777 375546 403016 -8453 -263373 -185172 -129866 -153914 -8154
15585h154Q9441l695j05339J2225k5440k95220k4597j7832J35674J04529L0841
$$ -8154 81287 77592 -27747 -15522 -40962 -336182 -360779 -378611 -242937 -138408 -107567
15574a07567J02253j34581M9730K86625J73353p9780k61812K01668N9702m8496
$$ -107567 -5314 -139895 -90165 196460 369813 290033 28221 229889 289591 241095
15564B41095k84658j17601j42627k315p1493J23043J15527P8552m6165j38104
$$ 241095 -43563 -161164 -303791 -306106 -377599 -254556 -139029 -60477 -106642 -244746
15554b44746j5373J46570J02176O9326j9806l74582m7688K380J01239P1730J79883
$$ -244746 -260119 -113549 -11373 57953 38147 -336435 -384123 -381743 -280504 -208774 -28891
15543b8891J69440o5312l8692p0529k19623l9410K61318j07095m0735K22332k7988
$$ -28891 140549 75237 36545 -33984 -253607 -293017 -31699 -138794 -179529 42803 14815
15532A4815m4087j1826J0202k08121n239J06566P6231J58252J01778K16909q6492
$$ 14815 -29272 -41098 -30896 -239017 -244256 -137690 -61459 96793 198571 415480 328988
15521C28988j96841k67615J91577K97181L0571n2557k67288m1117M6489K0365
$$ 328988 132147 -135468 56109 353290 383861 331304 64016 22899 69388 89753
15511H9753l9318j21680q7437J4073m6259J37682M4810q4538k7398K8567j51880
$$ 89753 50435 -71245 -158682 -144609 -190868 -53186 -8376 -92914 -120312 -91745 -243625
15500b43625M754P7590J32377k40957j25241J37713J44255Q7448m5202J20995
$$ -243625 -238871 -161281 -28904 -269861 -395102 -257389 -113134 -25686 -70888 50107
15490E0107J53754k52400K7082j13927J5531K19791J35704J19680p0907l00557
$$ 50107 203861 -48539 -21457 -135384 -119853 99938 235642 355322 284415 -16142
15480a6142j57276O5247M24699K39095k7535J4184j12722j34626j34872K18798
$$ -16142 -173418 -108171 316528 555623 528088 542272 429550 294924 160052 378850
15470C78850j94258j81158J00626P230l7635m906O6488N2458j35375j24695n3828
$$ 378850 184592 3434 104060 111290 73655 68749 135237 187695 52320 -72375 -126203
15459a26203M1684Q2556K71667J84322J25828j0596O493n4584o3908l3597J26474
$$ -126203 -84519 -1963 269704 454026 579854 569258 575751 521167 457259 423662 550136
15448E50136j20673J73548K09078O5883o7029k03609l25205O9438J82046o9292
$$ 550136 429463 603011 812089 877972 810943 607334 282129 351567 533613 464321
15438D64321j74139o8349p4540N8572K31874K48320l15498l76187Q8894j22831
$$ 464321 290182 221833 147293 205865 437739 686059 370561 -5626 83268 -39563
15428c9563j145J3294J65481j15141m7702J8178J37992O8024K47118J12342m39542
$$ -39563 -40708 -27414 138067 22926 -24776 -6598 131394 199418 446536 558878 119336
15417A19336M0391K27000O1203J4735j90357j22479K59902M38k90666q1483k5944
$$ 119336 159727 386727 447930 462665 272308 149829 409731 410169 119503 38020 12076
15406A2076N0771m0659l11103k47888J21412K40910K76586j50419j12072K92317
$$ 12076 62847 22188 -288915 -536803 -415391 -174481 102105 -48314 -160386 131931
15396A31931K82110J03862m3485l14523j81549N5407Q0777M7954J43298K69508
$$ 131931 414041 517903 474418 159895 -21654 33753 114530 162484 305782 575290
15386E75290J66780k17676k15898n1258j51216J4224J59521k3031o2268J7354
$$ 575290 742070 524394 308496 257238 106022 120246 279767 256736 194468 211822
15376B11822J66304k09929l13763K34980L2443l45980m2564J54591J36241O9017
$$ 211822 378126 168197 -145566 89414 121857 -224123 -266687 -112096 24145 93162
15366I3162j73664k28611J75631R0802l1546j64828R7212K31121n2516m2271k09203
$$ 93162 -80502 -309113 -133482 -42680 -74226 -239054 -141842 89279 36763 -5508 -214711
15355b14711K58499K04517J5506J63986N6768k42886k00879J57076k08219l29856
$$ -214711 43788 248305 263811 427797 484565 241679 40800 197876 -10343 -340199
15345c40199J46129K39264K48221q6180k12765N8806J1336n6160J40932j99705
$$ -340199 -194070 45194 293415 207235 -5530 53276 64612 8452 149384 -50321
15335e0321m00815N2656K9612m9367l7376J26526J6601Q5308j544N6263n7655
$$ -50321 -451136 -398480 -368868 -418235 -455611 -329085 -312484 -227176 -228720 -172457 -230112
15324b30112J9665K93047O6328m8488j20244j26174k7246K28905K3755k9264j88542
$$ -230112 -210447 82600 148928 100440 -19804 -145978 -173224 55681 79436 50172 -138370
15313a38370K3918J95738K0543j7160n05255J13052L68774K46158j53805J9884
$$ -138370 -114452 81286 101829 84669 -420586 -307534 61240 307398 153593 173477
15303A73477J55692o5364N4365M9012k81949o1494J08929K25719q1132k03097
$$ 173477 329169 263805 318170 367182 85233 23739 132668 358387 277255 74158
15293G4158k95330j3023J32099J91116Q6768r1451j86361J2056k7901q9851K54442
$$ 74158 -221172 -234195 -102096 89020 175788 84337 -102024 -89968 -117869 -207720 46722
15282D6722L25483J83749K31698J89668m67207m96694k28350J93870K9665J86483
$$ 46722 372205 555954 787652 977320 510113 13419 -214931 -21061 8604 195087
15272A95087j08919j62580O654n6428J37965j92352r631K80596J42943l3023j23102
$$ 195087 86168 -76412 -69758 -126186 11779 -180573 -190204 90392 233335 200312 77210
15261G7210k74068l1163K69619l05896j83590J52008k060l74053L06889P0115
$$ 77210 -196858 -228021 41598 -264298 -447888 -295880 -297940 -671993 -365104 -294989
15251b94989j67692j29002K45523K38341k7629K29498l0801j56808J42580J9927
$$ -294989 -462681 -591683 -346160 -107819 -135448 94050 63249 -93559 49021 68948
15241F8948j72736J80942R6888K18431j87584k0186J61688k3291r5574l3013J383
$$ 68948 -103788 77154 174042 392473 204889 184703 346391 323100 227526 194513 195896
15230A95896j7085l35785L2731J64523R7533l1955j24309l17971j92658K10077
$$ 195896 178811 -156974 -124243 40280 137813 105858 -18451 -336422 -529080 -319003
15220c19003q8663k1383Q8410Q8730J17816r0770O3514l172m169j83445K14356
$$ -319003 -407666 -429049 -340639 -251909 -134093 -224863 -161349 -164521 -168690 -352135 -137779
15209a37779J01111L7339k6543L9698j01049k39274K03020M1818J39285p7399
$$ -137779 -36668 671 -25872 13826 -87223 -326497 -123477 -81659 57626 -19773
15199a9773k18635P9442J62551M44559N0680J10615j56219k64169k55872j01178
$$ -19773 -238408 -158966 3585 448144 498824 609439 453220 189051 -66821 -167999
15189a67999k2378L01259L19216j26923n6870k29221m03269L3645K72647O9655
$$ -167999 -190377 110882 430098 303175 246305 17084 -386185 -352540 -79893 -10238
15179a0238J952J29546j55322k2191l0807J68977J2939k05842J98397J66431j29543
$$ -10238 -8286 121260 -34062 -56253 -87060 81917 94856 -110986 87411 253842 124299
15168A24299l85836O6926P9105Q8466k5027j68290j5231Q8676J17229j1445j42144
$$ 124299 -261537 -194611 -115506 -27040 -52067 -220357 -235588 -146912 -29683 -41128 -183272
15157a83272n1692Q1226k05485m1729L62633Q565Q926R6855l40415k08854j57070
$$ -183272 -234964 -153738 -359223 -400952 -38319 -29754 -20828 76027 -264388 -473242 -630312
15146f30312J43777L21287L5145L11322J63792L0815J642r8037l4503J94294k6039
$$ -630312 -486535 -165248 -130103 181219 345011 375826 377468 279431 244928 439222 413183
15135D13183m07022o4718M53509K06622j01J44866j64669m86648j80790N2715
$$ 413183 6161 -58557 394952 601574 601473 746339 581670 95022 -85768 -33053
15125c3053P450J95198J44918J39753J64253j24710o06389M4518Q1962m9784J26879
$$ -33053 -25603 169595 314513 454266 618519 493809 -112580 -68062 13900 -35884 90995
15114I0995m966j92154j80636P9219M15902j75713j38522K11410N3898p9143L4614
$$ 90995 86029 -106125 -286761 -207542 208360 32647 -105875 105535 159433 80290 114904
15103A14904L0489m5821L9382j18362k44492l81657l10155Q6356K51869M75035
$$ 114904 145393 99572 138954 20592 -223900 -605557 -915712 -829356 -577487 -102452
15093a02452J17666J5265j07412j88243o8807L84981Q3455P9460J63609j35324
$$ -102452 15214 30479 -76933 -265176 -333983 50998 134453 213913 377522 242198
15083B42198l2971k22102p8654L81287J78821O6078k24210J93886o1461l42944
$$ 242198 209227 -12875 -91529 289758 468579 534657 310447 504333 442872 99928
15073I9928j40225k41131L09387J82189j37994J89670M9702k4031J95881k69796
$$ 99928 -40297 -281428 27959 210148 72154 261824 311526 287495 483376 213580
15063B13580k6805J6604r5953j47753p5176j41688o2415p4984K54415J18996J54895
$$ 213580 186775 203379 107426 -40327 -115503 -257191 -319606 -394590 -140175 -21179 133716
15052A33716Q0241l7782M4424J05446k07152r373L13289M3617k11080P526j56685
$$ 133716 213957 176175 220599 326045 118893 109520 422809 466426 255346 262872 106187
15041A06187M3267k05645J07465L05560j83817k86616L16918J4751j56352k56250
$$ 106187 149454 -56191 51274 356834 173017 -113599 203319 218070 61718 -194532
15031a94532K25635j49336k97128l65456J69954j61550L77495M50083K00722k8403
$$ -194532 31103 -118233 -415361 -780817 -610863 -772413 -394918 55165 255887 227484
15021B27484n05761m9990J32025R8357J37430K47833L1112l14730j79892J79598
$$ 227484 -278277 -328267 -196242 -97885 39545 287378 318490 3760 -176132 3466
15011C466p1706r1889l6588j89877m58767j61484J16482J01081J06265Q7451M47863
$$ 3466 -68240 -160129 -196717 -386594 -845361 -1006845 -890363 -789282 -683017 -595566 -147703
15000a47703o1986k04534j9919q4039M6191P0873L17094J09237j72724O2329J44236
$$ -147703 -209689 -414223 -434142 -518181 -471990 -401117 -84023 25214 -147510 -85181 59055
14989E9055m3841j46056k9544Q368J02264q765k81342j75481O3181l4011M2138
$$ 59055 15214 -130842 -160386 -152018 -49754 -58519 -339861 -515342 -452161 -486172 -444034
14978d44034K48984K09659j55822k2483K57611Q6308L01280j8362k9293m34480
$$ -444034 -195050 14609 -141213 -163696 93915 180223 481503 463141 433848 -632
14968f32k56214K30443L9440m7577p2539p2710L10270Q8363P585j59893k27264
$$ -632 -256846 -26403 13037 -34540 -107079 -179789 130481 218844 226429 66536 -160728
14957a60728j84379L26105R0268K83470J47271j25467o2748l56218J51091J34763
$$ -160728 -345107 -19002 71266 354736 502007 376540 313792 -42426 108665 243428
14947B43428J35504M7367k40047j11182k1896n4430O497K85117r2833P7781R5205
$$ 243428 378932 426299 186252 75070 53174 -1256 5241 290358 197525 275306 370511
14936C70511o7245j65282l9220N7448R8610J84968j52539l4432J99409J09275
$$ 370511 303266 137984 98764 156212 254822 439790 287251 252819 452228 561503
14926E61503O7875m18784l61177K8561k96324l98289O0591N14504M99799j91091
$$ 561503 629378 210594 -150583 -122022 -418346 -816635 -756044 -241540 258259 67168
14916F7168k49022K03138K26154Q1354r1815Q5055p9184j00953j37239Q550k474
$$ 67168 -181854 21284 247438 328792 236977 322032 242848 141895 4656 13206 10732
14905A0732J56223Q2962M8585q8438l76500J05865K15627l5727j53358P95K66514
$$ 10732 166955 249917 298502 210064 -166436 -60571 155056 119329 -34029 -33234 233280
14894B33280K21376J09954k84198q2965K47318j80757K7298R5406J1332O3414
$$ 233280 454656 564610 280412 197447 444765 264008 291306 386712 398044 461458
14884D61458j79516l9840l0529J44756q1149q7283J82148J35111J1508j75443
$$ 461458 281942 242102 211573 356329 275180 187897 370045 505156 516664 341221
14874C41221q54J2289k19311j03345l9853j11067j02614K53744K09962p8015n5239
$$ 341221 340367 352656 133345 30000 -9853 -120920 -223534 30210 240172 162157 106918
14863A06918k7467K10032N4730J41780k60993q2710p7447p9639J72696K99487
$$ 106918 79451 289483 344213 485993 225000 142290 64843 -14796 157900 457387
14853D57387j583r8167m3553k7407n3524l86083q9589J20321J35664j41009k73787
$$ 457387 455804 357637 314084 286677 233153 -152930 -242519 -122198 13466 -127543 -401330
14842d01330k48306k0716j02226N39591M81791J03483k71051j43118J64063q6316
$$ -401330 -649636 -670352 -772578 -232987 248804 352287 81236 -61882 102181 15865
14832A5865k30503M0694J11063O4260L48177K12949J93250j47287l298K86849
$$ 15865 -214638 -173944 -62881 1379 349556 562505 755755 608468 605170 892019
14822H92019o5652l22025l03778k34316O6394j52484O129m7221j04357j45878
$$ 892019 826367 504342 200564 -33752 32642 -119842 -113713 -160934 -265291 -411169
14812d11169r037M1052K46012J73749O8486K7355l4080j9011J91649j5444o0704
$$ -411169 -420206 -379154 -133142 40607 109093 136448 102368 83357 275006 259562 198858
14801A98858q944j08846n3714n347j34373K4741J29787j52743K70878J41448j58311
$$ 198858 189914 81068 27354 22007 -112366 -87625 42162 -110581 160297 301745 143434
14790A43434k15544n5701k92082M1980K23919j48851k02772n6433K13790M70136
$$ 143434 -72110 -127811 -419893 -377913 -153994 -302845 -505617 -562050 -348260 121876
14780A21876M66645k91656m04990O1040j71188j73053M1141l9161j14477K62199
$$ 121876 588521 296865 -108125 -47085 -218273 -391326 -350185 -389346 -503823 -241624
14770b41624M03820k9436l96766n0000J62500J49051k82175j11726J58209J67987
$$ -241624 162196 132760 -264006 -314006 -151506 -2455 -284630 -396356 -238147 -70160
14760g0160J60470J2084j07187O3482K79908l74295k94984K05022L45335J14199
$$ -70160 90310 102394 -4793 58689 338597 -35698 -330682 -125660 219675 333874
14750C33874J16194L7111l3073k80601k11979J34653J00799j09165l0268R6831
$$ 333874 450068 487179 454106 173505 -38474 96179 196978 87813 57545 154376
14740A54376O1069j71183p6731J89708j2205k35033l437M2690K39171J51928j75121
$$ 154376 215445 44262 -32469 157239 145034 -89999 -93436 -50746 188425 340353 165232
14729A65232J8243j05217k95555Q0281L29603j9635q7726J38193L1475n7913j12244
$$ 165232 183475 78258 -217297 -137016 192587 172952 85226 223419 254894 196981 84737
14718H4737j91733n290L45990K17600l8884k52505o3613K7922R1637L65146J75260
$$ 84737 -106996 -112286 233704 451304 412420 159915 96302 124224 215861 581007 756267
14707G56267K1333k44377m857K4551j12857k11517o9517N5158O5359R4346j77792
$$ 756267 777600 533223 528366 552917 440060 228543 159026 214184 279543 373889 196097
14696A96097l23692J3997M08j77639p8094K6532l2133R5227L58546L08673p4305
$$ 196097 -127595 -113598 -113190 -290829 -368923 -342391 -374524 -279297 79249 387922 313617
14685C13617Q6460J05179l82857L5493J57349j17521n9799p1036r8485N1195M080
$$ 313617 400077 505256 122399 157892 315241 197720 137921 66885 -31600 19595 23675
14674B3675j7484L2006J27823o355l30408l75085K16914M28701K2373N7984k90704
$$ 23675 6191 38197 166020 159665 -170743 -545828 -328914 99787 122160 180144 -110560
14663a10560k25234q3949J24188L0939l88208J30085K31357k8084m6803K57394
$$ -110560 -335794 -419743 -295555 -264616 -652824 -522739 -291382 -319466 -366269 -108875
14653a08875K34900J19714m9446r6842l565J02776j37298M3240L4006j60905o6638
$$ -108875 126025 245739 196293 99451 95886 198662 61364 104604 138610 -22295 -88933
14642h8933j89140J74331K74459J22808o4230j33707m4857j48300k79843J46396
$$ -88933 -278073 -103742 170717 293525 229295 95588 50731 -97569 -377412 -231016
14632b31016K0458q2315K18671J37249J73346K04487n7808k6787k36310l72209
$$ -231016 -210558 -292873 -74202 63047 236393 440880 383072 356285 119975 -252234
14622b52234j21810L7254J30253k25728k61025J16271K94939Q8940N2118o852
$$ -252234 -374044 -336790 -206537 -432265 -693290 -577019 -282080 -193140 -141022 -147874
14612a47874J09578K62467O6019j73279q5636j38256k36865N707O3833O9206K30521
$$ -147874 -38296 224171 290190 116911 31275 -106981 -343846 -338139 -274306 -205100 25421
14601B5421J22415o0752K20221o6781j86451P5404L8299m9342k38038l65776r6004
$$ 25421 147836 87084 307305 240524 54073 129477 167776 118434 -119604 -485380 -581384
14590e81384J8009M18158K73321K09988j37297k68453N8494K56270M5931k24992
$$ -581384 -563375 -145217 128104 338092 200795 -67658 -9164 247106 293037 68045
14580F8045j25048j28086l3022O498O9069l801J11601L56319N6419L1834l71172
$$ 68045 -57003 -185089 -218111 -211613 -142544 -146345 -34744 321575 377994 409828 38656
14569C8656k28392j1011R1892J42974k10163r574j7255l6582q0608L29923J71595
$$ 38656 -189736 -200747 -108855 34119 -176044 -185618 -202873 -239455 -320063 9860 181455
14558A81455J2933q5533J66667J21244j65178l59702k1895L7592J65441M0685
$$ 181455 194388 108855 275522 396766 231588 -128114 -150009 -112417 53024 93709
14548I3709J98124j52554m19132R8820J33721n1510l5663M6626L0204P2300J31588
$$ 93709 291833 139279 -279853 -181033 -47312 -98822 -134485 -87859 -57655 14645 146233
14537A46233K51529j30398j62528Q6303J12259j19093j07784Q3603R5262L24312
$$ 146233 397762 267364 104836 191139 303398 184305 76521 160124 255386 579698
14527E79698O9857l45947j09592R0085m8860n443j0782j91061J21782J15356J37877
$$ 579698 649555 303608 194016 284101 235241 229798 219016 27955 149737 265093 402970
14516D02970k43570k14795N7134r2397P8510K76834J2476k9106l37761m6140j5042
$$ 402970 159400 -55395 1739 -90658 -12148 264686 277162 248056 -89705 -135845 -150887
14505a50887K58458J29783j26477k05612r2362M0262k8006P0132l8084j23845
$$ -150887 107571 237354 110877 -94735 -187097 -146835 -174841 -104709 -142793 -266638
14495b66638M42829J58182M0387l9874j2377k62605j51927K48427J19280R7365
$$ -266638 176191 334373 374760 334886 322509 59904 -92023 156404 275684 373049
14485C73049k96801l96158L6498J40133j38022j82848J78512O4243P8947K81658
$$ 373049 76248 -319910 -283412 -143279 -281301 -464149 -285637 -221394 -142447 139211
14475A39211m1632l52315m81936K49064M80097J94563n0877j86304k3564o0089
$$ 139211 97579 -254736 -736672 -487608 -7511 187052 136175 -50129 -73693 -133782
14465a33782l9729M6230J11972J34975j57655k39015r7782N5286J83320R9235
$$ -133782 -173511 -127281 -15309 119666 -37989 -277004 -374786 -319500 -136180 -36945
14455c6945J4565Q6110J44991j81639N5532J1511j69733j40658J7K53317J80722
$$ -36945 -22380 63730 208721 27082 82614 94125 -75608 -216266 -216249 37068 217790
14444B17790J10770J42060q1665J00101k75971j51999N9963R9795q8664J2891
$$ 217790 328560 470620 388955 489056 213085 61086 121049 220844 132180 145071
14434A45071k96536J44064L36100M8350k20583j86662k8394p9264M8767r9475
$$ 145071 -151465 -7401 328699 377049 156466 -30196 -58590 -137854 -89087 -188562
14424a88562P9220k5812j06639p1876o2776m8829n8923r0077L99866J20355k1638
$$ -188562 -109342 -135154 -241793 -313669 -376445 -425274 -484197 -574274 -174408 -54053 -75691
14413g5691J82724p2368j44473R4322m676k917Q8431j50401l69242j25653J81833
$$ -75691 107033 34665 -109808 -15486 -20162 -23079 65352 -85049 -454291 -579944 -398111
14402c98111q8736L43083J65897J38705J20187M2608J150k30705j78747j69204
$$ -398111 -486847 -143764 22133 160838 281025 323633 324783 94078 -84669 -253873
14392b53873k01684K1745J74583L7823R6386J87816j81268k40915K2085M1908
$$ -253873 -455557 -433812 -259229 -221406 -125020 62796 -118472 -359387 -337302 -295394
14382b95394L0281K41209K44925M2554l26660q2561Q1483m44300j06182M49150
$$ -295394 -265113 -23904 221021 263575 -63085 -145646 -64163 -508463 -614645 -165495
14372a65495R0481r4544K24410K79876K4032j17810q1088R462J15688l01485K8895
$$ -165495 -75014 -169558 54852 334728 358760 240950 159862 169324 285012 -16473 12422
14361A2422M4536L9769j07374j63477j78849J19135K41905n5532r6294p9599J82755
$$ 12422 56958 96727 -10647 -174124 -352973 -233838 8067 -47465 -143759 -223358 -40603
14350d0603J51885K0640l7172n22853L203L50927J39000K7154K30501j25791j11477
$$ -40603 111282 131922 94750 -428103 -424900 -73973 65027 92181 322682 196891 85414
14339H5414j35344L9487j67888j14841K27324O1444L55369L91660r3029l34372
$$ 85414 -49930 -10443 -178331 -293172 -65848 -4404 350965 742625 649596 315224
14329C15224k73861l7083M1000q2521L70686j09741k25495k07533j79752l6258
$$ 315224 41363 4280 45280 -37241 333445 223704 -1791 -209324 -389076 -425334
14319d25334M08894J93556j19373q4139j0849R8920j43740j73780n5638J04147
$$ -425334 -16440 177116 57743 -26396 -37245 61675 -82065 -255845 -311483 -207336
14309b07336j06205J82522K88568K2139k63504l58172L54127L8655k66958j41127
$$ -207336 -313541 -131019 157549 179688 -83816 -441988 -87861 -49206 -316164 -457291
14299d57291M9068J40807O0376r9386l37300K09322J68891j18313l9411J52302
$$ -457291 -408223 -267416 -207040 -306426 -643726 -434404 -265513 -383826 -423237 -270935
14289b70935L95042J51847j35334Q4843J55664p505p5456l3177r6000r662o1694
$$ -270935 124107 275954 140620 225463 381127 373622 298166 264989 168989 159327 97633
14278I7633J93754J44696j68819l934j88964r1233O9733j666J93755L13310k6458
$$ 97633 291387 436083 267264 263330 74366 -16867 52866 51200 244955 558265 531807
14267E31807k09505j21234Q4554j11681j4874p5102L9609o490j19676k82684Q8290
$$ 531807 322302 201068 285622 173941 159067 83965 123574 117084 -2592 -285276 -196986
14256a96986J46216L0576Q0002n0974j65501R0545K7945J54537r1244j23482L0224
$$ -196986 -50770 -20194 59808 8834 -156667 -66122 -38177 116360 25116 -98366 -68142
14245f8142J71151J6486J13284r9736J76029J16371L9641j53786k94956j52739
$$ -68142 103009 119495 232779 133043 309072 425443 465084 311298 16342 -136397
14235a36397Q4610J88378k16120J78901R3725K30593k5064j02589l88811l99380
$$ -136397 -51787 136591 -79529 99372 193097 423690 398626 296037 -92774 -492154
14225d92154j0978j5354L6169K84525O2732N2470K58212q3045j35861o3891K47575
$$ -492154 -503132 -518486 -482317 -197792 -135060 -82590 175622 92577 -43284 -107175 140400
14214A40400J16922k03573J36907M25246r2371l56382j98630n3432L3268K13930
$$ 140400 257322 53749 190656 615902 523531 167149 -31481 -84913 -51645 162285
14204A62285J22744k41141K509k44808k02853L59560j9215K2470R3218p9625J7169
$$ 162285 285029 43888 46397 -198411 -401264 -41704 -60919 -38449 54769 -24856 -7687
14193g687P2964m2708j62213J40513k44055j10885O6607N0242J82429K16961j67949
$$ -7687 65277 22569 -139644 869 -243186 -354071 -287464 -237222 -54793 162168 -5781
14182e781l13227K73146M19781k40708k44824n081J22938J59441J36482j16400
$$ -5781 -319008 -45862 373919 133211 -111613 -116694 6244 165685 302167 185767
14172A85767K2395l11812j3205J54095k9245k14801J3678m2214J44641K62135
$$ 185767 208162 -103650 -116855 37240 7995 -206806 -193128 -235342 -90701 171434
14162A71434N5046q1216j08964R3915J08451k96346l65272o5459J68941l6460
$$ 171434 226480 145264 36300 130215 238666 -57680 -422952 -488411 -319470 -355930
14152c55930k58555j3910L61081K22862O4678Q2244L1879n6611J00596Q0111K79244
$$ -355930 -614485 -628395 -267314 -44452 20226 102470 134349 77738 178334 258445 537689
14141E37689k96563k65815p7787j44421J03802p2066K74098L488j02332J18243
$$ 537689 241126 -24689 -102476 -246897 -143095 -215161 58937 62425 -39907 78336
14131G8336J34350l30551l7363m6252k2090l2211j46693L2807J11543j88132j12473
$$ 78336 212686 -117865 -155228 -201480 -223570 -255781 -402474 -369667 -258124 -446256 -558729
14120e58729L30367M28859K05767j49930j90477n9596k59472o7918J65289m8701
$$ -558729 -228362 200497 406264 256334 65857 6261 -253211 -321129 -155840 -204541
14110b04541j85764P9998K11230J19950m12657p5813K36505m5018l562J19183
$$ -204541 -390305 -310307 -99077 20873 -391784 -467597 -231092 -276110 -279672 -160489
14100a60489J36500l42956N0620P1020J91238M26609K00188m62117k68922P9080
$$ -160489 -23989 -366945 -316325 -245305 -54067 372542 572730 110613 -158309 -79229
14090g9229m5934j04659O3489J27863J12784K08069K99867j55109l72840j95090
$$ -79229 -125163 -229822 -166333 -38470 74314 282383 582250 427141 54301 -140789
14080a40789J17801J83521j86493l34129j26468L48974N41028K38362q7774j47499
$$ -140789 -22988 160533 -25960 -360089 -486557 -137583 403445 641807 554033 406534
14070D06534l2372p8383J77339k48503j81910J35120O7834R8204R5284n5274n697
$$ 406534 374162 295779 473118 224615 42705 177825 245659 343863 439147 383873 378176
14059C78176k18824k33345O9621J45702O3498m6157K31420N2485k69040j80573
$$ 378176 159352 -73993 -4372 141330 204828 158671 390091 442576 173536 -7037
14049g037q2596J05465O6084j69453p8188N6211q1245R4065l58781k06595K29288
$$ -7037 -89633 15832 81916 -87537 -165725 -109514 -190759 -96694 -455475 -662070 -432782
14038d32782L78088j55583l2891M3521q2671r2106J42402J5954R1776K20189K58314
$$ -432782 -54694 -210277 -243168 -199647 -282318 -374424 -232022 -216068 -124292 95897 354211
14027C54211K5643o3847k53173m22324L4449R6844P0530J638P2637K30912N4663
$$ 354211 379854 316007 62834 -359490 -325041 -228197 -157667 -156029 -83392 147520 202183
14016B02183N069j61059J46782J87626j45537k15441k002K77329J18003k19971
$$ 202183 207252 46193 192975 380601 235064 19623 17621 294950 412953 192982
14006A92982j60203N3107Q8893n9382q2816L947o1563J49121N3956r4541k36344
$$ 192982 32779 85886 174779 115397 32581 36528 -25035 124086 178042 83501 -152843
13995a52843j99984k22101J01836J81876J54554J66010k0343L4776L28774n721
$$ -152843 -352827 -574928 -473092 -291216 -136662 29348 9005 43781 372555 366834
13985C66834l54916j17224L19727n3718j40601N979n42j73330k13615j39310J13444
$$ 366834 11918 -105306 214421 160703 20102 26081 25539 -147791 -361406 -500716 -387272
13974c87272J20595M6546R9416K50970K95078p7243k56612j61377r9232L5664
$$ -387272 -266677 -220131 -120715 130255 425333 348090 91478 -69899 -169131 -133467
13964a33467J00461J29112r7224K19847o918j36375j85475l307L11463J00190
$$ -133467 -33006 96106 -1118 218729 211811 75436 -110039 -113346 198117 298307
13954B98307l25814k57694J02134L78216K07182l29874k01252J80947K74876J57075
$$ 298307 -27507 -285201 -183067 195149 402331 72457 -128795 52152 327028 484103
13944D84103J03163R7344j31491j08569k73066j48207j8549M6321k0579n9147
$$ 484103 587266 684610 553119 444550 171484 23277 4728 51049 30470 -28677
13934b8677p3571k3049p865L45413K90410L6593q8461j78315l15038j67001l66305
$$ -28677 -102248 -125297 -133162 212251 502661 539254 450793 272478 -42560 -209561 -575866
13923e75866j4171R6750M22231K98176l15916r7158q7150j54004L87808L60912
$$ -575866 -590037 -493287 -71056 227120 -88796 -185954 -273104 -427108 -39300 321612
13913C21612J1528L3620K9302j91381l07173r3338K39281J04370n1100j94388
$$ 321612 333140 366760 396062 204681 -102492 -195830 43451 147821 96721 -97667
13903i7667O8102j32748o1088k6441O9041J63637l8555j37212J25423L8309J2533
$$ -97667 -29565 -162313 -223401 -249842 -180801 -17164 -55719 -192931 -67508 -29199 -16666
13892a6666Q0975q7644j72820l9549M1725J45610J11579Q7756J03140O2590j81564
$$ -16666 64309 -23335 -196155 -235704 -193979 -48369 63210 150966 254106 316696 135132
13881A35132j19228J78007P603q1010J08277j65226k84704M68033L63965p4267
$$ 135132 15904 193911 201514 120504 228781 63555 -221149 246884 610849 536582
13871E36582j79917k21194n5606j67626L06088K5830j00237m1532O1927L8155
$$ 536582 356665 135471 79865 -87761 218327 244157 143920 102388 164315 202470
13861B02470P2701N2985J86994l18577j03173K07553j72981k71304Q2907n8430
$$ 202470 275171 328156 515150 196573 93400 300953 127972 -143332 -60425 -118855
13851a18855j7367K34485Q1090R5591k16311j49792j7445L52750K42521k64396
$$ -118855 -136222 98263 179353 274944 58633 -91159 -108604 244146 486667 222271
13841B22271k43235J13248k02270K53844K75240J74061r6917m39415j57695j55055
$$ 222271 -20964 92284 -109986 143858 419098 593159 496242 56827 -100868 -255923
13831b55923j68978J46142K42443J86850k23661m7971r1700P9835K0666J74996
$$ -255923 -424901 -278759 -36316 150534 -73127 -121098 -212798 -132963 -112297 62699
13821F2699r3341r8777o4058N5966J17493J01720j61813J24227r3428l79261O7236
$$ 62699 -30642 -129419 -193477 -137511 -20018 81702 -80111 44116 -49312 -428573 -361337
13810c61337J17836J42845n2167j40355j06659n8016L76607M33934J00177k30202
$$ -361337 -243501 -100656 -152823 -293178 -399837 -457853 -81246 352688 452865 222663
13800B22663j86960l7045j5885J92155p1354l33505K24211K20462j3614k94010
$$ 222663 35703 -1342 -17227 174928 103574 -229931 -5720 214742 201128 -92882
13790i2882K56150K39447p9756m5878j62798k09678L58373n4908Q4488r7550N6887
$$ -92882 163268 402715 322959 277081 114283 -95395 262978 208070 292558 195008 251895
13779B51895j00241J52235o877m11007k69655L59387N0363o352O9448Q0748J16538
$$ 251895 151654 303889 297012 -113995 -383650 -24263 26100 19748 89196 169944 286482
13768B86482o3675j71810P6593K06080J5236j61463j64083J9107n1610j41469
$$ 286482 222807 50997 127590 333670 348906 187443 23360 42467 -9143 -150612
13758a50612k07146J37191l2641J14996M00236m4008k7797k30191k5611K99636
$$ -150612 -357758 -220567 -253208 -138212 262024 218016 190219 -39972 -65583 234053
13748B34053L38096j0463k1964l9705m41750k83622J158K20467J68527j166j1840
$$ 234053 572149 561686 539722 500017 58267 -225355 -224197 -3730 164797 163631 151791
13737A51791J79069P9318R5298j13622l15936m6417M3333O2578M3197K38016j84351
$$ 151791 330860 410178 505476 391854 75918 29501 72834 135412 178609 416625 232274
13726B32274j53505o6202J5945J93769k8157J47974k07991j77508o0674J69990
$$ 232274 78769 12567 28512 222281 194124 342098 134107 -43401 -104075 65915
13716F5915j84819j17479L3627K2660M0317r9616O5733M63228N4344j26872j53557
$$ 65915 -118904 -236383 -202756 -180096 -139779 -239395 -173662 289566 343910 217038 63481
13705F3481N4867N7775k9855K54293j89748m25429n2710k6657J699K9420K11931
$$ 63481 118348 176123 146268 400561 210813 -214616 -267326 -293983 -292284 -262864 -50933
13694e0933j6382M94482K78193N5529r3002l1144j63407o5790k59688o9609K77552
$$ -50933 -67315 427167 705360 760889 667887 636743 473336 407546 147858 78249 355801
13683C55801j69530j23698p4301K93556K40101J2461J5930L9545j7903k68123
$$ 355801 186271 62573 -11728 281828 521929 534390 550320 589865 571962 303839
13673C03839k77917r0207N1089j11697P4994J90488K39352J13657k36370j62209
$$ 303839 25922 -64285 -13196 -124893 -49899 140589 379941 493598 257228 95019
13663I5019K20069j4903Q6638K7643o5725k62970m14268j83649J96169K68351
$$ 95019 315088 300185 386823 414466 348741 85771 -328497 -512146 -315977 -47626
13653d7626K96028l155M861l3801j02993O1748L5918O1594P1757k48715k8103
$$ -47626 248402 245247 250108 216307 113314 175062 210980 272574 344331 95616 67513
13642F7513K61282j32615k27417l31781J90065L40116J81218O7759j24162J66357
$$ 67513 328795 196180 -31237 -363018 -172953 167163 348381 416140 291978 458335
13632D58335J39768n02933j87824K5943k2445L4788J1554L7126l5517K13040k25944
$$ 458335 598103 95170 -92654 -66711 -89156 -54368 -42814 -5688 -41205 171835 -54109
13621e4109l33778J522J27864K30210o4503p5977n7485r4809J20901J19777O7535
$$ -54109 -387887 -386365 -258501 -28291 -92794 -168771 -226256 -321065 -200164 -80387 -12852
13610a2852k8224J94028J9701k43529J40420l1392p4040K27720J23809k26533
$$ -12852 -41076 152952 172653 -70876 69544 38152 -35888 191832 315641 89108
13600H9108r4561L35154J95766j27253q2744r449q0071M6598L07963J412q3787
$$ 89108 -5453 329701 525467 398214 315470 306021 225950 272548 580511 581923 498136
13589D98136L7430l53759k4099m1175p2018Q2817N0584l98608L6188L5278J35202
$$ 498136 535566 181807 157708 116533 44515 127332 177916 -220692 -184504 -149226 -14024
13578a4024Q5872J58752j43k12107j46340J16128O5716L1927j04690j5395j46698
$$ -14024 71848 230600 230457 18350 -127990 -11862 53854 85781 -18909 -34304 -181002
13567a81002o8752J62858l5057l7836R5359J99973O5370J28067k94238j63918
$$ -181002 -249754 -86896 -121953 -159789 -64430 135543 200913 328980 34742 -129176
13557a29176N04518r8641p4603P6582N1806j1445k5004M6119j86543m9265J79973
$$ -129176 375342 276701 202098 278680 330486 319041 294037 340156 153613 104348 284321
13546B84321J14237j71070k0369n6542M4422j34986K4877K13832k97608J28279
$$ 284321 398558 227488 207119 150577 194999 60013 84890 298722 1114 129393
13536A29393m7428j13447j42715j14202K26779j07888k14997K40493M50155K78257
$$ 129393 81965 -31482 -174197 -288399 -61620 -169508 -384505 -144012 306143 584400
13526E84400j78518R097k7805O5974j10122k26394j92888R8140r5399j79446j23809
$$ 584400 405882 414979 387174 453148 343026 116632 -76256 21884 -73515 -252961 -376770
13515c76770K0241K14504q9972j67482p7521j20679Q4149J05564L295k10371o8140
$$ -376770 -356529 -142025 -231997 -399479 -477000 -597679 -513530 -407966 -404671 -615042 -683182
13504f83182K42056J02772J45274p0909j33145j91281o70J12594k39149j58162
$$ -683182 -441126 -338354 -193080 -263989 -397134 -588415 -589085 -476491 -715640 -873802
13494h73802O432K52125J28596o1815K187K90600J45038K82736J126n2010k6649
$$ -873802 -867370 -615245 -486649 -548464 -546277 -255677 -110639 172097 173223 121213 94564
13483I4564J34371k68349J20873K84483j43358N0956J2466k48374r7457m5615
$$ 94564 228935 -39414 81459 365942 222584 273540 286006 37632 -59825 -105440
13473a05440M2433L22712q7104q0830R002P9548j9000p6767J76038P4534j04424
$$ -105440 -63007 259705 172601 91771 100773 180321 161321 84554 260592 335126 230702
13462B30702j73849M9210J05415L5286j1208J09467j3628K9550P3468k58553o9123
$$ 230702 56853 106063 211478 246764 235556 345023 331395 360945 434413 175860 106737
13451A06737o0953O4939J78784P883J49280j56831k98015R1485J20273l66591
$$ 106737 45784 110723 289507 297390 446670 289839 -8176 83309 203582 -163009
13441a63009j93891N2634J58248J00205j9541J22494j0265O168k74496j19747
$$ -163009 -356900 -304266 -146018 -45813 -65354 57140 46875 53043 -221453 -341200
13431c41200Q5897J13343L92603j35388l23414K11369K13643Q0237l25505l31483
$$ -341200 -255303 -141960 250643 115255 -208159 3210 216853 297090 -28415 -359898
13421c59898J60848J93245o8030o1389J26547k87076j56286K47707J62439O4223
$$ -359898 -199050 -5805 -73835 -135224 -8677 -295753 -452039 -204332 -41893 22330
13411B2330m7405n0350k7180K7515J7405J49250J09087N0441k41598l4292k37056
$$ 22330 -25075 -75425 -102605 -75090 -57685 91565 200652 251093 9495 -24797 -261853
13400b61853J84583O6842j87100K12408R4586m7278k04527j23083J24507L56946
$$ -261853 -77270 -10428 -197528 14880 109466 62188 -142339 -265422 -140915 216031
13390B16031L7164k10390j59608L61947Q0357k23671k32184n0968l9866j40266
$$ 216031 253195 42805 -116803 245144 325501 101830 -130354 -181322 -221188 -361454
13380c61454l7881J86312r3531K93448J24320j5354k27347J09587K54309N6509
$$ -361454 -399335 -213023 -306554 -13106 111214 95860 -131487 -21900 232409 288918
13370B88918j27688M6570O2173J49855L505P3719q6985j07231J04415k26309m2325
$$ 288918 161230 207800 269973 419828 423333 497052 410067 302836 407251 180942 138617
13359A38617J37105M2070N1050p1696o7190k56736r3311L58190L0722J41607J29862
$$ 138617 275722 317792 368842 297146 229956 -26780 -120091 238099 268821 410428 540290
13348E40290j11023j09531r8266o447J3068j18510j63913j76533p6570K21213
$$ 540290 429267 319736 221470 215023 228091 109581 -54332 -230865 -307435 -86222
13338h6222J86070L2234l7059k36966k28896k71104j54896K83974L20446J79398
$$ -86222 99848 132082 95023 -141943 -370839 -641943 -796839 -512865 -192419 -13021
13328a3021q9470L6872M03147K38786k3807l56386J6328l11129j67123K41584
$$ -13021 -102491 -65619 337528 576314 552507 196121 212449 -98680 -265803 -24219
13318b4219O2769j19471n2886k59027l28438P9650O23392L45654N0256p6327j04333
$$ -24219 38550 -80921 -133807 -392834 -721272 -641622 -18230 327424 377680 301353 197020
13307A97020j14430J03503J29592J92576R2704k12971p2997j57941j88146o9898
$$ 197020 82590 186093 315685 508261 600965 387994 314997 157056 -31090 -100988
13297a00988J17236M2412j95164Q7567N7645P0503j94911j47877K4391J17503
$$ -100988 16248 58660 -136504 -48937 8708 79211 -115700 -263577 -239186 -121683
13287a21683M03199J47322J24207L6558R5527k8192k50847j32608j46128l704
$$ -121683 281516 428838 553045 589603 685130 656938 406091 273483 127355 123651
13277A23651n0674j23554m2169O9213J70426J5814j65242o4721N317k06896o4952
$$ 123651 72977 -50577 -92746 -23533 146893 162707 -2535 -67256 -61939 -268835 -333787
13266c33787M93885K56135k11200l05415J50834L6080J03195n5638j33711Q2066
$$ -333787 160098 416233 205033 -100382 50452 86532 189727 134089 378 82444
13256H2444J8247k12245r5434K13874p1110P0136k07377j86617K32039L1947K45493
$$ 82444 100691 -111554 -206988 6886 -64224 5912 -201465 -388082 -156043 -124096 121397
13245A21397m9246j07966k2100J50018J16198K0099O5731m4219j03575k8k4285
$$ 121397 72151 -35815 -57915 92103 208301 228400 294131 249912 146337 146309 122024
13234A22024n426J62206j2651m19832l15824L1499j0423j6366m7698n9550K7065
$$ 122024 116598 278804 266153 -153679 -469503 -438004 -448427 -464793 -512491 -572041 -544976
13223e44976L92897J07791j32629j35755J41037N7149L5645N8540j22251q320
$$ -544976 -152079 -44288 -176917 -312672 -171635 -114486 -78841 -20301 -142552 -150872
13213a50872M2401Q756q8172r3915J52335K61376M5501Q2633O6657j0845l42600
$$ -150872 -108471 -99715 -187887 -281802 -129467 131909 177410 260043 326700 315855 -26745
13202b6745j74085k39950K26401J60092J06503j02080j82680J60509j69089O4701
$$ -26745 -200830 -440780 -214379 -54287 52216 -49864 -232544 -72035 -241124 -176423
13192a76423M01777r9708R6426J03022O1086N8657J15093k14292J3129J7056r16
$$ -176423 225354 125646 222072 325094 386180 444837 559930 345638 358767 375823 374907
13181C74907Q7039j7949K66646j1214j91239k75281l01718j41981p9908J78972
$$ 374907 461946 443997 710643 699429 508190 232909 -68809 -210790 -290698 -111726
13171a11726J35092q1329L39056R2042r1943k89589l29484R6044J31443j3373
$$ -111726 23366 -57963 281093 373135 281192 -8397 -337881 -241837 -110394 -123767
13161a23767j06187J22321J01957p4898J24561J83219k67118j09890K00224L24706
$$ -123767 -229954 -107633 -5676 -80574 43987 227206 -39912 -149802 50422 375128
13151C75128n9900k77349j12893L9518K05452M9035m18510l12645n1486J94858
$$ 375128 315228 37879 -75014 -35496 169956 218991 -199519 -512164 -563650 -368792
13141c68792K71113J89907j05079k6841J81892n1923k96092J87434O9830J44962
$$ -368792 -97679 92228 -12851 -39692 142200 90277 -205815 -18381 51449 196411
13131A96411J22124j54833k45257k3737K27183j23810j19621J41525J87442N4495
$$ 196411 318535 163702 -81555 -105292 121891 -1919 -121540 19985 207427 261922
13121B61922r5645k39794n8867n043j22693O7652p2004J27824Q073j89509l24426
$$ 261922 166277 -73517 -132384 -137427 -260120 -192468 -264472 -136648 -128575 -318084 -642510
13110f42510K16727N09793r177k56992j50644M2770o9188o4013P4448j69522J05711
$$ -642510 -425783 84010 74833 -182159 -332803 -290033 -359221 -423234 -348786 -518308 -412597
13099d12597J20934p7681P0473l39k7296M2508K23003K8623j46818L0810j31298
$$ -412597 -291663 -369344 -298871 -299210 -326506 -283998 -60995 -32372 -179190 -148380 -279678
13088b79678l0810j448O4175J41601K12778j52836J29123n1065K1259J10889j16020
$$ -279678 -310488 -311936 -247761 -106160 106618 -46218 82905 31840 53099 163988 47968
13077D7968J04059J15640j75493r4798N1689j06451P0468r5512j80267k74981
$$ 47968 152027 267667 92174 -2624 49065 -57386 13082 -82430 -262697 -537678
13067e37678J17603J69598J0157M5316Q1900j74232n0545M4689K99304K33879
$$ -537678 -420075 -250477 -240320 -195004 -113104 -287336 -337881 -293192 6112 239991
13057B39991K08193j54900j99454j18531p1233l7618l5203K17813K16936M5646
$$ 239991 448184 293284 93830 -24701 -95934 -133552 -168755 49058 265994 311640
13047C11640o8110l17089m28310N1617K0189J21203L81147J148j67851k30364
$$ 311640 243530 -73559 -501869 -450252 -430063 -308860 72287 73435 -94416 -324780
13037c24780j10702j19433L03096K82594O7172q7999j96051j32972O7279K11639
$$ -324780 -435482 -554915 -251819 30775 97947 9948 -186103 -319075 -251796 -40157
13027d0157K68166K15690K0820N8708l4741j10599J5937r8758l09010k44219J65573
$$ -40157 228009 443699 464519 523227 488486 377887 393824 295066 -13944 -258163 -92590
13016i2590J0421j17264k065L51145l8137q2510M1151k02716J33885J28886l56687
$$ -92590 -82169 -199433 -201498 149647 111510 29000 70151 -132565 1320 130206 -226481
$$ [...]
##END NTUPLES=NMR SPECTRUM
##END=
