##TITLE=Analysis number 315502
Compound Code btb 13836
Project Code adrs
Chemist Name cyclan
##JCAMPDX= 6.0         $$ Bruker NMR JCAMP-DX V2.0
##DATA TYPE= NMR SPECTRUM
##DATA CLASS= NTUPLES
##ORIGIN= Bruker BioSpin GmbH
##OWNER= NMR
$$ XWIN-NMR		Version 3.5
$$ Tue Nov 22 10:14:03 2005 GMT Standard Time (UT+0h)  MAYBRIDGE\NMR@NMR_250MHZ
##.OBSERVE FREQUENCY= 250.131544655141
##.OBSERVE NUCLEUS= ^1H
##.ACQUISITION MODE= SIMULTANEOUS (DQD)
##.ACQUISITION SCHEME= undefined
##.AVERAGES= 16
##.DIGITISER RES= 18
##SPECTROMETER/DATA SYSTEM= dpx250
##.PULSE SEQUENCE= zg30
##.SOLVENT NAME= CDCl3
##.SHIFT REFERENCE= (INTERNAL, CDCl3, 0, 16.522)
##AUDIT TRAIL= $$ (NUMBER, WHEN, WHO, WHERE, WHAT)
$$ ##TITLE= Audit trail, XWIN-NMR		Version 3.5
$$ ##JCAMPDX= 5.01
$$ ##ORIGIN= Bruker BioSpin GmbH
$$ ##OWNER= NMR
$$ C:\u/data/dgb/nmr/ADRS/12810/pdata/1/auditp.txt
$$ ##AUDIT TRAIL=  $$ (NUMBER, WHEN, WHO, WHERE, WHAT)
(   1,<2005-11-22 10:13:42.21 +000>,<MAYBRIDGE\NMR>,<NMR_250MHZ>,
      <created by zg, POWCHK disabled, PULCHK disabled
       configuration hash MD5:
       62 19 C7 07 E1 42 D1 B7 37 6C 3D D0 77 39 F9 E6
       data hash MD5: 64K
       2D B3 6A 66 28 7A F5 46 75 B5 8E B4 F7 F9 F7 3E>)
(   2,<2005-11-22 10:13:54.56 +000>,<MAYBRIDGE\NMR>,<NMR_250MHZ>,
      <Start of raw data processing
       ef LB = 0.3 FT_mod = 6 PKNL = 1 SI = 32K 
       data hash MD5: 32K
       2A 56 1E 2F A8 6C C2 20 B6 E6 F4 95 34 D1 C3 0F>)
(   3,<2005-11-22 10:13:56.42 +000>,<MAYBRIDGE\NMR>,<NMR_250MHZ>,
      <apk 
       data hash MD5: 32K
       49 F8 A1 72 F0 D5 DB 4D 29 75 A9 8A 2A 1A DD AC>)
(   4,<2005-11-22 10:13:57.31 +000>,<MAYBRIDGE\NMR>,<NMR_250MHZ>,
      <abs ABSG = 5 
       data hash MD5: 32K
       F1 C8 E1 30 50 CF 64 ED F3 FD C4 E1 F4 D2 72 80>)
$$ ##END=
$$ 
$$ hash MD5
$$ 52 FF A4 19 97 DA A9 3E E5 BB D0 31 37 90 09 F9
##$RELAX= 
##$RELAX= 
##$RELAX= 
##$RELAX= 
##$RELAX= 
##$RELAX= 
##$RELAX= 
$$ Bruker specific parameters
$$ --------------------------
##$DU= <C:\u>
##$EXPNO= 12810
##$NAME= <ADRS>
##$PROCNO= 1
##$TYPE= <nmr>
##$USER= <dgb>
##$AMP= (0..31)
100 100 100 100 100 100 100 100 100 100 100 100 100 100 100 100 100 100 
100 100 100 100 100 100 100 100 100 100 100 100 100 100 
##$AQSEQ= 0
##$AQ_mod= 3
##$AUNM= <au_zg>
##$AUTOPOS= <10 >
##$BF1= 250.13
##$BF2= 250.13
##$BF3= 250.13
##$BF4= 250.13
##$BF5= 500.13
##$BF6= 500.13
##$BF7= 500.13
##$BF8= 500.13
##$BYTORDA= 1
##$CFDGTYP= 0
##$CFRGTYP= 5
##$CHEMSTR= <none>
##$CNST= (0..31)
1 1 145 1 1 1 1 1 1 1 1 1 1 1 1 1 1 1 1 1 1 1 1 1 1 1 1 1 1 1 1 1 
##$CPDPRG= <>
##$CPDPRG1= <>
##$CPDPRG2= <>
##$CPDPRG3= <>
##$CPDPRG4= <mlev>
##$CPDPRG5= <mlev>
##$CPDPRG6= <mlev>
##$CPDPRG7= <mlev>
##$CPDPRG8= <mlev>
##$CPDPRGB= <>
##$CPDPRGT= <>
##$D= (0..31)
0 1 0 0 0 0 0 0 0 0.06 0 0 0 0 0 0 0.0002 0 0 0 0 0 0 0 0 0 0 0 0 0 0 
0 
##$DATE= 1132654420
##$DBL= (0..7)
120 120 120 120 120 120 120 120 
##$DBP= (0..7)
150 150 150 150 150 150 150 150 
##$DBP07= 0
##$DBPNAM0= <>
##$DBPNAM1= <>
##$DBPNAM2= <>
$$ [...]
##$SUBNAM7= <"">
##$SUBNAM8= <"">
##$SUBNAM9= <"">
##$SW= 20.6930455092707
##$SWIBOX= (0..15)
0 0 3 0 0 0 0 0 0 0 0 0 0 0 0 0 
##$SW_h= 5175.983436853
##$TD= 65536
##$TD0= 1
##$TE= 294.16
##$TE2= 300
##$TE3= 300
##$TEG= 300
##$TL= (0..7)
0 120 120 120 120 120 120 120 
##$TP= (0..7)
150 150 150 150 150 150 150 150 
##$TP07= 0
##$TPNAME0= <>
##$TPNAME1= <>
##$TPNAME2= <>
##$TPNAME3= <>
##$TPNAME4= <>
##$TPNAME5= <>
##$TPNAME6= <>
##$TPNAME7= <>
##$TPOAL= (0..7)
0.5 0.5 0.5 0.5 0.5 0.5 0.5 0.5 
##$TPOFFS= (0..7)
0 0 0 0 0 0 0 0 
##$TUNHIN= 0
##$TUNHOUT= 0
##$TUNXOUT= 0
##$USERA1= <user>
##$USERA2= <user>
##$USERA3= <user>
##$USERA4= <user>
##$USERA5= <user>
##$V9= 5
##$VALIST= <valist>
##$VCLIST= <CCCCCCCCCCCCCCC>
##$VD= 0
##$VDLIST= <DDDDDDDDDDDDDDD>
##$VPLIST= <PPPPPPPPPPPPPPP>
##$VTLIST= <TTTTTTTTTTTTTTT>
##$WBST= 1024
##$WBSW= 4
##$XGAIN= (0..3)
0 0 0 0 
##$XL= 0
##$YL= 0
##$YMAX_a= 863270
##$YMIN_a= -828622
##$ZGOPTNS= <>
##$ZL1= 120
##$ZL2= 120
##$ZL3= 120
##$ZL4= 120
##$ABSF1= 16.522
##$ABSF2= -4.171173
##$ABSG= 5
##$ABSL= 3
##$ALPHA= 0
##$AQORDER= 0
##$ASSFAC= 0
##$ASSFACI= 0
##$ASSFACX= 0
##$ASSWID= 0
##$AUNMP= <proc_1d>
##$AZFE= 0.1
##$AZFW= 0.1
##$BCFW= 0
##$BC_mod= 0
##$BYTORDP= 0
##$COROFFS= 0
##$CY= 12.5
##$DATMOD= 1
##$DC= 0
##$DFILT= <>
##$DTYPP= 0
##$F1P= 14.0000005364418
##$F2P= -0.99999901652339
##$FCOR= 0.5
##$FTSIZE= 32768
##$FT_mod= 6
##$GAMMA= 0
##$GB= 0
##$INTBC= 1
##$INTSCL= 1
##$ISEN= 128
##$LB= 0.3
##$LEV0= 0
##$LPBIN= 0
##$MAXI= 10000
##$MC2= 0
##$MEAN= 0
##$ME_mod= 0
##$MI= 0
##$NCOEF= 0
##$NC_proc= -3
##$NLEV= 6
##$NOISF1= 0
##$NOISF2= 0
##$NSP= 0
##$NTH_PI= 0
##$NZP= 0
##$OFFSET= 16.522
##$PC= 1
##$PHC0= 75.34884
##$PHC1= 13.75156
##$PH_mod= 1
##$PKNL= yes
##$PPARMOD= 0
##$PSCAL= 4
##$PSIGN= 0
##$REVERSE= no
##$SF= 250.13
##$SI= 32768
##$SIGF1= 0
##$SIGF2= 0
##$SINO= 400
##$SIOLD= 32768
##$SREGLST= <1H.CDCl3>
##$SSB= 0
##$STSI= 32768
##$STSR= 0
##$SW_p= 5175.98343685301
##$SYMM= 0
##$S_DEV= 0
##$TDeff= 65536
##$TDoff= 0
##$TI= <Analysis number 999999
Compound Code 99
Book Reference 9
Project Code 9>
##$TILT= no
##$TM1= 0
##$TM2= 0
##$TOPLEV= 0
##$USERP1= <user>
##$USERP2= <user>
##$USERP3= <user>
##$USERP4= <user>
##$USERP5= <user>
##$WDW= 1
##$XDIM= 32768
##$YMAX_p= 266981086
##$YMIN_p= -271325
$$ End of Bruker specific parameters
$$ ---------------------------------
##NTUPLES= NMR SPECTRUM
##VAR_NAME=  FREQUENCY,     SPECTRUM/REAL,   SPECTRUM/IMAG
##SYMBOL=    X,             R,               I
##VAR_TYPE=  INDEPENDENT,   DEPENDENT,       DEPENDENT
##VAR_FORM=  AFFN,          ASDF,            ASDF
##VAR_DIM=   32768,         32768,           32768
##UNITS=     HZ,            ARBITRARY UNITS, ARBITRARY UNITS
##FACTOR=    0.157963299565203, 1,           1
##FIRST=     4132.6476996994, 0,             0
##LAST=      -1043.33573715361, 0,           0
##MIN=       -1043.33573715361, -271325,     0
##MAX=       4132.6476996994, 266981086,     0
$$ Real data points
##PAGE= N=1
##DATA TABLE= (X++(R..R)), XYDATA
$$ [...]
$$ plain form
18077 227613 210292 210220 194386 184334 166999 151255 139605 156186 168649 147592 117669 103738
18065 103738 105017 105735 93572 86995 79498 80128 83952 69101 54687 48910 35866 34160 33317 33014
18051 33014 17947 12016 9182 7555 7806 5835 5545 3395 6624 20823 17328 7971 4236 -258
18037 -258 10841 17418 4997 1190 -44 -3550 -3317 13626 18935 12663 3655 3818 11876 8113 -1572
18022 -1572 -894 -4442 -13619 -472 14378 11599 12441 10499 19005 17270 25520 28263 15063 6989
18008 6989 -4654 -8339 -4101 -1927 -1914 -13154 -20142 -9520 -17891 -29843 -37874 -36804 -16777 3929
17994 3929 -626 -2401 -6758 -11314 -7775 -11243 -1050 2644 -15033 -16483 -11746 -10797 -5224 8060
17980 8060 12432 -8621 -11876 6850 13763 11502 15208 22415 10297 3857 -1084 2479 -4179 -1292
$$ packed form
18077B27613j7321p2j5834j0052j7335j5744j1650J6581J2463k1057k9923j3931
18065A03738J279P18j2163o577p497O30L824j4851j4414n777j3044j706q43l03
18051C3014j5067n931k834j627K51j971k90k150L229J4199l495r357l735m494
18037b58J1099O577j2421l807j234l506K33J6943N309o272r008J63Q058l763r685
18022a572O78l548r177J3147J4850k779Q42j942Q506j735Q250K743j3200q074
18008F989j1643l685M238K174J3j1240o988J0622q371j1952q031J070K0027K0706
17994C929m555j775m357m556L539l468J0193L694j7677j450M737R49N573J3284
17980H060M372k1053l255J8726O913k261L706P207j2118o440m941L563o658K887
$$ plain form
17966 -1292 -2901 -194 -5048 -6815 5152 17852 21043 16619 6009 8542 5470 9218 14583 4345
17952 4345 -5464 -56 -2572 -28599 -52915 -41086 -28363 -23641 -32510 -34903 -17887 -15149 -23450
17939 -23450 -18915 -4533 -8287 -14579 -21598 -24891 -23701 -30084 -29447 -13065 -9413 -13857 -8360 -1961
17925 -1961 -12819 -32798 -42472 -48669 -41815 -30297 -18531 -18788 -5462 4767 669 -6136 -9861
17912 -9861 -12763 -19037 -20302 -24842 -21057 -11831 2048 14045 546 -6038 -4280 -8988 -22347 -17508
17898 -17508 -40 1301 -15885 -24154 -20579 -19738 -14443 -10340 -7119 -11240 -18408 2089 9127 -2699
17884 -2699 -15245 -9112 -5157 -25470 -29569 -24735 -19024 -21443 -19042 -9809 -7029 5323 2766 -3119
17870 -3119 -3030 -7408 -23224 -31437 -22778 -12565 -21075 -9594 -1669 -18753 -22929 -16252 -5711 -12972
$$ packed form
17966a292j609K707m854j767J1967J2700L191m424j0610K533l072L748N365j0238
17952D345r809N408k516k6027k4316J1829J2723M722q869k393J7016K738q301
17939b3450M535J4382l754o292p019l293J190o383O37J6382L652m444N497O399
17925a961j0858j9979r674o197O854J1518J1766k57J3326J0229m098o805l725
17912i861k902o274j265m540L785R226J3879J1997j3499o584J758m708j3359M839
17898a7508J7468J341j7186q269L575Q41N295M103L221m121p168K0497P038j1826
17884b699j2546O133L955k0313m099M834N711k419K401R233K780J2352k557n885
17870c119Q9m378j5816q213Q659J0213q510J1481P925j7084m176O677J0541p261
$$ plain form
17856 -12972 -4506 -858 -3239 5443 4209 5674 10115 -2932 -3400 8884 7373 872 5173 6180
17842 6180 -6512 -14390 -20633 -32515 -39251 -34065 -31040 -26776 -30441 -21876 -10771 -12418 -7299 -8368
17828 -8368 -19997 -28071 -23339 -22050 -30221 -31214 -23430 -21431 -13692 -19576 -35969 -44713 -41430 -37575
17814 -37575 -35630 -42091 -44413 -50932 -50585 -45032 -21211 -1553 994 -15752 -16725 -15943 -16752 3152
17800 3152 14049 316 -6854 -11362 -12487 -14614 -26522 -29379 -18066 -19474 5092 17296 -1862
17787 -1862 -5531 -6483 -4131 3515 17669 6831 -8500 -19038 -20999 -27648 -35773 -38570 -33669 -13167
17773 -13167 -3817 -2181 13 -8376 -15319 -13260 -13937 -10850 -20317 -31833 -33679 -19509 -15218 2870
17759 2870 1404 -5965 11158 27549 5672 -14877 -14451 -1787 -2493 8699 1178 -26090 -35525
$$ packed form
17856a2972Q466L648k381Q682j234J465M441j3047m68J2284j511o501M301J007
17842F180j2692p878o243j1882o736N186L025M264l665Q565J1105j647N119j069
17828h368j1629q074M732J289q171r93P784J999P739n884j6393q744L283L855
17814c7575J945o461k322o519L47N553K3821J9658K547j6746r73P82q09J9904
17800C152J0897j3733p170m508j125k127j1908k857J1313j408K4566J2204j9158
17787a862l669r52K352P646J4154j0838j5331j0538j961o649q125k797M901K0502
17773a3167R350J636K194q389o943K059o77L087r467j1516j846J4170M291J8088
17759B870j466p369J7123J6391k1877k0549M26J2664p06J1192p521k7268r435
$$ plain form
17746 -35525 -24969 -9797 -6390 -6972 6099 -1153 2229 7259 10125 51 -23904 -28895 -26874
17733 -26874 -37748 -30944 -9529 -10312 -12848 -19947 -21290 -3509 -8644 -787 10641 1014 -26517
17720 -26517 -33134 -24428 -20327 -3 11366 13434 -685 -21639 -28865 -36564 -41710 -48808 -36480
17707 -36480 -12782 -19738 -19116 -8641 943 -7040 -12439 -10529 -8347 -5400 -10402 3988 5872 16785
17693 16785 10272 4688 348 622 5889 9730 11941 1144 -5409 -12277 -9699 -1462 1894 -2000
17679 -2000 -8067 -2151 304 -10423 -2225 -1857 -9786 -14853 -6253 -7887 -7074 -8108 -3964 -2646 -3084
17664 -3084 -12945 -25844 -15325 2508 11538 24689 28022 22369 15806 10097 15820 -4196 -15162
17651 -15162 -8673 9273 -281 -21595 -18287 1516 1360 -6045 -28695 -29041 -14176 -3824 -4740 -9409
$$ packed form
17746c5525J0556J5172L407n82J3071p252L382N030K866j0074k3955m991K021
17733b6874j0874O804K1415p83k536p099j343J7781n135P857J1428r627k7531
17720b6517o617Q706M101K0324J1369K068j4119k0954p226p699n146p098J2328
17707c6480K3698o956O22J0475R584p983n399J910K182K947n002J4390J884J0913
17693A6785o513n584m340K74N267L841K211j0797o553o868K578Q237L356l894
17679b000o067N916K455j0727Q198L68p929n067Q600j634Q13j034M144J318m38
17664c084r861j2899J0519J7833R030J3151L333n653o563n709N723k0016j0966
17651a5162O489J7946r554k1314L308J9803j56p405k2650l46J4865J0352r16m669
$$ plain form
17637 -9409 3432 11252 -191 -5937 -2358 4854 1423 -10145 -13062 -13721 -17500 -23981 -21515 -27851
17623 -27851 -20725 -19016 -12526 -7938 9672 6948 4525 7339 68 -13254 -19920 -20128 -7495 -2550
17609 -2550 -1647 -7751 -15116 -24292 -17801 -1572 6633 11526 1469 -1000 5794 -1367 -20943 -31009
17595 -31009 -25021 -14792 -14000 -17996 -24175 -21083 -16721 -20942 -26333 -20594 -22063 -29018 -27577 -40876
17581 -40876 -24217 -2858 -2145 -6368 -2645 1265 -12549 -24504 -26808 -15340 -27610 -35098 -25921
17568 -25921 -6366 -4578 2400 8642 2164 372 -1125 -3232 -13489 -7507 -14099 -13895 -11571 -24346
17554 -24346 -21900 -19278 -10551 513 -3285 -4209 2147 -9641 -12370 -9282 -9686 -9644 -5006 -14588 -12830
17539 -12830 -61 -11188 -22538 -6837 1260 -17224 -27418 -28107 -22221 -19929 -21157 -11910 -8606
$$ packed form
17637i409J2841P820j1443n746L579P212l431j1568k917o59l779o481K466o336
17623b7851P126J709O490M588J7610k724k423K814p271j3322o666k08J2633M945
17609b550R03o104p365r176O491J6229Q205M893j0057k469O794p161j9576j0066
17595c1009N988J0229P92l996o179L092M362m221n391N739j469o955J441j3299
17581d0876J6659K1359P13m223L723L910j3814j1955k304J1468j2270p488R177
17568b5921J9555J788O978O242o478j792j497k107j0257N982o592K04K324j2775
17554b4346K446K622Q727J1064l798r24O356j1788k729L088m04M2M638r582J758
17539a2830J2769j1127j1350J5701Q097j8484j0194o89N886K292j228R247L304
$$ plain form
17526 -8606 -6382 -7805 -1668 -9720 -13558 -9091 2571 2511 -381 -6255 -15707 -18891 -12052 -11719 -5327
17511 -5327 1511 6810 -746 1026 882 7353 3809 6434 2853 3069 6164 12485 843 -16455 -16978
17496 -16978 -2660 12798 11745 3981 -494 -20065 -31080 -25391 -28183 -22464 -16817 -9211 -8843 -17235
17482 -17235 -16246 -11368 -8784 -5271 -4505 -15797 -13626 -12027 -4302 -1304 2617 -5907 -9442 -17996 -26432
17467 -26432 -26174 -15027 4278 12558 -397 -4121 2362 2482 5848 4285 -1600 -11551 -21130 -13731
17453 -13731 -11946 263 -8827 -11666 -18681 -22014 -21738 -15932 -5321 14355 19035 25043 45945 78422
17439 78422 95976 62909 41657 43455 41569 41988 9730 -5372 -751 6838 4503 1858 -9011
17426 -9011 -235 -36 -7171 -770 10374 3146 -10697 -19580 -19649 -15880 -22860 -22017 -14828 -3282 -9621
$$ packed form
17526h606K224j423O137q052l838M467J1662o0k892n874r452l184O839L33O392
17511e327O838N299p556J772j44O471l544K625l581K16L095O321j1642j7298n23
17496a6978J4318J5458j053p764m475j9571j1015N689k792N719N647P606L68q392
17482a7235R89M878K584L513P66j1292K171J599P725K998L921q524l535q554q436
17467b6432K58J1147J9305Q280j2955l724O483J20L366j563n885r951r579P399
17453a3731J785J2209r090k839p015l333K76N806J0611J9676M680O008K0902L2477
17439G8422J7554l3067k1252J798j886M19l2258j5102M621P589k335k645j0869
17426i011Q776J99p135O401J1144p228j3843q883o9L769o980Q43P189J1546o339
$$ plain form
17411 -9621 -18965 -26347 -24159 -18532 -18161 5704 15453 11039 16562 17792 3435 415 6966 31441
17397 31441 35612 22893 5073 -7197 -5440 1422 -6539 -5932 -19 5996 8140 6127 4971 8827
17383 8827 17206 6878 -5220 4047 -12452 -8941 3194 11857 14343 3551 -6878 -4198 1031
17370 1031 -6083 433 -979 4187 4027 -1084 -10871 -10349 1796 -8114 -18384 -24282 -27105 -14552
17356 -14552 -9832 -23982 -29945 -22259 -22576 -19192 -21538 -8308 4791 3675 -4867 -12437 -17373 -21838
17342 -21838 -13825 -4919 2139 5542 550 12929 20808 4632 5523 -3250 -20405 -7107 -3598 -9726
17328 -9726 -18201 -11605 5175 11361 20381 13866 10062 11883 14355 12625 18903 10661 14503 -4729
17314 -4729 -7633 -12351 2638 7321 4371 -1154 -9217 268 18159 21535 20439 20459 18242 14286 -7260
$$ packed form
17411i621r344p382K188N627L71K3865R749m414N523J230j4357l020O551K4475
17397C1441M171j2719j7820j2270J757O862p961O07N913O015K144k013j156L856
17383H827Q379j0328j2098R267j6499L511J2135Q663K486j0792j0429K680N229
17370A031p114O516j412N166j60n111r787N22J2145r910j0270n898k823J2553
17356a4552M720j4150n963P686l17L384k346J3230J3099j116q542p570m936m465
17342b1838Q013Q906P058L403m992J2379P879j6176Q91q773j7155J3298L509o128
17328i726q475O596J6780O186R020o515l804J821K472j730O278q242L842j9232
17314d729k904m718J4989M683k950n525q063R485J7891L376j096K0k217l956k1546
$$ plain form
17299 -7260 -15665 -15976 -16769 -7197 -886 -2400 -10481 -13034 351 14008 16912 403 -13227 -9615
17285 -9615 -5004 -3649 7088 16486 28407 21872 6694 4566 -4984 -13950 -21631 -31616 -35626 -21191
17271 -21191 -8398 -12160 -15508 -7932 1652 6653 -13699 -37968 -35430 -22712 -18684 -5630 -12345
17258 -12345 -17312 -17485 -20139 -15146 6792 1753 2488 -897 -12716 -19601 -12186 -17807 -26292 -18072
17244 -18072 -10672 -8073 -8377 -3504 -4812 -20800 -19065 -13438 -20352 -13668 -4640 15045 9365 -5718
17230 -5718 -5032 7521 8870 -2367 642 -3149 -1179 -17395 -43867 -38253 -17797 -6799 -6388 -5461
17216 -5461 -7053 -4305 -12586 -14874 -11158 -8293 2817 12032 5222 14287 15858 20098 12892 11429
17202 11429 2748 8164 18590 18609 -4664 -12668 -7506 5333 21714 20027 17561 5508 4486 16777
$$ packed form
17299g260q405l11p93R572O311j514q081k553J3385J3657K904j6509j3630L612
17285i615M611J355J0737R398J1921o535j5178k128r550q966p681r985m010J4435
17271b1191J2793l762l348P576R584N001k0352k4269K538J2718M028J3054o715
17258a2345m967j73k654M993K1938n039P35l385j1819o885P415n621q485Q220
17244a8072P400K599l04M873j308j5988J735N627o914O684R028J9685n680j5083
17230e718O86J2553J349j1237L009l791J970j6216k6472N614K0456J0998M11R27
17216e461j592K748q281k288L716K865J1110R215o810R065J571M240p206j463
17202A1429q681N416J0426J9k3273q004N162J2839J6381j687k466j2053j022J2291
$$ plain form
17188 16777 14913 8209 12691 16931 19207 1061 -3393 -6978 -15363 -16206 -23539 -27351 -27368 -36503 -18909
17173 -18909 -13096 -17017 -8474 2131 4216 15878 17274 3661 -6976 -17355 -10196 -1091 -2635
17160 -2635 -1370 8509 28260 30329 24623 19239 22111 22000 17465 9643 5557 782 -476 3443 2745
17145 2745 1975 794 -6203 -14826 -12793 3715 9094 5162 7218 -1371 -7501 -5789 -8627 -17116 -27544
17130 -27544 -34299 -20930 -12132 249 6810 -1809 -4065 -19879 -35567 -26232 -13923 -11030 -23404
17117 -23404 -22009 -21113 -19709 -7149 -1053 6519 12707 13347 7655 248 -15852 -29701 -34032 -26070
17103 -26070 -6812 5686 4750 -274 -8087 -16846 -7425 10336 10761 14622 17 -4319 5224 3655
17089 3655 5686 8797 15684 2309 -5435 -84 1377 10857 19938 12028 4174 -7119 -12870 -4064
$$ packed form
17188A6777j864o704M482M240K276j8146m454l585q385q43p333l812j7r135J7594
17173a8909N813l921Q543J0605K085J1662J396j3613j0637j0379P159R105j544
17160b635J265R879J9751K069n706n384K872j11m535p822m086m775j258L919o98
17145B745p70j181o997q623K033J6508N379l932K056q589o130J712k838q489j0428
17130b7544o755J3369Q798J2381O561q619k256j5814j5688R335J2309K893j2374
17117b3404J395Q96J404J2560O096P572O188O40n692p407j6100j3849m331P962
17103b6070J9258J2498r36n024p813q759R421J7761M25L861j4605m336R543j569
17089C655K031L111O887j3375p744N351J461R480R081p910p854j1293n751Q806
$$ plain form
17075 -4064 6010 6471 -4178 -4957 -4272 -5120 -1350 -5877 -13042 -7856 -12132 -4342 -15554 -16372 -11737
17060 -11737 -4220 2367 7338 15383 12077 4608 14664 23253 3076 -8118 -6348 11190 24333
17047 24333 11699 1158 -8777 -2922 -7232 -11862 -4352 -7271 -8998 -14964 1627 1810 100 -5972
17033 -5972 -14231 -16677 -24542 -24875 -14161 -12404 -13349 -22833 -23614 -16767 -9260 -13733 -20727 -19832 -5949
17018 -5949 -9008 -13490 -2415 -4651 -13561 -21244 -14332 -5400 10396 11098 6507 -1967 -912 -9631
17004 -9631 -18124 -19166 -11690 -7574 926 -8011 -18423 -22567 -18808 -23035 -21825 -10085 -8541 -750
16990 -750 -8455 -21755 -4822 11254 31322 22790 7763 -4255 -6333 394 -1207 3590 2064
16977 2064 -7352 -9767 -17947 -24347 -13430 -6805 -3256 -9231 -11433 -23398 -18351 -17787 -6927 -1809
$$ packed form
17075d064J0074M61j0649p79O85q48L770m527p165N186m276P790j1212q18M635
17060a1737P517O587M971Q045l306p469J0056Q589k0177j1194J770J7538J3143
17047B4333j2634j0541r935N855m310m630P510k919j727n966J6591J83j710o072
17033e972q259k446p865l33J0714J757r45r484p81O847P507m473o994Q95J3883
17018e949l059m482J1075k236q910p683O912Q932J5796P02m591q474J055q719
17004i631q493j042P476M116Q500q937j0412m144L759m227J210J1740J544P791
16990g50p705j3300J6933J6076K0068q532j5027j2018k078O727j601M797j526
16977B064r416k415q180o400J0917O625L549n975k202j1965N047N64J0860N118
$$ plain form
16963 -1809 -6787 -5198 -4955 -386 9339 11154 1556 -6424 -11636 -13982 -24867 -15625 -14095 -22203 -26592
16948 -26592 -21666 -13333 -9072 -4667 -4399 -7559 -2301 6373 16285 7199 4162 -6209 -4180 -7894
16934 -7894 -15369 -16509 -17548 -12153 -12692 4220 15528 12922 13598 16499 15793 12442 1544 -1789 5977
16919 5977 7524 -2876 2305 8273 14352 24783 34160 25185 19713 27902 27374 32996 31301 19217
16905 19217 14494 15729 27203 30156 26360 19631 19018 1016 -18914 -18471 -21051 -12625 -13939 -20155
16891 -20155 -17984 -14194 -13783 -1592 16576 11919 9522 7924 -2952 -1315 -3786 -15325 -22300 -19880
16877 -19880 1294 11001 7156 9793 4690 -1486 1178 -1442 -2538 -7523 -11968 -8437 -16059 -13800
16863 -13800 -18420 -29794 -20966 -12089 -9870 -7947 -7228 2347 4436 1448 4602 6960 7710 2984 5089
$$ packed form
16963a809m978J589K43M569R725J815r598p980n212k346j0885R242J530q108m389
16948b6592M926Q333M261M405K68l160N258Q674R912r086l037j0371K029l714
16934g894p475j140j039N395n39J6912J1308k606O76K901p06l351j0898l333P766
16919E977J547j0400N181N968O079J0431R377q975n472Q189n28N622j695j2084
16905A9217m723J235J1474K953l796o729o13j8002j9930M43k580Q426j314o216
16891b0155K171L790M11J2191J8168m657k397j598j0876J637k471j1539o975K420
16877a9880K1174R707l845K637n103o176K664k620j096m985m445L531p622K259
16863a3800m620j1374Q828Q877K219J923P19R575K089k988L154K358P50m726K105
$$ plain form
16848 5089 9028 -731 -3840 -18752 -23887 -22100 -3895 11422 10758 2639 -23463 -29903 -12583 4220
16834 4220 5448 13526 11423 14010 -3329 -5822 -3258 -9033 -6009 -12202 -16218 -3915 2984 16047
16820 16047 9929 4313 -1619 -1331 7742 9457 13717 15176 18367 5746 -2017 -1510 -8824 -3101 -2292
16805 -2292 -7645 -10692 3925 10688 12239 7176 -3898 -10262 -20932 -13517 458 -14618 -10379
16792 -10379 4243 8868 21265 -427 -10324 -13535 -10917 -10869 1378 3576 -3370 -9335 -16698 -17585
16778 -17585 -8857 3204 5509 5041 6041 7212 149 -12026 -12833 -8109 749 -217 -6610 474 -2085
16763 -2085 -7558 -9894 -11591 -11725 -14934 -17589 -35720 -29684 -10203 -16037 -22597 -26356 -14174 -10192
16749 -10192 -5958 -11168 -9594 -9645 -5610 -12085 -5972 -1468 6186 11183 14203 19132 8664 -7863
$$ packed form
16848E089L939r759l109j4912n135J787J8205J5317o64q119k6102o440J7320J6803
16834D220J228Q078k103K587j7339k493K564n775L024o193m016J2303O899J3063
16820A6047o118n616n932K88R073J715M260J459L191j2621p763N07p314N723Q09
16805b292n353l047J4617O763J551n063j1074o364j0670P415J3975j5076M239
16792a0379J4622M625J2397k1692r897l211K618M8J2247K198o946n965p363q87
16778a7585Q728J2061K305m68J000J171p063j2175q07M724Q858r66o393P084k559
16763b085n473k336j697j34l209k655j8131O036J9481n834o560l759J2182L982
16749a0192M234n210J574n1M035o475O113M504P654M997L020M929j0468j6527
$$ plain form
16735 -7863 -3466 4323 12163 21961 8799 4413 7920 17032 28398 23511 9829 -4524 -957 7446
16721 7446 4275 -9906 -17005 -13291 -4714 -14025 -9337 897 -19922 -25107 -21116 -19564 -14886 -17389
16707 -17389 -9191 -2391 -607 5172 -5131 -15866 -12933 -23427 -30370 -25735 694 11688 11206
16694 11206 8702 17496 22829 12573 -6933 -15453 -22771 -22254 -320 -2101 -16064 -15332 -16032 -11799
16680 -11799 -3647 -5722 -14539 -11331 -12077 -8537 -1219 6390 12222 18261 4322 723 6215 2562
16666 2562 -8092 708 8467 5316 10353 3555 952 -11135 -20192 -19886 -15971 -23039 -10920 -24701
16652 -24701 -29593 -3047 9740 -1983 -11021 -2 23974 34871 43333 38289 34266 28998 13563
16639 13563 9965 -2048 -7009 -4807 -7947 -12893 -10052 -5365 -15482 -18578 -12770 -8319 -4267 -268
$$ packed form
16735g863M397P789P840R798j3162m386L507R112J1366m887j3682j4353L567Q403
16721G446l171j4181p099L714Q577r311M688J0234k0819n185L991J552M678k503
16707a7389Q198O800J784N779j0303j0735K933j0494o943M635K6429J0994m82
16694A1206k504Q794N333j0256j9506q520p318N17K1934j781j3963P32p00M233
16680a1799Q152k075q817L208p46L540P318P609N832O039j3939l599N492l653
16666B562j0654Q800P759l151N037o798k603j2087r057L06L915p068J2119j3781
16652b4701m892K6546J2787j1723r038J1019K3976J0897Q462n044m023n268j5435
16639A3563l598j2013m961K202l140m946K841M687j0117l096N808M451M052L999
$$ plain form
16625 -268 457 7770 8131 835 7477 9509 3132 -8739 -1956 -4196 -8904 7981 7771 1700 -5873
16610 -5873 -19649 -12300 -18197 -25542 -27364 -23179 -20708 -14492 -8384 -4418 -8748 -5508 5264 6806
16596 6806 14682 18733 16947 4931 -4585 -11407 -28027 -39321 -32092 -13819 -3020 -3878 -4621 -8315
16582 -8315 -4585 -7497 -12486 -13779 -13104 -13684 -4157 5517 -7039 -13114 -861 -3092 -2542 -246 -9536
16567 -9536 -18186 -29667 -29032 -23000 -21495 -6553 -2052 2324 -11707 -23854 -17783 -13779 -10154 -9253
16553 -9253 -9963 -16139 -17695 -8673 -13807 6558 6968 -9606 -25817 -33007 -27397 -17537 -9893 9816
16539 9816 4815 995 2540 -6841 -13992 -15864 -13713 -12221 -3845 3686 -99 7033 12985 4720 -7018
16524 -7018 2613 3559 -3621 -451 4002 3138 -8891 -9183 -4303 13289 -4124 -17441 -23515 -21046
$$ packed form
16625b68P25P313L61p296O642K032o377j1871O783k240m708J6885k10o071p573
16610e873j3776P349n897p345j822M185K471O216O108L966m330L240J0772J542
16596F806P876M051j786j2016r516o822j6620j1294P229J8273J0799q58p43l694
16582h315L730k912m989j293O75n80R527R674j2556o075J2253k231N50K296r290
16567i536q650j1481O35O032J505J4942M501M376j4031j2147O071M004L625R01
16553i253p10o176j556R022n134K0365M10j6574j6211p190N610R860P644J9709
16539I816n001l820J545r381p151j872K151J492Q376P531l785P132N952q265j1738
16524g018R631R46p180L170M453q64j2029k92M880J7592j7413j3317o074K469
$$ plain form
16510 -21046 -10630 -2395 15013 14797 12714 8538 8034 -8949 -14284 -11372 -6043 3793 9418 3100
16496 3100 2212 -6733 -8108 -6682 -5854 -12393 -14201 -12707 -6894 -8691 -8350 -13970 -29057 -42430 -34917
16481 -34917 -19850 -21330 -18942 -29122 -27925 -38593 -41329 -34203 -37084 -39202 -31750 -16360 -9293
16468 -9293 -3371 -5420 5985 3985 -3080 -12114 -15745 -13752 -5585 -8854 -15154 -20796 -15825 -19764
16454 -19764 -17441 2736 -2871 -5326 13401 20961 16739 17396 36706 37205 34997 41146 31504 6062
16440 6062 6875 15346 9008 1958 -400 -9311 -18929 -7840 -4418 -281 8810 -14770 -24993 -27064
16426 -27064 -19526 -3062 5189 3792 -2692 -5602 1224 7978 12343 16205 170 -10289 -15871 -19966
16412 -19966 -8274 2645 3829 -4507 -954 -11955 -18955 -20698 -31555 -24891 -12642 -17724 -14346
$$ packed form
16510b1046J0416Q235J7408k16k083m176n04j6983n335K912N329R836N625o318
16496C100q88q945j375J426Q28o539j808J494N813j797L41n620j5087j3373P513
16481c4917J5067j480K388j0180J197j0668k736P126k881k118P452J5390P067
16468i293N922k049J1405k000p065r034l631J993Q167l269o300n642M971l939
16454a9764K323K0177n607k455J8727P560m222O57J9310M99k208O149r642k5442
16440F062Q13Q471o338p050k358q911r618J1089L422M137R091k3580j0223k071
16426b7064P538J6464Q251j397o484k910O826O754M365L862j6035j0459n582m095
16412a9966J1692J0919J184q336L553j1001p000j743j0857O664J2249n082L378
$$ plain form
16399 -14346 -23476 -21822 -11659 -10211 -12646 944 4775 -2197 -7035 -9019 -7003 -933 245 4034
16385 4034 6409 -4654 -16987 -13971 -11845 -18421 -28235 -10368 -10249 -18646 -5991 -8366 -9998 -4815
16371 -4815 -4202 -9564 -9936 -3993 -9262 -3476 11077 2954 -9653 -18946 -15839 5291 5698 -6246
16357 -6246 -5404 -1086 -1064 -8940 -10376 4518 -1273 11208 16367 14148 7606 -1625 -8213 300 199
16342 199 -14634 -9029 -9221 4584 6307 -2947 -6857 -1263 -136 1220 -6220 -13248 -12861 -11625 -22656
16327 -22656 -27287 -24877 -17515 -20845 -25509 -18318 -18255 -26835 -29033 -22263 -15985 -6794 -5029 -12547 -12845
16312 -12845 -10300 4105 567 -11776 -22133 -4342 11360 17160 21109 11316 -3849 -7157 -13942
16299 -13942 -11763 -9548 -8095 -11177 -24712 -21273 -18915 -9798 6828 9953 364 -7833 -11108 -5736
$$ packed form
16399a4346r130J654J0163J448k435J3590L831o972m838j984K016O070J178L789
16385D034K375j1063j2333L016K126o576r814J7867J19q397J2655k375j632N183
16371d815O13n362l72N943n269N786J4553q123j2607r293L107K1130M07j1944
16357f246Q42M318K2p876j436J4894n791J2481N159k219o542r231o588Q513j01
16342A99j4833N605j92J3805J723r254l910N594J127J356p440p028L87J236j1031
16327b2656m631K410P362l330m664P191O3q580k198O770O278R191J765p518k98
16312a2845K545J4405l538j2343j0357J7791J5702N800L949r793j5165l308o785
16299a3942K179K215J453l082j3535L439K358R117J6626L125r589q197l275N372
$$ plain form
16285 -5736 -1240 -1683 6003 -8119 -6797 104 -3247 -10583 -8525 -8557 -18634 -10292 -5747 -15057 -10622
16270 -10622 -6920 -5474 -211 4100 17446 22035 16661 8373 6595 5063 9416 16432 19001 1638
16256 1638 -6622 -1194 -22574 -30401 -44029 -31630 -6294 5385 6045 6212 8313 7453 5578 11352
16242 11352 7890 13522 15036 15025 14005 -223 -14363 -22924 -22356 -14787 -4756 8655 7286 4437
16228 4437 11593 22968 21738 7334 12636 18124 15394 13195 11812 13534 1673 -8111 -8027 -1695
16214 -1695 7289 7072 -7612 -3466 4426 -493 -6589 -7765 -3326 -3908 -13022 -15131 -18553 -18899 -22595
16199 -22595 -23258 -14379 7912 13568 15585 15354 -734 -10867 -12568 -8931 -3883 1841 2720 -1647
16185 -1647 4830 4457 9799 9668 -6703 -7687 -4205 -7421 -5918 -7730 6506 6333 -5391 -12851 -25260
$$ packed form
16285e736M496m43P686j4122J322O901l351p336K058l2j0077Q342M545r310M435
16270a0622L702J446N263M311J3346M589n374q288j778j532M353P016K569j7363
16256A638q260N428k1380p827j3628J2399K5336J1679O60J67K101q60j875N774
16242A1352l462N632J514j1j020j4228j4140q561N68P569J0031J3411j369k849
16228D437P156J1375j230j4404N302N488k730k199j383J722j1861r784Q4O332
16214a695Q984k17j4684M146P892m919o096j176M439n82r114k109l422l46l696
16199b2595o63Q879K2291N656K017k31j6088j0133j701L637N048N724Q79m367
16185a647O477l73N342j31j6371r84L482l216J503j812J4236j73j1724p460j2409
$$ plain form
16170 -25260 -27767 -30639 -17091 690 5602 -4944 -8202 -2753 869 -3846 -3573 -10499 -13481 -25345
16156 -25345 -22540 -20615 -21490 -11085 -6676 10635 5252 -3894 4282 10562 7347 2306 -2271 -9699
16142 -9699 -16679 106 21836 28752 24481 -1014 -15110 -11353 -16494 -9919 5720 -1106 -12528
16129 -12528 -14007 -11020 -1730 4954 11730 -7197 -15428 -12983 -2304 2476 6982 3951 -4628 -12227
16115 -12227 -4984 -8792 -14374 -8759 -12306 -6298 -4770 -2336 1131 9096 10126 12187 6524 -5626
16101 -5626 -10393 -12593 -16015 -15340 -4896 -1314 3445 -7796 -8992 -4971 -23186 -26725 -19475 -7784
16087 -7784 9252 20609 8020 -2814 8952 6844 3361 323 -15867 -5765 899 7889 1056
16074 1056 -16904 -9716 -6393 -11552 -24838 -29709 -19279 -11676 -21676 -21245 -8412 5975 14429
$$ packed form
16170b5260k507k872J3548J7781M912j0546l258N449L622m715K73o926k982j1864
16156b5345K805J925q75J0405M409J7311n383r146Q176O280l215n041m577p428
16142i699o980J6785K1730O916m271k5495j4096L757n141O575J5639o826j1422
16129a2528j479K987R290O684O776j8927q231K445J0679M780M506l031q579p599
16115a2227P243l808n582N615l547O008J528K434L467P965J030K061n663j2150
16101e626m767k200l422O75J0444L582M759j1241j196M021j8215l539P250J1691
16087g784J7036J1357j2589j0834J1766k108l483l038j6190J0102O664O990o833
16074A056j7960P188L323n159j3286m871J0430P603j0000M31J2833J4387Q454
$$ plain form
16061 14429 9121 1655 -1139 4712 12213 15817 3633 -9639 -3266 -1082 8695 7410 9965 10910
16047 10910 -4717 -7662 -9717 -20455 -9695 -3325 -7399 -20046 -20563 -24421 -16910 -4016 -3989 -10574
16033 -10574 -27227 -28474 -25829 -23995 -4439 -6591 -3814 -7289 -10897 -19268 -20994 -27150 -23084 -28250
16019 -28250 -31611 -22652 -25924 -24267 -17544 -14795 -1181 -2404 -2520 1839 -3018 -3106 -3915 8173 17641
16004 17641 15867 7498 5195 594 -9898 -24349 -36246 -26822 -14741 -5322 2521 14367 20581
15991 20581 14047 8304 11058 10978 14523 12603 13371 6568 -9520 3551 10151 12616 12275 7722 13069
15976 13069 9087 6469 10343 11550 3729 -2520 -4303 -7216 -7856 -4496 -5574 -3461 1499 -2902 -5788
15961 -5788 -3270 210 5024 -1279 -5400 -14233 -11238 1216 4746 -6232 -8123 -9924 -13296 -21319
$$ packed form
16061A4429n308p466k794N851P501L604j2184j3272O373K184R777j285K555R45
16047A0910j5627k945k055j0738J0760O370m074j2647n17l858P511J2894K7o585
16033a0574j6653j247K645J834J9556k152K777l475l608q371j726o156M066n166
16019b8250l361Q959l272J657O723K749J3614j223j16M359m857q8q09J2088R468
16004A7641j774q369k303m601j0492j4451j1897R424J2081R419P843J1846O214
15991B0581o534n743K754q0L545j920P68o803j6088J3071O600K465l41m553N347
15976A3069l982k618L874J207p821o249j783k913o40L360j078K113M960m401k886
15961e788K518L480M814o303m121q833K995J2454L530j0978j891j801l372q023
$$ plain form
15947 -21319 -10408 3245 9953 -2508 -10708 2387 5191 3812 -3272 -6516 -11852 -1424 11231
15934 11231 16530 22915 25396 28870 31960 21879 21356 20989 25606 23235 10408 -3511 -5283 -9544
15920 -9544 -19519 -23815 -34629 -30465 -9565 3819 5950 2370 14620 1100 -4244 12456 14122
15907 14122 11646 8891 -5578 936 8020 18423 15254 7451 -1081 -6140 -9951 -16058 -1900 19302
15893 19302 19296 10099 -3113 4915 3768 -4960 -9148 -18160 -9170 -4854 1812 -6634 -17586 -29588
15879 -29588 -11635 8478 8708 -3483 -22749 -14297 -11430 -3810 -6334 -8714 -14328 -6970 -7355 -11622
15865 -11622 -12800 -19919 -14650 -4537 -5556 -16142 -18553 -12938 -1979 -7078 -2254 -3839 -3633 -18088
15851 -18088 -25980 -21440 -10278 -12946 -4822 -81 -2857 -5156 -11552 -15280 -22810 -28214 -24213 -18347
$$ packed form
15947b1319J0911J3653O708j2461q200J3095K804j379p084l244n336J0428J2655
15934A1231N299O385K481L474L090j0081n23l67M617k371j2827j3919j772m261
15920i544r975m296j0814M164K0900J3384K131l580J2250j3520n344J6700J666
15907A4122k476k755j4469O514P084J0403l169p803q532n059l811o107J4158K1202
15893A9302or197j3212Q028j147q728m188r012Q990M316O666q446j0952j2002
15879b9588J7953K0113K30j2191j9266Q452K867P620k524k380n614P358l85m267
15865a1622j178p119N269J0113j019j0586k411N615J0959n099M824j585K06j4455
15851a8088p892M540J1162k668Q124M741k776k299o396l728p530n404M001N866
$$ plain form
15837 -18347 -17469 -6376 -1999 -1989 -1188 -5747 -1061 -9254 -17964 -5634 -6177 -10716 -7293 -13462 -14220
15822 -14220 -3010 9424 6959 4765 8753 1025 -9720 -437 11174 14458 19154 14766 13004
15809 13004 6992 -4698 -18067 -32234 -21759 -13447 -10169 -7509 9554 -2296 1075 7884 16737
15796 16737 21902 2823 -8397 -12086 -8916 -2697 -1166 9816 6167 8726 10168 21155 26961
15783 26961 26910 22325 4443 -13046 -30429 -26784 -28580 -26260 -235 7418 -2272 -397 8277 25038
15769 25038 17866 19352 6227 -7559 -10045 -1411 3267 4128 -6684 -6995 -5588 -7854 -7462 -6718 -6293
15754 -6293 -3190 -1502 -13528 -12058 -4874 -5420 10137 27578 27708 14884 14474 22025 28623 20120
15740 20120 9622 -368 595 2254 3410 -4931 10156 19903 21034 2542 -1802 6865 10722 10664
$$ packed form
15837a8347Q78J1093M377J0Q01m559M686q193q710J2330n43m539L423o169p58
15822a4220J1210J2434k465k194L988p728j0745R283J1611L284M696m388j762
15809A3004o012j1690j3369j4167J0475Q312L278K660J7063j1850L371O809Q853
15796A6737N165j9079j1220l689L170O219J531J0982l649K559J442J0987N806
15783B6961n1m585j7882j7489j7383L645j796K320K6025P653r690J875Q674J6761
15769B5038p172J486j3125j3786k486Q634M678Q61j0812l11J407k266L92P44M25
15754f293L103J688j2026J470P184n46J5557J7441J30j2824m10P551O598q503
15740B0120j0498r990R63J659J156q341J5087R747J131j8492m344Q667L857n8
$$ plain form
15726 10664 17151 26004 25262 10459 -1158 3921 580 -9274 -12289 -7913 -9364 7809 16956 9203
15712 9203 -3907 -13482 -23329 -21312 -26034 -15935 -23129 -19796 -18514 -9496 -6121 -6057 -11022 -9234 4506
15697 4506 3129 -2794 -4506 -8713 -24490 -26119 -13988 -18282 -19212 -10555 -23065 -28914 -7908 -9303
15683 -9303 -3957 8138 9133 23005 26991 16049 18695 19052 13467 8853 13492 12877 9028 10112 751
15668 751 522 2492 14593 19922 14720 7321 13661 33045 27279 31068 32229 21854 9021 3629
15654 3629 -2465 -10835 -11908 -7166 839 7742 -2122 5354 1159 -4841 -15087 -20188 -2303 -4032
15640 -4032 -7548 -2652 -2845 3084 12496 7125 11374 16693 10256 11018 -7569 5861 7468 12466 4525
15625 4525 9419 16766 7619 -3679 -4259 -13622 -10249 -6135 -16770 -6156 -5942 -6682 4155 23752
$$ packed form
15726A0664O487Q853p42j4803j1617N079l341r854l015M376j451J7173R147p753
15712I203j3110r575r847K017m722J0099p194L333J282R018L375O4m965J788J3740
15697D506j377n923j712m207j5777j629J2131m294r30Q657j2510n849K1006j395
15683i303N346J2095R95J3872L986j0942K646L57n585m614M639o15l849J084r361
15668G51k29J970J2101N329n202p399O340J9384n766L789J161j0375j2833n392
15654C629o094q370j073M742Q005O903r864P476m195o000j0246n101J7885j729
15640d032l516M896j93N929R412n371M249N319o437P62j8587J3430J607M998p941
15625D525M894P347r147j1298n80r363L373M114j0635J0614K14p40J0837J9597
$$ plain form
15611 23752 18063 13586 9666 3749 5169 12552 6977 564 -5126 -13583 -5874 7178 12115 12265
15597 12265 2460 -5361 -12460 -752 11439 16074 3934 -4162 -17156 -19828 -21150 -1284 15169
15584 15169 9247 3844 15222 11455 5877 9770 10159 24370 26741 15432 4041 -5898 -10343 -9837
15570 -9837 -15774 -11194 -11996 -16008 -10766 946 13075 17600 6497 -6273 -5022 -12166 -20116 -10932
15556 -10932 5067 11839 14988 1927 563 3615 9450 17976 16928 14323 24291 12471 10477 12843
15542 12843 11018 10109 3942 7584 -2757 -3640 2772 -5573 -14594 -5741 1386 17867 27457 29668
15528 29668 21314 6308 -3212 -8629 -604 7843 2617 -11523 -26780 -23129 -12766 1119 7758
15515 7758 -329 9466 16549 13418 12216 20915 16234 9370 8425 -1753 -9905 -8468 -1491 -1715 -1904
$$ packed form
15611B3752n689m477l920n917J420P383n575o413n690q457P709J3052M937J50
15597A2265r805p821p099J1708J2191M635j2140q096j2994k672j322J9866J6453
15584A5169n922n403J1378l767n578L893L89J4211K371j1309j1391r939m445N06
15570i837n937M580q02m012N242J1712J2129M525j1103j2770J251p144p950R184
15556a0932J5999O772L149j3061j364L052N835Q526j048k605R968j1820j994K366
15542A2843j825r09o167L642j0341q83O412q345r021Q853P127J6481R590K211
15528B9668q354j5006r520n417Q025Q447n226j4140j5257L651J0363J3885O639
15515G758q087R795P083l131j202Q699m681o864r45j0178q152J437O977k24j89
$$ plain form
15500 -1904 14071 12243 -206 -4920 -8639 5424 18045 16408 15518 7440 -208 -9787 -8461 -19094
15486 -19094 -25756 -26464 -37405 -34221 -21851 -13795 -5118 1968 10043 11128 2649 2299 368 721 2487
15471 2487 -1487 759 15491 26273 20703 9255 12587 8045 -4276 -4839 3578 6704 7203 25546
15457 25546 24269 7059 -1186 -4091 -11520 -6334 6036 -1551 -786 5588 5403 -3362 -5677 2554
15443 2554 -3096 -4008 4187 8527 4485 6133 -2508 -8715 -8404 -13499 -10179 3295 12179 5235 -1662
15428 -1662 7872 11822 6485 3900 10510 -3771 -19412 -25559 -20205 -18585 -27218 -34039 -21550 -6327
15414 -6327 -2102 7313 2817 -12657 -20882 -17976 -13188 -18419 -5274 11083 11781 18112 30441 23488
15400 23488 5112 12750 12572 4128 420 -9158 -14073 -19204 -15524 -8632 -4362 2193 -1701 9499
$$ packed form
15500a904J5975j828j2449m714l719J4063J2621j637q90q078p648r579J326j0633
15486a9094o662p08j0941L184J2370Q056Q677P086Q075J085q479l50j931L53J766
15471B487l974K246J4732J0782n570j1448L332m542j2321n63Q417L126M99J8343
15457B5546j277j7210q245k905p429N186J2370p587P65O374j85q765k315Q231
15443B554n650r12Q195M340m042J648q641o207L11n095L320J3474Q884o944o897
15428a662R534L950n337k585O610j4281j5641o147N354J620q633o821J2489J5223
15414f327M225R415m496j5474q225K906M788n231J3145J6357O98O331J2329o953
15400B3488j8376P638j78q444l708r578m915n131L680O892M270O555l894J1200
$$ plain form
15386 9499 6144 3352 -4540 -4073 -8237 -25504 -27709 -22764 -18453 -17135 -23620 -15875 -16842 -12966 -346
15371 -346 -2957 5923 9285 3027 -188 8440 16689 26616 12894 348 -12028 -6573 3048 5428
15357 5428 8993 1305 8774 20261 21846 76 -8903 458 3196 -14507 -21392 -11620 -2319 -1023
15343 -1023 4483 10558 14622 6995 -2970 2458 8006 3778 -1485 -8364 4977 3457 -6536 -5332
15329 -5332 -1917 -5440 -22902 -24946 -10246 -7223 -16389 -7190 7020 12050 11262 20806 20408 10955
15315 10955 16911 16988 -2889 -12859 -8813 -14636 -22653 -21063 -28575 -44083 -36150 -25658 -13163 -13241
15301 -13241 -13494 -4344 -4696 -6217 6123 1979 -7584 -5741 -6381 -3434 -2242 -12887 -19206 -8297
15287 -8297 -3114 -13814 -12016 1543 10826 5872 6725 -1537 1863 10753 13747 -2543 194 17656
$$ packed form
15386I499l355k792p892M67m164j7267k205M945M311J318o485P745r67L876J2620
15371c46k611Q880L362o258l215Q628Q249R927j3722j2546j2376N455R621K380
15357E428L565p688P469J1487J585k1770q979R361K738j7703o885R772R301J296
15343a023N506O075M064p627r965N428N548m228n263o879J3341j520r993J204
15329e332L415l523j7462k044J4700L023r166R199J4210N030p88R544l98r453
15315A0955N956P7j9877r970M046n823q017J590p512j5508P933J0492J2495p8
15301a3241k53R150l52j521J2340m144r563J843o40K947J192j0645o319J0909
15287h297N183j0700J798J3559R283m954Q53q262L400Q890K994j6290K737J7462
$$ plain form
15273 17656 12964 6929 1697 -2192 5183 16839 6171 -6379 -24285 -27637 -12554 -15810 -13261
15260 -13261 -1067 -4271 -11417 -13356 -13410 -8658 10548 18508 16690 -3563 -15906 -14656 -18035 -22465
15246 -22465 -21243 -13911 -20406 -25804 -21036 -14173 -12654 3234 6179 -3512 -5223 13438 20863 7439
15232 7439 -13761 -27135 -37770 -32758 -26581 -16644 -6320 -8501 -3500 -7734 -3069 -4717 -770 902
15218 902 -4329 -14279 -13417 -3594 1984 -8675 -13047 -9925 -4678 9575 5757 -6648 -2895 17802
15204 17802 9450 5009 -698 4275 18825 14828 9351 6032 -73 -5196 -8663 194 15188 15954
15190 15954 9487 10544 5538 7884 9773 1872 4670 7077 10803 8687 5632 3150 5862 1910
15176 1910 -1453 -10416 -9474 -5189 -14250 -11890 -3011 2061 16 -3123 -2939 -11349 -14083 -14281 1533
$$ packed form
15273A7656m692o035n232l889P375J1656j0668j2550j7906l352J5083l256K549
15260a3261J2194l204p146j939n4M752J9206P960j818k0253j2343J250l379m430
15246b2465J222P332o495n398M768O863J519J5888K945r691j711J8661P425j3424
15232G439k1200j3374j0635N012O177R937J0324k181N001m234M665j648L947J672
15218I02n231r950Q62R823N578j0659m372L122N247J4253l818j2405L753K0697
15204A7802q352m441n707M973J4550l997n477l319o105n123l467Q857J4994P66
15190A5954o467J057n006K346J889p901K798K407L726k116l055k482K712l952
15176A910l363q963R42M285r061K360Q879N072k045l139J84q410k734j98J5814
$$ plain form
15161 1533 9747 8109 -3738 -7109 5776 -9626 -10248 1173 -3140 3447 1858 -681 -8305 -5926
15147 -5926 3432 2142 -334 6220 11650 8369 15765 4331 -18465 -33843 -28674 -20684 -7638 -11134
15133 -11134 -13269 -7247 -2633 -2596 -9499 -5472 -18733 -18919 -14782 54 3293 -11226 -23228 -26082
15119 -26082 -18272 -9991 -1866 7262 -2504 -12969 -10727 -11742 -14844 -15934 -9855 2772 27 4301
15105 4301 20754 24197 4835 -14882 -13403 -1414 4549 -1276 -7322 -456 -2701 -3904 -9349 -16235
15091 -16235 -22949 -9230 -5487 4104 12443 -4135 -18189 -11758 -6811 -4436 -1105 -1464 -10345 -10469
15077 -10469 5081 80 -10575 -24544 -8581 6822 3957 -6757 -9151 478 7017 -3507 -9947
15064 -9947 -11964 -14362 -438 -7322 -6919 4050 9853 25063 13022 5446 112 -14371 -8351 -1836
$$ packed form
15161A533Q214j638j1847l371J2885j5402o22J1421m313O587j589k539p624K379
15147e926R358j290k476O554N430l281P396j1434k2796j5378N169P990J3046l496
15133a1134k135O022M614L7o903M027j3261j86M137J4836L239j4519j2002k854
15119b6082P810Q281Q125R128r766j0465K242j015l102j090O079J2627k745M274
15105D301J6453L443j9362j9717J479J1989N963n825o046O866k245j203n445o886
15091a6235o714J3719L743R591Q339j6578j4054O431M947K375L331l59q881j24
15077a0469J5550n001j0655j3969J5963J5403k865j0714k394R629O539j0524o440
15064i947k017k398J3924o884M03J0969N803J5210j2041p576n334j4483O020O515
$$ plain form
15050 -1836 -3821 -2110 -215 -5781 -7697 -3810 -6457 2714 1090 5799 5465 668 -4939 9136 11143
15035 11143 10448 18299 26293 10026 6830 8825 14077 6305 441 -2109 -4957 -9471 -2083 5442
15021 5442 5184 -4516 -9533 -12433 -3681 5973 14555 5466 1719 -212 -972 -4708 -4523 -9176 -23791
15006 -23791 -21057 -23642 -24225 -15404 -6694 -5320 -2656 -16240 -21211 -17841 -7039 480 14795 30609
14992 30609 21009 1634 -3669 3672 14263 8772 -24266 -26608 -29750 -21880 -8083 -8499 -13632 -15105
14978 -15105 -12530 -16777 -19026 -14577 -14096 -8892 2184 2680 4531 1793 296 -1292 -8132 -3566 10162
14963 10162 31000 26069 18289 10504 8267 -9465 -19674 -20983 -17712 -11284 -12778 -4077 1565 -1188
14949 -1188 16695 21080 23801 16426 3327 13966 523 -12645 -4997 14232 10352 5609 7580
$$ packed form
15050a836j985J711J895n566j916L887k647R171j624M709l34m797n607J4075K007
15035A1143o95P851P994j6267l196J995N252p772n864k550k848m514P388P525
15021E442k58r700n017k900Q752R654Q582r089l747j931p60l736J85m653j4615
15006b3791K734k585n83Q821Q710J374K664j3584m971L370J0802P519J4315J5814
14992C0609r600j9375n303P341J0591n491l3038k342l142P870J3797m16n133j473
14978a5105K575m247k249M449M81N204J1076M96J851k738j497j588o840M566J3728
14963A0162K0838m931p780p785k237j7732j0209j309L271O428j494Q701N642k753
14949a188J7883M385K721p375j3099J0639j3443j3168P648J9229l880m743J971
$$ plain form
14936 7580 7910 854 11095 28699 18855 4323 -1384 -3979 -12897 -10215 5894 1862 -9576 -10081
14922 -10081 -6889 -3397 -230 -593 -12026 -11584 -1621 -410 -13812 -19181 -12384 -12723 -4205 1927 -4053
14907 -4053 -8349 -7533 7456 1464 -6639 7163 -380 -13858 -11641 -15751 -8607 5676 4464 4579
14893 4579 8112 3046 -10424 -16871 -24299 -15597 -9895 -9465 -16278 -14027 -14899 -12170 -15048 -5576 5715
14878 5715 12391 18174 13147 -4245 -20887 -26035 -18192 3888 19238 13787 6210 -2450 -9421 5515
14864 5515 12828 12375 -90 -10728 -11581 -12370 -3776 312 -10497 -6955 -11181 -9069 -4048 -5537 2567
14849 2567 8558 -3808 -11992 -20213 -3310 9021 20 153 9061 10916 5544 3077 3861 -2407
14835 -2407 -1615 6316 -3947 14357 23803 10035 -1160 -13397 -26706 -25379 -28784 -20572 -11217
$$ packed form
14936G580L30p056J0241J7604r844j4532n707k595q918K682J6109m032j1438n05
14922a0081L192L492L167l63j1433M42R963J211j3402n369O797l39Q518O132n980
14907d053m296Q16J4989n992q103J3802p543j3478K217m110P144J4283j212J15
14893D579L533n066j3470o447p428Q702N702M30o813K251q72K729k878R472J1291
14878E715O676N783n027j7392j6642n148P843K2080J5350n451p577q660o971J4936
14864E515P313m53j2465j0638q53p89Q594M088j0809L542m226K112N021j489Q104
14849B567N991j2366q184q221J6903J2331r001J33Q908J855n372k467P84o268
14835b407P92P931j0263J8304R446j3768j1195j2237j3309J327l405Q212R355
$$ plain form
14822 -11217 -24801 -21031 -6436 6165 2662 1305 -4835 -10047 -28585 -37846 -31184 -8669 4381
14809 4381 1414 12326 25946 28298 11544 6233 9440 5688 4438 10636 14333 4266 -10000
14796 -10000 -5445 -1848 -8724 -8899 -1180 15228 23784 23903 18299 11277 10530 19068 28159 23907 -8372
14781 -8372 -14829 -4599 -4185 -5544 -5829 -3140 -660 -5324 -4757 -6335 -7377 -817 1730 -8173 -15211
14766 -15211 -31002 -31298 -15461 -6043 -6891 427 -2390 -11609 -13377 -16101 -8639 -12146 -10785 -13439
14752 -13439 -8255 -12188 -22147 -21087 -24805 -21110 -16004 -14266 -3602 6312 1395 -10612 -4202 4172
14738 4172 3746 2116 -379 2563 -2993 6517 6614 -2153 1117 10115 10146 3437 4812 -1369 5999 3834
14722 3834 6062 4854 -453 -7689 -6610 -12428 -10647 -5033 -9603 -17920 -19928 -9590 3246 5972
$$ packed form
14822a1217j3584L770J4595J2601l503j357o140n212j8538r261O662K2515J3050
14809D381k967J0912J3620K352j6754n311L207l752j250O198L697j0067j4266
14796a0000M555L597o876j75P719J6408Q556J19n604p022p47Q538R091m252l2279
14781h372o457J0230M14j359k85K689K480m664N67j578j042O560K547r903p038
14766a5211j5791k96J5837R418q48P318k817r219j768k724P462l507J361k654
14752a3439N184l933r959J060l718L695N106J738J0664R914m917j2007O410Q374
14738D172m26j630k495K942n556R510R7q767L270Q998L1o709J375o181P368k165
14722C834K228j208n307p236J079n818J781N614m570q317k008J0338J2836K726
$$ plain form
14708 5972 401 -12882 -11657 -3587 -1760 -5510 -9746 -6700 -7817 -5478 83 -7723 -7683 6221 9019
14693 9019 7226 3381 7283 16483 12901 1463 -16944 -16492 -7151 -118 3568 -10706 -25754 -28643
14679 -28643 -36040 -25087 -6737 -6194 -13066 -23909 -33429 -31732 -23802 -9380 1317 7462 5871
14666 5871 -547 -20155 -27786 -27789 -27317 -13047 -15555 -15127 -11518 -10872 -15034 -20972 -11011 -9592 -7392 4346
14650 4346 5718 -2706 -11163 -10607 3342 10950 10969 22335 25126 28294 39580 38186 18218 -852
14636 -852 -4516 -16718 -30712 -29152 -23321 -19112 -22525 -25895 -24223 -13907 -6356 10178 14560 -20
14622 -20 4776 8992 3541 -444 -8305 -6588 -9856 -12370 -11050 -7249 -11721 -18165 -13417 -5009 13809
14607 13809 35734 33287 26792 21161 21923 21258 19370 10086 15897 20527 15139 11280 14575 26257
$$ packed form
14708E972n571j3283J225Q070J827l750m236L046j117K339N561p806M0J3904K798
14693I019j793l845L902R200l582j1438j8407M52R341P033L686j4274j5048k889
14679b8643p397J0953J8350N43o872j0843r520J697P930J4422J0697O145j591
14666E871o418j9608p631lM72J4270k508M28L609O46m162n938R961J419K200J1738
14650D346J372q424q457N56J3949P608J9J1366K791L168J1286j394j9968j9070
14636h52l664j2202j3994J560N831M209l413l370J672J0316P551J6534M382j4580
14622b0M796M216n451l985p861J717l268k514J320L801m472o444M748Q408J8818
14607A3809K1925k447o495n631P62o65j888r284N811M630n388l859L295J1682
$$ plain form
14593 26257 24912 10597 773 1313 13334 15549 17387 8525 7732 10644 8012 8448 -3289 648
14579 648 -301 733 5950 14827 3743 -8317 -16767 -22705 -26549 -16126 -27812 -25926 -25893 -25009 -21439
14564 -21439 -22773 -23752 -27940 -31990 -25702 -13537 -17866 -27311 -31889 -20289 -10860 -11315 -15560 -19316
14550 -19316 -8837 -1848 -9219 -23230 -20244 2269 7136 551 186 295 1244 22484 28311 11537
14536 11537 -1167 -681 6303 15931 5904 2899 14037 12747 5465 81 -7000 -8743 -1400 10055
14522 10055 20418 15498 -8034 -7934 2796 11627 -1443 -1826 -364 -15568 -18834 -533 9549
14509 9549 -1184 -5833 990 5001 5554 -7519 -12990 -616 669 -8813 -5483 -2543 -5344 -15928
14495 -15928 -27507 -18778 -3435 -4133 -4834 -3812 6777 4359 6143 2190 3419 7022 -6537 -13380
$$ packed form
14593B6257j345j4315r824N40J2021K215J838q862p93K912k632M36j1737L937
14579F48r49J034N217Q877j1084j2060q450n938l844J0423j1686J886L3Q84L570
14564b1439j334r79m188m050O288J2165m329r445m578J1600R429m55m245l756
14550a9316J0479O989p371j4011K986K2513M867o585l65J09R49K1240N827j6774
14536A1537j2704M86O984R628j0027l005J1138j290p282n384p081j743P343J1455
14522A0055J0363m920k3532J00J0730Q831j3070l83J462j5204l266J8301J0082
14509I549j0733m649O823M011N53j3073n471J2374J285r482L330K940k801j0584
14495a5928j1579Q729J5343o98p01J022J0589k418J784l953J229L603j3559o843
$$ plain form
14481 -13380 -12228 -21592 -16738 -2989 4981 1695 990 -9926 -10168 -5027 1514 -1597 -7744 -8185 -8151
14466 -8151 -5213 7058 29033 27417 -6669 -17716 -7473 -3895 -6216 -11658 -10049 -27784 -37377
14453 -37377 -12932 -9309 -9538 -9815 -11400 -27212 -14012 16559 28334 24604 13727 -6258 -12321
14440 -12321 -8356 3965 21612 12089 16861 19564 20082 14656 21087 27255 16101 -5877 -304 -7621
14426 -7621 -25241 -19838 -14344 -14251 -4671 -8346 -18501 -19204 -10313 -21813 -21382 -21924 -14307 -1740 8125
14411 8125 5717 3442 3830 -6784 -9383 -167 14412 16561 9199 -4905 -13287 -23716 -29283 -29508
14397 -29508 -14673 -26327 -29934 -38727 -28613 -18883 -14973 -8176 3515 -1377 -1012 -13339 -5808
14384 -5808 7034 1723 -2187 3416 7403 20463 13859 -10032 -8268 11645 6071 4883 3401 -1838
$$ packed form
14481a3380J152r364M854J3749P970l286p05j0916k42N141O541l111o147m41L4
14466h151K938J2271K1975j616l4086j1047J0243L578k321n442J609j7735r593
14453c7377K4445L623k29k77j585j5812J3200L0571J1775l730j0877j9985o063
14440a2321L965J2321J7647r523M772K703N18n426O431O168j1154k1978N573p317
14426g621j7620N403N494R3R580l675j0155p03Q891j1500M31n42P617J2567R865
14411H125k408k275L88j0614k599R216J4579K149p362j4104q382j0429n567k25
14397b9508J4835j1654l607q793J0114R730L910O797J1691m892L65j2327P531
14384e808J2842n311l910N603L987J3060o604k3891J764J9913n574j188j482n239
$$ plain form
14370 -1838 4701 18658 17815 2739 -12879 -889 14252 23967 30227 29046 15232 -2969 -13398
14357 -13398 -18310 -10453 -9395 -13119 -2532 5758 850 2896 8617 15559 12109 -2577 -651 7381
14343 7381 2393 -6927 -6522 -9468 -14739 -7541 -5547 -3236 -10190 -9164 -15245 -15213 -6724 4798 5847
14328 5847 7492 2826 -5454 -3193 920 -1883 363 -1338 2636 -5685 1554 8139 -1118 -114 -4756
14313 -4756 -4527 -7025 -14631 -21185 -19125 -16669 -23193 -20886 -18329 -9091 3534 -2277 -1378 -6384 853
14298 853 2028 2400 4666 6962 -2947 -15034 -15453 -13259 -10197 -6833 2545 323 5884 14366 16044
14283 16044 23064 13303 6730 2521 -2711 -7132 948 6895 -2086 -13719 -1811 -10872 -9354 -2963
14269 -2963 -1742 5614 14821 25042 12882 7505 -1466 -2419 -1309 8353 7183 1518 2848 2094 -6888
$$ packed form
14370a838O539J3957q43j5076j5618J1990J5141R715O260j181j3814j8201j0429
14357a3398m912P857J058l724J0587Q290m908K046N721O942l450j4686J926Q032
14343G381m988r320M05k946n271P198J994K311o954J026o081L2Q489J1522J049
14328E847J645m666q280K261M113k803K246j701L974q321P239O585r257J004m642
14313d756K29k498p606o554K060K456o524K307K557R238J2625n811Q99n006P237
14298H53J175L72K266K296r909j2087m19K194L062L364R378k222N561Q482J678
14283A6044P020r761o573m209n232m421Q080N947q981j1633J1908r061J518O391
14269b963J221P356R207J0221j2160n377q971r53J110R662j170n665J330p54q982
$$ plain form
14254 -6888 -12159 -20607 -20237 -16307 -12121 -7212 -3464 -9509 -13879 -8436 -12257 -8348 5297 445 -3675
14239 -3675 -4658 -15946 -2859 8672 -6173 -11488 -1400 -3521 -11551 -7690 -7451 -13502 -19596 -6216
14225 -6216 -1552 1643 4018 -2538 131 14976 16727 16181 5416 -3704 -1136 -7119 -12052 -7327
14211 -7327 -4325 -11826 -13925 -11688 -7032 -6540 -7820 -2778 -540 12222 1690 -3627 -8635 -4861
14197 -4861 -3358 -8996 -588 11979 15346 11038 160 3356 -4366 -7932 -6039 -10625 -10563 3014
14183 3014 2177 6298 3095 13 -840 12342 30364 23045 11977 14611 16439 17321 15899 13092 14450
14168 14450 24390 26346 32090 20090 -810 -2875 -3435 -8222 -14170 -13193 -6207 -918 3956 -3894
14154 -3894 -16505 -10305 -23790 -32525 -27867 -18627 -16510 -17394 -18892 -11010 -4532 3390 20282 33924
$$ packed form
14254f888n271q448L70L930M186M909L748o045m370N443l821L909J3645m852m120
14239c675r83j1288J3087J1531j4845n315J0088k121q030L861K39o051o094J3380
14225f216M664L195K375o556K669J4845J751n46j0765r120K568n983m933M725
14211g327L002p501k099K237M656M92j280N042K238J2762j0532n317n008L774
14197d861J503n638Q408J2567L367m308j0878L196p722l566J893m586O2J3577
14183C014q37M121l203l082q53J3182J8022p319j1068K634J828Q82j422k807J358
14168A4450R940J956N744j2000k0900k065n60m787n948R77O986N289M874p850
14154c894j2611O200j3485q735M658R240K117q84j498P882O478P922J6892J3642
$$ plain form
14140 33924 24998 34928 34066 18826 17267 12747 4747 1389 -3758 -24023 -25901 -21797 -17587 -15265
14126 -15265 -21016 -26293 -25946 -12097 12383 13260 12662 18801 21358 23834 25158 32517 36147 23531
14112 23531 4189 -13038 -22062 -31349 -15826 -19289 -30044 -16099 -11741 -31364 -30593 -26113 -32739
14099 -32739 -21182 -19763 -14729 -6903 -9130 -4188 5512 -66 1466 -20691 -24746 -19434 -8529 3176
14085 3176 7459 2372 -12027 -1881 2178 -12190 -5434 4955 2243 16869 17161 6646 7838
14072 7838 9127 7835 18265 20040 11612 2658 1892 1396 -2890 -14351 1597 17770 29898 25932
14058 25932 26437 30921 26465 17767 -4362 -9035 374 8284 3447 1615 -19 -7101 -12229 -3843
14044 -3843 -12201 -15406 -11894 -10829 -17156 -2899 4134 3038 10765 11376 1557 9063 22528 33897
$$ packed form
14140C3924q926R930q62j5240j559m520q000l358n147k0265j878M104M210K322
14126a5265n751n277L47J3849K4480Q77n98O139K557K476J324P359L630j2616
14112B3531j9342j7227r024r287J5523l463j0755J3945M358j9623P71M480o626
14099c2739J1557J419N034P826k227M942R700n578J532k2157m055N312J0905J1705
14085C176M283n087j4399J0146M059j4368O756J0389k712J4626K92j0515J192
14072G838J289j292J0430J775q428q954p66m96m286j1461J5948J6173J2128l966
14058B5932N05M484m456q698k2129m673R409P910m837j832j634p082n128Q386
14044c843q358l205L512J065o327J4257P033j096P727O11r819P506J3465J1369
$$ plain form
14030 33897 19252 -6452 -7014 2974 -1913 8565 3234 -7615 -11614 -17426 -13931 -13328 -3748 -6838
14016 -6838 -3332 4694 5805 8263 8357 -1790 -7961 -8417 -3694 -5440 -372 442 -9491 -1065 -3693
14001 -3693 -2417 1170 616 1872 21442 16150 1733 4270 7701 11124 2134 -5205 -6330 -10016
13987 -10016 -2151 874 4695 6050 2838 3551 6480 5901 3863 12107 7792 25036 15053 4943
13973 4943 3452 5543 6641 7050 -820 47 11759 21638 10022 9656 20236 16988 9186 5940 -5524
13958 -5524 -20517 -15806 10636 5096 -5117 891 3517 4853 9226 2334 -1464 1043 -7345 -7718
13944 -7718 1488 5305 9799 13852 14457 10415 9914 -2228 -12469 -12365 -15556 -19346 -33111 -35800 -23933
13929 -23933 -21860 -15421 -23328 -29997 -13120 7009 9093 7800 6154 -3256 -3209 7527 13798 18854
$$ packed form
14030C3897j4645k5704n62R988m887J0478n331j0849l999n812L495O03R580l090
14016f838L506Q026J111K458R4j0147o171m56M723j746N068Q14r933Q426k628
14001c693J276L587n54J256J9570n292j4417K537L431L423q990p339j125l686
13987a0016P865L025L821J355l212P13K929n79k038Q244m315J7244r983j0110
13973D943j491K091J098M09p870Q67J1712R879j1616l66J0580l248p802l246j1464
13958e524j4993M711K6442n540j0213O008K626J336M373o892l798K507q388l73
13944g718R206L817M494M053O05m042n01j2142j0241J04l191l790j3765k689J1867
13929b3933K073O439p907o669J6877K0129K084j293j646r410M7J0736O271N056
$$ plain form
13915 18854 13838 5454 -8316 -8357 599 -2425 -5441 804 1034 16373 16016 22581 8874 -1045 -11708
13900 -11708 -9792 -10704 -5773 -17156 -24826 -22760 -18254 -1102 12444 2072 -9973 -6422 -2180
13887 -2180 -6236 -3420 -1074 -12753 -23830 -26791 -20836 -21105 -18785 -17458 -5749 11873 5023 -12813
13873 -12813 -25326 -25039 -7409 13207 24891 19240 5375 1623 1590 3341 4777 11793 18624 14377
13859 14377 14959 16317 1214 -9029 -10163 574 4984 12979 15097 3651 -9908 -3094 8438
13846 8438 17410 15622 16357 12665 9142 9456 6086 12128 6043 -8430 5922 11577 3384 11184 9680
13831 9680 18121 10791 -4022 -12171 -5046 2429 -1721 9567 15449 17631 20780 5740 -3410 3547
13817 3547 24 1577 -12678 -6249 361 13675 6530 7623 1174 -2335 596 4805 12655 23803
$$ packed form
13915A8854n016q384j3770m1Q956l024l016O245K30J5339l57O565j3707r919j0663
13900a1708J916r12M931j1383p670K066M506J7152J3546j0372j2045L551M242
13887b180m056K816K346j1679j1077k961N955k69K320J327J1709J7622o850j7836
13873a2813j2513K87J7630K0616J1684n651j3865l752l3J751J436P016O831m247
13859A4377N82J358j5103j0243j134J0737M410P995K118j1446j3559O814J1532
13846H438Q972j788P35l692l523L14l370O042o085j4473J4352N655q193P800j504
13831I680Q441p330j4813q149P125P475m150J1288N882K182L149j5040r150O957
13817C547l523J553j4255O429O610J3314p145J093o449l509K931M209P850J1148
$$ plain form
13803 23803 16903 -3829 -1584 -12600 -25546 -26189 -8931 -851 18538 19608 711 -13038 -11635
13790 -11635 -12947 -15647 -13623 -1547 -1648 -13016 -18398 -8670 -1664 690 -1897 4391 17687 17716
13776 17716 14953 5366 -2136 3859 15667 12460 6683 5826 4772 -2476 5430 5216 2022 -167 87
13761 87 -8289 -22171 -23309 -2510 -1148 -1131 -2512 1205 -5236 -5328 11073 20035 21715 18926 -5853
13746 -5853 -16272 -7834 6887 10050 4313 4431 -6594 -9653 -10235 -5919 -6610 -7658 -2930 -4611 17249
13731 17249 19632 15769 15172 14540 12674 4510 -1104 -4015 -6798 2095 2090 13812 24777 15279 12586
13716 12586 7276 5491 3459 2493 14571 22582 18945 6130 5869 19769 9503 -6696 -9543 -9405
13702 -9405 -6564 -7900 -714 -2348 -10034 4319 13985 2489 7051 1799 -4770 -3722 2994 -5204
$$ packed form
13803B3803o900k0732K245j1016j2946o43J7258Q080J9389J070j8897j3749J403
13790a1635j312k700K024J2076j01j1368n382R728P006K354k587O288J3296K9
13776A7716k763r587p502N995J1808l207n777q57j054p248P906k14l194k189K54
13761H7q376j3882j138K0799J362J7j381L717o441r2J6401Q962J680k789k4779
13746e853j0419Q438J4721L163n737J18j1025l059n82M316o91j048M728j681K1860
13731A7249K383l863n97o32j866q164n614k911k783Q893nJ1722J0965r498k693
13716A2586n310j785k032r66J2078Q011l637j2815k61J3900j0266j6199k847J38
13702i405K841j336P186j634p686J4353R666j1496M562n252o569J048O716q198
$$ plain form
13688 -5204 -3767 -5159 2303 -4326 -5975 655 4867 -4723 -12538 -17402 -6598 -6439 -3495 -7152 -14498
13673 -14498 -19005 -23615 -14101 -10790 -4870 14697 22580 17496 8065 -2722 -7115 757 11494 23245
13659 23245 30099 35435 24977 14553 9349 9138 8761 14465 14651 10045 7001 9583 13303 23172 26178
13644 26178 29285 18362 13358 11229 1456 9696 10000 -2303 9417 5969 7153 9253 5280 6328
13630 6328 12629 13723 6697 -7755 -14786 -11726 -9971 -5808 -11853 -10144 -6253 -8141 -8701 -17678 -21093
13615 -21093 -12921 -12350 -9300 -640 14944 17479 22254 10964 20015 21170 8578 4731 -501 6387
13601 6387 -1795 -6318 -835 3957 2333 -8258 -15890 -13323 -16307 -22494 -11094 671 1952 6995
13587 6995 12231 10251 3210 -3162 6246 7324 3878 5013 4291 -1799 -3989 -21899 -26969 -37728
$$ packed form
13688e204J437j392P462o629j649O630M212r590p815m864J0804J59K944l657p346
13673a4498m507m610R514L311N920J9567P883n084r431j0787m393P872J0737J1751
13659B3245O854N336j0458j0424n204k11l77N704J86m606l044K582L720R869L006
13644B6178L107j0923n004k129r773Q240L04j2303J1720l448J184K100l973J048
13630F328O301J094p026j4452p031L060J755M163o045J709L891j888n60q977l415
13615b1093Q172N71L050Q660J5584K535M775j1290R051J155j2592l847n232O888
13601F387q182m523N483M792j624j0591p632K567k984o187J1400J1765J281N043
13587F995N236j980p041o372R408J078l446J135p22o090k190j7910n070j0759
$$ plain form
13573 -37728 -35637 -43932 -32306 -21278 -307 -85 5132 1163 -3477 -8827 -4673 -13382 -11123 -3039
13559 -3039 -1167 -4403 -5345 -32304 -40128 -17275 -6104 -7251 -2117 6467 4198 8606 691 -5306
13545 -5306 4342 12664 -1551 -13540 -13553 1013 13176 22522 15190 4158 1046 12355 13374 1791
13531 1791 -2104 8048 4448 -311 2009 8691 18290 8998 -7855 -10719 -451 1235 10923 13250
13517 13250 15905 5274 -397 2636 -1568 -8774 -17246 -12184 -6351 -3652 -2437 2883 -10409 -13971
13503 -13971 -5804 -3747 3157 -1274 -14400 4304 11633 12860 5471 -662 -4019 -6089 -11303 -10858
13489 -10858 -5433 3105 10193 9326 13526 13732 19594 6167 -19694 -13673 -5597 2595 4694 -7507
13475 -7507 -13726 -17056 -12055 -6196 -6565 -552 -6269 -14844 -15387 -18477 -12400 -8362 -1031 8528 12416
$$ packed form
13573c7728K091q295J1626J1028K0971K22N217l969m640n350M154q709K259Q084
13559c039J872l236r42k6959p824K2853J1171j147N134Q584k269M408p915n997
13545e306R648Q322j4215j1989j3J4566J2163R346p332j1032l112J1309J019j1583
13531A791l895J0152l600m759K320O682R599r292j6853k864J0268J686R688K327
13517A3250K655j0631n671L033m204p206q472N062N833K699J215N320j3292l562
13503a3971Q167K057O904m431j3126J8704P329J227p389o133l357k070n214M45
13489a0858N425Q538P088q67M200K06N862j3427k5861O021Q076Q192K099j2201
13475g507o219l330N001N859l69O013n717q575n43l090O077M038P331R559L888
$$ plain form
13460 12416 14206 12485 7980 -7745 -14379 -1573 15549 16033 -1229 -4048 -10020 -14029 -11612 -10602
13446 -10602 1471 -719 -1995 -2385 -3790 -7729 -11095 -4898 7914 2902 -4411 -8654 -8121 -8042 -3558
13431 -3558 -10076 -12425 -28721 -18587 -14606 -3642 -1166 -13063 -18178 4573 9310 4549 5367 9498
13417 9498 584 -7676 -2489 6197 -2438 -4606 -13671 -5966 12007 32379 30347 12307 10708 5089
13403 5089 4821 99 -745 5630 13275 18733 15109 6576 13273 14896 11850 12463 5333 10906 11987
13388 11987 20222 24876 15984 22311 29424 23526 30252 19668 20172 18460 17705 8574 2615 18220
13374 18220 23194 15010 12981 17938 11771 -655 2370 2610 -670 6207 6604 15164 9825 -4410
13360 -4410 -9280 -16309 -11394 -6381 -13355 -12238 -8344 -15811 -17947 -22128 -9888 -2984 -2054 -9509 -1411
$$ packed form
13460A2416J790j721m505j5725o634J2806J7122M84j7262k819n972m009K417J010
13446a0602J2073k190j276l90j405l939l366O197J2812n012p313m243N33P9M484
13431c558o518k349j6296J0134L981J0964K476j1897n115K2751M737m761Q18M131
13417I498q914q260N187Q686q635k168r065P705J7973K0372k032j8040j599n619
13403E089k68m722q44O375P645N458l624q533O697J623l046O13p130N573J081
13388A1987Q235M654q892O327P113n898O726j0584N04j712p55r131n959J5605
13374A8220M974q184k029M957o167j2426L025K40l280O877L97Q560n339j4235
13360d410m870p029M915N013o974J117L894p467k136m181J2240O904R30p455Q098
$$ plain form
13345 -1411 -3505 -3574 -6672 -15244 -29356 -18535 -14132 -1743 -1475 2074 -4508 4558 -890 -1741 15449
13330 15449 26180 14993 368 -934 -1360 -4023 6140 18300 19624 13788 17089 10880 -5655
13317 -5655 -5425 -6315 -7417 -635 3913 994 -8477 -17714 -8701 -8599 2355 3902 -12804 -1095 7765
13302 7765 -5590 6401 22712 9324 -6563 -2542 2572 -2069 6542 14895 16524 10555 -3596
13289 -3596 -6807 186 13039 13365 -4264 951 19542 18196 10157 13193 -3048 -10639 -5061 -13935
13275 -13935 -21281 -354 13391 18012 7428 -5608 -3269 -15104 -26374 -30675 -35320 -22754 745
13262 745 2970 -1045 -7927 -4873 -10871 -3696 7795 20256 8996 -3118 -14170 -3924 -1957
13249 -1957 -8788 -20454 -12808 -10708 -5719 -6086 -18562 -37705 -46176 -28183 -7384 807 5615 3559
$$ packed form
13345a411k094o9l098q572j4112J0821M403J2389K68L549o582R066n448q51J7190
13330A5449J0731j1187j4625j302m26k663J0163J2160J324n836L301o209j6535
13317e655K30q90j102O782M548k919r471r237R013J02J0954J547j6706J1709Q860
13302G765j3355J1991J6311j3388j5887M021N114m641Q611Q353J629n969j4151
13289c596l211O993J2853L26j7629N215J8591j346q039L036j6241p591N578q874
13275a3935p346K0927J3745M621j0584j3036K339j1835j1270m301m645J2566K3499
13262G45K225m015o882L054n998P175J1491J2461j1260j2114j1052J0246J967
13249a957o831j1666P646K100M989l67j2476j9143q471J7993K0799Q191M808k056
$$ plain form
13235 3559 -3220 -9658 -17619 -10305 -9768 -13522 -9821 -5359 9406 12522 14506 7520 -1353 -566 11022
13220 11022 9983 2874 -5182 5534 17328 22611 7381 5989 20864 30549 24028 16812 11469
13207 11469 7853 -897 2911 15761 13147 3876 -2635 -3661 -8554 -19073 -22680 -9119 2599
13194 2599 4052 -7685 -5882 -2943 -4660 791 -296 21249 33733 25715 12831 5834 11088 13854
13180 13854 12918 3564 -11220 3132 13770 12710 12207 23916 19743 24508 28929 29042 18828 24176
13166 24176 22822 19352 17418 8556 9927 4160 15599 21399 16233 17387 7807 -2816 -4495 -9819
13152 -9819 -6771 -5092 -5382 9269 12338 17354 20269 20364 17894 7384 15549 23903 24477 22008 12085
13137 12085 8723 -793 1055 6177 3784 10054 17107 20607 8743 8374 16078 8057 -7593 -7080
$$ packed form
13235C559o779o438p961P314N37l754L701M462J4765L116J984o986q873P87J1588
13220A1022j039p109q056J0716J1794N283j5230j392J4875R685o521p216n343
13207A1469l616q750L808J2850k614r271o511j026m893j0519l607J3561J1718
13194B599J453j1737J803K939j717N451j087K1545J2484q018j2884o997N254K766
13180A3854r36r354j4784J4352J0638j060n03J1709m173M765M421J13j0214N348
13166B4176j354l470j934q862J371n767J1439N800n166J154r580j0623j679n324
13152i819L048J679k90J4651L069N016K915R5k470j0510Q165Q354N74k469r923
13137A2085l362r516J848N122k393O270P053L500j1864l69P704q021j5650N13
$$ plain form
13123 -7080 5217 4534 -3462 3674 -1502 -3561 -11410 1162 18408 21781 24897 16845 23744 20869
13109 20869 17560 14067 15124 2361 3227 4466 6722 8935 1760 -21068 -18371 2033 7407 349
13095 349 -11008 -20933 -24103 -22582 -15694 -1809 -1571 1455 13888 28874 24291 18610 18631 13818 8935
13080 8935 8990 12107 22719 16842 11607 17208 32437 31598 24965 49066 67470 67759 45659 35508
13066 35508 30852 20985 16547 13395 12196 -1546 -1322 -4340 -2923 2746 1155 6630 10424 8458
13052 8458 6669 1786 6892 19965 14306 13832 24067 14527 -11521 -13077 3719 20486 20612 26254
13038 26254 17683 16217 20573 22237 26150 11361 2130 6849 20453 14477 6879 10810 16764 10949
13024 10949 -4119 5585 5356 -6068 2530 3711 -7366 -9928 -12727 786 14097 27044 29109
$$ packed form
13123g080J2297o83p996P136n176k059p849J2572J7246L373L116q052O899k875
13109B0869l309l493J057j2763Q66J239K256K213p175k2828K697K0404N374p058
13095C49j1357r925l170J521O888J3885K38L026J2433J4986m583n681K1m813m883
13080H935N5L117J0612n877n235N601J5229q39o633K4101J8404K89k2100j0151
13066C5508m656r867m438l152j199j3742K24l018J417N669j591N475L794j966
13052H458j789m883N106J3073n659m74J0235r540k6048j556J6796J6767J26N642
13038B6254q571j466M356J664L913j4789r231M719J3604n976p598L931N954n815
13024A0949j5068R704k29j1424Q598J181j1077k562k799J3513J3311J2947K065
$$ plain form
13011 29109 24128 23136 16875 19109 -7742 -12000 6183 2314 150 14504 17470 4093 7190 -1917
12997 -1917 2248 -3046 -12410 -10902 -11528 -2645 11957 29126 20659 14740 4447 -815 -2253 7772
12983 7772 -728 -13549 -17150 -10110 379 1092 2962 -67 -11541 -13482 -10526 -6985 -16640 -14031
12969 -14031 -13545 -19448 -30999 -19661 -4975 -7423 -5144 689 9022 8663 12073 10797 7274 7792
12955 7792 657 -6757 -8819 -9433 -296 9979 3012 -5834 -4120 -871 6419 9792 10546 12289 21742
12940 21742 27788 12879 14756 17172 4746 -1168 -3795 4129 19127 23416 15130 14145 5690 -6197
12926 -6197 3265 18524 17221 15432 8260 20479 27055 22196 19397 22891 35035 38813 29856 16617
12912 16617 -7843 534 9963 9812 10824 10808 7567 -5818 -6179 -9282 -18507 -16231 -6834 -8558 -8889
$$ packed form
13011B9109m981r92o261K234k6851m258J8183l869k164J4354K966j3377L097r107
12997a917M165n294r364J508o26Q883J4602J7169q467n919j0293n262j438J0025
12983G772q500j2821l601P040J0489P13J870l029j1474j941K956L541r655K609
12969a4031M86n903j1551J1338J4686k448K279N833Q333l59L410j276l523N18
12955G792p135p414k062o14R137J0275o967q846J714L249P290L373P54J743R453
12940B1742O046j4909J877K416j2426n914k627P924J4998M289q286r85q455j1887
12926f197R462J5259j303j789p172J2219O576m859k799L494J2144L778q957j3239
12912A6617k4460Q377R429j51J012j6l241j3385l61l103r225K276R397j724l31
$$ plain form
12897 -8889 -6804 -11512 -27238 -16638 -1516 -6062 2452 11175 2962 -11039 -2897 15346 15292 11569
12883 11569 23977 25507 13769 21403 20619 10797 11322 8032 1311 -10073 -6867 5051 6360 12771
12869 12771 22385 35769 47041 55890 40611 19195 -2603 -5367 -3902 1784 9817 17445 28822
12856 28822 18802 6825 -5226 -11274 -12283 -6753 9483 8970 8516 7785 7717 13895 -1170 -4561
12842 -4561 11980 26928 29984 25057 15765 14914 20814 25159 12377 167 5633 12687 16687 15050
12828 15050 6217 -2796 -9717 -6287 6496 9006 -1188 -3125 9261 14073 9877 7464 17014 25543
12814 25543 27836 26919 27145 39884 33307 11125 6865 9702 9245 11385 10757 5009 -3338 13009 17036
12799 17036 20273 27464 18090 16587 25162 28095 27158 28606 23761 16382 19867 27112 34711 38012 37978
$$ packed form
12897h889K085m708j5726J0600J5122m546Q514Q723q213j4001Q142J8243n4l723
12883A1569J2408J530j1738P634p84r822N25l290o721j1384L206J1918J309O411
12869A2771R614J3384J1272Q849j5279k1416k1798k764J465N686Q033P628J1377
12856B8822j0020j1977j2051o048j009N530J6236n13m54p31o8O178j5065l391
12842d561J6541J4948L056m927r292q51N900M345j2782j2210N466P054M000j637
12828A5050q833r013o921L430J2783K510j0194j937J2386M812m196k413R550Q529
12814B5543K293r17K26J2739o577k2182m260K837m57K140o28n748q347J6347M027
12799A7036L237P191r374j503Q575K933r37J448m845p379L485P245P599L301l4
$$ plain form
12784 37978 20390 11580 17371 14038 -1209 6195 24204 25637 10125 8375 11564 11499 17027 11224
12770 11224 19790 19790 24891 39382 35734 20661 4740 1684 4131 -2746 -13026 -13149 -12684 -14417 3710
12755 3710 20963 26201 36051 46177 42394 20670 16140 11208 5393 -5934 -6609 -20624 -14667 -8945
12741 -8945 -1631 -5831 -7392 -12619 -11826 -2327 8005 -5685 -5896 -7953 -3638 -345 5658 -1858 10814
12726 10814 17805 13956 11020 -1771 -18881 -13314 -4205 -1387 -282 -4288 -15083 -9264 -16570 -15992
12712 -15992 -29292 -32654 -22675 -2896 842 4923 14858 8767 -25 -6798 -7161 -4616 -3326 -9373
12698 -9373 -3999 874 16944 19252 12722 3878 2351 7002 -111 -7162 -13230 -2582 14996 4333
12684 4333 -13967 -18237 -10778 -1574 21113 19872 21033 27774 24055 5707 -4693 -7927 -9707 -7127
$$ packed form
12784C7978j7588q810N791l333j5247P404J8009J433j5512j750L189o5N528n803
12770A1224Q566%N101J4491l648j5073j5921l056K447o877j0280j23M65j733J8127
12755C710J7253N238R850J0126l783k1724m530m932n815j1327o75j4015N957N722
12741h945P314m200j561n227P93R499J0332j3690k11k057M315L293O003p516J2672
12726A0814O991l849k936j2791j7110N567R109K818J105m006j0795N819p306N78
12712a5992j3300l362R979J9779L738M081R935o091q792o773l63K545J290o047
12698i373N374M873J6070K308o530q844j527M651p113p051o068J0648J7578j0663
12684D333j8300m270P459R204K2687j241J161O741l719j8348j0400l234j780K580
$$ plain form
12670 -7127 -4778 -7592 -17977 -18994 -19115 -10119 3787 10863 9710 10966 19310 31199 36544 31034
12656 31034 15400 18170 2577 6392 23302 14012 5771 6178 11113 2204 8551 18050 14562 10213
12642 10213 4040 9129 21762 31277 17203 10685 23146 25186 25631 31582 41190 24846 18877 11471
12628 11471 8042 4964 793 7682 4965 -6317 -16366 3774 20573 12372 354 -831 14130
12615 14130 12229 22785 26067 13783 7394 12081 21940 20413 26399 23260 15384 14617 12976 7874
12601 7874 11657 4615 3558 21263 11521 8809 11279 13805 14754 5938 -8327 5017 8616 11547
12587 11547 21743 19484 2471 -1438 5061 6129 -4799 -13034 -10993 -7311 -8532 -14535 -4853 8342
12573 8342 16724 22671 27558 30196 25934 25096 24437 21164 22957 29877 15605 13183 17944 15659 36190
$$ packed form
12670g127K349k814j0385j017j21Q996J3906P076j153J256Q344J1889N345n510
12656C1034j5634K770j5593L815J6910r290q241M07M935q909O347R499l488m349
12642A0213o173N089J2633R515j4074o518J2461K040M45N951R608j6344n969p406
12628A1471l429l078m171O889k717j1282j0049K0140J6799q201j2018j185J4961
12615A4130j901J0556L282j2284o389M687R859j527N986l139p876p67j641n102
12601G874L783p042j057J7705r742k712K470K526R49q816j4265J3344L599K931
12587A1547J0196k259j7013l909O499J068j0928q235K041L682j221o003R682J3195
12573H342Q382N947M887K638m262q38o59l273J793O920j4272k422M761k285K0531
$$ plain form
12558 36190 44272 30632 17708 8629 15147 26475 14920 -2183 2864 15942 19811 25601 16627
12545 16627 7401 11167 11687 12871 25207 42317 38441 30965 22436 21461 16964 39269 51697 43598
12531 43598 26266 22673 31402 27423 13340 8750 8739 8155 -545 -1653 11392 12052 19592 25645 18091
12516 18091 5726 -11981 -10655 -9824 -1344 26105 40282 44724 29660 18243 10125 12502 22806
12503 22806 26722 24961 35849 37087 32711 40138 47926 44041 34660 22827 18241 27155 30844 19345
12489 19345 5936 4222 7351 2439 -2434 11247 6041 -6644 -19065 -20025 -7347 -3766 26567
12476 26567 33108 20942 20577 15740 17647 21783 25427 22199 26839 24238 34740 36590 23845 25132
12462 25132 35287 31972 20717 10735 -2179 -8132 1111 17702 9750 10425 17723 6624 1966
$$ packed form
12558C6190Q082j3640j2924r079O518J1328j1555j7103N047J3078L869N790q974
12545A6627r226L766N20J184J2336J7110l876p476q529r75m497K2305J2428q099
12531D3598j7332l593Q729l979j4083m590j1n84q700j108J3045O60P540O053p554
12516A8091j2365j7707J326Q31Q480K7449J4177M442j5064j1417q118K377J0304
12503B2806L916j761J0888J238m376P427P788l885r381j1833m586Q914L689j1499
12489A9345j3409j714L129m912m873J3681n206j2685j2421r60J2678L581L0333
12476B6567O541j2166l65m837J907M136L644l228M640k601J0502J850j2745J287
12462B5132J0155l315j1255r982j2914n953R243J6591p952O75P298j1099m658
$$ plain form
12449 1966 8221 14757 24937 23098 17952 14216 18910 11213 20796 16677 2269 4067 10299 10507
12435 10507 -376 7831 23833 33213 41154 33598 18723 22460 18342 6925 1972 12131 19943
12422 19943 20367 18506 16130 20162 11714 15314 29340 29526 33527 21263 15021 9257 7773 8028 5781
12407 5781 2056 3092 17389 26763 12674 -20 -3758 -4046 -5281 -9034 -8893 -3518 -9470 8174
12393 8174 19894 23512 20006 21955 24817 26955 27812 34172 38966 41564 37152 34636 38382 48088 49255
12378 49255 40151 38446 29911 20163 13931 11693 14124 22127 20104 20993 16463 18451 29676 40633
12364 40633 42777 42652 42136 28851 6126 -2095 -3215 6786 13866 8825 4911 4696 1136 3579
12350 3579 13737 23608 22922 31561 43358 41552 43460 38688 33971 27596 38500 52029 42028 34832
$$ packed form
12449A966O255O536J0180j839n146l736M694p697R583m119j4408J798O232K08
12435A0507j0883Q207J6002R380P941p556j4875L737m118j1417m953J0159P812
12422A9943M24j861k376M032q448L600J4026J86M001j2264o242n764j484K55k247
12407E781l725J036J4297R374j4089j2694l738k88j235l753J41N375n952J7644
12393H174J1720L618l506J949K862K138Q57O360M794K598m412k516L746R706J167
12378D9255r104j705q535r748o232k238K431Q003k023Q89m530J988J1225J0957
12364D0633K144j25n16j3285k2725q221j120J0001P080n041l914k15l560K443
12350C579J0158R871o86Q639J1797j806J908m772m717o375J0904J3529j0001p196
$$ plain form
12336 34832 25445 12804 6191 -1770 9216 24750 17750 18946 21576 31278 33826 29873 25070 16568
12322 16568 16320 23705 20688 25583 31449 22907 19620 21674 29809 24555 21759 33028 30810 23520
12308 23520 13168 -381 -10170 -11568 9814 14775 23856 29651 26931 24274 23010 33066 36841
12295 36841 33709 35824 23806 13551 26854 31992 31147 25631 22409 14743 14285 15371 24842 29027
12281 29027 15695 12360 25896 33702 25848 18527 24977 39903 35728 37128 34825 31318 29318 20640
12267 20640 21584 23405 26576 38733 47089 49519 46367 40512 46752 54409 38705 15307 14850 10026
12253 10026 10345 14215 21759 25985 17440 651 7389 10053 10078 14332 13037 5443 3446 3808 11515
12238 11515 14896 19619 26740 38013 33264 40096 46001 31504 21252 32636 38118 38162 40184 30616
$$ packed form
12336C4832r387j2641o613p961J0986J5534p000J196K630R702K548l953m803q502
12322A6568k48P385l017M895N866q542l287K054Q135n254k796J1269k218p290
12308B3520j0352j3549r789j398K1382M961R081N795k720k657j264J0056L775
12295C6841l132K115j2018j0255J3303N138q45n516l222p666m58J086R471M185
12281B9027j3332l335J3536P806p854p321O450J4926m175J400k303l507k000q678
12267B0640R44J821L171J2157Q356K430l152n855O240P657j5704k3398m57m824
12253A0026L19L870P544M226q545j6789O738K664K5M254j295p594j997L62P707
12238A1515L381M723P121J1273m749O832N905j4497j0252J1384N482M4K022r568
$$ plain form
12224 30616 30707 22497 23793 30221 32462 22472 16255 6207 17507 33451 34319 25693 21860 27257
12210 27257 18362 22324 12758 1578 11109 17617 35257 29357 9383 -1591 9186 8765 8557 23800
12196 23800 33854 23584 9058 16198 29065 32220 35576 46830 34401 32228 35092 46140 45053
12183 45053 43230 48712 36484 30314 26356 32938 32444 34857 41156 32403 30696 37406 44155 56440
12169 56440 52463 47418 57205 51190 38551 28652 30726 28403 36854 44760 43490 30630 32296 32918
12155 32918 37079 46129 43471 42466 35970 33691 27198 20033 21693 39837 45862 42814 36014 43002
12141 43002 44481 46686 44373 43287 50197 55201 50645 49559 51911 52830 50478 40402 39221 57062
12127 57062 73792 86553 83158 70074 72256 73679 73566 64936 61780 54394 60264 68056 77433 84572
$$ packed form
12224C0616R1q210J296O428K241r990o217j0048J1300J5944Q68q626l833N397
12210B7257q895L962r566j1180R531O508J7640n900j9974j0974J0777m21k08J5243
12196B3800J0054j0270j4526P140J2867L155L356J1254j2429k173K864J1048j087
12183D5053j823N482j2228o170l958O582m94K413O299q753j707O710O749J2285
12169E6440l977n045R787o015j2639r899K074k323Q451P906j270j2860J666O22
12155C2918M161R050k658j005o496k279o493p165J660J8144O025l048o800O988
12141D3002J479K205k313j086O910N004m556j086K352R19k352j0076j181J7841
12127E7062J6730J2761l395j3084K182J423j13q630l156p386N870P792R377P139
$$ plain form
12113 84572 78743 72571 77274 81474 82456 78326 56404 50207 50323 55036 56142 73526 66428 63695
12099 63695 64263 77547 82784 68489 63405 64883 66738 70937 60717 63050 72268 80240 99627 111394
12085 111394 119434 135743 150519 166451 162192 174301 198356 214345 243518 281730 353189 461145
12073 461145 608953 819468 1049777 1248348 1404635 1480878 1441964 1315442 1157911 990124
12063 990124 814490 675025 553419 455505 372292 318360 280914 249267 206461 171558 159085
12052 159085 155705 143573 133955 119046 108349 102989 95992 91610 87123 87159 70873 59620 50131
12039 50131 49261 60138 67557 65892 66853 64289 59450 76288 68413 63500 57178 48355 45703 60444
12025 60444 56393 41095 33903 31154 35323 52829 61763 53731 43059 58003 72844 89385 92608
$$ packed form
12113H4572n829o172M703M200R82m130k1922o197J16M713J106J7384p098k733
12099F3695N68J3284N237j4295n084J478J855M199j0220K333R218P972J9387J1767
12085A11394Q040J6309J4776J5932m259J2109K4055J5989K9173L8212P1459J07956
12073D61145J47808K10515K30309J98571J56287P6243l8914j26522j57531j67787
12063I90124j75634j39465j21606r7914q3213n3932l7446l1647m2806l4903j2473
12052A59085l380j2132r618j4909j0697n360o997m382m487L6j6286j1253r489
12039E0131q70J0877P419j665R61k564m839J6838p875m913o322q823k652J4741
12025F0444m051j5298p192k749M169J7506Q934q032j0672J4944J4841J6541L223
$$ plain form
12012 92608 89462 72030 56921 51226 54365 57890 67074 65223 73609 88935 83131 69621 76323
11999 76323 75266 72081 60383 60599 62911 54180 34227 25096 33751 50178 60860 62112 67321 73024
11985 73024 66212 58074 63235 65901 67373 58379 60857 63441 58358 61273 67869 67229 74277 87079
11971 87079 84818 72915 66066 49579 49191 61189 60557 48389 36825 35488 51647 61257 48139
11958 48139 49970 62632 77288 74504 78628 73299 67438 51945 41580 38062 56105 70309 68236
11945 68236 78609 92861 90722 87138 85196 66553 70024 78707 80969 75483 65390 73647 83856
11932 83856 85001 72321 66589 67384 74199 70628 60375 57121 53651 68189 73950 62927 65043 82099
11918 82099 99484 114942 120188 144395 165971 186826 205440 226147 255279 279028 280215 261611
$$ packed form
12012I2608l146j7432j5109n695L139L525R184j851Q386J5326n804j3510O702
11999G6323j057l185j1698K16K312q731j9953r131Q655J6427J0682J252N209N703
11985G3024o812q138N161K666J472q994K478K584n083K915O596o40P048J2802
11971H7079k261j1903o849j6487l88J1998o32j2168j1564j337J6159R610j3118
11958D8139J831J2662J4656k784M124n329n861j5493j0365l518J8043J4204k073
11945F8236J0373J4252k139l584j942j8643L471Q683K262n486j0093Q257J0209
11932H3856J145j2680n732P95O815l571j0253l254l470J4538N761j1023K116J7056
11918H2099J7385J5458N246K4207K1576K0855J8614K0707K9132K3749J187j8604
$$ plain form
11906 261611 231872 207658 179435 146464 122780 111498 109853 97588 84550 79323 77697 79584
11894 79584 74831 72393 77022 84510 88498 96957 97567 101582 97601 93595 102737 92894 85133 87651 93890
11879 93890 105939 98787 93624 94850 81140 92810 97393 105416 115847 127044 123530 118066 123233
11866 123233 124464 115643 118500 126825 139018 135626 143104 159393 177428 203923 230370 239141 247503
11853 247503 262339 277974 285370 283090 275360 262643 238361 222304 215717 197629 207201 211149 182263
11840 182263 168560 170591 169810 166758 160225 164202 152745 137849 137220 147960 144633 143519 140090 135682
11826 135682 142994 147997 137489 118186 111966 115447 127603 142890 138381 128089 129160 125650 116072
11813 116072 105924 105346 112331 116469 115670 121253 123840 126516 124646 145185 153715 144435 140770 134951
$$ packed form
11906B61611k9739k4214k8223l2971k3684j1282j645j2265j3038n227j626J887
11894G9584m753k438M629P488L988Q459O10M015l981m006R142r843p761K518O239
11879I3890J2049p152n163J226j3710J1670M583Q023J0431J1197l514n464N167
11866A23233J231q821K857Q325J2193l392P478J6289J8035K6495K6447Q771Q362
11853B47503J4836J5635P396k280p730j2717k4282j6057o587j8088R572L948k8886
11840A82263j3703K031p81l052o533L977j1457j4896o29J0740l327j114l429m408
11826A35682P312N003j0508j9303o220L481J2156J5287m509j0292J071l510r578
11813A16072j0148n78O985M138p99N583K587K676j870K0539Q530r280l665n819
$$ plain form
11799 134951 137955 139720 139681 163342 172476 176457 178425 184736 198650 214184 229508 219683 210880 202995
11785 202995 195938 203059 193459 193894 204536 213065 220866 215732 213506 228272 236057 248607 253090 257093
11771 257093 272341 275392 294011 316859 329157 344572 343280 367537 392748 421514 448946 488986
11759 488986 510850 515492 505187 474275 389854 285099 178428 68541 -19877 -81738 -105528
11748 -105528 -123635 -132549 -117748 -93311 -79550 -60149 -45220 -20594 -5307 1284 16047 33716
11736 33716 48628 78261 91487 108312 135965 171954 201068 243974 296946 373283 471337 557291
11724 557291 622572 653184 659252 645923 605276 538433 478972 415425 362368 307363 250481 229894
11712 229894 239102 251405 255110 257781 261957 276177 289130 316637 338046 354904 377457 414077
$$ packed form
11799A34951L004J765l9K3661R134L981J968O311J3914J5534J5324r825q803p885
11785B02995p057P121r600M35J0642Q529P801n134k226J4766P785J2550M483M003
11771B57093J5248L051J8619K2848J2298J5415j292K4257K5211K8766K7432M0040
11759D88986K1864M642j0305l0912q4421j04755j06671j09887q8418o1861k3790
11748a05528j8107q914J4801K4437J3761J9401J4929K4626J5287O591J4763J7669
11736C3716J4912K9633J3226J6825K7653L5989K9114M2906N2972P6337R8054Q5954
11724E57291O5281L0612O068j3329m0647o6843n9461o3547n3057n5005n6882k0587
11712B29894R208J2303L705K671M176J4220J2953K7507K1409J6858K2553L6620
$$ plain form
11700 414077 441452 456003 472244 493258 521883 536465 536122 550929 564157 557238 551399 543205
11688 543205 542249 530147 524078 497761 506790 501660 485811 475238 469275 480268 490887 498416 503719
11675 503719 520718 548329 593038 634931 655410 682133 720900 744268 765516 806580 834225
11664 834225 853998 876056 903257 942767 980260 1022782 1067201 1119827 1155359 1196582 1235621
11653 1235621 1257130 1268890 1276704 1301656 1321172 1339130 1362386 1384607 1425702 1454463 1479520
11642 1479520 1521225 1566362 1636461 1710365 1785335 1879519 1971423 2075226 2187439 2313595 2459349
11631 2459349 2630930 2790566 2950241 3136529 3360192 3631858 3929489 4235796 4572912
11622 4572912 4953723 5371532 5851412 6432070 7110434 7968737 9051083 10398389 12073417
$$ packed form
11700D14077K7375J4551J6241K1014K8625J4582l43J4807J3228o919n839q194
11688E43205r56j2102o069k6317R029n130j5849j0573n963J0993J0619P529N303
11675E03719J6999K7611M4709M1893K0479K6723L8767K3368K1248M1064K7645
11664H34225J9773K2058K7201L9510L7493M2522M4419N2626L5532M1223L9039
11653A235621K1509J1760P814K4952J9516J7958K3256K2221M1095K8761K5057
11642A479520M1705M5137P0099P3904P4970R4184R1904J03803J12213J26156J45754
11631B459349J71581J59636J59675J86288K23663K71666K97631L06307L37116
11622D572912L80811M17809M79880N80658O78364Q58303J082346J347306J675028
$$ plain form
11613 12073417 14137964 16620296 19485987 22773492 26683626 31613587 38282802 47822325
11605 47822325 61836729 82356198 111204886 148355245 190221436 229352273 256974526
11598 256974526 266981086 258599170 236061688 205857865 173612730 142808277 115192604
11591 115192604 91689584 72747553 58267098 47567834 39676200 33690634 28958573
11584 28958573 25041186 21745150 18947091 16562001 14519426 12783025 11306469 10072925
11576 10072925 9034535 8158079 7419097 6799216 6255913 5785019 5362160 4994978 4651645
11567 4651645 4342219 4054107 3801863 3586315 3379320 3178294 2997759 2832747 2676778
11558 2676778 2526488 2392494 2264577 2115423 1957739 1821431 1708900 1602484 1502989 1409803
$$ packed form
11613A2073417K064547K482332K865691L287505L910134M929961O669215R539523
11605D7822325J4014404K0519469K8848688L7150359M1866191L9130837K7622253
11598B56974526J0006560q381916k2537482l0203823l2245135l0804453k7615673
11591A15192604k3503020j8942031j4480455j0699264p891634n985566m732061
11584B8958573l917387l296036k798059k385090k042575j736401j476556j233544
11576A0072925j038390q76456p38982o19881n43303m70894m22859l67182l43333
11567D651645l09426k88112k52244k15548k06995k01026j80535j65012j55969
11558B676778j50290j33994j27917j49154j57684j36308j12531j06416r9495r3186
$$ plain form
11548 1409803 1333370 1258606 1174445 1104729 1038019 982590 933436 888041 836247 783079 754899
11537 754899 714045 681911 646132 613862 587455 559313 524474 500517 475828 459374 442499
11526 442499 438046 438366 428895 420335 422238 424874 427934 450180 453541 456649 441857 422768 406883
11513 406883 382089 366024 344762 341965 334443 331607 325557 316238 303553 287333 268944 250261
11501 250261 236505 231612 223012 220086 225225 223567 226501 232298 240824 244266 243674 228669 215547 229044
11487 229044 236659 237741 227673 238076 248525 234392 233371 235810 224382 210900 182265 152327
11475 152327 129831 108648 91384 90732 94010 94428 97330 114747 139583 150838 163880 171997 164842
11462 164842 186428 212139 223492 227673 233167 239902 261522 271646 262774 272296 305954 321064
$$ packed form
11548A409803p6433p4764q4161o9716o6710n5429m9154m5395n1794n3168k8180
11537G54899m0854l2134l5779l2270k6407k8142l4839k3957k4689j6454j6875
11526D42499m453L20r471q560J903K636L060K2246L361L108j4792j9089j5885
11513D06883k4794j6065k1262k797p522k836o050r319j2685j6220j8389j8683
11501B50261j3756m893q600k926N139j658K934N797Q526L442n92j5005j3122J3497
11487B29044P615J082j0068J0403J0449j4133j021K439j1428j3482k8635k9938
11475A52327k2496k1183j7264o52L278M18K902J7417K4836J1255J3042Q117p155
11462A64842K1586K5711J1353M181N494O735K1620J0124q872R522L3658J5110
$$ plain form
11450 321064 341655 363163 362028 362170 327056 260052 171722 74932 -29926 -117525 -190021 -232663
11438 -232663 -261700 -271076 -271325 -266539 -254510 -239152 -217834 -196610 -159124 -135618 -126950 -105863
11426 -105863 -98280 -96539 -92522 -88413 -72017 -58745 -65244 -65059 -45451 -16784 -6584 -15272 -25828
11413 -25828 -24267 -16813 -24446 -29526 -33381 -35999 -40969 -49331 -51603 -40650 -40495 -32167 -29977 -18177
11399 -18177 -7186 -8355 -3061 7734 19586 22027 15491 8730 -5129 -7670 -2284 -4254 4632
11386 4632 7324 -5652 661 14746 21241 12658 2784 -465 -10040 -17309 -22662 -18635 -18897 -15949
11372 -15949 -19721 -17820 75 -1182 -7674 -3391 -8688 -20810 -16300 -16945 -22677 -32304 -48342 -42238
11358 -42238 -30495 -15851 -22005 -23463 -28310 -35482 -25356 -19503 -9719 6884 16204 17381 14205
$$ packed form
11450C21064K0591K1508j135J42l5114o7004q8330r6790j04858q7599p2496m2642
11438b32663k9037r376k49M786J2029J5358K1318K1224L7486K3506Q668K1087
11426a05863P583J741M017M109J6396J3272o499J85J9608K8667J0200q688j0556
11413b5828J561P454p633n080l855k618m970q362k272J0953J55Q328K190J1800
11399a8177J0991j169N294J0795J1852K441o536o761j3859k541N386j970Q886
11386D632K692j2976O313J4085O495q583r874l249r575p269n353M027k62K948
11372a5949l772J901J7895j257o492M283n297j2122M510o45n732r627j6038O104
11358d2238J1743J4644o154j458m847p172J0126N853R784J6603R320J177l176
$$ plain form
11345 14205 10523 -925 3715 7507 -2336 -11599 3118 16795 10195 -3006 -4829 4866 9483
11332 9483 1383 -3552 -1368 -9345 -725 1739 11095 10915 4097 -6449 -11539 -2116 -7321 -12162 -19912
11317 -19912 -11438 -9804 -7877 -5233 -8101 -9768 -8281 -9720 -14086 -5077 8421 10745 7363 3753
11303 3753 -1649 -1731 -4072 8794 8827 1995 -2876 -8917 -10564 -20057 -59117 -110360 -139768 -168706
11289 -168706 -188756 -202881 -189714 -170835 -158108 -144112 -116226 -116581 -108677 -76204 -52485 -54754
11277 -54754 -43680 -41435 -35029 -36113 -34200 -18729 -2776 2652 -10913 -12069 192 11310 9935
11264 9935 4948 826 316 -18562 -20433 -14741 -16572 -8598 -8559 -25747 -19621 -12553 -11042 -250 3485
11249 3485 19480 33703 42309 37120 26322 482 -1153 -6323 -1419 -4540 -2770 10955 -2581
$$ packed form
11345A4205l682j1448M640L792r843r263J4717J3677o600j3201j823R695M617
11332I483q100m935K184p977Q620K464R356j80o818j0546n090R423n205m841p750
11317a9912Q474J634J927K644k868j667J487j439m366R009J3498K324l382l610
11303C753n402q2k341J2866L3o832m871o041j647r493l9060n1243k9408k8938
11289a68706k0050j4125J3167J8879J2727J3996K7886l55P904L2473K3719k269
11277e4754J1074K245O406j084J913J5471J5953N428j3565j156J2261J1118j375
11264I935m987m122n10j8878j871N692j831P974L9j7188O126P068J511J0792L735
11249C485J5995J4223Q606n189j0798k5840j635n170M904l121J770J3725j3536
$$ plain form
11236 -2581 -3203 -3188 -20629 -25023 -17495 -30157 -28797 -13784 -20874 -28196 -16142 6487 11308 8991
11222 8991 8776 7035 2729 8943 -3315 -18608 -18942 -13435 -15143 -8388 3982 20040 15831 3172
11208 3172 -6298 -15528 -15801 813 1625 -4964 -8931 -8984 8719 15583 11159 9916 16787 11049 1155
11193 1155 -13463 -8372 6377 10473 15032 28869 27649 21755 11582 11062 19638 20540 9176 23851
11179 23851 35079 32077 22280 19668 25401 28948 30459 24794 20172 5270 -4290 -1146 -8324 -7230
11165 -7230 567 6560 7365 1948 4973 7908 15452 16734 21982 11175 5956 -3229 -3231 -1443 -4512
11150 -4512 -7511 -10954 -4683 -4774 -6524 -6963 940 8745 17170 11224 9491 18279 25766 36661 47619
11135 47619 61326 82062 113769 145331 177203 216432 258160 324707 423063 581099 772503
$$ packed form
11236b581o22J5j7441m394P528j2662J360J5013p090p322J2054K2629M821k317
11222H991k15j741m306O214j2258j5293l34N507j708O755J2370J6058m209j2659
11208C172r470r230k73J6614Q12o589l967n3J7703O864m424j243O871n738r894
11193A155j4618N091J4749M096M559J3837j220n894j0173n20Q576R02j1364J4675
11179B3851J1228l002r797k612N733L547J511n665m622j4902r560L144p178J094
11165g230P797N993Q05n417L025K935P544J282N248j0807n219r185kJ788l069
11150d512k999l443O271r1j750m39P903P805Q425n946j733Q788P487J0895J0958
11135D7619J3707K0736L1707L1562L1872L9229M1728O6547R8356J58036J91404
$$ plain form
11124 772503 974718 1192022 1354110 1422983 1386219 1291893 1152430 973066 805537 657039
11114 657039 539232 438210 351105 291914 244632 197968 161174 142927 131830 106137 84807
11103 84807 70207 54042 37813 31598 32870 36028 38806 31305 23685 22177 22865 19579 14700 14865
11089 14865 17802 10599 6295 11279 2900 -647 261 -5340 -3189 -10161 -3532 -9339 -22936 -27826
11075 -27826 -26027 -17789 -9381 -8737 -10869 -28232 -22911 -5859 5755 11487 -2361 -4816 -6365 -1198
11061 -1198 447 4794 11407 -3866 -16171 -12439 2412 9605 3885 -1643 -8505 -3047 5074 -6285
11047 -6285 -9131 1431 2757 10890 14360 12561 1059 2283 -8225 -12639 -21313 -16964 -14650 -16337
11033 -16337 -18438 -11807 -9589 -2854 10985 13782 16524 9215 3842 7541 2101 -14871 -25237 -30033
$$ packed form
11124G72503K02215K17304J62088O8873l6764r4326j39463j79364j67529j48498
11114F57039j17807j01022q7105n9191m7282m6664l6794j8247j1097k5693k1330
11103H4807j4600j6165j6229o215J272L158K778p501p620j508O88l286m879J65
11089A4865K937p203m304M984q379l547R08n601K151o972O629n807j3597m890
11075b7826J799Q238Q408O44k132j7363N321J7052J1614N732j3848k455j549N167
11061a198J645M347O613j5273j2305L732J4851P193n720n528o862N458Q121j1359
11047f285k846J0562J326Q133L470j799j1502J224j0508m414q674M349K314j687
11033a6337k101O631K218O735J3839K797K742p309n373L699n440j6972j0366m796
$$ plain form
11019 -30033 -17535 -4149 -442 -6265 -6161 -13395 -2510 -5000 -21785 -17955 -8876 -10443 -12095 4246
11005 4246 13046 5027 3530 -5672 -1930 9166 9408 -5167 -12743 -11454 -18763 -17574 -7507 13230
10991 13230 11927 -220 4218 12286 6207 1990 150 7751 21750 31542 18055 1669 -1926
10978 -1926 -3711 -7674 -2754 6957 935 5610 14193 16050 15285 13160 4086 -4409 2695 9224 15581
10963 15581 12518 18225 28351 21053 7109 8818 5488 893 11443 14022 18309 26273 18081 17304
10949 17304 9664 -1713 -1065 2412 11534 7283 9626 10419 6604 -2644 3609 4871 -7445 -4543
10935 -4543 -2604 -1676 -1742 -1210 2961 19379 19103 9430 10381 13938 6546 -1484 -1606 -1683 7455 18251
10919 18251 10504 8812 3317 -5481 -4286 7603 6194 -4893 -9859 1397 18158 25331 23156
$$ packed form
11019c0033J2498J3386L707n823J04p234J0885k490j6785L830R079j567j652J6341
11005D246Q800q019j497r202L742J1096K42j4575p576J289p309J189J0067K0737
10991A3230j303j2147M438Q068o079m217j840P601J3999R792j3487j6386l595
10978a926j785l963M920R711o022M675Q583J857p65k125r074q495P104O529O357
10963A5581l063N707J0126p298j3944J709l330m595J0550K579M287P964q192p77
10949A7304p640j1377O48L477R122m251K343P93l815r248O253J262j2316K902
10935d543J939R28o6N32M171J6418k76r673R51L557p392q030j22p7R138J0796
10919A8251p747j692n495q798J195J1889j409j1087m966J1256J6761P173k175
$$ plain form
10906 23156 5889 24837 39306 30659 27689 36228 38310 35781 41359 41820 22178 8258 11622
10893 11622 7908 7396 6881 -4800 1456 -631 -1493 10972 7126 3198 -10545 -12280 1818 9465
10879 9465 16686 31750 37536 34538 14927 5137 703 2771 13530 17485 26063 28737 24117 16519
10865 16519 21978 29094 39314 45980 39991 42164 45475 42710 37546 19135 7714 8784 15627 19624
10851 19624 17137 -1595 -15750 -17444 197 11659 14094 24629 23448 25633 27133 17436 28704
10838 28704 30468 20007 8972 -1723 2837 9957 -985 2815 2364 -2258 -6948 -5790 -2154 -9410
10824 -9410 -10414 -16408 -24820 -22287 -9309 -6922 -8394 -5792 2115 11040 10796 3130 2183 -4132 3007
10809 3007 19479 13824 4920 -4762 -19030 -21726 -7943 -347 268 568 -3179 -7420 -6536 -8182 2836
$$ packed form
10906B3156j7267J8948J4469q647k970Q539K082k529N578M61j9642j3920L364
10893A1622l714n12n15j1681O256k087q62J2465l846l928j3743j735J4098P647
10879I465P221J5064N786k998j9611r790m434K068J0759L955Q578K674m620p598
10865A6519N459P116J0220O666n989K173L311k765n164j8411j1421J070O843L997
10851A9624k487j8732j4155j694J7641J1462K435J0535j181K185J500r697J1268
10838B8704J764j0461j1035j0695M560P120j0942L800m51m622m690J158L636p256
10824i410j004n994q412K533J2978K387j472K602P907Q925k44p666r47o315P139
10809C007J6472n655q904r682j4268k696J3783P596O15L00l747m241Q84j646J1018
$$ plain form
10794 2836 9892 13494 16619 1056 -6273 -18702 -20174 -21273 -13620 -1651 -5275 -14829 -19951 -12454
10780 -12454 -14463 -6931 2566 12381 10398 22842 27722 10751 9214 28775 47120 52873 52102 51951
10766 51951 43405 38073 26524 9013 -1863 12888 15259 17546 28130 33879 37398 22884 20295
10753 20295 20259 11590 4415 -374 -4564 885 6236 932 -13997 -21691 -21491 -14606 -2962 11061
10739 11061 28339 27376 23317 21425 17175 16878 31064 33522 35476 15188 1857 3361 2290 5090
10725 5090 11822 4455 -12741 -3138 13707 29452 40725 33170 8388 6564 13376 -5431 -16863
10712 -16863 2059 9233 13461 30882 19768 11454 14979 21469 12949 -7250 -8645 -6069 -1441
10699 -1441 9093 24615 26541 31705 29629 33261 41352 16219 -4097 3537 25409 33862 21566
$$ packed form
10794B836P056L602L125j5563p329j2429j472j099P653J1969l624r554n122P497
10780a2454k009P532R497R815j983J2444M880j6971j537J9561J8345N753p71j51
10766E1951q546n332j1549j7511j0876J4751K371K287J0584N749L519j4514k589
10753B0295l6q669p175m789m190N449N351n304j4929p694K00O885J1644J4023
10739A1061J7278r63m059j892m250k97J4186K458J954k0288j3331J504j071K800
10725E090O732p367j7196R603J6845J5745J1273p555k4782j824O812j8807j1432
10712a6863J8922P174M228J7421j1114q314L525O490q520k0199j395K576M628
10699a441J0534J5522J926N164k076L632Q091k5133k0316P634K1872Q453j2296
$$ plain form
10686 21566 26267 31550 25360 35561 30702 29030 24572 2892 -3175 -4984 5408 9002 11615 16712
10672 16712 15749 18270 11098 12750 20155 13154 8890 25603 38100 31655 32689 29161 35230 21746
10658 21746 26417 32278 27010 23962 22027 26035 22618 24458 22939 18609 20066 18295 12630 11732 19772
10643 19772 21105 3240 -3804 -11332 11494 30424 42307 23249 21366 8604 13849 19479 31240
10630 31240 32791 23650 24494 20817 18442 18216 28043 20590 7037 11538 31185 32204 32894 38088 50076
10615 50076 42578 31968 38634 36286 38994 38599 37049 26511 21406 18733 18857 32870 39679 31099
10601 31099 22023 28519 28921 7125 11977 26273 35664 37194 45487 40156 26770 32911 42710 33620
10587 33620 29168 38649 33834 26058 21672 32705 39318 30522 19442 11773 7360 19377 32653
$$ packed form
10686B1566M701N283o190J0201m859j672m458k1680o067j809J0392L594K613N097
10672A6712r63K521p172J652P405p001m264J6713J2497o445J034l528O069j3484
10658B1746M671N861n268l048j935M008l417J840j519m330J457j771n665q98Q040
10643A9772J333j7865p044p528K2826J8930J1883j9058j883j2762N245N630J1761
10630C1240J551r141Q44l677k375k26R827p453j3553M501J9647J019O90N194J1988
10615E0076p498j0610O666k348K708l95j550j0538n105k673J24J4013O809q580
10601C1099r076O496M02k1796M852J4296R391J530Q293n331j3386O141R799r090
10587C3620m452R481m815p776m386J1033O613q796j1080p669m413J2017J3276
$$ plain form
10574 32653 34424 8863 -738 5783 20688 23306 27760 30421 29499 31277 27525 27614 32545 22464
10560 22464 22348 13545 15250 14780 29783 10702 1380 3329 12125 21967 27654 27818 25389 24846 24537
10545 24537 28877 27070 38320 29578 28015 37016 38584 29295 10428 4976 11046 5204 4166 22598
10531 22598 36719 39616 40272 46572 30231 25469 24388 28102 34260 33776 26877 13317 25802 42842
10517 42842 37978 29191 26652 29226 36188 31215 12188 12518 22137 24302 24840 36069 35577 36510 33417
10502 33417 20485 20231 23425 32593 38337 28193 20919 9494 10709 14917 23340 27890 16503 11390
10488 11390 15759 30452 37508 34067 21309 29279 30492 33115 34506 24820 20475 30435 35390 25045
10474 25045 26511 35735 33202 23057 9213 12671 17117 11976 22227 50781 46525 40368 49997
$$ packed form
10574C2653J771k5561r601O521J4905K618M454K661r22J778l752Q9M931j0081
10560B2464j16q803J705m70J5003j9081r322J949Q796R842N687J64k429n43l09
10545B4537M340j807J1250q742j563R001J568r289j8867n452O070n842j038J8432
10531B2598J4121K897O56O300j6341m762j081L714O158m84o899j3560J2485J7040
10517D2842m864q787k539K574O962m973j9027L30R619K165N38J1229m92R33l093
10502C3417j2932k54L194R168N744j0144p274j1425J215M208Q423M550j1387n113
10488A1390M369J4693P056l441j2758P970J213K623J391r686m345R960M955j0345
10474B5045J466R224k533j0145j3844L458M446n141J0251K8554m256o157R629
$$ plain form
10461 49997 54267 46739 41633 44413 39227 21427 25532 25244 32447 36182 39432 29806 34935 47326
10447 47326 25062 19086 18993 18345 31076 34532 24136 41860 35658 25879 39837 46655 28711 10447
10433 10447 3662 11710 27380 39993 56162 56052 51867 48710 37291 38189 37447 22858 14365 19093
10419 19093 25937 31393 26446 33715 29282 38798 49459 42692 36645 45855 53558 59754 54160 50863
10405 50863 53142 48837 39469 44584 52583 53882 52681 40980 42976 61246 52603 46372 54190 57900
10391 57900 63126 58849 57084 59836 50338 45539 32322 35823 35820 36120 34121 26067 30967 34149 34147 48132
10375 48132 54592 73976 84256 84081 71327 63754 54973 46427 65012 92407 97220 86248 77687
10362 77687 71551 67438 75669 76952 61018 48741 56853 76441 102341 100105 89378 94868 103026
$$ packed form
10461D9997M270p528n106K780n186j7800M105k88P203L735L250r626N129J2391
10447D7326k2264n976r3o48J2731L456j0396J7724o202r779J3958O818j7944j8264
10433A0447o785Q048J5670J2613J6169j10m185l157j1419Q98p42j4589q493M728
10419A9093O844N456m947P269m433R516J0661o767o047R210P703O196n594l297
10405E0863K279m305r368N115P999J299j201j1701J996J8270q643o231P818L710
10391E7900N226m277j765K752r498m799j3217L501lL00j999q054M900L182kJ3985
10375D8132O460J9384J0280j75j2754p573q781q546J8585K7395M813j0972q561
10362G7687o136m113Q231J283j5934j2277Q112J9588K5900k236j0727N490Q158
$$ plain form
10349 103026 106481 102518 110095 107442 100789 87085 76113 77403 77883 67658 72240 75486 79230 84939
10335 84939 71688 60465 61580 70036 52918 30587 38924 47738 51135 56869 48498 39109 37404
10322 37404 38174 36959 30275 37906 70739 88935 68000 48965 41454 50585 57490 61176 51483 65732
10308 65732 72113 61901 77454 89442 66781 55995 80714 96385 102887 110063 109868 94726 67718
10295 67718 66031 67340 52826 59503 83139 100579 100480 90098 88166 89897 86146 84357 79974 77026
10281 77026 75738 79248 73986 70923 68448 70084 71349 88083 92805 103580 97289 93286 101350 97850
10267 97850 100174 89796 80278 62408 60489 74483 99792 95476 81750 79306 86734 107715 117229
10254 117229 108552 104467 103705 105010 115351 114501 116792 120441 118636 118742 127737 113980 106847 105765
$$ packed form
10349A03026L455l963P577k653o653j3704j0972J290M80j0225M582L246L744N709
10335H4939j3251j1223J115Q456j7118k2331Q337Q814L397N734q371r389j705
10322C7404P70j215o684P631L2833J8196k0935j9035p511R131O905L686r693J4249
10308F5732O381j0212J5553J1988k2661j0786K4719J5671O502P176j95j5142k7008
10295F7718j687J309j4514O677K3636J7440r9j0382j932J731l751j789m383k948
10281G7026j288L510n262l063k475J636J265J6734M722J0775o291m003Q064l500
10267I7850K324j0378r518j7870j919J3994K5309m316j3726k444P428K0981R514
10254A17229q677m085p62J305J0341q50K291L649j805J06Q995j3757p133j082
$$ plain form
10240 105765 115236 130906 132594 131566 128133 133242 134267 146716 154957 174960 201448 203160 196560
10227 196560 188365 195594 196347 212575 227781 231885 239221 232013 234964 251408 265667 270615 272027
10214 272027 283237 301406 308619 316449 332664 349023 355948 377491 382975 387279 392692 397531 393616
10201 393616 402668 417482 412728 401084 407924 417286 416052 419968 432310 453791 465275 481751 489256
10188 489256 500853 525579 543659 547056 558681 548462 526023 524868 525277 513765 519262 528668 521559
10175 521559 500551 498997 496661 486315 489635 490318 489503 490952 475526 472924 463558 450194 439881
10162 439881 433390 425833 423346 419966 408620 391900 375923 363502 360755 347166 342211 330946 308016
10149 308016 294430 280808 277099 266633 256452 247225 245140 248497 241497 239690 240798 242050 226692
$$ packed form
10240A05765R471J5670J688j028l433N109J025J2449Q241K0003K6488J712o600
10227A96560q195P229P53J6228J5206M104P336p208K951J6444J4259M948J412
10214B72027J1210J8169P213P830J6215J6359O925K1543N484M304N413M839l915
10201C93616R052J4814m754j1644O840R362j234L916J2342K1481J1484J6476P505
10188D89256J1597K4726J8080L397J1625j0219k2439j155M09j1512N497R406p109
10175E21559k1008j554k336j0346L320O83q15J449j5426k602r366j3364j0313
10162D39881o491p557k487l380j1346j6720j5977j2421k747j3589m955j1265k2930
10149C08016j3586j3622l709j0466j0181r227k085L357p000j807J108J252j5358
$$ plain form
10136 226692 202947 196094 203691 191621 185750 186832 177061 170141 178083 195196 192845 174430 163904
10123 163904 153950 157603 166017 169974 179011 182860 166396 169555 170349 172942 172905 167906 173772 164046 154620
10108 154620 146380 153850 162417 169861 168344 168553 162998 148328 146585 159409 165390 158109 152060 160263
10094 160263 181193 183365 170649 176494 187991 190674 185814 178828 181595 183868 192014 206893 199248
10081 199248 186845 193313 196581 198755 200389 203068 197193 186839 191489 194694 201729 198455 197475 195897
10067 195897 196917 187596 184638 193176 206594 207265 205794 212522 219099 234155 234392 241701 250760 257896
10053 257896 258357 254253 248449 251182 243394 245100 230149 224199 231469 247123 256789 249035 235256 231585
10039 231585 236461 236148 240637 230869 222086 232966 243173 251379 246997 237905 225187 227199 230531 240298
$$ packed form
10136B26692k3745o853P597j2070n871J082r771o920P942J7113k351j8415j0526
10123A63904r954L653Q414L957R037L849j6464L159P94K593l7m999N866r726r426
10108A54620q240P470Q567P444j517K09n555j4670j743J2824N981p281o049Q203
10094A60263K0930K172j2716N845J1497K683m860o986K767K273Q146J4879p645
10081A99248j2403O468L268K174J634K679n875j0354M650L205P035l274r80j578
10067A95897J020r321k958Q538J3418O71j471O728O577J5056K37P309R059P136
10053B57896M61m104n804K733p788J706j4951n950P270J5654R666p754j3779l671
10039B31585M876l13M489r768q783J0880J0207Q206m382r092j2718K012L332R767
$$ plain form
10025 240298 237467 226658 232489 235975 238898 238600 228491 238333 255895 270491 259987 252169 258464
10012 258464 259186 259094 268662 273634 277008 270175 259590 255725 252939 247958 251418 260039 254175 253032 246187
9997 246187 233178 250217 260747 275240 274184 261036 256991 258693 261460 260746 250130 231772 232076
9984 232076 225197 227262 222554 224616 230939 239187 240609 228169 230915 241523 233636 233010 245715 245609
9970 245609 258147 266081 253176 254039 252217 239411 236150 248415 265357 271208 272113 275155 279233 294850
9956 294850 291704 294889 297510 292583 285305 276346 280900 289807 295253 295340 291679 288839 290229 294797 304357
9941 304357 306005 310403 305548 304395 305256 313681 314894 312201 333001 352466 353284 357750 346729 342429
9927 342429 334921 334682 332346 336766 345814 325491 322854 327833 336744 353956 351721 352490 344632 340486
$$ packed form
10025B40298k831j0809N831L486K923k98j0109R842J7562J4596j0504p818O295
10012B58464P22r2R568M972L374o833j0585l865k786m981L460Q621n864j143o845
9997B46187j3009J7039J0530J4493j056j3148m045J702K767p14j0616j8358L04
9984B32076o879K065m708K062O323Q248J422j2440K746J0608p887o26J2705j06
9970B45609J2538P934j2905Q63j822j2806l261J2265J6942N851R05L042M078J5617
9956B94850l146L185K621m927p278q959M554Q907N446Q7l661k840J390M568R560
9941C04357J648M398m855j153Q61Q425J213k693K0800J9465Q18M466j1021m300
9927C42429p508k39k336M420R048k0323k637M979Q911J7212k235P69p858m146
$$ plain form
9913 340486 331899 333483 330150 338575 352346 363036 355940 347790 334572 346373 349734 349992 352797 354964
9899 354964 353451 345467 340995 357656 374796 379306 385706 397888 410502 403809 406504 407631 408041 419975
9885 419975 419709 414183 428660 453249 466422 470221 473955 477171 476413 492626 496173 486364 486876 517242
9871 517242 538808 547905 554282 543555 542651 547857 561626 575261 591564 612161 626626 656696 688279
9858 688279 724668 754076 786265 813926 838469 869770 905198 931311 967526 1004086 1043626 1097492
9846 1097492 1148987 1204426 1281711 1392998 1505927 1603451 1709946 1845887 2004734 2173829
9836 2173829 2383697 2613802 2858727 3130913 3415326 3710849 4033643 4341831 4673963 5029623
9826 5029623 5395528 5790088 6227823 6694275 7183770 7730693 8353697 9038887 9782912 10593204
$$ packed form
9913C40486q587J584l333Q425J3771J0690p096q150j3218J1801L361K58K805K167
9899C54964j513p984m472J6661J7140M510O400J2182J2614o693K695J127M10J1934
9885D19975k66n526J4477K4589J3173L799L734L216p58J6213L547r809N12L0366
9871E17242K1566R097O377j0727r04N206J3769J3635J6303K0597J4465L0070L1583
9858F88279L6389K9408L2189K7661K4543L1301L5428K6113L6215L6560L9540N3866
9846A097492N1495N5439P7285J11287J12929R7524J06495J35941J58847J69095
9836B173829K09868K30105K44925K72186K84413K95523L22794L08188L32132L55660
9826E029623L65905L94560M37735M66452M89495N46923O23004O85190P44025Q10292
$$ plain form
9816 10593204 11457249 12386579 13387383 14454024 15579341 16735498 17928407 19128625
9808 19128625 20330729 21541303 22739660 23940141 25161580 26397002 27641408 28880174
9800 28880174 30172552 31521767 32949941 34485488 36141972 37937667 39863054 41885814
9792 41885814 43942442 45989060 47999588 49988050 51895990 53660745 55256072 56691793
9784 56691793 58008369 59231916 60356698 61389521 62361836 63278364 64217197 65206113 66269465
9775 66269465 67425677 68684044 70058671 71467784 72890813 74306088 75628445 76754519
9767 76754519 77560419 77941118 77928469 77600850 77050471 76311736 75432165 74514383 73608737 72755424
9757 72755424 71973645 71274381 70640216 70057476 69513217 68964852 68420469 67851580 67207137
$$ packed form
9816A0593204Q64045R29330J000804J066641J125317J156157J192909J200218
9808A9128625J202104J210574J198357J200481J221439J235422J244406J238766
9800B8880174J292378J349215J428174J535547J656484J795695J925387K022760
9792D1885814K056628K046618K010528J988462J907940J764755J595327J435721
9784E6691793J316576J223547J124782J032823R72315R16528R38833R88916J063352
9775F6269465J156212J258367J374627J409113J423029J415275J322357J126074
9767G6754519Q05900L80699j2649l27619n50379p38735q79571r17782r05646q53313
9757G2755424p81779o99264o34165n82740n44259n48365n44383n68889o44443
$$ plain form
9748 67207137 66398952 65388065 64184785 62810306 61273621 59557967 57637160 55531291
9740 55531291 53345689 51166061 49069752 47096413 45228135 43496579 41911444 40428866
9732 40428866 39010763 37642951 36297420 34959685 33628207 32296404 30937867 29539216
9724 29539216 28069773 26548106 25025872 23529998 22069330 20649270 19268640 17953116
9716 17953116 16699989 15515456 14418583 13420177 12500883 11657462 10894441 10193361 9568156
9707 9568156 8998382 8459426 7938497 7423754 6906272 6401741 5923777 5480131 5057965 4644177
9697 4644177 4259934 3923349 3615741 3329138 3075543 2845100 2643009 2453189 2291023 2158229
9687 2158229 2038591 1937515 1833536 1754251 1696483 1642247 1592048 1551927 1512658 1485790 1449804
$$ packed form
9748F7207137q08185j010887j203280j374479j536685j715654j920807k105869
9740E5531291k185602k179628k096309j973339j868278j731556j585135j482578
9732D0428866j418103j367812j345531j337735j331478j331803j358537j398651
9724B9539216j469443j521667j522234j495874j460668j420060j380630j315524
9716A7953116j253127j184533j096873r98406r19294q43421p63021p01080o25205
9707I568156n69774n38956n20929n14743n17482n04531m77964m43646m22166m13788
9697D644177l84243l36585l07608k86603k53595k30443k02091j89820j62166j32794
9687B158229j19638j01076j03979p9285n7768n4236n0199m0121l9269k6868l5986
$$ plain form
9676 1449804 1425273 1406019 1393578 1384181 1369105 1360180 1340272 1339383 1316725 1293617 1275528 1259135
9664 1259135 1250509 1243299 1222810 1204968 1215130 1217634 1221595 1219187 1210592 1211492 1197974 1184867 1173602
9651 1173602 1162622 1155408 1144615 1119532 1092152 1065399 1029609 993260 965941 947986 937561 924744
9639 924744 895141 870045 851044 851416 845164 834894 831693 827958 810761 793864 787042 761628 740012
9626 740012 736520 727069 729933 719538 716611 705694 692943 699166 689531 673720 679934 674469 660547
9613 660547 666554 673744 675048 679370 694270 704858 718697 739025 745645 752156 747309 735544 735275
9600 735275 744410 755681 787602 797528 808319 821760 821353 826342 817724 801693 770778 757468 743627
9587 743627 732810 731684 725953 726757 709372 689082 664992 648814 638190 644430 642473 624129 615869
$$ packed form
9676A449804k4531j9254j2441r397j5076q925j9908q89k2658k3108j8089j6393
9664A259135q626p210k0489j7842J0162K504L961k408q595R00j3518j3107j1265
9651A173602j0980p214j0793k5083k7380k6753l5790l6349k7319j7955j0425j2817
9639I24744k9603k5096j9001L72o252j0270l201l735j7197j6897o822k5414k1616
9626G40012l492r451K864j0395k927j0917j2751O223r635j5811O214n465j3922
9613F60547O007P190J304M322J4900J0588J3839K0328O620O511m847j1765k69
9600G35275R135J1271L1921R926J0791J3441m07M989q618j6031l0915j3310j3841
9587G43627j0817j126n731Q04j7385k0290k4090j6178j0624O240j957j8344q260
$$ plain form
9574 615869 613475 604882 596897 579932 564527 550656 525493 483487 475149 467951 449975 449295 464001
9561 464001 461760 450657 433544 396749 369953 371758 375208 370201 355499 337168 334205 327177 330195
9548 330195 333293 345538 350000 343438 354630 356673 367548 370117 381790 397698 411194 431208 444931
9535 444931 435969 437145 439307 439956 436839 462634 480955 497716 514809 507035 512270 525659 541282
9522 541282 557514 565430 573798 570837 578968 584595 593941 586546 588943 597046 598757 592653 606478 612537
9508 612537 613698 601856 606048 600950 600816 605425 597959 596193 599816 624263 634414 634441 658547 677489
9494 677489 706377 745601 787071 841543 893173 961087 1024650 1090836 1164234 1244325 1328383 1391543
9482 1391543 1455065 1518762 1558506 1599872 1640270 1670040 1676543 1669860 1666777 1660817 1647079 1647136 1647306
$$ packed form
9574F15869k394q593p985j6965j5405j3871k5163m2006q338p198j7976o80J4706
9561D64001k241j1103j7113l6795k6796J805L450n007j4702j8331k963p028L018
9548C30195L098J2245M462o562J1192K043J0875K569J1673J5908J3496K0014J3723
9535D44931q962J176K162O49l117K5795J8321J6761J7093p774N235J3389J5623
9522E41282J6232P916Q368k961Q131N627R346p395K397Q103J711o104J3825O059
9508F12537J161j1842M192n098j34M609p466j766L623K4447J0151K7K4106J8942
9494F77489K8888L9224M1470N4472N1630O7914O3563O6186P3398Q0091Q4058O3160
9482A391543O3522O3697L9744M1366M0398K9770O503o683l083n960j3738N7J70
$$ plain form
9469 1647306 1627875 1618084 1617664 1618545 1622350 1627202 1625827 1622933 1629755 1637661 1648769 1643327 1649989 1642268
9455 1642268 1599030 1545465 1486896 1447567 1391726 1330568 1264142 1208563 1135729 1058578 1018723
9444 1018723 975032 947718 902725 875668 846355 819272 801313 789369 770771 764536 743673 734535
9432 734535 722793 716116 717009 716879 708131 708372 698877 700835 700104 695126 699745 708147 709914 705292 706800
9417 706800 719616 728468 730276 727400 744510 742118 747460 773208 792943 815457 831452 843186 850041
9404 850041 869490 883468 906190 935840 983355 1024411 1059999 1100406 1144906 1195527 1237122 1268166
9392 1268166 1311735 1346113 1380211 1414878 1473298 1533231 1591445 1660269 1735657 1821523 1906189
9381 1906189 1998178 2102562 2226590 2373031 2523566 2691296 2881916 3105519 3366300 3678004
$$ packed form
9469A647306j9431r791m20Q81L805M852j375k894O822P906J1108n442O662p721
9455A642268m3238n3565n8569l9329n5841o1158o6426n5579p2834p7151l9855
9444A018723m3691k7314m4993k7057k9313k7083j7959j1944j8598o235k0863r138
9432G34535j1742o677Q93j30q748K41r495J958p31m978M619Q402J767m622J508
9417G06800J2816Q852J808k876J7110k392N342K5748J9735K2514J5995J1734O855
9404H50041J9449J3978K2722K9650M7515M1056L5588M0407M4500N0621M1595L1044
9392A268166M3569L4378L4098L4667N8420N9933N8214O8824P5388Q5866Q4666
9381A906189R1989J04384J24028J46441J50535J67730J90620K23603K60781L11704
$$ plain form
9371 3678004 4014229 4379519 4804932 5274183 5812287 6422533 7067155 7783768 8543604 9335456
9361 9335456 10153515 11006027 11887342 12757956 13617120 14442319 15235509 15956594 16605630 17204055
9351 17204055 17765923 18301672 18776654 19233864 19724162 20239344 20807972 21438895 22115207
9342 22115207 22821108 23538849 24262779 24954386 25555529 26027496 26404544 26685643 26833345
9333 26833345 26796466 26560483 26161703 25638484 25012253 24323373 23596001 22848761 22115909 21447431
9323 21447431 20812812 20239006 19722177 19245603 18767230 18308331 17882044 17445861 16972314
9314 16972314 16434197 15848186 15237511 14607331 13976203 13331924 12722036 12146618 11610967
9305 11610967 11146373 10748116 10437150 10209110 10086763 10073404 10148764 10326786 10655192 11109278
$$ packed form
9371C678004L36225L65290M25413M69251N38104O10246O44622P16613P59836P91852
9361I335456Q18059Q52512Q81315Q70614Q59164Q25199P93190P21085O49036N98425
9351A7204055N61868N35749M74982M57210M90298N15182N68628O30923O76312
9342B2115207P05901P17741P23930O91607O01143M71967L77048K81099J47702
9333B6833345l6879k35983l98780n23219o26231o88880p27372p47240p32852o68478
9323B1447431o34619n73806n16829m76574m78373m58899m26287m36183m73547
9314A6972314n38117n86011o10675o30180o31128o44279o09888n75418n35651
9305A1610967m64594l98257l10966k28040j22347j3359P5360J78022L28406M54086
$$ plain form
9295 11109278 11683154 12403520 13320835 14451160 15757852 17292632 19071580 21086188 23318870
9286 23318870 25749224 28330783 31066943 33909458 36815712 39731185 42615548 45415268
9278 45415268 48043760 50478085 52740030 54850302 56797547 58608980 60359522 62145182
9270 62145182 64033552 66022534 68169156 70510575 73035369 75684433 78390977 81071720
9262 81071720 83587437 85814695 87644095 89080713 90106312 90668470 90728662 90231579 89197641
9253 89197641 87667466 85745446 83595123 81363979 79127165 76935898 74809003 72837474
9245 72837474 71061246 69474027 68014054 66613903 65272360 64000068 62752068 61472952
9237 61472952 60151734 58845888 57653986 56586258 55582076 54561705 53609815 52874431
$$ packed form
9295A1109278N73876P20366R17315J130325J306692J534780J778948K014608K232682
9286B3318870K430354K581559K736160K842515K906254K915473K884363K799720
9278D5415268K628492K434325K261945K110272J947245J811433J750542J785660
9270F2145182J888370J988982K146622K341419K524794K649064K706544K680743
9262H1071720K515717K227258J829400J436618J025599N62158O0192m97083j033938
9253H9197641j530175j922020k150323k231144k236814k191267k126895j971529
9245G2837474j776228j587219j459973j400151j341543j272292j248000j279116
9237F1472952j321218j305846j191902j067728j004182j020371r51890p35384
$$ plain form
9229 52874431 52436441 52396197 52749051 53069578 53002285 52976163 53572636 54958984 57006880 59271445
9219 59271445 61195141 62464423 63251350 63856268 64445212 65212277 66282058 67768897 69840527
9210 69840527 72296514 74527301 76213617 77574521 78984996 80797164 83316748 86416180
9202 86416180 89259761 90976393 91560136 91571758 91275691 90604172 89591907 88523887 87686988
9193 87686988 87103560 86556425 85709663 84297603 82204603 79525935 76502271 73316392 70136990
9184 70136990 67276378 64826264 62475841 59995055 57662407 55711431 54063521 52608901
9176 52608901 51137495 49143413 46467562 43818375 41725310 39871174 37582452 34686005
9168 34686005 31673912 28973440 26565886 24263935 21991315 19876740 18064207 16555262
$$ packed form
9229E2874431m37990m0244L52854L20527o7293k6122N96473J386348K047896K264565
9219E9271445J923696J269282P86927O04918N88944P67065J069781J486839K071630
9210F9840527K455987K230787J686316J360904J410475J812168K519584L099432
9202H6416180K843581J716632N83743J1622k96067o71519j012265j068020q36899
9193H7686988n83428n47135q46762j412060k093000k678668l023664l185879l179402
9184G0136990k860612k450114k350423k480786k332648j950976j647910j454620
9176E2608901j471406j994082k675851k649187k093065j854136k288722k896447
9168C4686005l012093k700472k407554k301951k272620k114575j812533j508945
$$ plain form
9160 16555262 15325646 14315034 13507860 12893810 12468857 12210486 12098882 12159407 12398949
9151 12398949 12786009 13294208 13952874 14670462 15359616 16013314 16667701 17342882 18050068
9142 18050068 18666945 19098470 19374893 19566307 19732511 19965640 20357526 20860131 21350755
9133 21350755 21841183 22410949 23147788 24079779 25174404 26329575 27413494 28310421 28926686
9124 28926686 29294830 29488314 29588243 29656155 29686624 29698323 29732204 29810633 29825206 29608039 29088847
9113 29088847 28475456 28030685 27848453 27854249 27912865 27946123 27930442 27972366 28241113 28791494
9103 28791494 29581354 30609410 31941446 33641659 35713381 37993465 40483515 43431090
9095 43431090 47152519 51967077 58176200 66129162 76171130 88541347 103307579 120038230
$$ packed form
9160A6555262j229616j010612q07174o14050m24953k58371j11604O0525K39542
9151A2398949L87060N08199O58666P17588O89154O53698O54387O75181P07186
9142A8050068O16877M31525K76423J91414J66204K33129L91886N02605M90624
9133B1350755M90428N69766P36839R31991J094625J155171J083919Q96927O16265
9124B8926686L68144J93484R9929O7912L0469J1699L3881P8429J4573k17167n19192
9113B9088847o13391m44771j82232N796N8616L3258j5681M1924K68747N50381
9103B8791494P89860J028056J332036J700213K071722K280084K490050K947575
9095D3431090L721429M814558O209123P952962J0041968J2370217J4766232J6730651
$$ plain form
9087 120038230 137959129 156479187 175192402 193672068 211253262 227150807 240658352
9080 240658352 251305757 258864302 263241460 264343759 262255305 257722581 251955265 246103166
9072 246103166 240927176 236825218 234025519 232730151 233115511 235262867 239146358 244447405
9064 244447405 250402296 255895888 259887003 261733236 261004394 257376773 250805597 241586444
9056 241586444 230235617 216587266 200051819 181813861 162968039 144185602 126258586
9049 126258586 109781647 95159442 82522672 71718689 62545239 54811942 48299438
9042 48299438 42805204 38125365 34093151 30593415 27546239 24897693 22580054 20555121
9034 20555121 18772675 17190584 15803816 14594045 13508619 12545628 11710727 10975929 10300825
$$ packed form
9087A20038230J7920899J8520058J8713215J8479666J7581194J5897545J3507545
9080B40658352J0647405P558545M377158J102299k088454m532724n767316n852099
9072B46103166n175990m101958k799699j295368L85360K147356L883491N301047
9064B44447405N954891N493592L991115J846233p28842l627621o571176r219153
9056B41586444j1350827j3648351j6535447j8237958j8845822j8782437j7927016
9049A26258586j6476939j4622205j2636770j0803983r173450p733297o512504
9042D8299438n494234m679839m032214l499736l047176k648546k317639k024933
9034B0555121j782446j582091j386768j209771j085426r62991q34901p34798o75104
$$ plain form
9025 10300825 9690421 9124592 8625991 8167350 7751199 7362778 7007228 6703097 6427692
9016 6427692 6163593 5919247 5695518 5497991 5333212 5185643 5031128 4880017 4756349 4631813
9006 4631813 4503697 4386049 4273750 4154449 4031675 3928018 3839588 3738080 3620202 3516672
8996 3516672 3447666 3376906 3299400 3235462 3185957 3133406 3088770 3037469 2995197 2955359 2887767
8985 2887767 2823362 2762946 2693185 2621285 2559776 2484118 2389105 2306332 2225631 2143190 2076869
8974 2076869 2012192 1951168 1899607 1843515 1786768 1743731 1706267 1676982 1623967 1568548 1525659
8963 1525659 1489979 1461827 1439363 1415640 1384876 1366218 1344778 1307103 1291710 1274312 1255609
8952 1255609 1247270 1237058 1229963 1214195 1218831 1215834 1206464 1198916 1195715 1193321 1196566 1203448 1222808
$$ packed form
9025A0300825o10404n65829m98601m58641m16151l88421l55550l04131k75405
9016F427692k64099k44346k23729j97527j64779j47569j54515j51111j23668j24536
9006D631813j28116j17648j12299j19301j22774j03657q8430j01508j17878j03530
8996C516672o9006p0760p7506o3938m9505n2551m4636n1301m2272l9838o7592
8985B887767o4405o0416o9761p1900o1509p5658r5013q2773q0701q2441o6321
8974B076869o4677o1024n1561n6092n6747m3037l7464k9285n3015n5419m2889
8963A525659l5680k8152k2464k3723l0764j8658k1440l7675j5393j7398j8703
8952A255609q339j0212p095j5768M636k997r370p548l201k394L245O882J9360
$$ plain form
8939 1222808 1218109 1210556 1214228 1219360 1226949 1234428 1239494 1228484 1213000 1192313 1147796 1111026 1085477
8926 1085477 1048513 1017256 969578 907399 853548 816079 778942 741359 735821 728265 707957 693196
8914 693196 664098 630909 601543 581365 562642 550843 523151 477760 434077 382351 340726 299234
8902 299234 261593 234830 194468 161881 135295 107937 100904 89523 97795 120356 135063 127996
8890 127996 131513 148462 157235 180844 214687 239343 261535 296261 329737 362413 386996 417367
8878 417367 453956 498076 515408 524323 546728 559561 553041 562214 563867 566550 577215 580345 583662
8865 583662 614954 627423 629705 654155 689289 714669 738798 742539 757966 777444 795216 819150
8853 819150 824869 819057 784816 760053 739576 719791 706561 685837 655735 629526 618775 597912
$$ packed form
8939A222808m699p553L672N132P589P479N066j1010j5484k0687m4517l6770k5549
8926A085477l6964l1257m7678o2179n3851l7469l7137l7583n538p556k0308j4761
8914F93196k9098l3189k9366k0178j8723j1799k7692m5391m3683n1726m1625m1492
8902B99234l7641k6763m0362l2587k6586k7358p033j1381Q272K2561J4707p067
8890A27996L517J6949Q773K3609L3843K4656K2192L4726L3476L2676K4583L0371
8878D17367L6589M4120J7332Q915K2405J2833o520R173J653K683J0665L130L317
8865E83662L1292J2469K282K4450L5134K5380K4129L741J5427J9478J7772K3934
8853H19150N719n812l4241k4763k0477j9785j3230k0724l0102k6209j0751k0863
$$ plain form
8841 597912 589041 570101 562586 569309 566734 562315 563270 543231 526650 514725 506395 509417 518204 517852
8827 517852 515511 512763 501551 480421 451564 423790 413312 417403 426024 460779 485609 488106 481005
8814 481005 475677 473836 483460 501228 517135 526875 557519 581540 604753 612062 618860 615752 602313
8801 602313 599354 615263 632028 652504 674849 686909 697229 700612 679215 658162 641624 622469
8789 622469 605965 594574 587003 597974 589777 584309 582169 572922 545477 535988 510511 479076 454833
8776 454833 430776 402787 377511 350288 311160 288071 262911 218394 199581 185401 165628 158749
8764 158749 167710 167994 169781 171694 155620 139536 123680 110667 109886 104163 92869 84829 70394
8751 70394 66135 72459 79310 71413 60780 41761 40298 40185 58043 85095 110377 142315 161456
$$ packed form
8841E97912q871j8940p515O723k575m419R55k0039j6581j1925q330L022Q787l52
8827E17852k341k748j1212k1130k8857k7774j0478M091Q621L4755K4830K497p101
8814D81005n328j841R624J7768J5907R740L0644K4021K3213P309O798l108j3439
8801F02313k959J5909J6765K0476K2345J2060J0320L383k1397k1053j6538j9155
8789F22469j6504j1391p571J0971q197n468k140r247k7445r489k5477l1435k4243
8776D54833k4057k7989k5276k7223l9128k3089k5160m4517j8813j4180j9773o879
8764A58749Q961K84J787J913j6074j6084j5856j3013p81n723j1294q040j4435
8751G0394m259O324O851p897j0633j9019j463j13J7858K7052K5282L1938J9141
$$ plain form
8738 161456 168359 179558 177950 186566 206653 215225 220351 218741 217808 231664 253448 259764 257351 267265
8724 267265 260841 251080 251679 260419 270339 278835 283510 302154 305314 302185 301150 277561 261736 264172
8710 264172 269983 272233 279656 271479 270956 276841 274054 270441 267367 270394 281014 288373 279222 285728
8696 285728 301247 313954 328692 348740 378080 411327 449063 510120 559949 610263 678400 749851
8684 749851 828517 905938 981714 1054669 1129264 1190336 1243431 1286292 1316824 1358540 1382082 1391541
8672 1391541 1391796 1384324 1369101 1356872 1334436 1326208 1334279 1346429 1348565 1343706 1351209 1371459 1398124
8659 1398124 1418414 1407769 1397017 1377988 1365711 1344047 1291780 1248952 1200098 1139215 1068130
8648 1068130 991516 928822 853891 764492 699462 637014 572913 519687 461501 412626 376798
$$ packed form
8738A61456O903J1199j608Q616K0087Q572N126j610r33J3856K1784O316k413R914
8724B67265o424r761N99Q740R920Q496M675J8644L160l129j035k3589j5825K436
8710B64172N811K250P423q177n23N885k787l613l074L027J0620P359r151O506
8696B85728J5519J2707J4738K0048K9340L3247L7736O1057M9829N0314O8137P1451
8684G49851P8666P7421P5776P2955P4595O1072N3095M2861L0532M1716K3542R459
8672A391541K55p472j5223j2229k2436q228Q071J2150K136m859P503K0250K6665
8659A398124K0290j0645j0752j9029j2277k1664n2267m2828m8854o0883p1085
8648A068130p6614o2694p4931q9399o5030o2448o4101n3226n8186m8875l5828
$$ plain form
8637 376798 342448 319927 297936 274190 255799 240188 216698 196197 188620 179525 181457 162668
8625 162668 150578 138460 138946 148793 151379 151350 140144 141351 131768 138353 137219 135143 126514 131614
8611 131614 111392 114783 125899 127854 135074 137178 130635 134781 138250 141271 137925 137987 141981 135782
8597 135782 114651 110121 114911 129010 132832 148305 165972 173397 156160 155050 172485 184948 159479
8584 159479 158612 149954 142725 144869 132606 123905 130678 120224 99618 94075 112954 112862 111834 123634
8570 123634 128536 112346 99833 108690 119378 141172 156399 147722 131324 135960 138059 130561 123203
8557 123203 102893 91985 91763 91243 94172 86653 81455 89667 88182 70981 76533 87101 90426 82302
8543 82302 59591 38502 42223 65227 71066 72637 78111 74903 61882 67461 81364 84996 89976
$$ packed form
8637C76798l4350k2521k1991k3746j8391j5611k3490k0501p577r095J932j8789
8625A62668j2090j2118M86R847K586k9j1206J207r583O585j134k076q629N100
8611A31614k0222L391J1116J955P220K104o543M146L469L021l346O2L994o199
8597A35782k1131m530M790J4099L822J5473J7667P425j7237j110J7435J2463k5469
8584A59479q67q658p229K144j2263q701O773j0454k0606n543J8879r2j028J1800
8570A23634M902j6190j2513Q857J0688K1794J5227q677j6398M636K099p498p358
8557A23203k0310j0908k22n20K929p519n198Q212j485j7201N552J0568L325q124
8543H2302k2711k1089L721K3004N839J571N474l208j3021N579J3903L632M980
$$ plain form
8530 89976 101034 112105 118774 114687 113782 121276 125029 126133 127974 140859 143039 148525 135748 113257
8516 113257 110248 108563 87093 85762 76338 81283 84952 76120 77734 71691 60219 56272 56125 58639
8502 58639 55744 56874 66686 55126 47120 53279 61374 67333 57262 56434 57211 70381 81016 90923
8488 90923 94899 100578 101640 98212 78270 81285 84873 80556 79557 69534 68336 71227 69815 73689
8474 73689 77853 87666 86029 79516 89684 97583 101093 93032 86719 78699 66791 57075 53005 55495
8460 55495 60757 64947 59501 71994 68256 49665 39136 49114 54374 51225 50117 58170 60470 53994
8446 53994 41745 40723 34023 38181 33382 33722 53925 56807 39857 28519 25613 41556 48012 63339
8432 63339 69765 67286 51148 27415 23591 19030 15543 27491 42117 58565 56189 45510 46441
$$ packed form
8530H9976J1058J1071O669m087r05P494L753J104J841J2885K180N486j2777k2491
8516A13257l009j685k1470j331r424M945L669q832J614o043j1472l947j47K514
8502E8639k895J130R812j1560q006O159Q095N959j0071q28P77J3170J0635R907
8488I0923L976N679J062l428j9942L015L588m317r99j0023j198K891j412L874
8474G3689M164R813j637o513J0168P899L510q061o313q020j1908r716m070K490
8460E5495N262M190n446J2493l738j8591j0529R978N260l149j108Q053K300o476
8446E3994j2249j022o700M158m799L40K0203K882j6950j1338k906J5943O456J5327
8432F3339O426k479j6138k3733l824m561l487J1948J4626J6448k376j0679R31
$$ plain form
8419 46441 46402 39827 40040 38311 30946 34377 36994 35709 37929 43462 55674 47860 46024 57751 60641
8404 60641 56865 40642 43527 47315 40879 47376 51416 37441 26649 31967 35712 26996 23752 19584
8390 19584 30333 35634 33114 36618 30050 33956 43508 35990 39978 41927 38759 39301 34536 23921
8376 23921 21587 10125 17040 28877 30878 14059 1866 -10419 2412 19654 12508 3315 16935
8363 16935 20785 15242 22030 33597 41983 34155 33947 38825 40375 38873 34561 34907 23128 21205 29374
8348 29374 34065 32679 44999 28552 26322 30943 35670 45211 50281 44467 43450 40070 36755 13450
8334 13450 5559 16342 15890 26635 31900 34870 43929 36813 20774 8610 -2307 -6200 2418 10879
8320 10879 23664 15449 15060 23384 21856 23246 22580 32004 35515 16596 16651 32164 30932 28734 30194
$$ packed form
8419D6441l9o575K13j729p365L431K617j285K220N533J2212p814j836J1727K890
8404F0641l776j6223K885L788o436O497M040j3975j0792N318L745q716l244m168
8390A9584J0749N301k520L504o568L906R552p518L988J949l168N42m765j0615
8376B3921k334j1462O915J1837K001j6819j2193j2285J2831J7242p146r193J3620
8363A6935L850n543O788J1567Q386p828k08M878J550j502m312L46j1779j923Q169
8348B9374M691j386J2320j6447k230M621M727R541N070n814j017l380l315k3305
8334A3450p891J0783m52J0745N265K970R059p116j6039j2164j0917l893Q618Q461
8320A0879J2785q215l89Q324j528J390o66R424L511j8919N5J5513j232k198J460
$$ plain form
8305 30194 25713 16471 7486 7429 8088 15470 26312 34288 30060 23951 17301 25988 29352 21100 12317
8290 12317 41 -3369 -521 9813 22534 21741 8969 9684 7976 7097 9666 1209 11090 15131
8276 15131 22793 20592 17754 14808 8873 17910 21023 8360 6511 23557 17601 23393 24665 32720
8262 32720 25857 22056 31905 17469 9934 10353 16697 24616 18084 9527 15536 24318 30491 12598
8248 12598 3307 5473 19331 27664 22615 8745 4245 2589 9713 16881 8035 6504 14225 21006
8234 21006 11463 -2636 8517 12340 15437 20159 15917 19463 11970 25503 39729 41786 43029 22528
8220 22528 4223 8871 9443 9730 3506 -2560 11129 18986 29352 34079 17141 11417 13399 16566
8206 16566 16241 9600 16469 21553 7415 12235 15279 23691 21495 19189 15938 9862 9086 13132 15291
$$ packed form
8305C0194m481r242q985n7O59P382J0842P976m228o109o650Q687L364q252q783
8290A2317j2276l410K848J0334J2721p93j2772P15j708q79K569q457R881M041
8276A5131P662k201k838k946n935R037L113j2663j849J7046n956N792J272Q055
8262C2720o863l801R849j4436p535M19O344P919o532q557O009Q782O173j7893
8248A2598r291K166J3858Q333n049j3870m500j656P124P168q846j531P721O781
8234B1006r543j4099J1153L823L097M722m242L546p493J3533J4226K057J243k0501
8220B2528j8305M648N72K87o224o066J3689P857J0366M727j6938n724J982L167
8206A6566l25o641O869N084j4138M820L044Q412k196k306l251o076p76M046K159
$$ plain form
8191 15291 16322 10441 12703 16392 18126 17694 21577 16976 540 4860 5276 14381 14470 8762 10689
8176 10689 5271 10027 10476 14598 16380 21923 28055 13905 16101 27246 36209 27757 19645 25077
8162 25077 26818 13956 9281 -5210 -10190 10370 21864 26795 18064 23785 25717 33337 33674 31308
8148 31308 37810 39495 25847 19867 26130 28693 22853 29395 38790 33207 16508 13747 8315 3113
8134 3113 1346 11735 17601 15479 10876 22903 40752 45015 40958 34322 37389 43391 40003 23902
8120 23902 18305 15486 23699 42764 34332 18041 16642 14118 10537 7772 16327 19360 20579 19184
8106 19184 28262 38728 36144 37467 30414 13604 30589 44631 38939 41373 27692 19013 22051
8093 22051 16784 13632 18419 36149 30717 7349 14717 21892 17725 18301 4874 -10422 -4508 -4960
$$ packed form
8191A5291J031n881K262L689J734m32L883m601j6436M320M16R105Q9n708J927
8176A0689n418M756M49M122J782N543O132j4150K196J1145Q963q452q112N432
8162B5077J741j2862m675j4491m980K0560J1494M931q731N721J932P620L37k366
8148C1308O502J685j3648n980O263K563n840O542R395n583j6699k761n432n202
8134C113j767J0389N866k122m603J2027J7849M263m057o636L067O002l388j6101
8120B3902n597k819Q213J9065q432j6291j399k524l581k765Q555L033J219j395
8106A9184R078J0466k584J323p053j6810J6985J4042n692K434j3681q679L038
8093B2051n267l152M787J7730n432k3368P368P175m167N76j3427j5296N914m52
$$ plain form
8079 -4960 -12512 -4998 -936 -5820 -10663 2359 7475 15467 23361 18237 15106 15497 23625 19555 23622
8064 23622 25219 25107 35416 24408 18400 23648 22180 22956 31252 14789 6146 -9646 -7946 12422
8050 12422 15699 -2116 -17237 -10595 -5264 11246 33200 23389 13502 5283 3362 10994 22615
8037 22615 27334 26624 33198 22695 2957 -12144 -5269 -10341 -23522 -17664 -11354 -9729 -11587 -12388
8023 -12388 -14685 -4746 -4492 -10215 2205 7520 22301 26967 13381 7244 1615 942 13296 26634
8009 26634 32134 40508 40574 26423 19122 22870 11103 4466 3727 4018 -5363 -13757 3561 25217 32190
7994 32190 18447 14352 11622 7267 13578 10120 8040 13099 18137 29858 33927 23332 15538 19482
7980 19482 30058 22583 24610 20166 27056 22565 23149 25422 26843 30077 28328 31963 31469 28646 27928
$$ packed form
8079d960p552P514M062m884m843J3022N116P992P894n124l131L91Q128m070M067
8064B3622J597j12J0309j1008o008N248j468P76Q296j6463q643j5792J700K0368
8050A2422L277j7815j5121O642N331J6510K1954r811r887q219j921P632J1621
8037B2615M719p10O574j0503j9738j5101O875n072j3181N858O310J625j858q01
8023a2388k297R939K54n723J2420N315J4781M666j3586o137n629o73J2354J3338
8009B6634N500Q374O6j4151p301L748j1767o637p39K91r381q394J7318K1656O973
7994C2190j3743m095k730m355O311l458k080N059N038J1721M069j0595p794L944
7980A9482J0576p475K027m444O890m491N84K273J421L234j749L635m94k823p18
$$ plain form
7965 27928 30936 31231 29876 18155 4499 16230 25974 27766 23452 21315 19823 17014 15278 19278
7951 19278 -5917 -14757 -15848 -13316 -8239 -17538 -24002 -11963 3824 3388 -8150 -12016 2156 -254
7937 -254 -708 11564 23533 13011 301 3691 -2281 -9580 -8513 6804 18930 26544 29000 23654
7923 23654 10561 4958 -973 -7845 -3869 2833 16841 19170 11212 9229 9588 7886 5578 5744 9211
7908 9211 9628 5605 8529 21620 24238 13922 4506 -1772 4425 -2136 -4598 4024 -3176 2041 13320
7893 13320 28588 28351 6994 7312 12322 153 9210 9868 6682 -9135 -16711 -9693 -8727 -20306
7879 -20306 -30294 -18699 -15697 -17373 -7961 -11590 -22008 -29960 -22672 -17365 -14983 -15475 -21671 -19610
7865 -19610 -615 14245 4759 9983 -308 936 7603 5227 -8362 -7763 -3248 5035 16593 12503
$$ packed form
7965B7928L008K95j355j1721j3656J1731R744J792m314k137j492k809j736M000
7951A9278k5195q840j091K532N077r299o464J2039J5787m36j1538l866J4172k410
7937b54m54J2272J1969j0522j2710L390n972p299J067J5317J2126P614K456n346
7923B3654j3093n603n931o872L976O702J4008K329p958j983L59j702k308J66L467
7908I211M17m023K924J3091K618j0316r416o278O197o561k462Q622p200N217J1279
7893A3320J5268k37k1357L18N010j2169R057O58l186j5817p576P018R66j1579
7879b0306r988J1595L002j676R412l629j0418p952P288N307K382m92o196K061
7865a9610J8995J4860r486N224j0291J244O667k376j3589N99M515Q283J1558m090
$$ plain form
7851 12503 2906 -7855 1899 7807 13544 20880 16565 8546 5659 -6198 -23299 -18510 -8425 -3982
7837 -3982 -5251 111 -3656 -13731 -11479 -20033 -31685 -12550 495 7180 9728 1498 10623 19787
7823 19787 19312 9998 11964 13968 -5353 -10698 -2021 4225 4553 7124 21808 25623 21310 16546 16662
7808 16662 17946 27173 30919 16687 14108 7627 7817 14406 13866 8092 -1713 -2213 -2034 4833 6135
7793 6135 11977 21643 23661 17195 1988 -11171 -12063 -2940 -7578 -9871 -2475 -5615 -10955 -2916 -685
7778 -685 167 6842 16830 22503 16891 -2625 -8271 -3749 3872 10765 -3727 -247 -909 5666 -5602
7763 -5602 550 -1086 -8157 -19284 -15771 -20744 -26413 -27640 -26868 -18186 -23456 -15025 -13660 -16684 -6840
7748 -6840 3980 2630 -2835 3959 1410 547 13895 8511 -391 -7318 -6850 -4501 -16409 -15244 -4900
$$ packed form
7851A2503r597j0761R754N908N737P336m315q019k887j1857j7101M789J0085M443
7837c982j269N362l767j0075K252q554j1652J9135J3045O685K548q230R125R164
7823A9787m75r314J966K004j9321n345Q677O246L28K571J4684L815m313m764J16
7808A6662J284R227L746j4232k579o481J90O589n40n774r805n00J79O867J302
7793F135N842R666K018o466j5207j3159q92R123m638k293P396l140n340Q039K231
7778f85Q52O675R988N673n612j9516n646M522P621O893j4492L480o62O575j1268
7763e602O152j636p071j1127L513m973n669j227P72Q682n270Q431J365l024R844
7748f840J0820j350n465O794k549q63J3348n384q902o927M68K349j1908J165J0344
$$ plain form
7733 -4900 -6209 3136 22584 15846 3113 -8666 -7402 -1014 -2354 -4781 4461 8262 -3545 -4989
7719 -4989 -6484 3646 21300 22061 21974 13124 791 5797 5077 5385 9831 19319 15083 968 4238
7704 4238 326 -4918 -4724 -3557 -17918 -17430 -2817 7411 15551 21802 19611 10671 3534 11499 13497
7689 13497 5792 3859 6991 7786 3125 14735 11845 -4530 -1673 1061 4271 -4439 -15149 -18649
7675 -18649 -17095 -22143 -22098 -30146 -38147 -33014 -28727 -24715 -6105 -8593 -11866 -3686 2407 -2876 -12173
7660 -12173 -2627 6253 -1416 -4396 -3566 566 -440 8202 12745 4990 -18710 -16750 -18028 -13983 -16902
7645 -16902 -16497 -4016 -179 -1750 1819 7470 6511 19966 8979 -3406 -5047 6122 9876 14632
7631 14632 10097 15094 25347 24734 12573 5316 14996 17853 19664 7718 9607 7635 18899 22036
$$ packed form
7733d900j309R345J9448o738j2733j1779J264O388j340k427R242L801j1807j444
7719d989j495J0130J7654P61q7q850j2333N006p20L08M446R488m236j4115L270
7704D238l912n244J94J167j4361M88J4613J0228Q140O251k191q940p137P965J998
7689A3497p705j933L132P95m661J1610k890j6375K857K734L210q710j0710l500
7675a8649J554n048M5q048q001N133M287M012J8610k488l273Q180O093n283r297
7660a2173R546Q880p669k980Q30M132j006Q642M543p755k3700J960j278M045k919
7645a6902M05J2481L837j571L569N651r59J3455j0987j2385j641J1169L754M756
7631A4632m535M997J0253o13j2161p257R680K857J811j1946J889j972J1264L137
$$ plain form
7617 22036 11598 894 -5792 -10185 -20254 -16129 -4043 -1458 -980 304 6624 8167 6963 10135
7603 10135 2528 -4754 -16267 -13146 -12462 -10226 730 1700 3870 -1474 7623 7141 -7304 -15503 -1358
7588 -1358 19732 13461 3998 11087 6359 -1837 862 259 -10285 -13122 -3874 -12636 -2163 -1395 -12986
7573 -12986 -16983 -10412 -9378 -11115 -7733 -599 4708 -2418 -9955 -6881 -901 1180 -9350 -10169 5385
7558 5385 3248 -9009 -2092 -2494 -12224 -13273 -10808 -10376 -5642 11817 11163 12673 15402 21090 15907
7543 15907 8990 11563 17010 21644 9011 7718 10685 9492 -523 4761 18237 16295 15330 1867
7529 1867 161 2991 5305 -8214 -16311 -18266 -17731 -17008 -17959 -11257 -9968 -11258 -14466 -20515 -25189
7514 -25189 -25098 -12729 914 -1616 4813 9318 11516 10036 5115 14022 8998 -1602 -1111 -1981 -4321
$$ packed form
7617B2036j0438j0704o686m393j0069M125J2086K585M78J284O320J543j204L172
7603A0135p607p282j1513L121O84K236J0956R70K170n344R097m82j4445q199J4145
7588a358K1090o271r463P089m728q196K699o03j0544k837R248q762J0473P68j1591
7573a2986l997O571J034j737L382P134N307p126p537L074N980K081j0530q19J5554
7558E385k137j2257O917m02r730j049K465M32M734J7459o54J510K729N688n183
7543A5907o917K573N447M634j2633j293K967j193j0015N284J3476j942r65j3463
7529A867j706K830K314j3519q097j955N35P23r51O702J289j290l208o049m674
7514b5189R1J2369J3643k530O429M505K198j480m921Q907n024j0600M91q70k340
$$ plain form
7499 -4321 -2539 -7053 -10484 -10513 -4663 -995 1972 -983 654 435 5730 8816 -2878 -18717 -9933
7484 -9933 -4067 1493 -5911 -15685 -13557 -14182 -5145 -1343 -1457 -4315 -14031 -17267 -14004 -6765 -2469
7469 -2469 5356 9166 12339 -2631 -2203 -9186 -90 9594 5550 4142 -8830 -9027 -2986 2569 -8877
7454 -8877 -11740 -5710 2678 3242 -6898 -1855 -5109 -16276 -16402 -7558 -23608 -23752 -14980 -14186 -6439
7439 -6439 -9470 -16109 -21060 -28829 -20586 -14627 -14717 4604 -293 760 7331 -6143 -23917 -19013 -19664
7424 -19664 -21849 -17553 -1828 806 2865 3679 7160 7810 12653 977 -10240 -12102 -15660 -26445
7410 -26445 -11088 -6255 -8952 -3817 6238 8662 3542 1902 6344 -1167 -10872 -6943 5368 -3632
7396 -3632 -20966 -17000 -6472 6194 9761 17401 19458 17206 3960 -356 -266 -11693 -10548 -21199
$$ packed form
7499d321J782m514l431k9N850L668K967k955J637k19N295L086j1694j5839Q784
7484i933N866N560p404r774K128o25R037L802j14k858r716l236L263P239M296
7469b469P825L810L173j4970M28o983R096R684m044j408j2972j97O041N555j1446
7454h877k863O030Q388N64j0140N043l254j1167j26Q844j6050j44Q772P94P747
7439f439l031o639m951p769Q243N959r0J9321m897J053O571j3474j7774M904o51
7424a9664k185M296J5725K634K059Q14L481O50M843j1676j1217j862l558j0785
7410b6445J5357M833k697N135J0055K424n120j640M442p511r705L929J2311r000
7396c632j7334L966J0528J2666L567P640K057k252j3246m316R0j1427J145j0651
$$ plain form
7382 -21199 -12337 -11902 1508 9148 -128 -10017 -2956 19317 5136 3016 7214 121 952 3882
7368 3882 13945 15954 19827 22927 21931 20066 28286 13302 -6016 6717 9795 -4870 -17867 -19306
7354 -19306 -31669 -25675 -20155 -12557 -7105 4877 -1250 1511 17144 14798 6686 1769 5475 16340
7340 16340 14200 7115 37 -2635 6120 2315 11306 16794 14959 11831 16463 12551 4089 -9320
7326 -9320 -9172 460 6428 10556 14612 22629 12049 1824 13084 15624 6862 609 -3527 10744
7312 10744 16087 14141 20899 22327 11384 8476 13614 26651 35847 23629 13259 16218 11564 858
7298 858 1697 6549 2518 -1683 -5194 -2086 10179 8097 3559 8174 6909 2684 -5271 -9388 -10926
7283 -10926 -18244 -22048 -21736 -17840 -17719 -20414 -14444 -17905 -8095 5772 7520 14250 20452 18825 21624
$$ packed form
7382b1199Q862M35J3410P640r276r889P061K2273j4181k120M198p093Q31K930
7368C882J0063K009L873L100r96j865Q220j4984j9318J2733L078j4665j2997j439
7354a9306j2363N994N520P598N452J1982o127K761J5633k346q112m917L706J0865
7340A6340k140p085p078k672Q755l805Q991N488j835l128M632l912q462j3409
7326i320J48R632N968M128M056Q017j0580j0225J1260K540q762o253m136J4271
7312A0744N343j946O758J428j0943k908N138J3037R196j2218j0370K959m654j0706
7298H58Q39M852m031m201l511L108J2265k082m538M615j265m225p955m117j538
7283a0926p318l804L12L896J21k695N970l461R810J3867J748O730O202j627K799
$$ plain form
7268 21624 23219 15616 24601 27218 17198 7812 11664 12895 -4736 -7774 -6535 13877 14080 7635
7254 7635 4367 9080 11145 8732 13995 -1813 -10700 -16375 -16324 -4525 -3057 -4075 7182 13492 16698
7239 16698 18417 20366 23977 22317 7697 -2936 -18806 -12911 -5807 -9442 -4165 -2775 4074 2972
7225 2972 11653 11631 7463 -3159 -17915 -19419 -4643 2406 -7264 -12954 -9734 -1840 2569 5113 -10958
7210 -10958 -13594 -2530 8859 6980 10819 10038 -1994 -4534 -9169 -10882 -4995 2890 11724 14635
7196 14635 13552 3064 2175 4953 5845 15184 8723 -8783 -13106 -6696 -7078 -2718 -6245 -4161 -4554
7181 -4554 3362 1957 4817 -242 -5668 -9466 -4505 1484 9281 25616 19024 14352 1047 4744
7167 4744 -1218 155 -3344 -784 5243 11767 13881 7930 9574 13644 10273 3016 -10576 -10053 4684
$$ packed form
7268B1624J595p603Q985K617j0020r386L852J231j7631l038J239K0412K03o445
7254G635l268M713K065k413N263j5808q887n675N1J1799J468j018J1257O310L206
7239A6698J719J949L611j660j4620j0633j5870N895P104l635N277J390O849j102
7225B972Q681k2m168j0622j4756j504J4776P049r670n690L220P894M409K544j6071
7210a0958k636J1064J1389j879L839p81j2032k540m635j713N887P885Q834K911
7196A4635j083j0488q89K778Q92R339o461j7506m323O410l82M360l527K084l93
7181d554P916j405K860n059n426l798M961N989P797J6335o592m672j3305L697
7167D744n962J373l499K560O027O524K114n951J644M070l371p257j3592N23J4737
$$ plain form
7152 4684 4531 4740 -5189 -9323 -1836 3151 154 12623 17276 23047 14377 12815 19560 22643 15635
7137 15635 18789 13047 3844 7260 14740 20658 19577 4612 -3128 -5998 -4102 -11961 -4405 -4075 236
7122 236 -46 1914 5245 -4021 -6064 -1498 9398 9200 6170 2845 -10101 -16343 -11143 -14254 -10446
7107 -10446 -4271 -25927 -43096 -18748 -20067 -17360 -4302 -12974 -15083 -2483 5820 16932 13838
7094 13838 6641 -7328 -20702 -21039 -14110 -12933 -321 3479 -3693 -1819 728 -7267 -16620 -17095
7080 -17095 -16083 -14604 -7615 -3738 -6335 -11626 -3250 8007 9101 6278 2324 -11503 -6944 -734
7066 -734 5184 11672 9570 -459 -15104 -11230 -8019 6045 11319 -4982 -14124 -16989 -6445 -2388
7052 -2388 -3542 -18012 -30358 -33931 -28687 -21277 -27168 -20455 -15488 -15609 -23815 -11119 8397 13900
$$ packed form
7152D684j53K09r929m134P487M987k997J2469M653N771q670j562O745L083p008
7137A5635L154n742r203L416P480N918j081j4965p740k870J896p859P556L30M311
7122B36k82J960L331r266k043M566J0896j98l030l325j2946o242N200l111L808
7107a0446O175k1656j7169K4348j319K707J3058q672k109J2600Q303J1112l094
7094A3838p197j3969j3374l37O929J177J2612L800p172J874K547p995r353m75
7080a7095J012J479O989L877k597n291Q376J1257J094k823l954j3827M559O210
7066g34N918O488k102j0029j4645L874L211J4064N274j6301r142k865J0544M057
7052b388j154j4470j2346l573N244P410n891O713M967j21q206J2696J9516N503
$$ plain form
7038 13900 -135 -4087 2463 -16626 -22480 -19028 -21456 -5602 2364 -3323 -17494 -16299 2138
7025 2138 13228 -5607 -18708 -17140 -9237 -1008 8182 15499 12228 115 6725 1842 -12420 -20769
7011 -20769 -15702 -5371 -522 -2004 -10776 -4948 1779 2083 -2395 8209 10095 7989 11679 3648
6997 3648 -15974 -21671 -5966 5305 10548 3961 6132 20398 16545 12510 18270 13845 1903 -3003
6983 -3003 310 7508 9277 -1050 -6807 -3383 8127 -7535 -27658 -14859 -3836 1296 -1925
6970 -1925 -7518 -6012 10562 16992 20244 13655 12366 12563 -85 -10234 -11346 -11851 -13113 -14039 -4709
6955 -4709 -5962 -6631 -5402 938 7400 4983 6284 -4477 944 745 1484 7371 7287 6038 17480 3601
6939 3601 -6092 -12062 -20942 -31105 -24723 -9960 -4369 2192 -613 -9627 -21753 -16054 -14033 -10177
$$ packed form
7038A3900j4035l952O550j9089n854L452k428J5854P966n687j4171J195J8437
7025B138J1090j8835j3101J568P903Q229R190P317l271j2113O610m883j4262q349
7011b0769N067J0331M849j482q772N828O727L04m478J0604J886k106L690q031
6997C648j9622n697J5705J1271N243o587K171J4266l853m035N760m425j1942m906
6983c003L313P198J769j0327n757L424J1510j5662k0123J2799J1023N132l221
6970a925n593J506J6574O430L252o589j289J97j2648j0149j112n05j262r26R330
6955d709j253o69J229O340O462k417J301j0761N421j99P39N887q4j249J1442j3879
6939C601r693n970q880j0163O382J4763N591O561k805r014j2126N699K021L856
$$ plain form
6925 -10177 -19941 -16944 -9767 -19331 -24113 -22837 -16868 -60 15735 3756 -13345 -5117 8094
6912 8094 10328 1867 -1207 1905 14749 11587 -5133 -11999 -12766 1538 19026 18954 18289 27403 15503
6897 15503 -7051 -17068 -6465 -8894 -15212 -12944 -13562 -20221 -11924 -2680 4255 -2565 -12859 -30280
6883 -30280 -22494 -1478 -2187 -6149 2933 7455 8479 -3791 -17863 -14242 3136 8073 -6324 -16459
6869 -16459 -21266 -30391 -31214 -22027 -2377 10023 10662 6637 -1647 -1436 -5386 -16466 -17379 -13701 -7221
6854 -7221 -20454 -17646 -5669 5478 8695 12730 1985 -9750 -13881 -6556 -73 9167 7327 5237
6840 5237 -3141 -4398 -10102 -13221 -12521 -20052 -32906 -21964 -6923 -7229 -5912 -956 -9202 -12859 -7161
6825 -7161 1958 8375 8586 5984 4207 10796 9661 13295 18046 14570 13994 10911 1552 -6929 -16713
$$ packed form
6925a0177r764K997P177r564m782J276N969J6808J5795j1979j7101Q228J3211
6912H094K234q461l074L112J2844l162j6720o866p67J4304J7488p2o65R114j1900
6897A5503k2554j0017J0603k429o318K268o18o659Q297R244O935o820j0294j7421
6883c0280P786K1016p09l962R082M522J024j2270j4072L621J7378M937j4397j0135
6869a6459m807r125q23R187J9650J2400O39m025q284K11l950j1080r13L678O480
6854g221j3233K808J1977J1147L217M035j0745j1735m131P325O483R240j840k090
6840E237q378j257n704l119P00p531j2854J0942J5041l06J317M956q246l657N698
6825g161R119O417K11k602j777O589j135L634M751l476n76l083r359q481r784
$$ plain form
6810 -16713 -11945 -1867 -9217 -7380 20421 18240 10031 11031 5076 -11887 -6225 1240 3438 20894
6796 20894 26885 30387 33337 22731 18011 -1339 -11133 -6089 -5212 -8483 -10438 -5183 -8960 -7201
6782 -7201 -1717 -4631 -13854 -10764 8418 13760 14970 11453 -436 2704 -22 -1660 -2125 -14034
6768 -14034 -11400 -6751 -9137 -11798 -10410 -9135 -2400 -8132 -16633 -11314 -4353 -1563 -231 -13649
6754 -13649 -11888 -13314 -10181 2071 -9170 -15953 -15022 -13003 3744 6678 7785 2106 -900 -5564
6740 -5564 -9787 -12005 99 11068 7117 4916 -5427 -4090 15285 7478 15112 14804 15561 19637
6726 19637 2234 1871 5438 10661 16666 27541 22853 6661 6779 8879 15809 4810 496 3426
6712 3426 -1707 14984 10178 -10651 -17589 -12655 -11867 -16032 -9990 -5006 -13559 -11135 1831 16381
$$ packed form
6810a6713M768J0078p350J837K7801k181q209J000n955j6963N662P465K198J7456
6796B0894N991L502K950j0606m720j9350r794N044Q77l271j955N255l777J759
6782g201N484k914r223L090J9182N342J210l517j1889L140k726j638m65j1909
6768a4034K634M649k386k661J388J275O735n732q501N319O961K790J332j3418
6754a3649J761j426L133J2252j1241o783R31K019J6747K934J107n679l006m664
6740e564m223k218J2104J0969l951k201j0343J337J9375p807P634l08P57M076
6726A9637j7403l63L567N223O005J0875m688j6192J18K100O930j0999m314K930
6712C426n133J6691m806k0829o938M934P88m165O042M984q553K424J2966J4550
$$ plain form
6698 16381 11005 -17996 -36556 -36380 -25865 -21088 -14950 -17415 -22799 -12536 2120 510 -9356 -13016
6684 -13016 -4474 -5810 -3041 11297 7481 -14496 -19664 -7696 7572 15117 11248 4226 -13741
6671 -13741 -25725 -18592 -2109 9105 10275 1725 -1545 -2501 -4615 9721 3507 -20262 -21572 -11323
6657 -11323 -10058 -613 -3972 -5933 11674 21297 15810 14606 11700 7757 1764 -1080 159 7811
6643 7811 913 -12184 -5616 -12936 -21119 -20645 -22320 -22720 -8122 2327 3778 -7696 -5632 -3900
6629 -3900 883 -2705 -13471 -14590 -4656 2334 -1741 -4669 -19127 -22597 -29233 -23143 -18172 -10305
6615 -10305 -7829 -9229 -6610 -4492 -3737 -4615 -12296 -491 7945 10041 -1013 -7042 -13954 -2707
6601 -2707 9369 -4728 8982 10365 11326 13727 14445 7600 -7706 -8633 -1848 -6090 -17193 -12062
$$ packed form
6698A6381n376k9001j8560J76J0515M777O138k465n384J0263J4656j610r866l660
6684a3016Q542j336K769J4338l816k1977n168J1968J5268P545l869p022j7967
6671a3741j1984P133J6483J1214J170q550l270r56k114J4336o214k3769j310J0249
6657a1323J265R445l359j961J7607R623n487j204k906l943n993k844J239P652
6643G811o898j3097O568p320q183M74j675m00J4598J0449J451j1474K064J732
6629c900M783l588j0766j119R934O990m075k928j4458l470o636O090M971P867
6615a0305K476j400K619K118P55q78p681J1805Q436K096j1054o029o912J1247
6601b707J2076j4097J3710J383R61K401P18o845j5306r27O785m242j1103N131
$$ plain form
6587 -12062 4024 9007 -1112 10517 8382 -9289 -9557 -7560 -3762 -2362 178 424 4043 8228
6573 8228 5873 10619 15126 25426 21510 20866 10679 -5100 -13301 11762 25650 11799 8921 11424
6559 11424 4456 1200 -10100 -11425 -103 18774 13039 2812 3099 14753 20470 37036 34865
6546 34865 22980 30481 26737 20169 36769 43051 33016 19223 514 -1825 4236 11001 23858
6533 23858 21533 23788 15780 21392 27496 25586 14058 9315 6925 7107 17263 10368 14021 7396
6519 7396 1155 6547 -2258 4113 12178 22523 18912 4304 -793 -7334 -4053 -2145 -1460 -5980 -1304
6504 -1304 10285 11713 776 -11658 -5626 -13772 -19660 -25813 -17572 -6770 14094 11114 13286 20466
6490 20466 19782 3114 -18396 -24283 -20653 -19579 -4921 -4216 -9038 -17120 -11781 -6733 -5330 719
$$ packed form
6587a2062J6086M983j0119J1629k135j7671k68J997L798J400K540K46L619M185
6573H228k355M746M507J0300l916o44j0187j5779q201K5063J3888j3851k878K503
6559A1424o968l256j1300j325J1322J8877n735j0227K87J1654N717J6566k171
6546C4865j1885P501l744o568J6600O282j0035j3793j8709k339O061O765J2857
6533B3858k325K255q008N612O104j910j1528m743k390J82J0156o895L653o625
6519G396o241N392q805O371Q065J0345l611j4608n097o541L281J908O85m520M676
6504a304J1589J428j0937j2434O032q146n888o153Q241J0802K0864k980K172P180
6490B0466o84j6668k1510n887L630J074J4658P05m822q082N339N048J403O049
$$ plain form
6476 719 4080 -3361 -9807 -20585 -21704 358 10101 6113 2524 -2365 -1812 -9256 2654 18841
6462 18841 20389 10334 4529 -749 -1305 -937 -2311 -9861 -16753 -18657 -23910 -13040 -6002 -12920 -14213
6447 -14213 -14957 -23078 -12895 8902 12081 16298 13294 -4501 -17811 -14622 -5354 -8526 -7357 -697
6433 -697 -4433 1515 -5286 -12567 -8828 538 5434 176 2126 6543 2461 11057 11758 7654 3291
6418 3291 -7363 -7117 -918 -3926 -7929 -2062 -7050 -10313 -1526 7414 21148 16587 -1847 8327
6404 8327 8743 308 7225 5395 3781 6052 4166 -961 -7631 1892 16918 10056 10171 4632 -6324
6389 -6324 -15522 -7872 554 5995 16060 15785 10316 -110 4510 -2233 -16430 -9764 2907 8886
6375 8886 1585 -14958 -23975 -21391 -14185 -18634 -11275 6170 10605 -465 1906 -1247 -20726 -10841
$$ packed form
6476G19L361p441o446j0778j119K2062R743l988l589m889N53p444J1910J6187
6462A8841J548j0055n805n278n56L68j374p550o892j904n253J0870P038o918j293
6447a4213p44q121J0183K1797L179M217l004j7795j3310L189R268l172J169O660
6433f97l736N948o801p281L739R366M896n258J950M417m082Q596P01m104m363
6418C291j0654K46O199l008m003N867m988l263Q787Q940J3734m561j8434J0174
6404H327M16q435O917j830j614K271j886n127o670R523J5026o862J15n539j0956
6389f324r198P650Q426N441J0065k75n469j0426M620o743j4197O666J2671N979
6375H886p301j6543r017K584P206m449P359J7445M435j1070K371l153j9479R885
$$ plain form
6361 -10841 2980 -3553 -3202 -4788 -3746 -2035 -11056 -4702 8093 5858 -2370 -28994 -28860 -24123
6347 -24123 4848 13044 11132 732 -10681 -20142 -26786 -19242 -293 3628 -6762 -10558 -7326
6334 -7326 -18421 -18987 -17629 -8464 -3074 -4321 -11039 -23101 -22140 -14208 844 2223 -2117 -746 1364
6319 1364 266 5203 1552 -12541 1816 7912 9686 -97 -7990 -12234 -5698 -15040 -10753 -8897
6305 -8897 -14433 -10199 1425 -1962 -6280 11430 9456 6486 -1972 7425 8231 11129 29017 34043
6291 34043 11664 1246 -369 -1090 6518 10289 3543 -8439 -9079 -11293 2263 13060 2660 -13850
6277 -13850 -20980 -15766 -13851 -6204 -2811 -5830 -13381 -21959 -25402 -18928 -7172 -12775 -16303 -14133
6263 -14133 -10055 -18142 -19020 -7613 1303 -5151 3623 12039 6721 1429 -1568 -12833 -13508 -8690 -14457
$$ packed form
6361a0841J3821o533L51j586J042J711r021O354J2795k235q228k6624J34M737
6347b4123K8971Q196j912j0400j1413r461o644P544J8949L921j0390l796L232
6334g326j1095n66J358R165N390j247o718j2062R61P932J5052J379m340J371K110
6319A364j098M937l651j4093J4357O096J774r783p893m244O536r342M287J856
6305h897n536M234J1624l387m318J7710j974k970q458R397Q06K898J7888N026
6291C4043k2379j0418j615p21P608L771o746j1982o40k214J3556J0797j0400j6510
6277a3850p130N214J915P647L393l019p551q578l443O474J1756n603l528K170
6263a4133M078q087q78J1407Q916o454Q774Q416n318n292k997j1265o75M818n767
$$ plain form
6248 -14457 -15474 -6355 -2879 279 90 2021 8670 -308 -12831 -9768 -21527 -35032 -26752 -13759
6234 -13759 544 -82 -5711 -22318 -22612 -15506 -15554 -17807 -12031 -9374 -3396 -8829 -4017 5525 5168
6219 5168 1548 1041 1724 -2932 -257 8292 3479 -11387 -31861 -43891 -30723 -5431 9810 12160
6205 12160 -2582 -14933 -19556 -9213 3713 3405 9238 10232 5269 -3309 -9557 -9473 -16613 -14136 6746
6190 6746 1962 -11697 -15969 -3981 -5182 -13480 -7833 -14308 -15832 -5813 -401 -7880 -6772 -10508
6176 -10508 -16200 -11783 5538 13806 7374 5059 15532 10268 -2518 4505 1828 -2288 -4742 -2425
6162 -2425 13735 15684 3051 -6261 8755 8499 6439 11792 10758 -723 -5408 6047 -7894 -17104
6148 -17104 -8202 293 19254 9645 11140 7154 7695 6112 9817 3666 4324 12136 5253 1210 -3107
$$ packed form
6248a4457j017R119L476L158j89J931O649q978j2523L063j1759j3505Q280J2993
6234a3759J4303o26n629j6607k94P106m8k253N776K657N978n433M812R542l57
6219E168l620n07O83m656K675Q549m813j4866k0474j2030J3168K5292J5241K350
6205A2160j4742j2351m623J0343J2926l08N833R94m963q578o248Q4p140K477K0882
6190F746m784j3659m272J1988j201q298N647o475j524J0019N412p479J108l736
6176a0508n692M417J7321Q268o432k315J0473n264j2786P023k677m116k454K317
6162b425J6160J949j2633r312J5016k56k060N353j034j1481m685J1455j3941r210
6148a7104Q902Q495J8961r609J495l986N41j583L705o151O58P812o883m043m317
$$ plain form
6133 -3107 6127 3545 -139 -5449 -12701 -17315 -15022 -17153 -10016 -544 -10638 -16432 -18414 -11566 -10503
6118 -10503 -5657 -17607 -23376 -30289 -18524 -18742 -19601 -12986 -16393 -18897 -33624 -27179 -12815 -1621
6104 -1621 -3910 -3600 6546 7336 8980 147 -3518 13310 19668 10324 -13101 -4428 -13581 -16652 -13366
6089 -13366 -13867 1144 11982 -2722 -2940 1304 -2423 -6379 6970 9584 2479 10470 10140 2292
6075 2292 -8211 -17852 -11254 -11963 -21509 -13986 -3612 2368 989 -13649 -10108 6167 19334 22709
6061 22709 19673 16227 15674 11656 12192 34 2964 11833 14328 3905 -5886 -7980 -15475 -22730 -17653
6046 -17653 -10047 -2139 1088 -12412 622 11811 17961 6099 -15209 -22222 -21981 -18181 -3800
6033 -3800 3524 -13327 -12583 689 4033 2757 -2385 -1416 -2293 -2111 -712 -643 -12263 -11931 -15188 -11167
$$ packed form
6133c107R234k582l684n310p252m614K293k131P137R472j0094n794j982O848J063
6118a0503M846j1950n769o913J1765k18q59O615l407k504j4727O445J4364J1194
6104a621k289L10J0146P90J644q833l665J6828O358r344k3425Q673r153l071L286
6089a3366n01J5011J0838j4704k18M244l727l956J3349K614p105P991l30p848
6075B292j0503r641O598p09r546P523J0374N980j379j4638L541J6275J3167L375
6061B2709l036l446n53m018N36j2158K930Q869K495j0423r791k094p495p255N077
6046a7653P606P908L227j3500J3034J1189O150j1862k1308p013K41L800J4381
6033c800P324j6851P44J3272L344j276n142R69q77J82J399O9j1620L32l257M021
$$ plain form
6017 -11167 3311 13834 19331 17640 5703 -5251 -3798 -6023 -7376 -9917 -17864 -5777 1353
6004 1353 -12933 -11787 -21983 -13052 -407 -340 63 4297 9332 7322 -9470 -25148 -5009 1938
5990 1938 1447 -588 -1467 4876 -6019 -9734 -29124 -42412 -28136 -7547 3199 11785 5041 5093
5976 5093 2313 -14071 -5295 -8938 -10704 -19111 -14954 -2577 -4137 -8290 -23691 -24761 -22172 -24718
5962 -24718 -22663 -14227 -6362 8189 9329 -6297 -18952 -26167 -36642 -32096 -22008 -5686 13663
5949 13663 13392 5008 -642 17025 12905 7030 3793 -13539 -31001 -24083 -13892 -18968 -26365 -25951
5935 -25951 -24159 -17590 -8420 -17353 -22206 -13031 6060 13116 3807 -6284 -7436 -5244 -312 1983
5921 1983 10020 -3500 -5015 4188 -7361 -11141 -19902 -8087 -9578 -9058 -4595 7414 12921 1484
$$ packed form
6017a1167J4478J0523N497j691j1937j0954J453k225j353k541p947J2087P130
6004A353j4286J146j0196Q931J2645O7M03M234N035k010j6792j5678K0139O947
5990A938m91k035q79O343j0895l715j9390j3288J4276K0589J0746Q586o744N2
5976E093k780j6384Q776l643j766q407M157J2377j560m153j5401j070K589k546
5962b4718K055Q436P865J4551J140j5626j2655p215j0475M546J0088J6322J9349
5949A3663k71q384n650J7667m120n875l237j7332j7462O918J0191n076p397M14
5935b5951J792O569R170q933m853R175J9091P056r309j0091j152K192M932K295
5921A983Q037j3520j515R203j1549l780q761J1815j491N20M463J2009N507j1437
$$ plain form
5907 1484 -7534 -7139 -5787 -5158 -14844 -32221 -13068 3619 1572 -12103 -7848 -12410 -15096 -5358
5893 -5358 -7248 -3635 -3639 -12554 -17688 -17668 -12949 -16070 -2162 13501 21831 31877 27781 10547 -11836
5878 -11836 -15417 -14579 -8505 -1665 -3655 1813 -277 -9339 -6164 -3001 -4706 -646 15384 18166 1374
5863 1374 -7200 -13965 -25399 -30302 -30542 -17262 8124 19517 16948 10161 16624 12963 182 2941
5849 2941 1825 -4744 -12518 -15819 -16835 -18931 -9635 -6460 -11762 -3447 -6749 -11522 4250 13458 -2866
5834 -2866 -23224 -28518 -20472 -16712 -16935 -12270 -2203 519 6562 19748 24795 21221 11486 -4959
5820 -4959 1916 16764 19767 24117 29961 22461 13009 13574 3263 -5767 -19492 -21006 -15443 -6272
5806 -6272 -4721 -13710 -19630 -10295 3341 14164 16235 4435 -6169 -11199 -4359 657 -5655 1106
$$ packed form
5907A484r018L95J352O29r686j7377J9153J6687k047j3675M255m562k686R738
5893e358j890L613mq915n134K0M719l121J3908J5663Q330J0046m096j7234k2383
5878a1836l581Q38O074O840j990N468k090r062L175L163j705M060J6030K782j6792
5863A374q574o765j1434m903k40J3280K5386J1393k569o787O463l661j2781K759
5849B941j116o569p774l301j016k096R296L175n302Q315l302m773J5772R208j6324
5834b866k0358n294Q046L760k23M665J0067K722O043J3186N047l574r735j6445
5820d959O875J4848L003M350N844p500r452N65j0311r030j3725j514N563R171
5806f272J551q989n920R335J3636J0823K071j1800j0604n030O840N016o312O761
$$ plain form
5792 1106 11485 5775 -4797 -7953 9129 10477 4027 4009 16208 9599 -6721 -4815 -8081 -1195
5778 -1195 3290 22209 20227 3528 -108 13977 21662 17061 4467 6144 16744 2048 2088 9630
5764 9630 13069 -9261 -28994 -42918 -32977 -21757 -12656 -7745 -8103 -10799 -2165 2844 4248 -7861
5750 -7861 -13134 -12983 -19050 -22691 -28400 -34649 -23315 -1551 5246 12640 7590 -1186 -10338 -1282 -6322
5735 -6322 -19013 -22388 -16922 8522 11498 3294 -20858 -33563 -21461 -50 6632 12627 20738
5722 20738 17485 -424 -6202 -8474 -19407 -7214 3147 7289 6466 3004 10350 6077 -2722 2128
5708 2128 2778 -1068 2879 3593 -5842 -16235 -23201 -20848 -8034 7800 10079 5228 10403 18116 13984
5693 13984 11755 8472 16674 21468 14237 11820 18874 17654 17801 14293 24972 19795 8762 12502
$$ packed form
5792A106J0379n710j0572l156J7082J348o450j8J2199o609j6320J906l266O886
5778a195M485J8919j982j6699l636J4085P685m601j2594J677J0600j4696M0P542
5764I630L439k2330j9733j3924R941J1220R101M911l58k696Q634N009J404j2109
5750g861n273J51o067l641n709o249J1334K1764O797P394n050q776r152R056n040
5735f322j2691l375N466K5444K976q204k4152j2705J2102K1411O682N995Q111
5722B0738l253j7909n778k272j0933J2193J0361M142q23l462P346m273q799M850
5708B128O50l846L947P14r435j0393o966K353J2814J5834K279m851N175P713m132
5693A3984k229l283Q202M794p231k417P054j220J47l508J0679n177j1033L740
$$ plain form
5679 12502 16258 -101 -7641 -9981 -17439 -3398 847 -4542 -3979 -58 15975 5170 -5811 6935
5665 6935 7189 -607 -1367 4296 3176 -11048 -18492 -23022 -28302 -18195 92 11126 11510 -3975
5651 -3975 -2710 -1109 -2906 418 -6043 -3080 -15334 -24983 -8689 3318 3614 -3635 -15343 -8410
5637 -8410 611 8781 -2149 -796 7444 10216 -670 5589 -4136 -11687 -3785 405 -325 -4229 -17126
5622 -17126 -17834 6382 16808 15146 9140 8008 3184 -6084 -9984 -17484 -12795 -9473 -14391 -20361
5608 -20361 -26134 -24727 -19267 -14858 49 8292 4152 -5313 -17470 -9185 -1291 -10412 -3875 -2660
5594 -2660 -11730 -7091 -28589 -26540 -23043 -16845 -15930 -3733 7861 10252 5281 2639 3814 -7128
5580 -7128 -5603 6008 4650 13135 8473 894 2435 10379 8011 7207 4786 14469 15154 6989 188
$$ packed form
5679A2502L756j6359p540k340p458J4041M245n389N63L921J6033j0805j0981J2746
5665F935K54p796p60N663j120j4224p444m530n280J0107J8287J1034L84j5485
5651c975J265J601j797L324o461K963j2254r649J6294J2007K96p249j1708O933
5637h410R021Q170j0930J353Q240K772j0886O259r725p551P902M190p30l904j2897
5622a7126p08K4216J0426j662o006j132m824r268l900p500M689L322m918n970
5608b0361n773J407N460M409J4907Q243m140r465j2157Q285P894r121O537J215
5594b660r070M639k1498K049L497O198R15J2197J1594K391m971k642J175j0942
5580g128J525J1611j358Q485m662p579J541P944k368q04k421R683O85q165o801
$$ plain form
5565 188 -11952 -14204 -7021 -10911 -7752 -17582 -16496 -17464 -13806 3631 13581 10868 -1068 -6388 -937
5550 -937 6383 15650 12869 122 900 -1131 -4967 -16821 -22770 -10895 8380 -5198 -17727 -21660
5536 -21660 -24317 -28622 -34263 -33109 -25791 -20777 -29288 -15902 -2293 -6383 -13838 -8778 -7387 -5705
5522 -5705 1198 15 -18847 -25371 -18622 -25660 -27522 -13873 3672 18334 13503 5197 7857 4906
5508 4906 -979 -14607 -22941 -25846 -3959 8529 3883 -3628 3256 13370 11885 11806 -4884 -13612
$$ packed form
5565A88j2140k252P183l890L159r830J086r68L658J7437R950k713j1936n320N451
5550i37P320R267k781j2747P78k031l836j1854n949J1875J9275j3578j2529l933
5536b1660k657m305n641J154P318N014q511J3386J3609m090p455N060J391J682
5522e705O903j183j8862o524O749p038j862J3649J7545J4662m831q306K660k951
5508D906n885j3628q334k905K1887J2488m646p511O884J0114j485p9j6690q728
$$ [...]
##END NTUPLES=NMR SPECTRUM
##END=
