##TITLE=Analysis number 319516
Compound Code dfp 00120
Project Code adrs
Chemist Name ugmt
##JCAMPDX= 6.0         $$ Bruker NMR JCAMP-DX V2.0
##DATA TYPE= NMR SPECTRUM
##DATA CLASS= NTUPLES
##ORIGIN= Bruker BioSpin GmbH
##OWNER= nmr
$$ XWIN-NMR		Version 3.5
$$ Wed May 17 14:28:00 2006 GMT Daylight Time (UT+1h)  MAYBRIDGE\nmr@NMR_250MHZ
##.OBSERVE FREQUENCY= 250.131544655141
##.OBSERVE NUCLEUS= ^1H
##.ACQUISITION MODE= SIMULTANEOUS (DQD)
##.ACQUISITION SCHEME= undefined
##.AVERAGES= 16
##.DIGITISER RES= 18
##SPECTROMETER/DATA SYSTEM= dpx250
##.PULSE SEQUENCE= zg30
##.SOLVENT NAME= CDCl3
##.SHIFT REFERENCE= (INTERNAL, CDCl3, 0, 16.522)
##AUDIT TRAIL= $$ (NUMBER, WHEN, WHO, WHERE, WHAT)
$$ ##TITLE= Audit trail, XWIN-NMR		Version 3.5
$$ ##JCAMPDX= 5.01
$$ ##ORIGIN= Bruker BioSpin GmbH
$$ ##OWNER= nmr
$$ C:\u/data/dgb/nmr/ADRS/4640/pdata/1/auditp.txt
$$ ##AUDIT TRAIL=  $$ (NUMBER, WHEN, WHO, WHERE, WHAT)
(   1,<2006-05-17 14:27:38.23 +100>,<MAYBRIDGE\nmr>,<NMR_250MHZ>,
      <created by zg, POWCHK disabled, PULCHK disabled
       configuration hash MD5:
       84 BC 41 DB A1 6E 1D 46 DA 25 12 A5 C1 ED C5 3A
       data hash MD5: 64K
       DC 1E A4 D9 9C FB 14 AA 05 D7 9A 40 FE 8D CF E4>)
(   2,<2006-05-17 14:27:50.74 +100>,<MAYBRIDGE\nmr>,<NMR_250MHZ>,
      <Start of raw data processing
       ef LB = 0.3 FT_mod = 6 PKNL = 1 SI = 32K 
       data hash MD5: 32K
       80 FC D3 60 19 7C 00 C5 8E 46 F3 C4 FF EE 24 6B>)
(   3,<2006-05-17 14:27:52.65 +100>,<MAYBRIDGE\nmr>,<NMR_250MHZ>,
      <apk 
       data hash MD5: 32K
       85 F9 86 ED 98 C9 5B F1 8F A5 33 81 A7 72 59 C6>)
(   4,<2006-05-17 14:27:53.45 +100>,<MAYBRIDGE\nmr>,<NMR_250MHZ>,
      <abs ABSG = 5 
       data hash MD5: 32K
       5A C8 C4 95 69 4B FB 79 D2 37 63 0F F0 DE F4 6D>)
$$ ##END=
$$ 
$$ hash MD5
$$ D8 D7 37 EB 6A 7F 48 EB DE 6D 7F EA 44 11 49 9B
##$RELAX= 
##$RELAX= 
##$RELAX= 
##$RELAX= 
##$RELAX= 
##$RELAX= 
##$RELAX= 
$$ Bruker specific parameters
$$ --------------------------
##$DU= <C:\u>
##$EXPNO= 4640
##$NAME= <ADRS>
##$PROCNO= 1
##$TYPE= <nmr>
##$USER= <dgb>
##$AMP= (0..31)
100 100 100 100 100 100 100 100 100 100 100 100 100 100 100 100 100 100 
100 100 100 100 100 100 100 100 100 100 100 100 100 100 
##$AQSEQ= 0
##$AQ_mod= 3
##$AUNM= <au_zg>
##$AUTOPOS= <42 >
##$BF1= 250.13
##$BF2= 250.13
##$BF3= 250.13
##$BF4= 250.13
##$BF5= 500.13
##$BF6= 500.13
##$BF7= 500.13
##$BF8= 500.13
##$BYTORDA= 1
##$CFDGTYP= 0
##$CFRGTYP= 5
##$CHEMSTR= <none>
##$CNST= (0..31)
1 1 145 1 1 1 1 1 1 1 1 1 1 1 1 1 1 1 1 1 1 1 1 1 1 1 1 1 1 1 1 1 
##$CPDPRG= <>
##$CPDPRG1= <>
##$CPDPRG2= <>
##$CPDPRG3= <>
##$CPDPRG4= <mlev>
##$CPDPRG5= <mlev>
##$CPDPRG6= <mlev>
##$CPDPRG7= <mlev>
##$CPDPRG8= <mlev>
##$CPDPRGB= <>
##$CPDPRGT= <>
##$D= (0..31)
0 1 0 0 0 0 0 0 0 0.06 0 0 0 0 0 0 0.0002 0 0 0 0 0 0 0 0 0 0 0 0 0 0 
0 
##$DATE= 1147872456
##$DBL= (0..7)
120 120 120 120 120 120 120 120 
##$DBP= (0..7)
150 150 150 150 150 150 150 150 
##$DBP07= 0
##$DBPNAM0= <>
##$DBPNAM1= <>
##$DBPNAM2= <>
$$ [...]
##$SUBNAM7= <"">
##$SUBNAM8= <"">
##$SUBNAM9= <"">
##$SW= 20.6930455092707
##$SWIBOX= (0..15)
0 0 3 0 0 0 0 0 0 0 0 0 0 0 0 0 
##$SW_h= 5175.983436853
##$TD= 65536
##$TD0= 1
##$TE= 295.16
##$TE2= 300
##$TE3= 300
##$TEG= 300
##$TL= (0..7)
0 120 120 120 120 120 120 120 
##$TP= (0..7)
150 150 150 150 150 150 150 150 
##$TP07= 0
##$TPNAME0= <>
##$TPNAME1= <>
##$TPNAME2= <>
##$TPNAME3= <>
##$TPNAME4= <>
##$TPNAME5= <>
##$TPNAME6= <>
##$TPNAME7= <>
##$TPOAL= (0..7)
0.5 0.5 0.5 0.5 0.5 0.5 0.5 0.5 
##$TPOFFS= (0..7)
0 0 0 0 0 0 0 0 
##$TUNHIN= 0
##$TUNHOUT= 0
##$TUNXOUT= 0
##$USERA1= <user>
##$USERA2= <user>
##$USERA3= <user>
##$USERA4= <user>
##$USERA5= <user>
##$V9= 5
##$VALIST= <valist>
##$VCLIST= <CCCCCCCCCCCCCCC>
##$VD= 0
##$VDLIST= <DDDDDDDDDDDDDDD>
##$VPLIST= <PPPPPPPPPPPPPPP>
##$VTLIST= <TTTTTTTTTTTTTTT>
##$WBST= 1024
##$WBSW= 4
##$XGAIN= (0..3)
0 0 0 0 
##$XL= 0
##$YL= 0
##$YMAX_a= 166565
##$YMIN_a= -305265
##$ZGOPTNS= <>
##$ZL1= 120
##$ZL2= 120
##$ZL3= 120
##$ZL4= 120
##$ABSF1= 16.522
##$ABSF2= -4.171173
##$ABSG= 5
##$ABSL= 3
##$ALPHA= 0
##$AQORDER= 0
##$ASSFAC= 0
##$ASSFACI= 0
##$ASSFACX= 0
##$ASSWID= 0
##$AUNMP= <proc_1d>
##$AZFE= 0.1
##$AZFW= 0.1
##$BCFW= 0
##$BC_mod= 0
##$BYTORDP= 0
##$COROFFS= 0
##$CY= 12.5
##$DATMOD= 1
##$DC= 0
##$DFILT= <>
##$DTYPP= 0
##$F1P= 14.0000005364418
##$F2P= -0.99999901652339
##$FCOR= 0.5
##$FTSIZE= 32768
##$FT_mod= 6
##$GAMMA= 0
##$GB= 0
##$INTBC= 1
##$INTSCL= 1
##$ISEN= 128
##$LB= 0.3
##$LEV0= 0
##$LPBIN= 0
##$MAXI= 10000
##$MC2= 0
##$MEAN= 0
##$ME_mod= 0
##$MI= 0
##$NCOEF= 0
##$NC_proc= -5
##$NLEV= 6
##$NOISF1= 0
##$NOISF2= 0
##$NSP= 0
##$NTH_PI= 0
##$NZP= 0
##$OFFSET= 16.522
##$PC= 1
##$PHC0= 165.9593
##$PHC1= 18.19382
##$PH_mod= 1
##$PKNL= yes
##$PPARMOD= 0
##$PSCAL= 4
##$PSIGN= 0
##$REVERSE= no
##$SF= 250.13
##$SI= 32768
##$SIGF1= 0
##$SIGF2= 0
##$SINO= 400
##$SIOLD= 32768
##$SREGLST= <1H.CDCl3>
##$SSB= 0
##$STSI= 32768
##$STSR= 0
##$SW_p= 5175.98343685301
##$SYMM= 0
##$S_DEV= 0
##$TDeff= 65536
##$TDoff= 0
##$TI= <Analysis number 999999
Compound Code 99
Book Reference 9
Project Code 9>
##$TILT= no
##$TM1= 0
##$TM2= 0
##$TOPLEV= 0
##$USERP1= <user>
##$USERP2= <user>
##$USERP3= <user>
##$USERP4= <user>
##$USERP5= <user>
##$WDW= 1
##$XDIM= 32768
##$YMAX_p= 406309082
##$YMIN_p= -1323211
$$ End of Bruker specific parameters
$$ ---------------------------------
##NTUPLES= NMR SPECTRUM
##VAR_NAME=  FREQUENCY,     SPECTRUM/REAL,   SPECTRUM/IMAG
##SYMBOL=    X,             R,               I
##VAR_TYPE=  INDEPENDENT,   DEPENDENT,       DEPENDENT
##VAR_FORM=  AFFN,          ASDF,            ASDF
##VAR_DIM=   32768,         32768,           32768
##UNITS=     HZ,            ARBITRARY UNITS, ARBITRARY UNITS
##FACTOR=    0.157963299565203, 1,           1
##FIRST=     4132.6476996994, 0,             0
##LAST=      -1043.33573715361, 0,           0
##MIN=       -1043.33573715361, -1323211,    0
##MAX=       4132.6476996994, 406309082,     0
$$ Real data points
##PAGE= N=1
##DATA TABLE= (X++(R..R)), XYDATA
$$ [...]
22855a79785j39865O7760K45699j4927K3596J43053J18927k26362k35349k44197
22845d41450J9509K3172K63823K8950m47514k2115n6756R7888N7127J21348k8354
22834c84372j96408J33215N9164j26406j22780J50906K68817l057k56887o6978
22824e44786J66156p9937n6212L22997O64942M6177n22341M26932R8673k40302
22814B82299j90876l94770j83888j29244L5234L95740K14299L27755j15599m06821
22804a65871l64361o9292J19946K15385n2643r3180K37212O6042J32296M1999
22794F7533m40836n6513J69568J84838J75438P8433j57762k52126j90413j68526
22784e90366K42477L90231J49613M2937J8862o0311l34614k88337l00811K63703
$$ y = [-179785, -319650, -251890, -6191, -21118, 2478, 145531, 264458, 38096, -197253, -441450, -421941, -398769, -134946, -105996, -553510, -575625, -632381, -534493, -477366, -356018, -384372, -580780, -447565, -388401, -514807, -637587, -486681, -217864, -220921, -477808, -544786, -378630, -458567, -514779, -191782, 473160, 519337, -3004, 423928, 522601, 282299, 91423, -303347, -487235, -616479, -581245, -185505, 28794, 356549, 240950, -165871, -530232, -599524, -479578, -264193, -316836, -410016, -172804, -106762, 25534, 67533, -373303, -429816, -260248, -75410, 100028, 178461, 20699, -231427, -421840, -590366, -347889, 42342, 191955, 234892, 253754, 193443, -141171, -429508, -730319, -466616]
22774d66616J57682J30696L0336m22375j63642O42987K03089j40261R4935p5897
22764i066n9429J5862J79122j47486o1693j45005Q5813J1132l30086k43368J05906
22753e98298L00847J73510K26939L65873j98620j02390Q6779J22813k89673j99639
22743a11859o0395P2420J12998j55258l49693k03239L45114K17255p1497M5596
22733a58558L0873j26400j0319j21260P4959K08170J23720O9901K03527k8699
22723B65914n0857J79515j67869O3459j37174l12385j43918R1423O5365k138M8053
22712a00612j36043P2658r7687j88469Q8869K8142P4902J711J86566l6299O1094
22701d5168J55751N80413J29534l24213m68211j31626L07977J71213k93664k58978
$$ y = [-466616, -308934, -178238, -147902, -570277, -733919, -90932, 112157, -28104, 66831, -9066, -68495, -52633, 126489, -20997, -82690, -227695, -141882, -130750, -460836, -704204, -598298, -297451, -123941, 102998, 468871, 270251, 167861, 254640, 377453, 87780, -111859, -172254, -99834, 13164, -142094, -491787, -695026, -349912, -132657, -204154, -158558, -127685, -254085, -264404, -385664, -310705, -102535, 21185, 91086, 294613, 265914, 215057, 394572, 226703, 290162, 152988, -159397, -303315, -211892, -146527, -148665, -100612, -236655, -163997, -261684, -450153, -361284, -333142, -258240, -256529, -69963, -106262, -45168, 110583, 690996, 820530, 496317, 28106, -103520, 204457, 375670, 82006, -176972]
22691a76972k32675j20204j82175L26811L19114j06J38548M9330l37394j21660
22681c37383J06842R6232k5320J84345j9166l38155K55854K14933k10869P8952
22671F265L98838M763j46330k86942k83301R9610J05131r2763m6593L5048Q0672
22660a25602K51067k20374l4397K82218O0634k08846k30064K41076J5812L61636
22650C93160m9161l89828k79724K53678r5225j18858j02087L1344K47902j73094
22640b81893k33207N2064o7895k80252K62063N4046J94850k88315j08098K32436
22630d64201j84101K10009J97201p6628m36048l43456o6391N33499L30081r2992
22620c93027j58983J21752P38878j03906k16139l59347r9371R1752K88402M48595
$$ y = [-176972, -409647, -529851, -712026, -385215, -66101, -66207, 72341, 121671, -215723, -337383, -230541, -134309, -159629, 24716, 5550, -332605, -76751, 138182, -72687, 6265, 405103, 409866, 263536, -23406, -306707, -207097, -101966, -194729, -241322, -206274, -125602, 125465, -94909, -129306, 152912, 213546, 4700, -225364, 15712, 31524, 393160, 343999, -45829, -325553, -71875, -167100, -285958, -388045, -356701, -108799, -281893, -515100, -463036, -530931, -811183, -549120, -495074, -300224, -588539, -696637, -464201, -648302, -438293, -241092, -317720, -753768, -1097224, -1163615, -630116, -300035, -393027, -552010, -430258, 308620, 204714, -11425, -370772, -470143, -378391, -89989, 358606]
22610C58606j21519q3932K62460K77131r1932k39947l75281l5440P1552j77841
22600a56143M04680J8985l63162j81093l1223R5117J25731p2120m24531o50859
22590a234618m8199N08109N21701J22758q6650n5594J65340K7853L94829j22122
22580A93407l60487l15372k9630j90473k4287m57J78822M10463K20812K63888
22570C46686k2533m71530j21366M08928K69257p7457l8488J18580j33385k13061
22560F5631j43725L70316M48940k52616N2959j91746j99310l31208j73806J27042
22550b27523p1692j54839n2161k56712O8173N2091K84148N59562k11850l81578
22540c92381j60278J26861m2264P6291P2564N3612J09312j02175j23908J04250
$$ y = [358606, 237087, 153155, 415615, 692746, 600814, 360867, -14414, -49854, 21698, -156143, 248537, 267522, -95640, -276733, -307956, -212839, -87108, -159228, -583759, -1234618, -1282817, -774708, -253007, -130249, -216899, -272493, -107153, -79300, 315529, 193407, -167080, -482452, -512082, -702555, -726842, -727299, -548477, -138014, 82798, 346686, 324153, -147377, -268743, 140185, 409442, 331985, 293497, 412077, 278692, 65631, -78094, 292222, 741162, 488546, 541505, 349759, 150449, -180759, -354565, -227523, -299215, -454054, -506215, -762927, -694754, -642663, -358515, 201047, -10803, -392381, -552659, -425798, -468062, -391771, -319207, -265595, -156283, -258458, -382366, -278116]
22530b78116L04712L08877N9709l29752j12975K80531O2342m8734k39161n0814
22520d3381J79828J18435k14072l06718N0622N40598K88882j69015k11320j01334
22510A32525l32669j16360K84275p0102J27767J1108J89022K39861q8619K5737
22500D02545j51050l34512Q4333L46510k90437j0260j34479l33838j98569J11732
22490e08025L45125J68404K3363O4599k22094P1441p9367j31462r085J79087N33221
22479D35207J1816l92399j46184o3739J46219l56005k87819K20404K87920n2275
22469a96855K93276J89357k57597k24120L36257K24062j46571O8249j55742k5701
22459A04615R0673K87042j38863k86302k0118L08143J15955R1922j76368l9881
$$ y = [-278116, 26596, 335473, 395182, 65430, -47545, 232986, 295328, 246594, 7433, -43381, 136447, 254882, 40810, -265908, -215286, 325312, 614194, 445179, 233859, 132525, -200144, -316504, -32229, -102331, 25436, 36544, 225566, 465427, 376808, 402545, 251495, -83017, 1316, 347826, 57389, 47129, -87350, -421188, -619757, -508025, -162900, 5504, 28867, 93466, -128628, -57187, -136554, -268016, -277101, -98014, 435207, 447023, 54624, -91560, -155299, -9080, -365085, -652904, -432500, -144580, -196855, 96421, 285778, 28181, -195939, 140318, 364380, 217809, 286058, 130316, 104615, 195288, 482330, 343467, 57165, 37047, 345190, 461145, 553067, 376699, 336818]
22449C36818j59021K37192O9309l16434m65357K47741K65410j44963n8222l4379
22439b1906j90681J11668K63310n5318j296L6883l3864j86287j86639N0408J75519
22428c8203K31793K24398q8714l93396j58776R9675M74781J42060q8935j15538
22418B89145j68262j35951m4612l22391j7261J96133M44064q5856o0676J79222
22408B73555J26966m12965j7020M4278p6533O7870L45532K63611k02360j75368
22398B37566j15387k19242n37376m98600j4512K81691K04005J10907K24138J64396
22388a62414K37598k67067K10721M51214J20882k23227k43326Q4274O7699j52643
22378A23711j14449j47001J24799k42047j48126r3067J67474r0075k19971m7600
$$ y = [336818, 177797, 414989, 484298, 167864, -297493, -49752, 215658, 70695, 12473, -21906, -212587, -100919, 162391, 107073, 105777, 142660, 108796, -77491, -264130, -213722, -38203, 193590, 417988, 329274, -64122, -222898, -123223, 351558, 493618, 404683, 289145, 120883, -15068, -59680, -382071, -399332, -203199, 240865, 155009, 94333, 273555, 400521, -12444, -29464, 14814, -61719, 6151, 351683, 615294, 412934, 237566, 122179, -97063, -634439, -1133039, -1147551, -865860, -661855, -550948, -326810, -162414, 75184, -191883, 18838, 470052, 590934, 367707, 124381, 208655, 276354, 123711, 9262, -137739, -12940, -254987, -403113, -496180, -328706, -418781, -638752, -686352]
22368f86352L79961J65961L2542j28910k43006J29698O3441J49054q9660K7776
22358a99495O4589J06893J30606J77180q7191J89086Q0165j83194l93009j87906
22348c02276Q7259L87401K59360j87673l39835k11522J60718J35384K24707P421
22338B20944l65644Q834J14716K36250m0225j31478J18948L40035K33815j61902
22328E74293L81257j60673k72137m61804l84347L8608L76575L82715J9891j69760
22318C24618j55944j60997j29068K3068J50146j92492j72051J49457R9217l83150
22308d47196j39662K62714J99410K46951q5121J72918J73700l1075j46053L36013
22298E42599J88373k39867l20698K01608K44042k47877j59524J90668K994J92882
$$ y = [-686352, -306391, -140430, -107888, -236798, -479804, -350106, -286665, -137611, -227271, -199495, -134906, -28013, 102593, 279773, 192582, 381668, 461833, 278639, -114370, -302276, -215017, 172384, 431744, 244071, -95764, -307286, -146568, -11184, 213523, 220944, -144700, -135866, -21150, 215100, 174875, 43397, 162345, 502380, 736195, 574293, 955550, 794877, 522740, 60936, -323411, -284803, 91772, 474487, 494378, 324618, 168674, 7677, -121391, -98323, 51823, -140669, -312720, -163263, -64046, -447196, -586858, -324144, -124734, 122217, 37096, 210014, 383714, 352639, 206586, 542599, 730972, 491105, 170407, 372015, 616057, 368180, 208656, 399324, 402318, 595200]
22288E95200k15537l05616R0436j26288j11893p9361j75896K63819J68735k64321
22278a60722K19043M0269j28675L6725k06816k43762j15463K15635K6379P6279
22268b41108R0795L06656M9859J62783j24841l64668j10337P0418j8928j5336
22258a94707J5720J39591j16236k05326J58034M6140j96804p3308j12263o3084
22248f02243L97755J41621p2189J90672K30788j53102n11157J20255M49467R228
22238B01095J77526K61020L02030l27916l12748J21030j909m85525l06902j21324
22228d93623J49877K92902L59621M3535k64401k46158k45447q5157M20877N12017
22218D44043j89370P7221L29925k9527l6532m30432J10840n8906K7085j48830
$$ y = [595200, 379663, 74047, 164483, 38195, -73698, -153059, -328955, -65136, 103599, -160722, 58321, 98590, -30085, 6640, -200176, -443938, -559401, -343766, -317387, -241108, -150313, 156343, 206202, 368985, 244144, -120524, -230861, -160443, -179371, -194707, -178987, -39396, -155632, -360958, -202924, -156784, -353588, -426896, -539159, -602243, -204488, -62867, -135056, 55616, 286404, 133302, -377855, -257600, 191867, 201095, 378621, 639641, 941671, 613755, 301007, 422037, 420128, -65397, -372299, -493623, -343746, -50844, 308777, 352312, 87911, -158247, -403694, -488851, -67974, 444043, 254673, 331894, 661819, 632292, 595760, 165328, 276168, 217262, 244347, 95517]
22208I5517l23587j5792o4565k77959K18291J37492J50916M67581j30260r6579
22198A61055q3279j05259M1346m03626J43354J84118J10201j1988k27395O21j48386
22187c39238l5975P830L98374L60962r6635j57035k73793J55633L03094J22721
22177D45938J19787q3296j7779k12168n49301K56387J52031R7959J28443n6094
22167B81907K07427K48979k77269l46896k64370k41858J41423L40894K68542j24139
22157B34640k20212l71025k89130M08341K42559J89338J84678k7850p8058l79727
22147a06446P3103R3176M68684J64462k99828j82038j36326l11013j37690K93714
22137h0202O616M917q4262Q8966J36709k5148l73601j29594L7619K84141R085
$$ y = [95517, -228070, -243862, -308427, -586386, -368095, -230603, -79687, 387894, 257634, 161055, 77776, -27483, 13863, -389763, -246409, -62291, 47910, 35922, -191473, -190852, -339238, -375213, -367383, 30991, 391953, 295318, 138283, -135510, 20123, 323217, 445938, 565725, 482429, 464650, 252482, -296819, -40432, 111599, 209558, 338001, 281907, 489334, 738313, 461044, 114148, -150222, -392080, -250657, 90237, 358779, 234640, 14428, -356597, -645727, -237386, 5173, 194511, 379189, 351339, 273281, -106446, -33343, 59833, 528517, 692979, 393151, 211113, 74787, -236226, -373916, -80202, -73586, -68669, -152931, -63965, 72744, 47596, -326005, -455599, -417980, -133839, -124754]
22126a24754J8940P3219l6032m6309O4014j43233J10388J67116l4888N8022J29688
22115B36171l60811k47257l58783K81967j93877R2159K83108Q4059k16752r0183
22105d90199K51232M96086k9020N2132j02908l77134L6834J23723l14253J13242
22095b40265L70954J13787J00013p9410m6285j70551k55240j57722r3582j18284
22085e76585Q7688N4954M01495J63699K39437j64821n3395M41972M8628j50243
22075D92829J22314m30918q5990K82266L62650p0888l47061n23167k76260N42790
22065F8565J74815R6936P5186J4063j72090n7556m13574k9013K70055q8200p6633
22054a37446L97866M89224l67363P5708J11266k29716m09202K93005j48668l9131
$$ y = [-124754, -105814, -32595, -68627, -114936, -50922, -194155, -83767, 83349, 48461, 106483, 236171, -124640, -371897, -730680, -448713, -642590, -550431, -267323, -183264, -400016, -490199, -238967, 257119, 228099, 280231, 177323, -199811, -162977, -39254, -353507, -240265, 130689, 244476, 344489, 265079, 218794, 48243, -206997, -364719, -458301, -576585, -488897, -433943, -32448, 131251, 370688, 205867, 152472, 594444, 643072, 492829, 615143, 184225, 98235, 380501, 743151, 672263, 325202, -197965, -474225, 68565, 243380, 340316, 415502, 429565, 257475, 199919, -213655, -242668, 27387, -60813, -137446, 260420, 749644, 382281, 457989, 569255, 339539, -69663, 223342, 74674, 35543]
22044C5543J77125l97410J50758K08457j78328k99679n2955m101j60146J18534
22034d02202J29468J59836J76731j74303Q7620J21961K31894l8234l5292J51603
22024D09082M06941k9533k08767j87244j58930k84306L1287K16784M0990K4232
22014B60536k41897l4143O4085k68953j94920K54592K90720J2038o3955p8781
22004f78l05514k853j0840j20401J08409J97908J94777L01418J98053j49824k50926
21993A59529n7588L9410J00367j32176o0675J42966j55857P806j35991k37335
21983c29544k10409J81817L35588J67217n9368r3491J33914J38735J54931K36481
21973F55871L4827L6008l42119m87018k34268K43214O0439k04013J31106L36776
$$ y = [35543, 212668, -184742, -33984, 174473, -3855, -303534, -356489, -360590, -520736, -402202, -272734, -112898, 63833, -110470, -22850, 99111, 331005, 292771, 257479, 409082, 816023, 786490, 577723, 390479, 231549, -52757, -21470, 195314, 236304, 260536, 18639, -15504, 48581, -220372, -415292, -160700, 130020, 142058, 78103, -678, -306192, -309045, -319885, -440286, -331877, -133969, 60808, 362226, 560279, 410455, 159529, 101941, 141351, 241718, 109542, 48867, 191833, 35976, 43782, -92209, -329544, -539953, -358136, -22548, 144669, 85301, -8190, 125724, 264459, 419390, 655871, 690698, 726706, 384587, -102431, -336699, -93485, -33046, -237059, -105953, 230823]
21963B30823Q7578j39516j97356M30748m6862j6422O8776n4321J8969J62100J72185
21952G16702J48081k17912k70173j42437N4315L37411j17180n69082J6212K85369
21942B41306M74581m23338n23071J40604K32165n6659J3887J22837P9655Q8304
21932C90271j52229M3129K03827l34401n56253j56189K50709L67260K33200j13308
21922A76016K1888l1496j41736K4247K5794j56023K7972l1157K15525L2154l91283
21911b28099J45976K81853L0072J21876J65154j87230j12134j73129Q6249K51909
21901C82497k55024j56973K24966k47338n573K31105q4623j57139m3100n5674
21891a66876K00174R0518k06034k64195j65143m3062k01763j60059j3537Q2826
$$ y = [230823, 318401, 178885, -18471, 412277, 365415, 348993, 417769, 363448, 382417, 544517, 716702, 864783, 646871, 376698, 234261, 288576, 625987, 508807, -60275, -44063, 241306, 715887, 292549, -230522, -89918, 142247, 85588, 99475, 222312, 301967, 390271, 238042, 281171, 484998, 150597, -405656, -561845, -311136, 56124, 289324, 176016, 197904, 166408, 24672, 48919, 74713, -81310, -53338, -84495, 131030, 163184, -228099, -82123, 199730, 229802, 351678, 516832, 329602, 217468, 44339, 130588, 382497, 127473, -29500, 195466, -51872, -57445, 173660, 89037, -68102, -111202, -166876, 33298, 123816, -82218, -346413, -511556, -554618, -756381, -916440, -929977, -847151]
21881h47151J44623M8487K41087K83041l3214o3959l2342k5605L31585O2541J80864
21870B89957J72709o96m1855M9764l91213N1178K37652p2675j05035l36763J09108
21859c7869K50669L4786l32931j00202r6635k07769O6595j6547K82730M20639
21849B63466M2442J7709j78301l61813j24032N4226J6907j60785J27439m682M7013
21838b60411N0295j73934j76191M13016J77134J16052k73581Q1156j1812n33J29637
21827G0828p6892k59282j70641K28375J28690J98773p0079l13337M04143K19623
21817C60201n3534R0061J51631o3776n7632k35970o37408k92148N06161O8429
21807a63985J49514K73510j56081j19881Q6675j08994p3511K00926K3487P0659
$$ y = [-847151, -702528, -654041, -412954, -129913, -163127, -227086, -259428, -285033, 46552, 109093, 289957, 462666, 461970, 420115, 469879, 78666, 129844, 367496, 294821, 189786, -146977, -37869, 212800, 247586, -85345, -185547, -282182, -489951, -423356, -439903, -157173, 263466, 305908, 323617, 145316, -216497, -340529, -286303, -269396, -430181, -302742, -307424, -260411, -210116, -384050, -560241, -147225, 29909, 145961, -127620, -46464, -58276, -58809, 70828, -6064, -265346, -435987, -207612, -78922, 119851, 49772, -263565, 140578, 360201, 306667, 396728, 548359, 484583, 426951, 190981, -446427, -738575, -232414, -163985, -14471, 259039, 102958, -16923, 69752, -39242, -112753, 88173, 111660, 182319]
21797A82319J66011k26664p581K17712J47368R3873m11721j11521K8668Q484n4411
21786C2537K39972k30276l99854j40619K93850K39130k01455n7001J19191j5556
21776a20081k1807J24776Q1416J64881J3436j721j61917j6495j76777l60998j4422
21765d89709J65705r7630L0505K97924P5659k50571j29677J16399k45526k13930
21755g40851M11316J37478l8383o6683K52676K2691k10882Q1299J19413q7099
21745a19025k41384l90389O0940J35216J79291J48855j84609l48557Q4713K44038
21735d30911o0373k0894J98213J73836K50362o3287j85816N4819K08854L01174
21725D25977l5258l08649k37924L16423l9267k96390r3479L29449K15675j46405
$$ y = [182319, 348330, 121666, 114085, 331797, 479165, 573038, 161317, 49796, 78464, 86948, 32537, 272509, 42233, -357621, -498240, -204390, 34740, -166715, -223716, -104525, -120081, -141888, -17112, 64304, 229185, 242621, 240900, 78983, 62488, -114289, -475287, -489709, -324004, -421634, -391129, -93205, -17546, -268117, -397794, -281395, -526921, -740851, -329535, -192057, -230440, -297123, -44447, -21756, -232638, -151339, -31926, -119025, -360409, -750798, -689858, -554642, -375351, -226496, -411105, -759662, -674949, -430911, -491284, -512178, -313965, -140129, 110233, 46946, -138870, -84051, 124803, 425977, 390719, 82070, -155854, 160569, 121302, -175088, -268567, 60882, 276557, 130152]
21715A30152j84300j75089J67235K53626P6153J0746j10184k8803l6950l0044
21705G2542L53393m3082m26248l79421P7553O963k2659J48901l16504q3548L17985
21694b94125L36331P1525n3202j79973k42809j23501R7054J69743J58660J73408
21684A13111J00236j99753l3406l05615j49224j55810j97729L14787M74498K02696
21674A63791M458j13862N0985k33761k54216j05445K02774L28458K3572J9240
21664H5994j32985P5476k50821J77529K32498Q8485j09748j05465m28695M2984
21654c24748J67699j76832J9049j33094K8514N98552o046l04957N7693J41323
21644F7153J06490j26596n9967r5025L4563J36539J85677j47874J64536J49386
$$ y = [130152, -54148, -229237, -62002, 191624, 267777, 278523, 168339, 139536, 102586, 72542, 425935, 382853, -43395, -422816, -345263, -338300, -360959, -212058, -528562, -612110, -294125, 42206, 113731, 60529, -119444, -362253, -485754, -388700, -218957, -60297, 113111, 213347, 13594, -19812, -325427, -474651, -630461, -828190, -513403, -38905, 163791, 168249, 54387, 105372, -128389, -382605, -488050, -285276, 43182, 66754, 85994, -46991, 28485, -222336, -44807, 187691, 276176, 166428, 60963, -367732, -324748, -157049, -333881, -314832, -447926, -419412, 179140, 173094, -131863, -74170, 67153, 173643, 47047, -12920, -107945, -73382, 63157, 248834, 100960, 265496, 414882]
21634D14882j78037J15853j45889j01872o8938j35351k97865p6862j90289K69186
21624c95182P8133j59751K99743k10863k90053J90176K40515k05506j73724Q619
21614f17893L71039L86478m18416l61113J67067J52140j52646k01688j85117m922
21604h65071j20806L47089L19740j71951M8802L23143J04676k81607j03120j95932
21594e95037L40311N09134J40101l96908j54769j32870q2869M5736L69450k2922
21584A9357k92700m54823J2976L20485M68119p645n30166M5672J16374l8473n6206
21573c97030j55080J33309J87136J98423K59798J28638J48970J13087n00097j7781
21563I9373J56251K17495J37045M5336j63788k37423k1157K74717k02013l30957
$$ y = [414882, 236845, 352698, 206809, 104937, 35999, -99352, -397217, -474079, -664368, -395182, -317049, -476800, -177057, -387920, -677973, -487797, -247282, -452788, -626512, -617893, -246854, 139624, -278792, -639905, -472838, -320698, -473344, -675032, -860149, -865071, -985877, -638788, -319048, -490999, -442197, -119054, -14378, -295985, -399105, -595037, -254726, 254408, 394509, -2399, -157168, -290038, -372907, -327171, 42279, 19357, -273343, -728166, -715190, -394705, 73414, 65769, -464397, -418725, -302351, -340824, -397030, -552110, -418801, -231665, -33242, 226556, 355194, 504164, 617251, 117154, 99373, 255624, 473119, 610164, 655500, 491712, 254289, 233132, 507849, 305836, -25121]
21553b5121j20430k29514j94071M17268N8459K085j28733j79697L2629N0370J72397
21542a44358P6287L7092K04830J74068m7682q1164K83250J32054l14097k33254
21532H7026O2362j81927n6040L33473k56231k20381O1124J89780j31433k1213
21522a33460L9446j92972J54212L0838R7083K90710n24695l15841J83453L20148
21512e1078O2694j88570J50592K9160n2754j40956J09801K34440k40435j37466
21502b24572q6809j28387J07542m12436j25613J85228l2882n8230L51002M67679
21492D2522j96651k87292Q5631J31008n9121N544K95676J26770N7819m21829m08330
21481f28253m7613L92851K75635o5442Q364l9302l10505o3598K35206J88997K37244
$$ y = [-25121, -145551, -375065, -569136, -151868, -93409, -91324, -220057, -399754, -367125, -316755, -144358, -68071, -30979, 173851, 347919, 300237, 219073, 502323, 634377, 320280, 87026, 149388, -32539, -88579, 244894, -11337, -231718, -170594, 19186, -112247, -133460, -94014, -286986, -132774, -101936, -4853, 285857, -238838, -554679, -371226, -51078, 11616, -176954, -26362, 2798, -49956, -190912, -81111, 153329, -87106, -224572, -311381, -439768, -332226, -744662, -870275, -685047, -717929, -776159, -425157, 42522, -154129, -441421, -355790, -224782, -283903, -278359, 17317, 144087, 201906, -219923, -628253, -675866, -283015, -7380, -72822, -64458, -103760, -414265, -477863, -242657, -53660, 183584]
21470A83584K8071J19628J84374l5658J09016l83584P1770J85716J67127R83k16665
21459D14362l18494k87215M64918Q1657l58486j07687J89902J31871N5800J10296
21449C76924K14771m51824n16289j36710K14117K02640m2104j48865k49833j44738
21439f81911q355M69038L91935J00678q1318K53410K18486r6972K24357l668m24229
21428C61451k11953o8971j82052k47282j9887J03798N05515J88383l50879l40148
21418b62025m00489k37104k71302K12583M12262m0003J33994L01363K64196J80478
21408B93953k94337m26076K18778J84094j7518k7747J26586m5090L12865J01591
21398D27099m1071l42754n0754k31536J35825K45878k32234o7890k75732n8877
$$ y = [183584, 211655, 331283, 515657, 479999, 589015, 205431, 277201, 462917, 630044, 631027, 414362, 95868, -191347, 273571, 355228, -3258, -110945, 78957, 210828, 266628, 376924, 591695, 139871, -376418, -513128, -299011, -96371, -138475, -287340, -537173, -681911, -690266, -221228, 170707, 271385, 190067, 443477, 661963, 564991, 789348, 785680, 361451, 149498, 80527, -101525, -348807, -368694, -264896, 240619, 429002, 78123, -262025, -662514, -899618, -1170920, -958337, -546075, -586078, -452084, -150721, 113475, 293953, -384, -426460, -207682, -23588, -41106, -68853, 57733, 12643, 325508, 427099, 386028, 43274, -7480, -239016, -103191, 142687, -89547, -157437, -433169, -492046]
21388d92046L9565L79203j16578k29502l6168N89301k02053j27303K28782J78357
21378B11558k86826R8394J98649P8706R6765J8697J40029q6696j62628J59840
21368D66488J06482k67367J24680j43008k41216j07740l33200j16897j74535J81656
21358e04657p2953J0961q2034q631o7172l6473L32182L46750l0193Q9928Q1435
21347E9143K37238K75645k38501k32654k51538n4721M31507j82455n5152L14940
21337C03452p7153k28917l50514m02968M30517O74476K11359k99821o47668k52164
21327f39401J42760Q5220j9754J98631L14046K21173j39318j44966l13057k32316
21317e26982j15479M16505K39334K02862j0450j76512l43625J6107K09601o3622
$$ y = [-492046, -452481, -73278, -189856, -419358, -455526, 133775, -68278, -195581, 33201, 211558, -75268, 23126, 221775, 300481, 397246, 415943, 555972, 469276, 306648, 466488, 572970, 305603, 430283, 287275, 46059, -61681, -394881, -511778, -686313, -504657, -577610, -566649, -648683, -657314, -724486, -760959, -428777, -82027, -112220, -22292, 59143, 296381, 572026, 333525, 100871, -150667, -205388, 226119, 43664, -11488, 303452, 226299, -2618, -353132, -756100, -325583, 348893, 560252, 260431, -387237, -639401, -496641, -411421, -431175, -232544, 81502, 302675, 163357, 18391, -294666, -526982, -642461, -225956, 13378, 216240, 205790, 29278, -314347, -298240, -88639, -152261]
21307a52261K00248K80716j35459l93493m80180J06031L26017K21632k04398K13579
21297a7568J59698l58671O7341K3747K42724k06836j175K9590p9751j48695P2112
21286b17484n6500K4437M25618q6854k13960j32507j42517M81047L34445l46329
21276F9396j1083N4397j80031N5961j07923M85654N4464k21360p1968N3874J78952
21265C60333r466j98441k06413k11503j19450J50047Q9042J41126M2274N6246
21255I3795K58690j67588k37428k29759J0604R4373J04555r7819N7707J60324
21245D7454j65994K02386l03054L356R9206k1977m59006J09427j49583j84268
21235h22053J05071j75786N30881M92874J74836k97905k5532l34924J88347L2268
$$ y = [-152261, 47987, 328703, 193244, -200249, -680429, -574398, -248381, -26749, -231147, -17568, 142130, -216541, -149200, -125453, 117271, -89565, -90740, -61150, -140901, -289596, -217484, -273984, -249547, 176071, 89217, -124743, -257250, -399767, 81280, 415725, 69396, 58313, 112710, -67321, -11360, -119283, 366371, 420835, 199475, 127507, 181381, 360333, 350867, 152426, -53987, -265490, -384940, -234893, -145851, -4725, 37549, 93795, 352485, 184897, -52531, -282290, -271686, -177313, -72758, -170577, -112870, 47454, -118540, 83846, -219208, -215852, -116646, -138623, -597629, -488202, -637785, -822053, -716982, -892768, -361887, 130987, 305823, 7918, -17614, -352538, -164191, -131923]
21225a31923J93515K95420j07095R272l61947j48342J86167R1946k60184j72748
21215d05919j46295K22030J35153L3183J77225j9573n6594J9466p9411P3665j20165
21204a67235j11423j90657O7912K17682J71180m0751k43166J69063N16844J02678
21194D92127J8812k70833p33418k66401k39407m878L00955M03281K03396M69912
21184C73546k15625k90473j73404k42685J31150k84977n7294K71571J93290J37468
21174a57433J40125J37434j44883l11539L31105K20400m32655n24791n0689J96806
21164e96120j84660K20216J26007l260J51911J14064L58282O4717k70830l63135
21154c82808j29138J11408L15867N7204j97126m4462q9321L19471M4803l53339
$$ y = [-131923, 61592, 357012, 249917, 259189, -102758, -251100, -64933, 27013, -233171, -405919, -552214, -330184, -195031, -161848, 15377, -4196, -60790, -41324, -120735, -47070, -167235, -278658, -469315, -401403, -183721, -12541, -53292, -296458, -127395, 389449, 492127, 510939, 240106, -493312, -759713, -999120, -1003998, -703043, -299762, -96366, 373546, 157921, -132552, -305956, -548641, -417491, -702468, -759762, -488191, -294901, -157433, -17308, 120126, -24757, -336296, -5191, 215209, -217446, -742237, -792926, -596120, -780780, -560564, -434557, -437817, -285906, -171842, 186440, 251157, -19673, -382808, -511946, -400538, -84671, -27467, -224593, -269055, -358376, -38905, 5898, -347441]
21144c47441m9881k21220O4987K25559K09166Q8101o46976r7813M26711J03216
21134b45591L363L56798l44686J08093j90729J16726L30114m9707l75012j42027
21124d32658K32016J57k16264J7937K7782M44427L18833k95535l77901m42329
21114g23535j9830M31848J84558j63002l74140j02558N9203L58014K50279K38089
21104A38926J51106j32592k28642Q6986o3279P6555m6005Q3118j34149j13366
21094a81342J18533K5540j82834J80466K08086l0182r9311j55039K21898j63113
21084e7298j59056m9412K75961J37123l02654l18734q4879L54377p2294j54924
21074d31790J18905J96829l33316r6023K35355k0899M6653J24231N3965K68801
$$ y = [-347441, -397322, -618542, -553555, -327996, -118830, -30729, -677705, -775518, -348807, -245591, -242228, 114570, -230116, -122023, -312752, -196026, 134088, 84381, -290631, -432658, -200642, -200485, -416749, -398812, -371030, 73397, 392230, 96695, -281206, -723535, -743365, -311517, -126959, -289961, -664101, -766659, -707456, -349442, -99163, 138926, 290032, 157440, -71202, 15784, -47495, 29060, -16945, 66173, -67976, -181342, -62809, -37269, -220103, -39637, 168449, 138267, 38956, -116083, 105815, -57298, -216354, -265766, 10195, 147318, -155336, -474070, -558949, -204572, -276866, -431790, -312885, -116056, -449372, -545395, -310040, -330939, -284286, -160055, -106090, 162711]
21064A62711k02658k79233J27634M1291l53079j14280K28239K39139L6655k96885
21054d10466j07215M06518L3042l43259k07198K339O02438K90883J38849k09611
21044A96320k15966j17483J19104m2679j89271k91927J42402K92611o2865Q0633
21034h9121p1114P9247k01033l3010J2618m0242j86813K73708J01881p9819J38434
21023i5264Q4984m08541k42882m0304k0888M16931K07421J69893M4173Q2785O1428
21012B59736m40725m46557K8089J68284j35392J3668R7400q6750k7364L98485
21002a71126K65450r4905k97518k98459J22669r6710m32499K54352M37734J05099
20992b05913j31558j05089J62505K19664K84975j27500M3848j54128p4373N1641
$$ y = [162711, -39947, -319180, -191546, -150255, -503334, -617614, -389375, -150236, -113581, -410466, -517681, -111163, -78121, -421380, -628578, -626239, -23801, 267082, 405931, 196320, -19646, -137129, -18025, -60704, -249975, -541902, -399500, -106889, -169754, -89121, -160235, -80988, -282021, -315031, -302413, -342655, -529468, -255760, -153879, -233698, -95264, -10280, -418821, -661703, -702007, -722895, -305964, -98543, 71350, 115523, 198308, 259736, -180989, -627546, -599457, -431173, -566565, -552897, -455497, -542247, -569611, -171126, 94324, -581, -298099, -596558, -473889, -570599, -1003098, -748746, -311012, -205913, -337471, -442560, -280055, -60391, 224584, 97084, 140932, -13196, -87569, -35928]
20982c5928o942j31706j93446j56230K03513J46163k78779M07064J56968k30634
20972a19957j10488k47419r577N66880K51812j36557N2681J82470J2116j29450
20962C12511n1541r2459K9947j59407j08157J02932N7951k5199J2534m73933J60932
20951b33889L89138L9967K04193J03164j21959j3564j58643j99794k70626J39230
20941a22783K24305O4J0148M3436n5930J61397J2421J55000l6985K2695K35948
20930F49716K65363J9511j57059l13835k08444J88053L51878k79792l31458n5447
20920A28486j00012J95001j66965l30502J23304J30956P5933l8450j3826P0575
20910G4500K54100o8579j18101J0390R9058k35071k46213k44126J07489K15316
$$ y = [-35928, -42870, -174576, -368022, -524252, -320739, -174576, -453355, -46291, 110677, -119957, -230445, -477864, -487441, 79439, 331251, 194694, 247375, 429845, 441961, 312511, 260970, 168511, 198458, 39051, -69106, 33826, 91777, 66578, 79112, -394821, -233889, 155249, 195216, 399409, 502573, 380614, 367050, 208407, 8613, -262013, -122783, 101522, 101586, 111734, 155170, 99240, 260637, 273058, 428058, 391073, 413768, 649716, 915079, 934590, 777531, 463696, 255252, 443305, 795183, 515391, 183933, 128486, 28474, 223475, 56510, -273992, -150688, -19732, 56201, 17751, 3925, 74500, 328600, 260021, 141920, 152310, 251368, 16297, -229916, -474042, -366553, -151237]
20900a51237L25947k88137j70360j61893K93823J91091o0093k50324j76310R6554
20890c50939K38257K03276k80537j37163j74759J47018N3112r3987l51998J18680
20880f29040O49673J9389j53711o03957j49776M70601L72142P496j15416J92870
20870F0271L49007K34538r5733l99545j88075q0008L3369j07794l3566l3266m6208
20859c07010N4862P8990K0553j29047j06217J67593n8401K35268M4195j35944
20849a35158k21835M5994l4437K39509K07385l7328p6485n471R5412j4454n4215
20838H917L9477n2026n00387j91756P2947O8455R6968K44173K51796j60640J02819
20827a9257o3092K90608J33334l18847n7496J54925K60348m0011k10827k7457
$$ y = [-151237, 174710, -113427, -283787, -445680, -151857, 39234, -20859, -271183, -447493, -350939, -112682, 90594, -189943, -327106, -501865, -354847, -301735, -395722, -747720, -629040, 20633, 40022, -113689, -717646, -867422, -396821, -24679, -17183, -132599, 60271, 409278, 643816, 548083, 148538, -39537, -119545, -86176, -193970, -227536, -260802, -307010, -252148, -173158, -152605, -281652, -387869, -220276, -278677, -43409, 786, -135158, -356993, -310999, -345436, -105927, 101458, 64130, -12355, -17826, 77586, 63132, 8917, 48394, -3632, -504019, -695775, -622828, -554373, -457405, -213232, 38564, -122076, -19257, -82349, 208259, 341593, 22746, -34750, 120175, 380523, 340512, 129685, 102228]
20817A02228k0751K46356k67537j64395L97057N4j70712J77706K64655k11774
20807C52887l67793l35406J1021K44686k65886J06138K73820J6618J2107O9970
20797A18162p0112M5472q1350j87815l01349j74379O7717M1945p073M23853M88803
20786C63874o4156K1710j70836K79996j62325J52228k72043o8550J72863j98497
20776E4264r1755j52380J33661J17358j9616k1799j26254j3333J71529J12940
20766A64615k07853j81059J5995j63755K42370N26416K67149J64054q28970j93020
20756a94058o5732j1661J02296K25395R7700m34084m7368K79275K66674L06299
20746E24736Q7099l98894j13223M1661M9684j62382j46229j22898l8907R2832
$$ y = [102228, 81477, 327833, 60296, -104099, 292958, 293012, 122300, 300006, 564661, 352887, -14906, -350312, -339291, -94605, -360491, -254353, 19467, 36085, 48192, 118162, 48050, 93522, 12172, -175643, -476992, -651371, -583654, -541709, -548782, -124929, 363874, 299718, 321428, 150592, 430588, 268263, 420491, 148448, 79898, 252761, 54264, -37491, -189871, -56210, 61148, 41532, 19733, -106521, -119854, 51675, 164615, -43238, -224297, -208302, -372057, -129687, 396729, 663878, 827932, -1038, -194058, -259790, -271451, -169155, 56240, 153940, -280144, -327512, -48237, 218437, 524736, 611835, 212941, 99718, 141379, 191063, 28681, -117548, -240446, -279353, -186521]
20736a86521L816m6851k6460j22086j57098M79990J23433k03148K09520M1974
20726A16569j86782j01344n129J59968P1467K49115j65334J8953j63695J46863
20716A40651J15910j82833J51858J907j16868p3913k97281J52082N153k79820
20706c83154L4572n2014K77408J06197p6236K23481J99455P89k28827k27554J43882
20695A7999R0228r2053k24407Q7733L18093J13224k51842k0087L17049K06665
20685E62602J6535k6632l17676R9529J05719N6354l13639n32483Q9902J31419
20675a28370N908l84724k81082m884L55566J3328j27272K52358K61814N5434J9367
20664C7443k76926Q8956J34841k21899N3818k5133K16409k6110K07825J77742
$$ y = [-186521, -182705, -229556, -256016, -378102, -535200, -55210, 68223, -134925, 74595, 116569, -70213, -171557, -176686, -16718, 54749, 303864, 138530, 157483, -6212, 140651, 256561, 73728, 225586, 227493, 110625, 36712, -260569, -108487, -103334, -383154, -348582, -400596, -123188, -16991, -93227, 130254, 329709, 330498, 101671, -125883, 17999, 108227, 16174, -208233, -120500, 197593, 310817, 58975, 38888, 355937, 562602, 579137, 552505, 234829, 334358, 440077, 496431, 182792, -349691, -259789, -128370, -122462, -507186, -788268, -793152, -437586, -424258, -551530, -299172, -37358, 18076, 37443, -239483, -150527, -15686, -237585, -183767, -208900, 7509, -18601, 189224, 366966]
20654C66966p8670j04662j6941K7849j56645k04984J93986N16305M2372o52960
20644f7384j66450K7310j18076j20671J15619k56309N6670J94948J60002l46837
20634e21178L29355K54587j30434l3591j03495K98290P8778R5473K01004l56453
20624A12336K53439k06783l08361J1431K92468j49092K8643K33355J36465j83367
20614B20534l17346k76585k18632l9257K44963L66198p0061j06342k90752J056
20604d86224K85674K34426K16014r6540K9254N4781k7865P0032m10435j11661
20594b42544L63129p8815m6028j39179j34179J48353k35236l13732O05036J51526
20584G8331m33322J63792L81279l10199K69879J41069j59785O3976l5976J96201
$$ y = [366966, 288296, 183634, 166693, 194542, 37897, -167087, 26899, 543204, 585576, -67384, -233834, -206524, -324600, -445271, -329652, -585961, -529291, -334343, -174341, -521178, -191823, 62764, -67670, -101261, -204756, 93534, 172312, 267785, 468789, 112336, 365775, 158992, -149369, -137938, 154530, 5438, 34081, 267436, 403901, 220534, -96812, -373397, -592029, -631286, -386323, -20125, -90186, -196528, -487280, -486224, -200550, 33876, 249890, 153350, 182604, 237385, 209520, 279552, -130883, -242544, 120585, 41770, -4258, -143437, -277616, -129263, -364499, -678231, -73195, 78331, -354991, -191199, 190080, -120119, 149760, 290829, 131044, 195020, 159044, 355245]
20574C55245j69241m04777k9920J35829l5423N1655q6770l70572Q3615j01424
20564e71783k24007K40117J00613P2897L10922l48314j16420O2892Q7420L38635
20554d7028L28389J75526l05104l93739j92733K1877K50171j22194k08172J70025
20544c22982P8248L98518l4183q2004K24437Q5519j61758j76397L9666K60936
20534C10000P3182m73339k7172p1718O396k84889k6991K37320j2954l40342J59192
20523d51315M7424K49865J46092n2818k7602l63520L7417M02432K17956J46444
20513C52375k79209l81207J4866l23989j25000M86659K27463K22118J27465j66884
20503A54657j05824K35734J49016j96197q0459j6602j10716r2249J40546j30538
$$ y = [355245, 186004, -218773, -248693, -112864, -148287, -96632, -183402, -553974, -470359, -571783, -795790, -555673, -455060, -382163, -71241, -419555, -535975, -473083, -385663, -47028, 281361, 456887, 151783, -241956, -434689, -412812, -162641, -284835, -493007, -322982, -244734, 153784, 119601, 37597, 262034, 347553, 185795, 9398, 49064, 310000, 383182, -90157, -117329, -189047, -182651, -467540, -494531, -257211, -270165, -610507, -451315, -403891, -154026, -7934, -60752, -88354, -451874, -414457, -12025, 205931, 352375, 73166, -308041, -293175, -617164, -742164, -255505, -28042, 194076, 321541, 154657, 48833, 284567, 433583, 237386, 156927, 140325, 29609, -62640, 77906, -52632]
20493e2632k89263Q2360K08611J28042j43097J3007P4905N39713n1186k67730
20483B42730J82212J53035q4530j6058k66390m01325K20019J43257k43934J19914
20473D8930J56933P8641k08615L31731k72507k42027L9956K7890k49325R4335
20463a94058L77195M17726K4775N3686n4520L1225P9680m16631k73493R6153J44808
20452B86546J27165J89778l7690j13860J6460L30931k3601n89967p85393m2427
20442f42058r72q8654K7501K46241K91867K98153J8572M5781R8505J14992l51104
20431E8824l30338J01164M6509k47902J6489M22608j44007M859j14730p6211K22210
20420d0525L88647K08924n97741m7230K76506J53550j88405l47362o2274r4500
$$ y = [-52632, -341895, -259535, -50924, 77118, -65979, -52972, 21933, 561646, 510460, 242730, 424942, 577977, 493447, 477389, 210999, -190326, 29693, 172950, -70984, 48930, 205863, 284504, 75889, 407620, 135113, -106914, -66958, -39068, -288393, -194058, 183137, 600863, 625638, 679324, 624804, 656029, 735709, 319078, 45585, 141738, 286546, 413711, 603489, 565799, 451939, 468399, 799330, 775729, 185762, -599631, -642058, -643030, -731684, -704183, -457942, -166075, 132078, 150650, 196431, 294936, 409928, 58824, -271514, -170350, -123841, -371743, -355254, 67354, -76653, -71794, -186524, -262735, -40525, 348122, 557046, -40695, -87925, 188581, 342131, 153726, -193636, -255910, -350410]
20410c50410J56120J09322k58499J74461P9574K2708p5140j82520M3286K71501
20400i597M15644n5635l190o9160J37116j00190k39607k47692R1276L43595K73114
20389E35674k93469k80004r8181R7660j90371J67304J21281Q2012j77721q8215
20379a24030k81096J46725N03017K39832n4296l07409k42991j72352J54115q5527
20369b24012N2896J16094j67846k9528j22105K31388J56190K15405K05432k58436
20359A75478p62743k55371j14095J80386J89314M32858J95548r778j83739R957
20349a42185J76007J19944K38662j77011k53860Q7943p008j31793m831J77903
20339H3771j87767L3635K50566n8829j78021J77003m7563j26939N7497j71489
$$ y = [-350410, -194290, -84968, -343467, -169006, -89432, -66724, -141864, -324384, -281098, -9597, 406047, 350412, 347222, 278062, 415178, 314988, 75381, -172311, -81035, 262560, 535674, 242205, -37799, -135980, -38320, -228691, -61387, 59894, 141906, -35815, -124030, -405126, -258401, 244616, 484448, 430152, 122743, -120248, -292600, -138485, -224012, -171116, -55022, -222868, -252396, -374501, -143113, 13077, 228482, 433914, 175478, -587265, -842636, -956731, -776345, -587031, -154173, 41375, 31597, -152142, -142185, 33822, 153766, 392428, 215417, -38443, 49500, 42492, -89301, -94132, 83771, -103996, -70361, 180205, 121376, -56645, 120358, 72795, -54144, 3353, -168136]
20329a68136p1142J31772K99763j50437n12242J88483m8962R7246j38074l5270
20319d06999N96396p9397L6529k5719J455N931k89441j69980L23960K39043J33496
20308C65274l83924r3316Q6455r7255j88127n4456J84489N20999J183k2916k46117
20297G2289l32222k8818o7437o8387N1046k8485J92070M3095l9542K99522K26938
20286C20069J70849j43655k33544k56754p7361R813p4694J41911J14146L3071
20276C851n9962J01023J0978M1094k0907l25723m00724n933M81114n790J06634
20265g4345q4199l62958p0664O3022O5249Q0993k2747j42084M13852N9939l70494
20254d44436J13488o686J17464O0272k94356k5176J71784L8605P6923K38361J4963
$$ y = [-168136, -239278, -107506, 192257, 41820, -470422, -281939, -330901, -233655, -371729, -406999, 189397, 110000, 146529, 120810, 122265, 128196, -161245, -331225, -7265, 231778, 365274, -18650, -111966, -25511, -122766, -310893, -365349, -180860, 340139, 341322, 318406, 72289, -259933, -288751, -356188, -424575, -373529, -402014, -209944, -166849, -206391, 93131, 320069, 490918, 347263, 113719, -143035, -220396, -210583, -285277, -143366, -29220, 3851, -56111, 44912, 55890, 96984, 76077, -249646, -650370, -656303, -175189, -180979, -74345, -158544, -521502, -592166, -529144, -463895, -382902, -405649, -547733, -133881, -73942, -444436, -330948, -337634, -220170, -159898, -454254, -479430, -307646, -269041, -192118, 46243, 61206]
20243F1206j52668J75560L856J08194j85020l41011J36157K77676J60348J524
20233B45822m11376j48189J85729k0909L03070J49161J38284r3102J2906K13709
20223E75105M0942K9995j33900m08435N5822J05401N4816l60657j80133N5194
20213a65850m3105j48833k30012J22557j8444k85784k753J25556l1280K42249
20203d35699j44005O8959K31168N6404K30191k78971O0828l3090j10106K16603
20193a37718j18454L41975K1730k94150n9409l43186l88980K93116n1420K3816
20183g12680N87219M36266L28615l44563n46876M1029M20310M33444k63250j17851
20173B61663K33957o6905j30057J776m25944j15020L71481K21357k65185p8262
$$ y = [61206, -91462, 84098, 87954, 196148, 11128, -329883, -193726, 83950, 244298, 245822, -165554, -313743, -128014, -148923, 154147, 303308, 441592, 348490, 361396, 575105, 616047, 646042, 512142, 103707, 159529, 264930, 319746, -40911, -221044, -165850, -208955, -357788, -587800, -465243, -483687, -769471, -772224, -646668, -677948, -435699, -579704, -510745, -279577, -223173, 7018, -271953, -211125, -244215, -354321, -137718, -256172, 85803, 107533, -186617, -246026, -589212, -978192, -685076, -736496, -712680, -125461, 310805, 639420, 294857, -252019, -210990, 209320, 642764, 379514, 261663, 495620, 428715, 298658, 300434, -125510, -240530, 130951, 352308, 87123, 8861]
20163H861m7694l19854j38508m5323K3639Q631L43441o0229n263Q5412K02776
20152E5889N15126k33900j28863Q8095r3865J47583O3542l06619O2990L91014
20142E60992j74504k72494l8395q1461J29031L78031k34158l58125K42816j05814
20132D5919k10225L2293m73910j03136L36928J59287m6313J89296J80161l2052
20122G8248J17647J27527j37307k62201j41222J64815j28421J014J6080L07046
20112A43226P1728r2598J33623K22883r6017j06606L1053O4365k9592K24277j69920
20101C96422m48777m58052q7179K25197K40871k23368j31433L53591j2787J86399
20091D0884M0415l09800K7482m7391k41545Q5110j6686O7110L27470J78754J01061
$$ y = [8861, -38833, -358687, -497195, -542518, -518879, -510248, -166807, -227036, -232299, -146887, 55889, 571015, 337115, 208252, 296347, 202482, 350065, 413607, 106988, 169978, 560992, 386488, 113994, 75599, -5862, 123169, 501200, 267042, -91083, 151733, 45919, -164306, -132013, -605923, -709059, -372131, -212844, -259157, -69861, 110300, 78248, 195895, 323422, 186115, -76086, -217308, -52493, -180914, -179900, -163820, 143226, 214954, 122356, 255979, 478862, 382845, 276239, 307292, 371657, 342065, 566342, 396422, -52355, -510407, -597586, -372389, -131518, -354886, -486319, -132728, -145515, 40884, 81299, -228501, -201019, -248410, -489955, -404845, -421531, -354421, -26951, 151803, 252864]
20080B52864k20317k30205l95058K46239K38866L42583o1180m02580j96251J72280
20070b52759P3764r0109j38072J97332L41804q8532J28815j76096j5542K64541
20060B45146K94656M3790j04348j3553q0547j90860k50796m058J71984R2492l27744
20049a23838j16310J59621m8976M8683N6438K01144k57303j50984J15109j11596
20039b28012j04346R0274J93669J69754l5068J01999J03951p598l20552m49924
20029d85853Q8620J12666L22793j03315j16153J4005K22512J30083k12837j89109
20019b16588j86276Q7095j33914j63413J32397R0415m5807J38896M42234k34k43714
20008i8909k63387M0770J62999l44286P4893L69651k24884j0292J72830j7205
$$ y = [252864, 32547, -197658, -592716, -346477, -107611, 234972, 173792, -228788, -425039, -252759, -178995, -269104, -407176, -209844, 131960, 43428, 172243, -3853, -19395, 245146, 539802, 583592, 479244, 465691, 385144, 194284, -56512, -60570, 111414, 203906, -123838, -240148, -80527, -129503, -80820, -24382, 176762, -80541, -231525, -116416, -228012, -332358, -242084, -48415, 121339, 86271, 188270, 292221, 284623, -35929, -485853, -397233, -284567, 38226, -65089, -181242, -167237, 55275, 185358, -27479, -216588, -402864, -315769, -449683, -613096, -480699, -390284, -436091, -297195, 145039, 144805, -98909, -362296, -321526, -158527, -502813, -427920, -58269, -283153, -293445, -120615, -137820]
19998a37820l9662K9881K60263K6585m03882k5095J15290K2553j03248m0664K40361
19987e5438n0035p5055K65243O4288K97193k21555J8132j66189k65637P390M75759
19976B94096k50373p2529k96197L89291O56928M0532k06846l7701j42900m22712
19966d8411l51612k76135P4590j7834L08223R8348j13438j60716N5073J7563L9606
19955c74743J22283k5357j81358P7772J42676J36978k58756n8709J99242K53776
19945C3804J11623m6657n4311K21291j86251l41958j77869K47446K81550K49743
19935C38411J75354j37489l20048K16811n5801k63769L70517K6064k00745k45711
19925i6406k20978J15509K70769k6841M65584o6064k73930k44257P709N225J35448
$$ y = [-137820, -177482, -147601, 112662, 139247, -264635, -289730, -174440, -151887, -255135, -295799, -55438, -105473, -180528, 84715, 149003, 446196, 224641, 242773, 76584, -189053, -181663, 294096, 43723, -28806, -325003, 64288, 721216, 761748, 554902, 517201, 374301, -48411, -400023, -676158, -601568, -619402, -311179, -212831, -326269, -486985, -431912, -414349, -374743, -252460, -277817, -459175, -381403, -238727, -101749, -360505, -419214, -219972, 33804, 145427, 98770, 44459, 265750, 79499, -262459, -440328, -192882, 88668, 338411, 513765, 376276, 56228, 273039, 217238, -46531, 323986, 350050, 149305, -96406, -317384, -201875, 68894, 42053, 507637, 441573, 167643, -76614, -68905, -63680, 71768]
19914G1768K85673J81952J32477j21560m69012k43424j5l78119m45626M4094Q1395
19903h60397j36426J78061M7157K25345M0970k39044L05580J93307N40066L22888
19893F17507l10326k36471L40101J26015k85183j99748P6715k09183j00791J75248
19883f116k03671j64705j03448r545K11369K58110j03219j01714J0558J96952
19873a5429p3797k74537L7218J79880n38J02187j23011J40955J41802l13102j14148
19862c12520j3822K16306J09105M1209m47m03474n37331j32810K73369J08754
19852f51661M75896K14761R1892k29631j99899K66325O3839q3862j70104p5348
19842b97792K04433L1126K20207l8887J1172m7288M3374l5534J46162r6848L8862
$$ y = [71768, 357441, 539393, 671870, 550310, 81298, -162126, -162141, -540260, -985886, -941792, -860397, -996823, -818762, -771605, -546260, -505290, -744334, -438754, -245447, 294619, 617507, 307181, 70710, 410811, 536826, 251643, 51895, 128610, -80573, -181364, -6116, -209787, -374492, -477940, -487485, -276116, -18006, -121225, -222939, -212381, -15429, -89226, -363763, -326545, -146665, -147203, -45016, -168027, -27072, 114730, -198372, -312520, -326342, -110036, -931, 40278, 39831, -363643, -900974, -1033784, -760415, -651661, -175765, 38996, 130888, -98743, -298642, -32317, 31522, -52340, -222444, -297792, -93359, -62233, 157974, 119087, 130259, 82971, 126345, 90811, 236973, 140125, 178987]
19831A78987L12737j21233k74636K2891q5649L42478K92333j50829k09746j8216
19821B89117j00148k4370j3364J55119j8824J65607l34114j13388L2455M11745
19811D49835J24641j92693O3589k37651k55233j18290n8557K82980J99414m9329
19801B08706L16531Q1684j91353j90075L05290K61228j57000k06613j67830k72416
19791a1848j10249L9566K08499L60215N38725j64295l45610j33251L37949n1784
19781F67917k62681q9603k55990k31500N7792L91246J75851k40558k10164L2513
19771C4823J54393M0441m35046k201K98984K96943j02485q7121J91101N1429m34087
19760G174l06427j00908K92814M2858j3105K1267m5852j8648k99545M8895K66417
$$ y = [178987, 491724, 370491, 95855, 118746, 33097, 375575, 667908, 517079, 307333, 289117, 188969, 164599, 151235, 306354, 287530, 453137, 119023, 5635, 38090, 449835, 574476, 381783, 445372, 207721, -47512, -165802, -224359, 58621, 258035, 208706, 525237, 606921, 415568, 225493, 530783, 792011, 635011, 428398, 260568, -11848, -122097, -82531, 125968, 486183, 1024908, 860613, 515003, 381752, 719701, 667917, 405236, 315633, 59643, -171857, -114065, 277181, 453032, 212474, 2310, 34823, 189216, 229657, -205389, -207590, 91394, 388337, 285852, 198731, 389832, 441261, 7174, -299253, -400161, -107347, -64489, -77594, -56327, -102179, -120827, -420372, -371477, -105060]
19749a05060J28815K19549m5178j73610o2057L9299P9856K72772K95228J10478
19739G60092K57375L87377K69150K64545l56805n01933j87925j90171P530K01431
19729I10666J21994k85996l15532Q874j32486j36285O0730N3853r9733l85297
19719a99212k6094j01300j74938K9622L23861M26865k04975j19359M2509j57743
19709a60764J62325J16124J80329N7527l6487j89321n9440J55353l31197j98402
19699c03953J59986L09427J68055o1530J89629l69659J8943M60901O5218m37314
19689A99703m92359m9280j40262K69305M36763o2961N5197L4270k39207j43474
19679a32305l3117P3098j07812J99729M13543l71720l01642l68307J27607K18465
$$ y = [-105060, 23755, 243304, 198126, 24516, -37541, 1758, 81614, 354386, 649614, 760092, 1017467, 1404844, 1673994, 1938539, 1581734, 1079801, 891876, 701705, 709235, 910666, 1032660, 746664, 431132, 440006, 307520, 171235, 231965, 285818, 186085, -199212, -225306, -326606, -501544, -471922, -148061, 278804, 73829, -45530, -3021, -160764, 1561, 117685, 298014, 355541, 319054, 129733, 70293, 225646, -105551, -303953, -143967, 165460, 333515, 271985, 461614, 91955, 110898, 571799, 637017, 199703, -292656, -341936, -482198, -212893, 223870, 160909, 216106, 250376, 11169, -132305, -165422, -92324, -200136, -407, 413136, 41416, -260226, -628533, -500926, -282461]
19669b82461K46961L02862P6850k06862k05109k13063j4243J55885j44064j59562
19659d42806j38518l4122j31844J55056K25270N0274p6589k62119j43878O56729
19649a42547N39326j55738K0952k03442k47905K51520J8536l39795m4738J46118
19639a57713j27995K76594N19788k46239k67076j38985k46613m89K27743Q9743
19629g1242j06527J57580R1448K21754K86494j33550K487k75362j88358k70898
19619b86174j9964q9127R4041j07097J12016M1494J16932M4264n6122J53465K6534
19608C0262r28j17248J36851K38552j54739k87291j25754J24111J24152m28438
19598d60470m19113K29724L25082K04542K92168k98832l50656J12122J37890n0696
$$ y = [-282461, -35500, 267362, 344212, 137350, -67759, -280822, -295065, -139180, -283244, -442806, -581324, -615446, -747290, -592234, -366964, -316690, -393279, -655398, -799276, -142547, 396779, 241041, 261993, 58551, -189354, 62166, 80702, -259093, -303831, -157713, -285708, -9114, 510674, 264435, -2641, -141626, -388239, -388728, -160985, -71242, -177769, -20189, 71259, 293013, 579507, 445957, 448444, 173082, -15276, -286174, -306138, -395265, -301224, -408321, -296305, -254811, -137879, -93615, -149737, 3728, 30262, 29334, -87914, 48937, 287489, 132750, -154541, -280295, -156184, -32032, -460470, -879583, -649859, -324777, -120235, 171933, -126899, -477555, -365433, -227543, -278239]
19588b78239p0707k2023P9266J18703k29015J0304K90233J14438M5863j16654
19578e7831K16627m3008k71288J55940P5844k64475m8267m90277n0411M30204
19568c46942L46854K94251J00259r8391j08212r2151J12057k94197m24548K10022
19558c00998N81337L36758L3621j1686l21693q553j39575j98657o9681K39993
19548A40866M36333J66386n59167o3415o4276o2745l8509j19166j7916O1220K05642
19537H5253j56089O2941Q8573L14291j0294q8428j25457j40666l32827o8320M33237
19526F2214j29573j71513Q4824J06408K6846J71211j54723l8145J1679J17435
19516H6663K41402Q4458J13870k34519p39153j79889J44421m657N3622K88400
$$ y = [-278239, -348946, -370969, -291703, -173000, -402015, -391711, -101478, 12960, 58823, -57831, 158796, 115788, -155500, 440, 76284, -188191, -236458, -726735, -777146, -346942, -88, 294163, 394422, 296031, 187819, 95668, 207725, -86472, -511020, -300998, 280339, 617097, 650718, 639032, 317339, 308786, 169211, -29446, -99127, 140866, 577199, 743585, 184418, 121003, 56727, -6018, -44527, -163693, -181609, -120389, 85253, -70836, -7895, 80678, 394969, 384675, 296247, 170790, 30124, -302703, -371023, 62214, -67359, -238872, -154048, -47640, -20794, 150417, -4306, -42451, -30772, 86663, 328065, 412523, 526393, 291874, -447279, -627168, -482747, -487404, -433782, -145382]
19506a45382K66430O0481Q0570n5286K66319k16701m59059M7675L26985j49965
19496B2067K16938j28655m11035M39954L95547L74322m12102n08387k72907Q4585
19486a99673J46377L16200J72898m26422k2352J34983J88902K06163l11938j84563
19476B0575L5153o2951p1529o5150k984k9372P2281j03978k30105K65391J64199
19465h470J60507j73878o859M4850J93289p1755n3355m3089j10261l12769K21747
19454a60043K19845P2515K8385L2438Q6255k93185l92182j41288K20389Q17916
19444D91045j7971l46838J74269m0595k14162n42733N5073K86276K00215l2398
19434A2181q0986Q8839J20756J03116l77960J17432K03890M694j21131M8162K16785
$$ y = [-145382, 121048, 181529, 262099, 206813, 473132, 256431, -202628, -154953, 172032, 22067, 239005, 110350, -300685, 139269, 534816, 909138, 497036, -11351, -284258, -199673, -53296, 262904, 435802, 9380, -12972, 122011, 310913, 517076, 205138, 20575, 55728, -7223, -78752, -143902, -146886, -176258, -103977, -207955, -438060, -172669, -8470, 152037, -21841, -28700, 16150, 209439, 137684, 84329, 41240, -69021, -381790, -160043, 59802, 132317, 160702, 193140, 279395, -13790, -405972, -547260, -326871, 491045, 473074, 126236, 300505, 259910, 45748, -496985, -441912, -155636, 44579, 12181, -68805, 20034, 140790, 243906, -134054, -16622, 187268, 191962, 70831, 118993, 335778]
19423C35778O3460q4018n27429j90451J87189J92021K35249J40781j17577K5703
19413B60706n2536k22932n9224Q2822j91714J78742J65006k41162l90115m40523
19403i10930M12820K68073L13761L15562K96713o5925j81025k69578r0419j49108
19393f0056l51987J27140P5644K17067P4689L5140M19195L22811q634l60475m17867
19382G2667n4039K16088j54535k02861K72936J98089J60277J57905K05327l01127
19372E70727j18802l67269P0142K16395j48075K987P5414M3356j26044O8396N1243
19361C38470K68003k1178m29665n34031J9756m0114N40411J07809m8185o0432
19351A40844j74925j50028K15022L38359l21593M9379P4963M3874N013m0804L156
$$ y = [335778, 399238, 315220, -212209, -402660, -215471, -23450, 211799, 352580, 235003, 260706, 208170, -14762, -73986, 8836, -182878, -4136, 160870, -80292, -470407, -910930, -498110, -230037, 83724, 399286, 695999, 630074, 449049, 179471, 89052, -60056, -412043, -284903, -209259, 7808, 82497, 117637, 536832, 859643, 851009, 490534, 72667, 18628, 234716, 80181, -122680, 150256, 348345, 508622, 666527, 871854, 570727, 451925, 84656, 154798, 371193, 223118, 226105, 301519, 344875, 218831, 287227, 338470, 606473, 585295, 155630, -378401, -358645, -398759, 141652, 249461, 201276, 140844, -34081, -184109, 30913, 369272, 47679, 97058, 172021, 215895, 220908, 180104, 183260]
19340A83260j16714j8570J79866k41440M9805o8881j56002K5119J11378J93426
19330A41247j31510J30220k027Q7028J00407k6784J056J79886L5520j55836j10968
19319B48239k16115j53539k56631o1269O4440J47144l7100K5479K59628m3763
19309b3487j79609L49231J33941k43519k00169k8644O9123j47641J53764K63485
19299A46475J70608l1706Q5191O6855l11383k69323M55158L09936k13798r1332
19289C16681J0736k27106j36715q9356J80478L07136K76161l9083q7843k38867
19279B72222O2283p2542K62052K8715k04788j51206P8283Q9592j68164l67089
19269a70642o3724K28026M58277j93155k63048k85043j97997l77262Q1845O30096
$$ y = [183260, 66546, 47976, 227842, -13598, 36207, -32674, -188676, -163557, -52179, 141247, 9737, 139957, 137930, 224958, 325365, 298581, 299637, 479523, 515043, 359207, 248239, 32124, -121415, -378046, -439315, -374875, -227731, -264831, -239352, 20276, -23487, -203096, 146135, 280076, 36557, -163612, -192256, -123133, -270774, -117010, 146475, 317083, 285377, 370568, 437423, 126040, -143283, 311875, 621811, 408013, 316681, 327417, 100311, -36404, -125760, 54718, 361854, 638015, 598932, 511089, 272222, 334505, 261963, 524015, 552730, 347942, 196736, 275019, 364611, 196447, -170642, -234366, -6340, 451937, 258782, -4266, -289309, -487306, -864568, -782723, -152627]
19259a52627L5575L2495j11468L09328J27899N1609K59817P5948l05758j83383
19249A39435j05069j72423J61338M5919J41947l4338p7998J08512k10421k55863
19239b58961j25212K15231j31277j40091K46093M84980R1530l0203J6840l4406
19229C34524o5993J03182k20573J78033j44552N3368J69887j01558k584Q4364
19219C88098j20687r3011K36196R0159j82082p6410j28615J45089J15266N7341
19209D31344j98229n8814k73833L4217J58401Q5413K66116O1072n2199k11007
19199B42481L0265J87714N95348m871o64054l29016k17384J30562K90119j61730
19189I9434J20028P5061j4320P8072n4439k87951k43098j08267m4102m77L32582
$$ y = [-152627, -117052, -84557, -196025, 113303, 241202, 292811, 552628, 628576, 322818, 139435, 34366, -138057, 23281, 69200, 211147, 176809, 98811, 207323, -3098, -258961, -384173, -168942, -300219, -440310, -194217, 290763, 382293, 352090, 368930, 334524, 268531, 371713, 151140, 329173, 184621, 237989, 407876, 306318, 303734, 388098, 267411, 174400, 410596, 500755, 318673, 242263, 113648, 258737, 374003, 431344, 233115, 174301, -99532, -65315, 93086, 178499, 444615, 505687, 453488, 242481, 272746, 460460, 1055808, 1050937, 386883, 57867, -159517, -28955, 261164, 99434, 219462, 294523, 280203, 358275, 303836, 15885, -227213, -335480, -379582, -380059, -47477]
19178d7477K44724P1242j57740K52044j6534l85758q7362j12213j24623J01635
19168b62062P00610L22151m4592l14533j81860j68206J61924J72271k15641l980
19158A66082k2021j89975k06049J66104L14226J49098K08267k02144m74239l8760
19148a29411M82509N4620n99008l6797R7809M39026l9277J7835O9332M34567J88458
19137I79663J22590J26880R6873m33828j88036L5391q042j54583j58452N79147
19127I97603L38244l83033l70738M5999J91696K61306J07086K74404k07743l29006
19117I25818j11793p8054j1410p9397K88136K02796J58628m06067j70176m5412
19107F73069K44297J01236j64182N8357o15L5637l08630K03039R5769j80239J05266
$$ y = [-47477, 197247, 268489, 110749, 362793, 346259, -39499, -126861, -239074, -363697, -262062, 438548, 760699, 716107, 401574, 219714, 51508, 213432, 385703, 170062, 166082, 144061, -45914, -251963, -85859, 228367, 377465, 585732, 383588, -90651, -129411, 353098, 407718, -191290, -228087, -130278, 308748, 269471, 287306, 356638, 791205, 979663, 1102253, 1229133, 1326006, 892178, 704142, 739533, 731491, 576908, 418456, 997603, 1335847, 952814, 582076, 628075, 819771, 1081077, 1188163, 1462567, 1254824, 925818, 814025, 735971, 724561, 645164, 933300, 1136096, 1294724, 888657, 718481, 673069, 917366, 1018602, 854420, 912777, 912162, 947799, 639169, 842208, 937977, 757738, 863004]
19096H63004J12875o5369J44042J6176L4635k71492k916J85626j18497J977K89143
19085A189204j24387j61096k34307M0784N60503L90945M9053n7905k20163j46473
19075A286158K44082N17342K18105l36237l36051j36695l91564n1067N01036L37399
19065A852508k61880q9300J27361L01938j18054l6460P4419L91986K65042J86550
19055B694110O19174J63131j69633K07439m4508j92405k66634J29205k1256M35579
19045C554202M28298L92244K16243M51984L30254K61351K50780K06957j66230
19036E926083j08242P3214M48017O03642P31026R72263J517146J310941J618021
19027A3092111K008832K503548L199495M187654N040138P157498J0933433J6587706
$$ y = [863004, 975879, 910510, 1054552, 1070728, 1105363, 833871, 830955, 1016581, 898084, 900061, 1189204, 1064817, 903721, 669414, 710198, 1270701, 1661646, 1710699, 1652794, 1432631, 1286158, 1530240, 2047582, 2265687, 1929450, 1593399, 1456704, 1065140, 1014073, 1515109, 1852508, 1590628, 1501328, 1628689, 1930627, 1812573, 1776113, 1850532, 2242518, 2507560, 2694110, 3313284, 3476415, 3306782, 3514221, 3469713, 3277308, 3010674, 3139879, 3118623, 3554202, 3982500, 4374744, 4590987, 5042971, 5373225, 5634576, 5885356, 6092313, 5926083, 5817841, 5891055, 6339072, 6942714, 7673740, 8646003, 10163149, 11474090, 13092111, 15100943, 17604491, 20803986, 24991640, 30031778, 37189276, 48122709, 64710415]
19019F4710415K5174575L6192172M5522849M5915889L5033228J1298352j5235030
19012B48612450l3901196m4559494m1673464l0437643k0023034j3475842r501903
19005E5039874o994565m795127l203451k454100k495830k328495k203363k122273
18997B8442670j943213j310191j003415j052217o17172p30772o82778l51930p55691
18988A9995291j052700n30875j043643j093075o72217m19453l77170k98392m27572
18979A4080194m01738n71386n18475n31766o52123J15687K09295k38880l77490
18970A1113318o04695o08966j58242l83097l86543m87406p4837j14513l81316
18961G913703l54463J61120Q2989j46832k95292l05502n96392P3660K78309m0791
$$ y = [64710415, 89884990, 126077162, 171600011, 217515900, 252549128, 263847480, 248612450, 214711254, 170151760, 128478296, 98040653, 78017619, 64541777, 55039874, 48045309, 43250182, 40046731, 37592631, 35096801, 32768306, 30564943, 28442670, 26499457, 25189266, 24185851, 23133634, 22516462, 21785690, 21102912, 20750982, 19995291, 18942591, 18411716, 17368073, 16274998, 15602781, 15183328, 14806158, 14507766, 14080194, 13678456, 13107070, 12588595, 12056829, 11404706, 11520393, 11729688, 11490808, 11113318, 10508623, 9899657, 9741415, 9358318, 8971775, 8484369, 8409532, 8295019, 7913703, 7559240, 7720360, 7803349, 7656517, 7361225, 7055723, 6459331, 6532991, 6811300, 6770509]
18951F770509o23979P9896q3316n52051m22033q2193q1988M2267l18840J0306
18941D738578L11433J20213j18741k32372q1867k40258p8308k79359n6858M9653
18931D132114k08650k85105p010m9706l82569l47757r4304J82323M1645k97962
18921B683019J81517M05600K89674k72702q1838k080n02718m25071j59614k51051
18911A864736J83747L59881N9975l2144j92191J23683k73351m05155k44733l6772
18901A407676K30189K43362j93809k30942n9830O4185K35044K91748j98912n78342
18891A210369m3208m5110M02695J07522J66503k21230R9477J26830N9383J90019
18881B053250j67040l99780m56362j69630L26061K71153J65188L91712q1038l14417
$$ y = [6770509, 6146530, 6226426, 6143110, 5591059, 5169026, 5086833, 5004845, 5047112, 4728272, 4738578, 5050011, 5170224, 5051483, 4819111, 4737244, 4496986, 4418678, 4139319, 4082461, 4132114, 3923464, 3638359, 3631349, 3581643, 3199074, 2851317, 2757013, 2939336, 2980981, 2683019, 2864536, 3270136, 3559810, 3287108, 3205270, 3203190, 2700472, 2275401, 2115787, 1864736, 2048483, 2408364, 2468339, 2436195, 2244004, 2367687, 2094336, 1689181, 1444448, 1407676, 1637865, 1881227, 1687418, 1456476, 1396646, 1460831, 1695875, 1987623, 1788711, 1210369, 1167161, 1122051, 1524746, 1632268, 1798771, 1577541, 1677018, 1803848, 1863231, 2053250, 1886210, 1486430, 1030068, 860438, 1186499, 1457652, 1622840, 2014552, 1933514, 1619097]
18871A619097l11236o86272P7187K33553L42980L23991k20829k14634l5002o3439
18861A065396q1939Q2591j18801j23636k78315j01261L14071J05587r2188l1682
18851G39823j49208j96272J298J50597J37226l20996k63968K2194J47944k1812
18841B46826j53089k47095J34884K80144K96058L68075Q4779m12892n0106J86626
18831G34210j13388k71900K04214J11521L76652k93392m15947j87449K15913K31912
18821E92346N42169P069J55522O2309k35602q9173j79381J68710J04156n74011
18811E54114m93820p2962j8746Q2533M48878O3896j28870Q3380j99373K8767J40160
18800D87957K7164k20764j36430k8408k33054K15316J66536Q778j9827r8473J50640
$$ y = [1619097, 1307861, 621589, 698776, 932329, 1275309, 1599300, 1378471, 1163837, 1128835, 1065396, 983457, 1066048, 947247, 823611, 545296, 444035, 758106, 863693, 771505, 739823, 590615, 394343, 395641, 546238, 683464, 362468, 98500, 120694, 268638, 246826, 93737, -153358, -18474, 261670, 557728, 925803, 1010582, 597690, 547584, 734210, 620822, 348922, 553136, 664657, 1041309, 747917, 331970, 144521, 360434, 592346, 1134515, 1141584, 1297106, 1359415, 1123813, 1034640, 855259, 1023969, 1128125, 554114, 60294, -12668, -31414, 51119, 499997, 563893, 435023, 518403, 319030, 347797, 487957, 515121, 294357, 157927, 129519, -103535, 111781, 278317, 287095, 267268, 168795, 319435]
18789C19435j04899k32734j09030L05426J79209r8209k86171l13129J11894N32763
18779C04555K80063q8250J51913o1826j83136k3262O5864J66599J48538K9849
18769G90907P2559M96714R77360N04925l01046j030594r00995K69388L09490l46410
18759H42298m82653k67364N5014L00880j21812j70987K46059j23720j43190J54956
18749B89481N35018j4029k51414p6854l3329j31456J78775N8182j11042N3758
18739D97090r2105J4144J66054J36720k43252P1409k8278j62439M1255L4580M9910
18728D85088K01044j2081L5231K89016j86310J50683k9800m18133K2333J90243
18718G27314k78735n6890r7134j26885L61308J53434o48k54072k55770m65131
$$ y = [319435, 214536, -18198, -127228, 178198, 357407, 259198, -26973, -340102, -228208, 304555, 584618, 496368, 648281, 586455, 403319, 380057, 445921, 612520, 761058, 790907, 863466, 1360180, 2337540, 2842465, 2541419, 1510825, 609830, 879218, 1188708, 842298, 359645, 92281, 147295, 448175, 326363, 155376, 401435, 277715, 134525, 289481, 824499, 810470, 559056, 482202, 448873, 317417, 496192, 554374, 443332, 497090, 404985, 419129, 585183, 721903, 478651, 550060, 521782, 359343, 400598, 435178, 485088, 686132, 674051, 709282, 998298, 811988, 962671, 932871, 514738, 537071, 727314, 448579, 391689, 294555, 167670, 528978, 682412, 681764, 427692, 171922, -293209]
18708b93209l19465J59187J92064n8411M42232L91674K06930j63086j03811k06869
18698B47236k44781j7242k49546J12309J85474j01934J67110K03862j6818j19786
18688A65884J69855n8195j15542J32082m89985j99386L18875J87699M477J17018
18678B32782J17432m51216q9346K44525J64813j53132M473n0336J96822o1030
18668A55787k6861J00498l71273j30499j62392J26521j0373J09327L46818J62163
18658B99716P1175k24353l62476R6351N21958k09022k46649L30860K07928l29294
18648A56194k11036P7033q9683j35350K67978K72164J99236K39501K52561l63412
18638F65186l24331j41210k09722K84383J54663L25352J6683n3327j48328P7130
$$ y = [-293209, -612674, -453487, -261423, -319834, 122398, 514072, 721002, 557916, 454105, 247236, 2455, -14787, -264333, -152024, 33450, -68484, 98626, 302488, 285670, 165884, 335739, 277544, 162002, 294084, -195901, -395287, -76412, 111287, 115764, 232782, 350214, -101002, -190348, 54177, 218990, 65858, 70331, 19995, 216817, 155787, 128926, 229424, -141849, -272348, -434740, -308219, -318592, -209265, 137553, 299716, 370891, 146538, -215938, -119587, 402371, 193349, -53300, 277560, 485488, 156194, -54842, 22191, -67492, -202842, 65136, 337300, 536536, 776037, 1028598, 665186, 340855, 199645, -10077, 274306, 428969, 754321, 771004, 717677, 569349, 646479]
18628F46479l16660o0276K97338L98361J1245j6409l24935k25992N3185M14125
18618H76461R6895r2100j81974j18832k2928J66689J84776q6286m52672n39965
18608a69936l4119K56147j33362O9494j55031K23427J0584j41706J32568L19044
18598C77110L36366M8306k64286l60475k50055J77349n0053P0780J01320K42558
18588D28920J12915j53286p2896L63891M1219J71275k9774q2261j92826n9992
18578E27185L2219k7250j59303N7998k9930J72822j49468q952L1995J95105K78124
18567I20545J0025o5707K53377j38482k72606J18107J41080L64029L96098K45706
18557A972172J76808L48854l43658k85902j62526L71980k63588k59211l58826
$$ y = [646479, 329819, 269543, 566881, 965242, 976487, 960078, 635143, 409151, 462336, 876461, 973356, 881256, 699282, 580450, 557522, 724211, 908987, 822701, 370029, -169936, -204055, 52092, -81270, -11776, -166807, 56620, 67204, -74502, 58066, 377110, 713476, 761782, 497496, 137021, -113034, 64315, 14262, 85042, 186362, 428920, 541835, 388549, 315653, 679544, 720763, 892038, 862264, 780003, 587177, 527185, 559404, 532154, 372851, 430849, 400919, 573741, 424273, 415321, 447316, 642421, 920545, 930570, 864863, 1118240, 979758, 707152, 825259, 966339, 1330368, 1726466, 1972172, 2148980, 2497834, 2154176, 1868274, 1705748, 2077728, 1814140, 1554929, 1196103]
18548A196103J62511r8128j61481M035K1794O988k23100J73479J27190M3483K23218
18537A476092L09819j21936o05623m10349k32058J13098K90720J75379j79243
18528H15899l35460j69593r4061K61467J90174J2975L5734J83566L26191l36344
18518H90548p8649j7054J44196N90587O87958p167k28537j54386J08168j76397
18508A759267l0803k93103l18607j05070n7186L0055N9882J53129J04240J05470
18498A407274j69581J99075j01123o8526m4970M94723K9267n08271k2036K14608
18488A430440J97789j32826K48153l8603j9557J12150J48721L05042M5861L40791
18478B637961P1369K50541M39623N25856O49534O20658J20661j05748K94384N61024
$$ y = [1196103, 1358614, 1260486, 1099005, 1103040, 1124834, 1131822, 908722, 1082201, 1209391, 1252874, 1476092, 1785911, 1663975, 1058352, 648003, 415945, 529043, 819763, 995142, 815899, 480439, 310846, 216785, 478252, 668426, 681401, 717135, 900701, 1226892, 890548, 811899, 794845, 939041, 1529628, 2217586, 2210419, 1981882, 1827496, 1935664, 1759267, 1728464, 1435361, 1116754, 1011684, 954498, 984553, 1044435, 1197564, 1301804, 1407274, 1237693, 1436768, 1335645, 1267119, 1222149, 1716872, 1746139, 1237868, 1215832, 1430440, 1628229, 1495403, 1743556, 1704953, 1685396, 1797546, 1946267, 2251309, 2297170, 2637961, 2709330, 2959871, 3399494, 3925350, 4574884, 5195542, 5316203, 5210455, 5504839, 6065863]
18468F065863P33080J348928J402925K399011L256206L724214L589556J817835
18460B4337618l86369k123956k480510j390297o8181J109176K340085L972273
18452B5309839O209069R558819J4652463K2238392L1251662L6601983L2534545
18445A78356772J7893738j866932j7757465k4688417k4577245k1846644j8134739
18438H7379068j3263775p676532j800990K981578N636023O194812K456486l268085
18430G8638585q614577j0790213j0076860p099519m924835l346992k380531k282509
18422B9122549j085144m25318r8739m99915l90l61838m36023o35335o04313k11127
18412B4764407L42426J315675K058274K890027M616167P390460R688453J0849006
$$ y = [6065863, 6798943, 8147871, 9550796, 11949807, 15206013, 18930227, 22519783, 24337618, 23951249, 21827293, 19346783, 17956486, 17888305, 18997481, 21337566, 25309839, 31518908, 41077727, 55730190, 77968582, 109220244, 145822227, 178356772, 196250510, 194383578, 176626113, 151937696, 127360451, 105513807, 87379068, 74115293, 66438761, 64637771, 67619349, 73255372, 79450184, 81906670, 78638585, 70024008, 59233795, 49156935, 42057416, 37132581, 33785589, 31405058, 29122549, 28037405, 27612087, 27513348, 27013433, 27013043, 26651205, 26215182, 25579847, 24975534, 24764407, 25106833, 26422508, 28480782, 31370809, 35986976, 43377436, 53065889, 63914895]
18404F3914895R440236M481018j747182n844890o064200k823669J640331P648120
18396G0644659J4304239K0452987K6003404K9825904L0633073K5283826J1192657
18389B28340749j0561794l0043699l8656110l4911871k5084635j6415799j0770581
18382F1896260p195272m690455k929598k137530k08041J505509J808347J697197
18374D9746417J9254k041967l977673m792561m371275l131986k443534j757084
18366B7249591j376574r92278q38123o40309r12316p55288p57652q79470j433836
18357A8663745j141838q39941n15046k66578m85540l35500m04388o42482j20536
18348A3911896o55333o97480m02168m26075n82543m03997j08774q3022k23155
$$ y = [63914895, 73355131, 77836149, 76088967, 70244077, 64179877, 61356208, 62996539, 70644659, 84948898, 105401885, 131405289, 161231193, 191864266, 217148092, 228340749, 217778955, 187735256, 149079146, 114167275, 89082640, 72666841, 61896260, 54700988, 50010533, 47080935, 44943405, 44735364, 46240873, 48049220, 49746417, 49765671, 47723704, 43746031, 38953470, 34582195, 31450209, 29006675, 27249591, 25873017, 24880739, 24042616, 23402307, 22489991, 21734703, 20977051, 20097581, 18663745, 17521907, 16681966, 16166920, 15900342, 15414802, 15079302, 14674914, 14032432, 13911896, 13256563, 12559083, 12156915, 11730840, 11148297, 10744300, 10635526, 10552504, 10329349]
18339A0329349r7985j62272m96108k86918l02800k41335j48738n39212l82044
18330G671937k32998m58030J47980o429l55612j68988m9617n5665j75830j43851
18320F172897J08522j6241n13245k65045K70187K74206j65747n28226o5074M2238
18310E314472o05844o24173k82298j6716m544Q2400j1618j64735l6461k60209
18300C390274m90372j74495M29527K86708J99864J10791m12541l97001j63058
18291B779697M8407M3404M5942J92257K01945m7430j65757L36814J76203j88530
18281C422952M2165k58331k23537o2855j8461l47693j32418l636k9292R8111j48389
18270B338616K55989j12843m93912n788k86207k24411L9582q4303j72365k21051
$$ y = [10329349, 10231364, 10069092, 9572984, 9286066, 8983266, 8741931, 8593193, 8053981, 7671937, 7438939, 6980909, 7128889, 7122460, 6766848, 6597860, 6548243, 6492578, 6316748, 6172897, 6281419, 6265178, 5751933, 5486888, 5757075, 6031281, 5865534, 5337308, 5272234, 5314472, 4708628, 4084455, 3802157, 3785441, 3780897, 3863297, 3851679, 3686944, 3650483, 3390274, 2899902, 2725407, 3154934, 3441642, 3641506, 3752297, 3339756, 2942755, 2779697, 2828104, 2871508, 2917450, 3109707, 3311652, 3264222, 3098465, 3435279, 3611482, 3422952, 3465117, 3206786, 2983249, 2920394, 2901933, 2554240, 2421822, 2418186, 2388894, 2487005, 2338616, 2594605, 2481762, 1987850, 1982062, 1695855, 1471444, 1511026, 1426723, 1254358, 1033307]
18260A033307M6097M47610j38576p9433K65957n9901J14504J07732K21189p4371
18250A884115L4017o7836j02853o53353j49826k45641j10271L912k5613K28215
18240G94866K95998j04979k51362k54308l88437K94509P17142K73831k41986q0202
18230A055072N3320Q4157P9987m61671J6764o586O9152k30468j39K09581K58001
18219A127170O5131J9784m9371P7395l22154r8345K36414N9029J03168k93658
18209I24563k35310K07754L93029R1905p8543Q1746m1181k8040j53431Q8449j20037
18198A130904l49583j13799L11343J49853Q8224O535J96872o3620l08149K85312
18188A333892R2313j83052j36188K73943L5733k89221k97886L1307k54504j59209
$$ y = [1033307, 1079404, 1527014, 1388438, 1309005, 1574962, 1515061, 1629565, 1737297, 1958486, 1884115, 1918132, 1850296, 1747443, 1094090, 944264, 698623, 588352, 592264, 566651, 794866, 1090864, 985885, 734523, 480215, 91778, 386287, 1103429, 1377260, 1135274, 1055072, 1108392, 1192549, 1272536, 810865, 827629, 821043, 890195, 659727, 659588, 869169, 1127170, 1192301, 1212085, 1162714, 1240109, 917955, 819610, 1056024, 1115053, 1218221, 924563, 689253, 897007, 1290036, 1381941, 1303398, 1385144, 1343963, 1315923, 1162492, 1250941, 1130904, 781321, 667522, 978865, 1128718, 1216942, 1223477, 1420349, 1356729, 1048580, 1333892, 1426205, 1243153, 1106965, 1380908, 1416641, 1127420, 829534, 860841, 606337, 447128]
18178D47128K10710p1354k16124j09849N08954O15346K62143L22j15955j50686
18168A380635j18831K74939L42350j30625k94050k10500J64824l3054k51533l4005
18158A090150k6529J0382K51857K04809L7110l4756k22641j49159K1877M105K43596
18147A430801J15034K13484J69609p0082p1905J59633n4894L57373M29763J19049
18137B797865j29595K96292M13325K90915M8119M03210L86700J21869k12905M24740
18127D840535L73541j73039P47758J082484P17816J198018J438099K086596K145003
18118A4456811L064047M270368N471843P764324J1994841J8881671L3688926O2861510
18110A62454341R9756042R8357383M5741316k7437621j15718350r6472193n0975771
$$ y = [447128, 657838, 586484, 370360, 260511, 769465, 1384811, 1646954, 1647276, 1531321, 1380635, 1261804, 1536743, 1879093, 1748468, 1454418, 1243918, 1408742, 1375688, 1124155, 1090150, 1063621, 1074003, 1325860, 1530669, 1567779, 1533023, 1310382, 1161223, 1183100, 1187205, 1430801, 1545835, 1759319, 1928928, 1858846, 1786941, 1946574, 1891680, 2249053, 2678816, 2797865, 2668270, 2964562, 3377887, 3668802, 3716921, 4120131, 4506831, 4628700, 4415795, 4840535, 5214076, 5041037, 5788795, 6871279, 7589095, 8787113, 10225212, 12311808, 14456811, 17520858, 21791226, 27263069, 35027393, 47022234, 65903905, 99592831, 162454341, 262210383, 360567766, 406309082, 378871461, 263153111, 166680918, 115705147]
18103A15705147k7761097j6409089j0916716p757782o207433m788389l417294
18096C8447347k867935k259869j582575j645621j426305j750625j425943j125928
18088B4362546j071487p99908o07956q46400m62622p18645j158555p63573o04248
18079A7329152n40716m19587r24777m45583k34688l38672r9850m16739p1270m37873
18069A3399397r76329p10846j52041l6615k37891o43063k36110j95211l53645
18060I857646j71692J39502m24520l07468N4487k48083n4392k42210m68833k31618
18050G902819k53990l76113k34208J48865j21125n32211n86507m9446K54693K51407
18040F404184k20539j019979n22398K96447K18119J07580K5780q9791l94144j94184
$$ y = [115705147, 87944050, 71534961, 60618245, 52860463, 46653030, 41864641, 38447347, 35579412, 33319543, 31736968, 30091347, 28665042, 26914417, 25488474, 24362546, 23291059, 22491151, 21883195, 21036795, 20574173, 19855528, 18696973, 17933400, 17329152, 16788436, 16368849, 15444072, 14998489, 14763801, 14425129, 14325279, 13908540, 13837270, 13399397, 12423068, 11712222, 11560181, 11523566, 11285675, 10642612, 10406502, 10211291, 9857646, 9685954, 9825456, 9400936, 9093468, 9147955, 8899872, 8845480, 8603270, 8134437, 7902819, 7648829, 7272716, 7038508, 7187373, 7066248, 6534037, 5947530, 5898084, 6152777, 6404184, 6183645, 5163666, 4641268, 4937715, 5155834, 5263414, 5289194, 5199403, 4805259, 4611075]
18030D611075j17899j04360j73295o5623j1063L3818p8298l30555k57170L6347
18020C542977l5832j41172J86056J97249N5857K405j01964Q46m00346p0692K63958
18009C499342K17961q4145m91582m00937R8072K04825L73840L41301M56855J33433
17999D348965j00647J83391k62317l44353j85282k25188n53930l06913k78525
17990B275201l00690L44303K41775M2660k4801M90429M97074M63298N48078M95614
17980E072941M37675j26898k95994k44982J66396K38268J49743k65443q6917J02322
17970E147111K98788N8164J45615M66100J89000J06332N62459P88494P95951Q09117
17960I367131J528119K016920K676158L280917M167303N912991Q491302J2569535
$$ y = [4611075, 4493176, 4388816, 4215521, 4149898, 4138835, 4172653, 4094355, 3763800, 3506630, 3542977, 3507145, 3365973, 3552029, 3749278, 3805135, 3807540, 3705576, 3706422, 3306076, 3235384, 3499342, 3717303, 3633158, 3141576, 2740639, 2838711, 3043536, 3417376, 3758677, 4215532, 4348965, 4248318, 4431709, 4169392, 3825039, 3639757, 3414569, 2860639, 2553726, 2275201, 1974511, 2318814, 2560589, 2603249, 2578448, 3068877, 3565951, 4029249, 4577327, 5072941, 5510616, 5383718, 5087724, 4842742, 5009138, 5247406, 5397149, 5131706, 5044789, 5147111, 5445899, 5504063, 5649678, 6115778, 6304778, 6411110, 6973569, 7762063, 8558014, 9367131, 10895250, 12912170, 15588328, 18869245, 23036548, 28949539, 37440841, 50010376]
17952E0010376K0137409L1254935M3575514N0452366M6503856K9349746K491177
17945B73775379k3835599m1331118m7119762m1337048k9409234j8414782j2009831
17938F0318005q477780n931760m594566l416880k711697k338975j914741j798501
17930B9133105j823672j354098j423969j240901j157068j011850r97945q75983
17922A9247619p33565m40529n54066l68625k88267l61384j69113k38092K5210
17913A6119188j63758p70222n58288n05450j52394q14763p79511p31618k31992
17904A1411192j49248m6949r3841n07912l49396k64977p5501j37785m22366j82014
17894I181203j03560j45768L58537N36022J08401m55297q39216p57873o08678
$$ y = [50010376, 70147785, 101402720, 144978234, 195430600, 241934456, 271284202, 273775379, 249939780, 208608662, 161488900, 120151852, 90742618, 72327836, 60318005, 51840225, 45908465, 41313899, 37897019, 35185322, 32846347, 30931606, 29133105, 27309433, 25955335, 24531366, 23290465, 22133397, 21121547, 20123602, 19247619, 18514054, 18073525, 17519459, 17150834, 16862567, 16501183, 16332070, 16093978, 16119188, 15955430, 15185208, 14626920, 14121470, 13969076, 13154313, 12374802, 11643184, 11411192, 11261944, 11214995, 11121154, 10613242, 10263846, 9998869, 9923368, 9785583, 9363217, 9181203, 9077643, 8931875, 9290412, 9826434, 9934835, 9479538, 8640322, 7882449, 7273771]
17885G273771k53162l88863m29857J46177L34222J39346J92759l26196n32096
17876F156101p0058m27792k43909l7193j29482M1103O4915l32036j57562K9613
17866D893700k63166m69870m9685l769j23442k24401q5726J28749k2859l29232
17856C450299l40391j29960J41958K10353j53947o29982k5992L61190l621Q3513
17846B963420l27824r8079J20367k37701j18328k87974L347L7415K22392q4475
17836B192560o12941K53625R5844j24582k1578K74186K44972M4745J3261k19813
17826B140279j03657k47817m53228M7207L6069L68049M1360n3207n1515j36731
17816A586809j58282l73782J99432K79660K34962p8171j29310J19597j00720j57963
$$ y = [7273771, 7020609, 6631746, 6201889, 6348066, 6682288, 6821634, 7014393, 6688197, 6156101, 6086043, 5658251, 5414342, 5377149, 5247667, 5288770, 5353685, 5021649, 4864087, 4893700, 4630534, 4160664, 4110979, 4107210, 3983768, 3759367, 3673641, 3802390, 3779531, 3450299, 3109908, 2979948, 3121906, 3332259, 3178312, 2548330, 2522338, 2883528, 2879907, 2963420, 2635596, 2537517, 2657884, 2420183, 2301855, 2013881, 2017228, 2054643, 2277035, 2192560, 1579619, 1833244, 1929088, 1804506, 1782928, 2057114, 2302086, 2346831, 2360092, 2140279, 2036622, 1788805, 1335577, 1382784, 1418853, 1786902, 1828262, 1775055, 1723540, 1586809, 1428527, 1054745, 1254177, 1533837, 1768799, 1690628, 1561318, 1680915, 1580195, 1422232]
17806A422232K33569M885k3080l33723N1483K44969k58105n60652k33802K05065
17796G52841L28177J40632M2282j54811m22065o9953K77004J19784j7096L17315
17786A314110l06k51905j40140j43650K07600J36934K4862j35627Q8667L4640
17776A135185n96957j71020j00641K39341K83302M40578r7058m50701m58156j2547
17766B11326L28143N2784j62900l9039N1681q1251O403N176J30734J43562Q1888
17755G28507r2793J8810O0510J41164m5598m2804n0359l64820K16980L98859L47861
17744A316317j86826k07952J63413j30556O5702l43104k84310K86698k55115m59230
17734c4963K8776J37271Q9036k49525K87208Q6107j76224K17250O87115j308k08192
$$ y = [1422232, 1655801, 1660686, 1637606, 1303883, 1355366, 1600335, 1342230, 781578, 547776, 752841, 1081018, 1221650, 1263932, 1109121, 687056, 617103, 894107, 1013891, 996795, 1314110, 1313804, 1061899, 921759, 778109, 985709, 1122643, 1147505, 1011878, 1100545, 1135185, 538228, 367208, 266567, 505908, 789210, 1229788, 1132730, 682029, 223873, 211326, 539469, 592253, 429353, 390314, 441995, 360744, 367147, 372323, 503057, 646619, 728507, 635714, 654524, 715034, 856198, 810600, 767796, 717437, 352617, 569597, 968456, 1316317, 1129491, 921539, 1084952, 954396, 1020098, 676994, 392684, 679382, 424267, -34963, -6187, 131084, 220120, -29405, 257803, 343910, 167686, 384936, 1072051, 1070743, 862551]
17723H62551M8920n27758k83994O3184K24384Q9275k82702o1818K28061l5995
17713C24108K2849K9418j60891j99528M9765L780j48087L6653K70528K86549L03390
17702H18534l9608m3185Q7408j53039m10088n2863J04791j77256j43361L81507
17692C72840L98206l41856K40134j00384k15842k56330K13309J24006Q9656j16556
17682D07183p6054J31723M5103j98413K91440j0972l01208l33420J48791N4437
17672A58610l27879K84996L1524j4339J71014J69479j19832j30785j30955K05035
17662B96868n4766j76959L9379j16507j5530j04673k79127m61261L33729l2604
17652e71451K79467M59779o3401j64499k2258P5958M24062M475N0329M892l68481
$$ y = [862551, 911471, 383713, 99719, 162903, 387287, 476562, 193860, 132042, 360103, 324108, 346957, 376375, 215484, 15956, 65721, 69501, -78586, -41933, 228595, 515144, 818534, 778926, 735741, 823149, 670110, 260022, 207159, 311950, 134694, -8667, 372840, 771046, 429190, 669324, 568940, 353098, 96768, 310077, 434083, 523739, 407183, 331129, 462852, 507955, 309542, 600982, 590010, 288802, -44618, 104173, 158610, -169269, 115727, 147251, 132912, 303926, 473405, 353573, 222788, 91833, 296868, 242102, 65143, 104522, -11985, -27515, -132188, -411315, -872576, -538847, -571451, -291984, 167795, 104394, -60105, -82363, -6405, 417657, 422132, 472461, 477353, 108872]
17641A08872K05943J15509k32745l98678j24643K30886R3515j59548P7188L65944
17631B82243K26838j85259l75278j34102j49870J3790p6301j23365K60726J22856
17621a37722J32035J54719J67073m8748O5076l58104k07901J61404J21672j08648
17611e9144l49571q910O9108K28925j64912N17106N31714L6693L1481j15559k28571
17600D88360P0619l50689l78606k0785r7082L13689N99981K70224q1811k66344
17590E47556j04613P7635K4443j64565o6863j65388j2323k12743k04716K89966
17580H389L47517m03594k91064P4548K57238k8860J61325n8771k80508m4182K01669
17569e6293o2352j87510M9491M213N55397P3826l42926l18575J48989J81110J29651
$$ y = [108872, 314815, 430324, 197579, -201099, -325742, -94856, -1341, -160889, -83701, 282243, 509081, 323822, -51456, -185558, -335428, -321638, -397939, -521304, -260578, -137722, -5687, 149032, 316105, 267357, 332433, -25671, -233572, -72168, 49504, -59144, -408715, -417625, -348517, -119592, -284504, 232602, 764316, 801009, 832490, 716931, 488360, 558979, 208290, -170316, -191101, -288183, 25506, 625487, 895711, 813900, 547556, 442943, 520578, 545021, 380456, 313593, 148205, 135882, -76861, -281577, 8389, 355906, -47688, -338752, -264204, -6966, -35826, 125499, 66728, -213780, -257962, -56293, -118645, -306155, -256664, -252451, 302946, 376772, 33846, -284729, -135740, 45370, 175021]
17558A75021o8130k83961j50903l23882m4474K21318J59482M11144L56921r2818
17548C59718l38956l81667k801L45451K34374K33909k8628j25115Q0278J83204
17538E59767j56658k77101q9727R6236L59278K8368k52271p4767J27466P4225
17528C94816m55232M77091L54324J16985j75726j88988m3339n6332j31992m08608
17518a17001j99341J23786J6204K06119K32999m2030K8721k8320J48311J16416
17508D85864L0003n4258k60161j43242j38639j72550k91079O6310j70758j40791
17498g89301J00536j08922m6670M00814J78001j01938J45491J02255J25382k39414
17488b33766N6155K4877N4132L5138j62141k91705J55852k172O6517K70948j71459
$$ y = [175021, 106891, -177070, -327973, -651855, -696329, -475011, -315529, 95615, 452536, 359718, 20762, -360905, -363706, -18255, 216119, 450028, 421400, 296285, 376563, 559767, 403109, 126008, 36281, 132517, 491795, 520163, 267892, 193125, 320591, 394816, -60416, 416675, 770999, 887984, 712258, 523270, 479931, 423599, 291607, -117001, -316342, -192556, -176352, 29767, 262766, 220736, 249457, 221137, 369448, 485864, 515867, 461609, 201448, 58206, -80433, -252983, -544062, -477752, -648510, -789301, -688765, -797687, -844357, -443543, -265542, -367480, -221989, -119734, 5648, -233766, -177611, -152734, -98602, -63464, -225605, -517310, -361458, -363630, -297113, -26165, -197624]
17477a97624l02966j53953J30019K12042J81638Q3621l35058o389L20546K54889
17467A86765L03853J73381k9521k36615n1976j57870j66255J47123q984j49232
17457A0669J01494L988K95979k2340J82792j24810J5577j11781m0967K30378J49966
17446F90945Q4674N86170L90430J25490L49232j0196r04917o59656j57449J488
17436D96211l58536j54407o54R6018J90061p2193j51358j43383K31547J02817
17426B36123M4352r4931m9143m231n643k74615J60128J61870K39705M19513P7362
17415I10490l7070r292k87435m35514R581m8381L90161K38796j02320l13956K54785
17404E69845M11146j15709o8495J00946k77222J67831O32889j54842O4394j36513
$$ y = [-197624, -500590, -654543, -524524, -312482, -130844, -47223, -382281, -388670, -68124, 186765, 490618, 663999, 634478, 397863, 345887, 188017, 21762, 168885, 159901, 10669, 112163, 116151, 412130, 389790, 572582, 447772, 463349, 351568, 310601, 540979, 690945, 775619, 1361789, 1752219, 1877709, 2226941, 2216745, 1311828, 652172, 494723, 496211, 137675, -16732, -17386, 78632, 268693, 196500, 45142, -98241, 133306, 236123, 280475, 185544, 136401, 132170, 126527, -148088, 12040, 173910, 413615, 833128, 910490, 873420, 864128, 576693, 141179, 150760, 102379, 492540, 731336, 629016, 315060, 569845, 980991, 865282, 796787, 897733, 620511, 788342, 1421231, 1266389, 1330783, 1194270]
17394A194270j76927K20191n6279j40473J16374J91974m47243l65293l48753p3228
17384A14613J96158Q5020o4149l5220O0882J51839r8289j12261J76708q5812m4795
17373C44694R3651r7942l1405N2304J64877q6935j76564M5530n9762Q781K59330
17362E16559j00905l44036K67604M28250P4972o1639K80135p6221o5878n4191
17352H64650k93499k71801K06282p1894J37111Q7349R9831K08045P9639K09795
17342A255508j86324L2555N34522l4487l58808n6305Q0445K31811J53909k4258
17332A628568L88382K46401J79152K55502k32157k01815K48468l95802O1945j84707
17322A993937j14833m4436K34844m6402N4241K03207L0239L73815L70821j41199
$$ y = [1194270, 1017343, 1237534, 1181255, 1040782, 1157156, 1349130, 901887, 536594, 187841, 114613, 310771, 395791, 331642, 296422, 357304, 509143, 410854, 298593, 475301, 389489, 344694, 438345, 340403, 308998, 361302, 526179, 439244, 262680, 308210, 248448, 257229, 516559, 415654, 71618, 339222, 767472, 842444, 780805, 1060940, 984719, 918841, 864650, 571151, 299350, 505632, 433738, 570849, 658198, 758029, 966074, 1045713, 1255508, 1069184, 1101739, 1636261, 1601774, 1242966, 1186661, 1267106, 1498917, 1652826, 1628568, 2016950, 2263351, 2442503, 2698005, 2465848, 2264033, 2512501, 2116699, 2178644, 1993937, 1879104, 1834668, 2069512, 2023110, 2077351, 2280558, 2310797, 2684612, 3055433, 2914234]
17312B914234k703J35252P7640K91282M24056L95657M52596M93008J51793N27347
17302E860162P18546M96920Q61265J419096K766073M179841M935700M533433K442085
17293B8213121k69435l379337l379234j192800j65534J566853K467578L620901
17285B7482113N491844Q530818J4486779K3846593L7530445M8572798M4455136
17278B10396526K4688826o581766l0559111l3378884k8517838k4205781k0713478
17271I1128494j3867102p984092k232586K730884P416110Q791958M863812k695570
17263H8151908j1112206j3819523j1127764p194174n270079l831859k263745j505781
17255C2026777r06757j185914j045127j046384p50381o78512k71322P5045o4947
$$ y = [2914234, 2911531, 3046783, 3124423, 3415705, 3839761, 4235418, 4688014, 5181022, 5332815, 5860162, 6578708, 7075628, 7936893, 9355989, 12122062, 16301903, 21237603, 25771036, 28213121, 27943686, 24564349, 21185115, 19992315, 19826781, 21393634, 23861212, 27482113, 32973957, 41504775, 55991554, 79838147, 117368592, 165941390, 210396526, 235085352, 228503586, 197944475, 164565591, 136047753, 111841972, 91128494, 77261392, 69277300, 67044714, 69775598, 77191708, 85983666, 90847478, 88151908, 77039702, 63220179, 52092415, 44898241, 39628162, 35796303, 33532558, 32026777, 31120020, 29934106, 28888979, 27842595, 27092214, 26413702, 26142380, 26217425, 26152478]
17246B6152478R2830M27079M96660R25266K332158L973123N820931R331074J2200194
17237F1751793J1479878O525013j344189q313316p435560l447975J036028O756281
17229F7007953J2853643J8702025K3623237K8036915L1166944K9247412J4260585
17222B24898714r512352l4884042m5715096l4382155k1271785j3092690q447705
17215E7592889o084587m636906l022007j951626o90232M51131J537730K459825
17207D5656217J146497j494791l834960m729749m096638k478648j507000j320079
17199B7340849j057492j157683j126528j014606j331489j179439r07800p43465
17191A8822347o27537n82195k82060l64929l66486q18118p11100o05927l26902
$$ y = [26152478, 26245308, 26672387, 27169047, 28094313, 30426471, 34399594, 40220525, 49551599, 61751793, 73231671, 79756684, 78412495, 70099179, 62663619, 59215644, 60251672, 67007953, 79861596, 98563621, 122186858, 150223773, 181390717, 210638129, 224898714, 215386362, 180502320, 134787224, 100405069, 79133284, 66040594, 57592889, 51508302, 46871396, 43849389, 41897763, 41207531, 41658662, 43196392, 45656217, 46802714, 45307923, 41472963, 36743214, 32646576, 30167928, 28660928, 27340849, 26283357, 25125674, 23999146, 22984540, 21653051, 20473612, 19565812, 18822347, 18194810, 17612615, 17330555, 16965626, 16599140, 15781022, 15069922, 14463995, 14137093]
17182A4137093l96026o55779l65465l71461n05339l48539q4610k65951r3299m21462
17172A0629162j95393n73922l60561L91620r3489k24484l62697n11422o46447
17163H052367J2252J90805n9346l72231j98714k53394l22917j02911n5581k35477
17153F654853o4324L60142j21996k06618K7266j95333j43496l0234j77286m99811
17143E603163k66367k247j1906m57475m9845J19759m1638r1848K26438j99337
17133D828697k25527n1035j71509l16626l04427N3932M2184o60478n52238j33210
17123B509763K86495P9702l44079k09136R7199o0882P1760J99593j64953k35261
17113B230201k84230p0506N09152P2673n45450n3685K06769l03523r8804p8556
$$ y = [14137093, 13741067, 13085288, 12719823, 12348362, 11843023, 11494484, 11409874, 11143923, 11050624, 10629162, 10433769, 9859847, 9499286, 9890906, 9797417, 9572933, 9210236, 8698814, 8052367, 8064619, 8255424, 8196078, 7823847, 7625133, 7371739, 7048822, 6945911, 6890330, 6654853, 6590529, 6950671, 6828675, 6622057, 6649323, 6453990, 6310494, 6280260, 6102974, 5603163, 5336796, 5334549, 5322643, 4865168, 4815323, 4935082, 4893444, 4801596, 5028034, 4828697, 4603170, 4552135, 4380626, 4064000, 3759573, 3813505, 3855689, 3195211, 2642973, 2509763, 2796258, 2875960, 2531881, 2322745, 2419944, 2359062, 2430822, 2630415, 2465462, 2230201, 1945971, 1875465, 2384617, 2457290, 1911840, 1858155, 2064924, 1761401, 1662597, 1584041]
17103A584041j10258K46451k6322J32037L93330M3592q5586L12063N4255l01842
17093B241761m99039k84789k47801N5294J18634k71556j06587K89124O1755l6743
17083A320053j07871K24633J0977p0510j32473l57836j51399l98609k28496K8034
17073A36503J83910J72947J51533L14098J1044k2895K7325K77003M9119k5871
17063A274716J69977K42254m74896k38096J46863k32282j19691j68999n06573
17054I3273J50956J80687J72260J30442j26930j3714K55367P065j03715k88740
17044D56951k61968R4354K1393K00414M7424k92968q2593Q1615P2408j50188m09243
17033b22401n0764K32901L20638k0615l9764k27714j28774k30113O99843M28321
$$ y = [1584041, 1473783, 1720234, 1693912, 1825949, 2219279, 2262871, 2177285, 2489348, 2543603, 2241761, 1742722, 1457933, 1210132, 1265426, 1384060, 1112504, 1005917, 1295041, 1356796, 1320053, 1212182, 1436815, 1447792, 1377282, 1244809, 886973, 735574, 336965, 108469, 136503, 320413, 493360, 644893, 958991, 970035, 947140, 974465, 1251468, 1300587, 1274716, 1444693, 1686947, 1212051, 973955, 1120818, 888536, 768845, 599846, 93273, 244229, 424916, 597176, 727618, 600688, 586974, 842341, 849406, 745691, 456951, 194983, 289337, 310730, 511144, 558568, 265600, 183007, 264622, 337030, 186842, -222401, -273165, -40264, 280374, 259759, 219995, -7719, -136493, -366606, 333237, 761558]
17023G61558l25890j38184j8581j14499R1956l6291J31854J89776N2696j98959
17013C95436m1740o860k95704P155n1088L30l4951L38581M53216r9349l18755
17002C46271j89809P6780J07030K79860J37199k35223l22823J53089n547l8867
16992C07960j19497r4780l10637j3374K3496J07817M88264J68494j62089k66672
16982A28982k31491k6197J31316K35653J0565k38530j38921K612K04594q6952
16972h369n02803J2430L15517J43398J80321o5093J04794m756J38923K57997k26382
16961C45977L3114m9993m25175l30669R401O9297j33867k45712Q3031N73474J68648
16950I7526l7696k43849r554J28616N383o3612j82081J94995J53788L6850l2986
$$ y = [761558, 435668, 297484, 278903, 164404, 256360, 220069, 351923, 541699, 594395, 395436, 353696, 346836, 51132, 58287, 7199, 7529, -27422, 311159, 764375, 665026, 346271, 156462, 233242, 340272, 620132, 757331, 522108, 199285, 352374, 346827, 307960, 188463, 93683, -216954, -230328, -206832, -99015, 389249, 557743, 395654, 128982, -102509, -128706, 2610, 238263, 248828, 10298, -128623, -126011, 78583, -8369, -511172, -498742, -183225, -39827, 140494, 75401, 180195, 175439, 314362, 572359, 345977, 379091, 329098, -96077, -426746, -417345, -348048, -481915, -727627, -644596, -71122, 97526, 59830, -184019, -193573, -64957, -59574, -123186, -305267, -110272, 43516, 80366, 47380]
16939D7380l13671J77129N78735J4886k12363k13153j32846j27824J88175k8529
16929b2081k8267K27718n9371j56799K5469J29764j64138k53002K0134r459J43153
16918a46879K19369J6213k03564J48167N3444j18592L70353J5872L9709l48703
16908D5389j2943L1490k37244j98474J30017K50395O8938j89796J84621K19676
16898B92069r7515l42254k78827J54155M06790J84039n28610N7760K04776k11048
16888a58665k16926J33971J61217M14997J98120o241k28183j28468l6363l2878
16878A00581n8040o1692j69146J72126L2910j9684R5944j90372m08999J99419
16868c06953J25739R2634L70145k45709l70726J53993r8973m108J85095L22746
$$ y = [47380, -266291, -89162, 489573, 504459, 292096, 78943, -53903, -181727, 6448, -22081, -50348, 177370, 117999, -38800, -13331, 116433, -47705, -300707, -280573, -290032, -146879, 72490, 88703, -114861, 33306, 86750, -31842, 338511, 354383, 394092, 45389, 32446, 63936, -173308, -371782, -241765, 8630, 77568, -112228, 72393, 292069, 194554, -147700, -426527, -272372, 134418, 318457, -210153, -152393, 52383, -158665, -375591, -241620, -80403, 334594, 532714, 526473, 298290, 169822, 133459, 100581, 42541, -19151, -188297, -16171, 16739, -2945, 92999, -97373, -506372, -306953, -181214, -88580, 281565, 35856, -334870, -180877, -279850, -283958, -98863, 223883]
16858B23883k59386o2708N0170L12952N35958k3955j03829j76167M9456m01521
16848A44853j98935K40571M53499k1376k59482l31222n10061q7081O2396J20683
16838c86155N3194M23079K28294l57171Q7092j61996J86268J25780j85531k40140
16828b27286j10896K88286p0831O8082K49909k00470j16617l20702n82911N8695
16818i64741L66173K38954K26292J03153N1283Q346l99315J18641K21818J18569
16808H9173P9292j05560l43331J42232J71690n1262l9387j89982L17760j06377
16798c5752K2429k66867l1819J56529J53650L24848M50820j87776l86472J33683
16788C33273M08080l21467l18551q6869J42276L26516J69884k96122j75749j36658
$$ y = [223883, -35503, -98211, -48041, 264911, 800869, 776914, 673085, 496918, 546374, 144853, -54082, 186489, 639988, 618612, 359130, 27908, -482153, -569234, -506838, -386155, -332961, 90118, 318412, -38759, 48333, -113663, 72605, 198385, 12854, -227286, -338182, -49896, -120727, -52645, 197264, -3206, -119823, -440525, -1023436, -964741, -598568, -359614, -133322, -30169, 21114, 29460, -369855, -251214, -29396, 89173, 168465, 62905, -280426, -138194, 33496, -17766, -57153, -247135, 70625, -35752, -13323, -280190, -312009, -155480, -1830, 323018, 773838, 586062, 199590, 333273, 741353, 419886, 101335, 14466, 156742, 483258, 653142, 357020, 181271, 44613]
16778D4613K62711M49442K38230j20298j09278k5203q6245n870N9787k25019q9655
16767C93215j89807J48944N17519K12978l07198j33943M9866k22949l50500k91152
16757a73027l09984N36867J02547n3554k45200J77637K46127k31765m61209O05920
16747A94359P30704o1431l66339m68533j90520M29097K79613q9328n98874R9889
16737d1363J43947K33224J74409J68531n2305j49389j384K42213n0973j27545
16727E39365K57040m1094l90832k21646k7371K10867J59524j04083q9485k12196
16717H0089k92172J3884L38960L73049j87777j70791K51072M7278j96963N1253
16707C07882N8804J1451R1809K4328j64178l3807L9432k858l08522j21758J05284
$$ y = [44613, 307324, 756766, 994996, 874698, 765420, 740217, 653972, 648102, 707889, 482870, 393215, 203408, 352352, 869871, 1082849, 775651, 641708, 691574, 468625, 118125, -173027, -483011, 53856, 156403, 102849, -142351, 35286, 281413, 49648, -411561, 194359, 925063, 863632, 497293, 28760, -161760, 267337, 546950, 457622, -141252, -41363, 102584, 335808, 510217, 678748, 626443, 477054, 475670, 717883, 666910, 539365, 796405, 755311, 364479, 142833, 115462, 326329, 485853, 381770, 292285, 80089, -212083, -198199, 140761, 513810, 326033, 155242, 406314, 453592, 256629, 307882, 366686, 378137, 469946, 494274, 330096, 296289, 335721, 332863, 24341, -97417, 7867]
16696G867N1251j0517j89301Q1215j38650J62611K674J4216K68108j71380l65518
16685b87424k5384m624r1281m4390K83705L33119Q2827L7111K44022p9901j96710
16674B51070k06617O6649j4402k79746j0809q250R9162K6968k97912J86040J51754
16663c6093M55048j07169N0944k84712l52453q4130Q0470J38990n1547K52852
16653F2200j2025k3486J33751k55121j08166R538L0086Q3832k1557j82849J35937
16642a47860L10713P4831p2623l14734p553k2k19588k02727L1645J34672N9251
16631c53995m02998k0763M7665K62602M469j6999J13662l66662J92159K14234
16621c26626Q6622J99835k59605M3640L4167J32007j77231P1810L38403l7735
$$ y = [7867, 59118, 48601, -140700, -59485, -198135, -35524, -32850, -18634, 249474, 78094, -287424, -312808, -317432, -408713, -453103, -169398, 163721, 246548, 283659, 527681, 447780, 251070, 44453, 111102, 96700, -183046, -193855, -202105, -102943, -75975, -373887, -187847, -36093, 418955, 311786, 362730, 78018, -274435, -358565, -278095, -139105, -190652, 62200, 50175, 26689, 160440, -94681, -202847, -193309, -163223, -79391, -100948, -283797, -147860, 162853, 237684, 165061, -149673, -157226, -157248, -376836, -579563, -547918, -413246, -353995, -756993, -777756, -730091, -467489, -463020, -480019, -366357, -733019, -540860, -326626, -240004, -40169, -299774, -256134, -221967, -89960, -267191, -195381, 143022, 105287]
16611A05287N4151O9719m1339k82190n1722M0894j3716o0986J18552J35556M14540
16600D88746p8439k1485J9545J19323k40745n06014R7140Q0254k69905P3840L33176
16589I5436j20308J7951l53111m51752R0779K67839J58577L3148K39327J13746
16579I1632k72137n06592J86040J58006l9228N53276J95826j44853k5453J09627
16569C06144m97137j24682M07536r8099O5135J16703P3650m5606o47508j61649
16559f05513o4023l4130j08689K42266K83620R00J41284j64080O6280J17218K80229
16548A55362L107r9993k9983N4348p6021j64354j09476k14961O6279J07712j94225
16537e02205M3287P8762o5177J07861K27046K79234j72185l86479K31008L60603
$$ y = [105287, 159438, 229157, 187818, -94372, -146094, -105200, -118916, -179902, -61350, 74206, 488746, 410307, 388822, 408367, 527690, 286945, -219069, -121929, -41675, -311580, -237740, 95436, -24872, -6921, -360032, -811784, -721005, -453166, -294589, -261441, -22114, 91632, -180505, -687097, -501057, -343051, -382279, 170997, 366823, 221970, 196517, 306144, -190993, -315675, 91861, -6238, 58897, 175600, 249250, 203644, -443864, -605513, -669536, -703666, -812355, -570089, -286469, -285569, -144285, -308365, -242085, -124867, 155362, 158469, 58476, 28493, 82841, 6820, -157534, -267010, -481971, -415692, -307980, -502205, -458918, -380156, -445333, -337472, -110426, 168808, -3377, -389856, -158848, 201755]
16527B01755K42681Q6876l08511l31639j63692j16339j88780L27811K3568j11144
16517c37414k03736M2171J08241K6636K32833J77300j01976K44602L53783L4237
16507E76677k98063j21662R7506K84019o4895N4883n0154j66515n28633l008P19
16496b19126k04938j11852N38986L82577k79272k33796K93809M13040J92173m0558
16486G31043l38760j55091k16467J97022m5631k75191l15916j68383m2043O49880
16476B0463O10069k01953l69506k10642k5682J32893j43884m1314J5894j64699
16466c78361N45152K28503j12428j76356k34245j39138M8638J29014L14320J4227
16456B39326l42938l7527m50688o7872K22335J50805K65660M9551j39064P8225
$$ y = [201755, 444436, 531312, 222801, -108838, -272530, -388869, -577649, -249838, -226270, -337414, -541150, -498979, -390738, -364102, -131269, 46031, -55945, 188657, 542440, 576677, 278614, 156952, 254458, 538477, 473582, 528465, 478311, 311796, -216837, -219845, -219126, -424064, -535916, 3070, 385647, 106375, -127421, 166388, 579428, 771601, 731043, 392283, 237192, 20725, 217747, 172116, -103075, -418991, -587374, -629417, 20463, 630532, 428579, 59073, -151569, -177251, -44358, -188242, -229556, -213662, -378361, 166791, 395294, 282866, 106510, -127735, -266873, -218235, -89221, 225099, 239326, -103612, -141139, -591827, -659699, -437364, -286559, -20899, 28652, -110412, -32187]
16446c2187j98687k68243O3499K60141J21908q7032j61542r8862K66584Q6721
16436d7700j65640j75810J66402K13507M78428O1975p4807j38030k21579k52237
16426a55491K90617N18888M73195m04973o36673k13726N2615j01919n22369J31390
16416e68446M15483J50714j29081j12718K87167m504m94034j80220O2681m5138
16406f18096K51010k23966k6013L32494O8072j98646m57914k82680L5942L92563
16396g27234J44755K65030J15742N9196M62613K19143j94723l43858l5006q3464
16386a17806n0925p9550k31655N1288L44570J77003J16679N321j56914K7080J53638
16375B38729o0060j05357J68144j05163N7110j34309J05541j7051l74263K5145
$$ y = [-32187, -230874, -499117, -435618, -175477, -53569, -140601, -302143, -401005, -134421, -47700, -213340, -389150, -222748, -9241, 469187, 531162, 456355, 318325, 96746, -155491, 135126, 654014, 1127209, 722236, 85563, -128163, -75548, -177467, -699836, -568446, -152963, -2249, -131330, -244048, 43119, 38615, -455419, -635639, -572958, -618096, -367086, -591052, -617065, -284571, -216499, -415145, -873059, -1155739, -1119797, -727234, -582479, -317449, -201707, -142511, 320102, 539245, 344522, 664, -34342, -117806, -168731, -248281, -479936, -428648, -84078, 92925, 209604, 214925, 58011, 85091, 238729, 178669, 73312, 241456, 136293, 193403, 59094, 164635, 147584, -226679, -201534]
16365b01534K51079j29768l95204J82876J14327L32825m1227p2853k13230O1869
16355a10840R8099Q1185J00187k55282J2914n6902N9932P198l656n3151K69427
16344A49111k27447l11162K11906J08011l22530p5579N8472J04026J7052M30857
16334A42717L75940l11405l47557K3873K10590K50807J3399m0528m3528k73818
16324D90j89140P9306R9332j97746K38003Q1150k45557k63214k22919K00379K77134
16313a42782P6626M8j77423N7692M52467K25145m1568l54095q5457Q5522k88548
16302a92373j26162J56086K08498J72313j78186K23520J2297l34126P8468j9477
16292H58j86390K61573J22530k59617j46913n7197L2815J11958M5517k03397j56123
$$ y = [-201534, 49545, -80223, -475427, -292551, -178224, 154601, 113374, 40521, -172709, -110840, -12741, 68444, 168631, -86651, -73737, -130639, -70707, -63509, -67165, -120316, 149111, -78336, -389498, -177592, -69581, -392111, -467690, -409218, -305192, -288140, 142717, 518657, 207252, -140305, -116432, 94158, 344965, 358364, 317836, 274308, 490, -188650, -109344, -10012, -207758, 30245, 111395, -134162, -397376, -620295, -419916, -142782, -66156, -66108, -243531, -185839, 266628, 491773, 450205, 96110, 10653, 96175, -192373, -318535, -162449, 46049, 218362, 40176, 263696, 275993, -58133, 20335, 858, -185532, 76041, 198571, -61046, -207959, -265156, -232341, -120383, -74866, -278263, -434386]
16281d34386j29904J7846K18811M8636j68877K26040K64235k28269M4104P7682
16271f4082j17878j70469K41641r979j91049o7548K3133r2064l83832J69560K19837
16260d42730Q8691j14263L01225M70974J7828j03137k64099k41734j95231J31462
16250c51014O4690r8306J41801l68286k56490K35479J47574M92655M79157L4803
16240E22063J182o5368l34980k29220l72074J7420J55562Q8190l43699N6660J02473
16229d01791J32855J57845l281j29839j47222K8873K58744J59554J9444Q8330
16219A63512n0702j79440n8263K13539o5224k62034J58836L6635M1873K52377
16209B51109p6593M213M7890l33019n65920l10959K10950L74250o8245J71784
$$ y = [-434386, -564290, -546444, -327633, -278997, -447874, -221834, 42401, -185868, -141764, -64082, -181960, -352429, -110788, -120767, -311816, -379364, -356231, -448295, -832127, -662567, -442730, -354039, -468302, -167077, 303897, 321725, 218588, -45511, -287245, -482476, -351014, -286324, -384630, -242829, -611115, -867605, -632126, -484552, 8103, 487260, 522063, 523245, 457877, 122897, -106323, -478397, -460977, -305415, -217225, -560924, -504264, -401791, -268936, -111091, -114372, -244211, -391433, -362560, -103816, 55738, 75182, 163512, 112810, -66630, -124893, 88646, 23422, -238612, -79776, -43141, -1268, 251109, 174516, 178729, 226619, -106400, -672320, -983279, -772329, -398079, -466324, -294540]
16199b94540M00187K05298O0256r8895M7762j28721j87318K7174k09068o5053
16189b42918M8892k37226R3688L45091k32010j67209j09941L0172R2720J78109
16179b00632K53187J66500m13552J10864M85786K11006m71294j29040j43415l04958
16169d35548l14795J56932L1949P7714R1644N3601J37619j57049j15203M88797
16159A5661O5761o5627j27233l75270J6526j98204J97455M09160j50122n18889
16149g30782K22459K85099L53350M8762j0509k28570m09592J56087l005l32644
16139f49345N2636k5157K6145J83457k76015m45969P05088M47120O1943J64415
16129B44318j74566k71140L61239J163J90993L56305j42629K4509j18531m56297
$$ y = [-294540, 105647, 310945, 371201, 272306, 320068, 191347, 4029, 31203, -177865, -242918, -194026, -431252, -337564, 7527, -224483, -391692, -501633, -471461, -378741, -200632, 52555, 219055, -194497, -83633, 402153, 613159, 141865, 12825, -130590, -435548, -750343, -593411, -561462, -483748, -392104, -338503, -200884, -357933, -473136, 15661, 81422, 15795, -111438, -486708, -470182, -668386, -470931, -61771, -211893, -730782, -508323, -223224, 130126, 178888, 168379, -60191, -469783, -313696, -316701, -649345, -596709, -621866, -595721, -412264, -688279, -1134248, -429160, 17960, 79903, 244318, 69752, -201388, 159851, 161014, 352007, 708312, 565683, 590192, 471661, 15364]
16119A5364k18795o8202O8996J46219L59200J32700q8300m19145q2652J58673
16109D058J23617r074n1574J14758j39396o5431O2370m7083M5456K32290K22244
16098D92235L88088l85350l72197k33345l7640J38348J63608j84225j74370K4048
16088a80800L75693J84962K4790J22101p0686k52145k40460j81094J77417K35077
16078A94855J48795l87903J63916M1937k72780j09657K0692J97778j38470l62604
16068e03441k05980p1360J14165p2021k97339L39848K79970K34979J58955N7289
16058C5065L42806J80902j4330k34219j77570L5855J39328J39518k4828J04929
16048E27456l25796k95857J51678Q1529K43571M3687k74707k31889n8413m3668
$$ y = [15364, -203431, -271633, -202637, -56418, 302782, 435482, 347182, -71963, -154615, 4058, 127675, 118601, 67027, 181785, 42389, -23042, 39328, -7755, 37701, 269991, 492235, 880323, 494973, 122776, -110569, -148209, -9861, 153747, -30478, -204848, -180800, 194893, 379855, 404645, 526746, 456060, 203915, -36545, -217639, -40222, 194855, 343650, -44253, 119663, 161600, -111180, -220837, -200145, -2367, -140837, -503441, -709421, -780781, -666616, -738637, -1035976, -696128, -416158, -181179, -22224, 35065, 377871, 558773, 544443, 310224, 132654, 168509, 307837, 447355, 422527, 527456, 201660, -94197, 57481, 139010, 382581, 426268, 151561, -80328, -138741, -182409]
16038a82409K00847J00496J10224l88252k3703j15370j33182k08449K87611N01713
16028A49526q3330P540k40666p6662J33275O01373J76935j32866r5762n78251
16018a38888l16867o3797R5261j19768K14561L24310j11291J77871j67207m05042
16008e10857L426K36510K85232J46677O9689l26606k68943k90968J26236M49286
15998h0318L90182K49032j06050l99949j24929J5222J07676m2374k36682L40953
15988A12763K23947k64676p2334J38076r135k38547j40256r8144J35830K50115
15978C7639K75440M7522Q7843l96656q0211l27637O9040J94407L9672m01070j28658
15967e82669j7722k25405m4791P591J58501K93910k31150J22085N57270K56254
$$ y = [-182409, 18438, 118934, 229158, -159094, -182797, -298167, -431349, -639798, -352187, 149526, 66196, 73736, -166930, -243592, -110317, 491056, 667991, 535125, 439363, -138888, -455755, -519552, -424291, -544059, -329498, -5188, -116479, 61392, -105815, -510857, -507431, -270921, 14311, 160988, 230677, -95929, -364872, -655840, -529604, -80318, 309864, 558896, 452846, 52897, -72032, -56810, 50866, 8492, -228190, 112763, 336710, 72034, -300, 137776, 128641, -109906, -250162, -348306, -212476, 37639, 313079, 360601, 448444, 51788, -28423, -356060, -287020, -92613, -52941, -454011, -582669, -600391, -825796, -870587, -862996, -704495, -410585, -641735, -519650, 37620, 293874]
15957B93874k65395k09214P0683l0516j73618K01k8618R557J45262R9497K57300
15946A69013K80452k7408K34624j97537r5810k49403L96243J05801m09581J42503
15936C48897m3587k82098j22559k27945M9894L02610O3509l65571L5965L57741
15926A16856k5674J22349k57385l4641K00526j93452j68600j56710J77474K10485
15916h772j60100j22157k67622O7348J0907j21540K44294L77852k87414L1472
15906b35732J97956r1391m4803J69486N5374o0452q4446j64664j24775j19085
15896e02532p4580J10291P2369K96066J84922k3190j35580M9701K15384j7822
15886A75029m1914l0390k28146J8417J25621J54450k77587m27724k02348K60104
$$ y = [293874, 28479, -180735, -110052, -140568, -314186, -313985, -342603, -333046, -187784, -88287, 169013, 449465, 422057, 656681, 459144, 363334, 113931, 510174, 615975, 206394, 348897, 305310, 23212, -99347, -327292, -277398, 25212, 88721, -276850, -240885, 116856, 91182, 213531, -43854, -78495, 122031, -71421, -240021, -396731, -219257, -8772, -168872, -291029, -558651, -491303, -480396, -601936, -357642, 20210, -267204, -235732, -37776, -129167, -173970, -4484, 50890, -9562, -94008, -258672, -383447, -502532, -577112, -466821, -394452, -98386, 86536, 63346, -72234, -22533, 192851, 175029, 133115, 102725, -125421, -107004, 18617, 173067, -104520, -532244, -734592, -474488]
15876d74488P0848k44726J59725j56001q0910J20865L1349J24141P9692J62918
15866b06587Q504K306N55009P6205m82289k68078J09368k12433K21053M71547
15856B74605k7485m64889k5040J38765R259K22802j16021j25451j49959K92047
15846B8633J50619j38529j49370J4923O5037M3416m40655k51482P4489N2229J98633
15835c52057J38376l9131j95734k49864J45460l36400n1719K67972J98424O0717
15825d13956l7736K25341N8961k06985K27913J96933J06052j15467j68358K43390
15815A16088O471j55254m04631L0588O91094Q8903l09613J57017L19228J07809
15805F47700j83805k69531j51865l33348m0362j29124r6981N3844q3570j24419
$$ y = [-474488, -403640, -648366, -488641, -644642, -725552, -604687, -573338, -449197, -369505, -206587, -198083, -195777, 359232, 435437, -46852, -314930, -205562, -417995, -196942, 274605, 247120, -217769, -242809, -104044, -94785, 128017, 11996, -113455, -263414, 28633, 179252, 40723, -108647, -93724, -28687, 14729, -425926, -677408, -602919, -550690, -352057, -213681, -252812, -448546, -698410, -552950, -889350, -941069, -673097, -474673, -413956, -451692, -226351, -167390, -374375, -146462, 50471, 156523, 41056, -127302, 116088, 122559, -32695, -437326, -406738, 284356, 373259, 63646, 220663, 539891, 647700, 463895, 194364, 42499, -290849, -331211, -460335, -557316, -503472, -587042, -711461]
15795g11461L30416J46621K29251K4610K1015k36275k76730J28846J41973L1071
15785a70663k49906K40411J88123j71619J61516J87292k08333k92961j06850M5099
15775c77891J76865L07758M16719r7005m39440j29876j38130k28109J34928K00542
15765a73639o3213j15416p2485K0421Q9549K6324l7084r5148K09081j3836K02418
15754b3028J8289j08619q3405n54577l1507p1528L00131M66181J94601N048k62974
15743a51388k03852n1716Q9385K8692J3707M63036R5102j35544k03633j88782
15733b44993l2340L19323K62911J67300l83626k14661k8940j46308J87919L7752
15723g5663J55645j65974l14950j13956N24165o6703j46853l81497j40007N03795
$$ y = [-711461, -381045, -234424, -5173, 19437, 40452, -195823, -472553, -343707, -201734, -170663, -420569, -180158, 7965, -163654, -2138, 185154, -23179, -316140, -422990, -377891, -201026, 106732, 523451, 426446, -12994, -142870, -281000, -509109, -374181, -173639, -236852, -352268, -424753, -404332, -314783, -288459, -325543, -420691, -211610, -225446, -23028, -4739, -113358, -196763, -751340, -782847, -854375, -554244, -88063, 106538, 111586, -151388, -355240, -406956, -317571, -288879, -275172, 187864, 282966, 147422, -56211, -244993, -277333, 41990, 304901, 472201, 88575, -126086, -155026, -301334, -113415, -75663, 79982, -85992, -400942, -514898, 9267, -57436, -204289, -585786, -725793, -221998]
15713b21998J97559n7191P6537j77402l15963k8786k4466J92352J38408J97483
15703b3467N5455j19866k64246r8050J44668J74431m5577r6541j66200r6856J25056
15692d11193k41680k28930P1991M49655J74789l518J5512n4323j27923j90199
15682e45819Q9108K74239N5989K72479K32683Q2792k19923k31414M29710J28574
15672E68418J35400k48502j51960k92585Q7040k16577k28162Q9426K84326l30478
15662c03654k4817L41738K8362j23569k06381j07861J66609J34640l4681k4846
15652a54460J22232j48096N8045K92543J56582j75592m06437J06483j56345j62783
15642d67828L16969L67484O5545j99903j74889M33994K65301m51724J95911K36843
$$ y = [-221998, -24439, -81630, -5093, -182495, -498458, -527244, -551710, -359358, -220950, -23467, 31988, -87878, -352124, -450174, -305506, -131075, -176652, -273193, -439393, -536249, -411193, -652873, -881803, -809812, -360157, -185368, -188886, -173374, -227697, -355620, -545819, -456711, -182472, -126483, 145996, 378679, 461471, 241548, 10134, 439844, 568418, 703818, 455316, 303356, 10771, 97811, -118766, -346928, -257502, 26824, -303654, -328471, 13267, 41629, -81940, -288321, -396182, -229573, -94933, -129614, -154460, -32228, -180324, -122279, 170264, 326846, 151254, -255183, -148700, -305045, -467828, -150859, 216625, 282170, 82267, -92622, 341372, 606673, 154949, 350860, 587703]
15632E87703J19172j90781j54162l53771O1665L39892k68298R5354L5514k11862
15622F0426L02k96611n4664R8676j32541K60937L14054l62504m71040m1572J19977
15611e04560L33343J08170K5562Q944J87380J30386j1956k26270j11102K5837
15601c4266k72995k19762K95763M39596L9475j45432m1186N6103O7700O0876j30047
15590A15825l83602j29418P3551N70357M9875m12627k15831j66034K83170K88273
15580G3539q960q0604O703o474L79043m28447k36779K83672M38933J42021l42362
15569B20285N2837K9617l37945j76306r36k26721n23317N3265K78848L87399L99389
15558A56415K23297k86384m68534O778K56275J20598K58520L7007k04877r8567
$$ y = [587703, 706875, 516094, 361932, 8161, 69826, 409718, 141420, 236774, 272288, 60426, 60728, -235883, -290547, -191871, -324412, -63475, 250579, -111925, -582965, -624537, -504560, -171217, -63047, -37485, -28541, 158839, 289225, 277269, 50999, -60103, -34266, -307261, -527023, -231260, 208336, 247811, 102379, 61193, 117296, 184996, 245872, 115825, -267777, -397195, -323644, 246713, 296588, -116039, -331870, -497904, -214734, 73539, 64579, -16025, -9322, -15796, 363247, -65200, -301979, -18307, 420626, 562647, 220285, 273122, 302739, -35206, -211512, -212448, -439169, -962486, -909221, -630373, -242974, 156415, 379712, 93328, -375206, -368428, -112153, 8445, 266965, 303972, 99095, 528]
15548E28L9364k68727n621k55277k72957L23358J60296j99647L03730M29395k5384
15537B29058K8026K1948j84082l2226J42287l03142j83265J42195M44683O0194
15527C65676j58534l284R6964l81074m21414J94988k51125J34398J26889M2815
15517b53701q6827K25431O4449L3206j51564j82377k94387J37965M3225J64956
15507b99624M16756K0336J59750J04601P6597k91216P7374Q0082P757l10987j89214
15496a47788J02330K12849j1078k36300J76020p7439l51161k61770L88138M77208
15486B71009k6724K13294j18282k7454k72085M37165n9874k91446l08507k55139
15476d38043Q8281J98674J15235J6967R9488J50902j73452j77625p7781L17482
$$ y = [528, 39892, -228835, -234456, -489733, -762690, -439332, -279036, -478683, -174953, 254442, 229058, 257084, 279032, 94950, 62724, 205011, -98131, -281396, -139201, 305482, 365676, 207142, 203858, 300822, -80252, -501666, -306678, -557803, -423405, -296516, -253701, -340528, -115097, -50648, -17442, -169006, -351383, -645770, -507805, -464580, -299624, 117132, 137468, 297218, 401819, 478416, 187200, 264574, 344656, 352413, 41426, -147788, -45458, 167391, 156313, -79987, 96033, 18594, -332567, -594337, -206199, 271009, 244285, 457579, 339297, 311843, 39758, 476923, 417049, 125603, -182904, -438043, -349762, -151088, -35853, -18886, 80602, 231504, 58052, -119573, -197354, 120128]
15466A20128K4631o0183q3840M5411j89916n9942q19n1883J90687M58653N646
15455C98573k51261M2585K57595P5775J06659m87717O183K19232K09515m072k84926
15444B88141l37419j70326M2285J40550l54506j61782r5191K10461L00767L11024
15434A74004J88755j97322j831k15639k87923Q1928J25328J45257j71328j19359
15424b78130J43806j79894k32789R5346O9260K08987O6962k82409K12250N6957
15414a19654Q1247J58200k16359k22671j8431r2334k25017J53724K25202K71438
15404d655j03118K38751K24188N380j39844J30823m16380J0828j28248J68686
15394a3589K8953l00809j87119j17889L537J31301q708j26296K16820K3052N4921
$$ y = [120128, 144759, 84576, 736, 46147, -143769, -203711, -204530, -256413, -65726, 392927, 398573, 147312, 189897, 447492, 523267, 629926, 142209, 148392, 367624, 577139, 573067, 288141, -49278, -219604, -177319, -36769, -391275, -553057, -648248, -437787, -137020, 174004, 362759, 165437, 163606, -52033, -339956, -258028, -132700, 12557, -158771, -278130, -134324, -314218, -547007, -451661, -382401, -173414, -106452, -388861, -176611, -119654, -38407, 119793, -96566, -319237, -337668, -430002, -655019, -501295, -276093, -4655, -107773, 130978, 355166, 360546, 220702, 351525, -64855, -54027, -182275, -13589, 15364, -285445, -472564, -590453, -586916, -455615, -464323, -590619, -373799, -350747, -295826]
15383b95826j183K2186L33050k6567k50245o3705L2979K20869J6238k0555N4729
15372B1970j86240k21915M2191K59697K73747q0784j63314L5083k02639K33724
15362A1520j36058j39514k71563J91993M24173j24914k9707K3003j98459j69813
15352d19339K55814J72208k07715l44910N1700Q9718q7703M50086N96702K21257
15342G77818l31462j05723J08955k57313j14265q3295l22320j47731P8245q3772
15332d80863K14011K01842K31554K3158n12142j4481k97152K1254K03714L70551
15322c8554L14707l17928l57092j85846J76531N7877p4578J95997L60833o8666
15312F3281O1126l5521l1153j42813K90294J10186l40780j25383N105j4044k7457
$$ y = [-295826, -297009, -274823, 58227, 31660, -218585, -282290, -249311, -28442, -12204, -32759, 21970, -164270, -386185, -343994, -84297, 189450, 108666, -54648, -19565, -222204, 11520, -124538, -264052, -535615, -343622, 80551, -44363, -74070, -51067, -249526, -419339, -163525, 8683, -199032, -543942, -492242, -402524, -490227, -40141, 556561, 777818, 446356, 340633, 449588, 192275, 78010, -5285, -327605, -475336, -397091, -480863, -266852, -65010, 166544, 189702, -322440, -336921, -634073, -612819, -409105, -38554, 276153, -41775, -398867, -584713, -408182, -350305, -424883, -228886, 131947, 63281, 124407, 88886, 57733, -85080, 205214, 315400, -25380, -150763, -145658, -159702, -187159]
15301a87159j3459Q8167k06610J04332K66594j6672J94399K07337j41256j68919
15291A26754k56283l64767K91905K52925J01208j25218J47670J35776o2865m17137
15281a70032n9916L01696r1289Q9804P1603k6036o7457m9938Q1148J55761j48492
15270H6852m22884k07517J81093J74767j13160m6555J14443O4942M07979K7964
15260B67924J41322Q5608J66185k13847m8184j73576l37964J92048J43286J46100
15250C68902K24222p7952m53665o8019M2164j20071j88862m41482M9999J89451
15240d75313J31162K42962j1580j11915j43306p2122J46858J14024J30222J43059
15230I4051J32308J14465q8452k0690k37036n981K1749j82542O3204q6388J82603
$$ y = [-187159, -200618, -112451, -319061, -214729, 51865, 35193, 229592, 436929, 295673, 126754, -129529, -494296, -202391, 50534, 151742, 26524, 174194, 309970, 247105, -170032, -229948, 71748, -19541, 70263, 141866, 115830, 48373, -1565, 79583, 235344, 86852, -336032, -543549, -362456, -187689, -300849, -347404, -232961, -168019, 239960, 267924, 409246, 494854, 661039, 447192, 399008, 225432, -112532, 79516, 222802, 368902, 593124, 515172, 61507, -6512, 35652, -84419, -273281, -714763, -664764, -475313, -344151, -101189, -112769, -224684, -367990, -440112, -293254, -179230, -49008, 94051, 226359, 340824, 252372, 231682, -5354, -11335, 10414, -172128, -108924, -195312, -12709]
15219a2709j41191J70538j38413l45533J66207R7516k38175K00176L11678J57056
15209B27150j11512k55008m13562k33543R6538p2629q2972J60137j44442q9104
15199i18947K71812K38133L32823k01592J00679M36609J56821J2910J87459k90638
15189C26069j5968J91748j43113j75338J22246P9670j37706r8889J37639L4020
15179C20378k24155j3082K88418k2588k99755J00281j34655m38714J25938n4100
15169c52034J84892J92307j13294k67948L0432J06005j27257K26933K03452k32853
15159a49365k21829p0533K55794L37355O6138J16333J72396m24100j33258J6641
15149c4428J89593K38q7308L21668p7874q1013k25759p6521k68881L43659L91843
$$ y = [-12709, -153900, 16638, -121775, -467308, -301101, -203585, -441760, -241584, 70094, 227150, 115638, -139370, -552932, -786475, -689937, -762566, -845538, -685401, -829843, -918947, -647135, -409002, -76179, -277771, -177092, 259517, 416338, 429248, 616707, 326069, 310101, 501849, 358736, 183398, 305644, 385314, 247608, 148719, 286358, 320378, 96223, 83141, 371559, 348971, 49216, 149497, 14842, -423872, -297934, -352034, -167142, 25165, -88129, -356077, -325645, -219640, -346897, -119964, 83488, -149365, -371194, -441727, -185933, 151422, 217560, 333893, 506289, 82189, -51069, -34428, 155165, 155403, 68095, 389763, 311889, 230876, 5117, -71404, -340285, 3374, 395217]
15138C95217k28588m45053j36408Q1316K07625L47017Q3798l11694k61040k15141
15128d82951k49121J69653j98016J12960K47969K28842M16840K93168R4890l53122
15118B81112P9254J03207j78003L1026K64504J38822M3281l312m87471j73019
15108I9401K60479n0382j28701J3551m12336K3622K49911J95758l8172j87590
15098B5541O7509j30199J87150l7999p7943j9819k54104K3560j0804J63623K64094
15087B00609j58076p5070L73981J36502j68764k13748j92513m5989k01117j54746
15077d98931K53011J59271J86l12003J64013K43162j06458J71710N48774K07307
15067H30042j29089j49939m81689l48170J58886J28128L13862M24810o0914o53902
$$ y = [395217, 166629, -278424, -414832, -333516, -125891, 221126, 304924, -6770, -267810, -482951, -732072, -562419, -760435, -647475, -399506, -170664, 246176, 539344, 634234, 281112, 360366, 463573, 285570, 316596, 581100, 719922, 763203, 759891, 272420, 99401, 359880, 309498, 180797, 194348, -217988, -194366, 55545, 251303, 213131, 25541, 93050, -37149, 150001, 112002, 34059, 14240, -239864, -216304, -227108, -63485, 200609, 42533, -32537, 341444, 477946, 309182, 95434, -97079, -143068, -344185, -498931, -245920, -86649, -86463, -398466, -234453, 8709, -97749, 73961, 622735, 830042, 700953, 551014, 69325, -278845, -119959, 8169, 322031, 746841, 685927, 32025]
15057C2025m09156M808J40615J83793k6858j34641l01257J87140P3092m4399L10967
15046A6129J12461j29551j24909k89910Q2995j81372l4921m1355K56642k6729
15036c60520m612R730q4050J59149j27479j82236k4164K74488M29564j2709k09275
15025a32114L9056P2095L71876r1588k18351j77804J12797L40294p280l64745
15015e5764l98387L3048J91150J42249j40956K74738K35678L13236j00396l51246
15005A43350j65028J2781r8654K51457o5698j03508o8561k58892n7389m123j98735
14994f13000q4300L31362K56122j73402m7610J41375j1806l56932M9602M12309
14984i6280j70347j52898j64291K04035L08486m5441k13748j8671K65533M66080
$$ y = [32025, -377131, -372323, -231708, -47915, -74773, -209414, -510671, -323531, -250439, -294838, 16129, 128590, -961, -125870, -415780, -332785, -514157, -549078, -590433, -333791, -360520, -365132, -355402, -439452, -280303, -407782, -590018, -614182, -339694, 89870, 77161, -132114, -93058, -20963, 350913, 259325, 40974, -136830, -24033, 316261, 308981, -55764, -454151, -421103, -229953, -87704, -228660, 46078, 281756, 594992, 494596, 143350, -21678, -8897, -107551, 143906, 78208, -25300, -93861, -352753, -410142, -414265, -613000, -697300, -365938, -109816, -283218, -330828, -189453, -201259, -558191, -508589, -96280, -266627, -419525, -583816, -379781, -71295, -116736, -330484, -349155, -83622, 382458]
14974C82458K7015N9128q6571k28832m7410K4245J78423R7133p4037K6789K44271
14963F02612J46618l88624j92198p9200l72056l1859m7840m8842J56337M42484
14953A87432L04492k09027p9718O2050P394k33242j72130J27535p2604j1867M44876
14942C55191Q9855k49407j48273J01879J32558O0947m2871J62024J9560J31508
14932F12971K02130k97038j81995j69001j69023K2617k89480j4473M7524k25630
14922d61398K19045K78350J41426j45478j8477J61430l4323k44198R9622j98587
14912b02588q0331l6053L89927N9497l27455J3336K04791O3142J93045J00623
14902C77934j91384n8888R9295J95629Q473m7560j5112r4803l00165l35239L25475
$$ y = [382458, 409473, 468601, 382030, 153198, 105788, 130033, 308456, 405589, 331552, 358341, 602612, 749230, 360606, 168408, 89208, -282848, -314707, -362547, -411389, -255052, 187432, 491924, 282897, 203179, 265229, 272623, 39381, -132749, -5214, -77818, -89685, 355191, 445046, 195639, 47366, 149245, 281803, 342750, 299879, 461903, 481463, 612971, 815101, 518063, 336068, 167067, -1956, 20661, -268819, -283292, -235768, -461398, -242353, 35997, 177423, 31945, 13468, 174898, 140575, -103623, -4001, -202588, -282919, -318972, 70955, 130452, -197003, -183667, 21124, 84266, 277311, 377934, 186550, 127662, 226957, 422586, 431059, 383499, 368387, 273584, -26581, -361820, -36345]
14891c6345J8059Q9500m0982K69719q0951J46183J5715p6273K5777k07893j74071
14880e1562j99104q3652k71138J16354J10495j68504l55833j03313K95297M54714
14870b56246j78054p1262J01373K0002K8693R8399J28324J03926q8671N27267
14860D13751K92009n94424m16154Q7446O9531R1771J21287K14744l8849m93247
14850b52135j34104M9274M18779j93259k81909J64588O02323m4859k44383m6303
14840C8012J08040l2934k56926j7905r7900J43392L4599l08082J3544O3220j31890
14829d44830j68440O2162J07273J93731l36287J289L67120J80308J23592m9890
14819C6028J52130O7848j89960p9632k68180k14836L74784N1505K6111r433K53765
$$ y = [-36345, -18286, 71214, 30232, 299951, 219000, 365183, 380898, 304625, 330402, 122509, -51562, -250666, -334318, -605456, -489102, -378607, -547111, -902944, -1006257, -710960, -256246, -434300, -505562, -404189, -384187, -355494, -257095, -128771, -24845, -113516, 413751, 705760, 111336, -304818, -217372, -147841, -56070, 65217, 279961, 241112, -252135, -386239, -336965, 81814, -111445, -393354, -228766, 373557, 328698, 84315, 38012, 146052, 113118, -143808, -161713, -259613, -116221, -81622, -389704, -376160, -312940, -444830, -613270, -551108, -443835, -250104, -586391, -585102, -217982, -37674, 85918, 36028, 188158, 256006, 66046, -13586, -281766, -496602, -121818, -70313, -44202, -53635, 200130]
14808B00130N4010j12511Q2798J48460j78334k07860k588j79427k51586K11684
14798b35224N3558j04911J43725N25962l97863n14950j98134J28092j07544j5430
14788g22719J17261J18761j46927k3929R8392J39291j6465l8668P3763L61205
14778d0035N6924o3803k15651j56651l2642K09911k0331j13571K05783L32325
14768A62259L04512k20872p1449J31276r0703k25306k83965q449M9848q6101j89714
14757e28664n4396P2956J34129K21076O2168j11376j11410K94255N26795K7914
14747E33447k7783M57723j39531o64907k31081j7275Q442r6667L12475J99090
14737C33933k27964k60094P559K39623j47391j70125J2678p9627K81849J90709
$$ y = [200130, 254140, 141629, 224427, 372887, 194553, -13307, -15895, -195322, -446908, -235224, -181666, -286577, -142852, 383110, -14753, -529703, -727837, -599745, -707289, -722719, -605458, -486697, -633624, -657553, -559161, -419870, -436335, -475003, -401240, -40035, 16889, -46914, -262565, -419216, -451858, -241947, -262278, -375849, -170066, 162259, 466771, 245899, 174450, 305726, 215023, -10283, -294248, -302697, -252849, -338950, -528664, -583060, -510104, -375975, -154899, -92731, -204107, -315517, -21262, 505533, 533447, 505664, 963387, 823856, 158949, -72132, -89407, -80965, -177632, 134843, 333933, 105969, -154125, -146566, 93057, -54334, -224459, -211781, -291408, -9559, 181150]
14727A81150j36971j95620J08958J82064K55188J24045n74927k49971j1750K33205
14717h4629j00109K89672l07884n1238M38643L28821j21953k22071J63002L75876
14707G08130m01580l71733m15405o8994J99031J06954K78328j1797j98351j3257
14697a88674K58780J86769j60163j00844l06090j20321K30966R9348J55020k12400
14687a57609o5916k41693j89478J64763J73993j93842K74098K21515m54997j18995
14677e88161m6714j0571K57373k1945L72315M02406J44244k47054l15050K43249
14667A90092j22788p5821k94202J33413K48117N48980j38360p9471J35029p9142
14657D65847p3677p8196q8491j86444k41447k76715Q9503m7578q4199o3376L2902
$$ y = [181150, 44179, -151441, -42483, 139581, 394769, 518814, -56113, -306084, -317834, -84629, -184738, 104934, -202950, -254188, 184455, 513276, 391323, 169252, 332254, 708130, 306550, -65183, -480588, -549582, -350551, -243597, 34731, 22934, -175417, -188674, 70106, 256875, 96712, -4132, -310222, -430543, -199577, -100229, 54791, -157609, -223525, -465218, -654696, -489933, -315940, -509782, -235684, -14169, -469166, -588161, -634875, -645446, -388073, -410018, -37703, 364703, 508947, 261893, -53157, 190092, 67304, -8517, -302719, -169306, 78811, 627791, 489431, 409960, 544989, 465847, 392170, 313974, 225483, 39039, -202408, -479123, -389620, -437198, -521397, -584773, -551871]
14646e51871j83095k46521K50520K02795L7053j48524o9592K39015J61710j61171
14636d69681J08437k46885P5544k03234j86067M56986L76227L2554q3097N5664
14626h3552k74192j88642m00260Q0599M32213K13012j05728J38357L69305J9855
14616B00967J28076Q9178l7794K5091J14080P7591l16354j22547k81192m8372
14606a71276K0416J0990k30795J81123K12059q2167j15047K46379q9224m05510
14596d23052r9175N9372j31324L85559K82757l90k8872J878o5768p0640M1557
14585d8098J16305l35249K5473L6509k92455N71048N7200R3693j99736j15715
14575i1025j2161n2978j8406M5273j57534L62011L69524k57711P2658j44451l07082
$$ y = [-551871, -734966, -981487, -730967, -528172, -491119, -639643, -709235, -470220, -308510, -469681, -361244, -608129, -532585, -735819, -921886, -464900, -88673, -56119, -139216, -83552, -357744, -546386, -946646, -866047, -433834, -220822, -326550, -188193, 181112, 200967, 329043, 418221, 380427, 405518, 519598, 597189, 280835, 158288, -122904, -171276, -150860, -139870, -370665, -189542, 22517, -59650, -174697, 71682, -17542, -423052, -522227, -462855, -594179, -208620, 74137, 73747, 44875, 46753, -19015, -89655, -48098, 68207, -267042, -241569, -205060, -497515, 73533, 130733, 224426, 24690, -91025, -103186, -156164, -174570, -129297, -286831, 75180, 444704, 186993, 259651, 115200, -191882]
14564a91882K40010M0272j08786m1302R2716L4051n8757j92299k60339J10567
14554c35749K32130K36390r3368o2956N4799P3308J21856m79599m17235L07422
14544c63002M74928J25728n3176J92196j08577K0623K35399Q0747k19461j97569
14534A87836n29041l57426O4799K0391K82729P2466R7504q9688J76266L45395
14524B71231J67915k60020J06133j32903J87174M4954n85813m3955k4764j77729
14514d47777L67791J36575k75730j78667N4187O680j84715K67099J50830j03327
14504b07054K3335M13468R6847j60112j5361L00876p4597k63599l79787Q8980
14494a77004K5234K9785N791m4190O0828j27086k34140L8949P1984M5082M06284
$$ y = [-191882, 48128, 88400, -20386, -61688, 31028, 65079, 6322, -185977, -446316, -335749, -103619, 132771, 39403, -23553, 31246, 104554, 226410, -253189, -670424, -363002, 111926, 237654, 184478, 376674, 268097, 288720, 524119, 604866, 385405, 187836, -341205, -698631, -633832, -613441, -330712, -258246, -160742, -250430, -74164, 271231, 439146, 179126, 285259, 152356, 339530, 384484, -201329, -245284, -270048, -447777, -79986, 56589, -219141, -397808, -343621, -336941, -521656, -254557, -103727, -207054, -183719, 229749, 326596, 166484, 151123, 451999, 377402, 113803, -265984, -177004, -151770, -121985, -116194, -160384, -99556, -226642, -460782, -421833, -349849, -304767, 101517]
14483A01517L82781L4563o04172n0616K82664p8954R1449P9519o540l20066l8523
14472a26378J29943M13375j27307l10806J26171m3415n8093m2527J13578K93543
14462C68084k68992l65679P3511p9678K31139m5343j21243J26394K73977Q8734
14452B80904k2354J3050j15635J80680R2526l77555J78915J82509n0555j07481
14442B55004L8488r5374j46785l08617k49749N6506J22017M1904k0682l3734J188
14431c39834p9638M15163L1207l13593K35806r4251J1841K11821J28118l19194
14421a12554k35957n3145K3011J07414K80326p8947R3496k36872j41766J88436
14411a66558J90430r680m19463M7061J67330j23956j52481j18802K20845j18050
$$ y = [101517, 484298, 518861, -85311, -135927, 146737, 67783, 159232, 238751, 232211, -87855, -126378, 3565, 416940, 289633, -21173, 104998, 61583, 3490, -39037, 74541, 368084, 99092, -266587, -193076, -272754, -41615, -86958, -208201, -81807, 192170, 280904, 258550, 271600, 155965, 336645, 429171, 51616, 230531, 413040, 362485, 255004, 293492, 198118, 51333, -257284, -507033, -450527, -328510, -286606, -307288, -341022, -339834, -419472, -4309, 26898, -286695, -50889, -145140, -133299, 78522, 206640, -112554, -348511, -401656, -378645, -271231, 9095, -69852, 23644, -213228, -354994, -166558, 23872, 14192, -405271, -358210, -190880, -314836, -467317, -586119, -365274, -483324]
14401d83324K4510J31393j52972n39J83835J33385J76207K66414k06970k11418
14391a39479o7003O9121K58593L26196O5478l579p5930R9631j92938j37930k08205
14380f045j35814O6321K76723k55816j25271K27057m1251Q622j12438J08375p0657
14369f0194j89622l3640O3691j771K25309k82430k96734L0183K96421L77367m4816
14358H3764J71926o7654j29115q2087K79904j00560l99092J38423n2292j32149
14348b88932Q8539J52760L70095j86911k71379J18348K01828j29419p8403Q8356
14338F4882K6612Q6726m4755k97704j10399J27204j14314J57387K55494K30604
14328C81737K69340J15159k12281k94347o8013M7236j48564j25642J39412j58116
$$ y = [-483324, -458814, -327421, -480393, -480932, -297097, -163712, 12495, 278909, 71939, -139479, -206482, -137361, 121232, 447428, 512906, 509327, 433397, 533028, 340090, 202160, -6045, -141859, -75538, 201185, -54631, -179902, 47155, 5904, 14526, -97912, 10463, -60194, -249816, -283456, -219765, -221536, 3773, -278657, -575391, -545208, -248787, 128580, 83764, 255690, 188036, 58921, -23166, 256738, 156178, -242914, -104491, -156783, -288932, -200393, -47633, 322462, 135551, -135828, -17480, 184348, 54929, -23474, 64882, 91494, 178220, 133465, -164239, -274638, -147434, -261748, -104361, 151133, 381737, 651077, 766236, 553955, 259608, 191595, 238831, 90267, -35375, 104037, -54079]
14318e4079j71740j97357K50994K04635J96738Q8542q9969K31053k75958m4711
14308A38148k16721k99660J0782N72199K49811j04965k47321o72171J5016L83476
14298a71406o3024J58906M5309k74695k81741K03770N17066L4856Q956k01252
14288b3255q370O7488L05614k48143k42110J12006J83070j88795l7336m54787
14278e34618o5478K50267K20035Q2350p2120m4902N6186Q4978K47962Q9044o1346
14267B52358n37814N2642P9921J83773l37763j79114M02238L48128l21719j44841
14257b02191L5237K46396j51726R3902L69326j77598K18889n3068l60161l82612
14247c63606j10202j35294M49437L66538p7574J90914k1625l30777j44026o8820
$$ y = [-54079, -225819, -423176, -172182, 32453, 229191, 317733, 227764, 458817, 182859, 138148, -78573, -378233, -367451, 204748, 454559, 349594, 102273, -569898, -554882, -171406, -234430, -75524, -30215, -304910, -586651, -382881, 134185, 169041, 177997, -23255, -31625, 35863, 341477, 93334, -148776, -36770, 146300, -42495, -79831, -534618, -600096, -349829, -129794, -47444, -119564, -164466, -108280, -23302, 224660, 313704, 252358, -285456, -232814, -152893, 30880, -306883, -485997, -83759, 264369, -57350, -202191, -166954, 79442, -72284, 21618, 390944, 213346, 432235, 379167, 19006, -363606, -473808, -609102, -159665, 206873, 129299, 320213, 298588, -32189, -176215, -245035]
14237b45035k15158q0540M06549j603j36906k55054j58922N04658J76824l76952
14227c82139m80333K1267M04678L08017r2255l60183J54988O4616M29987J41823
14217B10466l80225J0078k14413J99038K08660K37926j3679o70814k62046L22991
14207c52018J9108M2172J64369R4803J73567J71627l73484l36132k70294j25899
14197g92181Q8257L33974L5402l22152R5542J02006K51242l7704K26629L87430
14187C68445K62072o9401n10615k91611k94440K97932J42968J39103j37480J17791
14177B4764l15350l83268K6464J85247L61031P8126K71551m7593m76606q529j62632
14166d46795K9439M50268N44340r9263K5756j89090J77359l3342m93347r3254
$$ y = [-245035, -460193, -540733, -134184, -135787, -272693, -527747, -686669, -182011, -5187, -382139, -862472, -841205, -436527, -128510, -220765, -580948, -425960, -361344, 68643, 210466, -169759, -159681, -374094, -175056, 33604, 271530, 257851, -412963, -675009, -352018, -332910, -290738, -126369, -31566, 142001, 313628, -59856, -395988, -666282, -792181, -703924, -369950, -334548, -656700, -561158, -459152, -207910, -245614, -18985, 368445, 630517, 561116, 50501, -241110, -535550, -237618, -94650, 44453, -93027, 24764, -290586, -673854, -647390, -462143, -101112, -22986, 248565, 200972, -275634, -284163, -446795, -417356, 32912, 577252, 477989, 503745, 314655, 492014, 458672, -34675, -127929]
14156a27929J55335J11154j18875k68013J31560K38178j25505k28916j03775J93733
14146a43053p2637k43237J58222J69204j17619L3229j20604K13722K32717k95797
14136a85853k9747k74880j90376J27880J64826J85779l12543j15696M45316o4413
14126b49707r8236Q0826J4326j05487L10288N80508k4255k43879p8968k80369
14116i4953m59881j76423O84348P84988L60658m42709l20819j07552l53788n41077
14106f67208j47620R9190M3670K00242l91111j30050N72938K98519j36056j29661
14096c87147O8251j06513J00981J48603K34488K87261j93657J83037J07473j87474
14086B55303j97325j35034o4146k67525j19670q415K67071M36336L8864L30271
$$ y = [-127929, 27406, 138560, 19685, -248328, -116768, 121410, -4095, -233011, -336786, -143053, -215690, -458927, -300705, -131501, -249120, -215891, -336495, -122773, 109944, -185853, -215600, -490480, -680856, -552976, -388150, -202371, -514914, -630610, -185294, -249707, -347943, -267117, -252791, -358278, -47990, 532518, 508263, 264384, 185416, -94953, -554834, -731257, -46909, 738079, 1098737, 656028, 335209, 227657, -126131, -667208, -814828, -715638, -671968, -471726, -862837, -992887, -419949, -121430, -257486, -387147, -318896, -425409, -324428, -175825, 58663, 345924, 152267, 335304, 442777, 255303, 57978, -77056, -141202, -408727, -528397, -536812, -269741, 166595, 205459, 535730]
14076E35730l79781l94308j25003K03352l23164j6230K7703M35981k237j4881
14066e2838n1202J89041J23560k07554q3021m3606Q0135J81077K27532j19731
14056B43393O5692K63600j20286l07391k39740l6787J44734J51152K9769k16375
14046b2239k07423M527M1220N3229K74887j75356k27875J67659K526j13233k05271
14035d07349j42081J58434m000J68526q3603o7554J32988L76142n7844k37707
14025a64048k68928K12934J52077L90086L67875k93046r7429K18629r2100k93269
14015A32781j78500l72235m8070K73621Q5195M2264K43582j8027K807l6851l0699
14004I5868l69102j67174M9314R9607J58271L35702J00945k36203k59012m4146
$$ y = [535730, 155949, -238359, -363362, -160010, -483174, -499404, -471701, -35720, -37957, -52838, -104040, 85001, 208561, 1007, -82014, -125620, -45485, 135592, 363124, 243393, 309085, 572685, 452399, 145008, -94732, -131519, 13215, 164367, 194136, -22239, -229662, -225135, -183915, -130686, 144201, -31155, -259030, -91371, -88845, -202078, -407349, -549430, -390996, -394996, -226470, -310073, -377627, -244639, 131503, 73659, -164048, -432976, -220042, -67965, 322121, 689996, 396950, 299521, 518150, 426050, 132781, -45719, -417954, -466024, -192403, -107208, -64944, 178638, 160611, 163418, 126567, 95868, -273234, -440408, -391094, -291487, -133216, 202486, 303431, 67228, -191784, -235930]
13994b35930J37079k04583k33836J37204K08053J33484J47405j50625k35396r0176
13984c87321j04740J72633M86599J8071L339N9898j11026l538o6588N7623J54069
13973B79019p0054K81603L66688k82574l72951O2647l94761J5418j58271j00732
13963c73968K90056J07021j29278k55031J0160K29705O9326K23061j87842k04901
13953b21691j68199N5558O588j50198Q2434M52527M00971K07418j4642K07464
13943H58230J21437m33950k81284k45841J142N129K8741K06823o4463J11467o8644
13932B38787j87736o0651L03204o4409J59943J25044m26973M0981M6890j46929
13922B8151J4550j47718j04231k1004J52772J9559L07286K7739j93964l7703q7084
$$ y = [-235930, -98851, -303434, -537270, -400066, -192013, -58529, 88876, -61749, -297145, -387321, -492061, -319428, 167171, 185242, 188581, 248479, 137453, 133915, 67327, 124950, 279019, 208965, 490568, 857256, 574682, 201731, 264378, -130383, -114965, -273236, -373968, -83912, 23109, -106169, -361200, -351040, -121335, -52009, 171052, -16790, -221691, -389890, -334332, -327744, -477942, -395508, 57019, 457990, 665408, 650766, 858230, 979667, 545717, 264433, 18592, 19734, 24863, 53604, 260427, 195964, 307431, 238787, 51051, -9600, 293604, 229195, 389138, 514182, 87209, 128190, 175080, 28151, 42701, -105017, -209248, -230252, -77480, -57921, 249365, 277104, 83140, 45437, -41647]
13911d1647R673k12997l24425L62899m000k01352J44959K95745K55047Q807k04657
13900H8052j78322m49K51062p0887J14874O738k09735J55512M6875K16994m8731
13889C71983k63867j26474p738R2011R6818M03873q014l61091m31925k66984J05391
13878c96017m510L081K44872M78809j2827j31772p5651n8623M5779J4425J2734
13867A20300j85381J9709J97807n1158k43337k04166l1129P4882M9554o8712J21354
13856b00277L70867L13677k54458R8203M0086j14873p9801K46062j90347k28273
13846H66J18303l57494p1414K26913K58759j411j20877m27925J29034j05568k5834
13835c76648J00483N2125j61963K17568M7525P8990q3850J71195M97605j02907
$$ y = [-41647, -31974, -244971, -569396, -206497, -210497, -411849, -266890, 28855, 283902, 292709, 88052, -90270, -90719, 160343, 89456, 204330, 211068, 1333, 156845, 203720, 420714, 371983, 108116, -18358, -26096, 65915, 162733, 566606, 558592, 197501, -234424, -501408, -396017, -400527, -397446, -152574, 326235, 313408, 181636, 105985, 47362, 93141, 107566, 120300, -65081, -45372, 152435, 101277, -142060, -346226, -377355, -302473, -252919, -321631, -200277, 170590, 484267, 229809, 328012, 368098, 253225, 173424, 419486, 229139, 866, 119169, -238325, -309739, -82826, 175933, 174522, 53645, -374280, -245246, -350814, -376648, -276165, -224040, -386003, -168435, -120910, -41920, -125770, 45425, 543030, 440123]
13825D40123K2461k30366j78878j00646K98288j31714Q4721Q2344l20108K52297
13815B18522L90723j20397k09300O6900J69663J98451k87380m94996o038K00269
13805A26417J87809n6130J60564J99894P8101j63611J45347r5176j53628n5720
13795C73867k57515j61545R0985j90381J61842J06387j27686m76087j99621J29157
13785e50597N13897K98857o9177l0813J22057Q322J26897j53279J01167J53727
13775E21058l82437k11648j98016R4609l37139j57144Q694K41135J87991J83268
13765d9629J72402j94374r5473J66846N3940r9806R7125K74676k70174o05487
13755e49954j14768K50792l6149K10300K27253J98875k46156j41701K07864K3733
$$ y = [440123, 462584, 232218, 53340, -47306, 250982, 119268, 203989, 286333, -33775, 218522, 609245, 488848, 279548, 346448, 516111, 714562, 427182, -67814, -73852, 126417, 314226, 258096, 418660, 618554, 696655, 533044, 678391, 583215, 429587, 373867, 116352, -45193, 45792, -144589, 17253, 123640, -4046, -480133, -679754, -550597, -36700, 262157, 192980, 162167, 284224, 292546, 419443, 266164, 367331, 521058, 138621, -73027, -271043, -176434, -513573, -670717, -662023, -420888, -232897, -49629, 122773, -71601, -167074, -228, 53712, -46094, 51031, 325707, 55533, -549954, -664722, -413930, -450079, -239779, -12526, 186349, -59807, -201508, 6356, 30089]
13745C0089Q4628m4098q9003j41837R2119J13767J71160J98687M3552k50012J79114
13734C88166P7722k32652m08048N921K28272n831j79455Q3945r5901J26450N06045
13723D94634P9610N9345O0788l71614N3527j29658j48867n6083J61333m2551r4119
13712F6345k76502L4355j41251M20670J83719j44227j7002j39083J57927k28653
13702h3702l5720n8868L40889r1039j32970j118L9964R5604J22474K56142K16430
13691F68086j42200k99879l64201k59062K88461J66220k44626l32103P8974L33092
13681a07238l5282n603M824n0073K79188P5388l85319j36373j45883L47141J28847
13670c0383L410K95292n4k99399l13646L3728M80416j42462O0890j88899l05080
$$ y = [30089, 114717, 70619, -18384, -160221, -68102, 45665, 216825, 415512, 459064, 209052, 388166, 465888, 233236, -174812, -168891, 59381, 53550, -125905, -41960, -137861, -11411, 494634, 574244, 633589, 694377, 322763, 376290, 246632, 97765, 41682, 203015, 160464, 66345, -210157, -175802, -317053, 103617, 287336, 143109, 126107, -12976, 144951, -83702, -119422, -178290, 162599, 71560, -61410, -62528, -22564, 73040, 195514, 451656, 668086, 525886, 226007, -138194, -397256, -108795, 57425, -187201, -519304, -440330, -107238, -142520, -148123, -143299, -193372, 85816, 161204, -224115, -360488, -506371, -159230, -30383, -26973, 268319, 268265, -31134, -344780, -311052, 169364, 26902, 87792, -101107, -406187]
13659d06187j9887j13146K04981L28261K26275p6077L5571l94498L6188j3389
13649a91908L5540q8909m59427J27242L49423K72498k5500k32315l91019J92275
13639d12100M00921L13756K88284Q5080j79108l51448m74089k27611Q5286L59920
13629a11109Q7929q4309J24050M72159k50536l16298j16017K78327Q7601q2994
13619H8803j37932N8837P7023O8332P6129m370J0594M6099j65157J9075j93231
13608e5798k33303k58054M0335M89089K67177K37338j35982m46551k00889j9515
13598c16153K70631k16243j8173L29278Q9320O5910K3867k84340Q0326J45554
13588A69977k79269o5571K31710k35167m3363J25639K18975j14466k33866N6709
$$ y = [-406187, -426074, -539220, -334239, -5978, 220297, 144220, 179791, -214707, -178519, -191908, -156368, -245277, -704704, -577462, -228039, 44459, 18959, -213356, -604375, -412100, -11179, 302577, 590861, 675941, 496833, 145385, -328704, -556315, -471029, -111109, -23180, -107489, 16561, 488720, 238184, -78114, -194131, 84196, 171797, 88803, -49129, 9708, 86731, 155063, 231192, 226822, 237416, 283515, 118358, 137433, -55798, -289101, -547155, -506820, -17731, 249446, 486784, 350802, -95749, -296638, -316153, -45522, -261765, -279938, 49340, 138660, 204570, 228437, -55903, 24423, 169977, -109292, -174863, 56847, -178320, -221683, -96044, 122931, 8465, -225401, -168692]
13578a68692L8296J32704L15007p9229j20073J3521J76906K00729k30108m56122
13568a77061O5456J09654r1740J34615K65998L9999m42765j20991N9096j5358
13558a73097k99381j23055K36250K05738j51306O4989R4109j13949l45742k46527
13548h51971K62831M13185q2550j57617L8883J22754j6619l9179K99159K84995
13538B73871N4118J56817K40535J39171M3581L8048m53583l09800k70226J28061
13528D0593J68989J30528k50311l82399K65831L91871j7925k15163K63899J1164
13518D07077m5333l63622o998K11292J19209K71433J08594o0177l80150k49642
13508A1683L958j54467K15564O32653K09440j06576l29832m98428J67499J50405
$$ y = [-168692, -130396, 2308, 317315, 238086, 118013, 131534, 308440, 509169, 279061, -177061, -111605, -1951, -93691, 40924, 306922, 346921, -95844, -216835, -157739, -173097, -472478, -595533, -359283, -153545, -304851, -239862, -145753, -259702, -605444, -851971, -589140, -175955, -258505, -416122, -377239, -254485, -271104, -310283, -11124, 273871, 327989, 484806, 725341, 864512, 908093, 946141, 492558, 182758, -87468, 40593, 209582, 340110, 89799, -292600, -26769, 365102, 347177, 132014, 395913, 407077, 361744, -1878, -8876, 202416, 321625, 593058, 701652, 641475, 261325, 11683, 15641, -138826, 76738, 709391, 918831, 812255, 482423, -16005, 151494, 301899]
13498C01899j81021j86407L30715P2634j51591m5035N2808K43905K4810Q7431
13488E50148j19418j55365J012l4054m07619o4097J01575P9248M8855J96719p1452
13477A25552O8374J1477J06983j6310l13402k04418j96843L42611L53249j52835
13467A24438J73467P1832j57135m51205l60958P0764K69649l6932K65510J58868
13457A28298L0942j78869J8483o9224M99982K49458l24561n44313L1375L38943
13447A80514Q6992k55530j57038j50157r7720k60000J40570K96016K73420L25663
13437C82730j21946k17699J66077J20410J10571R092k52892j66163l09895j09843
13427c89558k1942J70949J55059l71608N0889N12862k8277l15195J61678L3483
$$ y = [301899, 120878, -65529, 265186, 337820, 186229, 141194, 194002, 437907, 462717, 550148, 430730, 275365, 276377, 242323, -165296, -229393, -127818, -48570, 285, 197004, 125552, 193926, 205403, 312386, 296076, -17326, -221744, -418587, -75976, 277273, 124438, 297905, 369737, 212602, -238603, -599561, -528797, -259148, -296080, -30570, 128298, 159240, -19629, -1146, -70370, 429612, 679070, 354509, -189804, -158429, 180514, 267506, 11976, -145062, -295219, -392939, -652939, -512369, -216353, 57067, 382730, 260784, 43085, 209162, 329572, 440143, 449235, 196343, 30180, -279715, -389558, -411500, -240551, -85492, -457100, -406211, 106651, 78374, -236821, -75143, -41660]
13417d1660j03009r1698K34351k4360j14277K27461n53847l01695K01417N37802
13407b9515K92447j8492l05834K5967l91462k48978N5461J31694K22077K05110
13397f1525L18914J06971l0938j58141q8236j07612j76894j76581K60111L62490
13387B48559j42274p5926J46528l53455j53351L16336L72977K20281K2639j58913
13377D43401l72117k23711m8713k317O3381j7725q1365J07143K60269k5422j34403
13366c1579J2073j35463l05730K56694L90719J14277m34804k1140K45338j88073
13356i7688J72810K12620p0000l95976k84966J978K09810L74287K2852P7265L73790
13345E96782J96897M9513j03643q7575j06354j05802q8594N4028Q0650L13027
$$ y = [-41660, -144669, -236367, -2016, -26376, -140653, 86808, -467039, -768734, -567317, -29515, 262932, 244440, -61394, -35427, -426889, -675867, -620406, -488712, -266635, -61525, 257389, 364360, 333422, 175281, 87045, -20567, -197461, -374042, -113931, 248559, 106285, 30359, 176887, -176568, -329919, -13583, 359394, 579675, 602314, 443401, 71284, -152427, -201140, -203457, -140076, -157801, -239166, -132023, 128246, 102824, -31579, -19506, -154969, -460699, -204005, 186714, 300991, -133813, -154953, 90385, -97688, 75122, 287742, 217742, -178234, -463200, -461222, -251412, 122875, 145727, 222992, 596782, 793679, 843192, 739549, 651974, 545620, 439818, 351224, 405252, 485902, 798929]
13335G98929p347l39029k73516K44202L5630k04290J44828J84269j20754k49576
13325B13346L76144K83605m18956m82791J23674k03861j37755R2736N9275K44402
13315A49819K97212J22285J0977K34066M8343j36841j59110j58833k60482K05837
13305C53273K71219K9425m36632o8245K09683o7127K24985K61968o9924K78255
13295I86880k9714m01557m6809j03944j45118j1292l749K51009l2342k03635l09829
13284e0100j52646J53432K53563K36897m04650Q3541r2189m5083J78432j86584
13274b5387k7113m4430o9703N6403n8347k07652J71794K88878L81620k36800l5400
13263A93863K02938l48657m56278L3149K88558j31743N7877n1309N2984m1034
$$ y = [798929, 791582, 452553, 179037, 423239, 458869, 254579, 399407, 583676, 462922, 213346, 589490, 873095, 454139, -28652, 95022, -108839, -246594, -153858, -94583, 149819, 447031, 569316, 580293, 814359, 862702, 725861, 566751, 407918, 147436, 353273, 624492, 653917, 217285, 149040, 358723, 291596, 516581, 778549, 708625, 986880, 957166, 555609, 508800, 404856, 259738, 248446, 244697, 495706, 463364, 259729, -50100, -202746, -49314, 204249, 441146, 36496, 120037, 27848, -17235, 161197, -25387, -52500, -96930, -166633, -110230, -168577, -376229, -204435, 84443, 466063, 229263, 193863, 396801, 48144, -408134, -374985, -86427, -218170, -160293, -211602, -158618, -199652]
13253a99652j93734J62746J88803l8976N1646M40191J17337p7086K13329m05392
13243B59212j77175j10069K68749K06053j31057j121N7554J11433o8065R6643
13233E12157j76214k28207j69154J73801L28530m6046n033Q0316j14704l33748
13223B1698k55769K725P9082J14454J53405K43227K8179j98129m68688K72964
13213f852L7270j599K23669j17767J07397P753k38798k47240L71966M41880P3425
13202F51104n30776j04420Q8165K32000k0129J1584j07459l33192j79142L35418
13192D3153K59768P0543k66748O3517L59486n5909J6231J43237k63951l50136
13182A9191k99925l9747q2769J69644j85161K01564J96017n4787L36083l6962
$$ y = [-199652, -393386, -230640, -41837, -80813, -29167, 411024, 528361, 451275, 664604, 259212, 82037, -28032, 240717, 446770, 315713, 314592, 372146, 483579, 415514, 512157, 335943, 107736, -61418, 112383, 440913, 394867, 389834, 470150, 355446, 21698, -234071, -231346, -152264, -37810, 115595, 358822, 387001, 188872, -279816, -6852, 30418, 28819, 252488, 134721, 242118, 249871, 11073, -236167, 135799, 577679, 651104, 120328, 15908, 104073, 336073, 315944, 327528, 220069, -113123, -292265, 43153, 302921, 373464, 106716, 170233, 529719, 473810, 490041, 633278, 369327, 19191, -280734, -320481, -403250, -233606, -418767, -217203, -21186, -75973, 260110, 223148]
13172B23148J90190n804L02726k55672k23453k49933m3807M45424K12207L80733
13162I75759K72135J40783J15722k18007l45866k85327Q4030k16729P2055Q4856
13152F79411n51051l0413L36330J51492l4529r9949k91350Q2421K27309J92824
13142F62495q2921j51871J9534K00573p9928o0687M2354k68612m5276J68843m6877
13131C57627J18361k83933k24854M8081J33636J61388j26592j14218J03244J18730
13121B91470K3076j12918K84340O3847k84663K97523K88079L75470J67691q2119
13111A311796k39023L1749j19476j53202j11807l73480K170l0269m2674M50596
13101G26380J52267o3267j34621j81412m2970N0376J03107l39621P591R2434o2860
$$ y = [223148, 413338, 407534, 710260, 454588, 231135, -18798, -62605, 382819, 595026, 975759, 1247894, 1388677, 1504399, 1286392, 940526, 655199, 739229, 522500, 594555, 679411, 128360, 97947, 434277, 585769, 551240, 451291, 159941, 242362, 469671, 662495, 579574, 427703, 447237, 647810, 567882, 507195, 549549, 280937, 235661, 404504, 357627, 475988, 192055, -32799, 15282, 148918, 310306, 183714, 69496, 172740, 291470, 314546, 201628, 485968, 549815, 265152, 562675, 850754, 1226224, 1393915, 1311796, 1072773, 1104522, 985046, 831844, 720037, 346557, 348727, 318458, 275784, 726380, 878647, 815380, 680759, 499347, 456377, 506753, 609860, 270239, 277830, 370264, 307404]
13090C07404k26067L3122m1874K55084L34161N3885J36792j21755r8721J4826
13080F46857j90920k74055m6382K98583o37j70115p0419O21646K74613q7020k04111
13069G98040r5732R9071j16844j31017q9248N7176l48896j14881K96642K04361
13059E58672k23600n440k6607k64959O8060M08380K19164m6169n1951q0286n0306
13048E04958o0002k20200j93710K80247J36707M68075R6108n00703m6198L14929
13038G80211J23718j14585Q5922q4213r1069L08869m2597J21158l3059n21400
13028E32955l24546K23628J73495j70526K60820M9875l48684K56184J25830M50863
13018A229894M9191K43596l93019o43970k14279j08466K13725K06487K14524K16302
$$ y = [307404, 81337, 114459, 72585, 327669, 661830, 715715, 852507, 730752, 632031, 646857, 455937, 181882, 135500, 434083, 433446, 263331, 192912, 814558, 1089171, 1002151, 798040, 702308, 801379, 684535, 553518, 464270, 521446, 172550, 57669, 354311, 558672, 335072, 329632, 303025, 38066, 106126, 514506, 733670, 687501, 635550, 555264, 504958, 444956, 224756, 31046, 311293, 448000, 916075, 1012183, 511480, 465282, 780211, 903929, 789344, 875266, 791053, 699984, 1008853, 966256, 1087414, 1054355, 532955, 208409, 432037, 605532, 435006, 695826, 745701, 397017, 653201, 779031, 1229894, 1279085, 1522681, 1129662, 485692, 271413, 162947, 376672, 583159, 797683, 1013985]
13008A013985p0745L12212Q8798k75130j90359j08806O9855j66254L3932J35301
12998H42789k51011k37113l9569Q3532Q0423Q9092k23087K05195K61349j7286
12988G94314k00228K08462J7440K99462K4976j47565K47465R6469Q5660j48462
$$ y = [1013985, 943240, 1255452, 1344250, 1069120, 878761, 769955, 839810, 673556, 707488, 842789, 591778, 354665, 315096, 398628, 479051, 568143, 345056, 550251, 811600, 794314, 594086, 802548, 819988, 1119450, 1144426, 996861, 1244326, 1340795, 1426455, 1277993]
$$ [...]
##END NTUPLES=NMR SPECTRUM
##END=
