##TITLE=Analysis number 314868
Compound Code dp 01925
Project Code adrs
Chemist Name stores
##JCAMPDX= 6.0         $$ Bruker NMR JCAMP-DX V2.0
##DATA TYPE= NMR SPECTRUM
##DATA CLASS= NTUPLES
##ORIGIN= Bruker BioSpin GmbH
##OWNER= NMR
$$ XWIN-NMR		Version 3.5
$$ Fri Oct 28 11:54:45 2005 GMT Daylight Time (UT+1h)  MAYBRIDGE\NMR@NMR_250MHZ
##.OBSERVE FREQUENCY= 250.131544655141
##.OBSERVE NUCLEUS= ^1H
##.ACQUISITION MODE= SIMULTANEOUS (DQD)
##.ACQUISITION SCHEME= undefined
##.AVERAGES= 16
##.DIGITISER RES= 18
##SPECTROMETER/DATA SYSTEM= dpx250
##.PULSE SEQUENCE= zg30
##.SOLVENT NAME= DMSO
##.SHIFT REFERENCE= (INTERNAL, DMSO, 0, 16.522)
##AUDIT TRAIL= $$ (NUMBER, WHEN, WHO, WHERE, WHAT)
$$ ##TITLE= Audit trail, XWIN-NMR		Version 3.5
$$ ##JCAMPDX= 5.01
$$ ##ORIGIN= Bruker BioSpin GmbH
$$ ##OWNER= NMR
$$ C:\u/data/dgb/nmr/ADRS/11520/pdata/1/auditp.txt
$$ ##AUDIT TRAIL=  $$ (NUMBER, WHEN, WHO, WHERE, WHAT)
(   1,<2005-10-28 11:54:10.71 +100>,<MAYBRIDGE\NMR>,<NMR_250MHZ>,
      <created by zg, POWCHK disabled, PULCHK disabled
       configuration hash MD5:
       62 19 C7 07 E1 42 D1 B7 37 6C 3D D0 77 39 F9 E6
       data hash MD5: 64K
       4A 47 D8 CE 65 CC A8 52 B2 B0 50 45 08 A3 27 44>)
(   2,<2005-10-28 11:54:25.07 +100>,<MAYBRIDGE\NMR>,<NMR_250MHZ>,
      <Start of raw data processing
       ef LB = 0.3 FT_mod = 6 PKNL = 1 SI = 32K 
       data hash MD5: 32K
       EE 49 E2 1A 1B 1B 35 A0 8D 9E 85 97 2D 86 53 1B>)
(   3,<2005-10-28 11:54:30.82 +100>,<MAYBRIDGE\NMR>,<NMR_250MHZ>,
      <apk 
       data hash MD5: 32K
       E1 6A 9B 91 DF C4 04 56 65 6F 37 3C 38 DB 90 0D>)
(   4,<2005-10-28 11:54:32.61 +100>,<MAYBRIDGE\NMR>,<NMR_250MHZ>,
      <abs ABSG = 5 
       data hash MD5: 32K
       1E C3 DD 67 CD 84 B1 7C F0 53 B0 16 88 31 F9 09>)
$$ ##END=
$$ 
$$ hash MD5
$$ B2 6A 53 45 18 07 14 20 17 BA 95 5B 52 E3 C6 49
##$RELAX= 
##$RELAX= 
##$RELAX= 
##$RELAX= 
##$RELAX= 
##$RELAX= 
##$RELAX= 
$$ Bruker specific parameters
$$ --------------------------
##$DU= <C:\u>
##$EXPNO= 11520
##$NAME= <ADRS>
##$PROCNO= 1
##$TYPE= <nmr>
##$USER= <dgb>
##$AMP= (0..31)
100 100 100 100 100 100 100 100 100 100 100 100 100 100 100 100 100 100 
100 100 100 100 100 100 100 100 100 100 100 100 100 100 
##$AQSEQ= 0
##$AQ_mod= 3
##$AUNM= <au_zg>
##$AUTOPOS= <18 >
##$BF1= 250.13
##$BF2= 250.13
##$BF3= 250.13
##$BF4= 250.13
##$BF5= 500.13
##$BF6= 500.13
##$BF7= 500.13
##$BF8= 500.13
##$BYTORDA= 1
##$CFDGTYP= 0
##$CFRGTYP= 5
##$CHEMSTR= <none>
##$CNST= (0..31)
1 1 145 1 1 1 1 1 1 1 1 1 1 1 1 1 1 1 1 1 1 1 1 1 1 1 1 1 1 1 1 1 
##$CPDPRG= <>
##$CPDPRG1= <>
##$CPDPRG2= <>
##$CPDPRG3= <>
##$CPDPRG4= <mlev>
##$CPDPRG5= <mlev>
##$CPDPRG6= <mlev>
##$CPDPRG7= <mlev>
##$CPDPRG8= <mlev>
##$CPDPRGB= <>
##$CPDPRGT= <>
##$D= (0..31)
0 1 0 0 0 0 0 0 0 0.06 0 0 0 0 0 0 0.0002 0 0 0 0 0 0 0 0 0 0 0 0 0 0 
0 
##$DATE= 1130496849
##$DBL= (0..7)
120 120 120 120 120 120 120 120 
##$DBP= (0..7)
150 150 150 150 150 150 150 150 
##$DBP07= 0
##$DBPNAM0= <>
##$DBPNAM1= <>
##$DBPNAM2= <>
$$ [...]
##$SUBNAM7= <"">
##$SUBNAM8= <"">
##$SUBNAM9= <"">
##$SW= 20.6930455092707
##$SWIBOX= (0..15)
0 0 3 0 0 0 0 0 0 0 0 0 0 0 0 0 
##$SW_h= 5175.983436853
##$TD= 65536
##$TD0= 1
##$TE= 295.16
##$TE2= 300
##$TE3= 300
##$TEG= 300
##$TL= (0..7)
0 120 120 120 120 120 120 120 
##$TP= (0..7)
150 150 150 150 150 150 150 150 
##$TP07= 0
##$TPNAME0= <>
##$TPNAME1= <>
##$TPNAME2= <>
##$TPNAME3= <>
##$TPNAME4= <>
##$TPNAME5= <>
##$TPNAME6= <>
##$TPNAME7= <>
##$TPOAL= (0..7)
0.5 0.5 0.5 0.5 0.5 0.5 0.5 0.5 
##$TPOFFS= (0..7)
0 0 0 0 0 0 0 0 
##$TUNHIN= 0
##$TUNHOUT= 0
##$TUNXOUT= 0
##$USERA1= <user>
##$USERA2= <user>
##$USERA3= <user>
##$USERA4= <user>
##$USERA5= <user>
##$V9= 5
##$VALIST= <valist>
##$VCLIST= <CCCCCCCCCCCCCCC>
##$VD= 0
##$VDLIST= <DDDDDDDDDDDDDDD>
##$VPLIST= <PPPPPPPPPPPPPPP>
##$VTLIST= <TTTTTTTTTTTTTTT>
##$WBST= 1024
##$WBSW= 4
##$XGAIN= (0..3)
0 0 0 0 
##$XL= 0
##$YL= 0
##$YMAX_a= 319514
##$YMIN_a= -305679
##$ZGOPTNS= <>
##$ZL1= 120
##$ZL2= 120
##$ZL3= 120
##$ZL4= 120
##$ABSF1= 16.522
##$ABSF2= -4.171173
##$ABSG= 5
##$ABSL= 3
##$ALPHA= 0
##$AQORDER= 0
##$ASSFAC= 0
##$ASSFACI= 0
##$ASSFACX= 0
##$ASSWID= 0
##$AUNMP= <proc_1d>
##$AZFE= 0.1
##$AZFW= 0.1
##$BCFW= 0
##$BC_mod= 0
##$BYTORDP= 0
##$COROFFS= 0
##$CY= 12.5
##$DATMOD= 1
##$DC= 0
##$DFILT= <>
##$DTYPP= 0
##$F1P= 14.0000005364418
##$F2P= -0.99999901652339
##$FCOR= 0.5
##$FTSIZE= 32768
##$FT_mod= 6
##$GAMMA= 0
##$GB= 0
##$INTBC= 1
##$INTSCL= 1
##$ISEN= 128
##$LB= 0.3
##$LEV0= 0
##$LPBIN= 0
##$MAXI= 10000
##$MC2= 0
##$MEAN= 0
##$ME_mod= 0
##$MI= 0
##$NCOEF= 0
##$NC_proc= -5
##$NLEV= 6
##$NOISF1= 0
##$NOISF2= 0
##$NSP= 0
##$NTH_PI= 0
##$NZP= 0
##$OFFSET= 16.522
##$PC= 1
##$PHC0= 69.08611
##$PHC1= 5.832975
##$PH_mod= 1
##$PKNL= yes
##$PPARMOD= 0
##$PSCAL= 4
##$PSIGN= 0
##$REVERSE= no
##$SF= 250.13
##$SI= 32768
##$SIGF1= 0
##$SIGF2= 0
##$SINO= 400
##$SIOLD= 32768
##$SREGLST= <1H.DMSO>
##$SSB= 0
##$STSI= 32768
##$STSR= 0
##$SW_p= 5175.98343685301
##$SYMM= 0
##$S_DEV= 0
##$TDeff= 65536
##$TDoff= 0
##$TI= <Analysis number 999999
Compound Code 99
Book Reference 9
Project Code 9>
##$TILT= no
##$TM1= 0
##$TM2= 0
##$TOPLEV= 0
##$USERP1= <user>
##$USERP2= <user>
##$USERP3= <user>
##$USERP4= <user>
##$USERP5= <user>
##$WDW= 1
##$XDIM= 32768
##$YMAX_p= 405095204
##$YMIN_p= -1085253
$$ End of Bruker specific parameters
$$ ---------------------------------
##NTUPLES= NMR SPECTRUM
##VAR_NAME=  FREQUENCY,     SPECTRUM/REAL,   SPECTRUM/IMAG
##SYMBOL=    X,             R,               I
##VAR_TYPE=  INDEPENDENT,   DEPENDENT,       DEPENDENT
##VAR_FORM=  AFFN,          ASDF,            ASDF
##VAR_DIM=   32768,         32768,           32768
##UNITS=     HZ,            ARBITRARY UNITS, ARBITRARY UNITS
##FACTOR=    0.157963299565203, 1,           1
##FIRST=     4132.6476996994, 0,             0
##LAST=      -1043.33573715361, 0,           0
##MIN=       -1043.33573715361, -1085253,    0
##MAX=       4132.6476996994, 405095204,     0
$$ Real data points
##PAGE= N=1
##DATA TABLE= (X++(R..R)), XYDATA
$$ [...]
15603i4179J01858m6535n0923n9334q9403J03197K8794J16230N6654n3689J97955
$$ -94179 7679 -38856 -89779 -149113 -238516 -135319 -106525 9705 66359 12670 210625
15592B10625k40511r1292R6020K60026j80912j95013J04973M7328j77488J80134
$$ 210625 -29886 -121178 -25158 234868 53956 -141057 -36084 11244 -166244 13890
15582A3890J16850k49323J12930K934N3913k5532k19702j0360P7646J08953K24495
$$ 13890 130740 -118583 -5653 -2719 51194 25662 -194040 -204400 -126754 -17801 206694
15571B06694N6335l08658j71861j83447K373j3810l8452J89439J58469J93011
$$ 206694 263029 -45629 -217490 -400937 -398564 -412374 -450826 -261387 -102918 90093
15561I0093k6522j35146n5385J05767K46388J55592M2739j12063J8429q2275N121
$$ 90093 63571 -71575 -126960 -21193 225195 380787 423526 311463 329892 247617 252738
15550B52738R6745o8799R5856J16038q7758k24166l12774m90834J42204O270J64734
$$ 252738 349483 280684 376540 492578 404820 180654 -132120 -622954 -480750 -474480 -309746
15539c09746J6187j90307M8420m7771j31916j90302N2406L83620K87179M5521
$$ -309746 -293559 -483866 -435446 -483217 -615133 -805435 -753029 -369409 -82230 -36709
15529c6709J21021K7253j02530Q1055L5823K3955J28482j02951P8985K58088k28814
$$ -36709 84312 111565 9035 90090 125913 149868 278350 175399 254384 512472 283658
15518B83658k46942k0725N3377k56169K04966K1561j35622j58375p3568J25095
$$ 283658 36716 15991 69368 -186801 18165 39726 -95896 -254271 -327839 -202744
15508b02744L2198N476o1959K6544K8920J47225L64910j88995k47601n2248k040
$$ -202744 -170546 -165070 -227029 -200485 -171565 -24340 340570 151575 -96026 -148274 -150314
15497a50314J59489K7638M1075O7096K1760K84273j25759k87713m3695J79963
$$ -150314 9175 36813 77888 144984 166744 451017 325258 37545 -6150 173813
15487A73813p2868o8798k09371j60550r9837J53412L5805o8084J20392K2032K7247
$$ 173813 100945 32147 -177224 -337774 -437611 -284199 -248394 -316478 -196086 -174054 -146807
15476a46807J61482j80402j21633O2844J48141r6987q7122O3345K3863K84306
$$ -146807 14675 -165727 -287360 -224516 -76375 -173362 -260484 -197139 -173276 111030
15466A11030L60501j35266j15745K08845J03088L7101J03881p5812m4436k75757
$$ 111030 471531 336265 220520 429365 532453 569554 673435 597623 553187 277430
15456B77430l74894L5202j1310J16863K13463R5561j49281k6181j17886m9845
$$ 277430 -97464 -62262 -73572 43291 256754 352315 203034 176853 58967 9122
15446I122l6196j89586m1671K8566J03577k12167j89717K9822J25730p0521J2396
$$ 9122 -27074 -216660 -258331 -229765 -126188 -338355 -528072 -498250 -372520 -443041 -430645
15435d30645J49980K04427N6526J14732j81864j56829j53258j1922l6877R6630
$$ -430645 -280665 -76238 -19712 95020 -86844 -243673 -396931 -408853 -445730 -349100
15425c49100K18709O4863q7467O7077k05746n3390K87941L51457J1091j08236
$$ -349100 -130391 -65528 -152995 -85918 -291664 -345054 -57113 294344 305435 197199
15415A97199p7909j88937j18672J13238M29458p6674k45628L1688K428l4873M2090
$$ 197199 119290 -69647 -188319 -75081 354377 277703 32075 63763 66191 31318 73408
15404G3408J76727M8097k17718K9472j14878J8679j02701j2210r657K22202K51924
$$ 73408 250135 298232 80514 109986 -4892 13787 -88914 -101124 -110781 111421 363345
15393C63345k59637j29656J18699j0638J15438J37944r9593j96311J57465Q9010
$$ 363345 103708 -25948 92751 82113 197551 335495 235902 39591 197056 286066
15383B86066j86490j90291K1460J50576K52817k4225j01385L8902k98473j40518
$$ 286066 99576 -90715 -69255 81321 334138 309913 208528 247430 -51043 -191561
15373a91561k36635j755N1950K28624K70480K0507j65666n5355K40517J33178
$$ -191561 -428196 -429951 -378001 -149377 121103 141610 -24056 -79411 161106 294284
15363B94284P2929K0864j11095j51094j93407m1686K46899O2990j17435j30289
$$ 294284 367213 388077 276982 125888 -67519 -109205 137694 200684 83249 -47040
15353d7040Q276o9132R6938P4742M6888j45098j06758K37961m4486Q9530K06144
$$ -47040 -38764 -107896 -10958 63784 110672 -34426 -141184 96777 52291 141821 347965
15342C47965r701l37291j61509K37120M42138J66891l86186j33884J97646j70794
$$ 347965 338264 973 -160536 76584 518722 685613 299427 165543 363189 192395
15332A92395j92727j18812l6980j62350r6817K69032L71068N5727m9809J0592
$$ 192395 -332 -119144 -156124 -318474 -415291 -146259 224809 280536 230727 241319
15322B41319p1666p8780k51431m8431L22058j67338O3827K56020j55793r5813
$$ 241319 169653 90873 -160558 -208989 113069 -54269 9558 265578 109785 13972
15312A3972j0604N5134q4280l3063q2955N4524j3669Q0955k6243J02787J99419
$$ 13972 3368 58502 -25778 -58841 -141796 -87272 -100941 -19986 -46229 56558 255977
15301B55977k20058k78683J0884o1893P7734r0515j88219J37826K38861J14849
$$ 255977 35919 -242764 -231880 -293773 -216039 -306554 -494773 -356947 -118086 -3237
15291c237q4613r0174J03608p1246j72948j42623N0634J16302m2172j70153J38065
$$ -3237 -87850 -178024 -74416 -145662 -318610 -461233 -410599 -294297 -336469 -506622 -368557
15280c68557K81164q5861j49999J96704J64339p3981K5139o7391J65512J66516
$$ -368557 -87393 -173254 -323253 -126549 37790 -36191 -11052 -78443 87069 253585
15270B53585J35993j59907m59824j69657J09980o6057J28521j10775r0019L13006
$$ 253585 389578 229671 -230153 -399810 -289830 -355887 -227366 -338141 -428160 -115154
15260a15154Q3563P1647p365P236J3959j39069P3335m7621j21158Q52P0913m562
$$ -115154 -31591 40056 32691 39927 53886 -85183 -11848 -59469 -180627 -179775 -108862 -113424
15248a13424j71731P9197K70751J70285Q964j31792m0800J1083r0909O978Q6959
$$ -113424 -285155 -205958 64793 235078 244042 112250 71450 82533 -8376 -1398 85561
15237H5561j66257l1942O6187J08347j68223k97990J11853O2951L8300N6608Q7336
$$ 85561 -80696 -112638 -46451 61896 -106327 -404317 -292464 -229513 -191213 -134605 -47269
15226d7269N1331j11981k04168K8193K00514q2677n4888p2897J04761k62558n0603
$$ -47269 4062 -107919 -312087 -283894 -83380 -166057 -220945 -293842 -189081 -451639 -502242
15215e02242K22961J56468J37275k7036O0389j0843L3798J27324K52194k83197
$$ -502242 -279281 -122813 14462 -12574 47815 36972 70770 198094 450288 167091
15205A67091K0911O108j71213k908K38420l3796j38293j67743j55730q9019o9391
$$ 167091 188002 194110 22897 19989 258409 224613 86320 -81423 -237153 -326172 -395563
15194c95563m6976M4399L32273K75137R727m1035m1686J92557l6216J4774M764
$$ -395563 -442539 -398140 -65867 209270 218997 177962 136276 328833 292617 307391 312155
15183C12155l3218q3286j31013j28008l12893J04283J87544k64436N2571Q2326
$$ 312155 278937 195651 64638 -63370 -376263 -271980 -84436 -348872 -296301 -213975
15173b13975J16455q973l70719l3434K26783K15275N5261k96n5410p9556j15074
$$ -213975 -97520 -106493 -477212 -510646 -283863 -68588 -13327 -13623 -69033 -148589 -263663
15162b63663J16197p9619Q4556K56031j17257J79446n6904j26845k27118L477
$$ -263663 -147466 -227085 -142529 113502 -3755 175691 118787 -8058 -235176 -231699
15152b31699L02610J45119l42902j3177Q3726O8263K16443M89l68134n1900r618
$$ -231699 70911 216030 -126872 -140049 -56323 11940 228383 228872 -139262 -191162 -200780
15141b00780L01083m5695l39643j15790M7785J27542o4338k8483K37218J16085
$$ -200780 100303 54608 -285035 -400825 -353040 -225498 -289836 -318319 -81101 34984
15131C4984K39266j97995p9730l8110o2769j38533j81532K12959L40602N9993
$$ 34984 274250 76255 -3475 -41585 -104354 -242887 -424419 -211460 129142 189135
15121A89135J89095k02073l91474j68268Q5490L07618N08304J81916k17049j12215
$$ 189135 378230 176157 -215317 -383585 -298095 9523 517827 699743 482694 370479
15111C70479j21820k64771p4838l8839J999J61433K82301k57597M6145K09985
$$ 370479 248659 -16112 -90950 -129789 -127790 33643 315944 58347 104492 314477
15101C14477j22148p0816M191J40753O7735l94242j94141r9638r2359J41130L6263
$$ 314477 192329 121513 125704 266457 334192 -60050 -254191 -353829 -446188 -305058 -268795
15090b68795J42723K22533J4787j80771r4172K47524J99258J81413p6279k74808
$$ -268795 -126072 96461 111248 -69523 -163695 83829 283087 464500 388221 113413
15080A13413j8459k00701j74543J89878K45571j06972J17371K81445K636K23929
$$ 113413 94954 -105747 -280290 -90412 155159 48187 165558 447003 449639 673568
15070F73568J08875j02879l72203p7170j7976k31191j58742j82669n939P6023
$$ 673568 782443 679564 307361 230191 212215 -18976 -177718 -360387 -366326 -290303
15060b90303O7670k03918n4170J42883K74239K42724k07871j20000k77606O8191
$$ -290303 -222633 -426551 -480721 -337838 -63599 179125 -28746 -148746 -426352 -358161
15050c58161K47364N6777J84107k4991o5579K96886O4456j96331p5556K22L5559
$$ -358161 -110797 -54020 130087 105096 39517 336403 400859 204528 128972 129194 164753
15039A64753p7858N2633j5146m50332n5557L72257N2886J83471J70040j57031
$$ 164753 86895 139528 124382 -325950 -381507 -9250 43636 227107 397147 240116
15029B40116k77632j30671J59717o1880k58668L2176Q1493N7392J22046J25740
$$ 240116 -37516 -168187 -8470 -70350 -329018 -296842 -215349 -157957 -35911 89829
15019H9829J42116R9639k09885k77554r7300O7479l860K92295R1918n3702M0168
$$ 89829 231945 331584 121699 -155855 -253155 -185676 -189536 102759 194677 140975 181143
15008A81143J83619K34639K62944k25439m16454J33096P8538l89530j46927m649
$$ 181143 364762 599401 862345 636906 220452 353548 432086 42556 -104371 -109020
14998a09020l3894l10513j06799J21953L7170L72310J65764k38901J51698J28245
$$ -109020 -142914 -453427 -560226 -438273 -401103 -28793 136971 -101930 49768 178013
14988A78013k4687J7920K14065k27453N3428K14478Q9235R0001K1982j63330k52203
$$ 178013 153326 171246 385311 157858 211286 425764 514999 605000 626982 463652 211449
14977B11449k14345J40923N2193j52404j19135J18841Q5395j26760k67324R6161
$$ 211449 -2896 138027 190220 37816 -81319 37522 122917 -3843 -271167 -175006
14967a75006J56959N3159J08910J66850k66806J57548L4463J0409K36155K3079
$$ -175006 -18047 35112 144022 310872 44066 201614 236077 246486 482641 505720
14957E05720j71078K1805k51151j74866K68468k75924l43822K63232Q1868R8304
$$ 505720 334642 356447 105296 -69570 198898 -77026 -420848 -157616 -75748 22556
14947B2556J99653j37623l52489N2218J01587j35706L0025J48618r9579O1428
$$ 22556 222209 84586 -267903 -215685 -114098 -249804 -219779 -71161 -170740 -109312
14937a09312O0486k55115K15748K90310j74137k967R2401o1203j0536q0456J59907
$$ -109312 -48826 -303941 -88193 202117 27980 25013 117414 56211 45675 -34781 125126
14926A25126J87710P1784J05963r5349j51192l3835J8624r7803q3044j8340J70846
$$ 125126 312836 384620 490583 395234 244042 210207 228831 131028 47984 29644 200490
14915B00490J91392k09273o5328P0203k22517k16910L19367j05821l1745N7070
$$ 200490 391882 182609 117281 187484 -35033 -251943 67424 -38397 -70142 -13072
14905a3072r0376n3400k9946L4431n8336M22079k9790j33508j955j13772p671
$$ -13072 -103448 -156848 -186794 -152363 -210699 211380 181590 48082 46127 -67645 -75316
14894g5316N1447l32813k15135M4238J37862J58050J96N911n3068j48872K30124
$$ -75316 -23869 -356682 -571817 -527579 -389717 -231667 -231471 -225560 -278628 -427500 -197376
14883a97376K19138M21821j08960j09916J46582j3673r5669k14054o426o8455
$$ -197376 21762 443583 334623 224707 371289 357616 261947 47893 41467 -26988
14873b6988j02908j68487K19030M40654M0286l58921k26127j29312Q0680L02824
$$ -26988 -129896 -298383 -79353 361301 401587 42666 -183461 -312773 -232093 70731
14863G0731K4629j63344P4447q4791J77997L424r0432j88337j23700J32079J20404
$$ 70731 95360 -67984 6463 -78328 99669 103093 12661 -175676 -299376 -167297 -46893
14852d6893J2032k39694J816J32825R9006J79295n2145O0580L4736j5073j99944
$$ -46893 -34861 -274555 -272739 -139914 -40908 138387 86242 146822 181558 166485 -33459
14841c3459O8621J25119l34354N9371R2833O2762j64085k05853L01016K84849
$$ -33459 35162 160281 -174073 -114702 -21869 40893 -123192 -329045 -28029 256820
14831B56820J01508j30251r0384q9007J91172R0784M5896j83812J68477j49879
$$ 256820 358328 228077 137693 48686 239858 330642 376538 192726 361203 211324
14821B11324M7275l6264m11623O6583L58158N821o3611p3058j59541j30513j27843
$$ 211324 258599 222335 -189288 -122705 235453 241274 177663 104605 -54936 -185449 -313292
14810c13292J55181k466J4382P6088j8887P7902K24548L13827J97475k11706l71429
$$ -313292 -158111 -160577 -146195 -70107 -88994 -11092 213456 527283 724758 513052 141623
14799A41623k01093K70559K31701j52947k30917L8214k01819j85032P2072q7271
$$ 141623 -59470 211089 442790 289843 58926 97140 -104679 -289711 -217639 -304910
14789c04910J05376N7062J68376o536j30664j48998O4950Q0360l21191J9143K24609
$$ -304910 -199534 -142472 25904 19368 -111296 -260294 -195344 -114984 -436175 -417032 -192423
14778a92423N5012K62681P9253M6936K64321r5692o5508L415L8692r0894M5627
$$ -192423 -137411 125270 204523 251459 515780 420088 354580 357995 396687 305793 351420
14767C51420q492N1690M4716j93602M5719R5059j06609o7701K3959J32003M479
$$ 351420 342928 394618 439334 245732 291451 386510 279901 212200 236159 368162 372641
14756C72641J0417Q370l15760m7636L45372J24719k60151l6751k89288j10182
$$ 372641 383058 391428 75668 28032 373404 498123 237972 201221 -88067 -198249
14746a98249q2880J87471J45529J64986o9140m9307q5461N2838J51808p3156j01384
$$ -198249 -281129 -93658 51871 216857 147717 98410 12949 65787 217595 144439 43055
14735D3055J66930J40737O7126k90657k80608k81889O6903J28863k943M0505j52848
$$ 43055 209985 350722 417848 127191 -153417 -435306 -368403 -239540 -242483 -201978 -354826
14724c54826J69865K43894j42370k41484J07071K27622o606q9234J35556j8494
$$ -354826 -184961 58933 -83437 -324921 -217850 9772 3166 -86068 49488 30994
14714C0994l77645j44742K91301J97116J62914Q8272K03525L35460m4372k21629
$$ 30994 -346651 -491393 -200092 -2976 159938 248210 451735 787195 742823 521194
14704E21194j27337p0283J01828j77102J23125Q727K1401j77314k74127l3592
$$ 521194 393857 323574 425402 248300 371425 380152 401553 224239 -49888 -83480
14694h3480N5395J33610M1570j1704k6615R6466j11283l65778p395l2730J68571
$$ -83480 -28085 105525 147095 135391 108776 205242 93959 -271819 -279214 -311944 -143373
14683a43373J17286J11755j45299j15573O0834m8455Q5288L41817O8920j99447
$$ -143373 -26087 85668 -59631 -175204 -114370 -162825 -77537 264280 333200 133753
14673A33753j30519J39765J99822o9672j30716J54613Q9247J24978N140l43153
$$ 133753 3234 142999 342821 273149 142433 297046 386293 511271 516411 173258
14663A73258k42280k27249J17698K04264l2913r0806J94017j60981k31949O8497
$$ 173258 -69022 -296271 -178573 25691 -7222 -98028 95989 -64992 -296941 -228444
14653b28444K10470L00245r1367k16484R8112j65533k2019J16935K07771p0574
$$ -228444 -17974 282271 190904 -25580 72532 -93001 -115020 1915 209686 139112
14643A39112k17909N8630p1509k0491j57014Q7577P2088K85234O924j31315o1264
$$ 139112 -78797 -20167 -91676 -112167 -269181 -181604 -109516 175718 182642 51327 -9937
14632i937M5991J0196l42951m0647K86127J32349J23696J11885j53427k34072
$$ -9937 36054 46250 -296701 -337348 -51221 81128 204824 316709 163282 -70790
14622g0790N7084j91232j53796j2530M1827K69818L80061k98495M526p7689Q7460
$$ -70790 -13706 -204938 -358734 -371264 -329437 -59619 320442 21947 26473 -51216 36244
14611C6244j66342M1553n8308L8926O5618J28611l751J72184J23546k76113J6347
$$ 36244 -130098 -88545 -146853 -107927 -42309 86302 82551 254735 378281 102168 118515
14600A18515k1141L1032K85973J50155J80261M3105R560j90795l14343j54026
$$ 118515 97374 128406 414379 564534 744795 787900 797460 606665 292322 138296
14590A38296P697k50608l2624K43238j03694J02948J78315J27764n2697J411j4204
$$ 138296 145993 -104615 -137239 105999 2305 105253 283568 411332 358635 360046 345842
14579C45842k50911m94721j2658K62832O4999k38594k03568R7879J15146j3244
$$ 345842 94931 -399790 -412448 -149616 -84617 -323211 -526779 -428900 -313754 -326998
14569c26998r5223j58303L6979J27625k8312M540M2010K63961j1879k9404j88754
$$ -326998 -422221 -580524 -543545 -415920 -444232 -439692 -397682 -133721 -145600 -175004 -363758
14558c63758L1509K3178P4519j22573K09806J01142J96138L18231j80348j65365
$$ -363758 -332249 -309071 -234552 -357125 -147319 -46177 149961 468192 287844 122479
14548A22479p3959J01222j89935O4316O5113R4116J34093N2486k47628l16708
$$ 122479 48520 149742 -40193 24123 89236 183352 317445 369931 122303 -194405
14538a94405j62004Q8335k87070J6253K46943J38473J40803J19023K21952O0730
$$ -194405 -356409 -268074 -555144 -538891 -291948 -153475 -12672 106351 328303 389033
14528C89033J18000J0844n4088o1747k34540k21947J414O9072J1399J3512L8847
$$ 389033 507033 517877 463789 402042 167502 -54445 -53031 16041 27440 40952 79799
14517G9799L59831L2773k23227q6512O3313l53206p7489K14P6439k2444R340K59509
$$ 79799 439630 472403 249176 162664 225977 -127229 -204718 -204504 -128065 -150509 -141169 118340
14505A18340l1208N3538O3116j97626j54536O3177j02979J44329P5145j86594
$$ 118340 87132 140670 203786 6160 -148376 -85199 -188178 -43849 31296 -155298
14495a55298J7152k76146j13524J82476l9379J93253J39141P9009J61162J9907
$$ -155298 -138146 -414292 -527816 -345340 -384719 -191466 -52325 26684 187846 207753
14485B07753l20409J03693J54562j5335k92359O6240m4809m25926Q0211L50486
$$ 207753 -112656 -8963 145599 130264 -162095 -95855 -140664 -566590 -486379 -135893
14475a35893J3403O337J18545J60033j16333j19527j16482L39813J81194p0908
$$ -135893 -122490 -116153 2392 162425 46092 -73435 -189917 149896 331090 260182
14465B60182q3617j69003j74415J44361J42771K04956j8606k27170o7321K12943
$$ 260182 176565 7562 -166853 -22492 120279 325235 306629 79459 12138 225081
14455B25081j45239j61424l3214p6108R8727k86335n3121Q5523j64430J18437
$$ 225081 79842 -81582 -114796 -190904 -92177 -378512 -431633 -346110 -510540 -392103
14445c92103N4336m9015j15980K58175M94774M0093Q7710k13107n5161P5946j72245
$$ -392103 -337767 -386782 -502762 -244587 250187 290280 377990 164883 109722 185668 13423
14434A3423j34348R5314R7382q3869P8176N4884p2612k19240p1675O815q3530
$$ 13423 -120925 -25611 71771 -12098 66078 120962 48350 -170890 -242565 -235750 -319280
14423c19280m4927O4571J70130R8709L1092J62520j04461j16597J33287L26186
$$ -319280 -364207 -299636 -129506 -30797 295 162815 58354 -58243 75044 401230
14413D01230j72222l60285M6342O1120l52246r3158L12692J10701K61106j15668
$$ 401230 229008 -131277 -84935 -23815 -376061 -469219 -156527 -45826 215280 99612
14403I9612k9889J18280J03518q7415m8137j1602M2568j18754j0990K60478j23632
$$ 99612 69723 188003 291521 204106 155969 144367 186935 68181 57191 317669 194037
14392A94037k68558P0954p3972j29284L309K84714K2165l7015J27710j17976j45360
$$ 194037 -74521 -3567 -77539 -206823 -203514 81200 103365 66350 194060 76084 -69276
14381f9276Q9725O3192q5032j20988r5466j73158J76927L97526K17719j39749
$$ -69276 20449 83641 -1391 -122379 -217845 -391003 -214076 183450 401169 261420
14371B61420M7537Q4297k90798m943L9967j14459j56603L7160J3862O3752Q6947
$$ 261420 308957 393254 102456 97513 137480 23021 -133582 -96422 -82560 -18808 68139
14360F8139j99947j37066M6049K74451L37647K82405L537k97536j77142j10903
$$ 68139 -131808 -268874 -222825 51626 389273 671678 675215 377679 200537 89634
14350H9634K0743M0258j37951J31882K43098J14758k64326k99281p9452J66421
$$ 89634 110377 150635 12684 144566 387664 502422 238096 -61185 -140637 25784
14340B5784J02313k06387K6408Q841o9102j16543r8122j89372K16969J36296J49612
$$ 25784 128097 -78290 -51882 -43041 -112143 -228686 -326808 -516180 -299211 -162915 -13303
14329a3303K20926k46286k74141R8228K33504K7889P0899k4498j89274J12222
$$ -13303 207623 -38663 -312804 -214576 18928 46817 117716 93218 -96056 16166
14319A6166J6198m6521P5845K0431l7190Q5490k4824k20017j11527J00996L56659
$$ 16166 32364 -14157 61688 82119 44929 130419 105595 -114422 -225949 -124953 231706
14308B31706R7286q9387o759o3957j6684k4111l3719K88807j16603j30565K76385
$$ 231706 328992 239605 232846 168889 152205 128094 94375 383182 266579 136014 412399
14297D12399Q5354K5345k35713o3679j85151K10783k3316J5516o0821j40439N6386
$$ 412399 497753 523098 287385 223706 38555 249338 226022 241538 180717 40278 96664
14286I6664j1803j20599k19899Q0842J81462Q4701j88353J91845K75317j07763
$$ 96664 84861 -35738 -255637 -174795 6667 91368 -96985 94860 370177 262414
14276B62414l46223l15574j8508J12921N5719J51545N0540O5086J2283R2806r5648
$$ 262414 -83809 -399383 -417891 -304970 -249251 -97706 -47166 17920 30203 123009 27361
14265B7361J95386j17799j71580L9418j0826q1860K8761J1581j8557Q175J8885
$$ 27361 222747 104948 -66632 -27214 -38040 -119900 -91139 -79558 -98115 -89940 -71055
14254g1055l8551O292O2893J11764J01415n0599K13154k08811j84578J68447k0959
$$ -71055 -109606 -103314 -40421 71343 172758 122159 335313 126502 -58076 110371 89412
14243H9412k05927l05404j33370J62845L29946j00306M3946K0102O9376j30461
$$ 89412 -116515 -421919 -555289 -392444 -62498 -162804 -118858 -98756 -29380 -159841
14233a59841j93841L46478J08311n8154P5104j40553r8094m2795K9978l4196L565
$$ -159841 -353682 -7204 101107 42953 118057 -22496 -120590 -163385 -133407 -167603 -164038
14222a64038M7698J23256q5837n8437J46119l6555M1060J60826L9673L9311n0168
$$ -164038 -116340 6916 -78921 -137358 8761 -27794 13266 174092 213765 253076 202908
14211B02908j35307j2166J06985J09589M5407j99002k08343r5790j47631n293
$$ 202908 67601 55435 162420 272009 317416 118414 -89929 -185719 -333350 -338643
14201c38643K82986P2416r6851J92732j75657j63183J12489j06994n7327k84120
$$ -338643 -55657 16759 -80092 112640 -63017 -226200 -113711 -220705 -278032 -562152
14191e62152R8498J74753L21243j20332m8603K43544n0615j96116j48173J7355
$$ -562152 -463654 -288901 32342 -87990 -136593 106951 56336 -139780 -287953 -270598
14181b70598J1780j62211J17066K42719P7918K60118j10183j12585N2184k72654
$$ -270598 -258818 -421029 -303963 -61244 16674 276792 166609 54024 106208 -166446
14171a66446k16722P3688j40217J43102J21166L57896l7876k12626k57111r6791
$$ -166446 -383168 -309480 -449697 -306595 -185429 172467 134591 -78035 -335146 -431937
14161d31937k3028K79703J30998M7185j20980o8543N0810R6505J36899j93974
$$ -431937 -454965 -175262 -44264 2921 -118059 -186602 -135792 -39287 97612 -96362
14151i6362L6182J3568J70884K10286r2393k42637k35151P9356j98257l8597K1690
$$ -96362 -60180 -46612 124272 334558 242165 -472 -235623 -156267 -354524 -393121 -371431
14140c71431r8287L52015K63612O8281L534M9582k80147k70357K877j99562L6634
$$ -371431 -469718 -117703 145909 214190 217724 267306 -12841 -283198 -280321 -479883 -443249
14129d43249R9397N9528J89199L66435j52611k0561l91760R540j2393k18421p1177
$$ -443249 -343852 -284324 -95125 271310 118699 98138 -293622 -284082 -296475 -514896 -586073
14118e86073J75544J81147L90122J24981l22350m50895K9271N3570k768K5680
$$ -586073 -410529 -229382 160740 285721 -36629 -487524 -458253 -404683 -407451 -381771
14108c81771J11400L2297J43680K57053Q6221O160k80090l14743M66290M61203
$$ -381771 -270371 -238074 -94394 162659 248880 255040 -25050 -339793 126497 587700
14098E87700j39721j52221k10196m5488O3796O5274j0737k26293j34365L33070
$$ 587700 447979 295758 85562 40074 103870 169144 158407 -67886 -202251 130819
14088A30819J4691l5324o0550P3782J44046j04816j92964j34391K50924J07526
$$ 130819 145510 110186 49636 123418 267464 162648 -30316 -164707 86217 193743
14078A93743j35593l47111j799J07834J4154k8210o8247L13736J37960J90503
$$ 193743 58150 -288961 -290760 -182926 -168772 -196982 -265229 48507 186467 376970
14068C76970j22512l12132r6361K38547K99362j27757K5146L3303q4683K3760
$$ 376970 254458 -57674 -154035 84512 383874 256117 281263 314566 229883 253643
14058B53643J4280J7710r6019J93414J76591j76018k24987j92050P1472O9111
$$ 253643 267923 285633 189614 383028 559619 383601 158614 -33436 38036 107147
14048A07147j24158l59746j73022j81842K06839J95519r8153P4142N5218j15453
$$ 107147 -17011 -376757 -549779 -731621 -524782 -329263 -427416 -353274 -298056 -413509
14038d13509J25381K8049J72264L5072L6193L184j65492K47449K02644k32333
$$ -413509 -288128 -260079 -87815 -52743 -16550 -13366 -178858 68591 271235 38902
14028C8902o3848r3379q4361J37645J00567j96944k36738J91710J54499j34340
$$ 38902 -24946 -118325 -202686 -65041 35526 -161418 -398156 -206446 -51947 -186287
14018a86287L59100J0999k19023k0242j3544J90486N6689J28897R0097j2494L1005
$$ -186287 172813 183812 -35211 -55453 -68997 121489 178178 307075 397172 384678 415683
14007D15683k82962k54577j40124k89647L3335J09795J7548r1307L7650n8502
$$ 415683 132721 -121856 -261980 -551627 -518292 -408497 -390949 -482256 -444606 -503108
13997e03108J64858L14282J71619L528l03788j7314o0578l13642J9394j42195
$$ -503108 -338250 -23968 147651 151179 -152609 -169923 -230501 -544143 -524749 -666944
13987f66944J35598M16738j14807J21703J03100k98789j64877K21247J23407L44692
$$ -666944 -531346 -114608 -229415 -107712 -4612 -303401 -468278 -247031 -123624 221068
13977B21068J94966m706l13590L6767J8957j69127r9338m585N9379o6168L61724
$$ 221068 416034 411328 97738 134505 153462 -15665 -115003 -119588 -60209 -126377 235347
13966B35347N2966M9450J37550j59903l04920j42407K0238J25929M3766j15909
$$ 235347 288313 337763 475313 315410 10490 -131917 -111679 14250 58016 -57893
13956e7893j70705K28217J90052j15916M8955J93290P3551j97804r3654K072O9578
$$ -57893 -228598 -381 189671 73755 122710 316000 389551 191747 98093 100165 169743
13945A69743j48793o0892K45506r9371j96365l02388N6294q2850j14978P1939
$$ 169743 20950 -39942 205564 106193 -90172 -392560 -336266 -419116 -534094 -462155
13935d62155q6663J85511Q0761P3893p5828j03021L14055J37314m3500K01119
$$ -462155 -548818 -363307 -282546 -208653 -284481 -387502 -73447 63867 20367 221486
13925B21486p8802p9484P1966k9013n4575j60894J53942K62548j06983k98305
$$ 221486 142684 63200 135166 106153 51578 -109316 44626 307174 200191 -98114
13915i8114j57156M224J28049q1525q0991K02088Q2974J01757J7445m8052M347
$$ -98114 -255270 -251046 -122997 -204522 -285513 -83425 -451 101306 118751 70699 75046
13904G5046N1830r242o4228j12384n5042j32648p0583K99951K34258L23914j29372
$$ 75046 126876 117634 53406 -58978 -114020 -246668 -317251 -17300 216958 540872 411500
13893D11500l98825M0533K03542J22520O1353n6533l81729j12602P8929o3928
$$ 411500 12675 53208 256750 379270 440623 384090 2361 -110241 -31312 -95240
13883i5240m3429K30665j78378j80191J890Q5319J060n5792j3338k7372O3744
$$ -95240 -138669 91996 -86382 -266573 -264683 -179364 -178304 -234096 -247434 -274806 -211062
13872b11062J64931R2909J6128R1827K57882P0658k12816q9020l28139K9647P9378
$$ -211062 -46131 46778 62906 154733 412615 483273 270457 181437 -146702 -117055 -37677
13861c7677K39601l5156r7435j26821j08805k36008O5037K0292o3218M4360L69008
$$ -37677 201924 166768 69333 -57488 -166293 -402301 -337264 -316972 -380190 -335830 33178
13850C3178J87693J41875o5000J53534j32022m83676k70114J42873K02239M9641
$$ 33178 220871 362746 297746 451280 319258 -164418 -434532 -291659 -89420 -39779
13840c9779N270k46580j04002J54352L90534K54815k35421M6212M7379k00754
$$ -39779 -34509 -281089 -385091 -230739 159795 414610 179189 225401 272780 72026
13830G2026r1343J3680J76614J48052n0601m8085O8018P5889j71916J74664Q164
$$ 72026 -19317 -5637 170977 319029 268428 220343 288361 364250 192334 366998 375162
13819C75162K51013p9306j07695J44386R6457r3437k25561m7733k43437q1638
$$ 375162 626175 546869 439174 583560 680017 586580 361019 313286 69849 -11789
13809a1789R4947K9371J3617J40877L9360k92332M1706J16932k25836P3314j43431
$$ -11789 83158 112529 126146 267023 306383 14051 55757 172689 -53147 20167 -123264
13798a23264m8866J21791k9802k96543p7628Q5388j65793L27249J66086R2437
$$ -123264 -172130 -50339 -80141 -376684 -454312 -368924 -534717 -207468 -41382 51055
13788E1055m8588Q5704J91476l1295k66114r320j87223l10729J72437J83685K76397
$$ 51055 2467 88171 279647 248352 -17762 -27082 -214305 -525034 -352597 -168912 107485
13777A07485j55248k43212k09091J67421N43432j645j48206K2914l18083N5765
$$ 107485 -47763 -290975 -500066 -332645 210787 209142 60936 83850 -234233 -178468
13767a78468K29622J10669j91636M20237J75773j64941m02814k20534R1689K65962
$$ -178468 51154 161823 -29813 390424 566197 401256 -1558 -222092 -130403 135559
13757A35559R3328J19480K13437J2714j66601k13264K02104k87180j60214m1434
$$ 135559 228887 348367 561804 574518 407917 194653 396757 109577 -50637 -92071
13747i2071R6918Q4102J75340J68073k49727l08194j26766Q5237J6278L12141
$$ -92071 4847 88949 264289 432362 182635 -125559 -252325 -167088 -150810 161331
13737A61331J00500P0400L4552j07271k05661n4593L5057j20240L83803l0458
$$ 161331 261831 332231 366783 259512 53851 -742 34315 -85925 297878 267420
13727B67420j05511Q1068n3496k44517o7816j05445J53377L92801l8965j44966
$$ 267420 161909 242977 189481 -55036 -122852 -228297 -74920 317881 278916 133950
13717A33950j16017o7797J35125J30479P023o8556Q9382k63926j97112j22255
$$ 133950 17933 -49864 85261 215740 222763 154207 243589 -20337 -217449 -339704
13707c39704j91343J11011K91194J08807j78967j37213K36350J76882K00297j24507
$$ -339704 -531047 -420036 -128842 -20035 -199002 -336215 -99865 77017 277314 152807
13697A52807k23603J58807K85867p6910j87987l3243P9844k05902j41313J19699
$$ 152807 -70796 88011 373878 296968 108981 75738 155582 -50320 -191633 -71934
13687g1934Q9685J68509L7901j68203j13389k62379M9217N29484J77460n9332
$$ -71934 17751 186260 224161 55958 -57431 -319810 -270593 258891 436351 377019
13677C77019J18509k31218k273K1004J73502k19543m7788r9762k18765j36624
$$ 377019 495528 264310 262037 283041 456543 237000 189212 89450 -129315 -265939
13667b65939Q157J50462N0773K06296J58915J80686K4318l25215q7980L52251
$$ -265939 -257782 -107320 -56547 149749 308664 489350 513668 188453 100473 452724
13657D52724l41573l42464k1658J32186K45991J98847K85459j35875j39947k82285
$$ 452724 111151 -231313 -252971 -120785 125206 324053 609512 473637 333690 51405
13647E1405j5874K46841P8087k07560J0235j07303N2727j59437j88289J47207
$$ 51405 35531 282372 360459 152899 163134 55831 108558 -50879 -239168 -91961
13637i1961J47306n8970K53975r1714l71284m31112J4175L41200J39051J35379
$$ -91961 55345 -3625 250350 158636 -212648 -643760 -629585 -288385 -149334 -13955
13627a3955K8572m8396R8486R9240j21131J38622Q1958q6658K2201m7012J74620
$$ -13955 14617 -33779 64707 163947 42816 181438 263396 176738 198939 151927 326547
13616C26547q9062Q9491k62257K5205Q4110j02837J17747j19974q2907Q4832q162
$$ 326547 237485 326976 64719 89924 174034 71197 188944 68970 -13937 70895 62733
13605F2733j52139j4338M8484J15617j17569J7063J07826j21985m4478j52932
$$ 62733 -89406 -103744 -55260 60357 -57212 -40149 67677 -54308 -98786 -251718
13595b51718K2274K4667n4467J67150K54026j9697n9817k59179j98908r5564Q9799
$$ -251718 -229444 -204777 -259244 -92094 161932 142235 82418 -176761 -375669 -471233 -381434
13584c81434K31753M16762M6117j52811j24380n2561n5980j09185M2850L75305
$$ -381434 -149681 267081 313198 160387 36007 -16554 -72534 -181719 -138869 236436
13574B36436L5391j34558k2447Q7937j81418j14120P7529K6284K34380k53722
$$ 236436 271827 137269 114822 202759 21341 -92779 -15250 11034 245414 -8308
13564h308l70476M5191M02414M4476l03184j58709K72673M00206j36982k65263
$$ -8308 -378784 -333593 68821 113297 -189887 -348596 -75923 324283 187301 -77962
13554g7962r1137m483k02125p8568K4192P430j93627L21452K79595K56779p0093
$$ -77962 -169099 -173582 -375707 -454275 -430083 -422653 -616280 -294828 -15233 241546 171453
13543A71453j31237r3321J13413N5009k28990P3949R2171K213M32883k38021j33511
$$ 171453 40216 -53105 60308 115317 -113673 -39724 52447 54660 487543 249522 116011
13532A16011J05639m2365j47691M425J25621P340P1721K53689k9547j21932k25575
$$ 116011 221650 179285 31594 36019 161640 168980 240701 494390 464843 342911 117336
13521A17336m325N7025n4383N4525K01304m8022k88857k35796J90637o5738k28715
$$ 117336 113011 170036 115653 170178 371482 323460 34603 -201193 -10556 -76294 -305009
13510c05009j31491J87870J97690K25507O86r4129j09446m5768j12649q2163Q3520
$$ -305009 -436500 -248630 -50940 174567 175253 81124 -28322 -74090 -186739 -268902 -185382
13499a85382J32187R1196L1920j26943l442l8648Q8801K27676J94326k58387k61922
$$ -185382 -53195 38001 69921 -57022 -60464 -99112 -10311 217365 411691 153304 -108618
13488a08618l28044R6604L59920Q3351k14521j77235K35351J3843J2925k73854
$$ -108618 -436662 -340058 19862 103213 -111308 -288543 -53192 -39349 -26424 -300278
13478c00278p7201J36023J84811o7656q0241O9644O5444K93113N0383J61904N5960
$$ -300278 -377479 -241456 -56645 -124301 -204542 -134898 -69454 223659 274042 435946 491906
13467D91906j85249r797k40519k10507K04145O648K27053j8056p411j61224k44693
$$ 491906 306657 296860 56341 -154166 49979 56627 283680 265624 258213 96989 -147704
13456a47704k09463L1449k1878q1927J45010j61448k52456K03316K99409o0326
$$ -147704 -357167 -325718 -347596 -429523 -284513 -445961 -698417 -495101 -195692 -256018
13446b56018J52200J3401J71846J56140k8425n3278q9738Q660p0048J92115K8012
$$ -256018 -103818 -90417 81429 237569 209144 155866 66128 74788 4740 196855 224867
13435B24867j52714k1355J03683K01571j32763k8692k0001K16919j80207l96393
$$ 224867 72153 50798 154481 356052 223289 194597 174596 391515 211308 -185085
13425a85085J53494L27844J29193k62671j90400j11812p7069P6155J94642n1600
$$ -185085 -31591 296253 425446 162775 -27625 -139437 -216506 -140351 54291 2691
13415B691k7135L35769K67140j78120K6178R1723J09484k20352N4246k6223j65382
$$ 2691 -24444 311325 578465 400345 426523 518246 627730 407378 461624 435401 270019
13404B70019L3975Q5825K0120k47760K6668L27353j70783k52416j17422N4751
$$ 270019 303994 389819 409939 162179 188847 516200 345417 93001 -24421 30330
13394C0330J73716j30283L5165K86952J48973q7869j75727R3859j29165j05068
$$ 30330 204046 73763 108928 395880 544853 456984 281257 375116 245951 140883
13384A40883m3521o5120j4852m2941j37944O2624K74282r0162j29376m6840k00887
$$ 140883 97362 32242 17390 -25551 -163495 -100871 173411 83249 -46127 -92967 -293854
13373b93854j40868l5409j07576J54953J51800O7729J41441K1909K29563r0917
$$ -293854 -434722 -470131 -577707 -422754 -270954 -203225 -61784 -39875 189688 98771
13363I8771J21900l1917j80014J33861K62077q5589J9878j42650l33887k30366
$$ 98771 220671 188754 8740 142601 404678 319089 338967 196317 -137570 -367936
13353c67936K32623K15256J50665k35049j13140J7483j71036K53361l8922j7312
$$ -367936 -135313 79943 230608 -4441 -117581 -100098 -271134 -17773 -56695 -74007
13343g4007M0833J82298j97713J09017L33470k09637o7205J16369M0367j32271
$$ -74007 -33174 149124 -48589 60428 393898 184261 117056 233425 273792 141521
13333A41521j67424m1845n946l5535J45032J85549j06857j21487k00626N2419
$$ 141521 -25903 -67748 -73694 -109229 35803 221352 114495 -6992 -207618 -155199
13323a55199J24125j76136l72455m1439k8889N95667K55888j23023j75023l68636
$$ -155199 -31074 -207210 -579665 -621104 -649993 -54326 201562 78539 -96484 -465120
13313d65120J3972L1441J01564j9371J71396K54883j40674j90505j18069q0259
$$ -465120 -451148 -419707 -318143 -337514 -166118 88765 -51909 -242414 -360483 -440742
13303d40742J45588M15437o9432l56840j54750r3072L1175L7159L19515K40773
$$ -440742 -295154 120283 50851 -305989 -460739 -553811 -522636 -485477 -165962 74811
13293G4811j55110J17727J15496j78351j7906K26374K04751r5420K8825j01676
$$ 74811 -80299 37428 152924 -25427 -43333 183041 387792 292372 321197 219521
13283B19521r5593P0153p530n9996j1620J09608M8317r1419J03753J36513R95
$$ 219521 123928 194081 186551 126555 114935 224543 272860 181441 285194 421707 422702
13272D22702k87915j52685q46k40117j13295K42787J07803J50796q4031O4701
$$ 422702 134787 -17898 -18744 -258861 -372156 -129369 -21566 129230 45199 109900
13262A09900p6846n858K86679q5718K52310M4364l31801j3787p9503o987M6174
$$ 109900 33054 27196 313875 228157 480467 524831 193030 179243 99740 92753 138927
13251A38927J29238K4512j92076k26588k1381L6276k3080K8273J76952j27218
$$ 138927 268165 292677 100601 -125987 -147368 -111092 -134172 -105899 71053 -56165
13241e6165j12310p9549j9489M5943J62950M5997k05245K3757J63848R5694k06496
$$ -56165 -168475 -248024 -267513 -221570 -58620 -12623 -217868 -194111 -30263 65431 -141065
13230a41065R190j24872j90884J07310K22269j43205N7979J17970J16092j65478
$$ -141065 -131875 -256747 -447631 -340321 -118052 -261257 -203278 -85308 30784 -134694
13220a34694k40522j71383J84014M12130J04322o192k30336o0323M8399m873J89084
$$ -134694 -375216 -546599 -362585 49545 153867 147675 -82661 -142984 -94585 -99458 89626
13209H9626K12904M8414j34964l35117R7047L28361j96005o6711J54534k82189
$$ 89626 302530 350944 215980 -119137 -22090 306271 110266 43555 198089 -84100
13199h4100m07034j3800J43468j18736j3600L56937J07417j2117O9481k1843j51767
$$ -84100 -491134 -504934 -361466 -480202 -493802 -136865 -29448 -41565 27916 6073 -145694
13188a45694J77681J3140K15845K64449k4674m1504k25501N2936L34365N6641
$$ -145694 31987 45127 260972 525421 500747 459243 233742 286678 621043 677684
13178F77684l87875k65824j1473j19888q6175K06349J2201j04698L09566k53831
$$ 677684 289809 23985 12512 -107376 -193551 12798 24999 -79699 229867 -23964
13168b3964j68815J76636L72266j31879j73977L626j20717j99101j66181J8530
$$ -23964 -192779 -16143 356123 224244 50267 53893 -66824 -265925 -432106 -413576
13158d13576J38096J45162O2898o2443n3840M6048J0948J84385n783j19329M703
$$ -413576 -275480 -130318 -67420 -129863 -183703 -137655 -126707 57678 51895 -67434 -62731
13147f2731K50612K77991L3508o8088j97408n0318J30278r3261k07244j39254
$$ -62731 187881 465872 499380 431292 233884 183566 313844 220583 13339 -125915
13137a25915l1194J6509j69727J36858K49267K81385N5037k26285l25559M614
$$ -125915 -157109 -140600 -310327 -173469 75798 357183 412220 185935 -139624 -135010
13127a35010J14321N8449J31255O8841O2194l18954j30803J28675k0055k21592
$$ -135010 -20689 37760 169015 237856 300050 -18904 -149707 -21032 -41087 -262679
13117b62679L3379P6786r516Q592J7382L05322r5488q3167K06450J80628j13638
$$ -262679 -229300 -152514 -162030 -153438 -136056 169266 73778 -9389 197061 377689 264051
13106B64051L0339J735n1181j24605J84026j06191J53367J0454l8744p4869Q7473
$$ 264051 294390 296125 244944 120339 304365 198174 351541 361995 323251 248382 335855
13095C35855j62315p2144K88256p7905L4528L29392J95266j2150j33226j42959
$$ 335855 173540 101396 389652 311747 346275 675667 870933 858783 725557 582598
13085E82598m50407j57860K11974R1524p4244k4388O3097n66163j86602M04282
$$ 582598 132191 -25669 186305 277829 203585 179197 242294 -323869 -510471 -106189
13075a06189M9858J87850n315k22163N2734o426j10733j96574K726K39324n1944
$$ -106189 -56331 131519 126204 -95959 -43225 -49651 -160384 -356958 -354232 -114908 -166852
13064a66852J43347o7376o46R1233K50859Q5779L363P5867j88354j73529K9737
$$ -166852 -23505 -90881 -91527 -294 250565 336344 339707 415574 227220 53691 83428
13053H3428j10041q7135L9181K83899k05549m1229K63959j52907l0094J52190
$$ 83428 -26613 -113748 -74567 209332 3783 -37446 226513 73606 43512 195702
13043A95702M50920k11688l06311j41306j67991k08095k79412j10545L38646L44347
$$ 195702 646622 434934 128623 -12683 -180674 -388769 -668181 -778726 -440080 -95733
13033i5733K9346M5796L3650n49N5093q9012K15086k74316l7031J22223O0018
$$ -95733 -66387 -20591 13059 12510 67603 -21409 193677 -80639 -117670 4553 64571
13022F4571k23656J16503P968q8176K9414K26061j75090l6926m0530j97253m2522
$$ 64571 -159085 -42582 -34614 -122790 -93376 132685 -42405 -79331 -119861 -317114 -359636
13011c59636J74038J76694j11792N6370J36899Q5374j54047M0103k91953n9408
$$ -359636 -185598 -8904 -120696 -64326 72573 157947 3900 44003 -247950 -307358
13001c07358J08228j6322j13262J0114P1152K84586j5828P9907K39902o3632k64665
$$ -307358 -199130 -215452 -328714 -318600 -247448 37138 21310 101217 341119 277487 12822
12990A2822M9047M04049J26542j26011J6965o5125K20559L7270j94067j44445
$$ 12822 61869 465918 592460 466449 483414 418289 638848 676118 482051 337606
12980C37606k25374j11922k02006K5038R0141R9633o7802j4858k36565r6033J85295
$$ 337606 112232 310 -201696 -176658 -86517 13116 -54686 -69544 -306109 -402142 -216847
12969b16847K77118O4672P6862j36369j49993J66329M32186O1681R958k13382
$$ -216847 60271 124943 201805 65436 -84557 81772 513958 575639 585597 372215
12959C72215l30379k17262M2492O4403n8373j19349J0794j26675J44897J49203
$$ 372215 41836 -175426 -132934 -68531 -126904 -246253 -235459 -362134 -217237 -68034
12949f8034J48364N9190J90346J6556k17664k90426k55440O1936J04598J50276
$$ -68034 80330 139520 329866 346422 128758 -161668 -417108 -355172 -250574 -100298
12939a00298L9279J68405J37607l56645j10001L06309L14359l9280m03538o7016
$$ -100298 -61019 107386 244993 -111652 -221653 84656 399015 359735 -43803 -110819
12929a10819K40268M3677p1541n130j77683J26349M6251n2361J87080r2811m2183
$$ -110819 129449 173126 101585 96455 -81228 45121 91372 39011 226091 133280 91097
12918I1097k2485k83386J26999j39715j80526l2039P7175j4211P4319K75444q7547
$$ 91097 68612 -214774 -87775 -227490 -408016 -440055 -362880 -377091 -302772 -27328 -114875
12907a14875l5526J78388j50458q2543j05064j42553K63189N729k00507n432J62732
$$ -114875 -150401 27987 -122471 -205014 -310078 -452631 -189442 -183713 -384220 -389652 -226920
12896b26920L39856K10236j17636j9122j44644l7867j31413j00359J94566L26967
$$ -226920 112936 323172 205536 186414 41770 3903 -127510 -227869 -33303 293664
12886B93664K8186n9301o6868o1359j97947R1414J67929R089j683J50776j91923
$$ 293664 321850 262549 195681 134322 -63625 27789 195718 204807 203124 353900 161977
12875A61977j15322N9244n8660O2633J16773k35338Q357r635J15504k85385k37299
$$ 161977 46655 105899 47239 109872 226645 -8693 -336 -9971 105533 -179852 -417151
12864d17151p4854K21255J85158K39428K2152N6912l471K71324m0301p8672k9180
$$ -417151 -492005 -270750 -85592 153836 175988 232900 229429 500753 460452 381780 352600
12853C52600o4364J7885M712j11214k15961Q3379m8172l75654K45016J90287n9254
$$ 352600 288236 306121 310833 199619 -16342 67037 18865 -356789 -111773 78514 19260
12842A9260M05782K23154k89404j80980o27j6212o9377o7795M1978M7419M3898
$$ 19260 425042 648196 358792 177812 177185 160973 91596 23801 65779 113198 157096
12831A57096O6459K1562K65209j08034k30840j71111j82022J37224J01345R4988
$$ 157096 223555 245117 510326 402292 171452 341 -181681 -44457 56888 151876
12821A51876J58447R4096J5204n0945K5147r1345K92192J50462k27558k54784
$$ 151876 310323 404419 419623 368678 393825 302480 594672 745134 517576 262792
12811B62792j06767o5632j5333J44076n7050m0105o3345k0105m657K0372k20630
$$ 262792 156025 90393 75060 219136 162086 121981 58636 38531 33874 54246 -166384
12800a66384N6734J75066J0435K1003j41691K86409M2497J56122K87482k16973
$$ -166384 -109650 65416 75851 96854 -44837 241572 284069 440191 727673 510700
12790E10700l5736J6154l15670k11422K41193J09300K66386J51861k17073l00523
$$ 510700 474964 491118 175448 -35974 205219 314519 580905 732766 515693 215170
12780B15170m2970r7645j2311M7738J23661J53556j52308r9130K9775k5133J07638
$$ 215170 172200 74555 62244 109982 233643 387199 234891 135761 165536 140403 248041
12769B48041k85176j65630M2271n6064K00028j12658l19500r4558j25310J85003
$$ 248041 -37135 -202765 -160494 -216558 -16530 -129188 -448688 -543246 -668556 -483553
12759d83553J65239M68029J12863J72253Q8529P318l67443j2265J01945P7111
$$ -483553 -318314 149715 262578 434831 523360 530678 163235 150970 252915 330026
12749C30026N8379j17213M4835l23714K0235k41046J82131N4727L9669J05737
$$ 330026 388405 271192 316027 -7687 12548 -228498 -46367 8360 48029 153766
12739A53766j01966j07388O6599L01009j18037k54229o2773k9603R93J81844Q2217
$$ 153766 51800 -55588 11011 312020 193983 -60246 -123019 -152622 -151629 30215 112432
12728A12432K18169M2562j53635j03579o0084j5226K52125j38428j39943O2882
$$ 112432 330601 373163 219528 115949 55865 40639 292764 154336 14393 77275
12718G7275M9083J99423N958j97306j99310K241n0708n2219J71243q1664l17525
$$ 77275 126358 325781 331739 134433 -64877 -62636 -113344 -165563 5680 -75984 -393509
12707c93509K5648k3750J9999K02445J72985j03397k89994n1874K47514R1748
$$ -393509 -367861 -391611 -371612 -169167 3818 -99579 -389573 -441447 -193933 -102185
12697a02185k54659J24567K52198j27331j56653m1208R4047J84396J08570m7950
$$ -102185 -356844 -232277 19921 -107410 -264063 -305271 -211224 -26828 81742 33792
12687C3792j12815M3168J92620K44204j19058l0808m5889J63101O5917k69402
$$ 33792 -79023 -35855 156765 400969 281911 251103 205214 368315 434232 164830
12677A64830j11326l63726p5291J20106K31849J67374J07287L67153k82224k12752
$$ 164830 53504 -310222 -385513 -265407 -33558 133816 241103 608256 326032 113280
12667A13280k69635O1124R0752N8041j07546m7208R4683L11218Q1977l3249o9068
$$ 113280 -156355 -95231 -4479 53562 -53984 -101192 -6509 304709 386686 353437 284369
12656B84369J86831K72330k99436j97361J19590P4037j80884j48827J71901j4902
$$ 284369 471200 743530 444094 246733 366323 440360 259476 110649 282550 267648
12646B67648p7806r1475L6957j09729K00674J15398l46612j54984K94550K13941
$$ 267648 189842 98367 135324 25595 226269 341667 -4945 -159929 134621 348562
12636C48562K84501j43018j76491j53085m16423j8450L38847J22945k26477l41807
$$ 348562 633063 490045 313554 160469 -255954 -274404 64443 187388 -39089 -380896
12626c80896k2661K81445K57396J38176k24395J14328r811r6766R4757K51704
$$ -380896 -403557 -122112 135284 273460 49065 163393 153582 56816 151573 403277
12616D03277o095L7516l32657k71448J66889k9206q2754R1133Q0200j3486q5366
$$ 403277 397182 434698 102041 -169407 -2518 -31724 -114478 -23345 56855 43369 -41997
12605d1997Q078J28659Q9907L6984k60299J06919J48646n1268k7684l6010l2883
$$ -41997 -33919 94740 184647 221631 -38668 68251 216897 165629 137945 101935 69052
12594F9052P5148J28726j2515J86333O3252j86645p0757p9400k0019m3726M4064
$$ 69052 144200 272926 260411 446744 509996 323351 252594 173194 153175 109449 153513
12583A53513K02746Q2150r5911j4212J00900j69176j40373J63584n2722j8949
$$ 153513 356259 438409 342498 328286 429186 260010 119637 283221 230499 211550
12573B11550R649o1047K3161j76716n3604K80388j2492k46965j90593J68178L02207
$$ 211550 221199 160152 183313 6597 -47007 233381 220889 -26076 -216669 -48491 253716
12562B53716M45824J13005l63984q2944k4306j8203J70352j14890l37457K34484
$$ 253716 699540 812545 448561 365617 341311 323108 493460 378570 41113 275597
12552B75597j22034j27126J08369P7476J85085k249p6941j08592p875N0582k60877
$$ 275597 153563 26437 134806 212282 397367 395118 318177 209585 201710 252292 -8585
12541h585M7782q7710J4295O343K40362N4658j01075J23405N0784L4114Q1064
$$ -8585 39197 -48513 -34218 -27875 212487 267145 166070 289475 340259 374373 455437
12530D55437N7289j41145L2663J10527k03945o6249K56992L75549J30758k18978
$$ 455437 512726 371581 404244 514771 310826 244577 501569 877118 1007876 788898
12520G88898p2508m0446n6281j66029J11339N5291r9820j83256r2395M5541q307
$$ 788898 716390 675944 619663 453634 564973 620264 520444 337188 244793 290334 282027
12509B82027k54790m4301k3903j4337m8408K20808l5666K4992k0698M2756L6970
$$ 282027 27237 -17064 -40967 -55304 -103712 117096 81430 106422 85724 128480 165450
12498A65450K00867n9230j87699k43937K60987L02689j48013r5748J9185j20204
$$ 165450 366317 307087 119388 -124549 136438 439127 291114 195366 214551 94347
12488I4347l70346k2591M03184L64033L05298j89685K2697R3961p1193o4025k51148
$$ 94347 -275999 -298590 104594 468627 773925 584240 606937 700898 629705 565680 314532
12477C14532j21329J87846J28604j34830k08162n4865Q8046O5936j7488k55750
$$ 314532 193203 381049 509653 374823 166661 111796 199842 265778 248290 -7460
12467g460q2058n3236j88900R9556L9916J42536j33019N74J36069J20985k940
$$ -7460 -89518 -142754 -331654 -232098 -192182 -49646 -182665 -182091 -46022 74963 72023
12456G2023m235J06146j9997l3066L4623J27626J82217j68538r047m045O6983
$$ 72023 67788 173934 153937 120871 155494 283120 465337 296799 287752 283707 350690
12445C50690K96535K7735m1162j65050j67741l17078j86210N1947N974P8232K36293
$$ 350690 647225 674960 633798 468748 301007 -16071 -202281 -150334 -144360 -66128 170165
12434A70165J42587J19590L1079j38117J03976Q5457l06776l0430J95288R668
$$ 170165 312752 432342 463421 325304 429280 514737 207961 177531 372819 382487
12424C82487J59716k40538n8898O8810N6237J32345Q433R5026j69841m07076j33374
$$ 382487 542203 301665 242767 311577 367814 500159 508592 603618 433777 26701 -106673
12413a06673O6729J07902J44034J52408L11090J50511J39181j17658p6650n8334
$$ -106673 -39944 67958 211992 364400 675490 826001 965182 847524 770874 712540
12403G12540R5236j00511j28026j89665Q9720J06717J04880p6212l12110q072
$$ 712540 807776 707265 579239 389574 479294 586011 690891 614679 302569 294497
12393B94497J79916J75253L0686K6567N985q0500j39761N1455j0674j41430k47319
$$ 294497 474413 649666 680352 706919 712904 632404 492643 544098 533424 391994 144675
12382A44675k31847J62709M09978J04386l5769o8387k26570K34601j20522P1629
$$ 144675 -87172 75537 485515 589901 554132 485745 259175 493776 373254 444883
12372D44883J61531J14052J87161j23609j6825J61584j90161k13026Q9489J44670
$$ 444883 606414 720466 907627 784018 767193 928777 738616 525590 615079 759749
12362G59749p3084q8386Q1296R0472N0694R3559l21310j90847k8170K33258J39174
$$ 759749 686665 598279 679575 770047 820741 914300 592990 402143 373973 607231 746405
12351G46405K23351m8644j45390J29806j49388j8064r0114j29421k78283J2071
$$ 746405 969756 921112 775722 905528 756140 738076 647962 518541 240258 252329
12341B52329k53173J36329L30887q1183q0801L9518j02606o3958M2985K54565
$$ 252329 -844 135485 466372 385189 304388 343906 241300 177342 220327 474892
12331D74892M7562P0514J14650J54169j81194k35103k7365K9489J46990k67606
$$ 474892 522454 592968 707618 861787 680593 445490 418125 447614 594604 326998
12321C26998K8508L39590o8065l80926k01215M8557J13692J07750K44884K24236
$$ 326998 355506 695096 627031 246105 44890 93447 207139 314889 559773 784009
12311G84009j11628j05131J83634O9024K49794j39499p3080n6425p4651o2588
$$ 784009 672381 567250 750884 819908 1069702 930203 857123 800698 726047 663459
12301F63459k5625p8861M2375l19947K4366J19976M1408J42847J56414j69460
$$ 663459 637834 558973 601348 281401 305767 425743 467151 609998 766412 596952
12291E96952K853J31260m7314J51967l8823j3320l3690j40723P2422K31896r9726
$$ 596952 599805 731065 683751 835718 796895 783575 749885 609162 681584 913480 813754
12280H13754k26965k3188R3776r7111l1841k9429j2745J90487n9827m0634L27412
$$ 813754 586789 563601 657377 560266 528425 498996 486251 676738 616911 576277 903689
12269I03689J36786j30171m70550n9325J07767j5369o3151K34769K13115j6825
$$ 903689 1040475 910304 439754 380429 488196 472827 409676 644445 857560 840735
12259H40735j52253j57107j85275j06305J01349O7187k5172j3240L51283M30061
$$ 840735 688482 531375 346100 239795 341144 408331 383159 369919 721202 1151263
12249A151263o4333j89962N2066N8869R0857o9434J78593n3256r3331n1438j9960
$$ 1151263 1086930 896968 949034 1007903 1098760 1029326 1207919 1154663 1061332 1009894 989934
12238I89934r6044K3069L42139n4496l85604l23396J46557J03952p7597j50056
$$ 989934 893890 916959 1259098 1204602 818998 495602 642159 746111 668514 518458
12228E18458M7888K11269N7614J06024q5492k61916j19407k01890P3438J3595
$$ 518458 566346 777615 835229 941253 855761 593845 474438 272548 345986 359581
12218C59581L36846K38876K91224O5555j41982k05277J33510P273j78554K66425
$$ 359581 696427 935303 1226527 1292082 1150100 944823 1078333 1085606 907052 1173477
12208A173477L03847k18458q7353j99933l0463q9878R9899n8689K84497j8197
$$ 1173477 1477324 1258866 1171513 971580 941117 851239 951138 892449 1176946 1158749
12198A158749J45586J83325k98627j15005k30510J78388o818J22812K65877q1304
$$ 1158749 1304335 1487660 1189033 1074028 843518 1021906 1015088 1137900 1403777 1322473
12188A322473j18567r6871j39623q1073L00379L50167j1689k85601k35633p7702
$$ 1322473 1203906 1107035 967412 886339 1186718 1536885 1525196 1239595 1003962 926260
12178I26260J52123m3443K01835J16007K179j3096p6183J92125K0946J71862l54799
$$ 926260 1078383 1034940 1236775 1352782 1354961 1341865 1265682 1457807 1478753 1650615 1295816
12167A295816j58075K7060k5245j26348J08289n8378R9465K7976N8673J43948
$$ 1295816 1137741 1164801 1139556 1013208 1121497 1063119 1162584 1190560 1249233 1393181
12157A393181K46257o761j24787K12858J66966k50595k91090r4024K836J16020
$$ 1393181 1639438 1632677 1507890 1720748 1887714 1637119 1346029 1252005 1254841 1370861
12147A370861J31910L665j94665q129N7993O7459k03601J48910j26282r9103J69393
$$ 1370861 1502771 1506436 1311771 1303642 1361635 1429094 1225493 1374403 1248121 1149018 1318411
12136A318411K04991M3301n3863J09936L00143K6546k21528o1905L7712N0067
$$ 1318411 1523402 1566703 1512840 1622776 1922919 1949465 1727937 1666032 1703744 1753811
12126A753811l47676k18414J32820K00982j0732j18555K9383K84068K89095j84362
$$ 1753811 1406135 1187721 1320541 1521523 1510791 1392236 1421619 1705687 1994782 1810420
12116A810420l13144j2455L15814M81920J85987m48496k66068K74067J21517J87649
$$ 1810420 1497276 1484821 1800635 2282555 2468542 2020046 1753978 2028045 2149562 2337211
12106B337211j2575M0436J7839j67424l52664j7342r9584J71695J98586K53565
$$ 2337211 2324636 2365072 2382911 2215487 1862823 1845481 1745897 1917592 2116178 2369743
12096B369743K48047L7415N5913P7548J18709Q8082k37286r7895j5308j17169
$$ 2369743 2617790 2655205 2711118 2788666 2907375 2995457 2758171 2660276 2644968 2527799
12086B527799q3720L8816J9851q1652O372J11847K0358Q4419K62887P0810n4781
$$ 2527799 2444079 2482895 2502746 2421094 2427466 2539313 2559671 2644090 2906977 2977787 2923006
12075B923006n1487K2687K04859N9875n0666J9884N5979q4019q1707N1545L51603
$$ 2923006 2871519 2894206 3099065 3158940 3108274 3128158 3184137 3100118 3018411 3069956 3421559
12064C421559J65049r5288K7581j30867q0590L55682O0834j2478p8598O9512J90795
$$ 3421559 3586608 3491320 3518901 3388034 3307444 3663126 3723960 3711482 3632884 3702396 3893191
12053C893191K63514j85766j75879J84371J86753q707O0967m2794N7893J76650
$$ 3893191 4156705 3970939 3795060 3979431 4166184 4157477 4218444 4175650 4233543 4410193
12043D410193P7065K97757J97223j4691N3648p8676J06038P4901m0802m7559N8695
$$ 4410193 4487258 4785015 4982238 4967547 5021195 4942519 5048557 5123458 5082656 5035097 5093792
12032E093792J94962Q3131k6529l0168J09529N3406R8731j06571K89117K42665
$$ 5093792 5288754 5371885 5345356 5315188 5424717 5478123 5576854 5470283 5759400 6002065
12022F002065J67271K78482L56837K39608L3095k18306L272p5677L77091q7951
$$ 6002065 6169336 6447818 6804655 7044263 7077358 6859052 6862324 6786647 7163738 7075787
12012G075787j25311M29370N12848J97820M41200K45782n4528j09335P60J18495
$$ 7075787 6950476 7379846 7892694 8090514 8531714 8777496 8722968 8613633 8614393 8732888
12002H732888J39902L42620K50080K56068L6428J20273J60188J88946K41994K64244
$$ 8732888 8872790 9215410 9465490 9721558 9757986 9878259 10038447 10227393 10469387 10733631
11992A0733631K17891J21790K28149L46115L34483N27426K19763J91261K5025
$$ 10733631 10951522 11073312 11301461 11647576 11982059 12509485 12729248 12920509 12945534
11983A2945534K70178L25219K83638P102K23042L11298M45198J36155M06831O68645
$$ 12945534 13215712 13540931 13824569 13831671 14054713 14366011 14811209 14947364 15354195 16022840
11973A6022840O02351K47075J46483L09838N46404N01360M22168L32367L09383
$$ 16022840 16625191 16872266 17018749 17328587 17874991 18376351 18798519 19130886 19440269
11964A9440269M68541M56273N24827O64960N49926N45257N03867M45916N12872
$$ 19440269 19908810 20365083 20889910 21554870 22104796 22650053 23153920 23599836 24112708
11955B4112708O19350P80473O36148O46335Q19501J053628Q19294P11953R22686
$$ 24112708 24732058 25512531 26148679 26795014 27614515 28668143 29487437 30199390 31122076
11946C1122076P43835R03957J064221Q75534O01437J028156J234099J264743J010166
$$ 31122076 31865911 32769868 33834089 34709623 35311060 36339216 37573315 38838058 39848224
11937C9848224J019205J079143J048500J118974J182221J144743R60657R71304
$$ 39848224 40867429 41946572 42995072 44114046 45296267 46441010 47401667 48372971
11929D8372971J163175J292255J179683J256214J160438J124318J260780J160754
$$ 48372971 49536146 50828401 52008084 53264298 54424736 55549054 56809834 57970588
11921E7970588J151831R97164Q35331J007051Q02109Q19987R33795R34004O06303
$$ 57970588 59122419 60119583 60954914 61961965 62764074 63584061 64517856 65451860 66058163
11912F6058163K70848M45572K19351K39765L85639J42937J5469j34768k22656
$$ 66058163 66329011 66774583 66993934 67233699 67619338 67762275 67777744 67642976 67420320
11903F7420320j59534m42544p45688n66826p24299p42192j076048j061224p42046
$$ 67420320 67260786 66818242 66072554 65505728 64781429 64039237 62963189 61901965 61159919
11894F1159919r14587q03602j180844j006624j138542j207467q17954j252052
$$ 61159919 60245332 59441730 58260886 57254262 56115720 54908253 54090299 52838247
11886E2838247j564768j304211q77031j038484j135638j123843j239579j064710
$$ 52838247 51273479 49969268 49092237 48053753 46918115 45794272 44554693 43489983
11878D3489983r83103r55392j010209j112320j103404q27250j094708j123536
$$ 43489983 42506880 41551488 40541279 39428959 38325555 37498305 36403597 35280061
11870C5280061r02962r74492r03931o85168o45573q34285o46572p30811q33106
$$ 35280061 34377099 33402607 32498676 31813508 31167935 30333650 29687078 28956267 28123161
11861B8123161o74042q73747p79178o04414r13739n96323m68672m84593m28035
$$ 28123161 27449119 26575372 25796194 25191780 24278041 23681718 23213046 22728453 22300418
11852B2300418l00204o34532n06908m11228n60717o00149p52453o00401p5862
$$ 22300418 22000214 21365682 20858774 20447546 19886829 19286680 18534227 17933826 17857964
11843A7857964k73421l57339m14610n95305q02846J62534q6404l84745l56647
$$ 17857964 17584543 17227204 16812594 16217289 15414443 15576977 15490573 15105828 14749181
11834A4749181k88834l38664l19188j27510k78414j80658m32128k20038n04488
$$ 14749181 14460347 14121683 13802495 13674985 13396571 13215913 12783785 12563747 12059259
11825A2059259l52722J12068K704l48619k65934k57757k74826j09313j96767l80213
$$ 12059259 11706537 11818605 11821309 11472690 11206756 10948999 10674173 10564860 10368093 9987880
11815I987880j25202J66824k29414l00634m0937n5790j96991l44017l95654k67238
$$ 9987880 9862678 10029502 9800088 9499454 9458517 9402727 9205736 8861719 8466065 8198827
11805H198827K49588J35544j76803j95016m56723l15989k59595l8181j38530m15772
$$ 8198827 8448415 8583959 8407156 8212140 7755417 7439428 7179833 7141652 7003122 6587350
11795F587350N3449K4506J62052R0551r3299j91409k74347k692K0245j22191p2595
$$ 6587350 6640799 6665305 6827357 6917908 6824609 6633200 6358853 6356161 6376406 6254215 6181620
11784F181620j22958P087q5053q1313j82386m8557j78762l07806R3133j28075
$$ 6181620 6058662 6065749 5980696 5899383 5716997 5668440 5489678 5181872 5275005 5146930
11774E146930j74610P0160j8468J33650L7497j0096q3851J87358k24201m57291
$$ 5146930 4972320 5042480 5024012 5157662 5195159 5185063 5101212 5288570 5064369 4607078
11764D607078p1551k80939J86471j94002j93404R3619K99443j27683k70960J71139
$$ 4607078 4535527 4254588 4441059 4247057 4053653 4147272 4446715 4319032 4048072 4219211
11754D219211J4898k51947p1416J0990m1453J19592r0619J53937R6226O296k00742
$$ 4219211 4234109 3982162 3910746 3921736 3880283 3999875 3909256 4063193 4159419 4165715 3964973
11743C964973J3531l76950k50621K12649J01189l76358k38429R6486K08441J8876
$$ 3964973 3978504 3601554 3350933 3563582 3664771 3288413 3049984 3146470 3354911 3373787
11733C373787K4840l15J38820K25459j65560N5676j07784j43796R8433k09930
$$ 3373787 3398627 3398312 3537132 3762591 3597031 3652707 3544923 3401127 3499560 3289630
11723C289630r1657L1799P7131n12271k94249J39544J17939q3809k48184K693
$$ 3289630 3197973 3229772 3306903 2794632 2500383 2639927 2757866 2674057 2425873 2428566
11713B428566n7471o6355J00053J78274o3736J55091J85167j31643l13043m50151
$$ 2428566 2371095 2304740 2404793 2583067 2519331 2674422 2859589 2727946 2414903 1964752
11703A964752k18100N2771J83879L59374p2619O7050K9136j61698j62921J27110
$$ 1964752 1746652 1799423 1983302 2342676 2270057 2337107 2366243 2204545 2041624 2168734
11693B168734Q2436p4818m6467j85284j89371M9975n3267n4059l2494j28377l0813
$$ 2168734 2251170 2176352 2129885 1944601 1755230 1805205 1751938 1697879 1665385 1537008 1506195
11682A506195J36237L3153J59353m6739r600l17580p3857o3860J53662L38426
$$ 1506195 1642432 1675585 1834938 1788199 1778599 1461019 1387162 1323302 1476964 1815390
11672A815390k37516o2232J61402J04515n8418j17604J444K65299j55007q8106
$$ 1815390 1577874 1515642 1677044 1781559 1723141 1605537 1606981 1872280 1717273 1629167
11662A629167J3490o4245j91832j88757J40109Q6314j28320k52496K12492J64852
$$ 1629167 1642657 1578412 1386580 1197823 1337932 1424246 1295926 1043430 1255922 1420774
11652A420774L0512J55341q6048j5124R850L5184j6000j10871k506l6585J470
$$ 1420774 1451286 1606627 1520579 1505455 1515305 1550489 1534489 1423618 1421112 1384527 1385997
11641A385997k95543l71882J77459J07280J97070L46124L4184n6427q3915j40855
$$ 1385997 1090454 718572 896031 1003311 1200381 1546505 1580689 1524262 1440347 1299492
11631A299492l4159P5661l26487o5649N1063r341J25337L4831J66316L13394l7788
$$ 1299492 1265333 1340994 1014507 948858 999921 990580 1115917 1150748 1317064 1630458 1592670
11620A592670q4085R9385J43459k23309m21579j64230N0322Q8966J96358J17206
$$ 1592670 1508585 1607970 1751429 1528120 1106541 942311 992633 1081599 1277957 1395163
11610A395163J788J18977l25833l93638q808o5585J70511J70973K86003o3826
$$ 1395163 1396951 1515928 1190095 796457 787649 722064 892575 1063548 1349551 1285725
11600A285725j9847K6919j88894Q1807j96271j204L3527Q6804Q1733j7786j55275
$$ 1285725 1265878 1292797 1103903 1185710 989439 988235 1021762 1108566 1190299 1172513 1017238
11589A017238k46942L6469j29461k03614J62775K84632N6849J51173j28634m2586
$$ 1017238 770296 806765 677304 473690 636465 921097 977946 1129119 1000485 957899
11579I57899M6962k82092j64216m705n2398K94182K02788K8716m0986j2531J28608
$$ 957899 1004861 722769 558553 553848 501450 795632 998420 1027136 986150 973619 1102227
11568A102227M7331j35669j41767q4891k14087l60385J52088K57147m3518K0281
$$ 1102227 1149558 1013889 872122 787231 573144 212759 364847 621994 578476 598757
11558E98757M6088Q2527r6160K36382J96152j35445k3824K12182j71154m9717
$$ 598757 644845 727372 631212 867594 1063746 928301 904477 1116659 945505 895788
11548H95788j47191n2204j04226k07460Q9638K36322K18278n2031q1591K45665
$$ 895788 748597 696393 592167 384707 474345 710667 928945 876914 795323 1040988
11538A040988n1k10755J70151k16674q5578O3418J89525j48360k40713K0594j2056
$$ 1040988 1040937 830182 1000333 783659 698081 761499 951024 802664 561951 582545 570489
11527E70489J9879N7420j38946J35309K89976o1113n5767j60956K13086O8166
$$ 570489 590368 647788 508842 644151 934127 873014 817247 656291 869377 937543
11517I37543j29534j22477k08843l000J09285L33733J36519o1796l79004l38375
$$ 937543 808009 685532 476689 473689 582974 916707 1053226 991430 612426 274051
11507B74051R3053J98246n0985j79538j49625J66911P5939j45564n5150l8059
$$ 274051 367104 565350 514365 334827 185202 352113 428052 282488 227338 189279
11497A89279J83367J45778m1269m7996j40411j12119J20033r7862k7334R4969
$$ 189279 372646 518424 477155 429159 288748 176629 296662 198800 171466 266435
11487B66435N5178Q9676n6266k40177n3644K40041j0711m58918j29134K3402J90230
$$ 266435 321613 411289 355023 114846 61202 301243 290532 -168386 -297520 -274118 -83888
11476h3888J80025J23714l1228J38848l8408j37692J9056J14274K53917o9064
$$ -83888 96137 219851 188623 327471 289063 151371 170427 284701 538618 469554
11466D69554r6983j78845J07955L64533j82306l00759j05470j99048r1552m6258
$$ 469554 372571 193726 301681 666214 483908 183149 77679 -121369 -212921 -259179
11456b59179K29981K51175J03417K43022j41706m5328k7666l3088Q0519K22501
$$ -259179 -29198 221977 325394 568416 426710 381382 353716 320628 401147 623648
11446F23648m6759m846J38850l65494k45388j64626q6881K07749M37587R4935
$$ 623648 576889 572043 710893 345399 100011 -64615 -151496 56253 493840 588775
11436E88775Q8734o3664p6429m8272j52726k54643l3694l9259q538K46697J62430
$$ 588775 677509 613845 537416 489144 336418 81775 48081 8822 284 246981 409411
11425D09411m4219P2852J4511p4977K17302J00724k4783j81294m5467j93151k44776
$$ 409411 365192 438044 452555 377578 594880 695604 670821 489527 444060 250909 6133
11414F133j11061M7282L5671r514Q9847j26560j31197k4877L43692L404l9765
$$ 6133 -104928 -57646 -21975 -31489 58358 -68202 -199399 -224276 119416 122820 83055
11403H3055N6886R907M32865Q5755l14317j57955n2679J04478L21206j0467K9121
$$ 83055 139941 149848 582713 668468 354151 196196 143517 247995 569201 558734 587855
11392E87855q4774p3330J17064j53093l41419k6125K6757J97117o5213p8325K266
$$ 587855 503081 429751 546815 393722 52303 26178 52935 250052 184839 106514 108780
11381A08780L23423l820p6142j6227j14233p9236J32140j17840r7075j34700J02752
$$ 108780 432203 428383 352241 336014 221781 142545 274685 156845 59770 -74930 27822
11370B7822K97365P1822j22045P1146J22447k92925k48801J1124L8085j62972
$$ 27822 325187 397009 274964 346110 468557 175632 -73169 -62045 -23960 -186932
11360a86932O1379K29493Q9979L0646J9456K80642m771k21686o3079J44265J16961
$$ -186932 -125553 103940 193919 224565 244021 524663 519892 298206 235127 379392 496353
11349D96353k5591l4447r2394j41876j53982J95060J25914k77089j37527K59386
$$ 496353 470762 436315 343921 202045 48063 243123 369037 91948 -45579 213807
11339B13807J95184j88856k42697j9166R6360j51576J92737K16095J27030k19393
$$ 213807 408991 220135 -22562 -41728 54632 -96944 95793 311888 438918 219525
11329B19525p5575j50729m20004j38202J08397J64916J07834J69844J46799L5904
$$ 219525 143950 -6779 -426783 -564985 -456588 -291672 -183838 -13994 132805 168709
11319A68709J6176Q9995Q9769j09418K43463l08848Q4013J6424p8894k33859O7035
$$ 168709 184885 274880 364649 255231 498694 189846 273859 290283 211389 -22470 44565
11308D4565J75778O4409N5807N6306O4348k3157k08316Q0108J72686p2352j3803
$$ 44565 220343 284752 340559 396865 461213 438056 229740 309848 482534 410182 396379
11297C96379j65289m6654K31444J50609l5873j04080k32185J50827J10811n3539
$$ 396379 231090 184436 415880 566489 530616 426536 194351 345178 455989 402450
11287D02450O3748l344L1045P4718l5773J27767O7943j93816r2028m455M6559
$$ 402450 466198 462854 493899 568617 532844 660611 728554 534738 442710 438255 484814
11276D84814k55808M188J47443J00873k93589k2143k3601o9791J23500K50881
$$ 484814 229006 233194 380637 481510 187921 165778 142177 72386 195886 446767
11266D46767j24528p4519j7628R1031j09288j07781J34338K31273j1113o8548
$$ 446767 322239 247720 230092 321123 211835 104054 238392 469665 458552 390004
11256C90004r1368R7058R1645k00947j75131j24850M1038L30595L9719j01114
$$ 390004 298636 395694 487339 286392 111261 -13589 27449 358044 397763 296649
11246B96649j90433l5501J18972J24866k62525r2780J8590L23760J40742j62041
$$ 296649 106216 70715 189687 314553 52028 -40752 -22162 301598 442340 280299
11236B80299k46733n3401M58478J89737j527l54079k33151r3919L7942J24712
$$ 280299 33566 -19835 438643 628380 626853 272774 39623 -54296 -16354 108358
11226A08358J38616P1123J80212N0682l286j58019k26631J48378J3628n6272N3141
$$ 108358 246974 318097 498309 548991 545705 387686 161055 309433 323061 266789 319930
11215C19930j30504j47764R8875K72099K2937K09376j51119l26687k19856j38260
$$ 319930 189426 41662 140537 412636 435573 644949 493830 167143 -52713 -190973
11205a90973R7965N5410L29510L27060j57797m06840l4067L4302R4940q5628K7341
$$ -190973 -93008 -37598 291912 618972 461175 54335 20268 54570 149510 63882 91223
11194I1223j7921J02880j09625o5580k5149L9730n1993R5857L7065N0727J62469
$$ 91223 73302 176182 66557 977 -24172 15558 -36435 59422 96487 147214 309683
11183C09683K2171J42488K08686N7609J78562j44420j98812k26841j86981K16745
$$ 309683 331854 474342 683028 740637 919199 774779 575967 349126 162145 378890
11173C78890L25936m82626k75247l9602j0484j9310N8043J30008j54105k40005
$$ 378890 704826 222200 -53047 -92649 -103133 -122443 -64400 65608 -88497 -328502
11163c28502m5472J13700R2836l00458Q3258K76749J29990k9924J58622m7119
$$ -328502 -373974 -260274 -167438 -467896 -384638 -107889 22101 -7823 150799 103680
11153A03680m02945j52676L06606L37309M5428J33127P3123J06381j55121m32137
$$ 103680 -299265 -451941 -145335 191974 237402 370529 443652 550033 394912 -37225
11143c7225q3689k1018J45629q2676J83937r0050r8361J78134K41363j3328j75563
$$ -37225 -120914 -141932 3697 -78979 104958 14908 -83453 94681 336044 322716 147153
11132A47153k65363k81309k7519J26427J35306K42372j13723p5374j19439N2990
$$ 147153 -118210 -399519 -427038 -300611 -165305 77067 -36656 -112030 -231469 -178479
11122a78479K05919K02150L9564k65804j70649J46079J77183j52309n4861L5968
$$ -178479 27440 229590 269154 3350 -167299 -21220 155963 3654 -51207 -15239
11112a5239K66357L17026j59809l01564j67878J55458j2081K49024K8246j63806
$$ -15239 251118 568144 408335 106771 -61107 94351 82270 331294 359540 195734
11102A95734l7585K66352L8278k37980K7318k24207j29339j85045n2881j02861
$$ 195734 158149 424501 462779 224799 252117 27910 -101429 -286474 -339355 -442216
11092d42216J97404K13440j06032j03908J85664J61520J46696k34892k86071R6536
$$ -442216 -244812 -31372 -137404 -241312 -55648 105872 252568 17676 -268395 -171859
11082a71859J92624P7105j13993K85798J4217K8271q4558n58416K3832K48470
$$ -171859 20765 97870 -16123 269675 283892 312163 227605 -330811 -306979 -58509
11072e8509P9888q5867J73903k83850m4518j61750j43491o5251P2432M2084k01382
$$ -58509 21379 -64488 109415 -174435 -218953 -380703 -524194 -589445 -517013 -474929 -676311
11061f76311j133M6836K08302J5221K37036M4905k6553k3264M0462J86173J20044
$$ -676311 -677444 -630608 -422306 -407085 -170049 -125144 -151697 -174961 -134499 51674 171718
11050A71718o5780l70692q393J59992J11082M8064j5910j0157J31800N5719J30746
$$ 171718 105938 -264754 -273147 -113155 -2073 45991 30081 19924 151724 207443 338189
11039C38189K2160O4591J25274l6602r1388j2169J01283R5655O5584J04445n1760
$$ 338189 360349 424940 550214 513612 422224 410055 511338 606993 672577 777022 725262
11028G25262M39385L86975O8177r5547O0163j68699j45906K02765J03375K69334
$$ 725262 1164647 1551622 1619799 1524252 1584415 1415716 1269810 1472575 1575950 1845284
11018A845284j14403j86293q462L73543K26929o863j69185l1739j55104l41944
$$ 1845284 1730881 1544588 1536126 1909669 2136598 2129735 1960550 1928811 1773707 1431763
11008A431763j18911J24263l6502k6820M9783K59761O1431k98038l05522l6758
$$ 1431763 1312852 1437115 1400613 1373793 1423576 1683337 1744768 1446730 1141208 1104450
10998A104450j28978J23442j8306j48652l52902O5943K83248K0181r1264j10404
$$ 1104450 975472 1098914 1080608 931956 579054 644997 928245 948426 857162 746758
10988G46758j75132l32271J34565P4453r9836j49558O5939J12788O6088J73946
$$ 746758 571626 239355 373920 448373 348537 198979 264918 377706 443794 617740
10978F17740p321k63296l1934J27874o9662M5914o2048j20835L2441J89355j65126
$$ 617740 610419 347123 315189 443063 373401 419315 357267 236432 268873 458228 293102
10967B93102M1861K8076k43561q8779k34736K1615j20788r6666K1894K81100L23766
$$ 293102 334963 363039 119478 30699 -204037 -182422 -303210 -399876 -377982 -96882 226884
10956B26884K627j16262p9713K4610Q6425N4288J27348M1041L0289J36320K09601
$$ 226884 229511 113249 33536 58146 144571 198859 326207 367248 397537 533857 743458
10945G43458l15900j39998K6111K614r2108k86695j67853Q9093Q7161k9411p339
$$ 743458 427558 287560 313671 316285 224177 -62518 -230371 -141278 -54117 -83528 -90867
10934i0867j37795j6356J5055R5897R1450O6235O3969Q5851q0182K24599K8680
$$ -90867 -228662 -245018 -229963 -134066 -42616 23619 87588 173439 93257 317856 346536
10923C46536k68254k1871q7015M8011R5018L18240r1652N3776N3290l2431j31431
$$ 346536 78282 56411 -30604 17407 112425 430665 339013 392789 446079 413648 282217
10912B82217J1383J14138j94085p5782n9345M3252M1255n613k06917o1424J66388
$$ 282217 293600 407738 213653 137871 78526 121778 163033 157420 -49497 -110921 55467
10901E5467k75995j94316p975L68469J68890j15056J5789P0789p7204O5620r2034
$$ 55467 -220528 -414844 -422819 -54350 114540 -516 15273 86062 8858 74478 -17556
10890a7556n4826l2828L07207K9579O077L4011j37705j35452j01001q0900j83011
$$ -17556 -72382 -105210 201997 231576 237653 271664 133959 -1493 -102494 -183394 -366405
10879c66405j10707j0485Q6697J53032L47765J73820p5817J8444N6098L1057n9303
$$ -366405 -477112 -487597 -400900 -247868 99897 273717 197900 216344 272442 303499 244196
10868B44196l60927j8565o2758L4422P9072k05436J94241J94886J17416K06029
$$ 244196 -116731 -135296 -198054 -163632 -84560 -289996 -95755 99131 216547 422576
10858D22576K37083j41096n0621P3444k0220j22515K7622R3621k18243j63831
$$ 422576 659659 518563 467942 541386 521166 398651 426273 519894 301651 137820
10848A37820j74335l4643J11150L43304K67220J42080j3699L4915j58169l02310
$$ 137820 -36515 -71158 39992 383296 650516 792596 778897 813812 655643 353333
10838C53333j53938R959k36052K94140M22523N5359P0719M7309j48933m19590
$$ 353333 199395 209354 -26698 267442 689965 745324 816043 863352 714419 294829
10828B94829k0493N22317Q2801o6446k71852m1222j44487k11402J56951K543P4269
$$ 294829 274336 796653 879454 813008 541156 499934 355447 144045 300996 303539 377808
10817C77808l698r1825n3067k41729j21602J89154J90153O377l8348j68076r3163
$$ 377808 374110 282285 229218 -12511 -134113 55041 245194 251571 213223 45147 -48016
10806d8016L6871J93220q6443j70352J45260j2810J81239J66586j54833l48064
$$ -48016 -11145 182075 95632 -74720 70540 57730 238969 405555 250722 -97342
10796i7342j6458L28440J385O7596K52336P5550p8502j32013j63746J73453J82198
$$ -97342 -113800 214640 216025 283621 535957 611507 533005 400992 237246 410699 592897
10785E92897j67898k85515k99636j60697O1205J35413K37333L39546l68861j98253
$$ 592897 424999 139484 -160152 -320849 -259644 -124231 113102 452648 83787 -114466
10775a14466K31661J623J05696K09287P615m0954J39423r0415j6355p1777k23131
$$ -114466 117195 118818 224514 433801 441416 400462 539885 449470 433115 361338 138207
10764A38207M92488J10377l15414k19786l88891o5866M93514K2070k21736n9917
$$ 138207 630695 741072 425658 205872 -183019 -248885 244629 266699 44963 -14954
10754a4954J77020M8049m20363j93394J93000j20388j34980J51338Q8447J05014
$$ -14954 162066 210115 -210248 -403642 -210642 -331030 -466010 -314672 -226225 -121211
10744a21211R9284j45590o4603o3422r7538L9636k54979k68247K38626Q4950K25073
$$ -121211 -21927 -167517 -232120 -295542 -393080 -353444 -608423 -876670 -638044 -553094 -328021
10733c28021j71563j2899k8950J62048R5680j53264K32785k00256k19045J25028
$$ -328021 -499584 -512483 -541433 -379385 -283705 -436969 -204184 -404440 -623485 -498457
10723d98457K8224Q8611L3530J94968K8517M3570q3447l15426O5919k4525J50186
$$ -498457 -470233 -381622 -348092 -153124 -124607 -81037 -164484 -479910 -413991 -438516 -288330
10712b88330o336k08310J0457K65628K29254P1336k33394j0253j16984p111M34972
$$ -288330 -294666 -502976 -492519 -226891 2363 73699 -159695 -169948 -286932 -294043 140929
10701A40929M77303P9263j39059r4456j07877k42396j14920M65932l5958k89064
$$ 140929 618232 697495 558436 463980 356103 113707 -1213 464719 428761 139697
10691A39697J05075l099j77019n4583L3598K78424p3615q8874n2469j70954K41210
$$ 139697 244772 241673 64654 10071 43669 322093 248478 159604 107135 -63819 177391
10680A77391k61423m16819m8578L50304L69680K12657j03321j43947n7849k3863
$$ 177391 -84032 -500851 -549429 -199125 170555 383212 279891 135944 78095 54232
10670E4232J15456N2432J01500K1988j63020k66746j36354J88789P1070L2370
$$ 54232 169688 222120 323620 345608 182588 -84158 -220512 -31723 39347 71717
10660G1717M1002M5380m947P7608O7798m2211k64271J14561L69070K37289j38822
$$ 71717 112719 158099 153152 230760 298558 256347 -7924 106637 475707 712996 574174
10649E74174P8021K20779j11340j37165K7532L7012R1475M8155J2533N834K37309
$$ 574174 652195 872974 761634 624469 652001 689013 780488 828643 841176 847010 1084319
10638A084319K41960R2057P8292J19416K9554j71249M7663M33261L71263L21813
$$ 1084319 1326279 1418336 1496628 1616044 1645598 1474349 1522012 1955273 2326536 2648349
10628B648349M14363L96205L41542Q80663Q10141P20451O66030O63286O08486
$$ 2648349 3062712 3458917 3800459 4681122 5491263 6211714 6877744 7541030 8149516
10619H149516J064536J382655J990997K583280L424965M443526O279876Q771666
$$ 8149516 9214052 10596707 12587704 15170984 18595949 23039475 29319351 38091017
10611C8091017J2526242J6908275K0623328K0869735J4589936M132386m751159
$$ 38091017 50617259 67525534 88148862 109018597 123608533 127740919 122989760
10604A22989760q619116p185635k392968L969088J1781471K1540894L3195332
$$ 122989760 114370644 107185009 104792041 108761129 120542600 142083494 175278826
10597A75278826M2845558M2241003K4648832k614714k3825285l0167440k4105883
$$ 175278826 218124384 260365387 285014219 282399505 258574220 228406780 204300897
10590B04300897j3096122l26476J3229978K8599961M4441752N5948764N1007182
$$ 204300897 191204775 190878299 204108277 232708238 277149990 333098754 384105936
10583C84105936K0989268j9735633m7576353n3645831m3849079k9102714j4722764
$$ 384105936 405095204 385359571 337783218 284137387 240288308 211185594 196462830
10576A96462830j261271J1679541K3876493L1044820K5436117L468847k4073014
$$ 196462830 195201559 206881100 230757593 261802413 287238530 290707377 266634363
10569B66634363m0800556m1465054l2833029k1999441j2884773n128527J682149
$$ 266634363 225833807 184368753 151535724 129536283 116651510 111522983 113205132
10562A13205132O647620Q508211N265363l756928j4247894k0244210k0270758
$$ 113205132 119852752 128360963 133626326 129869398 115621504 95377294 75106536
10555G5106536j7229957j3106261r339096o832316m938790l771612k926802k263017
$$ 75106536 57876579 44770318 35431222 28598906 23660116 19888504 16961702 14698685
10547A4698685j523158j269718j200227j189860p74188q19169m63068m43795o65871
$$ 14698685 13175527 11905809 10705582 9515722 8741534 7922365 7459297 7015502 6349631
10538F349631m27313j05064l62236n72924k50098m4839j61325l74785j66579k67081
$$ 6349631 5922318 5817254 5455018 4882094 4631996 4587157 4425832 4051047 3884468 3617387
10528C617387n6148k25269q3037K9370m41010o2649J10377K0966P4999P3079j93568
$$ 3617387 3561239 3335970 3252933 3282303 2841293 2778644 2889021 2909987 2984986 3058065 2864497
10517B864497M7746k79037k81149K5801K13998J1270q5218l23900j30880k89014
$$ 2864497 2912243 2633206 2352057 2377858 2591856 2603126 2517908 2194008 2063128 1774114
10507A774114l1876K48508k3128r9602L9147k72950q3696p876j99542j80878J60427
$$ 1774114 1742238 1990746 1967618 1868016 1907163 1634213 1550517 1542641 1343099 1162221 1322648
10496A322648L35640J27518N6059j21191o1247m1923l013k3589j82504l7585o4605
$$ 1322648 1658288 1785806 1841865 1720674 1659427 1617504 1614491 1590902 1408398 1370813 1306208
10485A306208k28923p2451J14649K63438N2344J42928J19799M2472m0179k15618
$$ 1306208 1077285 1004834 1119483 1382921 1435265 1578193 1697992 1740464 1700285 1484667
10475A484667J59128P5677p6432q3728j28313j60510J40399j6105j74804J0791
$$ 1484667 1643795 1719472 1643040 1559312 1430999 1270489 1410888 1394783 1219979 1230770
10465A230770Q6528K9159k60169O6574O77J00193j61498Q9016J46819M2250p9676
$$ 1230770 1317298 1346457 1086288 1152862 1153539 1253732 1092234 1181250 1328069 1370319 1290643
10454A290643k71406J07408K963j26850J56459m9506N7860J43167Q5286O9216
$$ 1290643 1019237 1126645 1129608 1002758 1159217 1109711 1167571 1310738 1396024 1465240
10444A465240N6779P030j69011l9246O3250n7994k20002k2735O5232k84743k07226
$$ 1465240 1522019 1529049 1360038 1320792 1384042 1326048 1106046 1083311 1148543 863800 656574
10433F56574J1250J89967L17488o5681k16884k10735P5775K7133j45890p4618
$$ 656574 667824 857791 1175279 1109598 892714 681979 757754 784887 638997 564379
10423E64379j56912K14235J21955P907K04591q6253J19909P3299j05137j95994
$$ 564379 407467 621702 743657 751564 956155 869902 989811 1063110 957973 761979
10413G61979q3804M2289N22j8522M2731J7445K73062P5301l49042l5823J67024
$$ 761979 678175 720464 720986 702464 745195 762640 1035702 1111003 761961 726138 893162
10402H93162j10151k41624r0188N5039l01275R066R9063K03824K46384j57270
$$ 893162 783011 541387 451199 506238 204963 214029 313092 516916 763300 606030
10392F06030l60964n9446K36505J17839O2375n067q7456j01289j39547q5690N3081
$$ 606030 245066 185620 422125 539964 602339 597272 509816 408527 268980 183290 236371
10381B36371j70955R394R4185J17964j72064O3571J77262Q712r3394m4991l94521
$$ 236371 65416 74810 168995 286959 114895 178466 355728 364440 271046 226055 -168466
10370a68466l53926L54608N8783J49717L3761l00643L4445J90745J66391m5093
$$ -168466 -522392 -167784 -109001 40716 74477 -226166 -191721 -976 165415 120322
10360A20322j71620j40097j3539J18756J50522L58010K22664j20030p1667p6822
$$ 120322 -51298 -191395 -204934 -86178 64344 422354 645018 524988 453321 376499
10350C76499j78124j70722J06516K35244J40182o3319l06916k59807m9619r1487
$$ 376499 198375 27653 134169 369413 509595 446276 139360 -120447 -170066 -261553
10340b61553K04348p2930q363J37548J88286j28865j67711k5857k0750K2113K36971
$$ -261553 -57205 -130135 -138498 -950 187336 58471 -109240 -135097 -155847 -133734 103237
10329A03237k2618Q6811J96568n6979k22348m10444P2046K77327J66180L7370
$$ 103237 80619 167430 363998 307019 84671 -325773 -253727 23600 189780 227150
10319B27150k17081j90506k29123j4016j08777m3355K46017J51792j63125K38221
$$ 227150 10069 -180437 -409560 -423576 -532353 -575708 -329691 -177899 -341024 -102803
10309a02803J77600o134K12134K07728J28132l21135j48849O1037M3007J49937
$$ -102803 74797 68663 280797 488525 616657 295522 146673 207710 250717 400654
10299D00654Q9078j49594Q2679J84018J61156k78662J75684J88501k02887j05409
$$ 400654 489732 340138 422817 606835 767991 489329 665013 853514 650627 545218
10289E45218o1937l33806j39417Q9855Q1647k4853J81483J55436J6338k97058
$$ 545218 483281 149475 10058 99913 181560 156707 338190 493626 509964 212906
10279B12906o2994J99014k33614K33964r5140j40446J51849j96304n6578L81228
$$ 212906 149912 348926 115312 349276 254136 113690 265539 69235 12657 393885
10269C93885n5401k45240k20669M09387L47434l6587j00931k68773j28178N1393
$$ 393885 338484 93244 -127425 281962 629396 592809 491878 223105 94927 146320
10259A46320L76625K69151m8440p2750j18324k54137p5511j48056L2762R0447
$$ 146320 522945 792096 743656 670906 552582 298445 222934 74878 107640 198087
10249A98087J00902j18089k03984K11584o629k07750J71997J09566K26579j01813
$$ 198087 298989 180900 -23084 188500 181871 -25879 146118 255684 482263 380450
10239C80450k66821r6768J05202J79468n5471q3601o0773j26583p8446O1160l3599
$$ 380450 113629 16861 122063 301531 246060 162459 101686 -24897 -103343 -42183 -75782
10228g5782m5236J08165l12773J01208L86428J60333J15123j51081L784P0944
$$ -75782 -121018 -12853 -325626 -224418 162010 322343 437466 286385 290169 361113
10218C61113j00326k79008r7463J55030p7682Q5033R9240K640j75611J76096J54352
$$ 361113 260787 -18221 -115684 39346 -38336 46697 145937 148577 -27034 149062 303414
10207C03414q5214J079M2749k21120J899R3715o5873j13683J70881N9449l08714
$$ 303414 218200 219279 262028 40908 42807 136522 70649 -43034 127847 187296 -121418
10196a21418k40504L0523L14367Q8876K0706k03428m7190R1437J86870j91224
$$ -121418 -361922 -331399 -17032 71844 92550 -110878 -158068 -66631 120239 -70985
10186g0985Q7763J53454j02408p568r3487l91494J19934J61713L86868L16040
$$ -70985 16778 170232 67824 60256 -33231 -424725 -304791 -143078 243790 559830
10176E59830j40828j13955j38569M456J29942r4369k6174M4062K78006R332m3931
$$ 559830 419002 305047 166478 170934 300876 206507 180333 224395 502401 511733 467802
10165D67802L54141J6452J45500j8117O2870J75667L07667K04587k61240l84883
$$ 467802 821943 838395 983895 965778 1028648 1204315 1511982 1716569 1455329 1070446
10155A070446l02657N6918J3573O6234j8922N2571L89635P19097L53031J31913
$$ 1070446 767789 824707 838280 904514 885592 938163 1327798 2046895 2399926 2531839
10145B531839l07685m18275n29897j97966j06796J14922K36215M4170J5998K60881
$$ 2531839 2224154 1805879 1275982 1078016 971220 1086142 1322357 1366527 1382525 1643406
10135A643406J76029j06413j42402o9791j59816j13215p1152k84869J7901j25434
$$ 1643406 1819435 1713022 1570620 1500829 1341013 1227798 1156646 871777 889678 764244
10125G64244Q336J18304l9754O6397r386l82086j72147j1880j32356j6319q8418
$$ 764244 772580 890884 851130 917527 908141 526055 353908 342028 209672 193353 104935
10114A04935K5087K6664j39257J56569J64123K3264p6270j57491l5948K86864
$$ 104935 130022 156686 17429 173998 338121 361385 285115 127624 91676 378540
10104C78540L1626j58176j50003k62360q6199M13367K54022l4863R9360J41014
$$ 378540 410166 251990 101987 -160373 -246572 166795 420817 385954 485314 626328
10094F26328K6998l35363o5845o4021M9979j0402N1896l0417J46951o5563l0068
$$ 626328 653326 317963 252118 188097 238076 227674 279570 249153 396104 330541 300473
10083C00473o0743j05775J82378k01765q6259J29489k4643q4256J88058L3095
$$ 300473 239730 133955 316333 114568 28309 157798 133155 48899 236957 270052
10073B70052k16599j03831r5237l343L09229J38885n8704p9833n3549Q8118K09246
$$ 270052 53453 -50378 -145615 -148958 160271 299156 240452 160619 107070 195188 404434
10062D04434r0203L6745j7055R8505q2216l56924l46560o9867R6063J51198L34654
$$ 404434 314231 350976 333921 432426 350210 -6714 -353274 -423141 -327078 -175880 158774
10051A58774L1762r119J7714P9930j38437l36337J9733j36432j33270K58036L86175
$$ 158774 190536 181417 199131 279061 140624 -195713 -175980 -312412 -445682 -187646 198529
10040A98529J4184j0082J31542L9443Q4802j48556k63296J0152k54939l5904P9969
$$ 198529 212713 202631 334173 373616 458418 309862 46566 56718 -198221 -234125 -154156
10029a54156L2984J65388Q3160L3270k0945p4597j53590o6682Q7668J81133P1180
$$ -154156 -121172 44216 127376 160646 139701 65104 -88486 -155168 -67500 113633 184813
10018A84813R3281j31643J65578L809k05774j91686n24876j73846L49028K95102
$$ 184813 278094 146451 312029 315838 110064 -81622 -606498 -780344 -431316 -136214
10008a36214R6872q6151j39448J77709K89671j33958o9439J19945J99497k6923
$$ -136214 -39342 -125493 -264941 -87232 202439 68481 -958 118987 318484 291561
9998B91561M092l9407l26681k28603q5469K45274J79116k41264n1790J86037J07105
$$ 291561 295653 256246 -70435 -299038 -384507 -139233 39883 -201381 -253171 -67134 39971
9987C9971J47851L32727P8451J62667j83460l0150o6929n8279J66586j18138j77546
$$ 39971 187822 520549 599000 761667 578207 548057 481128 422849 589435 471297 293751
9976B93751P5609M0449o6438j01145Q4319J25219l65941l81216j7148J86735K1991
$$ 293751 369360 409809 343371 242226 326545 451764 85823 -295393 -312541 -125806 -103815
9965a03815N4995J912M9581L5176k9695L26859p0657l71397K02736K85073j56833
$$ -103815 -48820 -46908 2673 37849 8154 335013 264356 -107041 95695 380768 223935
9954B23935j74654L5588J37928j86821J59940n3782j70424k22687m25527K4761
$$ 223935 49281 84869 222797 35976 195916 142134 -28290 -250977 -676504 -651743
9944f51743K46732K90061J24681q0565k33999K5308K98625L40319k13608j79441
$$ -651743 -405011 -114950 9731 -70834 -304833 -279525 19100 359419 145811 -33630
9934c3630j5326r188J56692o6705r331J28916k51737J00853K56420J92748K9778
$$ -33630 -48956 -58144 98548 31843 22512 151428 -100309 544 256964 449712 479490
9923D79490N19972L36179k00797m74734j10745N8834n0604R426j58219J02361
$$ 479490 999462 1335641 1134844 660110 549365 608199 557595 567021 408802 511163
9913E11163k42937p5572M6752o452J03678j20844m4856j88604l15802j49949K76871
$$ 511163 268226 192654 239406 232954 336632 215788 170932 -17672 -333474 -483423 -206552
9902b06552L5807K5667K81498k2738J32934o4270j74730p9492J29428q9368j2080
$$ -206552 -170745 -145078 136420 113682 246616 182346 7616 -71876 57552 -31816 -43896
9891d3896k04516j92809O1180J47344K10615k03770k45712n9247L99613L53180
$$ -43896 -248412 -441221 -380041 -232697 -22082 -225852 -471564 -530811 -131198 221982
9881B21982P7478j27903j60024o8587J02957l08733k34751K05684k1519K19944
$$ 221982 299460 171557 11533 -57054 45903 -262830 -497581 -291897 -313416 -93472
9871i3472M1366m0944N1521j15538J34846J92179k07170n4762R465n5842k1218
$$ -93472 -52106 -93050 -41529 -157067 -22221 169958 -37212 -91974 -82509 -138351 -159569
9860a59569N8069j24050r8768J56993O6654N0666J36897J4622Q6525O1732k54428
$$ -159569 -101500 -225550 -324318 -167325 -100671 -50005 86892 101514 188039 249771 -4657
9849d657l04458m4434Q024k26111j84193L80791J36987l01105k2818J03293r5247
$$ -4657 -309115 -353549 -345525 -571636 -755829 -375038 -238051 -539156 -561974 -458681 -553928
9838e53928Q7690J96317K68681R1102k13027L830K3581P8514L8990K8944j40749
$$ -553928 -466238 -269921 -1240 89862 -123165 -119335 -95754 -17240 21750 50694 -90055
9827i0055k71614m0106L62659N6576K44780N4827l43784J04458J7726J51256j00862
$$ -90055 -361669 -401775 -39116 17460 262240 317067 -26717 77741 95467 246723 145861
9816A45861l48743l4383k1274K21832J79636R8189j59057j24155k36156j19384
$$ 145861 -202882 -237265 -258539 -36707 142929 241118 82061 -42094 -278250 -397634
9806c97634j38919K28673J5570l01969Q7742J69894J22882j706L18328L47285
$$ -397634 -536553 -307880 -292310 -594279 -506537 -336643 -213761 -215467 102861 450146
9796D50146M7130j73406k24264j37536P6889j12752j09763R0530p1493r9312l3219
$$ 450146 497276 323870 99606 -37930 38959 -73793 -183556 -93026 -164519 -263831 -297050
9785b97050Q7283M2561O7561m9063P4047J34640J44974j32310M3254J98640j41493
$$ -297050 -209767 -167206 -99645 -148708 -74661 59979 204953 72643 115897 314537 173044
9774A73044p9112J22305R9955J86855j62464k09208l24277r1150J38825q807J22579
$$ 173044 93932 216237 316192 503047 340583 131375 -192902 -284052 -145227 -154034 -31455
9763c1455J48508j76756j5312K04472N1667L4281J3919j44413Q3148J85059j19326
$$ -31455 117053 -59703 -75015 129457 181124 215405 229324 84911 168059 353118 233792
9752B33792k06234j31013j32113J63074K2432r6506J55615J29141Q0864j01144
$$ 233792 27558 -103455 -235568 -72494 -50062 -146568 9047 138188 219052 117908
9742A17908n3359k21605j0814M5061o9364p1554k31063K52686L93614m6044k0370
$$ 117908 64549 -157056 -167870 -122809 -192173 -263727 -494790 -242104 151510 105466 85096
9731H5096N8704J02632J65594k7482q3395k15479k15007k42817j20913L21752
$$ 85096 143800 246432 412026 384544 301149 85670 -129337 -372154 -493067 -171315
9721a71315L7123j74980q6333P2962J41045Q2018k12938l17444L7488n9084J98462
$$ -171315 -134192 -309172 -395505 -322543 -181498 -99480 -312418 -629862 -592374 -651458 -452996
9710d52996K84860P2420p7169j02443k9067J49988M81818J13720q9503k7293k35153
$$ -452996 -168136 -95716 -172885 -275328 -304395 -154407 327411 441131 351628 324335 89182
9699H9182J32183l9992j96975k9623J57246q9562r6796j26817K79647O2038r1427
$$ 89182 221365 181373 -15602 -45225 112021 22459 -74337 -201154 78493 140531 49104
9688D9104r4966j38250J32804J27225j28251j91678j04911J73856K23304j82390
$$ 49104 -45862 -184112 -51308 75917 -52334 -244012 -348923 -175067 48237 -134153
9678a34153J05527J39217J36673k22149Q3006K8588L5123R7294l35264n3851l3676
$$ -134153 -28626 110591 247264 25115 108121 136709 171832 269126 -66138 -119989 -153665
9667a53665k2651o5660J712o8867P6826k66974j21643K81436J83394j33886o0079
$$ -153665 -176316 -241976 -240264 -309131 -232305 -499279 -620922 -339486 -156092 -289978 -350057
9656c50057J63150J4448L4647L91455K3349K8722K6275k19325K17319K37446q9807
$$ -350057 -186907 -172459 -137812 253643 276992 305714 331989 112664 329983 567429 477622
9645D77622J52167K55971L92016P2904l96669l90376k54459m4596k93780l99339
$$ 477622 629789 885760 1277776 1350680 954011 563635 309176 264580 -29200 -428539
9635d28539K09378R0487N1721J88728n148K16423p6084l06720p1893L55855q5573
$$ -428539 -219161 -128674 -76953 111775 106627 323050 246966 -59754 -131647 224208 138635
9624A38635l6831j7190Q5365J29664n094j81898K9695j13707r5068j3942Q5663
$$ 138635 101804 84614 169979 299643 294549 112651 142346 28639 -66429 -80371 5292
9613E292L0456j64174m0375n8533J52313N4023J23223L42915o4067l03852k32596
$$ 5292 35748 -128426 -168801 -227334 -75021 -20998 102225 445140 381073 77221 -155375
9602a55375J30965K01665j09888M0949K74752k22125j76823L6699n903j73689
$$ -155375 -24410 177255 67367 108316 383068 160943 -15880 20819 14916 -158773
9592a58773K3695l7552K06339K22980J2361j08415j50892l14176j17300K51882
$$ -158773 -135078 -172630 33709 256689 269050 160635 9743 -304433 -421733 -169851
9582a69851N6417J3972K81361K06547j85561j8903j20758k90630k03917P8394
$$ -169851 -113434 -99462 181899 388446 202885 183982 63224 -227406 -431323 -352929
9572c52929J03836k1376O2888P5108j11361n209J5245J16489j29104j6933O2964
$$ -352929 -249093 -270469 -207581 -132473 -243834 -249043 -233798 -117309 -246413 -263346 -200382
9561b00382R9826L16993Q7658j90368k58737K40653K70124k11094j45858k1761
$$ -200382 -100556 216437 304095 113727 -145010 95643 365767 154673 8815 -12946
9551a2946J2386N1484J2457O1358k65470m8815o8966j27274J35846K11982K52026
$$ -12946 -560 50924 63381 124739 -140731 -189546 -258512 -385786 -249940 -37958 214068
9540B14068j68025n1816j25269P0631K40068j61747k36215L60586K09990m5191
$$ 214068 46043 -5773 -131042 -60411 179657 17910 -218305 142281 352271 307080
9530C07080p4523j80874P6254L3827k02193j39497J41427m317o1719q5058J44535
$$ 307080 232557 51683 127937 161764 -40429 -179926 -38499 -42816 -104535 -189593 -45058
9519d5058m7848p1674k814j07142r2438K31125M05637K7024j7525k5886k06599
$$ -45058 -92906 -164580 -167394 -274536 -366974 -135849 269788 296812 279287 253401 46802
9508D6802l14442p98p0517L0779J43958J59699L1391J88104J51028k16404k35166
$$ 46802 -267640 -268438 -338955 -308176 -164218 -4519 26872 214976 366004 149600 -85566
9497h5566L391j05915p3628J36431J41326j48321R791k5143O4271J65170j13339
$$ -85566 -82175 -188090 -261718 -125287 16039 -132282 -122491 -147634 -83363 81807 -31532
9486c1532j62524q1167Q6869R1277J77705K1319J47664l2648P2552q0455o6325
$$ -31532 -194056 -275223 -188354 -97077 80628 101947 249611 216963 289515 209060 142735
9475A42735L6730K29363o6005m11636k12578J20963M0968L36008J58305k51682
$$ 142735 179465 408828 342823 -68813 -281391 -160428 -119460 216548 374853 123171
9465A23171j60230k04162j6157J10164j50570K49758k4096j66850j76609J2683
$$ 123171 -37059 -241221 -257378 -147214 -297784 -48026 -72122 -238972 -415581 -402898
9455d02898J77993N0987j11608j68370l8054K40828J13271P145j81914J47431
$$ -402898 -224905 -173918 -285526 -453896 -491950 -251122 -137851 -130706 -312620 -165189
9445a65189J65470l8549l6891J847J92471J36158J60704J19363j78386J2786M671
$$ -165189 281 -38268 -75159 -73312 119159 255317 416021 535384 356998 369784 374455
9434C74455m55957j07808j18573j34508J57315M1858M8699M8320O544R9392L5380
$$ 374455 -81502 -189310 -307883 -442391 -285076 -243218 -194519 -146199 -139655 -40263 -4883
9423d883J81641k57128k36918K42778P9209m6850N6308L09569R1504l8606q6077
$$ -4883 176758 -80370 -317288 -74510 4699 -42151 14157 323726 415230 376624 290547
9412B90547j3975l07484k22020k9847Q8320K25207o4888J69133R9284k93377l40378
$$ 290547 276572 -30912 -252932 -282779 -194459 30748 -34140 134993 234277 -59100 -399478
9401c99478j56956j1480j32523L11678K61923K71408j78665m44227M0557L61870
$$ -399478 -556434 -567914 -700437 -388759 -126836 144572 -34093 -478320 -437763 -75893
9391g5893K31393K72290n5366j12961j7681M4425j72914J40078J45651m1844j64485
$$ -75893 155500 427790 372424 259463 241782 286207 113293 253371 399022 357178 192693
9380A92693K95845Q1166m37469j46059K68149J94682J30819j79119j55368j43341
$$ 192693 488538 569704 132235 -13824 254325 449007 579826 400707 245339 101998
9370A01998P1333k61984r7838j5305Q2179O5263j49291J13202P5325o4179L4261
$$ 101998 173331 -88653 -186491 -201796 -119617 -54354 -203645 -90443 -15118 -79297 -45036
9359d5036K26762J36396K01068k78324j92828r3129J2806J43380J2770j03443
$$ -45036 181726 318122 519190 240866 48038 -45091 -32285 111095 123865 20422
9349B0422l4871J50128k02477N6174K43560L7616J45932J8845j5151j59906j31429
$$ 20422 -14449 135679 -66798 -10624 232936 270552 416484 435329 420178 260272 128843
9338A28843k18641K0256L52841K64951M5716j33084k03329k90081k59833J97443
$$ 128843 -89798 -69542 283299 548250 593966 460882 257553 -32528 -292361 -94918
9328i4918o158p9087J27488n8296R9119L13032R9536j47585O1882p3563j84832
$$ -94918 -101076 -180163 -52675 -110971 -11852 301180 400716 253131 315013 241450 56618
9317E6618J61620P2818n1193m97382J04259J86751l0506k00896k83272J97753
$$ 56618 218238 291056 239863 -257519 -153260 33491 2985 -197911 -481183 -283430
9307b83430J01853q6781k02052M8232L76688q7889m4879J93518J71727l27306
$$ -283430 -181577 -268358 -470410 -422178 -45490 -133379 -178258 15260 186987 -140319
9297a40319p6631K6005J47289J49938K5237J77567j69954l12603J67762J59474
$$ -140319 -216950 -190945 -43656 106282 131519 309086 139132 -173471 -5709 153765
9287A53765k97673n5953L28255J1539m5958j04407Q1949j17932k6343k32910q8669
$$ 153765 -143908 -199861 128394 139933 93975 -10432 71517 -46415 -72758 -305668 -394337
9276c94337P4448J76043K80098j8714k52698j10567o4288J44150Q4284j33314
$$ -394337 -319889 -143846 136252 117538 -135160 -245727 -310015 -165865 -81581 -214895
9266b14895k79334J87611N6943R4501p5850K4440J71239M2684n3492l69025K24098
$$ -214895 -494229 -306618 -249675 -155174 -231024 -206584 -35345 7339 -46153 -415178 -191080
9255a91080L38648k85123k89438r5607J94710L52239P0774l0273K12934K04978
$$ -191080 147568 -137555 -426993 -522600 -327890 24349 95123 64850 277784 482762
9245D82762J83467j25094k26576j33581j49222l2704J74459j25139j86570j10241
$$ 482762 666229 541135 314559 180978 31756 -948 173511 48372 -138198 -248439
9235b48439p0768N2540P8485P5086j83453K97118j13052j79737P1703Q5834J36677
$$ -248439 -319207 -266667 -188182 -113096 -296549 569 -112483 -292220 -220517 -134683 1994
9224A994J71489K0288L34157o5141j26733j13680k76087R2159K66840Q4417k2125
$$ 1994 173483 193771 527928 462787 336054 222374 -53713 38446 305286 389703 367578
9213C67578j51120l660J2471k39723l17428j50408Q1378L28282J58938l37164
$$ 367578 216458 212798 225269 -14454 -331882 -482290 -400912 -72630 86308 -250856
9203b50856k6128O1605P2879J79231Q7982J56473j77374k67425j36979m06J4451
$$ -250856 -276984 -215379 -142500 36731 124713 281186 103812 -163613 -300592 -300998 -286547
9192b86547r3979Q3604K31333j05051J14834k9496J90002K24958k24682P360j43391
$$ -286547 -380526 -296922 -65589 -170640 -55806 -85302 104700 329658 104976 112336 -31055
9181c1055k07534K63734K86630j08949j34352q7251M8873j08128Q287j94343R8001
$$ -31055 -238589 25145 311775 202826 68474 -18777 30096 -78032 -69745 -264088 -166087
9170a66087L3980j63697R2919J04793L6101J70902J31073k04864m8792K47454
$$ -166087 -132107 -295804 -202885 -98092 -61991 108911 239984 35120 -13672 233782
9160B33782J20248M5558k30586j49683j90358J16584j06244r8000l9133K89971
$$ 233782 354030 399588 169002 19319 -171039 -54455 -160699 -258699 -297832 -7861
9150g861J1881l07517P0966K33K18237j451K0216J99249J4291K1202j39251j17909
$$ -7861 4020 -303497 -232531 -232298 -14061 -15512 4704 203953 218244 239446 100195 -17714
9138a7714P6162R6310L24192j21288j90020j4350N7090j76424j93869K52699m6952
$$ -17714 58448 154758 478950 357662 167642 153292 210382 33958 -159911 92788 45836
9127D5836k8869K3452J09031k77960k53391J36793K02419j98249k14052J32456
$$ 45836 16967 40419 149450 -128510 -381901 -245108 -42689 -240938 -454990 -322534
9117c22534J98422L96693j23581k15316j15711P408J36247q191K63338j48605
$$ -322534 -124112 272581 149000 -66316 -182027 -174619 -38372 -46563 216775 68170
9107F8170k64785L3653k1096J02428K7667j13686k8636j21775K64587k8243j5383
$$ 68170 -196615 -162962 -184058 -81630 -53963 -167649 -196285 -318060 -53473 -81716 -97099
9096i7099J7147R5271j58115n8602K03081o9763R8653J98399k46439j03862k00301
$$ -97099 -79952 15319 -142796 -201398 1683 -68080 30573 228972 -17467 -121329 -321630
9085c21630J07249K35121M1555o5350J21051j82252l00438l1492K8211J81642
$$ -321630 -214381 20740 62295 -3055 117996 -64256 -364694 -396186 -367975 -186333
9075a86333K48431K90892k21577Q2558r4507j58045p0561M2648K7974O223J49237
$$ -186333 62098 352990 131413 213971 119464 -38581 -109142 -66494 -38520 -32297 116940
9064A16940M1900J94735K1585j08989l0171p9149J86336N3115j63662L1871l31430
$$ 116940 158840 353575 375160 266171 236000 156851 343187 396302 232640 264511 -66919
9053f6919o6989l0518J66827q9342L1555K1858k9129J36255M41682j40992k26406
$$ -66919 -133908 -164426 2401 -86941 -55386 -33528 -62657 73598 515280 374288 147882
9042A47882j21784J61018m1270k03410J1500j07862q2064K0303L8465J39577J93807
$$ 147882 26098 187116 145846 -57564 -46064 -153926 -235990 -215687 -177222 -37645 156162
9031A56162L880j99203k66664M0820K61315J11897q926p0802L2075j4484j29681
$$ 156162 160042 -39161 -305825 -265005 -3690 108207 99281 28479 60554 46070 -83611
9020h3611l5212J34389J25663l634j00683L433k91422J9477K31191p9269j2373
$$ -83611 -118823 15566 141229 137595 36912 40345 -251077 -231600 -409 -79678 -92051
9009i2051j12139l0116K58885K43836P3658j23395k35188k52714R2429j63942
$$ -92051 -204190 -234306 24579 268415 342073 218678 -16510 -269224 -176795 -340737
8999c40737j0809L42829J89505l75861l6878K12557j32651J01693K09585m2491
$$ -340737 -351546 -8717 180788 -195073 -231951 -19394 -152045 -50352 159233 116742
8989A16742k77631j11360J41548Q9154N8896L4931j33437M9756O0755n5001O9655
$$ 116742 -160889 -272249 -130701 -41547 17349 52280 -81157 -31401 29354 -25647 44008
8978D4008J3320O1773J01394J647K00683k03945K0836l01716j30859k4617j21591
$$ 44008 57328 119101 220495 222142 422825 218880 239716 -62000 -192859 -217476 -339067
8967c39067J67447K44941K96851K31800j69408k70460m63351P7518L56409Q3433
$$ -339067 -171620 73321 370172 601972 432564 162104 -301247 -223729 132680 216113
8957B16113q8389O3912j4361l14469n897J25032k96510J08456L754k0930J12253
$$ 216113 127724 191636 177275 -137194 -143091 -18059 -314569 -206113 -202359 -223289 -111036
8946a11036J89995n4435j09519j16319K4063K48482K41881k49599k57327J1576
$$ -111036 78959 24524 -84995 -201314 -177251 71231 313112 63513 -193814 -182238
8936a82238k26496R926K81246j19753J8290M6050M9502O120K0307j16053J19463
$$ -182238 -408734 -398808 -117562 -237315 -219025 -172975 -123473 -117353 -97046 -213099 -93636
8925i3636l7325J34880r6067l07219K40624M19006k4109k73884k82386k3554M1241
$$ -93636 -130961 3919 -92148 -399367 -158743 260263 236154 -37730 -320116 -343670 -302429
8914c02429j44195R3642J86894J07690r592K6881j16052M9161M949N0401k50823
$$ -302429 -446624 -352982 -166088 -58398 -67990 -41109 -157161 -108000 -103051 -52650 -303473
8903c03473N4820J11488J84036n5716J43310J70058k70181j75980k12083k40698
$$ -303473 -248653 -137165 46871 -8845 134465 304523 34342 -141638 -353721 -594419
8893e94419O02934L30995p3047j83178J649J67659P8726P2642j74685K1495M1901
$$ -594419 8515 339510 266463 83285 84934 252593 331319 403961 229276 250771 292672
8882B92672j5556k76384q8267j588J72646p3296j54599j45969R7441q9426j96553
$$ 292672 277116 732 -87535 -89123 83523 10227 -144372 -290341 -192900 -282326 -478879
8871d78879J03256j2289N1603M80502m8869l65675K9019K10433j84074r2906j7631
$$ -478879 -375623 -387912 -336309 144193 95324 -270351 -241332 -30899 -214973 -307879 -325510
8860c25510K0438M66589Q0877m79867j97477J89953J7073k55273l9349r5273k9947
$$ -325510 -305072 161517 242394 -237473 -434950 -244997 -227924 -483197 -522546 -617819 -647766
8849f47766L41119K49147J25899k82106q094J56752J38845l0517q649m626K0147
$$ -647766 -306647 -57500 68399 -213707 -221801 -65049 73796 43279 34630 30004 50151
8838E0151J05933n7817j378l258N4033r3734j06514J49374N5107r2580R3625o4743
$$ 50151 156084 98267 96889 93631 147664 53930 -52584 96790 151897 59317 152942 88199
8826H8199o8800k5571K7267o6304k8079J00770j4869j28710J57235J61765K09807
$$ 88199 19399 -6172 21095 -45209 -73288 27482 12613 -116097 41138 202903 412710
8815D12710j26899j64464p9243K966j10309J27532L37227K0553J3869r6260n8389
$$ 412710 285811 121347 42104 45070 -65239 62293 399520 420073 433942 337682 279293
8804B79293Q7953J40235k2431k18396l04946m3063l23818n063L12244M1388Q3131
$$ 279293 367246 507481 485050 266654 -38292 -81355 -405173 -410236 -97992 -56604 26527
8793B6527K2515j35367j3699J40845J36993k4559j07037p6986K1007P6933R2289
$$ 26527 49042 -86325 -100024 40821 177814 153255 46218 -30768 -9761 67172 159461
8782A59461k50317j43247J08605j5328k82643k41664L93625L42365J92683m2983
$$ 159461 -90856 -234103 -125498 -140826 -423469 -665133 -271508 70857 263540 220557
8772B20557j18058j18507m0590j2387L0935r2588N9133J75034m9019n1632K33798
$$ 220557 102499 -16008 -56598 -68985 -38050 -130638 -71505 103529 54510 2878 236676
8761B36676p8262k45922j11947k20837o1659M052K72828L18872J06885N4887M8922
$$ 236676 158414 -87508 -199455 -420292 -481951 -477899 -205071 113801 220686 275573 324495
8750C24495j15539R935j37684j68648k16284k1421r1604P1351j08243j14007J97872
$$ 324495 208956 218891 81207 -87441 -303725 -325146 -416750 -345399 -453642 -567649 -369777
8739c69777J33327k7981j80435J13072j1623p8350P151J21730J47591J3325n551
$$ -369777 -236450 -264431 -444866 -331794 -343417 -421767 -414616 -292886 -145295 -131970 -137521
8728a37521j84333n268J2757o0651M9956J28271P3330K01358m4121J1254k4721
$$ -137521 -321854 -327122 -314365 -375016 -325060 -196789 -123459 77899 33778 45032 20311
8717B0311N1466M0952m0066j6230j17169j68503j19013J66414K3407J34670K1756
$$ 20311 71777 112729 72663 56433 -60736 -229239 -348252 -181838 -158431 -23761 -2005
8706b005k77965k5868J17597J44816j5359j33493j9594Q0552J76892J07946K50531
$$ -2005 -279970 -305838 -188241 -43425 -58784 -192277 -211871 -131319 45573 153519 404050
8695D04050q0060l8725j26212P4748J28016k65876j2204k7085k8002q0245L02885
$$ 404050 323990 285265 159053 233801 361817 95941 83737 56652 28650 -51595 251290
8684B51290J81406r4459J91619K6932K3977j98961l65979k33965k2922J40985
$$ 251290 432696 338237 529856 556788 580765 381804 15825 -218140 -241062 -100077
8674a00077J52028M2355j33352K83017J53009k09899M3787q3922o7289l26092
$$ -100077 51951 94306 -39046 243971 396980 187081 230868 146946 79657 -246435
8664b46435N8337M04498q4006k22337L8998j05736j65157Q4103K31823O7361j20828
$$ -246435 -188098 216400 132394 -89943 -50945 -156681 -321838 -237735 -5912 61449 -59379
8653e9379J00250R4780p5504m8476Q2985k09338k65895J0936Q0441K00855J82782
$$ -59379 40871 135651 60147 11671 94656 -114682 -380577 -369641 -289200 -88345 94437
8642I4437j63595J17905K82982j2548p1749J47364R8896L35279k24970m11284
$$ 94437 -69158 48747 331729 319181 247432 394796 493692 828971 604001 192717
8632A92717j88651l5317o0756j7220m0850j02124R5484L57025m3256j97739q785
$$ 192717 4066 -31251 -92007 -109227 -150077 -252201 -156717 200308 157052 -40687 -49472
8621d9472K48134p190j1922M6682k71143J88282K18689j65141j47230o5355r5026
$$ -49472 198662 191472 179550 226232 -44911 143371 362060 196919 49689 -15666 -110692
8610a10692n6139J46552N9844O4843j40332m0597J97674L002n1463j46037K46297
$$ -110692 -166831 -20279 39565 104408 -35924 -76521 121153 124155 72692 -73345 172952
8599A72952k18383j7923P8220k91339J40890M7262l03606m1225L76034L30879
$$ 172952 -45431 -63354 14866 -276473 -135583 -88321 -391927 -433152 -57118 273761
8589B73761r027P3565P5468N0979K39613l81969j78063l5502L00514K68457J10342
$$ 273761 264734 338299 413767 464746 704359 322390 144327 108825 409339 677796 788138
8578G88138q2178r6059j3280j54426m3875J9250m2121k34467n7154K21921k5325
$$ 788138 705960 609901 596621 442195 398320 417570 375449 140982 83828 305749 280424
8567B80424k81492N6074r0570J59513k1419k14000k52888k68299n2846Q1991J94101
$$ 280424 -1068 55006 -35564 123949 102530 -111470 -364358 -632657 -685503 -603512 -409411
8556d09411J28076j8434J76323J27631k94917k02924J68497R9834j1101n9055
$$ -409411 -281335 -299769 -123446 4185 -290732 -493656 -325159 -225325 -236426 -295481
8546b95481N8229j20446K51575J84814m9110M2028K03145J17132l3018l35221
$$ -295481 -237252 -357698 -106123 78691 29581 71609 274754 391886 358868 23647
8536B3647j16062k72373n6676J74960Q2383R4054n8558K7239J51743J59886l03749
$$ 23647 -92415 -364788 -421464 -246504 -164121 -70067 -128625 -101386 50357 210243 -93506
8525i3506k79409N763J92747n7999l58229J33176K56376J40416L4414P2348j29511
$$ -93506 -372915 -367152 -174405 -232404 -590633 -457457 -201081 -60665 -26251 46097 -83414
8514h3414r0291Q4591L5958k43844K07701J79431j64547j45882j26768j22212
$$ -83414 -173705 -89114 -53156 -297000 -89299 90132 -74415 -220297 -347065 -469277
8504d69277k14619K91270O42358l8054k39590J04062K57992j69096j33690j45535
$$ -469277 -683896 -392626 249732 211678 -27912 76150 334142 165046 31356 -114179
8494a14179l9097j72062M2000J63744J62442R1463q2533j44372o2286P7928L25486
$$ -114179 -153276 -325338 -283338 -119594 42848 134311 51778 -92594 -154880 -76952 248534
8483B48534R3481l8934j97631l40964P7137n6341p9598J58571K35879J3006l2219
$$ 248534 342015 303081 105450 -235514 -158377 -214718 -294316 -135745 100134 113140 80921
8472H0921j15694J8055J3969n789k05817j59603O6258k867K92273J39986J62211
$$ 80921 -34773 -16718 -2749 -8538 -214355 -373958 -307700 -310567 -18294 121692 283903
8461B83903J61172j06482k18796l5967J82274M3009j30543k65459j16097K61328
$$ 283903 445075 338593 119797 83830 266104 309113 178570 -86889 -202986 58342
8451E8342J82922J62485J15155j88719l72341O5476R7191N5117o087K62932j09139
$$ 58342 241264 403749 518904 330185 -42156 23320 120511 175628 169541 432473 323334
8440C23334j25525q7952J8974J51992J52259O5636j62010K4262k06114K71633
$$ 323334 197809 109857 128831 280823 433082 498718 336708 360970 154856 426489
8430D26489P7572M218r1956m18439j57503J09939K74192J17319j28353K55091
$$ 426489 504061 508279 416323 -2116 -159619 -49680 224512 341831 213478 468569
8420D68569L1833j27318n7082n3136j92121j26101p6605Q5612J5313J1236J7996
$$ 468569 500402 373084 316002 262866 70745 -55356 -131961 -46349 -31036 -19800 -1804
8409a804j23082k59265j16626J7774M42125O6010k23917J06588R6653j86288J75205
$$ -1804 -124886 -384151 -500777 -483003 -40878 25132 -198785 -92197 4456 -181832 -6627
8398f627J2011j66066n12571o6510N16330L96131j61838L168J06787J64934j93473
$$ -6627 5384 -160682 -673253 -739763 -223433 172698 10860 14028 120815 285749 92276
8387I2276R5386N34121K8044l31442j81774O8212L8533k96305k22391R9966L58659
$$ 92276 187662 721783 749827 418385 236611 304823 343356 47051 -175340 -75374 283285
8376B83285m9908j29184j7611j36313k21851k31415J50698O15758J00493k36040
$$ 283285 233377 104193 86582 -49731 -271582 -502997 -352299 263459 363952 127912
8366A27912J752j77527J7318L0092k4815J09330l6738j37045q5546K4925J24994
$$ 127912 129664 -47863 -30545 -453 -25268 84062 47324 -89721 -175267 -150342 -25348
8355b5348K8073j15671n8546J50491P8397j66988m07089J13226K06381K39717
$$ -25348 2725 -112946 -171492 -21001 57396 -109592 -516681 -403455 -197074 42643
8345D2643J85798J09403Q1348j38784K70518l7296m18685j49765K38946J07042
$$ 42643 228441 337844 419192 280408 550926 513630 94945 -54820 184126 291168
8335B91168j28189K06852O2546k94570k10076j02493m0411p7208q7020K54184
$$ 291168 162979 369831 432377 137807 -72269 -174762 -215173 -292381 -379401 -125217
8325a25217J02212r617K9689j92100o5450Q2667J07959j90640j80681J68818J58085
$$ -125217 -23005 -32622 -2933 -195033 -260483 -177816 -69857 -260497 -441178 -272360 -114275
8314a14275j33619j34007k56327K36636L36938J69487j44114j13871l4853R6248
$$ -114275 -247894 -381901 -638228 -401592 -64654 104833 -39281 -153152 -188005 -91757
8304i1757J33245r4348k09452j32486J36796L04628K93402k20008j52927k02502
$$ -91757 41488 -52860 -262312 -394798 -258002 46626 340028 120020 -32907 -235409
8294b35409L28658J24944J92318q3930k20349k64468j98949j90956M0480J09600
$$ -235409 93249 218193 410511 326581 106232 -158236 -357185 -548141 -507661 -398061
8284c98061J39225J38652J55885j59115L3209K9388p4285j46522j5314n1881K049
$$ -398061 -258836 -120184 35701 -123414 -90205 -60817 -135102 -281624 -296938 -348819 -346770
8273c46770P9751K15032N8361K41883j234k38179O4797K42380q164j22645L7565
$$ -346770 -267019 -51987 6374 248257 247023 8844 73641 316021 307857 185212 222777
8262B22777l9801p0817j13892j4872K50524J9571k99295j75948n3356j56061J45542
$$ 222777 182976 112159 -1733 -16605 233919 253490 -45805 -221753 -275109 -431170 -285628
8251b85628L10347K76654q1624j20444J43703J61601k21556N9339K90721J89331
$$ -285628 24719 301373 219749 99305 243008 404609 183053 242392 533113 722444
8241G22444k30351j71464j43130K5105n6238l38570K2053L23831M21016j90919
$$ 722444 492093 320629 177499 202604 146366 -192204 -170151 153680 574696 383777
8231C83777j41532l0624k17664o1845J60492P5729K25075l81601m26641J38695
$$ 383777 242245 211621 -6043 -67888 92604 168333 393408 11807 -414834 -276139
8221b76139R2114K15153J77947L2143o6821j4360Q6251j227N6461k9755R625r6881
$$ -276139 -184025 31128 209075 241218 174397 160037 246288 245061 301522 271767 281392 184511
8209A84511O678J5825m7J03972O729N144n04345o3740K72792J14875n0360N809
$$ 184511 191189 207014 206967 310939 317668 322812 -181533 -245273 27519 142394 92034 97843
8197I7843j25685j96506M3401J58759J51673M6956K2336k36002k48622J36478
$$ 97843 -27842 -224348 -180947 -22188 129485 176441 198777 -37225 -285847 -149369
8187a49369Q0210N8998M1113L50063K7784l13144o451j26024q5771k62058j08218
$$ -149369 -69159 -10161 30952 381015 408799 95655 89204 -36820 -122591 -384649 -492867
8176d92867J87645Q921j43600k0011N6878J26615Q833O1888J44266o4955p3998
$$ -492867 -305222 -296301 -439901 -459912 -403034 -276419 -267586 -205698 -61432 -126387 -200385
8165b00385k39564o4025Q2693j19883J06139O70k5586J04268N9834J9643p3794
$$ -200385 -439949 -503974 -421281 -541164 -435025 -434355 -459941 -355673 -295839 -276196 -349990
8154c49990Q7259J02343Q3609j14310M2680l7474O2353J13448r3298k07996j07842
$$ -349990 -262731 -160388 -76779 -191089 -148409 -185883 -123530 -10082 -103380 -311376 -419218
8143d19218J69772J52912K4471Q941j02421l01586o0967J20334k22045J39566
$$ -419218 -249446 -96534 -72063 -63122 -165543 -467129 -528096 -407762 -629807 -490241
8133d90241K38457K37280j78744q5037j18510J25673J54202k12354p4911Q8856
$$ -490241 -251784 -14504 -193248 -278285 -396795 -271122 -116920 -329274 -404185 -315329
8123c15329N5710j53257P8260J98138Q8918J8611m6802K38425K50021n3251k41998
$$ -315329 -259619 -412876 -334616 -136478 -47560 -28949 -75751 162674 412695 359444 117446
8112A17446j26797O7261k17551Q8734j30506L2922j04637J30512J35553j37992
$$ 117446 -9351 57910 -159641 -70907 -201413 -168491 -273128 -142616 -7063 -145055
8102a45055J19845q722l04255r7982L25432K5324K03518J29550J58603O2112k12616
$$ -145055 -25210 -33932 -338187 -436169 -110737 -85413 118105 247655 406258 468370 255754
8091B55754k93010k83969L6028q1907J83463J6666j61824n0264K07610L26438
$$ 255754 -37256 -321225 -285197 -367104 -183641 -166975 -328799 -379063 -171453 154985
8081A54985N4884j78288k14060k512Q6830J15384j46169l09246K72986L86130
$$ 154985 209869 31581 -182479 -184991 -98161 17223 -128946 -438192 -165206 220924
8071B20924j4108J99542R3993n4703j61582n41633N4705J23774K37625K41484
$$ 220924 206816 406358 500351 445648 284066 -257567 -202862 -79088 158537 400021
8061D00021J057r0737n8882k8347r2584J68765k12402j29889J78367j11386k86334
$$ 400021 401078 310341 251459 223112 130528 299293 86891 -42998 135369 23983 -262351
8050b62351P0157J44407K38824J97692j18043k74188n9050l2000N8463p8856N5776
$$ -262351 -192194 -47787 191037 388729 270686 -3502 -62552 -94552 -36089 -114945 -59169
8039e9169J13565k55598l95930j49008J58098M17853Q1855j07949p046N4832j75008
$$ -59169 54396 -201202 -597132 -746140 -588042 -170189 -88334 -196283 -203329 -148497 -323505
8028c23505K77616R2821q8802q3888M0713M4186j57422L1970J8683j13694p2446
$$ -323505 -45889 46932 -41870 -125758 -85045 -40859 -198281 -166311 -147628 -261322 -333768
8017c33768q0312Q5645N8034j8588J7284j65531j79933J9322J600J97057M68034
$$ -333768 -414080 -328435 -270401 -288989 -271705 -437236 -617169 -597847 -596247 -399190 68844
8006F8844J22559M8615Q3072K85860N2411j72691j64487J1738k22184r915j93128
$$ 68844 191403 240018 323090 608950 661361 488670 324183 335921 113737 103822 -89306
7995h9306L1702J86069J03888j44805K9130K07918q829r8080k74233j36498p4240
$$ -89306 -57604 128465 232353 87548 116678 324596 315767 217687 -56546 -193044 -267284
7984b67284J75701N56808M0278m02085k23436j44010L34800L48804L4715m2670
$$ -267284 -91583 465225 505503 103418 -120018 -264028 70772 419576 454291 411621
7974D11621l2673L509j25118k5732J53243k3002l0325J75672j12963r2861k16999
$$ 411621 378948 382457 257339 231607 384850 361848 331523 507195 394232 301371 84372
7963H4372j52970K37775J95899k50582k24714k37792k11014L37913K19360r1316
$$ 84372 -68598 169177 365076 114494 -110220 -348012 -559026 -221113 -1753 -93069
7953i3069j23857j0919j43918K21338J56210O8075l9383l48220q9702Q3232k81601
$$ -93069 -216926 -227845 -371763 -150425 5785 73860 34477 -313743 -403445 -320213 -601814
7942f01814O7221K55751p493n3441J29184K7592j91815P2807K51975J75697K07509
$$ -601814 -534593 -278842 -286335 -339776 -210592 -183000 -374815 -302008 -50033 125664 333173
7931C33173l3751j57657k60156j77266Q7659J26315q5441j25313N4260J66690
$$ 333173 299422 141765 -118391 -295657 -207998 -81683 -167124 -292437 -238177 -71487
7921g1487J53753J5286M8988j42064L6925J2537o0715J71599J55573j38749j44516
$$ -71487 82266 97552 146540 4476 41401 53938 -6777 164822 320395 181646 37130
7910C7130j89657k27212J65175M79728J00344J15287k92566l87137R1402J65938
$$ 37130 -152527 -379739 -214564 265164 365508 480795 188229 -198908 -107506 58432
7900E8432j49524k88977q118K41872J81259j00577N2149N5991K23753O8815m08638
$$ 58432 -91092 -380069 -388187 -146315 34944 -65633 -13484 42507 266260 335075 -73563
7889g3563k67595K51505J90815R2184k06346k19411J52073Q1538k65605J44213
$$ -73563 -341158 -89653 101162 193346 -13000 -232411 -80338 1200 -264405 -120192
7879a20192K19005k6703J53380J2397k41229R3623N5312L4562k26142j6355j18936
$$ -120192 98813 72110 225490 237887 -3342 90281 145593 180155 -45987 -62342 -181278
7868a81278J1228n8148L81478J81261j41866p4229J5819O6263K30856K78415k60128
$$ -181278 -170050 -228198 153280 334541 192675 118446 134265 200528 431384 709799 449671
7857D49671m95398j98321m3801K07365J2438K26742r4372N5641m9620J5080K2008
$$ 449671 -45727 -244048 -287849 -80484 -68046 158696 64324 119965 70345 85425 107433
7846A07433k76397k00064L43327K05599j38351q0875J54356j1010O4498j25833
$$ 107433 -168964 -369028 -25701 179898 41547 -39328 115028 104018 168516 42683
7836D2683J2335o1764J21921Q8730j29816J0303R2670o6784k51602K060R8336
$$ 42683 55018 -6746 115175 203905 74089 84392 177062 110278 -141324 -139264 -40928
7825d0928R1649R4720m7304j90799j1993J82574j44134k78047n385L94031J20107
$$ -40928 50721 145441 98137 -92662 -104655 77919 -66215 -344262 -349647 44384 164491
7814A64491p1335R8200j19368j49011n0512O1291J33726m5829k96062K41838Q6980
$$ 164491 93156 191356 71988 -77023 -127535 -66244 67482 21653 -274409 -32571 54409
7803E4409n5198j56561l0993J60324o7900M0618n7506Q4141p208k9630K45748
$$ 54409 -789 -157350 -188343 -28019 -95919 -55301 -112807 -28666 -35874 -65504 180244
7792A80244O9306j41990j13543k70244j01662K04336M14691L62859k67823L4721
$$ 180244 249550 107560 -5983 -276227 -377889 -173553 241138 603997 336174 370895
7782C70895q0804j08558k52464O2262K10153l00674L6075M0051J14059O1788j20016
$$ 370895 290091 181533 -70931 -8669 201484 -99190 -63115 -23064 90995 152783 32767
7771C2767R3265R789k1296n660j12828p6641k178J99577j62831k43314o3290J24956
$$ 32767 126032 135821 114525 108865 -3963 -80604 -82782 116795 -46036 -289350 -352640 -227684
7759b27684n1793M7233q1258J47089M0076k41448l4159J62972J96864J08249j59594
$$ -227684 -279477 -232244 -313502 -166413 -126337 -367785 -401944 -238972 -42108 66141 -93453
7748i3453j99839J39528J9535j84984r1408K15093J23153k11442K15843Q3329
$$ -93453 -293292 -153764 -134229 -319213 -410621 -195528 -72375 -283817 -67974 15355
7738A5355j63317J94864n652q0526Q8088N4613L31211p5984l06412k98111j30928
$$ 15355 -147962 46902 41250 -39276 48812 103425 434636 358652 52240 -245871 -376799
7727c76799K11336R7450J00592O5865J6432K73609n850k78186K9619N4201k55432
$$ -376799 -165463 -68013 32579 98444 114876 388485 382635 104449 134068 188269 -67163
7716f7163J108J51697q3977j87873j44116r399K45431K29171j16776K06632k9076
$$ -67163 -66055 85642 1665 -186208 -330324 -339723 -94292 134879 18103 224735 195659
7705A95659j11450j20332j38136j542J07500m0820P0516n2389j46727J58158K86577
$$ 195659 84209 -36123 -174259 -175801 -68301 -109121 -38605 -90994 -237721 -79563 207014
7694B07014j01212k0007j78493q5171K02060K92842J11760O7914J08348k98783
$$ 207014 105802 85795 -92698 -177869 24191 317033 428793 496707 605055 306272
7684C06272j98345j53703j31498k45132k44184M33797M32310M8667k91522q5687
$$ 306272 107927 -45776 -177274 -422406 -666590 -232793 199517 248184 -43338 -129025
7674a29025L54766J12387j11678O3874K02399j55364j31864m2987n6677O1595
$$ -129025 225741 338128 226450 290324 492723 337359 205495 162508 105831 167426
7664A67426P7536j04633k03294L05403M5815m01385L23745J43043J6086j03799
$$ 167426 244962 140329 -62965 242438 288253 -113132 210613 353656 369742 265943
7654B65943m9027j14381K65830K8016j74897l22593j33070L8247j49735k6333
$$ 265943 216916 102535 368365 396381 221484 -101109 -234179 -195932 -345667 -372000
7644c72000K5546j58562L9087L14815Q1704J83903N5169M2222Q3910k25252j90892
$$ -372000 -346454 -505016 -465929 -151114 -69410 114493 169662 211884 295794 70542 -120350
7633a20350j570M9014m9770j53006R9061K61430k93483j42798K55699K15504j58545
$$ -120350 -121920 -72906 -122676 -275682 -176621 84809 -208674 -351472 -95773 119731 -38814
7622c8814j29426k73856j01220K29826K84434r3283k19572j9453Q3315p862K34109
$$ -38814 -168240 -442096 -543316 -313490 -29056 -122339 -341911 -361364 -278049 -285911 -51802
7611e1802J61197J14149K3744l05979k10226l2503O3935K47267n5272r1502Q0218
$$ -51802 109395 223544 247288 -58691 -268917 -301420 -237485 9782 -45490 -136992 -56774
7600e6774l0140j04451Q0699p4203j15283j30207K64776J01222J19830l58149
$$ -56774 -86914 -191365 -110666 -184869 -300152 -430359 -165583 -64361 55469 -302680
7590c02680l24922o9979L40746J54104j5423j30599P5598q425q9303J17041L2845
$$ -302680 -627602 -697581 -356835 -202731 -218154 -348753 -273155 -281580 -370883 -253842 -220997
7579b20997N6075q6923J2884L0929n4422m8199J98613j58539N0311K31045r6837
$$ -220997 -164922 -251845 -238961 -208032 -262454 -310653 -112040 -270579 -220268 10777 -86060
7568h6060j06368J4803q6617J42999R858k31556j86934J28450J53963K05200j44568
$$ -86060 -192428 -177625 -264242 -121243 -111385 -342941 -529875 -401425 -247462 -42262 -186830
7557a86830j41199j15326L82256K02728k0234K19676j55384j88634n8324J12488
$$ -186830 -328029 -443355 -61099 141629 121395 341071 185687 -2947 -61271 51217
7547E1217K20204j87745J92708K3479m9686n4480N5764l14890k65729p9523J91238
$$ 51217 271421 83676 276384 299863 250177 195697 251461 -63429 -329158 -408681 -217443
7536b17443N6676k6240j83016q8585K11360K21045K7152q5227M8509J47381j02497
$$ -217443 -160767 -187007 -370023 -458608 -247248 -26203 949 -84278 -35769 111612 9115
7525I115l2798J81159K04693o5179k76209M8416P6086k241M4995L9547r3649k14064
$$ 9115 -23683 157476 362169 296990 20781 69197 145283 143042 188037 227584 133935 -80129
7513h0129o4704N7804K03511P0463N9220k69136k14575l22145k66851L74318k6214
$$ -80129 -144833 -87029 116482 186945 246165 -22971 -237546 -559691 -826542 -452224 -478438
7502d78438q121J3385J49790k09413P2371M15539J23422l6534P5357K23380j04066
$$ -478438 -486559 -473174 -323384 -532797 -460426 -44887 78535 42001 117358 340738 236672
7491B36672j80859j47545j82628J43309J90021j11086P9123L3547j29535j37618
$$ 236672 55813 -91732 -274360 -131051 58970 -52116 27007 60554 -68981 -206599
7481b06599q8064K86675M01901j81285k05672k18570k81166R0685K06959n3012
$$ -206599 -294663 -7988 393913 212628 6956 -211614 -492780 -402095 -195136 -248148
7471b48148K5979Q5476J56129L00666J75965J49465N8206k17022k83144j54258
$$ -248148 -222169 -136693 19436 320102 496067 645532 703738 486716 203572 49314
7461D9314l442M8662P9333j3014l66100q8769L92307k7225m4801k892R6136J18676
$$ 49314 45872 94534 173867 160853 -205247 -294016 98291 71066 26265 23373 119509 238185
7449B38185L69253J86099j91520l44771j28314p2301j38686l6664k13999O6256
$$ 238185 607438 793537 602017 257246 128932 56631 -82055 -118719 -332718 -266462
7439b66462J01104O9131R2801m4228O3888R707j63843J04965n5986M3124K69672
$$ -266462 -165358 -96227 -3426 -47654 16234 25941 -137902 -32937 -88923 -45799 223873
7428B23873Q9662p9895j58063k67640k22327J55264J13970K72639K7264j08187
$$ 223873 313535 233640 75577 -192063 -414390 -259126 -145156 127483 154747 46560
7418D6560J04911K44305j85542m08880j18273R6220J49071L6098J44454J81765
$$ 46560 151471 395776 210234 -198646 -316919 -220699 -71628 -35530 108924 290689
7408B90689j23632j33714j55358k85792J16813J08034k4466k76295L9791R4356
$$ 290689 167057 33343 -122015 -407807 -290994 -182960 -207426 -483721 -443930 -349574
7398c49574J20882p9843l10273k60773L00104N8778K8768L81239R6051J03734
$$ -349574 -228692 -308535 -618808 -879581 -579477 -520699 -491931 -110692 -14641 89093
7388H9093J4042m0047j69793o8899K42751J92177m44610l27991L4661J67298Q2906
$$ 89093 103135 63088 -106705 -175604 67147 259324 -185286 -513277 -478616 -311318 -228412
7377b28412p5400J99048j45648m14666j84133L08513J33074J03870J60425J87590
$$ -228412 -303812 -104764 -250412 -665078 -849211 -540698 -407624 -303754 -143329 44261
7367D4261J54797l3654N1148n8648k52874K9546j1393r521K59439L5211O8292
$$ 44261 199058 165404 216552 157904 -94970 -65424 -76817 -86338 173101 208312 276604
7356B76604J46881M1388j54255k27508K47981j48215l01261J53738J43058j27240
$$ 276604 423485 464873 310618 83110 331091 182876 -118385 35353 178411 51171
7346E1171j22224q6485l6279R2151j25701J0700J82008J96959j42839R74J33384
$$ 51171 -71053 -157538 -193817 -101666 -227367 -216667 -34659 162300 19461 20435 153819
7335A53819q9755l22836o9034j16424K34471L66620K74986L2667j21799k12599
$$ 153819 64064 -258772 -327806 -444230 -209759 156861 431847 464514 342715 130116
7325A30116n7364k13381K55709o199j01985j31562J0515l0457J01352Q4221N5156
$$ 130116 72752 -140629 115080 108881 6896 -124666 -114151 -144608 -43256 40965 96121
7314I6121j44525o5728q0525J60468J971m7081J47913J45412j59577o7305K81605
$$ 96121 -48404 -114132 -194657 -34189 -32218 -79299 68614 214026 54449 -12856 268749
7303B68749J81842k91071j32489M4684r7527O5649j68806j41048O1793j52448
$$ 268749 450591 159520 27031 71715 -25812 39837 -128969 -270017 -208224 -360672
7293c60672Q1379M69374O5522l14015l43608l8294O6063j64330J35417N6565n9830
$$ -360672 -279293 190081 255603 -58412 -402020 -440314 -374251 -538581 -403164 -346599 -406429
7282d06429j9920j23866j94154K18140K07118J23459J99092J18192K52086k65942
$$ -406429 -426349 -550215 -744369 -526229 -319111 -195652 3440 121632 373718 107776
7272A07776j33943M4544J37092J11357k40620j23858J47113J76310Q05j31583
$$ 107776 -26167 18377 155469 266826 26206 -97652 49461 225771 226576 94993
7262I4993N6353p3118j77944j42419p711N4265J21732J26799K0109L9049J25559
$$ 94993 151346 78228 -99716 -242135 -249846 -195581 -73849 52950 73059 112108 237667
7251B37667l62697J46010O436j64006j07621l77142K49060J98545J30904n1974
$$ 237667 -125030 20980 27416 -136590 -244211 -621353 -372293 -173748 -42844 -94818
7241i4818j47727k7347L55371q8878k32272K65663J56767P5968N7215j21659J8500
$$ -94818 -242545 -269892 85479 -3399 -235671 29992 186759 262727 319942 198283 216783
7230B16783r8284p4649j07897k2846r5875k596K24487J07819l78242j04545K11210
$$ 216783 118499 43850 -64047 -86893 -182768 -185364 39123 146942 -231300 -335845 -124635
7219a24635J17114K07937K59035j04134j89894j42744j20654K72975K77978m08036
$$ -124635 -7521 200416 459451 355317 165423 22679 -97975 175000 452978 44942
7209D4942r9635L92667q8482j53789o7733J57031J12452j75696l98115q011q2954
$$ 44942 -54693 337974 249492 95703 27970 185001 297453 121757 -276358 -284369 -367323
7198c67323L0128L63203N7369m567J26186o3167K442K7077j44489O631j21022
$$ -367323 -337195 26008 83377 78810 204996 141829 144271 171348 26859 33490 -87532
7187h7532L0972K54291k26894o1070k18749r1254K74874J89213J11045J8196j33351
$$ -87532 -56560 197731 -29163 -90233 -308982 -400236 -125362 63851 174896 193092 59741
7176E9741Q3726q1610q7361K55871K32065j34159k76940k76697j19430K22717
$$ 59741 143467 61857 -25504 230367 462432 328273 51333 -225364 -344794 -122077
7166a22077k5455K04740n692j88787m3279J02867N3540l4293M2360P3850l33841
$$ -122077 -147532 57208 51516 -137271 -180550 -77683 -24143 -58436 -16076 57774 -276067
7155b76067l63518n6349J71819O1972K85562J61137P4212m5029l5917p1288r8590
$$ -276067 -639585 -695934 -524115 -462143 -176581 -15444 58768 13739 -22178 -93466 -192056
7144a92056k46449K10269M8060J14072J31280P4786q0159l4643O9049K47171n8690
$$ -192056 -438505 -228236 -180176 -66104 65176 139962 59803 25160 94209 341380 282690
7133B82690n6113Q7576p9345j04316j05276l92529J3816J78334K24488j489j16034
$$ 282690 226577 314153 234808 130492 25216 -367313 -353497 -175163 49325 47836 -68198
7122f8198k61620j81010L40452o7977l7950j18546R3353L47255n1334M9041j42812
$$ -68198 -329818 -510828 -170376 -238353 -276303 -394849 -301496 45759 -5575 43466 -99346
7111i9346o5180L2985j2111J86948R3348j48624l3587J78058m25J52763Q29j08437
$$ -99346 -164526 -131541 -143652 43296 136644 -11980 -45567 132491 132066 284829 285658 177221
7099A77221l1769J03467p8006j3372j48091k00021M9215N0841k01953M0625J09136
$$ 177221 145452 248919 170913 157541 9450 -190571 -141356 -90515 -292468 -251843 -142707
7088a42707L67225m0949J37121k2086p3261l53634m1316J88704J21258J21446
$$ -142707 224518 183569 320690 298604 225343 -128291 -169607 19097 140355 261801
7078B61801p2059l53430k55263J53883J71847L06467L7170k05495j3794k1610
$$ 261801 189742 -163688 -418951 -265068 -93221 213246 250416 44921 31127 9517
7068I517K0803n5509j84099k7686k24752p9835N3556R5690K65243J26702K57525
$$ 9517 30320 -25189 -209288 -236974 -461726 -541561 -488005 -392315 -127072 -370 257155
7057B57155K6878k02815k64114k32332j69948M5331Q2838L8034M8320o2085j84015
$$ 257155 284033 81218 -182896 -415228 -585176 -539845 -457007 -418973 -370653 -432738 -616753
7046f16753L6135M2721K92728J93710n904J0971J58481O045p619K1236m12525
$$ -616753 -580618 -537897 -245169 -51459 -57363 -46392 112089 118134 110515 131751 -280774
7035b80774p9073N5083r6756P6711J16789p5686J32818O532j46683j43019N2376
$$ -280774 -359847 -304764 -401520 -324809 -208020 -283706 -150888 -144356 -291039 -434058 -381682
7024c81682L46993o3750q9379j53718n4649J14196J52931l422J45370K85986k0084
$$ -381682 -34689 -98439 -187818 -341536 -396185 -281989 -129058 -132480 12890 298876 278792
7013B78792k20580K7093l09082l96241K24655L13745P7596m97L8908j12824p20
$$ 278792 58212 85305 -223777 -620018 -395363 -81618 -4022 -4519 34389 -78435 -79155
7002g9155l9220K08277K934J09126r7527l87261k65166K56322K54145J02645m2055
$$ -79155 -118375 89902 92836 201962 104435 -282826 -547992 -291670 -37525 65120 23065
6991B3065J2539J76972J24760l1956l94700n4115k74697p979J28169o17J01679
$$ 23065 35604 212576 337336 305380 -89320 -143435 -418132 -426111 -297942 -298559 -196880
6980a96880N8468j27025q7769J08560O7867j94932n8016L42043J86321P2167Q3055
$$ -196880 -138412 -265437 -353206 -244646 -176779 -371711 -429727 -87684 98637 170804 253859
6969B53859j62483j5801l2559j15201p5993M1653k73916o9727N0661M3730K20136
$$ 253859 91376 75575 43016 -72185 -148178 -106525 -380441 -450168 -399507 -355777 -135641
6958a35641K8328J52753k0247J5078J21885j83736K2094J60090p4620N6778k45313
$$ -135641 -107313 45440 25193 40271 162156 -21580 514 160604 85984 142762 -102551
6947a02551l82527R7278J60834M86241K57849r2949j01246R8376K40133j16189
$$ -102551 -485078 -387800 -226966 259275 517124 424175 322929 421305 661438 545249
6937E45249l05700j48800M4298j9723k82665q2259J13511P0156j01960L0240j47189
$$ 545249 239549 90749 135047 115324 -167341 -249600 -136089 -65933 -167893 -137653 -284842
6926b84842j95797J37979q9456L8266J04893q0866k10228n0138L53793K79037
$$ -284842 -480639 -342660 -432116 -393850 -288957 -369823 -580051 -630189 -276396 2641
6916B641K13633Q9922j05479j92449o4854M4981J6984q5744j80409r7610k8271
$$ 2641 216274 306196 200717 8268 -56586 -11605 5379 -80365 -260774 -358384 -386655
6905c86655O269P7866J17554J79597J1743k19856P4487J39123k4609N8644j12416
$$ -386655 -380386 -302520 -184966 -5369 6374 -213482 -138995 128 -24481 34163 -78253
6894g8253K4515J76870l2579j00280j66250n8982J74981K58756J38543K2777R857
$$ -78253 -53738 123132 90553 -9727 -175977 -234959 -59978 198778 337321 360098 369955
6883C69955q6156J76947l02861j9310l2945j39252j90490k55191n2878O1691L77955
$$ 369955 283799 460746 157885 138575 105630 -33622 -224112 -479303 -532181 -470490 -92535
6872i2535q8389R1345K1012j63020K06098o6913k2645N0787q2134l67434k3106
$$ -92535 -180924 -89579 -68567 -231587 -25489 -92402 -115047 -64260 -146394 -513828 -536934
6861e36934K22401J774O1264J94506L25324K99787k5308m75897r1088q3524j01148
$$ -536934 -314533 -312759 -251495 -56989 268335 568122 542814 66917 -24171 -107695 -208843
6850b08843L9509J17085j68519k56702J55342j65562M8089o3601J3283J39016
$$ -208843 -169334 -52249 -220768 -477470 -322128 -487690 -439601 -503202 -489919 -350903
6840c50903p3917l6861j21962L84016K68424L15336O695j89491o8889o5036q1701
$$ -350903 -424820 -461681 -583643 -199627 68797 384133 390828 201337 132448 67412 -14289
6829a4289N1196j3154J5588M03674L19872J02051m25642l60557j40903n2185n9016
$$ -14289 36907 23753 39341 443015 762887 864938 439296 78739 -62164 -114349 -173365
6818a73365O4869m2129o1516n8757K85620J39209j61097J67374q6004q4789J57152
$$ -173365 -108496 -150625 -212141 -270898 14722 153931 -7166 160208 74204 -10585 146567
6807A46567Q3695n5344J39817Q5215k84098k78838J85936j052L6512J37927O8526
$$ 146567 230262 174918 314735 399950 115852 -162986 22950 21898 58410 196337 264863
6796B64863M3749L1219o3331K10380p6077p9760j50194k89626k08269p192J09357
$$ 264863 308612 339831 276500 486880 410803 331043 180849 -108777 -317046 -324238 -214881
6785b14881J02278J52242P7538n8192Q3920j65509J67263P8561j04069l1293n530
$$ -214881 -112603 39639 117177 58985 142905 -22604 144659 223220 119151 87858 82328
6774H2328j09972j06435n5158r1633J2945J21477k01959k39428J45872J88921
$$ 82328 -27644 -134079 -189237 -280870 -267925 -146448 -348407 -587835 -441963 -253042
6764b53042J46426J71972k9398j7304o7759k42290K33804K60996l4194q8334J49293
$$ -253042 -106616 65356 35958 18654 -49105 -291395 -57591 203405 169211 80877 230170
6753B30170n1478j98927P1381K01060j21638j39306J13047k11443j65609k05561
$$ 230170 178692 -20235 51146 252206 130568 -8738 104309 -107134 -272743 -478304
6743d78304N1665L05551o0905O6081J4260j82693K13057K49682L1399j96758p0199
$$ -478304 -426639 -121088 -181993 -115912 -101652 -284345 -71288 178394 209793 13035 -57164
6732e7164J84726P0682j232j0349m9267q9056n5214k3996j71217Q2322K07651
$$ -57164 127562 198244 197012 186663 137396 48340 -6874 -30870 -202087 -119765 87886
6721H7886k39232k4854J09857K14676P5362j49739j53528k29162r4246P8522j69439
$$ 87886 -151346 -176200 -66343 148333 223695 73956 -79572 -308734 -402980 -324458 -493897
6710d93897p2131L23119K66552J73131l2274l08420J22720k2156m991K30697R0816
$$ -493897 -566028 -242909 23643 196774 164500 -143920 -21200 -43356 -48347 182350 273166
6699B73166l2747K49566J43322j16289j77262P4058p7719K817j05917l27556j88454
$$ 273166 240419 489985 633307 517018 339756 413814 336095 338912 232995 -94561 -283015
6688b83015M61534j86996l41486J91638M89644K57267p8195k44188j89043o6578
$$ -283015 178519 -8477 -349963 -158325 331319 588586 510391 266203 77160 10582
6678A0582l60197L4709J75838J09754L76578J09031k14080l56794k57462N4889
$$ 10582 -349615 -314906 -139068 -29314 347264 456295 242215 -114579 -372041 -317152
6668c17152l3965m8704n7394J81688K40262j8059n1648n0819J14016q7995r1802
$$ -317152 -351117 -399821 -457215 -275527 -35265 -53324 -104972 -155791 -41775 -129770 -221572
6657b21572j52904K566J68881J98956j76133J32862K26957L2786J6912j90550
$$ -221572 -374476 -371910 -203029 -4073 -180206 -47344 179613 212399 229311 38761
6647C8761k12697J08324j69576r589P8417j21223j12025o5401q5657L66719J74236
$$ 38761 -173936 -65612 -235188 -244777 -166360 -287583 -399608 -465009 -550666 -183947 -9711
6636i711K6953k52486j34274K07203J81881p2449p3840N0348J10115j76768o4171
$$ -9711 17242 -235244 -369518 -162315 19566 -52883 -126723 -76375 33740 -143028 -207199
6625b07199n3369Q8303N183J24262K08615m811k80605J17903m7984K1525j05706
$$ -207199 -260568 -172265 -167082 -42820 165795 160984 -119621 -1718 -49702 -28177 -133883
6614a33883j12771j61123J84948J77648K36795q7345l78668o6569K76860J65971
$$ -133883 -246654 -407777 -222829 -45181 191614 104269 -274399 -340968 -64108 101863
6604A01863j85652J78768J90075K1602J05557k89768k42954M4857L44061j53384
$$ 101863 -83789 94979 285054 306656 412213 122445 -120509 -75652 268409 115025
6594A15025j27289r3673m0042q6702J85037L11739J4512l01359j40395o0098J8540
$$ 115025 -12264 -105937 -145979 -232681 -47644 264095 278607 -22752 -163147 -223245 -204705
6583b04705K88528L2466p6840l3502k01003Q6061P7994m4664j6103j71891Q9239
$$ -204705 83823 116289 39449 5947 -195056 -108995 -31001 -75665 -91768 -263659 -174420
6572a74420r0090K2782j68246N1014K48033J26182J12124q7758j34263L1467M8947
$$ -174420 -264510 -241728 -409974 -358960 -110927 15255 127379 39621 -94642 -63175 -14228
6561a4228n9689K58114o1450J79867J53938j36837k59455l47171q5488J48253
$$ -14228 -73917 184197 122747 302614 456552 319715 60260 -286911 -372399 -224146
6551b24146J26959J0263J44324j12106o2709K70635j50052n5038K76075K32241
$$ -224146 -97187 -86924 57400 -54706 -117415 153220 3168 -51870 224205 456446
6541D56446J43889j04033k82103j60602Q3750j31672r1529J43055J08317J06638
$$ 456446 600335 496302 214199 53597 137347 5675 -85854 57201 165518 272156
6531B72156r6917K0067k75636q1906m5685J21100k2867K0960P5599k85655J14960
$$ 272156 175239 195306 -80330 -162236 -207921 -86821 -109688 -88728 -13129 -298784 -183824
6520a83824M80631Q5931k16607j79769k120j23045k4019p7777L1013l1068O7468
$$ -183824 296807 382738 166131 -13638 -15758 -138803 -162822 -240599 -209586 -240654 -173186
6509a73186J54131q0230j32750O7249J52160k3375J6011K25416N4917q1967k4372
$$ -173186 -19055 -99285 -232035 -164786 -12626 -36001 -19990 205426 260343 178376 154004
6498A54004k54284j40984K18321J15448n6355o319q2244M9525R5453L66o5057
$$ 154004 -100280 -241264 -22943 92505 36150 29831 -52413 -2888 92565 92931 27874
6487B7874N7973j00501k96668j33501K71435L35918j70469j44906J38785J28331
$$ 27874 85847 -14654 -311322 -444823 -173388 162530 -7939 -152845 -14060 114271
6477A14271j22914n8318J39991L03409r690k81942l23469q630J1888k37970k661
$$ 114271 -8643 -66961 73030 376439 366749 84807 -238662 -247292 -235404 -473374 -476035
6466d76035K18395J9259N8806j40092l74133K40945N42156K63479L8948k06783
$$ -476035 -257640 -238381 -179575 -319667 -693800 -452855 89301 352780 391728 184945
6456A84945l34216m0620M54773l00231k74551J40418K10335J7143l96004k62982
$$ 184945 -149271 -189891 264882 -35349 -309900 -169482 40853 57996 -338008 -600990
6446f00990k0630M74988N9550j4512N7378o3380L3052j16574J53165K92970r5855
$$ -600990 -621620 -146632 -87082 -101594 -44216 -107596 -74544 -191118 -37953 255017 159162
6435A59162n2187l07519L4290M1332j8120J61296J3609J20930j50187P7087J87753
$$ 159162 106975 -200544 -166254 -124922 -143042 18254 31863 152793 2606 79693 267446
6424B67446j28347l99539l49352P0434J69903l7651Q8603n1245K09544J44493
$$ 267446 139099 -260440 -609792 -539358 -369455 -407106 -318503 -369748 -160204 -15711
6414a5711j96022n04624q6434J41927K51846J12146k9601K98904J43041j49749
$$ -15711 -211733 -716357 -802791 -660864 -409018 -296872 -326473 -27569 115472 -34277
6404c4277K15312k61362j39612K51852J21031J06286J18061q1676p6447j4258
$$ -34277 181035 -80327 -219939 31913 152944 259230 377291 295615 219168 204910
6394B04910N2224k4676l22848r4649O3642j46063J76181J95329k09828P2087L9925
$$ 204910 257134 232458 -90390 -185039 -121397 -267460 -91279 104050 -105778 -33691 6234
6383F234J08353p5381j44599j441P6632j76141j01532J02626P7179j63278J4599
$$ 6234 114587 39206 -105393 -106834 -30202 -206343 -307875 -205249 -128070 -291348 -276749
6372b76749K37124j0131k53246q3029M1273J34282L03491P6504j78767K8520K20807
$$ -276749 -39625 -49756 -303002 -386031 -344758 -210476 93015 169519 -9248 19272 240079
6361B40079N8752q3546n3404R7128j64716k09227M648j59737K20230Q884l2150
$$ 240079 298831 215285 161881 259009 94293 -114934 -110286 -270023 -49793 -40909 -73059
6350g3059J29180j26627j19115J82318J16727k08455j76292k91627q1590M9359
$$ -73059 56121 -70506 -189621 -7303 109424 -99031 -275323 -566950 -648540 -599181
6340e99181p3989K84303L32036J92476J63912Q2027j81324j09658J73425j00206
$$ -599181 -673170 -388867 -56831 135645 299557 381584 200260 90602 264027 163821
6330A63821Q844r7550m206J57627j83842J64795J8423R0801j29183j61789j44963
$$ 163821 172665 75115 70909 228536 44694 209489 227912 318713 189530 27741 -117222
6319a17222O1326j84407k17064K61657J55827j5756k02644k07187K59698L06707
$$ -117222 -55896 -240303 -457367 -195710 -39883 -55639 -258283 -465470 -205772 100935
6309A00935l3807J1006Q5192o0392j54548Q9450P5195o8784j68021J11008P0661
$$ 100935 67128 78134 163326 102934 -51614 37836 113031 44247 -123774 -12766 57895
6298E7895L6787n821J55436J98861j57238R4229n2821o6354q6025k9961K7651
$$ 57895 94682 88861 244297 443158 285920 380149 327328 260974 174949 144988 172639
6287A72639j52651j82996L17809K53099m8114k21809O2176L9233Q6766j2037j25341
$$ 172639 19988 -163008 154801 407900 359786 137977 200153 239386 326152 314115 188774
6276A88774j49606K37797j72577n6038m153L3990k41936k28017j24756j21469
$$ 188774 39168 276965 104388 48350 44197 78187 -163749 -391766 -516522 -637991
6266f37991K72151M97653K7207j47979l4025j81239J60870K58096n9297o2521
$$ -637991 -365840 131813 159020 11041 -22984 -204223 -43353 214743 155446 92925
6256I2925J79466J34797r9664l24319j04447M5082J24796o3154j74917k51212
$$ 92925 272391 407188 307524 -16795 -121242 -76160 48636 -14518 -189435 -440647
6246d40647R3105K60760M8885J70455n0453k22862R2548j10294N5638J95219j18931
$$ -440647 -347542 -86782 -37897 132558 82105 -140757 -48209 -158503 -102865 92354 -26577
6235b6577J03671J6832N426o3508j85385j74113J78230n0383m9013l6547J64569
$$ -26577 77094 93926 99352 35844 -149541 -323654 -145424 -195807 -244820 -281367 -116798
6224a16798M71693L69963j92123j41729j01281j48179k10467Q5239K9971K6725
$$ -116798 354895 724858 532735 391006 289725 141546 -68921 16318 46289 73014
6214G3014J94524J89481j84671j19851n9819r7605K58621j95948j45798o9575
$$ 73014 267538 457019 272348 152497 92678 -4927 253694 57746 -88052 -157627
6204a57627j50379P4140o3291j29507K8691P9156J39185j95358n2552K02593L55236
$$ -157627 -308006 -233866 -297157 -426664 -397973 -318817 -179632 -374990 -427542 -224949 130287
6193A30287n0644J67687l0664j51775Q1688k63608j22252j12963J01377J87261
$$ 130287 79643 247330 216666 64891 146579 -117029 -239281 -352244 -250867 -63606
6183f3606k5387m6925n7253Q0957N7185O489L4209J86575J70129k1810o6718j44908
$$ -63606 -88993 -135918 -193171 -112214 -55029 -48540 -14331 172244 342373 320563 253845 108937
6171A08937r4710k053r6903j17790J5948K41359K57624M2461j01281k8125j97792
$$ 108937 14227 12174 -84729 -202519 -186571 54788 312412 354873 253592 225467 27675
6160B7675q8086K25304o4386O0233J33243j04689J09439j32891k08184N4246J15578
$$ 27675 -60411 164893 100507 160740 293983 189294 298733 165842 -42342 11904 127482
6149A27482j44446p7667k82970O1810L80636L68819j26819k80454M8675K87894
$$ 127482 -16964 -94631 -377601 -315791 64845 433664 306845 26391 75066 362960
6139C62960j08752l21225j83805K00637J92234K20102j93577K9328j06361m0332
$$ 362960 254208 -67017 -250822 -50185 142049 362151 168574 197902 91541 51209
6129E1209J27375J91843J39063j24360L1571J89672j67249j45100m54170k27735
$$ 51209 178584 370427 509490 385130 416701 606373 439124 294024 -160146 -387881
6119c87881R3825J38944k540n9886M4277k9428j70020j86941J78360K62807O1055
$$ -387881 -294056 -155112 -157652 -217538 -173261 -202689 -372709 -559650 -381290 -118483 -57428
6108e7428m8336Q0384j54566k6687K95847L44089o5065J11398P7202k70153J2846
$$ -57428 -105764 -25380 -179946 -206633 89214 433303 368238 479636 556838 286685 299531
6097B99531j53418k46186L54745q7632k62142k04095L3307Q8009l7773m538l5515
$$ 299531 146113 -100073 254672 167040 -95102 -299197 -265890 -177881 -215654 -220192 -255707
6086b55707J19094j30912o168j7465J82645Q531Q1833k23540k26099K2809M40489
$$ -255707 -136613 -267525 -273693 -291158 -108513 -99982 -18149 -241689 -467788 -444979 -4490
6075d490K10197j98110j24850m1182K2957K04802J31931M2100K3995j84724j6817
$$ -4490 205707 7597 -117253 -158435 -135478 69324 201255 243355 267350 82626 65809
6064F5809r8313O0286j38737j13674j82762r7564J64653R3292N5003J95993J76760
$$ 65809 -32504 27782 -110955 -224629 -407391 -504955 -340302 -247010 -192007 3986 180746
6053A80746j37956r4544l3213J18003J22028J63791j23493j04290J29838q3917
$$ 180746 42790 -51754 -84967 33036 155064 318855 195362 91072 220910 136993
6043A36993m1974k9613K67960o4662k16859p1235K5578l442J34448n3537o3372
$$ 136993 95019 65406 333366 268704 51845 -19390 6188 2746 137194 83657 20285
6032B0285q1415j73782j97637j64843J64892J21509J93007L4932R6050N1456l6659
$$ 20285 -61130 -234912 -432549 -597392 -432500 -310991 -117984 -83052 12998 64454 27795
6021B7795k25268j45491J28105J85366K78330o4622j80726m5949l4826j21493
$$ 27795 -197473 -342964 -214859 -29493 248837 184215 3489 -42460 -77286 -198779
6011a98779L1082j74723k05233K5956P2767j80854J90462l0789j68965J48552
$$ -198779 -167697 -342420 -547653 -521697 -448930 -629784 -439322 -470111 -639076 -490524
6001d90524R699j63966n3275R1803J37212J02245K91463J27284j59528J32951
$$ -490524 -480825 -644791 -698066 -606263 -469051 -366806 -75343 51941 -107587 25364
5991B5364J05104P0535l11974k24412k163J17510K48059K50249Q075m5558j24151
$$ 25364 130468 201003 -110971 -335383 -337546 -220036 28023 278272 286347 240789 116638
5980A16638k68523R2879j9320j49052j67939O5283j38611k59868M8466K59499
$$ 116638 -151885 -59006 -78326 -227378 -395317 -330034 -468645 -728513 -680047 -420548
5970d20548J38510k9599O0203J00746k7934l76890K21551N1873j36621k14014
$$ -420548 -282038 -311637 -251434 -150688 -178622 -555512 -333961 -282088 -418709 -632723
5960f32723J65636K32172n895p8431j7581L20892j51864K08696N8939q8647K3954
$$ -632723 -467087 -234915 -240810 -319241 -336822 -15930 -167794 40902 99841 11194 35148
5949C5148j69892j41742L1915J34758N3522r049M8134P2646J07273N3715m7919
$$ 35148 -134744 -276486 -244571 -109813 -56291 -65340 -17206 55440 162713 216428 168509
5938A68509o9284n5346r2527J11521j1578J86819n5439r7571n083J64857N7535
$$ 168509 99225 43879 -48648 62873 51295 238114 182675 85104 80021 244878 302413
5927C02413m6973k52464p6155K4951n5673j22137m125K63772L7377j93612k26001
$$ 302413 255440 2976 -73179 -48228 -103901 -226038 -230163 33609 70986 -122626 -348627
5916c48627j85442J49622L49941K62569o8155j41478J79727k29078O0440K13359
$$ -348627 -534069 -384447 -34506 228063 159908 18430 198157 -30921 29519 242878
5906B42878j25046k4457j24228k08061K49252n8493l56089k5316K25834J72076
$$ 242878 117832 93375 -30853 -238914 10338 -48155 -404244 -429560 -203726 -31650
5896c1650P2219J2504k15m8020o7852Q0239J25412k4346j17237k33152J13045
$$ -31650 40569 53073 52858 4838 -63014 17225 142637 118291 1054 -232098 -119053
5885a19053l310k02381m6618Q9288K5583J37916J80299J73357j91819k31623j60931
$$ -119053 -122363 -324744 -371362 -282074 -256491 -118575 61724 235081 43262 -188361 -349292
5874c49292j08172L55331l6097r7054j9045N5575j7615J9416K24212J37687m103
$$ -349292 -457464 -102133 -138230 -235284 -254329 -198754 -216369 -196953 27259 164946 160843
5863A60843N4084q5403j28680q7487Q0422J57900P3938J2442j26488j6768j95587
$$ 160843 214927 129524 844 -86643 -6221 151679 225617 238059 111571 94803 -100784
5852a00784j91543N6110j98693l5164M5975R4590K2904k8852J10990M44134K57533
$$ -100784 -292327 -236217 -434910 -470074 -424099 -329509 -306605 -335457 -224467 219667 477200
5841D77200q2083k16144k5053j20852q9563J62358j4649j13882m3444N4513Q6007
$$ 477200 395117 178973 153920 33068 -56495 105863 91214 -22668 -66112 -11599 74408
5830G4408K87962Q8447Q7869j62959l22128l39240q4516L24719J77973o2777l57640
$$ 74408 362370 450817 538686 375727 53599 -285641 -370157 -45438 132535 69758 -287882
5819b87882L4948J2288R4938K6220k296K60236m3024M8763R7383k32815j21095
$$ -287882 -252934 -240646 -145708 -119488 -121784 138452 95428 144191 241574 8759 -112336
5808a12336j4188r53O5013r1835J33058n8172l12052R4335J40521n9841L9032
$$ -112336 -126524 -127477 -62464 -154299 -21241 -79413 -391465 -297130 -156609 -216450 -177418
5797a77418K7351N6077m786o8835k8827J38994J75923M5396p5301k8878l21895
$$ -177418 -150067 -93990 -98776 -167611 -196438 -57444 118479 163875 88574 59696 -262199
5786b62199j07795l351J767J79146L234j90927J19809K03748L3994m5102O3583
$$ -262199 -369994 -373345 -371578 -192432 -189198 -380125 -260316 -56568 -22574 -67676 -4093
5775d093l61173l0838M10097n0178R1510J02057m0460k81685m07997k06154J64283
$$ -4093 -365266 -396104 13993 -36185 55325 157382 116922 -164763 -572760 -778914 -614631
5764f14631L09616K95441k03005K8708L4597n417j8836m2304r4194k35283J07535
$$ -614631 -305015 -9574 -212579 -183871 -149274 -154691 -173527 -215831 -310025 -545308 -437773
5753d37773J0682r9418J13781Q3932J35365Q6070R1254l5294l84378j77859J45819
$$ -437773 -427091 -526509 -412728 -328796 -193431 -107361 -16107 -51401 -435779 -613638 -467819
5742d67819q8611J21120j03362R0679N6699J48944o6061k81035j99002J27724
$$ -467819 -556430 -435310 -538672 -447993 -391294 -242350 -308411 -589446 -788448 -660724
5732f60724K09543J21686J83629K74988J12384m2450J57529k35088l20846o9640
$$ -660724 -451181 -329495 -145866 129122 241506 199056 356585 121497 -199349 -268989
5722b68989o290p0491L11124K51739J70951j4467p5362p5597j28230k23525j59450
$$ -268989 -275279 -345770 -34646 217093 388044 373577 298215 222618 94388 -129137 -288587
5711b88587r6237J06490J13561J93793r9186j57305k65439Q7854N49470Q6328
$$ -288587 -384824 -278334 -164773 29020 -70166 -227471 -492910 -405056 144414 230742
5701B30742j21962J90523Q7903k07494k83691K36519M77524L608j69030l12031
$$ 230742 108780 299303 387206 179712 -103979 132540 610064 613672 444642 132611
5691A32611l44177J7339O2212K11361M0598j97153n3768J53548j10854j25338
$$ 132611 -211566 -194227 -132015 79346 119944 -77209 -130977 22571 -88283 -213621
5681b13621j776O0020J30121R1340L12714m4855k05981J0998K05834K28086j7620
$$ -213621 -215397 -155377 -25256 66084 378798 333943 127962 138960 344794 572880 555260
5670E55260k49221j51423n9381J41455n0916N7148K38054n2192l23892J0525J17596
$$ 555260 306039 154616 95235 236690 185774 242922 480976 428784 104892 115417 233013
5659B33013j12734m7979j9074q4724J88340l1611l91812R7737K12299j32830j00064
$$ 233013 120279 72300 53226 -31498 156842 125231 -266581 -168844 43455 -89375 -189439
5648a89439K90335M8862j61671O3362k61346M08N1079j67906j62692J23808N4337
$$ -189439 100896 149758 -11913 51449 -209897 -209489 -158410 -326316 -489008 -365200 -310863
5637c10863N65743k3310j74587J42117P3652J50575n8608j43028q1974K70826
$$ -310863 254880 231570 56983 199100 272752 423327 364719 221691 139717 410543
5627D10543J91854k4223l25934m09192j90489R1497m2544J23685J82962L70846
$$ 410543 602397 578174 252240 -156952 -347441 -255944 -298488 -174803 8159 379005
5617C79005M92r9650k86600j40293m914r6108J00137N3627q4649O3891l8215p7567
$$ 379005 379497 279847 -6753 -147046 -151960 -248068 -147931 -94304 -178953 -115062 -153277 -230844
5605b30844j32059M1189J7929O8436R4874O4513J74880k22178j12982K8091K39367
$$ -230844 -362903 -321714 -303785 -235349 -140475 -75962 98918 -123260 -236242 -208151 31216
5594C1216J31218m7377j92517J76562K59480k19820j74874J64975K42036p4325
$$ 31216 162434 115057 -77460 99102 358582 138762 -36112 128863 370899 296574
5584B96574j75750l2684k62721K7422K65667L12562L24526j03521l7984l73213
$$ 296574 120824 88140 -174581 -147159 118508 431070 755596 652075 614091 240878
5574B40878J48563p0568l60207k79250j38689q9152J93849J32674q9578l6940
$$ 240878 389441 318873 -41334 -320584 -459273 -548425 -354576 -221902 -311480 -348420
5564c48420J57471J88760O3816M3488O4683m8669K3314N329j01254J75329p8337
$$ -348420 -190949 -2189 61627 105115 169798 121129 144443 149772 48518 223847 145510
5553A45510k38997K30199J34425j60991m38296K46785k3108N8787K82268j78493
$$ 145510 -93487 136712 271137 110146 -328150 -81365 -104473 -45686 236582 58089
5543E8089r319j89134j72378N5226K65377K33857k15888j8960O1892q3266l242
$$ 58089 48770 -140364 -312742 -257516 7861 241718 25830 6870 68762 -14504 -17746
5532a7746J88377j04801j38913k4610K75058J12194m5031J02270l27916j43851
$$ -17746 170631 65830 -73083 -97693 177365 289559 244528 346798 18882 -124969
5522a24969N9997k90840j66285P8037n1068p46P3099K02429r0868P1016J32454
$$ -124969 -64972 -355812 -522097 -444060 -495128 -495874 -422775 -220346 -311214 -240198 -107744
5511a07744j12361R7896J42958N8926J00015M1795n0922k74507J4014K26635L5489
$$ -107744 -220105 -122209 20749 79675 179690 221485 170563 -103944 -89930 136705 172194
5500A72194N0778j6567j25288k48727n6043j62670J18367K48291k375k43676j59684
$$ 172194 222972 206405 81117 -167610 -223653 -386323 -267956 -19665 -22040 -265716 -425400
5489d25400J240L46310K08675j29082K567M6815L6774j6205n0514J86551J55876
$$ -425400 -424160 -77850 130825 1743 4310 51125 87899 71694 21180 207731 363607
5478C63607j16491l17826J27991L87433l25308j61873O4582K51421N9268K2880
$$ 363607 247116 -70710 57281 444714 119406 -42467 22115 273536 332804 355684
5468C55684J82445J6545j01050q4413J33082o5973k06451k82985l9016L47806
$$ 355684 538129 554674 453624 369211 502293 436320 229869 -53116 -92132 255674
5458B55674P850k95715K2626j7356P8346K07014k25834j00609j2651r9857k6254
$$ 255674 263524 -32191 -9565 -26921 51425 258439 32605 -68004 -80655 -180512 -206766
5447b06766P6721j69718o6284M06644J02215j1245l109k16406p7284N4378N8089
$$ -206766 -130045 -299763 -366047 40597 142812 131567 128458 -87948 -165232 -110854 -52765
5436e2765L6678J74387K26592p7586n44705m77362K9686N34570K4324q4449Q3868
$$ -52765 -16087 158300 384892 307306 -237399 -714761 -685075 -150505 -126181 -210630 -126762
5425a26762K11403J89677O3896m31748l17553l2944j72449O2696M52479L10400
$$ -126762 84641 274318 338214 -93534 -411087 -444031 -616480 -553784 -101305 209095
5415B09095j14028K58010J57007j71636j80147K5119k39145m5025J74629M9607
$$ 209095 95067 353077 510084 338448 158301 183420 -55725 -100750 73879 123486
$$ [...]
##END NTUPLES=NMR SPECTRUM
##END=
