##TITLE=Analysis number 316225
Compound Code han 00233
Project Code adrs
Chemist Name fudan
##JCAMPDX= 6.0         $$ Bruker NMR JCAMP-DX V2.0
##DATA TYPE= NMR SPECTRUM
##DATA CLASS= NTUPLES
##ORIGIN= Bruker BioSpin GmbH
##OWNER= nmr
$$ XWIN-NMR		Version 3.5
$$ Thu Jan  5 13:56:36 2006 GMT Standard Time (UT+0h)  MAYBRIDGE\nmr@NMR_250MHZ
##.OBSERVE FREQUENCY= 250.131544655141
##.OBSERVE NUCLEUS= ^1H
##.ACQUISITION MODE= SIMULTANEOUS (DQD)
##.ACQUISITION SCHEME= undefined
##.AVERAGES= 16
##.DIGITISER RES= 18
##SPECTROMETER/DATA SYSTEM= dpx250
##.PULSE SEQUENCE= zg30
##.SOLVENT NAME= CDCl3
##.SHIFT REFERENCE= (INTERNAL, CDCl3, 0, 16.522)
##AUDIT TRAIL= $$ (NUMBER, WHEN, WHO, WHERE, WHAT)
$$ ##TITLE= Audit trail, XWIN-NMR		Version 3.5
$$ ##JCAMPDX= 5.01
$$ ##ORIGIN= Bruker BioSpin GmbH
$$ ##OWNER= nmr
$$ C:\u/data/dgb/nmr/ADRS/14310/pdata/1/auditp.txt
$$ ##AUDIT TRAIL=  $$ (NUMBER, WHEN, WHO, WHERE, WHAT)
(   1,<2006-01-05 13:55:32.77 +000>,<MAYBRIDGE\nmr>,<NMR_250MHZ>,
      <created by zg, POWCHK disabled, PULCHK disabled
       configuration hash MD5:
       62 19 C7 07 E1 42 D1 B7 37 6C 3D D0 77 39 F9 E6
       data hash MD5: 64K
       60 00 CC CC F4 E4 B7 FC 5A 9C A6 95 66 EB 70 C1>)
(   2,<2006-01-05 13:55:53.96 +000>,<MAYBRIDGE\nmr>,<NMR_250MHZ>,
      <Start of raw data processing
       ef LB = 0.3 FT_mod = 6 PKNL = 1 SI = 32K 
       data hash MD5: 32K
       05 1D A7 B0 A9 4E 00 82 CD 7C 12 F6 E0 3B 3B 87>)
(   3,<2006-01-05 13:55:59.57 +000>,<MAYBRIDGE\nmr>,<NMR_250MHZ>,
      <apk 
       data hash MD5: 32K
       07 F5 2D 52 0F 20 2C 6C EA 1C 5B A5 A2 D8 1C 17>)
(   4,<2006-01-05 13:56:01.21 +000>,<MAYBRIDGE\nmr>,<NMR_250MHZ>,
      <abs ABSG = 5 
       data hash MD5: 32K
       FB C1 E2 E2 E9 BB F1 98 39 05 36 E8 A5 B3 CD 3B>)
$$ ##END=
$$ 
$$ hash MD5
$$ A4 02 8B AC DE DF D1 D0 AD 16 14 83 78 4B 6C 8E
##$RELAX= 
##$RELAX= 
##$RELAX= 
##$RELAX= 
##$RELAX= 
##$RELAX= 
##$RELAX= 
$$ Bruker specific parameters
$$ --------------------------
##$DU= <C:\u>
##$EXPNO= 14310
##$NAME= <ADRS>
##$PROCNO= 1
##$TYPE= <nmr>
##$USER= <dgb>
##$AMP= (0..31)
100 100 100 100 100 100 100 100 100 100 100 100 100 100 100 100 100 100 
100 100 100 100 100 100 100 100 100 100 100 100 100 100 
##$AQSEQ= 0
##$AQ_mod= 3
##$AUNM= <au_zg>
##$AUTOPOS= <50 >
##$BF1= 250.13
##$BF2= 250.13
##$BF3= 250.13
##$BF4= 250.13
##$BF5= 500.13
##$BF6= 500.13
##$BF7= 500.13
##$BF8= 500.13
##$BYTORDA= 1
##$CFDGTYP= 0
##$CFRGTYP= 5
##$CHEMSTR= <none>
##$CNST= (0..31)
1 1 145 1 1 1 1 1 1 1 1 1 1 1 1 1 1 1 1 1 1 1 1 1 1 1 1 1 1 1 1 1 
##$CPDPRG= <>
##$CPDPRG1= <>
##$CPDPRG2= <>
##$CPDPRG3= <>
##$CPDPRG4= <mlev>
##$CPDPRG5= <mlev>
##$CPDPRG6= <mlev>
##$CPDPRG7= <mlev>
##$CPDPRG8= <mlev>
##$CPDPRGB= <>
##$CPDPRGT= <>
##$D= (0..31)
0 1 0 0 0 0 0 0 0 0.06 0 0 0 0 0 0 0.0002 0 0 0 0 0 0 0 0 0 0 0 0 0 0 
0 
##$DATE= 1136469330
##$DBL= (0..7)
120 120 120 120 120 120 120 120 
##$DBP= (0..7)
150 150 150 150 150 150 150 150 
##$DBP07= 0
##$DBPNAM0= <>
##$DBPNAM1= <>
##$DBPNAM2= <>
$$ [...]
##$SUBNAM7= <"">
##$SUBNAM8= <"">
##$SUBNAM9= <"">
##$SW= 20.6930455092707
##$SWIBOX= (0..15)
0 0 3 0 0 0 0 0 0 0 0 0 0 0 0 0 
##$SW_h= 5175.983436853
##$TD= 65536
##$TD0= 1
##$TE= 294.16
##$TE2= 300
##$TE3= 300
##$TEG= 300
##$TL= (0..7)
0 120 120 120 120 120 120 120 
##$TP= (0..7)
150 150 150 150 150 150 150 150 
##$TP07= 0
##$TPNAME0= <>
##$TPNAME1= <>
##$TPNAME2= <>
##$TPNAME3= <>
##$TPNAME4= <>
##$TPNAME5= <>
##$TPNAME6= <>
##$TPNAME7= <>
##$TPOAL= (0..7)
0.5 0.5 0.5 0.5 0.5 0.5 0.5 0.5 
##$TPOFFS= (0..7)
0 0 0 0 0 0 0 0 
##$TUNHIN= 0
##$TUNHOUT= 0
##$TUNXOUT= 0
##$USERA1= <user>
##$USERA2= <user>
##$USERA3= <user>
##$USERA4= <user>
##$USERA5= <user>
##$V9= 5
##$VALIST= <valist>
##$VCLIST= <CCCCCCCCCCCCCCC>
##$VD= 0
##$VDLIST= <DDDDDDDDDDDDDDD>
##$VPLIST= <PPPPPPPPPPPPPPP>
##$VTLIST= <TTTTTTTTTTTTTTT>
##$WBST= 1024
##$WBSW= 4
##$XGAIN= (0..3)
0 0 0 0 
##$XL= 0
##$YL= 0
##$YMAX_a= 856838
##$YMIN_a= -791207
##$ZGOPTNS= <>
##$ZL1= 120
##$ZL2= 120
##$ZL3= 120
##$ZL4= 120
##$ABSF1= 16.522
##$ABSF2= -4.171173
##$ABSG= 5
##$ABSL= 3
##$ALPHA= 0
##$AQORDER= 0
##$ASSFAC= 0
##$ASSFACI= 0
##$ASSFACX= 0
##$ASSWID= 0
##$AUNMP= <proc_1d>
##$AZFE= 0.1
##$AZFW= 0.1
##$BCFW= 0
##$BC_mod= 0
##$BYTORDP= 0
##$COROFFS= 0
##$CY= 12.5
##$DATMOD= 1
##$DC= 0
##$DFILT= <>
##$DTYPP= 0
##$F1P= 14.0000005364418
##$F2P= -0.99999901652339
##$FCOR= 0.5
##$FTSIZE= 32768
##$FT_mod= 6
##$GAMMA= 0
##$GB= 0
##$INTBC= 1
##$INTSCL= 1
##$ISEN= 128
##$LB= 0.3
##$LEV0= 0
##$LPBIN= 0
##$MAXI= 10000
##$MC2= 0
##$MEAN= 0
##$ME_mod= 0
##$MI= 0
##$NCOEF= 0
##$NC_proc= -2
##$NLEV= 6
##$NOISF1= 0
##$NOISF2= 0
##$NSP= 0
##$NTH_PI= 0
##$NZP= 0
##$OFFSET= 16.522
##$PC= 1
##$PHC0= 83.3785
##$PHC1= 6.677644
##$PH_mod= 1
##$PKNL= yes
##$PPARMOD= 0
##$PSCAL= 4
##$PSIGN= 0
##$REVERSE= no
##$SF= 250.13
##$SI= 32768
##$SIGF1= 0
##$SIGF2= 0
##$SINO= 400
##$SIOLD= 32768
##$SREGLST= <1H.CDCl3>
##$SSB= 0
##$STSI= 32768
##$STSR= 0
##$SW_p= 5175.98343685301
##$SYMM= 0
##$S_DEV= 0
##$TDeff= 65536
##$TDoff= 0
##$TI= <Analysis number 999999
Compound Code 99
Book Reference 9
Project Code 9>
##$TILT= no
##$TM1= 0
##$TM2= 0
##$TOPLEV= 0
##$USERP1= <user>
##$USERP2= <user>
##$USERP3= <user>
##$USERP4= <user>
##$USERP5= <user>
##$WDW= 1
##$XDIM= 32768
##$YMAX_p= 504603651
##$YMIN_p= -145951
$$ End of Bruker specific parameters
$$ ---------------------------------
##NTUPLES= NMR SPECTRUM
##VAR_NAME=  FREQUENCY,     SPECTRUM/REAL,   SPECTRUM/IMAG
##SYMBOL=    X,             R,               I
##VAR_TYPE=  INDEPENDENT,   DEPENDENT,       DEPENDENT
##VAR_FORM=  AFFN,          ASDF,            ASDF
##VAR_DIM=   32768,         32768,           32768
##UNITS=     HZ,            ARBITRARY UNITS, ARBITRARY UNITS
##FACTOR=    0.157963299565203, 1,           1
##FIRST=     4132.6476996994, 0,             0
##LAST=      -1043.33573715361, 0,           0
##MIN=       -1043.33573715361, -145951,     0
##MAX=       4132.6476996994, 504603651,     0
$$ Real data points
##PAGE= N=1
##DATA TABLE= (X++(R..R)), XYDATA
$$ [...]
19183A8899L83m620j846m3j374M809P313l003o489J045J059k754q579n040K510
19168B270R420J962j318m691P547M37N181l024n937p07O638N349P13l643n794
19153A4403m349k643n754J700K294O912R022l184r297m13L89j93J2322M577m109
19138B1677r56l656o232p980j071P228P915P705j818j3180r993K417j902j665
19124a511P988L178L658l08O157Q61k986m584l821Q99M693N973J712k740n382
19109A3787q751O171L401l801o092l199R565M135L11L44O614n536l474J883k969
19094A2389p95P161K438n483o922M009J956K804R024J249l144m881r328k015R026
19079A7488J0914j2521j2283n078M566O327o52K592O330L891m392m562R3L275
$$ y = [18899, 19282, 14662, 12816, 12773, 11399, 16208, 23521, 20518, 14029, 15074, 16133, 13379, 4800, -240, 2270, 11690, 13652, 12334, 7643, 15190, 15627, 20808, 17784, 11847, 11140, 17778, 23127, 23840, 20197, 14403, 10054, 7411, 1657, 3357, 5651, 12563, 21585, 18401, 9104, 8691, 9080, 8887, 21209, 25786, 21677, 20721, 17065, 10833, 2853, 1782, 9010, 16925, 24630, 22812, 9632, -361, 2056, 154, -1511, 6477, 9655, 13313, 13005, 19162, 20023, 17037, 12453, 8632, 9531, 14224, 20197, 21909, 19169, 13787, 5036, 11207, 14608, 10807, 4715, 1516, 11081, 15216, 15527, 15871, 22485, 16949, 13475, 15358, 12389, 11594, 18755, 21193, 15710, 8788, 12797, 14753, 17557, 26581, 27830, 24686, 19805, 10477, 8462, 17488, 28402, 15881, 3598, -1480, 3086, 9413, 8761, 11353, 17683, 21574, 17182, 12620, 12713, 15988]
19065A5988k1l395o99j444O22n101K835j199j164J24P749P923q504n007J151O087
19049A5945Q89j885o67l1L626J99p396L256N853m862m250K438J262j794O008K353
19033B0944P34O22N52K778l294p741P01L418J439K249P07K963l5k704r57l641
19017A8735j006o415m242J21J30O108N927p119L003L256m590Q13K419O607k394
19002B1353K43j814o544L599N797M044k78l063j964M869k173q137k631O027R93
18987B0321j338L060O152r812M07P385l543r66K087k211j6K155K607M868M638
18972C5794m760j132j248n136Q070K679m488k135l78K136M479N14r624l642J354
18957B2483K408K740N12j18J806m103m571L20r46M348O415J905k542K789M660
$$ y = [15988, 15967, 12572, 11873, 10429, 11051, 5950, 8785, 7586, 6422, 6546, 14295, 22218, 13714, 8707, 9858, 15945, 16834, 14949, 14282, 14251, 17877, 18076, 10680, 13936, 19789, 14927, 10677, 13115, 14377, 12583, 18591, 20944, 21678, 22300, 22852, 25630, 22336, 14595, 15296, 18714, 20153, 22402, 23109, 26072, 26037, 23333, 22376, 18735, 17729, 11314, 7072, 7193, 7323, 13431, 19358, 12239, 15242, 18498, 13908, 14721, 17140, 23747, 21353, 21596, 19782, 13238, 16837, 22634, 26678, 26400, 23337, 21373, 26242, 24069, 15932, 13301, 19328, 20321, 18983, 22043, 28195, 18383, 18790, 26175, 22632, 21666, 23753, 21542, 21526, 23681, 26288, 31156, 35794, 31034, 29902, 28654, 23518, 31588, 34267, 29779, 27644, 27266, 29402, 33881, 34395, 24771, 21129, 22483, 24891, 27631, 28143, 28025, 29831, 25728, 21157, 21477, 20531, 24879, 31294, 33199, 30657, 33446, 38106]
18942C8106k432l794R35M493k688N93M224L220L124l734K439Q571rK336J383M087
18926F0854N991J1190L741K983J3969J5410P858P872J0288J7487J8999K0963K2651
18913B20256L8181L6441K4276K5273K7433K7155J5415O623L399L710J2096J2985
18901D53243R277l578j2649n632m431m108k523M03m837l535j4130k1175k2014
18888C64311j6154j4140r578k1994l7009l0212k8462k9003k6868k0039j8957k6555
18876H5340k0531k651l341r875n852O420O994k238j1858j977K79r41p626Q81l252
18861B9772p785l390K654M854J0803N719n826o491l699L512N247j430q515k992
18847B2433k959n64N581k636J430J277l774N096j328L78j214J100J072J306l506
$$ y = [38106, 35674, 31880, 32815, 37308, 34620, 35213, 39437, 42657, 45781, 42047, 44486, 53057, 53048, 55384, 56767, 60854, 66845, 78035, 81776, 84759, 98728, 114138, 121996, 129868, 140156, 157643, 176642, 197605, 220256, 258437, 294878, 319154, 344427, 371860, 399015, 414430, 421053, 424452, 428162, 440258, 453243, 462520, 458942, 446293, 440661, 436230, 432122, 429599, 430002, 425165, 421630, 407500, 386325, 364311, 348157, 334017, 324439, 302445, 265436, 235224, 206762, 177759, 150891, 130852, 111895, 85340, 64809, 62158, 58817, 48942, 43090, 49510, 56504, 54266, 42408, 40431, 40710, 39769, 32143, 33024, 29772, 21987, 18597, 21251, 26105, 36908, 42627, 36801, 30310, 26611, 30123, 35370, 33940, 25425, 22433, 19474, 18910, 24491, 21855, 23285, 24562, 20788, 25884, 24556, 24934, 23720, 24820, 25892, 27198, 23692]
18832B3692J132L371Q23n517K31M111Q31m386J119M222J744J767l709k006J519
18817B8944K172j847Q92K004L77m74n07q28M565J008J319m68q94j224n154K393
18801C2278K598m25N348m177j1470k428L702M800J5427N336p57o080R72J623J19
18786D6866l877M461l405q595k75O322o87L819N372j789O4L69j80K404N622r85
18770E5506N160M573M33P627J7737L415k0677j5933l656k759j889j0638p007n206
18756B6686R82R036J737k45q037l629M867K683J3135O904o018p915O1N424j244
18741D4427O01K718J161k983m207M03M146J0782R872o07j1789q152r288L046J483
18726D1613J832j305o86L415P99m157n083k145n016J571j337J488K10L597P801
$$ y = [23692, 24824, 28195, 29018, 23501, 23732, 27843, 28674, 24288, 25407, 29629, 31373, 33140, 29431, 27425, 28944, 31116, 29269, 30161, 32165, 32542, 32068, 31561, 30733, 35298, 36306, 37625, 37157, 36263, 35039, 29885, 32278, 34876, 34451, 39799, 35622, 24152, 21724, 25426, 30226, 45653, 50989, 50232, 44152, 45124, 46747, 46866, 42989, 47450, 44045, 35450, 35175, 41497, 40810, 44629, 50001, 48212, 48276, 48645, 48465, 50869, 56491, 55506, 60666, 65239, 65672, 73299, 91036, 94451, 73774, 57841, 54185, 51426, 49537, 38899, 31892, 26686, 27668, 36704, 38441, 38196, 30159, 26530, 31397, 34080, 47215, 54119, 48101, 40186, 40247, 45671, 44427, 45028, 47746, 48907, 45924, 41717, 42120, 46266, 57048, 66920, 66313, 54524, 46372, 37084, 40130, 41613, 43445, 42140, 41454, 44869, 45668, 41511, 36428, 34283, 29267, 30838, 29501, 30989, 31199, 34796, 42597]
18711D2597M278J430K162l963l961p109M473j035n216K165N564k4j445J80N483
18696D5579M827K414k426K08m937K324O076l982m432L120M269K262L404j659k499
18681E4548o273q236L2R989P864M202Q10j150j456n046p814j0161j558O884O785
18666D9420j488J412O600m645n178j672r86M701O682o585j679N627o15l718n665
18651D2211l728P277O127O455N951M277p41J266N925q049p031o870j112Q04m35
18636E2327P2M513k016N380M034p509k460m933O79m72K550l039q593l065P113
18621D4581M188k089j54J890L037j034K416O511l171O26M329m453r245l145J24
18606D4411J149n07O218M589K874j78j351j044K303M476J43j681J345r312J062
$$ y = [42597, 46875, 48305, 50467, 46504, 42543, 35434, 39907, 38872, 33656, 35821, 41385, 41361, 39916, 40096, 45579, 50406, 52820, 50394, 50602, 45665, 47989, 54065, 50083, 45651, 48771, 53040, 55302, 58706, 57047, 54548, 48275, 40039, 40071, 50060, 57924, 62126, 62936, 61786, 60330, 55284, 47470, 37309, 35751, 42635, 49420, 47932, 49344, 55944, 51299, 46121, 44449, 43463, 48164, 54846, 48261, 46582, 52209, 51594, 47876, 42211, 38483, 45760, 51887, 58342, 64293, 68570, 67829, 69095, 75020, 66971, 59940, 53070, 51958, 52762, 52327, 52399, 56912, 54896, 60276, 64310, 56801, 54341, 49408, 50087, 49615, 52165, 49126, 40533, 37468, 44581, 48769, 46680, 46526, 48416, 51453, 50419, 52835, 59346, 56175, 56801, 61130, 56677, 47432, 44287, 44411, 45560, 45053, 51271, 55860, 58734, 58556, 57205, 56161, 58464, 62940, 63083, 61402, 62747, 53435, 54497]
18591E4497P159m40k212j080K282o09M843l545L655K361K522R62m713M785M993
18576G5460q57L840J1861M758P490k358k037l373K552M250Q341L141K364J387
18562A16819K984J522k965P99M44R29P916J111j949P719Q534K132o337l498n194
18547A30966l127m296K007r2L72l241L872o466m667J58k127o469K362J046P88
18532A11086q072j17p19k388M231M085K448O22j577l567j2795l667l695K297L226
18517I1398l30K504L642K108l122N26q80m192m641J030k01r54K05j823O841P143
18501I9254P11m470K488K945o853m609K008N376j914o28j158M715P122N669O555
18486A17211P348Q60J645O319M428l45L882M379Q124N336M134l782k690k040L624
$$ y = [54497, 61656, 61216, 59004, 57924, 60206, 59597, 64440, 60895, 64550, 66911, 69433, 70395, 65682, 70467, 75460, 74603, 78443, 90304, 95062, 102552, 100194, 98157, 94784, 97336, 101586, 109927, 113068, 115432, 116819, 119803, 121325, 118360, 119159, 119603, 120532, 128448, 129559, 127610, 135329, 143863, 145995, 139658, 136160, 130966, 127839, 123543, 125550, 125458, 125830, 122589, 126461, 119995, 115328, 115486, 113359, 106890, 109252, 110298, 111086, 103014, 102897, 102178, 99790, 104021, 108106, 110554, 111176, 109599, 106032, 93237, 89570, 85875, 88172, 91398, 91068, 93572, 97214, 99322, 96200, 96726, 95846, 91654, 87013, 88043, 87842, 86888, 87093, 85270, 92111, 99254, 99965, 95495, 97983, 100928, 94075, 89466, 91474, 96850, 94936, 94308, 93150, 97865, 104987, 110656, 117211, 124559, 125419, 127064, 133383, 137811, 137466, 141348, 145727, 153851, 159187, 163321, 159539, 156849, 154809, 158433]
18471A58433K97j016K525Q268R759m334P798R339K451J973O242P62K735r63k66
18456B04003l55J1822m60m958j750l183M49L166q05P612p595L143R918M066M721
18441B29794J128Q1J587L645J662p417j514J1030P021M852K71K83M753P304M078
18426B68558J65J0863O373M494O382M193J0443P569N156O685J2848P956O094L249
18412C61028K882N458P939P942K430Q617M622N371R483P259J6664J798n627O29
18398D36495M938L900J178J621P145M666m310R0L5J724M467J0848P596J2182J2809
18383E05384J1736N604Q491J3015J1843J2422K5405K6505K1886K6515K0743K3155
18371G12704K5468L5546L8958K9481K4361L4012M5261M5793M4218M9790N4772
$$ y = [158433, 158730, 157714, 160239, 168507, 178266, 173932, 181730, 191069, 193520, 195493, 201735, 202497, 205232, 204269, 204003, 203648, 215470, 215010, 210052, 208302, 205119, 205568, 208734, 207929, 215541, 207946, 211089, 221007, 225073, 229794, 230922, 231003, 232590, 236235, 237897, 230480, 228966, 239996, 247017, 251869, 252140, 252423, 257176, 264480, 268558, 268723, 279586, 285959, 290453, 296835, 301028, 311471, 319040, 324196, 330881, 343729, 351685, 357779, 361028, 363910, 369368, 377307, 385249, 387679, 396296, 400918, 406289, 415772, 423031, 439695, 441493, 435866, 436495, 441433, 445333, 446511, 448132, 455277, 459943, 455633, 455723, 455758, 457482, 461949, 472797, 480393, 492575, 505384, 517120, 522724, 531215, 544230, 556073, 568495, 593900, 620405, 642291, 668806, 689549, 712704, 738172, 773718, 812676, 842157, 866518, 900530, 945791, 991584, 1035802, 1085592, 1140364]
18360A140364N3146O4726P1703P4611P8921Q3813R1975J10883J19957J32883J49543
18349B172525J72458J87674J97348K14335K30324K52523K71903K88686L03078
18340D290854L22686L39635L66196M21461M78083N32334N76552O46456P44468
18331H718725Q74602J042404J261346J530469J851439K251724K735596L294914
18323B3561219L836206M306469M637027M732231M832802N022228N135791N152961
18315F1216934M735002L432009K328449J417865Q52786J072536J158971M68712
18307G6683264j53959r44870j474827r47247j83065L61286O33609J31259j193919
18298G2911531j966198k666478k930931k693002k955762m032890m903967n891078
$$ y = [1140364, 1193510, 1258236, 1329939, 1404550, 1483471, 1567284, 1659259, 1770142, 1890099, 2022982, 2172525, 2344983, 2532657, 2730005, 2944340, 3174664, 3427187, 3699090, 3987776, 4290854, 4613540, 4953175, 5319371, 5740832, 6218915, 6751249, 7327801, 7974257, 8718725, 9593327, 10635731, 11897077, 13427546, 15278985, 17530709, 20266305, 23561219, 27397425, 31703894, 36340921, 41073152, 45905954, 50928182, 56063973, 61216934, 65951936, 69383945, 71712394, 73130259, 73983045, 75055581, 76214552, 76683264, 76529305, 75584435, 74109608, 73162361, 72979296, 73340582, 73974191, 74105450, 72911531, 70945333, 68278855, 65347924, 62654922, 59699160, 55666270, 50762303, 44871225]
18290D4871225o182698n590392m896525m343590l920736l687049l333268k758358
18282A0158609k126516j525844j061596p64855n74631m49598l66624k94253k36194
18273B758498j91360j71900j57863j46623j42059j27243j15081j17707j10848
18264A477814j09869j15736j06486j04466r4369q2256p6334p1790o2843n0071
18254F03594m1163l7917l4139k4658j9512k2493k5611j6728p467j5789j7499j3303
18242C27315j2648j1503j0477j7332q248p726q738j6207r079j573j2992j3045
18230A97747J201K847j0596j403k738o237K359l61q500o703q932p053p619q722
18216A35290J283P39n656r6n922K346m687J999J277m879p777o191q402p075j805
$$ y = [44871225, 38688527, 33098135, 28201610, 23858020, 19937284, 16250235, 12916967, 10158609, 8032093, 6506249, 5444653, 4679798, 4105167, 3655569, 3288945, 2994692, 2758498, 2567138, 2395238, 2237375, 2090752, 1948693, 1821450, 1706369, 1588662, 1477814, 1367945, 1252209, 1145723, 1041257, 946888, 864632, 788298, 716508, 653665, 603594, 562431, 524514, 490375, 465717, 446205, 423712, 398101, 381373, 373906, 358117, 340618, 327315, 314667, 303164, 292687, 275355, 267107, 259381, 250643, 234436, 225357, 223784, 210792, 197747, 198948, 201795, 191199, 189796, 187058, 180821, 183180, 182819, 174319, 167616, 158684, 151631, 144012, 135290, 136573, 137312, 131656, 131560, 125638, 127984, 123297, 125296, 126573, 121694, 113917, 107726, 99324, 92249, 90444]
18201I0444p999o085N892N088Q19r31m770l529m619M37j148l593Q870j395k952
18186G4529j1842o710j681l708m363k739O952L852K29j0536M764L071k275J952
18172E1495L729l35P36J857j06k603O565L534Q588Q058k057R12M912J175J8859
18157A05319J7031J8864J7230L3502M7931M7977M2099L2800J184k0077k0153k7274
18145B96433l3780k3696j6645j4301j158m210J0714Q916J6842J9842J2764q88
18133B70833l444O857J3101J5702K7400L2895L6413M0115L8207M3107N6075O2535
18121F39796P7668Q0710R1397J15693J49319J98963K64111L50836M80027P59589
18111C208109J057949J266630J317614J568240K425367L50004l933636l282708
$$ y = [90444, 82445, 76360, 82252, 87340, 88159, 87228, 82458, 78929, 74310, 74747, 73599, 70006, 78876, 77481, 74529, 62687, 55977, 54296, 50588, 46225, 43486, 50438, 54290, 54519, 43983, 48747, 51818, 49543, 51495, 55224, 54889, 55625, 57482, 57376, 54773, 61338, 64872, 73460, 81518, 79461, 80373, 85285, 86460, 105319, 122350, 141214, 158444, 191946, 239877, 287854, 329953, 362753, 363937, 343860, 323707, 296433, 262653, 238957, 222312, 208011, 206853, 202643, 213357, 222273, 239115, 258957, 271721, 270833, 267389, 274246, 287347, 303049, 330449, 363344, 399757, 439872, 478079, 521186, 577261, 639796, 717464, 798174, 889571, 1005264, 1154583, 1353546, 1617657, 1968493, 2448520, 3208109, 4266058, 5532688, 6850302, 8418542, 10843909, 11193913, 7260277, 3977569]
18103C977569j638901p71959l82084k01096r7556n6269m8541n1222p4048q7774
18093E68119r7723r2196q4225n4780l9475l3364j5546j4457j0983l799L52k472
18081A19451n862j2933j3968j3275r549l718n33l30N14j368m094j298j480m076
18067D7481R295J723m497K255j1478q401m516L234L603J351k827N01Q72J311K461
18052D2368j298q29p457m235J676J039p56N938q62l178l98n878n373K097j918
18037B0936k761j143N438k275k427K50m774L303L761j615Q098N190p340k321M051
18022B6371j325M847l526m248J0162R89m70p052J882M157Q78m086J431J626l153
18007B8483k761N749J355j857O147L617j061N757J480M316N965Q4O625J0548N051
$$ y = [3977569, 2338668, 1566709, 1184625, 983529, 885973, 829704, 781163, 729941, 655893, 568119, 470396, 378200, 293975, 239195, 199720, 166356, 150810, 136353, 125370, 121571, 121923, 119451, 113589, 100656, 86688, 73413, 63864, 60146, 59613, 59283, 59797, 58429, 54335, 53037, 51557, 47481, 56776, 58499, 54002, 56257, 44779, 36378, 31862, 35096, 38699, 40050, 37223, 37724, 38596, 39907, 42368, 41070, 40241, 32784, 28549, 30225, 31264, 30508, 36446, 35584, 32406, 32008, 26130, 20757, 22854, 20936, 18175, 17032, 22470, 20195, 17768, 18018, 13244, 16547, 20308, 18693, 26791, 31981, 24641, 22320, 26371, 25046, 29893, 26367, 22119, 32281, 33270, 32800, 25748, 27630, 31787, 32665, 28579, 30010, 31636, 28483, 25722, 31471, 32826, 30969, 37116, 40733, 39672, 45429, 46909, 51225, 57190, 57274, 63899, 74447, 79498]
17992G9498L70j159r925r221o944o482k790l892n777l797n739P381o280l930k450
17977A8863L374R873L100M72J00J586L051M189k977n856l731L426m51J810K969
17962C9798l560o737P073j380O15k968l789m218j079K541O78r808k283J290K328
17947A8501N430N885K836J581J077n123k119J721J399M221j476l63o70r33k751
17932B9216K563K394M766L378k792l446L63N292n255m652l061j009J343K139L144
17917C4383k193n472L153N180M787M066L001k228M697j374r139l753N139R01k887
17902C8261P335L174m359o707K810O221P140J3870R708Q714K722K552l20J0280
17888A01401J0615L421J1520J0159J2558J9114K2332K4096K3401K2033J9716J4128
$$ y = [79498, 79868, 78709, 68784, 59563, 52619, 46137, 43347, 39455, 33678, 29881, 24142, 31523, 25243, 21313, 18863, 22237, 32110, 35210, 35682, 35782, 37368, 40419, 44608, 41631, 35775, 32044, 35470, 35019, 36829, 39798, 36238, 29501, 36574, 35194, 35809, 32841, 29052, 24834, 23755, 26296, 26974, 17166, 14883, 16173, 18501, 23931, 29816, 32652, 34233, 35310, 30187, 28068, 29789, 31188, 35409, 33933, 33570, 32900, 31967, 29216, 31779, 34173, 38939, 42317, 39525, 36079, 36442, 41734, 36479, 31827, 28766, 27757, 29100, 31239, 34383, 32190, 26718, 29871, 35051, 39838, 43904, 46905, 44677, 49374, 48000, 38861, 35108, 40247, 41148, 38261, 45596, 48770, 44411, 37704, 40514, 46735, 53875, 67745, 77453, 86167, 88889, 91441, 91121, 101401, 112016, 115437, 126957, 137116, 149674, 168788, 191120, 215216, 238617, 260650, 280366, 294494]
17876B94494K1146K9540O052n332R318J0144n512l2810k7750k0984k3057k3288
17864B31961k8108j9467O04K202j2074r596m92j348l749q787n525l066l047J1292
17850A50800O238J6862K0438J1248J3377K8099K1062K061M610P667J3040Q129
17838C03631J3219K3853L5168M4677N8642O6301P3641J07400J36178J16387R6307
17827A075404J28656J89641J23529k4486m2301M0901N9639j03360k09058j47440
17817A091125n4197o5892j35982j19354o4101j8374k1350n8340n1533k6064k4615
17806D51323m5509n3790m3812k3891k3639l1264l2645j5654j726J3213M280O99
17794A97585J5234K2636K2433K6402L3138M8568N2220L5445M6445O5818N9365
$$ y = [294494, 315640, 345180, 351232, 345900, 355218, 365362, 359850, 327040, 299290, 278306, 255249, 231961, 203853, 184386, 184990, 187192, 175118, 165522, 165030, 163682, 159933, 151146, 145621, 142555, 139508, 150800, 157038, 173900, 194338, 205586, 218963, 247062, 268124, 270185, 274795, 282462, 295502, 303631, 316850, 340703, 375871, 420548, 479190, 545491, 619132, 726532, 862710, 979097, 1075404, 1204060, 1393701, 1517230, 1492744, 1450443, 1491344, 1550983, 1447623, 1238565, 1091125, 1036928, 971036, 835054, 715700, 651599, 633225, 611875, 553535, 502002, 475938, 451323, 405814, 352024, 308212, 284321, 260682, 229418, 196773, 181119, 179393, 192606, 196886, 197585, 212819, 235455, 257888, 284290, 317428, 365996, 418216, 453661, 500106, 565924, 625289]
17783F25289J8980J2834L8959O5464O3720L2178N4110R8914J31894J31026P0218
17772A343586M5689J12259J52155o964j70285j10957j0516o8253k41862k45354
17762G99498j46552r5371j08669j08218q1839m5893k1540M95j984M150R297l822
17750A99552j5403r118o647q216j7729k6624j6991o293r849k537o745q535p774
17737E7091k231n141o537N388N193Q271Q004k14N661k805K094J7143M230K0036
17723A16183K7107J9477K6893K3464K3649K7177L3141K5889K6240K6149J3275
17712C88644J2359Q255m252O054Q468Q852j508o380M020l397l139k497L754L173
17698D22406o802j1888j5640k2911r095j2879k2833k6748k9007l0580l2540l2258
$$ y = [625289, 644269, 657103, 696062, 761526, 825246, 857424, 911534, 1010448, 1142342, 1273368, 1343586, 1389275, 1501534, 1653689, 1646725, 1476440, 1365483, 1354967, 1286714, 1044852, 799498, 652946, 557575, 448906, 340688, 258849, 212956, 191416, 191911, 189927, 194077, 203374, 199552, 184149, 175031, 168384, 160168, 142439, 115815, 98824, 92531, 82682, 80145, 73400, 64865, 57091, 54860, 49719, 43182, 48570, 53763, 62034, 70038, 69824, 75485, 72680, 74774, 91917, 96147, 116183, 143290, 162767, 189660, 213124, 236773, 263950, 297091, 322980, 349220, 375369, 388644, 401003, 409258, 405006, 411060, 419528, 428380, 426872, 420492, 424512, 421115, 417976, 415479, 419233, 422406, 415604, 403716, 388076, 365165, 356070, 343191, 320358, 293610, 264603, 234023, 201483, 169225]
17686A69225k7886k3319j8043j7836j9090j2450l177n254j0442n831k137L325
17674B7085k305O714N991o76j0762o846L730P742K021j0025l931R77j439K744
17660B1020K367n73j651k2M542J841K527K236n787l656j187m785m098k041J421
17645A2154M340l988J016O149q84p52N274j572q423l428r02p88L346O911R14m000
17629A5367n723L256m692j239K970J789M467L954n288p380r89Q062M295j159K876
17614B0566N331N065m877p724n553P70p761l494l196M341R771L010m190k954m073
17599E032p51j261j00M353L519L891L163p317J132K71P409r99j575K033k553n132
17583A1115J3102l691l887l977j613n85j309J257J0791Q57J939L765j2171o425
$$ y = [169225, 141339, 118020, 99977, 82141, 63051, 50601, 47424, 42170, 31728, 25897, 23760, 27085, 24780, 31494, 37485, 36809, 26047, 19201, 22931, 30673, 32694, 22669, 18738, 19715, 18276, 21020, 23387, 22814, 21163, 21141, 25683, 27524, 30051, 32287, 26500, 22844, 21657, 16872, 12774, 10733, 12154, 16494, 12506, 13522, 19671, 18787, 18035, 23309, 21737, 13314, 9886, 8984, 8196, 11542, 18453, 19367, 15367, 9644, 12900, 8208, 6969, 9939, 11728, 16195, 20149, 14861, 7481, 6492, 14554, 18849, 17690, 20566, 25897, 30962, 26085, 18361, 12808, 13578, 5817, 2323, -873, 3468, 13239, 16249, 12059, 9105, 5032, 4281, 3020, 2920, 7273, 10792, 14683, 17846, 10529, 11661, 11932, 19341, 18342, 16767, 18800, 16247, 11115, 24217, 20526, 16639, 12662, 11049, 10464, 9155, 10412, 21203, 22060, 23999, 27764, 15593, 9168]
17569I168O027l001k836K819K932n443n978j667K560l65M542j627j972m501J654
17554B312R322K409n395n16J516P9n227K195R186O54j58l566n585J18O702M913
17538A8959K036J058m537n442N006J159m703L83K018K891N573J199m235l128K851
17523B1088p131n263j73J546l569K275j782m644L949M540p552K12L958M36J468
17508I358J70Q829L666m122j0146L256K868J746L152Q71M487j33m49o918N981
17493B2616J0887n83j984m38L014N708k559l304k266L454k614l622L300K988M980
17478C9577O68m41L681J608l691L419R789p54K382O681O728R822O466P348O139
17463I9422J1585J7307J7071J9261K0559J8425L6131M1771M3374N2133N0626M5371
$$ y = [9168, 15195, 12194, 9358, 12177, 15109, 9666, 3688, 2021, 4581, 4216, 8758, 7131, 5159, 658, 2312, 11634, 14043, 8648, 8132, 9648, 9727, 4500, 6695, 15881, 16535, 16377, 12811, 7226, 7344, 14046, 18959, 20995, 22053, 17516, 12074, 17080, 18239, 13536, 13919, 15937, 18828, 24401, 25600, 21365, 18237, 21088, 13957, 8694, 8521, 10067, 6498, 8773, 6991, 2347, 6296, 10836, 3284, 3496, 7454, 7890, 9358, 9528, 18357, 22023, 17901, 7755, 11011, 13879, 15625, 18777, 19648, 24135, 24002, 23553, 16635, 22616, 33503, 32920, 30936, 30498, 33512, 39220, 36661, 33357, 31091, 34545, 31931, 28309, 31609, 34597, 39577, 40245, 39804, 43485, 45093, 41402, 44821, 54610, 53856, 56238, 62919, 69647, 79469, 85935, 93283, 99422, 111007, 128314, 145385, 164646, 185205, 203630, 239761, 281532, 324906, 377039, 427665, 473036]
17451D73036L6752J2165n018k842n135l1374l7708k2152j2886L601J2815K0769
17439D42023K0343M171J2295J3363q544j3687j2831k5614m6946n5927n6456m9075
17427B23115l8673k6225k6014k2054j0463p647j0234j0510j694O590K543q64K057
17414G9927K623k462M711K377j0655n068Q165J4915L126J980O148J3944J4992
17401A34723J0081J0935J8678K3814K6269K8142K9500L3848K6126P708o065k1298
17389C22461j7910N891J3266L1264L9492N1530P3848R8920J33561J79496K20642
17378A152461K74015L03972K77899J77889K3124j38848k59209l19596k98890k47552
17368I45265j83099j21632o8020k0649J1794L8829L6323K2701j2253n9005q2657
$$ y = [473036, 509788, 521953, 516935, 514093, 508958, 477584, 439876, 417724, 404838, 408439, 421254, 442023, 462366, 466537, 478832, 492195, 483651, 469964, 457133, 431519, 384573, 328646, 272190, 223115, 184442, 158217, 132203, 110149, 99686, 92039, 81805, 71295, 69601, 76191, 78734, 77870, 79927, 82550, 80088, 84799, 87176, 76521, 71453, 79618, 94533, 97659, 99639, 105787, 119731, 134723, 144804, 155739, 174417, 198231, 224500, 252642, 282142, 315990, 342116, 349824, 343759, 322461, 304551, 310442, 323708, 354972, 394464, 445994, 519842, 618762, 752323, 931819, 1152461, 1426476, 1730448, 2008347, 2186236, 2209360, 2070512, 1811303, 1491707, 1192817, 945265, 762166, 640534, 572514, 551865, 563659, 602488, 638811, 661512, 649259, 590254, 507597]
17357E07597r4814q7920p1333m1260k1053j5168J264Q99j092l580K578L454P922
17344A87494J5888J3665J6618K1168L7475M0611M5440O1475Q0698Q8137O4417
17333F73086L6424O091k3627l4177m555K8474O4072J06900J37625J49561J69146
17322A309020J61612J31294P1064k7146j48302k44233k92832k68525k09024j45267
17312C37661r2604n0622k2248j3827j3398J405R638L902R839M886J1489K700m068
17299A84753j4295k3500k1996k3800k0822j0169m180r951j4383j0109j732M69
17287C0285l581R065k878r616N89K803k811k42j459k997o36J869r08J0594M751
17272C4828J364L57l456n123J326N782L442J92L471L317r00j99k199k391M003
$$ y = [507597, 412783, 324863, 253530, 212270, 191217, 176049, 177313, 178212, 177120, 173540, 176118, 179572, 187494, 203382, 217047, 233665, 254833, 292308, 332919, 378359, 439834, 520532, 608669, 673086, 709510, 715601, 691974, 657797, 653242, 681716, 745788, 852688, 990313, 1139874, 1309020, 1470632, 1601926, 1672990, 1645844, 1497542, 1253309, 960477, 691952, 482928, 337661, 245057, 194435, 172187, 158360, 144962, 146367, 156005, 159907, 169746, 174632, 186121, 188821, 184753, 170458, 146958, 124962, 101162, 80340, 70171, 65991, 56040, 41657, 31548, 29816, 30285, 26704, 35769, 32891, 23275, 23864, 26667, 23856, 23614, 22155, 19158, 18522, 20391, 19483, 30077, 34828, 36192, 36549, 33093, 27970, 29296, 35078, 38520, 38712, 42183, 45500, 44600, 44401, 42202, 39811, 43814]
17257D3814o699m347l724J483Q441J026q165l832L643k032K410k621N385M502
17243C9284L991K702l745m404m364K646O844J528O327J361l792k538J934R757
17229E7531K780m614j813P943M383n324N06K411j09J200q029R58m068j028m334
17214D8393P64J277k024M390M538m672m054j416m132Q88R71L801O578k775k706
17199D9821K484m971m528j405l107j420J42k38J490k735K989k607m083r20O958
17184C7870N789m837K301N376L482n616n034l98J643m467J252o51j393K575M74
17169C8366l566k159K093P381k465p19p33R20k981j939N252P055n820k492P855
17154D6048R035J318j0244k092n131K568M468J257P817M991L899O409O556n57
$$ y = [43814, 37115, 32768, 29044, 30527, 38968, 39994, 31829, 27997, 31640, 29608, 32018, 29397, 34782, 39284, 43275, 45977, 42232, 37828, 33464, 36110, 42954, 44482, 50809, 52170, 48378, 45840, 47774, 57531, 60311, 55697, 53884, 61827, 66210, 60886, 61392, 63803, 63694, 64894, 56865, 57823, 53755, 52727, 48393, 49157, 50434, 48410, 52800, 57338, 52666, 48612, 47196, 43064, 43952, 44923, 48724, 55302, 52527, 49821, 52305, 47334, 42806, 41401, 38294, 36874, 37016, 36778, 38268, 35533, 38522, 35915, 31832, 30912, 37870, 43659, 38822, 41123, 46499, 49981, 44365, 39331, 38933, 40576, 36109, 37361, 36710, 35317, 37892, 38366, 34800, 32641, 34734, 42115, 39650, 38931, 38198, 39118, 36137, 34198, 39450, 46505, 40685, 38193, 46048, 55083, 56401, 46157, 44065, 38934, 41502, 45970, 47227, 55044, 60035, 63934, 70343, 76899, 76342]
17140G6342o099j372M237J0021N435N468L204r76K009k39k048K95L131N428J632
17125A06468n377k310J9N320j066J535j806j782J875Q028N478j223L000k940p249
17110A07970n713L036J022k211q780o876K110m209o186n272L687J0789l073k831
17096H3463N281P796Q23l171l415Q03J930Q200j492J92k842l408k177m651k360
17081H4972Q497k029m496J419O33l809l852k2P620Q132L922j877k316J877L068
17066A01739M671j154j0562K545J5248M976J82q55R034K292L192O593R239J7668
17052A64808J5781J3712R092J1092Q816J0065Q976M04L966O623R514P931m777
17039B66003k044M981o30M979L63M830N764n846r496l228L819l137n467j6126
$$ y = [76342, 70243, 68871, 73108, 83129, 88564, 94032, 97236, 96260, 98269, 98030, 95982, 96277, 99408, 104836, 106468, 101091, 98781, 98800, 104120, 103054, 104589, 102783, 101001, 102876, 110904, 116382, 115159, 118159, 115219, 107970, 102257, 105293, 106315, 104104, 95324, 88448, 90558, 86349, 80163, 74891, 78578, 89367, 86294, 83463, 88744, 96540, 97363, 94192, 90777, 91580, 93510, 101710, 100218, 100410, 97568, 94160, 91983, 87332, 84972, 93469, 91440, 86944, 88363, 88996, 85187, 81335, 81313, 88933, 97065, 100987, 99110, 96794, 98671, 101739, 106410, 105256, 94694, 97239, 112487, 117463, 117645, 116790, 125824, 128116, 131308, 137901, 147140, 164808, 180589, 194301, 203393, 214485, 223301, 233366, 242342, 242746, 246712, 253335, 262849, 270780, 266003, 263959, 268940, 268310, 273289, 273652, 278482, 284246, 278400, 268904, 265676, 269495, 266358, 260891, 244765]
17025B44765p353o068J066o056n935K6J581K12j1969j4254o190J549K650m332
17011A89692M453O884Q280P200R318O900L477L276K493n096p759L795p38K849
16997B35024j793J331L491J49J176k795J2695J8727O427o17n121o932N467j403
16983B65826K957P902O692K494L05n15N376P773R9Q986P110m189K54O106J1814
16968C28990J1405P211Q732J1048M633K886J2317J2739K653O159J0865Q315J3315
16955D41268J2703J5018J9701K0691O690R913J7969J8865K0380J5394J1313J7046
16943F26951K2514K3560K0063J9537J6758K6154K9318L4558M1267M2878L0509
16932I34067L3091M7778N1275N1058N0471O0608O9667P8229Q3454Q5710Q7369
$$ y = [244765, 237412, 231344, 232410, 226354, 220419, 220445, 222026, 222238, 210269, 196015, 189825, 191374, 194024, 189692, 194145, 201029, 209309, 216509, 225827, 232727, 236204, 239480, 241973, 236877, 229118, 232913, 232175, 235024, 233231, 234562, 238053, 238202, 239378, 236583, 249278, 268005, 274432, 273815, 268694, 261762, 267229, 265826, 268783, 276685, 283377, 285871, 286176, 285661, 291037, 298810, 298909, 307895, 315005, 310816, 311070, 317176, 328990, 340395, 347606, 356338, 367386, 372019, 374905, 387222, 399961, 402614, 408773, 419638, 427953, 441268, 453971, 468989, 488690, 509381, 516071, 525984, 543953, 562818, 583198, 598592, 609905, 626951, 649465, 673025, 693088, 712625, 729383, 755537, 784855, 819413, 860680, 903558, 934067, 967158, 1014936, 1066211, 1117269, 1167740, 1228348, 1298015, 1376244, 1459698, 1545408, 1632777]
16921A632777R8915J06100J14435J24226J48743J60685J76427J99784K22607K49763
16911C234462K77884L08183L35013L64527L99395M26026M50663M72780N20989
16902F789922N85118O34019O86032Q03498R49996J098043J257280J486266J788732
16893A6078906K159750K640777L295536M089651N027158O136092P386189Q298342
16885E5112401Q123577P407652P471051P202556L921927n39060j867742j702784
16877H5129578l906394o727633o171376l579219j499360K21362K110022L231029
16869F8808009L782207M733634M512159R18209l097468l939541m241768p281580
16861F4193861j0223052r802554q096965p256810o627271n337885l802994k587904
$$ y = [1632777, 1731692, 1837792, 1952227, 2076453, 2225196, 2385881, 2562308, 2762092, 2984699, 3234462, 3512346, 3820529, 4155542, 4520069, 4919464, 5345490, 5796153, 6268933, 6789922, 7375040, 8009059, 8695091, 9498589, 10448585, 11546628, 12803908, 14290174, 16078906, 18238656, 20879433, 24174969, 28264620, 33291778, 39427870, 46814059, 55112401, 63235978, 70643630, 78114681, 85317237, 89239164, 88700104, 86832362, 85129578, 81223184, 74495551, 68324175, 64744956, 63245596, 63466958, 65576980, 68808009, 72590216, 77323850, 81836009, 82754218, 79656750, 75717209, 71475441, 64193861, 53970809, 44168255, 36071290, 28814480, 22187209, 16849324, 13046330, 10458426]
16853A0458426j802448j297865r73471p64282o28429n31612m64752m03898l40908
16844C250761k85112k39642k21967j87705j45883j37333j41131j39586j24593
16835A627809j18603j20908j28126j17550j03427q2668p4573o7297n6230m7820
16825G10607l9950l5445l2307k5761k4094k0719j7285j6484k0185l0069j2794
16814D35514j6444j1277r739j3527k1370j0060j0598j6929j3063j0479r648j2486
16802B79894j4430j3692j1480j2737r256r576p574r917j093l641o806o266k895
16789A70531k677q013M90j408j2414j1265r673l916J538N05k346o579j713P797
16775A20857j176q014p667k890q299j303p636q007n195M17j679j0849r948o150
$$ y = [10458426, 8655978, 7358113, 6384642, 5620360, 4991931, 4460319, 3995567, 3591669, 3250761, 2965649, 2726007, 2504040, 2316335, 2170452, 2033119, 1891988, 1752402, 1627809, 1509206, 1388298, 1260172, 1142622, 1039195, 956527, 881954, 814657, 758427, 710607, 670657, 635212, 602905, 577144, 553050, 532331, 515046, 498562, 478377, 448308, 435514, 419070, 407793, 398054, 384527, 363157, 353097, 342499, 325570, 312507, 302028, 292380, 279894, 265464, 251772, 240292, 227555, 218299, 208723, 201149, 191232, 190139, 186498, 179692, 173426, 170531, 167854, 159841, 160331, 158923, 146509, 135244, 125571, 121655, 123193, 123698, 121352, 114773, 113060, 120857, 119681, 111667, 104000, 101110, 92811, 91508, 83872, 75865, 70670, 71087, 69408, 58559, 48611, 42461]
16761D2461k736j571m163p886J920N297L055N859L980R79r821o554J631k734k722
16746B6995L244r168k520j424m026q988L711K11q770j628J971l386Q03L842K367
16731C234l873j619L18n981j0627j0322m940K391l920J257N191j981j078J630
16717c0320L503P558N42p882o220k668p93Q611Q352J101J198n1L835M674N700
16702b860O377J060O45m416O114r96k659l317j931N650J994q065j570O074O421
16687H521P292J430o14J059n11k110r067k477L378J281q46P80k692k817J657j498
16671B766n676j084j148L06M667l304m801j09J600L624o919M115k351p623N958
16656i979J235n911q24L330J233K759p714o535L974Q448O412j879j3516j833O647
$$ y = [42461, 39725, 38154, 33991, 26105, 28025, 33322, 36377, 42236, 46216, 47195, 37374, 30820, 32451, 29717, 26995, 30239, 21071, 18551, 17127, 13101, 4113, 7824, 8035, -735, -2363, -392, -3778, -2975, 867, 3234, -639, -2258, -1940, -7921, -18548, -28870, -33810, -31419, -35339, -34082, -28891, -30872, -31950, -30320, -26817, -19259, -18717, -26599, -32819, -35487, -36280, -27669, -19317, -18216, -17018, -17069, -13234, -8560, -2860, 3517, 4577, 5222, 806, 6920, 5924, 3265, -52, -1983, 3667, 5661, -2404, -3974, 2100, 8521, 15813, 17243, 16629, 17688, 17177, 15067, 6000, 3523, 6901, 8182, 7336, 8116, 5424, 2607, 4264, 2766, -2910, -3994, -5142, -4836, -169, -3473, -8274, -8383, -6783, -3159, -10078, -5963, -8314, -15937, -9979, -8744, -14655, -15479, -12149, -10916, -8157, -15871, -22406, -18432, -9984, -3572, -5451, -18967, -20800, -14153]
16641a4153K893j011m318R71Jl295K36M955k629K403k543k459N273N240n43o818
16625a5797N52P795n496l411P412M718K153j186k635J786n895r857L78J0069L778
16610e636l141m152J044M104K085k937L356M933j898L68mk797M221j699j301K024
16594a430J757M050k453p237m403Q66p339k851J643L569M175N1M640Q351p751
16579d362m075K474Q939J205m237n710k212P612l055O67L18k857k811m921K696
16564a0329L099j319j890O68n873o818K972J242p67J61l479l949O546m88p627
16549b7851q864L242Q537M947J769K959K823j838L537m91m408N036n28j66O934
16534d362l031p470l295M650R70O558K102L174r95l090j130Q92M930m281p87O743
$$ y = [-14153, -11260, -12271, -16589, -15618, -15617, -18912, -18676, -13721, -16350, -13947, -16490, -18949, -13676, -8436, -8979, -15797, -15245, -7450, -12946, -16357, -8945, -4227, -2074, -3260, -5895, -4109, -10004, -19861, -19483, -9414, -5636, -8777, -12929, -11885, -7781, -5696, -8633, -5277, -344, -2242, -1874, -1878, -4675, -454, -2153, -3454, -1430, 327, 4377, 1924, -5313, -9716, -8850, -16189, -19040, -17397, -13828, -9653, -9602, -4962, 3389, -4362, -8437, -5963, 2976, 4181, -56, -5766, -7978, -366, -3421, -2754, -2436, -5293, -8104, -13025, -10329, -7230, -8549, -10439, -9771, -15644, -22462, -19490, -18248, -19015, -18854, -22333, -26282, -19736, -20224, -27851, -36715, -33473, -24936, -19989, -18220, -15261, -12438, -14276, -10739, -11230, -15638, -10602, -11130, -11296, -4362, -7393, -14863, -18158, -13508, -12538, -5980, -3878, -704, -1699, -4789, -5919, -5027, -97, -4378, -5165, 1578]
16518A578O986O551M462R92Q374M431R749J6212J1059L121O482J0499M902M297
16504I9695O107M854L553o56o957o027n195p777j0400r042j2593p943o807j0286
16490C0526j2705l816o418q015j2963j958R826j633l530J181q93M307R241k809
16476C41n685l590n205O272P8q85m586l265O890M614M830m021r535l146k976n88
16460b0457O391K809l904j613K147J800n76p306p54L707o472k260J866m654m230
16445c3506l272M204O025R587m749k826M279j732j264o90L124O779O097j296q586
16430a7826l209L339j881l363j926n695L297o963J76J615r46N478L796k083l658
16415b9849n570O493L962J1221l304n660o706m981N766L345k467K466O381M67
$$ y = [1578, 8564, 15115, 19577, 20569, 28943, 33374, 43123, 59335, 70394, 73515, 79997, 90496, 95398, 99695, 105802, 110656, 114209, 113553, 106596, 100569, 95374, 87597, 77197, 68155, 55562, 47619, 40812, 30526, 17821, 14005, 7587, -428, -13391, -15349, -5523, -7156, -10686, -9505, -10398, -6091, 3150, 341, -5344, -8934, -14139, -7867, -7789, -8674, -13260, -16525, -9635, -5021, -191, -4212, -13747, -16893, -19869, -20457, -14066, -11257, -15161, -16774, -14627, -12827, -13403, -20709, -21463, -17756, -24228, -26488, -24622, -29276, -33506, -36778, -32574, -26549, -16962, -21711, -24537, -20258, -21990, -23254, -23944, -20820, -14041, -7944, -9240, -17826, -21035, -17696, -19577, -22940, -24866, -30561, -27264, -34227, -34051, -32436, -33382, -27904, -24108, -26191, -29849, -35419, -28926, -24964, -13743, -17047, -22707, -29413, -34394, -28628, -25283, -27750, -25284, -18903, -18436]
16401a8436m970N72M089j626n82j639q56L053Q8M47P21k333j399R58q115p36P988
16384b2776N075K017k88k473j1612l580P543j727l349N956j227O569K522r37k617
16369b0904L472L288M965q675k408N983l046M796N233Q406l053l695m732n579
16355a5949l131KN63J924l187O459L887L166l669n327M261l962j736M919n60R72
16339a1368K127l472m033L76O100R601J545j213L863J0771O571n73l119m922n48
16324A1706J1002J4668O863m17Q308J1150J0142P697J4250J5259K7599K9035L4338
16311B01600M3538M4359M8471L9272L9117L7446K1911r827j1892r507j9298l0370
16299C94820k7804k2623o141k54J4926J3170J5339K5556K5684P82j6773j9575
$$ y = [-18436, -23406, -22834, -18745, -20371, -20953, -22592, -23448, -20395, -20307, -19860, -19139, -21472, -22871, -21913, -30028, -30764, -22776, -17701, -15684, -15972, -18445, -30057, -33637, -26094, -27821, -31170, -25214, -26441, -19872, -17350, -18287, -20904, -17432, -14144, -9179, -17854, -20262, -14279, -17325, -12529, -7296, 1110, -1943, -5638, -10370, -15949, -19080, -19078, -18515, -16591, -19778, -13319, -9432, -6266, -9935, -15262, -11001, -14963, -16699, -11780, -12340, -11368, -9241, -12713, -16746, -16370, -10270, -669, 876, -337, 3526, 14297, 20868, 20295, 17176, 12254, 11706, 22708, 37376, 44239, 43822, 52130, 63280, 73422, 81119, 95369, 110628, 138227, 167262, 201600, 245138, 289497, 337968, 377240, 416357, 453803, 475714, 465887, 453995, 444488, 425190, 394820, 367016, 344393, 338252, 337998, 352924, 366094, 381433, 406989, 432673, 433455, 416682, 397107]
16287C97107k6572m0874n5474n2357l9065l7774l4429l0886k0118j4896j7103
16276B7559q176k477q687p532n524k301j1150J662L552O090J334q183k356k465
16262a8654K811J635k500J258N679O361o052p767j890N741P14m636j72M92m658
16247b1638k052J075j517k800L403O377M240k116k810N167J875n87L26k775J827
16232a2005K723l231n586m278j642K650J706O482M894K578k465q697k201M18R566
16217i088P090n929k421m279j507N181q258n334N521O18M395j180m15o831j013
16202b3450J049L648P173j574n919J59L087m271l104M442K337N401K042j422r0
16187a0492o754n918J687K404j204K110K302J078j719o880p40K933L179p45m850
$$ y = [397107, 370535, 329661, 274187, 221830, 182765, 144991, 110562, 79676, 59558, 44662, 27559, 19383, 16906, 8219, 687, -4837, -7138, -18288, -16626, -13074, -6984, -5650, -13833, -16189, -18654, -15843, -14208, -16708, -15450, -9771, -3410, -9462, -17229, -19119, -13378, -12664, -17300, -17472, -16980, -21638, -23690, -22615, -24132, -26932, -23529, -17152, -12912, -15028, -17838, -12671, -10796, -11383, -11057, -13832, -12005, -9282, -12513, -18099, -22377, -24019, -21369, -19663, -13181, -8287, -5709, -8174, -16871, -19072, -18654, -9088, -1998, -7927, -10348, -14627, -16134, -10953, -19211, -24545, -19024, -18406, -14011, -15191, -15606, -22437, -23450, -22401, -18753, -11580, -13154, -19073, -18914, -15827, -20098, -23202, -18760, -16423, -11022, -8980, -10402, -10492, -17246, -23164, -21477, -19073, -20277, -18167, -15865, -14787, -16506, -23386, -24126, -21193, -18014, -18759, -23609]
16172b3609M094P118K322l826k323L863m953n654R88O346R516o74l104k143l743
16157a5782n050m768K495K034m442J175L646p76k177m962l587N115P069L402L62
16142a6246j0544p111Q666N389l571m45M264J213R49m792K504R94k161J468J713
16127a7710q37m308q547Q88Q762R389k002o154L318O509L63N496L946J259p839
16112g467m630m218K529L278J809k250n281q58l234j645k207k952N648p57l611
16097b5846K277L560K248k113L06L256N597N258M396j309n936j682J994k403Q42
16082i555Q433P0l865m355l734K332K091O538J947n892q206J259j191r874M3J3640
16066a0319Q44m237m997N572L518n09n671j0359O684K222p228m659N977J1844
$$ y = [-23609, -19515, -12397, -10075, -13901, -16224, -12361, -17314, -22968, -21980, -15634, -6118, -6792, -9896, -12039, -15782, -20832, -25600, -23105, -21071, -25513, -24338, -20692, -21468, -23645, -28607, -32194, -27079, -20010, -16608, -16246, -26790, -33901, -25235, -19846, -23417, -23862, -19598, -18385, -17436, -22228, -19724, -18730, -20891, -19423, -17710, -18547, -22855, -31402, -30514, -21752, -12363, -14365, -20519, -17201, -10692, -10329, -4833, -887, 372, -7467, -12097, -16315, -13786, -10508, -8699, -10949, -16230, -17088, -20322, -21967, -24174, -27126, -21478, -22235, -25846, -23569, -20009, -17761, -19874, -19568, -16312, -10715, -5457, -1061, -2370, -8306, -9988, -7994, -10397, -9555, -1122, -1052, -4917, -9272, -13006, -10674, -8583, -2045, -98, -5990, -14196, -12937, -14128, -24002, -23959, -10319, -9475, -13712, -18709, -13137, -9619, -10128, -15799, -26158, -19474, -17252, -24480, -29139, -23162, -11318]
16052a1318L009o06p647m588j507M819N910m509m111R88l406M906R31j177M205
16037a4101R266J490k586k754J926j839j866K560q71j697K252j700o117r40K669
16022a4308K164o113J22Nk840J017M32k518m69M96k831j384j7q359j641P661P073
16005b1510M555J119o40k263L640N442j964j54K433k679o853p797J142L492J222
15990b0815o03M06J212k105J676j701J678L821L666j701k278K238k143j606M468
15975a3787K372J866j565n228m770m753m85N594J609r49J079L883O388k88J677
15960g357l887k759j1080K03l033M039O040Q872Q67j16K039l405l801J47O836
15945f395N921l66l305n830n309k996J931P460K361J06J773l346J151k296k968
$$ y = [-11318, -8309, -8915, -16562, -21150, -22657, -17838, -11928, -16437, -20548, -19560, -22966, -18060, -17129, -18306, -14101, -4835, -3345, -5931, -8685, -6759, -8598, -10464, -7904, -8775, -10472, -8220, -9920, -16037, -16977, -14308, -12144, -18257, -18135, -18130, -20970, -19953, -19521, -22039, -22508, -22012, -24843, -26227, -26244, -34603, -36244, -28583, -21510, -16955, -15836, -16476, -18739, -15099, -9657, -11621, -11775, -9342, -12021, -18874, -26671, -25529, -22037, -20815, -21418, -21012, -19800, -21905, -20229, -21930, -20252, -16431, -12765, -14466, -16744, -14506, -16649, -18255, -13787, -11415, -9549, -11114, -16342, -21112, -25865, -26350, -20756, -19147, -20096, -19017, -15134, -8746, -9034, -7357, -11244, -14003, -25083, -24880, -27913, -23874, -17834, -8962, -8095, -8211, -6172, -9577, -13378, -13231, -6395, -474, -840, -4145, -9975, -15284, -18280, -16349, -8889, -6528, -6422, -4649, -7995, -6844, -9140, -12108]
15930a2108p361q010j096K230J4645Q453q251n729j556M88l489j041O321R05K752
15915a2847K130r309K731P191k315j965M78M019k176J591j174O02k969l444N89
15900a6868L495O02J218k236M96n39j301m270K71j249k882L972J1227J300J933
15885d831l182o387k789K761L29j831j1M955P229l334K437L695n79K188k374l310
15869e034j652m027j434K635k99n762M893O034K133m82l583J65k926k464N021
15854f782P301q28q302p37M760l299o492k265J861K18J481o963k43O674K712O738
15838d166L431l324j360l906j683J109l542l183n148o185N716K771k626K88J0044
15823a1764O999r788m973L742M837j250o449N950K174Q70L90l641O430K78p448
$$ y = [-12108, -19469, -27479, -28575, -26345, -11700, -3247, -11498, -17227, -18783, -18295, -21784, -22825, -16504, -15599, -12847, -10717, -20026, -17295, -10104, -12419, -14384, -13906, -9887, -12063, -10472, -11646, -11044, -14013, -17457, -16868, -13373, -12771, -11553, -13789, -13293, -13832, -15133, -19403, -19132, -20381, -23263, -19291, -8064, -6764, -4831, -8013, -14400, -17189, -14428, -14099, -15930, -15941, -10986, -3757, -7091, -4654, -959, -1538, 650, -1724, -5034, -6686, -10713, -12147, -9512, -9811, -15573, -10680, -4646, -2513, -2995, -6578, -6413, -9339, -11803, -6782, 519, -309, -8611, -9348, -4588, -7887, -14379, -16644, -14783, -14565, -13084, -20047, -20290, -13616, -10904, -4166, -735, -4059, -5419, -9325, -11008, -9899, -13441, -16624, -21772, -27957, -22241, -19470, -22096, -21808, -11764, -4765, -14553, -19526, -15784, -10947, -12197, -18646, -12696, -10522, -9652, -9262, -12903, -6473, -6195, -13643]
15808a3643l798K967O066K276j082r873k211P081K8k304j888J996L398j184R59
15793a1212j451j120K701l126M176N048m37m534n419M13O366j753o073o569K428
15778b0562P427k717m018k77M540M139j930K290N833K164m181q587l96J0851N189
15763b35j0433q96m631L926P695n287j0302l27P325M16r132o96P379O581N330
15748c287m565m049J08n22M97J698K206J411K711J43N1N517J76k427o538J488
15732e382K22K055J77n648q27o087o34n139N17O543J626j694K467n34r491k146
15716b3975N431J665q31J045K135n83k021L258m199m17N942n302K402O070p72
15701a0152L361l405k134j608l970o695o09N875R025J829o258n231j255R000L925
$$ y = [-13643, -17441, -14474, -8408, -6132, -7214, -17087, -19298, -12217, -12189, -14493, -16381, -14385, -10987, -12171, -11212, -12663, -13783, -11082, -14208, -10032, -4984, -5421, -9955, -15374, -14961, -8595, -10348, -16421, -22990, -20562, -13135, -15852, -19870, -20147, -15607, -11468, -13398, -11108, -5275, -3111, -7292, -15879, -16275, -5424, -235, -10668, -11564, -16195, -12269, -4574, -9861, -20163, -20490, -13165, -12749, -21881, -22577, -15198, -8617, -3287, -7852, -11901, -11793, -12315, -11818, -10120, -7914, -6503, -3792, -3649, -3598, 1919, 2095, -332, -6870, -5382, -5160, -3105, -2928, -8576, -9403, -15490, -16124, -21263, -20746, -14203, -12577, -14271, -11804, -12338, -21829, -23975, -18544, -16879, -17710, -16665, -14530, -15113, -17134, -13876, -18075, -18492, -12550, -17852, -15450, -9380, -10152, -6791, -10196, -12330, -13938, -17908, -24603, -25212, -19337, -10312, -8483, -14741, -19972, -21227, -12227, -8302]
15686h302l102l901j588O9K352K579l537m814J936M638o242k338K750M287P103
15671h110l650R6P813n089l979O123L10o710m00o88J940P013P499O573p847K658
15655C552o81r147m959l877n07L165l044l060n56q24J168M21M26K24N315L384
15639i000m187n392j965p393L313L532k414L30M790K721j386m24L897k153K499
15624a3232J946K102M863o917k027N61L342J424M224L63k446k155p31Q693J895
15609A905n693k315J111R38q081j0781L612o703Q5J017j759L181J822K915j721
15594b0467N735J0624N96l745m763j433L844o24Q431N282l450m114j206l754p473
15579a6517K81o086J136N826K991K230J552L07M362n989K171l600k37k391K952
$$ y = [-8302, -11404, -15305, -16893, -16824, -14472, -11893, -15430, -20244, -18308, -13670, -19912, -22250, -19500, -15213, -8110, -11760, -11664, -3851, -8940, -12919, -6796, -6486, -13196, -13596, -14284, -12344, -5331, 2168, 8741, 894, 3552, 2871, -6276, -11235, -15112, -15619, -12454, -15498, -18558, -19114, -19938, -18770, -18349, -17923, -17699, -12384, -9000, -13187, -18579, -20544, -27937, -24624, -21092, -23506, -23176, -18386, -15665, -17051, -17475, -13578, -15731, -13232, -11286, -9184, -4321, -11238, -13265, -12704, -9362, -7938, -3714, -3351, -5797, -7952, -8683, 10, 1905, -3788, -6103, -4992, -4054, -12135, -22916, -19304, -26007, -25922, -24905, -26664, -23483, -21661, -18746, -20467, -14732, -4108, -3512, -7257, -12020, -13453, -9609, -10233, -1802, 3480, 30, -4084, -5290, -9044, -16517, -16236, -22322, -21186, -15360, -12369, -10139, -8587, -8280, -3918, -9907, -7736, -11336, -11573, -13964, -11012]
15564a1012K430J86o685M94K313L057J0141N551l487o303q887K149k184j699R4
15549a3842m924P533M106o606r340M960N102O66k432r55j522o03l98j323N624
15534a3954M113N899j540K329l352l398J911N753m220j304J617L309L729j770
15520h78K408o025L86K988j0311p588l641J764O614K835L946j230K228q89j683
15505i076j286m513P30m02j865j787L728Q243K207q001j801J440M625J2100P10
15490E052j42r228j2169J437q40Q99J125P42n23N32N168M268K477o291j2325K10
15474a9608O008j818K823M289M022K287q365k808m874K225Q41M417J598r72P67
15459i168K189j547l101j127j218p179q52l842J036P458J1273O856q89L000o162
$$ y = [-11012, -8582, -8396, -15081, -14587, -12274, -9217, 924, 6475, 2988, -3315, -12202, -10053, -12237, -13936, -13842, -18766, -11233, -7127, -13733, -23073, -18113, -13011, -12345, -14777, -15732, -17254, -17857, -18255, -19578, -13954, -9841, -3942, -5482, -3153, -6505, -9903, -7992, -2239, -6459, -7763, -6146, -2837, 892, -878, 1530, -4495, -4109, -1121, -11432, -19020, -22661, -20897, -14283, -11448, -7502, -8732, -6504, -7393, -9076, -10362, -14875, -14145, -14547, -16412, -18199, -14471, -6228, -4021, -12022, -13823, -12383, -7758, 4342, 5052, 4910, -4318, -16487, -15050, -15890, -14991, -13866, -13124, -13647, -13115, -7947, -3679, -1202, -7493, -19818, -19608, -13600, -15418, -12595, -8306, -4284, -1997, -10362, -13170, -18044, -15819, -14978, -10561, -8963, -9935, -9168, -6979, -8526, -11627, -12754, -13972, -21151, -22003, -25845, -24809, -17351, -6078, 778, -111, 2889, -3273]
15444c273o633n453k135j304N015O93L310K015q4m650p356j386j07P955J114j484
15428a3763q456J331o29M379N195P013L850m190k161o766J876O752O27J159l114
15413f897l546J428K466j224j803j485L567n658o134m543P398J1438O417m16m643
15398c635K288J098l12o20Q26J165K403q65p643q713l0L692j280O752J397K249
15382a228j008n907n03r49L030J840m12p755R909P847q70k318o453k621m148o67
15366a2213Q28M095M78J270O19k645K142k06n778J675k324K24J836n899L700R461
15350b737M552M98m598k618K266l043q36M507Q41K120M072o56k738k110M303L361
15334G184q823l540K94J496M87n102n80k449J044R407K840n82k848j2582j065
$$ y = [-3273, -9906, -15359, -17494, -18798, -13783, -13090, -9780, -7765, -7849, -12499, -19855, -21241, -21348, -13393, -12279, -13763, -22219, -20888, -21517, -17138, -11943, -4930, -1080, -5270, -7431, -14197, -12321, -5569, -4942, -3783, -6897, -10443, -9015, -6549, -7773, -9576, -11061, -7494, -13152, -19286, -23829, -16431, -4993, 1424, 1008, -3635, -1347, -249, -561, -1181, -355, 810, 3213, 2348, -5295, -14008, -14038, -10346, -11626, -4874, -3477, -1228, -2236, -8143, -8646, -9595, -6565, -4725, -5137, -12892, -2983, 4864, 3994, 1676, -4777, -7398, -11546, -12213, -11385, -7290, -6812, -5542, -4923, -7568, -5426, -5632, -11410, -9735, -12059, -11835, -9999, -15898, -12198, -2737, 1815, 2313, -2285, -4903, -2637, -5680, -6516, -2009, -1168, 952, 5024, 4368, 1630, -480, 3823, 7184, -1639, -5179, -4885, -3389, -2902, -8004, -8584, -11033, -9989, -582, 2258, 1676, -1172, -13754, -14819]
15319a4819k760M725J0852O89K019j306p211J650j330N584O193n233n978m434
15305a1359P699l227o491O295O712L787Q08n046p168L379j75k106k583n842N161
15290a0156L374P414j783o224k474O218L570q6k455k300r63m96j326l943K131
15275i499L981J604R478m428j0189j679K062K062N612N172q318n483N021r02k854
15260h360K133M67j848O155q08n752l944N533N624q753l98L055O528m519J853
15245c034J377K671K202o336M173m402o604M769R875K731o519o235M677K367j303
15230D09q027m352M921k020j848N1k556j971j481N131L427R28O820N086l403j851
15214g36J756m350k114l355k254Q46L212P276N02M595M22k751J709K262j493J533
$$ y = [-14819, -17579, -12854, -2002, -1313, 706, -600, -7811, -6161, -7491, -1907, 4286, -947, -6925, -11359, -3660, -6887, -13378, -7083, -371, 3416, 4224, -822, -7990, -4611, -4786, -6892, -9475, -15317, -10156, -6782, 632, -1151, -7375, -9849, -3631, -61, -147, -2602, -4902, -5865, -6361, -7687, -11630, -9499, -5518, -3914, 5564, 1136, -9053, -10732, -8670, -6608, -996, 4176, -4142, -9625, -4604, -5506, -8360, -6227, -5760, -7608, -1453, -2261, -8013, -11957, -6424, -800, -9553, -9951, -6896, -368, -4887, -3034, -1657, 1014, 3216, -3120, 1053, -3349, -9953, -5184, 4691, 7422, 903, -5332, -655, 1712, 409, -7618, -11970, -7049, -9069, -10917, -10866, -13422, -15393, -16874, -11743, -8316, -7388, -568, 4518, 1115, -736, 1020, -3330, -5444, -8799, -11053, -10207, -6995, 281, 783, 5378, 5800, 3049, 4758, 7020, 5527, 7060]
15198G060k900o623n44o584r756r25J50Q250J285L906R74l897M341M827m581m195
15182i212l550N785L87l625k210m891K315N855n40N422n045K261o21K589L003
15167b077l238K218O899n856r18O233l023l222K437N29q252m765L040k363n20
15152a2878P703j260l403r54J471k00L898P042m11q461L271K463n28J298J807
15137H58k365J617k05j881l973L673M180m20j767n655m368J348k442J917n74r36
15121a0993M443Q56J668l692l505n69k130K55k647k309L668J758J615J869o11
15106a0324l021k033M268N052n396K203Q380L753m146m924M507j0922m000J504
15092a5099L096L135l043k745l398J281J0433M292M300k091q35O122j592j760
$$ y = [7060, 4160, -2463, -3007, -9591, -19347, -20272, -20122, -11872, -10587, -6681, -5707, -9604, -5263, -436, -5017, -9212, -12762, -6977, -6590, -10215, -12425, -17316, -15001, -9146, -9686, -4264, -9309, -7048, -7669, -5080, -2077, -5315, -3097, 3802, -2054, -2972, 3261, 238, -2984, -547, -18, -8270, -13035, -9995, -12358, -12878, -5175, -6435, -9838, -10792, -9321, -9521, -5623, 1419, 1008, -7453, -4182, -1719, -2247, -949, 858, -1507, 110, -95, -1976, -5949, -2276, 1904, 1484, -283, -5938, -10306, -8958, -11400, -9483, -10057, -10993, -6550, -5694, -4026, -7718, -11223, -11792, -13922, -13667, -16314, -18623, -14955, -13197, -11582, -9713, -10324, -13345, -15378, -11110, -6058, -11454, -9251, -871, 2882, -1264, -6188, -1681, -12603, -16603, -15099, -12003, -8868, -11911, -14656, -18054, -16773, -6340, -2048, 2252, 161, -674, 5448, 3856, 2096]
15078B096j0711j198N230O288k862k929j985p784l159k024J28P05N31L798Q205
15063e671M67k353K239P654O53R48M157l555l200k356l902l243Q12O871l945k64
15047d688n994j083o22j129Q906K895j02n46Q55m054L202K256j644Q02m75Q76
15031e45K81j77L002j93l130K848m535L47M511k057O645J253r915l164K464j99
15015b564L07M950q72o70q92l34N896J192J428J66l041m270k96J1357L996m594
14999A1759k044o66M397j646J070N909k7n214L358L512O706N271J903M053N694
14984D4035O960N542L13P892O231M066P974J4521J9522J9564K3448K3245K9323
14971B12636M4303N5988Q0537J25139J89724K25563K40309K74875M32718Q7071
$$ y = [2096, -8615, -9813, -4583, 1705, -1157, -4086, -6071, -13855, -17014, -19038, -18910, -18205, -17674, -13876, -5671, -5204, -7557, -5318, 2336, 2989, 3937, 8094, 4539, 1339, -1017, -4919, -8162, -7350, -479, -4424, -4688, -10682, -11765, -12387, -13516, -4610, -1715, -1817, -2363, -1508, -5562, -2360, -104, -1748, -946, -1421, -545, -264, -441, 2561, 2368, -762, 2086, -2449, -2102, 2409, 352, 6997, 8250, -1665, -4829, -2365, -2564, -2257, 2693, 1821, 1151, 259, -75, 5821, 7013, 8441, 8607, 5566, 1296, 1000, 12357, 16353, 11759, 9715, 9049, 13446, 11800, 12870, 18779, 18752, 13538, 16896, 20408, 27114, 32385, 34288, 38341, 44035, 50995, 56537, 56850, 64742, 70973, 75039, 83013, 97534, 117056, 136620, 160068, 183313, 212636, 256939, 312927, 393464, 518603, 708327, 933890, 1174199, 1449074, 1881792, 1968863]
14961A968863o94494n99926l02061j41553p4265m6580k9078j5751j1340n447q091
14950D0277n664r240o272k624J246J497J976m033r030K486K879N98Q4r454o672
14935a946p21J507j49l110o05p42K510L447J426k593R283M952q492o434k490q08
14919d965J59q19N756J834j299K183j387m653m407l188L314M113O02N25L857K056
14903C681L14p041m616K478J65N511M815N189l189n196j370K209M870j437L650
14888A0033J226n687l213R4j909J106K430j759K83J683L805K502j472l481o090
14873d49J639j762n424M670P683m328l477j216k097J156l297L401K151K184J478
14858B312n557m526l762l058K105N634p77l16n61j942o410J091J1870K211n329
$$ y = [1968863, 1274369, 674443, 372382, 230829, 156564, 109984, 80906, 65155, 53815, 48368, 40277, 34613, 25373, 19101, 16477, 17723, 19220, 21196, 17163, 8133, 10619, 13498, 14096, 14180, 4726, -1946, -2667, -1160, -1309, -4419, -5024, -5766, -3256, 191, 1617, -976, 8307, 13259, 4767, -1667, -4157, -4965, -4806, -5625, 131, 1965, 666, 2849, 1462, -3191, -7598, -10786, -7472, -3359, -2757, -2232, 1625, 3681, 3995, -3046, -7662, -5184, -5019, 492, 5307, 10496, 7307, 2111, 741, 2950, 7820, 6383, 10033, 11259, 5572, 2359, 2453, 544, 1650, 4080, 2321, 2604, 4287, 8092, 10594, 9122, 5641, -449, 1190, -572, -5996, -1326, 6357, 2029, -1448, -2664, -4761, -3605, -6902, -3501, -1350, 834, 2312, -3245, -7771, -11533, -14591, -12486, -6852, -7629, -7945, -8506, -10448, -16858, -15767, -3897, -1686, -7015]
14843g015Q17N921l47k039m35L324J734k25k569n161N044N962L009m112j312N238
14827G834k149l234n229O05M34M99K951P954L617n727l150n350J780m186l425
14812f776K764m509j372N457K237k379n098O934L113j106k439l21M334j888l280
14797d329m283j405N595O823n267l090R25R29J521L97L923k955m516K571M094
14782I33k956k771L002O27m255l45L275L818M71l664p45l007J56K655O003J621
14766D818o12L976K21J511k285r71k406Q123M42k163p004m943M425m895r42N355
14750B650r05l828J304k077k232N667P151N061L820k026p530n873l892J576R26
14735b08P50M004o16k829n406J775L438L600L710o06j573k662p21R71M300n109
$$ y = [-7015, -6198, -277, -624, -2663, -3098, 226, 1960, 1735, -834, -5995, -951, 5011, 8020, 3908, 2596, 7834, 5685, 2451, -2778, -2173, -1739, -1240, 1711, 9665, 13282, 7555, 4405, -945, 835, -3351, -6776, -4012, -8521, -9893, -4436, -2199, -4578, -9676, -2742, 371, -735, -3174, -3495, 839, -1049, -4329, -8612, -10017, -4422, 2401, -2866, -5956, -5031, -4102, -2581, -2184, 1739, -1216, -5732, -3161, 933, -2023, -4794, -1792, -1165, -5420, -5765, -2490, 1328, 1799, -1865, -2610, -5617, -5461, -2806, 3197, 4818, 4206, 8182, 8403, 9914, 7629, 6658, 4252, 12375, 12817, 10654, 3650, -1293, 3132, -1763, -2705, 2650, 1745, -2083, -779, -2856, -5088, 579, 7730, 12791, 16611, 14585, 7055, 1182, -2710, -1134, -208, 542, 4546, 3930, 1101, -4305, -2530, 908, 4508, 8218, 7612, 6039, 3377, 2656, 3627, 7927, 2818]
14719B818j152K405L681l302m557K923R165K602k796n1j511n741q193m764M251
14704d222J66J918Q731J579l82j172m69Q795K573L765l515N560P095J343n90m273
14688B6902K837k094l754K046M946O483K755m500R58J891N703K825k088m67O003
14673E0446Q838j542o03N374L018K137N126J028r346q960n58k374j688K61k520
14658D8637m248n075p897m052k34k353l608L704J010K914q630r065l603k828j487
14643C185L582M402M621k290k638l913J317m143l915N922J663n798J47k207L54
14628B89j330k902n085p538J115Q908K887n97j614L952M255O203k210l429p742
14613d838m147K141N726o3M085n083n67k22q924m037J374O273Q684P640K402q3
$$ y = [2818, 1666, 4071, 7752, 4450, -107, 2816, 11981, 14583, 11787, 11736, 10225, 4484, -3709, -8473, -4222, -4056, -2138, 6593, 8172, 7790, 6618, 6149, 14944, 17517, 21282, 17767, 23327, 30422, 31765, 31175, 26902, 29739, 27645, 23891, 25937, 30883, 37366, 40121, 35621, 36579, 38470, 44173, 46998, 44910, 44443, 50446, 59284, 57742, 57139, 62513, 65531, 67668, 72794, 73822, 64476, 55516, 54958, 52584, 50896, 51157, 48637, 44389, 39314, 31417, 27365, 27131, 24778, 21170, 24874, 25884, 28798, 20168, 11103, 7500, 4672, 3185, 6767, 11169, 15790, 13500, 10862, 6949, 8266, 4123, 208, 6130, 7793, 1995, 2142, -65, 289, -1041, -3943, -9028, -16566, -15451, -6543, -3656, -4253, -5867, -1915, 2340, 8543, 6333, 2904, -4838, -8985, -6844, -1118, -1181, 2904, -2179, -2746, -2968, -11892, -15929, -14555, -8282, 402, 8042, 10444, 10361]
14597A0361L523o235k786n810k001l943M369N110j462K172o830k244M951P472
14583F647J439P24q387k338o93K754R40N647K358j618o456k481M609P75l530J8
14567D08J288n46K002L415l301k758P42M153K001k70Q60m688p062l965K04n276
14551a2793N244N294N161L366j27k260m015m682N302R734L322r20M924N284n368
14536A7466l087r61J111K165p064j344L016O90l391r886m788J801N827k161L884
14521C278O25p522k928L444L192M231N095N183Q063l429k959j556j725L699Q545
14506B5236o004o853o866J753L771N378K385J171r69k752o225k514l92M49p169
14491C99l427R77K548K893P67k890q75L724n166j0422J814R565K510q259K040
$$ y = [10361, 13884, 7649, 4863, -947, -2948, -6891, -2522, 2588, 1126, 3298, -3532, -5776, -825, 6647, 8086, 8810, 423, -1915, -2608, 146, 1086, 6733, 9091, 7473, 1017, -1464, 3145, 3920, 390, 408, 1696, 1150, 3152, 6567, 3266, 508, 1250, 5403, 7404, 7134, 7994, 3306, -3756, -7721, -7517, -12793, -7549, -2255, 2906, 6272, 6145, 3885, -130, -4812, 490, 10224, 13546, 12626, 17550, 22834, 17466, 14379, 13418, 14529, 16694, 9630, 8286, 11302, 11992, 8601, -1285, -6073, -4272, 1555, -606, 3278, 3903, -3619, -6547, -3103, 89, 4320, 9415, 14598, 22661, 19232, 16273, 14717, 12992, 16691, 25236, 19232, 12379, 5513, 7266, 11037, 16415, 18800, 19971, 19002, 16250, 10025, 7511, 7119, 7568, 399, -3028, -2051, 497, 3390, 4157, 1267, 392, 4116, -1050, -11472, -9658, -93, 2417, -5842, -3802]
14476c802l585L636O265j364M010J2683j90p561m982K54m168q432L323N447J023
14461B557n077m47L063J027m305k464P853R280j551k152J004k128K097k122m469
14446B166q790n073M658r39O003N898m604L813N703k060j277Q228L025l345J129
14431A4535M7l168n070k367Q87J600K873k48k564J697j928O380K894l251L133
14416A5450n700q059m787p15j001P066O583K298k620n512j0096l869L030O661
14402a271R315N890M230k173l041m06N150P05O6J87j3342m271J710J59j342L637
14386E203m07L884K735l933o575q60L101q39M279L687n588k175N406M464k796
14371I586J791K478J170n152l259m216q58L321M489p307m960L429M39P289J32
$$ y = [-3802, -7387, -3751, 2514, 1150, 5160, 17843, 17653, 10092, 5110, 5364, 1196, -7236, -3913, 1534, 2557, -2520, -2967, 96, 1123, -3182, -5646, 2207, 11487, 9936, 7784, 8788, 6660, 8757, 6635, 2166, -6624, -11697, -7039, -7978, -1975, 3923, -681, 3132, 8835, 6775, 5498, 13726, 16751, 13406, 14535, 14582, 11414, 6344, 3977, 4864, 6464, 9337, 9089, 6525, 8222, 6294, 12674, 15568, 12317, 15450, 9750, 1691, -3096, -3811, -4812, 2254, 8837, 11135, 8515, 3003, -7093, -10962, -7932, -1271, 8044, 13934, 18164, 15991, 12950, 12544, 17694, 18399, 18465, 18652, 5310, 1039, 2749, 2908, 1566, 5203, 4796, 8680, 11415, 7482, 907, 47, 3148, 2309, 6588, 10275, 4687, 2512, 7918, 12382, 9586, 11377, 13855, 15025, 9873, 6614, 2398, 1540, 4861, 9350, 2043, -2917, 512, 951, 8240, 8372]
14356H372m100L718j252L101j942k900n635K728M972J149o73q518r13K986Q51
14341A944J476N225j499r632J799J1j691Q127q6K098k058p307j333O984M320n490
14325B888n357L960K632q50J330J541J289j835J424L19K84L83n815o274M263J1421
14309A1603L517k389L922P054k890l069m259l109j528M042l450n497M931N331
14295A4209m831r15n73m446l353L623J355j137j751k320K245L195M757k293OL613
14279A1384J19m518k016P314j763l404j59k472k697j61P709K819m596m686O063
14264H936J426M573K649R85L437j986m820p820j350L539K856j684K527P427m379
14249A6316q724L136O074P210m049k74q61J808L526m790l499J47J031m629k887
$$ y = [8372, 4272, 7990, 6738, 9839, 7897, 4997, -638, 2090, 7062, 8211, 7538, -980, -1893, 1093, 1944, 3420, 8645, 7146, -2486, -687, -676, -2367, 5760, 5674, 7772, 5714, -1593, -2926, 4058, 8378, 2888, -2469, 1491, 4123, 3273, 4603, 6144, 7433, 5598, 7022, 7341, 7625, 8008, 2193, -4081, 182, 11603, 15120, 12731, 16653, 23707, 20817, 17748, 13489, 10380, 8852, 12894, 9444, 3947, 8878, 14209, 9378, 8463, 7890, 3444, 91, 3714, 5069, 3932, 2181, -139, 2106, 5301, 10058, 7765, 7771, 11384, 11503, 6985, 4969, 12283, 10520, 7116, 6957, 4485, 1788, 1627, 9336, 12155, 7559, 2873, 8936, 10362, 14935, 17584, 18569, 22006, 20020, 15200, 7380, 6030, 9569, 12425, 10741, 13268, 20695, 16316, 7592, 10728, 16802, 24012, 19963, 19689, 18828, 20636, 24162, 19372, 15873, 16020, 17051, 12422, 9535]
14234I535j444K334M852O798Q308M28j223L096P075j316L518O098N797j843m55
14219E1558L246j751p093j2053o429p19J083k641p299m362M21K93l989l140O967
14204A4092k544J283L449K159J877j592n047L872k708n55J2289M42m321K895n472
14189B0119n80P610J865j548n338J154n767K030K861L321M462l852m922M077P055
14174C2547q201p50P782J756l510P011N488L671N388L572J4717J8218J4268K0278
14160A22235K9430K1542J0463n416k1683l0274l2345l3170k6305j2521k327K129
14148B1758J428k533j960j136K416K085K019J072k302r816J264l42L509M607l199
14133A8870p96L632k698l111N811k910L199L191p77n518M222J730p153l480J928
$$ y = [9535, 8091, 10425, 15277, 22075, 30383, 30811, 29588, 32684, 39759, 38443, 41961, 48059, 53856, 52013, 51558, 54804, 53053, 45960, 33907, 27478, 26759, 27842, 25201, 17902, 13540, 13961, 14254, 10265, 7125, 14092, 11548, 12831, 16280, 18439, 20316, 18724, 13677, 17549, 14841, 14286, 26575, 27017, 22696, 25591, 20119, 19539, 27149, 29014, 27466, 22128, 23282, 17515, 19545, 22406, 25727, 30189, 26337, 21415, 25492, 32547, 24346, 23596, 31378, 33134, 29624, 36635, 42123, 45794, 51182, 54754, 69471, 87689, 101957, 122235, 151665, 173207, 183670, 178254, 156571, 126297, 93952, 60782, 34477, 21956, 19629, 21758, 23186, 20653, 18693, 17557, 19973, 22058, 24077, 25149, 22847, 13031, 14295, 13953, 17462, 22069, 18870, 18074, 21706, 19008, 15897, 21708, 18798, 21997, 25188, 24411, 18893, 23115, 24845, 17692, 14212, 16140]
14118A6140J381j414K061l757l009N070J779n85Q957N854k733o628m582M06m107
14103A4833j922l964R25Q536J650n213N132J354n647l954R82j115j026r39k130
14088G502J985L720K806J451o47K369J309l365p497k098L41j946k635M530K408
14073A0233O63R05L355m357l397K844P526J126n289M920J154m122k37k478n201
14058G645k35K239N682l170p259J845N197L807N143L418j720k296q70l534K636
14043A8528J633M066l169j235L775l227k079N399M43n54K711n150k569l904k11
14028A4457K643L079M590k005r590N437K656k453k142k615M921O747K594p468
14014B0851n479J500j698n051K212P321K781l375Q27m081j20O828P309J444m93
$$ y = [16140, 17521, 16107, 18168, 14411, 11402, 16472, 18251, 17666, 26623, 32477, 29744, 23116, 18534, 18940, 14833, 12911, 8947, 9872, 18408, 20058, 14845, 19977, 21331, 15684, 11730, 12712, 11597, 10571, 9632, 7502, 9487, 13207, 16013, 17464, 16817, 19186, 20495, 17130, 9633, 7535, 7876, 5930, 3295, 7825, 10233, 10896, 11801, 15156, 10799, 7402, 10246, 17772, 18898, 13609, 18529, 19683, 15561, 15324, 12846, 7645, 7410, 9649, 15331, 12161, 4902, 6747, 11944, 15751, 20894, 24312, 22592, 20296, 19426, 15892, 18528, 20161, 24227, 21058, 19823, 23598, 20371, 18292, 23691, 24134, 23580, 26291, 21141, 18572, 14668, 14457, 17100, 20179, 24769, 22764, 13174, 18611, 21267, 18814, 16672, 14057, 18978, 25725, 28319, 20851, 15372, 16872, 15174, 10123, 12335, 19656, 22437, 19062, 19889, 15808, 15688, 22516, 29825, 31269, 30776]
13999C0776P69l204m564k7j685j065M102Q194L371j820j756p119n456o234n65
13984A3717J928O216N911m875l643N990m541p56k223p889J768M157J044J257J606
13969A9667n058n049m168n472M734K625L250O100K942p30Q23j687M501R717q217
13954B3978o449J884k687l18j299J675K752n752L30J426l091j404K248m637J279
13939I935L714K721J0493m291J006K673L77j355q306L331R53n590l353J0022Q213
13924C0543K972k009q664R95j75k122K645O388M829K111k222j49j129m04J31N169
13908C8909m478L619N540l940p530p063q17L804K947n354k493m064K938K815K119
13893B6952j873n049o35M501J1722m019q730o678N730J473j462M257k538j547
$$ y = [30776, 31545, 28341, 23777, 23750, 22065, 21000, 25102, 33296, 36667, 34847, 33091, 25972, 20516, 14282, 13717, 15645, 21861, 27772, 22897, 19254, 25244, 20703, 19947, 17724, 9835, 11603, 15760, 16804, 18061, 19667, 14609, 9560, 5392, -80, 4654, 7279, 10529, 16629, 19571, 18841, 19664, 17977, 22478, 32195, 23978, 17529, 19413, 16726, 16408, 15109, 16784, 19536, 13784, 14114, 15540, 12449, 11045, 13293, 8656, 9935, 13649, 16370, 26863, 22572, 23578, 26251, 26628, 25273, 16967, 20298, 21251, 15661, 12308, 22330, 30543, 33515, 31506, 22842, 23837, 23662, 21540, 24185, 30573, 35402, 37513, 35291, 35142, 34013, 33609, 33740, 38909, 34431, 38050, 43590, 39650, 32120, 25057, 24240, 28044, 30991, 25637, 23144, 19080, 22018, 24833, 26952, 25079, 20030, 19395, 23896, 35618, 31599, 22869, 16191, 21921, 23394, 21932, 26189, 23651, 22104]
13879B2104k229j941p130m013J658O399J5316m95n154l277j114j621Q392L257
13865C0152o518k856L932N794l09M192k012l197j596k478l447k996N82J323J862
13850B2428K756o951m065O411m34k230M334M237p337j610K55J332K936l595J503
13835A9970K676M002L466q112l582l352L10K539P67M168l800L163J188J983Q88
13820B6274j194j498J062K551j29L401N957K017l310k345q94p807N872K969l343
13805B9583l284Q764l07p511j393j153j007J079q00k44J732r99N406l828m284
13790B1754m428k860M167M826Q066j951p392p955N241O916J451J202o424j856
13776B0757O85N629L318O60n201p4M12j661k940J833K842N326k51o494O03l934
$$ y = [22104, 19875, 17934, 10804, 6791, 8449, 14848, 30164, 29669, 24515, 21238, 20124, 18503, 26895, 30152, 23634, 20778, 24710, 30504, 30195, 34387, 32375, 29178, 27582, 25104, 21657, 18661, 19243, 20566, 22428, 25184, 18233, 14168, 20579, 20145, 17915, 22249, 26486, 19149, 17539, 17794, 19126, 22062, 18467, 19970, 22646, 26648, 30114, 22002, 18420, 15068, 15378, 17917, 18684, 22852, 19052, 22215, 23403, 25386, 26274, 25080, 23582, 24644, 27195, 27066, 30467, 36424, 38441, 35131, 32786, 31892, 24085, 29957, 32926, 29583, 26299, 35063, 34756, 27245, 25852, 24699, 23692, 24771, 23971, 23727, 25459, 24460, 29866, 26038, 21754, 17326, 14466, 18633, 23459, 31525, 29574, 22182, 14227, 19468, 26384, 27835, 29037, 22613, 20757, 21442, 27071, 30389, 31049, 25848, 25774, 26186, 24525, 21585, 23418, 26260, 31586, 31335, 24841, 25444, 21510]
13760B1510J0119l126n312R72L785P600Q536l994m41l892j663J511q08o60n223
13745B8914j260M88j316N08L890P35n793L97p82M048K85j213l81k619k985M101
13729B7017M707l321j245L271K345K012l52k091J606j463P878l868r011j359K85
13714B6411L598j437k292p697m162L295N024j942o846n130L627P280P690L869
13700C1288M586m607k395M928j001n15k640L595P922Q124k742j5280K453O942
13686D0658J092N220O349O186j186k833r180M966k086n676m088k098L13n75o305
13671C0757o634O42P201N32J0414p52q956l84P599Q821n178m483M37M378K982
13656D7376l435K085N328N108O10N649J1325P396R018N000M751j197j2696n953
$$ y = [21510, 31629, 28503, 23191, 24163, 27948, 35548, 44084, 40090, 39649, 35757, 34094, 35605, 34797, 34137, 28914, 27654, 28142, 26826, 27334, 31224, 31959, 26166, 26563, 25781, 29829, 30114, 28901, 28520, 25901, 22916, 27017, 31724, 28403, 27158, 30429, 32774, 34786, 34434, 32343, 33949, 32486, 40364, 36496, 27485, 26126, 26411, 30009, 28572, 26280, 18583, 14421, 17716, 22740, 20798, 13952, 8822, 12449, 19729, 27419, 31288, 35874, 31267, 28872, 33800, 32799, 32284, 29644, 33239, 41161, 49285, 46543, 31263, 33716, 40658, 41750, 46970, 53319, 59505, 58319, 55486, 46306, 51272, 49186, 43510, 39422, 37324, 37637, 37062, 30757, 24123, 24765, 31966, 32498, 42912, 42160, 33204, 32820, 40419, 49240, 44062, 39579, 40016, 44394, 47376, 43941, 46026, 51354, 56462, 57072, 62721, 74046, 81442, 90460, 95460, 100211, 99014, 86318, 80365]
13642H0365n522j6678j3496l10K281p226l359n383O097K137J236K010m632J000
13628C8520l012m281O383L657K025K101l510M10j214P07q224j722O996P247M551
13613E0634K214N909N908l604k642j362j435q774k705L750l736p327n294M346
13599C5882J726n569Q4L962p589k046m857L169R717M135J197M725M307j959j216
13584D5668n040l48m218o415k924J883r724O85O925N576j977P07o86m030N939
13569C2021l443j64N352K301k382L276J052L403j441K459l48n472j878O46n55
13554C4827l984J737J136P89L455J1m061N439n33N151R39p730P14K128p900m131
13538B7987M615k3O40N268m089k953l284m919j309L740P757J381L665k003p523
$$ y = [80365, 74843, 58165, 44669, 44359, 46640, 39414, 36055, 30672, 36769, 38906, 40142, 42152, 37520, 38520, 35508, 31227, 37610, 41267, 43292, 45393, 41883, 42293, 41079, 41786, 33562, 31840, 38836, 46083, 50634, 52848, 58757, 64665, 61061, 58419, 57057, 55622, 46848, 44143, 47893, 44157, 36830, 31536, 35882, 37608, 32039, 32123, 36085, 28496, 26450, 21593, 24762, 34479, 38614, 39811, 44536, 48843, 46884, 45668, 40628, 40280, 36062, 29647, 26723, 28606, 18882, 19567, 26492, 32068, 30091, 30798, 30112, 26082, 32021, 28578, 28414, 33766, 36067, 33685, 36961, 38013, 41416, 39975, 42434, 42086, 36614, 34736, 35382, 34827, 30843, 32580, 33716, 34505, 37960, 37971, 33910, 39349, 38816, 43967, 44906, 37176, 37890, 40018, 32118, 27987, 32602, 32579, 33219, 38487, 34398, 31445, 28161, 23242, 21933, 25673, 33430, 34811, 38476, 36473, 28950]
13523B8950j230P578N309R25j065k279j164O102M477j68J599o64n663N77K325
13508D5609m306l920K717j494l20J840N646M976L053O39l809m22N38p408k404
13493D0935k336L226k248j822M158M14k589L978L165N9J5J28M643L444k30j936
13477E3004l268J556l009N51L17M981Q99j756k761L281N516J653J407k230n311
13462E4830j1029K328J844L292k444j482K892L357j2200q540P018J0578j877K703
13448E1270R809Q404m401o578J95L782N399M982n5n044n789l230j997Q49K253
13433E9849M845J093l486n565p97K246L324J849n160K911l251l956m610m552J089
13418D5829J158O309K954p103j497n000r4N004k804K025K961J778N509L395k50
$$ y = [28950, 27720, 35298, 40607, 41532, 40467, 38188, 37024, 43126, 47603, 47435, 49034, 48370, 42707, 43284, 45609, 41303, 37383, 40100, 38606, 38286, 40126, 45772, 50748, 53801, 54440, 50631, 50209, 50747, 43339, 40935, 38599, 41825, 39577, 37755, 41913, 42327, 39738, 43716, 46881, 46940, 46955, 47083, 51726, 55170, 54940, 53004, 49736, 51292, 48283, 48834, 49151, 54132, 55031, 53275, 50514, 53795, 59311, 60964, 62371, 60141, 54830, 43801, 46129, 47973, 51265, 48821, 47339, 50231, 53588, 41388, 32848, 39866, 50444, 48567, 51270, 61079, 69483, 65082, 58504, 58699, 62481, 67880, 72862, 72807, 67763, 61974, 58744, 56747, 57596, 59849, 64694, 65787, 62301, 56736, 55939, 58185, 61509, 63358, 58198, 61109, 57858, 53902, 49292, 44740, 45829, 46987, 53296, 56250, 49147, 47650, 42650, 42556, 47560, 44756, 46781, 49742, 51520, 57029, 60424, 60174]
13403F0174M169M618q0K560N020k979J986k398L910M421n184r99k456l122n79
13388F9061m315o734J153P054r14M964j588J446P744J199n069r063J959R128P966
13373H3991J345J6n290m617O753K040n014k655q95O407O367l671k325k817j207
13358G8428n390p352K21J0999L785M920Q040k410o622N115J1480J0504J1007n18
13344A22207o262j027r5k36l595k819M882q25J263K816L696L992R771N712P748
13329A47228K934p204Q85m053o693J838j311j2813j2099m584J2684k01r810M051
13315A10852M080O022L413O82K487K783Q722Q910M722O166L987L368J6108J9898
13301B02200J9839J5961J3395K2969K9991K4359K2043K6786K5165K4451K7758
$$ y = [60174, 64343, 68961, 68881, 71441, 76461, 73482, 75468, 73070, 76980, 81401, 76217, 75218, 72762, 69640, 69061, 64746, 58012, 59165, 66219, 65305, 70269, 68681, 70127, 77871, 79070, 74001, 64938, 66897, 76025, 83991, 85336, 85352, 80062, 75445, 82198, 84238, 79224, 76569, 75674, 82081, 88448, 84777, 82452, 79635, 78428, 73038, 65686, 65907, 76906, 80691, 85611, 93651, 91241, 84619, 89734, 101214, 111718, 122725, 122207, 115945, 114918, 114823, 114587, 110992, 108173, 113055, 112230, 113493, 116309, 120005, 123997, 133768, 139480, 147228, 150162, 142958, 143843, 139790, 133097, 134935, 133624, 120811, 108712, 104128, 116812, 116611, 106801, 110852, 114932, 120954, 124367, 125049, 127536, 130319, 139041, 147951, 152673, 158839, 162826, 166194, 182302, 202200, 222039, 238000, 251395, 274364, 304355, 328714, 350757, 377543, 402708, 427159, 454917]
13290D54917M0992O0988O7446Q8108J23885J49884J82422K31612K71198K75392
13280A946844K83237K75489J94869P8877J0186r0230k27259k82935l19885l60207
13270A508986l25384k63157k20960j80259j24356p1406m1195l8357l1253k3826
13260A88833j2916j0008j0651j2078m921k151j6M970J684Q30o419k308K750k020
13246A35579K062N041K857j20J949P907J1329J8661K0057O200K631M160q647j3881
13232A95785j8870j5103j3989m254j2571j2297M015J269o259j285k590p01J470
13219A14620j790m308k894O598R659j698j2905j824P8n282k210O326j08K385m165
13204A02482o667J451K371K096M019L915L231O445J2467J3180Q538R571J0574
$$ y = [454917, 495909, 556897, 624343, 712451, 836336, 986220, 1168642, 1400254, 1671452, 1946844, 2230081, 2505570, 2700439, 2779316, 2789502, 2699272, 2472013, 2189078, 1869193, 1508986, 1183602, 920445, 699485, 519226, 394870, 323464, 282269, 243912, 212659, 188833, 175917, 165909, 155258, 143180, 138259, 136108, 136092, 141062, 142746, 143576, 137157, 134849, 137599, 135579, 137641, 142682, 145539, 145419, 147368, 155275, 166604, 185265, 205322, 211522, 214153, 218313, 209666, 195785, 176915, 161812, 147823, 143569, 130998, 118701, 122716, 123985, 117726, 116441, 113851, 113150, 114620, 112830, 108522, 105628, 112226, 121885, 120187, 107282, 105458, 105536, 100254, 98044, 104370, 104262, 106647, 102482, 95815, 97266, 99637, 101733, 105752, 109667, 112898, 119343, 131810, 144990, 153528, 163099, 173673]
13191A73673L593K781J595R85N603M227N061j521j489o572k560k509M056J684
13177A88607p566r790m656k968L845P903o84q790l421K486m737j0803K057Q87
13163A52370j916K719K216l280K026R8q154k43K653j281M862O123J658j194q434
13148A50223j4243l919O511l85n037j3341j6508j0608k919O345R099M933K369
13135A12520Q614J4292P404M749O616R544j795J10P069j210q05j768q500m437
13121A52403k015N620M575N000N47J198P341O061M06k449m774j818j768k758P063
13106A74632R986M320R172Q558J497J0047M955N006N585R256J8651K3927K4644
13093C10236L4308K8534J2255R839J2641J1740L681j326m743k766J9o850k23j950
$$ y = [173673, 177266, 180047, 181642, 182627, 188230, 192457, 197518, 195997, 194508, 187936, 185376, 182867, 186923, 188607, 181041, 171251, 166595, 163627, 167472, 175375, 174691, 165901, 162480, 164966, 160229, 149426, 151483, 152370, 150454, 153173, 155389, 152109, 154135, 154233, 146079, 145836, 148489, 147208, 152070, 158193, 159851, 158657, 150223, 135980, 132061, 138572, 138187, 133150, 119809, 103301, 92693, 89774, 96119, 105218, 110151, 112520, 121134, 135426, 142830, 147579, 154195, 163739, 161944, 162054, 169123, 167913, 167108, 165340, 156840, 152403, 150388, 156008, 160583, 165583, 166130, 167328, 174669, 180730, 181136, 178687, 173913, 172095, 170327, 167569, 174632, 184618, 188938, 198110, 206668, 208165, 218212, 223167, 228173, 233758, 243014, 261665, 285592, 310236, 344544, 373078, 385333, 395172, 407813, 419553, 423234, 421908, 417165, 414399, 414418, 407568, 407345, 405395]
13079D05395q958j6820j1745l986n374j1315k0275j3046m010m798o363m474o920
13066B87311q643k284j0146p426J316J147l202q516l655L655J0394R618Q31J212
13052B71612k128J206l670J835p184N006M859n777M106K513j1424o345k902o026
13038B45681o345j3919j0564o159J697P00n071L480J614Q889R565J1146J4600
13025B55314J0566R057o27P021N547j357L939J3303O711J4491J3512J0305Q064
13012C55846J2482J4110J1148O745M370J4761J7530J3144N605L076p308j4418
13000D37091j3144o727L897J3795L1248K7182K1503K1690K1099K7040K7566K7015
12988F39255J3372J1357N986N048p404o857j593p388j6520j7539j7118j3822j2992
$$ y = [405395, 396437, 379617, 367872, 363886, 358512, 347197, 326922, 313876, 309866, 305068, 298705, 294231, 287311, 278668, 276384, 266238, 258812, 260128, 261275, 258073, 249557, 245902, 249557, 259951, 269569, 270400, 271612, 269484, 270690, 267020, 268855, 261671, 266677, 271536, 265759, 269865, 272378, 260954, 254609, 251707, 245681, 239336, 225417, 214853, 208694, 210391, 211091, 206020, 209500, 211114, 220003, 229568, 240714, 255314, 265880, 274937, 274310, 281331, 286878, 285521, 289460, 302763, 309474, 323965, 337477, 347782, 355846, 368328, 382438, 393586, 400331, 404701, 419462, 436992, 450136, 455741, 458817, 451509, 437091, 423947, 417220, 421117, 434912, 466160, 493342, 514845, 536535, 557634, 584674, 612240, 639255, 652627, 663984, 669970, 675018, 667614, 660757, 659164, 651776, 635256, 617717, 600599, 586777, 573785]
12975E73785j6369j8379r599j2403k4314k6143q532k292N250J1394J4710L1135
12963E18243M9081M2801L6531M9448M9787K3931J9677J3475l88n634p44j1072
12951G85136j1037j3765q533j5090j1938o294q956q617o957j578k437j145J146
12938F89935Q516O076P776K1232K7843K5544K4340L4455M3950L5854L4281K9361
12926I89163L1732K6213K8643L2757K8087K8764L3199L0984K8338K3215K4279
12915A305374K4286K9068K6815K9376M3278N9901P4062Q9439J05782J18678J05063
12904B011122Q8411J07283J38274J50962Q1022j628J6438O8650J08982N1605l5883
12893B785238k2017K3785P0817P0811N5632P4053J04070J37323J67896J87265
$$ y = [573785, 557416, 539037, 529438, 517035, 492721, 466578, 458046, 455754, 461004, 472398, 487108, 518243, 567324, 610125, 646656, 696104, 745891, 769822, 789499, 802974, 802586, 796952, 796208, 785136, 774099, 760334, 751801, 736711, 724773, 718479, 709523, 700906, 693949, 692371, 689934, 688789, 689935, 698451, 704527, 712303, 733535, 761378, 786922, 811262, 845717, 889667, 925521, 959802, 989163, 1020895, 1047108, 1075751, 1108508, 1136595, 1165359, 1198558, 1229542, 1257880, 1281095, 1305374, 1329660, 1358728, 1385543, 1414919, 1458197, 1518098, 1592160, 1681599, 1787381, 1906059, 2011122, 2099533, 2206816, 2345090, 2496052, 2577074, 2575446, 2591884, 2660534, 2769516, 2821121, 2785238, 2763221, 2787006, 2857823, 2928634, 2984266, 3058319, 3162389, 3299712, 3467608, 3654873]
12883C654873K02113K18913K45983K67323K98354L27144L50800L83296M17706
12874F366505M49807M88199N19810N62773O14684O81863P51413Q40213R34655
12865A2209922J039269J157026J293448J429737J585767J752886J935666K151582
12857B4555303K399899K686899L025993L432425L924811M519545N262254O198620
12849E6005749P390964Q935733J0958161J3746461J7569533K2374781K8320752
12842A65302134L5777559M4464270N1016115N1242046N0426624M9803184L7219527
12835D85251459J5645461L706731j3941560l5750320m7111682n3332590o5095402
12828B89372097o2709991n1464583m3895374l6639069k5943293j6868916j1145378
$$ y = [3654873, 3856986, 4075899, 4321882, 4589205, 4887559, 5214703, 5565503, 5948799, 6366505, 6816312, 7304511, 7824321, 8387094, 9001778, 9683641, 10435054, 11275267, 12209922, 13249191, 14406217, 15699665, 17129402, 18715169, 20468055, 22403721, 24555303, 26955202, 29642101, 32668094, 36100519, 40025330, 44544875, 49807129, 56005749, 63396713, 72332446, 83290607, 97037068, 114606601, 136981382, 165302134, 201079693, 245543963, 296560078, 347802124, 398228748, 448031932, 485251459, 500896920, 504603651, 490662091, 454911771, 407800089, 354467499, 289372097, 226662106, 175197523, 131302149, 94663080, 68719787, 51850871, 40705493]
12821D0705493p777542n703830m326638l358703k659230k155097j752132j442115
12813A1530206j223736j052311r07858p88083o90794o15979n61382m97298m37516
12804D755249m01104l66111l18524k72232k35289k12555j85276j64424j38901
12795B460833j24246j10368r2509p9982o5682o0061n0576m3319n0319m8286n2486
12784A682999n1221m6824o1319o8454o7629o1226n6494n5683n0772m4468m5866
12773A073043m4093n3592l5462k1796k8135k3521k2442k2950l1087k2542j8894
12762G48529k1144k1640j9586j5529k0532l0110l5889k5724k8552k3219k7945
12751D78659k7915j6483j4914j6874j3007q521j957n610K215Q825l810l768j839
$$ y = [40705493, 32927951, 27224121, 22897483, 19538780, 16879550, 14724453, 12972321, 11530206, 10306470, 9254159, 8346301, 7558218, 6867424, 6251445, 5690063, 5192765, 4755249, 4354145, 3988034, 3669510, 3397278, 3161989, 2949434, 2764158, 2599734, 2460833, 2336587, 2226219, 2133710, 2053728, 1988046, 1927985, 1877409, 1834090, 1783771, 1735485, 1682999, 1631778, 1584954, 1523635, 1455181, 1387552, 1326326, 1269832, 1214149, 1163377, 1118909, 1073043, 1028950, 975358, 939896, 918100, 889965, 866444, 844002, 821052, 789965, 767423, 748529, 727385, 705745, 686159, 670630, 650098, 619988, 584099, 558375, 529823, 506604, 478659, 450744, 434261, 419347, 402473, 389466, 380945, 378988, 373378, 375593, 384418, 380608, 376840, 375001]
12738C75001K595M523L888L852M792N468K983l329n215o627r991j5230k7816l0584
12724C04310l1543k9474l3292k6815k8168k1019j6688j0547j5867j6286j6906
12713E7705n832m032K383J2425J6747J2655J6848K1731K7185K0831J6250J2805
12701B07701N415j5020j4192j4582k6259l1499k3171k5880k3020l2410k4677l1142
12689d8736j5879j6486k1194j5455j0866o610j0725J874M312J0200J7587K1472
12677i0506K6893K8192K0196K9704K4011O910P722O462l225k061r222p878k240
12664C4958j2685n077m672K587M740J596L276J1286J1824O684L788P295R895J5666
12650I1161J4252Q285K322l665J546J020L308J394K860M424J0285J1880J3727
$$ y = [375001, 377596, 382119, 386007, 389859, 394651, 400119, 403102, 399773, 394558, 387931, 377940, 362710, 334894, 304310, 272767, 243293, 210001, 183186, 155018, 133999, 117311, 106764, 90897, 74611, 57705, 51873, 47841, 50224, 62649, 79396, 92051, 108899, 130630, 157815, 178646, 194896, 207701, 213116, 198096, 183904, 169322, 143063, 111564, 88393, 62513, 39493, 7083, -17594, -48736, -64615, -81101, -102295, -117750, -128616, -135226, -145951, -144077, -139765, -129565, -111978, -90506, -63613, -35421, -15225, 14479, 38490, 45400, 53122, 59584, 56359, 54298, 45076, 37198, 34958, 22273, 17196, 12524, 15111, 19851, 21447, 24723, 36009, 47833, 54517, 58305, 65600, 75495, 91161, 105413, 113698, 116020, 112355, 113901, 114921, 118229, 119623, 122483, 126907, 137192, 149072, 162799]
12637A62799J3432J1687J4446J7701J7905Q908R472M558j9835l5355l1544j8501
12625A55673j5572q579l02J0878J6059R477K4867L4508M0573M4836M5277M9262
12613D06957M8017N6437M6753J0719j2866k0257l1945m9930o2480o2243m3069
12602B86093k8480k2326j7849j1478j1422j4268k6465k1788n750m381o200r40
12590A14746P575N802K190P247J1409J4423J7492K3501K0679J3545K3049K5731
12578B87389K5200K8474M0802M1482M2895M7618N1890P1682Q8747R5792P3827
12567H95798N6705P1588R2332J14547J59228K16748L09597M36303O46864R11450
12557C911160J181213J373457J565908J880089J213152j303263l146267k686234
$$ y = [162799, 176231, 187918, 202364, 220065, 237970, 246878, 256350, 260908, 241073, 205718, 174174, 155673, 140101, 131522, 131220, 142098, 158157, 167634, 192501, 227009, 267582, 312418, 357695, 406957, 454974, 511411, 558164, 568883, 556017, 535760, 503815, 453885, 391405, 329162, 286093, 257613, 235287, 217438, 205960, 194538, 180270, 153805, 132017, 126267, 121886, 115686, 114746, 122321, 128123, 130313, 137560, 148969, 163392, 180884, 204385, 225064, 238609, 261658, 287389, 312589, 341063, 381865, 423347, 466242, 513860, 565750, 637432, 726179, 821971, 895798, 952503, 1024091, 1116423, 1230970, 1390198, 1606946, 1916543, 2352846, 2999710, 3911160, 5092373, 6465830, 8031738, 9911827, 11124979, 9821716, 6675449, 3989215]
12549C989215j544964p98703m28739k42788j44081q0559l9924j1047m4662p9605
12539E74143n9127m0082k5229k5008m0491m0776k8180j1913j121J393L053M675
12527C11337J6470K936j8771k4601k0153p772p00R670Q320Q481J2621K1806j651
12514C17993j1523n303l33J2577J8282K0781K8119K3701L0921M0307M6124N2737
12502E74383N4525P6724Q4232M956j25381j41070r0708m2576k1581k7568l4110
12491C11826k5844j8983o177p776J123J5929J2758J1560j3283l5551k6086o971
12479B12525l758Q93m953P33R423J2829J5071q187j2304r221j498R042N813J4520
12465B40928K4457K0608R958L411p393O436J2580K3878Q467o6300o9399n2273
$$ y = [3989215, 2444251, 1645548, 1216809, 974021, 829940, 749381, 709457, 698410, 653748, 574143, 515016, 474934, 449705, 424697, 384206, 343430, 315250, 303337, 302216, 303609, 306662, 311337, 327807, 330743, 311972, 287371, 267218, 259446, 258746, 268416, 276736, 285217, 297838, 319644, 317993, 306470, 301167, 300834, 313411, 331693, 352474, 380593, 404294, 435215, 475522, 521646, 574383, 628908, 705632, 789864, 794820, 669439, 528369, 437661, 395085, 373504, 345936, 311826, 285982, 266999, 260822, 253046, 254169, 270098, 282856, 294416, 281133, 245582, 219496, 212525, 208767, 209660, 204707, 205440, 214863, 227692, 242763, 234576, 222272, 213051, 211553, 220595, 226408, 240928, 265385, 285993, 295951, 299362, 291969, 298405, 310985, 334863, 343330, 277030, 207631, 155358]
12453A55358k5770j3132m688j238m566l491o608m569j4703j6952p069J926J960
12440E6458J983N59J92N587m087k80M474O553J4470J3343L160k980m611q280r446
12425G7095j5664r766k921n31N364M662J0501O662Q590J1830J496L821M365P319
12411A12823M394O451Q736R018J1791J4724J4358J1662K4645K8283J8090K8506
12399B93481M0139N2020O5127Q0723J07191J41049J83315K31186K67446K78203
12389A739880K93663L01843K35952J08368L2100p6325k08775k77461l32937l84157
12379A432151l46530k75224k32211j81191j16801p2363n4646k5474j1967k762
12369A12982J834L793n501k0930k4140j8301q470r309j1815m985j324k665r803
$$ y = [155358, 129588, 116456, 111768, 110530, 105964, 102473, 95865, 91296, 76593, 59641, 52572, 54498, 56458, 58441, 59000, 59192, 64779, 60692, 60412, 64886, 71439, 85909, 99252, 102412, 99432, 94821, 86541, 77095, 61431, 51665, 48744, 48213, 53577, 58239, 68740, 75402, 83992, 95822, 97318, 101139, 105504, 112823, 117217, 123668, 132404, 141422, 153213, 167937, 182295, 193957, 218602, 246885, 264975, 293481, 333620, 385640, 450767, 531490, 638681, 779730, 963045, 1194231, 1461677, 1739880, 2033543, 2335386, 2571338, 2679706, 2711806, 2635481, 2426706, 2149245, 1816308, 1432151, 1085621, 810397, 578186, 396995, 280194, 207831, 153185, 127711, 115744, 112982, 114816, 118609, 113108, 92178, 68038, 49737, 41267, 31958, 20143, 15158, 13834, 11169, 1366]
12356A366j1527J889J491L012j131n388m578K498M035O448j621o48L390M254M143
12341G633j0500o843k40P909P902P299k554o458n525Q25L049Q344N174K341J0067
12326B8423Q152Q906J9736P176l665p290q386j5397j2979j1771p135k465L51l288
12312C68l341q07q846n020J314k702m679J617J86r66N922L566n18j191o753p100
12296b8950N134N509Q34J011J287J207L954k37q70O265J1551O027N431J4419J4523
12281D7095J4681J5392J3382j6513l2472k7032j6167n984o053j804k449m760q47
12268b3531J425R49P037K978m45J744N43q406j528P078L788l335L326P250j118
12253b245j405p94n68P30L339M087N814k846r946K053J1297J2185J0094j522j1005
$$ y = [1366, -10161, -8272, -6781, -3769, -4900, -10288, -14866, -12368, -8333, -1885, -3506, -4154, -764, 3490, 7633, -2867, -9710, -9950, -2041, 5861, 13160, 10606, 4148, -1377, -552, 2497, 10841, 16015, 18356, 28423, 36575, 45481, 65217, 72393, 68728, 61438, 53052, 37655, 24676, 12905, 5770, 3305, 3656, 368, -2973, -3780, -12626, -17646, -16332, -19034, -23713, -22096, -21910, -22876, -16954, -13388, -13906, -15097, -21850, -28950, -23816, -18307, -17473, -16462, -15175, -13968, -10014, -10251, -11121, -4856, 6695, 12722, 18153, 32572, 47095, 61776, 77168, 90550, 74037, 41565, 14533, -1634, -7618, -13671, -15475, -17924, -22684, -23531, -22106, -21157, -14120, -11142, -11587, -9843, -9300, -17706, -19234, -12156, -8368, -11703, -8377, -1127, -2245, -3650, -4444, -5012, -4282, -943, 3144, 8958, 6112, -3834, -1781, 9516, 21701, 31795, 30273, 19268]
12238A9268r786m505l548o891m781l88M255k961l770R27p95J2227J1963K552o239
12223G528l533p394k525O602K282o042j0860K4J59J297K631K69P07J100r43j529
12207a0227J53K415n777J509M059O572l123L568l661K778Q124R958J0202L176
12193B9726L974O664P192M986P708J7911P388k126K764J0914R482N746p734k161
12179A02434n695k2009k6855j0097j4593m105k425K081p312n770n770o715n970
12166a2801K803O354Q467L156Q29o020q398o351m081K910P621P232J156M039Q33
12151G749k798k662j12K316O174L050j757j5530l01J2808J1524N523L982L665
12137C3631P818J6012J6013p318k0205k3170j7167j0774o565L141N573K192N103
$$ y = [19268, 9482, 4977, 1429, -5462, -10243, -10631, -6376, -9337, -13107, -12180, -12975, -748, 11215, 13767, 7528, 3995, -3399, -5924, 678, 2960, -3082, -13942, -13918, -13759, -12462, -9831, -9562, -8855, -7755, -8698, -10227, -10074, -7659, -13436, -11927, -7868, -1296, -4419, -851, -4512, -1734, 6390, 16348, 26550, 29726, 33700, 40364, 47556, 52542, 60250, 78161, 85549, 83423, 86187, 97101, 106583, 112329, 104595, 102434, 96739, 74730, 47875, 37778, 23185, 19080, 16655, 18736, 11424, 5654, -116, -6831, -12801, -9998, -3644, 4823, 7979, 8808, 2788, -5610, -11961, -16042, -13132, -5511, 1721, 2877, 6916, 7749, 4951, 2289, 2177, 4493, 10667, 13717, 11960, -3570, -3871, 8937, 20461, 25984, 29966, 33631, 41449, 57461, 73474, 66156, 45951, 22781, 5614, -5160, -11725, -8584, -3011, -819, 4284]
12124D284P381L049k22R37k27j312p272j1642m002n112O740Q655J338k33J60q70
12108A652O329R741M353k606k637L168j05J54J3700J2515R861J3749J2291J2295
12094I4460J744o983j580M79j0910p498o068m321m17L946J782N113J761m656j940
12079F4912j263J5693N913p540m637q176j2972j3615p332N031o656o096l672k1
12065A9569q101r889q643Q14m07P79k209j378L766J672O874l447j0176Q097J6972
12050A4293Q329k44r94J932m313j035j612J1558J0881k960l88o381m236O456R93
12035C2279n350K943k434k998J329J729n908q527l5j919p711p779J415L099Q85
12020A018n260J058Q781R286j225k877m283K603L647J0549J0250n06q657k096
$$ y = [4284, 11665, 14714, 14492, 15429, 15202, 13890, 6618, -5024, -9026, -14138, -7398, 1257, 2595, 2362, 2522, 1652, 7981, 17722, 22075, 19469, 16832, 20000, 19895, 20049, 33749, 46264, 56125, 69874, 82165, 94460, 96204, 89221, 87641, 88120, 77210, 69712, 63644, 59323, 58906, 62852, 64634, 69747, 71508, 66852, 64912, 63649, 79342, 85255, 77715, 73078, 64902, 51930, 38315, 30983, 36014, 29358, 23262, 19590, 19569, 11468, 1579, -7064, -6250, -6657, -5878, -8087, -9465, -5699, -4027, 2847, -600, -10776, -2679, 14293, 22622, 22378, 21384, 23316, 19003, 17968, 16356, 27914, 38795, 35835, 35447, 29066, 24830, 31286, 32279, 26929, 29872, 27438, 24440, 25769, 27498, 21590, 13063, 13028, 11109, 3398, -4381, -2966, 133, 1018, -4242, -3184, 5597, 14883, 13658, 10781, 6498, 9101, 12748, 23297, 33547, 33041, 24384, 22288]
12006B2288p48J325m404k561Q263O79O26M816L335O56j297p313q382J848K969
11991B2100o194p101o789N22J911j543N266J235J553M88p00j226R200k927M2J41
11975A5978j7O285J0187P770J0471N464N681J5753L6839M0796K9651L7061M9464
11962B71383N2277k5943j04308p3096l0846k2936j2341l792L391M529R03j228
11950E7993o375n519Qm286j6106p512l636L70j81R20P07k027k394Q60L174k953
11934A3043r614l819n395m738L571O635L033r363r391M681R07j523j092K546J668
11919h851p017M371K448L623k484l381P214M106l938q027l485j135l029K380o75
11904a7880J305J066j828O775J559K3M733K261K353o950j748P36k07k255O101
$$ y = [22288, 21540, 22865, 18461, 15900, 24163, 24842, 25468, 30284, 33619, 34275, 32978, 25665, 17283, 19131, 22100, 15906, 8805, 2016, 2538, 4449, 2906, 8172, 9407, 10960, 11448, 10748, 9522, 18722, 15795, 15837, 15978, 15961, 22246, 32433, 40203, 50674, 56138, 61819, 77572, 114411, 155207, 184858, 221919, 271383, 323660, 297717, 193409, 120313, 89467, 66531, 54190, 50398, 53789, 58318, 59221, 57993, 51618, 46099, 46107, 41821, 25715, 18203, 14567, 14937, 14756, 15676, 16383, 14356, 11962, 12822, 15996, 13043, 3429, -390, -5785, -10523, -6952, -317, 2716, -6647, -16038, -11357, -10450, -11973, -13065, -10519, -8851, -15868, -11497, -9049, -5426, -7910, -11291, -4077, 29, -3909, -11936, -15421, -16556, -19585, -17205, -17880, -16575, -15509, -17337, -10562, -9003, -8980, -4247, -1986, 367, -6583, -8331, -7595, -7802, -10057, -3956]
11889c956M491k447K806J22k152R529O240M106m864L537M131j848m406N965L324
11874B4578p019n488L768L761P454J1514Q518P575O111J6052N320J1257J1015
11861A04416R939J5781K2908L6338L7180N4307P6366L2742n8465p0930m5182j3426
11849B01974J9616M0217P838l7114j7029J0786m35j1051N497K8616M7609N3665
11837C50189J1215m3208l6908m7773n0165k0532R195K2282j3805n1242m2454j2058
11825G4736j4998j9003j3228j0994j370j0193m497n679p789R69P641l84o333Q61
11811a0261M361J317J67R519p328l860P77Q012o53j414j40o588k500j409o769
11796a6769r36L230m12m376J726J448j305j743p86K045K4L759k23k986k569P94
$$ y = [-3956, 535, -1912, 894, 1016, -1136, 8393, 14633, 18739, 13875, 17412, 21543, 19695, 15289, 21254, 24578, 17559, 12071, 15839, 19600, 27054, 38568, 47086, 54661, 60772, 76824, 82144, 93401, 104416, 114355, 130136, 153044, 189382, 226562, 280869, 357235, 389977, 331512, 260582, 215400, 201974, 221590, 261807, 269645, 232531, 215502, 226288, 225853, 214802, 220299, 248915, 296524, 350189, 361404, 318196, 281288, 233515, 183350, 162818, 172013, 194295, 180490, 129248, 86794, 74736, 59738, 40735, 27507, 16513, 15143, 4950, 453, -5226, -13015, -12046, -4405, -4789, -11122, -10261, -5900, -4583, -4416, 5103, -2225, -6085, -5308, 2704, 2051, 637, 497, -6091, -8591, -10000, -16769, -17705, -14475, -14887, -19263, -17537, -16089, -17394, -19137, -19923, -17878, -17854, -14095, -14318, -17304, -19873, -19079]
11780a9079P1M17J849j977J145L122L289l433j311R21L139K962m924N31O124M084
11764c070j325k661l72O985J719ON128M293O515K485Q200M859J291p114j3484
11749A3455j5255p136k280o637q13K40R77L924K094j223k401l406O99K381O965
11734h416J302n325j754m973j914J829k425M72n101K712K613M931J1323K985K29
11719a512J1231Q427j998p36L284j924o190r24j75j2543j1536N70R66j964J471
11704a3553m63j074K998o030j262N785L179O299l98J743K863r128l207N583j624
11689h289n981l491k38j869K388l505j27K49m765j636N708J739J736P622J355
11674i104j551P875M244m284m720J466n950L101J0895J0985K773K602o905p342
$$ y = [-19079, -19008, -18591, -16742, -18719, -17574, -14452, -11163, -14596, -15907, -14986, -11847, -8885, -13809, -13278, -7154, -3070, -4395, -7056, -7428, -443, 1276, 1282, 6410, 10703, 17218, 19703, 27903, 32762, 34053, 26939, 13455, -1800, -8936, -11216, -17853, -18666, -18426, -17449, -13525, -11431, -12654, -15055, -18461, -17762, -15381, -8416, -7114, -12439, -14193, -19166, -21080, -19251, -21676, -21204, -26305, -23593, -20980, -16049, -4726, -1741, -1512, 9719, 18146, 16148, 15412, 18696, 16772, 10582, 9658, 9483, -3060, -14596, -14026, -13060, -15024, -13553, -14016, -15090, -12092, -18122, -19384, -13599, -10420, -4121, -4519, -2776, 87, -9041, -12248, -6665, -8289, -14270, -17761, -17999, -19868, -17480, -20985, -21112, -20863, -25628, -27264, -21556, -19817, -18081, -10459, -9104, -10655, -2780, 1464, -2820, -7540, -6074, -12024, -8923, 1972, 12957, 15730, 18332, 11427, 4085]
11660D085r482j941k680k890j357j404M990K851k051J233K7l305M716K654p008
11645a1562k051l05n648N526l644K461n311R85O896j400m671J548o97J709k770
11630a8934j070j146P858J1917J3128j371m876m319j553L685K594N241j079j4022
11616c947j3282K830j083m039M45J274O564L901N075L842O906m954J594K82M127
11601I535p71p321j0899o111l529N596P630K731m022k414o066J20K991N335m165
11586a1360J639K642j0119k401K479J1490J0991K00p784r863n120L115M365N961
11572c765K212j722o509M51n088n439o08N560N23m6k999l496l795n215l463m068
11556c7467L862Q693L258K504j723L468j896k791O07j538N615K685j990p640m67
$$ y = [4085, -5397, -7338, -10018, -12908, -14265, -15669, -10679, -7828, -9879, -8646, -8619, -11924, -7208, -4554, -11562, -13613, -13918, -19566, -14040, -17684, -15223, -20534, -19549, -12653, -14053, -18724, -17176, -17873, -16164, -18934, -20004, -21150, -13292, -1375, 11753, 10382, 5506, 1187, -366, 3319, 5913, 11154, 10075, -3947, -17229, -14399, -15482, -19521, -19076, -17802, -11238, -7337, -2262, 1580, 8486, 3532, 5126, 5408, 9535, 8764, 1443, -9456, -15567, -19096, -13500, -5870, -3139, -7161, -9575, -15641, -15521, -12530, -7195, -11360, -9721, -7079, -17198, -19599, -17120, -5630, 5361, 5561, -2223, -12086, -17206, -14091, -9726, -3765, -1553, -3275, -9784, -9333, -14421, -19860, -20468, -14908, -14385, -14431, -17430, -20926, -24721, -29936, -33399, -37467, -33605, -24912, -21654, -19150, -20873, -17405, -19301, -22092, -21485, -23023, -17408, -14723, -16713, -24353, -24820]
11541b4820K752P368M729m812k641k176l874K590K943M407O301k153m352p79K427
11526a2090k507J917q012p73K905K229M126l843N453j182j1477j434P347M435
11512a2906L05K898J230n504P58k856m026j0086k315K739j338R861O493K3J264
11497a3460k086n548J706m430j367k520n093p42O532P781N121o391j046O844P990
11482f709O1j1639r083J1656M362k213J393J284J900K695o133q390n734m327m996
11467c5873L040Q868K992j245j776M353J719L142n063k21P408l76l554K448k319
11452a6457R4N274J868m330k089M92J529M102M87K928j31n067n396N96K190M01
11436a3509O221n067l734M749j246R382L243j801l415P83J5827K0591P766P879
$$ y = [-24820, -22068, -14700, -9971, -14783, -17424, -19600, -23474, -20884, -17941, -13534, -7233, -9386, -13738, -14517, -12090, -14597, -12680, -20692, -21465, -18560, -16331, -12205, -16048, -10595, -11777, -23254, -24688, -17341, -12906, -12601, -9703, -8473, -13977, -13219, -16075, -20101, -30187, -32502, -29763, -31101, -21240, -14747, -14724, -13460, -15546, -21094, -19388, -23818, -25185, -27705, -32798, -33540, -27008, -19227, -14106, -20497, -21543, -14699, -6709, -6648, -18287, -27370, -15714, -11352, -13565, -12172, -10888, -8988, -6293, -12426, -20816, -26550, -30877, -35873, -32833, -23965, -20973, -22218, -23994, -19641, -17922, -14780, -19843, -20064, -12656, -13032, -16586, -14138, -16457, -16363, -11089, -9221, -13551, -15640, -15148, -13619, -9517, -9030, -6102, -6233, -11300, -16696, -16100, -13910, -13509, -7288, -12355, -16089, -11340, -12586, -3204, 39, -1762, -5177, -4394, 11433, 32024, 39790, 47669]
11422D7669J1576o851j4629j4647q150l399n839L118k474n794l50l957k62L230
11408g59n463m442N724j545l692M494J419p246p831k910q94M439L088m858J883
11393a8593O501k07K738k355j978J372m202P45K626m927N328O091K079j991q604
11378a5377l111O151n67J956L87J587k502J594L079j074l052K09O043r76q269
11363a3922M975R656j1187l357k944m080O342Q60P382j175n251p070k459L412
11349a8818M781J970k164j450o969M81J374N262K937k120k39j872M518m735J855
11334a5189K848L149R98n871m03k029M527j053n92M206K87L050K579p113l594
11319a4200l254M52m155J75q73J177M058j237l212p117J711J0895J597K172m028
$$ y = [47669, 59245, 52394, 37765, 23118, 14968, 11569, 5730, 8848, 6374, 580, 230, -3727, -3989, -759, -6222, -10664, -4940, -6485, -10177, -5683, -4264, -11510, -19341, -22251, -23145, -18706, -15618, -20476, -18593, -12092, -12299, -9561, -11916, -13894, -12522, -16724, -15979, -13353, -18280, -12952, -6861, -4782, -6773, -15377, -18488, -12337, -12904, -10948, -10561, -8974, -11476, -9882, -6803, -7877, -10929, -10720, -4677, -5653, -13922, -8947, 709, -10478, -13835, -16779, -20859, -14517, -13657, -6275, -7450, -12701, -19771, -22230, -18818, -14037, -12067, -14231, -15681, -22650, -22169, -20795, -15533, -12596, -14716, -14955, -16827, -12309, -17044, -15189, -12341, -9192, -8194, -14065, -14468, -16497, -11970, -13023, -13615, -9409, -9122, -6072, -3493, -10606, -14200, -17454, -17002, -21157, -20982, -21855, -20678, -16620, -17857, -21069, -28186, -26475, -15580, -13983, -11811, -15839]
11304a5839k307k9L512L306L240R50K728l265j1984k537p975o392M882O564N75
11289b4571L700O768k088j467Q75j604r527N176P618M959J416L78K460n475j380
11274a2762l389K733K646n368o049K99M261P353j636j322J920N588R15j1969n73
11259a7353Q605K104m181J88J655k716q699k069J2441M692k930M652L762K127
11245B278K881L042n125q475o656j169k696M547N641N837M054k680n728l370M074
11230c545O059N935N982P72l201K552K424J982p958j4874N12m904k851M135J390
11215e590l788M372j799k102Q05k056j147L952rK640k17r08r31l592l104K123
11199a1351k276j800r60n81N34M716R620N652K39j803K462P437J589P233R296
$$ y = [-15839, -18146, -18175, -14663, -11357, -8117, -7167, -4439, -7704, -19688, -22225, -30200, -36592, -31710, -25146, -24571, -20871, -14103, -16191, -17658, -16783, -18387, -27914, -22738, -15120, -10161, -8745, -8367, -5907, -11382, -12762, -16151, -13418, -10772, -16140, -22189, -21890, -17629, -10276, -11912, -13234, -11314, -5726, -4811, -16780, -17353, -8748, -6644, -10825, -10637, -8982, -11698, -20397, -22466, -10025, -5333, -8263, -3611, 151, 2278, 5159, 8201, 3076, -5399, -12055, -13224, -15920, -11373, -5732, 105, 4159, 1479, -4249, -7619, -3545, 2514, 8449, 14431, 15203, 12002, 14554, 16978, 18960, 11002, -3872, -3360, -8264, -11115, -6980, -5590, -9378, -5006, -6805, -8907, -8102, -10158, -11305, -7353, -7362, -4722, -4939, -5847, -6778, -10370, -13474, -11351, -13627, -15427, -16387, -16968, -16434, -11718, -2098, 3554, 3793, 1990, 4452, 11889, 13478, 20711, 30007]
11184C0007R304m855j566L930Q788L022l720j3031q406l514M20m162j0082r261
11170c126K130m18r380o092M364J572l621l122R855j252j576o95k049K12O814
11155f384J163l651M111m55q51M114K76l813n411j85P445L680p104k587l228L436
11139i444Q501K203L517J2391O113K042j168j933M232J1443P615n569j0055m001
11125B5887K673k270o58l838p061o797m448q639o170M49L0L963P75q471j015O496
11109i094J387q62k651m825r65P59j101l363J899M798j297n57k35M427L967M304
11093c409J559l202j319l354Q57k892q614L248m824J298M153j216k507K91n18
11078b0449k771J220M166J706l685j464j120j407O425N608j722K240L503M126
$$ y = [30007, 39311, 34456, 32890, 36820, 45608, 48630, 44910, 31879, 23473, 19959, 20379, 16217, 6135, -3126, -996, -1414, -10794, -16886, -12522, -10950, -14571, -17693, -7838, -9090, -10666, -11361, -13410, -13198, -6384, -5221, -8872, -4761, -5216, -6067, -1953, -1677, -5490, -10901, -11086, -3641, 39, -7065, -9652, -12880, -9444, -943, 1260, 4777, 17168, 23281, 25323, 24155, 22222, 26454, 37897, 45512, 39943, 29888, 25887, 28560, 26290, 25632, 21794, 14733, 7936, 3488, -5151, -11321, -10872, -10842, -6879, -6104, -14575, -15590, -9094, -7707, -8569, -11220, -16045, -17010, -16251, -17352, -20715, -18816, -14018, -15315, -15872, -16107, -11680, -7713, -3409, -1850, -5052, -6371, -9725, -8868, -11760, -20374, -17126, -21950, -20652, -16499, -17715, -20222, -19931, -20449, -23220, -22000, -17834, -16128, -19813, -21277, -22397, -23804, -17379, -11771, -13493, -11253, -7750, -3624]
11064c624l959j0915L25O519K972L925o178o060n122L142J0520M181l254K134
11050e394Q40K338n755n394M789l137k073L390M226l472m145N021O607n282k531
11035i972M650p7j932l87o37k813J797N922N35L866L239P16l34J677N096m424
11019F922k785l188o440m890M592L448k867j239P89o423K117N905l360k322P20
11004i021o144o386K467O343J342K909M201O199l159p093p271k02M107N189Q063
10989A544p221r618o922J368J123O328k463K456j773P85M533j625M771M153j679
10974d240m285j073m536L664K840J644o053k036k721N262k892p590L472R313M967
10959d264R5p282n278N155J38M99r118j738M586L806J733r1n033J333k938k267
$$ y = [-3624, -7583, -18498, -18173, -11654, -8682, -4757, -10935, -16995, -22117, -18975, -8455, -4274, -7528, -5394, -4554, -2216, -7971, -13365, -8576, -11713, -13786, -10396, -6170, -9642, -13787, -8766, -2159, -7441, -9972, -5322, -5399, -7331, -7718, -8355, -11168, -9371, -3449, -2914, 952, 4191, 4907, 4573, 6250, 11346, 6922, 4137, 949, -5491, -10381, -5789, -2341, -5208, -6447, -5658, -12081, -9964, -4059, -7419, -9741, -9021, -15165, -21551, -19084, -12741, -11399, -8490, -4289, 1910, -1249, -8342, -15613, -15815, -11708, -6519, 1544, -5677, -15295, -22217, -20849, -19726, -13398, -15861, -13405, -15178, -14393, -9860, -11485, -6714, -2561, -4240, -8525, -9598, -14134, -10470, -7630, -5986, -12039, -14075, -16796, -11534, -14426, -22016, -18544, -9231, -4264, -4169, -11451, -16729, -11574, -11436, -10937, -20055, -21793, -17207, -13401, -11668, -11759, -16792, -15459, -18397, -20664]
10943b0664l008p27j291j967K736o11L229O183j778m540K248j786J065j414L903
10928a8422K904m715o60K585L163q89l007J113J255m734N382P150M774j66k673
10913f940o524l271q82N045N420j209n589k402q39l583l131Q2L524p776P313Q611
10897a2151NK021L633L449k882n756M370j360m030l72l2l145K571N999j555n238
10881a4473l364l271o041L590p31o463Q784K205J837O143J050M32k678K415k138
10866a2703L171K963p42m524m650O795Q656J254O178M538O085K128N137J839m06
10851B5719J172N257O529R93M961m572p115r45N083k095M92k874k850k903j0290
10836A6562r273l578L323N596k09r283m663k402j1351q450K526Q5j238K831M697
$$ y = [-20664, -23672, -24399, -25690, -27657, -24921, -25532, -22303, -16120, -17898, -22438, -20190, -21976, -20911, -22325, -18422, -15518, -20233, -20893, -18308, -15145, -16034, -19041, -17928, -16673, -21407, -16025, -8875, -4101, -4267, -6940, -13464, -16735, -17617, -12572, -7152, -8361, -13950, -16352, -17191, -20774, -23905, -23823, -20299, -28075, -20762, -12151, -12146, -10125, -6492, -3043, -5925, -11681, -7311, -8671, -12701, -13073, -13105, -16250, -13679, -7680, -9235, -14473, -17837, -21108, -27149, -23559, -24290, -30753, -21969, -19764, -17927, -11784, -10734, -10302, -12980, -10565, -12703, -9532, -6569, -7311, -11835, -16485, -9690, -1034, 220, 6398, 10936, 17021, 19149, 24286, 26125, 25719, 26891, 32148, 38677, 39670, 44631, 40059, 32944, 31999, 37082, 34987, 35479, 32605, 29755, 26852, 16562, 7289, 3711, 7034, 12630, 12421, 3138, -1525, -3927, -15278, -23728, -21202, -21117, -22355, -19524, -14827]
10821a4827J724J887m30n43K710N58n206j146M588K492O846M52p68Q71L452k624
10805C6k258m447K103L389j785m494O64M166N047J531K180R045j876L56N945L965
10789B3567Q118O819O695Q750O917M875J2971R411J6175K8563J5322j0947j2928
10776A24308m711q429J583O556O684M754k3213l0550k2107o216o00L138O976p979
10762E0194j0321j2136r440o309q54L045o262M005J944J260L760J14k686k716
10748A3598o520l071j972L657P176j748M429j752p326m198K599K547K877R583
10734A9879R324P53k088J90R89L929M615N588Q052j2251j6135k699K734k066l344
10719A7470K399K975P680P559l891R00o588j0003m394O43r853k227J0558J1918
$$ y = [-14827, -13103, -11216, -11646, -12189, -9479, -8921, -14127, -15273, -10685, -8193, -1347, -895, -1663, -792, 2660, 36, -2222, -6669, -4566, -1177, -2962, -7456, -6792, -2626, 2421, 3952, 6132, 15177, 13301, 13657, 19602, 23567, 31685, 38504, 45199, 53949, 60866, 65741, 78712, 88123, 104298, 132861, 148183, 137236, 124308, 119597, 111168, 112751, 119307, 125991, 130745, 107532, 76982, 54875, 48659, 48059, 51197, 58173, 50194, 39873, 27737, 18297, 11988, 11134, 14179, 7917, 11922, 13866, 15126, 18886, 19000, 16314, 13598, 7078, 4007, 2035, 5692, 12868, 11120, 15549, 13797, 6471, 2273, 4872, 7419, 10296, 19879, 29203, 29956, 27868, 28058, 29047, 32976, 37591, 43179, 51231, 38980, 22845, 20146, 22880, 20814, 17470, 19869, 22844, 30524, 38083, 34192, 35092, 28504, 18501, 14107, 14750, 4897, 2670, 13228, 25146]
10705B5146Q124P61j4202o386l886p052R78O607N185n07N2M401P864J0308O10
10690C8003K968J4292J2593J0871j710j8745j9732j8058r862j887r983q19k308
10677d377k072J839J842N795l793l796N783K523K977k183l825p381r60K927p303
10662a2004P495n130j677K518J556L710O177P496J48N554K279l65L255L398M184
10647B8594Q394j781r899j1703r202n457k257n34J177k109K548J356O04q42L261
10632B150N91l48M899l575j381K519R146p126j1027o88O297M555J460m008k530
10617I34K211n379j521M158J414L776m67O087O308J0944M745l794r93l328m98
10602B4597J91l131j1846o557K39N322J23P31M070R100J357J528K842L115L172
$$ y = [25146, 33270, 34031, 19829, 13443, 9557, 2505, 3483, 10090, 15275, 14768, 14820, 19221, 27085, 37393, 38003, 40971, 55263, 67856, 78727, 77017, 58272, 38540, 20482, 10620, 8733, -1250, -2069, -4377, -6449, -4610, -2768, 3027, -766, -4562, 1221, 3744, 6721, 4538, 713, -6668, -7628, -4701, -12004, -4509, -9639, -11316, -8798, -7242, -3532, 2645, 10141, 10289, 15843, 18122, 17757, 21012, 24410, 28594, 36988, 35207, 25308, 13605, 4403, -1054, -3311, -3845, -2668, -4777, -2229, -873, -269, -1111, 2150, 2741, 2393, 7292, 3717, 2336, 4855, 14001, 6875, -4152, -4840, 1457, 6012, 7472, 3464, 934, 3145, -2234, -3755, 403, 1817, 5593, 5126, 11213, 17521, 28465, 33210, 29416, 28423, 25095, 24597, 24788, 21657, 9811, 3254, 3493, 8815, 8938, 9669, 13739, 22839, 24196, 25724, 28566, 31681, 34853]
10587C4853J428L758J779o723j799k006n327l890p570q418k344k167K224K494
10573F292k234O065M014l069j528n506P623j806o951j615m611o128J713M894L358
10558E11l26m278J237Q320J637k896o249M64n354m303K20J281N683J849r908m78
10542a2590M755N110L063k956n457M377L446n312r85k19M918N007m407l45M966
10527C371L770o041k091K263k692m131k759r295n8P059L451Q04j225j553j723
10512a0850p06O133O958n282j553l97l163N667M018R1j077p157l121m135P28L682
10496a0164J357o42L167M750M939j623j0360R18k000l81M57J137j016K799L075
10481c587L223j963n318J022O904Q01J651j416k896O874K54n941k20M386M788
$$ y = [34853, 36281, 40039, 41818, 35095, 33296, 31290, 25963, 22073, 14503, 6085, 3741, 1574, 3798, 6292, 4058, 10123, 14137, 11068, 9540, 4034, 11657, 9851, 2900, 1285, -3326, -9454, -7741, -2847, 511, 185, -4093, -2856, 5464, 7101, 4205, -2044, -1580, -6934, -11237, -11017, -9736, -4053, -2204, -12112, -12590, -7835, -2725, 338, -2618, -8075, -3698, -252, -5564, -6549, -6768, -1850, 3157, -1250, -1595, 3371, 7141, 1100, -991, 1272, -1420, -5551, -8310, -17605, -17663, -10604, -7153, -6349, -7574, -9127, -10850, -11556, -5423, 1535, -3747, -5300, -5697, -8860, -3193, 825, 916, -161, -7318, -10439, -14574, -13846, -10164, -8807, -9449, -6282, -1532, 3407, 1784, -8576, -7658, -9658, -10039, -9582, -8445, -9461, -6662, -3587, -364, -2327, -7645, -6623, 281, 1082, 2733, 1317, -1579, 5295, 5549, -392, -612, 3774, 8562]
10466H562K866o00k598o081L97r32Q37p31k184k088j210L21L797j25J3739Q051
10450B2021K847L038O733n452n56N005L511l689m806m113L630j449L806l82k997
10435B7147j676K90N25L80J896N521k124j0329k478k893j865K462k739M404k668
10420A5853m246r689k009J016K83k759L455j461N690N951K682j1055j472m88q75
10405H76j736m170k8O261J0915l585r104N806N666L763n50J730k651m773j051
10390G369J980m66m995m530J867L084Q44j818M19N252K707l532K33K104k578j741
10374F199O490k435o848N368Q242j420N10l994o387R41M889l666j809r4N559O602
10358A8147K865n177L908R122K599P82m523r041k671k985M0j319n827j000o409
$$ y = [8562, 11428, 10828, 8230, 2149, 2546, 1614, 2451, 1720, -464, -2552, -3762, -3441, 356, 231, 13970, 22021, 24868, 27906, 34639, 29187, 28631, 33636, 37147, 33458, 28652, 24539, 28169, 26720, 30526, 30144, 27147, 25471, 25761, 26286, 26666, 28562, 34083, 31959, 21630, 19152, 16259, 14394, 16856, 14117, 18521, 15853, 11607, 1918, -91, 925, 1208, -1551, 1904, 443, 6133, 12084, 14766, 3711, 2239, 1751, 876, -860, -5030, -5058, 1203, 12118, 8533, -571, 5235, 10901, 14664, 14114, 15844, 13193, 8420, 7369, 9349, 8883, 3888, -642, 1225, 4309, 5153, 3335, 3754, 9006, 11713, 8181, 8414, 10518, 7940, 6199, 12689, 10254, 3406, 8774, 17016, 15596, 16106, 12112, 5725, 6666, 11555, 7889, 6080, 5986, 11545, 18147, 21012, 15835, 19743, 28865, 31464, 32246, 27723, 18682, 16011, 13026, 13066, 11747, 5920, 4920, -1489]
10343a489j671K295P488N367J261k354k989j35N875J915j188M143k046j4297P326
10328I501J2356l892l245q096o126K794N176L713O991K691O53M677K843K612L424
10313C6072O355r58J4157n533j299Q034J2237O426J0649K3752K0543J4060J3222
10300A57717O667J0037L660J632p363j8333j7320j1216k5846j8547n560K916o641
10287G1803q818l867l688m154O482Q363m141J547N522M548P576O535P721M557
10273I9986K094J826J0116J0973J6793K2872J6672Q232L237P975P401o86k085
10260B05406L804R329J0707K0039J7606J3644J9051K1860L7973N2763Q2208J00314
10248E94704J21353J38896J38613J23185R0381P2169L0197j122p3073j20198j36091
$$ y = [-1489, -3160, -865, 6623, 11990, 13251, 10897, 7908, 7773, 13648, 15563, 14375, 18518, 16472, 2175, 9501, 21857, 17965, 14720, 6624, 498, 3292, 8468, 12181, 19172, 21863, 22516, 27193, 30036, 32648, 36072, 42427, 41469, 55626, 50093, 48794, 56828, 69065, 75491, 86140, 109892, 130435, 144495, 157717, 164384, 174421, 178081, 179713, 172350, 154017, 136697, 125481, 99635, 81088, 75528, 78444, 71803, 62985, 59118, 55430, 51276, 57758, 66121, 61980, 63527, 69049, 73597, 81173, 87708, 95429, 99986, 102080, 103906, 114022, 124995, 141788, 164660, 181332, 189564, 192801, 200776, 208177, 207491, 205406, 209210, 218539, 229246, 249285, 266891, 280535, 299586, 321446, 359419, 412182, 494390, 594704, 716057, 854953, 993566, 1116751, 1207132, 1279301, 1309498, 1308376, 1235303, 1115105, 979014]
10237I79014j41345j30450j31456j07342r3207o4282l7546j9253j1961o696O626
10226B42102R990R425J7780L2049K8275K8811L0609L4832L7503M9183O2503Q4383
10214F67445R1806J09589R4022M2910J5616K5413L8502J8266k4752m0271j9029
10203A019517K7885P0105J29051J97702K67338L57064M68409O12932P05791O87449
10193D543243O35078M85078M19187K51086N1109k75202o00672o92477p66740o89186
10183C360504p12611o66148n85328m30878k61416j39420q5172n4901k5800q855
10173C89975j1028k0630j5180k2567k5274l5932m1575k6497j9327j7590j8304
10162A36071j9225j4200r640q927l044n979p113M405k39m552j013p33m179j2273
$$ y = [979014, 837669, 707219, 575763, 468421, 375214, 310932, 273386, 254133, 242172, 235476, 242102, 252092, 261517, 279297, 311346, 339621, 368432, 399041, 433873, 471376, 520559, 583062, 667445, 759251, 868840, 962862, 1005772, 1021388, 1046801, 1085303, 1103569, 1078817, 1038546, 1019517, 1047402, 1117507, 1246558, 1444260, 1711598, 2068662, 2537071, 3150003, 3855794, 4543243, 5178321, 5663399, 6082586, 6333672, 6384781, 6109579, 5508907, 4816430, 4049690, 3360504, 2647893, 1981745, 1396417, 965539, 704123, 564703, 479531, 424630, 398830, 389975, 378947, 358317, 343137, 320570, 295296, 259364, 217789, 191292, 171965, 154375, 136071, 116846, 102646, 93006, 84079, 81035, 75056, 67943, 72348, 72109, 67557, 66544, 65811, 61632, 49359]
10148D9359p141q389m473j47O1K97K066l737k931j792J303K210j315M954k510
10133B7815j633K045k028K559O638m431m599q592r79M656K153R12m571N00m816
10118A5629k521o020K105L501P540Q206j27j308j570J168j871j468l909J712N882
10103B6949L164L515N616R864N842L438J4697J2396O070J4130R821L842m994j1498
10089A02852j1337m53r29j4373j7275j0041p099N2k080o360o718n125o279L735
10075A8570N325J338J485k877o082J708l91q277M018j148l684l619J865J2959
10061B1190J448k163l530r526L386N013J506q52n327k327k374n006k438K703N309
10046G012N939l297K893L023j30m730o392J482K787j388J248M501K924j505l676
$$ y = [49359, 42218, 33829, 29356, 29209, 29270, 29567, 31633, 27896, 24965, 23173, 24476, 26686, 25371, 30325, 27815, 26182, 28227, 26199, 28758, 35396, 30965, 26366, 17774, 16795, 21451, 23604, 24516, 19945, 20445, 15629, 13108, 7088, 9193, 12694, 20234, 28440, 28313, 27005, 25435, 26603, 24732, 23264, 19355, 21067, 26949, 30113, 33628, 39244, 49108, 54950, 58388, 73085, 85481, 91551, 105681, 115502, 119344, 114350, 102852, 91515, 91062, 90133, 75760, 58485, 48444, 41345, 41397, 39317, 32957, 26239, 21114, 14835, 18570, 23895, 25233, 26718, 23841, 17759, 19467, 19076, 10799, 14817, 13669, 9985, 6366, 8231, 21190, 22638, 20475, 16945, 7419, 10805, 15818, 17324, 16472, 11145, 8818, 6444, 1438, -1000, 1703, 7012, 12951, 9654, 12547, 15570, 15440, 10710, 4318, 5800, 8587, 7199, 8447, 12948, 15872, 14367, 10691]
10031A0691l343l229k941J184L775n306l55P49J0776P916k989m172J468J598P038
10016B2860N582M379M993K701o282n70n241l182q00n449J186N4O73r38K305l79
10000B1892P302K009j4062r239m898L516J981L50J788o208l400l019P33M958Q529
9985A2232J286M04j939n379J588J703N69p07l122j857j174j49R36N399m245J396
9969F941N855j755j784L571K528n180l16p726m528k550K951O374k741J113O61
9954C414M113L434K939j360m032j631M007l110m216M293J854L724j1633l389j182
9939b775n02L641M712k92O259l54l040M346j668j958j755J051l993L355p102k493
9923b568o8K879k003l140P729N653l164p608M00M948l574J82N261K469o96k014
$$ y = [10691, 7348, 4119, 1178, 2362, 6137, 831, 476, 1225, 12001, 19917, 16928, 12756, 14224, 15822, 22860, 28442, 32821, 37814, 40515, 34233, 33663, 28422, 25240, 24440, 18991, 20177, 20231, 20904, 19966, 22271, 21892, 29194, 31203, 17141, 7902, 3004, 6520, 8501, 8851, 10639, 4431, 1031, -1988, -1255, 3703, 12232, 13518, 13922, 11983, 6604, 8192, 9895, 10464, 9757, 6635, 4778, 3604, 3455, 4391, 9790, 5545, 6941, 12796, 11041, 9257, 12828, 15356, 10176, 9860, 2134, -2394, -4944, -1993, 4381, 1640, 2753, 3414, 7527, 10961, 13900, 12540, 8508, 6877, 10884, 7774, 3558, 7851, 9705, 13429, 1796, -1593, -2775, -3277, 364, 5076, 4784, 11043, 10689, 7649, 11995, 10327, 8369, 6614, 7665, 3672, 7027, -75, -2568, -2636, 243, -1760, -4900, 2829, 8482, 5318, -2290, -1890, 3058, -516, -334, 4927, 7396, 6700, 4686]
9907D686n181m69K535n53r04R04K224k76J520P504j849q564k46O693O908R027
9891B3959N754p0L458m980l484J38J052j201k087j483L175P71n251K339Q069j487
9875B8672o141j2903p139J930M557L585L369J005N200l631o346k41k156O28L644
9860A4033L327M49N352P361o745m819O23J667l53j402M442K893M454O651n381
9845C2552l605K988O522m765N0J727K42K079N362K156l515p83j0112r083k247
9830A9568j36o051L503L344n343m781J149L682j706m564M319N545n372J661O647
9815B1465L903m285o009l420O827O595M244K338K105l075M985M352o98j1562j412
9800B6353K734K716K79m075L338Q887Q582N104qQ588M193o226j347j269o152j2375
$$ y = [4686, -495, -964, 1571, 1018, 114, 1018, 3242, 2966, 4486, 11990, 10141, 1577, 1331, 8024, 14932, 23959, 29713, 29643, 33101, 28121, 24637, 24775, 25827, 24626, 22539, 21056, 24231, 25002, 19751, 22090, 30159, 28672, 22531, 9628, 2489, 4419, 8976, 12561, 15930, 16935, 22135, 18504, 12158, 11917, 9761, 10389, 14033, 17360, 17809, 23161, 30522, 23777, 18958, 19581, 21248, 20895, 19493, 23935, 26828, 31282, 37933, 32552, 28947, 31935, 38457, 33692, 33742, 35469, 35711, 37790, 43152, 45308, 41793, 41010, 30898, 21815, 19568, 19432, 13381, 16884, 20228, 14885, 10104, 11253, 14935, 13229, 8665, 12984, 18529, 13157, 14818, 21465, 25368, 21083, 15074, 11654, 18481, 25076, 29320, 31658, 33763, 30688, 35673, 40025, 39327, 27765, 26353, 29087, 31803, 32082, 28007, 31345, 40232, 48814, 53918, 53910, 62498, 66691, 60465, 59118, 57849, 51697, 39322]
9784C9322L598L293j529J584k955K31o954o284J32K727j762j484l825o630j583
9769A7881L398J740J08P568Q954j23n174j572k404p243n973J369N075K999p29
9754B5874N232O85m02k827j074J0399P246P694P190J608k244M077m146q65j649
9739E6798n95l45L06k580J217L259K852K894j413P878O930J367J57j2045j5291
9724E1389j3652o362r274j730P124l047k129M138J993K43j091j230R165J9898
9710E5435J5989K086m570j1202j5387n366j0800j5940l27p25K72Q957k390q601
9696G431n599J719K410J741L685M315M337O297O017k321j0151k581J207l255r105
9681F147q26O461O372j839K94J761J284P231K285k4k083N81o749M600N089P943
$$ y = [39322, 42920, 46213, 44684, 46268, 43313, 43544, 36590, 30306, 30438, 33165, 31403, 29919, 26094, 19464, 17881, 21279, 23019, 23127, 30695, 39649, 39526, 34352, 32780, 30376, 23133, 17160, 18529, 23604, 26603, 25874, 31106, 31791, 31389, 28562, 27488, 37887, 45133, 52827, 60017, 61625, 59381, 63458, 59312, 58447, 56798, 56203, 55858, 56164, 53584, 54801, 58060, 60912, 63806, 62393, 70271, 77201, 78568, 78725, 66680, 51389, 37737, 31375, 22101, 20371, 27495, 24448, 22319, 26457, 28450, 28693, 27602, 26372, 35537, 55435, 71424, 73510, 68940, 57738, 42351, 36985, 26185, 10245, 9918, 9193, 9465, 18422, 16032, 7431, 1832, 3551, 5961, 7702, 11387, 15702, 20039, 26336, 32353, 30032, 19881, 17300, 18507, 15252, 6147, 5321, 11782, 18154, 16315, 16609, 18370, 19654, 26885, 29170, 29146, 27063, 27644, 20895, 25495, 30584, 38527]
9665C8527N457O032J981N79k245J580L658P844M270N657Q862M183p05J4037J9872
9650A19589K7382L6467L7563M7206N3397M3874M152j6452m3308o4356p3121n4703
9638A17690l4874j8492q435q21K517j685j1528O97P410k386p610m154J037K707
9624D2073J103m180o93M656r6m945L696L964K467J275N0L141q702j015P539l091
9608D7242l934q276p08l300n325N94M844K271J225P2P68K89N979k549P82J0198
9592E0172J2535k20l553L963N352K446k743n79l034q085K844J884j437j567n992
9577E1986J920O237J009n66N343M167L549Q987Q080K25K312k086l317L431Q484
9562I9761Q767J3114J3191J5638J1864K693J920J1119K1894K6730K8348L2610
$$ y = [38527, 43984, 50016, 51997, 52576, 50331, 51911, 55569, 63413, 67683, 73340, 82202, 86385, 85680, 99717, 119589, 146971, 183438, 221001, 268207, 321604, 365478, 369630, 353178, 309870, 245514, 172393, 117690, 82816, 64324, 55889, 55068, 57585, 55900, 44372, 45069, 52479, 50093, 42483, 38329, 39366, 42073, 43176, 38996, 38303, 42959, 42863, 37918, 41614, 45578, 48045, 49320, 49370, 52511, 43809, 42794, 50333, 47242, 43308, 35032, 34324, 31024, 25699, 26293, 31137, 33408, 34633, 34705, 35473, 35762, 41741, 39192, 39974, 50172, 62707, 62487, 58934, 62897, 68249, 70695, 67952, 67373, 64339, 56254, 59098, 60982, 59545, 57978, 51986, 53906, 60143, 61152, 60586, 65929, 70096, 73645, 82632, 90712, 90937, 93249, 91163, 87846, 91277, 99761, 108528, 121642, 134833, 150471, 162335, 165028, 166948, 178067, 199961, 226691, 255039, 287649]
9550B87649L8543M6579M9227N1384P823l7472k8641o409M312j469m630R324J8841
9537D35061L0752L6608N5242Q2378R6999J18663J52340J80604K37820L51125M68354
9526B245946N37392N35602O55983Q54977j32957j477985j247115o76688l43368
9517I51787j84666j24490q4532m4436k5490L019L1308N2529O4109P8503R4587
9506H12228R5957Q3974l7774j84265j87743j28638p8936m8426l5954k1258p058
9495B62107J0373J5216J1963J0590N77M617P311J9386J7685J2764J1398L640P484
9482C95111M575j9814k9099j8989p969r919k193L843J7877K7292J9534J2555M380
9469C97184P051J0848r518k3693k2621j4222j554j6751o5518p0159m2748k4308
$$ y = [287649, 326192, 372771, 421998, 473382, 481205, 443733, 415092, 408683, 412995, 411526, 406896, 416220, 435061, 465813, 502421, 557663, 640041, 737040, 855703, 1008043, 1188647, 1426467, 1777592, 2245946, 2783338, 3318940, 3974923, 4829900, 4696943, 3218958, 1971843, 1295155, 951787, 767121, 642631, 558099, 513663, 488173, 491192, 522500, 575029, 639138, 717641, 812228, 908185, 992159, 954385, 770120, 582377, 453739, 374803, 326377, 290423, 269165, 262107, 272480, 287696, 299659, 310249, 310826, 315443, 322754, 342140, 359825, 372589, 383987, 387627, 395111, 399686, 379872, 350773, 331784, 323815, 313896, 311703, 315546, 333423, 360715, 380249, 392804, 397184, 404235, 415083, 405565, 381872, 359251, 345029, 343475, 326724, 261206, 191047, 148299, 123991]
9457A23991j2116n693l641o891K932j358j5476j8637j4343n583L422N478o813
9444D5272n085p171l693K06K595m555o7J449M659J37r542l446q48k86j655q53
9428A7117j411K247r67N851L014L667J691K697N532K599m155n919o933m821R27
9413B1136R38o779M85P106k135k341O918N508N897K943Q118N007l68M756N306
9398F2495p6m168L944P016K024n391R93J678j500n396m519l403O040j02j2558
9383D7077j1681k794K209O45K362Q817k905J815K224m74J183K567K733J0049K2042
9368H5869K8978L5383L5513L6702M7998L8565k1215o1628l9353j0695J0930K7179
9356B14226K9846L4229J2651m7493o7834n4617l4200o693j0445j2536r853n183
$$ y = [123991, 111875, 106182, 102541, 95650, 98582, 97224, 81748, 63111, 48768, 43185, 46607, 52085, 45272, 40187, 33016, 29323, 29529, 32124, 27569, 27502, 28951, 33610, 33747, 24205, 20759, 19911, 19625, 17970, 17117, 15706, 17953, 16986, 22837, 25851, 29518, 31209, 33906, 39438, 42037, 37882, 31963, 25030, 20209, 21136, 22074, 15295, 15780, 22886, 20751, 18410, 25328, 30836, 36733, 39676, 47794, 52801, 52433, 57189, 62495, 62419, 58251, 62195, 69211, 71235, 65844, 66837, 68515, 67015, 61619, 57100, 53697, 59737, 59635, 47077, 35396, 32602, 34811, 35456, 37818, 46635, 43730, 45545, 47769, 47295, 48478, 51045, 53778, 63827, 85869, 114847, 150230, 185743, 222445, 270443, 309008, 287793, 226165, 186812, 176117, 187047, 214226, 244072, 278301, 290952, 243459, 175625, 121008, 86808, 80115, 69670, 57134, 47281, 42098]
9344D2098l691j859j564K409M54n627o325j685k190n961m071l044K904O155P37
9329A8740o758p116J113K526K998q133L572L397J324M455j652p098m249L532K451
9314I102r89n079K497Q137L849K953K744O153N533O529l238l870j206o92K191
9299C4614k457k0J702m902n916l463l013m296J31N061J468K918j534l448k86k070
9283A4489m88O7q792l546M611N90l505K964n63K56L917O327P901P162K332l534
9267C0188n787n811m03J150J93L033L458Q657L265j3726n571m875l032J937o81
9252A1995k735M415K103j250M510Q531Q44j852n889k401j938o721K299l778j058
9237G075l66L567j621J159R685n96n132m839j211m140r31L217o70K25J260J877
$$ y = [42098, 38407, 36548, 34984, 37393, 37847, 32220, 25895, 24210, 22020, 16059, 11988, 8944, 11848, 18003, 18740, 11982, 4866, 5979, 8505, 11503, 3370, 6942, 10339, 11663, 16118, 14466, 7368, 3119, 6651, 9102, 8113, 3034, 5531, 13668, 17517, 20470, 23214, 29367, 34900, 41429, 38191, 34321, 33115, 32423, 34614, 32157, 32137, 33839, 28937, 23021, 19558, 16545, 12249, 12380, 17441, 18909, 21827, 20293, 16845, 16559, 14489, 14001, 14068, 5276, 1730, 6341, 6931, 3426, 6390, 5827, 6083, 10000, 16327, 24228, 31390, 33722, 30188, 24401, 18590, 18187, 19337, 19530, 22563, 26021, 34678, 37943, 24217, 18646, 13771, 10739, 12676, 11995, 9260, 13675, 15778, 14528, 19038, 27569, 28413, 26561, 20672, 18271, 16333, 9612, 11911, 8133, 7075, 6709, 10276, 8655, 9814, 19499, 18903, 13771, 8932, 7721, 3581, 2650, 5867, 5197, 5422, 6682, 8559]
9221H559l781J379o81n420r1N47M13o13L424N47K904O178K951Q57K865q77J3396
9204C2557M533j020J838K814J804l028l105k148k704L668L189Q56J875k121j902
9189C7106j899q466o144N845J250N48o394K082O580q07n293j092l755p13J765
9174B0613P639J062R7l546L476N229l990J134k15m528N722O353K90m86n116k937
9158C0797m787p110M150q12o45L439l593k345m504L997K863l373l432P798O947
9143B9390J73k29K019J360m465m396J824N268n513J210K722l529j180N207M517
9128C4378M026j077l968r155j498J373L761l26J258O39p07m410N610l922M774
9113C0756j732l74Q3o52J313q8R211K861l357M593L41L10k730M354k946m065k1
$$ y = [8559, 4778, 6157, 5476, 56, -35, 512, 925, 312, 3736, 4283, 7187, 13365, 16316, 17173, 20038, 19161, 32557, 37090, 36070, 37908, 40722, 42526, 39498, 36393, 34245, 31541, 35209, 38398, 39254, 41129, 39008, 37106, 35207, 26741, 20597, 26442, 27692, 28240, 21846, 23928, 30508, 29701, 24408, 23316, 19561, 18848, 20613, 28252, 29314, 29411, 25865, 29341, 34570, 30580, 31714, 31499, 26971, 32693, 39046, 39336, 38850, 33734, 30797, 26010, 18900, 23050, 22238, 21593, 25032, 21439, 19094, 14590, 18587, 21450, 18077, 14645, 22443, 29390, 29563, 29334, 31353, 32713, 28248, 23852, 25676, 30944, 25431, 26641, 29363, 25834, 24654, 29861, 34378, 38404, 37327, 33359, 24204, 22706, 24079, 27840, 27514, 28772, 29411, 28704, 24294, 29904, 25982, 30756, 29024, 28650, 28733, 28081, 29394, 29306, 38517, 41378, 38021, 42614, 42955, 43265, 40535, 44889, 41943, 37878, 37857]
9096C7857L552m867j368L540n20l074m158J863L799q33j978j557m892p673K491
9081B2182J20q21k185j261M96k073P90j276M448L047k126J814Q818R327l521K015
9065C9794K515n148p985J926Q480K588M313N260m26P946M214p62J195k263j0335
9050E1312n767l205l121J172j136L000O827Q98k071l787P635L708k34o39p38N448
9034E9302O81n71n621j107j318n531r867n651o919K933K219r51O202L884j206
9019C6479N482J0957P362p55K868r22O887J4627K1362J6917K2455K6802K8702
9006A99223L574l5515l7400k7107j4574q612j4948q384n041j1736N43O326r304
8993C7045M134j242J771O5m486j097j279Q00o785m378Q825P653L08k890J994M142
$$ y = [37857, 41409, 36542, 35174, 38714, 38194, 35120, 30962, 32825, 36624, 35791, 33813, 32256, 27364, 19691, 22182, 22302, 21481, 19296, 18035, 18531, 16458, 17248, 15972, 20420, 23467, 21341, 23155, 31973, 41300, 37779, 39794, 42309, 37161, 29176, 31102, 39582, 42170, 46483, 51743, 51317, 59263, 63477, 62715, 63910, 61647, 51312, 45545, 42340, 39219, 40391, 39255, 42255, 49082, 49980, 47909, 44122, 51757, 55465, 55231, 54592, 53854, 59302, 59983, 59412, 53791, 52684, 51366, 45835, 35968, 30317, 23398, 26331, 28550, 27599, 33801, 37685, 36479, 41961, 52918, 60280, 59525, 62393, 61471, 68358, 82985, 104347, 121264, 143719, 170521, 199223, 202797, 167282, 129882, 102775, 88201, 79589, 64641, 56257, 51216, 39480, 40023, 46349, 37045, 41179, 39937, 41708, 41773, 37287, 36190, 34911, 35711, 28926, 24548, 33373, 41026, 41334, 38444, 40438, 44580]
8977D4580P891M167l165L936J869L796M662L182N854Q987J1729J7703K3577L3336
8963A72104L8556M0420N1393M9843l0903r4500q1749m1373j5998q984o796j3446
8951E8567o413j867q480m704O854L260m641j766N076O215o370m405P178O522K410
8936E7436q34M667N576K997K953L04M054O616j179J1J719J53m26P532l17j686
8920H9576J0963K3014J7187J2275J2712J1062J1291J844l6264m6733k5883j4537
8908F6507j5089j0537o535L993K117J956K501l111k410j590J078J31J624n494
8894C5141J816K946J320k343K99j621l601j938J467K046J789N232j828o663n759
8879B8303n700L361O687k016R15P694Q415N316Q166N883L914M33k331k731l753
$$ y = [44580, 52471, 56638, 53473, 57409, 59278, 63074, 67736, 70918, 76772, 85759, 97488, 115191, 138768, 172104, 210660, 251080, 302473, 352316, 321413, 226913, 145164, 103791, 87793, 78809, 72013, 58567, 52154, 50287, 41807, 37103, 43957, 47217, 42576, 40810, 45886, 52101, 45731, 41326, 48504, 55026, 57436, 56602, 61269, 66845, 69842, 72795, 73099, 77153, 83769, 82590, 82601, 84320, 84473, 84047, 91579, 91262, 89576, 100539, 123553, 140740, 153015, 165727, 176789, 188080, 189924, 153660, 106927, 81044, 66507, 51418, 40881, 34346, 38339, 40456, 42412, 44913, 41802, 39392, 37802, 38880, 39011, 40635, 35141, 36957, 39903, 41223, 38880, 39179, 37558, 33957, 32019, 33486, 35532, 37321, 42553, 40725, 34062, 28303, 22603, 25964, 32651, 30635, 31550, 39244, 47659, 52975, 61141, 67024, 70938, 71371, 69040, 66309, 62556]
8864F2556l113m802p79L988p533j5297m271K819M330M350O27n67P995N283J224
8849E6810N604O305j42j829r370l056o58n814r788o717m580Q616j119o639k965
8834B4658O794N112l519j447k030k213j389K613K43Q165J845l027k831M995P77
8819C8746Q021L144j17J49L357M79R285R283J1641J5410J4072P910j6687k2588
8805H2105j7635j5235k67L079r744j0217K913J617p699j138K199M763M65m399
8791C0807J950l451L50O259m61p289n880K421Q853O054J953R48J687r409p986
8776B6806J350M786M197K67k181n705j947J2257N665m030L169M598m591k476K345
8761D4510J355N616O094L447Q04n898k484p883q295N534R881P527O04M053J2319
$$ y = [62556, 59443, 54641, 53862, 57850, 50317, 35020, 30749, 33568, 37898, 42248, 42875, 42308, 50303, 55586, 56810, 62414, 68719, 68577, 66748, 57378, 54322, 53664, 47850, 38062, 31345, 26765, 35381, 34262, 27623, 24658, 31452, 36564, 33045, 31598, 29568, 27355, 25966, 28579, 28822, 36987, 38832, 35805, 32974, 37969, 38746, 46767, 49911, 49794, 49943, 53300, 53779, 63064, 72347, 83988, 99398, 113470, 121380, 104693, 82105, 64470, 49235, 48968, 52047, 42303, 32086, 34999, 36616, 28917, 27779, 29978, 34741, 35206, 30807, 32757, 29306, 29656, 35915, 35454, 28165, 22285, 24706, 33559, 39613, 41566, 42514, 44201, 34792, 26806, 28156, 32942, 37139, 37406, 35225, 29520, 27573, 39830, 45495, 41465, 44634, 49232, 44641, 42165, 44510, 45865, 51481, 57575, 61022, 61826, 55928, 53444, 45561, 37266, 42800, 52681, 60208, 60812, 64865, 77184]
8746G7184L642Q810J5569R874J4405K4741N1836O5089O3625O0968R5510J10899
8734F02152p6764j87656j26366o9880l3799k0928j5602j1306j0506k355L018O520
8722E6528L646M313J58n702O6k515j374j010M33m099j571O762L325n691p412m82
8706D5375M223K317N787P170j068p017n00P775J555r421K368L097l274N055M413
8691F7855j962J475R781R37j811L084K509K767k08J360N719Q021R536O08o585
8676A03086J0503J6015P092Q640M486P437J5068K1142J5326J2874J8792K2600
8664B63061L0762L4810L1868L2213M7349N5612O3645Q2926J04799J19531J47590
8653A014166J62480J85331J62814J9213M5721K37057M65396O38759P58069Q17516
$$ y = [77184, 80826, 89636, 105205, 115079, 129484, 154225, 206061, 271150, 334775, 395743, 491253, 602152, 525388, 337732, 211366, 141486, 107687, 86759, 71157, 59851, 49345, 46990, 50008, 56528, 60174, 64487, 64645, 58943, 59009, 56494, 55120, 54110, 54543, 50444, 48873, 55635, 58960, 53269, 45857, 45375, 49598, 51915, 57702, 64872, 63804, 56787, 56287, 64062, 65617, 56196, 58564, 61661, 58387, 63442, 67855, 65893, 67368, 77149, 78086, 76275, 79359, 81868, 84635, 84427, 85787, 91506, 99527, 109063, 109671, 103086, 113589, 129604, 136696, 145336, 149822, 157259, 172327, 193469, 208795, 221669, 240461, 263061, 293823, 328633, 360501, 392714, 440063, 495675, 559320, 642246, 747045, 866576, 1014166, 1176646, 1361977, 1524791, 1544004, 1589725, 1826782, 2292178, 2930937, 3689006, 4506522]
8643D506522J091081J074997p79445k137050j562227q34608m30851k41201j43600
8634E43618q0165n2955k8992j2251j343q611k7812k6031k7150k9860k7826k6303
8622A94319l4604k0274j687n564q142J322J909l996j203J351p74K736j683j4933
8608A08777n172P809j152J20L939N786P6r16k195R79l743m865k422K583Q672k744
8592A15532o441n320K727N038M496O999R944O188P077O313M789O247Q377K0385
8578A92351K6784J3788J6373Q556J1023m510j7994j7562k6555k8460j1819p774
8566A54201j0359q370n733m112k125J91m901r58M043o982K708k778j2210j0278
8552I2337l600J121J674K411m410R946P950M540J1849Q577P962K1891K9518L8508
$$ y = [4506522, 5597603, 6672600, 5893155, 3756105, 2193878, 1359270, 928419, 687218, 543618, 463453, 410498, 381506, 369255, 367912, 359301, 331489, 305458, 278308, 248448, 220622, 194319, 159715, 139441, 137754, 132190, 124048, 125370, 127279, 123283, 122080, 123431, 122657, 125393, 123710, 108777, 103605, 111414, 110262, 110382, 114321, 120107, 120183, 119267, 117072, 118051, 114308, 109443, 107021, 109604, 118276, 115532, 109091, 103771, 106498, 111536, 116032, 123031, 132975, 139163, 146240, 152553, 157342, 163589, 171966, 192351, 219135, 232923, 249296, 257852, 268875, 264365, 246371, 228809, 202254, 173794, 161975, 154201, 143842, 135472, 129739, 125627, 123502, 123693, 118792, 117834, 121877, 114895, 117603, 114825, 102615, 92337, 88737, 89858, 91532, 93943, 89533, 99479, 107429, 111969, 123818, 132395, 140357, 162248, 191766, 230274]
8538B30274L3621K8177M0149M6721K4299m4643o1749l4228j8652k7855m0489l6490
8526A39135k8260j7650p470m23M508l608j1456n828o350J236J0414P283K655J544
8512H5730K460o9M37q271k386K025L151R577M504R610J0340J6407J5053K4286
8498A72854K8084L4068M3719O5089P0635N5053M7531O6429P1323m4818j54818
8487D55149j31899p4929l7724l0789l1565l4805k4801p997k542p243l346r549
8475E7960p497P8M38k845p978k531P575P265J479k579O162N412L897m509o408
8460E5919j359L643L650q67m345J0775R616R906J4096K3193K7967L4707L0557
8447B17458L1387L6772J3816m0661p0408n2992l5508k6543j3489K373r397n661
$$ y = [230274, 263895, 292072, 332221, 378942, 403241, 358598, 296849, 262621, 243969, 216114, 175625, 139135, 110875, 93225, 85755, 85332, 89840, 86232, 74776, 68948, 62598, 63834, 74248, 81531, 84186, 85730, 88190, 88121, 88558, 80287, 77901, 79926, 83077, 92654, 97158, 106768, 117108, 133515, 148568, 172854, 200938, 235006, 278725, 343814, 414449, 469502, 517033, 583462, 654785, 609967, 455149, 323250, 248321, 210597, 179808, 148243, 113438, 88637, 80640, 78098, 70855, 67509, 57960, 50463, 50541, 50979, 48134, 40156, 37625, 45200, 52465, 53944, 51365, 57527, 62939, 66836, 62327, 55919, 54560, 58203, 61853, 60986, 56641, 67416, 77032, 86938, 101034, 124227, 152194, 186901, 217458, 248845, 285617, 299433, 258772, 188364, 135372, 99864, 73321, 59832, 62205, 52808, 47147]
8435D7147k927j552l260j2353l289L208K449J923n973k221j647j3431l468J942
8421F548K882L222J366M342J0689L020n923J543J934o371R60J702N175J37L76
8406C1602J247p057N224P398M539O511P187J1261J6495J8386J1353J1500O367
8393A32013k2070k8974j8881m830K956K272N842l337q734p619o852k550J133o888
8379C3481l073N107P500N179p230o613J904P350L64Q64M861J2196P160K514O696
8364G8260J3757K0304K302k0947k1583j2031r235p541m906J550N171l510M310
8351D5901J1372J6695J2964K503K152O613Q310J1632J5659K1165J5050J6671l481
8338A83206k7389k1246k530P547R308O278R799J4484J7239K5839L0124M3740N3337
$$ y = [47147, 44220, 42668, 39408, 27055, 23766, 26974, 29423, 31346, 25373, 23152, 21505, 8074, 4606, 6548, 9430, 12652, 14018, 18360, 29049, 32069, 26146, 27689, 29623, 23252, 24212, 25914, 31089, 31226, 31602, 32849, 25792, 31016, 38414, 42953, 49464, 56651, 67912, 84407, 102793, 114146, 125646, 132013, 109943, 80969, 62088, 57258, 60214, 62486, 68328, 64991, 56257, 48638, 41786, 39236, 40369, 33481, 30408, 35515, 43015, 48194, 40964, 34351, 36255, 43605, 43969, 44833, 49694, 61890, 69050, 71564, 78260, 92017, 112321, 114623, 93676, 72093, 60062, 50827, 43286, 38380, 39930, 45101, 41591, 45901, 57273, 73968, 86932, 89435, 91587, 98200, 106510, 118142, 133801, 154966, 170016, 186687, 183206, 155817, 134571, 132041, 139588, 148896, 155174, 164973, 179457, 196696, 222535, 252659, 296399, 349736]
8325C49736P9714J31184J70781J98294K12666K63807L03449j11655n48657m28625
8315F20694k31432j28301p6157m1300k3397n460o59M290J4226K1238K2843K3105
8303A99690K0665j5147m9758m3101k8266k2901o562j032k910n586j0387p900J371
8290B8176Q19k195r372n901M467N626L727q32l728N528Q800N30J05J046m078o905
8274B5813K318J384K808K354l441J602R58m576j1237j03K3L94l83J188K466l349
8258A8219k586O207o19P61P9m848J611J0782M366K282N43K253L598L912m704k737
8242C9119M285K955j0945k608q52p877j0995l293P171Q715k412k867q4L837o42
8227B3507r382J813N198K078O489R226N633J486J962J740K493K357j483o892J883
$$ y = [349736, 429450, 560634, 731415, 929709, 1142375, 1406182, 1709631, 1597976, 1049319, 620694, 389262, 260961, 184804, 143504, 120107, 114647, 113988, 118278, 132504, 153742, 176585, 199690, 220355, 205208, 155450, 112349, 84083, 61182, 54620, 53588, 50678, 45092, 34705, 26805, 28176, 28995, 26800, 17428, 11527, 15994, 21620, 25347, 24515, 20787, 26315, 35115, 35645, 35750, 36796, 32718, 25813, 28131, 29515, 32323, 34677, 31236, 32838, 33796, 29220, 17983, 17880, 17903, 18297, 17914, 19102, 21568, 18219, 15633, 21840, 21221, 21982, 22061, 17213, 18824, 29606, 33972, 36254, 36797, 39050, 42648, 46560, 41856, 39119, 43404, 46359, 35414, 32806, 31954, 24077, 13082, 9789, 16960, 25675, 23263, 20396, 20312, 24149, 23507, 14125, 15938, 21136, 23214, 29703, 38929, 44562, 46048, 48010, 49750, 52243, 54600, 53117, 46225, 48108]
8212D8108J280J038K192m468p552l672p298o934N159P319J021O0m482j422m404
8197B5945l566n2K885Q340L882l687p297O293Q453r90q57r57r48N718M755O279
8181E4196O582P238N928J224n92k414O501j106J844m469M288N696J9425L1280
8167A35621L1600L4336L4182K6593l351m2295n2747m8679l7833k2068m685O751
8155E7425M243L668O239J0441N597J1109P543J7493K3693L3515M6950M4712N5543
8142C28171L9473k9329q0476q3800m6436k4578j5966m476p543K304Q851J3884
8130A00079K0552J7329J0627O857R203K2585j7851m5349k6792j6128j6273o700
8118E8139L473J5577N539J2338M018j06M683K853l089j4455k5271k1404o939K582
$$ y = [48108, 49388, 50426, 52618, 48150, 40598, 36926, 29628, 22694, 27853, 35172, 36193, 36253, 31771, 30349, 25945, 22379, 22327, 25212, 33552, 37434, 33747, 26450, 32743, 41196, 40206, 39349, 38392, 37444, 43162, 47917, 54196, 60778, 68016, 73944, 75168, 74576, 72162, 78663, 77557, 79401, 74932, 79220, 84916, 104341, 135621, 167221, 201557, 235739, 262332, 258981, 216686, 163939, 115260, 77427, 55359, 50674, 57425, 61668, 65336, 71575, 82016, 87613, 98722, 106265, 123758, 147451, 180966, 227916, 272628, 328171, 367644, 338315, 257839, 174039, 127603, 103025, 87059, 82583, 75040, 77344, 86195, 100079, 120631, 137960, 148587, 155444, 164647, 187232, 169381, 124032, 97240, 81112, 64839, 58139, 61612, 77189, 82728, 95066, 99084, 98978, 103661, 106514, 103425, 88970, 63699, 42295, 35356, 37938]
8104C7938Q139j984m809k151L003Q258Q624P217K391J1981Q363K482J5286K1268
8090A26006K2172K2349K0185n360m3672m4173k2222r200l198K658K571P066O275
8077H1457J2490j242o479p212j662Q35K652J984K673k736n318N678J667M369J3743
8062A02899J5469K2267K7220M232k3968m5318k8836j4824n056n86o92R54j442
8049E2319N041r22K470R466j059M960O645Q232K594J0069R560L093J2698J4401
8035A39567J8442J3170J4554J0522J1584K1335L3697L4313L0240J698m0832n2267
8023B36023k7574j2795j1257l251m464L618K220O661J3775J4258J7319J4435J3404
8010B62372K6331K3041K8424L6545K8707L8583O7469J02029J44349J96901K36416
$$ y = [37938, 46077, 44093, 39284, 37133, 40136, 48394, 57018, 64235, 66626, 78607, 86970, 89452, 104738, 126006, 148178, 170527, 190712, 185352, 141680, 97507, 75285, 66085, 62887, 65545, 68116, 75182, 81457, 93947, 92705, 86226, 79014, 77352, 78187, 80839, 82823, 85496, 82760, 77442, 83120, 84787, 89156, 102899, 118368, 140635, 167855, 172087, 148119, 102801, 73965, 59141, 54085, 53499, 52807, 53761, 52319, 57360, 56438, 58908, 68374, 67315, 72275, 78920, 87152, 89746, 99815, 109375, 112468, 125166, 139567, 158009, 171179, 185733, 196255, 207839, 229174, 262871, 297184, 327424, 329122, 288290, 236023, 208449, 195654, 184397, 181146, 176682, 180300, 182520, 189181, 202956, 217214, 234533, 248968, 262372, 288703, 311744, 340168, 376713, 405420, 444003, 511472, 613501, 757850, 954751, 1191167]
7999A191167K64100K98848K99315l0372m86294n27537l35777j79026q9257n7761
7989C47406k5890q180q104l426J8078L6794L2389J7559K7910P784j8565k4450
7977C99305j0469K1707P3545J13236J48060J84940K09950K45125K69238M7941
7967A702578l56584m55955l07069j68603r4118o6861m6010l8844k7347j1057l015
7956A27115r041j2080j2154l124l125n945j0885j4015L089M153k40R99j1526m781
7942D8440n252o514J092R095K735l102n630n893L986J537L092N583J289J568j687
7927E0339o905j885J0173J377j6J921O958K902o995l995J097J784m217r531r118
7912C3889n350l106r319j0304N966N880k887P29o56k654j042l745J24R779j808
$$ y = [1191167, 1455267, 1754115, 2053430, 2023058, 1536764, 1009227, 673450, 494424, 405167, 347406, 321516, 313336, 305232, 301806, 319884, 356678, 389067, 406626, 434536, 442320, 423755, 399305, 388836, 410543, 484088, 597324, 745384, 930324, 1140274, 1385399, 1654637, 1702578, 1345994, 890039, 582970, 414367, 320249, 253388, 207378, 168534, 141187, 130130, 127115, 118074, 105994, 93840, 90716, 87591, 81646, 70761, 56746, 59835, 63988, 63748, 64747, 53221, 48440, 43188, 36674, 37766, 46861, 49596, 46494, 40864, 34971, 38957, 40494, 43586, 49169, 50458, 52026, 50339, 43434, 41549, 51722, 53099, 53083, 55004, 61962, 64864, 57869, 53874, 54971, 56755, 52538, 43007, 33889, 28539, 25433, 16114, 5810, 11776, 17656, 14769, 15498, 14842, 12188, 11146, 7401, 7525, 17304, 15496]
7897A5496k82N976J897Q85P55R64k118o530K070K48L56O495O893p529k487m183
7881A8906o800j282q63L591M57l306k675M59M045J149q64k774K542N89M193L425
7865B0792n071k076j087o902m395r95j47M733J301j807n753J079Q665N880J438
7850A5655J804k647m039k085m47o508J001M208M807J800k566m089j244J899J747
7835I296m126L769L577J729J474r561j5538n79Q438n55r112k93Q569Q122l27l581
7819A302l088K786L279L454J322j606J667m374l38o959q312L142P839m440m649
7804h975L672j970r68Q105O451K468o368K401N87m634j026k014R03Q31K016l507
7788b028L38L195J276l029K411N660j647m597k28N261P83k291l387J97L657l361
$$ y = [15496, 15214, 21190, 23087, 23972, 24727, 25691, 23573, 17043, 19113, 19361, 19717, 26212, 33105, 25576, 23089, 18906, 12106, 10824, 9961, 13552, 14009, 10703, 8028, 8487, 12532, 13681, 12817, 10043, 12585, 13174, 17367, 20792, 15721, 13645, 12558, 5656, 1261, 266, 119, 4852, 6153, 4346, -1407, -328, 8337, 14217, 15655, 17459, 14812, 10773, 8688, 8241, 1733, 2734, 6942, 11749, 13549, 10983, 6894, 5650, 7549, 9296, 5170, 8939, 12516, 14245, 15719, 6158, -9380, -9959, -1521, -2076, -11188, -11481, -2912, 5210, 4883, 1302, -1786, 1000, 4279, 7733, 9055, 7449, 9116, 4742, 4404, -2555, -10867, -7725, 114, -4326, -8975, -5303, -7273, -8241, -136, 6315, 8783, 2415, 4816, 5403, 769, -257, -2271, -1368, -537, 1479, -2028, -1690, 1505, 2781, -248, 2163, 7823, 6176, 1579, 1351, 6612, 7395, 5104, 1717, 1914, 5571, 2210]
7772B210j411m505M023N863K630n49k302n714o674K557K550o65M452q38m024J384
7756a013L301m06o586p886L530M167J85o293O882M358L544o396k52J677M786m889
7740a291o009k927k535j99M758O531M994n958K19J536K372o13k461o767k768j069
7724a2187L612J608Q826N719J398q872n198L320o38p910K970j740K223K219r36
7709e586J563M896K20k364j67l651J465N451M60n372L380j353l241k949l623k26
7693a1097J282O447j904m460R0j90K236M812r01k589M1p70p73j873l410L227N320
7676d512k392J792J488L400J938L574K560m172l278K598m545l881j564K154o212
7661a1052k931K047k832J421O292K524M408K705K48Q03p22K349P96K185o506J28
$$ y = [2210, 799, -3706, 317, 6180, 8810, 8261, 5959, 245, -6429, -3872, -1322, -1987, 2465, 1627, -2397, -1013, 2288, 1882, -4704, -12590, -9060, -4893, -4708, -11001, -4119, 239, 3783, -2613, -2865, -1188, 3598, -1291, -7300, -10227, -12762, -12961, -8203, -1672, 3322, -2636, -2417, -881, 1491, 878, -1583, -8350, -11118, -12187, -8575, -6967, 1859, 7578, 8976, 104, -5094, -1774, -2412, -10322, -7352, -9092, -6869, -4650, -5586, -4023, 873, 1093, -1271, -1438, -5089, -3624, 1827, 2287, -3085, 295, -1058, -4299, -7248, -10871, -11097, -9815, -3368, -5272, -9732, -9642, -9832, -7596, -2784, -3685, -6274, -6233, -7003, -7776, -9649, -13059, -9832, -4512, -6904, -5112, -3624, -224, 1714, 5288, 7848, 3676, 398, 2996, -1549, -5430, -6994, -4840, -11052, -13983, -11936, -14768, -13347, -7055, -4531, -123, 2582, 2830, 3633, 2911, 5260, 6056, 8241, 1735, 1863]
7645A863J0267j597J354M195p227n184j959j227o672j099M540J743M99m471o877
7630a1852k413O713K111N918J856j884Q7l244j1335q878j112O435M862J0940o342
7615h138k646m012m673O44O762M981Q057l33K035q41R13l602k876j896L44P502
7599B221Q520j505m105L78M730m35j0407k813o67K796M069q67j937J724J823P37
7583D262j116j0281J991J521p974p466N279Q580P470K676n182j167K864O1k635
7568a117M510k097k837n901m164M971J263p150j333P838p16k680N681q98k448
7553g078J079l15K631K022P756o061j1632n470k002j61R864o47n951j792K202
7538a5555L175M666O104l209M263o482o413m625M309R314N515q125M043Q020j117
$$ y = [1863, 12130, 10533, 11887, 16082, 8855, 3671, 1712, 485, -6187, -7286, -2746, -1003, -504, -4975, -11852, -14265, -7552, -5441, 477, 2333, 449, 536, -2708, -14043, -22921, -24033, -17598, -12736, -1796, -8138, -10784, -14796, -19469, -18825, -12063, -7082, 975, 642, 2677, 1836, 2749, -853, -3729, -5625, -5281, 2221, 10741, 9236, 5131, 5509, 10239, 9804, -603, -3416, -4083, -1287, 2782, 1915, -22, 1702, 3525, 4262, 3146, -7135, -5144, -3623, -11597, -19063, -13784, -5204, 2266, 4942, -240, -1407, 1457, 1518, -1117, 3393, 1296, -1541, -7442, -11606, -6635, -5372, -12522, -13855, -6017, -6733, -9413, -3732, -4630, -7078, -5999, -6314, -3683, -1661, 6095, 34, -11598, -17068, -19070, -19231, -9367, -10014, -15965, -17757, -15555, -12380, -7714, -1610, -4819, -556, -7038, -13451, -18076, -13767, -4453, 1062, -7063, -3020, 5000, 3883]
7523C883p358j0163k268n639R519N380L363K292m708L304Q44j969k661L037M946
7508A802J155l682M497k315p234m522j960Q13Q783N080N962j230m167N490p124
7493A348k652m160n702l435l067J066J984j926k294j146L276J1107P109m914k501
7478e907n774k418J805Q15K635L757L532N26o111K104oL799k074r45J469P878
7462E085J587l690l541J285l967P24o55m529j880N89N2L027J930k56k969k360
7446i568K797N006K106n319o673j879o3l053L064R393Q885l56p796L108N61j451
7430a238j0404j556N330J305M642J657M903r8l785k953o55P78l544m029l195M483
7414h359N204N125J377n389j0609j933K485P295j609m862K955J306J748K329K080
$$ y = [3883, -3475, -13638, -15906, -21545, -12026, -6646, -3283, -991, -5699, -2395, -1551, -3520, -6181, -3144, 1802, 2957, -725, 3772, 1457, -5777, -10299, -12259, -11446, -2663, 2417, 8379, 7149, 2982, 8472, 1348, -1304, -5464, -11166, -14601, -17668, -16602, -14618, -16544, -18838, -19984, -16708, -5601, 1508, -3406, -5907, -11681, -14099, -12294, -11479, -8844, -5087, -1555, -1029, -7140, -5036, -5042, -1243, -3317, -4262, -2793, 5085, 6672, 2982, -559, 726, -3241, -2517, -3172, -7701, -9581, -8992, -8940, -5913, -3983, -4239, -7208, -9568, -6771, -1765, 341, -4978, -11651, -13530, -13593, -16646, -13582, -4189, 4696, 4340, -3456, -348, 213, -1238, -11642, -13198, -7868, -6563, -1921, -264, 4639, 4541, 756, -2197, -2852, -2074, -5618, -9647, -12842, -8359, -3155, 1970, 3347, -2042, -12651, -14584, -12099, -4804, -6413, -11275, -8320, -7014, -5266, -2937, -857]
7399h57M173J501l491k556N431j490N7l088q545J109M758J458m511L675J0527
7384H151M665m892q315K198N453j204p745p930J385M285O259j694P44J55K160
7369C675P07k197m930l201K357Q095l275m89J902l48l816N64M555k76j978k098
7353g53k093n37M44L09k390l114k164J378K143k115N708M405L015j89M508O65
7337I220n531J403M244l361p766l062n5J586q342M582J480K121J068J87R53Q45
7321d28M216J391l588j4503o242O125O065M93L778J522l121l886k023K219M725
7306c257j347m300L361M722k278L26N565l581o447k918k713L58k984N651L733
7291f109L04K451m498O060l308K305L568p53k689K045l465LR323J374k210Q177
$$ y = [-857, 3316, 4817, 1326, -1230, 4201, 2711, 2768, -320, -8865, -7756, -2998, -1540, -6051, -2376, 8151, 12816, 7924, -391, 1807, 7260, 6056, -1689, -9619, -8234, -3949, 2310, 616, 1360, 1515, 3675, 4382, 2185, -2745, -5946, -3589, 4506, 1231, 742, 2644, 2296, -1520, -956, 3599, 3323, 1345, -753, -2846, -3383, -2939, -2630, -5020, -8134, -10298, -8920, -6777, -8892, -3184, 1221, 4236, 4047, 8555, 9220, 3689, 5092, 9336, 5975, -1791, -4853, -4908, -3322, -11664, -7082, -5602, -3481, -2413, -2226, -1273, -428, 3788, 5179, 1591, -12912, -19154, -13029, -6964, -6471, -2693, -1171, -4292, -8178, -10201, -7982, -3257, -4604, -8904, -5543, -821, -3099, -2773, 2792, -789, -7236, -10154, -12867, -12509, -15493, -9842, -6109, -5805, -3354, -7852, -1792, -5100, -2795, 773, 20, -2669, -624, -4089, -4086, 5237, 6611, 4401, 12578]
7275A2578n277p461n464M187M54l649J7P77M904K551p852j46n40n317j070P01
7259a0607K458Q599j176p193K549N776J711k041K310j309J502K597m989J743K016
7244C946j455m07k184r350j46K495j095k27l925k961N063k140N727J0090k190
7229A241n987M256L264K275l070r973r76K031M541Q093m421K705N45n991K308
7214H41N66k874M856j249M02k068R83n623l886p38J506K467L743M619k374j913
7198g42l461n401J102P963j60k525L024k0m452o804P594J84k81O503j555m326
7182c357M606L763m317m865j748K473K67P176p52r064o205J514O162L096J767
7167E16o457n577O764Q971k275l661j254j589j477M284o62l455K716q01n189m892
$$ y = [12578, 7301, -160, -5624, -1437, -983, -4632, -4615, -3838, 1066, 3617, -4235, -4381, -4921, -10238, -11308, -10607, -8149, 450, -726, -7919, -5370, 406, 2117, 76, 2386, 1077, 2579, 5176, 187, 1930, 3946, 2491, 2084, -100, -9450, -9596, -7101, -8196, -8423, -12348, -15309, -10246, -12386, -6659, 3431, 1241, -4746, -490, 2774, 5049, 1979, -7994, -8970, -6939, -2398, 5695, 1274, 3979, 4524, -1467, 841, 1407, -1467, 3389, 2140, 2542, 474, 1457, -4166, -8052, -8790, -7284, -4817, -1074, 3545, 1171, -742, -4203, -9604, -8502, -539, -699, -3224, -200, -220, -4672, -11476, -3882, -3698, -3979, 2524, 969, -3357, 1249, 5012, 695, -4170, -5918, -3445, -3178, 3998, 3246, -5818, -12023, -10509, -4347, -1251, 516, -5941, -11518, -4754, 4217, 1942, -1719, -2973, -4562, -6039, -1755, -2417, -5872, -3156, -3957, -9146, -14038]
7151a4038P821j297k266j463o58n518p37Q411M479N82q640K422J0369N597o064
7136a000o632L642j936q82j0752k445L45L197K125K774J0328R863k96k633l167
7121B531p840l741N842M836m647K095J521m128n185j951J216L144K156k528l101
7106i780j301L244k101N014p107p021n263J2807J367j969J598K243l585K335N44
7091h975J550l722l722M026L294K941o01l071k527k426K965Q354j110J964M351
7076C291K879N42K196k622l324K710M366n417m674l531j186j554M152M268l441
7061a345j0467m749Q071L190l833L746O149L871j260l827O298J114p902l159L418
7046f85n17p052k878M875J989M99l123p367j931J647J0960P717p48q097k560K58
$$ y = [-14038, -6217, -7514, -9780, -11243, -11901, -17419, -18156, -9745, -5266, -4684, -13324, -10902, -533, 5064, -1000, -7632, -3990, -5926, -6808, -17560, -20005, -19660, -16463, -14338, -11564, -1236, 8627, 8331, 5698, 2531, -5309, -9050, -3208, 1628, -3019, -924, 597, -3531, -8716, -10667, -9451, -6307, -4151, -6679, -9780, -11081, -7837, -9938, -4924, -12031, -19052, -24315, -11508, -10141, -12110, -10512, -8269, -11854, -9519, -8975, -7425, -11147, -14869, -10843, -7549, -4608, -5209, -8280, -10807, -13233, -10268, -1914, -3024, -1060, 3291, 6170, 6712, 8908, 6286, 2962, 5672, 10038, 4621, -53, -3584, -4770, -6324, -2172, 2096, -1345, -11812, -16561, -8490, -5300, -9133, -5387, 762, 4633, 3373, -454, 5844, 6958, -944, -4103, -685, -1202, -8254, -11132, -6257, -4268, -3769, -6892, -14259, -16190, -14543, -3583, 4134, 3386, -4711, -7271, -7013]
7030g013K674l15n782j562J707k849O685J934O170j171n574k379j093o714J172
7015a4110M896M600p33k797o783l011O622Q35n794N403r15o014k606O274O362
7000g771R21n330O21J983J822K070j528k924l923k630L645N182O202N821l392
6985G69n096R35l263k891R516M576n735k736P281K134j71o401J143K340q564k633
6969h796N97K786l883j424R068J0940k244l632q621n128p25M299L125n641q541
6954a7820K425O099N996L992l350m136l146J118N812J060l099p453L510J119N655
6939b218k19j132j152l162L235O812Q148n14m810j854om816o453p762l066N248
6923a3721M766N795Q387P511k67k676q414m250J67l469L773m17m198O110K687
$$ y = [-7013, -4339, -4654, -10436, -11998, -10291, -13140, -6455, -4521, 1649, 478, -5096, -7475, -8568, -15282, -14110, -9214, -4614, -5347, -8144, -14927, -17938, -11316, -10481, -16275, -10872, -11787, -17801, -20407, -14133, -7771, -6850, -12180, -11559, -9576, -7754, -5684, -7212, -10136, -14059, -16689, -13044, -7862, -1660, 4161, 769, -4327, -3392, -6655, -9546, -30, 4546, -1189, -3925, 3356, 5490, 5319, -1082, 61, 2401, -6163, -8796, -8199, -5413, -9296, -10720, -1652, 9288, 7044, 3412, -5209, -10337, -11062, -6763, -3638, -9279, -17820, -15395, -9296, -3300, 692, -2658, -6794, -9940, -8822, -3010, -1950, -5049, -12502, -8992, -7873, -2218, -2437, -3569, -4721, -7883, -4648, 2164, 10312, 9798, 4988, 3134, 3128, -1688, -8141, -15903, -18969, -13721, -8955, -3160, 5227, 12738, 12471, 9795, 1381, -2869, -2702, -6171, -2398, -2815, -7013, -903, 1784]
6908A784p93j002m065l569o423J505n60r26k395L215N241P636J0185J256K063
6893A3152J763j212j09o087l147j475l807k032n583K978j208O935R153J73m093
6878E401R45m069p873J000Q430J120p400n568k555j753R246j844K789K666p24
6863a89Q60l0J58r787p359P759j064n719O618O382L283r90l397p132k019M021
6847h605M784M314K458n255o44N512J155r21j673l148n085k309j091L283Q78j169
6831g516Q3M25L729P95J028j445J203K851J87n161j481K801J52l645m571j555
6815a2120K437N252P84l884M052K564K33n940n92m100j232J230Q441O23N622M017
6799G387J074o857m72m097l863J686L263L929N033K06j673o807l390k563k622
$$ y = [1784, 991, -11, -4076, -7645, -14068, -12563, -13123, -14049, -16444, -13229, -7988, -352, 9833, 11089, 13152, 14915, 13703, 13594, 7507, 4360, 2885, -922, -2954, -8537, -5559, -6767, 168, 9321, 9494, 5401, 6346, 2277, -5596, -4596, 3834, 4954, -2446, -8014, -10569, -12322, -3076, -4920, -2131, 535, -189, 671, 641, 799, -8988, -16347, -8588, -9652, -15371, -8753, -2371, 912, -78, -3475, -10607, -12626, -8605, -3821, 493, 2951, -2304, -2948, 2564, 3719, 2798, 1125, -2023, -7108, -9417, -10508, -7225, -6347, -7516, -7433, -7008, -3279, -2484, -1456, -2901, -1698, 1153, 1340, -3821, -5302, -2501, -2349, -5994, -10565, -12120, -9683, -4431, -3647, -7531, -3479, -915, -682, -6622, -7214, -11314, -12546, -11316, -2875, -2252, 3370, 7387, 8461, 1604, 1132, -2965, -6828, -5142, -1879, 2050, 7083, 7289, 5616, -1191, -4581, -7144, -9766]
6784i766J276P777r83j140L215L140m504P1J608r609L463P84k822m690M045L590
6768d545k221j91M748L501l867k936n60l522Q0N961J751l006l373m431R07L163
6752h541j13l15m126J452K343R44l122K68N597n098j227j598p19L678M122m51
6736f906J780P487p81r32L830j904p009M2m81j243n287k573L808J0178L822k201
6720A630l243o49J781j643j423L37K457N005r89k604P00k430Q73N716l801m416
6704b699J017m738j737l960o61O321j839k620M014M272j419o035r21L20K061j816
6688a0440K878M746J111L155q41r454K772L015k223O4nl469o041L906O816L99
6672c611n338K424J833J77p716m557L180P623M518j911k721J203q5J149O069m401
$$ y = [-9766, -8490, -713, -1696, -2836, 379, 3519, -985, -914, 694, -8915, -5452, -4668, -7490, -12180, -8135, -4545, -6766, -6957, -2209, 1292, -2575, -5511, -6071, -9593, -9513, -3552, -1801, -4807, -8180, -12611, -11704, -8541, -8654, -8969, -13095, -11643, -9300, -8356, -11478, -11210, -5613, -10711, -11938, -13536, -14255, -10577, -6455, -6906, -5126, 2361, 1580, 648, 4478, 2574, -4435, -4393, -4874, -6117, -11404, -13977, -10169, 9, 3831, 1630, -1613, -2262, -481, -2124, -3547, -3210, -753, 4252, 3263, 659, 1359, -1071, -198, 5518, 1717, -2699, -1682, -6420, -8157, -12117, -12778, -6457, -8296, -10916, -6902, -2630, -4049, -10084, -11005, -10685, -8624, -10440, -7562, -2816, -1705, 1450, 609, -8845, -6073, -3058, -5281, -5217, -5222, -8691, -14732, -10826, -4010, -3611, -8949, -6525, -4692, -4515, -12231, -16788, -13608, -5985, -1467, -3378, -6099, -4896, -4981, -3832, 2237, -2164]
6656b164o720o941k322O359L113K627M84o385l582K978N557M347N082m78j523
6641D32j685m386N473L467K397O732n204q554L4m008L799M070l836K096J841l49
6625B319Q52J438P456k94n600p758m320l7M287L122m020r03n94K399k80m221k620
6608h774j028P750j31n659o877l066K817R94p09O874P119R14k341k30l215K42
6592e320K954k952J389K343M309n520l221j236o42K023L718P736L132l640J407
6577F480J406m775l164K066L170n710k347j902j763M668L857K315m596j721k089
6562d105L77L8J245M332J572j658L091P42p037p34N241j83l794J9J189k432K830
6545G33j584Q7j289O224M651O24j959K612j271l575l834k801l85O798q73K942
$$ y = [-2164, -8884, -15825, -18147, -11788, -8675, -6048, -5564, -11949, -15531, -12553, -6996, -2649, 2433, 1955, 432, -1253, -5639, -166, 3301, 5698, 12430, 7226, -1328, -1294, -5302, -1503, 2567, -1269, 827, 2668, 2319, 3171, 4609, 12065, 11771, 6171, -1587, -5907, -5944, -1657, 1465, -2555, -3458, -4052, -1653, -1933, -6154, -8774, -9802, -2052, -2183, -7842, -14719, -17785, -14968, -13974, -14683, -7809, -690, 224, -2117, -2347, -5562, -5320, -2366, -5318, -3929, -1586, 2723, -2797, -6018, -7254, -7896, -5873, -2155, 5581, 8713, 5073, 6480, 7886, 3111, -53, 2013, 5183, -527, -2874, -4776, -6539, -1871, 1986, 4301, -295, -2016, -4105, -3728, -3690, -2445, 1887, 3459, 1801, 4892, 5634, -1403, -2137, 3104, 2921, -873, -854, 335, -2097, 733, -851, -764, -2053, 4171, 8822, 9446, 7487, 10099, 8828, 5253, 1419, -1382, -1767, 5031, 4158, 7100]
6529G100J692j249J555j541L707m305l588m023K251O738r007n125J072k376K420
6514d679K619o963j025K946O731j019k041j172k027R84M91k475L638n34L657m110
6498d979m368p13O932K298O999m187r83p24N158l130o349k536K019K750M68n560
6482f905l472L058O149J107R63L513N744j705k778p368o204P04P116L768K008
6467E698j545O27K396p060o682K889K249n009N03L704k892J608J254J609N540
6452D889k198p632l534Q108M124K133k818K560k702n04N48n609k747l593K263
6437f712M067k73l505O773k160p631K28J503r14L799L760K892n834p36J133L565
6421d5O213m143j506J695k087l210j899q03j112k076k068P868k162k369K647m95
$$ y = [7100, 8792, 7543, 9098, 7557, 11264, 6959, 3371, -652, 1599, 8337, -670, -5795, -4723, -7099, -4679, -2060, -9023, -10048, -7102, -371, -1390, -3431, -4603, -6630, -5646, -5155, -7630, -3992, -4526, -869, -4979, -9347, -10060, -3128, -830, 6169, 1982, 999, 275, 5433, 2303, -4046, -6582, -4563, -1813, -1345, -6905, -10377, -7319, -1170, -63, 900, 4413, 10157, 8452, 5674, -1694, -7898, -7194, -78, 3690, 5698, 4153, 4780, 7176, 116, -6566, -3677, -1428, -6437, -5934, -2230, -5122, -3514, -2260, -651, 4889, 2691, -4941, -8475, -367, 3757, 5890, 3072, 5632, 2930, 2426, 2974, -2635, -5382, -8975, -6712, -2645, -2918, -6423, 350, -1810, -9441, -9213, -7710, -8624, -4825, -1065, 1827, -4007, -4743, -3610, -45, 6168, 2025, 519, 2214, 127, -3083, -4982, -5785, -6897, -8973, -11041, -3173, -5335, -7704, -5057, -5552]
6405e552q71K832K232J332M339k048N628k022l935n235L815k8k212j758r087o605
6389a9175k846J2257Q316M381l321m136M056k506J917J147j721l285l812J164
6375g564R507j417P90n941K24j461K877R51L730l077P37M37j524m71J108k584
6359c678p385Q536K865N49k665n260Q472J3348j114k321n001k216q877p04P730
6344B279J601n868k029J901m9J385m142j54K677j5L977M123K27n8K119q44l603
6327C527L397J683j4165m988N528K137j709P4p8L824j728Q52m699l766P839J0076
$$ y = [-5552, -6423, -3591, -1359, -27, 4312, 2264, 7892, 5870, 1935, -3300, 515, 487, -1725, -3483, -12570, -19175, -22021, -9764, -1448, 2933, -388, -4524, -468, -2974, -1057, 90, -1631, -4916, -8728, -7564, 1943, 526, 1316, -4625, -4401, -5862, -2985, -2034, 1696, -1381, -644, -207, -1731, -2202, -1094, -3678, -11063, -2527, 338, 887, -1778, -7038, 1434, 14782, 13668, 11347, 6346, 4130, -4747, -5451, 2279, 3880, -1988, -4017, -2116, -2165, -780, -4922, -5076, -2399, -2414, 1563, 5686, 5913, 5855, 7974, 7130, 3527, 6924, 8607, -5558, -10546, -5018, -2881, -4590, -4516, -4594, -770, -2498, -1646, -6345, -10111, -2272, 7804]
$$ [...]
##END NTUPLES=NMR SPECTRUM
##END=
