##TITLE=Analysis number 317573
Compound Code hts 07422
Project Code qc-cat
Chemist Name he.co
##JCAMPDX= 6.0         $$ Bruker NMR JCAMP-DX V2.0
##DATA TYPE= NMR SPECTRUM
##DATA CLASS= NTUPLES
##ORIGIN= Bruker BioSpin GmbH
##OWNER= nmr
$$ XWIN-NMR		Version 3.5
$$ Fri Feb 24 08:53:52 2006 GMT Standard Time (UT+0h)  MAYBRIDGE\nmr@NMR_250MHZ
##.OBSERVE FREQUENCY= 250.131544655141
##.OBSERVE NUCLEUS= ^1H
##.ACQUISITION MODE= SIMULTANEOUS (DQD)
##.ACQUISITION SCHEME= undefined
##.AVERAGES= 16
##.DIGITISER RES= 18
##SPECTROMETER/DATA SYSTEM= dpx250
##.PULSE SEQUENCE= zg30
##.SOLVENT NAME= DMSO
##.SHIFT REFERENCE= (INTERNAL, DMSO, 0, 16.522)
##AUDIT TRAIL= $$ (NUMBER, WHEN, WHO, WHERE, WHAT)
$$ ##TITLE= Audit trail, XWIN-NMR		Version 3.5
$$ ##JCAMPDX= 5.01
$$ ##ORIGIN= Bruker BioSpin GmbH
$$ ##OWNER= nmr
$$ C:\u/data/dgb/nmr/ADRS/16800/pdata/1/auditp.txt
$$ ##AUDIT TRAIL=  $$ (NUMBER, WHEN, WHO, WHERE, WHAT)
(   1,<2006-02-24 08:53:18.74 +000>,<MAYBRIDGE\nmr>,<NMR_250MHZ>,
      <created by zg, POWCHK disabled, PULCHK disabled
       configuration hash MD5:
       84 BC 41 DB A1 6E 1D 46 DA 25 12 A5 C1 ED C5 3A
       data hash MD5: 64K
       B9 D7 23 D4 1E 76 6D C8 0B 86 34 51 CB 34 C7 27>)
(   2,<2006-02-24 08:53:34.85 +000>,<MAYBRIDGE\nmr>,<NMR_250MHZ>,
      <Start of raw data processing
       ef LB = 0.3 FT_mod = 6 PKNL = 1 SI = 32K 
       data hash MD5: 32K
       A4 08 B2 7C D0 51 41 16 1F 04 7C 9D 84 E6 25 29>)
(   3,<2006-02-24 08:53:38.57 +000>,<MAYBRIDGE\nmr>,<NMR_250MHZ>,
      <apk 
       data hash MD5: 32K
       C3 94 71 6D CD 84 F4 BE E2 AB 92 31 41 B3 8D 5D>)
(   4,<2006-02-24 08:53:39.85 +000>,<MAYBRIDGE\nmr>,<NMR_250MHZ>,
      <abs ABSG = 5 
       data hash MD5: 32K
       59 9D 92 17 1A 9F AC CB 66 F0 33 B0 B5 93 D2 3E>)
$$ ##END=
$$ 
$$ hash MD5
$$ CF 5F 57 5A 46 0E D0 1D 75 DC 93 40 65 91 68 6B
##$RELAX= 
##$RELAX= 
##$RELAX= 
##$RELAX= 
##$RELAX= 
##$RELAX= 
##$RELAX= 
$$ Bruker specific parameters
$$ --------------------------
##$DU= <C:\u>
##$EXPNO= 16800
##$NAME= <ADRS>
##$PROCNO= 1
##$TYPE= <nmr>
##$USER= <dgb>
##$AMP= (0..31)
100 100 100 100 100 100 100 100 100 100 100 100 100 100 100 100 100 100 
100 100 100 100 100 100 100 100 100 100 100 100 100 100 
##$AQSEQ= 0
##$AQ_mod= 3
##$AUNM= <au_zg>
##$AUTOPOS= <3 >
##$BF1= 250.13
##$BF2= 250.13
##$BF3= 250.13
##$BF4= 250.13
##$BF5= 500.13
##$BF6= 500.13
##$BF7= 500.13
##$BF8= 500.13
##$BYTORDA= 1
##$CFDGTYP= 0
##$CFRGTYP= 5
##$CHEMSTR= <none>
##$CNST= (0..31)
1 1 145 1 1 1 1 1 1 1 1 1 1 1 1 1 1 1 1 1 1 1 1 1 1 1 1 1 1 1 1 1 
##$CPDPRG= <>
##$CPDPRG1= <>
##$CPDPRG2= <>
##$CPDPRG3= <>
##$CPDPRG4= <mlev>
##$CPDPRG5= <mlev>
##$CPDPRG6= <mlev>
##$CPDPRG7= <mlev>
##$CPDPRG8= <mlev>
##$CPDPRGB= <>
##$CPDPRGT= <>
##$D= (0..31)
0 1 0 0 0 0 0 0 0 0.06 0 0 0 0 0 0 0.0002 0 0 0 0 0 0 0 0 0 0 0 0 0 0 
0 
##$DATE= 1140771196
##$DBL= (0..7)
120 120 120 120 120 120 120 120 
##$DBP= (0..7)
150 150 150 150 150 150 150 150 
##$DBP07= 0
##$DBPNAM0= <>
##$DBPNAM1= <>
##$DBPNAM2= <>
$$ [...]
##$SUBNAM7= <"">
##$SUBNAM8= <"">
##$SUBNAM9= <"">
##$SW= 20.6930455092707
##$SWIBOX= (0..15)
0 0 3 0 0 0 0 0 0 0 0 0 0 0 0 0 
##$SW_h= 5175.983436853
##$TD= 65536
##$TD0= 1
##$TE= 293.16
##$TE2= 300
##$TE3= 300
##$TEG= 300
##$TL= (0..7)
0 120 120 120 120 120 120 120 
##$TP= (0..7)
150 150 150 150 150 150 150 150 
##$TP07= 0
##$TPNAME0= <>
##$TPNAME1= <>
##$TPNAME2= <>
##$TPNAME3= <>
##$TPNAME4= <>
##$TPNAME5= <>
##$TPNAME6= <>
##$TPNAME7= <>
##$TPOAL= (0..7)
0.5 0.5 0.5 0.5 0.5 0.5 0.5 0.5 
##$TPOFFS= (0..7)
0 0 0 0 0 0 0 0 
##$TUNHIN= 0
##$TUNHOUT= 0
##$TUNXOUT= 0
##$USERA1= <user>
##$USERA2= <user>
##$USERA3= <user>
##$USERA4= <user>
##$USERA5= <user>
##$V9= 5
##$VALIST= <valist>
##$VCLIST= <CCCCCCCCCCCCCCC>
##$VD= 0
##$VDLIST= <DDDDDDDDDDDDDDD>
##$VPLIST= <PPPPPPPPPPPPPPP>
##$VTLIST= <TTTTTTTTTTTTTTT>
##$WBST= 1024
##$WBSW= 4
##$XGAIN= (0..3)
0 0 0 0 
##$XL= 0
##$YL= 0
##$YMAX_a= 375653
##$YMIN_a= -392702
##$ZGOPTNS= <>
##$ZL1= 120
##$ZL2= 120
##$ZL3= 120
##$ZL4= 120
##$ABSF1= 16.522
##$ABSF2= -4.171173
##$ABSG= 5
##$ABSL= 3
##$ALPHA= 0
##$AQORDER= 0
##$ASSFAC= 0
##$ASSFACI= 0
##$ASSFACX= 0
##$ASSWID= 0
##$AUNMP= <proc_1d>
##$AZFE= 0.1
##$AZFW= 0.1
##$BCFW= 0
##$BC_mod= 0
##$BYTORDP= 0
##$COROFFS= 0
##$CY= 12.5
##$DATMOD= 1
##$DC= 0
##$DFILT= <>
##$DTYPP= 0
##$F1P= 14.0000005364418
##$F2P= -0.99999901652339
##$FCOR= 0.5
##$FTSIZE= 32768
##$FT_mod= 6
##$GAMMA= 0
##$GB= 0
##$INTBC= 1
##$INTSCL= 1
##$ISEN= 128
##$LB= 0.3
##$LEV0= 0
##$LPBIN= 0
##$MAXI= 10000
##$MC2= 0
##$MEAN= 0
##$ME_mod= 0
##$MI= 0
##$NCOEF= 0
##$NC_proc= -4
##$NLEV= 6
##$NOISF1= 0
##$NOISF2= 0
##$NSP= 0
##$NTH_PI= 0
##$NZP= 0
##$OFFSET= 16.522
##$PC= 1
##$PHC0= 235.6963
##$PHC1= 13.10893
##$PH_mod= 1
##$PKNL= yes
##$PPARMOD= 0
##$PSCAL= 4
##$PSIGN= 0
##$REVERSE= no
##$SF= 250.13
##$SI= 32768
##$SIGF1= 0
##$SIGF2= 0
##$SINO= 400
##$SIOLD= 32768
##$SREGLST= <1H.DMSO>
##$SSB= 0
##$STSI= 32768
##$STSR= 0
##$SW_p= 5175.98343685301
##$SYMM= 0
##$S_DEV= 0
##$TDeff= 65536
##$TDoff= 0
##$TI= <Analysis number 999999
Compound Code 99
Book Reference 9
Project Code 9>
##$TILT= no
##$TM1= 0
##$TM2= 0
##$TOPLEV= 0
##$USERP1= <user>
##$USERP2= <user>
##$USERP3= <user>
##$USERP4= <user>
##$USERP5= <user>
##$WDW= 1
##$XDIM= 32768
##$YMAX_p= 356647963
##$YMIN_p= -463840
$$ End of Bruker specific parameters
$$ ---------------------------------
##NTUPLES= NMR SPECTRUM
##VAR_NAME=  FREQUENCY,     SPECTRUM/REAL,   SPECTRUM/IMAG
##SYMBOL=    X,             R,               I
##VAR_TYPE=  INDEPENDENT,   DEPENDENT,       DEPENDENT
##VAR_FORM=  AFFN,          ASDF,            ASDF
##VAR_DIM=   32768,         32768,           32768
##UNITS=     HZ,            ARBITRARY UNITS, ARBITRARY UNITS
##FACTOR=    0.157963299565203, 1,           1
##FIRST=     4132.6476996994, 0,             0
##LAST=      -1043.33573715361, 0,           0
##MIN=       -1043.33573715361, -463840,     0
##MAX=       4132.6476996994, 356647963,     0
$$ Real data points
##PAGE= N=1
##DATA TABLE= (X++(R..R)), XYDATA
$$ [...]
15523d0810J12037k7723M348k7842k0582K86N6641L2101r7941o435P3217l128
15511E4169r3940j19043r406L7022J03967N3132j2975m4500o6828L2957k3156
15500h8601m086r7158J02278J63481j21704o042o7889j35688J09003K30375j2869
15489G1100j55845L1830J49493J4444j15706j04021K3147K0266O5748Q0667r0765
15478i642q600o2014P5833J05576l9665P9856L2863M9683j32175J675L7488o3730
15466F7148l2348o8131J3906L582j1070K1987J7018O0952J01199m7710j48871
15455b2338N7946N0858n5509k8830L4140o4531j15113J2554M5786N9914L7681
15444A2558O198n3085J63945M1983r6532O187J42849m5644j00217Q3013O5109
$$ plain form
15523 -40810 71227 43504 47852 20010 -572 -286 56355 88456 -9485 -15920 57297 54169
15511 54169 -39771 -158814 -168220 -131198 -27231 25901 12926 -31574 -98402 -65445 -88601
15500 -88601 -92687 -189845 -87567 75914 -45790 -51832 -119721 -255409 -146406 83969 71100
15489 71100 -84745 -52915 96578 111022 -4684 -108705 -85558 -65292 456 81123 -9642
15478 -9642 -18242 -80256 -4423 101153 61488 141344 174207 223890 91715 93390 130878 67148
15466 67148 34800 -33331 -19425 -15843 -26913 -4926 12092 73044 174243 126533 -22338
15455 -22338 35608 86466 30957 2127 36267 -28264 -143377 -130823 -85037 -25123 12558
15444 12558 18756 -34329 129616 171599 75067 81254 224103 178459 78242 161255 226364
15433B26364L3840p9742K5623Q2138k653j86736n3502j2670J5741J08196M5093
15422B01692q2907R3169J1401q0238N0547q3626j08345M3591J3886O4271J21369
15411B44810p4702j43804p4791J3154L5802m9096k784J16426o555r4451j2039
15400d8030J4840Q9401M0994q9091R129o0214O8884q4933K6423O1278p8351j29715
15388a79385n3745K04R4843J28242l2653j7123q142P180j08520j6692m1252j9569
15376b46612N0740l003J31795J18755k2393m6226q9058K8289R2419J02882o341
15365A11247q1823m275n2836m5313P477K823m4458j55256k2485J74534R9568j0966
15353b1763L9574N2924q354j04996J5588Q308Q3870P2829n0965j15551K3515R1654
$$ plain form
15433 226364 260204 180462 206085 288223 285570 98834 45332 32662 48403 156599 201692
15422 201692 118785 211954 223355 143117 193664 110038 1693 45284 59170 123441 244810
15411 244810 170108 26304 -48487 -35333 469 -48627 -51411 65015 58460 -35991 -48030
15400 -48030 -33190 56211 97205 8114 17243 -42971 25913 -59020 -32597 28681 -49670 -179385
15388 -179385 -233130 -232926 -138083 -9841 -42494 -59617 -67759 -60579 -169099 -185791 -227043 -246612
15376 -246612 -195872 -198875 -67080 51675 29282 -16944 -106002 -77713 14706 117588 111247
15365 111247 29424 25149 -27687 -73000 -65523 -62700 -107158 -262414 -284899 -110365 -10797 -21763
15353 -21763 17811 70735 62381 -42615 -27027 -18719 65151 137980 87015 -28536 -5021 86633
15341H6633M7010p4178j5407O8065Q715n3241j3383q1122j47996N0375m0223o3278
15329b28030n9718Q135P3249J16282Q0748m7657r751k6424r6615J53681J28085
15318I1985J2225q7747M9671l1019j07900K2917Q2307l3432o8862j37041j7971
15307b24867P6887Q5591P4550R16n0244l5165n729k1815m345K4129k6465j08639
15295b15196M8830J11941L9290J1678j9731O3991O3904j35539l7712Q0158R264
15284B0878j30853J3226P9142k6120n3103J56749J7607p7533J2523n8474n4338
15273a00296J32095Q163M3055j6803j08962j52714J08160K9795n231R2148m527
15262B4883p206j03653K2446M8440l0919l7426n1473Q3776j3633q1119J3748O8883
$$ plain form
15341 86633 133643 59465 44058 112123 120838 67597 54214 -26908 -174904 -124529 -164752 -228030
15329 -228030 -287748 -279613 -206364 -90082 -9334 -56991 -66742 -93166 -189781 -36100 91985
15318 91985 104210 16463 66134 35115 -72785 -49868 32439 -993 -69855 -206896 -224867
15307 -224867 -147980 -62389 12161 13077 -37167 -72332 -78061 -99876 -104221 -80092 -106557 -215196
15295 -215196 -166366 -54425 -15135 -3457 -23188 40803 104707 -30832 -68544 11614 20878
15284 20878 -109975 -96749 -17607 -43727 -96830 59919 77526 -7 12516 -45958 -100296
15273 -100296 31799 39962 83017 66214 -42748 -195462 -87302 -57507 -62738 29410 24883
15262 24883 17677 -85976 -63530 -15090 -46009 -83435 -134908 -51132 -64765 -145884 -132136 -63253
15250f3253l4026o6037n8061K6000N0170N7732R1664M7132J03673J02378j00925
15239A56447j26499m5177J43411K5725r5738n1219Q093j47410n4625R2386J19264
15228B4658Q5701l0024K0617J14060O006j56673r3687k7909J1514K3539j3840
15217c6038J14581M2601j03385j84922m830O3096Q5712K8431J1516j48994l7247
15206a69479O1671o296M6987M7216o5107M5164j7900K1656r7242j0793J99673
15195E5550l0986K9091k4439j03807j19965j68132P4267R0712J7540N9525R4539
15184b6105J1162R2824J77378M2108j77024j60686o2082J8948J17041Q9159j22013
15173G10n3508J00686P3772K2332l3139P3848o9203q2961j15584m8630J1340m2370
$$ plain form
15250 -63253 -97279 -163316 -221377 -195377 -145207 -87475 4189 51321 154994 257372 156447
15239 156447 29948 -15229 128182 153907 58169 6950 15043 -132367 -186992 -94606 24658
15228 24658 110359 80335 100952 215012 221018 64345 -29342 -57251 -45737 -22198 -36038
15217 -36038 78543 121144 17759 -167163 -171993 -108897 -23185 5246 16762 -132232 -169479
15206 -169479 -107808 -114104 -67117 -19901 -85008 -39844 -57744 -36088 -133330 -144123 55550
15195 55550 24564 53655 29216 -74591 -194556 -362688 -288421 -197709 -180169 -120644 -26105
15184 -26105 -14943 77881 255259 297367 120343 -40343 -102425 -83477 33564 122723 710
15173 710 -52798 47888 121660 143992 110853 184701 115498 32537 -83047 -131677 -120337 -162707
15161a62707P3490K1666Q6036M9152m1566O8287O5115j23262j4576J0231M541
15150C6407m519r3811j10869O8573J12367N4869k62089j04521j6906J31319J28169
15139f1011Q7037o1160M2848J24471p629k8577l4029n8455j0364N3033Q2205J03971
15127B32340K4821r664j13392j63663j12216R2400J09042k2528j13538J8151J352
15116e6895l3943P1021N2054r7484r2511K6733P7526r2977o8996M5780P3015N4679
15104d1998K7779K0423n0250M1406J57147J6436q3044j19953J3379N5377M6709
15093H3411l6514p520r0774m056J863N6534J42005K4600q1857m6664M6139N5547
15081A42714Q774m5598k6562k0440q5497q3367k0746J02659O38l2202m571k6442
$$ plain form
15161 -162707 -89217 -67551 18485 67637 26071 94358 159473 36211 21635 31866 36407
15150 36407 31888 -61923 -172792 -104219 8148 63017 -199072 -303593 -320499 -189180 -61011
15139 -61011 26026 -35134 7714 132185 124556 95979 61950 3495 -6869 46164 128369 232340
15127 232340 257161 247497 134105 -29558 -141774 -49374 59668 37140 -76398 -58247 -56895
15116 -56895 -90838 -19817 32237 -65247 -157758 -131025 -53499 -146476 -215472 -169692 -96677 -41998
15104 -41998 -14219 6204 -44046 -2640 154507 170943 87899 -32054 -18675 36702 83411
15093 83411 46897 39377 -51397 -55453 -53590 2944 144949 169549 87692 41028 87167 142714
15081 142714 151488 105890 79328 58888 -26609 -109976 -130722 -28063 -27425 -59627 -64198 -90640
15069i0640j2521K2680l0412R7862J13860q4435P1075n511j89847j12171R7864
15058a22196M9360J28570J4227L8839o469j12967m7299O7439N8347N8055M643
15047A30549l2391n9553j16220q7290N1659P9794J37886j3061j23973j22281R270
15036a45611R454Q940J25253K3954q5003M9445O2316O8491L4479j10380N94j05184
15024f3252j40570l5702Q4515K70797R0085p6104o9142R8904J8879n5391N8971
15013A81990j02677j22055m7602k1506l816N3293M377R7591N6710K7171M4633
15002A68109L0860l1628r190o9136R859j13297o2585k1411J3141J14889k387K6057
14990E3281J03285L849p4780r8116l4679o239k6344j32135J1750R0461Q5752k0381
$$ plain form
15069 -90640 -103161 -80481 -110893 -13031 100829 16394 87469 81958 -107889 -220060 -122196
15058 -122196 -72836 55734 69961 108800 102331 -10636 -57935 9504 67851 125906 130549
15047 130549 98158 38605 -77615 -164905 -113246 -33452 104434 91373 -32600 -154881 -145611
15036 -145611 -136157 -127217 -1964 21990 -63013 -13568 48748 117239 151718 41338 41932 -63252
15024 -63252 -203822 -239524 -155009 115788 205873 129769 60627 159531 178410 123019 181990
15013 181990 79313 -42742 -90344 -111850 -115666 -62373 -57996 39595 96305 123476 168109
15002 168109 198969 167341 158151 89015 98874 -14423 -77008 -98419 -85278 29611 27224 53281
14990 53281 156566 160415 85635 -12481 -47160 -53399 -79743 -211878 -200128 -109667 -23915 -44296
14978d4296M8577J4108N7335Q4864l0595j94998J21282J8253p2698K7281j3892
14967A5221N7063O628j5538r4564n4555K4981N1322M1651j4493n0222p5131R001
14955i8636p0353O1421P8896K8411M438q2660R2143P7107M990o4185n5989M0817
14943A6400N09N5268N2855J7019o2700l5219j15830m4217N231N5460J6767l8286
14931g6743j8767J28627N6408j93716J7372Q6009J7782o452j4235l6824l1969
14920g2508M7945P9567Q9174K4567k6901m0678o1683j25004k8929N1181r553j40646
14908b13468m0415P0560J21678j04129n2403j6540Q9024J13669l0490p4437j4159
14897a51110m3068J16407J1801j52689K8050K04460j6319L3227N7259j5681l049
$$ plain form
14978 -44296 4281 18389 75724 160588 129993 -65005 56277 74530 1832 29113 15221
14967 15221 72284 78912 63374 -31190 -85745 -60764 -9442 32209 17716 -32506 -107637 -98636
14955 -98636 -168989 -107568 -28672 -261 4177 -78483 13660 90767 95757 31572 -24417 16400
14943 16400 16909 72177 125032 142051 79351 44132 -71698 -115915 -110684 -55224 -38457 -76743
14931 -76743 -95510 33117 89525 -104191 -86819 -810 16972 10520 -3715 -40539 -72508
14920 -72508 -24563 55004 144178 168745 141844 101166 39483 -85521 -114450 -63269 -72822 -213468
14908 -213468 -253883 -183323 -61645 -165774 -218177 -234717 -145693 -32024 -62514 -136951 -151110
14897 -151110 -194178 -77771 -65970 -218659 -190609 13851 -2468 30759 88018 72337 69288
14886F9288K5563l3125o6856j28718R1115K14265l9120r8875O0585k7376n6204
14875A0542k9552M9860j7999M6087Q8905j08105M370q5602q1182L3021Q752j29231
14863b10134Q374P8440J35315N2107p8363r67K0145K2948K176n3197J201n3399
14851g5354O1157j9823n9922J2937j3150j54116m9596j47818J29819J51041J70148
14840E323M207j00420j35254J05861O9042R3174M0591K0049j44332j53733J39303
14829e6189J17381j03865j08356o4224k4118N6989K5929k5931J63957P3511N006
14818F0090p3129j04070j37060l189J66310L3094N8018Q0696l115j39302m0103
14807a01760N6819j0379j2987n2921Q7637o7124m0617K1331J04330Q1134j6097
$$ plain form
14886 69288 94851 61726 -5130 -133848 -42733 171532 132412 33537 94122 66746 10542
14875 10542 -19010 30850 12851 58938 147843 39738 44108 -41494 -122676 -89655 -80903 -210134
14863 -210134 -201760 -123320 11995 64102 -14261 -15228 4917 27865 30041 -23156 -21955 -75354
14851 -75354 -14197 -34020 -93942 -81005 -94155 -248271 -297867 -445685 -315866 -164825 5323
14840 5323 9530 -90890 -226144 -120283 -51241 41933 82524 102573 -41759 -195492 -56189
14829 -56189 61192 -42673 -151029 -215253 -239371 -182382 -156453 -182384 -18427 55084 60090
14818 60090 -13039 -117109 -254169 -257358 -91048 -57954 64 80760 77645 -61657 -101760
14807 -101760 -44941 -55320 -68307 -121228 -33591 -100715 -141332 -120001 -15671 65463 49366
14796D9366l4577n054N2464j04839L917P2213M7516j09385r466J13933J15616
14785A91704j26411m5754k0864K3048R803J6066m7087j2861k6291P2310J13946
14774A47609l0782p9638q8204J3779K0817J2369L8402o1540q6753P3639N8029
14763A7727j01024L3505m2167K3251K02573L1594p3282J51986k9488j54345q6150
14752b5820J9151q127J75717J3924j34956J7300L0847m5732j0732j17356r9737
14741a85521K8010R0417K1462r972j2967l3824L0163K7574r4184p516N8166m5776
14729a33968L2607L3842l2474j14293O7801J12120J6783J8786K7240l8120p4020
14718h3696p746M6777J3765M6775l4893N3183n5499m2711M49q1491R2887P2541
$$ plain form
14796 49366 14789 9735 62199 -42640 -38723 33490 81006 -28379 -37845 76088 191704
14785 191704 65293 19539 -1325 21723 31526 47592 505 -12356 -38647 33663 147609
14774 147609 116827 37189 -51015 -37236 -16419 -4050 34352 -27188 -113941 -40302 17727
14763 17727 -83297 -49792 -91959 -68708 133865 165459 92177 244163 214675 60330 -25820
14752 -25820 -6669 -14796 160921 174845 39889 57189 88036 42304 31572 -85784 -185521
14741 -185521 -157511 -67094 -45632 -55604 -68571 -102395 -72232 -44658 -138842 -146358 -88192 -133968
14729 -133968 -101361 -67519 -99993 -214286 -146485 -34365 -17582 1204 28444 -9676 -83696
14718 -83696 -91442 -44665 -30900 15875 -19018 34165 -21334 -64045 -63596 -145087 -52200 20341
14706B0341l8948N7562K0910r432q5823O2639j34935r8671Q6768o6679m2470l9317
14694b68055R5502P6078K449l943K519N6502L1903j07814r5233J45259R3496n2828
14682b4165P6903k2059j95901k3482N2136j3171n7618N2611M9093L9138R5125
14671B8610N0206M3497j33646p5746J03899n9588p266P3303O2612m6816k8280
14660A0785R7729p2364l0741J8808J7871M313k1414r3158K6866N6712k5922q1420
14648i1935n9408q8157L6779N7775K5486K9156o3561n8864N0534P3134N1111m289
14636d2239m8429J3853J8800J10o8893K8729R5541L9776j8889j19088l5271o479
14624a42479J38173J52863r4907j30357j2460L5918J13114k8521j25123J10159
$$ plain form
14706 20341 -18607 38955 59865 50433 -35390 27249 -107686 -206357 -119589 -186268 -228738 -268055
14694 -268055 -172553 -96475 -94026 -97969 -95450 -38948 -7045 -114859 -210092 -64833 28663 -24165
14682 -24165 52738 30679 -165222 -188704 -136568 -149739 -207357 -154746 -105653 -66515 28610
14671 28610 78816 122313 -11333 -87079 16820 -42768 -50034 23269 85881 39065 10785
14660 10785 108514 36150 5409 24217 42088 46401 24987 -68171 -41305 15407 -10515 -91935
14648 -91935 -151343 -239500 -202721 -144946 -119460 -90304 -153865 -212729 -162195 -89061 -37950 -42239
14636 -42239 -90668 -76815 -58015 -57905 -126798 -98069 -2528 37248 18359 -100729 -136000 -142479
14624 -142479 -4306 148557 53650 -76707 -89167 -53249 59865 31344 -93779 16380
14614A6380R8071M8018o0719J4143J8122j3841L5867l523p7248j43645j98470
14603b66845O2170J5212O2171J08855N4784m8128q1446k1372N5326O7750J7489
14592B5966p7980j0374r061J2454l8452J206Q234J67837K9407j23301K1207k2117
14580a4974j2340J84712Q5349r5131o6430L5707o9273j28029N2293n4490q2611
14569a65217N7573O2567j31295m1949Q2727L5706m2987Q1911L4093o2943O4142
14558b5672M7315j9062j6607K109n0896L8764j7221N2395J28130q4392j28768
14547g3905j07322m4832Q2946J11873O0683K3258m9081n4816l0374M5975M3142
14536G547L821q239o0976o4768k8868O2067J5743m9486k3076J2022Q9035j3798
$$ plain form
14614 16380 114451 162469 101750 115893 134015 120174 156041 152518 75270 -68375 -266845
14603 -266845 -204675 -189463 -127292 -18437 36347 -11781 -93227 -114599 -59273 8477 25966
14592 25966 -52014 -62388 -71449 -58995 -97447 -96241 -88007 79830 109237 -14064 7143 -14974
14580 -14974 -27314 157398 242747 147616 81186 116893 47620 -80409 -28116 -82606 -165217
14569 -165217 -107644 -45077 -176372 -218321 -135594 -99888 -142875 -60964 -26871 -89814 -25672
14558 -25672 21643 2581 -14026 -11917 -62813 -24049 -41270 11125 139255 54863 -73905
14547 -73905 -181227 -226059 -143113 -31240 29443 52701 3620 -51196 -81570 -35595 7547
14536 7547 11368 3129 -57847 -122615 -151483 -89416 -73673 -123159 -146235 -134213 -45178 -58976
14524e8976Q1665j3340k7773J0919r835j2169j947l9886j21033o0545o331M5082
14512b14169k6819K3124J29387j7312o0017K1607K2446l3117o9238R5422P5317
14501e3369j9981L3353l4777p8500l3332k1320N9867R8726Q42R3823P3355k4998
14489I3689j82714p110J9037J18898K2791q3877m2828O6127K7135R750K2009M8367
14477A11274L0487n1089o483p4030j03681N3900k3009n4344L4487O5821J7236
14466E69q2509M8497J00019n713J1508o0279O4221j01849j15345k2651M7739N5079
14454f0714M2932J656Q6166k6161n1499J11806l0530j48041m156J5776k895J54373
14442H8713P7895K4550j11446j6312o0779j84894j00412J45303K1310K0146M1860
$$ plain form
14524 -58976 22689 9349 -18424 -7505 -17340 -29509 -31456 -71342 -192375 -252920 -259251 -214169
14512 -214169 -240988 -217864 -88477 -105789 -165806 -144199 -121753 -154870 -224108 -128686 -53369
14501 -53369 -73350 -39997 -74774 -153274 -186606 -207926 -148059 -49333 -48491 45332 118687 93689
14489 93689 -89025 -96135 -77098 41800 64591 -19286 -62114 4013 31148 40898 62907 111274
14477 111274 141761 90672 84189 10159 -93522 -39622 -62631 -116975 -82488 -16667 569
14466 569 -81940 -33443 66576 60863 72371 12092 76313 -25536 -140881 -163532 -115793 -60714
14454 -60714 -17782 -16126 70040 43879 -7620 104186 73656 -74385 -78541 -62765 -65660 88713
14442 88713 166608 191158 79712 63400 2621 -182273 -282685 -137382 -116072 -95926 -54066
14431e4066q7176O3317L2597M4036j01194n5497J10575Q2378k8233J8946R2514
14420A18197j436P0403m3541j52990l1858k2976p2986j25334m586O3352k806R9340
14408a07221Q9034n1971J22851J18482k7662k3202K2091L1719L9196j2020j9947
14397A81350J47956q5492k55803j31248r6368M9942J20925R5890J0701m3329O7710
14386F2234Q1511P5571m3978O8214Q4605j50320r592J83993O606j83751j72698
14375B395j3634n0389n3288k3386R2234J5249m9781K761J37865j5801J374o994
14363C8605R5500J19281j9506J8250n7663j15027k18580o5739j42973J09645M0148
14352a98059l8975O1828J45680J90270n3039R220q3535j9931P4034k6332j56109
$$ plain form
14431 -54066 -141242 -77925 -45328 -1292 -102486 -157983 -47408 34970 6737 25683 118197
14420 118197 116761 187164 143623 -9367 -41225 -64201 -137187 -262521 -267107 -203755 -206561 -107221
14408 -107221 -18187 -70158 52693 171175 143513 120311 142402 174121 213317 201297 181350
14397 181350 329306 243814 -11989 -143237 -239605 -189663 -68738 27152 37853 -5476 62234
14386 62234 143745 219316 175338 243552 328157 177837 168245 352238 358844 175093 2395
14375 2395 -11239 -61628 -114916 -138302 -46068 -30819 -80600 -77839 60026 44225 45599 38605
14363 38605 134105 253386 233880 252130 194467 79440 -139140 -204879 -347852 -238207 -198059
14352 -198059 -237034 -175206 -29526 160744 107705 116925 33390 13459 87493 61161 -94948
14341i4948j8677m3311P2567K1888M0238J02853j34567n0881l74L4126n2418M9052
14329g4452J09536k0751J8676l8648J0500l2341k1207N3694n4039J3171J30563
14318I4702J00580n7209n9787j02810o6178j3798q48k6681K7767j09728K920K2252
14306a88818J07288M0061K1062P585M2123j7465J06303j9821j02247Q8042l3611
14295E0502k0554p2666l8790m315p475m7902O1754O2025j1423L3068r0740P2236
14283a4280L1515o8310j23368K7407R3053J02597J5721j9050j19769j12094P6173
14272a10405M7324j8548q5494J37725J71266K4427j3831j09561j14130M4605j6360
14261d2982k3433m0193M2663M6108m2599Q4910N3070m6853J9076j4443k9645N9630
$$ plain form
14341 -94948 -113625 -156936 -84369 -62481 -22243 80610 -53957 -104838 -105212 -71086 -123504 -74452
14329 -74452 35084 14333 33009 -5639 4861 -27480 -48687 5007 -49032 -35861 94702
14318 94702 195282 138073 78286 -24524 -90702 -104500 -105348 -132029 -104262 -213990 -211070 -188818
14306 -188818 -81530 -41469 -20407 -12822 29301 11836 118139 98318 -3929 84113 50502
14295 50502 29948 -42718 -81508 -85823 -93298 -141200 -79446 -17421 -28844 4224 -86516 -14280
14283 -14280 17235 -51075 -174443 -147036 -53983 48614 64335 45285 -74484 -186578 -110405
14272 -110405 -63081 -81629 -167123 -29398 141868 166295 152464 42903 -71227 -26622 -42982
14261 -42982 -66415 -106608 -63945 -17837 -60436 24474 77544 30691 49767 35324 5679 65309
14249F5309L4456q9624r012m9947n6711m9602J07560J5045N852o4355M8064N2748
14237I783J9504n7094N8901o5903O0489k2760m4276l9151K3795L2018J46163M2580
14225A64049j13142j00139R7224J06610r0950q9841p4123j28603J9467J31073
14215g8375K2500r5931O6628M8258j7008R3620l957j4781j16945j14974L5543
14204a75422J66367J24120Q3898k782M1321o505j12594m0261K0868J50393Q8335
14193C37738k9645p6472j11805p2750l5122q7047j4972k0350j9103M1476R1357
14182C305j44758q6877n0587J14674k7559n5601p2345J16062J9707N0941o2925
14171a95963P4370Q1041n381m5159j377L2759J03668m3621l5439j22184o679R9441
$$ plain form
14249 65309 99765 10141 1129 -48818 -105529 -155131 -47571 -32526 -26674 -91029 -42965 9783
14237 9783 29287 -27807 31094 -34809 25680 2920 -41356 -80507 -56712 -24694 121469 164049
14225 164049 50907 -49232 47992 154602 63652 -26189 -100312 -228915 -209448 -78375
14215 -78375 -55875 -151806 -85178 -36920 -53928 39692 35735 20954 -95991 -210965 -175422
14204 -175422 -9055 115065 198963 196181 237502 230997 118403 78142 99010 249403 337738
14193 337738 308093 231621 119816 47066 11944 -75103 -90075 -110425 -129528 -88052 3305
14182 3305 -141453 -228330 -278917 -164243 -191802 -247403 -319748 -203686 -183979 -133038 -195963
14171 -195963 -121593 -40552 -45933 -91092 -92469 -59710 43958 337 -35102 -157286 -163965 -64524
14159f4524l1757j34911K8492L6602j7190M6817M8269P0538R6356J13593j6534
14148A75751j12493q5177L4485O7496k8964k48N5872P7608o4552l7614J5746l2742
14136F5168j10317p8795Q9090J03607J0560p6046n497p1116j30158j85996J93544
14125a95956J53400O8124M4208j4753k7515r8958j21862p1463J01219l188R1336
14114g5408Q9627J9121r4015j26242R4476J57690j7492j75027j2086J19935q5790
14103a05211j11094k0668J93575Q2397K3808n5160j42877j3053Q2538J6241p1836
14092a21340m2215m2988P0991O5802K6340K6548L5789O7635l4477m0195j50257
14081a38367O7188j2980k9874N6884J17702P6462n5616m1430J2514k0640n8889
$$ plain form
14159 -64524 -96281 -231192 -202700 -166098 -183288 -136471 -88202 -17664 78692 192285 175751
14148 175751 63258 -21919 12566 80062 51098 50850 106722 184330 119778 82164 97910 65168
14136 65168 -45149 -123944 -34854 68753 79313 3267 -2230 -73346 -203504 -389500 -195956
14125 -195956 -42556 25568 69776 55023 27508 -71450 -193312 -264775 -163556 -166744 -75408
14114 -75408 14219 33340 -60675 -186917 -92441 65249 47757 -127270 -139356 -19421 -105211
14103 -105211 -216305 -236973 -43398 38999 62807 7647 -135230 -148283 -65745 -49504 -121340
14092 -121340 -163555 -206543 -135552 -69750 -43410 -16862 18927 86562 52085 11890 -138367
14081 -138367 -71179 -84159 -114033 -57149 60553 137015 81399 39969 52483 31843 -27046
14070b7046P049k3906n3126m7251M857R9135R598M0681q044p5466q0938m4998
14058a99455o5775k3500J96616J7243O3935j251N1785N5187r2193L3031O1998
14047I7621K0744J1226j256L8500k3798p5674q138o8821q0739M3169l9538J8079
14035f8625K3746K5700j2856P1493K4467m0039m5040k8500m2175R8928P1380k7455
14023E1024p6302l8417m4133J5753j2095P0142l9120P517L0140l606L1583Q192
14011F78J15861j00706r2959l334P1580M7049j25345r3251P491P1461R609m3673
13999a35539L764J8363l5629J13951N8375k2597O9908L323j13538j23415k05q801
13987a72040J07075P1491k0392r0458o532K6610J08574M3551k0139o6013L9747
$$ plain form
14070 -27046 -19997 -43903 -97029 -144280 -139423 -40288 -30690 9991 1947 -73519 -154457 -199455
14058 -199455 -265230 -288730 -92114 -74871 -10936 -12187 39598 94785 2592 35623 97621
14047 97621 118365 129591 128335 166835 143037 67363 59225 -9596 -90335 -47166 -86704 -68625
14035 -68625 -44879 -19179 -32035 39458 63925 23886 -21154 -49654 -91829 7099 78479 51024
14023 51024 -25278 -63695 -107828 -92075 -104170 -34028 -73148 -65631 -35491 -39097 -7514 678
14011 678 116539 15833 -77126 -80460 -8880 38169 -87176 -180427 -172936 -101475 -91866 -135539
13999 -135539 -131775 -113412 -149041 -35090 23285 688 70596 73919 -39619 -163034 -163239 -172040
13987 -172040 -64965 6526 -13866 -104324 -110856 -84246 24328 67879 47740 -18273 21474
13976B1474J28139Q5791N216J1279M603p6765j08404n180r005J9153r187n0402
13964A6712J8376j1611n8778K1285o1711O2705J2244N0255J4975j11243q7211
13953a34002r447L4395P7311M656m3672l6029K1275m6034K091K551o049J47434
13941A4480M2683m4783N0338p6621j5974l1408N2834K9886k6197l6379J19469
13930G8328P7904n5480N7110r6648Q7916M7453m4055n9765L1581r908k03245k853
13918i1662J68327O3815q6694m26j36147l709L8636L5168J33780R6331O6527q7155
13906A96791L2008K3063o5741l0415j31561p7979M7914L5102M1575p128q584M6080
13894A01125k3546m9431R141k5186j32736M0383N1497m8998J8483q0005m3569
$$ plain form
13976 21474 149613 235404 240620 251899 256502 179737 71333 66153 57148 76301 67114 16712
13964 16712 35088 23477 -35301 -14016 -75727 -13022 -778 49477 64452 -46791 -134002
13953 -134002 -143449 -109054 -31743 -27087 -70759 -106788 -85513 -131547 -129456 -126905 -132954 14480
13941 14480 57163 12380 62718 -13903 -29877 -61285 -8451 21435 -4762 -41141 78328
13930 78328 156232 100752 157862 61214 149130 196583 152528 92763 124344 114436 -88809 -91662
13918 -91662 76665 140480 53786 53360 -82787 -86496 -47860 -12692 121088 217419 283946 196791
13906 196791 228799 251862 186121 155706 24145 -53834 -5920 29182 70757 63629 55045 101125
13894 101125 77579 28148 37289 12103 -120633 -80250 -28753 -77751 -59268 -139273 -182842
13883a82842j7294J1376r8050o7849O848Q6235J51716J00418k2549P6435m4417
13872B7k5947M734J33996l6383r4403O0858J08627O9796q178j15909o4558p3162
13860d0502l286j01109L9957L3823R2097R6822j4015J4469K1359O4898M3790j15137
13848A33166k8544L2454m8603j28098r7727j4106R8428L0408j07412j48712L0535
13837b48211N2497K0019O6480N5988L0968J2502k02905M0679J07557o264N0162
13826b0528O2947l9436k8119m9598r695J4545K061J8637Q776j8449J04972Q7066
13814A33179J6654j00562j43923j35337J40074J96305j28418j53872M1129R6486
13804c8285M3163M3404j13129j55718l2784J53186J924Q004R9979q233J49924
$$ plain form
13883 -182842 -200136 -188760 -286810 -354659 -347811 -261576 -109860 -9442 -31991 44444 27
13872 27 -25920 -21186 112810 76427 -17976 42882 151509 221305 213127 97218 32660 -40502
13860 -40502 -43788 -144897 -104940 -71117 20980 117802 103787 118256 139615 204513 248303 133166
13848 133166 104622 137076 88473 -39625 -137352 -151458 -53030 -22622 -130034 -278746 -248211
13837 -248211 -195714 -175695 -109215 -53227 -22259 -9757 -212662 -171983 -64426 -70690 -20528
13826 -20528 42419 2983 -25136 -74734 -84429 -69884 -67823 -49186 -40410 -58859 46113 133179
13814 133179 149833 49271 -94652 -229989 -89915 106390 -22028 -175900 -134771 -38285
13804 -38285 4878 48282 -64847 -220565 -253349 -100163 -98239 -90235 9744 1511 151435
13793A51435L403o3060M0008j0708K611M0635l759j7253j70946j22566m9646J1542
13781a88304K5228J17122J63913o5294L4015j43852j02538l5344k1847J23015
13771i3886K806P1668Q0013r9134n9054N5366n6886M4407J5807m131k4557N033
13759f2548N6695q8671j22319O9117J16526j7116o8224j19186o2383j0771J51899
13748a56981l312p2829l5699K8579J35501P5323j14208q6280O9984P0202M6218
13737d3502J63789N5454l3043j4101j15727j07980n0133p8225K2242Q8642J75427
13726F2843K5055j2247J62458l513o5557m3750j30742p2939Q8321O5990n7915
13715A8004o0881j28142N2662J38925N1947K8397M5927M7710k0837p8854Q3691
$$ plain form
13793 151435 154838 91778 131786 121078 123689 164324 160565 143312 -27634 -150200 -199846 -188304
13781 -188304 -163076 -45954 117959 52665 86680 -57172 -159710 -195054 -216901 -93886
13771 -93886 -91080 -19412 60601 -38533 -97587 -42221 -99107 -54700 -38893 -43024 -67581 -62548
13759 -62548 -5853 -94524 -216843 -147726 -31200 -48316 -116540 -235726 -298109 -308880 -156981
13748 -156981 -160293 -233122 -268821 -240242 -104741 -29418 -143626 -229906 -159922 -89720 -43502
13737 -43502 120287 175741 142698 128597 12870 -95110 -145243 -223468 -201226 -112584 62843
13726 62843 87898 75651 238109 234596 169039 125289 -5453 -78392 9929 75919 18004
13715 18004 -42877 -171019 -118357 20568 72515 100912 146839 194549 173712 94858 178549
13704A78549k01533k40828P4621O2079Q9113O7181l1589j11143j25849n0238m2542
13693c32179J21839K12022J13424Q9116q802j71543q0230M8773j6180l150o2990
13682h9900J5609k9442K0235N7811n425K1503L9959j4315m8721n3720J7666M4528
13670b4212J28586j27971k8517R0845K2052L1150J30186j49039j11827O6487J55454
13659A83194Q6477j45855j36904m410m1525J16090p3729M4735O7029k3624k1486
13648D9992r4571o160k2893n4987k6242K6155k961q177J49914L6877N5784j13262
13636a0531k06072L5022K17063L9558j10503k2296M6448O8546l0826P434K1580
13625E5423n898J3728k7400j32642r3474J121J3463j6202J31724R9188K2176J3628
$$ plain form
13704 178549 -22984 -263812 -189191 -127112 -37999 29182 -2407 -113550 -239399 -289637 -332179
13693 -332179 -210340 1682 115106 204222 195420 23877 -56353 -7580 -23760 -26910 -89900
13682 -89900 -74291 -103733 -83498 -25687 -31112 -9609 30350 16035 -32686 -86406 -68740 -24212
13670 -24212 104374 -23597 -52114 38731 60783 91933 222119 73080 -38747 27740 183194
13659 183194 269671 123816 -13088 -17498 -59023 57067 -16662 28073 95102 71478 49992
13648 49992 -44579 -50739 -73632 -128619 -154861 -128706 -131667 -139844 10070 46947 102731 -10531
13636 -10531 -216603 -181581 35482 75040 -35463 -57759 -11311 57235 26409 33843 55423
13625 55423 49525 63253 35853 -96789 -190263 -189142 -175679 -191881 -60157 39031 61207 74835
13613G4835K024K5405P7881n9890Q6828j32840j25636O5149M8927o5402O7597
13602F4878J16782j86285k2168n9062j50222K8073J75215J34583M4979k2492p6568
13591D7713M6893J09718j08323M2158P8098k11965r9689k7961J84646J10620q7894
13580H4014m9906j01392j22419R3440J93746N7545l2306p7735q5414R7856k2665
13569C4764k3419j79136K238P3562Q9623m7293m4228m7414r015M7897L2473m8085
13557a18033R3339O6884J3333j19627q5474J30435P0695o7278n0302M3736N8235
13546C5943P9130K3548m3134N5203J25364J07627K6241Q240q2310n5444j55903
13535A24505l9277M4043p7084o3193P4356R440r4045k4507J8887j1669J09352
$$ plain form
13613 74835 76859 102264 180145 120255 207083 74243 -51393 13756 62683 -2719 64878
13602 64878 181660 -4625 -26793 -85855 -236077 -208004 -32789 101794 146773 124281 47713
13591 47713 94606 204324 96001 138159 216257 4292 -95397 -123358 61288 171908 84014
13580 84014 34108 -67284 -189703 -96263 97483 155028 122722 44987 -40427 57429 34764
13569 34764 11345 -167791 -165553 -91991 -2368 -49661 -93889 -141303 -150318 -102421 -69948 -118033
13557 -118033 -24694 42190 55523 -64104 -149578 -19143 51552 -15726 -66028 -22292 35943
13546 35943 115073 138621 95487 150690 276054 383681 409922 418162 335852 280408 124505
13535 124505 85228 129271 52187 -11006 63350 72790 -21255 -45762 -26875 -38544 70808
13524G0808j5605o0286Q3831J12047j165j19415j2726l957j3649k6487k1117m85
13512h206L2745P8204L5467k2874J1796N0748N370m6022J5382j62634j50737K5139
13500a35622Q7814R1581o815r9130m0152o0250L7204O2845J01842P3236J0012
13489A22565r4061m4801N091l0572j28377o0742L2359j2275N1644J22501J64794
13478A28126m5447q462j32128p4282Q1471R3536J2355J7782o3224j00631q6079
13467a76983J13514J29145O359M6574J15052J2891L7776q5657m1381r242l0356
13456A17692j22028n622j6963r3419J47373M2898l6989o0198l228K4084o62K186
13444d876L9652n2116l3062K634J2038N1603L4849p7684j0757j4808q01o7503
$$ plain form
13524 70808 55203 -5083 78748 190795 189630 70215 57489 53532 39883 13396 -7721 -8206
13512 -8206 24539 102743 138210 115336 127132 177880 183250 137228 152610 -10024 -160761 -135622
13500 -135622 -47808 43773 36958 -62172 -102324 -162574 -125370 -62525 39317 112553 122565
13489 122565 28504 -16297 -11206 -41778 -170155 -230897 -198538 -210813 -159169 -36668 128126
13478 128126 82679 74217 -57911 -132193 -50722 42814 55169 72951 9727 -90904 -176983
13467 -176983 -63469 65676 72035 118609 233661 246552 284328 198671 157290 148048 117692
13456 117692 -4336 -9958 -26921 -120340 27033 69931 32942 -27256 -30484 -6400 -7062 -4876
13444 -4876 34776 -17340 -50402 -47768 -35730 15873 50722 -26962 -37719 -52527 -53328 -120831
13432a20831O0941Q3567j32312K157n8237N6928J18587P9140J22308q0975q7690
13421D3583K5518N209m5038L831M642J2633n5256j38658N9722K8705j19007M861
13409a69255P4073R2755R303p4717M78L8353N3634J19073J26768j8368j19020
13398A33077r3357J9250o7277j07693r4396N7465J59162q5614o1943J3333J39844
13387A1851J09417j3024j20270j33447k9765J60806L7542M7080m2314J03867R2838
13376B24581k5816j69642k8991l3680m2363P0258j4313n6970n0421Q996Q0764
13365c7597J78535n2600p8708n1097L4118L2917L4609N5790l0714j46636q824
13354g0207Q5405K2049J31246m3121j6320j32551j52469O2745J50044O2898l0639
$$ plain form
13432 -120831 -59890 23677 -108635 -106478 -164715 -107787 10800 89940 212248 131273 43583
13421 43583 69101 74310 29272 33103 37745 50378 -4878 -143536 -83814 -55109 -174116 -169255
13409 -169255 -95182 -2427 6876 -67841 -67363 -29010 24624 143697 270465 252097 133077
13398 133077 39720 58970 -8307 -116000 -210396 -152931 6231 -79383 -141326 -127993 11851
13387 11851 121268 108244 -12026 -145473 -175238 -14432 23110 70190 27876 131743 224581
13376 224581 198765 29123 132 -33548 -75911 -5653 -19966 -76936 -127357 -118361 -37597
13365 -37597 140938 88338 9630 -41467 -7349 25568 60177 115967 85253 -61383 -70207
13354 -70207 15198 37247 168493 125372 109052 -23499 -175968 -113223 36821 99719 69080
13343F9080j18341L0742J23577j34269l2077K4075K2590q5153N8962Q9780N0708
13332I9674o4094n0548j06742k3471n7669N3323L8222J73033Q5338o3487k0011
13321F3568j11986p3647Q761L310j55242P8990K33557R2688l3196n9725n8276
13310a1198j35396L1001l162J69877L5481j25511M199r087R6586j01329q5600
13299a34139l9591N6317J36303J09883L211j14113l8998O4935j02403p5409K284
13288a31720N774J96250J23752n0572k9251p3978l7790m364J20410p7782J1218
13277E1947L4861K4662o3415n8012j6867J0045J5254k6430K4748Q1749k3656j0558
13265D4328o1488P2924j49593L3110k3223p7872n5863k6380P14Q8679R8604P8548
$$ plain form
13343 69080 -49261 -18519 105058 -29211 -61288 -37213 -14623 -99776 -40814 48966 99674
13332 99674 35580 -14968 -121710 -145181 -202850 -149527 -111305 61728 147066 83579 63568
13321 63568 -48418 -122065 -113304 -109994 -265236 -186246 47311 139999 106803 47078 -11198
13310 -11198 -146594 -115593 -118755 51122 86603 -38908 -34709 -43796 52790 -48539 -134139
13299 -134139 -173730 -117413 18890 128773 131984 17871 -21127 43808 -58595 -134004 -131720
13288 -131720 -125946 70304 194056 143484 114233 40255 2465 -1899 118511 40729 51947
13277 51947 86808 111470 48055 -9957 -26824 -16779 -1525 -27955 -3207 78542 54886 44328
13265 44328 -17160 55764 -93829 -60719 -83942 -161814 -217677 -244057 -243343 -154664 -56060 22488
13253B2488p618M784J7275J09862j44832j0007N203J7490j197M6511k5044R04
13241C5819n6721m8723m6653m5920p4721O8295L7639O9576J5323M1819j04850
13230a09117m0596l5238k2101P9926N3590O1112L9841m8233M8034J25195L9174
13219A91587m9862K3109p8168N722m7157M1688l5157n9641R3768J35944m3440
13208A78393r9809p6105P6517o5483o9338l434r3950j02360j0894R5570J72845
13197A952J46181p5467p1213n4554p6242m063j1848L9439N3761L6143l0995O6950
13185B0044P7660o3531j16166P37m4964m1685Q8743J08295M5052n5014M7919o3968
13173C122k0168P662M4207m2461j32405P7606P883Q1852M9547k3007l8671j01309
$$ plain form
13253 22488 14870 19654 36929 146791 1959 -8048 -2845 14645 13448 59959 34915 35819
13241 35819 -20902 -69625 -116278 -162198 -236919 -168624 -130985 -61409 -46086 -4267 -109117
13230 -109117 -149713 -184951 -207052 -127126 -73536 -12424 27417 -20816 27218 152413 191587
13219 191587 141725 164834 86666 92388 45231 86919 51762 -7879 85889 221833 178393
13208 178393 78584 2479 78996 13513 -55825 -59259 -153209 -255569 -266463 -170893 1952
13197 1952 148133 72666 1453 -53101 -129343 -133406 -145254 -105815 -52054 -15911 -46906 20044
13185 20044 97704 34173 -81993 -81256 -126220 -167905 -79162 29133 74185 19171 67090 3122
13173 3122 -17046 -9384 34823 -7638 -140043 -62437 -54554 27298 76845 53838 15167 -86142
13161h6142j07208J7954M8587L0221k2955J14236r711q9139p5875R3370J32633
13150D5971R3309k0306n5753q3311q5951J4790P3230M7811J12380r5705n5945
13139i480J9379J11841O5048n3650o2635n2320j3475P9565p3594K4992N2728j50656
13127f2257N6818O486o9770l5353q1308L857j3130J34886J71221l2862j57798
13116g9210K3288L9352O3112k6525N0347j96172q7782J33715R6079r3136O256
13105g0676j7760r6132l7890J43582R9653J20500j06712k596K7787L971q3604
13094a9877j31467P7995O2576j2864J5277L5504R1212o6397m9732J0022M7004
13083E9253p1621q8775j27713J29872K44463O8360j23795J1205m3283p2432n4035
$$ plain form
13161 -86142 -193350 -175396 -126809 -96588 -119543 -5307 -15018 -104157 -180032 -86662 45971
13150 45971 139280 118974 63221 -20090 -106041 -91251 -18021 29790 142170 46465 -9480
13139 -9480 9899 121740 186788 133138 70503 18183 4708 84273 10679 35671 88399 -62257
13127 -62257 -5439 1047 -68723 -104076 -185384 -181527 -194657 -59771 111450 78588 -79210
13116 -79210 -55922 -16570 46542 20017 70364 -125808 -213590 -79875 16204 -76932 -70676
13105 -70676 -88436 -184568 -222458 -78876 20777 141277 34565 31969 59756 63727 -19877
13094 -19877 -151344 -73349 -10773 -23637 -8360 27144 118356 51959 2227 12249 59253
13083 59253 -12368 -101143 -228856 -98984 145479 213839 90044 101249 57966 -14466 -68501
13072f8501k3902K7221r4695J2519R7705J33485k2212l9976n5360N5771k4228
13061b173k9524n7561k08243K393R3336K06407P3055j30794j07032j9129O7025
13050a12240O6521n4070n1562P0528J5241m7045k179N9129M8319o0394k9647m1181
13038a38580n0669J89736J4390N5266N802p9651O5683L9532l9475n2165K6430
13027C6299l0943Q9896l7139J3258k3859m598N1965L4821J7393o0449M1147n9177
13015F8614J1200L1325j25220o9426J9984O5356j03188l7152J6837R2777k2022
13004e0915m4931O6282m471k0463O4816J3287j13338q4334j9540n7830n1258M2609
12992b60086P6244q181J68375n0083k5433J016O1845K4419k9924j44643l4338
$$ plain form
13072 -68501 -92403 -65182 -159877 -147358 -49653 83832 61620 21644 -33716 22055 -2173
13061 -2173 -31697 -89258 -297501 -295108 -201772 4635 77690 -53104 -160136 -179265 -112240
13050 -112240 -45719 -99789 -151351 -80823 -65582 -112627 -114806 -55677 -7358 -67752 -97399 -138580
13038 -138580 -189249 487 14877 70143 75945 -3706 61977 101509 62034 9869 36299
13027 36299 5356 95252 58113 71371 47512 42914 94879 129700 147093 86644 127791 68614
13015 68614 79814 111139 -14081 -83507 -63523 1833 -101355 -138507 -121670 -28893 -50915
13004 -50915 -95846 -29564 -34035 -54498 10318 23605 -89733 -174067 -193607 -251437 -302695 -260086
12992 -260086 -183842 -192023 -23648 -73731 -99164 -98148 -36303 -11884 -41808 -186451 -220789
12981b20789K3850P1493J28438J81801o1341j25543p7519q0882m9028J14748J00259
12970E487o679q9663j40013J28711O8176Q9975m4499J2725M1997J28307o5564
12959A28960l2723O4201Q8386M9962K3557r7671j20654o5455K5492j49426Q090
12948g7281j1656J996J1669j4596K7430K4568Q8250j00971l0100l4119R5246L9165
12936A9601O2786L9817k9799j20213J6274J18529R0112k6779j49611K810P0806
12925I4333l0970j27753n5403m53m5990P9367J39191q2721l5317L3990J49218
12914A17492J7941r5175l3766J18622N7434q9565L4587m8162j88023m717L6427
12903g6905Q814Q472J26628Q5712r3081p3532p9850p357J053J24559O9782J0052
$$ plain form
12981 -220789 -196939 -125446 2992 184793 123452 -2091 -79610 -160492 -209520 -94772 5487
12970 5487 -1192 -90855 -230868 -102157 -33981 55994 11495 24220 66217 194524 128960
12959 128960 96237 160438 248824 298786 322343 224672 104018 38563 64055 -85371 -77281
12948 -77281 -88937 -86941 -75272 -89868 -62438 -37870 50380 -50591 -80691 -114810 -19564 19601
12936 19601 82387 122204 92405 -27808 -11534 106995 197107 170328 20717 23527 94333
12925 94333 63363 -64390 -119793 -120246 -166236 -86869 52322 -30399 -65716 -31726 117492
12914 117492 135433 40258 6492 125114 182548 92983 127570 79408 -108615 -113332 -76905
12903 -76905 -68091 -59619 67009 152721 59640 -13892 -93742 -101099 -100046 24513 94295 104347
12891A04347q8160K8723j46282J8188m5346p7127J41258j0619J2209Q481m1801
12880i6129N7847k2476N8701Q0203l7974p8542P8584m1361Q3534R409L875M5322
12868A40993m4498l7011K2981o3791m4777l9916P2050l4892L8998M7385q1294
12857b3772N8752j7290N523m6135m7558K1141Q3405O8864p8920j05164o2049J20777
12845b2426J16641q388m0492o7087o037K6506j37837J11652P3909N6253J14033
12834B16727N7803L4206J2966q8834j24020q0181j25848j17902j99258N9247J63243
12823a91851M7484J47845J56087K4872K3809m6713l784M7588j13700r238N126
12812H7525n1163O0417n6802P3918k043r0696j17389n8533K14991N2015L1045
$$ plain form
12891 104347 16187 44910 -101372 -83184 -128530 -205657 -64399 -75018 -62809 -54328 -96129
12880 -96129 -38282 -60758 -2057 78146 40172 -38370 40214 -1147 82387 91796 95671 140993
12868 140993 96495 59484 82465 18674 -26103 -66019 6031 -28861 10137 57522 -23772
12857 -23772 34980 17690 23213 -22922 -70480 -49339 34066 102930 24010 -81154 -143203 -22426
12845 -22426 94215 85827 45335 -21752 -27789 -1283 -139120 -27468 46441 102694 216727
12834 216727 274530 308736 321702 232868 108848 28667 -97181 -215083 -414341 -355094 -191851
12823 -191851 -144367 3478 159565 184437 208246 161533 157749 205337 91637 82399 87525
12812 87525 36362 96779 39977 113895 111852 21156 -96233 -154766 60225 112240 143285
12801A43285O4186j09286j26019o7017j6001o8741J4214k5978L1132J08855P4456
12790B3086k9903j636J3612q3460L6840J22914q3708m3909Q6832m0887N5518j22556
12778f7257K9193O6555m9200l3420r811M8752L3949j5308n4028q7488j0052L8377
12766a09738P4347N4689N3604O843k25O9442n9925P2954j9833j68205j36134K5708
12754a36473M6057j2405R1781R1233P258p7032Q735K0629q6675J427N1590m2895
12742c6770j16710n3585R888J393K4828L4851O6571Q3814j3267K5292J05253k2100
12730A09458l0830j8956j6574O2032m6939r9255j3337K6261J9558q6902k0525
12719a16009q3374J21693O3916L1166o900O2784M2375k00698j00688Q6379K06261
$$ plain form
12801 143285 207471 98185 -27834 -94851 -110852 -179593 -165379 -191357 -160225 -51370 23086
12790 23086 -6817 -8453 5159 -78301 -41461 81453 -2255 -46164 40668 -219 55299 -67257
12778 -67257 -38064 28491 -20709 -54129 -63940 -15188 18761 3453 -50575 -138063 -148115 -109738
12766 -109738 -35391 19298 72902 79745 79520 148962 89037 161991 142158 -26047 -162181 -136473
12754 -136473 -90416 -102821 -11040 80193 87451 10419 19154 39783 -46892 -45465 6125 -36770
12742 -36770 -153480 -207065 -197177 -195784 -170956 -136105 -69534 14280 1013 26305 131558 109458
12730 109458 78628 59672 43098 105130 58191 -41064 -54401 -28140 -8582 -95484 -116009
12719 -116009 -199383 -77690 -13774 17392 10492 73276 115651 -85047 -185735 -99356 106905
12708A06905J20645j08332j75689r2587J40747N9100r2235l1311J18578Q7247
12698A33068j4181l3597j11601L674j7829q4242r4383K743Q2497J20151J30840
12687A17140k2299R6366M696p4873M6004l7321j23858n370K2911j83213j98244
12676c58061O8482O3985l8885J47413J00571p5545l5304L38m2124q9636M4193
12665b14573Q8959J33034Q5102m8017O9550k3756J8290O6019q5471j3676P7168
12654A52629L1888j52837j43553o3499j21405j51281K06317J72635o518Q3359
12644G735M6217j59305J19267Q5241k6308j5995O682r7221m6446l6026J19439
12633C280N0543q337M4571j3598r4313J2023J8160l8755J2096q728R0786P070
$$ plain form
12708 106905 227550 119218 -56471 -149058 -8311 50789 -41446 -72757 45821 133068
12698 133068 118887 85290 -26311 -22637 -40466 -124708 -219091 -216348 -133851 -13700 117140
12687 117140 94841 191207 195903 121030 167034 129713 5855 485 23396 -159817 -358061
12676 -358061 -289579 -225594 -264479 -117066 -16495 -92040 -127344 -127006 -169130 -258766 -214573
12665 -214573 -125614 7420 92522 44505 114055 90299 108589 174608 89137 75461 152629
12654 152629 184517 31680 -111873 -175372 -296777 -448058 -241741 -69106 -75624 7735
12644 7735 53952 -105353 13914 99155 72847 56852 63534 -33687 -80133 -116159 3280
12633 3280 53823 45486 90057 76459 -17854 -5831 12329 -26426 -14330 -23058 67728 74798
12621G4798n638k3111n442J5879L9188j24195l0219m7430M3955l4469K4573l3402
12609a05513J08050P8285k03419k2872J76889J21247o6654k1638m3036p1713M7214
12598c160n4572N4972O3840n6168j06858R1326J47682J4193n7333R1833j61374
12587B4381l8129J77849R264p1683p8212j13129o1860k8384q4686J13276J8454
12576a32859n2443J19705n0445N9382k2762o2497L9612k969O6640Q067n3211J22727
12564C8947R5717L7494m390n039r1130k6494O7573J11162J32688j3571j81035
12553A61922n1596o3844j11397O1919M5372j14354K5891Q4379R9745p9186j57202
12542i8351J74044J09024J8077k562M6549J3231j03703r1915l0794J19427l8663
$$ plain form
12621 74798 69160 46049 40607 56486 95674 -28521 -58740 -106170 -62215 -96684 -72111 -105513
12609 -105513 2537 80822 -122597 -145469 31420 152667 86013 64375 21339 -50374 -3160
12598 -3160 -57732 -2760 61080 4912 -101946 -10620 137062 151255 93922 185755 24381
12587 24381 -13748 164101 173365 101682 23470 -89659 -151519 -179903 -264589 -151313 -132859
12576 -132859 -185302 -65597 -116042 -56660 -79422 -141919 -102307 -105276 -38636 -30569 -83780 38947
12564 38947 134664 172158 167768 162729 71599 45105 112678 223840 356528 342957 161922
12553 161922 110326 46482 -64915 -2996 42376 -71978 -46087 38292 138037 58851 -98351
12542 -98351 75693 184717 202794 200232 246781 260012 156309 64394 33600 153027 114364
12531A14364j59737J4803N5167l2270o4239K7854R6573k3478j8232P629K8903
12520D7337J2215J5290o3102j63074m0313M7169O1615N1339j6813L3786l6520
12509e1071o429j2813p4799J3225m551O989P4302K8570q66m970j13741p4534J17851
12496a02837L0850P1244m4321j18671N9982Q4792l5990k0454J8577M822N0209
12485a797J10052M8559j35980j32741P4544M1378k1163j5312K0738n8734K1835
12474d8621l2517L1545J27519k7052j39827j10567L499p4614R8957o232K3330
12463a54580Q7738L0471j14475K7306j7366j10849J7993k4271M7834J55580J38721
12452H4102L3332M7389m0635m961K1145q0319k6044J28072N3799n5976j8673P7518
$$ plain form
12531 114364 -45373 -30570 24597 -7673 -71912 -44058 52515 29037 10805 18434 47337
12520 47337 59552 74842 11740 -151334 -191647 -144478 -82863 -31524 -48337 -14551 -51071
12509 -51071 -57500 -70313 -145112 -131887 -136438 -129449 -55147 -26577 -27443 -32413 -146154 -220688 -102837
12496 -102837 -71987 -743 -45064 -163735 -103753 -18961 -54951 -75405 -56828 -52006 -1797
12485 -1797 108255 156814 20834 -111907 -37363 4015 -17148 -32460 -11722 -70456 -48621
12474 -48621 -81138 -49593 77926 50874 -88953 -199520 -196021 -270635 -171678 -177910 -154580
12463 -154580 -66842 -36371 -150846 -123540 -140906 -251755 -233762 -258033 -210199 -54619 84102
12452 84102 117434 164823 124188 119227 140372 60053 34009 162081 215880 159904 141231 218749
12440B18749j27371r6169j19272J10600n042k4993P6502N3758r1605j08842P910
12429a05775J67022O3803Q411l1627p7873j29068q702r7509k5212N9089R2124
12418h5317j1452k9902o7913k7864O2655J56312J24765N4212L5638j44531j35432
12407f8829N54O0981j23399P0082l6512J9852M8374J44225K3124R2303k2204k19216
12395a0665j08556J44648N059j69704L8607M7096k9533k8186j8230M9346N2712
12384b7406J6270k0640J4626o2479K429J14392O0590l8329O715j25181J8436N2582
12372A2005J02499m4453m7335N0622j3510j4549O5604m191l0467q3783j19154
12361a26712n6973k0921M5737O8965L8725L3696N5856k8064j56352j51198M8817
$$ plain form
12440 218749 91378 -4791 -124063 -13463 -18505 -43498 33004 86762 -4843 -113685 -105775
12429 -105775 61247 125050 133461 101834 23961 -105107 -113809 -211318 -236530 -177441 -85317
12418 -85317 -96769 -126671 -194584 -222448 -159793 -3481 121284 175496 211134 66603 -68829
12407 -68829 -68275 -7294 -130693 -60611 -97123 -77271 -28897 115328 138452 230755 208551 -10665
12395 -10665 -119221 25427 30486 -139218 -100611 -53515 -83048 -111234 -129464 -80118 -27406
12384 -27406 -11136 -31776 -17150 -79629 -77200 37192 97782 59453 66168 -59013 -40577 12005
12372 12005 114504 70051 22716 73338 59828 45279 110883 106692 76225 -7558 -126712
12361 -126712 -183685 -204606 -158869 -89904 -51179 -17483 38373 10309 -146043 -297241 -248424
12350b48424K67593k482k2867J17785P4022p2066n2918j19563N0647R9985K8426
12339A20138Q152j20040j81071k1173N0285P5899M2786j2816O9829O026Q8752
12328A26767Q3337j24289j21571j62117J8874n8489R3952J2757k1751R7102J26142
12317G0714K2155j17660L355l8791o2645k7296Q0371Q3540R3930N7670q2493o9142
12305A3708j5003j1892r9270R4216J47042K015n3021j803j2724R169m635n6813
12293A0989l3302K5158K0881J9735n2390M6955k4430q5276J80358J781o1528k9860
12281A9071P4088P5987M403K1101j36085j39266j9823L3055R1253j1119j51228
12270a38563L7609j2771n584n3885R151J00856q9129n7589P6116J72131L4864
$$ plain form
12350 -248424 19169 16687 -6180 111605 185627 113561 60643 -58920 -8273 91712 120138
12339 120138 128290 8250 -172821 -193994 -143709 -67810 -25024 -37840 31989 38015 126767
12328 126767 210104 85815 -35756 -197873 -178999 -237488 -143536 -130779 -152530 -55428 70714
12317 70714 92869 -24791 -21436 -60227 -122872 -150168 -69797 13743 107673 165343 82850 13708
12305 13708 -1295 -13187 -112457 -18241 128801 130816 77795 75992 63268 72437 67802 10989
12293 10989 -22313 2845 23726 43461 -8929 38026 13596 -71680 108678 110459 48931 19071
12281 19071 93159 169146 173549 194650 58565 -80701 -100524 -67469 23784 12665 -138563
12270 -138563 -100954 -113725 -119309 -173194 -164043 -63187 -152316 -209905 -133789 38342 73206
12259G3206M113j3468o1595q90l3700j3385K6795J0712R4285M8551R057J52237
12247B95918J2158q7840o1950j46628m0041J6213J46242l6595r3372N4091K0342
12236G8538m463R8580J00825o2097j62848N8237n7202p1925N3327L6732J968O951
12224G6623m3895n3040K4077Q8806L5724L96p392j27114k3960J07235p6843N9511
12212F0128K2401K3399l8614J1515m7425q6730L9234Q3871j5606O8887J38333
12201B59393Q7260J6202j04418r2394J9987k6964o0488r0607r7492J32991N1289
12190I4759l7683j00759o0138J1877p636Q2292Q5477J39787J49677r2526m7983
12179B17144m2513J17631K10961J14881j09954O10j1129J3186p179p1822N1480
$$ plain form
12259 73206 77319 63851 2256 1366 -32334 -45719 -18924 -8212 86073 134624 143681 295918
12247 295918 308076 220236 158286 11658 -28383 -12170 134072 97477 4105 58196 78538
12236 78538 74075 172655 273480 211383 48535 106772 49570 -22355 30972 67704 69672 76623
12224 76623 32728 -20312 3765 92571 128295 128691 121299 -5815 -29775 77460 617 60128
12212 60128 82529 105928 67314 78829 31404 -55326 -16092 67779 52173 121060 259393
12201 259393 346653 362855 258437 166043 186030 159066 98578 7971 -89521 43470 94759
12190 94759 57076 -43683 -103821 -91944 -99580 -17288 68189 207976 357653 265127 217144
12179 217144 174631 292262 503223 618104 508150 508760 497631 510817 503638 431816 483296
12168D83296J81286J2782j59484j02219O22R301N7402M601q288K7851J10010J67783
12156G84943L3138j25872n5801J11900n3566j22785q724R2735R7640o9648j56938
12145E27022J701J3484j75626o8248n5163q5587j879L805M1837J4632J28595m6514
12133B98059o7451K517L375q7540o6005K6456L0738k6456L6857k2017j6303J5541
12121A27771l4420K4980m5594J6218j07976j12526J04601P4491J16940K6585J02758
12110B93828m3838j05056K01108M8812O2647k501j2113k7345j98480o6672L0435
12099A80825R7810j15873k34604j25199N3974L6886j7179K4039J34338J17771
12089A52788J1648N0105m3949N5471p9886O549k7928l397N7576K0878o7548n8175
$$ plain form
12168 483296 664582 677364 517880 415661 416283 425584 482986 487587 479299 507150 617160 784943
12156 784943 818081 692209 636408 748308 694742 571957 563233 655968 753608 683960 527022
12145 527022 528723 542207 366581 298333 243170 157583 155704 159509 201346 215978 344573 298059
12133 298059 230608 233125 236500 148960 82955 109411 140149 113693 150550 128533 112230 127771
12121 127771 93351 118331 72737 88955 -19021 -131547 -26946 47545 164485 191070 293828
12110 293828 249990 144934 346042 394854 457501 455000 442887 415542 217062 150390 180825
12099 180825 278635 162762 -71842 -197041 -143067 -106181 -123360 -99321 35017 152788
12089 152788 164436 214541 170592 226063 146177 152726 124798 121401 178977 199855 132307 74132
12077G4132l9479J7472K2147l0649m7360O8262J73365R4996P221O0828m0604j06051
12065B54280p5013o129P2157p4596K9798p0185r535J3597r249n2596K2185r2542
12053B172L5727J05703k7606k8686n583L0592Q0957o6432o5978J0491O0792J0232
12041A42381r7450O2465M7504p1498n0658Q666l0365P1497j6868J64599J40007
12030C70280j411N2772O324K4498J5656K3730M2748l6132m3768j25033j24837
12019B04827j30272J14269O4466M2260j2363m1142K7208Q7253q2198j7906O1808
12008C18210J6314k9260k4533O8889J6683o3694J9063P2680r1397k2068J50266
11997D31153J78822Q6127L9415q526l2489k3993k21966j24841K9731O4791j9969
$$ plain form
12077 74132 34653 52125 74272 43623 -3737 64525 237890 332886 340107 400935 360331 254280
12065 254280 179267 173138 245295 170699 200497 130312 120777 134374 125125 72529 94714 2172
12053 2172 37899 143602 115996 87310 81727 112319 193276 126844 60866 71357 132149 142381
12041 142381 44931 107396 154900 83402 32744 41410 11045 82542 65674 230273 370280
12030 370280 368869 421641 427965 452463 468119 491849 534597 498465 454697 329664 204827
12019 204827 74555 188824 253290 295550 283187 242045 269253 356506 274308 256402 318210
12008 318210 334524 305264 280731 349620 366303 302609 321672 394352 302955 280887 431153
11997 431153 609975 696102 735517 726991 694502 670509 448543 323702 353433 418224 398255
11986C98255k4518J54777J63651N5352j8092m1096m0782l8692N380J59073O7407
11975H40715o3569Q331J21545j660N3440n7252l0866j1866J03424p196P9577M0121
11963A074744J0191J63339J41642j9293k8623L0058K5510m5626J13786P0954J39807
11952A676489J06708L6060J62649J74483J93940O3385R3027K05757J82447K87918
11942C182863L13327M23526M78690K97550L09074M01649N25643O21009N89479
11933G142810O30621R72251J183085J320279J385735J933934K302360L042704
11925A9913779L822288M983570O602889Q860418J1995863J6391262K2014111K7313661
11917A21897841K8917214K3396020J1633305j182613j2705490k1821426k5878446
$$ plain form
11986 398255 373737 528514 692165 747517 729425 688329 647547 608855 614235 773308 840715
11975 840715 777146 785477 907022 905362 958802 901550 870684 858818 962242 955046 1034623 1074744
11963 1074744 1084935 1248274 1389916 1370623 1342000 1372058 1397568 1351942 1465728 1536682 1676489
11952 1676489 1783197 1819257 1981906 2156389 2350329 2413714 2506741 2712498 2894945 3182863
11942 3182863 3496190 3919716 4398406 4695956 5005030 5406679 5932322 6553331 7142810
11933 7142810 7773431 8745682 9928767 11249046 12634781 14568715 16871075 19913779
11925 19913779 23736067 28719637 35322526 44182944 56178807 72570069 94584180 121897841
11917 121897841 150815055 174211075 185844380 184661767 171956277 150134851 124256405
11910A24256405k4659226k0406152j5915234j2161285r035721o812457n248370
11903C0017960m127351l324419k855657k202360j944798j697299j359848j256187
11895A1250041r21638p89847q07159o09086o38494o21450m36777m10513l80360
11886E634717l06976l21453l88753l11876j1642K0268k38769j63696k24702l01504
11876C385614l34818k76400j86700l3237j6573r5743m9577j53910j07166j67783
11866A963707r5012k6784L7523r6604l0456Q654n7540j46655j66908j65092m5092
11855A179741Q6129J7469p6471J0422o5097q5069J9570J6516j720p0207J1768
11844A043051Q5072P0377r9958p0391O8134k50811j28143J46879J16746o4667
$$ plain form
11910 124256405 99597179 79191027 63275793 51114508 42078787 35266330 30017960
11903 30017960 25890609 22566190 19710533 17508173 15563375 13866076 12506228 11250041
11895 11250041 10328403 9538556 8731397 8122311 7483817 6862367 6425590 6015077 5634717
11886 5634717 5327741 5006288 4617535 4305659 4294017 4314285 4075516 3911820 3687118 3385614
11876 3385614 3050796 2774396 2587696 2554459 2537886 2442143 2392566 2238656 2131490 1963707
11866 1963707 1868695 1841911 1879434 1782830 1752374 1761028 1703488 1556833 1389925 1224833 1179741
11855 1179741 1265870 1283339 1206868 1217290 1152193 1067124 1086694 1103210 1101490 1031283 1043051
11844 1043051 1128123 1198500 1098542 1028151 1096285 845474 717331 864210 980956 916289
11834I16289j29217j48777N2285P8389J64891m6562j04295P674J8045l7650J5913
11823G86985Q8168n7072L3075J4811P2096m2322Q9808k3342q4980m0730N8234
11812H94731N5142j9659k5313P6644P1734O2662j27120l1414P5457j47973m9150
11801H35741O3864N0972m2009J10096n9142p7872l6531Q6581R0294J35851n9906
11790A097939j9275J10479O7019M6940O2093L6689J40116L0149N485K0726j3817
11779A584543j0433Q09J36758K67750J03127J4846J00081J85039J20538J04002
11769B607060L8236K36813K64958J32367J39379J65861L15769L50088M21702L75670
11759E047903L99097O08899M54714M64446O08278O62524R60357J182400J313113
$$ plain form
11834 916289 787072 638295 690580 768969 933860 887298 783003 790677 808722 771072 786985
11823 786985 875153 818081 851156 865967 938063 895741 985549 962207 877227 836497 894731
11812 894731 949873 930214 904901 981545 1053279 1115941 988821 957407 1032864 884891 835741
11801 835741 899605 950577 908568 1018664 959522 881650 845119 931700 1021994 1157845 1097939
11790 1097939 1078664 1189143 1256162 1303102 1365195 1401884 1542000 1572149 1577634 1598360 1584543
11779 1584543 1574110 1574919 1711677 1979427 2082554 2097400 2197481 2382520 2503058 2607060
11769 2607060 2645296 2882109 3147067 3279434 3418813 3584674 3900443 4250531 4672233 5047903
11759 5047903 5447000 6055899 6510613 6975059 7583337 8245861 9206218 10388618 11701731
11750A1701731J421668J724599K084753K510560L023372L708963M474967N375251
11742C6025864O035442O485460O399650N796537M420385L149407J978900J467986
11734G1759631J672665K423663M138837O715493R011709J1016002J1664420R926352
11726A28328772N655012N53961m230274q086358j0263596j0351165q725005o406245
11718H6475102m171545k347509j124267q58596j616871k956259m542400n709797
11710F3147858o598474o732798o303975n682082m887719m407206l517573k817836
11702B2200195k349218k053760j789812j451347j323865j207409j157300q85748
11694I981736o36816o68198p08293o67329n34451l79491k60341k98739l32796
$$ plain form
11750 11701731 13123399 14847998 16932751 19443311 22466683 26175646 30650613 36025864
11742 36025864 42061306 48546766 54946416 60742953 65163338 68312745 70291645 71759631
11734 71759631 73432296 75855959 79994796 86710289 95721998 106738000 118402420 128328772
11726 128328772 133983784 134537745 130307471 122221113 111957517 101606352 92881347 86475102
11718 86475102 82303557 79956048 78831781 77973185 76356314 73400055 68857655 63147858
11710 63147858 56549384 49816586 43512611 37830529 32942810 28535604 25018031 22200195
11702 22200195 19850977 17797217 16007405 14556058 13232193 12024784 10867484 9981736
11694 9981736 9344920 8676722 7968429 7301100 6766649 6387158 6126817 5828078 5495282
11685E495282l84245k47184k59224l41096l07486k25911k90208k40561q2861o2088
11675C054418j29207P4822j20820k45396j72858p5525j39889j19438p8748r6362
11665A950997j506r3320j28452j7189J9482M686q8420J5399r4957j76010j41439
11654A249271l2506L9033p9612N332Q9266L0720j71551o2285q0976l1481J15627
11643A070838N3650p010o0263j42718j07745L0255j60455j09812l5379J4694L2068
11632E78123o0592m0638P9021J39315n7281p6597j2132O971l6085l3386j07151
11621C79568N7340M1788k1677J0119N0805P3915N0803r7684q7659K7750m1856
11610D43212r8l7681q0873o8140J0648O8813J23708N0986o6962j1799k9414n2102
$$ plain form
11685 5495282 5111037 4863853 4604629 4263533 3956047 3730136 3439928 3199367 3116506 3054418
11675 3054418 2925211 3000033 2879213 2633817 2460959 2385434 2245545 2126107 2047359 1950997
11665 1950997 1949491 1856171 1727719 1710530 1730012 1734698 1646278 1661677 1566720 1390710 1249271
11654 1249271 1216765 1255798 1176186 1181518 1270784 1301504 1129953 1067668 986692 955211 1070838
11643 1070838 1124488 1117478 1057215 914497 806752 837007 676552 566740 531361 546055 578123
11632 578123 517531 476893 555914 695229 637948 561351 549219 556190 520105 486719 379568
11621 379568 436908 478696 457019 467138 517943 591858 642661 544977 457318 485068 443212
11610 443212 443114 405433 324560 256420 267068 335881 459589 510575 443613 431814 402400 350298
11598C50298J12159M0476k6653k3120J6251O2871M9105j00430j00628m737N6642
11587D32234m2757j4580n2480p8329K8594P9525J74833N5979k5049j0710n4037
11576D93223j46110r9191l028O970p0717o2643L8593M5415J31509l5889q619P643
11564B97156L2982M9601K9483n1346o0171k5093L3088j8567q5179P2263n4222
11553B19995m7752Q9773O3543o9803O1969m7327m8341q70K8944J1271M1408J5754
11541C18564k5931M2610p6667m7691j5049k1436P95N571j3330L5648j27693r9750
11529b4359M9393K1750p1787M132q5058L0810J01852M0419q982R5041L4340j08992
11517G8559j06412o43J03207J35767m466j39203J4705r3262P1555Q8837M4111
$$ plain form
11598 350298 462457 502933 476280 453160 469411 532282 581387 480957 380329 375592 432234
11587 432234 389477 374897 322417 244088 272682 352207 527040 583019 557970 547260 493223
11576 493223 347113 247922 244894 251864 181147 118504 157097 202512 334021 298132 289513 297156
11564 297156 330138 379739 409222 357876 297705 272612 305700 287133 201954 274217 219995
11553 219995 172243 262016 325559 255756 317725 270398 222057 221187 250131 261402 302810 318564
11541 318564 292633 335243 258576 210885 195836 174400 175195 180766 167436 203084 75391 -24359
11529 -24359 25034 46784 -25003 -20871 -105929 -75119 26733 67152 58170 153211 187551 78559
11517 78559 -27853 -28496 74711 210478 206012 66809 81514 -11748 59807 148644 192755
11506A92755j9138j52993l4845j3597K8187j0786O72K1098R478M2117J50560N8720
11494B72228M8140l1006M8335n1777q9533o0336p5574K5867j34727p583J30082
11483G4116P6954k3765P0750J93j4330j5898Q3528K4204o577o0802p5412L2083
11471A65044m4749o538n28j2185p0667o3985p1939M2816O2666j3981l7694M546
11459d7194J8689o811J18554j3909r304r3075r9631M3867O5554J29731J08339
11448B14810J9778p530n9215k9628N9261m361j09914L3247p3835j80230o2413
11437b00030J9901J15631L1900l8549o0008q1281r4720M9856J8650K7653K3717
11426a87280J04659J30349L6001K9525M2212J9621m1884o2970n182O6673m8156
$$ plain form
11506 192755 173617 20624 -14221 -27818 369 -10417 -9745 11353 20831 62948 213508 272228
11494 272228 320368 289362 337697 285920 196387 136051 60477 86344 -48383 -55966 74116
11483 74116 151070 127305 198055 198248 183918 168020 251548 275752 269175 208373 132961 165044
11471 165044 120295 113757 113229 101044 30377 -33608 -105547 -62731 -65 -14046 -51740 -47194
11459 -47194 -28505 -35316 83238 69329 60025 -33050 -132681 -88814 -23260 106471 214810
11448 214810 234588 227058 167843 138215 197476 193115 83201 116448 42613 -137617 -200030
11437 -200030 -180129 -64498 -32598 -71147 -131155 -212436 -307156 -257300 -238650 -210997 -187280
11426 -187280 -82621 47728 83729 113254 155466 175087 133203 70233 65051 131724 83568
11415H3568O483M1942n4805o4000p0577j7500O8231Q1999k3144j8768J67970L7647
11403B39046j57596o8752M3875n2290k5333J80565l6407n2848j38539o5738l8056
11392a72073M1524N8615J01675P6907r5390l1078k0033R952l3963J08655M0293
11381H5084M0792k4634j60567j57668Q6022J13655J44652J9628j17239j50318
11371a20593j4045O4364N7420j9719j6017L0372j09031j12381J95818J67612l3344
11360I0456j64436O3901J59589M100M0978J0119p2960j28140p2976P8106J6319
11349B5056J3804j20404Q6482Q2529l9207p0919j48038J52343J68869n6828p0991
11338B2696L229P9580k0122m4518o6790K239O2269l6363K3123P3266n033r2927
$$ plain form
11415 83568 90051 131993 77188 13188 -57389 -74889 -6658 75341 52197 33429 201399 239046
11403 239046 81450 12698 56573 4283 -21050 159515 123108 70260 -68279 -134017 -172073
11392 -172073 -130549 -71934 29741 106648 11258 -19820 -39853 -29901 -63864 44791 85084
11381 85084 125876 101242 -59325 -216993 -130971 -17316 127336 146964 29725 -120593
11371 -120593 -134638 -70274 -12854 -32573 -48590 -18218 -127249 -239630 -43812 123800 90456
11360 90456 -73980 -10079 149510 153610 194588 204707 131747 3607 -69369 8737 25056
11349 25056 38860 -81544 4938 87467 48260 -22659 -170697 -18354 150515 93687 22696
11338 22696 25925 105505 85383 40865 -25925 -23686 38583 2220 25343 98609 93576 649
11326F49r433j0370m5694j06242k5018R1807J7372p2202l154N0003J35305J18045
11314A41068N2293P8262k9440j03182m4710L1452Q9437o2000j5519J35207O0956
11303C33824K3666N8606k9371r9280o0243J45769M4752j1379P9851N6839J7822
11292E60856K2334O7169j2377K9216R8364P3205k901q9123q7856j37485p0611
11281D50791j9016J07863P7690p6740j49234j69587p8336p8962M2132J78993L1933
11270C17527j38459m3414l3724j14382J0040J00161L7385j15221P2041M1518J4495
11259A47967o89j16470o343K4043l6855p3168J4375J7971j12000J3N6859O9556
11247a4741O8986j06446L2914J02509l7192q2196m6544n095Q3566J09838q7366
$$ plain form
11326 649 -8784 -19154 -64848 -171090 -196108 -104301 -86929 -159131 -162285 -112282 23023 141068
11314 141068 193361 271623 242183 139001 94291 125743 215180 153180 137661 272868 333824
11303 333824 357490 416096 386725 287445 227202 372971 417723 406344 486195 543034 560856
11292 560856 583190 650359 637982 667198 765562 838767 835866 746743 658887 521402 450791
11281 450791 431775 539638 617328 540588 391354 221767 143431 64469 106601 285594 317527
11270 317527 179068 135654 101930 -12452 -2412 97749 135134 19913 91954 133472 147967
11259 147967 147278 30808 24465 48508 11653 -61515 -47140 -29169 -141169 -141156 -84297 -14741
11247 -14741 54245 -52201 -19287 83222 46030 -36166 -82710 -87805 -4239 105599 18233
11236A8233O8657M5176n4400J06962J6956l179p5001l8948j11025r3875K9610
11225i0834L788j5N9024J47459N307N6112r1522q3131O817l7284M4240J5258l8200
11212b981q4108m1450R0102k7613J9062Q3380p840J4415n5021p8658K1121p1667
11200a41258J6138J27844J09481O6232M4631n8335l5286r879P7751L4400k2826
11189B08893j59867n4421k6652q8P3466K3448J9890l2967p5134j3555L5130L3187
11177C1330j00266j440J56812L545j26245j0718m437N556o3472O8379k8085J43504
11165G4463N0882O3819l7865J4586J95626J17598o9258r9737k8386O896j7025
11154B71599m7270n3860j0262o7957l1627q5404K7810j4257J760O0905K5337l4515
$$ plain form
11236 18233 86890 132066 77666 184628 201584 198405 123404 84456 -26569 -120444 -90834
11225 -90834 -87046 -87061 -28037 119422 124729 180841 89319 6188 13005 -24279 19961 35219 -2981
11212 -2981 -87089 -128539 -38437 -66050 -46988 36392 28552 42967 -12054 -90712 -69591 -141258
11200 -141258 -125120 2724 112205 178437 223068 164733 129447 119568 197319 231719 208893
11189 208893 49026 -5395 -32047 -32135 41331 64779 84669 51702 -23432 -36987 -1857 31330
11177 31330 -68936 -70376 86436 89981 -36264 -46982 -51419 -45863 -109335 -40956 -69041 74463
11165 74463 125345 189164 151299 165885 361511 479109 409851 310114 281728 288624 271599
11154 271599 224329 170469 160207 92250 60623 -24781 3029 -11228 -9468 51437 76774 42259
11142D2259o4084Q2844L077J00852Q4551J04276m9584l4852J10361n7423q9405
11131B32872o0005J1903k0284K3366n4368R8795J85362J15878J07785L2844p5065
11120E99083j26792j70039m6904k3165q7084R1738N8691q4010j11394n2006R1768
11109A39886P3709R9463J9278l1835K3663M6070M0603k4079j5983p7178j22685
11098A70912j8879l5172K6235r1664o9855J18721K4100m60J9203K4765N3928j8870
11086B02964L4538Q4752n2100p8515p9740j05104N7163M7644O4259q5939p3248
11075A6674J8686J3130O4011L6805M872q991j480o6230k18M8847N664p9061n5975
11062c266l0708M9240R3058O8097J03812o2428j10101o1729r6325k8237J71849
$$ plain form
11142 42259 -21825 61019 64096 164948 249499 353775 304191 269339 379700 322277 232872
11131 232872 172867 184770 164486 187852 133484 232279 417641 533519 641304 674148 599083
11120 599083 472291 302252 255348 232183 145099 236837 295528 211518 100124 48118 139886
11109 139886 213595 313058 332336 300501 324164 370234 410837 386758 370775 293597 170912
11098 170912 152033 116861 143096 51432 -18423 100298 124398 123938 143141 167906 221834 202964
11086 202964 237502 322254 270154 191639 111899 6795 63958 111602 175861 89922 16674
11075 16674 35360 48490 112501 149306 154178 145187 143707 77477 77259 126106 131770 52709 -3266
11062 -3266 -33974 15266 108324 176421 280233 217805 107704 45975 -50350 -78587 93262
11051I3262J26372N2487P231j70314l7558j06116l8154P5322P3896Q5500M9519
11040B11447k5380K387J25343J09570j6843l7791L2595M794K3865k6487o6328
11029C37172k9226n014J49225K74646J78874o6961L3875k9961n5506j04606O3279
11018G45797M4605L2006J68606J24906J75461M3607m1240o7107j71791j31738
11008I23112n9229j16947J329J38765k9153K788k5649o6045k0686R3951M35j47580
10996F95091j67056j5909R1103o5093l627n5965j8950K7686m8497P3220n2928
10985D59075j49965j71294N5358N721j09104j37018j2554L2939j5778P6131l9454
10974e943K7801n1084N9198R7862m9779r1986J4785K8329k4620j4288J59259J98172
$$ plain form
11051 93262 219634 272121 279352 109038 71480 -34636 -72790 2532 76428 161928 211447
11040 211447 186067 188454 313797 423367 406524 368733 401328 406122 429987 403500 337172
11029 337172 307946 302932 452157 726803 905677 838716 872591 842630 787124 682518 745797
11018 745797 790402 822408 991014 1115920 1291381 1334988 1293748 1226641 1054850 923112
11008 923112 863883 746936 748265 887030 857877 860665 835016 768971 748285 842236 842671 695091
10996 695091 528035 512126 603229 538136 534509 478544 459594 487280 438783 512003 459075
10985 459075 309110 137816 193174 198895 89791 -47227 -59781 -26842 -42620 33511 -5943
10974 -5943 21858 -29226 29972 127834 78055 -13931 854 29183 4563 -9725 149534 347706
10962C47706j27095m8598N023R3937J5312l3462O9806l0093l4195J7277k9164
10951B46454m3304p2591j91J09840K9617m8354r1417Q3640J1387j52974p0928
10940A179J1683K2118J29796M8706J8302j46465N893R3117j6452p1678r4481J6575
10928A8293R867j10579m860N752J69910N4742j0512m665k9580k3342M8940J26922
10916B50888j47919r9131J138r427Q3284J01382J29301m0446j7700j3754o584
10905B31032J10051k9014j7441J43334m4542l6377p0772o5808j28600q9110n8038
10894e5285J68982N101J06673J3049q7147n0597n2634K1091M7757K66N8196O4134
10882B39586r048L687n0856n382O2885p3214m3593m2371J00628M8247P0786m3351
$$ plain form
10962 347706 220611 172013 177036 270973 286285 252823 322629 292536 258341 275618 246454
10951 246454 203150 130559 130368 240208 269825 221471 130054 213694 225081 72107 1179
10940 1179 12862 34980 164776 213482 231784 85319 91212 184329 167877 96199 1718 18293
10928 18293 28160 -82419 -87279 -81527 88383 143125 132613 127948 98368 75026 123966 250888
10916 250888 102969 3838 4976 -4451 78833 180215 309516 269070 251370 237616 231032
10905 231032 341083 312069 294628 437962 393420 357043 286271 220463 91863 2753 -55285
10894 -55285 113697 118798 225471 238520 151373 100776 48142 69233 116990 117256 175452 239586
10882 239586 230538 234225 183369 177987 240872 167658 124065 81694 182322 230569 301355 258004
10870B58004K6142J12026K3422p5088k7267J56655o1752k18542r8729J55694J28553
10859C79118n4887q2693j5050L5496L1698n1081J08738J42982p1575o8760k0991
10848C32995P2366J17008N4750l5102r9961q2731o5011M7179O2124Q3215m2383
10837D44449l3407j61896J03486J26200N3307l3680l929Q5012J281M0718M9261
10826F70802n6324N1578j3837P3302K8121o8884P577j6972j8602M0721o0129r7137
10814E40216N1561K1633Q06n7589M7467n8327o3475Q4157k2260Q38Q8021L5428
10802F68476J0526K4872N4155q7932j31665m5622N5623J21850M5188o4703k032
10791F48736P4947O0952J39537k388N5252J9015q0109K9431M6867O0675Q4681
$$ plain form
10870 258004 284146 396172 419594 344506 317239 473894 412142 193600 94871 250565 379118
10859 379118 324231 241538 226488 261984 293682 242601 351339 494321 422746 353986 332995
10848 332995 405361 522369 577119 542017 442056 359325 294314 341493 403617 486832 444449
10837 444449 411042 249146 352632 478832 532139 498459 494530 579542 580823 621541 670802
10826 670802 614478 666056 652219 725521 753642 684758 692335 675363 656761 697482 637353 540216
10814 540216 591777 613410 614216 556627 604094 545767 482292 566449 544189 545027 633048 668476
10802 668476 679002 703874 758029 670097 538432 492810 548433 670283 715471 650768 648736
10791 648736 723683 784635 924172 921784 977036 996051 915942 945373 992240 1052915 1137596
10780A137596J09656m9220j31294Q8053N1644P2118L5891R9789Q0080J32940k1484
10769A605769K1160R5097J61607K11042J21582J70749K78758J29050J24463L73234
10759C292511M45283K19637L76774M63314O61423O72728N69533N84937Q03937
10750H090077J235794J385641J717212K167034K342710K675532K752857K756571
10742B5123428K465424K038353J328622N68282j03422p21488j080551j383621
10734B8235027j746438j846914j767439j671073j628856j258249j014790r58661
10726A6342607p36838m94406j75905J57611K90590J84540M72691Q01174J060387
10717A7902451J251708J594120J940827K423464L123329L837727M630785N425948
$$ plain form
10780 1137596 1247252 1198032 1066738 1154791 1206435 1278553 1314444 1414233 1494313 1627253 1605769
10769 1605769 1626929 1722026 1883633 2094675 2216257 2387006 2665764 2794814 2919277 3292511
10759 3292511 3737794 3957431 4334205 4797519 5458942 6131670 6701203 7286140 8090077
10750 8090077 9325871 10711512 12428724 14595758 16938468 19614000 22366857 25123428
10742 25123428 27588852 29627205 30955827 31524109 31420687 30699199 29618648 28235027
10734 28235027 26488589 24641675 22874236 21203163 19574307 18316058 17301268 16342607
10726 16342607 15605769 15111363 14935458 15093069 15383659 15568199 16040890 16842064 17902451
10717 17902451 19154159 20748279 22689106 25112570 28235899 32073626 36704411 42130359
10709D2130359O026514O369199O611779O805255O749040O328128N358369L485506
10701H9864149Q08431k364920n210440p362745q667774q991582q053081o802360
10693D3219678n526214m372679l318166k667874j908084j378622r99604n78670
10685B2469765m79658l95970j53508k22784J04788M41740P05574J146319J464232
10676B5080498K231624K870955L518708M207012M601164M701442M537869L629798
10668E5379070K284392J008844n13917k060127l383115m152142m701561m871908
10660C8989536m633163m307599l735529l275519k780775k251495j948686j571003
10652A4485767j349617j096071j014654q32681o95530o58167m43333k79285l98786
$$ plain form
10709 42130359 48156873 54526072 61137851 67943106 74692146 81020274 86378643 89864149
10701 89864149 90672580 88307660 83097220 75734475 67066701 58075119 50022038 43219678
10693 43219678 37693464 33320785 30002619 27334745 25426661 24048039 23048435 22469765
10685 22469765 21990107 21594137 21440629 21217845 21322633 21764373 22469947 23616266 25080498
10676 25080498 27312122 30183077 33701785 37908797 42509961 47211403 51749272 55379070
10668 55379070 57663462 58672306 58158389 56098262 52715147 48563005 43861444 38989536
10660 38989536 34356373 30048774 26313245 23037726 20256951 18005456 16056770 14485767
10652 14485767 13136150 12040079 11025425 10192744 9497214 8839047 8395714 8116429 7717643
10643G717643m74948k09830j61891m23891l29407k37345m59083n39638k19794
10634D661816k13933j55470o1048r4166l8390Q524M0450J07407K90291K92767
10624D838248L00389K72097K08047K86321L46503L44839L53174N05088Q00891
10615H255597J336340K050621K883539L776650N148477O996922Q704027R762273
10607D8914446Q806232O109023L048505K76883j788951k075261n11562K586579
10599F5365894O799968J2078106J7438916J9774099J6091571Q806943J273890
10592A47629387n249367r817315j0277547o546674l95294P105754J5500649K2718365
10584A60667958K4383767J7418547N857955n161733j4465492k0791019k1162560
$$ plain form
10643 7717643 7242695 7032865 6870974 6447083 6117676 5880331 5421248 4881610 4661816
10634 4661816 4447883 4292413 4231365 4137199 4098809 4107333 4147783 4255190 4545481 4838248
10624 4838248 5138637 5410734 5618781 5905102 6251605 6596444 6949618 7454706 8255597
10615 8255597 9591937 11642558 14526097 18302747 23451224 30448146 39152173 48914446
10607 48914446 57720678 63829701 66878206 67155089 65366138 63290877 62779315 65365894
10599 65365894 72165862 84243968 101682884 121456983 137548554 146355497 147629387
10592 147629387 142380020 132562705 122285158 115738484 115343190 122448944 137949593 160667958
10584 160667958 185051725 202470272 208328227 203166494 188701002 167909983 146747423
10577A46747423j6315088r105651j497419N640542J1154008J1861901O502931
10570A54988647j322015q451471j4395809j7678128j7051324j3121957q242608
10563G4725335l730685l0366K149027K214908p6162l167202o150621q317140r372431
10554D8244663r090287p489677n729667m208461l230038k351376j854368j419188
10546A2871601j157207r74304q30046p68295o22063o01581n58820n08782m11896
10537F438607j93638k25510k74887l68302l23075j66181j20258k07266j23058
10528D436432j92686j89350j40422q46p710r0146o1572j63563r4279m7667m8120
10517C400071l7839l2579j00273r7495j8088K4038J37649J05169o9008J25518
$$ plain form
10577 146747423 130432335 121326684 119829265 125469807 136623815 148485716 154988647
10570 154988647 153666632 145215161 130819352 113141224 96089900 82967943 74725335
10563 74725335 70994650 70964284 73113311 75328219 75252057 72084855 65934234 57617094 48244663
10554 48244663 39154376 31664699 25935032 21726571 18496533 16145157 14290789 12871601
10546 12871601 11714394 10740090 9910044 9141749 8519686 7918105 7359285 6850503 6438607
10537 6438607 6244969 6019459 5744572 5376270 5053195 4887014 4766756 4559490 4436432
10528 4436432 4243746 4054396 3913974 3913128 3905418 3815272 3753700 3590137 3495858 3448191 3400071
10517 3400071 3362232 3329653 3229380 3131885 3113797 3137835 3275484 3380653 3311645 3437163
10507C437163J81898P5937P0865K83311J71230K09693K03936K40324L72021L81876
10497E628254K96924M08897P03499P78004Q36644Q94674J085816J358618J373749
10488A3365079J419935J334927J413672J537761J310272J322473J230313J250904
10480B4185336J330518J361167J500352J704049J819192J798422J651717J437825
10472C6788578J156050P50203K36553j98222o66460j094437j201374j189675q51033
10463C3730183o18710l32737k79009m5298O0660J06714R5162L38271N59390O72017
10453C4286643Q27699J141341J072332J059423Q18650O62122N04785M80717Q69455
10444D1723167J425086J989628K521986L050724L154199K994902K405920J303716
$$ plain form
10507 3437163 3619061 3694998 3765863 4049174 4220404 4430097 4634033 4874357 5246378 5628254
10497 5628254 5925178 6334075 7037574 7815578 8652222 9546896 10632712 11991330 13365079
10488 13365079 14785014 16119941 17533613 19071374 20381646 21704119 22934432 24185336
10480 24185336 25515854 26877021 28377373 30081422 31900614 33699036 35350753 36788578
10472 36788578 37944628 38694831 38931384 38733162 38066702 36972265 35770891 34581216 33730183
10463 33730183 33111473 32778736 32499727 32454429 32515089 32621803 32716965 33055236 33614626 34286643
10453 34286643 35114342 36255683 37328015 38387438 39206088 39868210 40372995 40853712 41723167
10444 41723167 43148253 45137881 47659867 50710591 53864790 56859692 59265612 60569328
10436F0569328J30651r37311j555209j945586k248828k222009k004833j809318
10428D7976885j415787j237017j227425j288594j528872j779470j855090j680939
10420C5963691j823465j767004j648531j510779j423933j254755q46416o50801
10412B5038007n36234m00233m09410j76814k3599R1534K454J56733K84387P2985
10402B4099810J60192N4727l4860j29736k57860k96640n97757q12400r25324r73117
10392B0287035r67769j012525j028748q33592q23783p44745p82077p61995q32971
10383A2498830p33399p63644q53298p94453o88222o13333o88667o22468n93059
10374F148287m94811m36773m00077l49564l49324l11493j88996j68778j56145
$$ plain form
10436 60569328 60699979 59762668 58207459 56261873 54013045 51791036 49786203 47976885
10428 47976885 46561098 45324081 44096656 42808062 41279190 39499720 37644630 35963691
10420 35963691 34140226 32373222 30724691 29213912 27789979 26535224 25688808 25038007
10412 25038007 24501773 24101540 23692130 23515316 23491717 23583251 23585705 23742438 24026825 24099810
10402 24099810 24260002 24314729 24279869 24150133 23892273 23595633 22997876 22185476 21260152 20287035
10392 20287035 19319266 18306741 17277993 16444401 15620618 14875873 14093796 13331801 12498830
10383 12498830 11765431 11001787 10148489 9354036 8665814 8052481 7363814 6741346 6148287
10374 6148287 5653476 5216703 4816626 4467062 4117738 3806245 3617249 3448471 3292326
10365C292326k18107k10802l0084l7959o5521j75291J95L9885J103K1287L4876
10354B651908n4143j55026o6344p0755N1236m5340P255P2301M1153n7145j40632
10343B234468m9779P360j2790j61740o8040M891j5907J11833J65751l5364K8221
10332B208904Q9684J92135k635k0324k5328o5539p192L3802k9184J5515P1871
10321B461709J15701J86355K35737J04006O6282K00769J74874J9441J40073J66597
10311C871544J44662J63764J09921K24376J94774R0753L05194K43565J86825K42867
10301E778245K79671M56363N53837N01400N66529M30039P05152Q19905Q92151
10292A0983292Q89498J126917J243331J517500J554001J780802K151343K208494
$$ plain form
10365 3292326 3074219 2863417 2833333 2795374 2729853 2554562 2554757 2594642 2595745 2617032 2651908
10354 2651908 2597765 2442739 2376395 2305640 2356876 2311536 2318791 2391092 2432245 2375100 2234468
10343 2234468 2184689 2192049 2179259 2017519 1949479 1954370 1938463 2050296 2216047 2180683 2208904
10332 2208904 2298588 2490723 2488088 2467764 2442436 2376897 2369705 2403507 2374323 2389838 2461709
10321 2461709 2577410 2763765 2999502 3103508 3169790 3370559 3545433 3564874 3704947 3871544
10311 3871544 4016206 4179970 4289891 4514267 4709041 4799794 5104988 5348553 5535378 5778245
10301 5778245 6057916 6514279 7068116 7569516 8136045 8566084 9271236 10091141 10983292
10292 10983292 11872790 12999707 14243038 15760538 17314539 19095341 21246684 23455178
10284B3455178K275457K821338L278217L879206M794260O012923P555883R651831
10276F3724293J2651494J6442101K1655168K8456254L6571529M4589993M9045855
10269B73136687M4799737K9735330Q976209j1598542k9142122m0891248m4283899
10262B30732152m0945874l4190978k7322740k1482238j6700882j3028651j0314095
10255F6746694q295287o626008n484727m401917l779292l349654k848784k676902
10247B9284123k330331k268516j932459j728102j557366j475230j453291j200842
10239A5337986j085550r01060o35046o83055o85816n83621n11686o31900n13394
10230I106858m40463n13443m61007l85458k91959l29664k96910k93145k43922
$$ plain form
10284 23455178 25730635 28551973 31830190 35709396 40503656 46516579 54072462 63724293
10276 63724293 76375787 92817888 114473056 142929310 179500839 224090832 273136687
10269 273136687 317936424 347671754 356647963 345049421 315907299 275016051 230732152
10262 230732152 189786278 155595300 128272560 106790322 90089440 77060789 66746694
10255 66746694 58451407 51825399 46340672 41938755 38159463 34809809 31961025 29284123
10247 29284123 26953792 24685276 22752817 21024715 19467349 17992119 16538828 15337986
10239 15337986 14252436 13351376 12716330 12033275 11347459 10763838 10252152 9620252 9106858
10230 9106858 8666395 8152952 7691945 7306487 7014528 6684864 6387954 6094809 5850887
10221E850887k57757j81783k33237k32016k22372j53411j16197k62980j50720
10212D040414j82209j56987j41495k01272r3636n0687k1047J0843k7312j61092
10202C015520q3334p0391q5267j54618j03291L1361p2445r6079j44519r1601j09431
10191B035905r8566r0561q9085q4583j5747k2095J5702m6985j1268J2530k3047
10180A582200l5138j23323k7269J38520M9937q4644j8320P5148J10802J6098j1109
10169A672902n7061j10410j11958J16354N3121o4701k8965J02343K04643P7681
10159A853949o2130K3585O674j01614j09649q3053o6304r2817K0047J34225J78566
10148A701479J97667N2599M4542N0568l433m7726q5170j27037n5519K8666J02049
$$ plain form
10221 5850887 5593130 5411347 5178110 4946094 4723722 4570311 4454114 4191134 4040414
10212 4040414 3858205 3701218 3559723 3358451 3264815 3214128 3193081 3203924 3176612 3015520
10202 3015520 2932186 2861795 2776528 2621910 2518619 2549980 2477535 2381456 2236937 2145336 2035905
10191 2035905 1937339 1846778 1757693 1673110 1657363 1635268 1650970 1603985 1592717 1605247 1582200
10180 1582200 1547062 1423739 1396470 1534990 1584927 1500283 1481963 1557111 1667913 1684011 1672902
10169 1672902 1615841 1505431 1393473 1509827 1562948 1498247 1469282 1571625 1776268 1853949
10159 1853949 1791819 1815404 1822078 1720464 1610815 1527762 1461458 1368641 1388688 1522913 1701479
10148 1701479 1899146 1951745 1996287 2046855 2043422 1995696 1910526 1783489 1727970 1756636 1858685
10137A858685J75998N6070J0253q5739n3405m2542l1286k15105j14494j17334
10127A441101p7597l3611O4513M3078J28957j9184k06082j16594n738j14777j22321
10116I81745k3998j14858k3968r9j05686j72179J4708Q4202K4280m9968m3361
10105E70818K4009M9872O5515p977j09801o6805Q6437J04427l011j19914o3597
10094E29973O9865k641Q0028O9832o955q6559N4725M2999j06999m8426J18807
10083G14649M1497j07886J09535N3808l4664M618j85401k49039J4067j8988L7238
10072C79434K26840p45k218J12802j7234M506K5555k4927N9395j2899m0429j6685
10060F93395o9317j14729O692L2287J33745O2190j3947j08332r0995R9755J5328
$$ plain form
10137 1858685 2034683 2090753 2101006 2015267 1961862 1919320 1888034 1672929 1558435 1441101
10127 1441101 1363504 1329893 1394406 1437484 1566441 1547257 1341175 1224581 1218843 1104066 981745
10116 981745 957747 842889 818921 818822 713136 540957 555665 639867 664147 614179 570818
10105 570818 594827 644699 710214 702237 592436 525631 612068 716495 713484 593570 529973
10094 529973 599838 597197 677225 747057 740102 653543 708268 751267 644268 595842 714649
10083 714649 756146 648260 757795 811603 776939 781557 596156 347117 361184 342196 379434
10072 379434 606274 605529 603311 716113 698879 703385 728940 704013 763408 750509 710080 693395
10060 693395 624078 509349 516041 548328 682073 744263 730316 621984 530989 630744 646072
10049F46072L2579j7009J1791r1761j01909Q7253J96702m4397j02383P522k5643
10038E98817p1563M9549q177J12202Q8019Q216q900K7323N1871J19481k5524j68865
10026G72449m3845Q681Q5939j7782O5412R392j40478q2798J19297p372j3382m7268
10014G08245O8152M2699j12042j6860r1233l4753P075r0798k2950k0032l868n655
10002D27980j33261L1444L5289N3577k6414j52038m9551J12112M5051l0642J7195
9991C30742K5043J5011L4877O8289m1998J24638N7417J1896o8197j38696j43011
9980B76011o761J8561J5916O5623J05866k3854j6621n0106j14068K1991J8155
9969C10713K9004J094N630J159N4324r3634q9289m6559N961n4005j586n7321j7698
$$ plain form
10049 646072 678651 661642 673433 581672 479763 567016 763718 719321 616938 624460 598817
10038 598817 527254 576803 568626 680828 768847 777063 768163 795486 847357 966838 941314 772449
10026 772449 728604 737285 823224 805442 870854 880246 739768 656970 776267 768895 755513 708245
10014 708245 776397 819096 707054 690194 598961 564208 571283 480485 457535 437503 433635 427980
10002 427980 294719 326163 361452 415029 388615 236577 187026 299138 344189 313547 330742
9991 330742 355785 370796 405673 473962 431964 556602 614019 625915 557718 419022 276011
9980 276011 269250 287811 303727 369350 475216 451362 434741 384635 270567 292558 310713
9969 310713 339717 340811 346441 347600 401924 308290 219001 172442 178403 124398 122812 65491 47793
9956D7793L0551J16991J34112o7136k08319j2566Q0750K1701Q3635K2237M507
9945B54256k5631j21633o7283O8262Q0004Q9094l5437J19890k052j43911l5486
9934A80073O2290P0268j69320l0450J38465M5694p3933r8337M7201J00970n8866
9923B14055l5829l8824M1738j0766J20537L0086n951L5672o1480j85236p4817
9912B9185R2941Q6766Q5560o6336j77670j7136P2748R8214P0599J8648K6385r4597
9900B25307k1461l6672P2011J1099o1850j75154R390P3900P7127J04585O552q3944
9888B00890k4455j7976n3340n9135p3385k0287J94706M1715m3981M3773K6449
9877B14974m7016k4050j17891j52708L9681J12944J8246o692N7507L2245L5665
$$ plain form
9956 47793 78344 195335 329447 262311 53992 41426 122176 143877 227512 249749 254256
9945 254256 228625 106992 39709 107971 187975 277069 241632 361522 359470 215559 180073
9934 180073 242363 312631 143311 112861 251326 297020 223087 124750 171951 272921 214055
9923 214055 178226 139402 181140 170374 290911 320997 315046 350718 289238 104002 29185
9912 29185 122126 208892 294452 228116 50446 33310 106058 204272 274871 293519 319904 225307
9900 225307 203846 167174 239185 250284 188434 13280 22670 96570 173697 278282 284834 200890
9888 200890 176435 158459 105119 45984 -27401 -47688 147018 188733 144752 188525 214974
9877 214974 167958 143908 26017 -126691 -87010 25934 44180 37488 94995 127240 162905
9866A62905J07553j2004l3447o8262M1630K3718p0920M4003K9167p079N2689J71082
9854D41035Q3145Q4406J6967L7116P1922J48968J81379J49406J35400J19208J77827
9843A646779J0585j1691M5626j65775l10532j54814j24558j07617K6033l0396
9833H23640j54589p1611j40398o7542J6535M1504j2655L6065n0513l4574n551
9822C80311l0295n3008N1180o1484L968m3596O2986J0029K2865O3923j19796j63345
9810A23738j9502R1267K7583n4255L4301J092P9595J42587k164q6270p6907j18188
9798A42877k2323O8004m4451J2594J20731o9341k8543l840M1483O9723n2944j66877
9786F7093m6172j0122J93l0455R9130j5623j0916q0639J5594J42415N2210R5076
$$ plain form
9866 162905 270458 258454 225007 156745 198375 222093 151173 195176 224343 217264 269953 441035
9854 441035 524180 608586 625553 662669 734591 883559 1064938 1214344 1349744 1468952 1646779
9843 1646779 1657364 1645673 1691299 1525524 1214992 1060178 935620 828003 854036 823640
9833 823640 669051 597440 457042 389500 406035 447539 434884 470949 420436 385862 380311
9822 380311 350016 297008 348188 286704 290672 247076 310062 320091 342956 406879 287083 123738
9810 123738 104236 195503 223086 168831 203132 204224 283819 426406 424242 337972 261065 142877
9798 142877 120554 188558 144107 156701 277432 208091 179548 175708 217191 286914 233970 67093
9786 67093 20921 10799 10992 -19463 79667 64044 53128 -27511 -11917 130498 182708 277784
9774B77784R4923q5297m5697k2008o4365J47834M9516j123o1525l3322j16664
9763A40056k8892J07073J9501j01779r0044L1232l4797k654n8792R295K0418M2883
9751E3500j1611P0612L6531j19232r1876l2914J51904J01039k2551q9601J63895
9740B09696J59859J758o6863l2518k6615J8013N2747k6033p3661J0801l5680K3385
9728B14889q151n1404q1506j7212N0417K9321k8745j694K4681J19531J164k21392
9716B9899r8757J1293p75p4911K7901P8408k7326M2420K3330J47204o7231k0689
9704G0766L5330R2112K99j7589P5501L4023k1911k46630p307P2020n2843k0511
9692A3260l1220R764j25355L9656Q2601J198j9093O0926N6394m745j01962j8077
$$ plain form
9774 277784 372707 287410 241713 219705 155340 303174 352690 351567 290042 256720 140056
9763 140056 111164 218237 237738 135959 45915 77147 42350 39696 -19096 -9801 10617 53500
9751 53500 41889 112501 149032 29800 -62076 -94990 56914 157953 135402 45801 209696
9740 209696 369555 371313 304450 271932 245317 263330 316077 290044 216383 227184 191504 214889
9728 214889 206738 155334 73828 56616 107033 136354 107609 105915 130596 250127 251291 29899
9716 29899 -68858 -57565 -58340 -133251 -105350 -26942 -54268 -11848 11482 158686 91455 70766
9704 70766 106096 198208 198507 180918 256419 290442 268531 21901 14594 86614 33771 13260
9692 13260 -17960 -8196 -133551 -93895 -11294 -10096 -29189 31737 88131 83386 -18576 -36653
9680c6653R9851J01767k5276J66339P9784o9971p8246j08893n9757j8336n1865
9669a256P5173j163l1473M0523K9539L1797K7254K4260k7120N7047N7464r2872
9657A89173k248P6266J3900j55199M80R7578n068n7399j08206j1870M8528k7070
9645E8865L1614J43112L8855l2574M2836l0617l9593n3051n6734k9243K4345o6876
9633C0939k8375O0354l0107p845J21918P9185O2914R5432J7478l0688j36281j45018
9621H9906K4397J01678M5362q0110k0636j8866L0098M4912K1300q299o0790l7238
9609A31714O2103k6415j25820j12680j5838J35479P9753Q0792j5856j02063N4739
9598A45908N2455l8360J22736L3674n0484p4241l4692L1556r247L3381o7835m4312
$$ plain form
9680 -36653 63198 164965 139689 306028 385812 315841 237595 128702 68945 50609 -1256
9669 -1256 73917 72754 41281 81804 111343 143140 170394 194654 167534 224581 282045 189173
9657 189173 186925 263191 277091 121892 122372 219950 214882 157483 49277 37407 85935 58865
9645 58865 90479 233591 272446 239872 282708 252091 212498 159447 102713 73470 97815 30939
9633 30939 2564 62918 32811 24966 146884 226069 288983 384415 401893 371205 234924 89906
9621 89906 114303 215981 261343 181233 160597 141731 171829 216741 238041 229742 168952 131714
9609 131714 193817 167402 41582 -71098 -86936 48543 128296 209088 193232 91169 145908
9598 145908 198363 160003 282739 316413 265929 191688 156996 188552 179305 212686 144851 100539
9586A00539o1904q2468Q6681Q2225N4528j52543l3560j094m657J51657J89303
9575C28707o5162p727k8962m9544p7114k4540k0344J0598p92O6195R0532O0271
9563B82118j20596o3632n2433j5520J1431R878N3326N0727p2032j50222k4539
9552i1494J6961J59571M0629Q0209L16l6210n6929l7224K0204J07342P219j58151
9540E2443P974O4581J0038r6842K4092j20709n4134q2398O5442J18827K4024O1085
9528G4423o088q562o3481J12445l8159K5760Q8046J7274J4145l6160j12029l2522
9516C5092J1349l5320o0583o7941k2031J6329K8746J9410J07392J92903Q4846
9505C10192N860j85888j6237L4632j4445j16990k5301k9352Q2884k1455j36808
$$ plain form
9586 100539 38635 -43833 42848 125073 179601 27058 -6502 -7596 -12253 139404 328707
9575 328707 263545 255818 226856 177312 100198 75658 55314 65912 65120 131315 221847 282118
9563 282118 161522 97890 45457 29937 41368 51246 104572 155299 83267 -66955 -91494
9552 -91494 -74533 85038 125667 205876 206192 169982 113053 75829 96033 203375 210594 52443
9540 52443 60417 124998 135036 38194 62286 -58423 -112557 -194955 -129513 -10686 13338 74423
9528 74423 68335 59773 -3708 108737 70578 96338 184384 201658 215803 179643 67614 35092
9516 35092 46441 11121 -49462 -117403 -139434 -123105 -94359 -74949 32443 225346 310192
9505 310192 316052 130164 113927 148559 134114 17124 -8177 -37529 45355 23900 -112908
9494a12908j6060J68448K371j99883q3942P3893R2842m0113m6149n837K6324J0679
9482a30335R8558J68600L8923l0575n6412q0345m4470r5566N0613N6968N439p44
9470a9346P6623k3394R2614K9468m675j2099o5607J794k05908K5087J10348q0774
9458g5869j05109J7672J36642J728o4137l8693J48366Q8677J00714m0617j190
9447A68184l5783r3330J7798l212o7514j2726N1675q7046m6384K6175J19823M3410
9435H1070n9892N8021J40185O3903n7056J0370P9874j57931l3404o5761O1655
9424A21034J35815j55174j73389p1995J44489R332q5724Q3940j780K3184M3519
9413G3251Q1297j1156J6687L7749j5002L0498Q1418j56860j06739R7629L3447
$$ plain form
9494 -112908 -128968 39480 41851 -158032 -241974 -168081 -75239 -115352 -161501 -167338 -141014 -130335
9482 -130335 -31777 136823 175746 145171 88759 8414 -36056 -131622 -81009 -24041 -18602 -19346
9470 -19346 57277 33883 126497 155965 151290 139191 73584 75378 -130530 -105443 4905 -75869
9458 -75869 -180978 -163306 -26664 -24936 -89073 -127766 20600 109277 209991 169374 168184
9447 168184 132401 39071 56869 53657 -13857 -26583 25092 -61954 -108338 -82163 37660 81070
9435 81070 21178 79199 219384 283287 226231 236601 316475 158544 125140 59379 121034
9424 121034 256849 101675 -71714 -143709 780 10112 -75612 8328 6548 29732 73251
9413 73251 154548 143392 160079 197828 182826 213324 294742 137882 31143 128772 162219
9402A62219m6686k2619J14572q3638K6262M2277J9972p7113j01869M2283j28409
9391e2749n1274M2669R4911O5645l7495l4000N2155O7188n5729n6714o2173N7051
9379B9485N5638j7539K7277O2877J2349n3116L2312n1613j07117n7808q5232J2686
9367a39801J46398P8389J786K2603p3423k2180K0010J8716K0907j23348k9041
9356g8984L2363J71464J73581p3619m112o2449k33980l9902J05072m1456Q1718
9345B9696J44693Q8950J3954p0198j089J841L8525k1784R1010j11955j38930j52988
9333h8275r1126J17306J07334O3472M1442j15503K1779k802k3693J63579M2526
9322B36039j63251N6670J60352o5746j06111M7614j0928j9327N4676N8298r7458
$$ plain form
9402 162219 115533 92914 207486 123848 150110 192387 212359 135246 33377 75660 -52749
9391 -52749 -104023 -61354 33557 99202 61707 27707 79862 147050 91321 34607 -27566 29485
9379 29485 85123 67584 94861 157738 170087 116971 149283 97670 -9447 -67255 -152487 -139801
9367 -139801 6597 84986 86772 109375 35952 13772 33782 52498 73405 -49943 -78984
9356 -78984 -46621 124843 298424 224805 220693 158244 -75736 -115638 -10566 -52022 29696
9345 29696 174389 263339 277293 207095 206006 207847 246372 224588 315598 203643 64713 -88275
9333 -88275 -179401 -62095 45239 108711 150153 34650 56429 53627 29934 193513 236039
9322 236039 72788 129458 289810 224064 117953 165567 154639 135312 189988 248286 150828
9311A50828j40388l1256P1728O7448M0371l3014p9573j7451K065j11948M6868
9300c4322J97508n6852j44567m2084o2608O340J44742J01598J2073o6402p4072
9289a8646L4024L1062p806O6273Q8396j1535m9935n8635J9299j3966m9862K9300
9277E7969Q1282l3864l5361l8188J5442l9264o8277R1579K0755o4257q809o0273
9265h1266n2332J8967m5948L2337M0514K5062J6303K9314p339k5796J6644J28215
9253I4675M7935l2778o0584J3288n4756n9988M8274J20557k4453j04489M6615
9242C4296J53368j20542M108O2826j20792j59420N1415J35951L3217P760j13651
9231c1464k3726k0470J6082L1100J27627M8991k36586j17222J39213O6457n6165
$$ plain form
9311 150828 10440 -20816 50912 118360 158731 125717 46144 28693 30758 -81190 -34322
9300 -34322 163186 106334 -38233 -80317 -142925 -136585 8157 109755 121828 55426 -18646
9289 -18646 15378 46440 38634 104907 193303 181768 131833 73198 92497 78531 28669 57969
9277 57969 139251 105387 70026 31838 47280 8016 -60261 31318 52073 -12184 -20993 -81266
9265 -81266 -133598 -114631 -160579 -128242 -87728 -62666 -46363 -17049 -24388 -50184 -33540 94675
9253 94675 142610 109832 49248 62536 7780 -52208 -3934 116623 92170 -12319 34296
9242 34296 187664 67122 71230 134056 13264 -146156 -94741 41210 74427 82187 -31464
9231 -31464 -55190 -75660 -59578 -28478 99149 148140 -88446 -205668 -66455 2 -56163
9220e6163O1484l1794J9360k3686J56714Q3294n4058P681k4902l2405m7889L9194
9208I6830l902k5619k4956o279J5735O6435m8364p8690k363j2763l9390Q8321
9196B4995M720j2695R4959k2687k5061m0386Q5103N1663r8418j33817l9365n0577
9184a61566p8383J81547J02332k9771P3677L7281j21642O4411l2832n5091k351
9173b2388L2920j907O452n5289J0504m8250m0929r6911m1128o352R2007R9111
9161g2160k6437M9598J00189N0424j7882j11569m4138Q2429l3697o6747n686j0693
9149a06369m3383j5162r1739L4419J53348P3542j1847N4568L8916O2347O1744
9138B10384p7734j40555M0111Q5762Q0771k1107J2007j00714j09282r1305p4056
$$ plain form
9220 -56163 5321 -26473 -7113 -30799 125915 209209 155151 162832 137930 105525 57636 96830
9208 96830 92928 67309 42353 36074 51809 118244 69880 -8810 -11173 -23936 -63326 24995
9196 24995 29715 17020 111979 89292 64231 23845 108948 160611 62193 -71624 -110989 -161566
9184 -161566 -239949 -58402 43930 14159 87836 125117 3475 67886 35054 -20037 -22388
9173 -22388 10532 8625 15077 -40212 -29708 -77958 -118887 -215798 -256926 -263278 -171271 -72160
9161 -72160 -98597 -48999 51190 101614 83732 -27837 -71975 10454 -23243 -89990 -95676 -106369
9149 -106369 -149752 -164914 -256653 -222234 -68886 4656 -7191 47377 86293 148640 210384
9138 210384 132650 -7905 32206 117968 198739 177632 189639 88925 -20357 -111662 -185718
9127a85718J41810m4783j4193j3835m714J11105j00340m4383l0401P6499J12326
9116C373J9034j1656l7800p6366L7814J15015j5152K5859Q1552k4033o1108k5586
9104C0946J6859L9548K5068m079K9897R232m3015o8883r4497j69811Q2373L8157
9092a08205J22069J11467P9137j86172m1183J91664Q0839n0780k2074q7801l0181
9081E8780m9532O778J1464m2008K0738j0425O7147n7917J1534p9145q5588J7985
9069a30189j0093k7629J2666J69841Q1161j08289o5500M7770k887N7122R4032
9058A18005m2625j35004n6752J29730l0516k2874J14977J93825K3300r3320j47818
9047E0928M9870P2759j00490j14572j4065R9211O062m7726Q8535L8452k0616o5221
$$ plain form
9127 -185718 -43908 -88691 -102884 -116719 -121433 -10328 -110668 -155051 -185452 -108953 3373
9116 3373 22407 10751 -27049 -103415 -65601 49414 34262 60121 141673 117640 56532 30946
9104 30946 47805 87353 112421 108342 138239 147471 104456 35573 -58924 -228735 -146362 -108205
9092 -108205 13864 125331 204468 18296 -22887 168777 249616 198836 176762 88961 58780
9081 58780 9248 16026 27490 -14518 6220 -4205 62942 5025 16559 -62586 -148174 -130189
9069 -130189 -140282 -167911 -155245 14596 95757 -12532 -78032 -30262 -33149 23973 118005
9058 118005 75380 -59624 -116376 13354 -17162 -40036 74941 268766 292066 198746 50928
9047 50928 100798 173557 73067 -41505 -55570 43641 49703 1977 90512 128964 108348 43127
9035D3127j8183p400p4386r2193K4667K03755k7552m0904j2427Q1735L1639k0704
9023I1174n9692o2285o3116J9528O6617o0860R850j1638J5850L8288m591L1792
9011A0917J12969o791q6264n6008k7560J41012J22116n1436r3397k1592K448j5990
8999C0424q7083l9950O6575J95030K9137m8711j48130m3872q1942P4676R8083
8988D4237J40511j07183o5493k2829K4282N1775k2682j02926j26372J6547J25353
8977d4780K5034j0616L5054l9238q706k1680K2122k3560Q6058J0952O9137j8075
8965H1702Q1402P289j47877p6749J06329q03L8898P0561q7400l2254L2342m9600
8953B3840N4679Q1425n3976n9017j3669n8672J12608j05447n6813o966L3221Q3434
$$ plain form
9035 43127 24944 17544 -56842 -149035 -124368 79387 51835 10931 -1496 80239 111878 91174
9023 91174 31482 -30803 -93919 -74391 -7774 -68634 -58784 -70422 -54572 -16284 -20875 10917
9011 10917 123886 117095 30831 -25177 -52737 88275 210391 158955 65558 43966 46414 30424
8999 30424 -56659 -96609 -30034 164996 194133 145422 -2708 -46580 -128522 -53846 44237
8988 44237 184748 77565 12072 -10757 13525 65300 42618 -60308 -186680 -170133 -44780
8977 -44780 -19746 -30362 4692 -34546 -43252 -64932 -42810 -66370 19688 30640 99777 81702
8965 81702 163104 170393 22516 -54233 52096 51293 90191 160752 73352 41098 73440 23840
8953 23840 78519 159944 105968 46951 33282 -25390 87218 -18229 -75042 -82008 -48787 34647
8941C4647O6951m5762Q9516Q1950K6929m771o0897P5240p4146p5870o8625M8646
8929I3808P2244j17707M3198m5696n7355N6654J00076m6307l0276r577o993m9349
8917B720m9970L1151M0758j2684l9813r00J43556K563n4268p6531j37681M212
8905a46887K03680J18656L2012j15186n7564K0966K9520K6573r2610J1205Q384
8894C8749N0595J3516K7719N6749l7802Q0435l0994j50971j42903Q8111l3411
8883d0207j21957j3499J65078R6486J10013j05719o5441P327k7236P8445l4589
8872D8701m9081J08925m9190j7995p3437M0121Q7296p7292n491J01372L8970J2238
8860A65137j25125n7832O3008M0052M1513k9229L326j9612k4189N1472L4492j23133
$$ plain form
8941 34647 101598 55836 145352 227302 254231 249460 188563 263803 189657 113787 45162 93808
8929 93808 166052 48345 91543 45847 -11508 45146 145222 98915 68639 59062 52069 2720
8917 2720 -47250 -16099 24659 11975 -27838 -28738 114818 117381 63113 -13418 -151099 -146887
8905 -146887 56793 175449 207461 92275 34711 55677 85197 111770 19160 30365 38749
8894 38749 89344 102860 130579 187328 149526 229961 198967 47996 -94907 -6796 -40207
8883 -40207 -162164 -175663 -10585 85901 195914 90195 24754 32081 4845 83290 48701
8872 48701 -380 108545 59355 41360 -32077 8044 95340 18048 12557 113929 152899 165137
8860 165137 40012 -17820 45188 85240 126753 97524 100850 81238 57049 108521 143013 19880
8848A9880j26279Q449R7391m7309r353K15381K392j93362q6399m4071Q3476P3563
8836f241O3121q7091m9883J13178J5886K17Q2803J16535N778j86302J4916j9682
8824F3235p4526o014l339N7650K2105K5151M2787J5579l4930p5416R646j0298
8812C1630J3631q1747q3769r7763p9711J58172J48648L9277n3215j27169M3717
8801h8299O2624J25551L0033j30224j44798m2176O5287J85769P1727o4913O9315
8790A39896j3551L5749j2510r5303k9397L152L8014M050J50375l220j33458j12107
8778b8310J02319m5326j8906J01395l8792j45011J18301J60023j1068p3216L4214
8767A55623k7927m1225l6954n8777P4092K3752J07988J14821l8905L3891N73l7199
$$ plain form
8848 19880 -106399 -97950 -559 -47868 -57221 158160 160552 -32810 -119209 -163280 -79804 -6241
8836 -6241 56880 -30211 -80094 33084 48970 49187 131990 248525 254303 68001 82917 63235
8824 63235 -11291 -17305 -20644 37006 59111 84262 127049 142628 107698 32282 41928 31630
8812 31630 45261 -36486 -120255 -218018 -297729 -139557 9091 48368 -4847 -132016 -88299
8801 -88299 -25675 99876 129909 -315 -145113 -187289 -122002 63767 135494 70581 139896
8790 139896 126345 162094 149584 54281 24884 28036 66050 70100 220475 217255 83797 -28310
8778 -28310 74009 28683 9777 111172 72380 -72631 45670 205693 194625 121409 155623
8767 155623 127696 86471 49517 -9260 64832 88584 196572 311393 272488 306379 306952 269753
8755B69753l5861o2406J17682r6789j40784l9965L944j8031L3582N1044L1938
8744A14107j13364N6490J10641O3242m9262j22815j8882M2629n378o2138P2582
8733H7852Q0837O578q2412P4016p764J1277k5323r0295j00339R5627r0021L3574
8721f393R9960M048j42953n9149P5719R572L892N2567j0887L8669o8738k1978
8709b5671J4900M2091k7598n577j1496N0887J4473M1103o2532j67628k8876M3217
8697a22707M7251M1598J9662O550n857q4384L0835J15105N7026q7780q6460m3421
8685a12582j26323J9468J0438M099P1467J43564J59487j876j99477j22986L9921
8674a14800M5305n0568k2644O2024J88776k1891o3192J8261P2578k0757q1781
$$ plain form
8755 269753 233892 171486 289168 192379 51595 11630 15574 -2457 31125 82169 114107
8744 114107 743 57233 167874 231116 181854 59039 40157 82786 77408 15270 87852
8733 87852 168689 175267 92855 166871 159107 170384 145061 54766 -45573 50054 -39967 -6393
8721 -6393 93567 97615 -45338 -104487 -28768 -19196 -15304 37263 26376 65045 -3693 -25671
8709 -25671 -10771 31320 3722 -1855 -13351 37536 52009 93112 30580 -137048 -165924 -122707
8697 -122707 -75456 -33858 -14196 -7646 -13503 -97887 -67052 48053 105079 17299 -69161 -112582
8685 -112582 -238905 -219437 -208999 -204900 -133433 10131 169618 167742 -31735 -154721 -114800
8674 -114800 -69495 -120063 -142707 -80683 108093 86202 23010 41271 113849 93092 11311
8663A1311J12628L6926j01806P8896k1848j40361p7710N7903N0582l2496K4470
8652a505n6923j0838J05758p1542k5178L1364j61193l7315J27181n7701M7135
8641a10757J44930J10021p239K5264M373j739r2437j01328j21135j47203P9159
8630b18091J56938J62172P5888n4277j34736N8655J9542k3904k7829n9108l3285
8619g8035l7511r860J3874J08927n5792K7880N4890p748J33226N6081p0035j21374
8607A4523j59249m7120J39240l8578o9229j22369J45043J17422M9698j5683J216
8596A4914K4622J3243M6216j06218J8241R8819L53j5411j07705j40881K3475M6536
8584h3796j22221L9511Q1056P5109P5463l4741m5609L8844M92K3011l2735P2922
$$ plain form
8663 11311 123939 160865 59059 137955 116107 -24254 -101964 -44061 6521 -25975 -1505
8652 -1505 -58428 -69266 36492 -35050 -60228 -28864 -190057 -227372 -100191 -157892 -110757
8641 -110757 34173 144194 136955 162219 166592 164853 72416 -28912 -150047 -297250 -218091
8630 -218091 -61153 101019 176907 122630 -12106 46549 66091 42187 14358 -44750 -78035
8619 -78035 -115546 -125406 -111532 -2605 -58397 -30517 24373 16625 149851 205932 135897 14523
8607 14523 -144726 -191846 -52606 -91184 -160413 -282782 -137739 -20317 29381 13698 14914
8596 14914 39536 52779 98995 -7223 11018 109837 110190 94779 -12926 -153807 -130332 -83796
8584 -83796 -206017 -166506 -85450 -10341 65122 30381 -15228 23616 24108 47119 14384 87306
8572H7306M7378m6491l5879l5250J7840l5849m4985K0834M6529J22297l7038p7055
8560B9637m5134L7860J61392n2881l5210J31304L1719j17019r1866l2252L1470
8549D9020J24136R3436J5872j42718o9632r7406N9749K4748j01783r7311N1049
8538i0840L2128N8334J11726l3017m1947l0508L0574q7213N4433Q2706J8678l0374
8526G4680J3430J85260O5978r5918j45387m6443k5839m531J45337m7237j475j71806
8514e3951J13164Q8080j88786q5815l4341k9999P8186R4623r626J6828j00093
8503a11730j16211O4859P6087J40540R8348L3321K4891M2238N491j64423l588
8492H9823K0994O049k5488L4109r8111m4629L6895L6907k7087m5541M7545K57
$$ plain form
8572 87306 134684 88193 52314 17064 34904 -945 -45930 -25096 21433 143730 106692 29637
8560 29637 -15497 22363 183755 130874 95664 226968 258687 141668 49802 17550 49020
8549 49020 173156 266592 282464 139746 70114 -27292 32457 57205 -44578 -141889 -90840
8538 -90840 -58712 -378 111348 78331 36384 5876 36450 -50763 3670 86376 105054 74680
8526 74680 88110 273370 339348 243430 98043 51600 25761 21230 166567 119330 117855 -53951
8514 -53951 59213 147293 -41493 -127308 -161649 -191648 -113462 -18839 -28465 -11637 -111730
8503 -111730 -227941 -163082 -86995 53545 151893 185214 210105 252343 257834 93411 89823
8492 89823 110817 116866 91378 125487 27376 -17253 19642 56549 29462 -16079 31466 31723
8480C1723j24806n5589j356j11272J27026K17142m081j48999p2543K8673o939
8469a21021N3266J17547O2352P6487J17561l4054k39293m6779l582q2504J4815
8458h5205k7829Q883J10791j3793Q9373O7906j19285n8220n5693N9951j1084q2924
8446a17129K6367M9009m2577n1427J11323p7225m8999K2010M0819M4717N917j9345
8434e6540M6451J18029j03569L0218n7567M3184N6161j1552l9804q3057M9542
8423h504M281j18678m1002M8974N5596J9906K6351R3391r4587m1187J10991j7878
8411C7654P6605R615J5963j03409j9613J36257j12691l1766j7134K2892n6793
8400d2420r363o4070r1121M4916J29797L2317l2362p7794K9827K53012L2999j72
$$ plain form
8480 31723 -93083 -148672 -150028 -261300 -134274 82868 78787 -70212 -142755 -114082 -121021
8469 -121021 -67755 49792 112144 188631 306192 272138 32845 -13934 -17516 -100020 -85205
8458 -85205 -113034 -104151 6640 -7153 82220 150126 30841 -27379 -83072 -23121 -34205 -117129
8446 -117129 -90762 -41753 -84330 -135757 -24434 -101659 -150658 -128648 -87829 -43112 -37195 -56540
8434 -56540 -10089 107940 4371 34589 -22978 20206 76367 64815 25011 -58046 -8504
8423 -8504 -4223 -122901 -163903 -114929 -59333 -39427 -13076 80315 -14272 -55459 55532 37654
8411 37654 114259 123874 139837 36428 16815 153072 40381 8615 -8519 14373 -42420
8400 -42420 -51783 -115853 -206974 -162058 -32261 56 -32306 -110100 -80273 172739 205738 205566
8388B05566j00504j7067j6427Q3702m3446n8988p5138r3467N8083n5034j8268
8377a30988n0873p0897Q125J75812O9788P4962P1792M3797j08990j10348N2368
8366B4548R4871p0100o9928k1049J33837j7651j39280J35120N3711l155K0268
8355A41192m8010j39206k6058J54258J7975j46184k7060R3648M9410J1770K2630
8344A04365M5955n4795N5233q3769j70052m2807J23851R4119j5434J39180K96548
8333D92394R2582L944m4302M4944O525k15240j81549p6940j31691j11814k6063
8322a47210Q13j9819J49075n2443n1583M8874L9365j4224o0487R6079J21211J05483
8310B15134q9648j00790j25676q4991J10164J54951K9207m1759k0622p3325M8561
$$ plain form
8388 205566 105062 87995 71568 155270 111824 52836 -22302 -115769 -57686 -112720 -130988
8377 -130988 -181861 -252758 -244633 -68821 967 75929 147721 191518 82528 -27820 24548
8366 24548 119419 49319 -20609 -41658 92179 74528 -64752 70368 124079 120924 141192
8355 141192 93182 -46024 -72082 82176 100151 -46033 -73093 20555 69965 81735 104365
8344 104365 150320 95525 150758 66989 -103063 -145870 -22019 72100 56666 195846 492394
8333 492394 584976 588920 544618 589562 596087 380847 199298 122358 -9333 -121147 -147210
8322 -147210 -146397 -166216 -17141 -69584 -121167 -72293 -32928 -47152 -107639 -11560 109651 215134
8310 215134 125486 24696 -100980 -185971 -75807 79144 108351 66592 45970 -27355 21206
8299B1206R9564J6204q0941p6555M2762J01996Q5214P5716K32125M10571K49950
8288A177812J0837m4883j35073l10348k25331N6347j88974j87640o960m0449j33979
8277b8641o4043L6686J38528J23772j0059l5401L7369l9975K4900P4977Q520J6181
8265B82814j81127k29193K9583J28389J17661J1512k9289j99309j2290L502l4670
8254a12417J11844J422j5780J4863J5665P7556K0821m329L63911K57025j13837
8243F16744j18003o2431L430m3737k20189o2451Q9280K6022o9856l9368P1777
8232A91218Q6375m1669q0219n6046J37399K5938q3454o1683n5262q2407N8444
8221C8634J3720N540J15246K15202n6342o7211m1232kq6877R860k0J1129J3177
$$ plain form
8299 21206 120770 136974 56033 -20522 22240 124236 209450 285166 517291 927862 1177812
8288 1177812 1188649 1143766 1008693 698345 473014 529361 340387 152747 145787 105338 -28641
8277 -28641 -92684 -55998 82530 206302 196243 160842 198211 158236 183136 258113 266633 282814
8265 282814 101687 -127506 -97923 30466 148127 159639 130350 -68959 -81249 -77747 -112417
8254 -112417 -573 849 -14931 -68 15597 93153 113974 109645 473556 730581 616744
8243 616744 498741 436310 439740 396003 175814 113363 202643 228665 158809 119441 191218
8232 191218 277593 235924 155705 99659 237058 262996 179542 117859 62597 -19810 38634
8221 38634 52354 57894 173140 388342 332000 264789 223557 223555 136678 146538 146518 157647 170824
8208A70824j09943p0195Q0480O047K1207o9267r011J19179J3032p6180L1311P4097
8196A81581j69215k13749j9353O1234l0278J17033R7392L5913M5674r7906L300
8185A1626O6942M8629j04977p1992M1419o7351J8476L4379J52658J05673j29433
8174A06049o616m8219m9389J22338K4016p0412j43976J9295J02143O694q9124
8163b7201N9502k0636j72447k1559K8444R7859k6046J51091J2850K0774o5267
8152C7364p112K5931o577o054k465K9855o6663r5263L5027L3264O265Q7778J21661
8139A93011l4048o8962r189N6896P7040M1166L2132r7547p7896q2247O0595J6025
8127A06976j06893j70412l8492J13707R2054R0027l32m2051J75059L3660p0896
$$ plain form
8208 170824 60881 -9314 71166 77213 98420 29153 20142 139321 152353 76173 107484 181581
8196 181581 12366 -201383 -220736 -159502 -189780 -72747 24645 60558 106232 8326 11626
8185 11626 78568 127197 22220 -49772 -8353 -75704 -57228 -22849 129809 235482 106049
8174 106049 99433 51214 1825 124163 148179 77767 -66209 -46914 55229 61923 -27201
8163 -27201 32301 11665 -160782 -182341 -153897 -56038 -82084 69007 81857 102631 37364
8152 37364 30252 56183 49606 43552 41087 70942 4279 -90984 -55957 -22693 -16428 71350 193011
8139 193011 158963 90001 80812 137708 214748 255914 288046 190499 112603 30356 90951 106976
8127 106976 83 -170329 -208821 -95114 -3060 86967 86635 44584 219643 253303 182407
8116A82407m5633r2378K4977k3290l5396O2267J57300j36294J08238P5111r4245
8105A83064o1152p6326Q0093L7873q7036m3496O949k7954P8405O5422m3529j47395
8093c5082o8321K1197j6316J05521J01294L2642k6477n0583Q984m4085N42k6000
8081C316j47438k0149L0431Q8938K3736o661J07958J07511J01988q4473j43687
8070F1470j71668l4966L8897m1069K7881L4322p8422m6450P6997L6003M5589Q6597
8058C5181K6601N9895K9004p5362J654q2375j11951j9908p0304N7593j7476j1190
8046a78638R10Q2941k8811j13515o5717Q9270J2671J7673j7190J14592o738J02572
8034A0020Q3429p1058M8419l438L683p9167p3683p9134K29706N2190j25837l9503
$$ plain form
8116 182407 136774 44396 69373 46083 10687 72954 230254 93960 202198 277309 183064
8105 183064 121912 45586 125679 163552 76516 33020 39969 12015 90420 155842 112313 -35082
8093 -35082 -103403 -82206 -98522 6999 108293 140935 114458 63875 72859 28774 29316 3316
8081 3316 -144122 -164271 -133840 -44902 -21166 -27827 80131 187642 289630 205157 61470
8070 61470 -110198 -145164 -106267 -147336 -119455 -85133 -163555 -210005 -133008 -97005 -51416 35181
8058 35181 61782 121677 150681 75319 76973 -5402 -117353 -137261 -207565 -149972 -167448 -178638
8046 -178638 -177728 -94787 -123598 -237113 -302830 -213560 -200889 -183216 -200406 -85814 -92552 10020
8034 10020 93449 22391 70810 67372 71055 -8112 -81795 -160929 68777 120967 -4870 -44373
8022d4373J46253M9982M5025p2087j84462j1016Q5743p6554n1190m0096j9040
8011a71815J49296J48133m9420r8803K0962o2650j01713L2838P7595J2227k6428
8000f9778J1675M1340R3604K8608o9139p5681N9084q6620q7656J63885J8936o3251
7988c4993J6628M2279L0219q7997l4813P9351Q6430K1540p0530j5969P3526m6864
7976E8807l9602L4781M2462K5737m7820o5642M0481j2088k2973q1145R5034K22594
7964B50626Q1559j33852k06991J776O4473j26811l6320J8033J3344n8984J2990
7953a20157J5337L9047m0554O481k2112R570P7529J3595r635P3674m6582n2878
7941e6685n2252l3704L4890P4767O7297J38054J5242j97688j23296M8299M1430
$$ plain form
8022 -44373 101880 151862 196887 124800 -59662 -70678 15065 -61489 -112679 -152775 -171815
8011 -171815 -22519 125614 76194 -22609 -1647 -64297 -166010 -133172 -55577 -43350 -69778
8000 -69778 -58103 -16763 76841 105449 36310 -39371 19713 -66907 -154563 9322 28258 -34993
7988 -34993 -18365 23914 54133 -33864 -68677 10674 97104 118644 48114 32145 105671 58807
7976 58807 19205 53986 96448 122185 74365 8723 49204 37116 14143 -67002 28032 250626
7964 250626 332185 198333 -8658 -6882 57591 -69220 -105540 -87507 -74163 -133147 -120157
7953 -120157 -104820 -65773 -106327 -99846 -121958 -112388 -34859 -21264 -30899 42775 -3807 -56685
7941 -56685 -108937 -142641 -107751 -32984 34313 172367 187609 -10079 -133375 -85076 -43646
7930d3646k7427N8628N9669k468o7617N7546P192M4701J01465L2356l1956M992
7918A93435m2320k8277R946q2200k6108q5262j48926J05801n090M8250J32604
7907G1853P2389p616p4602N4605m7101L7885J8945j0730n3613r8383R5517o0036
7895h87j3987M8998q8076l5823J9123p3415K8701j8291K220r8357R2456J70907
7883C3569P6226o0110N0915l3357o2037j56090p323k026J8658J33924j9316j40644
7871a67611j5846Q0377L8048k1097N9504Q6m6448M5578n4823o5322J15496m0141
7859g2199k4656J0679K2892K3966o7580M1190J04590L5591j03047n2638j39212
7848b20424O5688O7890O4168m1129q2506r4814J29646O0815m5453p7360O1560
$$ plain form
7930 -43646 -71073 -12445 47224 44756 -22861 34685 41877 86578 188043 220399 188443 193435
7918 193435 151115 122838 132784 50584 24476 -60786 -209712 -103911 -109001 -60751 71853
7907 71853 144242 136626 62024 116629 69528 107413 126358 115628 62015 -36368 59149 -887
7895 -887 -14874 34124 -53952 -89775 -70652 -144067 -115366 -133657 -131437 -229794 -137338 33569
7883 33569 109795 49685 100600 67243 5206 -150884 -158207 -160233 -141575 -7651 -26967 -167611
7871 -167611 -183457 -103080 -65032 -86129 -26625 -26539 -72987 -27409 -82232 -147554 -32058 -72199
7859 -72199 -96855 -86176 -63284 -39318 -106898 -65708 38882 74473 -28574 -81212 -220424
7848 -220424 -154736 -86846 -22678 -63807 -146313 -241127 -111481 -50666 -96119 -173479 -111919
7837a11919P6924k1910O3598K1990n6651m8592q3513k1676J21473J64221m6345
7826E7600p7372O3263j6761P6484m759l865p8417j0410M6110K0461N7954K900
7814A33188O435M5583n6664j02185j8136p9957m4181N1726N1397k0907P3033O4986
7802A04318m4369p1786m1435N2325j9171M946n7311R5147L1495o0892j34646J13466
7790b7913K22892K4728j95242P1496P4686j90475l8516N9062K341m4592k1129
7779f2662j9023J1677K2184l7920k299j6652L643R1131Q2333M3669L9885k8511
7767A27455r2317j72047n7352k7859O3941R8038N5604M2629m7487m116p2934O2968
7755b3477L7295L4473k0726j35643R0848J11522j54j4037r201j3119j0607r6849
$$ plain form
7837 -111919 -34995 -56905 6693 28683 -27968 -76560 -160073 -181749 -60276 103945 57600
7826 57600 -19772 43491 26730 103214 98455 94590 16173 5763 51873 72334 130288 133188
7814 133188 139623 185206 128542 26357 8221 -71736 -115917 -64191 -12794 -33701 39332 104318
7802 104318 59949 -11837 -53272 -947 -20118 -15172 -72483 22664 54159 -6733 -141379 -27913
7790 -27913 194979 219707 24465 95961 170647 -19828 -58344 718 3059 -41533 -62662
7779 -62662 -81685 -70008 -47824 -85744 -88043 -104695 -101052 -9921 72412 116081 155966 127455
7767 127455 35138 -136909 -194261 -222120 -158179 -60141 -4537 38092 -9395 -13511 -86445 -23477
7755 -23477 13818 48291 27565 -108078 -17230 94292 94138 80101 70900 57781 47174 -49675
7743d9675M0506P0681K9504N6218k753j41510j14041j6142j7597O6556L1452J22415
7731G5614n317J0381M151m4330o9095k8555j27855O9335J68293o2378J7775J34366
7719A42385K5923J7238L3942O356j57367j80776k7701N7266J75033q0964p3349
7708f2014m158j5313k2350J19441J31030o2600q7126j09117J2707m4088n6119
7697a99707j0034J92135Q0245j17795K885k2172m8460O4472O6384Q022J49615
7686A65590k2318o5488j10420j12104m0886O1636J3301P2279K5775O6360l7785
7675A5940l8388P3813r5792m5454L2338k1741P7053P2224J6696K0010m2480J852
7663F6071K8284K9240j21326l6972o7191k3972N7993L8134k6364N971L7705M9388
$$ plain form
7743 -49675 -9169 61512 91016 147234 144481 2971 -111070 -127212 -144809 -78253 -46801 75614
7731 75614 70297 80678 84829 40499 -28596 -57151 -185006 -115671 52622 -9756 8019 142385
7719 142385 168308 185546 219488 225844 68477 -112299 -140000 -82734 92299 11335 -62014
7708 -62014 -66172 -81485 -103835 15606 146636 84036 -3090 -112207 -99500 -143588 -199707
7697 -199707 -209741 -17606 62639 -55156 -52271 -74443 -122903 -58431 7953 15975 165590
7686 165590 143272 77784 -32636 -144740 -185626 -123990 -110689 -38410 -12635 53725 15940
7675 15940 -22448 51365 -44427 -89881 -57543 -79284 -2231 69993 86689 106699 64219 66071
7663 66071 94355 123595 2269 -34703 -101894 -125866 -67873 -29739 -56103 -50132 -12427 36961
7651C6961k7737m7670m3197P1222o9480J8296p1111p488R5467J9370n8442J26647
7639D2838Q2299p9605M582J8519q8258p2444P314n2050j3844N2463N2061J12046
7627F5921L0363j05395O6557L1524p5596J9099n2051J079M353o903L1625n763
7615D813K6051O2604M1932k4651n2599Q66j08641j4024j02360n3420J92395J43938
7603A16904l7028k6263r440k2736j67666J3243J64648o0426P2000L3068m5245
7592C1059m3949N8409P661O9674m8229q0276l1172O4102p0719m1935R2010Q5320
7580I1955k1241o8899N3137J01681j5220m0212N4691j02614p2080M8559J56627
7569A86384m812J5641L8057P3409l3360L5696M5374q1607q0906k00825j17133
$$ plain form
7651 36961 9224 -38446 -81643 -10421 -79901 -61605 -132716 -140204 -44737 -25367 -83809 42838
7639 42838 125137 45532 50114 68633 -19625 -92069 -84755 -136805 -150649 -98186 -46125 65921
7627 65921 96284 -9111 57446 88970 13374 32473 -19578 -18499 -14146 -21049 10576 4813
7615 4813 30864 93468 135400 110749 58150 59016 -49625 -63649 -166009 -219429 -27034 116904
7603 116904 79876 53613 44173 21437 -146229 -132986 31662 -28764 43236 76304 31059
7592 31059 -12890 45519 53180 122854 74625 -5651 -36823 27279 -43440 -85375 6635 91955
7580 91955 70714 1815 54952 156633 141413 101201 155892 53278 -18802 29757 186384
7569 186384 181572 197213 235270 308679 275319 311015 356389 274782 193876 -6949 -124082
7558a24082J5860O2816J05636l8057M478L5860R512q477l1963O3423P8437J441
7546A74884j15330j06700k1952k0367m7673j2895q4719j7419J54941K1226J4388
7535f1616J09368P2889j19501o0583l4334k7427K3589L5420r0493M0003J25821
7524A3136J14602j7525n4494l1885R4576q4019j13878L9368r634O0137L1468o0434
7512a8582j04595N3187J42062O9216J18151j24259j81895P1976R4566o8201p8599
7501b6973k3864L3427J0733O791J1133O2907j02608p6429Q2431o1873l4035J5443
7489a02917Q1800N8059o2020m966P2703O5583L1866j20466j4630l1657p0240q6461
7477a83346o4119P5792O763Q9617N4272J09455R1797j18261j40319n748L9485
$$ plain form
7558 -124082 -108222 -45406 60230 22173 26651 62511 72023 63546 31583 95006 173443 174884
7546 174884 59554 -47146 -69098 -89465 -137138 -150033 -234752 -252171 -97230 -76004 -61616
7535 -61616 47752 120641 1140 -59443 -93777 -121204 -97615 -62195 -152688 -112685 13136
7524 13136 127738 110213 55719 23834 118410 34391 -79487 -40119 -49753 10384 41852 -18582
7512 -18582 -123177 -69990 72072 141288 259439 135180 -46715 25261 119827 51626 -26973
7501 -26973 -50837 -17410 -6677 114 11247 74154 -28454 -104883 -22452 -84325 -118360 -102917
7489 -102917 -21117 36942 -25078 -30044 42659 108242 140108 19642 5012 -26645 -96885 -183346
7477 -183346 -247465 -171673 -164910 -75293 -21021 88434 180231 61970 -78349 -84097 -44612
7466d4612L2369o8907J04838J803q3202J2161P9493l810O271K3061K0186k5231
7454E4420j6798K4060J3166p4298K0846R6043j53652j13389L5527R4346M9699
7443B9970j15678P0310M3400j5922K4349N2045p3431n8302m2563K0645r736j26541
7431b01454J8337J15016L319J18335r856p1690q8490K8718O8880N5108j56379
7420a20156j01493P0035j3762J6471P7350M7649R1182M0803r3328j32665M707
7409a13207L0345K919P7464J13560R0218r9417p1678O5262O7941L2939l7643j24967
7397C3736J29865k8625j12072l3056l9007j16713J05727K3247J17823L3155q5349
7386B8731l4597O2737M1664J5054l6705M3486M7792m9709q1718r5783l1216L1370
$$ plain form
7466 -44612 -12243 -81150 23688 25491 -57711 -45550 33943 30133 36404 59465 79651 54420
7454 54420 37622 61682 74848 550 21396 117439 -36213 -149602 -114075 -19729 29970
7443 29970 -85708 -15398 28002 12080 36429 88474 15043 -43259 -85822 -65177 -74913 -201454
7431 -201454 -183117 -68101 -64782 53553 43697 -27993 -116483 -87765 -18885 36223 -120156
7420 -120156 -221649 -151614 -165376 -148905 -71555 -23906 67276 108079 14751 -117914 -113207
7409 -113207 -82862 -79943 -2479 111081 201299 101882 30204 95466 163407 196346 158703 33736
7397 33736 163601 134976 22904 -10152 -49159 -165872 -60145 -36898 80925 114080 28731
7386 28731 -5866 56871 98535 113589 76884 120370 168162 118453 36735 -59048 -90264 -58894
7374e8894J2444o5128n3924P8189J53864q282K3905L1224k3265N8124q300J092
7362A41049j49072n6574L2231R0371j21955r9279l1546n456k3213J4592K0466
7351a88386R2749M3604M4218J21345p7452r1452P7717j1016j2416Q918m8243l5697
7339g6111k0513L7329P095L0171L2955k4083O8987M3470Q1559l2561r8694j07864
7327e8260m4838P3897M1667j7070M7285R1221L7596K3178j7147j54186r4493J08379
7315C7229K6798o9777M8116l0899L2431o5512o2817N8472m9347m4531R8480L4009
7303A2652p3614R6385k3258m9525o1431O7188j03239r8558l5388K2230L2908J24529
7291h9121J23669M2754k0142p5368j8794J2539P0182r40j04924P102J34494J17529
$$ plain form
7374 -58894 -46450 -111578 -165502 -87313 66551 58269 82174 113398 90133 148257 139957 141049
7362 141049 -8023 -64597 -32366 58005 -63950 -163229 -194775 -200231 -223444 -208852 -188386
7351 -188386 -95637 -52033 -7815 113530 36078 -55374 22343 11327 -1089 7829 -40414 -76111
7339 -76111 -96624 -59295 -52200 -22029 10926 -13157 55830 99300 180859 148298 49604 -58260
7327 -58260 -103098 -29201 12466 -4604 42681 133902 171498 194676 177529 23343 -71150 37229
7315 37229 64027 -5750 42366 11467 43898 -21614 -84431 -25959 -75306 -119837 -21357 12652
7303 12652 -60962 35423 12165 -37360 -98791 -31603 -134842 -233400 -268788 -246558 -213650 -89121
7291 -89121 34548 77302 57160 -18208 -37002 -24463 45719 44779 -60145 -53043 81451 198980
7279A98980L4046j22319m8022K1693J1723K5077j06053P6663j1704J2351L5042
7268A27477p918j01105j00403p8226K21426j3755j42838j0561J18499m832j19382
7257a11618p4099p9550l1888J21696O0205P9494P4193L5600p1451j14588j49516
7246b61522N8540J57410J04424l6363o6726M347j20398n8633R5981J41604J3680
7235C2344N6884K9425k7740r6015j38686l0148k1067M1483k1223Q8275N6785p9341
7223a09024N6552j29201o1392O0317J04601P2910r2401m316n7048Q2314J97810
7212A21122M7029m1819k9167n4772p3312P7880J58051j05274j4524M9815o3363
7201G1666o8642j10287k2584k9914k0590O1471N6958K2422p6995m1075M9541P865
$$ plain form
7279 198980 233026 110707 62685 84378 96101 121178 15125 91788 80084 92435 127477
7268 127477 119559 18454 -81949 -160175 61251 47496 -95342 -105903 12596 7764 -111618
7257 -111618 -185717 -265267 -297155 -175459 -115254 -35760 38433 74033 2582 -112006 -261522
7246 -261522 -202982 -45572 58852 22489 -44237 -39890 -160288 -218921 -122940 18664 32344
7235 32344 89228 118653 90913 -5102 -143788 -173936 -195003 -153520 -174743 -86468 -29683 -109024
7223 -109024 -52472 -181673 -243065 -182748 -78147 -5237 -97638 -101954 -159002 -76688 121122
7212 121122 168151 126332 97165 42393 -30919 46961 205012 99738 85214 135029 71666
7201 71666 3024 -107263 -129847 -159761 -180351 -118880 -61922 -39500 -116495 -157570 -108029 -100164
7189a00164l7614k1008M6541m9450o4128R8349J39074m5938L2678j158q4429k5695
7177a12942q5135M9285P5778p1937j8460K3005K4508k2631O447J52424Q4862o8280
7165C6924m1077m764L1952K2678j06464n0036J56724J1311j67k2484j38845l6573
7153a40821J782M0387J25151K1981J0780J39726m5361j3239J2912j9904j56j37901
7141d663n5044k14l1528m9139m1827l2415J21721R4101L2098J10745J3081l4517
7129A22399J593k9235n4157p6369J858M8520O7682n5244J6283j45618j51269J7409
7117b36148j1055n198m4163P1459J52371P8846m6940M6704j16638j89693j55933
7106d56388L9049J04908K25706K5713K6771J08927R1036k2430j13065p5629K3336
$$ plain form
7189 -100164 -137778 -158786 -112245 -161695 -225823 -127474 11600 -34338 -1660 -2818 -87247 -112942
7177 -112942 -198077 -148792 -73014 -144951 -163411 -140406 -115898 -138529 -132082 20342 105204 36924
7165 36924 -4153 -8917 23035 45713 -60751 -110787 45937 57248 57081 34597 -104248 -140821
7153 -140821 -139039 -98652 26499 48480 59260 198986 153625 140386 153298 133394 133238 -4663
7141 -4663 -59707 -59921 -91449 -140588 -182415 -214830 -93109 992 33090 143835 156916 122399
7129 122399 123992 94757 40600 -35769 -33911 14609 82291 27047 43330 -102288 -253557 -236148
7117 -236148 -247203 -252401 -296564 -225105 -72734 6112 -40828 5876 -110762 -300455 -456388
7106 -456388 -417339 -312431 -86725 -61012 -34241 74686 165722 143292 30227 -45402 -22066
7095b2066M022K5172L3686L2651J4303r2894n4028O1764j7730J4728K3295J8795
7083D1698o2833J0474N9843M6040q761o9708m7334k180K2723j2377m3156J05953
7071D0382R4181j6939n988q0449j4693n9766L5299N9011M8182J22381J02522m5495
7059B78628j16567k5621p5115o5043M0307O6536m9360J2775q6873R8002k5302
7048E2367l5300K5254j7983q1822m4258l072J56712j0437j0781N3464k4006P0893
7036A31031R8845j67146p3488m4981o436J04048L2461N9996J12312Q9482j53422
7025A82702j56829o7984o0830J2660L462r9008L1448R5799O2893p5424j05476
7014a76587R1877J17242j7387j00747q2643P7881J12448N7722K5506j5833m6436
$$ plain form
7095 -22066 -18044 7128 40814 73465 87768 -5126 -59154 2610 -15120 -392 22903 41698
7083 41698 -21135 -10661 49182 95222 86461 16753 -30581 -32761 -10038 -22415 -65571 40382
7071 40382 134563 117624 111636 31187 16494 -43272 -7973 51038 99220 221601 324123 278628
7059 278628 162061 136440 61325 -3718 36589 103125 53765 66540 -20333 77669 52367
7048 52367 17067 42321 24338 -57484 -101742 -104814 51898 41461 30680 84144 60138 131031
7036 131031 229876 62730 -10758 -55739 -62175 41873 74334 134330 246642 336124 182702
7025 182702 25873 -42111 -102941 -90281 -86819 -185827 -154379 -58580 4313 -71111 -176587
7014 -176587 -84710 32532 15145 -85602 -168245 -90364 22084 79806 105312 89479 43043
7003D3043k3125j0498m6998P549O1106J3281R597j40788j07436j772R0297r165
6991a14909N163O6326O8652k0310r6041k6070J23186R6986r3843q9878L7603J02706
6979E9571O5122j06901j18407j38291O8468J76599m9699K5932J48717J2121j8708
6968A24524R852p0819n7449o2045J0577J13093J2535j05035o1168J56093J00365
6957A70523p2543m5169j22651o159J991J264M913N1075J43958j09481N0985J8650
6945H7356j4842q150P858r656K8500L29M8514l1731q2188P1573l0802Q0394q1476
6932F5679j52944K9518J5201M5031L2197L8593R611J00015J5463p5814L5842P2480
6920B30872N5092q9530j3122n7313j48814j9466J60489N9847p7581J5866R8377
$$ plain form
7003 43043 19918 9420 -37578 -30029 31077 44358 53955 -86833 -194269 -196041 -105744 -114909
6991 -114909 -109746 -43420 25232 4922 -91119 -117189 5997 102983 9140 -80738 -43135 59571
6979 59571 124693 17792 -100615 -238906 -170438 6161 -43538 -17606 131111 143232 124524
6968 124524 134376 63557 6108 -55937 -45360 67733 80268 -24767 -85935 70158 170523
6957 170523 97980 52811 -69840 -75999 -74008 -72744 -67831 -16756 127202 17721 68706 87356
6945 87356 72514 64364 72222 62566 91066 91395 139909 108178 25990 97563 66761 147155 65679
6932 65679 -87265 -57747 -42546 2485 34682 73275 82886 182901 198364 122550 158392 230872
6920 230872 285964 196434 183312 125999 -22815 -42281 118208 178055 100474 116340 214717
6909B14717j39320n7264M4630O5481O1802j00936j15699J6453P640o1948r0662
6898a55106O0215J12972k5003o9123L294j00469q022J33343L5132R4251n6888
6887B4596j39284j14499k7123J27246K0824j01690R0138J55668J06750P1092j01641
6876A12077r7454n9265k7074k0158N557R7129j6809K8929m5891n0809O81L7361
6864c5726P2144j0525N4700J27037m3377j90999j44870j4641J13879p3254K5307
6853a20325R6318R5037j6411L0784p0050j02988j21795k7691J7396N8441J6840
6842a44444P6686l131J1664K9852n9562r7637j88294J71378K5085p5717J10889
6831a43231J22112L7095m9899r369P5744R7001j2915P2862m6989M4936n2007n9291
$$ plain form
6909 214717 75397 18133 62763 128244 190046 89110 -26589 -10136 -2496 -64444 -155106
6898 -155106 -94891 18081 -6922 -76045 -72751 -173220 -181242 -47899 -12767 81484 24596
6887 24596 -114688 -229187 -256310 -129064 -108240 -209930 -119792 35876 142626 213718 112077
6876 112077 14623 -44642 -71716 -91874 -86317 10812 -5997 22932 -22959 -73768 -73087 -35726
6864 -35726 36418 25893 80593 207630 164253 -26746 -171616 -186257 -72378 -145632 -120325
6853 -120325 -24007 71030 54619 85403 15353 -87635 -209430 -237121 -219725 -161284 -144444
6842 -144444 -67758 -70889 -59225 -29373 -88935 -186572 -374866 -203488 -178403 -254120 -143231
6831 -143231 -21119 15976 -33923 -43292 32452 129453 116538 189400 142411 187347 135340 76049
6819G6049n3404L7370P1856j24250l8014j1670q2946j70387j7270J54646M9843
6808a08177Q0267O6950q9628o0452l1170M811K4161O9852K2314J2973M4676J72822
6796B09399k4077p3909Q2756k7772J0371l0378p7130q8087j6940m0446j04689
6785a80902o7785K6284n1758N2780J21031L0804q583L4017j5050k8136J21965
6774C4667N3031k7173q1230N459n7785k4882N4969n600J10302M6118L3391K775
6762A44042j31911l2060n1252j13788K3545J36712R518o2597k9478J803l7321
6751a42787Q1249J2097p988k9279O2680J59752L4072k5357l6698Q8590l5205j64417
6739c291l0995J53709J23532M2472r3711j44934o5602n6235n1747k0266M4130
$$ plain form
6819 76049 22645 60015 131871 7621 -30393 -42063 -125009 -295396 -312666 -158020 -108177
6808 -108177 -27910 39040 -50588 -111040 -142210 -137399 -113238 -43386 -21072 -8099 36577 209399
6796 209399 185322 111413 194169 166397 176768 146390 69260 -18827 -35767 -76213 -180902
6785 -180902 -248687 -222403 -274161 -221381 -100350 -69546 -78129 -44112 -59162 -87298 34667
6774 34667 87698 60525 -20705 -15246 -73031 -97913 -42944 -48544 61758 107876 141267 144042
6762 144042 12131 -19929 -71181 -184969 -161424 -24712 -15194 -77791 -107269 -105466 -142787
6751 -142787 -61538 -49441 -57429 -86708 -24028 135724 169796 144439 107741 196331 161126 -3291
6739 -3291 -34286 119423 242955 285427 191716 46782 -18820 -75055 -126802 -147068 -102938
6728a02938J27311L3430L1660l4399q6088k2636n2201P2672J19589Q0561m6764
6717A20197k0895O1638l1899j37088j28621j34741P255L0361R167N0821P983j15144
6705b80966O4190J81426M9336R9750q677n3053J21196O0390j48368J2588q3284
6694A4528J0711n9864o8173J5362P3197K2495J91541j9145n742k5746p1989o677
6682G0498j09308o4487j3923N1106N0950L9654n4582l9505K3388J19201n980j10310
6670d3298J1086q2209m6390k0745R8055J09490M7442n2048J0950p5293m3876L5950
6658e0886P8851N0914j5666l2531o998q4818m6522N4623P308j29278m5807J72087
6646d8723j6744n9844N919O7184N9947j14662L1628K18390j6761k22996m8804
$$ plain form
6728 -102938 24373 57803 89463 55064 -31024 -53660 -105861 -33189 86400 166961 120197
6717 120197 99302 160940 129041 -8047 -136668 -271409 -264154 -233793 -224626 -173805 -165822 -280966
6705 -280966 -216776 -35350 13986 113736 105059 52006 173202 233592 85224 97812 14528
6694 14528 25239 -34625 -102798 -87436 -14239 8256 199797 180652 174910 149164 77175 70498
6682 70498 -38810 -103297 -117220 -66114 -15164 24490 -30092 -69597 -46209 72992 67012 -43298
6670 -43298 -32212 -114421 -160811 -181556 -83501 25989 73431 21383 32333 -42960 -86836 -50886
6658 -50886 27965 78879 63213 30682 23684 -61134 -107656 -53033 -45725 -175003 -220810 -48723
6646 -48723 -65467 -125311 -119392 -52208 7739 -106923 -75295 143095 126334 -96662 -145466
6635a45466N4020m2326K1803J00451K4092Q5117j4235r9208N4690L9463o1624
6624A6777j38448o4183P6240J00248n5741l6120m9253k10408O1514J54213J61330
6613A6169r9564m4379K7106J09562n6235j14087J27220J80030m1666o3669R949
6602E0436q499M9203K1165O7250l9386q7302n5975J585q5261O7893N3909L5090
6590G0108P4614p2380p7140J2678J0446N9805k2677M9610l3130J411Q2454J1421
6578A67220p3002j06672m2456K0159N4454K992J37823o3319j36577m8379Q9251
6567A494J5822M1653L1335r2447j11804r689r5519k1733J14555J0117O4075o3529
6555a15670q1675p2805K7325J36315k2952R9587P8562l81l9459n0404J23611O6792
$$ plain form
6635 -145466 -91446 -133772 -111969 -11518 12574 97691 83456 -15752 38938 78401 16777
6624 16777 -121671 -185854 -109614 -9366 -65107 -101227 -150480 -360888 -299374 -145161 16169
6613 16169 -83395 -127774 -100668 8894 -47341 -161428 -34208 145822 104156 40487 50436
6602 50436 41937 91140 112305 179555 140169 52867 -3108 -1523 -86784 -18891 35018 70108
6590 70108 144722 72342 -4798 7880 18326 78131 55454 105064 71934 73345 155799 167220
6578 167220 94218 -12454 -54910 -34751 19703 22695 160518 97199 -39378 -87757 1494
6567 1494 17316 58969 90304 -2143 -113947 -123636 -219155 -240888 -126333 -116216 -52141 -115670
6555 -115670 -197345 -270150 -242825 -106510 -129462 -29875 48687 48306 8847 -41557 82054 148846
6543A48846k9207p3891p5569p1112o1438P9163R685J32923J23926j14392o5843
6532C091q7468K2185k294N6680j6624R2926J33227p924j47220j03045k9776Q087
6520g8155K567k8583k9765P6354K22090j1132r3726j2242L0833O4550q1399j43570
6508h2178N6084K8899N403O9991p9340r2126Q5829R5862o2503K5154n69P6509
6496A27015n5463j08900p2622P5366J26107L5024j02697n9400Q7747M3769j19886
6485b3940m1582L7301K3994Q4843K6379j3329l0199p4233n5951J5903M5450N793
6473D29L7006J25138L8607j33899L9417k0169J0380L2091j25794l5938M5233k2287
6461i786l7139m3855j5529J12134O2428j0870j85159r5199O6141k8243K3551O6426
$$ plain form
6543 148846 119639 45748 -29821 -100933 -162371 -83208 -73523 59400 183326 68934 3091
6532 3091 -84377 -62192 -64486 -7806 -24430 68496 201723 193799 46579 -56466 -86242 -78155
6520 -78155 -75588 -104171 -133936 -57582 164508 153376 59650 47408 78241 142791 61392 -82178
6508 -82178 -26094 2805 8208 78199 -1141 -93267 -7438 88424 25921 51075 50506 127015
6496 127015 71552 -37348 -109970 -34604 91503 126527 23830 -35570 52177 95946 -23940
6485 -23940 -65522 -28221 -4227 80616 106995 93666 63467 -10766 -66717 -50814 -5364 429
6473 429 37435 162573 201180 67281 106698 86529 96909 129000 3206 -32732 12501 -9786
6461 -9786 -46925 -90780 -106309 5825 68253 57383 -127776 -222975 -156834 -185077 -161526 -95100
6449i5100J48438p8882q8159o7582j1251o8464Q0610J72716P2597L0523r1105
6438D341l9882L8314k4481j00855M1310J2597l4800M0307L5693o4515p0106O3521
6426i8556j7962l0030J06088J03233Q678k9174R0524M516k44409j57175L6340
6415b27927P8243R5198J06979J24595N6230o5231j55708j42026N6411O9195M5697
6404D1656J26745n8456j23598j32042N4030l4065n3419J12633L1176L7719j05779
6393a03400k8720r6072K4978J14155R7788L2626p9131O175J6840L5101n331J775
6381A6784J24899P9232k2880j54343p2351J4328n2316l9329o4607P3541k9718
6370a26760M2709l5580j5124K7455J33363N4728K1379j45011q4581r6928k923
$$ plain form
6449 -95100 53338 -25544 -113703 -181285 -192536 -261000 -180390 -7674 64923 95446 4341
6438 4341 -35541 2773 -21708 -122563 -81253 -68656 -103456 -63149 -27456 -91971 -162077 -98556
6426 -98556 -116518 -146548 -40460 62773 71451 42277 132801 137317 -107092 -264267 -227927
6415 -227927 -149684 -54486 52493 177088 233318 168087 12379 -129647 -73236 -4041 41656
6404 41656 168401 109945 -13653 -145695 -91665 -125730 -179149 -66516 -35340 2379 -103400
6393 -103400 -132120 -228192 -203214 -89059 8729 41355 -37776 -31601 -14761 20340 15009 16784
6381 16784 141683 220915 198035 43692 -28659 -14331 -66647 -105976 -170583 -97042 -126760
6370 -126760 -84051 -119631 -134755 -107300 26063 80791 102170 -42841 -127422 -224350 -227273
6359b27273l8716J03156o6018O4089J68663J53678J6223k42j47015M856o6095
6348c4694j5204J14781K0817L8165n1114k9472J01367l7252o8155n4431p7880
6337i3072j0874l1175p4185L6467K21637K6628R039o3485L8245j1755K5639k6676
6325D6433m5164L7359M9248J20119j459r5641j62465j02707j2446L0431K1043
6314a15249m5514j3092J59495J06905j8137m2286J3654j18966l0162L6296K1330
6303d5726q5507J0694M3843J55171L8166Q4861k6638j36313j9880P674k3339p7513
6291g4507l4752k7591q0716L3663Q5332r5879O3059P9566P2169L9120k2294k9528
6279G642N1503j4616k3856r430j01904j26233P9945N3632J9770J4186o01L3675
$$ plain form
6359 -227273 -265989 -162833 -228851 -164762 3901 157579 173802 173560 26545 31401 -34694
6348 -34694 -49898 64883 85700 123865 72751 43279 144646 107394 39239 -15192 -93072
6337 -93072 -103946 -135121 -209306 -172839 48798 75426 84465 20980 59225 47470 73109 46433
6325 46433 1269 38628 87876 207995 206536 110895 -51570 -154277 -166723 -136292 -115249
6314 -115249 -160763 -173855 -14360 92545 74408 32122 45776 -73190 -103352 -67056 -45726
6303 -45726 -131233 -120539 -76696 78475 116641 201502 174864 38551 18671 26345 3006 -74507
6291 -74507 -109259 -136850 -217566 -183903 -98571 -194450 -131391 -51825 20344 59464 37170 7642
6279 7642 59145 44529 20673 11243 -90661 -216894 -136949 -83317 -63547 -49361 -49962 -16287
6267a6287J31605M1183o5244j7484j20500j34455J0264O7306R7343j9829k5909
6256e2007O4789L9945n2505k5374n6652Q6836n7008j4702R5632r0642j52791J3410
6244b01069k6670M5349n5307Q6541J08792j19600L3169P3017j0404M4933N7620
6233C6371J03070k0085M8960m2819k9274k9303P2240Q1443n565n4366q4525k1818
6221E4329o7J11654j6785j00103N149q4614K3186q0630K9311k3447M868k753M9442
6208c0460p9928r2932l5015Q5023J00287R8414k4650k183K913M2241m1763O1080
6196H3027r7852N2495m4242K4272J20892n7051j48465q9219l2260K35653j2276
6185C4974r9863R8278J3561p8555k5981j7965o8871J1173R976J02431Q3935n129
$$ plain form
6267 -16287 115318 156501 91257 73773 -46727 -181182 -170918 -103612 -6269 -26098 -52007
6256 -52007 12782 52727 222 -25152 -81804 5032 -51976 -66678 28954 -61688 -214479 -201069
6244 -201069 -227739 -182390 -237697 -151156 -42364 -161964 -128795 -55778 -66182 -21249 36371
6233 36371 139441 119356 168316 125497 96223 66920 139160 220603 215038 160672 76147 54329
6221 54329 54262 165916 149131 49028 54177 -30437 -7251 -87881 -58570 -82017 -77149 -79902 -30460
6208 -30460 -110388 -203320 -238335 -153312 -53025 45389 20739 18556 21469 63710 21947 83027
6196 83027 -14825 37670 -6572 17700 138592 81541 -66924 -156143 -188403 47250 34974
6185 34974 -64889 33389 46950 -31605 -57586 -75551 -144422 -133249 -123273 -20842 63093 57964
6173E7964J14769m2442n8208n7948k8054q1973j00967J686n9619K5213J70393
6162e9186L0495j01690Q6594J51363J62264q370k22883L292k2078n3428K9832
6151c795n1593O7828J1344p6229j3982M3682O6597J30148M4446r6154j01448K9329
6139E0173l6048N3130n8327n1218m8195L3343R3665q5075N8878O2812J0981M1929
6127A26048N0710M9164r6865j71642k44744Q043J30698J98487R7104p8931j2137
6116E5935O7653p1064K7770Q519K8104J5560q0488p4480k0252o742Q1552J31600
6104A63667k5406m9511p9845n3859Q118K1582o011M9018K7350q8273l7603N5908
6092a4865L91K0761J4111j02267j021J70466Q6502j55023o1245p1465p7926K240
$$ plain form
6173 57964 172733 130291 72083 14135 -13919 -95892 -196859 -195173 -254792 -229579 -59186
6162 -59186 -28691 -130381 -43787 107576 269840 261470 38587 41879 19801 -33627 -3795
6151 -3795 -55388 12440 23784 -52445 -66427 -22745 43852 174000 218446 122292 20844 50173
6139 50173 14125 67255 8928 -42290 -90485 -57142 36523 -48552 10326 73138 84119 126048
6127 126048 176758 225922 129057 -42585 -287329 -279286 -148588 49899 147003 68072 55935
6116 55935 123588 52524 80294 88813 116917 132477 51989 -22491 -42743 -49485 32067 163667
6104 163667 138261 88750 8905 -44954 -36836 -15254 -21265 27753 55103 -33170 -70773 -14865
6092 -14865 -14474 6287 20398 -81869 -82890 87576 174078 19055 -42190 -113655 -191581 -189341
6080a89341N0790N5005J01656K3953Q5694K1066J5386r6144j70431l4231o427
6069a43024O1611O7800m0125L1050M0113O2073K0380k7811l7950k0579l9554J02508
6057G6492p8999q2547q2768O7421J62548M8544n8002q8361q3158K690J10281K2626
6045A6767o442k5510j2919n8464m8597O5307Q681j09515r2801K4714l1098J67036
6033a02841J73306K4078l9714p4592q0656K2543J63744N0212l3607N8205q0798
6022G9880n3858Q4609P6624r2997j29209r8696n2797n1223k2228J42690R7948
6011a9257J00323n405q3802m3956J4838n238m1092Q5276L3481l1786q024j20858
5999a25500p1689k639O7755J4501j07912P4573M3828M987J23234J8982R76J5803
$$ plain form
6080 -189341 -138551 -83546 18110 42063 127757 148823 164209 68065 -102366 -136597 -143024
6069 -143024 -81413 -13613 -53738 -22688 17425 79498 99878 72067 34117 13538 -26016 76492
6057 76492 -2507 -85054 -167822 -100401 62147 110691 52689 -35672 -118830 -116140 -5859 16767
6045 16767 10325 -15185 -28104 -86568 -135165 -69858 -61177 -170692 -263493 -238779 -269877 -102841
6033 -102841 70465 94543 54829 -19763 -100419 -77876 85868 136080 102473 160678 79880
6022 79880 26022 110631 187255 94258 -34951 -133647 -186444 -237667 -259895 -117205 -19257
6011 -19257 81066 75661 -8141 -52097 -37259 -42497 -83589 1687 35168 3382 -4642 -125500
5999 -125500 -197189 -199828 -132073 -117572 -225484 -150911 -107083 -102096 21138 40120 41096 56899
5987E6899j24269Q19P0058L4101Q1490O5507O8582j20614j23148N9282m974j62433
5975i8700k1069J11625P1725j1500m4008M4315L9715q6494m4584q1468M0779R5571
5963A5907J05897k8034j9004k1853q7682L3387O0605j51804j90214l9193J05342
5952b16646q1665r97O2749j02522O7297K36173L8887l6130K8912N4438Q972L3382
5940I2850m9943O712N010n2980M4878l5162o3614M9904j16807r7180J33229N6279
5928b6824L022N2595n4197K2265l8736K2929k0903K7049n9954O5940J40439K1559
5916A55184j29023j03485J708J07755M3468j194j6951K626L9073l042Q377l8634
5904F5862N2074J09750J1030j4755q0672n6584r815J8023K556j36931M8846O800
$$ plain form
5987 56899 -67370 -66551 3507 37608 119098 184605 253187 132573 9425 68707 63733 -98700
5975 -98700 -119769 -8144 63581 52081 8073 52388 92103 5609 -38975 -120443 -79664 15907
5963 15907 121804 93770 74766 52913 -34769 -1382 59223 -92581 -282795 -321988 -216646
5952 -216646 -298311 -299308 -236559 -339081 -271784 -35611 3276 -32854 -3942 50496 59468 92850
5940 92850 42907 49619 54629 1649 46527 11365 -52249 -2345 -119152 -216332 -83103 -26824
5928 -26824 -23802 28793 -25404 -3139 -41875 -18946 -39849 -12800 -72754 -6814 133625 155184
5916 155184 26161 -77324 -75616 32139 75607 74413 57462 60088 99161 96119 104496 65862
5904 65862 117936 227686 238716 223961 143289 86705 76890 94913 97469 -39462 9384 16184
5892A6184K3200n9532m0960J01058k8405M8271l288J2250j18017k7664Q6528n7989
5880d8364l873p471O1663j9304l3692q3618l1614Q7952M413o2686k2385P537K4306
5867a27136r0293L9227J42612R4753L5366N3904k24588j14745m0215m26Q5383
5856a46158M9541o8841q4690j8070l0634k8177k753J21121M8715M4748j5019j0946
5844a41163N0578k9696k7051M6395M4036k057P36J01o1775k161L4214K5000Q115
5831e4728J472O2939K5821j21352M630M2142m638m1381j10022n2987K18K1218
5819b26668L7292J26720m3798P75K7242o4410p5864q1556O9326L1155J7645N2988
5807a29153M9435p9287o4127M836N3700M2640p2639N0820J20341L7894N276P3072
$$ plain form
5892 16184 39384 -20148 -61108 39950 11545 59816 56528 68778 -49239 -76903 9625 -48364
5880 -48364 -52237 -59708 1955 -17349 -51041 -134659 -166273 -78321 -73908 -136594 -158979 -151442 -127136
5867 -127136 -217429 -178202 -35590 59163 94529 148433 -76155 -190900 -231115 -231541 -146158
5856 -146158 -96617 -165458 -250148 -268218 -298852 -327029 -329782 -208661 -159946 -115198 -130217 -141163
5844 -141163 -90585 -120281 -147332 -100937 -56901 -58958 -58222 -58121 -119896 -122057 -87843 -62843 -54728
5831 -54728 -53256 9683 35504 -85848 -81218 -39076 -43714 -85095 -195117 -248104 -247886 -226668
5819 -226668 -189376 -62656 -106454 -105679 -78437 -142847 -218711 -300267 -230941 -199786 -182141 -129153
5807 -129153 -79718 -159005 -223132 -218296 -164596 -121956 -194595 -143775 -23434 14460 19736 92808
5795I2808L9789N6942m4370j7525j33195k1726K2206r911P5665K3565j66097N1013
5783c0836n7790k3241o76j0180O5368M7877L1633K4041m5424o0611K963L4075
5771b2801M0498n7032R341J1380n4703O8146L8592p3931J8075N5848o0440o1170
5759h8197J4514L7663K7482N7073k7944r5176p834l3143M1103j9173k6939q4731
5747b05302p324J23478K4842J4322k4942L3738J70012o3780O4665l0973k18124
5736a19388j60709J664J61993Q571r1425Q1576O458J0591Q3400q8777M9432j134
5724e7748r4829O9237R5806O121M1984K9290q7240k26256q2114M959J07422K50534
5712E7166J07289L0394j34586j18438l3591P8639R8214j7438m4626l9678j27488
$$ plain form
5795 92808 132597 189539 145169 127644 -5551 -27277 -5071 -14982 60683 84248 -81849 -30836
5783 -30836 -88626 -111867 -112543 -122723 -57355 -9478 22155 46196 772 -59839 -56876 -22801
5771 -22801 17697 -39335 -29994 -18614 -73317 -5171 33421 -40510 -22435 33413 -27027 -88197
5759 -88197 -73683 -36020 -8538 48535 20591 -74585 -82419 -115562 -74459 -93632 -120571 -205302
5747 -205302 -212626 -89148 -64306 -49984 -74926 -41188 128824 65044 129709 98736 -119388
5736 -119388 -280097 -278433 -116440 -107869 -199294 -117718 -111260 -100669 -17269 -106046 -56614 -57748
5724 -57748 -152577 -83340 12466 18587 60571 89861 2621 -223635 -305749 -300790 -193368 57166
5712 57166 164455 194849 60263 -58175 -91766 -13127 85087 67649 23023 -16655 -144143
5701a44143j25022k6173K3651K3689N0816Q9138N5436j06016l6896J56699M3209
5690D388j7273M9788m1753q780Q7942j5547m7135q1723n9934J61173J01867O4384
5678A97397j9803Q8588j1529j03315j25357j76273R1790J02058P6156m5199j15541
5667d1028k580R832m6593k9763k7355L1534m7136K3360m617K3647J26875J80346
5655A96522l9628l3601j98415q0910K04851J27491j22315j26059m7477J03383
5645a6158L3299l6365J03274j08087j43528n269M5867K0989J08681J58423M0793
5634B01919n8614P3156o0711P683j23989k19294k9332M5341R7506P912J20369
5623F1946K094o666p2944j3205m5663j25520l6091J4884K7687j1990J76116J40452
$$ plain form
5701 -144143 -269165 -295338 -271687 -247998 -197182 -108044 -52608 -158624 -195520 -38821 4388
5690 4388 -12885 36903 -4850 -13630 74312 58765 11630 -70093 -130027 31146 133013 197397
5678 197397 177594 266182 254653 151338 25981 -150292 -58502 43556 119712 74513 -41028
5667 -41028 -43608 -33776 -80369 -110132 -137487 -105953 -153089 -129729 -134346 -110699 16176 196522
5655 196522 156894 123293 -75122 -156032 48819 176310 53995 -72064 -119541 -16158
5645 -16158 17141 -19224 84050 -24037 -167565 -172834 -126967 -105978 2703 161126 201919
5634 201919 143305 216461 155750 163433 39444 -179850 -209182 -163841 -66335 -58423 61946
5623 61946 64040 57374 -15570 -28775 -74438 -199958 -236049 -221165 -193478 -205468 -29352 111100
5611A11100q1525J053L5707k2352J8671l2027l6747M2648j5370P9473n0001n1727
5599a097r5597K9322R1319J24079r483j7459J15693J34765l5414j41621k06936
5588a2429j32617j25973J68625J17662O6198j0653r2127p3436J18344P4264J03793
5577B01651R1097k675k0623j31808m2462j08386n8958m7055L4071O763L9777K6861
5565a1747q433l9866j43070j0082N8366Q1103M981Q55j5875N0417J4199K19910
5553B00758P8250r7729o589q9634n4394n8438M9208O2119L5700o6969m7731N005
5541I556q3517q2272k9831l7695M4329J00269l6413J6694J07835p6853o6504o4402
5529a98804J21907L8992L531l8331p8604m6030M6787O2760J16890J63081q1786
$$ plain form
5611 111100 29575 30628 66335 43983 62654 30627 -6120 36528 21158 100631 50630 -1097
5599 -1097 -96694 -67372 23947 148026 138543 121084 236777 371542 336128 194507 -12429
5588 -12429 -145046 -271019 -102394 15268 81466 70813 -21314 -94750 23594 97858 201651
5577 201651 292748 290073 269450 137642 95180 -13206 -72164 -119219 -85148 -78385 -38608 -11747
5565 -11747 -20180 -60046 -203116 -213198 -154832 -73729 -68748 -67893 -83768 -33351 -19152 200758
5553 200758 279008 181279 174690 85056 30662 -27776 21432 83551 119251 52282 4551 9556
5541 9556 -73961 -156233 -186064 -223759 -179430 -79161 -115574 -98880 8955 -67898 -134402 -198804
5529 -198804 -76897 -37905 -34374 -72705 -151309 -197339 -150552 -87792 29098 192179 110393
5518A10393j49956q2145J45990L7240O7482K2229p4792l468J2845O5983J2794
5507A64595j06385j310N7013k9318o2844j28490r1849j19975O9658K445K7643
5496b18817K1768J05174R5901P2628m1837p3543R4196Q798q3175M6196P4940j4745
5484H7484K1555o2215j30147J3759j2996K6401N3140O7782R6996j416j3204P02
5472A47841q753j45165n665N8391K4411k3627j05538N7561J7374j01312k3970
5461a08452J13136m0257K4446j4272J1003J5429q4969o9077m3219K8765M9716
5450a17751Q228K7529J02968L7701k2716k8687r313L075Q8117m2814l5636J20078
5438A30779p622k4404p1456r7071O7025N2925j8024j19011j2619O4736l8986Q3112
$$ plain form
5518 110393 -39563 -121708 24282 61522 129004 151233 76441 72973 85818 151801 164595
5507 164595 58210 56900 113913 84595 21751 -106739 -198588 -318563 -248905 -246460 -218817
5496 -218817 -197049 -91875 4026 76654 34817 -38726 55470 64268 -18907 27289 102229 87484
5484 87484 109039 46824 -83323 -69564 -82560 -56159 -3019 64763 161759 160343 147139 147841
5472 147841 139088 -6077 -11742 46649 71060 47433 -58105 -544 16830 -84482 -108452
5461 -108452 4684 -35573 -11127 -25399 -14396 1033 -83936 -153013 -196232 -167467 -117751
5450 -117751 -109523 -81994 20974 58675 35959 7272 -2041 1034 89151 46337 10701 130779
5438 130779 123157 98753 27297 -69774 -2749 50176 32152 -86859 -99478 -34742 -73728 9384
5426I384J23720M4549j22190o4792k5918l3717Q271n600j15681J6183N0547R953
5414a05291J7481J16628Q0017O9642N3051o9717j14173K5881K6171o0123j5161
5403B4406N7174N5341q3882r794n0794J8698K8993L4029R3504N0197l7096k8132
5391A52644m5513j31662j23153l0891K7020m3897N9479M2149M2241R0407o1752
5380b2928m7355O7885n2104o862M5262j1532p0925K9429P1267n4297m7810J05039
5368E069Q8345k5442j05647p7598M7201P6543l001o3992p658K0679k1389m7501
5356a14391K15548N9079j52229l9766O6770N4439L5638m8560j24481j6464K6986
5345c7431K38640Q3707l3705j23982P2952R259o8660n1582r1982q9141J7920M7469
$$ plain form
5426 9384 133104 177653 55463 -9329 -35247 -68964 -60693 -66293 -181974 -165791 -115244 -105291
5414 -105291 -87810 28818 108835 178477 231528 161811 47638 73519 99690 39567 24406
5403 24406 81580 136921 53039 43245 -7549 11149 40142 74171 167675 217872 180776 152644
5391 152644 107131 -24531 -147684 -178575 -151555 -195452 -135973 -93824 -51583 38824 -22928
5380 -22928 -70283 -2398 -54502 -61364 -16102 -27634 -98559 -69130 2137 -52160 -99970 5069
5368 5069 93414 67972 -37675 -115273 -68072 8471 5470 -58522 -66180 -45501 -66890 -114391
5356 -114391 101157 160236 8007 -31759 35011 89450 125088 76528 -47953 -64417 -37431
5345 -37431 201209 284916 251211 127229 200181 209440 140780 89198 -2784 -91925 -74005 -26536
5333b6536L2213L0198j501K5525m1602p5796p3282P5769N1420q0625j23136o423
5321b13776L1533M6883r663j2086R5040j9967k495Q9705m9153l9504j1295J22596
5309B7818Q4933j41155l7328P7520O3263J2379o0888m2040M6983J4365q5966P425
5297c2691k9995L2269L3026P5560o3531m9215R1722n7577n3019k1087N9971j10121
5285a24688p5630P4633J25478M5380l3431o6846Q7768j388J0285j09893p6869
5274a45201J82870l445o0212Q7577l7059j48214j06596J43592J347l867O9204
5263b0004m0473j02703K8723r087j17744j7566J79685O7255m0853J8030n8786
5252a13523p4793j9755o5849o085J86895k0274L0081Q6448l3716q9296m0919k4384
$$ plain form
5333 -26536 5677 35875 34374 59899 18297 -57499 -130781 -55012 -3592 -84217 -207353 -213776
5321 -213776 -182243 -135360 -145023 -157109 -62069 -82036 -84531 5174 -43979 -83483 -94778 27818
5309 27818 112751 -28404 -65732 11788 75051 87430 26542 -15498 31485 45850 -40116 -32691
5297 -32691 -62686 -30417 2609 78169 14638 -34577 57145 -432 -53451 -74538 -14567 -124688
5285 -124688 -200318 -125685 -207 45173 11742 -55104 32664 31276 41561 -68332 -145201
5274 -145201 37669 34224 -25988 61589 24530 -123684 -230280 -86688 -85341 -89208 -20004
5263 -20004 -60477 -163180 -134457 -143544 -261288 -278854 -99169 -31914 -72767 -54737 -113523
5252 -113523 -188316 -208071 -273920 -280005 -93110 -113384 -83303 3145 -30571 -119867 -160786 -185170
5240a85170k2251k6293M5020K9771k0037m01J00498L7374N1248M6957j04346m1710
5228h9340O2046R0587M776q3026o1867L1007N9164n6921p1308N9898k1666n7023
5216a33673l5979R9388P8943n6902j18182O8119J34458R4228k9346K0467P3403
5205A94924p2971o7446q6086l8325R1741k287o8708J9347J05952n9580r5423M9705
5193b9157P6193n0400J4456p753O9154N6797k985j6565q0796M6555K3867M9361
5181A48727N5743k5155Q817j4305k44453r1371O560n4913J3600m5604M6325J42870
5169e3159J11870J2755J02204l3908k9171j01383k3753j871L4282R3325N9763
5158A70954L370r6082j01393l9217j45384m2319L3776O8181N7188J35406J00166
$$ plain form
5240 -185170 -207421 -233714 -188694 -158923 -178960 -179361 -78863 -41489 9759 56716 -47630 -89340
5228 -89340 -27294 63293 68069 -14957 -76824 -45817 13347 -43574 -114882 -54984 -76650 -133673
5216 -133673 -169652 -70264 8679 -48223 -166405 -98286 36172 130400 101054 121521 194924
5205 194924 121953 54507 -31579 -69904 21837 19550 -49158 -29811 76141 16561 -78862 -29157
5193 -29157 47036 -3364 11092 3339 72493 129290 126305 109740 28944 75499 99366 148727
5181 148727 204470 179315 188132 173827 -70626 -161997 -155437 -210350 -196750 -242354 -196029 -53159
5169 -53159 58711 71466 173670 139762 110591 9208 -14545 -16416 17866 111191 170954
5158 170954 174324 78242 -23151 -62368 -207752 -250071 -216295 -148114 -90926 44480 144646
5147A44646o5756L5341n6650j31724o0376J20765p9729m5055N623m182l5178m795
5135a77070L2440L5254M4853J62533j19602j43317j84621j14310J25991J98319
5125a39530L6083J712L3663J36473J55294K4716k51272o4867O6494K10000n8096
5114A50670k13002K6495M5964j1447K6299J9379Q9692m4Q097l8575j63954N7542
5102b884R5j44980r3451M3123O2708K8986m264J4697l6659o8273J52727J19633
5090G1458r7481q5723k6248O7501J37217J3397n8827j33154j05750m689J6288
5079b06011R0392M2580J0501l9052j5171Q5397Q6848q9735Q7762J44407j03889
5068I4029j12954K604n4152L2360O5877l8205q0665n0180O2603m9929L1429L8330
$$ plain form
5147 144646 78890 114231 57581 -74143 -134519 -13754 -93483 -138538 -132915 -137097 -172275 -177070
5135 -177070 -144630 -109376 -64523 98010 -21592 -164909 -349530 -463840 -337849 -139530
5125 -139530 -103447 -101735 -68072 68401 223695 248411 -2861 -67728 -1234 208766 150670
5114 150670 -62332 -35837 10127 -1320 24979 44358 134050 134006 142103 103528 -60426 -2884
5102 -2884 -2789 -147769 -241220 -198097 -135389 -106403 -110667 -95970 -132629 -200902 -48175 71458
5090 71458 -26023 -111746 -137994 -70493 66724 80121 21294 -111860 -217610 -222299 -206011
5079 -206011 -115619 -73039 -62538 -101590 -116761 -31364 55484 -34251 53511 197918 94029
5068 94029 -18925 -16321 -70473 -38113 27764 -10441 -91106 -141286 -78683 -128612 -97183 -58853
5056e8853j1953J27395N4230o5035r5279P0399p5316J1270n0630J2204J14488
5045C2920L7302l0183r193j49339R3834M1375R2207O7842l4322K4451p9150j99596
5033a11852n9268m6743l7813J2786M2200L4108J06044J27669j5747m8649n2130
5022d9395J8877P4462M1743l411k196k1321r5630Q0408J53535n9104j00737K8631
5010F5862j02910n4348J20932J1459j39398j3875q5404J22255R6901O3268m6590
4999C8152j04418r9418j4292Q5870j04800o0546P5073K483N7057K2375Q2960P7968
4987E8464k9441p6217Q6411N7256j1974n8060J02186K3282m4361k4262l1939L8433
4975H9778Q2476l8657L41k6251j29857p4476l1979K9511N5295L3848N2937o482
$$ plain form
5056 -58853 -70806 56589 110819 45784 -49495 20904 -54412 -43142 -93772 -81568 32920
5045 32920 70222 40039 30846 -118493 -24659 16716 108923 176765 142443 166894 87744 -111852
5033 -111852 -171120 -217863 -255676 -242890 -200690 -166582 -60538 67131 51384 2735 -49395
5022 -49395 -30518 43944 85687 82276 80080 58759 -36871 43537 197072 137968 37231 65862
5010 65862 -37048 -91396 29536 40995 -98403 -112278 -197682 -75427 21474 84742 38152
4999 38152 -66266 -165684 -179976 -94106 -198906 -259452 -184379 -181896 -124839 -102464 -19504 58464
4987 58464 29023 -47194 39217 96473 84499 26439 128625 151907 107546 83284 51345 89778
4975 89778 172254 133597 133938 107687 -22170 -96646 -128625 -99114 -43819 -9971 42966 36484
4963C6484k4700j06193l719J7534J34597J1751q0012k6463Q8648J9300r1625L1836
4951G438Q6179n8119j92920J345q8347P2420J87534J7020q2857J8881P9680m6056
4939B198j08128l9531J55979M0725o2942M6591J30213l2180j25963k429n5261
4928e0728m9440n9393n7962N0251R3643k9767k2826m4400M3423O4981N491P960
4916d8767M8453p896K4801j2695N9855j7761j8118P9976j51666j67912Q3028J06865
4904b1837M216J7761j9519p1836M8193O3254j5091J1869j9501j4147J18984q3061
4892A9285o3290p1341k0721J06250J70483J04725m2205j26750j51587q9337J51952
4881a2536Q6784O1313l3725j6283j9589j2178L9049O2413J0352M7832p852J8835
$$ plain form
4963 36484 11784 -94409 -98128 -80594 54003 65754 -14258 -40721 47927 67227 -24398 7438
4951 7438 93617 35498 -157422 -156077 -244424 -172004 15530 32550 -50307 -31426 48254 2198
4939 2198 -105930 -145461 10518 51243 -11699 34892 165105 132925 6962 4533 -50728
4928 -50728 -100168 -159561 -217523 -167272 -73629 -103396 -126222 -170622 -127199 -62218 -56727 -48767
4916 -48767 -314 -8210 16591 3896 63751 45990 27872 107848 -43818 -211730 -128702 -21837
4904 -21837 -17621 140 -19379 -91215 -43022 20232 5141 17010 -2491 -16638 102346 19285
4892 19285 -44005 -115346 -136067 -29817 140666 245391 203186 76436 -75151 -164488 -12536
4881 -12536 74248 135561 101836 85553 65964 53786 92835 155248 165600 213432 205580 224415
4869B24415o192p874o9109q5158R8342L3296j79954j06168J38580J97267K4319
4858B61764p0715j20161j07614q4976l349Q6774L0257o8644k9370J40146p8196
4847d4084l8676M0712K0356N5244k1873n4760J0543J6590K4290m1004k8823o517
4835f8002n4430L5553m0743K2970O9128J0435o4285j6840M891O7372o3806J2554
4823h5203N0137j5687j9249K5739J4969p4680j38241J17100J32128J21332K0526
4812A48871P6891J2255l4622k4975m6864m5490q1134K1437O1961l9441J1614K893
4800F3396M804m5389q4556j1607J13929R1924j27882j17977O3422N7969k2481
4789a4448j34135j7478J61419J17457j32892p6011L2372K4712j5877J0765j68536
$$ plain form
4869 224415 218223 210349 141240 56082 154424 187720 7766 -98402 40178 237445 261764
4858 261764 191049 70888 -36726 -121702 -125051 -38277 -8020 -76664 -106034 34112 -44084
4847 -44084 -82760 -42048 -21692 33552 11679 -43081 -32538 -15948 8342 -32662 -61485 -68002
4835 -68002 -122432 -86879 -127622 -104652 -35524 -25089 -89374 -106214 -101323 -33951 -97757 -85203
4823 -85203 -35066 -50753 -70002 -44263 -29294 -103974 -242215 -125115 7013 128345 148871
4812 148871 225762 238017 203395 178420 131556 86066 4932 26369 88330 48889 60503 63396
4800 63396 68200 22811 -61745 -73352 40577 132501 4619 -113358 -49936 8033 -14448
4789 -14448 -148583 -166061 -4642 112815 -20077 -96088 -63716 -39004 -54881 -44116 -212652
4778b12652J6591J26743q9231j52910j9804O9563O3808n4128O8633o5469J4201
4767b34655J19186J2565m0936m2757R9954R6475o2425M7458l3149k608K3876P1107
4755E4091m3212q6106P4259O6658P8614L0991p246K6996j80982j88336K6016J16743
4743c1514J05173K425o154J4137j3935j12141L5159Q0115m1788l9331M2537N2400
4731H7083K2577j45970j29345J25063Q2676k42019O4374J17231N6733j78474n841
$$ plain form
4778 -212652 -196061 -69318 -158549 -311459 -331263 -261700 -197892 -252020 -183387 -248856 -234655
4767 -234655 -115469 -102904 -143840 -186597 -86643 9832 -52593 -5135 -38284 -40892 -17016 54091
4755 54091 10879 -75227 -968 65690 144304 175295 168049 195045 14063 -174273 -148257 -31514
4743 -31514 73659 76084 69930 84067 70132 -42009 -6850 73265 31477 -7854 34683 87083
4731 87083 109660 -36310 -165655 -40592 42084 -199935 -135561 -18330 38403 -140071 -145912
$$ [...]
##END NTUPLES=NMR SPECTRUM
##END=
