##TITLE=Analysis number 323530
Compound Code mo 07897
Book Reference 423/116/2
Project Code adrs
Chemist Name bruced
##JCAMPDX= 6.0         $$ Bruker NMR JCAMP-DX V2.0
##DATA TYPE= NMR SPECTRUM
##DATA CLASS= NTUPLES
##ORIGIN= Bruker BioSpin GmbH
##OWNER= nmr
$$ XWIN-NMR		Version 3.5
$$ Thu Oct 26 12:29:15 2006 GMT Daylight Time (UT+1h)  MAYBRIDGE\nmr@NMR_250MHZ
##.OBSERVE FREQUENCY= 250.131544655141
##.OBSERVE NUCLEUS= ^1H
##.ACQUISITION MODE= SIMULTANEOUS (DQD)
##.ACQUISITION SCHEME= undefined
##.AVERAGES= 16
##.DIGITISER RES= 18
##SPECTROMETER/DATA SYSTEM= dpx250
##.PULSE SEQUENCE= zg30
##.SOLVENT NAME= CDCl3
##.SHIFT REFERENCE= (INTERNAL, CDCl3, 0, 16.522)
##AUDIT TRAIL= $$ (NUMBER, WHEN, WHO, WHERE, WHAT)
$$ ##TITLE= Audit trail, XWIN-NMR		Version 3.5
$$ ##JCAMPDX= 5.01
$$ ##ORIGIN= Bruker BioSpin GmbH
$$ ##OWNER= nmr
$$ C:\u/data/dgb/nmr/ADRS/1790/pdata/1/auditp.txt
$$ ##AUDIT TRAIL=  $$ (NUMBER, WHEN, WHO, WHERE, WHAT)
(   1,<2006-10-26 12:28:52.31 +100>,<MAYBRIDGE\nmr>,<NMR_250MHZ>,
      <created by zg, POWCHK disabled, PULCHK disabled
       configuration hash MD5:
       49 4B E0 1D 92 C2 6B 37 9F E6 65 BC 52 41 86 1D
       data hash MD5: 64K
       31 BE F5 CB C7 94 A8 3D 95 0E C2 AF 93 4B C9 66>)
(   2,<2006-10-26 12:29:06.92 +100>,<MAYBRIDGE\nmr>,<NMR_250MHZ>,
      <Start of raw data processing
       ef LB = 0.3 FT_mod = 6 PKNL = 1 SI = 32K 
       data hash MD5: 32K
       9C BE EE 9F 2B F0 1D BA EF 23 79 6E 85 00 67 47>)
(   3,<2006-10-26 12:29:08.54 +100>,<MAYBRIDGE\nmr>,<NMR_250MHZ>,
      <apk 
       data hash MD5: 32K
       38 C5 EA 44 47 CE C3 9D A2 E8 F7 FC 88 B2 CB 5D>)
(   4,<2006-10-26 12:29:09.34 +100>,<MAYBRIDGE\nmr>,<NMR_250MHZ>,
      <abs ABSG = 5 
       data hash MD5: 32K
       59 78 1C 71 1D 61 F9 35 4C 33 27 6F 76 FF DB 96>)
$$ ##END=
$$ 
$$ hash MD5
$$ 20 AE F1 D3 E2 AC 6F 57 70 50 5A 3A 9F 4E D7 7B
##$RELAX= 
##$RELAX= 
##$RELAX= 
##$RELAX= 
##$RELAX= 
##$RELAX= 
##$RELAX= 
$$ Bruker specific parameters
$$ --------------------------
##$DU= <C:\u>
##$EXPNO= 1790
##$NAME= <ADRS>
##$PROCNO= 1
##$TYPE= <nmr>
##$USER= <dgb>
##$AMP= (0..31)
100 100 100 100 100 100 100 100 100 100 100 100 100 100 100 100 100 100 
100 100 100 100 100 100 100 100 100 100 100 100 100 100 
##$AQSEQ= 0
##$AQ_mod= 3
##$AUNM= <au_zg>
##$AUTOPOS= <30 >
##$BF1= 250.13
##$BF2= 250.13
##$BF3= 250.13
##$BF4= 250.13
##$BF5= 500.13
##$BF6= 500.13
##$BF7= 500.13
##$BF8= 500.13
##$BYTORDA= 1
##$CFDGTYP= 0
##$CFRGTYP= 5
##$CHEMSTR= <none>
##$CNST= (0..31)
1 1 145 1 1 1 1 1 1 1 1 1 1 1 1 1 1 1 1 1 1 1 1 1 1 1 1 1 1 1 1 1 
##$CPDPRG= <>
##$CPDPRG1= <>
##$CPDPRG2= <>
##$CPDPRG3= <>
##$CPDPRG4= <mlev>
##$CPDPRG5= <mlev>
##$CPDPRG6= <mlev>
##$CPDPRG7= <mlev>
##$CPDPRG8= <mlev>
##$CPDPRGB= <>
##$CPDPRGT= <>
##$D= (0..31)
0 1 0 0 0 0 0 0 0 0.06 0 0 0 0 0 0 0.0002 0 0 0 0 0 0 0 0 0 0 0 0 0 0 
0 
##$DATE= 1161862130
##$DBL= (0..7)
120 120 120 120 120 120 120 120 
##$DBP= (0..7)
150 150 150 150 150 150 150 150 
##$DBP07= 0
##$DBPNAM0= <>
##$DBPNAM1= <>
$$ [...]
##$SUBNAM7= <"">
##$SUBNAM8= <"">
##$SUBNAM9= <"">
##$SW= 20.6930455092707
##$SWIBOX= (0..15)
0 0 3 0 0 0 0 0 0 0 0 0 0 0 0 0 
##$SW_h= 5175.983436853
##$TD= 65536
##$TD0= 1
##$TE= 683.16
##$TE2= 300
##$TE3= 300
##$TEG= 300
##$TL= (0..7)
0 120 120 120 120 120 120 120 
##$TP= (0..7)
150 150 150 150 150 150 150 150 
##$TP07= 0
##$TPNAME0= <>
##$TPNAME1= <>
##$TPNAME2= <>
##$TPNAME3= <>
##$TPNAME4= <>
##$TPNAME5= <>
##$TPNAME6= <>
##$TPNAME7= <>
##$TPOAL= (0..7)
0.5 0.5 0.5 0.5 0.5 0.5 0.5 0.5 
##$TPOFFS= (0..7)
0 0 0 0 0 0 0 0 
##$TUNHIN= 0
##$TUNHOUT= 0
##$TUNXOUT= 0
##$USERA1= <user>
##$USERA2= <user>
##$USERA3= <user>
##$USERA4= <user>
##$USERA5= <user>
##$V9= 5
##$VALIST= <valist>
##$VCLIST= <CCCCCCCCCCCCCCC>
##$VD= 0
##$VDLIST= <DDDDDDDDDDDDDDD>
##$VPLIST= <PPPPPPPPPPPPPPP>
##$VTLIST= <TTTTTTTTTTTTTTT>
##$WBST= 1024
##$WBSW= 4
##$XGAIN= (0..3)
0 0 0 0 
##$XL= 0
##$YL= 0
##$YMAX_a= 575142
##$YMIN_a= -453550
##$ZGOPTNS= <>
##$ZL1= 120
##$ZL2= 120
##$ZL3= 120
##$ZL4= 120
##$ABSF1= 16.522
##$ABSF2= -4.171173
##$ABSG= 5
##$ABSL= 3
##$ALPHA= 0
##$AQORDER= 0
##$ASSFAC= 0
##$ASSFACI= 0
##$ASSFACX= 0
##$ASSWID= 0
##$AUNMP= <proc_1d>
##$AZFE= 0.1
##$AZFW= 0.1
##$BCFW= 0
##$BC_mod= 0
##$BYTORDP= 0
##$COROFFS= 0
##$CY= 12.5
##$DATMOD= 1
##$DC= 0
##$DFILT= <>
##$DTYPP= 0
##$F1P= 14.0000005364418
##$F2P= -0.99999901652339
##$FCOR= 0.5
##$FTSIZE= 32768
##$FT_mod= 6
##$GAMMA= 0
##$GB= 0
##$INTBC= 1
##$INTSCL= 1
##$ISEN= 128
##$LB= 0.3
##$LEV0= 0
##$LPBIN= 0
##$MAXI= 10000
##$MC2= 0
##$MEAN= 0
##$ME_mod= 0
##$MI= 0
##$NCOEF= 0
##$NC_proc= -4
##$NLEV= 6
##$NOISF1= 0
##$NOISF2= 0
##$NSP= 0
##$NTH_PI= 0
##$NZP= 0
##$OFFSET= 16.522
##$PC= 1
##$PHC0= -49.28059
##$PHC1= 2.812684
##$PH_mod= 1
##$PKNL= yes
##$PPARMOD= 0
##$PSCAL= 4
##$PSIGN= 0
##$REVERSE= no
##$SF= 250.13
##$SI= 32768
##$SIGF1= 0
##$SIGF2= 0
##$SINO= 400
##$SIOLD= 32768
##$SREGLST= <1H.CDCl3>
##$SSB= 0
##$STSI= 32768
##$STSR= 0
##$SW_p= 5175.98343685301
##$SYMM= 0
##$S_DEV= 0
##$TDeff= 65536
##$TDoff= 0
##$TI= <Analysis number 999999
Compound Code 99
Book Reference 9
Project Code 9>
##$TILT= no
##$TM1= 0
##$TM2= 0
##$TOPLEV= 0
##$USERP1= <user>
##$USERP2= <user>
##$USERP3= <user>
##$USERP4= <user>
##$USERP5= <user>
##$WDW= 1
##$XDIM= 32768
##$YMAX_p= 507276892
##$YMIN_p= -239119
$$ End of Bruker specific parameters
$$ ---------------------------------
##NTUPLES= NMR SPECTRUM
##VAR_NAME=  FREQUENCY,     SPECTRUM/REAL,   SPECTRUM/IMAG
##SYMBOL=    X,             R,               I
##VAR_TYPE=  INDEPENDENT,   DEPENDENT,       DEPENDENT
##VAR_FORM=  AFFN,          ASDF,            ASDF
##VAR_DIM=   32768,         32768,           32768
##UNITS=     HZ,            ARBITRARY UNITS, ARBITRARY UNITS
##FACTOR=    0.157963299565203, 1,           1
##FIRST=     4132.6476996994, 0,             0
##LAST=      -1043.33573715361, 0,           0
##MIN=       -1043.33573715361, -239119,     0
##MAX=       4132.6476996994, 507276892,     0
$$ Real data points
##PAGE= N=1
##DATA TABLE= (X++(R..R)), XYDATA
$$ [...]
19577B0597k0432O4918N8199n0944m77Q165M8306J1635k4599p2759m337J8898
$$ 20597 165 65083 123282 72338 71861 80026 128332 139967 115368 42609 38272 57170
19565E7170m121j2775n8596m1655K0413M3626M4617M945Q773J224N258n805k9012
$$ 57170 53049 40274 -18322 -59977 -39564 4062 48679 53624 62397 63621 68879 63074 34062
19552C4062J323N7260l6102m8819M9183J2331j043O1204K8975k5245M8481N6083
$$ 34062 35385 92645 56543 7724 56907 69238 68195 129399 158374 133129 181610 237693
19540B37693J2992l5745L7422N6037L6265R4371J40507J35880N0546n02o7286
$$ 237693 250685 214940 252362 308399 344664 439035 579542 715422 765968 765466 698180
19529F98180j17216q2022p9677j08016p9041N8905P5132J7587O9700O4602J30665
$$ 698180 580964 498942 419265 311249 232208 291113 366245 383832 453532 518134 648799
19518F48799J64457Q4102l4681j58919j57756j34888o6161l4308n1434r5511p3668
$$ 648799 813256 897358 862677 703758 546002 411114 344953 310645 259211 163700 90032
19507I0032N0947L57K642o1491M850Q172o537l840N1599P561m2972K3621j6055
$$ 90032 140979 141336 143978 82487 87337 95509 88972 85132 136731 144292 101320 124941 108886
19494A08886N1291o098L40q396j5612n9091k4931K8755L8664P6573J37523J27029
$$ 108886 160177 154079 154419 146023 130411 71320 46389 75144 113808 190381 327904 454933
19482D54933J04317J60762J16504N4174o0227j56489j46978j32539j31385r1287
$$ 454933 559250 720012 836516 890690 830463 673974 526996 394457 263072 171785
19472A71785L4241P6755L8874O4960J06750J17901J47469R7003K408n4900j25314
$$ 171785 206026 282781 321655 386615 493365 611266 758735 855738 858146 803246 677932
19461F77932j79202j38818r5375r1866j3338N195j8790l6675O441N15K7794q980
$$ 677932 498730 359912 264537 172671 159333 164528 145738 109063 115504 116019 143813 134833
19449A34833o9946m075k41O670o0111o2480n785M3579O8778M010k3867K2707l933
$$ 134833 64887 60812 60571 67241 7130 -55350 -61135 -17556 51222 55232 31365 54072 50139
19436E0139J7339N733l8442j8765K3578M887k5962K4500J6397j6894p623l5645
$$ 50139 67478 73211 34769 16004 39582 44469 18507 43007 59404 42510 34887 -758
19424g58k8187K9425M5916J1742K00l0155K4363L9112j9509l5712K3668j609k6316
$$ -758 -28945 480 46396 58138 58338 28183 52546 91658 72149 36437 60105 58496 32180
19411C2180L7198K5925J0882J4506r853J0740J865k568R872l97j4540M3830K8688
$$ 32180 69378 95303 106185 120691 110838 121578 123443 120875 130747 130350 115810 159640 188328
19398A88328j1381N710J5329J2159M305R79L4304K7833j9948K652N2149O479k3696
$$ 188328 176947 182657 197986 210145 214450 215429 249733 277566 257618 260270 312419 318898 295202
19385B95202Q784n4779R467Q3738K5938K1470Q138k6525p647p9652o5965o719
$$ 295202 303986 249207 258674 342412 368350 389820 397958 371433 363786 284134 218169 211450
19373B11450J0020p302r847l2794n4523o2036l3979K582l4718J4421R010M3942
$$ 211450 221470 214168 204321 171527 117004 54968 20989 23571 -11147 3274 12284 56226
19361E6226O1518r086l0468m9262l8531M9441q651l6790K0956M2355j424n0611
$$ 56226 117744 108658 78190 28928 -9603 39838 31187 -5603 15353 57708 56284 5673
19349E673q7322M781N1600N3049K7125J8313j7367p1264l7116O5153O4195m600
$$ 5673 -81649 -76868 -25268 27781 54906 73219 55852 -15412 -52528 12625 76820 72220
19337G2220j2927l1776n0903l7156k5268M6491M1589l3693r575K6815L6192j9155
$$ 72220 59293 27517 -23386 -60542 -85810 -39319 2270 -31423 -40998 -14183 22009 2854
19325B854k0754M1483L2569J1661K50l7208J3769O842O6204p990l1325l3996m1493
$$ 2854 -17900 23583 56152 67813 68063 30855 44624 51466 117670 109680 78355 44359 2866
19312B866J707O1658j4018n8003j5508o5350q2565J1789N3752O6917q829r339
$$ 2866 4573 66231 52213 -5790 -21298 -86648 -169213 -157424 -103672 -36755 -45584 -54923
19300e4923N831M1484M1470K2502n0889r309M0955j0708K8555p6435p7544M0318
$$ -54923 -49092 -7608 33862 56364 5475 -3834 37121 26413 54968 -21467 -99011 -58693
19288e8693l906L8772k2006n5832K6731K3081L5977Q4095m4917p3530M5231K3568
$$ -58693 -62599 -23827 -45833 -101665 -74934 -51853 -15876 68219 23302 -50228 -4997 18571
19276A8571K0902o265j0429K7294m5647Q65O5384R988p4619M37P7J7445l554K3447
$$ 18571 39473 33208 22779 50073 4426 5291 70675 80663 6044 6481 6558 24003 20449 43896
19262D3896M5493L5350L6966k6113k5664j8747p052j7655j8490m899N2955L73
$$ 43896 89389 124739 161705 135592 109928 91181 84129 66474 47984 43085 96040 96413
19250I6413l453j9304K7379o317m9253o1924J6467O7036j0100m4112N6630N2964
$$ 96413 92960 73656 101035 94718 45465 -16459 8 67044 56944 12832 69462 122426
19238A22426P5026l8119l9874j05282l7255m4950M8373Q6821R994J0981o1428
$$ 122426 197452 159333 119459 14177 -23078 -68028 -19655 67166 77160 88141 26713
19227B6713k7876N6972N8265n0294l4031j049J2514l0423K0301O0756P9132q595
$$ 26713 -1163 55809 114074 63780 29749 28700 41214 10791 31092 91848 170980 162385
19215A62385q8015J385L2616j7029L0917j6372k1794M3852J9680J7691k3599O5409
$$ 162385 74370 75755 108371 91342 122259 105887 84093 127945 147625 165316 141717 207126
19203B07126J4139q959l8647M3583j8364J4141J9371m0443K5638Q5767O86K0730
$$ 207126 221265 212306 173659 217242 198878 213019 232390 191947 217585 303352 304038 324768
19191C24768Q3456j9015o5447m2045K3729L1194n7422o4931l6913j7512J7435
$$ 324768 408224 389209 323762 281717 305446 336640 279218 214287 177374 159862 177297
19180A77297K7787J3800J1262P656K1043k4289j21609m7887M479j7318M5510j5525
$$ 177297 205084 218884 230146 237802 258845 234556 112947 65060 69539 52221 97731 82206
19168H2206K3418K0755L1839L4261m7283R753O6718r4899n2388p371J4865L6271
$$ 82206 105624 126379 158218 192479 145196 154949 221667 126768 74380 67009 81874 118145
19156A18145O1046Q862p211M5239q905k1058k4890o6198j8131K984L9033O2795
$$ 118145 179191 188053 180842 226081 217176 196118 171228 105030 86899 89883 128916 191711
19144A91711Q4925L1668L4367J8666O9471m8038r706p3340q1841q6290o32K7672
$$ 191711 276636 308304 342671 361337 430808 382770 373064 299724 217883 131593 130961 158633
19132A58633M4584J9980K9616L112J12988N060k8702R95J7625l6793p5396m7523
$$ 158633 203217 223197 252813 255925 368913 373973 345271 346266 363891 327098 251702 204179
19120B04179n2928K5286O4882J9703J6310o5608k5990P2328N5774N78n9759p8235
$$ 204179 151251 176537 241419 261122 277432 211824 185834 258162 313936 314514 254755 176520
19108A76520L8742K0935N5191P500n890j5326l9620m8930j8199L7718j4755L0350
$$ 176520 215262 236197 291388 298888 292998 277672 238052 189122 170923 208641 193886 224236
19096B24236N2475P133p721M2428j7189j9156O5384M3929l6524l8291N1316J03295
$$ 224236 276711 283844 276123 318551 301362 282206 347590 391519 354995 316704 368020 471315
19084D71315J9364j5253N7346L0051j9167m9662j9587P7649K7292J0443J6742
$$ 471315 490679 475426 532772 562823 543656 493994 474407 552056 579348 589791 606533
19073F06533j6553M3361l071k7118J6654n397j1788l7942J2401N1648M1223L0890
$$ 606533 589980 633341 630270 603152 619806 614409 602621 564679 577080 628728 669951 700841
19061G00841L1031N8985j2928n4626N3090J15703K4499M7684M3018Q543L8236
$$ 700841 731872 790857 777929 723303 776393 892096 916595 964279 1007297 1015840 1054076
19050A054076j9408j3823P7331Q1515R632M3055N5526N3533K8969Q9575J43421
$$ 1054076 1034668 1020845 1098176 1179691 1189323 1232378 1287904 1341437 1370406 1459981 1603402
19039A603402Q6924P4994O6264P7958J20278J48432J12826J90294J68738J22147
$$ 1603402 1690326 1765320 1831584 1909542 2029820 2178252 2291078 2481372 2650110 2772257
19029B772257K10384K61236L02889L51350L87245L38953L07585L66650M07276
$$ 2772257 2982641 3243877 3546766 3898116 4285361 4624314 4931899 5298549 5705825
19020E705825N18460N96992O30384P23770P84471J040008J406902J784237K391837
$$ 5705825 6224285 6821277 7451661 8175431 8959902 9999910 11406812 13191049 15582886
19011A5582886L189175M426235O407691R561530J4004309J9251500K3612898K4423822
$$ 15582886 18772061 23198296 29605987 39167517 53171826 72423326 96036224 120460046
19003A20460046J7671099N275223j0899423k2129675k3951412j9598632j2399553
$$ 120460046 138131145 143406368 132506945 110377270 86425858 66827226 54427673
18996E4427673o303490j482687K868565P708089J3113695J8456451K1957988K0297268
$$ 54427673 48124183 46641496 49510061 57218150 70331845 88788296 110746284 131043552
18988A31043552J1165644k353897j7898707k5024268k4462139j8810122j2504401
$$ 131043552 142209196 139855299 121956592 96932324 72470185 53660063 41155662
18981D1155662q055072n294978l715427k605075j892220j503083j130773p98394
$$ 41155662 33100590 27805612 24090185 21485110 19592890 18089807 16959034 16160640
18973A6160640n99471m55480k99668k20119n6579J39229K28767L06434L77964
$$ 16160640 15561169 15105689 14806021 14585902 14529323 14668552 14897319 15203753 15581717
18964A5581717M27007N64920Q55671J299588J829721K531559L636198N235989
$$ 15581717 16008724 16573644 17429315 18728903 20558624 23090183 26726381 31962370
18956C1962370P864457J1901060J7277995K3056228K7139261K5600557J5421715
$$ 31962370 39826827 51727887 69005882 92062110 119201371 144801928 160223643
18949A60223643j3463j7752015k6209793k5791818j9512524j1642172n317516
$$ 160223643 160210180 142458165 116248372 90456554 70944030 59301858 53984342
18942E3984342k39831M772796J0377729J6499927K2125314K4614208K0123627
$$ 53984342 53744511 58517307 68895036 85394963 107520277 132134485 152258112
18935A52258112P969226q857794k4146163k8522388k5900278j8831020j2389735
$$ 152258112 160227338 151369544 127223381 98700993 72800715 53969695 41579960
18928D1579960q078381n419647l931144k944395k261481j804536j542764j343724
$$ 41579960 33501579 28081932 24150788 21206393 18944912 17140376 15597612 14253888
18920A4253888j073784q66776p81894o82729n16476m58080l23622l46918m09460
$$ 14253888 13180104 12313328 11531434 10848705 10332229 9874149 9550527 9203609 8794149
18911H794149m59968m94143n03855m54709m07020l82474k94585k29976k42299
$$ 8794149 8334181 7840038 7336183 6881474 6474454 6091980 5797395 5567419 5325120
18902E325120k39533k34278k00803j69512j64513j97375j47603j67270j52440
$$ 5325120 5085587 4851309 4650506 4480994 4316481 4119106 3971503 3804233 3651793
18893C651793p9958j28471j64938j55509j32506l9526m0153j40150q2702r2821
$$ 3651793 3571835 3443364 3278426 3122917 2990411 2950885 2910732 2770582 2687880 2595059
18883B595059o0664K6848K2080r4417j30397r0607m7497o1245n5462p1591j9127
$$ 2595059 2534395 2561243 2583323 2488906 2358509 2267902 2220405 2159160 2103698 2032107 2012980
18872B012980n2997o1356j04499q1741m4215k46K8443q2458n2929p8569n5399
$$ 2012980 1959983 1898627 1794128 1712387 1668172 1667926 1696369 1613911 1560982 1482413 1427014
18861A427014n7670M4699J9022p1417p9447r6933p5627m6307K4289P67J4905q567
$$ 1427014 1369344 1414043 1433065 1361648 1282201 1185268 1109641 1063334 1087623 1088390 1103295 1094728
18849A094728p1729p426M640m5529n1468p239N5232J8520n4705q3751o4670k6249
$$ 1094728 1022999 1015573 1020213 974684 923216 915977 971209 989729 935024 851273 786603 760354
18837G60354M0179K3502n2584P105K4981j4949k0563n7016l1899m099j3377j0823
$$ 760354 800533 824035 771451 778556 803537 788588 768025 711009 679110 675011 661634 650811
18825F50811k9234L0733M2165j8045j0666Q5546K303o2672k4768k2650o3904q6405
$$ 650811 621577 652310 694475 676430 665764 751310 753613 690941 666173 643523 579619 493214
18813D93214r5983l4895N8846L8798R4603L8239k7962K0109m7801n2272k8000
$$ 493214 397231 362336 421182 459980 554583 592822 564860 584969 537168 484896 456896
18802D56896j27025p8597k4573J4940m1310l9334M9135r228K5175l9017l3574
$$ 456896 329871 251274 226701 241641 200331 160997 210132 200904 226079 187062 153488
18791A53488L8480j5346j5465K3877P6484M5840k4841K9317m2604K0750J3938
$$ 153488 191968 176622 161157 185034 261518 307358 282517 311834 269230 289980 303918
18780C03918k9560J1570k118L558P909N5216L9933k4722k2311n3498P6408J31383
$$ 303918 274358 285928 283810 287368 295277 350493 390426 365704 343393 289895 366303 497686
18768D97686J41308N9161q6034j34130p2563j46019j53741n3473k5838J4050L6663
$$ 497686 638994 698155 612121 477991 405428 259409 105668 52195 26357 40407 77070
18757G7070n62N3857J22584K1684j6783j9847r068q599o5990j03193p7969j8606
$$ 77070 76508 130365 252949 274633 257850 238003 228935 220336 154346 51153 -26816 -45422
18745d5422L2064k2586n278P8154J20440O107J6573m3348m6157k4502O3442L1590
$$ -45422 -13358 -35944 -41222 36932 157372 163479 180052 136704 90547 66045 129487 161077
18733A61077J9774N9953L5794j01294q6539j3118O5100k8462j7919L7502K1703
$$ 161077 180851 240804 276598 175304 88765 75647 140747 112285 94366 131868 153571
18722A53571P215j4245r419p324R835K7855K5573k6943N01k6659k5199O4951L8053
$$ 153571 160786 146541 137122 129798 139633 167488 193061 166118 166619 139960 114761 179712 217765
18709B17765l3887j7407k3109k210M328o9942m7983K2084J4478j7933P7678K6326
$$ 217765 183878 166471 143362 141152 145480 75538 27555 49639 64117 46184 123862 150188
18697A50188k6037J21K8211R208k5802p2668j0574Q0413N2953K1572k1569K4561
$$ 150188 124151 124272 152483 161691 135889 63221 52647 133060 186013 207585 186016 210577
18685B10577L9226J2872j8417M7007p6044j1019L8707l043l2104k4898k0915n908
$$ 210577 249803 262675 244258 291265 215221 204202 242909 239866 207762 182864 161949 156041
18673A56041k7566J350j2353o9263o1118J0385Q0629K8775n1265m0608N274K3595
$$ 156041 128475 129825 117472 48209 -12909 -2524 78105 106880 55615 15007 20281 43876
18661D3876r082M5437R0554L3735l9138j23162l2021q592L7859M6415L969R800
$$ 43876 34794 80231 170785 204520 165382 42220 10199 1607 39466 85881 89850 99650
18649I9650j9936J0528o393Q897K8028L4463L6892K2116n3690o5123L4649M718
$$ 99650 79714 90242 83849 92746 120774 155237 192129 214245 160555 95432 130081 134799
18637A34799m8494J479J0896m5565k8267q278N0917J6117l6703Q6078R3535L2755
$$ 134799 86305 87784 98680 53115 24848 16570 67487 83604 46901 132979 226514 259269
18625B59269l2081o5941j0799m5541K4909M43m1097l626L8080j2598k1437k6223
$$ 259269 227188 161247 150448 104907 129816 130259 89162 85536 123616 111018 89581 63358
18613F3358l5700k6534O738K924p387K4020M6755K6701l3517M307o1734j5078
$$ 63358 27658 1124 7862 10786 3399 27419 74174 100875 67358 71665 9931 -5147
18601e147Q654M632J105N5689N4187k619q649n7223k1830N0334K4382L0199O3561
$$ -5147 3507 8139 9244 64933 119120 116501 107852 50629 28799 79133 103515 133714 197275
18588A97275J3763o871J0532M286j8571n3934M2001p394J2526J6844k7803l9149
$$ 197275 211038 204167 214699 218985 200414 146480 188481 181087 193613 210457 182654 143505
18576A43505n5611L6537M9016M7898M0244L8116Q8300Q2031J02761M8127J22571
$$ 143505 87894 124431 173447 221345 261589 299705 388005 470036 572797 620924 743495
18565G43495P0673Q7745J08012R3364K2542k6237j5539l3837n0426j20567j87027
$$ 743495 814168 901913 1009925 1103289 1125831 1099594 1084055 1050218 999792 879225 692198
18554F92198p9222o6914p5183o7769p1749j526l2700j27753m3870j3990J3864
$$ 692198 612976 546062 470879 403110 331361 329835 297135 169382 125512 111522 125386
18543A25386K9991J1542n097p830n389k9160p6922L4097M6319M0533n4259o5266
$$ 125386 155377 166919 161822 153992 148603 119443 42521 76618 122937 163470 109211 43945
18531D3945J1414J8314k4522K1005M7539N0386m7755L5985j4431J2313P3333Q0911
$$ 43945 55359 73673 49151 70156 117695 168081 120326 156311 141880 154193 227526 308437
18519C08437N1435m0266M1766J2291P8811R9766J01361O5385O6890O5273M6203
$$ 308437 359872 319606 361372 373663 452474 552240 653601 718986 785876 851149 897352
18508H97352M687o3186l6733O4484n3377m7575q4000j07665q8858o2558j19052
$$ 897352 902039 838853 802120 866604 813227 765652 681652 573987 485129 422571 303519
18497C03519r8118q317K5098K6793l4332o8900L115P647k5539m7439L6912L6766
$$ 303519 205401 197084 222182 248975 214643 145743 148858 156505 130966 83527 120439 157205
18485A57205P364J64L1568N3942j1620l7095k9031K0799L7230J7507R689O2357
$$ 157205 164569 164733 196301 250243 238623 201528 172497 193296 230526 248033 257722 320079
18473C20079O7974L8697N1588J11217J54066N8262M2120l6116r7473j75557j34552
$$ 320079 388053 426750 478338 589555 743621 801883 844003 807887 710414 534857 400305
18462D00305k8201j9834k2949j0682L8168O7176M4127J01602J20357L7892K2132
$$ 400305 372104 352270 329321 318639 356807 423983 468110 569712 690069 727961 750093
18451G50093p3000j43360j13537j10711r3213k5718L1401J9404L6766m632n5523
$$ 750093 677093 533733 420196 309485 216272 190554 221955 241359 278125 273493 217970
18440B17970p163K342J7493p5047m9902l7203k1840M6797J13481j1591m612N1662
$$ 217970 210807 213149 230642 155595 105693 68490 46650 93447 206928 195337 190725 242387
18428B42387J715k3981J213j1045Q909p430k1952l4302P0039J33867J64258J41036
$$ 242387 244102 220121 221334 210289 219198 211768 189816 155514 225553 359420 523678 664714
18416F64714J27892Q3434O4840r6711j00921q4166j27304q3444l8533m4845k5294
$$ 664714 792606 876040 940880 844169 743248 659082 531778 448334 409801 364956 339662
18405C39662J26078Q3716J23996J98321J63473O3089n521k03044j65049j73864
$$ 339662 465740 549456 673452 871773 1035246 1098335 1092814 889770 724721 550857
18395E50857j27971o8674p3117j9068J3308p1504l606j0165j9041j7215m8246
$$ 550857 422886 354212 281095 262027 275335 203831 200225 190060 171019 153804 105558
18384A05558M9304P6043m5177k1023l018J4567K3077R349J7184N306q2522j4083
$$ 105558 154862 230905 185728 164705 161687 176254 199331 208680 225864 231170 148648 134565
18372A34565L4111K8794K0794k5674Q526j1725K0442K7788O8017R354q1901m4146
$$ 134565 168676 197470 218264 192590 201116 189391 209833 237621 305638 314992 233091 188945
18360A88945m5550L7721M7884m1651m6457l3880P6838m9127m0927M5405J8208
$$ 188945 143395 181116 229000 187349 140892 107012 183850 134723 93796 139201 157409
18349A57409l4177j2598j5314N086O7476K9200l5426m7894j2871M8361K3486M8547
$$ 157409 123232 110634 95320 100406 167882 197082 161656 113762 100891 149252 172738 221285
18337B21285J8322j9163l8195J9658k4494l0267l0574M4169k25j0594O0369J0448
$$ 221285 239607 220444 182249 201907 177413 147146 116572 160741 160516 149922 210291 220739
18325B20739j0259j2510O47J0971K459O18k0322N2854K5928j1868k9752r247L7567
$$ 220739 210480 197970 198617 209588 212047 212665 192343 245197 271125 259257 229505 220258 257825
18312B57825K9771j0369L4984M1771K8472o9239p956j3767M2382P7267K9082J4046
$$ 257825 287596 277227 312211 353982 382454 313215 305259 291492 333874 411141 440223 454269
18300D54269M0036L6365k9322k7002K1627R69j9998l2327j09108p1925N2297J8756
$$ 454269 494305 530670 501348 474346 495973 496942 476944 444617 335509 263584 315881 334637
18288C34637j4934L8566L6102K8277K648n5005k2001k4005J6445j5570j656M2721
$$ 334637 319703 358269 394371 422648 425296 370291 348290 324285 340730 325160 323504 366225
18276C66225O6215j4811J686O169N1565J5425l0421K6682k8509j8791k0619j3181
$$ 366225 432440 417629 419315 425484 477049 492474 462053 488735 460226 441435 420816 407635
18264D07635r8715l3285J03058N9155L1689j2530N136J5620k2855l272P5747N2923
$$ 407635 308920 275635 378693 437848 469537 457007 462143 477763 454908 451636 527383 580306
18252E80306J7511o561l135O0599k5029k1452j0050k2486j1842O5230N8309J641
$$ 580306 597817 591256 588121 648720 623691 602239 592189 569703 557861 623091 681400 683041
18240F83041P466j6062K7033P7711N1289Q044L0748k6684m6394r5608l6874J1173
$$ 683041 690507 674445 701478 779189 830478 838522 869270 842586 796192 700584 663710 674883
18228F74883O0427j7308j07926p6118k6086j1614O911j5916m0201K0820K5466
$$ 674883 735310 718002 610076 533958 507872 496258 503169 487253 447052 467872 493338
18217D93338k3641l2218p3679n4447O6232J00182M0795r927J5770O477K8949K4128
$$ 493338 469697 437479 363800 309353 375585 475767 516562 506635 522405 528882 557831 581959
18205E81959J7666l4342j5991l1527j1094R531J9732M8811M0888n5K0595N2109
$$ 581959 599625 565283 549292 517765 506671 516202 535934 584745 625633 625578 646173 698282
18193F98282K6660J174m9635q0283J7576o7708j702R0740L8241j9261m288L5531
$$ 698282 724942 726116 676481 596198 613774 546066 544364 635104 673345 654084 649796 685327
18181F85327N7674M364m0563J2838N5337j3822m3984m4377l7260j0084L1784L8230
$$ 685327 743001 747365 706802 719640 774977 761155 717171 672794 635534 625450 657234 695464
18169F95464J2019J0811q162n423Q101n400J9737N8445K0514j3667J9577K4481
$$ 695464 707483 718294 710132 704709 712810 707410 727147 785592 806106 792439 812016 836497
18157H36497K2354Q925k6915k4502M517l8918k312L8683N4558j2830k7817K7666
$$ 836497 858851 867776 840861 816359 820876 781958 779646 818329 872887 860057 832240 859906
18145H59906P0434J29570N5514P4852J3009n1501J416K7276L5056p208N4713L5705
$$ 859906 930340 1059910 1115424 1190276 1203285 1151784 1153200 1180476 1215532 1208324 1263037 1298742
18133A298742N8234J11363J32296J58872J58057J46211J35391J33461J84134K48308
$$ 1298742 1356976 1468339 1600635 1759507 1917564 2063775 2199166 2332627 2516761 2765069
18123B765069K54136K59019M14505M94657O49918P84743J243974J927767K835888
$$ 2765069 3019205 3278224 3692729 4187386 4837304 5622047 6866021 8793788 11629676
18114A1629676M369159P034954J1372732J6088496J6611541J3197179J109694
$$ 11629676 15998835 23033789 34406521 50495017 67106558 80303737 81413431
18107H1413431k2941191k1538616j2557569p246673m295735k667139j693820j184161
$$ 81413431 58472240 36933624 24376055 17129382 12833647 10166508 8472688 7288527
18099G288527p95486o14402n35282m83881l87397j75764p8962p3170j23633p5964
$$ 7288527 6493041 5878639 5343357 4859476 4472079 4296315 4217353 4144183 4020550 3944586
18089C944586R588O3950L4640K4407M9286O4268N5497P2751O1315J27963Q1171
$$ 3944586 3954174 4018124 4052764 4077171 4126457 4190725 4246222 4318973 4380288 4508251 4589422
18078D589422J53766K30195K52875K22823J70369J67748K30467K04150K48031
$$ 4589422 4743188 4973383 5226258 5449081 5619450 5787198 6017665 6221815 6469846
18069F469846L10837K66460K63173L80547M74740O04080P34379Q67171J060626
$$ 6469846 6780683 7047143 7310316 7690863 8165603 8769683 9504062 10371233 11431859
18060A1431859J339403J846340K340672K994795M025906N429850P488637J0222577
$$ 11431859 12771262 14617602 16958274 19953069 23978975 29408825 36897462 47120039
18052D7120039J3166742J5607892J7231756J7474935J7516672J9292890J9530800
$$ 47120039 60286781 75894673 93126429 110601364 128118036 147410926 166941726
18045A66941726J4372716L313152l007994j929192k379453r938056k0641759k2464161
$$ 166941726 181314442 184627594 181619600 179690408 177310955 167372899 146731140 124266979
18037A24266979j7831815j4761266j5067739j5234410j2550656r171853o611984
$$ 124266979 106435164 91673898 76606159 61371749 48821093 39649240 33037256
18030C3037256m764509l444518k538147j934423j446894j064493p87431n91436
$$ 33037256 28272747 24828229 22290082 20355659 18908765 17844272 17056841 16465405
18022A6465405n04503m19160k50560k32068j90425j06018j58671j52715j11060
$$ 16465405 15960902 15541742 15291182 15059114 14868689 14762671 14604000 14451285 14340225
18013A4340225j8267K1634R5280J74971L97702P00076J038054J383128J938309
$$ 14340225 14321958 14343592 14438872 14613843 15011545 15711621 16749675 18132803 20071112
18004B0071112K711197L710346N208297P266543R844979J2372824J4329121J5482524
$$ 20071112 22782309 26492655 31700952 38967495 48812474 61185298 75514419 90996943
17996I0996943J5374797J6008910J7511579J6555234R964374Q6362k940900j548936
$$ 90996943 106371740 122380650 139892229 156447463 166411837 166498199 163557299 162008363
17988A62008363l528393j2213964k0380978j9300282j4939992j3178654j4043094
$$ 162008363 158479970 146266006 125885028 106584746 91644754 78466100 64423006
17981F4423006j3341617j0433054p553543n477280l971034k907145k275849j811854
$$ 64423006 51081389 40648335 33094792 27617512 23646478 20739333 18463484 16651630
17973A6651630j395187j152068r10872p20796o01613n02249m82337l87588l63664
$$ 16651630 15256443 14104375 13193503 12472707 11871094 11368845 10886508 10498920 10135256
17964A0135256l85205m49011m57999m10102m03944m53163m53908l63361l47592
$$ 10135256 9750051 9301040 8843041 8432939 8028995 7575832 7121924 6758563 6410971
17955F410971l47215m12876l82243k74399k60789k69355j49441j32574j15242
$$ 6410971 6063756 5650880 5268637 4994238 4733449 4464094 4314653 4182079 4066837
17946D066837j20171j59369j79414j14775j03552o7674r1549j21946r306n6661
$$ 4066837 3946666 3787297 3607883 3493108 3389556 3321882 3230333 3108387 3099081 3042420
17936C042420j66779r0562j36048o1956p4508n3219r4022r8044r569o5875m9688
$$ 3042420 2875641 2785079 2649031 2587075 2512567 2459348 2365326 2267282 2257713 2191838 2142150
17925B142150k2309r9419p7216n9617n2572n2566K099j0455n1588m6595o1754
$$ 2142150 2119841 2020422 1943206 1883589 1831017 1778451 1780550 1770095 1718507 1671912 1610158
17914A610158q7141m9944k2534n371J1114j7947n0901r4285m8478m019j7453o5575
$$ 1610158 1523017 1473073 1450539 1445168 1456282 1438335 1387434 1293149 1244671 1240652 1223199 1157624
17902A157624k2173k4563n3276K8297l1915m3962j2048l1812n3619j8142j4464
$$ 1157624 1135451 1110888 1057612 1085909 1053994 1010032 997984 966172 912553 894411 879947
17891H79947l8689j162j9287m9207N711N1149J4463P694k9978k7717m5364k4024
$$ 879947 841258 840096 820809 771602 777313 828462 842925 850619 820641 792924 747560 723536
17879G23536N3983K2222l091k0045n5817n2977R678K9193J760j0064o7754k9437
$$ 723536 777519 799741 796650 776605 720788 667811 677489 706682 708442 698378 630624 601187
17867F01187J4540L385L0557K5179l8109j8380k1702k9904j24803j10346P028
$$ 601187 615727 619112 649669 674848 636739 618359 596657 566753 441950 331604 338632
17856C38632J8601l0827n105o10m1033m7169K3976j4470n4018k908O8L276J5131
$$ 338632 357233 326406 321301 320691 279658 232489 256465 241995 187977 185069 185137 188413 203544
17843B03544k6217N5631J26262R993q0776P268n2796j481O8975k3854l4843K6890
$$ 203544 177327 232958 359220 369213 288437 295705 242909 241428 310403 286549 251706 278596
17831B78596Q708K7825j6380J8055M1245n0230o9826k7495J7099N7192J07253
$$ 278596 287304 315129 298749 316804 358049 307819 237993 210498 227597 284789 392042
17820C92042N5332n0517q5357q2382j7855j2326j5576O146O1899R351o6871J708
$$ 392042 447374 396857 311500 229118 211263 198937 183361 189507 251406 260757 193886 195594
17808A95594N3791M326p5653j0958k0331l4434K6995n2096r666P0961j2967l0947
$$ 195594 249385 253711 178058 167100 146769 112335 139330 87234 77568 148529 135562 104615
17796A04615N830J5472K8483j9304O010L7949J0343j6617J3726j5239l8835J011
$$ 104615 110445 125917 154400 135096 141106 179055 189398 172781 186507 171268 132433 133444
17784A33444m7732J5031Q258N420M267K4967L0251O0063K2510m2442m2719n3334
$$ 133444 85712 100743 109001 114421 118688 143655 173906 233969 256479 214037 171318 117984
17772A17984k6724l9820M4901O7061K0258N825j0677J2163l1091l9325k6522J0166
$$ 117984 91260 51440 96341 163402 183660 189485 178808 190971 159880 120555 94033 104199
17760A04199R551N9517k721n0483j7553N8806K5536k4143q7334J1062j982M247
$$ 104199 113750 173267 170546 120063 102510 161316 186852 162709 75375 86437 84455 88702
17748H8702j4891M9870K5332j8618M2302K8096n2092K9701L9789l4431n571j6310
$$ 88702 73811 123681 149013 130395 172697 200793 148701 178402 218191 183760 178189 161879
17736A61879K653j3730K3738r859n0183m3522l5095K1587J5852L9356j3506m0369
$$ 161879 164532 150802 174540 164681 114498 70976 35881 57468 73320 112676 99170 58801
17724E8801l7617j6832q908j161L9789k857J3716N161l440L080K888O060j5284
$$ 58801 21184 4352 -4556 -5717 34072 31215 44931 50092 46652 49732 52620 58680 43396
17711D3396R824L99L530j4430Q287L1299k433k3715L9691L3813K920n0937j0283
$$ 43396 53220 53619 57149 42719 51006 82305 79872 56157 95848 129661 132581 81644 71361
17698G1361j5407j559K8023M3038J4164m9438n5452P764L5322j9017L2801K6995
$$ 71361 55954 54395 82418 125456 139620 90182 34730 42494 77816 58799 91600 118595
17686A18595M1152M8057m3808n4045l4068m9586L966j72k4127N6630K2598n5345
$$ 118595 159747 207804 163996 109951 75883 26297 30263 30091 5964 62594 85192 29847
17674B9847K1464L1341j4960l3132J7167k1788K299Q541N2268k670o7103n9122
$$ 29847 51311 82652 67692 34560 51727 29939 32238 40779 93047 90377 23274 -35848
17662c5848K0168J14500J4701j2851J951k6192l1116l8612l2926l02L17M3437
$$ -35848 -15680 98820 113521 100670 102621 76429 45313 6701 -26225 -26527 -26210 17227
17650A7227K7864J5865p247m6760p596L5457J3889J0414J2216L0750p19n9140
$$ 17227 45091 60956 53709 6949 -647 34810 48699 59113 71329 102079 101360 42220
17638D2220r7105k4313K4790N2853L0608o5474j3194j2270M0397M6838n4480O410
$$ 42220 -54885 -79198 -54408 -1555 29053 -36421 -49615 -61885 -21488 25350 -29130 -22720
17626b2720k6740r723J878j9346J2053j7085n323K8026J1745L1971N6754j1371
$$ -22720 -49460 -59183 -57305 -76651 -64598 -81683 -87006 -58980 -47235 -15264 41490 30119
17614C0119m7918n0207M263J325K3092J4788K5491L3268K6748j2988k8702o854
$$ 30119 -17799 -68006 -63743 -62418 -39326 -24538 953 34221 60969 47981 19279 12425
17602A2425p191k2391l8748k9855N0594J6373J4085J954P4168J4679J9865j6775
$$ 12425 5234 -17157 -55905 -85760 -35166 -18793 -4708 -2754 71414 86093 105958 89183
17590H9183m897o3881O0376r605o0642N9562L9925J5682n2216M5206j315m5701
$$ 89183 84286 20405 80781 71176 10534 70096 110021 125703 73487 118693 117378 71677
17578G1677P83K0838l8190k9708N177k746O6908j6900l0942l6267n3593k7779
$$ 71677 72460 93298 55108 25400 30577 27831 94739 77839 46897 10630 -42963 -70742
17566g0742P5083P5036k5932j28131K1801J1726J1032k9057k91R7348L7205k1651
$$ -70742 4341 79377 53445 -74686 -52885 -41159 -30127 -59184 -59475 37873 75078 53427
17554E3427k5100k1745O959J1008J01801J3278k1008j8360n5040o4460k2724M459
$$ 53427 28327 6582 13541 24549 126350 139628 118620 100260 45220 -19240 -41964 -37505
17542c7505L4630M4850K4876k5694J473L7672L4903K2342j430L975j9484J3743
$$ -37505 -2875 41975 66851 41157 42630 80302 115205 137547 136117 140092 120608 134351
17530A34351L2841M2846N2030N2008O9498J42509Q6212J03923J22344J02688L7269
$$ 134351 167192 210038 262068 314076 383574 526083 612295 716218 838562 941250 978519
17519I78519m7043j2820l4149k0810p2011p5249p4938j44682q1804j25672j2146
$$ 978519 931476 918656 884507 863697 791686 716437 641499 496817 415013 289341 277195
17508B77195l169l8306l0470k2359n2394l2564K6054J3409j3081j3382l3312r751
$$ 277195 274026 235720 205250 182891 130497 97933 123987 137396 124315 110933 77621 67870
17496F7870M0212l6021j3139N5370M1928j3302k3472k8958n319k5452r836L3575
$$ 67870 108082 72061 58922 114292 156220 142918 119446 90488 85169 59717 49881 83456
17484H3456K8953j3542K5312N153L5797K0932m096L3272J6820N4477K7640O8496
$$ 83456 112409 98867 124179 129332 165129 186061 181965 215237 232057 286534 314174 382670
17472C82670J23668J13908R7557J40417J38481J9256j0768j6172o3926j37170
$$ 382670 506338 620246 717803 858220 996701 1015957 1005189 989017 925091 787921
17462G87921p3606m5410n7429r8267q3774q7768n0503m9934n5612m4245M300L2355
$$ 787921 714315 668905 611476 513209 429435 341667 291164 241230 185618 141373 145673 178028
17450A78028J395k058n6578J3862L6537Q2976Q8452K7333P4031p7211j31701o4466
$$ 178028 179423 177365 120787 134649 171186 254162 342614 369947 443978 366767 235066 170600
17438A70600P348N0724J1513p3994m9198k5235k8092k1510m120L2953J6194n5629
$$ 170600 177948 228672 240185 166191 116993 91758 63666 42156 38036 70989 87183 31554
17426C1554j5224l4990j4435j8179k398j7319J0365K2712J3548J7755K0620K7896
$$ 31554 16330 -18660 -33095 -51274 -53672 -70991 -60626 -37914 -24366 -6611 14009 41905
17414D1905n0052K6845M9413L353l6403k4156j9051K6912o3012o7M4392K1932
$$ 41905 -8147 18698 68111 71464 35061 10905 -8146 18766 -44246 -44313 79 22011
17402B2011Q514J7727n288k3436N488P9770o1109k2801j20R032j4399j2326J1582
$$ 22011 30525 48252 42964 19528 25016 104786 43677 20876 20756 29788 15389 3063 14645
17389A4645L1816k5025l9173L0157n7428q89J1054O2826K319O9800M6525o1517
$$ 14645 46461 21436 -17737 12420 -45008 -45897 -34843 27983 30302 100102 146627 85110
17377H5110r5425O126L8739n2520j3656L9939J0112p1250N0564n288m0281R769
$$ 85110 -10315 -4189 34550 -17970 -31626 8313 18425 -52825 -2261 -7549 -47830 -38061
17365c8061K3457M8980L679k4033L4278N2153l5081O367J1311J1982N433r112
$$ -38061 -14604 34376 38055 14022 48300 100453 65372 71739 83050 95032 100465 91353
17353I1353j6503j7640o2846l8210l0110o3941r822N8250L2884j0538R376O0623
$$ 91353 74850 57210 -5636 -43846 -73956 -137897 -147719 -89469 -56585 -67123 -57747 2876
17341B876k3289m1896k0059O3124O6671L4070j3356o4722k1270N6295K206l7679
$$ 2876 -20413 -62309 -82368 -19244 47427 81497 68141 3419 -17851 38444 40650 2971
17329B971j4282k6906M0056J4926J4817j9698j5388N317k5519J79k3450k1881
$$ 2971 -11311 -38217 1839 16765 31582 11884 -3504 1813 -23706 -23527 -46977 -68858
17317f8858O3517L7902N6769J0814k1150j6805M1692m2506p0906l0852Q375K8007
$$ -68858 -5341 32561 89330 100144 78994 62189 103881 61375 -9531 -40383 -32008 -4001
17305d001J2809K6220j0158l8436J060L6653k333L0750j4409o1894q800K1581
$$ -4001 8808 35028 24870 -13566 -12506 24147 21814 52564 38155 -23739 -32539 -10958
17293a0958k1153m4611K8812L5155m1117q838P848n782k6755O391O1133K2738
$$ -10958 -32111 -76722 -47910 -12755 -53872 -62710 -54862 -60644 -87399 -81008 -19875 2863
17281B863q224j2205j0498j1709n2953n1318r971L4451N2852K0183O6981J5946
$$ 2863 -5361 -17566 -28064 -39773 -92726 -144044 -154015 -119564 -66712 -46529 20452 36398
17269C6398n1417l0926K501L2092k9071m5932L2579J0434M5042n693K5849L8643
$$ 36398 -15019 -45945 -43444 -11352 -40423 -86355 -53776 -43342 1700 -3993 21856 60499
17257F0499k4849o5301N3241L0554K3163n6997l2042l6253p3755Q171N0902Q7458
$$ 60499 35650 -29651 23590 54144 77307 20310 -11732 -47985 -121740 -113569 -62667 24791
17245B4791N8129j8085K363m738k5100r095n0869o096L0323l7798l1735K309j8900
$$ 24791 82920 64835 67198 62460 37360 28265 -22604 -28700 1623 -36175 -67910 -65601 -84501
17232h4501q0484n677J38749N2446m323n4777P04L3275m681q969l535R729m373
$$ -84501 -164985 -170662 -31913 20533 16210 -38567 -37863 -4588 -9269 -18238 -21773 -12044 -16417
17219a6417j3618j5786L3553L2892l1950n1136M0175j3968l4649J2085m519R530
$$ -16417 -30035 -45821 -12268 20624 -11326 -62462 -22287 -36255 -70904 -58819 -63338 -53808
17207e3808q282M3788j0580r575j394p702N9755j3492q7804R913N5023l2804K4494
$$ -53808 -62090 -18302 -28882 -38457 -39851 -47553 12202 -1290 -89094 -79181 -24158 -56962 -32468
17194c2468M8421K0409j0558L641l1404l3336P2046N3208m4144l7513K2902M2579
$$ -32468 15953 36362 25804 29445 -1959 -35295 36751 89959 45815 8302 31204 73783
17182G3783K5490N738P980n5716p3216o6300l4126m389k4677K3885O8885K5382
$$ 73783 99273 105011 112991 57275 -15941 -82241 -116367 -120756 -145433 -121548 -52663 -27281
17170b7281L8222r849j1962j9997M8276l4323L371Q56P258l3485L0990J7872n011
$$ -27281 10941 1092 -10870 -30867 17409 -16914 -13543 -12687 -5429 -38914 -7924 9948 4937
17157D937k0259m0183m387J6512M0597k0508L1135m2846k1565K509N235m4754
$$ 4937 -15322 -55505 -59892 -43380 -2783 -23291 7844 -35002 -56567 -54058 -48823 -93577
17145i3577l6621P5909M8978m2142j8379K4788J9719l325k5995l9558J5787O4514
$$ -93577 -130198 -54289 -5311 -47453 -65832 -41044 -21325 -24650 -50645 -90203 -74416 -9902
17133i902l373p9097k1045p436J268j2282q776K9218j0464M2943J7050n4377l6288
$$ -9902 -13275 -92372 -113417 -120853 -119585 -131867 -140643 -111425 -121889 -78946 -61896 -116273 -152561
17120a52561P757J22379j7663K824R0067n167p3381K8603R678o884n9555p1134
$$ -152561 -144804 -22425 -40088 -37264 52803 47636 -25745 2858 12536 5652 -53903 -125037
17108a25037K5445N5680N5530L6056K4383l8763n4824m8891J3665K727M9292K0480
$$ -125037 -99592 -43912 11618 47674 72057 33294 -21530 -70421 -56756 -54029 -4737 15743
17096A5743J5986K3760m9712J9012L2776l7233l7897o7602j360M7514J5695j194
$$ 15743 31729 55489 5777 24789 57565 20332 -17565 -85167 -86527 -39013 -23318 -24512
17084b4512J7781K6856k3491m1177P994O8273K4247j0939k5384k6953J3293J080
$$ -24512 -6731 20125 -3366 -44543 -36549 31724 55971 45032 19648 -7305 5988 7068
17072G068K2891l918m3255l5190M2711N3081j0613m2377n5176m0766J7968K6074
$$ 7068 29959 26041 -17214 -52404 -9693 43388 32775 -9602 -64778 -105544 -87576 -61502
17060f1502O1239P0123R301K0180o6464l8727k4419n3660j9041K5960k8545m4818
$$ -61502 -263 69860 79161 99341 32877 -5850 -30269 -83929 -102970 -77010 -105555 -150373
17048a50373N920P2189K1408r587M9497O1901J5859k1398J5386l616k4154m0836
$$ -150373 -144453 -72264 -50856 -60443 -10946 50955 66814 45416 60802 57186 33032 -7804
17036g804j3388K9889j7384J714K1214k4394p071M4962M4597P3138m0414k2741
$$ -7804 -21192 8697 -8687 -6973 14241 -10153 -17224 27738 72335 145473 105059 82318
17024H2318l7168P754M4356q032j2479j6221k7379m4305q0315n1963J8532M6680
$$ 82318 45150 52904 97260 89228 76749 60528 33149 -11156 -91471 -143434 -124902 -78222
17012g8222M8680m890K732K9282K080q5930j3581n730k3479K154J16451N5865
$$ -78222 -29542 -34432 -31700 -2418 -338 -86268 -99849 -105579 -129058 -126904 -10453 45412
17000D5412m5582j9529K5193k8813k5001M6179o094K7208O856j03623j2386l2961
$$ 45412 -170 -19699 5494 -23319 -48320 -2141 -8235 18973 25829 -77794 -90180 -123141
16988a23141l6446K3645M5873L7134N0292N8769J3006j9430j5573j3859j9439
$$ -123141 -159587 -135942 -90069 -52935 -2643 56126 69132 49702 34129 20270 831
16977H31l84j2414j6020M9491J735m101k5611l054Q120J5926Q3122k9941k0603
$$ 831 447 -11967 -27987 21504 23239 19138 -6473 -9527 -1407 14519 97641 67700 47097
16964D7097L7964k1481n4281m6926p799L4359q953L0900j4271J5748K2236n5426
$$ 47097 85061 63580 9299 -37627 -45426 -11067 -20020 10880 -3391 12357 34593 -20833
16952b0833m5270J081j8419K5730K1481j1884j7857K6018M5839l484K2424R68
$$ -20833 -66103 -65022 -83441 -57711 -36230 -48114 -65971 -39953 5886 2402 24826 25794
16940B5794p1133j5716L5129K6130k7158l6283j7967L8808L4855N340j9101r714
$$ 25794 -45339 -61055 -25926 204 -26954 -63237 -81204 -42396 -7541 -2201 -21302 -31016
16928c1016Q207L608o195k443m2701j6578n9620p099N1647Q866L9347m125J5050
$$ -31016 -22809 -19201 -25396 -27839 -70540 -87118 -146738 -153837 -102190 -93324 -53977 -58102 -43052
16915d3052N677K4523J4834K3470k2878l2407q883L5784n306n2569k8256q901
$$ -43052 -37375 -12852 1982 25452 2574 -29833 -38716 -2932 -8238 -60807 -89063 -97964
16903i7964l4801K0939k1784J2205O3526k7234P632k0236r359j6962P7650N4806
$$ -97964 -132765 -111826 -133610 -121405 -57879 -85113 -77481 -97717 -107076 -124038 -46388 8418
16891H418J4754p0644J4943q646n7381j7003m515R693N0243R563N9585L7632m1641
$$ 8418 23172 -47472 -32529 -41175 -98556 -115559 -120074 -110381 -60138 -50575 9010 46642 5001
16878E001j3667N0559K5264o4849J7991m7389m0953P6705K6978l5243l8823R318
$$ 5001 -8666 41893 67157 2308 20299 -27090 -68043 8662 35640 397 -38426 -29108
16866b9108K0758o1078j6206k6723L3943R795J1877r775M0271O934L2908m160
$$ -29108 -8350 -69428 -85634 -112357 -78414 -68619 -56742 -66517 -26246 -19312 13596 9436
16854I436p5510M0378L0508j5501O2854k389l2624K0069k8874n7986j100K0523
$$ 9436 -66074 -25696 4812 -10689 52165 49776 17152 37221 8347 -49639 -50739 -30216
16842c0216n4179J0897O2923p777k4012J4744k4099K9482L0425l5005J0504m9866
$$ -30216 -84395 -73498 -10575 -18352 -42364 -27620 -51719 -22237 8188 -26817 -16313 -66179
16830f6179L392O384k9229L848J1778Q3008L3104m9935j9250J6139j0904l8093
$$ -66179 -62787 -56403 -85632 -81784 -70006 13002 46106 -3829 -23079 -6940 -17844 -55937
16818e5937k977j2518k9531p874P433N3414L5243j4128j5842P935M8702l2069
$$ -55937 -58914 -71432 -100963 -108837 -101404 -47990 -12747 -26875 -42717 -34782 13920 -18149
16806a8149o0929m3363j4205j3676K7917O3300M116J5116q348n591K8362R151
$$ -18149 -79078 -122441 -136646 -150322 -122405 -59105 -54989 -39873 -48221 -53812 -25450 -16299
16794a6299l4714n2464l2343P2013Q9266K4613k9342j2966k0208l7802J1037N1173
$$ -16299 -51013 -103477 -135820 -63807 25459 50072 20730 7764 -12444 -50246 -39209 11964
16782A1964R408p1195L4224K1390K7860J4483p0102Q999N2460L2036j5603K7577
$$ 11964 21372 -49823 -15599 5791 33651 48134 -21968 -12969 39491 71527 55924 83501
16770H3501q246l4575n7910n4430o698L4918O11k3580P7342L4617M4021K3556
$$ 83501 75255 40680 -17230 -71660 -78358 -43440 -42829 -66409 10933 45550 89571 113127
16758A13127j9539j9037j2695l4358p3213j897K4867M6237p77m1672J995K8518
$$ 113127 93588 74551 61856 27498 -45715 -47612 -22745 23492 22715 -18957 -16962 11556
16746A1556n0448j7196n718j3016K6259J2779L2882J2546k7209o2014J2225N6220
$$ 11556 -38892 -56088 -61806 -74822 -48563 -35784 -2902 9644 -17565 -79579 -67354 -11134
16734a1134L4562N2884l3179m0824j4184K9156j6085o5718k8693Q127P2159P5201
$$ -11134 23428 76312 43133 2309 -11875 17281 1196 -64522 -93215 -85088 -12929 62272
16722F2272N7145K1006K0995l8469n6453j07640j3374L8623n5251l2208Q358K7927
$$ 62272 119417 140423 161418 122949 66496 -41144 -54518 -15895 -71146 -103354 -94996 -67069
16710f7069M0096J3695j5047J1205k4787n547J0300L8235M4833O2426j8287q1014
$$ -67069 -26973 -13278 -28325 -17120 -41907 -47454 -37154 1081 45914 108340 90053 9039
16698I039J5000J3489n5083K6514k0587m6994J3231j6332l1655k1741l2396O9614
$$ 9039 24039 37528 -17555 8959 -11628 -58622 -45391 -61723 -93378 -115119 -147515 -77901
16686g7901M8019l2814l4904J75J1070O0583K3912j2993J7016L8824o914l5933
$$ -77901 -29882 -62696 -97600 -97425 -86355 -25772 -1860 -14853 2163 40987 34073 -1860
16674a860K7881L8459k7163n4147J3835m0087j9782j1859L1031j7828L0161J4092
$$ -1860 26021 64480 37317 -16830 -2995 -43082 -62864 -74723 -43692 -61520 -31359 -17267
16662a7267L403j9506k0785M2002M4991m161K0652J991k8527o0120j5489J9420
$$ -17267 -13864 -33370 -54155 -12153 32838 28677 49329 51320 22793 -37327 -52816 -33396
16650c3396J7112M8333K2580r49n5938l1486J658R222j5227o1163l8046n194N8266
$$ -33396 -16284 32049 54629 53680 -2258 -33744 -32086 -22864 -38091 -99254 -137300 -142494 -84228
16637h4228N1130J3787K6960l9875J7338O0224N890K6475k3117j0104j7829k61
$$ -84228 -33098 -19311 7649 -32226 -14888 45336 51226 77701 54584 44480 26651 26390
16625B6390k316L36m56j3433R679j6493M951J5852o685o118K5894l7263K4426
$$ 26390 24074 24410 23954 10521 20200 3707 8658 24510 17825 11707 37601 338 24764
16612B4764n1830K856l922L7549L2925M183l9552m1804N5088N7955K6322j1468
$$ 24764 -27066 -24210 -28132 9417 42342 46525 6973 -34831 20257 78212 104534 93066
16600I3066o5579m8414J9015K0669p766j6335o5225n0536p245N4905M7114M907
$$ 93066 27487 -20927 -1912 18757 10991 -5344 -70569 -121105 -128350 -73445 -26331 -21424
16588b1424l6087J875O3220K8941q3929J6490N5272N692n976o2778K2985o0129
$$ -21424 -57511 -55636 7584 36525 -47404 -30914 24358 30050 24074 -38704 -15719 -75848
16576g5848j9851k1795N3526L1946N7957n6772n4855l714K3983J3790J3613M8827
$$ -75848 -95699 -117494 -63968 -32022 25935 -30837 -85692 -89406 -65423 -51633 -38020 10807
16564A0807j0987j9174K9161K8210J9874m2585k3835K896J7389M2484m5034K2868
$$ 10807 -180 -19354 9807 38017 57891 15306 -8529 -5633 11756 54240 9206 32074
16552C2074N0207j0944j06222p1746l2781J0917K2578K1715q943L2320L6021M3486
$$ 32074 82281 71337 -34885 -106631 -139412 -128495 -105917 -84202 -93145 -60825 -24804 18682
16540A8682k1971K1198L0202K8574n96p6837l8140n319K1831L4658l9932R398
$$ 18682 -3289 17909 48111 76685 76089 -748 -38888 -44207 -22376 12282 -27650 -18252
16528a8252J3003k8253K1136J6625Q034N689L1992J1631L0278o9047K930L8714
$$ -18252 -5249 -33502 -12366 4259 12293 17982 49974 61605 91883 22836 25766 64480
16516F4480m2951n9018p1639L0072Q6021L0808j0670K1938M2320j3040p6905o3623
$$ 64480 21529 -37489 -109128 -79056 6965 37773 27103 49041 91361 78321 1416 -62207
16504f2207l9548q866P2041J0231l1696J1868M4298L6229K8465L8035q82k7357
$$ -62207 -101755 -110621 -38580 -28349 -60045 -48177 -3879 32350 60815 98850 97968 70611
16492G0611r5400p8645O203L5501j3461M1408m1370K3735M1504k398m746j090
$$ 70611 -24789 -103434 -97231 -61730 -75191 -33783 -75153 -51418 -9914 -12312 -17058 -18148
16480a8148o0452j6846R250L089k2930R097J7224m59M3616N9498l37j10381p3284
$$ -18148 -78600 -95446 -86196 -83107 -106037 -96940 -79716 -80175 -36559 22939 22602 -87779 -161063
16467a61063L1403N8651K5968k7611m9533P426K4885L1331Q558r366J9423J1773
$$ -161063 -129660 -71009 -45041 -72652 -122185 -114759 -89874 -58543 -49985 -59351 -39928 -28155
16455b8155J8946O670n6707L933P581K9993M751N5953k6112J2442K8015p122p779
$$ -28155 -9209 -2539 -59246 -55313 -47732 -17739 -12988 42965 16853 29295 57310 50188 42409
16442D2409k6749J0953K7795l2125r915J5687K4078j7317k9196Q359K5990k8435
$$ 42409 15660 26613 54408 22283 12368 28055 52133 34816 5620 13979 39969 11534
16430A1534m9946N862L7915m4174j9676n0119j6798L5071M0019k6744O3045N6501
$$ 11534 -38412 -32550 5365 -38809 -58485 -108604 -125402 -90331 -50312 -77056 -14011 42490
16418D2490j4688m9523N0583N5892j3115q3757k3848M201p114K8713K3115m5227
$$ 42490 27802 -21721 28862 84754 71639 -12118 -35966 -31765 -38879 -10166 12949 -32278
16406c2278l350k7812l3744k1430q753k321M285J6213R6199P5848j3019p9096
$$ -32278 -35628 -63440 -97184 -118614 -127367 -129688 -125403 -109190 -12991 62857 49838 -29258
16394b9258P779J3914k7726j7161J0553m6580l8966L6934L1487k2625K4702J6867
$$ -29258 -21479 -7565 -35291 -52452 -41899 -88479 -127445 -90511 -59024 -81649 -56947 -40080
16382d0080K1064N3798l1848m2868K1936O3504j5384k3243k6187j8998k0098m2296
$$ -40080 -19016 34782 2934 -39934 -17998 45506 30122 6879 -19308 -38306 -58404 -100700
16370a00700r319K3274O8809J3776m8105N7196L9033m0463q851j7280k9573P964
$$ -100700 -110019 -86745 -17936 -4160 -52265 4931 43964 3501 -5350 -22630 -52203 -44239
16358d4239M0423p6071j5390r154N867L9861L8434K0781m6106k3433K1941K9164
$$ -44239 -3816 -79887 -95277 -104431 -98564 -58703 -20269 512 -45594 -69027 -47086 -17922
16346a7922l6791l3553K3828n914k2338r362m0777J092N6325M1752K9445O2359
$$ -17922 -54713 -88266 -64438 -70352 -92690 -102052 -142829 -141737 -85412 -43660 -14215 48144
16334D8144J5078o722j4336n081q4362m776P8248K1191j2424k5476j8136j6621
$$ 48144 63222 56500 42164 37083 -47279 -52055 26193 47384 34960 9484 -8652 -25273
16322b5273M4254K6080o752k6221J5252K8835l2943j6609j2348j2107r661j2711
$$ -25273 18981 45061 38309 12088 27340 56175 23232 6623 -5725 -17832 -27493 -40204
16310d0204j4756k4724P373N8625K0309k8975m6339k8430l038L435m017q0210
$$ -40204 -54960 -79684 -72311 -13686 6623 -22352 -68691 -97121 -100159 -96724 -100741 -180951
16298a80951K122P8070N3162K1169O388L3284N4443r827n2189K5774l7099m7313
$$ -180951 -178829 -100759 -47597 -26428 -20040 13244 67687 57860 5671 31445 -5654 -52967
16286e2967m647L0252N988O1441N7848o03k2424m8078j9024k6962K4477J2074
$$ -52967 -57614 -27362 -21374 40067 97915 97312 74888 26810 7786 -19176 5301 17375
16274A7375Q693L2880l7728J93J001J6349O400l1216k045j7541K370L1220J898
$$ 17375 26068 58948 21220 21413 22414 38763 45163 13947 11902 -5639 -3269 27951 29849
16261B9849P965l7344l1659L0370M6461q6999p576J4244l8265M9753K0957J9475
$$ 29849 37814 470 -31189 -819 45642 -41357 -48933 -34689 -72954 -23201 -2244 17231
16249A7231r382l5034K376l7806k4996J0018K2406L5430K641o080q293n100J5734
$$ 17231 7849 -27185 -24809 -62615 -87611 -77593 -55187 -19757 -17116 -23196 -31489 -36589 -20855
16236b0855j2972R0137K6058k8961n1105k7577N3733J8029l9019k0793L3808n6550
$$ -20855 -33827 56310 82368 53407 2302 -25275 28458 46487 7468 -13325 20483 -36067
16224c6067j5413O1013L821k7302q246j418j6537j8790J0343k0252j8772q418
$$ -36067 -51480 9533 13354 -13948 -22194 -23612 -40149 -58939 -48596 -68848 -87620 -96038
16212i6038k0838L9461O014k7395l7119kN9634N6124J5184K0929J131l8796p080
$$ -96038 -116876 -77415 -71401 -98796 -135915 -135917 -76283 -20159 -4975 15954 17085 -21711 -28791
16199b8791K6432M4549l4255K8137k2131n9777n5650M7039L0234p0241o4530N7076
$$ -28791 -2359 42190 7935 36072 13941 -45836 -101486 -54447 -24213 -94454 -158984 -101908
16187a01908N5764K0363M275l1025o2227o245r587m140P057L9306M4808k9660
$$ -101908 -46144 -25781 -21506 -52531 -114758 -121003 -130590 -134730 -127673 -88367 -43559 -73219
16175g3219N655o106k1m9892l489N6314R7041n4921q0642n2572l7412P7379J17959
$$ -73219 -67564 -73670 -73691 -123583 -127072 -70758 26283 -28638 -109280 -161852 -199264 -121885 -3926
16162c926j053n9425j140L7685j4752k7500k7430m2897K2419P4076J9115J8486
$$ -3926 -4979 -64404 -65544 -27859 -42611 -70111 -97541 -140438 -118019 -43943 -24828 -6342
16150f342J9301j3656l2560L1096n2716Q122K2698j2871n475M743j5221k3697
$$ -6342 12959 -697 -33257 -2161 -54877 -46755 -24057 -36928 -42403 -37660 -52881 -76578
16138g6578K0049J1621M5448K6813k5565o463O0836J898m8200l1836k7255l2803
$$ -76578 -56529 -44908 540 27353 1788 -4675 56161 58059 9859 -21977 -49232 -82035
16126h2035k4226N9201N8709N2152J4444l5007k7458l5427l7685J4005K5881m046
$$ -82035 -106261 -47060 11649 63801 78245 43238 15780 -19647 -57332 -43327 -17446 -21492
16114b1492n1208k5774L4570J0801L846m8551l431L3751K8520k8871L2716K7120
$$ -21492 -72700 -98474 -63904 -53103 -49257 -97808 -101239 -67488 -38968 -67839 -35123 -8003
16102h003k1935j6554l2862n4023P65O2608M7311N167m1356r712K1490J8866K5429
$$ -8003 -29938 -46492 -79354 -133377 -132612 -70004 -22693 -17526 -58882 -68594 -47104 -28238 -2809
16089b809n8185m2339k041j7694N0963J6400K3209n5740k3648L3142M1975M935
$$ -2809 -60994 -103333 -105374 -123068 -72105 -55705 -32496 -88236 -111884 -78742 -36767 -31832
16077c1832j8462m4968p0327L2168O8608j8617l0612O2320l9766j08513M3040
$$ -31832 -50294 -95262 -165589 -133421 -64813 -83430 -114042 -51722 -91488 -200001 -156961
16066a56961j1415J8550O4135M9068j5661J9218m2866p5277J2265O0661L8918
$$ -156961 -168376 -149826 -85691 -36623 -52284 -33066 -75932 -151209 -138944 -78283 -39365
16055c9365M3562K0003m6467l0229M865M2398J9536J7982L670j3494j2901k6826
$$ -39365 4197 24200 -22267 -52496 -47631 -5233 14303 32285 35955 22461 9560 -17266
16043a7266J2101l7772L155J080o110k0709K8997L8982J020K049l8560J9701j8064
$$ -17266 -5165 -42937 -39782 -38702 -44812 -65521 -36524 2458 3478 5527 -33033 -13332 -31396
16030c1396K6389L3623M1487M411n5747K2743L1595j9800j8668j8518K0855K683
$$ -31396 -5007 28616 70103 74514 18767 41510 73105 53305 34637 16119 36974 39657
16018C9657m2865n1698m1424j6092j996j2386n756L0947M480K0027L6152J0654
$$ 39657 -3208 -54906 -96330 -112422 -114418 -126804 -132560 -101613 -97133 -77106 -40954 -30300
16006c0300p5353r5290O976M6986L4501O9028j8220n2030M5159O3115L5891K1352
$$ -30300 -105653 -200943 -193967 -146981 -112480 -43452 -61672 -113702 -68543 -5428 30463 51815
15994E1815m6632p3192m58j4897p70R0389L3662p1906n9797j0894J1196J2185
$$ 51815 5183 -68009 -68467 -83364 -84134 6255 39917 -31989 -91786 -102680 -91484 -79299
15982g9299j1372k2278J7463j9418J7270P620o702O175l901N0467M1707p479P754
$$ -79299 -90671 -112949 -95486 -114904 -97634 -90014 -96716 -90541 -94442 -43975 -2268 -9747 -1993
15969a993K4746l7537j1545L541o2975l2915O8220O468j2277J942K275J899J328
$$ -1993 22753 -14784 -26329 -22788 -85763 -118678 -50458 -43990 -56267 -54325 -52050 -50151 -48823
15956d8823l002L7290J238n2689l6814K6073j1031n7911J8457M2415l163J6286
$$ -48823 -51825 -14535 -13297 -65986 -102800 -76727 -87758 -145669 -127212 -84797 -87960 -71674
15944g1674N7072L9129M962J6722q806O233L233m790n693j7769k9981l7969J0835
$$ -71674 -14602 24527 29489 46211 37405 43638 46871 42081 36388 18619 -11362 -49331 -38496
15931c8496L550k3362n6609N1077O1762K9809K0141p1570n2492K6536L7203m3526
$$ -38496 -34946 -58308 -114917 -63840 -2078 27731 47872 -23698 -76190 -49654 -12451 -55977
15919e5977n133m444j2510J2799J5766r150J3441O2729p056N7745j6813o6316
$$ -55977 -61110 -65554 -78064 -65265 -49499 -58649 -45208 17521 10465 68210 51397 -14919
15907a4919l4291K4620k2578J1406q298J6682K1493P528k0180L4195j9014n4095
$$ -14919 -49210 -24590 -47168 -35762 -44060 -27378 -5885 1643 -18537 15658 -3356 -57451
15895e7451l0790L0146j424o7037n100L8909J1633M826l2004m0958M366L3251
$$ -57451 -88241 -58095 -59519 -126556 -131656 -92747 -81114 -76288 -108292 -149250 -144884 -111633
15883a11633k3475O017N8108L8966J6541p6450k8672K9546k7037j5512N4704m394
$$ -111633 -135108 -129091 -70983 -32017 -15476 -91926 -120598 -91052 -118089 -133601 -78897 -83291
15871h3291j0661K4691m5210r393R6676O413l9687L0123M4630L9313J7006j9450
$$ -83291 -93952 -69261 -114471 -123864 -27188 -20775 -60462 -30339 14291 53604 70610 51160
15859E1160J6750n2255q0996M1658P5324l5210n7136o4301k1810M7275M166K5270
$$ 51160 67910 15655 -65341 -23683 51641 16431 -40705 -105006 -126816 -79541 -75375 -50105
15847e0105J3994J8546K936R142J2036J4425J2895k2562l3701k2810O9247L7966
$$ -50105 -36111 -17565 -14629 -5487 6549 20974 33869 11307 -22394 -45204 24043 62009
15835F2009p9421p1124p462K6376P9130K0692p7963m111J6039n3025J5954r880
$$ 62009 -17412 -88536 -95998 -69622 9508 30200 -47763 -51874 -35835 -88860 -72906 -82786
15823h2786j2007K83L1247K5973r476k4976p7271K5990O2435J3262K4196N4891
$$ -82786 -94793 -94510 -63263 -37290 -46766 -71742 -149013 -123023 -60588 -47326 -23130 31761
15811C1761J6351k2261m0110n7944M941O2891K402j5714l1050p417K8236L1823
$$ 31761 48112 25851 -14259 -72203 -67262 -4371 -1969 -17683 -48733 -56150 -27914 3909
15799C909m2470m3288L0921K7761M0883j6794o457j6177N9558n081m2430k810
$$ 3909 -38561 -81849 -50928 -23167 17716 922 -5535 -21712 37846 32765 -9665 -12475
15787a2475Q928m5986k4702l4091j2117N0010L5458K5220L7621M0838n3404p0706
$$ -12475 -3547 -49533 -74235 -108326 -120443 -70433 -34975 -9755 27866 68704 15300 -55406
15775e5406k2091M967P805m1696L2252M4281J0622l1511K3272j7402O639j0997
$$ -55406 -77497 -72530 -64725 -106421 -74169 -29888 -19266 -50777 -27505 -44907 -38268 -49265
15763d9265J0625L5622J6578O2107k3284j3099j0489l737n3151j1434l2983l293
$$ -49265 -38640 -3018 13560 75667 52383 39284 28795 25058 -28093 -39527 -72510 -75803
15751g5803N784o065M4896M5824J6920n053j4273m5168l0438J0554O7434K3092
$$ -75803 -70019 -76084 -31188 14636 31556 26503 12230 -32938 -63376 -52822 14612 37704
15739C7704k0564l6433Q401K4178L6030k939r1163m9339L1708j3402j4204N5964
$$ 37704 17140 -19293 -10892 13286 49316 46377 -44786 -94125 -62417 -75819 -90023 -34059
15727c4059P317j3829L9692J6382o5570Q431k5171m4433L5149K3372J1750J7907
$$ -34059 -26742 -40571 -879 15503 -50067 -41636 -66807 -111240 -76091 -52719 -40969 -23062
15715b3062L781P590k5890l0399j7033L654L2799N4748l0949k6329K1052Q5432
$$ -23062 -19281 -11691 -37581 -67980 -85013 -81359 -48560 6188 -24761 -51090 -30038 55394
15703E5394P699m7891m4552R5k195k0854K629m4930j1130K7093K9901m1095k0736
$$ 55394 63093 15202 -29350 -29255 -31450 -52304 -49675 -94605 -105735 -78642 -48741 -89836 -110572
15690a10572k8764R689k0559R800M8247o109L8959r047o0441m3304L2169K4538
$$ -110572 -139336 -129647 -150206 -140406 -92159 -98268 -59309 -68356 -128797 -172101 -139932 -115394
15678a15394j1741q793P852M0363r916L1358L7688R619k9312m0697o166j9095
$$ -115394 -127135 -135928 -128076 -87713 -97629 -66271 -28583 -18964 -48276 -88973 -95139 -114234
15666a14234L9760M3586k8464k1982j2759L2174L1225j097K681k9828L4926l7538
$$ -114234 -74474 -30888 -59352 -81334 -94093 -61919 -30694 -31791 -29110 -58938 -24012 -61550
15654f1550k5962K0817P2826L961k4776j8193M3412J341m5528k8060J2191k5106
$$ -61550 -87512 -66695 6131 10092 -14684 -32877 10535 11876 -33652 -61712 -49521 -74627
15642g4627N8294M1393Q684p514K3819L4739o9086n283P679n3180k1413J8735
$$ -74627 -16333 25060 33744 26230 50049 84788 15702 10419 18098 -35082 -56495 -37760
15630c7760m0700k5852P0498N4163l9057j4422j6386m038J533J5611J7010l1420
$$ -37760 -78460 -104312 -33814 20349 -18708 -33130 -49516 -53554 -52021 -36410 -19400 -50820
15618e0820J1750J2818r814l1583L428P590M9224j6776m1604l4126Q6475N5388
$$ -50820 -39070 -26252 -36066 -67649 -64221 -56631 -7407 -24183 -65787 -99913 -13438 41950
15606D1950l0181J9901J825j6394n1346n0677j539k1029K558L4523r487k1597
$$ 41950 11769 31670 33495 17101 -34245 -84922 -86461 -107490 -104932 -70409 -79896 -101493
15594a01493L1472K1108k9509K870j947l0924q377Q798k6231N7690L6329P237
$$ -101493 -70021 -48913 -78422 -75552 -77499 -108423 -116800 -108002 -134233 -76543 -40214 -32977
15582c2977J9812J3224r866J641K0439k8640m6347k4077j9462J6206M4979L0187
$$ -32977 -13165 59 -9807 -8166 12273 -16367 -62714 -86791 -106253 -90047 -45068 -14881
15570a4881l6549l5305j3184J5984j0028m5534J7595N6470j0609l1986j8120L491
$$ -14881 -51430 -86735 -99919 -83935 -93963 -139497 -121902 -65432 -76041 -108027 -126147 -122656
15558a22656L0591J5989N282K0116K2463L0196p804l1361N6848n1104l0620m1531
$$ -122656 -92065 -76076 -70794 -50678 -28215 1981 -5823 -37184 19664 -31440 -62060 -103591
15546a03591K047k6552o1341J3848K0107L8134K6037P5180l1388p5313M1543N7878
$$ -103591 -101544 -128096 -189437 -175589 -155482 -117348 -91311 -16131 -47519 -122832 -81289 -23411
15534b3411o051q4312n0826P6952O7651L3072K2441j239k6051l3827k9220N350
$$ -23411 -29462 -113774 -164600 -87648 -19997 13075 35516 34277 8226 -25601 -54821 -49471
15522d9471K7507K4863M9979p6299r8387l027P2896R3529N0891o423m8082O205
$$ -49471 -21964 2899 52878 -23421 -121808 -124835 -51939 41590 92481 86058 37976 44181
15510D4181k0059k2418k8684R731k4135J4017L1044J6004k8024k2271J4588j564
$$ 44181 24122 1704 -26980 -17249 -41384 -27367 3677 19681 -8343 -30614 -16026 -17590
15498a7590m3565K4867M8377k0820K9112R509m9643m8098m264M4129l2620m7126
$$ -17590 -61155 -36288 12089 -8731 20381 29890 -19753 -67851 -72115 -27986 -60606 -107732
15486a07732j166k7873L8513n845K2704l4765K9613O6513p436j9061J9373L6136
$$ -107732 -108898 -136771 -98258 -104103 -81399 -116164 -86551 -20038 -27474 -46535 -27162 8974
15474H974k8606l6510m9881J2341L4282M2872R942m2241J5752k5670k6796M6771
$$ 8974 -19632 -56142 -106023 -93682 -59400 -16528 -6586 -48827 -33075 -58745 -85541 -38770
15462c8770M7272p200j6722L4424j3538k6569m6617l0564n1385n262N7095j7059
$$ -38770 8502 1302 -15420 19004 5466 -21103 -67720 -98284 -149669 -154931 -97836 -114895
15450a14895l2838N2407N6203l7671l3154q453Q5706m2871k303L5651n1912P699
$$ -114895 -147733 -95326 -39123 -76794 -109948 -118401 -32695 -75566 -77869 -42218 -94130 -86431
15438h6431L631P88l6864q842L9493M1305r785q084M3529J9800l7257l6709J9986
$$ -86431 -82800 -82012 -118876 -127718 -88225 -46920 -56705 -64789 -21260 -1460 -38717 -75426 -55440
15425e5440L0869K0005n99m8147J813M6651K2831J3582K5016L0147m0020l8008
$$ -55440 -24571 -4566 -5165 -53312 -51499 -4848 17983 31565 56581 86728 46708 8700
15413H700j9554K283M701J9387j5978k5130o931M128k6910M0837K6664l3800K0934
$$ 8700 -10854 -8571 -3870 15517 -461 -25591 -32522 -28394 -55304 -14467 12197 -21603 -669
15400f69J1888p556l2861K901L0085L758k7083j7768K348M0514m3329n0339j7346
$$ -669 11219 3663 -29198 -26297 3788 7546 -19537 -37305 -34957 5557 -37772 -88111 -105457
15387a05457J1977N7295J4567o5537l3272K1458P876R104j443j2926k2010J4257
$$ -105457 -93480 -36185 -21618 -87155 -120427 -98969 -91093 -81989 -83432 -96358 -118368 -104111
15375a04111L7915N92j9499P4336J6045l2096P895l6884p4320k3174N413Q316
$$ -104111 -66196 -65604 -85103 -10767 5278 -26818 -18923 -55807 -130127 -153301 -147888 -139572
15363a39572P4077M0672K9862J306J9693k1951P756N425l5966J3901R514n093
$$ -139572 -65495 -24823 5039 6345 26038 4087 11843 17268 -18698 -4797 4717 -376
15351c76l2684k1776K1462j627j8251R2471O3919l0915o2549l5534n0184q81l6193
$$ -376 -33060 -54836 -33374 -35001 -53252 39219 103138 72223 9674 -25860 -76044 -76925 -113118
15338a13118k1576O0560Q997M6056j7837j07810K2194O0355N7693l4307j66O355
$$ -113118 -134694 -74134 -65137 -19081 -36918 -144728 -122534 -62179 -4486 -38793 -38959 -32604
15326c2604j5723k1096k6376J8206K1655J3249P229L3104j9746o7109k2149P566
$$ -32604 -48327 -69423 -95799 -77593 -55938 -42689 -35460 -2356 -22102 -89211 -111360 -103794
15314a03794K6204K7079j9317k8383J2571M4819K2312m7712p311m203j8640n5163
$$ -103794 -77590 -50511 -69828 -98211 -85640 -40821 -18509 -66221 -73532 -77735 -96375 -151538
15302a51538m3128r655M0559P8910K5294j3319k2300J8537M2389M1651O9291l7468
$$ -151538 -194666 -204321 -163762 -84852 -59558 -72877 -95177 -76640 -34251 7400 76691 39223
15290C9223m9658M1333K3846j2221k8511l1177o081p285l6299l6247o3084l4481
$$ 39223 -10435 30898 54744 42523 14012 -17165 -23246 -30531 -66830 -103077 -166161 -200642
15278b00642L0468R1047M1127J2478m6553l3212J8925P6545N3125p084l8065J3283
$$ -200642 -170174 -79127 -38000 -25522 -72075 -105287 -86362 -9817 43308 36224 -1841 11442
15266A1442M3655k7017q6967J9797L4748P531O7106J3473m5634L7440K4940m1237
$$ 11442 55097 28080 -58887 -39090 -4342 3189 70295 83768 38134 75574 100514 59277
15254E9277l2349m203n8131n7675r98J293K0921L7279j3111Q43K1503j6632L6801
$$ 59277 26928 22725 -35406 -93081 -94079 -92786 -71865 -34586 -47697 -46854 -25351 -41983 -5182
15241e182K506m4626n0199J5537K9162j0167m0493m0069O4525O6469o3220l0450
$$ -5182 -2676 -47302 -97501 -81964 -52802 -62969 -103462 -143531 -79006 -12537 -75757 -106207
15229a06207K8849J5513o639N7173K1174q07o2599m9180J1526j2663J3451P7067
$$ -106207 -77358 -61845 -68484 -11311 9863 9056 -53543 -102723 -91197 -103860 -90409 -13342
15217a3342J0284L1845k6155k9583k1751m109N1003j2738p6729L4M0704j992P659
$$ -13342 -3058 28787 2632 -26951 -48702 -52811 -1808 -14546 -91275 -91241 -50537 -52529 -44870
15204d4870P028K5317K4599l5324j6447n062M671K6508J7623J680J2125O880n4279
$$ -44870 -37842 -12525 12074 -23250 -39697 -44759 -40088 -13580 4043 5723 17848 24728 -29551
15191b9551l6953o1589r984O1069K6687j73J401m743j8214J082P94K2979K8474
$$ -29551 -66504 -128093 -138077 -77008 -50321 -50494 -49093 -53836 -72050 -70968 -70174 -47195 -18721
15178a8721J0660L488n7185K1983P6370M3693j5830m3359j0539j3588j894L23
$$ -18721 -8061 -4573 -61758 -39775 36595 80288 64458 21099 10560 -3028 -4922 -4599
15166d599m8798n4691k1820M593L6949L9740N4170m7593j0069K9386q846l6736
$$ -4599 -53397 -108088 -129908 -125315 -88366 -48626 5544 -42049 -52118 -22732 -31578 -68314
15154f8314N6735J2576M902n9799P261M6306m3166K5253J4088j2316k554J5562
$$ -68314 -11579 997 5899 -53900 -46639 -333 -43499 -18246 -4158 -16474 -19028 -3466
15142c466n2337l3044Q3437K3055l5175J2544M21L7771p296m7794J3184l1075
$$ -3466 -55803 -88847 -5410 17645 -17530 -4986 -4565 33206 25910 -21884 -8700 -39775
15130c9775K3119K1397j6603n1328q6965L5757K2747M190r036L1760l4807J598
$$ -39775 -16656 4741 -11862 -63190 -150155 -114398 -91651 -87461 -96497 -64737 -99544 -97946
15118i7946O2193K1633l3659m6569K2403K803O160M3569J442l782o6583m5584
$$ -97946 -35753 -14120 -47779 -94348 -71945 -69142 -62982 -19413 -17971 -21753 -88336 -133920
15106a33920j8851K6707M1414j9475R8378N7647m0192k9509J2834p1439j3131
$$ -133920 -152771 -126064 -84650 -104125 -5747 51900 11708 -17801 -4967 -76406 -89537
15095h9537K8643L665J2484l860L0738L4076q256n8421m0656K2673j1681K9553
$$ -89537 -60894 -57229 -44745 -48605 -17867 16209 7953 -50468 -91124 -68451 -80132 -50579
15083e0579N3528q4187O690N153j0094M0878O1245m1988l7985k9209j8529l700
$$ -50579 2949 -81238 -74548 -69395 -79489 -38611 22634 -19354 -57339 -86548 -105077 -108777
15071a08777j4986O3734K1071p302N049j0450O7094J1194l8127n6344P3058Q5392
$$ -108777 -123763 -60029 -38958 -46260 -41211 -51661 15433 26627 -11500 -67844 5214 90606
15059I0606j3156k1237l5710J3916j2906K2856o0466m4979j3166K2292J6242K0665
$$ 90606 77450 56213 20503 34419 21513 44369 -16097 -61076 -74242 -51950 -35708 -15043
15047a5043n1154m0594J5319O4404J5392n480M267j484p266J9368J4902N5054
$$ -15043 -66197 -106791 -91472 -27068 -11676 -17156 -12889 -14373 -21639 -2271 12631 67685
15035F7685J4798q9785m4627M3442M8146P910L2838M4369p5431m3711j9097L0171
$$ 67685 82483 -7302 -51929 -8487 39659 47569 80407 124776 49345 5634 -13463 16708
15023A6708j8956M882K3922P4956M8346r317q4823l9705k1371n1796o1434k6106
$$ 16708 -2248 2634 26556 101512 149858 140541 55718 16013 -5358 -57154 -118588 -144694
15011a44694Q7737Q9803J5740k0505K1294L748m1887m0445r63M894J3204L2112
$$ -144694 -56957 32846 48586 28081 49375 53123 11236 -29209 -30172 -25278 -12074 20038
14999B0038N6932N6699J7934p2157l6568M7790k7959L8808L9450r0426j12573
$$ 20038 76970 133669 151603 79446 42878 90668 62709 101517 140967 50541 -62032
14988f2032n2108L1224L7442O6904M7204L117L4241o1541l5464J3491p6953j644
$$ -62032 -114140 -82916 -45474 21430 68634 71751 105992 44451 8987 22478 -54475 -56119
14976e6119N6867J9397K6854J8582k5251r59J7351j0505l7492p248p864K2018
$$ -56119 748 20145 46999 65581 40330 39371 56722 46217 8725 1477 -6387 15631
14964A5631L6912K7215K2573m4720N34m754q141K0654O9759l0221k7578j3006
$$ 15631 52543 79758 102331 57611 58145 53391 45250 65904 135663 105442 77864 64858
14952F4858n8342l8809l745r972n113J3008L2302k8188j4952O9833J8241k6034
$$ 64858 6516 -32293 -36038 -46010 -51123 -38115 -5813 -34001 -48953 20880 39121 13087
14940A3087m8759l6149R726L4476q690l31J4346K8938n0687L3241O4668m4744
$$ 13087 -35672 -71821 -62095 -27619 -36309 -36640 -22294 6644 -44043 -10802 53866 9122
14928I122p5851j1544L5465J3906l0699j5745q971K9285N392K8222J3608m054
$$ 9122 -66729 -78273 -42808 -28902 -59601 -75346 -84317 -55032 -49640 -21418 -7810 -11864
14916a1864L4350K6458n5765K5328J3692j9882j1351J9219m1297k9881j9674L1811
$$ -11864 22486 48944 -6821 18507 32199 12317 966 20185 -21112 -50993 -70667 -38856
14904c8856M8237l4320M2775j4707j8851n3644N230K1304J027M5273j5020j9185
$$ -38856 9381 -24939 17836 3129 -15722 -69366 -64136 -42832 -41805 3468 -11552 -30737
14892c0737N4625J7933K7055l2738p2974N3597M550j7524o4859L3006J6654l2592
$$ -30737 23888 41821 68876 36138 -36836 16761 21311 3787 -61072 -28066 -11412 -44004
14880d4004J6614j2565M8019J422K3732K3583L0228L678p2477l9739l7335K4300
$$ -44004 -27390 -39955 8064 9486 33218 56801 87029 90707 18230 -21509 -58844 -34544
14868c4544k7764L9019M9121L5398J2726k3747q0160j0134L7722m1049q2944L314
$$ -34544 -62308 -23289 25832 61230 73956 50209 -29951 -40085 -2363 -43412 -126356 -123042
14856a23042O9186K2867m4976L1229N1994m566l7345j3187j7558K7812L1605k9692
$$ -123042 -53856 -30989 -75965 -44736 7258 2692 -34653 -47840 -65398 -37586 -5981 -35673
14844c5673k2294O026O703j328j2353K6289M3939J8949k5779p6290l0411N7796
$$ -35673 -57967 -51941 -45238 -46566 -58919 -32630 11309 30258 4479 -71811 -102222 -44426
14832d4426M622k7552k0837N8893M5232M2889K4998n9862l6632J520N7282O7143
$$ -44426 -39804 -67356 -88193 -29300 15932 58821 83819 23957 -12675 -11155 46127 113270
14820A13270j454l2271k1361m0859j6448J5046J0576l4790K3148L6497L2855n2617
$$ 113270 111816 79545 58184 17325 877 15923 26499 -8291 14857 51354 84209 31592
14808C1592m6255O6720J9558m6464l2883R799L2291N0985M4197o7309m474J4592
$$ 31592 -14663 52057 71615 25151 -7732 2067 34358 85343 129540 62231 57757 72349
14796G2349K1290j8597o3050J1647L595K6199n0484l0920P3068Q843J4120n543
$$ 72349 93639 75042 11992 23639 27234 53433 2949 -27971 45097 53940 68060 62517
14784F2517K625l2l1906L0182K9209M0556L673j2962l5922L187m5472l2753K1344
$$ 62517 65142 65110 33204 63386 92595 133151 136824 123862 87940 91127 45655 12902 34246
14771C4246l4473o271m6935r395N2275L4958R846M2887K6809k8857l4428l6795
$$ 34246 -227 -6498 -53433 -62828 -10553 24405 34251 77138 103947 75090 40662 3867
14759C867j3985J7445k9399K8997l6601J0286p011K1601L954m4220l792P3051
$$ 3867 -10118 7327 -22072 6925 -29676 -19390 -26401 -4800 -846 -45066 -48858 24193
14747B4193L0178n1498k7791l5352K7056q538n3652K5096M3994N4731N7740N2019
$$ 24193 54371 2873 -24918 -60270 -33214 -41752 -95404 -70308 -26314 28417 86157 138176
14735A38176j468r585j5591K5299L01p531p478p7935r7330J4717O6106J03455
$$ 138176 136708 127123 111532 136831 137132 129601 122123 44188 -53142 -38425 27681 131136
14723A31136j0417N5056q762p6176r3472l6058J8479N1358L785L5149K0390k0189
$$ 131136 120719 175775 167013 90837 -2635 -38693 -20214 31144 34929 70078 90468 70279
14711G0279O883o5925k5046m007M1409N1940L9844J1290m1925l6813L0746O3203
$$ 70279 77162 11237 -13809 -17816 23593 75533 115377 126667 84742 47929 78675 141878
14699A41878k4332j5116K0463k9088n397l9357J3194L8556J7876J411m0804k78
$$ 141878 117546 102430 122893 93805 88408 49051 62245 100801 118677 120088 79284 79006
14687G9006J7625m5318l1371l1017l6542K4075L3215l599M2993M1749M475r868
$$ 79006 96631 51313 19942 -11075 -47617 -23542 9673 6074 49067 90816 95291 85423
14675H5423l6352J3734m2716O538K5740l7267J275m5872j0074j5926P9594L5948
$$ 85423 49071 62805 20089 26627 52367 15100 16375 -29497 -39571 -55497 24097 60045
14663F0045K0078m1407j2182M9703J3325j7190k9600Q980J025K1464K3703j5336
$$ 60045 80123 38716 26534 76237 89562 72372 42772 51752 52777 74241 97944 82608
14651H2608l0100l8867j8033O2797O8162m9512o7098L0684N099r252K8071L6601
$$ 82608 52508 13641 -4392 58405 126567 77055 9957 40641 45740 36488 64559 101160
14639A01160p811k1251k691j7596r882J9215k1739J8564L783o2561J3346O7941
$$ 101160 93349 72098 69407 51811 41929 61144 39405 57969 61752 -809 12537 80478
14627H0478Q4686l7988l0836J5456l4956p4342L6348M6113j7766o2097J8766O9642
$$ 80478 165164 127176 96340 111796 76840 2498 38846 84959 67193 5096 23862 93504
14615I3504n8642j7491N8137m2536J0813O3399L1562P0648L897j8277M9928j2863
$$ 93504 34862 17371 75508 32972 43785 107184 138746 209394 213291 195014 244942 232079
14603B32079q1235m1815m617K3159J4312L6672K3635n3940o78J6508k8236j9386
$$ 232079 150844 109029 104412 127571 141883 178555 202190 148250 147572 164080 135844 116458
14591A16458l4973M4898P3702j7159m5397K5085M2648K4101j12304k7162M8781
$$ 116458 81485 126383 200085 182926 137529 162614 205262 229363 117059 89897 138678
14580A38678J6401m202K2023K2457j8027K7677k1145l889M3599M7902P5411N7659
$$ 138678 155079 150877 172900 195357 177330 205007 183862 179973 223572 271474 346885 404544
14568D04544L777q7574k7268J6905k5033r651m7285k8497P1266M0292J5437Q079
$$ 404544 408321 320747 293479 310384 285351 275700 228415 199918 271184 311476 326913 334992
14556C34992p178M5409K7525k579n1142k8322N4026P3785L5603R4332Q1403Q6709
$$ 334992 327814 373223 400748 398169 347027 318705 372731 446516 482119 576451 657854 744563
14544G44563M4744N2923N8730P2996Q7534J15368J31991K09693J64828J88561
$$ 744563 789307 842230 900960 973956 1061490 1176858 1308849 1518542 1683370 1871931
14534A871931J44647K35565K88638J97013J44576J29369J7677k68o4745j93637
$$ 1871931 2016578 2252143 2540781 2737794 2882370 3011739 3029416 3029148 2964403 2770766
14524B770766j92062k07178j93550j28673k18963j98544j65725j46264r2999n611
$$ 2770766 2578704 2371526 2177976 2049303 1830340 1631796 1466071 1319807 1226808 1221197
14514A221197q5359j02633q6985n8378j1683l133K6321r5409j07990k9774M7987
$$ 1221197 1135838 1033205 946220 887842 876159 873026 899347 803938 695948 666174 714161
14503G14161m722J1082l341O4560K316k9333o9889k4650k7305o1752m0658Q5746
$$ 714161 709439 720521 717180 781740 784056 754723 684834 660184 632879 571127 530469 616215
14491F16215M8163m4609k1313m4120j1168o278O2955J920M8952M1649m4573k8978
$$ 616215 664378 619769 598456 554336 543168 536890 599845 601765 650717 692366 647793 618815
14479F18815M0163q563j2379M9407J6883L7327K2610M7187M6628J8152n9170K0195
$$ 618815 658978 650415 638036 687443 704326 741653 764263 811450 858078 876230 817060 837255
14467H37255K1864j2090J2814O0662J5025k4383l0041L1423q168j9514K2503r566
$$ 837255 859119 847029 859843 920505 935530 911147 881106 912529 904361 884847 907350 897784
14455H97784J685L4535J3814O730n2915L5670P0357N2489M1389l4471m9232n6671
$$ 897784 899469 934004 947818 954548 901633 937303 1007660 1060149 1101538 1067067 1017835 961164
14443I61164k1255N1848K9797M8903N437k1219J0952j4229k3485L6011k5885o3987
$$ 961164 939909 991757 1021554 1070457 1075894 1054675 1065627 1051398 1027913 1063924 1038039 974052
14431I74052k5492L4199M2325o83N8483J6306K4202m5003m6905l5216l2461J2841
$$ 974052 948560 982759 1025084 1024401 1082884 1099190 1123392 1078389 1031484 996268 963807 976648
14419I76648K9073Q511J6945K5377n4144n9156k0638j502R490m1087n0408k2520
$$ 976648 1005721 1014232 1031177 1056554 1002410 943254 922616 921114 930604 889517 839109 816589
14407H16589n240K7147J358J1010J1559o4367k1635J6087q473l9461k1935r343
$$ 816589 811349 838496 839854 850864 862423 798056 776421 792508 784035 744574 722639 713296
14395G13296K9476l5098n1847o192m6394P85J9650K5464L7420J1115n1074j13863
$$ 713296 742772 707674 655827 649635 603241 604026 623676 649140 686560 697675 646601 532738
14383E32738J881q457q576O953K363L0219M0571k8833n9408J5511J5148m0979
$$ 532738 534619 526162 517586 524539 526902 557121 597692 568859 509451 524962 540110 499131
14371D99131k0376k0570J2252j8406j1994j6049n5058k2243O2448N748n1502M7448
$$ 499131 478755 458185 470437 452031 440037 423988 368930 346687 409135 414883 363381 410829
14359D10829K1062K5201L4205l8748K3640K0242J9880l4524K0043K2833j4234
$$ 410829 431891 457092 491297 452549 476189 496431 516311 481787 501830 524663 510429
14348E10429K0314K6050k162M5247m4585m5083j6238M5254N9994O2146N5598L8213
$$ 510429 530743 556793 554631 599878 555293 510210 493972 539226 599220 661366 716964 755177
14336G55177j3533l77K8826L7689J9949O1222M9139k34m0091o1315N718P3574
$$ 755177 741644 741267 770093 807782 827731 888953 938092 937858 897767 836452 842170 915744
14324I15744k72o2072o033m6510m0129n0098j9501M664J1866j2388o4453K0681
$$ 915744 915472 853400 847367 800857 760728 710630 691129 695793 707659 695271 630818 651499
14312F51499L4524j2465o8255q2051J7248L895k0788n8994M345j2410l1032j6406
$$ 651499 686023 673558 605303 523252 540500 544395 523607 464613 468958 456548 425516 409110
14300D09110K5101O3052Q8543K5607M858l7763J0845M9656j0841j1424k404M8368
$$ 409110 434211 497263 585806 611413 616271 578508 589353 639009 628168 616744 614340 662708
14288F62708N4002L3384L5651l5518n4168K4094N8092L2023k7618l562O3727K9621
$$ 662708 716710 750094 785745 750227 696059 720153 778245 810268 782650 779088 842815 872436
14276H72436N8634P1395O0610L1839j4588k5070K9922L0910N6173K7552M3699
$$ 872436 931070 1002465 1063075 1094914 1080326 1055256 1085178 1116088 1172261 1199813 1243512
14265A243512j5132r592n3808o1552l8464l9541m3048n0312p8634j288J0720j8035
$$ 1243512 1228380 1218788 1164980 1103428 1064964 1025423 982375 932063 853429 852141 862861 844826
14253H44826k4300k8728j3938L5507l6170K4334K2986l5390J4041o903J5636K4156
$$ 844826 820526 791798 777860 813367 777197 801531 824517 789127 803168 796265 811901 836057
14241H36057N5554o168L9687m5601K363N4902K1750k8860K4540J8661p9967L642
$$ 836057 891611 885443 925130 879529 881892 936794 958544 929684 954224 972885 892918 896560
14229H96560P0901j8798o3560o048M6367M5801m8520j0377N6280N6762N668K1264
$$ 896560 967461 948663 885103 879055 925422 971223 922703 912326 968606 1025368 1031036 1052300
14217A052300J7510Q599R806L2856K4182M9932l7972k5792K489N5028K7128O6668
$$ 1052300 1069810 1078409 1088215 1121071 1145253 1195185 1157213 1131421 1133910 1188938 1216066 1282734
14205A282734K1918k1201K2314O4657R4247J38512L0813L8473M5841k2711j2923
$$ 1282734 1304652 1283451 1305765 1370422 1464669 1603181 1633994 1672467 1718308 1695597 1682674
14194A682674J0218n6193K0221K7302R624l9772q040l2308k4414P1795J07267
$$ 1682674 1692892 1636699 1656920 1684222 1693846 1654074 1646034 1613726 1589312 1661107 1768374
14183A768374P526M2641L3244N5429K5150J3955P2984J53510P1168R0158P099
$$ 1768374 1775900 1818541 1851785 1907214 1932364 1946319 2019303 2172813 2243981 2334139 2341238
14172B341238M9876L0906R0207L9769M8148K8792J3452N3489J23202O9463N8329
$$ 2341238 2391114 2422020 2512227 2551996 2600144 2628936 2642388 2695877 2819079 2888542 2946871
14161B946871J02603J19890Q9174J16931R2156R5382L3959K3866P6064J32568
$$ 2946871 3049474 3169364 3258538 3375469 3467625 3563007 3596966 3620832 3696896 3829464
14151C829464J12453J47939J23807J27125J25471J59418J83036J54280Q7290J54960
$$ 3829464 3941917 4089856 4213663 4340788 4466259 4625677 4808713 4962993 5050283 5205243
14141E205243K61818J98133K05368K76693K40231K09286L00336K62833L19506
$$ 5205243 5467061 5665194 5870562 6147255 6387486 6596772 6897108 7159941 7479447
14132G479447L42819L16380K86236K82217L44999M40286M54310M73970M78759
$$ 7479447 7822266 8138646 8424882 8707099 9052098 9492384 9946694 10420664 10899423
14123A0899423M60064N05000O32843N73778O41183P02078O99093P85990Q96663
$$ 10899423 11359487 11864487 12497330 13071108 13712291 14414369 15113462 15899452 16796115
14114A6796115R67891J072992J086540J203454J319196J459195J575540J671341
$$ 16796115 17764006 18836998 19923538 21126992 22446188 23905383 25480923 27152264
14106B7152264J894556K058102K150720K472350K719050L059696L403555L839164
$$ 27152264 29046820 31104922 33255642 35727992 38447042 41506738 44910293 48749457
14098D8749457M422477N004793N619243O391138P359346Q445774R698630J1218355
$$ 48749457 53171934 58176727 63795970 70187108 77546454 85992228 95690858 106909213
14090A06909213J3001953J5241438J7838831K0748742K4159982K7934827L1936270
$$ 106909213 119911166 135152604 152991435 173740177 197900159 225834986 257771256
14083B57771256L5618511L8544725L9923754L9049191L5681360K9460262K0814068
$$ 257771256 293389767 331934492 371858246 410907437 446588797 476049059 496863127
14076D96863127J0413765p89450j1842514k1768616k9955283l5547570l8554028
$$ 496863127 507276892 506487442 494644928 472876312 442921029 407373459 368819431
14069C68819431l8851436l7092738l3946095l0207470k6323456k2635696j9328163
$$ 368819431 329967995 292875257 258929162 228721692 202398236 179762540 160434377
14062A60434377j6544775j4230306j2226086j0384816r034544p916223p002436
$$ 160434377 143889602 129659296 117433210 107048394 98013850 90097627 83095191
14055H3095191o120148n400756m860470m379308l909700l606748l315319l037098
$$ 83095191 76975043 71574287 66713817 62334509 58424809 54818061 51502742 48465644
14047D8465644k773125k591495k449538k230648k092122k025824j767210j620191
$$ 48465644 45692519 43101024 40651486 38420838 36328716 34302892 32535682 30915491
14039C0915491j534487j451350j395884j277147j207781j108240j063823r31365
$$ 30915491 29381004 27929654 26533770 25256623 24048842 22940602 21876779 20945414
14031B0945414q45608p33921q24415q59337p36819o79447o44002o11184n93250
$$ 20945414 20099806 19365885 18541470 17682133 16945314 16265867 15621865 15010681 14417431
14022A4417431n49463n20153m95179m78183m50215m08893l95634m22110m37204
$$ 14417431 13867968 13347815 12852636 12374453 11924238 11515345 11119711 10697601 10260397
14013A0260397m05314l26910k36035k37797k69380l15334k83130k93465k64513
$$ 10260397 9855083 9528173 9292138 9054341 8784961 8469627 8186497 7893032 7628519
14004G628519k34517k07889k64231k57490k18045k59098k08047j92960k19287
$$ 7628519 7394002 7186113 6921882 6664392 6446347 6187249 5979202 5786242 5566955
13995E566955j74895j20156j14055j48859j40884j28313j19089j40292j62809
$$ 5566955 5392060 5271904 5157849 5008990 4868106 4739793 4620704 4480412 4317603
13986D317603j03660o1276n9932j31308j41783j08844k2322l8254q7242q4569
$$ 4317603 4213943 4152667 4092735 3961427 3819644 3710800 3688478 3650224 3562982 3478413
13976C478413j02018j06114q4607j53682j08654q3633j8416K7341p4510o9105
$$ 3478413 3376395 3270281 3185674 3031992 2923338 2839705 2821289 2848630 2774120 2705015
13966B705015j9160o3525o9402j6652P629o8065j973p6612j12967l4757L575Q3661
$$ 2705015 2685855 2622330 2552928 2536276 2543905 2475840 2473867 2397255 2284288 2249531 2253106 2336767
13954B336767J3619J6356M0939k407l5181p7503n6316o5660q5464o3165l4693
$$ 2336767 2350386 2366742 2407681 2405274 2370093 2292590 2236274 2170614 2085150 2021985 1987292
13943A987292n4205j1659o3222q3087r6181l7545J384l7007o8664j01660o4682
$$ 1987292 1933087 1921428 1858206 1775119 1678938 1641393 1642777 1605770 1537106 1435446 1370764
13932A370764n0133o2051m7766n2333J971R238m7980m2862L6407J7197Q834p5575
$$ 1370764 1320631 1258580 1210814 1158481 1160452 1169690 1121710 1078848 1115255 1132452 1141286 1065711
13920A065711n9548q7514p5523m284M9430K7751j6257J2391k9283k2267q465J8602
$$ 1065711 1006163 918649 843126 838842 888272 916023 899766 912157 882874 860607 852142 870744
13908H70744k6869q2615r3043p9003l1970j6222q626m158k2770k5437l8450M3510
$$ 870744 843875 761260 668217 589214 557244 541022 532396 528238 505468 480031 441581 485091
13896D85091K8760k8959l1065p8512j09163q4210o1784k3302q3610k1580l7867
$$ 485091 513851 484892 453827 375315 266152 181942 120158 96856 13246 -8334 -46201
13885d6201n4177j7828J7726K4302L915J6910J111J944N354M1830O1062O7747
$$ -46201 -100378 -118206 -100480 -76178 -72263 -55353 -54242 -52298 -46944 -5114 55948 123695
13873A23695j663N313M330M3709K2692O633n398Q368O2527O8445n4291k7440K7859
$$ 123695 122032 127345 131675 175384 198076 204709 199311 207679 270206 338651 284360 256920 284779
13860B84779j3137K9511j818k9063k7959L2379M6848P7406M0733q1838n8297l9723
$$ 284779 271642 301153 299335 270272 242313 274692 321540 398946 439679 357841 299544 259821
13848B59821k0230K8690r340M4464K7538j0468k3545k3097l0250K8665L9049J7947
$$ 259821 239591 268281 258941 303405 330943 320475 296930 273833 243583 272248 311297 329244
13836C29244J6950l3963r570j7615k352j5556q0330k8079P1095l62j2787k862
$$ 329244 346194 312231 302661 285046 282694 267138 186808 158729 229824 229462 216675 213813
13824B13813J8064k344K7274j0249J800m4546P207m88L5548J9686K4054k5981
$$ 213813 231877 229533 256807 246558 248358 203812 211019 210531 246079 265765 289819 263838
13812B63838n4128k8046O5987J8760r335L9423k0207l7641L9096k967m0863Q317
$$ 263838 209710 181664 247651 266411 257076 296499 276292 238651 277747 274780 233917 242234
13800B42234q370k634j5908J4660m5285P990j4435L8690M7695M164L409o4540
$$ 242234 233864 231230 215322 229982 184697 192687 178252 216942 264637 268801 272210 207670
13788B07670m8709P453L3088k0983j2744K6032N1704M8091J7608l7450k4785o9310
$$ 207670 158961 166414 199502 178519 165775 191807 243511 291602 309210 271760 246975 177665
13776A77665k2746P9823j5180O4306L8680j9306k6096l2943r823j1229k8553k906
$$ 177665 154919 234742 219562 283868 322548 303242 277146 244203 234380 223151 194598 191692
13764A91692N080K2441K224n6790l7728q941k5001L0531P6342l5075k6711K7789
$$ 191692 196772 219213 221437 164647 126919 117978 92977 123508 199850 164775 138064 165853
13752A65853m5796l4589J8218k6181K5820K9268J7175o0797j24305l7770Q1603
$$ 165853 120057 85468 103686 77505 103325 132593 149768 88971 -35334 -73104 8499
13741H499K8177l7884m7402l7682K5208O7395j9291L6065J977m7898M8138M6958
$$ 8499 36676 -1208 -48610 -86292 -61084 6311 -12980 23085 25062 -22836 25302 72260
13729G2260k9072L6288K3125n9212k7635l1176J7494j0913K7469j0047k7906l5610
$$ 72260 43188 79476 102601 43389 15754 -15422 2072 -8841 18628 8581 -19325 -54935
13717e4935R9585L4430j3199P9791O3339o3977m7578m7910l7695J0284J9592j2459
$$ -54935 44650 79080 65881 145672 209011 145034 97456 49546 11851 22135 41727 29268
13705B9268K8K3403m0379m4131l1440L2558K4957L4769m6341o2330L3426K7966
$$ 29268 29296 52699 12320 -31811 -63251 -30693 -5736 29033 -17308 -79638 -46212 -18246
13693a8246K2144k861J672K6388J8205k5033k4424K303O991l2523m4652J4004
$$ -18246 3898 1037 2709 29097 47302 22269 -2155 148 7139 -25384 -70036 -56032
13681e6032N7825L4442J2284L1578L9049k5088k071M2312J2727K898k2130p2472
$$ -56032 1793 36235 48519 80097 119146 94058 91987 134299 147026 149924 127794 55322
13669E5322k8980K1540Q7870M1440p602k3764M166J2882j1979k1791o5150J113
$$ 55322 26342 47882 135752 177192 169590 145826 149992 162874 150895 129104 63954 65067
13657F5067K191K7969N1382J8889J1070J3808m1914l6007M3484N8236o009K0359
$$ 65067 67258 95227 146609 165498 176568 190376 148462 112455 155939 214175 208166 228525
13645B28525J124K9125L1432m841K8780O273p554K0226J609K8892M319J15328
$$ 228525 229649 258774 290206 285365 314145 320418 312864 333090 334699 363591 367910 483238
13633D83238J17265P056K1349Q1251J33510J62515J49581J28932J10320J63141
$$ 483238 600503 607559 628908 710159 843669 1006184 1155765 1284697 1395017 1558158
13623A558158K77732K64620K44925K39818J59106Q8842M9652k5462q1128j65115
$$ 1558158 1835890 2100510 2345435 2585253 2744359 2833201 2882853 2857391 2776263 2611148
13613B611148j50420k29474j82553k07461k38264j88620j45803j04817j50474
$$ 2611148 2460728 2231254 2048701 1841240 1602976 1414356 1268553 1163736 1013262
13604A013262j43182r5428m2364j4268k2099q6456n1495n4954o2013l9039L546
$$ 1013262 870080 774652 732288 718020 695921 609465 557970 503016 441003 401964 405510
13593D05510M001k0887o2789l6130k1808m8293j7306m2191Q1987O9664j1298K929
$$ 405510 409511 388624 325835 289705 267897 219604 202298 160107 242094 311758 300460 303389
13581C03389l824n6423l1485p6602l4329k4160O115r391r3433J9948O5507K9693
$$ 303389 299565 243142 211657 135055 100726 76566 82681 73290 -20143 -195 65312 95005
13569I5005r034j6092M8288J8152q6580K222M2290O5927p5623l0224k4856j9863
$$ 95005 85971 69879 118167 136319 49739 51961 94251 160178 84555 54331 29475 9612
13557I612m939j7961j1021Q79N5539J3893l3548l7918K8560M0130N9289j9650
$$ 9612 4673 -13288 -24309 -23430 32109 46002 12454 -25464 3096 43226 102515 82865
13545H2865r8511n9973K5587N0419M5800K9493J6682k2739K665P690O1225L2451
$$ 82865 -15646 -75619 -50032 387 46187 75680 92362 69623 72288 79978 141203 173654
13533A73654k2187l4407l7552n1452m676K9421P4315m1513K4378j3080j03784
$$ 173654 151467 117060 79508 28056 23380 52801 127116 85603 109981 96901 -6883
13522f883j179N5303N4399j7457n2075r433j6928L4969m4244o445l0763l8836
$$ -6883 -8062 47241 101640 84183 32108 22675 5747 40716 -3528 -9973 -40736 -79572
13510g9572J1625n0769L3192P6930K4226j1747K9010p923L2053K1570r1120p7797
$$ -79572 -67947 -118716 -85524 -8594 15632 3885 32895 24972 57025 78595 -12525 -90322
13498i0322j2534R4401L8710L0571l50J2167o3906l2488K1112K1991J1583p127
$$ -90322 -102856 -8455 30255 60826 60476 72643 8737 -23751 -2639 19352 30935 23808
13486B3808P062p213M532p141m5487n336k2095L426P670J7017O0577K5754k9193
$$ 23808 30870 23657 28189 21048 -24439 -29775 -51870 -48444 -40774 -23757 36820 62574 33381
13473C3381K1288l4774m4694l347R050O132m3801o246n3140K1990j3761J9360
$$ 33381 54669 19895 -24799 -28146 -19096 -12964 -56765 -63011 -116151 -94161 -107922 -88562
13461h8562k2j4236N7349N7218P683N707k9384J4303j2335r257k6083k5538N931
$$ -88562 -88584 -102820 -45471 11747 19430 25137 -4247 10056 -2279 -11536 -37619 -63157 -57226
13448e7226P541K7471K5350M667k6264m4530O483J686l099j6746K850O2351K851
$$ -57226 -49685 -22214 3136 7803 -18461 -62991 -56508 -54822 -57921 -74667 -71817 -9466 -6615
13435f615J8053Q926j6021K7307L699j8247K6800Q916k6988K4567m1386l464N8377
$$ -6615 11438 20364 4343 31650 35349 17102 43902 52818 25830 50397 9011 5547 63924
13422F3924j1063n4346p2103k2967M0733R8352L8785k2876l8479m3190k8506j7756
$$ 63924 52861 -1485 -73588 -96555 -55822 42530 81315 58439 19960 -23230 -51736 -69492
13410f9492R2478M3821L0931j3786o1959l3427N8163O688o5501k4881o356J9424
$$ -69492 22986 66807 97738 83952 21993 -11434 46729 53417 -12084 -36965 -43321 -23897
13398b3897M2242N923m5907O5335O3533q759k83l0428l2826K2105O4156l6427
$$ -23897 18345 24268 -21639 43696 107229 98470 98187 67759 34933 57038 121194 84767
13386H4767o1398j6184J6854j6031j3159O9343J8811J9292n1995l1783K3662K1980
$$ 84767 23369 7185 24039 8008 -5151 64192 83003 102295 50300 18517 42179 64159
13374F4159l3996k7152o536N2033M5079l2206l0403J0670o2230N222M8329j544
$$ 64159 30163 3011 -3525 48508 93587 61381 30978 41648 -20582 -15360 32969 31425
13362C1425k7058j0980L8685J6031J0330J4774k0834n6473m7798k0389k1516L465
$$ 31425 4367 -6613 32072 48103 58433 73207 52373 -4100 -51898 -72287 -93803 -90338
13350i0338J4815M4071P2519K9535m9713j9038L6681J1367j8676l2345Q0806j4996
$$ -90338 -75523 -31452 41067 70602 20889 1851 38532 49899 31223 -1122 79684 64688
13338F4688o3129k487M4292k2876J4260q066K130J6168K7918M5288o056J1108
$$ 64688 1559 -928 43364 20488 34748 26682 28812 44980 72898 118186 112130 123238
13326A23238J074l5767n1849k051n7793k3462q330J506M125L367r217m8908M2105
$$ 123238 124312 88545 36696 34645 -23148 -46610 -54940 -53434 -49309 -45942 -55159 -104067 -61962
13313f1962N4764k4893o3904K1161L5763L5814M2330l8864o7472K773M726N5935
$$ -61962 -7198 -32091 -95995 -74834 -39071 -3257 39073 209 -67263 -64490 -59764 -3829
13301c829K4274k6772J9892M5022K9j2901k70l939L7517M5246r356o6193o2477
$$ -3829 20445 -6327 13565 58587 58616 45715 45445 41506 79023 124269 114913 48720 -13757
13288a3757n183P0839m6804n3868K5718R646Q3073M5535J0378l0257l8292j5434
$$ -13757 -18940 51899 5095 -48773 -23055 -13409 69664 115199 125577 95320 57028 41594
13276D1594k0149J3672j49l792j2850l4995k9177K3295k5189J8467J0379R094
$$ 41594 21445 35117 34968 31176 18326 -16669 -45846 -22551 -47740 -29273 -18894 -9800
13264i800q877J4259L1986M7357L6779m7919k2524l865k7812M4461M2006j4873
$$ -9800 -18677 -4418 27568 74925 111704 63785 41261 37396 9584 54045 96051 81178
13252H1178m358J1558J9713N7440j7417k0747n7199O849K7411K3554k784J3964
$$ 81178 76820 88378 108091 165531 148114 127367 70168 77017 104428 127982 125198 139162
13240A39162k968k3198l4403k0391j5145l5960j0407n9167L211L7714M8480K7146
$$ 139162 136194 112996 78593 58202 43057 7097 -3310 -62477 -59266 -21552 26928 54074
13228E4074n486R163M2841J0121o2703j6315K2595l7318n7306p840L3670l3845
$$ 54074 48588 57751 100592 110713 48010 31695 54290 16972 -40334 -48174 -14504 -48349
13216d8349M3507N2139l3044m1482j4470k2446K0407k195M910J481k2080J0495
$$ -48349 -4842 47297 14253 -27229 -41699 -64145 -43738 -45933 -41023 -39542 -61622 -51127
13204e1127N0752M0767L2927m0089m7116J9766J3293J4437m9152m3315N547K5441
$$ -51127 -375 40392 73319 33230 -13886 5880 19173 33610 -15542 -58857 -53310 -27869
13192b7869O6248Q4443j1122l7168l8911M1060N6460j6971o8771l9603J9914L0348
$$ -27869 38379 122822 111700 74532 35621 76681 133141 116170 47399 7796 27710 58058
13180E8058j5562j1349R4455J1639k280J7899l6975O6647K6348j1034l265m7734
$$ 58058 42496 31147 125602 137241 134961 152860 115885 182532 208880 197846 194581 146847
13168A46847o1620k3116k2680R618l0991j5046J5263k8448n2312L0150J3466j6000
$$ 146847 85227 62111 39431 49049 18058 3012 18275 -10173 -62485 -32335 -18869 -34869
13156c4869o392N9822P903m6723K8442P1077j3249L58j5360K0570r180j2892k0316
$$ -34869 -41261 18561 26464 -20259 8183 79260 66011 66369 51009 71579 62399 49507 29191
13143B9191K6457N962k177K9514j9919k8064j1520K3129K8145M329K8090O855
$$ 29191 55648 61610 59433 88947 69028 40964 29444 52573 80718 85047 113137 119992
13131A19992J4021r6621q0251K1079K1003J5642R4863j8748m2536m0305M8004
$$ 119992 134013 37392 -42859 -21780 -777 14865 109728 90980 48444 8139 56143
13120E6143j5724n9659j5664J868J1220j2208K6408M4658m4869l3892K358K9976
$$ 56143 40419 -19240 -34904 -33036 -21816 -34024 -7616 37042 -7827 -41719 -39361 -9385
13108i385l0872j9065Q9267N6224K4133q440l0532J4997n1909m9469J3431k7554
$$ -9385 -40257 -59322 29945 86169 110302 101862 71330 86327 34418 -15051 -1620 -29174
13096b9174j0218M3081L294K7362k0321r555m5425k4401L4973k468J4627M0126
$$ -29174 -39392 3689 6983 34345 14024 4469 -40956 -65357 -30384 -32852 -18225 21901
13084B1901L3388K7414p4998n06J4315J7229l7744L6338M7662K2245K5835o248
$$ 21901 55289 82703 7705 7199 21514 38743 999 37337 84999 107244 133079 126831
13072A26831L1397m0539j6958j215j8619K7289J312J5172O966M4820J5029j1267
$$ 126831 158228 117689 100731 99516 80897 108186 109498 124670 131636 176456 191485 180218
13060A80218k6094o6164q536k2092o8604R475M9506K6316m021j8224J5394J8470
$$ 180218 154124 87960 79424 57332 -11272 -1797 47709 74025 70004 51780 67174 85644
13048H5644K7833j0716n6092l483N6498L409K013l057k6186R335K5729r147J8859
$$ 85644 113477 102761 46669 43186 99684 103093 105106 102049 75863 85198 110927 101780 120639
13035A20639M9981K00k428r182j0832O0950m2280k526J6470m5113K9119K6925
$$ 120639 170620 170820 168392 159210 148378 209328 167048 164522 180992 135879 164998 191923
13023A91923l4426q1258j5038N222L3153o0536N586K2452L842J01388J124m4532
$$ 191923 157497 76239 61201 66423 99576 39040 44626 67078 70920 172308 173432 128900
13011A28900k8923k0266J7161j3067M930N8990L6167o1861l3898K960k5065m0167
$$ 128900 99977 79711 96872 83805 88735 147725 183892 122031 88133 91093 66028 25861
12999B5861j6918n6013J4740K1610M6453p1817L2051O3781J3159M728m1872Q504
$$ 25861 8943 -47070 -32330 -10720 35733 -36084 -4033 59748 72907 77635 35763 44267
12987D4267O8853J9918k9972N911n28l2885r620P35L6530K1163n57l4619k0985
$$ 44267 113120 133038 103066 108977 108449 75564 65944 66679 103209 124372 123815 89196 68211
12974F8211P600J4758p855N555P029L0186M6465j1262l6121m6653N3418M9593
$$ 68211 75811 90569 82714 88269 95298 125484 171949 160687 124566 77913 131331 180924
12962A80924K4608o388p2234J2210n4746M42L0574K6021J2565k2752O106J5896
$$ 180924 205532 199144 126910 139120 84374 84816 115390 141411 153976 131224 137330 153226
12950A53226L9316J6202k6989r811k4569o029N0453l6838n9270R577k0961K5868
$$ 153226 192542 208744 181755 171944 147375 141346 191799 154961 95691 105268 84307 110175
12938A10175P3124j0720k3017M115k3146K97P483p0950J1813O3780l457r2186
$$ 110175 183299 172579 149562 153677 130531 130828 138311 67361 79174 142954 139497 47311
12926D7311k9903J1909j4860Q482k5543j4595K0379Q0916M5670P639L3849J9581
$$ 47311 17408 29317 14457 22939 -2604 -17199 3180 84096 129766 137405 171254 190835
12914A90835J3676j8842J7526J1179k2679L348n234m8265N6907J02872l5452n6519
$$ 190835 204511 185669 203195 214374 191695 195043 189809 141544 198451 301323 265871 209352
12902B09352p6245k8874p4189k3855L5537M3654K3599K5235m0917j105K4962R641
$$ 209352 133107 104233 30044 6189 41726 85380 108979 134214 93297 92192 117154 126795
12890A26795K7558J6494J8143m0786l9076m0922r957N4180L2717J0315k3317j1214
$$ 126795 154353 170847 188990 148204 109128 68206 58249 112429 145146 155461 132144 120930
12878A20930K1157J7294K2721J8120k6325K6010l05l2744p3582P1524J05251M9454
$$ 120930 142087 159381 182102 200222 173897 199907 199602 166858 93276 164800 270051 319505
12866C19505Q78l5758k7208m212l0521m5638k5599K5719J1269J5507l8341k1419
$$ 319505 320383 284625 257417 253205 222684 177046 151447 177166 188435 203942 165601 144182
12854A44182m16L1577J778k2673J1124O4987N8162l2505p6778K3706N4181N3718
$$ 144182 143766 175343 177121 154448 165572 230559 288721 256216 179438 203144 257325 311043
12842C11043m400k5924M305m3106n5709k3090j4274N1945l1869l5412j8688K4977
$$ 311043 306643 280719 285024 241918 186209 163119 148845 200790 168921 133509 114821 139798
12830A39798K1236J2108j766R825j9430k1134L3844N5564J9660k1497k8523p006
$$ 139798 161034 173142 171376 181201 161771 140637 174481 230045 249705 228208 199685 192679
12818A92679j4868k9521k1270l3538P4055J05802M5828j5741k500k4927n6996
$$ 192679 177811 148290 127020 93482 167537 273339 319167 303426 300926 275999 219003
12807B19003j267O2398N0540n1893o1073N6451N4637l4514l2155j4979O995J4131
$$ 219003 217736 280134 330674 278781 217708 274159 328796 294282 262127 247148 254143 268274
12795B68274k8038m6754M8515P8927J9505m9253p358N1221j9806m6050o2328m567
$$ 268274 240236 193482 241997 320924 340429 291176 283818 335039 315233 269183 206855 202288
12783B02288L7041k1997M5105Q486L3242l1323o6612l4061L0713P1407l806n987
$$ 202288 239329 217332 262437 270923 304165 272842 206230 172169 202882 274289 270483 264496
12771B64496k9525R408N6583Q3590p562o6069l8333m4320K0109J22369J9441k931
$$ 264496 234971 244379 300962 384552 376990 310921 272588 228268 248377 370746 390187 387256
12759C87256j1739k4690r968m717j6707k8906J3196N8460m484n547r124m0371
$$ 387256 375517 350827 340859 336142 319435 290529 303725 362185 357701 352154 343030 302659
12747C02659N7431K9758L1185P904J7395R698p6327l8677k3615l7164n2370l7977
$$ 302659 360090 389848 421033 428937 446332 456030 379703 341026 317411 280247 227877 189900
12735A89900J4540L8379O2355M9938l067L6050K6209J0898q4190L107J3066m4482
$$ 189900 204440 242819 305174 355112 352045 388095 414304 425202 341012 344119 357185 312703
12723C12703O3919O2568j878P564j6008L446p110M458J5006L8640K271P516Q3783
$$ 312703 376622 439190 437312 444876 428868 432314 425204 429662 444668 483308 485579 493095 576878
12710E76878M1552k2375k6889m007k3245J7797N988p8274n9003M5613R479j2255
$$ 576878 618430 596055 569166 565159 541914 559711 565699 487425 428422 474035 483514 471259
12698D71259j0310N349M284L5493O3525L694k1843O088j236o9559P4416M7822
$$ 471259 460949 466298 470582 506075 569600 573294 551451 557539 556303 486744 561160 608982
12686F08982j5228J4494L9001K1205j9448k4363j3504J0002Q267m8353o263K5390
$$ 608982 593754 608248 647249 668454 649006 624643 611139 621141 629408 581055 574792 600182
12674F00182N7967j6076m7721q753O4132O5080o6833l7363k6364J3058J5432K7182
$$ 600182 658149 642073 594352 585599 649731 714811 647978 610615 584251 597309 612741 639923
12662F39923M9017m0165m1639M5022L8074J483l1138k0575O9512R2572J5415p2149
$$ 639923 688940 648775 607136 652158 690232 691715 660577 640002 709514 802086 817501 745352
12650G45352j6030M9773R504l5574o648m2661j1404J04144L8223L4751K6025P824
$$ 745352 729322 779095 788599 753025 746377 703716 692312 796456 834679 869430 895455 903279
12638I03279q563J0438q79l075n606L488m41m3435R552N2619O341M4348L6731
$$ 903279 894716 905154 904275 901200 895594 899082 898641 855206 864758 917377 923718 968066 1004797
12625A004797N0676O184k0293j7834j677K1641p367l4006L3528j0717J7436k8743
$$ 1004797 1055473 1061657 1041364 1023530 1021853 1043494 1036127 1002121 1035649 1024932 1042368 1013625
12613A013625J4236N1113N9997m1194N4947J1211m7028j5078K3042J09926K6543
$$ 1013625 1027861 1078974 1138971 1097777 1152724 1163935 1116907 1101829 1124871 1234797 1261340
12602A261340l4850J4033J1273O5255j015j0629L4633M9774J8710j4866N610L2493
$$ 1261340 1226490 1240523 1251796 1317051 1316036 1305407 1340040 1389814 1408524 1393658 1399268 1431761
12590A431761R480K4867R404j0183L8813L203m9739J6404L9669l3805K2299N3451
$$ 1431761 1441241 1466108 1475512 1465329 1504142 1507345 1457606 1474010 1513679 1479874 1502173 1555624
12578A555624N4224n380L9408J14111L3208m9239J07062P8248m3407Q441O0768
$$ 1555624 1609848 1604468 1643876 1757987 1791195 1741956 1849018 1927266 1883859 1892300 1953068
12567A953068Q9055N981P598L1553o242N462J09794j7911o676M9840O0727N7062
$$ 1953068 2042123 2048104 2055702 2087255 2081013 2086475 2196269 2178358 2171682 2221522 2282249 2339311
12555B339311M8890P461N9989K5072Q1378J14538R2957J2284j6772J6949R1958
$$ 2339311 2388201 2395662 2455651 2480723 2562101 2676639 2769596 2781880 2765108 2782057 2874015
12544B874015Q2065L3257N376J02943R5477O3548R4067O0750O1956O5074K3073
$$ 2874015 2956080 2989337 2994713 3097656 3193133 3256681 3350748 3411498 3473454 3538528 3561601
12533C561601J8772R5327J02814M1746Q3992J52660R9384L9990J07783P7074P4041
$$ 3561601 3580373 3675700 3778514 3820260 3904252 4056912 4156296 4196286 4304069 4381143 4455184
12522D455184J52986J73745J61044J55567J21068R9519O6026P8453J46665K07172
$$ 4455184 4608170 4781915 4942959 5098526 5219594 5319113 5385139 5463592 5610257 5817429
12512E817429J46833J23482J50314J54060K10342J95057K50170K07164K96144
$$ 5817429 5964262 6087744 6238058 6392118 6602460 6797517 7047687 7254851 7550995
12503G550995K49055J40410J14392J86213L36285K59291K87043L39269K63081
$$ 7550995 7800050 7940460 8054852 8241065 8577350 8836641 9123684 9462953 9726034
12494I726034L09130L23218L57050L59684M32076L71703L86744M57667M26924
$$ 9726034 10035164 10358382 10715432 11075116 11507192 11878895 12265639 12723306 13150230
12485A3150230M95734N40978M28788N57923O13538N67985O89748O33326O98342
$$ 13150230 13645964 14186942 14615730 15173653 15787191 16355176 17044924 17678250 18376592
12476A8376592P52455P68687Q26421Q73915Q97985R40434R85468J084089J172346
$$ 18376592 19129047 19897734 20724155 21598070 22496055 23436489 24421957 25506046 26678392
12467B6678392J180144J223023J312992J369248J468024J562345J630903J682256
$$ 26678392 27858536 29081559 30394551 31763799 33231823 34794168 36425071 38107327
12459C8107327J750190J925324J989789K142404K159838K235537K375309K491828
$$ 38107327 39857517 41782841 43772630 45915034 48074872 50310409 52685718 55177546
12451E5177546K550637K657185K754463K836073K880555K901205K905817K914510
$$ 55177546 57728183 60385368 63139831 65975904 68856459 71757664 74663481 77577991
12443G7577991K898090K777522K699991K547224K324612K137495J830318J524362
$$ 77577991 80476081 83253603 85953594 88500818 90825430 92962925 94793243 96317605
12435I6317605J191421P83887M26292J0767l54459p04256j057487j379117j679590
$$ 96317605 97509026 98292913 98719205 98729972 98375513 97671257 96613770 95234653 93555063
12426I3555063j962876k136343k270204k547369k682394k670513k686623k798417
$$ 93555063 91592187 89455844 87185640 84638271 81955877 79285364 76598741 73800324
12418G3800324k780775k679399k603322k583584k574664k477094k352769k289415
$$ 73800324 71019549 68340150 65736828 63153244 60578580 58101486 55748717 53459302
12410E3459302k190591k065281j996945j950970j848379j747157j602316j650159
$$ 53459302 51268711 49203430 47206485 45255515 43407136 41659979 40057663 38407504
12402C8407504j527721j456722j408419j374295j266192j147036j082981j103644
$$ 38407504 36879783 35423061 34014642 32640347 31374155 30227119 29144138 28040494
12394B8040494j074203j034205r40489r01466q86130q60850q13644p52270p49910
$$ 28040494 26966291 25932086 24991597 24090131 23204001 22343151 21529507 20777237 20027327
12385B0027327o09577o76769o46412n81587o27854n35757m84033n26130n07851
$$ 20027327 19417750 18740981 18094569 17512982 16885128 16349371 15865338 15339208 14831357
12376A4831357m69983m35395l91376l79867m16960m12079l64772l62456l52794
$$ 14831357 14361374 13925979 13534603 13154736 12737776 12325697 11960925 11598469 11245675
12367A1245675l21036l91944k87226k79147k95654k40318k38183k98364k88765
$$ 11245675 10924639 10532695 10245469 9966322 9670668 9430350 9192167 8893803 8605038
12358H605038k07368k33187k48994k03423j88229j96853k07397k19772j75267
$$ 8605038 8397670 8164483 7915489 7712066 7523837 7326984 7119587 6899815 6724548
12349F724548j33304j61092j78813j45792j95590j54781j11227j37352j79297
$$ 6724548 6591244 6430152 6251339 6105547 5909957 5755176 5643949 5506597 5327300
12340E327300r3135o9776j10978j17602r8989j04727j23424j71644m4123p7084
$$ 5327300 5234165 5164389 5053411 4935809 4836820 4732093 4608669 4437025 4392902 4315818
12330D315818o9593k3788q7503p4133o0403j06783p4412j15276p4991o7969p0175
$$ 4315818 4246225 4222437 4134934 4060801 4000398 3893615 3819203 3703927 3628936 3560967 3490792
12319C490792j18090p2736k2984j8763j3579p6645j15656j19006n7404k2052K4563
$$ 3490792 3372702 3299966 3276982 3258219 3244640 3167995 3052339 2933333 2875929 2853877 2878440
12308B878440k2985n4345m2482j23866p9952L628p782o7473n6125l8716l7872
$$ 2878440 2855455 2801110 2758628 2634762 2554810 2558438 2550656 2483183 2427058 2388342 2350470
12297B350470o4403q7311o3310k3029L1356P762q0127o1211M966k1501p3967L605
$$ 2350470 2286067 2198756 2135446 2112417 2143773 2151535 2071408 2010197 2015163 1993662 1919695 1923300
12285A923300l0523m4578m3667p6807n6431k8602q476K610k6264k8359n493N613
$$ 1923300 1892777 1848199 1804532 1727725 1671294 1642692 1634216 1636826 1610562 1582203 1576710 1582323
12273A582323j9969l3386P772L987l4007q7103j21879j06557K7717N6123J8462
$$ 1582323 1562354 1528968 1536740 1540727 1506720 1419617 1297738 1191181 1218898 1275021 1293483
12262A293483q3888l8056l3996j0850l053k9268q2653j1487N0084k7214n2765
$$ 1293483 1209595 1171539 1137543 1126693 1123640 1094372 1011719 1000232 1050316 1023102 970337
12251I70337o9612l257J917J1799L43k5518m3473L2408j1430m2246k9892K8363
$$ 970337 900725 897468 899385 911184 911527 886009 842536 874944 863514 821268 791376 819739
12239H19739p6577m8200L9806J5216K1201j3944l2952o1823j7233M4356J6312
$$ 819739 743162 694962 734768 749984 771185 757241 724289 662466 645233 689589 705901
12228G05901P393K582j7306r3356m1535L1678O6599p186N9217j5673k9780l0358
$$ 705901 713294 715876 698570 605214 563679 595357 661956 654770 713987 698314 668534 638176
12216F38176K5958K7762m8783m6267j3425K9340K504l3410j8423J0889j8687j3930
$$ 638176 664134 691896 643113 596846 583421 612761 615265 581855 563432 574321 555634 541704
12204E41704K7375N2267o0395m5217o995o3931l1035L2166K5092N2607M4148L564
$$ 541704 569079 621346 560951 515734 508739 444808 413773 445939 471031 523638 567786 571350
12192E71350k7995o51M07n412J2190n1921l6274K5691l928J5328M6220K0476k6278
$$ 571350 543355 542704 543111 537699 549889 497968 461694 487385 483457 498785 545005 565481 539203
12179E39203q202k2031m5348L8286J0033k86n8230k7059K0783O7352J1062m4690
$$ 539203 531001 508970 463622 501908 511941 511655 453425 426366 447149 514501 525563 480873
12167D80873j4223Q832O0976J6077K09p0996q5239k2714J4400J4771j7880L5813
$$ 480873 466650 475482 536458 552535 552744 481748 396509 373795 388195 402966 385086 420899
12155D20899Q768k5064l3408K6640M8713Q301o4559K551N6984K4789M9468l8714
$$ 420899 429667 404603 371195 397835 446548 454849 390290 392841 449825 474614 524082 485368
12143D85368j11655l1754j5120l5323K5454M8467n441q7020J8009K9151L9772
$$ 485368 373713 341959 326839 291516 316970 365437 359996 272976 290985 320136 359908
12132C59908M3514n5111l2923N240M50j9357M3479k0j2935j0651l7902q763p652
$$ 359908 403422 348311 315388 320628 321078 301721 345200 345180 332245 321594 283692 274929 267277
12119B67277l2775M4630N0860M6447n0581n0563n4834m6966M9593M8221K4114
$$ 267277 234502 279132 329992 376439 325858 275295 220461 173495 223088 271309 295423
12108B95423r791k648L7929J1137j00329n6813K2184N1849K9914l9153n2674q1696
$$ 295423 285632 282984 320913 332050 231721 174908 197092 248941 278855 239702 187028 105332
12096A05332K473P0218J9857o0112j7864M4900J6453o986M6994j6404l9527L8924
$$ 105332 107805 178023 197880 137768 119904 164804 181257 174271 221265 204861 165334 204258
12084B04258L5666j3947J3456L1541m6670l3610K817J9371j1218l8488K577M8546
$$ 204258 239924 225977 239433 270974 224304 190694 193511 212882 201664 163176 165753 214299
12072B14299J5731N968J1164q890l8335k098p85j1042Q0034M9356j20995o6938
$$ 214299 230030 235998 247162 238272 199937 197839 197054 186012 266046 315402 194407 127469
12060A27469Q991m0374o036O8092N2561k9483N46j0431J1727l8965q3349M8625
$$ 127469 136460 96086 90050 158142 210703 181220 181766 171335 183062 144097 60748 109373
12048A09373N2182j630k2323k8964J7157q314n2175J532M9622L3491J1362n1101
$$ 109373 161555 159925 137602 108638 125795 117481 65306 66838 116460 149951 161313 110212
12036A10212K4393M3842P1394o0274j9123j6561N5097L5898K8882M4651l0082
$$ 110212 134605 178447 249841 189567 170444 153883 208980 244878 273760 318411 288329
12025B88329k4192n0396j3547n4165P074j2984K2570q504O157j783j26R223N741
$$ 288329 264137 213741 200194 146029 153103 140119 162689 154185 160342 158559 158433 167656 173397
12012A73397J4917j40958j03460R1642J9305N48k1170M1788M1784n587J4060L7927
$$ 173397 188314 47356 -56104 35538 54843 55391 34221 76009 117793 112206 126266 164193
12000A64193l9973k2986N2822l3560j0888Q230o158O115m1043L559J2419J9791
$$ 164193 124220 101234 154056 120496 109608 117838 111680 117795 76752 80311 92730 112521
11988A12521J8747N7396m02p2730k8359K1663k7293O0583j2434J6173j5441j2064
$$ 112521 131268 188664 188262 115532 87173 108836 81543 142126 129692 145865 130424 118360
11976A18360M4958l5781k0774M4882m2841r2691j2909J9986K6744K3732R836l35
$$ 118360 163318 127537 106763 151645 108804 16113 3204 23190 49934 73666 83502 83167
11964H3167M196k4292l59K3012O6540j8562m5649L6661M9208J7286n6040l1165
$$ 83167 87363 63071 62712 85724 152264 133702 88053 124714 173922 191208 135168 104003
11952A04003q413L5672j1764J3625k1209l6456k7769n351R867M5959M0672M976
$$ 104003 95590 131262 119498 133123 111914 75458 47689 42338 52205 98164 138836 143812
11940A43812K1414n7092m1318Q849m5022K4023O7371N3791j5747l8645j0903L0158
$$ 143812 165226 108134 66816 75665 30643 54666 122037 175828 160081 121436 110533 140691
11928A40691j9811L8964r150J9780n3633o0290J0790l779k7657q269j5532K2344
$$ 140691 120880 159844 150694 170474 116841 56551 67341 63562 35905 27636 12104 34448
11916C4448N5916m2049l8751K3880L5810P6781n6746k1739L5435K0912k2422N407
$$ 34448 90364 48315 9564 33444 69254 146035 89289 67550 102985 123897 101475 106882
11904A06882J6322l7962p0100j3685R87L5219K1334J803L1794o684l353M450k0125
$$ 106882 123204 85242 15142 1457 2444 37663 58997 60800 92594 85910 82557 87007 66882
11891F6882l3465j789N1444k253j7582n8116k2213m0966M4574L3272L067k3930
$$ 66882 33417 31628 83072 80819 63237 5121 -17092 -58058 -13484 19788 22855 -1075
11879a075o6715k9523N9574L8670N930M8882r848m7550J6889J8676l7733n312
$$ -1075 -67790 -97313 -37739 931 6861 55743 45895 -1655 15234 33910 -3823 -9135
11867i135Q520n6469m4753L9632M9405K9363j7583N604M7788K5899L927N0597
$$ -9135 -615 -57084 -101837 -62205 -12800 16563 -1020 4584 52372 78271 82198 132795
11855A32795L955l2589r0146j5890l9895K9496N8078j1691J4752n629j3407k3
$$ 132795 136750 104161 14015 -1875 -41770 -12274 45804 34113 48865 43236 29829 29806
11843B9806o2122j5153M8559L5533R826J4187M1543L8377k5043m3900L7298J136
$$ 29806 -32316 -47469 1090 36623 46449 60636 102179 140556 115513 71613 108911 110047
11831A10047j3360j1399j2680L9845l0599P321Q047j3167k39P183L588m9878K5993
$$ 110047 96687 85288 72608 112453 81854 89175 97222 84055 83816 90999 94587 44709 70702
11818G0702m1434j5740r036k4818l7017N0279M8384K4265k7503k6459o597k4660
$$ 70702 29268 13528 4492 -20326 -57343 -7064 41320 65585 38082 11623 5026 -19634
11806a9634k3432O867M5573R212Q118O090k2818R684J1261M6103P214j6778K961
$$ -19634 -43066 -36199 9374 18586 26704 32794 9976 19660 30921 77024 84238 67460 70421
11793G0421J862J8459L0307q1580q1189J087M5440L34M8342j8933o921k3905j3031
$$ 70421 72283 90742 121049 39469 -41720 -40633 4807 5141 53483 34550 27629 3724 -9307
11780i307l309P045K1171K9248P096j3410m1928k9472j7182M42K6739r898L527
$$ -9307 -12616 -5571 15600 44848 51944 38534 -3394 -32866 -50048 -49606 -22867 -32765 -29238
11767b9238k6049L0047K6295J9437N888o2376l1527O21M176K4364M9467J5399
$$ -29238 -55287 -25240 1055 20492 26380 -35996 -67523 -66902 -62726 -38362 11105 26504
11755B6504J6953M0336O657k0188J0953k491m613n4300m2617M0477M6016l0546
$$ 26504 43457 83793 90450 70262 81215 78724 74111 19811 -22806 17671 63687 33141
11743C3141r701k0284k4164r34j6420J9866k5411k7050K8412j1023k8184k0511
$$ 33141 23440 3156 -21008 -21942 -38362 -18496 -43907 -70957 -42545 -53568 -81752 -102263
11731a02263L9118K2667N8143q68M393k2942l4248L1448Q3077O278m3214K1559
$$ -102263 -63145 -40478 17665 16797 21190 -1752 -36000 -4552 78525 84803 41589 63148
11719F3148j4561m9891L6052J0240m2232l2269L0411o2364M844L3565K7689L6694
$$ 63148 48587 -1304 34748 44988 2756 -29513 898 -61466 -56622 -23057 4632 41326
11707D1326L4794J40k2299J0793j2445k9120M5076m3341p0805p0762M048L2978
$$ 41326 76120 76260 53961 64754 52309 23189 68265 24924 -45881 -116643 -112595 -79617
11695g9617M8064J093m084K3880L3900n108J3446m9055R338l0043J5075L5134
$$ -79617 -31553 -30460 -34544 -10664 23236 18128 31574 -17481 -8143 -38186 -23111 12023
11683A2023l3075j7246K4665l8821k2629M080o345o6797k3687q299Q4830Q4556
$$ 12023 -21052 -38298 -13633 -52454 -75083 -71003 -77348 -144145 -167832 -176131 -91301 -6745
11671f745K0042J6643l3607m7295N045L2911J9263n595m1352M677K3314J8589
$$ -6745 13297 29940 -3667 -50962 -45917 -13006 6257 662 -40690 -36013 -12699 5890
11659E890j8491O708j1726K7632J6546J171N2713L7746l3116r4854l1416j3954
$$ 5890 -12601 -5893 -17619 10013 26559 27730 80443 118189 85073 -9781 -41197 -55151
11647e5151N5950m3421l8790j052j2345r365O4852L7927n5230J2373L2040M139
$$ -55151 799 -42622 -81412 -82464 -94809 -104174 -39322 -1395 -56625 -44252 -12212 -8073
11635h073N46O6032K8683j9716l0849l2984k1015L9199j9477k2287m2637k6151
$$ -8073 -7527 58505 87188 67472 36623 3639 -17376 21823 2346 -19941 -62578 -88729
11623h8729k2310R152K0583N1656L7146J3755K3784l8873J6056N0506l0171L3264
$$ -88729 -111039 -101887 -81304 -29648 7498 21253 45037 6164 22220 72726 42555 75819
11611G5819K5378p177k9184k9519L2425L1931p47j9011l7963o1033l663j5253
$$ 75819 101197 94020 64836 35317 67742 99673 98926 79915 41952 -19081 -22744 -37997
11599c7997k4378j7880P5041Q0038M777j5639L0525R429n7157k0222k1662L8727
$$ -37997 -62375 -80255 -5214 74824 79601 63962 94487 103916 46759 26537 4875 43602
11587D3602l1158j8192L2054l8011K7115P4087m4349q2549j8899M0216k3131k7508
$$ 43602 12444 -5748 26306 -11705 15410 89497 45148 -37401 -56300 -16084 -39215 -66723
11575f6723k6369o1160M7061N1242K2084P7494O539m0681m3335J6955J1931L287
$$ -66723 -93092 -154252 -107191 -55949 -33865 43629 50168 9487 -33848 -16893 -4962 -1675
11563a675m2176L4353L9608J5507k1770L6947j6118j3009k1732k1759K2549M8644
$$ -1675 -43851 -9498 30110 45617 23847 60794 44676 31667 9935 -11824 10725 59369
11551E9369l5908j1410M3562J38223k1782j12893r5893l4889R287N96R184k9867
$$ 59369 23461 12051 55613 193836 172054 59161 -36732 -71621 -62334 -61738 -52554 -82421
11539h2421o5886l235K2138N9231R880j9150J6547M1930R5299q486j9229l0045
$$ -82421 -148307 -151542 -129404 -70173 -60293 -79443 -62896 -20966 74333 65847 46618 16573
11527A6573j5365K257L541J0472j7185m5066r905N7254p720o1087m0225k4281
$$ 16573 1208 3465 7006 17478 293 -44773 -54678 2576 -5144 -66231 -106456 -130737
11515a30737O5567N9599J1028j0563Q694K4295M822L1734o2041o8382k8614K5918
$$ -130737 -65170 -5571 5457 -5106 3588 27883 32705 64439 2398 -65984 -94598 -68680
11503f8680p701K6789k0998p231o3028n3547P6170J03495L9878j6933m649n0891
$$ -68680 -76381 -49592 -70590 -77821 -140849 -194396 -118226 -14731 25147 8214 3565 -47326
11491d7326l0963M102M474J2961J3768k5535K4331O1599O718m1262m5344J807
$$ -47326 -78289 -74187 -69713 -56752 -42984 -68519 -44188 17411 24129 -17133 -62477 -60670
11479f0670K0850R4382Q946L434O291J1243r3120k9478L3797M2982k9612k7132
$$ -60670 -39820 54562 63508 66942 73233 84476 -8644 -38122 -4325 38657 9045 -18087
11467a8087Q852L962J3410m1015K1774M2634L0354m7694m2938J9149K0271O366
$$ -18087 -9235 -5273 8137 -32878 -11104 31530 61884 14190 -28748 -9599 10672 17038
11455A7038Q670L4306j4998k9726p1444k2535P1570l315L3313K9787M4959j6885
$$ 17038 25708 60014 45016 15290 -56154 -78689 -7119 -10434 22879 52666 97625 80740
11443H0740k4318m706j7199k101K2539l3271J476K6440J6735m4579k4371K3312
$$ 80740 56422 51716 34517 32416 54955 21684 23160 49600 66335 21756 -2615 20697
11431B0697J9350K4943K4755l4214k6130l9059k1565n4500K332K2193L2945N7995
$$ 20697 40047 64990 89745 55531 29401 -9658 -31223 -85723 -83391 -61198 -28253 29742
11419B9742M11l4786J429o980j9646o056k996K9942n5702l0054N8596J1060p557
$$ 29742 30153 -4633 -3204 -10184 -29830 -35886 -38882 -8940 -64642 -94696 -36100 -25040 -32597
11406c2597O2336M8747j1371k2097j8461J7261p7114n8656J7020L3881K0202l5977
$$ -32597 29739 78486 67115 45018 26557 43818 -33296 -91952 -74932 -41051 -20849 -56826
11394e6826j9667k3557J3920J8460K8145L8922L5316k1141p1111K8426O8913j532
$$ -56826 -76493 -100050 -86130 -67670 -39525 -603 34713 13572 -57539 -29113 39800 38268
11382C8268n1313N6229M0405l1660o3159K4703m655k0615l5554m1217k4760N5577
$$ 38268 -13045 43184 83589 51929 -11230 13473 8818 -11797 -47351 -88568 -113328 -57751
11370e7751M3760L2879J2933j3592K0597l971k3775k7826P994K1705J6466P0856
$$ -57751 -13991 18888 31821 18229 38826 34855 11080 -16746 -8752 12953 29419 100275
11358A00275K1186k134m5034J0027o01r4162K0653k545m0763k0348K1310L1501
$$ 100275 121461 119327 74293 84320 83719 -10443 10210 7665 -33098 -53446 -32136 -635
11346f35n419j8823n251j1127m2989j7911Q8138J11242p0227k8180N6119L4922
$$ -635 -6054 -24877 -30128 -41255 -84244 -102155 -14017 97225 26998 -1182 54937 89859
11334H9859l7038m224l3144K3839l0772m7326k2802n4283M780N1573Q0453N576
$$ 89859 52821 48597 15453 39292 8520 -38806 -61608 -115891 -111111 -59538 20915 26491
11322B6491o8433n3542J2225N3645N951Q417m3626J778M2161M2830j01N1142m6203
$$ 26491 -41942 -95484 -83259 -29614 -23663 -15246 -58872 -57094 -14933 27897 27796 78938 32735
11309C2735n4307q449O0732j9590j70J3720K0894m1214n4329J3336K0587L3054
$$ 32735 -21572 -30021 30711 11121 10951 24671 45565 4351 -49978 -36642 -16055 16999
11297A6999P3591Q7927l6099p0613o7778j1265p562L4767k355J1661k3141K197
$$ 16999 90590 178517 142418 71805 4027 -7238 -14800 19967 17612 29273 6132 8329
11285H329p167n0025k3963j0790J5822M6913l6937q8669J2406P2642j7576l4607
$$ 8329 1162 -48863 -72826 -83616 -67794 -20881 -57818 -146487 -134081 -61439 -79015 -113622
11273a13622N9740K2230K0292k764N4912J7656J7358j609m6574j8320N948J0232
$$ -113622 -53882 -31652 -11360 -14124 40788 58444 75802 74193 27619 9299 15247 25479
11261B5479o3528j3535m8793L0227N7047M9241l6150l6873N7765k789N899N2061
$$ 25479 -38049 -51584 -100377 -70150 -13103 36138 -12 -36885 20880 18091 23990 76051
11249G6051n0092k0409m994K0236M2435L6056k2013M7092j6489j5343k1880K4437
$$ 76051 25959 5550 556 20792 63227 99283 77270 124362 107873 92530 70650 95087
11237I5087l8511l2673k1706k4140m6333O5818J3814J2355o246O911p97j5964
$$ 95087 56576 23903 2197 -21943 -68276 -2458 11356 23711 17465 24376 23579 7615
11225G615l0024l9294P0813L0529l376l3766m4490J6061R172L9779k9266j411
$$ 7615 -22409 -61703 9110 39639 36263 2497 -41993 -25932 -16760 23019 -6247 -7658
11213g658k0609m8731K658L3947J2222J7187j7880K8437L6381R687Q72p035L9834
$$ -7658 -28267 -76998 -74340 -40393 -28171 -10984 -28864 -427 35954 45641 46513 39478 79312
11200G9312k5518j17897m7515r670K2855P8278N3999j9505l2140m6077O904N032
$$ 79312 53794 -64103 -111618 -121288 -98433 -20155 33844 14339 -17801 -63878 -56974 -51942
11188e1942K3043L9465j1796K0120L7895K2836l9492k7767j1570j4638p760K6240
$$ -51942 -28899 10566 -1230 18890 56785 79621 40129 12362 792 -13846 -21606 4634
11176D634j3906j231J2242O5566M7321j0202K3476m3380n2359o0538r5038l9861
$$ 4634 -9272 -10503 1739 67305 114626 104424 127900 84520 32161 -28377 -123415 -163276
11164a63276N5402J00021K6287n6572Q209M0879L3697j960n1663m1312m55k1255
$$ -163276 -107874 -7853 18434 -38138 -29929 10950 44647 42687 -8976 -50288 -50743 -71998
11152g1998P0851K1044O0j1877k6608m1455j6038P1031L9579j9187Q513P946M8535
$$ -71998 -1147 19897 19957 8080 -18528 -59983 -76021 -4990 34589 15402 23915 31861 80396
11139H0396O9298K416m2790o5263o6964J0023J114O945l621l0490j6053L4692
$$ 80396 149694 152110 109320 44057 -22907 -12884 -11770 -4825 -8446 -38936 -54989 -20297
11127b0297R31m2499m7570R199N0839l013j9162M9539O7005j0953j1226o217K2495
$$ -20297 -19366 -61865 -109435 -100236 -49397 -52410 -71572 -22033 44972 34019 22793 16576 39071
11114C9071m4579m5340Q550J3651M5789L4090K4022j0941j9992m1635L0866J2746
$$ 39071 -5508 -50848 -42298 -28647 17142 51232 75254 64313 44321 2686 33552 46298
11102D6298j5832j1499M7353l223j9169K6785l1060k2907O242j2292j7444l2785
$$ 46298 30466 18967 66320 63097 43928 70713 39653 16746 22988 10696 -6748 -39533
11090c9533j7255m1446L4977P0246K6453l9468j9700M9405N8496O177q5076m9374
$$ -39533 -56788 -98234 -63257 6989 33442 -6026 -25726 23679 82175 88352 3276 -46098
11078d6098p600J4249J0378K7627J0644M1014K3399r7009q0248m6428L8593Q3783
$$ -46098 -53698 -39449 -29071 -1444 9200 50214 73613 -23396 -103644 -150072 -111479 -27696
11066b7696k0452K8712L950M2764M8185k1991j0263m7069Q964q798J7044o517
$$ -27696 -48148 -19436 -15486 27278 75463 53472 43209 -3860 5104 -3694 13350 6833
11054F833k0211p854J2468n350o0347M1873L519l1273M0096L9422K0558j4752
$$ 6833 -13378 -21232 -8764 -14114 -74461 -32588 -29069 -60342 -20246 19176 39734 24982
11042B4982p182J5685l9619N089l992k2211M2055J3699p8873o5955J019J1446
$$ 24982 17800 33485 -6134 -1045 -5037 -27248 14807 28506 -50367 -116322 -115303 -103857
11030a03857J0894K5857j163L224J7435j0335l006O266J407N767J1408L1298L6085
$$ -103857 -92963 -67106 -68269 -65045 -47610 -57945 -60951 -54685 -53278 -47511 -36103 -4805 31280
11017C1280K2892o4083K5564R9196q90m4176L5777n326k9901N9479m0535l7219
$$ 31280 54172 -9911 15653 114849 113959 69783 105560 100234 70333 129812 89277 52058
11005E2058j5134O002J9724j3540k66q3784n2451K0963M0761M8735N2706m4745
$$ 52058 36924 42926 62650 49110 48844 -34940 -87391 -66428 -25667 23068 75774 31029
10993C1029m3007m9106m2742J3076L0979l3036J0085M2889J7275l1889J3774J9398
$$ 31029 -11978 -61084 -103826 -90750 -59771 -92807 -82722 -39833 -22558 -54447 -40673 -21275
10981b1275L8539J6963j4686M0070L2431m0810k4249j5436J4510P035J1724K0377
$$ -21275 17264 34227 19541 59611 92042 51232 26983 11547 26057 33092 44816 65193
10969F5193j3990j4206k9506k7509K4569P1176K1370n9560l8316Q919J4462k2594
$$ 65193 51203 36997 7491 -20018 4551 75727 97097 37537 -779 8140 22602 8
10957HM698O2194j8726m2335M671o7542m0823O5336J3395j5656K2866K7187M9410
$$ 8 4706 66900 48174 5839 10510 -57032 -97855 -32519 -19124 -34780 -11914 15273 64683
10944F4683k8013k2777K0572P529j1387k3049k8404l3089K1552M2407O1758Q414
$$ 64683 36670 13893 34465 41994 30607 7558 -20846 -53935 -32383 10024 71782 80196
10932H0196p125m1867j3667j3926L2567k1838j1170k0075p8293j0822M7292L0997
$$ 80196 73071 31204 17537 3611 36178 14340 3170 -16905 -95198 -106020 -58728 -27731
10920b7731J1413k7385L9248N7813j4835M3869J6224l6242J581P0382n5321p3865
$$ -27731 -16318 -43703 -4455 53358 38523 82392 98616 62374 63955 134337 79016 5151
10908E151n4245J3754n458K9289q199k3270l8529j2884O3507L4811L8455k8170
$$ 5151 -49094 -35340 -40798 -11509 -19708 -42978 -81507 -94391 -30884 3927 42382 14212
10896A4212J2669J5820j7262K5498L3493J2443j7649m4993j0696j00653r594P775
$$ 14212 26881 42701 25439 50937 84430 96873 79224 34231 23535 -77118 -86712 -78937
10884g8937k8995J7919o238o141N6990O7567j5135m5331j0539j7162J9542q493
$$ -78937 -107932 -90013 -96251 -102392 -45402 22165 7030 -38301 -48840 -66002 -46460 -54953
10872e4953J8686M8633J1467J2714l9603R246L9007k4218l3896q675k8912j6904
$$ -54953 -36267 12366 23833 36547 -3056 6190 45197 20979 -12917 -21592 -50504 -67408
10860f7408L7972N4054J7867n1037k19K4327O0468k6382m8011j8394k5645L5155
$$ -67408 -29436 24618 42485 -8552 -8771 15556 76024 49642 1631 -16763 -42408 -7253
10848g253N7871k7176l7084j2260n3197L592Q102L5393k0172J0411O5625N0904
$$ -7253 50618 23442 -13642 -25902 -79099 -75507 -67405 -32012 -52184 -41773 23852 74756
10836G4756O016K3484l2305j7283K6812N294m0260m4859P43M3234J6977n796J9110
$$ 74756 80772 104256 71951 54668 81480 86774 46514 1655 2398 45632 62609 56813 75923
10823G5923n522J3658J1687k754p7069m8435O2259l0286R132m713j3175j1823
$$ 75923 70401 84059 95746 92992 15923 -32512 29747 -539 8593 3880 -9295 -21118
10811b1118j0755J1013L700m1912M119K9339K9394m0638R897K151q418P1394N5427
$$ -21118 -31873 -20860 -17160 -59072 -54953 -25614 3780 -36858 -26961 -24810 -33228 38166 93593
10798I3593k709J3892o918k8601n6497l3476K2594l2534m6977K2764k2467P8012
$$ 93593 90884 104776 97858 69257 12760 -20716 1878 -30656 -77633 -54869 -77336 676
10786F76L7456l1971J3963l2605J3272P3622P619n9131k7599K1740n3103L668
$$ 676 38132 6161 20124 -12481 791 74413 82032 22901 -4698 17042 -36061 -32393
10774c2393J9419O0190M0270p8701p1880K9144q3J9908J6060l1696p416J5127
$$ -32393 -12974 47216 87486 8785 -63095 -33951 -34034 -14126 1934 -29762 -37178 -22051
10762b2051J9191o347n6800j982N1633O843N238l3174m5247L335M8630L8054l5467
$$ -22051 -2860 -9207 -66007 -67989 -16356 -9513 -4275 -37449 -82696 -79361 -30731 7323 -28144
10749b8144m6679O540J301N6042N0563m1048k3786k360N9801J9215k6515j6457
$$ -28144 -74823 -68283 -66982 -10940 39623 -1425 -25211 -27571 32230 51445 24930 8473
10737H473m390R35K3491P93l379M0950L0234p0944l4692M1792M161l2441n004
$$ 8473 4083 5018 28509 29302 25923 66873 97107 26163 -8529 33263 37424 4983 -21
10724b1n698p2973m9046K9023k5273K697M4622L3083r215l0429j9336M5447K7582
$$ -21 -5719 -78692 -127738 -98715 -123988 -121291 -76669 -43586 -52801 -83230 -102566 -57119 -29537
10711b9537L3700l0786j9348J9119k7633j2261J3458P815L6900J7984o3765j7911
$$ -29537 4163 -26623 -45971 -26852 -54485 -66746 -53288 -45473 -8573 9411 -54354 -72265
10699g2265K6763L3905m2898K7059n070m7091K0508m7232l8514q035l0550J7948
$$ -72265 -45502 -11597 -54495 -27436 -32506 -79597 -59089 -106321 -144835 -152870 -183420 -165472
10687a65472M4785R1802J5768L035J5130k1682M862J0241m8159N4974M6841n164
$$ -165472 -120687 -28885 -13117 -10082 5048 -16634 -11772 -1531 -49690 5284 52125 46961
10675D6961l768m5800m738Q676M9961L6599n8139o0181l6216J5755J23869N4481
$$ 46961 43193 -2607 -7345 1331 51292 87891 29752 -30429 -66645 -50890 72979 127460
10663A27460l3569k8057K6137n7321o7979N6768l6080n8909K9128J7466J7119
$$ 127460 93891 65834 91971 34650 -33329 23439 -12641 -71550 -42422 -24956 -7837
10652g837J1220K6689L249j17012J1866J0949J6561m4435L6404L5271J5278N1955
$$ -7837 3383 30072 33321 -83691 -71825 -60876 -44315 -88750 -52346 -17075 -1797 50158
10640E0158n6j5940p390k2189Q016k7894l3333l1418k3003K2666J2890N6297J0968
$$ 50158 50102 34162 26772 4583 12599 -15295 -48628 -80046 -103049 -80383 -67493 -11196 -228
10627b28j3816K8141k8911n5544O820k0553L5924K6467j2115j165k0772J8912
$$ -228 -14044 14097 -14814 -70358 -63538 -84091 -48167 -21700 -33815 -34980 -55752 -36840
10615c6840K5172m5066j8712j4870j7159K8881N4636M2067K0997k9764o411L6961
$$ -36840 -11668 -56734 -75446 -90316 -107475 -78594 -23958 18109 39106 9342 2931 39892
10603C9892m8323l1995L267o2636k549Q2476Q5211L6269p5414o297j6483j1480
$$ 39892 -8431 -40426 -37159 -99795 -102344 -19868 65343 101612 26198 19901 3418 -8062
10591h062J9826k8335M9569L1392j8006P591J8062j3758p8536j6813K0549M653
$$ -8062 11764 -16571 32998 64390 46384 53975 72037 58279 -20257 -37070 -16521 -11868
10579a1868k3081j5440N411J6168n736m517K1150K4228J2684N3212j4974K6476
$$ -11868 -34949 -50389 -44978 -28810 -34546 -39063 -17913 6315 18999 72211 57237 83713
10567H3713L4914N047p9330k7681l571K2154l664l8149L2959R5439j8928m2616
$$ 83713 118627 123674 44344 16663 13092 35246 31582 -6567 26392 121831 102903 60287
10555F0287r680k2199J9131n5743J7808j3990n7966k9571L947J3979K9717m6717
$$ 60287 50607 28408 47539 -8204 9604 -4386 -62352 -91923 -87976 -73997 -44280 -90997
10543i0997q578K2947P640P6952J133j0617K485k1930J6739R3598K7523r198n2070
$$ -90997 -99575 -76628 -68988 7964 9097 -1520 965 -20965 -4226 89372 116895 107697 55627
10530E5627l2218K205K9192L3358L1292k4368q8793l3655Q9248N1443r745K3569
$$ 55627 23409 25614 54806 88164 119456 95088 6295 -27360 61888 113331 103586 127155
10518A27155j9316m8496k9526j8456O74k8495l7376l427P5691N1813k6568p5682
$$ 127155 107839 59343 29817 11361 12035 -16460 -53836 -57263 18428 70241 43673 -32009
10506c2009j8716k6371J7186J2011O248L5021j282m153k5162m937N0468P8558
$$ -32009 -50725 -77096 -59910 -47899 -41651 -6630 -7912 -12065 -37227 -42164 8304 86862
10494H6862k9412m0151j9200N7086N3785m5129n3158p401P1644l2958k9242O8007
$$ 86862 57450 17299 -1901 55185 108970 63841 10683 3282 74926 41968 12726 80733
10482H0733L0901k7648M1964O9742k0485o2017m7190K9693o828j8436j2742M146
$$ 80733 111634 83986 125950 195692 175207 113190 66000 95693 88865 70429 57687 61833
10470F1833O8884n7737j0600M8802K5261k5258r0367k5480j1453L7786O2535j6146
$$ 61833 130717 72980 62380 111182 136443 111185 20818 -4662 -16115 21671 84206 68060
10458F8060J1227r13j1949J8007l7074l2773j953J1805J7402N9423R0271J3285
$$ 68060 79287 78374 66425 84432 47358 14585 12632 24437 41839 101262 191533 204818
10446B04818j3253Q217N4883Q4032M0582L6329J25543K01128K36790L45712L69887
$$ 204818 191565 199782 254665 338697 379279 415608 541151 742279 979069 1324781 1694668
10435A694668K07059N8777j24716l37532l33508k95210k68936j15495M051j6195
$$ 1694668 1901727 1960504 1835788 1498256 1164748 869538 600602 485107 489158 472963
10425D72963j48775p9060j0412m8166l1653J0850O541l9078l982j6739n2508j2001
$$ 472963 324188 245128 234716 186550 154897 165747 172288 133210 129228 112489 59981 47980
10413D7980K809M2642j9364O4381J4796k2494l3188R129k0399J3014j8450N67
$$ 47980 50789 93431 74067 138448 153244 130750 97562 106691 86292 99306 80856 81423
10401H1423j3673l0726r0140P2289J36223j1843o8794k7640J4519r251M3897L3806
$$ 81423 67750 37024 -53116 19173 155396 143553 74759 47119 61638 52387 96284 130090
10389A30090K8962M443j17662m5616J2585J3788K7561k371j3218L025M118m471
$$ 130090 159052 163495 45833 217 12802 26590 54151 51780 38562 41587 45705 41234
10377D1234l6287K3342Q34n4139l1875N3440L7028m1707j1154O6564M3764m521
$$ 41234 4947 28289 29123 -25016 -56891 -3451 33577 -8130 -19284 47280 91044 86523
10365H6523o6945j5695K6939l770p811J1679J4148j9697o3971J3804L7921j2539
$$ 86523 19578 3883 30822 27052 19241 30920 45068 25371 -38600 -24796 13125 586
10353E86N1517N0732r771l8757l2098K2727N552k3634L3233J8185p1007m435N0732
$$ 586 52103 102835 93064 54307 22209 44936 50488 26854 60087 78272 7265 2830 53562
10340E3562N1693O654n5665n7242m027L6949j4864J0839J4989k1934J0217o975
$$ 53562 105255 111909 56244 -998 -5025 31924 17060 27899 42888 20954 31171 24196
10328B4196K8220M7659n9469k6871k85j6197M3201k9863j907k4749Q934M9996
$$ 24196 52416 100075 40606 13735 13450 -2747 40454 10591 8684 -16065 -7131 42865
10316D2865k5428k4957K3828K5546J1516k7838J6979j1895O843l7129k4798j9721
$$ 42865 17437 -7520 16308 41854 53370 25532 42511 30616 37459 330 -24468 -44189
10304d4189K98M998j1840N0721J6626p926q817L9505R73j2463J8952q357j1395
$$ -44189 -43891 -38893 -50733 -12 16614 8688 -129 39376 40349 27886 46838 38481 27086
10291B7086l6725r3104l5069k3053M5578O1241j686Q00j8301J2298P2757J2533
$$ 27086 -9639 -102743 -137812 -160865 -115287 -54046 -55732 -54932 -73233 -60935 11822 24355
10279B4355o273l9775j7510K9479J0525J9228K9639j5354k4480l6124l360L8672
$$ 24355 18082 -21693 -39203 -9724 801 20029 49668 34314 9834 -26290 -29650 9022
10267I022J8883m3381j7992J5118O639K8267P1932m0368j0418k0364q029n571
$$ 9022 27905 -15476 -33468 -18350 -11711 16556 88488 48120 37702 17338 9309 3738
10255C738J9896J8679P476n3236K3328M1098r403J984m0392k0876k2105K0561
$$ 3738 23634 42313 49789 -3447 19881 60979 51576 53560 13168 -7708 -29813 -9252
10243i252O4751L0941k6173l2809j9016n4356o127K075L215p244q128K4081N1776
$$ -9252 55499 86440 60267 27458 8442 -45914 -52041 -49966 -46751 -53995 -62123 -38042 13734
10230A3734k2161L2637K812p938O0336k4989o1549l2098J7444J8287o4366j4996
$$ 13734 -8427 24210 27022 19084 79420 54431 -7118 -39216 -21772 -3485 -67851 -82847
10218h2847R1027P2862K6340J6424J0929j8929k3416k2702J9226l5905j9455k0979
$$ -82847 8180 81042 107382 123806 134735 115806 92390 69688 88914 53009 33554 12575
10206A2575k260J6084Q510L224Q4185K9346p0821M222q987O6670L6959m3258q850
$$ 12575 10315 26399 34909 38133 122318 151664 80843 85065 76078 142748 179707 136449 127599
10193A27599k2319j5730K6499l9115j4836m87K6763J419p127n0904o5810J1711
$$ 127599 105280 89550 116049 76934 62098 61611 88374 89793 82666 31762 -34048 -22337
10181b2337Q556M1607l258j03799j6673J6133J2463L0528L3412m5828K52P9451
$$ -22337 -13781 27826 24568 -79231 -95904 -79771 -67308 -36780 -3368 -49196 -48944 30507
10169C0507J2091m8504k011K4593j348j4604M6166N985K086m5750K3340K2537
$$ 30507 42598 -5906 -7917 16676 15328 724 46890 52875 54961 9211 32551 55088
10157E5088j0774K5141j0791o983k5123p5504m5985J3866m1719K1568N9052L0606
$$ 55088 44314 69455 58664 51681 26558 -48946 -94931 -81065 -122784 -101216 -42164 -11558
10145a1558L3683J0270j6611L824N5690p476l1045K4118L5754r419j0654l4662
$$ -11558 22125 32395 15784 19608 75298 67822 36777 60895 96649 87230 76576 41914
10133D1914j1684N2195q689k6618J0038q6662j8978J7911m2793q132M7606M3175
$$ 41914 30230 82425 73736 47118 57156 -29506 -48484 -30573 -73366 -81498 -33892 9283
10121I283j707m0590n2518o845p009M0411Q6984N0881m285k4849l113K777J4156
$$ 9283 7576 -33014 -85532 -92377 -99386 -58975 28009 78890 74605 49756 46643 49420 63576
10108F3576m2583j2048N5385L8318m3158k4840j6376j9800L4098P975l638l6228
$$ 63576 20993 8945 64330 102648 59490 34650 18274 -1526 32572 40547 36909 681
10096F81M462L6834J1356n85k4224o444L4217J0952j8617j8964Q447k0375j2500
$$ 681 5143 41977 53333 52748 28524 22080 56297 67249 48632 29668 38115 17740 5240
10083E240K4734M776j461K156J9812n812r927o3952L8529N2264K6828R736m063
$$ 5240 29974 34750 33289 35445 55257 49445 39518 -24434 14095 66359 93187 102923 98860
10070I8860j8717k2798j0386K8415k6307j0227m5604p0914r340O317M4729N2037
$$ 98860 80143 57345 46959 75374 49067 38840 -6764 -77678 -87018 -80701 -35972 16065
10058A6065K5363m5516R439j3210J5866J001j6040J1781M3818P7022Q42p0441
$$ 16065 41428 -4088 5351 -7859 8007 9008 -7032 4749 48567 125589 126431 55990
10046E5990O480K7204L8880J3798j9688J6524k2057r868l7378l744O0531N4663
$$ 55990 62470 89674 128554 142352 122664 139188 117131 107263 69885 66141 126672 181335
10034A81335N2244j251r9315J3509M8031k6323l0135j207o1685J6216k6420K497
$$ 181335 233579 232328 133013 146522 194553 168230 138095 136888 75203 91419 64999 67496
10022F7496J6015J1629m4033J4843J05971J0821k5907J3799k3598r4919k4388
$$ 67496 83511 95140 51107 65950 171921 182742 156835 170634 147036 52117 27729
10011B7729L9670L254J5816M4111q971K1182O43j4910m6110k6572L2556L0225
$$ 27729 67399 70653 86469 130580 121609 142791 143434 128524 82414 55842 88398 118623
9999A18623j269q1842o7571N23Q916N5763l460O855N8836K8574Q857l6001j8551
$$ 118623 117354 35512 -32059 -31536 -22620 33143 29683 36538 95374 123948 132805 96804 78253
9986G8253j2776n010j9911l1457L4110L8103M3823L3209R648M0283M170j7592
$$ 78253 65477 60467 40556 9099 43209 81312 125135 158344 167992 208275 212445 194853
9974A94853j1317J4183r342o0491j2996K8567J9064j7587j3220N709k9479j4476
$$ 194853 183536 197719 188377 127886 114890 143457 162521 144934 131714 137423 107944 93468
9962I3468k9640r463L3267L7937K3110Q677k3663m9034l979L6361j1210j4566
$$ 93468 63828 54365 87632 125569 148679 157356 133693 84659 80680 117041 105831 91265
9950I1265k3321J6391l2320M5601M7258K4472o6459m5854j8865L1844L1735m512
$$ 91265 67944 84335 52015 97616 144874 169346 102887 57033 38168 70012 101747 97235
9938I7235j9308k710J9676j344j1276j9733j4880R0270N8821k5323k5307j5753
$$ 97235 77927 75217 94893 93549 82273 62540 47660 137930 196751 171428 146121 130368
9926A30368M5762J3007m9659o3076o2938P977M3171J4661N9320N7380N9252j5569
$$ 130368 176130 189137 139478 76402 13464 21441 64612 79273 138593 195973 255225 239656
9914B39656K81j0160m6826J1179Q1024M1315l3292k9178o6968p422L8770j5903
$$ 239656 239937 229777 182951 194130 275154 316469 283177 253999 187031 179609 218379 202476
9902B02476Q616k4687p7660n192L0543K7363M0517l3211k020j1204M2792M5819
$$ 202476 211092 186405 108745 103553 134096 161459 201976 168765 166745 155541 198333 244152
9890B44152l6194p0793j540O5273j3493k738K2641m2461k0532M4112M6108p559
$$ 244152 207958 137165 135625 200898 187405 184667 207308 164847 144315 188427 234535 226976
9878B26976J4453K3938l6674o1451J6722K3421l7889j8123K3268q992L0621K3546
$$ 226976 241429 265367 228693 167242 183964 207385 169496 151373 174641 165649 196270 219816
9866B19816K4227L5351m79l2029n3934j439M497l4890K7793L3799O26J4436K5573
$$ 219816 244043 279394 278915 246886 192952 191513 196010 161120 188913 222712 223338 237774 263347
9853B63347J6463L313J9048P4148k7459o6124l0006N959p9614J1213O8735J0362
$$ 263347 279810 283123 302171 376319 348860 282736 252730 258689 179075 190288 259023 269385
9841B69385o3998k1324P96M063O8355J34098R7043M8615k7401q3243m3023m969
$$ 269385 205387 184063 184859 188922 257277 391375 488418 537033 509632 426389 383366 378397
9829C78397k0699q1078n2417K6267L7174j0911L5993O1879J0604n7166l6059R0
$$ 378397 357698 276620 224203 250470 287644 276733 312726 374605 385209 328043 291984 292074
9817B92074O311k7193Q767r911m5198N966K1179N2687m9588l2170l3181L6395
$$ 292074 298385 271192 279959 270048 224850 230816 251995 304682 255094 222924 189743 226138
9805B26138m916j2184P373k0415J8098O1180J5320m1948M114j8134k9253L423
$$ 226138 221222 209038 216411 195996 214094 275274 290594 248646 252760 234626 205373 208796
9793B08796L1929k5346j6597O2440j0165J746N745J1919N9998R824p9738m2618
$$ 208796 240725 215379 198782 261222 251057 252803 258548 270467 330465 340289 260551 217933
9781B17933n6363Q632J0410M013M3024p974j0344L0362L3616k5473j8199n9238
$$ 217933 161570 170202 180612 184625 227649 219675 209331 239693 273309 247836 229637 170399
9769A70399L9048J00658L235K7196L1538m0355n1013J0212j2622l1854k7307k477
$$ 170399 209447 310105 313340 340536 372074 331719 280706 290918 278296 246442 219135 216658
9757B16658N4914K8071J2089k9199M9134j9209q981l95K7341l2695m3101k4129
$$ 216658 271572 299643 311732 282533 331667 312458 303477 303082 330423 297728 254627 230498
9745B30498L3896J9063K552O0952L2334l9371K2545P989L4993m6422q2511k4329
$$ 230498 264394 283457 286009 346961 379295 339924 362469 370458 405451 359029 276518 252189
9733B52189O1546J9608K3465O7467L4829q2211n1529O2913O1905N7989k30j5662
$$ 252189 313735 333343 356808 424275 459104 376893 325364 388277 450182 508171 507941 492279
9721D92279n6271R970M3847j1197l0942j6232m7680L6694M6658J3689j3015m2504
$$ 492279 436008 445978 489825 478628 447686 431454 383774 420468 467126 480815 467800 425296
9709D25296L5242Q3311q107k1025k9757j598j7630K3573q382L3846M6334J7917
$$ 425296 460538 543849 535742 514717 484960 483362 465732 489305 480923 514769 561103 579020
9697E79020n393k0347j7849N6675N211J1494j0370o0746P545L80o283l5717k762
$$ 579020 573627 553280 535431 592106 597317 608811 598441 537695 545240 545620 539337 503620 500858
9684E00858K001N2731L1530n2028q920J8021r53j494k3404k4920R1553O0587N2448
$$ 500858 502859 555590 587120 535092 526172 544193 543240 541746 518342 493422 584975 645562 698010
9671F98010P2090N1983p6385m3270j4538L1750L2806N5027M3216q879j3714k9891
$$ 698010 770100 822083 745698 702428 687890 719640 752446 807473 850689 841810 828096 798205
9659G98205o31l6892p137L6082l1831l3532M1874O0404L3947l1802L7424O9009
$$ 798205 797574 760682 753545 789627 757796 724264 766138 826542 860489 828687 866111 935120
9647I35120j1842L4446j7296p7044k6140k0367r614j1695M9646L3006J8866k9408
$$ 935120 923278 957724 940428 863384 837244 816877 807263 795568 845214 878220 897086 867678
9635H67678J8793J3306J5848m3212O0327R6565R9943L7998l3914o182J4468K9886
$$ 867678 886471 899777 915625 872413 932740 1029305 1129248 1167246 1133332 1127150 1141618 1171504
9623A171504k6000O902j4996j8972Q556J778L5632k5657q831k5644O733Q0029
$$ 1171504 1145504 1152406 1137410 1118438 1126994 1128772 1164404 1138747 1129916 1104272 1111005 1191034
9611A191034N5390o960k0057m7609j540J3862J9581R536q034M1436j5233l8844
$$ 1191034 1246424 1239464 1219407 1171798 1170258 1184120 1203701 1213237 1205203 1246639 1231406 1192562
9599A192562L4927O8334j0195k8344l1438O2686O1655m3570m937K4344O5265K2345
$$ 1192562 1227489 1295823 1285628 1257284 1225846 1288532 1350187 1306617 1301680 1326024 1391289 1413634
9587A413634K5208k1431k7801R906J4236K227L1025p523O4698M6591k7949k9174
$$ 1413634 1438842 1417411 1389610 1399516 1413752 1415979 1447004 1439481 1504179 1550770 1522821 1493647
9575A493647l7531J3630L991J992j4717m4034j03320o4218K8949k39L0646n171
$$ 1493647 1456116 1469746 1473737 1475729 1461012 1416978 1313658 1249440 1278389 1278150 1308796 1303625
9563A303625P601J669M2836j3394K0675K9451k7890J9614O4952l866o8346m2628
$$ 1303625 1311226 1312895 1355731 1342337 1363012 1392463 1364573 1384187 1449139 1445273 1376927 1334299
9551A334299L9298J8692j8162o9261J9265r108P050m5506l7048Q235K907L3085
$$ 1334299 1373597 1392289 1374127 1304866 1324131 1315023 1322073 1276567 1239519 1247754 1250661 1283746
9539A283746L0256o2308p5035k3450j8721P723O9008M3844p0048q1929J971k9509
$$ 1283746 1314002 1251694 1176659 1153209 1134488 1142211 1211219 1255063 1185015 1103086 1105057 1075548
9527A075548K8016k0565m6835J573M2218K5771J6166o1943o2766l6956m9798K338
$$ 1075548 1103564 1082999 1036164 1037737 1079955 1105726 1121892 1059949 997183 960227 910429 912767
9515I12767P0325k272q0136J8480n6920l7923r02K4603O7791M6294j0997O6707
$$ 912767 983092 980820 900684 919164 862244 824321 823419 848022 915813 962107 951110 1017817
9503A017817K1848r7081j81801m1855O7950K1880o892J1863m281J071J1751M923
$$ 1017817 1039665 942584 760783 718928 786878 808758 801866 813729 809448 810519 822270 827193
9491H27193J7678l5177j9718j9551n0409j580n0548j8826j1023L3479Q5379J7986
$$ 827193 844871 809694 789976 770425 720016 718436 667888 649062 638039 671518 756897 774883
9479G74883K2588m965p9173l1843j5676m216m9681o9901k2324K9462K1751M9413
$$ 774883 797471 792506 713333 681490 665814 661598 611917 542016 519692 549154 570905 620318
9467F20318J6661m0280k6548l9403k0341M140R101M9823K4944l2645J3676j165
$$ 620318 636979 596699 570151 530748 510407 514547 523648 573471 598415 565770 579446 578281
9455E78281o6871k2231r0582k1744k1800N6426R6597M0149p2110k5319N6844J0068
$$ 578281 511410 489179 398597 376853 355053 411479 508076 548225 476115 450796 507640 517708
9443E17708m3189m2009k0445J5880L5056k1888p8142l0179k2090j0715N2784K3939
$$ 517708 474519 432510 412065 427945 463001 441113 362971 332792 310702 299987 352771 376710
9431C76710K8915m1538j9474J6983n7074l6727K648Q491L3524N0458J1716k1355
$$ 376710 405625 364087 344613 361596 304522 267795 270443 278934 312458 362916 374632 353277
9419C53277j4485K7599L1842q342j0863L815M2436p335n5634j05625m1126Q5259
$$ 353277 338792 366391 398233 389891 379028 382843 425279 417944 362310 256685 215559 300818
9407C00818Q5925r286j1718n8330n0244K8787L1032J8916O4248K3979n6131l4230
$$ 300818 386743 377457 365739 307409 257165 285952 316984 335900 400148 424127 367996 333766
9395C33766j4035k2868k3390l9406M9051L3617K8501M4670k7139o7877j0340j4003
$$ 333766 319731 296863 273473 234067 283118 316735 345236 389906 362767 294890 284550 270547
9383B70547N2173L4097l4708k1446L535K8729n37k8633J1158j38Q224Q524k0187
$$ 270547 322720 356817 322109 300663 304198 332927 332390 303757 314915 314777 323001 331525 311338
9370C11338j3797j9382j8032K6818l5176M7476J6848k791k9364J7795o9114k6121
$$ 311338 297541 278159 260127 286945 251769 299245 316093 313302 283938 301733 232619 206498
9358B06498j4548J6099J6644N5985Q070l6478k8028j9794m0110K6220M5947o834
$$ 206498 191950 208049 224693 280678 288748 252270 224242 204448 164338 190558 236505 229671
9346B29671N6284l6348j6167l3933j849M5494L5634J0769J5650K2147J6637K512
$$ 229671 285955 249607 233440 199507 197658 243152 278786 289555 305205 327352 343989 346501
9334C46501J6161j0800n4644k3316K9227j2647o023j3506J0892L9615m9602m9208
$$ 346501 362662 351862 297218 273902 303129 290482 284459 270953 281845 321460 271858 222650
9322B22650J9343j6299l4167R979J3534o1010p804m0383M1167O6514P3831J9693
$$ 222650 241993 225694 191527 201506 215040 154030 146226 105843 147010 213524 287355 307048
9310C07048l9860Q9324j1350o808m7600p9496l1562M7917P0045m232j8020O2451
$$ 307048 267188 356512 345162 338354 290754 211258 179696 227613 297658 293426 275406 337857
9298C37857l7055k1915K6440j1309o0668m8817K2675O9502L9706O491k1864N267
$$ 337857 300802 278887 305327 294018 233350 184533 207208 276710 316416 322907 301043 306310
9286C06310J2092l1871m914J9611k8967n265k913q9575o1431N5335K7148K9336
$$ 306310 318402 286531 281617 301228 272261 266996 264083 174508 113077 168412 195560 224896
9274B24896M410O162j6217J2760p433j9892k1516J0316L0672J5718l3489O0411
$$ 224896 229306 235468 219251 232011 224578 204686 183170 193486 224158 239876 206387 266798
9262B66798N1Q59L7563m898j7099n2704J0254J1848J0627M8032K8205j238q983
$$ 266798 266849 267708 305271 300373 283274 230570 240824 252672 263299 311331 339536 338298 329315
9249C29315k3111k6573l7687l3062K6634N2342J036J2581l7515l211J9101o2351
$$ 329315 306204 279631 241944 208882 235516 287858 288894 301475 263960 260749 279850 217499
9237B17499k0064J176J634K439K9183K1629j2081M557J9410j8198m4446j7736
$$ 217499 197435 198611 200245 202684 231867 253496 241415 245972 265382 247184 202738 185002
9225A85002o0884j4518N5584p127j6813L546J1129J7293L0706j6780J2907k5374
$$ 185002 124118 109600 165184 158057 141244 144790 155919 173212 203918 187138 200045 174671
9213A74671o2517M2120J836N1302L2857k5509k0541Q0791R15m8354k7894r7439
$$ 174671 112154 154274 156110 207412 240269 214760 194219 275010 275925 227571 199677 102238
9201A02238L2969J6006J04736J6410l3873m4982q6297P711K7034K4882j3834l9615
$$ 102238 135207 151213 255949 272359 238486 193504 107207 114918 141952 166834 153000 113385
9189A13385j2612l646n5075m1248O1953K3640l6520k2989p114O4832M0131m9193
$$ 113385 100773 97127 42052 804 62757 86397 49877 26888 19774 84606 124737 75544
9177G5544M3772Q751j8670K8723L9793k4495l8599l3141l4253l9336K2509O4386
$$ 75544 119316 128067 109397 138120 177913 153418 114819 81678 47425 8089 30598 94984
9165I4984J9207j12m1708m7096K8120j4524N3530Q6798j3967k6795Q9746j5855
$$ 94984 114191 114079 72371 25275 53395 38871 92401 179199 165232 138437 228183 212328
9153B12328m6272L227J8780j9569J2750l317m0869Q0578Q2047n2287m0529k345
$$ 212328 166056 169283 188063 168494 181244 177927 137058 217636 299683 247396 206867 204522
9141B04522J1412k1296n0092k3035R681J6350j6166k2297k3942m8381L788M1478
$$ 204522 215934 194638 144546 121511 131192 147542 131376 109079 85137 36756 40544 82022
9129H2022O1962P0248o9336j0291K1277O2458j3885m1637K127J9382j9601J9436
$$ 82022 143984 214232 144896 134605 155882 218340 204455 162818 164945 184327 164726 184162
9117A84162n247L7118m086J5414k6024l7796K0773N9873j7599l8223j6282q1596
$$ 184162 178915 216033 211947 227361 201337 163541 184314 244187 226588 188365 172083 90487
9105I0487l3515q846L2691K9185r231J8523P7679O6528q3454r6081L4279N2990
$$ 90487 56972 48126 80817 110002 100771 119294 196973 263501 180047 83966 118245 171235
9093A71235l0278Q016M3402J0899k4937M1985Q710R871O3539L2173l137j8399
$$ 171235 140957 148973 192375 203274 178337 220322 229032 238903 302442 334615 331478 313079
9081C13079n5846q3539l1255l942N1793L2281L4964J372m926K9043j3946n0552
$$ 313079 257233 173694 142439 138497 190290 222571 257535 258907 253981 283024 269078 218526
9069B18526k1798R534K4391Q448M7992p3477j4p0404p6817J6898N5503o0909R982
$$ 218526 196728 206262 230653 239101 287093 213616 213602 143198 66381 83279 138782 77873 87855
9056H7855j658m8276M0185M7294J6218K4656L3429k0901l4801n314j7283j732
$$ 87855 86197 37921 78106 125400 141618 166274 199703 178802 144001 138687 121404 119672
9044A19672L2875j8173n5616M2855M1843p835K2642L4770k0685r141L1956J5655
$$ 119672 152547 134374 78758 121613 163456 155621 178263 213033 192348 183207 215163 230818
9032B30818O007J6188M2970M3829k1018l6282n8940k1891J5407j8138k8246P14
$$ 230818 236825 253013 295983 339812 318794 282512 223572 201681 217088 198950 170704 171418
9020A71418Q3022J1954j9156k1127J5714O6800j0997m2228l4864m9133k9096j1726
$$ 171418 254440 266394 247238 226111 241825 308625 297628 255400 220536 171403 142307 130581
9008A30581o2915K6257K6304N5715P111M4373L5485K3265l0942l9466P771L2781
$$ 130581 67666 93923 120227 175942 183053 227426 262911 286176 255234 215768 223539 256320
8996B56320J4284j2243l6876M0102m241K2320j5864k8981J6100K5145K0748m8820
$$ 256320 270604 258361 221485 261587 257346 279666 263802 234821 250921 276066 296814 247994
8984B47994n4198j4884K7868r027Q325Q9491k4953m4034o2509l9991J5879J4527
$$ 247994 193796 178912 206780 197753 206078 295569 270616 226582 164073 124082 139961 154488
8972A54488m1613n3642m7022L9007K0766K6288Q949L623Q101J8410n382p0465
$$ 154488 112875 59233 12211 51218 71984 98272 107221 110844 118945 137355 131973 61508
8960F1508m2463j1662M563N7861M9497j3432l3682l0673k9148K4305R4568K8206
$$ 61508 19045 7383 11946 69807 119304 105872 72190 41517 12369 36674 131242 159448
8948A59448M3044M5010l170r3782L6092J6387r4953n3994K48Q248K8540k6123
$$ 159448 202492 247502 244332 150550 186642 203029 108076 54082 54330 62578 91118 64995
8936F4995M0010O719n1809P083j2396P060N0299m2727Q789K8052M868j3228k6231
$$ 64995 105005 111724 59915 66998 54602 61662 111961 69234 78023 106075 110943 97715 71484
8923G1484l4840J5960L709m5620l0953k171K2000M2215Q1980M6612k5545k7249
$$ 71484 36644 52604 56313 10693 -20260 -22431 -431 41784 123764 170376 144831 117582
8911A17582k1587K477m4368J8196J0395K088L4490M8375M580o0557q1857n2675
$$ 117582 95995 98472 54104 72300 82695 84783 119273 167648 172228 111671 29814 -22861
8899b2861K7751N6318M3311j2185N715P747n884j1908L8745L2416n2173o1831
$$ -22861 4890 61208 104519 92334 98049 105796 99912 88004 126749 159165 106992 45161
8887D5161K6718K3808M0687k6316R695J3527k6539l5192K2030j8408R336j7930
$$ 45161 71879 95687 136374 110058 119753 133280 106741 71549 93579 75171 84507 66577
8875F6577j6246j7331K9618Q99m0685l9666P908L9030N6272P6405r165J7742J7974
$$ 66577 50331 33000 62618 63517 22832 -16834 -8926 30104 86376 162781 153616 171358 189332
8862A89332j3338M4477N6477N8605j543N3097K2999J08819K31361L73592M56312
$$ 189332 175994 220471 276948 335553 334010 387107 410106 518925 750286 1123878 1580190
8851A580190N25964N46956L78570j4590m78958o52957n01409l49147k37556j23835
$$ 1580190 2106154 2653110 3031680 3017090 2538132 1885175 1383766 1034619 797063 673228
8841F73228j07790j00516l2665n562r142o5208j03659o5827J4707k9370J8636
$$ 673228 565438 464922 432257 426695 417553 352345 248686 182859 197566 168196 186832
8830A86832N7526J2113m7521k4550K7801l1379p0912K7415N0595k8174l0920n1857
$$ 186832 244358 256471 208950 184400 212201 180822 109910 137325 187920 159746 128826 76969
8818G6969m9919M3455L914o3395M1062k2224k6709O015L1693n5039n7519r385
$$ 76969 27050 70505 74419 11024 52086 29862 3153 9168 40861 -14178 -71697 -81082
8806h1082O4448O6521O1403J5485j8972j5323J0184k2891j746J2791j4534l2903
$$ -81082 -16634 49887 111290 126775 107803 92480 102664 79773 78027 90818 76284 43381
8794D3381K3910N6463J7002N9557m3094m2227k3644O3939M2118J634l2602J3642
$$ 43381 67291 123754 140756 200313 157219 114992 91348 155287 197405 199039 166437 180079
8782A80079Q348P76m0796Q802j0674K3194L6215j2438r4251q0860L966n3772k5120
$$ 180079 188427 189203 148407 157209 146535 169729 205944 193506 99255 18395 22361 -31411 -56531
8769e6531N8557J02173K1515L9867M5278J8109n256k6535q925Q6632k8778q091
$$ -56531 2026 104199 125714 165581 210859 228968 223712 197177 188252 274884 246106 238015
8757B38015M8330l6797m5977o1432m4139k066L7182N4385p0692N114Q108M0111
$$ 238015 286345 249548 203571 142139 98000 95934 133116 187501 116809 121923 130031 170142
8745A70142K2164L0526M9870j265J947K9177M9120N329j8588P310o0307k2584
$$ 170142 192306 222832 272702 271437 273384 302561 351681 357010 338422 345732 285425 262841
8733B62841J1107R476J3589n9705K3749j3366L4053j0795l6036P5544N8585L5501
$$ 262841 273948 283424 297013 237308 261057 247691 281744 270949 234913 310457 369042 404543
8721D04543K0234Q955n709N9268K1J3935P2408M5323j353L1262l245K4494J8043
$$ 404543 424777 433732 428023 487291 487312 501247 573655 618978 617625 648887 645642 670136 688179
8708F88179n2404m8117k5241p511j2077Q938N6099m3788q8581l1573k4729k8507
$$ 688179 635775 587658 562417 554906 542829 551767 607866 564078 475497 443924 419195 390688
8696C90688J9795L8970M5823Q0823K2967m6903K7845O3483K6070K4657L4650M3898
$$ 390688 410483 449453 495276 576099 599066 552163 580008 643491 669561 694218 728868 772766
8684G72766K4835r179q17R5550J6642n584N2140K2434k2609O8513K0745N7310
$$ 772766 797601 788422 787605 883155 899797 894213 946353 968787 946178 1014691 1035436 1092746
8672A092746Q5281r689k8816K7424K2037N379J3041q503L407J01913J5204J0504
$$ 1092746 1178027 1168338 1139522 1166946 1188983 1194362 1207403 1198900 1202307 1304220 1319424 1329928
8660A329928j8162o800l4140o0295k5582j1321o0734J4408M1424O150M4799J7076
$$ 1329928 1311766 1304966 1270826 1210531 1184949 1173628 1112894 1127302 1168726 1174876 1219675 1236751
8648A236751N2524l7656j7004R5952M6104J6218O0650J37495N9019M7967O6840
$$ 1236751 1289275 1251619 1234615 1330567 1376671 1392889 1453539 1591034 1650053 1698020 1764860
8637A764860M7853O3217N9893m027M231N3162J00493L0696J8236N5231P0154O0997
$$ 1764860 1812713 1875930 1935823 1931796 1936027 1989189 2089682 2120378 2138614 2193845 2263999 2324996
8625B324996P69J9720k6985K3036J13804O2557O2516P6479Q7024O5684J46037
$$ 2324996 2325765 2345485 2318500 2341536 2455340 2517897 2580413 2656892 2743916 2809600 2955637
8614B955637K43051K75347L19207K19106J80995K94883K58750K66174K77109Q4098
$$ 2955637 3198688 3474035 3793242 4012348 4193343 4488226 4746976 5013150 5290259 5374357
8604E374357J63001K44619K04870J66894Q4939n893n6514l1091j14233j81704
$$ 5374357 5537358 5781977 5986847 6153741 6238680 6232787 6176273 6145182 6030949 5849245
8594E849245j82752j61679j79178k03418k28695j79300j13169j13749k5762m5841
$$ 5849245 5666493 5504814 5325636 5122218 4893523 4714223 4601054 4487305 4461543 4415702
8584D415702q1372o666M1058n7119j05682j47048j32217k38263k81957k46310
$$ 4415702 4334330 4327664 4368722 4311603 4205921 4058873 3926656 3688393 3406436 3160126
8574C160126j52386j96423k77391k61334j79569j08908j02865n9661k1360n4839
$$ 3160126 3007740 2811317 2533926 2272592 2093023 1984115 1881250 1821589 1800229 1745390
8564A745390p9966p8401m2721j03829j78454j14640l3082o8393n0949j1650l6188
$$ 1745390 1665424 1587023 1544302 1440473 1262019 1147379 1114297 1045904 994955 983305 947117
8553I47117j366o587k5874J1070l9801q1497o9967o6213k7553Q4909M1421n8753
$$ 947117 945751 939164 913290 924360 884559 803062 733095 666882 639329 724238 765659 706906
8541G06906p7138l2982k4457q951k5677k6970j226q8885q2567l212J212J8181
$$ 706906 629768 596786 572329 563378 537701 510731 509505 420620 338053 334841 336053 354234
8529C54234J5149K9582O8780l744o3899j6539N5832J5714r400q2198O566j5491
$$ 354234 369383 398965 467745 464001 400102 383563 439395 455109 445709 363511 370077 354586
8517C54586l4772j1243k6592J1153L7355m0367j9077l1812P465m5034o5693K9408
$$ 354586 319814 308571 281979 293132 330487 290120 271043 239231 246696 201662 135969 165377
8505A65377Q074M340J1964M9485J4929p0447k0586K1681l7678L635O823R7281
$$ 165377 173451 177791 189755 239240 254169 183722 163136 184817 147139 150774 157597 254878
8493B54878J1136l1899K7571L3644j8593k031l2863k4489K0615n1460k5197K1457
$$ 254878 266014 234115 261686 295330 276737 274706 241843 217354 237969 186509 161312 182769
$$ [...]
##END NTUPLES=NMR SPECTRUM
##END=
