##TITLE=Analysis number 324426
Compound Code btb 09313
Project Code adrs
Chemist Name stores
##JCAMPDX= 6.0         $$ Bruker NMR JCAMP-DX V2.0
##DATA TYPE= NMR SPECTRUM
##DATA CLASS= NTUPLES
##ORIGIN= Bruker BioSpin GmbH
##OWNER= nmr
$$ XWIN-NMR		Version 3.5
$$ Wed Nov 22 14:03:57 2006 GMT Standard Time (UT+0h)  MAYBRIDGE\nmr@NMR_250MHZ
##.OBSERVE FREQUENCY= 250.131544655141
##.OBSERVE NUCLEUS= ^1H
##.ACQUISITION MODE= SIMULTANEOUS (DQD)
##.ACQUISITION SCHEME= undefined
##.AVERAGES= 16
##.DIGITISER RES= 18
##SPECTROMETER/DATA SYSTEM= dpx250
##.PULSE SEQUENCE= zg30
##.SOLVENT NAME= CDCl3
##.SHIFT REFERENCE= (INTERNAL, CDCl3, 0, 16.4766)
##AUDIT TRAIL= $$ (NUMBER, WHEN, WHO, WHERE, WHAT)
$$ ##TITLE= Audit trail, XWIN-NMR		Version 3.5
$$ ##JCAMPDX= 5.01
$$ ##ORIGIN= Bruker BioSpin GmbH
$$ ##OWNER= nmr
$$ C:\u/data/dgb/nmr/ADRS/830/pdata/1/auditp.txt
$$ ##AUDIT TRAIL=  $$ (NUMBER, WHEN, WHO, WHERE, WHAT)
(   1,<2006-11-22 14:03:32.72 +000>,<MAYBRIDGE\nmr>,<NMR_250MHZ>,
      <created by zg, POWCHK disabled, PULCHK disabled
       configuration hash MD5:
       49 4B E0 1D 92 C2 6B 37 9F E6 65 BC 52 41 86 1D
       data hash MD5: 64K
       46 F3 C9 52 6C 49 DC C5 50 B0 68 1A 5F AA 40 63>)
(   2,<2006-11-22 14:03:47.19 +000>,<MAYBRIDGE\nmr>,<NMR_250MHZ>,
      <Start of raw data processing
       ef LB = 0.3 FT_mod = 6 PKNL = 1 SI = 32K 
       data hash MD5: 32K
       80 34 F4 5B D7 BE C0 1E 77 FE FE A0 83 72 BE 71>)
(   3,<2006-11-22 14:03:49.06 +000>,<MAYBRIDGE\nmr>,<NMR_250MHZ>,
      <apk 
       data hash MD5: 32K
       D3 2C 00 7E 8E AA 86 33 12 00 47 01 D3 0B 0A 0E>)
(   4,<2006-11-22 14:03:49.88 +000>,<MAYBRIDGE\nmr>,<NMR_250MHZ>,
      <abs ABSG = 5 
       data hash MD5: 32K
       A1 15 B4 39 3E FA CC 4A AF 26 A1 9B 64 E0 0F B6>)
$$ ##END=
$$ 
$$ hash MD5
$$ 20 B0 4D 7F 98 44 DD 04 85 D6 84 76 5E 0F F7 AA
##$RELAX= 
##$RELAX= 
##$RELAX= 
##$RELAX= 
##$RELAX= 
##$RELAX= 
##$RELAX= 
$$ Bruker specific parameters
$$ --------------------------
##$DU= <C:\u>
##$EXPNO= 830
##$NAME= <ADRS>
##$PROCNO= 1
##$TYPE= <nmr>
##$USER= <dgb>
##$AMP= (0..31)
100 100 100 100 100 100 100 100 100 100 100 100 100 100 100 100 100 100 
100 100 100 100 100 100 100 100 100 100 100 100 100 100 
##$AQSEQ= 0
##$AQ_mod= 3
##$AUNM= <au_zg>
##$AUTOPOS= <56 >
##$BF1= 250.13
##$BF2= 250.13
##$BF3= 250.13
##$BF4= 250.13
##$BF5= 500.13
##$BF6= 500.13
##$BF7= 500.13
##$BF8= 500.13
##$BYTORDA= 1
##$CFDGTYP= 0
##$CFRGTYP= 5
##$CHEMSTR= <none>
##$CNST= (0..31)
1 1 145 1 1 1 1 1 1 1 1 1 1 1 1 1 1 1 1 1 1 1 1 1 1 1 1 1 1 1 1 1 
##$CPDPRG= <>
##$CPDPRG1= <>
##$CPDPRG2= <>
##$CPDPRG3= <>
##$CPDPRG4= <mlev>
##$CPDPRG5= <mlev>
##$CPDPRG6= <mlev>
##$CPDPRG7= <mlev>
##$CPDPRG8= <mlev>
##$CPDPRGB= <>
##$CPDPRGT= <>
##$D= (0..31)
0 1 0 0 0 0 0 0 0 0.06 0 0 0 0 0 0 0.0002 0 0 0 0 0 0 0 0 0 0 0 0 0 0 
0 
##$DATE= 1164204211
##$DBL= (0..7)
120 120 120 120 120 120 120 120 
##$DBP= (0..7)
150 150 150 150 150 150 150 150 
##$DBP07= 0
##$DBPNAM0= <>
##$DBPNAM1= <>
##$DBPNAM2= <>
$$ [...]
##$SUBNAM7= <"">
##$SUBNAM8= <"">
##$SUBNAM9= <"">
##$SW= 20.6930455092707
##$SWIBOX= (0..15)
0 0 3 0 0 0 0 0 0 0 0 0 0 0 0 0 
##$SW_h= 5175.983436853
##$TD= 65536
##$TD0= 1
##$TE= 683.16
##$TE2= 300
##$TE3= 300
##$TEG= 300
##$TL= (0..7)
0 120 120 120 120 120 120 120 
##$TP= (0..7)
150 150 150 150 150 150 150 150 
##$TP07= 0
##$TPNAME0= <>
##$TPNAME1= <>
##$TPNAME2= <>
##$TPNAME3= <>
##$TPNAME4= <>
##$TPNAME5= <>
##$TPNAME6= <>
##$TPNAME7= <>
##$TPOAL= (0..7)
0.5 0.5 0.5 0.5 0.5 0.5 0.5 0.5 
##$TPOFFS= (0..7)
0 0 0 0 0 0 0 0 
##$TUNHIN= 0
##$TUNHOUT= 0
##$TUNXOUT= 0
##$USERA1= <user>
##$USERA2= <user>
##$USERA3= <user>
##$USERA4= <user>
##$USERA5= <user>
##$V9= 5
##$VALIST= <valist>
##$VCLIST= <CCCCCCCCCCCCCCC>
##$VD= 0
##$VDLIST= <DDDDDDDDDDDDDDD>
##$VPLIST= <PPPPPPPPPPPPPPP>
##$VTLIST= <TTTTTTTTTTTTTTT>
##$WBST= 1024
##$WBSW= 4
##$XGAIN= (0..3)
0 0 0 0 
##$XL= 0
##$YL= 0
##$YMAX_a= 439385
##$YMIN_a= -462728
##$ZGOPTNS= <>
##$ZL1= 120
##$ZL2= 120
##$ZL3= 120
##$ZL4= 120
##$ABSF1= 16.47662
##$ABSF2= -4.216553
##$ABSG= 5
##$ABSL= 3
##$ALPHA= 0
##$AQORDER= 0
##$ASSFAC= 0
##$ASSFACI= 0
##$ASSFACX= 0
##$ASSWID= 0
##$AUNMP= <proc_1d>
##$AZFE= 0.1
##$AZFW= 0.1
##$BCFW= 0
##$BC_mod= 0
##$BYTORDP= 0
##$COROFFS= 0
##$CY= 12.5
##$DATMOD= 1
##$DC= 0
##$DFILT= <>
##$DTYPP= 0
##$F1P= 14.0000005364418
##$F2P= -0.99999901652339
##$FCOR= 0.5
##$FTSIZE= 32768
##$FT_mod= 6
##$GAMMA= 0
##$GB= 0
##$INTBC= 1
##$INTSCL= 1
##$ISEN= 128
##$LB= 0.3
##$LEV0= 0
##$LPBIN= 0
##$MAXI= 10000
##$MC2= 0
##$MEAN= 0
##$ME_mod= 0
##$MI= 0
##$NCOEF= 0
##$NC_proc= -3
##$NLEV= 6
##$NOISF1= 0
##$NOISF2= 0
##$NSP= 0
##$NTH_PI= 0
##$NZP= 0
##$OFFSET= 16.47662
##$PC= 1
##$PHC0= -46.48067
##$PHC1= 5.548149
##$PH_mod= 1
##$PKNL= yes
##$PPARMOD= 0
##$PSCAL= 4
##$PSIGN= 0
##$REVERSE= no
##$SF= 250.130011349604
##$SI= 32768
##$SIGF1= 0
##$SIGF2= 0
##$SINO= 400
##$SIOLD= 32768
##$SREGLST= <1H.CDCl3>
##$SSB= 0
##$STSI= 32768
##$STSR= 0
##$SW_p= 5175.98343685301
##$SYMM= 0
##$S_DEV= 0
##$TDeff= 65536
##$TDoff= 0
##$TI= <Analysis number 999999
Compound Code 99
Book Reference 9
Project Code 9>
##$TILT= no
##$TM1= 0
##$TM2= 0
##$TOPLEV= 0
##$USERP1= <user>
##$USERP2= <user>
##$USERP3= <user>
##$USERP4= <user>
##$USERP5= <user>
##$WDW= 1
##$XDIM= 32768
##$YMAX_p= 577440124
##$YMIN_p= -127050
$$ End of Bruker specific parameters
$$ ---------------------------------
##NTUPLES= NMR SPECTRUM
##VAR_NAME=  FREQUENCY,     SPECTRUM/REAL,   SPECTRUM/IMAG
##SYMBOL=    X,             R,               I
##VAR_TYPE=  INDEPENDENT,   DEPENDENT,       DEPENDENT
##VAR_FORM=  AFFN,          ASDF,            ASDF
##VAR_DIM=   32768,         32768,           32768
##UNITS=     HZ,            ARBITRARY UNITS, ARBITRARY UNITS
##FACTOR=    0.157963299565203, 1,           1
##FIRST=     4121.29707768151, 0,            0
##LAST=      -1054.6863591715, 0,            0
##MIN=       -1054.6863591715, -127050,      0
##MAX=       4121.29707768151, 577440124,    0
$$ Real data points
##PAGE= N=1
##DATA TABLE= (X++(R..R)), XYDATA
$$ [...]
21391 7569 12077 12937 20274 10049 -6003 -9865 -11705 -2647 6689 15094 11838 13444 15889 14613
21377 14613 -382 8719 12421 6164 -204 -6637 -8142 -6998 -2884 5263 -315 15857 19902 12947
21363 12947 14833 17339 13372 -701 -4646 -480 698 936 -538 5477 3285 -11353 -17325 -19921
21349 -19921 -4048 4300 12079 11950 12093 9037 17405 13613 5970 3077 9270 7058 10216 5266 11806
21334 11806 12286 11080 -785 1533 10348 24101 19851 3926 10530 11923 7767 1892 -3150 -1850
21320 -1850 -2923 7038 -1439 -12399 -17365 -20191 -9202 -3982 4540 7243 -8797 -19695 -13708 -10787
21306 -10787 -4851 -41 7689 5012 -10311 -10106 -8428 -14006 -21336 -21762 -11192 -12420 -18618 -10537
21292 -10537 -9386 -8577 10352 12758 -1133 -10075 1140 -1094 -17604 -19871 -6507 -2648 -10330
21279 -10330 -11649 -16815 -20391 -9010 -3695 -4422 7254 20857 21327 5896 -1207 -22382 -21366 -3998
21265 -3998 -7411 -10762 -15869 -21440 -18807 -19833 -14944 -22048 -16065 -4116 19364 19069 10842 2013
21251 2013 -772 10740 10452 3204 -10094 -13591 -2246 6448 565 -10498 -19281 -11450 -9328 -11458
21237 -11458 -9993 -14534 -24554 -22301 -7527 -9786 -19336 -17514 -24692 -24773 -29912 -22578 -15571 -9400
21223 -9400 -9524 -9387 -5182 -7830 -6172 -7254 -9442 -1686 2774 6339 6325 8824 11576 18432 27142 23321
21207 23321 18756 4291 -1809 -4623 -21365 -37337 -32382 -16121 -10151 -14334 -15358 -9801 2314
21194 2314 503 -5812 -2554 1435 13188 23238 28405 29818 13191 8753 11998 9062 1702 -2285
21180 -2285 -4599 177 -13779 -15439 -4283 -7201 -14736 -4626 6070 2635 -3308 -8350 -1905 -1818
21166 -1818 12938 7578 -3488 1460 -314 1733 7883 12127 10604 15013 22321 11276 4923 2599
21152 2599 8183 6916 -2651 4173 3562 696 6913 10514 13355 10627 8737 10408 8110 6756 12345
21137 12345 7580 3634 893 3042 -4127 -19406 -30132 -14751 -12747 -17911 -13052 -8928 -11743 -22714
21123 -22714 -21051 -4855 2670 7861 11810 7234 -786 -8557 -27703 -26012 -22428 -10464 -3132 3532
21109 3532 6252 10369 11364 -678 3807 4767 3115 4734 -3949 -13216 -14675 5409 21093 5014
21095 5014 -15126 -9658 -7789 -12154 -11966 -6638 -15949 -31459 -27026 -21828 -23224 -25629 -16574 -3407
21081 -3407 -7227 -19674 -18916 -14577 -3288 10334 5094 -8122 -5862 -6050 -8624 -1810 -7717 -5071
21067 -5071 -4590 -2313 2613 -13064 -6463 867 -5510 -4135 -7653 -18095 -12531 -2362 -665 -4713
21053 -4713 -13360 -24524 -37047 -19855 -9261 1842 9751 -3361 -28763 -17512 -1166 4653
21041 4653 13341 16691 7099 7459 5368 5868 -15952 -30853 -31704 -36064 -20274 -3038 5945 10842
21027 10842 14454 4785 1034 15303 11374 -3271 -1508 3211 -16041 -15104 -13949 -27951 -24063 -7880
21013 -7880 -20 4549 10863 3998 -9344 -3927 -1469 2740 7898 1825 -8619 1741 11138 11640
20999 11640 821 -5156 -1061 8704 19804 23658 14602 22383 13574 -4089 -18727 -16550 -8169
20986 -8169 2152 -9217 -10679 -5088 355 11582 5551 7211 7241 6777 7397 -6896 -8153 746 -3072
20971 -3072 -9632 -11799 -24858 -37652 -25183 -20674 -18066 -13007 -15820 -23975 -27788 -20656 -2317 -12692
20957 -12692 -28329 -26168 -22666 -17721 -11815 -1558 4452 13254 17395 8110 1253 -6694 -12468 -3185
20943 -3185 3431 3125 3103 4208 1468 -2615 -14275 -8505 803 12129 6531 -9902 -16851 -11927 -3111
20928 -3111 7590 6333 7699 3947 -2803 10967 11519 10895 -8044 -9114 -10211 -16239 -8391 -5373
20914 -5373 -4955 -2390 -843 6947 19867 30515 7591 -17547 -7574 1920 -10421 -12434 -13607 -2444
20900 -2444 11441 13909 8401 5563 7557 -656 -8823 -215 6500 -3288 3699 2706 -6451 794 -896
20885 -896 -4641 45 6219 3053 6067 9584 24661 29799 20868 4674 5966 1103 -9621 -10043
20871 -10043 -11157 -2016 -630 8584 13790 3793 -4267 7870 18097 3948 -690 1721 3261 -3991
20857 -3991 -12717 -15712 -14520 -16145 -1459 2306 -2734 -3490 -12115 1292 10421 12493 15474 206
20843 206 -5982 801 5886 7159 7379 5799 25151 21616 13319 10593 12533 8793 7293 -1400 -904
20828 -904 -3573 -9540 -20050 -20077 -11745 3728 -5123 4810 14339 18787 6803 -6001 -15024 -13748
20814 -13748 -16697 4868 -1381 -5230 -1885 -4700 4550 305 2985 2473 12360 25280 2500 -7850
20800 -7850 305 5360 -75 -10389 2684 21014 27547 16919 14303 21401 15570 369 -8234
20787 -8234 -12103 1837 18293 23309 10865 2024 -7103 -1164 -4973 -9970 -7654 -7050 -4760 2535
20773 2535 12070 20321 24608 7163 5406 3093 -3207 -10076 -27259 -33299 -24900 -16623 -6122 -8420
20759 -8420 -11676 -12615 -11006 -7981 -1185 8850 394 -5278 -9221 -7426 -2217 -5886 -2471 6607 20639
20744 20639 8616 1287 7281 12184 9900 6901 1585 15853 13408 19277 20233 828 -1728 6115
20730 6115 -572 -15726 -10552 3113 4762 7395 8737 -10391 845 21129 27219 19148 8348
20717 8348 -4414 -14278 -13744 2891 15779 10269 1762 1489 -11835 -14672 -10560 -1469 -8962 -16564
20703 -16564 -14193 -13752 -18167 -32003 -24913 -20827 -12030 -10999 5145 27960 39941 34743 16976
20690 16976 14582 6165 4965 8931 7012 24353 34892 23941 13297 8447 17578 19288 7536
20677 7536 8237 8620 5535 -1712 -8696 -1909 3346 5621 8117 2293 -8587 -11035 -20419 -26475 -23421
20662 -23421 -7802 1171 2079 -9168 -21969 -15846 -16680 -8924 -13112 -25629 -15790 -12401 -14771 -7369
20648 -7369 -12548 -13780 -13902 -28052 -25216 -19173 -11683 1034 11983 11898 -977 856 5215 -4857
20634 -4857 -13707 -18715 -12774 -8865 -15673 -16301 -12543 -3070 3601 15683 25077 19913 11596 -1040
20620 -1040 -73 5697 2792 -4403 -5481 -7092 -3748 13580 11547 3311 -10077 -2856 -5733 -5378 -811
20605 -811 631 -2165 5571 15403 5772 299 -6128 977 8203 25951 23532 10974 6079 -6343
20591 -6343 -7548 -4574 2507 8356 12069 8721 -2112 1959 4853 6125 13723 15111 6209 3657
20577 3657 -6536 -4203 -296 -1932 241 1428 -10131 -28140 -23103 1791 13447 16089 14717
20564 14717 6004 -5361 4114 486 -578 2354 -6861 6742 7275 -3716 -8141 3704 15033
20551 15033 8298 413 7868 20300 12703 18899 21911 17940 15960 17096 21619 24199 16622 15112
20537 15112 10286 -7940 -10896 -7768 -166 20488 29699 11089 2427 16886 24443 20364 9500
20524 9500 11722 34171 31155 25403 31468 46917 45357 29003 13093 -8215 -15145 -9466 -3899
20511 -3899 -8329 -4940 15190 25571 30564 47326 39717 22622 1523 -6364 -3395 -12128 86
20498 86 16879 20515 18875 11634 399 -10554 -6769 5271 10536 2169 -3641 -12719 -10850 15766
20484 15766 22674 8702 8112 12384 5861 2542 -4164 2281 -8765 -15345 -619 7187 5189 -3665
20470 -3665 -6237 120 10350 18603 27470 19147 14173 9538 20110 8847 -1023 -4102 8520 13336
20456 13336 361 -4320 4873 7661 15013 5417 680 -4289 -9261 869 -715 -4306 2221 9127
20442 9127 3362 1736 -3616 -13895 -16447 -12493 -7414 -2383 -1825 -807 -6290 -8790 7555 -5211
20428 -5211 -19788 -18645 -8281 -7645 -4761 1472 2078 -283 -22749 -28669 -9661 5221 -17420 -25145
20414 -25145 -2624 2232 -2283 2150 12290 4435 4793 3898 -7922 -12132 -16084 -14264 -6846 1506
20400 1506 3068 1991 -2327 3112 16160 20431 21076 17934 11768 3196 2733 9918 19592 19322 11588
20385 11588 -3075 -5545 8143 17390 5000 -2741 -5992 -10541 -12733 -12711 -19823 -21665 -26483 -16501
20371 -16501 -3409 427 3872 -1009 -1290 4308 9596 -1807 -6445 2489 4342 8717 -1223 386
20357 386 -536 -20816 -19620 -6858 -4332 7194 12826 15657 -6446 -16238 -9549 -10240 -19756 -23952
20343 -23952 -21008 -12679 6823 12332 11675 4341 -1934 -5510 3911 7806 3867 3850 4465 11505 -3122
20328 -3122 -10388 -17804 -21287 -13245 -3446 5785 12118 13990 4234 -401 5986 10096 13349 7184 -5826
20313 -5826 -14272 -23789 -20870 -883 18333 13136 14422 -3180 -17841 -6406 10274 12635 11653
20300 11653 3926 -8980 -14769 -8997 -11502 -6645 4414 14673 818 -13748 -3462 3016 -13768
20287 -13768 -21292 -16027 -12758 -15850 -2251 10049 12688 12861 10092 -792 5808 3957 4104 2325
20273 2325 -9189 -23442 -30848 -19444 -3284 -6006 -17404 -13127 -15160 1335 6814 257 7970
20260 7970 12426 17519 9960 5942 -3787 -4466 -15616 -25458 -16197 4951 2725 -7096 -9942 -22754
20246 -22754 -26065 -19065 -12802 -4848 5763 -7546 -24755 -30826 -21858 -15939 -17195 -6108 -13109
20233 -13109 -14736 -2395 -7465 -24689 -18805 -15151 -13666 -18879 -3304 -4884 2288 9334 -8732
20220 -8732 -14706 -3515 5535 -3054 -16286 -13208 -9629 -7626 -11512 -18121 -11370 -16159 -13124 -11899
20206 -11899 -8884 -17665 -15193 -2292 -4612 -664 -4705 -8778 -13699 -28700 -34348 -30600 -29278 -18306
20192 -18306 -8114 -7418 -2802 -1520 -9904 -8403 6707 6286 7194 20997 11794 -12171 -1258 2516
20178 2516 -4908 1476 -4150 -383 -11638 -14553 -11313 -8435 124 -603 960 4826 15262 19669
20164 19669 13102 2030 10710 17678 -3516 -5505 7891 4922 -129 7391 11534 6962 2364 1808
20150 1808 -3885 -925 15732 17913 10768 551 9156 5504 1981 7644 207 -4240 -12785 -14649
20136 -14649 -11359 576 10302 5841 4299 1426 -13400 -25038 -18296 -12169 -11766 -13839 -2449 3458
20122 3458 4632 12528 17411 8938 10219 12169 18905 1267 -2903 5600 10291 11925 26004 17990
20108 17990 1281 -17386 -13218 582 7832 10235 22614 19987 -93 -6083 -11039 -5225 -6582
20095 -6582 -3590 8687 32608 34109 23036 25220 32714 17052 8627 10311 15690 -2252 -8583
20082 -8583 -2857 12471 13135 3883 -4748 -8469 -2021 -132 7467 8393 2339 -4527 -12321 -24325 -28382
20067 -28382 -29772 -19337 654 14950 16653 13744 21860 25978 26938 12553 7645 8198 3471 2651
20053 2651 1918 1164 3831 3729 -1862 -9317 -18904 -25956 -17534 -7671 -9735 -9143 -9077 -7817 -9687 -2288
20037 -2288 -7772 -19059 -20880 -14400 538 11137 10729 13658 7014 2855 6879 9158 8709 2674
20023 2674 -1420 1489 -4378 -13857 -16655 -15558 -25618 -22342 -27040 -17589 5180 2789 -7569 -3135
20009 -3135 4614 -5790 -8859 7341 16985 18508 7753 10972 25925 24090 -261 -8189 -24270
19996 -24270 -38144 -20109 -8780 -8238 131 8311 5747 -1732 2236 5634 15746 8094 -1603 -10414
19982 -10414 -19285 -8638 2103 -3882 -12609 -18247 -9638 -6122 8927 13597 1990 1538 5985 3535
19968 3535 -690 -1408 5023 15590 15975 10872 5254 -11560 -3061 1150 19668 22397 19950 26685
19954 26685 17267 4901 979 -6170 -20942 -31423 -15092 -2035 -5876 -4990 -3550 -11837 -30163
19941 -30163 -32974 -25566 -27071 -21600 -11621 -9938 -9981 -2113 -20176 -27110 -22501 -14953 -14923 -17388 -11908
19926 -11908 -22777 -25093 -32492 -23253 -3206 -2291 -2849 811 12489 10458 13304 9593 9485 16468
19912 16468 16474 17533 18506 8123 -4551 2918 19397 14868 475 -8601 5 -2032 1037 -1252
19898 -1252 -10667 -10428 -9637 -17329 -10614 -604 -2534 -1255 6444 3892 3381 -673 7948 18146 18046
19883 18046 4837 10315 10065 -5236 -627 20982 26043 33937 34810 24967 8902 2239 250 -11114
19869 -11114 -16315 -4151 -1346 -4676 -8707 -3471 12947 8954 -1835 -5436 -14660 -1162 4985
19856 4985 4937 11144 12747 28817 11113 -3952 -2868 3349 3189 10515 11281 1990 2928 -5392 -11341
19841 -11341 279 -1421 -647 6825 10426 14014 11437 8285 5783 9562 6465 -884 -17810 -26115
19827 -26115 -15518 -5894 89 19397 8692 209 13838 3417 -11671 -9639 -5986 -11672 -15794
19814 -15794 -11533 -6843 -9614 -17643 -23083 -15283 -1454 14163 23105 17458 10685 -4880 -18981
19801 -18981 -18091 -9843 5687 -2514 -6023 -7579 -11943 -9271 -3172 7435 2984 -12768 -11862 -16495
19787 -16495 -14577 -8900 -3750 -10602 -16170 -14056 -13764 -16324 4682 5760 -11362 -9061 -969 -804
19773 -804 -4995 -13141 -15209 -18282 -9924 3230 429 -10016 -8041 -431 2174 537 -182 -3635 -2389
19758 -2389 -886 -6730 -23531 -13428 -1802 2381 5544 10881 13216 22475 832 -16799 -9274
19745 -9274 523 -5459 -15862 -12577 755 11574 7746 12146 14669 32440 30723 21056 16404 15027
19731 15027 12747 11978 16142 16918 3600 4335 9236 1377 6997 -309 -14875 -31062 -32808 -26174
19717 -26174 -14801 -22747 -23391 -16144 -1819 7877 11401 7984 3811 353 3493 9790 3066 -11527
19703 -11527 -22107 -25553 -14016 -3367 -6994 -4298 -15731 -32654 -33749 -22389 -26609 -24970 -18619
19690 -18619 -20662 -12471 -9283 -8086 -20932 -17754 -10667 -27646 -22175 -11462 -7606 -11875 -21560 -20006
19676 -20006 -10766 -10499 -16460 -28671 -29963 -12509 -8970 -12127 1250 -5901 -22287 -9770 1827
19663 1827 12613 7950 -4201 2452 -3087 -10653 -10168 -9103 1923 -19486 -32708 -26539 -14301
19650 -14301 2877 3695 -1873 -5360 -1228 3038 9724 23318 10838 5257 -338 -20301 -26025 -26207
19636 -26207 -12038 -13953 -18924 -16406 -24314 -33263 -11943 -6418 -3161 -16299 -20153 -20256 -14803 -3332
19622 -3332 -12936 -14943 1954 -1605 -1411 4448 6372 3084 1938 5296 -1471 -6344 -3610 -10930 -7426
19607 -7426 -5787 -13710 -14542 -40 7513 13314 14542 8811 4951 204 -4093 -2891 4697 8594 2416
19592 2416 3538 2399 3513 7487 7650 11394 11664 7692 5081 13568 9496 -3024 -9094 -10475 -15227
19577 -15227 -17342 -15337 -14644 -12880 -3702 -464 -9273 -26767 -28038 -21713 -14828 -4434 955 3246
19563 3246 8195 5474 8165 17201 24483 23970 19588 3092 -5781 -11032 -17917 -24975 -20109 -10537 357
19548 357 3252 7322 7132 -2465 793 -4676 1202 7282 970 -2278 1297 3538 -1683 -12224 -22407
19533 -22407 -20007 -14370 -5889 -8767 -5083 2508 -6832 -4422 10210 -2123 -8697 -15332 -6126 -1114
19519 -1114 3107 14508 10453 14354 9849 -8451 -15717 -13587 -4042 -12348 -14570 -2715 2116 4360
19505 4360 -7306 -5638 -3051 -13297 -17967 -21109 -10818 -5260 -15090 -19268 -12918 -5646 -2741 4674
19491 4674 3283 -2596 -11779 -13378 -13561 -5529 -6941 -4367 583 -1587 59 10358 18434 14936 -1662
19476 -1662 -2490 -2912 -19803 -23605 -29798 -18226 -20383 -9242 4825 -7783 -24256 -32542 -29466 -19515
19462 -19515 -12438 -11522 -13697 -6152 5121 -1129 -6239 -3660 -15434 -24405 -11547 1405 9171 7210
19448 7210 8640 16925 15939 -5749 -10095 -12138 -740 5140 18789 19127 1451 7057 15281 18095
19434 18095 17805 19161 14664 -3919 -3437 56 -5316 -1505 10681 8863 9189 11163 6809 -845 -14232
19419 -14232 -19385 -20403 -11323 -3184 225 1979 -2450 1761 4429 14886 24080 19208 5787 4223
19405 4223 6070 -444 -4246 2260 11632 9178 2600 5250 -4563 -18175 -13904 -728 1095 6177
19391 6177 5262 -83 259 -4353 -3721 -4695 3862 -5707 -10917 -13632 -19744 -18689 -1799 -5137 -9200
19376 -9200 -10197 -15245 -17731 -19730 -25600 -33358 -43471 -41349 -41651 -35193 -22303 -17993 -21408 -15672 -5899
19361 -5899 9961 8243 8802 12300 1921 -9186 -13259 1537 14902 26980 41330 28363 25151
19348 25151 13455 13079 18507 15737 9294 13800 12933 9872 7851 -674 2772 6134 10202 -1116
19334 -1116 -13745 -23412 -23452 -27583 -35100 -32600 -26227 -16915 3822 10955 12024 2195 492 -545 -8365
19319 -8365 -21390 -33508 -18460 -8492 4166 12627 1162 8246 375 -15310 -16165 -16021 -20271 -24538
19305 -24538 -21917 -20463 -9032 -7472 -12404 -15009 -11239 -12214 -2526 7677 4588 37 4038 -7803
19291 -7803 -9023 -3558 15231 12178 413 2820 -2073 4492 5792 13015 4254 -13016 -29255 -15588
19277 -15588 -5242 2867 5523 2232 4954 9961 10825 -1792 -2235 -917 -13536 -17501 -8333 -8749
19263 -8749 4440 13537 -4122 -5600 -5411 -19598 -16240 2956 4489 -7141 -9480 -23240 -30921
19250 -30921 -37759 -26300 -13390 -6729 -1068 -4284 3932 -1116 -11431 -13952 -14805 -18285 -20871 -10545
19236 -10545 -5418 -10363 -3656 3211 -9018 -21990 -25806 -24586 -17483 -5106 -721 -4796 -12597 -16383
19222 -16383 -8043 10 8112 9757 -5512 -1877 6139 10564 8605 1365 -714 -109 -9443 -13046
19208 -13046 -13744 -19290 -14228 -17150 -8120 -8139 2406 10641 5451 -5599 -273 -1821 -9488 -11318 -20352
19193 -20352 -13675 -3344 -13877 -18522 -29263 -16524 5632 7716 4834 1141 18698 27821 24276
19180 24276 6140 7623 2518 675 6289 19602 23829 14697 -1391 -8423 -8415 -22361 -12476 2813
19166 2813 -4496 -20323 -22615 -17737 -9646 -10658 1075 -4289 -6116 -9603 -13528 2939 -2000 -6965
19152 -6965 -12495 -14777 -15107 -20533 -27854 -31431 -19640 -1156 3371 14810 13868 9422 3131 -23666
19138 -23666 -18650 -207 7054 8222 17095 10311 -4303 -11662 -23328 -24762 -20229 -1256 2590
19125 2590 644 -1156 -15658 -25092 -13227 -7948 -11606 -23865 -15545 -4099 -4753 -8932 -7384 -7705
19111 -7705 -12326 -17781 -28493 -28052 -15305 -9502 -4161 10192 7526 3275 -10981 -31813 -35538 -17368
19097 -17368 -13147 -5168 10003 8751 3691 -1550 -9252 -13238 -7637 39 -2375 -6407 -24722 -19979
19083 -19979 -18644 -30892 -18032 4149 8849 5770 -1083 4885 -422 -11869 -23314 -23240 -7792
19070 -7792 -5632 -6665 -4686 -769 4788 11542 -4516 -11335 -16724 -25161 -23340 -16174 -9098 4466
19056 4466 14778 7325 411 -2269 -715 -973 -9461 -8475 -7741 -15083 -11024 -18663 -24096 -21338 -5381
19041 -5381 2593 -1819 -3955 -14052 -15095 -7627 3368 2729 -3500 4376 18651 13818 14504 -2707
19027 -2707 -11864 -6220 -3584 -2151 22 20345 28062 26166 10617 -12226 -18678 -27553 -20403 -6359
19013 -6359 2931 5016 2967 -47 -2178 4678 6334 9975 10801 7685 2470 -1645 4825 6965 8839
18998 8839 -9124 -16744 -16907 -11291 -2952 -10113 -13397 -23127 -6841 10297 20416 24685 11677 11661
18984 11661 6135 -7428 -9691 -21297 -31244 -35285 -29784 -24868 -16537 986 -13839 -14676 -6153 -13903
18970 -13903 -6927 -3415 -9255 -12523 -10247 3192 7647 -3985 -6226 -15577 -23678 -21866 -8041 619
18956 619 -437 -5829 -3900 -15 4543 -6046 -10035 -14989 -14986 -5957 3212 6635 12291 10827 -7786
18941 -7786 -11101 -8492 3238 10820 -1020 -9507 -30498 -40092 -34228 -32929 -30444 -25560 -9936 8593
18927 8593 -3841 -11230 -11067 -12087 -22372 -31633 -29106 -17750 -8670 -12493 -9239 -16442 -23576 -35361
18913 -35361 -34528 -28783 -23908 -10203 -4934 -9163 -19626 -6663 1941 1886 -2334 -11709 -4380 8982
18899 8982 393 5199 2243 3102 -5071 -12745 -17696 -19008 -9235 -1621 -1080 -2970 850 -3808 -14115
18884 -14115 -11025 -14558 -22841 -14901 -23719 -36655 -46593 -46776 -40569 -23163 -18137 -3726 4868 -264
18870 -264 -11026 -5629 4595 999 8916 21564 28746 34280 30220 32897 25941 13314 3906 -5640
18856 -5640 -17710 3338 14831 -1356 -10676 -17525 -12471 -6326 -2060 -987 -6157 -16219 -21438
18843 -21438 -16309 -24048 -24256 -3751 11619 23284 17977 12003 16027 13868 7206 8374 14588 19136
18829 19136 9610 19514 8108 7557 13796 9753 11460 12027 2064 -6761 -10325 1309 2754 1898 8326
18814 8326 15212 6654 -4839 -6766 -5620 -12589 -18208 -15677 -15183 -19786 -11848 -6128 -9846 -8205 -8028
18799 -8028 -7295 -4143 3528 2965 1839 1971 9047 -3146 -3853 5216 -1528 -1285 -5240 2418 7757 -2738
18783 -2738 -9517 -3542 -5867 -11395 -12272 -11862 -6923 5453 -13279 -28165 -15369 2614 32692 65367
18769 65367 90975 101990 99896 87493 57957 47032 32530 25502 21529 10500 -4538 -4363 -4583
18756 -4583 -8592 -11679 -895 4719 14139 14916 11963 9356 4539 963 410 2639 4631 11810 6944
18741 6944 6856 4218 -3445 -104 14834 20890 3614 -24900 -32205 -24032 -11231 -7029 -12567 -12077
18727 -12077 -9604 -11949 -12297 -2830 3286 5106 17497 22633 13830 -3323 -6133 -6008 -10571 -22414
18713 -22414 -25623 -14731 -2072 632 -196 8965 6423 7097 3112 3937 -8433 -18611 -32183 -16762
18699 -16762 -7933 -477 4714 6205 7032 -883 -9971 -14744 -19512 -16798 -17413 -16532 -1414 -719 -15970
18684 -15970 -14501 10009 21577 12809 -3573 -15481 -14023 -2328 4452 115 -9960 -19163 -19630
18671 -19630 -15760 -6995 6043 22719 15456 3913 9369 3501 -10316 -12174 -13538 -17794 -16752
18658 -16752 -2997 -1490 -5434 -8217 -15329 -22083 -2616 -2480 -7997 -13112 -1468 8928 12114 3434
18644 3434 -2177 -12613 -15072 -11187 3932 3012 -13786 -10058 -6776 -4575 -10279 -16993 -27090 -30446
18630 -30446 -17054 -11765 -23642 -24042 -14848 5490 8969 3337 -7059 -8273 -5781 1571 5727 -6375
18616 -6375 -16721 -3691 -7149 -13889 -24929 -30611 -16073 -6312 -20110 -31492 -14815 -15894 -6218
18603 -6218 -8133 -5163 4124 -2467 -10367 -20066 -23333 -15838 -16260 -24536 -16260 -9989 -4416 -5970 -7343
18588 -7343 -6794 -9503 -16149 -11332 -17384 -16560 -10625 4326 6050 8398 24080 12546 5865 15404
18574 15404 12086 4974 890 -9710 -13108 -22131 -21899 -8606 -7510 -6455 -4654 -12038 -19176 -19422
18560 -19422 -17955 -20767 -12459 -1374 2834 6982 12146 2211 -13053 -14766 -5893 -7266 -543 -1743
18546 -1743 -7332 1969 3898 3597 -4447 -10394 -7724 -10418 -22609 -30660 -21609 -21899 -12965 1077 -1910
18531 -1910 -8961 -2014 11863 10338 5331 -5446 -9914 -16936 -9583 10066 16045 6254 1561 -222
18517 -222 618 1829 -4931 -13395 -27706 -24020 -21845 -15471 -607 14849 23419 9644 4150 -1472
18503 -1472 -5607 -9999 -10076 -6423 -16500 -22948 -26755 -26885 -16436 -20096 -20514 -3016 14598 15631 10023
18488 10023 9430 799 -5665 -15113 -6200 96 2438 -816 6305 -408 -3938 208 -1269 -2026 604
18473 604 3895 -4531 -7845 7549 6317 106 1848 -1346 -12099 -24493 -31065 -29093 -23276 -9703
18459 -9703 -15258 -13847 -3031 7027 1484 -9235 -6114 -11249 -11962 -14723 -4104 1910 -4493 -5489
18445 -5489 1352 952 -8652 -18287 -12744 423 -2815 2237 11384 885 -6227 -6996 -8269 -11812 -9688
18430 -9688 -21409 -30095 -40760 -35289 -34070 -25751 -19125 -8417 -3644 -8458 -4284 -3525 -4875 -2384
18416 -2384 -10009 -16630 -13239 -80 9833 16124 15849 19324 26056 14654 10365 -4954 -8592 -14753
18402 -14753 -7050 -15405 -12990 -3677 300 9935 16589 10285 7288 1408 2739 215 -9411 -11597
18388 -11597 -4107 9436 13479 13584 8130 11391 15389 23180 15467 2363 -1574 5029 1181 1734
18374 1734 8547 11618 11945 9349 -3294 -16257 -8003 3087 13421 12795 22490 20432 7026 8340
18360 8340 14837 14372 3047 -13761 -7068 7853 18017 15590 5077 -11519 -21441 -17948 -4045
18347 -4045 3647 10299 10078 9950 4711 -1515 -14491 -14120 -5320 2202 8794 1842 -14453 -18058 -6085
18332 -6085 -4192 -16225 -21931 -6984 9993 19577 913 -2545 -4808 -2601 20780 22091 12952
18319 12952 5661 11833 12373 -532 -282 -5347 -10274 -26854 -32049 -15064 -4310 -2596 -6313 -9685
18305 -9685 -11541 -13836 710 -3400 -6998 7800 10694 5231 -148 -1047 -10488 -19956 -30508 -18225
18291 -18225 -2688 7313 15550 4919 -5871 -18812 -8819 -7531 -19371 -10458 -2864 -12332 -3345
18278 -3345 9563 15002 18484 18320 14458 21495 14271 9519 12284 25179 24174 13035 15473 23728
18264 23728 4923 34 2718 -3438 -9448 -5879 474 16148 11538 207 -3980 -6821 -8273 2725
18250 2725 7986 2850 10051 11190 10003 10881 17530 5216 -10152 -9733 6154 21320 14888 17972
18236 17972 23751 27037 31690 17410 4785 854 -12578 -26097 -19989 5987 18085 12289 255
18223 255 773 8736 8895 -40 -1827 -4620 984 5126 6400 1851 5076 3863 -7976 -14424 -11511
18208 -11511 -1637 -3742 12652 17906 10630 -184 -2385 7292 18263 25092 31967 23308 8654
18195 8654 15746 19177 14441 1977 -955 2729 -3236 936 7380 15415 22650 26928 30545 31330 30669
18180 30669 30696 24845 11241 26139 30477 27170 20117 16670 10093 13857 40124 43630 38095 30671
18166 30671 23085 21910 26883 33854 29843 37817 32636 33314 39857 43208 39928 39618 46593 45648 31455
18151 31455 36275 66265 84303 92071 87178 89315 89095 87275 74610 56929 73089 86313 99638
18138 99638 94844 111187 122456 137330 135939 131039 148891 172111 190719 220337 251900 267421
18126 267421 288735 327895 386143 430791 500525 591858 706991 848984 1055872 1356370 1808942
18115 1808942 2529819 3693883 5558897 8536257 13051573 18070222 21235114 19825766
18107 19825766 14493735 9691587 6575650 4641025 3410638 2644704 2160765 1859871
18099 1859871 1639680 1492230 1368949 1266867 1204420 1147060 1088112 1032507 984721 925108
18089 925108 852039 790812 724915 687512 641164 603381 574257 550187 530812 487128 463809
18078 463809 446848 412058 389623 375902 382193 373843 355226 351960 356488 350614 347474 326804 306462
18065 306462 307536 302161 285108 260167 271300 273624 269462 262925 268428 260948 243499 233615 230480
18052 230480 201500 176429 173558 164074 164676 174202 168587 166608 165103 156361 141105 149446 158299 159311
18038 159311 151817 135369 126306 124133 121421 121047 120835 121877 118894 103754 90050 83368 87048 66328
18024 66328 52545 64426 78957 82937 68734 54108 56099 63095 66163 75185 78477 71058 67420
18011 67420 79192 91545 103396 91308 79521 82874 90643 87274 80942 80824 72323 74623 70739
17998 70739 55584 36842 42414 54780 65206 64834 58699 64840 81024 67165 64670 73521 73355
17985 73355 67033 64322 62859 65318 69472 68913 69126 74678 71122 48923 41573 55083 57258 56261 39118
17970 39118 33449 33138 22334 15920 10628 23079 28352 17688 15266 21331 28379 23240 18035 24525
17956 24525 25023 20341 14302 14945 14824 17042 7673 18237 18689 19728 25073 19304 13859 10795 13802
17941 13802 16675 24225 24893 15033 4566 4478 -2387 -973 6920 11979 7402 14739 22792 19342 10425
17926 10425 -3915 2240 -3066 -401 -4026 -1446 12072 -1232 -9286 2842 18994 26072 21841
17913 21841 25249 26988 29582 25081 15084 10951 9137 9153 12647 15052 1608 -3465 8139 4967
17899 4967 3558 3223 1915 12524 16444 7552 -10640 -6227 9921 5516 3264 -15024 -14427 -11336
17885 -11336 -21234 -15609 8517 16616 15990 7993 9816 5076 -3064 -873 -5 2465 6156 16587
17871 16587 24895 15175 21530 16721 7949 4115 804 -5180 571 3676 10971 18506 18320 15086 11441
17856 11441 9696 8851 -1026 10238 17306 10116 5716 5275 -289 5206 13522 13177 17802 16538 6189
17841 6189 -5749 -17977 -12056 3079 263 4177 10616 12202 7772 9350 2900 9481 6518 -10975
17827 -10975 -19780 -11760 -7717 -12824 -14581 -14839 -9069 -2721 -6003 -16425 -13750 1319 -2195 -14895
17813 -14895 -20491 -15561 -19095 -24588 -29098 -28222 -14916 957 -870 -6573 -4754 5892 12200 102
17799 102 -1494 -794 -12124 -14541 -14061 -23584 -20823 -14006 11813 9799 1843 -13151 -34886 -31849
17785 -31849 -11919 -7888 -9500 -826 7102 6606 3564 -3910 -5951 5157 4767 -4971 -5140 1838 12523
17770 12523 2309 -158 -5791 -9398 -8194 -15067 -14449 -13277 -1745 2968 -2649 -13426 -18831 -13195
17756 -13195 -13255 -9591 -4820 608 -2088 -3220 -4809 -17303 -26375 -21366 -23240 -29210 -21917 -18795 -23645
17741 -23645 -23490 -13953 -19543 -21570 -24011 -17106 -14764 -30569 -38742 -35532 -26841 -15839 -14018 -1889
17727 -1889 3112 11019 12666 3026 1795 13955 16519 2119 -16182 -3108 1877 8561 -5764
17714 -5764 -6956 902 3786 5797 8084 9301 105 -9858 -1431 -1272 -12649 -28257 -33409 -28649
17700 -28649 -21103 -3805 -596 -8414 -4115 13817 12940 -1899 -6220 -15832 -17387 -22602 -25308 -19881
17686 -19881 -5492 -16425 -34169 -38320 -23572 -12833 -20268 -10287 -4308 -5107 -9060 -4776 339
17673 339 3840 11420 16853 5706 426 8896 12173 11233 19693 18016 4203 -7240 -14445 -19654
17659 -19654 -24030 -16279 2627 5368 13634 12627 1578 -17000 -18062 5816 8681 14250 32000
17646 32000 26076 6864 8156 3501 -5085 -3315 -4494 -10579 -20450 -27461 -29473 -20134 -9618 -9962
17632 -9962 -7308 -2296 -6206 -17792 -13258 -13902 -5958 178 3127 2584 4429 359 -15449 -6709 -11111
17617 -11111 -11341 6225 2995 4619 5750 5384 -2191 -8601 2415 7142 13961 -229 -6329 -2343
17603 -2343 -10639 -10398 -6707 -3917 -10031 -13688 -25986 -24824 -13502 1671 8456 -3220 -18303 -13081
17589 -13081 -1628 -1193 -8980 -8491 3075 12071 2743 -11136 -7544 -12161 -6185 5632 8182 8523
17575 8523 2681 -13377 -20551 -3877 3693 -3017 -3196 -5311 -14658 -19861 -23422 -20970 -21485 -21646 -19713
17560 -19713 -16057 2338 2780 -6899 -9128 -1680 11322 4233 -8040 -23629 -29998 -29735 -28449 -34292
17546 -34292 -36351 -33283 -21450 -21202 -10811 3235 7113 -11914 -17361 -19508 -9108 -4651 380
17533 380 -5847 -10217 -969 -10752 -23345 -13703 -8440 -8836 5714 17458 6033 -10847 -16098 -11461
17519 -11461 -18800 -15880 -14209 -17973 -22375 -20153 -19144 1502 -3297 130 2480 -13236 -23801 -15819
17505 -15819 -13183 -27813 -40927 -38822 -16275 -4190 -2951 9622 20117 15928 16474 17741 10658
17492 10658 1410 -7521 -11939 -12872 -9245 -7146 2223 -1686 -8750 -12871 -10813 2665 7311 3714
17478 3714 -4765 -6549 -2357 -17237 -15820 -11587 -8929 -4608 -15713 -17286 -6666 -8360 -9884 -12091
17464 -12091 -8855 -7967 -12644 -9335 -1580 -7813 3088 6922 2705 7089 -3030 -8953 -7717 -3493
17450 -3493 -6991 -12513 -7808 7895 22531 47683 66050 96700 121391 126298 102158 68328 49514
17437 49514 25717 10544 11144 2182 -6685 -635 3289 12282 21459 18232 -1799 -13840 -22455 -2280
17423 -2280 9924 7064 -320 -650 -1834 -9498 -23453 -22336 3584 4186 7094 9079 4288 7545
17409 7545 3222 -4275 -6493 -5313 4837 1448 -9582 -32300 -31479 -19707 -14663 -30126 -37439 -37166
17395 -37166 -34112 -36105 -35952 -38094 -30916 -15030 -18226 -18738 -13841 -11026 -14089 -10143 895 -16011
17381 -16011 -20249 -15814 -11881 -8694 -14369 -14407 5863 4447 1347 -5281 -12714 -6214 323 -10883
17367 -10883 352 10905 -4198 -18314 -16298 -11182 -22755 -30088 -21773 -141 -7164 -13686 -10828
17354 -10828 -10727 -5510 -12275 -11575 -13705 -26722 -20341 -22781 -19879 -28248 -31272 -29731 -23164 -26615 -23579
17339 -23579 -17553 -20763 -31515 -34123 -36649 -26058 -5992 7235 -8141 -8689 -7885 -1077 -6823 -2304
17325 -2304 2297 3824 -2268 -4040 10867 18376 25738 28330 20695 17266 12559 14721 12335 -958
17311 -958 -23590 -33054 -20711 -13189 -990 -54 -6971 -9554 -10820 -6144 -4711 -12330 -27066 -25401
17297 -25401 -19778 -14812 -15464 -26420 -8060 5862 -3430 -16132 -14080 -4192 -6041 -8716 -13314 -6655
17283 -6655 -8386 -25578 -31097 -21601 -1616 7146 -7018 -9019 -4255 2437 11498 11899 3780 3040
17269 3040 4971 7234 -1311 -13856 -9641 -14345 -13422 -17263 -10342 -7608 -21667 -29646 -32145 -30835
17255 -30835 -9531 -10646 425 3094 -3447 -11589 -21472 -16519 -7578 -4386 -11311 -15511 -8709 -3321
17241 -3321 -21289 -17146 108 7897 -5788 -9307 -20538 -28406 -23712 -9819 -6306 -1781 -11725
17228 -11725 -21707 -12568 -18812 -20971 -34012 -29515 -31002 -24916 -23835 -27616 -24004 -40104 -44820 -33292
17214 -33292 -19187 -27118 -34138 -31588 -40134 -40734 -18249 -9740 -28425 -40302 -52161 -47300 -26830
17201 -26830 -12348 -8506 -2180 5883 8694 17309 14965 2142 -9486 -19155 -23912 -22352 -11742
17188 -11742 1146 3161 1669 -6196 -7406 -7155 2932 8859 3991 -909 -5924 -15893 -26435 -25763
17174 -25763 -17438 -6717 -11980 -21260 -24796 -20780 -15989 -7062 -20813 -29290 -16126 -11414 -16188 -13351
17160 -13351 -10080 -3564 -6542 7221 15368 17590 7199 6566 -3453 -9242 -6688 3394 4361 4681
17146 4681 2315 3266 -1776 -14847 -9262 -1552 12580 11255 1626 -4563 -4004 -12945 -11530 -13708 -9648
17131 -9648 -330 -2017 3573 14392 7418 2632 8994 4795 2002 4799 16469 21739 19437 3867
17117 3867 -13040 -18282 11051 33989 26127 6446 4149 10312 1727 -1502 -20607 -26509 -21643
17104 -21643 -14853 -8079 -10756 -8378 -1935 -1568 7070 8637 1574 -5866 -5980 -3428 -12591 -17931 -15572
17089 -15572 2036 -5888 -26421 -33256 -32451 -25354 1080 7118 927 -7637 -11514 -10097 -14610 -1770
17075 -1770 -7328 -10292 -15846 -24503 -24240 -29470 -19679 -16397 -14739 4097 15551 8893 8561 13481 6802
17060 6802 3428 -965 22 -5996 -17021 -25056 -20200 -15058 -19504 -19169 -8485 9735 8753 -6795
17046 -6795 -16398 -10154 -11432 -18382 -26900 -27143 -28635 -20547 -11152 -7611 -12886 -18044 -22353 -14926 -9360
17031 -9360 -2714 -7478 -1821 6257 -4826 -18842 -36366 -28598 -21893 -16015 -14232 -15139 -3257 4894
17017 4894 4496 -4805 -27204 -29469 -27032 -29642 -24681 -18012 -4275 -6733 -11844 -23014 -34263 -43157
17003 -43157 -29071 -17333 -11515 -16812 -13673 -3889 -1968 -1629 4504 13806 19681 11778 9217 2192
16989 2192 -9220 -15300 -12111 -15231 -6493 -182 -1612 -4330 2520 14006 16570 7487 148 -15564
16975 -15564 -17884 -13755 5487 859 4782 9964 -5131 -4041 -371 10864 -5859 -7558 -14714
16962 -14714 -19570 -8622 -7550 6997 3456 -3298 -9031 -18635 -15743 -12201 -13827 -16900 -6235 -5437
16948 -5437 -12656 -25210 -24555 -30504 -17960 2875 5282 -14301 -16488 -3069 2912 2599 -11282 -25806
16934 -25806 -18822 -16133 13299 3216 552 -607 2416 10477 3935 9761 9220 1342 -6400 -17853
16920 -17853 -7362 -4819 -15291 -13761 -7711 4631 3881 568 14337 -502 -17864 -16951 -1846
16907 -1846 6912 6189 5946 13165 6122 -3405 2246 2850 -7024 -16798 -29088 -22561 -17856 -4382 6065
16892 6065 18227 22115 21984 22222 9430 -6314 -24863 -14955 -6542 -2632 1300 4873 13787 4561
16878 4561 -2268 498 -5812 -18181 -17988 1653 13848 13510 5984 -6397 -21434 -22866 -15739 -1778
16864 -1778 5607 4342 10810 10521 -991 -6397 -5644 -4319 -11363 -6849 -13029 -19806 -20907 -19086 -14759
16849 -14759 -13533 -3133 6196 4880 -1120 -6387 -5075 952 -11088 -12369 -12741 7189 6103 2486
16835 2486 4325 328 -885 -1698 -16151 -20035 -23067 -6753 8270 13491 6046 -6057 -10669 -23535
16821 -23535 -21694 -17490 -21729 -33375 -41374 -44787 -33903 -27112 -7583 5298 2499 -690 4861
16808 4861 3608 5604 9185 3233 8149 9811 2636 -10233 -16684 -11082 -12692 -20348 -22891 -5434
16794 -5434 -6169 1524 4604 -5117 -18547 -16876 -11310 -5406 -4173 -13215 -11228 -24551 -28139 -18662
16780 -18662 -30804 -29343 -23359 -32466 -19036 -11982 -16976 -22890 -19068 -12329 3994 11993 8863 15548
16766 15548 18978 13301 922 -10991 470 10619 8589 -247 -15337 -12350 -5059 151 2448
16753 2448 -359 -153 -180 4687 19755 21257 5824 15615 17832 11548 3035 -195 -4878 -6230 -12665
16738 -12665 -7661 -3749 2834 -471 -1760 -5295 7831 3429 2407 4820 4652 12489 6597 5603 14
16723 14 -8119 822 11675 5520 14262 23821 12311 -11982 -22022 -27968 -8615 2809 7075 2324
16709 2324 -8118 -12428 -16590 -19358 -20035 -13734 -21068 -29190 -30021 -15204 -6454 289 -910 -2280 -10759
16694 -10759 -14316 -8021 -19352 -21927 -20314 -11892 -15396 -6762 2140 -11146 -12569 -3071 9071 -2020
16680 -2020 -2043 13885 9612 8104 2294 -10538 -15032 -26878 -13082 -7698 -13113 -25296 -27417 -21799
16666 -21799 -14791 -2469 -4526 661 13199 16242 4592 1316 11504 5105 640 -5971 -3734
16653 -3734 2026 -7578 -13016 516 558 -3026 -11878 -14171 -8442 -1813 4123 3220 1144 15450 10302
16638 10302 825 2356 16067 7270 1015 5116 -9464 -18754 -21222 -4255 1748 -8827 -19768
16625 -19768 -18530 -18904 -10041 2843 3614 1443 282 86 4932 4874 4650 6151 8858 13977 9441 15610
16609 15610 21900 11749 10334 6990 10965 1308 9937 12615 11607 4322 -2332 -3119 3800 2832 -5741
16594 -5741 -13674 -7416 1080 471 7082 11692 -3965 -21088 -16339 -9137 -7758 -9943 -5876 3496
16580 3496 12342 7949 12247 4818 -234 6313 9545 12843 10526 -4726 -1992 5290 -3530 -13362
16566 -13362 -19449 -18681 -11892 -7546 -7721 5831 20287 8361 3178 -3759 -13467 -13334 -12307 4301
16552 4301 18745 21395 3817 -12749 -11260 1357 18773 15027 -3384 -2430 1351 -20674 -10285
16539 -10285 -9580 -24289 -32047 -27949 -30823 -37840 -23306 -6932 -5757 1704 -1287 -9902 -8042 -19800
16525 -19800 -20454 -3326 -430 -1181 8 -4396 -4109 2070 13203 10420 18081 21425 14702 7591 17403
16510 17403 7517 -5146 -3565 -8357 -20436 -14266 -19987 -21423 -19225 -18383 -10618 -12093 -22053 -20030
16496 -20030 -19259 -7301 717 -1869 8093 5504 864 -6113 -23426 -28882 -26577 -19473 -15515 -13062
16482 -13062 -10376 -8627 -6192 14858 14338 9362 7477 4192 -7263 3167 5765 22685 19672 16808
16468 16808 23439 18224 -4627 -12289 -5152 -16020 -12428 -4520 1233 7618 1341 7588 10144 17590
16454 17590 20142 18031 17054 29965 38569 45347 49200 41192 35036 52048 82655 121822 142729
16441 142729 159513 163688 147846 135764 127730 132920 164404 207196 258435 310319 342062 332727
16429 332727 289560 242235 220870 205995 212319 250790 298071 323817 333393 304441 251717 209653
16417 209653 199309 185923 169812 165712 183493 206448 214612 186627 151344 117479 94810 90286
16405 90286 82520 76826 77482 77247 73843 62061 58392 61309 60627 52984 40791 25539 20006 13093
16391 13093 15849 25286 30896 31350 33414 28228 22084 4495 -4419 12136 29241 33329 26289 21356
16377 21356 9786 22570 28146 23323 28630 45944 49059 34540 35850 49036 35922 10712 23053
16364 23053 25077 20224 16187 23444 26239 23979 13058 11879 8542 3668 11177 11292 743 2180
16350 2180 6415 9919 11255 3780 -1939 -12748 -10143 4263 15391 5831 -4770 -3960 -377 6282
16336 6282 18816 10972 -1098 1453 -4468 -1581 -2021 -2434 2640 11293 2501 -7149 284 13354
16322 13354 24917 17834 4923 8159 3471 -17918 -16212 -5198 -636 -8370 -14823 -20018 -8168
16309 -8168 8170 3799 -5119 -9336 -12815 -12709 -23174 -18086 10746 16385 11294 7181 -1713 -9953
16295 -9953 -6114 -1073 -6950 -3998 -8395 -926 -9438 -7383 -3952 5701 15230 23054 20457 8814
16281 8814 -95 9627 17033 9007 4556 8704 8502 -529 -2568 -7234 -4333 900 12435 15331 16920
16266 16920 18609 17134 2113 5294 9478 27090 31709 13314 7749 1435 7870 -1156 -371 -4690
16252 -4690 6953 4801 1356 -9269 -11513 -16856 -17650 -13936 -13635 -9172 -13368 -19652 -24704 -15764 -3599
16237 -3599 10531 23986 15513 9374 15843 23487 2943 -8011 -4531 12809 19638 5515 1690
16224 1690 14115 7333 4698 10609 19325 12633 5447 16018 25917 16661 -5525 -2478 6732 22513
16210 22513 29867 15363 16925 22922 12276 6649 15817 15981 21636 23659 18502 15008 3474 -6318
16196 -6318 -7500 2769 10974 7358 -10483 -10988 11569 18104 -250 -6392 14608 8410 -13099
16183 -13099 -19132 -13056 7855 22104 23731 17049 10693 7939 -2527 1069 10785 14841 14623 10575
16169 10575 15803 20110 8564 -2830 -2646 3353 11617 9259 16481 26545 20910 11329 5598 17135
16155 17135 35505 45693 48575 47770 49232 39709 36734 9986 -4898 -1460 6047 12865 20185 29050
16141 29050 37081 50257 51659 50276 65554 65124 75753 83446 88840 87004 93185 90930 77232 64170
16127 64170 54728 60891 53369 53971 69218 76238 74221 81548 68203 59632 58595 50255 47147 41969
16113 41969 41520 43124 27397 28726 30812 34832 30309 34176 36634 37464 34195 39366 49200 37951
16099 37951 12045 5256 15470 29966 34234 22664 12611 10077 219 11056 30618 23069 13386
16086 13386 14773 18423 28293 29517 20181 15320 18372 13885 6193 9975 18362 18206 23500 9834
16072 9834 -1169 3088 4421 4177 11364 18298 26631 21706 26063 19145 12870 17723 24040 20859 12572
16057 12572 13285 17520 6647 12907 20409 16640 16943 23473 31431 40680 43342 28547 33888 38108
16043 38108 43532 47356 51832 63144 57608 61689 65959 71869 71010 79378 103733 127087 165314 178255
16029 178255 161388 136444 128700 136471 137636 152615 178161 212676 224309 217761 199221 170389
16017 170389 156760 151523 156838 151699 174073 195217 194267 172622 157076 144524 139309 151031 151563
16004 151563 168591 169687 147700 143515 142847 127749 113278 115119 123368 126297 138823 142432 151850
15991 151850 154033 148193 144657 149994 149185 138891 146749 148742 144332 146037 147391 144643 136471 137226
15977 137226 140040 139211 143206 159619 159889 148093 146123 154663 153111 155744 164993 166566 165749 170545
15963 170545 168589 164935 167901 166512 163096 161700 165139 168863 179995 201217 215972 215329 214075 204320
15949 204320 203156 201991 206865 216378 228359 235967 235955 244894 260449 271297 293370 308678 322571
15936 322571 333398 337705 347452 360305 366204 370591 393526 419897 449468 467483 480683 502612
15924 502612 534890 573927 604648 630096 682861 725700 767841 796346 827766 884895 946307
15913 946307 1023335 1143821 1263203 1356358 1444411 1516556 1615790 1753942 1935152 2152896
15903 2152896 2436472 2837447 3379617 4057251 4893379 5968139 7271814 8495834 9274952
15894 9274952 9509948 9691109 10344282 11789931 14313598 18177006 23447508 29015415 32780380
15885 32780380 32854793 30003240 27279700 26517703 28327649 33103265 41169422 51554708
15877 51554708 60490123 63424954 57866653 48721320 41657157 38346862 38904761 43322157
15869 43322157 51244993 60175046 65529272 63021690 53383802 43148459 35887111 31927888
15861 31927888 30872368 32274375 35278913 37927069 37916552 33953610 28018696 22824274
15853 22824274 19171758 16884643 15622299 15043428 14790123 14408208 13494772 12053117 10560786
15844 10560786 9347958 8446017 7759300 7177544 6659516 6215539 5850948 5538922 5260718
15835 5260718 5028084 4851227 4682158 4501229 4313635 4120566 3927719 3753675 3593100
15826 3593100 3450063 3320310 3197794 3106291 3017805 2934290 2850399 2755672 2658770 2573250 2486476
15815 2486476 2395733 2324553 2270408 2195229 2127977 2080910 2012178 1950030 1890550 1836945 1795460
15804 1795460 1739645 1681612 1623599 1591883 1560886 1519122 1478822 1428368 1380131 1356985 1339702
15793 1339702 1308596 1284326 1261158 1229269 1198882 1164778 1137586 1111425 1084805 1060316 1046325
15782 1046325 1026429 1011660 997160 983543 977969 943099 921684 906993 868137 834198 834108 832676
15770 832676 812223 815560 803549 802393 803617 773911 748137 733173 709085 697509 699661 696444
15758 696444 687030 673394 657359 645123 637336 627088 606865 592408 585308 578850 575660 580332 569132
15745 569132 542768 534176 521228 507676 502069 498808 508349 498078 480380 453463 433953 415579
15733 415579 401899 396482 385644 389776 395298 388578 368966 350435 351364 338237 335340 329522 318153
15720 318153 321736 317605 301924 292771 283085 263722 251242 266934 270123 256186 249060 239067 235369
15707 235369 240984 237247 226937 209619 210360 216648 220015 217433 223518 237396 224008 199286 198391
15694 198391 187874 186262 197600 194807 180222 174365 177419 169504 181157 179069 165215 148087 139451
15681 139451 147055 143147 134331 143353 153435 147040 139507 137228 137540 138719 136933 130437 118531 110313
15667 110313 112029 111835 107788 108703 106854 108726 92826 85551 86920 94811 101489 114102 112149 95004
15653 95004 94277 93912 96511 104836 90312 87864 93285 84094 75997 97501 95506 82659 78393 75694
15639 75694 75489 74654 81802 78359 58766 59506 73929 82476 77102 75945 74123 68360 52945 44652
15625 44652 51904 51262 58061 69108 78212 85034 75505 76878 80581 74804 58838 51632 38795 25187
15611 25187 41570 46913 41550 37976 55021 49294 28133 31974 53033 65665 73402 63288 54320
15598 54320 45448 42634 51784 43816 51232 44406 34105 37398 43371 35121 22176 19405 25544 31159
15584 31159 39929 50560 62143 50031 29364 28403 25993 19676 23588 11921 2840 1617 7089
15571 7089 19790 23471 26777 15153 10896 13423 23812 20042 15441 19702 24321 30237 24197 8146
15557 8146 -8284 -11930 -15438 -26830 -17796 -9896 2377 8853 2267 5583 12018 9429 5715 8988
15543 8988 3359 -2916 -14308 -16036 -8270 9227 17702 -461 -6972 3204 2227 -11733 -11339 -3880
15529 -3880 6726 3845 3416 8839 7880 11777 -589 -5530 -12641 236 12387 6094 18034 18635
15515 18635 9620 3085 5845 6254 8615 12199 12163 11822 4998 1380 15676 26269 36019 33211 21401
15500 21401 5949 6606 29193 21446 18482 14295 2675 5307 7823 2619 -2080 8556 4575 -3439
15486 -3439 -750 3832 808 -3407 -3201 10057 7661 14755 5867 -3454 2446 -4286 -10254 -20034 -15502
15471 -15502 4840 11163 7998 -4668 -8677 -20223 -19935 -23336 -19572 -23021 -17024 2822 8297 6601
15457 6601 9183 2338 241 348 13012 19733 13733 15040 -3691 -20658 -21172 -18536 -16994 -27627
15443 -27627 -12962 -8308 -16521 -12307 -8510 -1937 8279 10113 14004 20899 23099 14680 12165 11468
15429 11468 4430 15559 21453 18510 10772 11819 11220 15904 2049 -10302 -12468 -8182 -3647 573
15415 573 4533 13178 12835 431 -11668 -12927 -21839 -17276 -11132 -1480 -7540 1540 2973 1423 -2026
15400 -2026 -7562 -22282 -25728 -16706 -8493 -19965 -28348 -23890 -4445 6644 -984 3644 5556 -2975
15386 -2975 -8988 6815 3528 -2089 -13802 -15671 -15865 -21231 -25376 -19109 -3777 1508 -13931 -18449
15372 -18449 -16767 -16981 -19090 -15075 -27938 -21904 718 3428 -3087 -13290 -7236 -5032 -11340 -9711
15358 -9711 -3881 5201 5314 12566 -2330 -12014 -14556 -5465 -3817 -7454 585 3450 6094 14889 32437
15343 32437 42215 38299 26970 12705 9770 25383 35848 36072 42358 48923 41421 48715 57492 55597
15329 55597 57317 69406 85625 116061 159306 183928 193371 175643 156774 157217 173968 205302
15317 205302 241688 283009 320078 334170 295776 252775 224650 194394 195555 226913 278487 333256
15305 333256 364293 349662 301678 231424 194964 184377 180367 188518 208166 206771 206139 176983
15293 176983 155565 133792 95916 75800 67197 66244 65801 56347 48898 52319 44577 53917 57351 43050
15279 43050 41767 41477 59582 54696 42531 34709 38180 31009 24094 21076 21153 19358 33122 27887
15265 27887 23297 22029 24136 26324 30463 32322 30518 28311 11002 1563 5826 9032 12970 16910
15251 16910 19461 28023 32658 20044 28100 30101 31873 27901 23417 33934 53979 52881 53830 54134
15237 54134 60085 69899 76008 82682 98587 102402 102771 111923 120176 126831 141310 146617 150106 166357
15223 166357 152469 134566 133457 135022 127289 130242 128435 116891 106613 113374 110008 94629 88169
15210 88169 75445 59932 59923 60832 40974 18882 18229 29471 38455 38911 32754 20877 28023 26702
15196 26702 17378 26375 18441 2476 1454 -516 -7972 145 13166 4152 -401 4420 9135 17234
15182 17234 10196 -2001 3764 12351 8892 -5668 -10942 14083 32974 32295 18379 6576 -5283
15169 -5283 -16969 -26442 -28146 -20164 -11438 -11695 -7860 1556 12619 -717 -15627 -12732 100 -10870
15155 -10870 -19077 -1199 17331 12219 1780 -8950 -6171 7202 6703 -7884 -10467 -10448 -21660
15142 -21660 -27088 -15384 -7969 -12481 -22015 -31377 -30834 -13053 9871 21005 13663 7703 844 1369
15128 1369 2661 1071 -5156 -12323 -8200 -1329 -1796 -2230 -5549 -5302 -2385 -9904 -5724 13832 8643
15113 8643 -3762 -723 1650 -5497 -12205 -11445 -5272 -14557 -15510 -5858 1533 2256 10468 21225 13277
15098 13277 -14606 -13186 2586 6460 4442 -4952 -7903 -2135 4993 5499 -1003 -6758 -4501 324
15084 324 -5564 -1315 -11173 -10282 -15627 -17747 -14547 -8889 -5036 -2045 -2426 -7898 -27678 -37790 -34126
15069 -34126 -9980 -4565 -16606 -17033 -9430 -6282 -6474 -12989 -10893 138 12061 13498 17249 12688
15055 12688 6400 12416 9713 -3124 -19296 -7260 -6018 -10588 118 9102 409 -6555 -4041
15042 -4041 9251 9027 -2207 -5072 -1755 4811 5779 2991 657 -1871 -17431 -23791 -25826 -17535
15028 -17535 -557 5469 2908 4280 2418 -6611 -16239 -15647 -2453 3914 -2273 913 -908 -15928
15014 -15928 -13219 -18716 -32128 -25443 -18314 -10161 -3375 -8404 -11180 -13615 -13030 -18854 -11448 -5096
15000 -5096 -1542 -9972 -24381 -27820 -20142 -8018 -16172 -3409 2501 -475 -4317 -15281 -16270 -24122
14986 -24122 -17633 -20077 -19219 -6640 -1905 2462 4742 3208 4187 7758 10622 21139 15574 8620
14972 8620 -14290 -16339 -5347 5519 -1224 -5928 -22618 -28253 -23913 -20219 -22804 -13076 -2988
14959 -2988 465 -2674 -24045 -29066 -20504 -23031 -17448 -15 4706 418 -14681 -10119 -10027 -9466 -4321
14944 -4321 -27163 -38801 -29623 -10831 -1640 10659 13390 6750 2884 -10704 -10446 -2545 9144
14931 9144 21517 12642 3021 -11489 -24459 -26335 -31382 -16501 -4404 7319 5400 1821 908
14918 908 948 -6813 -16609 -13327 4949 12999 19433 13585 4558 17881 15373 6680 -7409 -13493 -20082
14903 -20082 -23233 -14247 -18776 -21538 -24586 -23087 -20365 -25978 -35225 -19169 7948 23911 301
14890 301 -3221 -2567 -24738 -31675 -19327 -8323 -10281 -12932 -14366 -16160 -15551 -16903 -8604 -6603 -14623
14875 -14623 -17824 -23293 -18103 -14593 -1968 2795 5217 -10514 -15871 -12434 -4001 3988 -7333 -15610
14861 -15610 -17183 -6930 -3854 -9734 -9641 -8199 -4759 3480 8509 7962 1672 -865 4841 9722 23936
14846 23936 22005 8230 7897 11975 1167 -4353 4551 -4676 -6661 -7038 -12955 -19870 -20234 -22172 -15485
14831 -15485 -18634 -21112 -2658 -2112 -4230 -4649 5496 -4559 -20320 -10762 -1974 -515 -3562 -7308
14817 -7308 3672 -1162 -317 -4850 -3466 -13138 -20529 -25121 -2391 -6310 -16457 -19827 -23516 -19635
14803 -19635 -2299 10367 10779 5010 2514 976 -11923 -23806 -18546 -17726 -20704 -22914 -24711 -23859
14789 -23859 -16994 -11690 -14406 -12122 -16341 -28556 -17265 -11819 1052 2326 -13386 -8975 -9979
14776 -9979 -16787 -6448 -17714 -32335 -31499 -29466 -27732 -20014 -19867 -22349 -18684 -14769 -23539 -26058
14762 -26058 -25044 -15723 -14347 -14025 -10311 6356 21929 20725 9148 3774 -2654 -8020 -4211 -3765
14748 -3765 2924 -969 -6981 -12626 -11925 -11217 -5336 -9560 -7106 -15854 -18133 -10594 -4851 -16092 -21154
14733 -21154 -16389 -11494 2469 6960 1649 -3942 -10071 -12720 -4307 -1004 2597 10070 -6170 -15475
14719 -15475 -25505 -28771 -24432 -23698 -10884 -4371 -9908 -17597 -21965 -24986 -30967 -13869 -15062 -10215
14705 -10215 183 -757 1600 -4413 -27 12439 8629 -5697 -8129 -14502 -20019 -5797 -11198 -31748
14691 -31748 -19883 -8001 -6541 -15477 -11633 -14699 -5271 -4053 -10489 -9679 -10528 2688 -855 2262
14677 2262 256 7717 10770 -8187 -11339 -8276 -17378 -9218 -3949 -9743 7187 22560 -7 -25758
14663 -25758 -19652 -13163 -11206 -14507 -21972 -16411 3514 5869 -3875 -7143 -23533 -29779 -14317 -16139
14649 -16139 -19586 -25493 -30638 -16978 -6505 -334 -3699 -14379 -15112 -4958 -18482 -13973 -2982
14636 -2982 -12145 -13002 -11733 5643 13278 6180 5572 -3706 -9315 -4850 3080 -4976 -4694 -1463 8641
14621 8641 4785 -1853 -10152 -28394 -15699 -4942 -3738 869 4655 -433 -8638 -7985 -7831 -14474
14607 -14474 -17508 -19445 -6346 -16514 -28510 -20256 -13746 -1657 -5676 -917 4752 6779 5109
14594 5109 4125 869 -577 1498 -13862 -21366 -12977 -19904 -20949 -19359 -12085 -668 -3451 -13853
14580 -13853 -6498 -4425 1625 10420 15718 -6089 -18696 -16175 -9401 -6373 -14480 -12118 -5095 -8424
14566 -8424 6862 4346 -4156 -7059 -9359 -14741 -12565 -7356 2285 2843 10553 10939 9554 9454 5106
14551 5106 -3410 -13241 -6757 -11135 -21422 -11129 -16716 -24014 -13724 -12968 -23806 -30926 -30489 -41369
14537 -41369 -35797 -10790 -3875 1014 -9470 -5061 5168 -12249 -23343 -18617 -11573 -5901 -3715
14524 -3715 -11528 -17978 -18749 -24428 -20560 -20205 -16437 -5455 3319 -155 2541 -6601 -18565 -16126 288
14509 288 14362 11440 11242 394 -7703 -382 208 -3631 -24757 -43935 -42101 -23969 -16894 -15449
14495 -15449 -13221 -18472 -24688 -20127 -32712 -40622 -19254 -2244 -11440 -21322 -20867 -15250 -16831 -15429
14481 -15429 -11342 8833 19800 23868 28012 16524 -2995 -11045 -9007 -9852 -15878 -20832 -23536 -14160
14467 -14160 -24385 -20857 -15878 -10912 -9133 -20447 -23427 -11688 -7288 -9507 -12364 -5199 -4736 9196
14453 9196 -343 -1746 8575 -468 -14304 -31324 -23720 -4712 7197 -1066 3560 7067 3252
14440 3252 -8930 -26896 -23105 -14404 -13562 -1545 4185 -5193 -18798 -16730 -14968 -13632 -29945 -23842
14426 -23842 -15515 -10194 -13335 -19568 -28206 -40825 -27717 -25177 -25827 -25418 -25214 -23322 -23242 -15772 -18806
14411 -18806 -29805 -32897 -26252 -29181 -27267 -28159 -33370 -37189 -44355 -42772 -33029 -7520 -2522 -4243
14397 -4243 -8711 -6146 -3210 -487 -4137 -8391 -25623 -34320 -34691 -19207 -13067 -9749 1171 -1883
14383 -1883 55 14027 9470 1665 -3465 -107 13708 4592 6522 3156 5534 2022 610 -1137
14369 -1137 -1157 1547 294 -10790 -23652 -21388 -23933 -27686 -23452 -12301 -9561 3932 -6014 -10673
14355 -10673 -1351 -4956 -5963 1142 14198 12873 -5569 -4209 7506 7903 491 -5174 -12356 -6147
14341 -6147 3206 12318 10628 18274 4195 -10187 -10610 -19765 -18273 -29201 -30696 -19501 -7507 -526
14327 -526 5438 7312 -8904 -11157 -15193 -17870 -9768 1623 8556 10988 5559 5362 -10729 -15949
14313 -15949 -3199 217 -11299 -16291 -11381 -8503 -25293 -34008 -26154 -38683 -31469 -11124 -3378
14300 -3378 -16807 -34658 -27140 -15557 -10657 -3796 7855 19936 16146 4507 -4184 -23443 -16517
14287 -16517 1586 -5131 -12399 -15487 -15309 -12598 -16572 -10097 -3981 10490 15142 22139 17176 -10390
14273 -10390 -16749 -10991 -22748 -22244 -6633 416 -2068 -2773 444 4634 3313 1206 2057 10136 13371
14258 13371 10825 2312 -1934 617 5716 6689 11201 2713 -4260 -4263 -3293 -12886 -11556 5146 5520 -928
14242 -928 2630 -5191 -11198 -22147 -17530 -26150 -26377 -15868 -18045 -24602 -22342 -13961 -6506 3350 2984
14227 2984 -11787 -3228 -4269 -12904 -24860 -21083 -12294 -6484 -16671 -7268 -6980 -12785 -15116 -20070
14213 -20070 -27224 -21121 -4934 8994 4100 -10308 -17438 -30518 -18329 -8281 -1766 1315 -10561
14200 -10561 -21822 -16440 -22045 -31607 -26163 -19734 -23826 -34133 -36778 -25433 -22900 -7684 -2295
14187 -2295 2788 5128 7193 -894 -1212 -9657 -14211 -9034 -10128 -12002 -10832 -6578 4399 8224 20295
14172 20295 21115 26631 28949 22781 18066 1486 -20945 -21256 -6037 -334 9170 7339 11137 19937
14158 19937 13120 3192 9434 6452 -3487 -6979 -8907 -13914 -18021 -27408 -23456 -24537 -13933 -22966
14144 -22966 -37825 -32219 -15630 -11499 4950 11882 3457 -10537 -15261 -10816 2598 2288 7142
14131 7142 1233 5044 101 1513 -7533 -7412 -31925 -44541 -28621 -18803 -12652 -9782 3369 12627
14117 12627 2932 -11981 -20253 -21270 -13348 -15172 -18186 -18525 -14632 -15618 -23048 -27117 -27398 -24677 -28248
14102 -28248 -27717 -7360 -2099 -3506 -6304 -11622 -4957 442 -11763 -7679 195 9177 10511 18029
14088 18029 13575 -3584 -17678 -14965 -5526 -2850 -19390 -14187 -5221 -17575 -8021 8921 12511
14075 12511 15720 13550 12838 4628 5882 3458 5823 1017 12820 2044 13349 10251 -965 5801
14061 5801 9506 3782 11459 12586 13128 10343 10228 5723 -787 -3100 -3322 -2896 -1280 -765 14561 28576
14045 28576 42989 36429 22287 14050 8021 11808 3001 -2820 -997 2578 3413 -6082 -5223 -13608
14031 -13608 -3820 8266 197 -2000 -3856 -16398 -5767 15744 3381 -8198 -7832 -7145 -13541
14018 -13541 -14095 -4178 -6409 -26884 -28172 -12143 354 406 206 -8742 4727 10579 -1656 -5315
14004 -5315 -13717 -22894 -17488 -18592 -23988 -25427 -12887 -10261 -19445 -22535 -19914 -15954 853 -410
13990 -410 351 5264 14240 11595 7209 -5538 -22528 -24028 -12690 -6654 -10222 -5261 3332 4001 3077
13975 3077 7786 12608 14158 -5562 -2429 8198 -2076 -15063 -7276 -2879 -4089 8620 14816
13962 14816 5967 6292 15787 28382 22781 22047 32403 24970 10170 4264 3936 -7957 -18754 -27096
13948 -27096 -11425 5241 2805 13 1685 4927 -16392 -28345 -27701 -17712 -16044 -6779 -11555 -8798
13934 -8798 805 -972 -6861 -12194 -450 8533 9139 6793 5573 7774 20597 18176 14334 16293
13920 16293 17382 -5793 -5476 -2142 -24736 -31690 -27013 -14962 -3079 3297 4848 9400 8521 6633
13906 6633 -6428 -3353 -3274 934 -297 -63 -200 -13578 -13894 -9768 7477 20608 11665 19993 19959
13891 19959 20342 22199 6433 4660 6326 9677 -1642 -6522 -15227 -5558 -13290 -32426 -29639 -21165
13877 -21165 -9685 -5460 -6258 -1807 5650 1405 2193 9046 4334 178 -653 9100 -382 -4636 -11082
13862 -11082 -6842 -15486 -1320 6922 10110 3568 1076 11959 23264 31047 29802 24781 16128 11747
13848 11747 24135 19960 4284 -801 -2366 -9512 -17752 -7066 2636 12256 9980 1694 -6200 1302
13834 1302 13644 18883 27415 27538 31922 44605 28055 6348 -439 6045 19250 31750 25040
13821 25040 29242 37109 45514 52199 43949 28754 18757 10158 19590 40758 37590 40395 47344 44808
13807 44808 48395 65959 76638 86112 94389 114338 158100 197959 236901 269872 327378 402693
13795 402693 483750 554063 608150 642532 677391 716972 770193 803089 803321 789673 785547 786872
13783 786872 762455 726175 710761 694509 655500 601917 523207 442458 384303 340037 289851
13772 289851 255069 224451 192232 172509 160309 139079 122705 108528 96895 76683 65607
13761 65607 58487 63476 73410 80501 69810 51387 43163 47930 48057 41626 21429 17897 38584 45715
13747 45715 51468 47031 25653 28177 42714 46469 35486 45342 45341 47068 43651 35377 37303 28491
13733 28491 22372 19702 20882 23940 16018 17919 12366 12233 32550 42990 29034 13401 15349 14931
13719 14931 7040 4019 15579 24391 23100 22633 14733 4816 10308 24533 16832 19659 13768 17898
13705 17898 9199 -6650 -5466 6760 6420 -5615 -11623 -8597 3465 17582 20585 12129 11306 17516
13691 17516 24863 22180 14198 6559 8794 10973 18059 11370 2915 20788 39272 25878 18238 27111
13677 27111 30255 20230 33968 41979 38467 30392 31291 34398 26437 20922 17856 13479 20027 28008
13663 28008 36919 53392 49595 39080 43879 47753 40007 20545 23272 43343 58383 60577 53147
13650 53147 47011 42634 47837 50716 34309 23342 27759 23338 21860 23811 23096 21351 22797 25457
13636 25457 17180 15395 16223 20822 23083 22349 19942 19992 11920 19124 35591 26430 8930 -6122 -15523
13621 -15523 -17287 -10672 -3996 3818 21150 26084 27253 26091 29455 45685 52927 37384 36857 41376
13607 41376 47402 39826 49826 60204 58194 69406 84669 102358 127378 143894 137376 146377 157232
13594 157232 157890 162222 179208 199033 210534 219297 213643 212664 212869 220467 216638 209938 211250 207748
13580 207748 186005 176990 168294 150093 127058 107039 97248 86109 78187 78660 72632 61233 59703
13567 59703 53015 56416 57172 60880 64220 55844 42802 59244 64823 58465 44405 40721 30002 39053
13553 39053 49343 43976 44250 43630 39985 49051 72037 79976 61500 50504 48672 53785 58316 54333
13539 54333 53297 39149 47398 68999 66803 55066 43334 34697 27299 30721 40691 44277 48136
13526 48136 56285 57838 54181 55472 45372 36294 29897 28357 29662 36229 46949 43462 43933 39858
13512 39858 28949 25225 27609 31663 59062 64106 53060 51024 49699 71535 86541 84502 88837
13499 88837 73793 67157 64161 75901 90202 92050 83422 81254 96772 125784 145884 143835 139191
13486 139191 144322 148104 159160 185577 204866 212989 232623 244655 250959 258259 269245 275765 301318
13473 301318 336027 363967 374871 378063 382301 383316 375207 366675 366571 376373 377675 388759 405962
13460 405962 410779 395736 367999 355110 355127 353008 340542 335240 336061 319789 324782 319775 307014
13447 307014 303272 300863 289308 271147 274296 273865 279049 291319 295048 299947 304938 306884 307575 318908
13433 318908 317104 315645 322885 340401 360667 373837 379601 388739 381719 374711 376866 387384 393335
13420 393335 403573 400412 407126 408522 412595 426212 437233 458617 467162 468944 473919 478372 473652
13407 473652 489576 508310 533650 551997 571160 590984 603231 622109 665390 688518 707629
13396 707629 741829 773698 786453 803416 816093 847482 871897 902742 928872 971732 1007023
13385 1007023 1038962 1086740 1115408 1144943 1197915 1243581 1299662 1373383 1447094 1544862 1626031
13374 1626031 1713468 1801401 1881440 1969022 2074352 2197605 2329067 2477856 2645860 2839233
13364 2839233 3066805 3329356 3612333 3943180 4322221 4744501 5243479 5824108 6484608
13355 6484608 7264192 8234553 9478828 11123243 13311370 16289472 20402342 26031977
13347 26031977 33279517 41775495 50945120 60650008 71675384 84682674 98363036 109733763
13339 109733763 117221017 123045289 130526422 139291759 145558577 147125836 146459692 147190161
13331 147190161 148830497 147501162 141508956 133825088 127937630 123115485 115737692 104279950
13323 104279950 91108880 79297363 69478282 60535942 51828392 43783919 37090697 31949366
13315 31949366 28121411 25236953 22985858 21146447 19621024 18314717 17158346 16123758
13307 16123758 15186349 14304545 13477213 12744580 12068197 11461220 10903423 10394842 9922669
13298 9922669 9494965 9099240 8745393 8413784 8104526 7839550 7580215 7354890 7139277
13289 7139277 6911316 6684634 6487609 6295277 6110092 5935610 5749339 5563476 5392853
13280 5392853 5218243 5046555 4888479 4752051 4611743 4482080 4352691 4225549 4080999
13271 4080999 3954090 3849305 3731280 3620107 3506231 3421681 3335510 3241042 3158033 3077707
13261 3077707 3008715 2938413 2870024 2805850 2741935 2662792 2595018 2546404 2508933 2445751 2388126
13250 2388126 2337848 2296910 2249741 2217064 2172964 2136861 2101277 2053432 2022177 1993259 1948505
13239 1948505 1900458 1854996 1824907 1796210 1768243 1742062 1708573 1667547 1636778 1595914 1545056
13228 1545056 1519413 1509439 1499443 1473067 1454225 1436981 1404392 1379789 1346559 1324133 1314497 1305726
13216 1305726 1295445 1264221 1259978 1257525 1245174 1240329 1227539 1201004 1173387 1150591 1134613 1118953
13204 1118953 1099126 1085389 1061622 1035749 1030515 1006734 970331 941464 911392 878673 830308
13193 830308 799757 786304 766687 747764 733228 699512 673224 644233 631350 623370 613535 597977
13181 597977 593230 589255 572590 560872 556956 560512 575530 565181 534784 516801 517591 506001 484628
13168 484628 485383 473194 469191 459438 454938 452455 449624 454753 456607 444588 441306 425463 415303
13155 415303 410668 389862 390685 400236 408555 403976 396578 387545 378694 371727 357821 350404 361111 361345
13141 361345 340373 323874 326505 301848 295644 304057 294554 293998 293955 295219 296452 303537 301205 276377
13127 276377 255871 244656 242163 241326 235603 232082 234931 244209 243763 240168 227899 209702 187782
13114 187782 184298 192249 201425 201382 194693 210579 202335 186354 177758 174240 185450 191141 183702 158010
13100 158010 157196 172113 176349 171843 157750 143221 138185 136585 138570 129571 130684 131635 132116 128334
13086 128334 118931 114364 104265 114364 116054 115600 106944 104702 97823 92392 93404 90697 91722 93314
13072 93314 90282 85507 93819 99064 100670 102993 101191 107540 99418 83219 82756 74942 75561 74157 82273
13057 82273 91826 93057 103774 101004 79793 70085 66018 53282 48215 64580 86225 93814 102147
13044 102147 116023 110281 89678 85383 64904 58843 57680 57658 57171 67847 74069 66153 56105 52210
13030 52210 56493 50297 29424 29345 37859 42457 43946 38330 41758 42383 32384 37836 42425 48245 44617
13015 44617 40680 41637 40140 39717 28538 18380 592 -5086 -9099 -17816 -18651 7663 3164 -9800
13001 -9800 -3969 6452 8713 14055 5641 1738 -8344 -5409 -5039 -8285 4578 25021 26870 5840
12987 5840 4511 13794 12597 23508 27874 13571 14294 28463 39365 36971 18736 -3920 -5092
12974 -5092 4481 29693 44059 33048 24687 18308 24071 25864 25626 32515 30170 37179 30549 22816
12960 22816 25649 34308 43130 37153 33377 25310 11318 3700 25694 32490 12095 3907 1359 18147
12946 18147 35274 31120 38587 28930 12026 9027 16503 12557 27154 29395 27904 30751 15879
12933 15879 11453 14964 13880 14577 10645 19784 4811 2258 3644 19526 22964 33848 43300 39953
12919 39953 28967 19200 6576 12470 13513 7455 8744 10311 18265 15754 22733 14910 9 -213
12905 -213 506 12214 9856 23826 27950 35199 43905 45975 40459 34278 42635 41148 50401 48640 63527
12890 63527 89703 119061 152029 182900 226567 266387 302343 347595 426532 509326 570893 609623
12878 609623 646696 676054 727673 772603 786271 785568 795610 799015 787355 769456 729225 692230
12866 692230 656610 616463 564482 503044 432763 378037 327372 277157 224538 190886 169633
12855 169633 156057 149559 133714 114457 102559 99290 86458 88036 94720 84759 71813 87059
12843 87059 97955 88359 74278 61730 57829 49921 52824 54621 54732 58911 51904 51238 60930 55785
12829 55785 49911 53363 49671 36732 41203 34592 25518 16351 25729 29935 42242 43376 37280 26053
12815 26053 11927 -4364 6643 26853 30702 50454 51157 36243 20430 15829 9731 18907 19637
12802 19637 23065 14949 5782 1890 -15670 -6730 13236 13027 5455 -2257 7169 12519 26150 30208
12788 30208 28749 35295 42736 50357 55905 63022 81381 103589 112498 118443 133796 157604 173569
12775 173569 186680 203642 212366 233678 242976 260724 251496 227755 217782 203880 189673 179692
12763 179692 169162 161883 145993 131234 115380 98442 87702 84739 78425 63927 70809 67186
12751 67186 55562 49808 51946 54037 42726 46417 41155 35352 44968 51930 37888 40663 28802
12738 28802 16888 999 -8501 -1248 11207 17537 29285 42110 49750 41673 35910 19484 20277
12725 20277 24215 29888 24174 17888 25309 32635 24147 22168 16371 23741 30970 36591 41993 26588
12711 26588 13631 -1904 9157 19531 19861 15058 -587 -5206 646 -4949 1627 8234 15253
12698 15253 10310 7493 17815 20521 13974 6434 4459 5005 -2136 -7176 -9718 8149 9481 -7900
12684 -7900 -22440 -1622 9358 -4421 -22130 -20780 -25000 -14774 1936 4637 -14142 -7523 8790
12671 8790 8221 20406 28045 26177 14705 14215 18296 12385 8756 11590 -7954 -24127 -4122 2438
12657 2438 6913 7747 6112 5300 11640 10818 12357 -3330 -20182 -22237 -8893 -9692 1001 5618 12429
12642 12429 10657 8141 -2697 -7581 -252 15732 15105 7214 3190 1081 -5825 -2022 -7117 892
12628 892 -15398 -27957 -18357 8137 13596 5390 -2186 1026 13158 10839 13086 8286 -99 2945
12614 2945 -3781 -16352 -18357 -15982 -16205 -19374 -20348 -11163 -10945 -7749 -6309 -8047 -25657 -18797 -19935
12599 -19935 -24032 -22405 -22961 -18387 -22459 -6685 -5425 -9953 -1594 4820 3255 -12556 -30392 -20963
12585 -20963 -657 -3439 -5455 3309 6407 3752 -5159 -7874 -12187 -11668 3223 5652 12964 22250
12571 22250 10230 -6489 -1979 1211 -14032 -11265 6887 -2760 -10562 -6237 -10250 -11155 -7888 8870
12557 8870 8215 9296 13271 10899 9065 18394 15882 15362 6064 -1904 -8335 -20546 -16951 -8923 -2994
12542 -2994 1470 2146 -11559 -22031 -22124 -12489 -12138 -19928 -29522 -22242 -10002 -4959 -8752 -8135 -7753
12527 -7753 -9591 -11786 -8864 4876 13336 8059 6826 -5052 8772 37321 29588 23007 6893
12514 6893 1442 2444 8520 14050 3239 -8030 -7152 2502 3040 2292 -5474 -9246 3468 22674
12500 22674 29292 25380 19924 7170 2976 15013 17290 4747 1747 -603 2943 -2046 -8300 -6466
12486 -6466 -4236 -8750 -15491 -17326 -11994 -19896 -10281 -3935 -11271 -14054 -6786 11398 27883 19875
12472 19875 6802 -5892 -16629 -19399 -10478 -14387 -2993 7545 2838 7907 14909 11260 10423
12459 10423 9791 -3166 -19388 -17938 -20875 -31808 -21878 -7957 181 1438 8972 7650 10630 7462
12445 7462 4629 1866 -2173 -2051 -5758 10170 16770 12929 5180 10355 9787 12940 16107 20436 278
12430 278 -6119 6619 -7151 -16356 -11262 5053 18312 11745 -2104 2545 13414 12108 1906
12417 1906 3956 17211 4889 633 10851 18116 20755 30536 32862 22547 14931 8611 4110 -14184
12403 -14184 -14317 4442 14238 23311 23998 18810 14172 17512 15494 12051 15487 15604 20097 18537 12319
12388 12319 11258 5873 -4382 -5331 4621 7674 10729 29536 46275 57478 81331 142373 202249
12375 202249 278445 367236 443725 466214 415687 316805 227265 160816 107310 73025 50080
12364 50080 38635 44936 41185 39725 44850 47940 31946 18229 22687 31947 31882 20943 15023 6636
12350 6636 -9201 -12548 -10407 -5740 -7643 -7911 -5823 -6999 -6153 -4757 -5094 -7976 -741 -1233 493
12335 493 6798 18567 12743 -1820 1757 -343 -9784 -19841 -11221 5942 15535 -1477 -5450 11914
12321 11914 3352 -4063 1110 7399 -757 -5738 12017 15655 4264 -8085 -16496 -1489 8469
12308 8469 11912 5861 3115 5717 11457 10482 8709 8913 -808 -676 -5722 2642 6224 347 -5307
12293 -5307 9381 18678 8231 5554 17795 11455 -3074 -19828 -14343 -4464 3883 13693 24972
12280 24972 25122 1332 -5393 -10736 -8820 -10825 -10406 2740 16358 11774 5255 1853 12740 17835
12266 17835 15896 17961 5773 -8475 -11611 6618 7384 -2133 3374 8936 2654 538 9379 6699
12252 6699 13190 14165 10774 3722 -4498 10205 27256 32132 34228 20973 13161 11204 6526 3736
12238 3736 3490 -335 -5579 2451 2307 -5961 -1579 -2352 -16402 -20018 -15394 -16797 -6002 -11146 -10134
12223 -10134 -13310 -1713 -4629 -8642 11686 23759 26766 21036 18384 7499 7787 2999 8179 10780
12209 10780 24053 19771 9088 1814 5541 341 -14451 -2192 10650 6233 -2678 -7835 -4337
12196 -4337 2074 9849 13982 17171 15463 8737 6126 9596 8534 -4808 -1882 -10278 -7585 5022
12182 5022 5417 1669 4271 14949 20947 5550 -4211 3378 14331 6484 15188 16755 1786 5387
12168 5387 23858 28469 26290 21898 23877 22214 27392 29853 24045 22210 16360 18035 28437 23950
12154 23950 20016 13502 13012 7770 2556 2609 6341 19543 16267 9832 16031 24716 32462 24883 24302
12139 24302 28143 15670 3298 11894 15935 18597 27711 30387 37557 41461 29534 27774 18027 18446
12125 18446 9183 17316 33908 41461 36851 31187 20174 16003 10617 3169 1792 12199 30162
12112 30162 20681 10990 18067 27469 31101 21780 25646 43040 45346 43392 45838 49034 66317 79703
12098 79703 97978 108005 112593 110018 112016 121866 130288 135504 142340 150713 180076 232229 273241
12085 273241 277985 295087 311514 323214 318032 289583 260350 232891 190912 168535 150802 127602
12073 127602 109884 102558 102267 106046 95078 84515 82597 72766 61429 56367 80237 90608 82164
12060 82164 63051 36141 26155 31933 35339 50987 53555 49082 49135 59176 62975 54591 41825 43741
12046 43741 43069 48964 50478 48436 42828 38546 34524 34115 38085 37321 42240 49579 41275 14468 8351
12031 8351 4018 5428 10134 19361 26385 23255 18254 10047 -7681 -895 16687 14693 9700 3917
12017 3917 5508 -5037 -3238 2583 -9033 -11053 2138 16909 19447 27806 21036 -5953 -3748
12004 -3748 2671 -1532 -568 -5871 -4896 -3834 -197 514 3915 2105 9541 2738 741 6923 13674
11989 13674 4640 3910 -906 2577 1727 1642 -194 6979 10158 15864 11834 -4904 -6398 -732 4928
11974 4928 18391 22690 30354 8894 -804 3012 10916 16101 21994 21729 8043 -5984 -13576 -14774
11960 -14774 3584 12371 12058 16043 3762 4956 2902 3386 16712 16247 6413 5768 -466 -1460 -1210
11945 -1210 9120 16929 6550 8483 387 7226 2462 -3577 -1532 5370 5085 3300 -3522 -7782
11931 -7782 -12446 -6989 -6057 -3126 -2343 10944 2205 -503 -2951 3119 28128 31914 23910 19877 15286
11916 15286 3877 448 5039 7025 -12317 -15665 -12128 -27195 -30440 -22734 -15079 2629 806
11903 806 -821 -9936 -10552 -10528 -9240 -5328 -10795 -9600 -9004 -21567 -12911 -342 -10149 -26108 -21597
11888 -21597 -6793 -12163 -15997 -19977 -23515 -17631 -19253 -17306 -12680 -1292 2997 5595 -6574 -2431
11874 -2431 2256 6281 14011 11240 -2972 -11511 -13500 -18955 -14642 -11175 -9061 3722 19246 13420
11860 13420 -11695 -15238 -11983 -18575 -10103 -8754 -5224 -2637 18827 31187 -5606 -4797 5969
11847 5969 9857 10540 18558 10859 -1490 4907 20879 25733 19196 -2875 -8661 -7210 -904 7803
11833 7803 -5963 -8839 -7147 -7260 -20316 -32064 -28218 -10357 4601 16552 7907 -7611 -11297
11820 -11297 -25417 -33666 -33128 -28326 -7544 -3308 -3537 -5082 1037 -3547 1449 7899 10010 2679
11806 2679 10515 11939 3286 -3063 -12632 -10726 -4983 -957 -793 4372 2523 13824 27221 25414
11792 25414 10872 9294 11542 7685 518 10578 12283 -6703 -3399 -1832 -5970 -9368 -607 -2076
11778 -2076 -3377 -17110 -26737 -11776 -1316 3212 5784 9825 10432 2924 6941 454 -11623 -13740
11764 -13740 -3500 -17579 -23527 -20446 -20504 -20448 -32230 -21325 -1867 3800 2821 256 -1736 -23103
11750 -23103 -31675 -21842 -9319 -7884 -8219 3697 10114 -6459 -13223 -10523 -19745 -25106 -6754 5244
11736 5244 -2481 -12361 -12096 -10350 -6434 -14655 -17653 -4522 1197 -401 -3853 -12417 -3097 -1665 560
11721 560 5052 6721 623 -850 -17300 -18200 -12871 -15748 -25035 -22100 -18391 -4437 2469 1389 -3141
11706 -3141 -12211 -10139 -12339 -10754 -3228 2303 1002 -2036 -11830 330 -2247 860 14779 18253
11692 18253 9295 5520 3711 -4234 -15444 -9813 1980 10751 19329 6378 549 237 7301 1306
11678 1306 -1534 -10619 -2971 37 6197 9029 10985 -647 -2675 -12677 -16376 -3042 -7600 -1735
11664 -1735 -10429 -11544 2687 -7528 -7316 -924 3865 3736 645 -471 -3805 -6171 -10287 -7841 -6815
11649 -6815 -4858 -3559 -8170 -3454 563 -4106 -4759 491 2755 3357 11908 9234 5278 1825 -5774
11634 -5774 -2549 -14136 -12062 -6587 -8526 -7811 -3218 -5491 -16370 -2290 7718 -1808 -3548 -12927
11620 -12927 -16247 -1347 5179 -6216 -5445 2981 -4600 -18609 -23328 -19136 -14104 -2712 -2858 1521
11606 1521 -6136 -6302 -7513 -12866 -4313 -916 -12285 -23939 -17678 -21889 -18039 -15213 -17577 -13836
11592 -13836 -16230 -13312 -9221 5469 17816 15627 12122 19144 3897 -23843 -19463 -15065 -5795
11579 -5795 59 923 3854 -6039 -12950 -9386 -1216 -2886 1379 9901 25433 33185 23609 19038 16952
11564 16952 6519 -513 -11424 -24124 -21068 -11275 5254 832 -2289 -14727 -17231 -15124 -8876
11551 -8876 1581 6195 15922 17325 -5061 -14835 -12376 -2444 1183 5584 -4901 -9253 -6263 -15923
11537 -15923 -20388 -15244 -14350 -13476 -22005 -16788 3736 14342 12592 5403 8142 9856 -138 -2945
11523 -2945 1129 -4886 -11943 -11191 -2712 -5084 -3017 8763 -1492 -6152 350 8697 12477 4481
11509 4481 11436 4419 -11328 -15690 -11348 -14343 -11902 -6696 -3154 9227 4910 -7682 -18537 -21575
11495 -21575 -6630 5681 -5723 -8182 -18375 -6997 6106 16628 8186 -12469 -25537 -32569
11483 -32569 -20635 -11994 -3636 -8736 -6923 10323 22679 18527 15402 6390 -11253 -2032 5609
11470 5609 6782 6581 -246 963 -1366 -6394 -1937 -973 -10908 -11525 1719 -3446 -10339 -5618 -2749
11455 -2749 -5201 -4713 3550 3639 1084 -3662 -11252 -17569 -10241 -13141 -19709 -10846 -4448 -4244 -388 9101
11439 9101 14119 8841 15606 11341 12308 5416 -9313 -3398 -1292 12722 22506 26746 17807 -1977
11425 -1977 -8866 -18400 -13319 -8243 -6089 5232 12706 9211 1518 -6232 -107 -3276 2799 -1367
11411 -1367 -14555 -9545 -3134 1759 2155 3444 14109 3255 -8268 -7679 5315 11309 7473 3273
11397 3273 2548 -431 -10672 -11948 -10739 -8419 -5720 -19663 -34805 -25964 -17282 -1619 -3710 -26693
11383 -26693 -26861 -8185 -6759 1488 -1464 -431 1074 16469 16307 9968 3440 5927 4584 10049
11369 10049 16855 21474 19632 9266 671 591 2630 4911 10554 7848 1552 623 7796 8953 17711
11354 17711 2993 -14272 -26250 -22562 -2772 12674 11277 14162 26266 14637 4745 -972 -6901
11341 -6901 626 25455 14870 -6618 -15461 -4071 18048 14508 6132 -2034 1318 10502 570
11328 570 -5900 17132 25946 26861 11738 -2619 1603 12880 17862 16048 15131 14329 -1501 3552
11314 3552 6111 7866 -10076 -4969 4759 8122 2930 3289 -3367 2661 10109 14980 21809 14529 16278
11299 16278 35039 24940 11933 2879 4815 12324 16344 26811 34877 28501 10347 14602 14305
11286 14305 25783 23297 13253 1962 16392 22204 29569 24738 25632 14315 9614 1073 -5587
11273 -5587 2802 6995 17548 10246 9323 432 -15432 -12180 -8727 -19594 -3185 3374 9984 14148
11259 14148 4870 2804 10308 18536 12578 2923 2121 -6168 -1967 -4182 -17652 -16157 -20625 -13523
11245 -13523 2908 19069 27683 22657 18564 20327 21783 32781 31586 30073 23236 12800 16753
11232 16753 24764 34944 15034 6878 6208 5513 13434 18309 2014 -11791 -8976 2288 16957
11219 16957 25098 42733 37872 30186 29270 20569 24325 31045 27962 31486 42321 42016 38853 40430
11205 40430 50467 57347 41803 37600 31942 19365 5416 5268 1530 3831 12842 19416 9829 -11271
11191 -11271 -10470 3814 22635 27745 39007 38310 36626 30045 28051 19351 5574 1138 3553 23290
11177 23290 20556 6717 -418 17102 26789 36995 32403 11601 8950 13802 16289 22037 10931
11164 10931 77 1587 10305 11947 18926 18123 10946 13210 7215 7440 13045 7472 5369 6819 -5813
11149 -5813 -4959 2120 -1116 11475 12554 20117 19760 -198 5471 19878 19732 4065 3806 8396 2421
11134 2421 14909 27153 30007 28823 31819 37356 36557 23843 33884 46211 31533 23830 28486
11121 28486 25615 19969 21036 25446 16571 11823 19788 19558 7632 8006 10676 16188 20461 21595 17905
11106 17905 9107 18005 12649 4992 17905 25789 19914 21613 28802 25926 21582 25170 38688 47659
11092 47659 60289 54628 46558 47821 46425 50407 52160 49844 45168 36958 36523 23572 15164 27997
11078 27997 35343 24542 18851 8546 10813 21542 22748 31531 36635 36903 34588 39347 27265 25156
11064 25156 25726 29463 26985 30213 44884 26126 13621 18136 23417 32054 26866 19922 29541 19669
11050 19669 22396 36595 36212 48740 50914 43716 38561 45795 42108 32926 23406 9392 6800 9014
11036 9014 25515 38082 48532 49838 33045 24338 19250 22902 18893 27347 17448 12443 27162
11023 27162 29539 42359 55724 56531 59697 55939 63527 47117 21972 2343 8501 28394 52489
11010 52489 50142 62611 81504 91269 103956 112021 104787 107324 122278 127633 137732 160017 173768
10997 173768 204430 262141 335526 434410 592337 844838 1236916 1795919 2479939 3065296
10987 3065296 3230183 2834112 2146330 1524906 1094749 814284 614369 477367 384775 330672
10977 330672 300705 284497 262059 250074 224264 200365 197303 208322 197681 181095 164515 151890
10965 151890 161149 160240 157400 135818 124235 125352 133199 135069 137688 124695 100248 83929 81704
10952 81704 92156 103218 106902 105288 97606 94872 95284 80434 79916 84512 93897 91025 87463 98055
10938 98055 95841 95524 85705 74197 71380 52642 60406 78075 89517 87778 90098 96643 95817 93092
10924 93092 92361 92504 87916 88347 83700 72206 65671 76019 80825 79820 80884 68724 72855 76847
10910 76847 68150 68359 81935 100405 106953 97578 97860 95563 88029 80879 81177 78228 78834 81693 91954
10895 91954 88886 77931 65792 78743 88264 99582 96551 91267 70033 49032 33181 21760
10883 21760 23585 25079 40134 69692 93966 86491 60014 49618 53914 46551 34022 28630 18222
10870 18222 11123 18392 41032 41866 34663 28741 34208 50358 64383 73919 70645 75532 77001 56719
10856 56719 50847 67651 77659 75135 71301 83708 89112 95093 94257 80024 83950 100476 115574
10843 115574 119833 133499 151013 178174 214930 263711 334939 428569 516373 602192 656280 666196
10831 666196 643331 565826 467766 378973 304874 250041 208350 179094 142277 115224 118518 120812
10819 120812 121104 107810 100445 95401 91063 96512 94707 111871 124689 121589 124936 128081 132302 130416
10805 130416 123347 104208 96413 97023 99624 97161 88419 79844 58654 41569 47005 72451 93924
10792 93924 101339 103126 108540 110426 117066 128726 127887 111890 117916 132572 134631 119441 116489 112214
10778 112214 110013 105057 101307 95365 87702 75091 73049 85007 101305 121701 151705 178080 186671
10765 186671 183815 155591 118782 115149 127620 119854 118687 113619 103735 99760 108511 117270 132780
10752 132780 142085 147683 141140 122362 113447 128604 152214 157420 159860 156562 137475 129721 115012
10739 115012 104969 95082 81060 100426 128550 159133 233714 301722 343413 339202 315048 304581
10727 304581 298837 304578 304781 291224 264067 242250 224074 234939 237723 240130 252019 256270 262973
10714 262973 287289 317572 343870 391668 445821 503012 585321 677758 743542 770119 748719
10703 748719 715328 659855 585452 523034 474445 431754 404311 396387 392454 404156 409070 409608
10691 409608 429288 433150 434484 449094 446978 449201 454192 471241 474452 480953 485532 492454 504409
10678 504409 514842 533660 534809 539603 559760 571481 585159 608900 642926 674526 678559 683750
10666 683750 704853 754007 827289 930042 1092477 1318320 1576112 1800872 1905422 1812029
10656 1812029 1576745 1344347 1188979 1114537 1085547 1072351 1027964 986163 948984 946196 952704
10645 952704 973681 1017435 1059139 1123033 1177717 1243895 1301801 1333616 1363609 1394664 1400272 1387553
10633 1387553 1386548 1420271 1477339 1530890 1584395 1639694 1702423 1775330 1851761 1921660 2002078
10622 2002078 2070248 2121170 2186646 2280424 2399237 2555309 2725603 2909837 3108980 3281933
10612 3281933 3453369 3651873 3857689 4087651 4364239 4676766 5017050 5396006 5836539
10603 5836539 6395610 7146282 8160414 9359507 10498421 11295075 11641128 11831700 12325445
10594 12325445 13295119 14728676 16589280 18977071 22083848 26177149 31709519 39416625
10586 39416625 50519916 67156535 92892608 133032191 194808328 285692392 402851764
10579 402851764 516620239 577440124 546347687 439154118 318617015 224845219 161349243
10572 161349243 119982626 93293661 75912118 64311196 56297092 50528747 46137636
10565 46137636 42613305 39760530 37440736 35488527 33735010 32114945 30652350 29393152
10557 29393152 28297596 27189078 25831757 24108418 22244608 20545660 19088845 17860885
10549 17860885 16819904 15946788 15193731 14539183 13960518 13451394 13005299 12618408 12287061
10540 12287061 11966596 11663055 11371307 11075829 10767729 10447111 10135003 9825406 9500397
10531 9500397 9212043 8963067 8704942 8444027 8176917 7922588 7666511 7414947 7160361
10522 7160361 6897783 6621616 6378998 6177564 5990736 5792196 5612688 5464705 5345529
10513 5345529 5233624 5124676 5027084 4905485 4780939 4655906 4515459 4376901 4261655 4165082
10503 4165082 4087721 4026594 3932503 3828622 3735555 3648193 3563760 3480548 3403767 3342640 3295579
10492 3295579 3252358 3202761 3143688 3090987 3036049 2974419 2923365 2886019 2869967 2855440 2834440
10481 2834440 2835473 2845255 2884495 2952069 3081539 3295487 3513237 3621654 3492729 3186756
10471 3186756 2893563 2668807 2493760 2365232 2278571 2210777 2163475 2117015 2067035 2029725
10461 2029725 2006351 1999654 1972618 1948557 1924647 1923980 1941320 1936524 1950858 1978705 1968631 1951832
10449 1951832 1917123 1855363 1772104 1677105 1607607 1533451 1466757 1403203 1353361 1304085 1280300
10438 1280300 1260816 1230355 1190707 1160279 1143256 1118938 1073281 1015483 961401 937572 907004
10427 907004 885448 858058 847580 858638 883358 903738 924171 940208 914515 888437 875099
10416 875099 858916 820334 787717 756858 738552 714892 708710 714441 723753 725280 696926 679363
10404 679363 679987 688086 675740 662857 653330 644703 618445 589027 575785 577999 591326 586685 565050
10391 565050 558888 568586 569653 564068 575107 591167 596465 583215 561527 557634 554417 527645 517472
10378 517472 520107 510538 517540 509184 498942 501830 500385 499066 505907 531667 555216 603155 681939
10365 681939 781239 895171 1002322 1100058 1175291 1285214 1426364 1519811 1527196 1481821 1491449
10354 1491449 1536539 1552324 1514050 1478798 1503029 1530852 1489002 1364744 1232299 1138519 1077334
10343 1077334 984190 853420 741237 658919 590306 544725 503909 465811 443147 435204 423534
10332 423534 403355 389081 363293 343644 321252 305948 308564 306438 317985 316247 291800 276693
10320 276693 258539 249695 249341 239784 232942 232411 242575 247540 243609 242929 236311 220168 203156 197294
10306 197294 175147 186860 205708 229791 228838 222963 225459 213767 193847 186907 194210 216286 221222
10293 221222 228261 232998 223080 212548 214016 214947 213940 214037 198907 207020 196190 178107 168057 163897
10279 163897 159009 160830 166194 194123 221644 234772 244394 250884 237286 204340 186986 169398
10267 169398 154229 142267 134656 131800 127687 121930 111174 121256 130407 136152 138883 138933 137685 131209
10253 131209 118215 117523 109654 111355 118570 115067 113910 102023 100650 116047 131899 132506 120100
10240 120100 113653 115110 118056 128778 116668 103888 97142 106560 116736 126542 107657 107006 112896
10227 112896 128156 138804 144298 157031 153082 149929 162031 181880 198617 211560 233396 229400
10215 229400 251726 287590 312673 335259 358887 363765 385741 407221 418900 423254 423307 423375 429425
10202 429425 423279 416770 401340 398096 382600 358060 327253 310945 279434 253324 249930 233591
10190 233591 220341 207530 197011 176514 174961 189274 201364 197881 196936 189333 160913 164464 183181
10177 183181 193359 201713 229712 253170 270290 307160 374854 466826 619088 866119 1228829
10166 1228829 1736087 2391250 3016471 3311201 3061861 2441701 1799431 1310085 973015
10157 973015 755751 627750 545938 478051 424187 379968 345626 319399 297546 295097 278214
10146 278214 265706 255508 254722 258716 255125 250909 230352 204086 195639 181888 170044 181176 193547
10133 193547 203816 202285 202067 187257 194527 203050 186660 174470 174065 183496 192184 198397 201856 204788
10119 204788 204860 201998 208205 204718 205175 211414 221998 227480 236561 253738 266273 272274 266870 262934
10105 262934 260010 259991 269601 263338 265934 276101 285268 277375 272375 282899 295565 282283 273685 275791
10091 275791 289215 300996 307275 312226 321338 330225 342335 382700 406322 425861 454252 472580
10079 472580 483493 502296 502488 499486 512696 538225 539826 520312 505836 518133 521283 513641 501386
10066 501386 498242 501504 489862 475586 463356 450787 473748 480884 489297 495585 495493 502559 502278 533458
10052 533458 561992 587989 609156 628943 660470 718770 802219 890997 960479 998304 1024527
10041 1024527 1052377 1091733 1122585 1130949 1129544 1144154 1144082 1155898 1157293 1153907 1156261 1156140 1155309 1109887
10027 1109887 1041852 976173 925493 901276 907645 931843 949250 979712 1005968 1032645 1075345
10016 1075345 1109516 1148904 1191720 1261032 1373473 1499986 1586269 1592107 1552607 1530610 1531325
10005 1531325 1545394 1584798 1621000 1657840 1702433 1755503 1813454 1888371 1965581 2047562 2139296
9994 2139296 2223434 2327015 2451517 2583635 2719381 2847694 2995692 3177505 3392164 3628221
9984 3628221 3892332 4205810 4571445 5003021 5454847 5921323 6462393 7122341 7883749 8672829
9974 8672829 9438449 10277106 11297061 12518333 13904110 15461155 17415293 20029175 23600549
9965 23600549 28552816 35638855 46010566 60943021 80868059 103063651 122988394
9958 122988394 137683524 152466868 174854439 200188069 217341770 218168632 213889211
9951 213889211 218540135 227997391 231151004 224123959 219136660 222922238 226234691 216079973
9943 216079973 191470585 168695945 154030464 141591970 124412264 102440682 82381590
9936 82381590 67379509 56761275 49297328 44020220 40133835 37080820 34525265 32316557
9928 32316557 30388002 28664229 27001220 25404671 23946028 22649741 21448637 20260281
9920 20260281 19091008 18030617 17106859 16281411 15495334 14774298 14121701 13530041 12988483
9911 12988483 12512442 12092897 11704316 11332924 10986935 10655058 10322729 10009119 9720101
9902 9720101 9429793 9140588 8856495 8573896 8300902 8050887 7806747 7553512 7306739 7074598
9892 7074598 6863449 6672845 6475097 6278253 6079901 5903224 5760150 5626498 5501271 5384036
9882 5384036 5287967 5194928 5100562 5030561 4947866 4846518 4731830 4622632 4552250 4482900 4390603
9871 4390603 4300605 4237531 4184423 4110497 4024556 3943853 3866720 3818737 3767532 3686697 3555165
9860 3555165 3416696 3290335 3197395 3136649 3095236 3040159 2987035 2915697 2833608 2749584 2685310
9849 2685310 2627226 2587215 2543749 2475774 2421151 2380100 2351370 2316407 2264778 2231149 2208491
9838 2208491 2185638 2149051 2120867 2110841 2109775 2128087 2159759 2203962 2283477 2349223 2380840 2347005
9826 2347005 2248709 2130680 2038157 1964678 1892672 1830441 1781305 1750452 1731810 1705313 1684652
9815 1684652 1647774 1604492 1563571 1498086 1447182 1384324 1340201 1308685 1284891 1266612 1248897
9804 1248897 1215829 1184139 1147673 1101789 1068994 1047983 1026086 1006902 990158 965700 945268
9793 945268 923483 907888 895034 881021 877877 869947 855533 844877 834983 831937 815811 812942 803601
9780 803601 774616 755159 754857 740461 726180 729320 712288 699663 693388 696098 688522 668951 666185
9767 666185 658832 647475 636927 618887 614371 616905 617751 604057 590205 586077 578063 564795 548456
9754 548456 543918 539395 527580 521608 521086 513565 491358 469726 455847 453329 441248 427971 425167
9741 425167 419228 418243 419909 417787 412897 400902 389627 368507 361097 375008 384464 375199 361347
9728 361347 360225 349620 347572 352729 345662 334104 347336 373900 389900 373813 357290 341957
9716 341957 334706 329834 327304 326155 335435 338899 333843 319923 307231 306399 307020 301233 295796 294220
9702 294220 303555 310818 319857 307177 284088 252425 229958 223260 210087 212389 225322 226419 206062
9689 206062 201269 207848 219339 216629 204312 198674 197867 194613 181476 173457 164821 167074 180491 197165
9675 197165 194584 178624 165955 179299 180251 175559 182984 183818 184187 181000 183813 175581 163342 162282
9661 162282 153587 164214 171742 169107 168397 169125 173980 178298 167817 152683 141006 149831 159262 157221
9647 157221 161343 168694 150710 136582 136597 143999 135771 132845 136793 131468 121630 108392 119794 134767
9633 134767 136262 143038 139471 137833 126395 105345 116662 117451 128449 138874 130470 120402 115649
9620 115649 108403 119748 119354 120150 116019 108336 105817 96008 90183 87948 99206 115470 116955 111942
9606 111942 112450 122088 113825 113713 122164 121350 121520 117980 115411 104446 92637 101625 120645 120343 131226
9591 131226 137539 119059 118548 137806 146047 152313 145078 143773 161563 166131 176546 187714 181655
9578 181655 175881 181622 189358 193253 197776 202325 206372 204628 213380 211841 206871 202589 201353 207508
9564 207508 243039 249312 232534 228871 239570 258872 276000 293217 326755 376671 425936 479491
9552 479491 577499 700631 803407 888089 987846 1123976 1276676 1384729 1416614 1392035 1417097
9541 1417097 1484356 1534885 1520585 1489910 1494597 1528135 1514003 1407374 1283695 1188028 1114775
9530 1114775 1030467 918396 817694 772300 717358 669543 648410 634274 637540 639780 646099 645602
9518 645602 642576 649317 676558 702186 708525 712372 738273 761516 785370 815250 843667 873384
9506 873384 901062 931025 975090 1021106 1077730 1128500 1183272 1234721 1292990 1351026 1394433 1447780
9494 1447780 1511369 1565159 1597219 1628872 1655545 1684001 1711782 1743037 1767098 1768749 1755621 1740345
9482 1740345 1713402 1674022 1649372 1611151 1547649 1472945 1409672 1353760 1305674 1258610 1222325
9471 1222325 1199127 1152114 1093415 1042536 989863 944249 898364 868692 835929 811336 779773
9460 779773 748711 725664 704751 684706 663374 643235 636338 602059 567986 546002 526812 499838
9448 499838 470614 451608 442120 439399 437172 424653 414798 399397 374921 363087 362422 354965 347261
9435 347261 348575 342551 319641 291883 287787 277536 265997 260694 251506 250033 252942 257845 263408
9422 263408 252351 237364 229745 234109 232642 214448 202032 202984 219231 217347 206264 189266 171864
9409 171864 171535 178250 176746 178899 165628 164643 169394 170934 166226 161045 162620 158786 133940 130481
9395 130481 145196 154406 150597 146398 136321 129938 139647 146942 148072 139521 131242 120296 122098 130248
9381 130248 130475 137027 132657 128782 131025 134709 137805 122589 108923 108840 104648 115402 117600 104280
9367 104280 103282 113375 118903 114153 118823 107096 96887 84803 87275 89936 97438 101653 101661 88182
9353 88182 78024 80835 94721 89415 76835 69489 66093 68001 72432 77566 72213 72066 63258 59027
9339 59027 59645 75525 75566 65791 66051 89248 103141 79422 71217 73920 72347 71279 73159 58360
9325 58360 47326 58147 69277 75494 76327 68288 66381 71906 71031 66808 66562 54847 59159 58476 50894
9310 50894 56500 47625 46271 57803 60955 47526 34948 23257 46496 71258 69918 51640 37281
9297 37281 37351 41779 44971 61164 66780 48914 30400 10312 11407 29564 47083 40436 32675 39698
9283 39698 49014 39475 30333 46655 56496 54177 43804 27424 22571 47875 72771 72292 64767 60426
9269 60426 69991 77012 66735 33856 19101 13637 13049 25825 45914 39159 20610 21017 19126 23768
9255 23768 20225 20783 23080 27738 41353 41599 54121 50941 41236 30370 48267 57031 62140 47650
9241 47650 40169 43860 48980 51824 53789 43368 37277 33816 26445 25470 32436 38960 38193 43738 42646
9226 42646 43723 51250 51098 40288 41953 54624 41089 34025 33582 34027 35474 32088 24123 23395 26488
9211 26488 26503 19402 28820 36709 26315 33411 58232 79233 91132 79292 61584 67128 68593 63303
9197 63303 66766 66701 78264 69943 60870 59397 50722 37573 22357 14776 11471 12274 31770 34153
9183 34153 21106 22719 33228 38432 50933 49410 46750 48559 54697 39307 34471 36699 33154 35664
9169 35664 29090 11618 5966 8510 9259 26529 25197 18446 13529 15883 18262 18288 41503 41380 32601
9154 32601 5292 2407 35675 45434 46609 50106 34109 25920 25069 30477 34445 32341 32040 31089 30453
9139 30453 21902 22449 25952 35771 45296 41119 41302 61077 56191 47898 45951 49655 45468 41214 54835
9124 54835 53605 44129 40831 20511 15322 32432 46368 44253 39935 44672 48515 49687 39748 32606
9110 32606 30418 36764 37585 27529 31433 25952 25244 29363 35265 34783 26148 30937 32647 25223 21438
9095 21438 23969 26597 16011 18522 30420 46773 46812 49466 59970 53434 48727 44650 42186 49996
9081 49996 43145 31659 13929 12169 11176 18840 34688 32959 34357 42586 43200 40519 48507 35864
9067 35864 23630 25736 41009 59858 68897 63988 71910 61848 53691 42172 30036 41691 50197
9054 50197 39221 38695 50080 58969 55902 39112 27060 18312 26486 29871 29412 28179 29279 25769
9040 25769 29851 36651 53172 56495 66930 87572 78959 58079 48199 40630 47355 51439 50450 57213
9026 57213 55620 52443 47751 50305 38754 35871 43184 37215 23084 17029 19267 18032 25092 36695
9012 36695 26360 19779 21271 23529 14950 13635 19735 25060 30461 33805 38657 27673 27335 18280
8998 18280 11799 6729 12813 25432 12167 10879 19010 17767 6054 12541 19750 17209 31895 40356
8984 40356 40247 38493 33943 21165 17022 32824 50430 47942 33849 24665 17046 27380 30102 16418
8970 16418 13649 5133 6425 20131 35825 24232 14130 23290 25991 18339 7325 10281 18674
8957 18674 24006 23467 25505 30768 16375 4441 -2731 -84 16531 34275 18907 24926 37922
8944 37922 34493 28071 11943 17634 53133 54983 47559 38644 43355 43233 38369 18703 23999 27736
8930 27736 33345 28555 24054 19043 11744 19019 24058 39082 46676 44165 31780 17491 18026 19652
8916 19652 15739 13968 16495 12711 16581 12832 8946 23239 37535 31982 32153 43282 58941 51755
8902 51755 42922 41798 33355 32205 39231 59495 58008 64464 57030 42330 36851 30504 18978 27089
8888 27089 28063 21944 33103 36094 27257 17166 17760 36400 40207 25381 3635 6044 24004 30549
8874 30549 33526 29625 36090 33775 24193 24348 37753 52703 42701 21438 16004 22533 33738 21257
8860 21257 4601 -309 3416 12406 17958 30922 35087 30503 37968 44647 31111 28783 14754 9524
8846 9524 14470 3707 1854 10167 17812 18651 14717 25087 29385 17388 11432 4178 -10557 -11705
8832 -11705 8658 13219 12727 17687 15870 9888 14688 22886 38306 48940 49086 43393 43246 47787 34038
8817 34038 21144 19526 16698 6333 2871 16124 25904 19659 3972 14158 18179 17547 14239 14689
8803 14689 11654 11662 22169 23022 16388 -1140 -12146 -8002 -18493 517 15857 15903 18316 18210 17385
8788 17385 16277 26608 29756 25337 36841 32045 26885 16799 25696 32207 32399 33876 32439 31478
8774 31478 15351 8690 1166 -222 13855 20454 30890 19968 21648 28178 26593 32905 29793 29041
8760 29041 21533 7212 20751 23250 7178 5043 9106 28339 35626 41063 48700 44326 40091 46313
8746 46313 55806 47431 37365 40781 45056 49710 51478 44628 39983 34773 34834 44565 44394 40524 51781
8731 51781 44497 41061 28737 40860 36118 35326 45228 44716 54079 49667 46245 51719 49645 35801
8717 35801 28782 39611 40492 35875 41524 46452 53062 56338 71836 71827 85443 93686 91917 90684 93682
8702 93682 82984 61293 38042 19309 21524 22293 26324 18246 25627 37163 36757 44909 54689 52565
8688 52565 44133 52651 41546 25465 11957 13179 25055 26292 32254 44660 50115 49111 54571
8675 54571 66983 63818 39822 35416 35968 41290 47678 39461 27071 18333 3657 -841 3528 981
8661 981 5643 18049 28639 17666 9472 15844 25121 30506 31646 26239 25233 14135 15300 26793
8647 26793 25516 28419 28546 34066 42967 34077 28687 23545 14111 12641 18586 15841 12552 18152 14067
8632 14067 14148 17582 17408 15682 22903 33401 32275 10453 21683 29354 22575 17011 20855 22579 31862
8617 31862 24937 8490 -5184 -1600 -1393 1010 17438 12353 2139 3632 6108 9598 7073 7535
8603 7535 18024 15190 17289 9213 11578 10846 3271 14126 14686 7523 1665 -2907 -3746 6065 22077
8588 22077 20035 13934 14762 19932 22070 30978 30958 30259 28986 29390 33924 30063 29666 17757 -1169 3886
8572 3886 7980 4402 10108 5091 8097 25179 16173 22764 29007 20557 28507 40405 55677 51689
8558 51689 35726 27562 26623 23041 27762 30820 37899 62999 76002 78751 74123 79488 84735 78033
8544 78033 67419 63923 70216 61631 48289 36712 24667 20938 25364 30434 29450 23888 18046 20900
8530 20900 30156 35452 44920 36456 27871 46347 61338 65721 66567 58776 53043 38230 30193 29272
8516 29272 32228 33067 31543 35309 56151 41709 37452 38331 42935 55479 53034 54923 55187 56726 55333
8501 55333 60568 73865 84949 88710 87225 80353 88306 99640 98186 82033 70987 54235 52272
8488 52272 44263 35631 37510 49937 51147 68436 64039 63749 67657 76579 90245 85096 84226 68173
8474 68173 61872 69139 80114 71077 47889 28789 28898 32062 37395 42046 38872 35162 31554 24508
8460 24508 9370 2353 2304 11934 16772 12029 3713 -5160 3134 -1882 815 -494 2631 14096 16010
8445 16010 22402 28162 21979 18428 10909 12206 14419 17844 22682 31272 42494 36852 44897 54056
8431 54056 54479 49736 49394 37175 16250 7389 -383 -1190 17734 29021 28895 5899 -6289 -8175
8417 -8175 4944 24619 27453 41831 44357 34695 23047 15857 15954 14894 9082 5514 12659 14487
8403 14487 19911 29779 34370 19900 6336 -1077 -1106 2125 -12759 5247 20912 38727 31244 25718
8389 25718 31607 21812 39617 51716 38821 15611 7296 7472 18634 11446 7639 11746 8648 11694
8375 11694 13667 13894 8277 8851 12286 4908 4085 16618 27514 22014 28643 34130 16878 15075 15747
8360 15747 5132 -10911 -8612 10204 13737 8973 10021 20926 22845 9293 8199 11931 16726
8347 16726 2831 -14139 -4750 6383 1191 1047 -198 802 -6846 -2431 12346 15929 20866 11680
8333 11680 11122 11440 12362 19333 23414 27878 26484 32752 29780 15762 8638 17770 28097 31695 35879
8318 35879 26125 17059 14402 11101 13814 5399 16332 30929 43070 46366 41844 44533 45179 46929
8304 46929 46733 46413 46351 30829 30933 34611 47774 65075 75746 78819 93460 124568 159840 177542
8290 177542 216603 288662 364680 434270 463853 437384 374238 296729 239023 187920 150584 127073
8278 127073 120228 111299 90990 75555 72373 63261 58663 54001 55349 53048 59050 66255 59652 49139
8264 49139 41523 41178 53774 58101 56047 49666 37525 26170 23108 37401 46444 42130 55910 60043
8250 60043 68216 85055 112419 145820 183552 233402 295713 363638 415829 437903 434146 390447
8238 390447 336371 276165 215204 171636 138353 120577 101167 85413 90272 85455 64985 53258
8226 53258 65367 62865 60384 68827 69339 66052 54439 52529 50741 47477 54606 50596 44005 30370
8212 30370 13737 9975 2535 6182 17322 28955 29078 33944 28183 8394 10500 23541 16766 6414
8198 6414 11754 24810 28533 23773 6844 10562 8052 10676 15651 24449 24992 18242 24792 23243 26007
8183 26007 16062 12053 -5630 7671 7644 12607 21038 17644 23827 26843 10151 -5024 -1469 -2950
8169 -2950 -12975 -1969 13695 10719 13029 15630 11519 23101 39469 30392 20437 22787 18679 20834
8155 20834 31726 30982 4038 -22812 -22895 -10881 -11413 -8847 -3805 3053 -747 3066 4678 -380 16200
8140 16200 21305 16519 -3948 -14744 -17994 -10907 5568 7035 12275 11136 9207 10453 14227 8999
8126 8999 5191 -3274 -4419 9403 11921 9625 10544 14990 16218 18675 23922 24227 11477 10114 21150
8111 21150 8084 -1729 3661 1584 -9947 -7966 5088 7582 14875 21482 18558 21920 25491 29446
8097 29446 36235 30078 7841 2953 2065 9939 10873 10628 9315 7451 4436 -16436 -26300 -16064 -3947
8082 -3947 -5442 -7872 6640 14231 20871 26883 30214 10895 -13551 -18273 -4294 -451 -5578 3615
8068 3615 20282 23100 29965 27086 1326 -5741 3547 12722 5362 13363 25497 19861 5521 -13995
8054 -13995 -10807 7977 13800 24582 26503 24715 27355 19228 18384 20241 4530 -10914 -17585 -10655
8040 -10655 -43 -4077 -4850 2157 -3693 -3352 9188 9808 11543 19924 9490 10402 11029 3759 -394
8025 -394 344 5173 16208 10085 -2161 1704 268 -432 7390 5064 6465 215 6554 8877 -87
8010 -87 924 4880 13258 10336 19987 13107 3732 -4492 -8379 -5649 -9508 -4803 14983 12783 10302
7995 10302 2815 3541 3254 -979 -4839 -17018 -17907 -11640 -12570 -1965 15617 29886 20403 15642 1787
7980 1787 -11218 -17633 -7565 -1069 760 -10856 -11587 -1060 -4285 -1953 9405 11338 8399 19980
7966 19980 11332 3232 4608 -2083 2552 6921 16280 16192 10552 -3648 -9038 -20284 -24125 -27244 -13125
7951 -13125 -5038 256 14999 1245 -7695 5613 -2595 -5244 -6455 -7608 -12551 -14393 -10149 -11132
7937 -11132 -5122 -310 10106 11449 12198 13890 20313 20510 20528 24126 25122 16873 10101 8362 541 2659
7921 2659 4468 2430 1974 -10768 -14818 -4437 5774 -5509 1569 9348 5558 1533 6181 -10263
7907 -10263 -4258 8787 15067 7430 -10268 -13634 -14816 -25535 -12646 3460 10412 22704 27221
7894 27221 28631 27509 13328 11172 14627 8828 -7410 -10908 -21214 -32033 -25873 5109 775
7881 775 -3536 700 -10498 -16527 -8066 -18693 -7296 555 -5260 -5108 8221 4353 6011 -2081
7867 -2081 -9280 -4835 -8280 -26689 -32830 -26383 -14394 -12211 -15048 -9365 8811 10031 3687 980
7853 980 4690 13117 5687 -4971 -73 5878 -6144 -17935 -17531 -24644 -30088 -33722 -39360 -22391
7839 -22391 -9730 3134 1097 5276 13236 10813 12104 17619 14882 33718 30811 15889 17981 23228
7825 23228 19932 18314 11288 2086 -8341 -1071 -8742 -10038 -6752 2038 2247 2047 -1869 -5962 -1571
7810 -1571 -7900 -6678 -3896 -20272 -15680 -13050 -11477 -15580 -21238 -22526 -10301 -14623 -11282 -15554
7796 -15554 -18597 -27694 -8727 -11045 -6311 2836 4461 -9994 -7964 -7365 -19685 -21863 -20479 -23716
7782 -23716 -26550 -14866 -15022 -20857 -19125 -7701 -937 2244 13307 22945 11848 8896 20783 23068
7768 23068 25894 19761 6539 3968 -5949 -11777 -13258 -8231 -14582 -1491 5827 -13575 -14714 -12138
7754 -12138 -8433 3508 -1671 4603 5024 -2404 -12995 -16237 -5463 4504 -11264 -9864 -376 3684
7740 3684 1774 -4734 -9670 -20271 -2395 8016 -947 -9263 8318 19813 12152 17857 20593 7694
7726 7694 -1729 -6936 -10307 -10289 -4760 8592 1598 -15 3289 3530 -6518 -1661 6393 7809 5874
7711 5874 13110 11845 8169 10566 -3845 -27660 -36643 -19918 -6723 1950 11306 13088 4955 607
7697 607 -6 12880 5272 1536 -12214 -7192 12726 6588 -7907 -12231 -12029 -10129 -35 5960
7683 5960 -9177 -14901 -10078 -7266 -17759 -11601 -5863 -7285 -8475 -16295 -30439 -25441 -25890 -18361
7669 -18361 -19727 -18942 -12736 -7573 977 3909 -1204 -6529 -17177 -26027 -28344 -24492 -7104 -5608
7655 -5608 -16360 3129 16441 7771 2402 5765 5323 -91 3115 -12549 -13602 -7238 -20970 -13445
7641 -13445 -28370 -23755 -14101 -11623 -3267 -1737 2867 10204 6283 13758 5093 -7858 -8463 -9153 -13735
7626 -13735 -4333 5128 4638 3795 -6797 -16126 -20080 -13318 6704 20539 18080 12167 23306 31634
7612 31634 25901 8307 -16310 -22387 -26536 -38080 -33268 -20985 -12413 -1017 12043 7576 6892
7599 6892 6584 13420 26482 33204 23190 19526 7335 -12854 -13483 -3952 -13609 -25213 -16927 -13110
7585 -13110 -11268 -10611 -7625 -22636 -15127 -5905 -9642 -13599 -5291 10040 4303 -8477 -13621 -2107
7571 -2107 273 2185 -3023 -10919 2381 19008 13070 5334 -6801 -4210 -9310 1447 17330 9406
7557 9406 8280 11579 18008 36436 32717 21229 6234 6328 12811 8846 -4309 -10394 -7618 -10234
7543 -10234 -19349 -16364 -13348 -8569 -4251 -503 7275 7934 7142 -6735 -11483 -9363 -1826 2919 -4309
7528 -4309 -6725 -3056 2369 -2887 -9189 -4333 -17091 -30916 -32827 -32741 -23013 -22228 -23894 -19435 -9154
7513 -9154 -8985 -8747 -10483 -2613 8525 9281 8561 6704 5742 -8568 -13259 -23234 -7666 -7909 -18709
7498 -18709 -17724 -3273 10213 11187 4645 -10000 -29657 -25163 -16280 -8579 -11326 -15254 171 8853
7484 8853 4887 4615 5212 8626 4602 7362 -1051 -6308 -21100 -19837 -17375 -13377 -2254 -2596 -9505
7469 -9505 -19791 -40211 -41917 -32431 -28264 -31631 -19922 -15378 -14041 -10385 -206 18402 17754 8605
7455 8605 -4299 -11017 3191 12453 2651 -14651 -21448 -12035 -3714 -5589 -12177 -11672 -5355 6029
7441 6029 9298 10556 3942 -14234 -9732 12094 15632 3593 -5658 -12949 -13762 -15060 -14609 -21071 -20524
7426 -20524 -11705 -15940 -13847 -16379 -6307 14042 7855 -260 -6499 3628 13706 3357 4333 1174
7412 1174 -7367 -20334 -14781 -10406 -8309 -6461 -4175 -8659 -6089 -15157 -13638 -5137 2955 488 -3983
7397 -3983 -13714 -10428 -6407 -17224 -15081 -2274 -4206 -5047 494 4626 -12291 -6033 1382 -4374
7383 -4374 -10156 -2295 -7330 -16061 9491 10516 1517 6106 6846 4520 -8820 -14964 -18730 -13624 -6105
7368 -6105 6276 -17860 -17092 -2125 -12104 -6242 -10717 -5569 -2617 -3450 -1769 -4790 -9491 -2018 13551
7353 13551 18619 7229 -376 4003 15766 24324 16017 1330 5418 -748 -3074 1223 2754 8515
7339 8515 15211 7432 1742 102 -5220 -7545 -7830 1047 3117 8645 2940 -6403 -3425 -2098 -9328
7324 -9328 -27009 -18807 -7696 -1161 3596 10369 1126 -11820 -17573 -9671 -5974 -16183 -13239 -6013
7310 -6013 3545 5516 -4164 -2086 7717 6262 9750 1615 11105 10539 2342 -10427 -15642 -11301 -18513
7295 -18513 -10295 -7782 -5528 -17214 -20170 -6427 -1926 4895 1743 7983 8088 5364 15039 2662
7281 2662 -10971 -13263 -5102 -1541 2201 4696 -2235 2493 1123 -12404 -12364 -9049 2048 4043 -1938
7266 -1938 -3292 -4921 -12467 -11629 -13320 -9052 -8967 -12851 -11283 -16089 -9309 2486 12525 4525 5000
7251 5000 -3816 -22721 -13945 -2372 4032 17755 14706 13981 813 -3776 3935 -10352 -5229 -14157
7237 -14157 -13021 -7037 -10464 -2913 5639 5544 13947 13099 11434 18467 14365 1592 4212 -52 -3974
7222 -3974 -17148 -25969 -15017 -13381 -10176 -5889 -17364 -19318 -17627 -14814 -12441 -15261 -27644 -22232
7208 -22232 -13872 -9015 -17779 -7802 202 8644 9113 16725 19687 1510 -5507 3507 -7968 -21940
7194 -21940 -12118 5403 17966 25771 29240 13734 -3057 -9008 -9106 -18310 -19885 5110 7415 8336
7180 8336 -1057 -9719 -20088 -18680 -18462 -23130 -17927 -29472 -33269 -27537 -13058 6489 16129 11977
7166 11977 -3546 -7648 -1213 -954 -11877 -22976 -24096 -7758 12908 5812 -5507 -3428 7683
7153 7683 17633 10578 7321 5200 898 -7488 -19191 -15621 -13810 -16192 -12659 -10312 -4890 -5835 3568
7138 3568 9283 11637 18899 12690 12037 7117 4497 1704 8671 6159 -6638 -15078 -21265 -19571 -8726
7123 -8726 -3878 12286 13688 8712 1053 3428 9541 13462 10022 15062 11004 3799 -3679 -2005 587
7108 587 8290 19108 13386 15529 15576 18405 12996 -10380 -2019 209 -1927 -6874 2592 -10809 -14465
7093 -14465 -12891 -16156 -10992 -10860 -8056 -657 -193 -9700 1136 10513 19284 26640 34614 14940 -7619
7078 -7619 -17070 -20916 -10690 -1621 2091 -9323 -10908 -17520 -27169 -22753 -19254 -22444 -20521 -12141
7064 -12141 -3827 3034 2590 2539 7085 -1410 -2283 5101 6084 2929 10975 22455 24527 32656 31807 21686
7048 21686 17056 -4240 -20501 -26219 -24130 -18690 -14157 -11666 -733 5178 1454 -17158 -20595 -24706
7034 -24706 -19778 -8828 3871 5202 11875 2754 1267 10475 6667 10591 11035 -4354 -6627 -178
7020 -178 554 3732 4393 10080 10777 12547 -3202 -11907 -8746 -9704 9226 15229 5393 -3085 -13899
7005 -13899 -18199 -24847 -34107 -31506 -13619 -3168 -8159 -11766 -10350 -4108 -96 -5019 -2588 -16291
6991 -16291 -13493 -10657 -7549 5841 3655 5400 16142 17583 5420 2016 4868 -9741 -19845
6978 -19845 -12944 -11537 -30049 -16434 -1419 -3124 2528 4159 4536 7487 7286 -1605 -7757 -14928
6964 -14928 -27140 -8176 -340 -394 4605 9486 3837 -21576 -20028 -7995 -1914 -8152 -4745 3069
6950 3069 895 4670 -2653 -13273 5764 16032 -610 -5160 4525 2755 496 1943 9233 5099
6936 5099 3168 -1021 4973 8864 929 -1313 -7926 -12678 -10084 -5802 1723 8300 -388 -222 8415
6921 8415 954 -2286 4474 9925 1827 -5287 -7210 -1048 9550 -4011 -7609 -25402 -23867 -17923
6907 -17923 -12072 3757 -1508 -9059 -11294 -28696 -38157 -24744 -13904 -16291 -11309 -5295 -18968
6894 -18968 -21380 -7089 -12768 -14979 -13138 -16986 -16166 -9164 -20434 -29752 -29330 -23019 -27569 -42783
6880 -42783 -30333 -27310 -13468 -14035 -14068 -5100 -4479 -8856 -8171 -20336 -22839 -23721 -10946 -8905 -11571
6865 -11571 -4889 4276 1922 -7961 -8623 11257 16649 10311 17630 7760 -524 -8389 -12930 -11221 -12681
6850 -12681 -10453 -7769 -3186 -13751 -27936 -14254 -10021 2019 7408 10253 6774 -9154 -18349
6837 -18349 -26387 -30932 -21882 -14955 -9050 4527 20696 13961 9292 8591 -2521 -4830 -9610 -21439
6823 -21439 -22190 -21103 -20456 -2634 1411 -5508 -12837 -30521 -29586 -18722 -3465 -9207 -19057 -10508
6809 -10508 577 18155 22718 16438 3752 -5114 -8442 -1157 -701 11851 12463 4788 340 -6319
6795 -6319 -12821 -9752 -12331 -14446 -20869 -21915 -15812 -8029 1518 86 2311 -3405 1364 9857 13370
6780 13370 -5945 -4754 -8816 -11328 -7199 5071 4021 -3748 -8466 6779 13463 14915 4985 -7308
6766 -7308 -12257 -19515 -20417 -12127 -6168 8628 10993 11878 1183 -3109 6550 2189 693 -793 -10453
6751 -10453 -21830 -27828 -20814 -18584 -28126 -5569 1044 -6575 -10945 -15619 -11887 7813 11561 408
6737 408 -4263 15675 23007 14962 -1159 -9271 -39 5788 -1248 1873 12992 13343 4120 -16513
6723 -16513 -19600 -9152 -17922 -4350 18622 13014 11534 14595 5203 1568 -13140 -24917 -32402
6710 -32402 -27846 -14866 -6005 467 -2882 -14007 -10398 -9473 -6986 2607 -2098 -3955 -7401 -15205
6696 -15205 -11323 -20037 -21167 -11600 80 -758 -6594 1006 5001 10523 16057 29739 50554 58069
6682 58069 68065 103940 144006 192199 237213 252258 238148 182683 138154 105410 69641 40442
6670 40442 39289 29976 21269 16192 18503 23402 14259 272 -970 4893 17975 28341 13885 3818
6656 3818 -2222 2559 16629 15046 8847 2023 2728 -2038 -2162 -9951 -5040 3866 6618 998 13587
6641 13587 13851 18738 9035 8879 10495 9481 -1492 6887 3541 6584 -3669 -10313 -15628 -3488
6627 -3488 13038 9995 2111 -7311 -7706 -7010 -1592 8121 14021 7189 -10696 -8501 5672 5985 -7263
6612 -7263 2957 -15875 -15858 -12903 -14559 -12381 -8954 3383 16640 10130 607 -3402 -5174 -4620 -2312
6597 -2312 156 7899 4191 -10340 -19470 -22430 -19070 -8663 -2064 2531 7538 8725 11960 7034
6583 7034 -4450 -17810 -15138 -13620 -19621 -11191 -248 -1085 -3358 -9641 -6780 -3398 -4168 -1638 8036
6568 8036 2637 -10720 -14633 -15302 -7336 -12563 -8657 -11498 -9530 -6918 -6843 -5593 -5039 -6359 -9137 -6166
6552 -6166 -9869 -10400 -12102 -13010 -16023 -7558 -14276 -9452 -15246 -22607 -20851 -462 13620 11214 17674
6537 17674 7837 2134 -1147 -5832 -17575 -19390 -17173 -13029 -10888 -7856 -5917 -14416 -23314 -12100
6523 -12100 -1280 -819 -975 2525 8155 -2803 -17488 -24011 -21330 -14555 181 -3019 -2846 12752
6509 12752 12004 7069 -5755 -20895 -25074 -19743 -18780 -15408 -19482 -19861 -7441 565 15666 16756
6495 16756 2539 5238 1132 9600 9044 -36 -5267 -11 -2951 2196 -498 -1178 -9316 -8263 -17586
6480 -17586 -14068 -15947 -15650 282 13874 176 10261 22815 3985 -4164 3468 9877 6085
6467 6085 4404 -1159 2758 -10327 -7730 -10079 -14227 -19349 -13207 1984 8987 5027 -11047 -23508
6453 -23508 -22018 -9262 -11029 -9819 -9559 -10028 -4750 -2191 -923 430 -1842 -11421 996 -1414 -12307
6438 -12307 -18710 -18436 -20212 -20979 -21790 -9025 1810 -1384 2843 8377 -225 514 10438 14887 10862
6423 10862 -11804 -18957 -10936 -7456 -5023 -4078 -7940 352 3327 -10328 -8125 -13670 -16864 -19959
6409 -19959 -19823 -9592 -18175 -24914 -21692 -7011 -2779 -6516 -8478 -6091 3746 -3162 -3049 7339
6395 7339 14299 17736 9385 5284 3475 -2259 -13838 -13923 -17375 -7092 544 -11489 -20174 -4228
6381 -4228 -11436 -16798 -12037 -6302 -13009 -12912 -6119 -5194 -2431 -11242 -17712 -8966 2328 -10972 -18189
6366 -18189 -11846 -3384 8152 7153 16695 7155 -7662 -14886 -9240 -5746 -2249 6105 2688 -8018
6352 -8018 -8620 16632 19484 4160 -7429 -18976 -22542 -13514 -14107 -4183 -16924 -22836 -22576 -18762
6338 -18762 -24331 -18104 -15157 -18952 -16841 -18018 -22801 -20186 -19165 -18130 -27009 -35287 -28618 -22521 -12825
6323 -12825 -15057 -17368 -13277 -11497 -21486 -29287 -16987 -14034 5151 16488 9895 1069 -4268 -13113
6309 -13113 -26387 -23930 -14940 -8366 -7561 -9347 -17899 -9763 -8062 -13458 -9758 -10522 -2824 -6475 -14677
6294 -14677 -16165 -31902 -40768 -33196 -24589 -13151 -20288 -22953 -16743 -11212 -3920 101 13559 17904
6280 17904 15855 10147 3278 8802 6477 -9531 -16073 -25145 -28401 -24744 -15109 -19463 -27697 -32227
6266 -32227 -24197 -13203 9179 14020 15191 105 3744 8607 -150 -5548 4665 -1824 -8378 -10005
6252 -10005 3204 15119 14264 1221 -12450 -2149 11026 6798 1751 3972 14489 27671 25723
6239 25723 22750 20055 28201 24682 8489 4480 6904 4060 7655 -680 -301 -1305 -2129 -2520 7788
6224 7788 4380 8709 4848 4545 21041 18859 10233 10599 11508 11668 14643 15244 17642 16505 13915 24438
6208 24438 26145 3947 -14620 -9702 -6553 -7150 -7541 -12749 -8714 6247 3277 3843 -353 -3233 -9912
6193 -9912 -12721 -15710 -15243 -6148 2913 545 -1268 12804 11557 7999 3117 -12355 -3594 -6392 -24388
6178 -24388 -10257 5158 -4235 -910 7968 13972 18359 11331 -972 5218 17701 18105 13804 10959
6164 10959 6084 -1752 -9587 -3471 9078 -2955 -12729 -30973 -29364 -19305 -7170 -4152 -20766
6151 -20766 -25883 -31852 -22642 -19196 -13102 -18581 -2721 2255 340 -9693 -112 -2574 -6849 -5683
6137 -5683 4841 5755 11931 23199 20925 8005 4949 1536 4300 3649 -5158 -18175 -37485 -35023
6123 -35023 -29721 -25315 -26828 -21821 -16901 -8961 -8175 -1082 -3568 -3058 -389 8203 -8236 -21967 -33208
6108 -33208 -29229 -25572 -23798 -19707 -12391 -4023 -6215 -5123 -15694 -8344 11100 15079 3347 -11496
6094 -11496 -13156 -8189 -15017 -14165 -524 6128 3360 -4782 -19984 -39641 -41313 -25014 -10816 -7889
6080 -7889 6116 10223 9318 4593 -1021 -12263 -13618 -15577 -6149 -518 3678 13420 3993 -12821
6066 -12821 -1589 10845 4938 7384 10187 17409 13655 7595 9623 3856 -9213 -9664 -17022 -19322
6052 -19322 -15696 -12823 -3104 -12015 -21598 -16416 3218 -6616 -6968 4853 6655 17603 17452 3712
6038 3712 4528 7370 -380 -317 -7553 9304 5419 -7535 -15540 -11421 -6612 -307 -7306 -16941 -23220
6023 -23220 -4040 13815 13330 5548 -8130 -17950 -21477 -19216 -16751 -16653 -15093 -8375 -2575 -1302 2844
6008 2844 1080 -9672 -10789 -21591 -19607 -12884 -8156 -11024 -6045 -14949 -20365 -17931 -10910 -12462
5994 -12462 -435 6953 13708 15161 9064 12342 10738 6738 2175 -4304 -15094 -24504 -27038 -16461
5980 -16461 1353 -4421 -1089 2737 2405 681 5727 5696 858 3567 -2746 -13299 -13442 -3562 1552
5965 1552 -3925 -58 2424 5025 13173 25470 30357 22128 12159 -6877 -18002 -20248 -9325 -4107
5951 -4107 -5679 194 5319 3131 -2393 -10488 -8975 -4402 -10087 -10692 -94 1735 -5875 -2971 -8251
5936 -8251 -13360 -5636 16147 7706 242 1638 11152 6725 -10142 -4379 -7695 -2985 -13231 -21855
5922 -21855 -23288 -14732 -4435 -15697 -6564 6558 -11814 -11776 -3257 11049 -7285 -12977 -20349 -12764
5908 -12764 -16961 -22583 -13327 -1565 807 -7503 -6872 817 4455 119 7133 3645 2009 2243 -5689
5893 -5689 2403 6770 -7372 -21980 -16066 4341 6932 -6942 -17316 -17184 -13712 -14877 -8149 -13760
5879 -13760 -23672 -14880 -981 7984 6228 5613 -3156 -14841 -8967 -4954 -8953 -13431 -16322 1320
5865 1320 10934 -2971 -14250 -17735 -11251 -16117 -12974 -14131 -23222 -17033 -12125 -8480 -5707 -9884
5851 -9884 -11727 -13658 -17995 -13942 -5153 -4981 -16503 -16465 -1918 -46 -14704 -23838 -16389 -13962 -16138
5836 -16138 -13431 -22128 -15669 -13947 -17811 -16326 -17192 -8095 -449 195 131 14605 22075 19904 15062
5821 15062 6245 -526 -7673 -7947 7108 7969 11400 10421 6125 -8844 -11587 -2002 6078 11559 13760
5806 13760 -6897 -19255 -30101 -20872 -15620 -9766 -2851 4828 3576 184 -9764 -11966 -7132 -42
5792 -42 994 5177 14966 8827 1785 2855 460 -1684 4618 17135 6023 -4507 -9217 -6146 -14322
5777 -14322 -20342 -31774 -38535 -26204 -17835 -17023 -19513 -13235 -15482 -15750 4591 14988 1221 542
5763 542 -11250 -9115 -15123 -17367 -3390 -7120 -15739 -19810 -23660 -7396 16811 11460 1457 -2445
5749 -2445 -10670 -16386 -10749 -6187 -7874 -15829 -15597 -16071 -25682 -23948 -35486 -43241 -27203 -6301 -9480
5734 -9480 -14084 -1658 9369 1811 -1245 -11949 -14840 -28394 -32100 -37557 -30331 -18630 -8415
5721 -8415 1791 1262 -5689 -2675 5443 7787 -3260 379 12368 6414 -8778 -20100 -14450 -3353
5707 -3353 -10289 -24625 -23366 -17993 -14372 -11522 -3722 -8748 -15112 -13186 -15385 -23494 -24752 -17136 -1957
5692 -1957 3307 4090 -1073 -12589 -12957 -11287 -9118 -10851 -6021 -14319 -35308 -36857 -31156 -16484 -15166
5677 -15166 -24740 -14166 -15529 -25250 -27653 -19114 -4819 10922 9307 -3468 -15863 -4886 4711
5664 4711 7709 14933 12805 13887 15037 12655 2467 -2352 -6375 3 857 6395 7185 -955 1308
5649 1308 -2392 -5781 -14941 -14918 -10808 -13969 -28688 -9395 -1616 -10029 -15291 -9066 -8997 1269 13476
5634 13476 15054 3224 -4364 -10525 -6749 -3291 -8202 1249 10370 14942 1492 -7107 -19853 -17487
5620 -17487 -14089 -6976 11397 8451 6026 7171 6620 17708 20062 1650 -14662 -15143 -9652 -2669
5606 -2669 2643 -4792 -12777 -20676 -24577 -23452 -18583 -18452 -11121 9304 10819 3852 6324 6274 -3190
5591 -3190 159 -511 5071 8023 6684 15183 6592 -3054 -8695 -10871 -9043 -999 168 -1343 -673
5576 -673 -3388 -1353 -3850 -7377 -23463 -28912 -16486 4748 14859 20685 19131 9503 7417 -4169
5562 -4169 -7279 -10923 -8377 -18041 -4150 8433 4648 -7558 -12244 -19318 -20702 -20871 -40277 -40234 -26024
5547 -26024 -15842 -13930 -8563 -6097 -5311 -12672 -13654 -3213 6152 -4782 -4160 -11305 -257 -2779
5533 -2779 -4033 4932 15534 19738 17021 28345 29225 12649 9136 12069 3436 -10805 -18783 -37904
5519 -37904 -28957 -15092 -14429 2941 15396 17910 -8922 -18781 -10982 2779 14478 -5796 -13878
5506 -13878 -11175 -12957 -10255 -13661 -6759 -9607 -10898 -14019 -20585 -18986 -7699 -3045 -9138 -12167
5492 -12167 -1074 10997 4217 8470 -3581 579 10037 10789 4590 -15188 -5957 6206 16358
5479 16358 12072 6450 5867 4271 -6143 -978 -6538 -1038 4300 17953 21175 10207 5378 -2016
5465 -2016 5682 -8094 -2671 -201 4914 16733 15499 20912 8063 -5629 -15959 -18725 -14337 -15676
5451 -15676 -18727 -19718 -31064 -27635 -22025 -14475 -17157 -11176 -4565 5993 1226 -4926 -8131 -16537
5437 -16537 -22511 -9251 -11674 -20057 -9464 10253 14303 -760 -16710 -32873 -33937 -27079 -23318
5424 -23318 -25795 -31886 -23832 -19861 -20516 -13088 -9125 7050 12587 7937 -2396 -11624 -10486 -2821
5410 -2821 498 -5352 -3224 -388 5672 6465 12290 16682 24232 30687 28509 9379 -7064 -13850 -21493
5395 -21493 -23671 -18134 -4859 5854 4181 9588 12100 2580 -2710 -12136 -5658 9380 6128 10864
5381 10864 11619 913 2912 8800 15798 11220 3820 4299 16196 27251 19293 4737 -2718 -8009
5367 -8009 986 -4717 -23724 -30109 -27377 -28363 -14969 -2895 -220 1326 8425 16502 7591 3687
5353 3687 -2159 -7882 -2702 -13461 -623 1641 -13308 -17589 -5810 216 -9381 -11017 -10959 -6731
5339 -6731 -5959 -1570 11297 4453 -1601 -2853 -980 -14674 -23711 -15151 -5913 -9304 -13000 -4539 5157
5324 5157 6016 -7123 -14163 -7823 -9843 -15546 -21687 -18273 -13701 -579 -10395 -23392 -21445 -24725
5310 -24725 -22940 -24089 -2522 5244 -4170 2492 55 -2951 -3142 -5766 8860 14595 19734 4949
5296 4949 -12403 -16812 -15866 -17687 -3724 16213 30032 25238 20230 12376 -276 -14579 -8163 4651
5282 4651 3898 -367 6883 9046 3675 1049 -7908 -28581 -43708 -22631 -5560 -9344 -5956 -2283
5268 -2283 2164 -9159 -23610 -24150 -11463 -16038 -9790 -1380 -5314 -4714 -10660 -6333 -4549 -3082 765
5253 765 -828 -12768 -18544 -9575 -12 14526 7491 -19708 -29318 -14677 -10161 -2876 -3956 -1189
5239 -1189 -1214 -3513 11025 26763 24281 17570 5058 3841 6260 1715 -4817 9190 7772 -8573
5225 -8573 -22797 -19432 -13243 -22850 -22172 -31036 -30024 -7657 -5767 -5754 -4113 -14367 -6376 -9312 -19871
5210 -19871 -17853 -11160 -11669 -16031 -13383 -2308 -570 -13671 -23011 -31611 -29198 -11635 -5517 -9390
5196 -9390 -16885 -25692 -19214 -13661 -14023 -11619 -8837 -2242 -2456 -1678 -11944 -13881 -4185 3982 1457
5181 1457 -1790 -9659 -2173 3483 120 -17502 -20852 -6873 -4111 -5390 -8615 -16928 -9793 -12470
5167 -12470 -13070 -17386 -12849 -5777 -8251 -14776 -15677 -15765 -3958 3328 -2273 -19766 -3548 17906 28718
5152 28718 28980 10709 3933 -2258 -2999 6346 4502 421 14127 10901 11290 5109 15174 17547 12556
5137 12556 -2003 -18008 -23910 -19711 -15011 -3281 -172 1201 12540 10679 -4841 -16214 -6259
5124 -6259 -9562 -189 -6616 -8835 -5362 4091 -7911 -18438 -23105 -20445 -18340 -7786 -140 13670
5110 13670 12265 3624 -10527 -7188 -1367 12982 14657 14429 13965 -3877 -13618 -18551 -19622 -24847
5096 -24847 -21132 -15116 -12912 -1370 -14724 -20043 -12730 -16438 -23421 -15807 -18215 -17741 -13875 -2142
5082 -2142 3663 -12329 -14797 -20776 -17368 -20813 -14847 -22099 -28629 -23537 -12267 -18456 -21853 -14478
5068 -14478 -7742 3081 5068 2874 7057 -18614 -34285 -19021 -12504 -3999 24597 18995 17817
5055 17817 18458 17710 11507 8320 10145 10915 10803 17542 26480 20916 20577 9104 284 8 4121 -2821
5039 -2821 2250 12643 18490 11184 -13492 -28708 -40777 -39169 -30949 -16941 -6013 -6701 -1210 1696
5025 1696 1357 -228 -9667 -12086 -6115 -8577 -19953 -9746 200 13990 16084 5012 2480 2760
5011 2760 -10087 -25586 -9834 -13609 -16201 -9234 -6760 -4785 -7137 -12517 -5965 -11793 -4453 69
4997 69 -9396 -7954 -11202 -19469 -24456 -17980 -15444 -14293 -18708 -22017 -14651 -12694 -7851 1753 8017
4982 8017 -2998 -7933 -5505 -18426 -18477 -10649 -11650 -2747 -12542 -7997 7216 -1268 -7092 5172
4968 5172 -26 -326 -1842 5081 3761 -11739 -11006 -2403 -977 6299 -3055 -13424 -16171 -9277 -12132
4953 -12132 -21314 -18857 -2202 12308 13608 11062 10500 11832 12711 7239 4018 -4466 -12972 -13220 -7121
4938 -7121 -4806 -7143 -4602 -3181 13673 20234 2374 -13195 -24580 -27886 -23229 -29195 -37013 -34113
4924 -34113 -21343 -15118 -19416 -17387 -23146 -23775 -20376 14 -4919 -16184 -22987 -8977 -11754 -2863
4910 -2863 8061 4686 1147 -7267 -23221 -26688 -24378 -13567 -17294 -22894 -24351 -13692 -5483 6875
4896 6875 -9195 -26515 -26390 -12130 -22314 -10375 11843 18122 16497 1873 -10928 -8007 5487
4883 5487 3988 5246 8349 13642 23467 25073 10599 -6304 -10260 3205 6260 568 343 10388
4869 10388 14302 18220 6846 96 -10662 -13687 -18450 -15417 -17576 -27228 -25460 -23494 -12232 -3515
4855 -3515 -9612 -9954 -582 -3437 -12045 -17365 -17513 -5360 824 -6684 -9543 3381 4677 4344 79
4840 79 -4525 -13847 -26862 -28904 -19805 -3942 -9710 -7187 -19793 -7973 6476 -11684 -5096 8310
4826 8310 15173 20854 25746 12103 -4238 -4671 -6660 -5651 -2518 397 -5180 -10760 -7989 -16788 -6479
4811 -6479 1997 8378 3341 -4086 -6663 -6226 -3973 -14005 -15189 -14659 5229 24171 16077 15359 21140
4796 21140 21841 25251 13873 12808 7593 -11901 -15769 -7149 4590 3947 -6939 -10035 -150 -9728
4782 -9728 -27281 -21199 -14500 -7431 -4146 -9230 -9095 -6220 7204 6303 719 -6880 -14698 -4889 -7808
4767 -7808 -13316 -1816 1311 -3634 -6709 5587 8296 3355 11627 6627 -5703 -10122 -10642 8459
4753 8459 14990 6818 7374 10019 4049 10507 4315 -10353 -8454 12886 2812 -15996 -22691 -26966
4739 -26966 -10691 14617 16567 2163 -8504 -6550 -20252 -12094 -15621 -7695 -10953 -20526 -28498
4726 -28498 -29902 -16594 -25964 -30934 -29531 -28378 -14067 222 -5897 -6657 -2986 -7692 -10919 -12376
4712 -12376 -9713 -14705 -14584 -8732 -16031 -14496 -8303 -11065 -14270 -4456 12666 21557 15447 137
4698 137 -14134 -24224 -15215 -7789 -9877 -21842 -23701 -16649 -11541 6829 6132 -17280 -27690 -26760
4684 -26760 -22672 -11636 -3398 -5855 -11268 -17359 -9181 -17791 -18437 -15236 -11491 -8585 -21396 -22802
4670 -22802 -8377 124 -10525 -4286 1246 4657 5700 -5681 -9998 -3890 13809 22409 15634 14287
4656 14287 12321 6072 2140 -616 -4419 4046 9171 7677 11141 12379 25117 17311 4513 -10148
4642 -10148 -14958 -10783 -5436 -1189 4609 870 78 19977 26953 16593 17000 17281 9361 2365 -11391
4627 -11391 -24043 -21117 -12725 -19600 -20887 -19507 -22847 -12257 11444 29788 31067 35025 39294 42514
4613 42514 20708 9061 16880 16395 15748 13324 16486 4693 -4878 -5233 -400 -1022 1220 6123 3151
4598 3151 -4863 6203 14694 34 -6875 -9098 2422 17637 13950 12813 5149 815 -15562 -21284
4584 -21284 -17142 -10728 5342 4652 8822 9195 -3788 -18984 -21674 -28074 -31468 -22095 -21183 -26048 -25265
4569 -25265 -11942 -650 -4357 -14985 -9038 -2538 -9414 2182 2946 6438 10421 7458 12752 -5895
4555 -5895 -8551 4943 23182 18976 2469 -8694 -7947 -1183 -9726 -11371 -917 -5120 -1420 -10960
4541 -10960 -20192 -14527 -11556 -18942 -28174 -21115 -17594 -9795 -6521 -6584 2564 6641 26786 32689 13051
4526 13051 -2571 -12836 -25470 -24954 -9415 2938 3069 1060 -14363 -15667 -14668 -6868 -23680 -20648
4512 -20648 -6369 -5256 -7526 -8504 -1363 4478 -2208 -6479 -12121 -14758 -19263 -11965 2835 14933
4498 14933 10232 -19170 -29174 -39347 -33207 -16437 -14903 -7456 5090 16755 21746 16184 -1118
4485 -1118 -7338 3925 11356 -12908 -19073 -8794 -13019 -25050 -26204 -26794 -33874 -28832 -12508 -2377
4471 -2377 -6175 -15207 -16549 -25853 -26159 -29181 -23649 -22578 -17135 -2120 -7758 -6948 347 -6073 -12060
4456 -12060 -5357 10507 21324 8021 -17196 -27040 -32904 -31115 -16800 -9882 -5300 -43 -2563
4443 -2563 -11171 -10208 -6607 -6510 -12089 -10429 -449 -1174 1723 -9322 -28201 -23746 -14244 813 8187
4428 8187 18748 18974 15241 8402 -7047 -5394 8197 25594 28851 15587 8474 679 10315 11280
4414 11280 2151 3734 4288 12973 14810 460 -2736 -11188 -12760 -18075 -12039 17389 12442 5137
4400 5137 9035 11783 14905 23373 25411 9733 -1534 -9194 -10004 -12904 -16955 -10533 -17987 -13223 -1855
4385 -1855 857 -2047 8202 13078 19195 15245 20009 22347 9112 8221 -118 -9330 -8440 5873 12209
4370 12209 12734 907 -198 4627 2678 -7700 3249 15693 9615 16983 22385 14448 1580 -2518
4356 -2518 -7932 770 -1386 -4525 -3112 -6170 1802 10417 14070 12857 16263 15271 -5783 -8122 2182
4341 2182 10422 15610 8668 -766 -14551 -15995 1131 19107 16738 6888 5611 -5350 -8871 -8885
4327 -8885 -8053 -12125 -26788 -20630 -18040 -9252 6895 -7430 -30321 -30320 -10321 6427 11270 -49
4313 -49 -5445 5572 4294 1445 9585 4024 1657 2738 -1513 -7156 -2023 5619 -2212 3109 1061
4298 1061 4019 -2430 -8151 -451 16246 21269 11748 8188 11992 12495 36398 36405 12440 1932 3000
4283 3000 339 -153 4954 15349 8116 5472 -4358 -15832 -21796 -17296 -22996 -13892 -11128 -8107 -13877
4268 -13877 -12693 -8717 -12767 -10211 -6253 -13442 -23678 -19568 -3174 1176 -7096 -12446 -22745 -28098
4254 -28098 -23594 -19092 -15536 -18896 -13032 -8271 -5781 -11830 -23530 -15967 4219 2107 -9757 -11030
4240 -11030 -12476 287 12697 7649 -6405 -4592 3892 -4080 -7023 -4192 -5207 2525 4315 3501
4226 3501 -534 174 6948 2648 -9855 -30619 -30225 -23724 -30494 -32231 -16193 -20979 -29588 -33801 -17654
4211 -17654 -5038 -5437 -12606 -10934 -1973 4342 -4304 -12156 -16669 -5977 11856 12228 -8230 -15117
4197 -15117 -7381 -789 3186 1017 -6070 -4361 -2627 -9683 9341 20875 13833 4836 -11698 -20905
4183 -20905 -28992 -36221 -38628 -29065 -10506 7931 12357 10118 5410 -7511 -23297 -32960 -45906
4170 -45906 -32727 -23275 -7252 -1865 -9515 -4698 -6356 -3183 -17204 -24777 -21754 -27205 -31794 -19597
4156 -19597 7299 718 842 6426 -1439 -28085 -36931 -21542 -2316 -996 -4548 342 261 -11320
4142 -11320 -18207 -22169 -7534 -683 -7421 -2168 1519 -4453 -4716 -10423 -19234 -12146 -6128 -3767 -6163
4127 -6163 -4504 -13839 -16149 -30628 -28825 -7459 -10109 -10321 -8190 -13351 -22448 -28049 -19405 -12384 4109
4112 4109 10867 7786 2170 -1832 -14495 -14438 -12044 -2778 1702 -2240 -560 -249 -6750 -4459 -9153
4097 -9153 3320 8979 13486 12334 -4076 -8151 -5101 -9883 -16177 -23754 -17720 -8337 -2238 11106
4083 11106 8838 -1559 -10840 5326 17560 3098 -11591 -3996 -538 -11000 -8700 -1906 -15973
4070 -15973 -18715 -10038 -3553 -7575 -21869 -13913 -10138 -11360 -12657 -19011 -22382 -32547 -24004 -9293
4056 -9293 -19401 -19744 -19627 -2676 16388 13864 15619 10795 1059 -622 -9217 -5906 3676 4735 2116
4041 2116 1137 3010 190 -11449 -12470 -2309 -10514 -11890 -6699 -2161 -8468 -6938 7065 7346 8728
4026 8728 9690 -4772 -8673 1922 10249 6527 11789 22323 24417 30437 19197 -1726 -15002 -20941
4012 -20941 -17974 -20326 -22383 -10123 -4143 -3549 -8507 -6266 -10156 -10889 -824 11646 10035 10670 -4373
3997 -4373 -20848 1888 23068 22662 15717 27866 18695 10511 3326 -856 -178 -6787 -10616 -13785
3983 -13785 -15885 -6035 -597 -7907 -13381 -15873 -25549 -23132 -5422 -56 -10743 -12227 -14046 -14267
3969 -14267 -10901 4578 5881 -7375 -10791 2441 14115 6613 6418 4976 2040 4987 -6753 -26497
3955 -26497 -21854 -16979 -24540 -29838 -25293 -21740 -29203 -32090 -37969 -34596 -41589 -50725 -55004 -42270
3941 -42270 -40005 -34403 -20786 -6669 7636 3472 16803 13658 -298 11872 19101 10223 5343
3928 5343 -6134 -14010 -10583 11615 6682 -9469 -54 -616 -5043 -1142 -6209 -2720 1331 -6171
3914 -6171 -1193 788 1955 -17980 -27527 -32326 -19098 -2615 2961 -5463 -9540 2191 7955 4454
3900 4454 8981 8382 8783 2376 6281 14141 11300 -3663 -840 13708 15969 -210 -914 -6647 -3985
3885 -3985 -2413 -10735 -4174 3977 4729 -12768 -12776 -4118 2039 8885 8549 14250 7170 17062 11697 -3433
3869 -3433 -8385 -15354 -13702 78 -1037 -12472 -11453 -4382 -1988 -7778 -7951 -3208 15608 9165
3855 9165 -520 -4418 -3664 -3124 -1953 -12364 -29807 -21471 -8143 -1793 1616 -4461 -2305 -19798
3841 -19798 -30542 -27249 -25620 -19371 -6958 -5198 2160 -6595 -1745 -3809 7157 14916 -2523 -15908
3827 -15908 -11519 -10556 -4669 -7391 -12066 -10528 -4455 -12440 -8870 2073 8209 17199 12706 13530 14135
3812 14135 12685 10424 -149 -7038 -10129 -17660 -27618 -25440 -8404 14089 21717 23529 19176 -7659
3798 -7659 -13996 -1102 4653 2857 2761 4374 15301 24574 21452 8497 -7150 -6331 12048 24567
3784 24567 22174 7039 -3646 -7406 -3457 -9121 -8591 -17328 -18332 -4178 -21289 -16640 -16183 -15192
3770 -15192 524 5746 -401 3593 17826 21839 12803 10178 -1979 1245 -1357 -162 6493 6165
3756 6165 -5905 -19398 -23798 -11544 -6113 -704 4413 -7336 -19741 -26194 -17593 -14614 -12215 -9804
3742 -9804 -1190 -3493 -2732 2639 -12652 -2624 13145 12222 2986 5449 9465 3883 -2312 -2942 -10629
3727 -10629 5104 7912 2217 3268 -3235 -4378 6701 5104 -1457 -2475 10684 4520 3990 297
3713 297 -14699 -15375 -13302 -9698 -15451 -12358 -9207 -8125 -4716 -726 -7553 -8184 -3729 -11079 -3282
3698 -3282 3966 -1888 1109 2688 -2162 -1487 5162 8525 8137 6371 -12085 -29681 -34377 -22537 -17212
3683 -17212 -8920 -15963 -17941 -3367 -2127 -1612 13536 15172 9409 9763 -11165 -25411 -18258 -10042
3669 -10042 -111 13560 15873 13520 12635 12334 10756 533 -7462 -16690 -14352 -12814 -14271 -21397 -19957
3654 -19957 -26858 -20553 -2994 -3894 -14190 -19847 -6225 11543 21850 27640 16180 6493 8825
3641 8825 4453 -4358 -8478 -9912 -4224 6003 1722 -11508 -19202 -23074 -21617 -13738 -16706 -28577
3627 -28577 -25385 -17923 -15903 -30035 -28972 -8323 4235 13732 6177 -16399 -25085 -23484 -24690 -5241
3613 -5241 6864 -2108 -17202 -12564 -9158 -9736 -13118 -11223 -11353 -10367 -3750 -3989 627 -10056 -12200
3598 -12200 -12720 -23367 -33577 -41195 -39274 -35243 -34260 -18994 -608 15729 8339 -3044 -6067 -12082
3584 -12082 -22720 -19195 -18985 -26497 -19871 -17979 -15684 -4010 2977 13585 21648 6547 -9658 -6502
3570 -6502 -13507 -11861 3353 21647 27667 27448 22861 -662 -18565 -15738 -3273 -531 -1132 -5357
3556 -5357 -6675 -1173 6758 14462 11755 4644 4473 682 3919 3139 -9344 -1084 7574 15156 25560
3541 25560 10639 12376 15727 8866 7090 -3701 -10966 -18942 -14696 -9954 -7543 4126 18967 21325
3527 21325 6124 -10595 -11459 5263 15578 718 -8549 1054 -9289 -21787 -11490 4180 12575
3514 12575 2460 -10608 -12352 -6545 2630 8639 6247 12221 10564 11042 3918 2984 -12462 -668
3500 -668 1175 1509 5541 6298 -4447 -14604 -14601 -12350 -5999 -9182 -12799 -3111 -3116 -16914 -16107 -9680 -13842
3483 -13842 -855 5448 -2999 -1821 -1965 -4694 -1176 -8391 -13646 -20980 -16205 -26158 -37723 -32270
3469 -32270 -19292 -6970 -1724 2233 973 12560 17610 -8477 -17943 -12912 -7790 -25886 -24456
3456 -24456 -17431 -6731 -2683 -18091 -20481 -15923 -16926 -6294 -12802 -8324 3043 10827 4670 2964
3442 2964 -1700 -2492 900 -5825 -11468 -12860 -17344 -14809 2866 18770 13053 601 -515 -3714
3428 -3714 -13976 -14371 -9778 1373 5323 -1722 -12580 -22670 -22704 -14637 -12853 -13474 -21058 -10804 7321
3413 7321 -3794 -1580 2264 10165 6810 -3598 -2067 -3137 -17224 -6046 11468 2831 -2410 6353
3399 6353 3372 5278 5582 4800 572 -7067 -13105 -14636 -8340 -6629 -6885 -8938 -19012 -26429 -17642
3384 -17642 -17312 -18398 -13837 -4501 -3207 1490 236 -3735 -890 6977 1682 3528 2334 6525 10927
3369 10927 19748 19611 4732 -1727 -3219 -3194 -12105 -12202 -10636 -4614 -3628 -5485 -9795 -17294 -16366 -12130
3353 -12130 -13410 -8605 -469 -906 -13624 -22194 -22604 -35113 -36462 -18770 3058 16945 10668 8611
3339 8611 -3929 -6995 8283 -596 -2036 18157 7920 -12563 -10607 -14896 -340 -5048 -18147
3326 -18147 -13888 -10509 -11788 -16701 -15067 -17146 -15086 -4334 -4673 3615 -3421 -3590 -3349 -3729 -3358 -10531
3310 -10531 -5095 2256 3859 -5336 -19478 -12260 -19247 -25254 -14640 -4256 831 6261 18189 17089
3296 17089 -2463 -18453 -13674 -11150 -5401 -6875 -2563 -2283 5090 777 7964 11058 1819 8625
3282 8625 -1315 -16030 -16868 -12344 -11648 -6028 -6626 -6373 -8056 -19585 -18452 -5049 -2693 -2242 -1757 -8832
3266 -8832 -7136 -5566 -2373 -920 -12566 -15707 -16844 -13232 -13760 -9463 -3103 7615 23277 13620
3252 13620 -2598 -5148 -19146 -28524 -22757 -26052 -18526 -20789 -23503 -9551 5754 -8702 -26925
3239 -26925 -19153 -6151 -4674 -4092 6174 19339 21351 20783 15106 3137 -1019 -7217 -3751 3947
3225 3947 11101 15628 20010 17029 1763 -4116 -2212 -8173 -12200 -331 12612 23690 29189 17072
3211 17072 -14777 -14789 317 8547 -1039 -4130 8558 20296 9581 1412 -5265 -14306 -16807 -20579
3197 -20579 -19084 -11076 -5975 -9870 -16242 -4543 4162 3308 5571 -3176 -291 -6178 -1624 7490 7514
3182 7514 9443 7589 9711 7033 9111 10107 -259 -3954 -97 3252 -8174 -17677 -12880 -13810 -11201
3167 -11201 -12745 -13038 -11565 -15886 -15005 -4633 -5516 -9018 -1887 7203 8841 17123 16854 18693 5020
3152 5020 -1150 3448 7550 29970 34517 16702 19381 17813 5645 -13961 -14826 -415 1715 882
3138 882 -3787 -9395 -15527 -6101 -7893 -21750 -26232 -13008 -6158 -856 -4570 3376 12031 -1871
3124 -1871 -11650 -12633 -11364 7705 10205 14831 16875 18579 15791 16794 14939 3729 8325 26827
3110 26827 14473 16167 17603 14203 9093 7033 12463 17300 11471 8640 14602 14017 6676 2722 -3248
3095 -3248 -17011 -7406 1433 8516 14304 18985 16440 1980 -9236 -2552 -4743 -4997 -1432 15017
3081 15017 17158 13762 7008 7397 9237 10770 7840 -2395 -5608 -462 10199 18002 15992 10365
3067 10365 9714 -2568 7754 7345 846 6931 -143 1210 9221 5567 -1901 -28 349 247 -955
3052 -955 -10060 -1604 13093 23714 14770 7340 284 -1372 1738 3036 -10793 -24848 -24725 -8103
3038 -8103 1849 4867 10289 8996 1719 -1587 -17818 -31660 -29735 -20522 -8953 -3044 -5587 909
3024 909 6627 16214 18807 9408 11361 20358 17526 4115 -8977 -8657 -3233 9184 16964 15268 9206
3009 9206 4065 5850 1498 598 6472 7257 8547 -1489 -6436 -5299 -985 -1495 -5719 -6745 -5813 -6306
2993 -6306 -1880 3384 6240 17284 13719 1173 -15725 -6216 4657 10156 21211 25870 15304
2980 15304 274 -8048 -12884 -20540 -17721 -9928 1334 -3780 -8945 -10246 -7749 -2876 4461 -2112
2966 -2112 -4847 -17269 -25712 -15404 2411 13884 14706 7213 -6238 -12641 -14015 -1953 12400
2953 12400 24466 19790 6316 8483 9549 7195 1514 6172 1441 7328 -1128 582 -7023 -6587
2939 -6587 -5245 -4009 3070 10717 6207 64 1925 -6748 -12259 4725 12620 10145 11869 8811 3292
2924 3292 3836 4864 8276 1700 -7768 -14848 -10278 4942 6259 3529 -3020 9448 28071 19953
2910 19953 24483 19263 12135 7343 -5463 -6605 14392 29207 28460 16289 10971 14993 16003 5183
2896 5183 8222 2629 -3299 -8769 -12555 -17681 -18472 -12718 -3257 7188 14286 26562 25426 22382 19617
2881 19617 17108 18965 226 -9360 -13237 -5339 -11699 -2767 10744 29476 35840 37026 35941 7252
2867 7252 -226 -3470 -10353 -4833 3135 1366 -256 -5256 4760 -2625 -16807 -20940 -20004 -16935 -1142
2852 -1142 14096 9446 14777 15025 4330 -14139 -17745 -6580 -3626 -1221 835 -2954 -7304 -10004
2838 -10004 6867 14986 16144 16256 5589 10169 16439 15202 10365 -499 -2923 1842 5422 -5299
2824 -5299 -989 7309 -6218 -30153 -37036 -24418 -9344 6303 19050 20161 16653 10848 4720
2811 4720 -4773 -4865 -9052 -8502 -4220 12196 22645 31070 30835 15048 18895 27843 21406 13543 2262
2796 2262 1928 5283 3076 10876 10807 2742 -10031 -6548 -2240 -8843 -3621 4644 11365 7188 259
2781 259 -1692 -3650 -12022 -8965 1979 -6194 -18787 -22101 -21880 113 7433 13680 3759 -229 1114
2766 1114 -666 -3007 -4993 -843 -3665 -11520 -23409 -10931 -10803 -7971 732 2770 6577 20901
2752 20901 20321 16195 13999 20113 19562 15255 23751 34247 21039 17505 20381 7139 5479 -5788
2738 -5788 -11994 -6783 -16009 -16178 -7892 -7676 -13537 -8870 -11213 -8972 -10285 -7793 -12334 -12620 -2037
2723 -2037 7874 13282 13557 8966 -4849 -7228 -12019 -11538 -8670 1501 456 -4149 8503 26120
2709 26120 31461 27152 22562 8915 6841 9350 22655 16797 8332 4337 7109 817 -6521 -8389
2695 -8389 -9176 -5485 7718 10252 -4769 -1627 7786 6212 5345 6037 5321 6184 8419 9852 9521 14628
2679 14628 4668 2711 -7537 -6529 -6891 5325 17409 17841 13355 8548 4148 7980 1845 -5387
2665 -5387 -12673 -6827 4396 7716 4589 2590 6827 6618 -3346 -5941 -1875 -7082 -19366 -13983 6671
2650 6671 20253 29341 19811 -2984 -9605 -8484 -16072 -23332 -8866 6810 6361 10569 2644 1894
2636 1894 -8515 1853 9888 7849 5197 11139 6796 4165 1423 4107 5188 -16554 -22936 -20962
2622 -20962 -24072 -17204 -11568 2873 244 802 10647 15297 7980 2509 -5637 -12925 -15497 -3228
2608 -3228 3631 5775 5929 1117 -765 -1144 -2167 -11661 -20312 -5301 -2894 -13841 -6164 -7626 -20627
2593 -20627 -10276 -1065 9507 10861 5786 120 -6278 -11161 -5972 -1801 -4768 9128 19928 27978
2579 27978 19738 17374 6703 8361 14674 20009 19785 18056 15863 7631 4885 12282 25989 31094
2565 31094 23688 11383 1885 9664 13244 12498 11937 4936 -6839 -141 3547 -12058 -14092 -20939
2551 -20939 -18248 -8850 562 7412 6067 441 4525 -1902 -1825 -657 1349 -7479 -3808 -1782 -16244
2536 -16244 -27121 -12700 -12022 -17338 -15368 -16349 -24655 -23841 -11909 -1939 -6395 6045 21883 18109
2522 18109 8318 -3101 -6837 -26357 -11694 6861 1283 -1048 2031 -682 -4722 -3537 -3356 -6947
2508 -6947 -2673 -10600 -11264 2030 8080 26820 20161 10075 4836 14586 14195 -7887 -12431 -11529 -5209
2493 -5209 15272 31155 15891 14593 15103 16370 22855 10923 1281 8047 4359 -973 -20 5065
2479 5065 5568 9736 6284 -1250 -6587 3803 14078 15182 14749 26835 14615 3600 -2374 -2811
2465 -2811 -15749 -23778 -9318 -1078 2411 -10967 -6100 6514 16824 -1652 -5546 3983 5688
2452 5688 -1737 10225 17631 7948 -8032 -10618 -1599 -1568 9065 14979 23077 27047 31798 28051 25638
2437 25638 25301 11961 13147 13385 5649 28023 31499 14871 -4958 -4136 578 -6200 -9163 -834
2423 -834 -656 -5830 -5546 -4795 4533 5609 -1159 -3044 -668 -7651 -8366 -12664 -29175 -25099 -16155 -21167
2407 -21167 -25023 -17497 -14288 -14376 -9902 7752 7737 6463 7986 9387 5379 616 7740 5871 21579
2392 21579 19063 3447 -1772 -4542 3394 11777 4717 17871 25569 14684 11784 16313 21608 24201
2378 24201 12891 10096 7746 2290 4083 23844 24201 13125 -858 -4099 -245 2192 -1235 2490
2364 2490 3105 -3523 11292 6394 -5150 -9728 2667 -3296 3905 16263 12814 1469 4610 14233
2350 14233 3115 444 12775 21896 14847 7828 -30 -8566 -13663 -9180 -3127 -4678 -9299 -20834
2336 -20834 -8972 3337 -5924 -2081 2611 12779 23609 19646 1101 -3745 -24366 -22676 -2714
2323 -2714 11860 12253 11398 6465 5003 6700 1253 4573 10344 5604 -8537 -9976 1690 4714 3199
2308 3199 7492 8772 6466 -1954 -10399 -19336 3390 19525 24002 30455 23870 14816 12121 25736
2294 25736 28253 14197 17600 27060 10035 5297 5666 7661 10202 8819 3878 5217 10027 5050
2280 5050 -6119 -12973 -15772 -12068 -4862 -2921 -8592 -14612 -6298 5432 7927 13239 8765 4688
2266 4688 3843 8479 8971 11887 9021 5170 -2813 114 10974 6376 -6950 -11700 -4955 -5470 -13761
2251 -13761 -21506 -22009 -27483 -23659 -21855 -25068 -16099 -11988 -10503 982 9631 10513 10844 6692 572
2236 572 2905 2357 -4832 -682 -3347 -7102 -1605 -193 1027 13298 2775 -2236 -5811 -5690 -21548
2221 -21548 -25589 -9154 -8257 -12724 -15879 -15469 -11771 11091 16295 17126 16149 8355 -11820 -23782 -31916
2206 -31916 -15292 -15573 -19680 -19251 -13119 -6650 -22171 -32127 -26758 -13947 -4152 10690 7392 1397
2192 1397 -2538 -8046 -5177 -2567 -2540 -7442 -14519 -14647 -8821 -9738 -281 12434 17260 15502 10953 -5073
2176 -5073 -9821 -9571 4472 15684 4094 -12827 -20365 -23472 -18273 -6292 7378 7398 1190 -4014
2162 -4014 5901 19568 19061 12124 14650 20145 19699 14073 21826 19069 11754 17852 19453 11559 3829
2147 3829 -6810 -6981 -5081 -3379 -22074 -17873 5671 12999 12945 2870 -7712 -9862 -21138 -25840
2133 -25840 -20920 -17798 -271 12901 21488 13328 5148 14035 12521 12609 16254 9093 5308 11675 12898
2118 12898 15198 3821 1697 656 -5352 -14320 -10044 -8987 -9685 -3735 -9457 -5655 -5722 -13067 -13124 -20868
2102 -20868 -14274 9703 13893 -7097 -6418 19163 18864 10759 -3684 7880 21486 13031 -3569
2089 -3569 -1045 347 -4218 -18104 -12236 -785 12132 9948 -1254 -2834 516 -2420 -10841 3869
2075 3869 3484 -13581 -16275 5379 29630 27241 16216 7144 12518 10309 8862 2507 -3265 -4845
2061 -4845 -19441 -16262 -743 8619 9608 7333 22202 20197 5636 -14460 -15579 9213 21995
2048 21995 11076 3881 -10500 -9419 3880 3162 -2603 -6030 -22677 -14615 -12732 -12717 -786 3587
2034 3587 9569 15849 7630 6757 17239 27139 32792 19409 13507 7141 1095 2318 -4745 -7540 -2385
2019 -2385 -1078 1522 918 -6337 -14131 -14960 -15977 -11447 -9428 -10293 -7500 -13586 -18023 -21612 -18380 -15463
2003 -15463 -20013 -19754 911 24148 23730 17171 14804 13465 13294 983 6304 9632 9883 10623 2255
1988 2255 3839 -7741 -13331 -1176 4508 3253 7297 4080 5303 -3058 -2039 -6652 -11498 -10066
1974 -10066 -211 -7209 -6787 7804 1452 -15653 -13627 -1900 -552 -9951 -10939 849 900 -7091 -1678
1959 -1678 1587 9465 5764 7125 18965 24889 25810 11036 -1786 7675 16305 7322 8112 10023 1795
1944 1795 1645 4814 4516 761 699 4301 -14904 -14307 -3983 -3601 2560 -3882 -4625 6660 20475 24920
1928 24920 25918 21708 21528 22703 5118 -15149 -10650 -12610 -1058 6641 -3156 -6159 -20213 -9026
1914 -9026 -3320 -2048 -9849 -19647 -12128 -13544 -22118 -18016 -23694 -16728 -16729 -13663 -13789 8099 9108 15810
1898 15810 25406 3853 -5548 -12030 -8555 -13634 -10036 21 5590 6829 5102 15194 33606 39132
1884 39132 25841 4190 5692 653 -8140 -10849 5884 7511 10948 24531 30082 22462 22294 18120
1870 18120 13400 8700 10659 23423 14064 16943 22597 26178 18697 12024 25432 16131 8234 8066
1856 8066 6312 -1249 922 -1703 2047 641 1658 -2381 -1223 3486 -3300 -4493 648 -6489 -5759
1841 -5759 16383 20567 3063 -12260 -6558 4931 16190 19649 16601 9729 -142 -499 -8068 -16734
1827 -16734 -4346 3332 1851 -5543 -5643 -5320 -5740 -12753 -11906 3757 -8677 -20880 -11469 -9327 -8666
1812 -8666 -1064 23809 20855 16012 10163 13036 14428 8090 -1015 -5917 -403 -13941 -20105 -20250 -13053
1797 -13053 -6744 3000 10408 -895 -8182 -4984 48 -1325 -9778 -20039 -14619 -5984 10435 13490
1783 13490 5544 -9585 -12906 8240 10067 9699 14824 17168 16176 8601 -6929 -19715 -16462 -853
1769 -853 9002 1489 -10423 -14548 -15084 -17107 -6127 1244 3514 -10002 -8394 -2728 -2225 990 -16374
1754 -16374 -2082 -6473 -19076 -23025 -20961 -9364 -3525 7183 2615 10674 8321 4530 -1658 14556
1740 14556 27122 19436 4227 7795 17476 13576 12725 18749 7988 1330 8585 8617 11638 11020 -1494
1725 -1494 -11581 1127 -3241 -455 1913 2477 -20811 -33827 -32109 -26995 -11984 8903 14923 7137
1711 7137 -190 2782 13933 1644 -546 11286 13973 17191 16099 10569 20629 11588 6778 15687
1697 15687 23207 11560 3487 -13506 -8321 -5642 -12311 -12633 2608 -1759 -6923 -1112 5124 18339
1683 18339 17929 21365 10869 -6398 -1356 1944 7140 11612 241 1150 3120 6904 -2228 -204
1669 -204 12009 21601 32736 8519 -21954 -19453 -4619 3689 6387 9868 -835 -5827 -15274 -5868
1655 -5868 12885 15487 12150 17458 13352 3341 -9229 -11554 -7802 -3819 -2857 -3490 -9189 -8323 -17351
1640 -17351 -22839 -3283 14831 14419 4935 -50 -5456 8554 20553 8228 4571 12410 14381 2636
1626 2636 9950 11354 10880 20957 26609 7899 4342 -1198 6435 13135 13583 10276 1781 -2616 -3779
1611 -3779 5761 3265 -2305 -13220 -13152 -2476 9153 20473 26283 10761 1811 6828 -3015 -21832
1597 -21832 -25617 -13563 10380 20552 29432 26060 22720 35434 34571 15500 7300 3843 -2806 -9014
1583 -9014 -18589 -11153 9635 13954 1989 -13027 -23183 -12732 10307 22739 6751 846 -8102
1570 -8102 2867 -1545 -22574 -27826 -8905 -2489 -11353 -6845 -3891 9447 26804 30433 31699 32667
1556 32667 12436 6286 9538 -5424 -6672 -5655 5289 27485 29981 23109 10007 3763 10952
1543 10952 19520 13131 9116 3387 2640 14023 25134 41248 40935 27711 13979 2873 -2639 -7749
1529 -7749 7156 8503 3448 8244 23814 24919 19685 -1913 -3646 3513 4886 12102 7746 4210
1515 4210 12345 17204 6735 1597 5719 -3773 -7598 -7117 -2277 -363 -12388 -14284 -11172 -12306 -2930
1500 -2930 2631 -3563 7463 7789 12029 18828 21620 18687 9626 6239 8270 6547 5513 8487 7878
1485 7878 5898 3681 3226 -959 -10045 -7657 -5361 -8111 -18632 -22850 -21084 -23700 -25557 -18862 -20177
1470 -20177 -11580 -4997 13549 20440 22630 14763 13844 31597 32410 23348 16418 17962 14491 164
1456 164 -11560 -21423 -29829 -15740 -20127 -25020 -25782 -22550 -14963 -2141 6869 13669 27744 31275
1442 31275 21561 19712 7579 7452 2778 5016 10484 8009 11981 19135 10697 864 -10861 -14461
1428 -14461 -18158 -14133 517 17358 8455 6229 2207 -4638 -8892 -9649 -1191 11288 12152 -150
1414 -150 -1807 -10709 -27777 -23362 -8648 -7286 -3198 3887 4793 -1818 -7241 1676 20916 13834 -2576
1399 -2576 -4897 -4546 -10878 -4336 -6469 4334 -419 -3102 -9733 3407 18896 16007 -3553 -6957
1385 -6957 6199 23882 18632 12169 9148 8274 12180 19269 22548 19303 11685 10099 956 -3944 -849
1370 -849 -4580 -17888 -26192 -20003 -12772 -1458 897 9548 21499 14007 4097 -1166 -3037 4193
1356 4193 15504 12204 6595 5987 6534 -10273 -16880 -1919 -6939 1563 2931 -1830 -2770 -1188 6525
1341 6525 1359 1291 -7116 -6736 1434 -2203 -2375 4782 11552 3012 4708 -471 11620 21213 35779
1326 35779 40694 37758 33100 11674 6721 14459 13713 10726 -395 7615 21499 31925 34205 31906
1312 31906 20308 10127 3673 10078 13548 13585 12449 4893 13561 13006 8271 4189 -4269 1668 13859
1297 13859 21393 19974 26320 27701 36179 25260 22068 10860 -4540 -55 3043 493 3031 5878
1283 5878 -1262 -7419 -3336 -19346 -16600 -9223 -2992 505 11941 11110 4494 1414 4469 1632 -8647
1268 -8647 4043 20878 25470 21279 21322 29822 20678 9247 4384 13373 14272 9104 15737 23822 13680
1253 13680 14420 3835 -3361 -3216 10147 18717 6021 -16010 -9026 -30 5772 11851 13819 3349
1239 3349 975 12563 13662 17329 17893 3511 10876 10752 18016 25822 23349 15465 3329 -332 6086
1224 6086 2893 -5555 -7656 -6886 -18880 -18140 -15416 -23592 -23564 -19353 -11389 10507 19940 16963 6142
1209 6142 -1441 -4430 4191 5148 -12323 -21964 -21553 -2466 8840 -4907 -1739 9163 29107 26105
1195 26105 16097 6635 8914 2848 -546 -145 -8046 -10927 3502 8604 3915 -5457 -6398 -4164 2156
1180 2156 20567 23380 17285 7093 10178 -499 -7566 8280 9121 -19748 -13412 -5206 6428 7877
1166 7877 486 -4249 -5083 12635 7605 6389 -396 1700 5246 4115 -7650 -3761 -8777 -20507
1152 -20507 -8031 -655 1340 -7404 -149 15168 16205 13922 7769 8080 13527 9308 9837 10616 12538
1137 12538 8605 9007 1934 4239 5555 6212 3136 5149 11060 15724 7531 18906 16586 4924 13847
1122 13847 32127 36362 29314 544 -17732 -25594 -8141 3004 6683 4891 -2807 11119 7992
1109 7992 15900 2933 4505 3272 -2921 -7457 -12455 -18871 -7844 3023 6170 -2306 -29260 -45203
1095 -45203 -30438 -12180 -3166 -11024 -5564 -3402 -7360 -17661 -22524 -2099 5618 -466 -11247
1082 -11247 -2537 10845 8747 -192 -6269 3250 898 -12253 -16143 -9778 -11872 -29133 -13505 4656
1068 4656 10213 19587 9825 -1717 -944 -1697 -6691 -3596 4906 6343 3396 6218 3870 -13801 -13328
1053 -13328 -7167 -4574 -797 -2292 -5663 -4655 10007 9883 10965 13398 5986 261 -7203 -4083 -12661
1038 -12661 -16521 -390 -1172 1208 10657 13408 5315 16587 12845 30990 30407 17823 8554 1051
1024 1051 -10144 -6598 -15873 -9349 -3389 6576 12340 12725 26571 23837 9266 -2007 6399 8490
1010 8490 6652 -1616 -14000 -17113 -15184 -15839 -3520 4693 6039 10155 15503 14933 8120 -1308 -16163
995 -16163 -28537 -23696 -15200 -3080 2628 5275 19325 14814 8420 10715 9407 10459 9006 343
981 343 2166 -9717 -2619 -2775 3176 11403 18195 9038 -4494 -8597 5576 19689 32491 9021
967 9021 5705 3789 -8024 1757 24030 11228 -281 6854 5138 -6259 -8593 -4680 306 -2001
953 -2001 199 4137 8663 -1729 -15638 -14313 3014 6565 14343 25031 21071 15302 21008 17626
939 17626 17142 16070 -1915 -9231 -9058 -2037 -909 -1376 1223 242 58 -9965 -21784 -27122 -19948
924 -19948 -5678 3286 15217 18835 11355 6889 5027 3863 7570 7895 -10347 -13035 -3174 8080
910 8080 5956 8803 17510 21892 15980 2102 19819 33030 26913 26051 33798 26469 11502 3436
896 3436 10687 13817 18294 14067 10141 14918 17957 4952 -2044 2465 10474 8644 10129 2897 374
881 374 -9369 -5079 10680 20539 10127 10401 8509 8011 2491 -673 9013 18868 26536 21412 22537
866 22537 37273 36712 34417 18080 -2328 -2374 6595 5691 920 -13465 -20376 -14390 3728 14365
852 14365 9766 1262 1370 -2472 -2703 -1402 14167 30828 23592 7195 14384 29295 26338 22949
838 22949 25399 23872 24829 10149 4149 22343 26292 19813 22140 17842 15316 19233 24672 20305 14090
823 14090 16091 22803 21802 27711 33282 13190 4133 7797 18212 5396 -741 773 -6045 -5346
809 -5346 3908 -4044 367 12889 -1046 -1077 -2700 -5561 12182 14254 9944 4282 -5269 -3805 -1805
794 -1805 10652 13573 21173 21159 21173 12089 10452 4041 -5326 -8600 4829 7209 13322 14817 -441
779 -441 3977 10150 14721 18444 14585 17951 18334 20976 13268 8907 9933 17541 26286 25249 16255 13985
763 13985 13158 18427 6108 7612 12744 8169 22306 22872 12992 25318 32816 25909 11733 23655
749 23655 24698 9198 5718 14666 12220 -10 5355 10916 1177 8918 19449 10427 10797 2042
735 2042 5664 14399 17980 24064 18882 19229 20822 11920 10818 8674 -137 -3163 299 18450 17267
720 17267 8749 12456 6232 -3145 -9161 -9707 -8000 -15023 -14194 -4494 -3575 -12966 -1991 5422 17702
705 17702 24944 24719 21847 15334 12024 21341 27159 19530 12525 10830 10201 5258 1630 13861 6195
690 6195 9030 4248 5533 -68 -7899 -3267 11349 17233 575 -4136 875 -4498 2201 9806 15076
675 15076 22165 12732 7665 1420 11587 11177 9807 9418 19890 23933 22311 27760 11533 2677 -14958
660 -14958 -9900 -73 -1010 -4361 2176 7588 8554 1418 -2317 -7324 12323 22825 6310 6939 15797
645 15797 18202 21068 9888 19706 22713 13108 16791 28982 26821 19984 22512 31417 24942 -8570
631 -8570 -12393 -8550 779 7450 -274 923 -5014 -3015 588 1051 758 7400 19232 21486 32287
616 32287 29008 16821 15092 18553 21935 22131 19928 17484 -583 -5985 -677 8456 17109 17431 13083
601 13083 8218 8338 20196 19052 -1840 -10922 -14571 -14500 -14898 -9437 3124 2254 -6213 -15260 -1984
586 -1984 3420 4590 5059 6158 -1843 -2604 -1218 -738 6154 10251 16221 16962 13202 13756 12977 13683 6679
569 6679 4011 12028 13826 16551 7924 12324 13642 -2241 -17566 -25826 -27002 -18558 607 2912
555 2912 -13090 -16333 -11596 14342 26961 14036 7718 9570 22683 17685 12182 24518 27058 16234
541 16234 11819 7086 -9730 -12808 6351 16524 10696 1682 -5301 -15591 -12935 -7723 1266 11879
527 11879 22127 18401 5567 -3978 -14321 -9266 -358 6323 3610 -646 -925 5886 19861 19714
513 19714 3970 -3290 6500 12616 17891 8500 4696 3340 9117 17193 10697 801 1010 -1339 -4146
498 -4146 -9700 -8378 -2839 268 -3431 7125 4562 -2513 6926 9307 9788 -201 -13065 -10541 14552
483 14552 19640 16815 15044 5264 2176 2789 -3084 -16749 -21053 -16889 -21996 -18959 -13262 -15061 -16498
468 -16498 -7377 -3714 -236 10339 17611 15644 17574 23611 29220 27905 17919 6396 107 -13298
454 -13298 -18620 -24955 -17551 -5376 670 -13236 -18071 9031 11764 -4292 -7712 5813 2272 750
440 750 3812 5311 12100 25033 10826 -2074 -15288 -19282 -15259 -17773 -18516 -25784 -31214 -38739 -28967
425 -28967 -20740 -12062 3095 5699 322 -17088 -22271 -14363 -11664 -13788 -7081 8089 -5343 -12063
411 -12063 -10338 -6591 5554 -591 -8456 -4746 -9900 -5962 -3164 8667 9824 918 -7013 -14720
397 -14720 3812 5549 7462 7529 -838 -8488 -18316 -17747 -14544 -19300 -16885 -8879 3801 2760 -6136
382 -6136 -8196 -12372 -8654 -4843 -7023 773 8669 4505 -4850 -11410 -10498 -15324 -17578 -10988 -3443
367 -3443 35 -11916 -23597 -23930 -10376 -12599 -13249 -13689 -9264 -6212 -4469 -171 -4783 -21589 -20134
352 -20134 -6873 -17430 -38139 -46449 -34250 -27329 -33964 -25917 -13461 -23646 -10559 4984 11216
339 11216 11712 -2150 -19241 -23244 -19442 4269 6999 -2372 -5499 -10645 -15098 -18719 -25066 -16269
325 -16269 -7566 -19518 -17313 -14147 -14373 -16153 -26510 -33483 -35236 -32483 -23014 -7056 -1421 -5263
311 -5263 2429 4154 -20621 -28392 -16450 -13658 -20447 -32789 -32033 -24360 -15784 -22951 -28092 -21919 -25781
296 -25781 -22951 -19382 -18481 -13519 -6436 -10779 -15980 -5314 5438 6237 -7705 -21008 -22982 -23803 -32551
281 -32551 -36999 -31199 -30740 -34510 -40379 -32587 -28721 -29917 -34832 -34316 -26317 -18822 -29362 -34901 -32719
266 -32719 -21382 -19576 -28004 -25772 -22021 -33102 -38862 -42617 -54409 -49983 -31864 -19438 -15843 -17095
252 -17095 -23390 -26289 -21893 -36864 -44150 -39028 -38349 -47579 -51045 -46414 -41124 -43689 -40592 -22421 -19587
237 -19587 -21360 -26895 -31142 -31417 -31918 -30547 -37146 -39772 -32599 -36760 -33510 -25334 -36557 -49243 -54814
222 -54814 -49008 -49839 -47042 -38572 -37087 -47237 -50319 -43163 -41221 -39525 -44543 -41680 -31618 -41813
208 -41813 -54419 -60082 -52806 -43866 -37609 -34241 -41699 -43004 -45498 -46093 -48683 -50190 -54780 -53239 -38183
193 -38183 -46422 -60905 -61158 -56579 -62863 -60056 -58751 -55277 -60237 -59142 -49832 -46242 -45708 -44474 -56904
178 -56904 -64553 -57870 -42379 -47777 -49843 -40252 -41231 -58444 -62475 -58660 -56751 -50344 -56828 -55641 -44547
163 -44547 -49169 -67955 -73874 -66806 -67538 -69804 -61151 -55688 -61177 -62710 -56935 -66985 -79590 -82963
149 -82963 -80006 -82893 -77699 -62975 -55226 -60034 -64970 -65644 -63039 -61459 -65254 -66409 -72654 -66514 -62294
134 -62294 -63324 -63455 -63990 -66039 -64150 -58268 -68852 -61707 -62838 -68546 -64236 -64243 -57362 -57247 -67745 -69286
118 -69286 -69831 -66706 -61190 -70204 -73876 -76641 -73695 -74820 -80899 -80497 -81940 -81975 -82584 -79175 -80156 -87418
102 -87418 -84517 -79097 -71637 -76877 -85073 -88141 -99082 -101881 -97018 -94791 -94561 -105778 -111150 -101231 -103344
87 -103344 -105541 -104045 -97531 -97221 -95201 -86644 -84712 -82391 -78466 -83945 -84048 -87922 -89726 -83624 -77738
72 -77738 -88343 -85612 -84812 -92213 -104147 -113449 -110292 -99552 -96902 -93200 -86137 -93064 -96565 -96721 -94239
57 -94239 -100146 -105690 -95398 -87115 -91443 -98602 -96711 -97590 -94305 -101884 -104016 -104459 -105264 -103403 -101990 -104962
41 -104962 -93789 -87893 -89121 -104932 -114266 -123340 -124374 -121030 -115503 -113570 -111730 -100754 -97525 -95866
27 -95866 -99550 -97115 -96775 -103233 -113705 -127050 -126876 -114340 -113899 -118203 -121867 -113406 -117998 -111837 -108050
12 -108050 -108048 -101782 -105342 -114422 -123653 -122631 -120053 -123120 -116721 -112961 -111737 -112310
0 -112310
$$ Imaginary data points
##PAGE= N=2
##DATA TABLE= (X++(I..I)), XYDATA
32767 43038 39525 37881 37122 45403 47712 52871 54802 49665 48561 43931 46257 53675 53502 53738 46716
32752 46716 38057 45584 54222 62905 70409 77656 80651 74418 72262 70742 62003 64815 74741 79138
32738 79138 87733 80073 77095 76264 72352 75985 80519 84279 76871 73996 74819 73026 70467 74539 79388
32723 79388 83742 90271 92310 82087 72483 72654 78631 85301 78717 81720 85961 88923 81564 79207
32709 79207 94346 95874 92880 97206 104709 105816 98280 92441 89072 89692 96215 105842 103356 101691
32695 101691 105401 105646 96224 87200 96768 115101 126278 124961 125740 117478 113065 115012 116256 119403
32681 119403 116801 123683 134905 133781 138825 133255 132170 118985 109749 110524 125488 126851 121169 128397
32667 128397 130539 128750 132523 133115 136842 145089 142916 146595 148272 138241 131726 131762 142929 149226
32653 149226 145670 141210 139393 134920 129900 127255 134666 145541 146815 143970 138387 129462 131420 145364
32639 145364 160341 169408 162544 163449 155457 141148 149057 150425 146383 145787 144320 147542 144525 136111
32625 136111 133701 142078 147350 158550 161737 163536 163023 165055 157993 160907 176389 173559 168438 163459
32611 163459 167668 165233 159768 158378 162930 167217 164681 163407 161906 165381 174623 180303 182483 187038
32597 187038 194053 195014 188678 184879 179809 186006 194086 194517 199597 202401 194989 182725 179658 181300
32583 181300 175704 180303 186787 195622 198065 202278 206725 215133 212889 199115 193426 197325 189287 193780
32569 193780 192704 188835 191573 188932 184679 192222 189891 185277 180096 189934 193604 205237 207491 198083
32555 198083 177357 179497 189127 207603 222473 217675 211821 198786 189220 193308 211526 224585 223311
32542 223311 220918 228694 227915 222292 222489 213100 214619 210786 212359 209138 212009 214591 221520 214213 219764
32527 219764 211350 205311 221215 230622 233131 246025 243558 228846 223503 224024 217713 219320 227102 228904
32513 228904 225561 211504 211623 212446 208153 205496 218044 225077 234063 237226 222069 214365 217565 222996
32499 222996 224280 218904 221249 238965 242183 231169 227955 237184 232570 228196 233264 240678 236090 230215
32485 230215 231577 224500 229523 235087 243453 240302 224018 216667 219456 219535 226270 236830 253578 253771
32471 253771 234806 232705 233404 232008 232574 245639 251837 248350 245602 251535 253754 250478 261709 274565
32457 274565 272543 269170 267172 263515 255594 253841 254980 258011 261005 277792 279362 254762 241189
32444 241189 246848 251691 246133 255535 266680 262294 256484 259459 256913 253679 242035 245273 252986 254739
32430 254739 244745 238426 231760 244659 251668 266599 266029 259130 249332 247085 244792 244475 255134 271308
32416 271308 280810 284028 284363 281269 273768 269452 275013 269787 273513 277664 272973 263869 269453 268099
32402 268099 268527 272683 274191 276371 289585 300484 293788 291032 276123 274976 275608 267097 271146 274158
32388 274158 268166 265652 265604 272846 284056 295336 284454 262103 255084 253452 266771 275770 284442
32375 284442 283387 279211 282763 299671 309138 297880 292278 283960 283631 281374 279560 290213 299718 295752
32361 295752 302679 298921 292222 284594 269674 267588 282720 278893 277264 289008 295976 288306 293186
32348 293186 293024 290883 299174 306272 320614 312778 302216 307512 308470 303947 310801 304492 295260 294206
32334 294206 287707 290697 294092 282154 277968 272957 264400 266133 274122 280691 283255 297768 302346 290283
32320 290283 282576 278225 278569 287871 292435 278624 275345 276119 279856 283456 282487 281594 286997 284300 295587
32305 295587 305940 306934 300414 297460 289794 288263 297980 294787 297072 289536 286976 286835 294926 307643
$$ [...]
##END NTUPLES=NMR SPECTRUM
##END=
