##TITLE=Analysis number 323979
Compound Code cc 10446
Book Reference 494/82
Project Code adrs
Chemist Name craigr
##JCAMPDX= 6.0         $$ Bruker NMR JCAMP-DX V2.0
##DATA TYPE= NMR SPECTRUM
##DATA CLASS= NTUPLES
##ORIGIN= Bruker BioSpin GmbH
##OWNER= nmr
$$ XWIN-NMR		Version 3.5
$$ Fri Nov 10 13:43:33 2006 GMT Standard Time (UT+0h)  MAYBRIDGE\nmr@NMR_250MHZ
##.OBSERVE FREQUENCY= 250.131544655141
##.OBSERVE NUCLEUS= ^1H
##.ACQUISITION MODE= SIMULTANEOUS (DQD)
##.ACQUISITION SCHEME= undefined
##.AVERAGES= 16
##.DIGITISER RES= 18
##SPECTROMETER/DATA SYSTEM= dpx250
##.PULSE SEQUENCE= zg30
##.SOLVENT NAME= CDCl3
##.SHIFT REFERENCE= (INTERNAL, CDCl3, 0, 16.522)
##AUDIT TRAIL= $$ (NUMBER, WHEN, WHO, WHERE, WHAT)
$$ ##TITLE= Audit trail, XWIN-NMR		Version 3.5
$$ ##JCAMPDX= 5.01
$$ ##ORIGIN= Bruker BioSpin GmbH
$$ ##OWNER= nmr
$$ C:\u/data/dgb/nmr/ADRS/2670/pdata/1/auditp.txt
$$ ##AUDIT TRAIL=  $$ (NUMBER, WHEN, WHO, WHERE, WHAT)
(   1,<2006-11-10 13:42:46.42 +000>,<MAYBRIDGE\nmr>,<NMR_250MHZ>,
      <created by zg, POWCHK disabled, PULCHK disabled
       configuration hash MD5:
       49 4B E0 1D 92 C2 6B 37 9F E6 65 BC 52 41 86 1D
       data hash MD5: 64K
       99 E8 AD DF 39 AC 76 72 43 35 AA B2 B5 BD EB D6>)
(   2,<2006-11-10 13:43:09.31 +000>,<MAYBRIDGE\nmr>,<NMR_250MHZ>,
      <Start of raw data processing
       ef LB = 0.3 FT_mod = 6 PKNL = 1 SI = 32K 
       data hash MD5: 32K
       88 22 46 6F 9F 76 98 4E 70 29 DD 83 4E 33 B1 FD>)
(   3,<2006-11-10 13:43:14.34 +000>,<MAYBRIDGE\nmr>,<NMR_250MHZ>,
      <apk 
       data hash MD5: 32K
       2E A1 28 2E B0 6F 62 33 75 8A 67 67 5A 39 83 3A>)
(   4,<2006-11-10 13:43:15.84 +000>,<MAYBRIDGE\nmr>,<NMR_250MHZ>,
      <abs ABSG = 5 
       data hash MD5: 32K
       44 52 D1 1B 7B 6F A8 5A FA 09 0F FA 7F F6 CF A9>)
$$ ##END=
$$ 
$$ hash MD5
$$ F8 E2 12 32 C1 C6 E6 63 5F D9 C0 3F FC 5B 03 BE
##$RELAX= 
##$RELAX= 
##$RELAX= 
##$RELAX= 
##$RELAX= 
##$RELAX= 
##$RELAX= 
$$ Bruker specific parameters
$$ --------------------------
##$DU= <C:\u>
##$EXPNO= 2670
##$NAME= <ADRS>
##$PROCNO= 1
##$TYPE= <nmr>
##$USER= <dgb>
##$AMP= (0..31)
100 100 100 100 100 100 100 100 100 100 100 100 100 100 100 100 100 100 
100 100 100 100 100 100 100 100 100 100 100 100 100 100 
##$AQSEQ= 0
##$AQ_mod= 3
##$AUNM= <au_zg>
##$AUTOPOS= <34 >
##$BF1= 250.13
##$BF2= 250.13
##$BF3= 250.13
##$BF4= 250.13
##$BF5= 500.13
##$BF6= 500.13
##$BF7= 500.13
##$BF8= 500.13
##$BYTORDA= 1
##$CFDGTYP= 0
##$CFRGTYP= 5
##$CHEMSTR= <none>
##$CNST= (0..31)
1 1 145 1 1 1 1 1 1 1 1 1 1 1 1 1 1 1 1 1 1 1 1 1 1 1 1 1 1 1 1 1 
##$CPDPRG= <>
##$CPDPRG1= <>
##$CPDPRG2= <>
##$CPDPRG3= <>
##$CPDPRG4= <mlev>
##$CPDPRG5= <mlev>
##$CPDPRG6= <mlev>
##$CPDPRG7= <mlev>
##$CPDPRG8= <mlev>
##$CPDPRGB= <>
##$CPDPRGT= <>
##$D= (0..31)
0 1 0 0 0 0 0 0 0 0.06 0 0 0 0 0 0 0.0002 0 0 0 0 0 0 0 0 0 0 0 0 0 0 
0 
##$DATE= 1163166164
##$DBL= (0..7)
120 120 120 120 120 120 120 120 
##$DBP= (0..7)
150 150 150 150 150 150 150 150 
##$DBP07= 0
##$DBPNAM0= <>
##$DBPNAM1= <>
$$ [...]
##$SUBNAM7= <"">
##$SUBNAM8= <"">
##$SUBNAM9= <"">
##$SW= 20.6930455092707
##$SWIBOX= (0..15)
0 0 3 0 0 0 0 0 0 0 0 0 0 0 0 0 
##$SW_h= 5175.983436853
##$TD= 65536
##$TD0= 1
##$TE= 683.16
##$TE2= 300
##$TE3= 300
##$TEG= 300
##$TL= (0..7)
0 120 120 120 120 120 120 120 
##$TP= (0..7)
150 150 150 150 150 150 150 150 
##$TP07= 0
##$TPNAME0= <>
##$TPNAME1= <>
##$TPNAME2= <>
##$TPNAME3= <>
##$TPNAME4= <>
##$TPNAME5= <>
##$TPNAME6= <>
##$TPNAME7= <>
##$TPOAL= (0..7)
0.5 0.5 0.5 0.5 0.5 0.5 0.5 0.5 
##$TPOFFS= (0..7)
0 0 0 0 0 0 0 0 
##$TUNHIN= 0
##$TUNHOUT= 0
##$TUNXOUT= 0
##$USERA1= <user>
##$USERA2= <user>
##$USERA3= <user>
##$USERA4= <user>
##$USERA5= <user>
##$V9= 5
##$VALIST= <valist>
##$VCLIST= <CCCCCCCCCCCCCCC>
##$VD= 0
##$VDLIST= <DDDDDDDDDDDDDDD>
##$VPLIST= <PPPPPPPPPPPPPPP>
##$VTLIST= <TTTTTTTTTTTTTTT>
##$WBST= 1024
##$WBSW= 4
##$XGAIN= (0..3)
0 0 0 0 
##$XL= 0
##$YL= 0
##$YMAX_a= 665974
##$YMIN_a= -780439
##$ZGOPTNS= <>
##$ZL1= 120
##$ZL2= 120
##$ZL3= 120
##$ZL4= 120
##$ABSF1= 16.522
##$ABSF2= -4.171173
##$ABSG= 5
##$ABSL= 3
##$ALPHA= 0
##$AQORDER= 0
##$ASSFAC= 0
##$ASSFACI= 0
##$ASSFACX= 0
##$ASSWID= 0
##$AUNMP= <proc_1d>
##$AZFE= 0.1
##$AZFW= 0.1
##$BCFW= 0
##$BC_mod= 0
##$BYTORDP= 0
##$COROFFS= 0
##$CY= 12.5
##$DATMOD= 1
##$DC= 0
##$DFILT= <>
##$DTYPP= 0
##$F1P= 14.0000005364418
##$F2P= -0.99999901652339
##$FCOR= 0.5
##$FTSIZE= 32768
##$FT_mod= 6
##$GAMMA= 0
##$GB= 0
##$INTBC= 1
##$INTSCL= 1
##$ISEN= 128
##$LB= 0.3
##$LEV0= 0
##$LPBIN= 0
##$MAXI= 10000
##$MC2= 0
##$MEAN= 0
##$ME_mod= 0
##$MI= 0
##$NCOEF= 0
##$NC_proc= -2
##$NLEV= 6
##$NOISF1= 0
##$NOISF2= 0
##$NSP= 0
##$NTH_PI= 0
##$NZP= 0
##$OFFSET= 16.522
##$PC= 1
##$PHC0= -47.60434
##$PHC1= 7.172549
##$PH_mod= 1
##$PKNL= yes
##$PPARMOD= 0
##$PSCAL= 4
##$PSIGN= 0
##$REVERSE= no
##$SF= 250.13
##$SI= 32768
##$SIGF1= 0
##$SIGF2= 0
##$SINO= 400
##$SIOLD= 32768
##$SREGLST= <1H.CDCl3>
##$SSB= 0
##$STSI= 32768
##$STSR= 0
##$SW_p= 5175.98343685301
##$SYMM= 0
##$S_DEV= 0
##$TDeff= 65536
##$TDoff= 0
##$TI= <Analysis number 999999
Compound Code 99
Book Reference 9
Project Code 9>
##$TILT= no
##$TM1= 0
##$TM2= 0
##$TOPLEV= 0
##$USERP1= <user>
##$USERP2= <user>
##$USERP3= <user>
##$USERP4= <user>
##$USERP5= <user>
##$WDW= 1
##$XDIM= 32768
##$YMAX_p= 399455606
##$YMIN_p= -188433
$$ End of Bruker specific parameters
$$ ---------------------------------
##NTUPLES= NMR SPECTRUM
##VAR_NAME=  FREQUENCY,     SPECTRUM/REAL,   SPECTRUM/IMAG
##SYMBOL=    X,             R,               I
##VAR_TYPE=  INDEPENDENT,   DEPENDENT,       DEPENDENT
##VAR_FORM=  AFFN,          ASDF,            ASDF
##VAR_DIM=   32768,         32768,           32768
##UNITS=     HZ,            ARBITRARY UNITS, ARBITRARY UNITS
##FACTOR=    0.157963299565203, 1,           1
##FIRST=     4132.6476996994, 0,             0
##LAST=      -1043.33573715361, 0,           0
##MIN=       -1043.33573715361, -188433,     0
##MAX=       4132.6476996994, 399455606,     0
$$ Real data points
##PAGE= N=1
##DATA TABLE= (X++(R..R)), XYDATA
$$ [...]
21857 1616 6441 11054 7632 642 5699 5348 4399 1515 6773 7523 6573 6484 7294 1697 -4162 -7329
21841 -7329 -11228 -5277 9224 13722 6094 -586 -71 -137 1535 2248 4873 2162 4485 9923 3849
21826 3849 -315 872 5155 4075 -2214 1762 10593 13317 11105 10266 3074 -2452 70 -2224 -808
21811 -808 -1149 4084 1122 -6680 -2244 1805 2614 -804 2205 6935 2623 2970 1597 2384 4239 3932
21795 3932 -4118 -6076 -5309 -6147 -7075 865 1836 4739 1496 -6362 -609 2704 4674 7471 11813 14924
21779 14924 12480 8086 4769 1778 6029 7872 5786 1836 2033 -1370 -2757 -6367 -12821 -6838 352
21764 352 -1065 -2440 2258 4802 9853 10851 3045 -3851 2039 5730 5285 705 -2109 -4805 -5732 -1100
21748 -1100 -1931 987 -1900 3532 9138 6625 11852 12921 12881 10767 5935 8175 8149 9096 4000 4880
21732 4880 3072 5572 607 -1558 3533 -609 -7788 -11072 -5488 2510 8650 8747 11043 10177 6659
21717 6659 -323 -7383 -7511 -13347 -15039 -5380 888 111 5126 11078 11628 11267 9419 2952 3178 -3718
21701 -3718 -3277 -1810 -3530 -4534 -1269 4471 1784 3637 507 -2814 -2674 -7566 -13284 -11644 -16034
21686 -16034 -14178 -9418 -8829 -15177 -16344 -14034 -8459 -566 4260 3502 -2524 -2203 382 668 -174 468
21670 468 3300 4310 -573 -8296 -10597 -4868 -2738 2749 9981 5402 7133 12481 8585 6691 11438
21655 11438 12030 13887 13736 14447 12961 9046 1833 2736 8575 6939 -1738 -5310 -6809 -2859 439
21640 439 -2985 -5797 2945 11364 9012 -670 -629 -1973 811 442 -696 4641 4288 2336 3896 4154
21624 4154 4905 1730 -2829 -9498 -4041 -5040 -3471 -5652 2540 8887 9759 7253 3500 275 1826
21609 1826 -1849 -4189 -3594 -4944 1531 371 -2520 -7317 -5875 -3393 -5871 -7219 -5214 -4197 -8321
21594 -8321 -5131 -6084 -11098 430 8647 6561 9378 7827 383 -504 -7900 -5278 467 734 -1108
21579 -1108 1317 461 -1227 924 -3831 -8207 662 4633 8142 9634 5545 1957 1143 3957 11323
21564 11323 8968 4832 3085 -1247 -3324 2764 3892 -643 3440 2064 907 -10961 -14639 -13180
21550 -13180 -10348 -4693 3187 8114 12626 8329 741 -2779 4303 8869 6500 2049 -4228 -2053
21536 -2053 -3256 8348 7940 1906 5406 7333 8447 6751 4256 61 -8319 -11891 -6009 2836 3409
21521 3409 -828 -3292 -3197 4659 4243 395 -2439 -3898 -5126 -4930 -5975 -5820 -4152 -5045 -6293 51
21505 51 3210 1451 -5271 -7287 -4896 -2941 -1448 5481 3585 1768 3449 9159 9418 3703 6843
21490 6843 10541 7692 -6075 -10093 -5258 -2372 -6 -227 345 -133 -11390 -17620 -14834 -7050 -414
21475 -414 -8211 -11971 -4651 -2050 2737 -328 -8625 -16886 -11547 -2551 -81 6154 9603 8221 7542
21460 7542 14956 9989 5015 4918 10059 5239 4358 4480 4191 1053 -3684 471 1951 -2196 3866 6000
21444 6000 -1808 -7368 -5459 -3362 -6217 -11015 -7575 -3474 1773 9254 8336 1535 -4812 -9428 -6849
21429 -6849 -1777 -2609 875 7727 8177 9089 11367 11591 7939 2413 -3437 -7995 -330 7832 3188 2164
21413 2164 2652 -4306 -10821 -7388 -3777 -4888 -4057 1902 1456 2239 3117 3224 -487 1185 9836 11194
21397 11194 5634 2240 2950 1706 -3762 -4223 -8560 -14522 -19437 -20814 -18290 -14998 -14470 -12278 -6292
21382 -6292 -4920 -5504 -5416 -3573 -1124 3215 47 4469 3781 2592 4236 5926 -1174 -4028 -6065 -3748
21366 -3748 846 -856 -6242 -6395 -6041 -46 1134 820 293 -735 -4129 -10133 -3437 -117 -818 -1908
21350 -1908 -8128 -6836 -11296 -11455 -7065 -1922 427 1355 2782 -3705 -3728 -6310 -4951 -1387 -3076 -6694
21334 -6694 -4471 -2175 4150 5218 4670 7043 3407 3968 8095 2071 -2236 -73 2234 2130 6073
21319 6073 10878 11130 1522 173 8243 9297 2555 -358 558 176 782 6905 9643 9152 9155 8062 3057
21302 3057 -6204 -7413 -1837 1282 -229 3814 -7556 -16809 -14595 -7289 -2991 1930 1120 4280 7984
21287 7984 14910 23249 14637 3747 5007 796 -7677 -7324 -8891 -8007 -1618 963 7831 11144 10687
21272 10687 6731 6446 3406 -1982 -3580 -3551 -5322 3690 8880 14071 17062 11290 10085 8459 10378
21257 10378 8668 2961 1222 -8875 -8571 -4197 3969 3096 -4256 -1879 -1861 229 10192 13312 12673
21242 12673 12065 14210 13289 11000 8091 8251 5943 2406 2509 -2059 -8669 -10950 -7284 -1530 -5370
21227 -5370 -9666 -12872 -9277 -9170 -4299 7677 8125 2540 3455 7060 699 -2990 -3462 -1959 555
21212 555 664 -1521 -2471 -96 8576 7600 2410 2227 2653 1495 -3566 -8935 -13634 -10975 -2070 7343
21196 7343 6237 7702 6431 -7 317 8741 4225 2006 3564 3478 5660 6823 8214 10275 -369
21181 -369 618 5776 4697 2383 -699 -3018 2648 -3750 -5731 111 4065 1076 2593 1997 3478
21166 3478 1949 1177 529 2274 2203 -489 -2809 -931 2946 4659 2183 1188 -2259 -5954 -10938 -13635
21150 -13635 -5428 -335 -6125 603 4788 3 -2723 -686 231 -3516 1504 4456 3229 130 -730
21135 -730 525 -1265 4971 -160 2402 5129 542 -324 1212 4078 2324 1923 -50 341 -4090 -3491
21119 -3491 -272 2662 9502 9602 7046 2862 -893 -7662 -10233 -7444 -232 5357 5743 8402 12437
21104 12437 14741 16979 18689 13050 4633 517 -6005 -8101 -503 3177 5930 11385 10914 7268 5656
21089 5656 3149 128 -1475 -342 1623 -356 1537 -1026 -1570 2653 2140 198 -1074 -8404 -4962
21074 -4962 5991 8749 10218 3360 132 -2611 2778 8398 8891 4475 -690 -5339 -2901 -493 9595
21059 9595 4738 -4098 -2660 -1864 1477 4745 2110 5668 7734 2858 -8159 -7111 59 2513 7164
21044 7164 4235 993 5634 4463 738 84 2007 -891 1985 6155 4751 -669 -6102 -5810 -5061
21029 -5061 -3452 -941 2222 -8106 -11253 -5600 586 10016 5506 1825 859 2523 994 -9585
21015 -9585 -7633 -121 2068 9458 12743 7266 5718 8232 10577 13752 10261 6003 8831 12767 16677
21000 16677 10626 4683 -4817 -5206 -1067 328 3715 2193 -3983 2163 6890 8146 3185 2855 -3024
20985 -3024 -9321 -13668 -11698 -7549 5520 12053 5733 5010 -385 -5485 -6420 -2445 -647 -3133 -8495
20970 -8495 -10091 -9333 -8979 -4907 -5468 -439 1553 -4233 -4103 1143 -2668 -5280 -1908 -892 7633 15360
20954 15360 16295 14888 10868 11902 4275 2374 -2377 52 3994 -2161 -6197 -8759 -9775 -7151 -4667
20939 -4667 847 -256 -2609 405 5566 1626 -4400 -3029 -2243 1943 3456 2840 -10485 -16688 -11147
20924 -11147 -2976 3782 1028 2177 5257 6408 6430 2273 1005 1166 -1865 393 8314 13297 14258
20909 14258 7778 -587 382 -1813 1195 3940 2061 -498 520 -1174 2462 1881 6318 4407 -242
20894 -242 1737 2317 5706 6779 767 -196 385 234 5303 5167 733 -807 15 2707 -853 3019
20878 3019 5449 3825 1111 849 -2716 -11455 -12986 -12770 -10660 -9359 -5343 -2609 6161 14643 11012
20863 11012 3895 6153 11568 11720 1911 1198 2236 -2142 2624 -1049 -1354 -4950 -3458 -4367 -10535
20848 -10535 -14027 -6862 -2455 -681 -6386 -12734 -5629 2056 -3044 786 -2104 -10468 -14232 -12261
20834 -12261 -12686 -9591 -10079 -3054 -1389 -6382 -3000 1368 -2718 -5722 -9271 -8969 -4107 -127 4925
20819 4925 14358 13067 8432 3358 5298 7928 6198 1982 -2547 -5837 -8214 -253 9984 10270 4538
20804 4538 3219 8628 14423 18960 20008 13975 8898 7853 2587 -362 -5211 -10400 -8139 -6872 -13037
20789 -13037 -12586 -5970 -2025 6385 16732 9433 -5320 -10732 -14861 -13021 -8568 -5225 -3218 -3111
20775 -3111 -1608 -2554 -4877 1532 8527 8321 5533 8155 12821 14645 13534 13336 11609 13974 4039
20760 4039 -2966 -2743 -1940 4225 1884 936 -636 -3549 -2807 1354 1550 -2800 -4882 -1320 580 2265
20744 2265 4025 3546 7187 11795 10896 7620 4191 5192 8157 8813 7710 1680 4907 2978 1593
20729 1593 7539 11909 10703 6905 4980 7343 6421 6460 1920 -2781 -2109 -1145 135 -1741 1005 2867
20713 2867 5900 7367 8198 9606 9791 6931 4858 956 1284 -1292 1087 -1371 -661 6456 7926 4413
20697 4413 2389 8239 8021 3320 7720 4263 1385 -2763 -5352 -2307 -4754 -6878 -6189 -1591 -763
20682 -763 -791 -7211 -11944 -9477 -4748 435 4598 2027 4637 7848 9139 9114 7198 10566 5004 756
20666 756 -745 2121 4751 310 3985 5376 3422 9132 6290 -2800 -11203 -16525 -10484 -5157 -5829
20651 -5829 -703 -2807 -146 -4144 -4212 -3872 -8966 -5702 1107 927 -2481 -1395 -5794 -5133 -3224 1480
20635 1480 1561 -686 3202 4665 11193 16196 10961 8648 4119 1112 6061 3578 2699 3566 8197 6907
20619 6907 5343 4709 3762 5262 4704 -2537 -10484 -12806 -3916 3534 9150 9415 7981 3981 8194 6202
20603 6202 4865 4487 1458 3609 223 -1810 734 959 3825 5118 3956 3685 282 -37 231 -3392
20587 -3392 -6347 -5955 -1886 97 2163 2215 -3514 -1282 -3127 -3242 -566 -8834 -8930 1543 3210 7301
20571 7301 -1110 -5793 -6857 -5093 -4517 -2059 -724 -5133 -11356 -14599 -12270 -5818 766 5749 6521
20556 6521 8943 -3029 -9744 -10030 -5224 -8107 -8982 -4440 -2462 -889 132 -2199 3518 6176 2733
20541 2733 -1386 -210 4537 5775 5818 10770 10110 3860 -1014 -2134 -3753 -4097 -4855 -2491 -6162 1485
20525 1485 2490 -2435 -5170 -2967 -3690 -176 3180 5420 2358 773 -22 -3669 -11759 -9618 -10260
20510 -10260 -7432 -855 2456 5029 4425 -85 -2839 -7541 -3136 4971 3619 1946 -194 -1450 1497
20495 1497 4573 7159 8625 3038 702 1230 4848 10139 9922 6990 7311 8143 14095 13905 10622 8878
20479 8878 8857 6246 2809 30 745 3027 282 -2897 -6680 -4852 -4173 -414 -229 -3187 -1154 5378
20463 5378 3144 -3099 -6439 469 7516 11961 10673 6268 6985 14112 11246 1204 -6949 -5665 3537
20448 3537 396 -6594 -14387 -14250 -8004 1371 4750 5742 6606 3979 5073 8328 5996 10478 13032
20433 13032 1463 -9968 -5562 13 9633 9166 6812 -584 -508 -1568 -89 944 4183 97 -2653
20418 -2653 -4708 -11109 -19474 -15955 -11244 -9599 -8857 -6011 1236 -489 -10763 -11467 -6657 -4702 5474
20403 5474 9038 -467 -7651 -6633 -1497 11141 10525 1400 879 10769 11659 5151 1935 4927 6667
20388 6667 2461 1372 -1615 1071 1456 561 1924 -2074 -5766 -6429 -5590 -8885 -10666 -612 13506
20373 13506 14174 6899 6357 3972 -168 739 -2111 -321 6102 8351 3452 5638 5684 -5026 -2477
20358 -2477 2813 6985 5960 6809 6310 1984 1873 4339 6719 7186 4072 2909 5249 2376 1256 -5853
20342 -5853 -5482 -6167 -6141 -1171 -4075 -6432 -7633 -3539 663 987 1151 -4147 -7064 -4104 5459 8320
20326 8320 3249 -1588 2639 6573 8284 3815 -260 -2383 -4669 -4775 5492 12724 10883 5732 5192
20311 5192 2876 -4416 -13441 -10196 -1759 -3504 -5436 594 2132 3722 -214 5 2276 4370 8841
20296 8841 9289 3976 2901 3993 888 1225 7516 14216 20857 18625 14125 7457 466 4032 3477
20281 3477 635 2260 1384 174 3490 6571 4032 4903 9005 14273 14916 15317 4278 -349 -3111
20266 -3111 -4480 -4769 -5274 -4278 -4124 -871 1370 -940 -2588 -1849 1265 4568 2716 -1911 -5249 -6868
20250 -6868 -1639 4612 8781 7933 2375 2489 5238 -646 -6724 -7755 -7454 -5492 -1221 4853 6025
20235 6025 1798 -3385 -7391 -9766 -6293 -8920 -12424 -6881 3918 6785 9575 13396 9019 -95
20221 -95 742 -1384 1114 2056 -4025 -8445 -6442 -1847 -4698 -8585 -4295 -3693 3460 5164 -3679 -4129
20205 -4129 -7446 -3332 1224 3915 2737 -2868 -5929 -6289 -7310 -3679 6284 10100 4421 -4412 -2288
20190 -2288 205 -438 -464 -6238 -8274 -8957 1203 -1735 -7899 -4937 -8791 -13148 -12787 -10233 -5860 -5711
20174 -5711 238 7336 9816 6581 -3235 -2399 5125 6348 -2288 -6237 -1973 1067 -2453 -6728 -2361
20159 -2361 3595 6491 134 -3118 -3926 -1549 3990 -641 -3600 3555 9755 3443 -403 -771 -2664
20144 -2664 -1294 -2952 -5949 -3959 -3334 -4846 -1347 -2705 -4364 -962 1851 488 -4824 -5605 -3321
20129 -3321 -1596 -1001 1856 2043 3660 9847 5864 2028 40 -1699 2525 581 623 -10200 -15075
20114 -15075 -11800 -3874 3576 737 3631 4070 -3102 -7198 -9805 -12656 -6588 -5953 -10842 -9660 -1252
20099 -1252 14135 15373 7458 6200 -2453 -6112 -4042 -3743 -1575 1258 4527 5949 3328 3969 4828
20084 4828 3341 -3408 2031 8630 6719 5140 8576 16377 7504 2211 -1566 -152 -1956 -3191 -3690
20069 -3690 -1524 824 28 2293 5033 3187 -301 -629 -5080 -2080 -855 1241 8515 9267 6061
20054 6061 4958 7808 9053 2490 -1968 -3148 8006 12072 5610 -2834 -391 1281 277 -610 -5627
20039 -5627 -5475 -7338 -9721 -8828 -8548 -3738 -4069 -3364 -3545 -5069 -2677 1804 1707 -4910 -5417 1026 4404
20022 4404 774 5640 1787 -4518 450 5462 5480 -6190 -7873 -332 4003 821 1320 -389 -5449
20007 -5449 -5845 4068 -2212 -6563 335 4782 1150 -5507 -2796 3810 3644 -1203 1349 402 -2614
19992 -2614 2446 -759 -2574 347 3209 3800 -2321 -2693 -1220 3030 7435 2749 -1200 1010 4234
19977 4234 1074 -3887 -6162 -11349 -14954 -13787 -16361 -12294 -11355 -9924 -6757 -7803 -3972 -4991 -8790
19962 -8790 -6239 1774 -6650 -12890 -8793 -4487 -1247 6427 2489 -3090 -5796 -4028 -3907 1979 9406
19947 9406 8784 4823 4650 555 -2657 -2614 -165 -159 -2870 -8134 -9561 -4868 -1337 -1553 -6728 -9330 -3782
19930 -3782 2313 -2680 -7282 -1025 -3587 -16326 -19778 -9706 -3833 1115 1599 -3283 -11023 -11654 -7077
19915 -7077 -8972 -7756 1614 6723 1972 1115 4729 6898 166 -5017 -741 -2738 -6819 -3435 4176
19900 4176 5547 741 -5503 -4441 -9325 -13094 -6010 2368 3612 5544 1665 -5103 -1369 4976 6864
19885 6864 -468 369 7349 5389 3361 2431 -399 6388 13100 8501 -2934 -3865 3854 9384 11834
19870 11834 1898 -1952 1400 8718 11117 4157 3209 -4624 -916 -215 -867 -652 2699 13037 10151
19855 10151 12004 8551 29 -2794 -3900 -1541 3050 2662 -4949 -3777 1009 8637 4127 -4932 -6405
19840 -6405 -5810 -4221 23 1547 -2661 -3208 -1651 -242 -7246 -4266 -5952 -3752 -4002 526 9638
19825 9638 10086 176 -7229 -7315 -6172 -6827 -12230 -11272 -4604 364 4413 7075 323 -955 4218 89
19809 89 428 -4700 -9448 -4292 -699 2994 -1285 583 5385 6640 2185 -5105 -9101 -2905 6974
19794 6974 6563 8753 10089 4291 -1290 -4756 983 7449 8820 3591 4116 -1831 531 667 3266
19779 3266 -600 -3643 1129 113 -3364 -5917 -5980 -4842 683 1229 4827 1979 3414 11284 10850 3815
19763 3815 -3225 2085 4582 1214 -441 143 -1771 -873 -2623 1334 -3035 -2451 4933 6486 7150 10513
19747 10513 15248 12529 8025 4405 -3463 -11094 -9841 -5849 -528 -2512 -8597 -8466 -2307 5941 4536
19732 4536 1655 852 2155 3792 7215 7198 9488 5893 946 -10911 -12982 -8297 -3947 -3067 1156
19717 1156 5241 10499 2114 -6768 -4485 4864 2686 -6221 -4696 -6268 -11738 -3358 -2643 -16002 -18865
19702 -18865 -11022 -7103 -3979 3993 9453 6594 3786 789 7466 11181 6215 3599 2542 5384
19688 5384 1714 1815 3977 3840 4334 2227 4458 2938 -1814 -12759 -15096 -4135 -6055 -10247 -15519
19673 -15519 -13752 179 6632 2065 1454 3555 4923 5091 8820 9959 4323 -188 -4849 -7737 -12070
19658 -12070 -13678 -8864 -6355 -1620 587 -1842 964 3722 968 -6717 -5850 -1443 -2721 -7406 -4768
19643 -4768 1060 -4661 -5293 -2884 -5767 -11056 -9824 -4056 -1505 4283 1139 -1239 -4272 -2729 -6476
19628 -6476 -8984 -366 -2445 -6665 -7603 -3315 -341 4408 7094 3418 2102 6455 2946 593 -2413
19613 -2413 -114 2627 3324 8339 10457 10391 10825 6093 62 -7372 -7920 -8221 -6510 310 2401 3783
19597 3783 773 -87 726 1423 -1586 -3804 -2471 -3964 -1891 2185 5632 746 -9372 -6387 -4224
19582 -4224 2042 -192 -8552 -12365 -12625 -8913 -1672 2960 -2333 -8288 -1011 748 1627 2426 3326 6708
19566 6708 7626 2549 -7611 -9000 -6111 -4333 -344 -4773 -3598 -10758 -9425 -13367 -16100 -8692 -691
19551 -691 5972 1133 -883 -603 -793 -3811 -13859 -13786 -6013 2782 8992 12285 6235 7391 3701 -5078
19535 -5078 267 6306 2548 2553 1956 -3990 -9602 -7978 -1022 3409 7378 1640 -3465 -3870 5429 4758
19519 4758 -2457 -5947 928 7943 9700 9098 10041 13591 7603 5181 1266 2899 5088 -884 -1801
19504 -1801 -1204 864 5284 5247 656 -4015 -5390 3136 7258 8538 6831 -724 -7000 -10076 -15600
19489 -15600 -23166 -16683 -5126 6199 4546 992 -660 -2666 -376 -7314 -7653 -3862 -5949 -1087
19475 -1087 -1886 -4350 -8531 -7122 -1568 2028 -2759 -10537 -9066 21 -1813 -1963 6459 9091 -2880
19460 -2880 -4150 -6055 -3711 5842 8904 7423 8383 7188 1981 -1415 -5791 -161 2672 -1735 -384
19445 -384 580 -1862 -4601 -204 3113 -2984 -1059 2026 6534 7819 8055 3749 568 -377 -4401 -7810
19429 -7810 -10929 -12688 -14410 -8802 718 -2568 607 2312 -735 -4710 -7090 -3883 -2799 -5037 -3203
19414 -3203 2314 4689 2504 1727 1899 -4021 -9317 -3628 -2742 -5731 -5869 -10176 -12438 -9103 -9728 -10222
19398 -10222 -8149 -6376 1402 1051 -2928 -6451 -1563 785 -3160 -5862 -6256 -6636 -4745 -3678 -9368
19383 -9368 -7761 -4104 3680 8210 2375 -1792 -982 3196 4700 2791 4516 -1272 -689 5290 3252
19368 3252 5097 4265 8606 8537 7161 2285 -2824 -2558 256 2706 3664 -2144 -10879 -11264 2074 7997
19352 7997 5699 4185 8331 7197 7919 4369 4997 9679 7852 5606 11323 10125 4652 -2609 -5230
19337 -5230 2271 5700 6172 7379 10401 9812 10653 6856 -4766 -9470 -1478 -4607 -4701 -3752 3547 2585
19321 2585 7429 6907 3675 4621 5098 2660 -1462 -5772 -7020 -3867 1430 8733 17084 25832 22899
19306 22899 16223 11453 9704 10919 13541 10241 4618 2239 5645 12103 11960 2148 -842 972 2404
19291 2404 1777 1541 3158 6469 8720 11495 9762 3728 6481 2250 4634 9255 7096 7469 9076
19276 9076 15837 13609 7138 8823 15939 15813 18527 21385 29278 27864 19049 21673 28429 28604 27905
19261 27905 30339 37021 45419 54032 63835 79509 91463 98927 104143 119135 136612 149179 156048
19248 156048 170440 184140 190369 198268 205713 206378 203295 192145 188196 183875 174323 160288 154002
19235 154002 145606 133326 118360 102840 96782 87622 72106 61191 57576 49311 43658 41652 37665
19222 37665 37474 37358 32472 22949 23175 18554 13495 10275 7591 10073 7268 14439 15085 16900 10999
19207 10999 10008 21224 20498 13245 3697 2737 -444 1062 5119 7483 7778 10869 13460 15708 13201
19192 13201 11756 16106 15981 13345 13043 11561 7152 8095 10591 12328 9892 5760 1947 5541 7831
19177 7831 -1084 -10522 -13885 -13117 -5990 691 1962 -6073 -2765 3712 4110 1965 5968 3355 4016
19162 4016 7800 4872 -5648 -15190 -10896 -5811 420 -703 -1374 6264 10284 11068 8074 1522 1417
19147 1417 3313 3967 2224 4718 5098 3549 1487 5089 4602 -6059 -8630 625 818 -3688 -3513 -2854
19131 -2854 -7400 -11520 -6557 -7546 -5195 -3134 2620 10397 8336 10679 10877 2277 -8447 -14344 -1970
19116 -1970 2209 2475 2351 -20 3527 2187 1487 2816 4754 -813 -5672 -7424 -11021 -6623 -7302 -3226
19100 -3226 1617 8375 8674 -2074 -4465 -2037 -1300 -6591 -10634 -10981 -9939 -11557 -9499 -13377 -12726
19085 -12726 -8989 526 -2775 -6955 -8033 -11144 -7260 -3121 5782 12305 8397 -1166 -3408 2053
19071 2053 8577 9873 6280 -5144 -14825 -12623 347 7423 9266 10514 2493 2189 4758 7448
19057 7448 494 -4296 -4795 -2513 391 7129 3644 1249 -1570 -5802 487 1314 -710 -3180 -164
19042 -164 5856 6967 2879 -1571 -8248 -10090 -553 4881 6706 6633 -1097 -4857 -1041 -4552 -5835
19027 -5835 -5357 -4296 -6566 -8453 -14679 -16843 -9601 -7395 -6059 -6585 -3808 1807 8116 5484 2056
19012 2056 1152 486 -1002 3095 -1070 -763 9022 6777 5897 1075 72 7969 10387 5358 -2544 -9549
18996 -9549 -9696 -5538 635 1056 469 -1996 -3426 -3633 235 6209 9367 7144 1597 -11315 -18246
18981 -18246 -16240 -10173 -9673 -11716 -19747 -13421 -6506 -5882 -6021 -8758 -10473 -11927 -7633 -2331 1896
18966 1896 -1901 -4156 -9995 -13722 -11043 -5067 2308 -207 -1719 -687 855 5899 -1764 -6882 -6810
18951 -6810 -11310 -8112 -9245 -8246 -7737 -5785 -2005 -7405 -7458 -8659 -10309 -3147 -35 947 -1732 -4021
18935 -4021 -144 -3065 -4325 -3420 2060 2981 -1551 2503 3868 -5467 -6247 -5568 -5826 -7405 -4087 177
18919 177 3916 -1378 -2304 -439 1479 -3474 -5810 -4600 -16 3319 6974 5581 2429 1759 -2227
18904 -2227 -3687 -1684 -5482 -10074 -1866 1111 1047 -6047 -10865 -9628 -12264 -13896 -14469 -7852 -845
18889 -845 427 1610 -2166 2576 2002 -4835 -5981 -14459 -13577 -12757 -6803 2518 965 -1875 -432 -2417
18873 -2417 -1806 3434 2004 -81 -1996 4842 10374 4587 -357 -8998 -9916 -10253 -9147 -73 -37 -840
18857 -840 -983 -670 1433 5501 6096 -3526 -7589 -8757 -4082 7503 4524 1138 1295 976 235 -1816
18841 -1816 -2662 -2532 4682 10870 9113 6862 342 -3703 5945 7338 304 -3412 -8604 -11050 -10813
18826 -10813 -7991 2897 9440 8371 7015 7556 9754 3839 -858 -10340 -8365 233 1935 -992
18812 -992 -1916 912 6946 6792 7865 7380 6029 10916 15936 12078 -88 -3957 3582 3556 -3289 -11034
18796 -11034 -9938 -3583 -86 883 -2002 -2032 -4438 -3420 -5559 -2528 744 -1975 106 8239 10354
18781 10354 10007 5279 7923 10796 2869 3866 2012 4243 12736 21291 33247 42893 57883 64392
18767 64392 49629 40453 32548 22400 17803 15039 13594 10021 4313 3860 -144 -2710 -3073 -2424 -2806
18752 -2806 -3867 -5713 -6751 -5695 -2035 -1924 -5175 -3316 -1458 -4589 -8843 -13904 -11635 -6006 -1048
18737 -1048 7346 6519 146 -5655 -16672 -18838 -12811 -12215 -10325 -2117 677 -3165 3412 5045 -2791
18722 -2791 -2301 -5157 -7580 -1946 -8208 -10474 -5257 -1825 -3430 -487 3752 2404 -4391 -10256 -8850
18707 -8850 -4056 170 2116 4147 -4905 -2640 2917 2678 148 -2249 600 1221 2745 2600 799
18692 799 -2956 -7550 -5122 -7447 -14101 -10052 -5089 -6912 -8536 -8005 -12384 -9499 1410 7308 7092
18677 7092 -3683 -11279 -10484 -4971 -637 -3185 -8535 -6413 -2565 557 6466 5853 -10341 -18484 -15283
18662 -15283 -8760 -4551 -5534 -1862 648 2806 1296 -6949 -9488 -2395 871 3686 1814 -1857 -10518
18647 -10518 -11376 -12058 -4406 142 -4762 -5518 -3415 2238 2369 834 -3261 -1054 6960 2326 -8752
18632 -8752 -8022 -7886 -9776 -18340 -14980 -10044 -12672 -1223 3391 -1882 -1548 -1125 4686 3759 2475 -2084
18616 -2084 -4645 -5153 -9723 -17248 -17273 -11099 -13375 -15649 -15187 -11732 -10842 -7332 -3047 -1328 1123 8740
18600 8740 9206 5638 3516 2680 33 3443 3397 -13 -901 -2730 4533 1706 -556 -1460 2574 3074
18584 3074 2521 5701 5175 -693 -5248 -1 170 -6773 -12314 -12954 -7364 -2638 4790 1813 6874 15126
18568 15126 15787 13127 13669 13668 9565 5038 -1310 -5370 -1371 6827 10075 2576 -1397 -2150 -4908 -6136
18552 -6136 -7226 3281 2045 -10332 -11791 -6777 1126 -1214 -3935 -4609 3338 -1225 2771 -3555
18538 -3555 -6801 -8788 -9351 -6601 -6711 -3129 2569 8073 4441 456 6816 2591 -5992 -7746 -6808
18523 -6808 -4138 -10866 -4988 1264 -5175 -8154 -985 2642 2600 3783 3744 4428 4407 203 1602 222
18507 222 4303 11331 5676 -3127 -10649 -11827 -9265 -11400 -9812 -2136 -2573 -7113 -7062 -5088 258 -1945
18491 -1945 -7708 -9786 -5738 -5243 -9697 -4394 5681 4519 1198 -1102 -7422 -7787 -10882 -3553 1473
18476 1473 -2777 605 2204 4680 7554 -425 104 3932 8962 9525 12921 15233 14089 6381 -2508
18461 -2508 -2255 -5583 -7199 -1941 6939 1089 -8252 -14340 -11856 -11353 -13638 -15451 -8104 -6729 -4791
18446 -4791 -1080 5689 -50 -957 -5700 -8588 -5045 2747 894 3024 3227 614 3728 3775 938 -214
18430 -214 -804 -7767 -12928 -856 624 -2211 -6992 -7222 -14425 -12369 -13374 -15026 -18368 -16681 -6115
18415 -6115 -2658 2571 2759 2811 4304 2200 -2364 861 7685 6615 6699 10443 11464 9339 9514 15563
18399 15563 7618 -5254 -13858 -12397 -5185 2054 1569 6938 15933 16145 11245 9882 8447 1422 -1283
18384 -1283 -1180 -1905 2733 598 4452 9283 11104 12380 9790 8053 5347 4283 8346 5672 -1541
18369 -1541 -5486 -3162 972 -1869 -240 -3394 -1338 -959 -5656 -4503 -980 -1625 2493 5489 2393
18354 2393 537 2554 -58 910 5896 758 -3101 -294 -2620 -5379 -5794 -1258 -106 567 1160 -2703
18338 -2703 -4241 -2632 609 -245 -1310 -4998 594 6638 -284 -2191 438 -5935 -8327 -6006 -5866
18323 -5866 -9795 -15634 -19814 -20572 -11475 -7471 -1992 -3752 -6741 -9445 30 824 -3223 -2021 -7658
18308 -7658 -824 -1379 -7637 -5757 -6819 -7204 2782 4069 -3694 -5750 -7343 -5380 -5441 214 5552 4715
18292 4715 -3978 -9711 -7581 -3919 -402 -1050 -5130 -12394 -12794 -10836 -3969 1593 -545 5837 5098
18277 5098 2579 -3457 -3941 -3149 -1168 -2331 2829 3438 1278 -3282 -4647 -2107 -1854 7648 11683 7483
18261 7483 3193 296 1436 4602 2997 3548 2765 2841 460 -2128 -7065 -1851 7197 7864 5936 2146
18245 2146 -3112 -858 4691 4097 11430 17043 9884 11153 9793 1064 7962 12695 16083 13237 8193
18230 8193 2331 3662 9383 10731 11202 10292 7277 10975 13908 11847 13726 13837 12950 13423 10791 14539
18214 14539 13401 5167 3825 2212 -68 -3716 -1036 6734 8508 5578 -2114 -5835 -7155 -4025
18200 -4025 -2679 -1255 -4969 -4753 -2144 4199 6389 1416 1119 357 -733 2696 9606 9201 10425 10658
18184 10658 10583 11454 15713 12636 11252 11874 6190 8135 15703 18972 16753 12007 12622 16379 16205 14612
18168 14612 16135 13314 15511 9673 7145 9961 13015 15923 19339 25402 26079 22968 22334 23875 23102
18153 23102 26251 23245 21375 20906 22308 30183 34340 29115 30664 40914 47187 45244 47530 47881 50324
18138 50324 50359 58782 60391 60942 61535 65664 72071 78876 88056 102914 111145 134957 155035 178439
18124 178439 214340 257530 315792 385749 482062 629942 860679 1193876 1623214 2144039
18114 2144039 2795348 3685885 4994581 6864766 8823213 9645863 7845137 5296781 3441449
18105 3441449 2278543 1580258 1169415 921821 769421 673303 595751 521631 459481 412604
18095 412604 366395 325336 296114 273825 257585 239209 218556 203275 189940 171573 153811
18084 153811 137344 124464 118500 115950 105321 97408 97088 93999 88834 87617 89313 76110 71199
18071 71199 64973 57718 54838 57846 57226 53982 57881 59714 53025 48766 45785 43678 39413 32474 28400
18056 28400 33481 37332 38865 36121 36737 28276 26356 27488 31116 28788 22235 17665 15566 16143 16370
18041 16370 17584 24348 24794 23674 22849 29859 30913 29893 26748 19879 15614 18358 18278 12414 7942
18026 7942 14122 16867 22441 21446 12160 8492 10404 13752 13810 6516 726 6142 10120 10027 7082 1704
18010 1704 -69 -5112 -4224 -5608 -3886 -1644 -3355 -8764 -10345 -4172 475 509 5552 11733 10838 7578
17994 7578 6010 4201 3248 11718 21466 21236 16565 20020 19000 8278 2340 -945 1574 13099 17050
17979 17050 12487 3247 -301 -5212 -3721 173 -1108 954 7169 9887 7192 4221 9077 13816
17965 13816 11098 3890 454 -831 8404 5574 -683 -308 -5750 -9467 -9039 141 6124 10843 4570
17950 4570 8560 9687 5529 4542 3883 4759 7124 5206 9867 11815 11172 10777 3341 1304 -2374 -2936
17934 -2936 -3078 4146 5645 6697 1624 3854 -6806 -6871 972 2980 -128 3761 7731 8831 5704
17919 5704 -1609 -5239 -3531 -2931 760 3238 -1690 -3669 2871 4105 4138 3459 -1471 -4437 -7642 -4395
17903 -4395 3830 7095 7206 6832 4116 -3051 -4065 -7379 -13865 -14179 -8963 -6840 -7266 -4525 -80 -1689
17887 -1689 3604 8024 9449 6036 375 -114 1346 310 3764 4002 -856 -11721 -17521 -12501 -3020
17872 -3020 5905 6693 1990 -176 2749 2105 -3724 574 8502 6247 8155 6335 3777 2316 4059
17857 4059 8089 8084 636 -1696 5900 10011 4534 3478 -662 -4306 -5802 -1978 -2549 -735 -3629 1331
17841 1331 4614 -3420 -561 2165 -372 -687 -4578 -117 1101 1000 -2419 -2181 -2454 -4810 5016 10279
17825 10279 396 -3336 -117 112 2908 2589 3595 4104 9430 6410 4703 15869 7575 1217 -6782
17810 -6782 -13375 -3456 5354 4849 6388 7584 8413 11081 11616 13238 12154 7873 -188 -5741 -7162
17795 -7162 -1849 -5742 -6204 -5465 -4594 -6229 -8754 4 4994 7642 5213 -4138 -11044 -4465 -7033
17780 -7033 -4867 4466 9424 3489 -1129 -2320 5192 13212 12204 7363 544 942 4098 3256 1767
17765 1767 4531 5087 6203 2159 -259 -975 772 2557 10191 5812 -668 -5685 -5281 -1527 -943 -2534
17749 -2534 -4287 -4508 -1592 872 -2862 -828 -500 -2445 -6282 -3635 5889 12610 7713 3305 -734
17734 -734 -1411 -8382 547 4490 -1888 -4921 -1927 -2745 -5546 -2238 -801 -192 -6210 -11119 -12466 -16184
17718 -16184 -12101 -8485 -5481 83 -1586 -2128 -6830 -9051 -10105 -11940 -13929 -13717 -11271 -7046 -7587
17703 -7587 -459 5644 1004 2534 2025 322 5990 6004 8062 472 -3358 869 -1172 -143 5646
17688 5646 3480 1572 2588 5711 8371 1535 -10695 -15710 -8805 -2838 -1218 -3510 -2020 -9866
17674 -9866 -1322 -1079 -2410 -1645 3337 4670 4076 212 -4557 -269 -639 922 4560 3356 -794 -7369
17658 -7369 -7717 -3842 -11033 -15231 -6458 -5002 -9271 -11064 -13027 -16149 -14500 -7891 4464 1708 1071
17643 1071 -2041 -3265 -3794 -2569 -1634 1291 4301 2633 4268 9226 13477 10258 6952 10594 10507 4583
17627 4583 -2093 -872 -468 3226 2953 4355 16337 18477 16526 8257 4332 3522 158 -2639 290
17612 290 4048 1288 2315 867 479 1189 1318 3702 4669 6034 2345 902 140 -4799 -7542 -8161
17596 -8161 -3303 513 1028 -5852 -7662 -2816 3029 904 -768 75 1314 4124 1050 2272 8957
17581 8957 5422 -6687 -7334 1264 4477 4676 5958 11107 9855 6074 3743 938 -1962 -3619 -2479
17566 -2479 1947 4056 -2341 -9365 -11639 -8893 -6273 -3089 -6634 -4299 71 1497 3120 3052 4323
17551 4323 5115 5886 9594 6000 6734 2959 -150 5410 10746 6608 2569 -4439 -6640 -7859 -9668
17536 -9668 -12474 -8794 -2756 -83 3098 8507 3288 1723 2474 5931 5706 9135 10630 5917 3424
17521 3424 6481 3126 -160 -6108 -4534 1367 11166 4809 1815 -1835 92 -3051 -2390 -2752 2660
17506 2660 -573 664 1546 878 -3155 -1020 -340 -3598 -6380 2424 2957 1015 8295 12706 12612 14807
17490 14807 13501 8300 11943 11762 14260 10647 -80 -264 6276 4204 5345 2735 -59 -1266 -1497
17475 -1497 1617 4747 7424 8382 3101 341 6446 10924 4999 4245 10920 11220 12000 10492 8196 10542
17459 10542 6757 6815 13124 13634 4264 8047 13070 16134 15970 10648 7311 9221 9602 14710 16670 24718
17443 24718 39332 50372 49022 25295 6243 -4014 -2802 -3658 -4899 -2289 3741 731 1756
17430 1756 2103 -1072 -1849 -4849 -2912 2169 945 -938 136 -2255 -6600 -13882 -14307 -12932 -13852 -14418
17414 -14418 -5759 539 4007 -3621 -4633 2860 10942 3484 -4316 -5492 -5680 -12307 -7550 1928 4192
17399 4192 3223 920 4561 9987 8127 9375 6793 195 -3338 -3180 1914 -2849 -8736 -7543 -3253
17384 -3253 -7131 -3492 2508 2393 -1182 -199 9614 11498 11495 6991 1902 -383 -5668 -7843 -5642 -6725
17368 -6725 158 169 -2907 -379 3903 -2063 -5175 -5771 -5066 -1421 -1945 809 3351 41 -7290 -4327
17352 -4327 -7361 -6089 -53 4439 10175 12912 11091 5857 5340 5655 3200 -1154 -3254 -3343 1127 6211
17336 6211 6469 -2603 -709 1301 -125 -4544 -7566 -3418 -8273 -19307 -20736 -17935 -16744 -9353 -6011
17321 -6011 -7178 -3736 6518 14688 8997 -2100 -5647 -4824 -6974 -4186 -4656 -8930 -2903 -1710 -2998
17306 -2998 -1325 -7292 -3144 -265 -4639 -3434 -3132 -3919 -2397 6692 5947 4255 2990 -3200 -5606
17291 -5606 544 3011 2167 1485 4182 1332 -183 -1350 1676 -1327 935 2560 557 -6200 -6183 -9684
17275 -9684 -11134 -8510 -13209 -11380 -3185 -2274 -1342 770 1187 -730 1709 2331 -1810 -10832 -16882 -17158
17259 -17158 -12157 -8348 -4426 -5720 -11708 -11714 1564 402 308 3698 5524 6264 3062 4928 3427 1563
17243 1563 5137 -385 -3801 -9797 -12413 -12049 -6707 -2283 -601 -1351 -7296 -5446 -1418 6175 10113
17228 10113 10602 4875 -180 -7286 -11177 -7034 -295 -1343 -11402 -15780 -11153 -10356 -16657 -19464 -15317
17213 -15317 -13504 -11196 -3572 -157 -4755 -8962 -7322 -4383 -6321 -10420 -14394 -12291 -11616 -5754 -6545
17198 -6545 -8650 -6403 -2613 989 2308 -2956 -771 -2725 -6254 -3493 -5799 -7784 -9597 -17061 -15673
17183 -15673 -6623 -4246 -12967 -18811 -10670 2246 3063 3333 3073 9469 5344 -8140 -10005 -9163 -3133
17168 -3133 -1464 -4663 -9406 -3105 766 -3105 -7247 -2683 1141 -3040 -3411 -2085 -5335 -7832 -10367
17153 -10367 -16297 -10502 -912 1851 -97 -2775 -6732 -8274 -9795 -10961 -4480 2749 -3205 -8020
17139 -8020 -10203 -10055 -18 6472 -1239 -4588 -5792 3390 7135 3810 3868 3984 -2618 -6630 -3876
17124 -3876 -6538 -4511 -13151 -22740 -11221 59 5321 637 -6952 -13191 -8487 -5795 -1775 -3442
17110 -3442 -5325 -5268 -288 1375 1411 -1116 -3128 -2764 678 2867 969 -2017 520 8142 5583 3052
17094 3052 5420 808 -3776 -163 4218 5839 -4256 -10606 -8900 -7725 -2960 -4904 -14473 -15664
17080 -15664 -8730 -2097 -1899 -1166 -3978 -2868 -3719 -3262 116 -295 4996 10832 9157 6837 2825 1163
17064 1163 1424 4704 5285 9782 2654 327 -4387 -9849 -5908 435 -3784 -1673 4022 5621 3593
17049 3593 -6240 -13839 -13014 -7985 -5076 -5612 315 -2017 -4423 -3604 -8040 -5341 -2658 -7795 -7528 -8772
17033 -8772 -9329 -6176 -4105 -1396 281 1970 6998 8973 2148 -2083 -6786 -4150 -1529 -3032 -10045
17018 -10045 -8881 -6170 -5476 -1594 878 -1365 -6137 -4051 -454 1400 -3756 7038 13689 13337 12096
17003 12096 8713 9979 12626 3476 -5484 -5030 -6809 -10548 -6168 -2311 -5855 -8803 -9857 -6835 -1034
16988 -1034 -1389 550 -5176 -5206 -3537 -3856 -1530 -5036 -13 5090 1514 -8134 -7712 -5523 -8546 -8305
16972 -8305 -4519 1591 3105 915 5700 8078 12536 888 -11924 -12717 -11335 -3561 -2407 -1003
16958 -1003 -1490 -3281 -3208 -3833 -942 2070 -3237 -8309 -8966 -13498 -16234 -19964 -17429 -17588 -19986 -17747
16942 -17747 -12369 -13182 -9076 -7044 -5834 -4521 -4701 -4285 -9949 -14228 -11258 -7137 -2842 -2671 -1322
16927 -1322 -361 -3610 -9735 -12418 -8751 -889 2968 -6023 -14364 -15018 -12139 -14456 -10947 -3856 -2967
16912 -2967 -6028 -6275 -5016 1413 1055 -8039 -15703 -10212 -10918 -6797 -8492 -7271 -6770 -11266 -11473 -12660
16896 -12660 -7349 -7302 -1545 1931 -972 -2571 -3962 -5634 -9439 -12509 -12900 -21567 -22057 -12173 3833
16881 3833 5741 3534 1832 -2383 -917 -2579 -2228 -2927 -7891 -13813 -12495 -10025 -4178 1908 -890
16866 -890 2504 5780 5338 2219 722 -844 -3201 -150 2067 -4348 -4445 2921 3597 -2474 -1832 -1125
16850 -1125 2849 -2250 -5523 -149 4799 5356 -660 -3672 -4529 -6630 -8609 -9088 -10577 -17313 -15978
16835 -15978 -17581 -9710 -1042 -1559 -1295 2778 -2344 -16129 -17096 -12816 -14046 -13195 -15853 -12615 -6562
16820 -6562 -299 1422 5587 8798 1096 -3855 1672 8650 2409 -1760 -4118 -3140 -2240 -570 4973
16805 4973 3951 9254 937 -714 3751 2603 -377 735 1616 4256 2945 4694 -632 1050 4855
16790 4855 3827 -1754 -6165 -1270 -1925 -373 958 1780 -2046 -11182 -10574 -8782 -5491 -2759 -2390 -3475
16774 -3475 -1336 -3768 -3225 2927 4713 -1618 -7899 -7137 -1743 -880 -1345 614 6595 4834 -2490 -482
16758 -482 2280 -8180 -13613 -6155 -5481 2578 10128 11617 11399 9851 6728 11537 20431 18274 15856
16743 15856 10837 11719 10677 18470 29324 32781 37487 43273 42698 49394 51209 40411 39950 43486 51729
16728 51729 54126 47685 34489 26725 24188 24567 24119 27656 29097 24710 15860 6367 9508 14003 9858
16713 9858 1371 -1113 2210 4104 4285 8736 10631 8624 6327 6312 13076 21923 19355 6656 4838
16698 4838 1658 2526 1899 -2104 -1503 898 84 -2603 -197 -1031 -5370 -4829 -5463 -5163 -1009 895 3391
16681 3391 1861 2061 113 151 2036 -2402 -254 937 4780 6324 4090 -591 -6760 -5543 -1321
16666 -1321 4158 934 -5167 1352 5382 6512 4405 11674 16686 14077 10694 3588 1224 7323 8714
16651 8714 11371 12758 13954 11633 9507 13663 14130 15637 9568 1294 -3823 -3334 -3099 306 4371
16636 4371 4390 2338 -161 -6920 -4448 641 586 9179 11893 14386 11692 9036 7310 119 1982 7614
16620 7614 6978 9164 9596 5735 3284 2392 -525 2167 11217 10022 4682 4143 3660 -2245 368 4056
16604 4056 8127 8123 4950 7924 5667 1505 -5630 -5503 3686 10080 15868 15161 17368 21005 17472 16241
16588 16241 24248 40213 56724 79446 100535 123102 146355 168616 201591 232687 259137 296857
16576 296857 340718 365894 365332 367577 366548 360980 355895 346995 322106 283277 239023 209059 181953
16563 181953 157477 138950 112737 96622 76448 55921 47943 41375 33124 34385 39463 35244 29036
16550 29036 21133 16110 12867 16847 19751 18959 23129 20094 22993 17135 13038 6838 4868 4601 5735
16535 5735 3930 5904 3941 6219 5478 3855 4354 4965 3809 7264 13646 10012 5800 11424 10880 9235
16519 9235 6957 4334 2032 -4162 1717 8952 14840 13760 12080 14177 10354 3301 5361 10672 12363
16504 12363 18172 14232 8904 6009 3044 -2248 -581 3632 6162 9772 14475 16401 14080 13709 6369
16489 6369 3183 2496 -1631 2240 3506 8798 15796 12921 8374 3150 664 2162 6664 7635 5382
16474 5382 2995 1788 197 -2140 7116 16548 17512 17214 22414 22462 21316 15543 17469 17272 10032 7096
16458 7096 1252 2491 7489 11119 16185 18481 18757 13614 10536 13015 9943 3621 389 4707 12928
16443 12928 11088 8275 2662 420 -612 -1567 -8389 -335 323 -368 7209 16661 24708 17899 14599
16428 14599 19612 19064 18390 23964 13215 8880 7143 -518 2761 10743 17735 14133 11794 11077 11885
16413 11885 8588 1348 -3135 3057 10524 14169 8905 10260 13700 11087 10664 5066 581 -2091 1282
16398 1282 6186 9812 8186 6634 5146 -1636 -7628 -11261 -10198 -2897 882 -2930 -9146 -12567 -9956
16383 -9956 -3960 794 -6229 -9116 -9798 -9652 -3624 -507 -4672 -815 -424 -6251 -5327 -5926 412 -2316
16367 -2316 -6404 -5379 -3263 -3887 -1515 -1565 -5015 -2039 -21 -1358 413 -112 -1795 -10067 -5149 774
16351 774 -5360 -6900 -3430 3043 1957 3303 -120 -3022 -9976 -11748 -4699 156 1804 5219 3191
16336 3191 10025 6172 -138 1696 -3280 -8231 -14181 -27818 -36308 -34132 -28403 -26911 -36408 -36206 -35177
16321 -35177 -42450 -53800 -56973 -53383 -58474 -58076 -56323 -49837 -46768 -44426 -25352 -7902 3141 13589
16307 13589 12043 5096 8559 14072 16808 19373 17276 22336 26796 29262 33476 31427 28544 22958
16293 22958 18297 19970 16179 15978 14997 10714 11862 11995 7895 8162 15718 15488 17185 18843 18183 22006
16277 22006 24062 25308 25192 24583 30611 34382 45228 56315 60281 62377 66372 70831 78349 85859
16263 85859 94506 102700 105327 96885 91161 88438 88457 92793 88819 73948 64955 52493 42198 38435
16249 38435 39450 32802 29296 27088 24690 26712 33997 35866 30985 24677 26436 25784 30368 24645 15447
16234 15447 11877 13756 18902 30941 34023 36938 34535 28197 26993 30000 31100 25908 25878 32013 28854
16219 28854 27870 27185 22808 32424 30269 19815 19842 27707 35393 33233 24230 21678 13750 9058 10611
16204 10611 10731 12339 14728 18452 21142 20709 18273 21018 17984 23396 32546 31036 27656 22686 21999
16189 21999 17407 16986 23778 32031 30391 29463 30551 24980 27539 24241 25466 22742 18868 21037 17908
16174 17908 20977 26607 30578 30634 29739 35489 37917 39466 39241 41385 46994 57989 61719 53809 53165
16159 53165 61136 71531 75310 69125 67467 69281 67299 67209 69384 71566 73104 75058 80383 90326 95453
16144 95453 97485 107330 116991 120260 118402 129251 142229 149585 152418 154877 152061 157081 165739 175008
16130 175008 174885 169046 160813 154994 141130 135008 138940 139663 135039 129720 129655 132740 137882 131431 123302
16115 123302 123927 126681 130262 129367 124660 127531 129564 130705 126996 119263 123807 124549 130432 131824 125779
16100 125779 126908 130233 133295 134915 148688 152252 150953 146414 144134 144511 143460 155202 168848 176144
16086 176144 180160 187715 194413 188349 192472 205573 217526 213132 220351 226838 231098 241300 245343
16073 245343 256730 273113 289508 301476 319981 339631 370529 402366 440133 474475 505004
16062 505004 543608 591490 642693 689233 736143 766906 778480 794544 808480 830282 855800
16051 855800 865974 860537 864460 875532 912148 946359 987520 1034276 1091148 1149121 1205454 1258510
16039 1258510 1311664 1368746 1438138 1513504 1610573 1716079 1807974 1914103 2055229 2249289
16029 2249289 2497793 2817102 3227803 3758370 4462806 5396024 6649559 8313498 10528303
16020 10528303 13513149 17407223 22151601 27363191 32653444 37855356 43345049 49798611
16012 49798611 56921762 63149872 67362555 68109758 67210223 66510493 66215053 65443841 62644345
16003 62644345 56484596 49228791 42094988 36080290 31181144 26540774 21894003 17621668
15995 17621668 13992986 11239271 9272867 7865768 6828570 6046515 5434917 4946595
15987 4946595 4527258 4160582 3825278 3528360 3280868 3068477 2878081 2704954 2558978
15978 2558978 2438277 2337164 2240639 2128643 2017814 1918213 1847164 1773859 1691979 1601001
15968 1601001 1511747 1422856 1342691 1274379 1210918 1144617 1078575 1023819 982934 941340 895111
15957 895111 862562 830670 799540 764017 730450 688440 651896 630391 616674 602379 580830
15946 580830 558293 539871 528384 508571 493035 471514 447671 433285 416773 408988 396567 373749
15934 373749 360133 354351 346228 341841 325736 310300 302672 292996 284839 277966 269001 263245 258346
15921 258346 249864 247879 240582 231451 225737 221985 215277 215105 205432 196717 183249 177911 174270 161946
15907 161946 152730 150766 145268 139091 139993 149362 151065 135078 123369 119366 115793 119918 125251 119023
15893 119023 121357 128289 126433 126424 133091 133931 131702 138719 148276 154238 156506 150902 147335 147730 145207
15878 145207 143050 141695 135334 116139 104382 97199 92893 85011 76686 66812 58666 56879 56137 60519
15864 60519 50938 48772 54426 49420 40542 33069 33869 34122 30088 36271 44408 41793 38598 42871 45321
15849 45321 45944 56113 57550 49491 47299 49090 46152 42008 46356 46315 45247 46245 40079 34424 35084
15834 35084 28665 29972 35905 36060 36543 37513 35415 27247 30139 32887 40820 43183 32116 31750 36747
15819 36747 37853 28688 25809 18840 18433 24840 30679 27736 26905 32073 37020 35720 34386 33145 33626
15804 33626 22631 17838 13477 12748 6977 5441 5541 2691 3389 5966 1905 -2881 -131 3133 5245
15789 5245 -66 -1242 -2005 4696 8555 11543 16710 14662 14865 6896 7934 11229 4738 1472 -3313
15774 -3313 -3659 -1141 5969 7120 11156 10763 5652 1801 5263 -3256 -2715 -837 9315 9614 9930 8948
15758 8948 6256 9431 17712 17604 13840 17919 16395 7440 -2183 -7630 -8877 -13302 -9950 -4308 -3125
15743 -3125 -3363 152 -3710 -4313 -5184 -5782 -5950 -5542 -3145 -3660 -2087 -4270 -6714 -7087 -8346 -5234 -7113
15726 -7113 -5347 78 -766 -6104 -7252 -7375 -9075 -7050 -8019 -3678 -9913 -14795 -16457 -7712 -3546
15711 -3546 -4085 2042 7075 10933 15608 14693 25597 40085 50559 58885 69745 73274 68705 72102
15697 72102 75536 71400 71018 64530 47541 38880 38846 36754 36875 29943 17266 14425 9168 13502 19073
15682 19073 15525 11169 6111 5080 226 2003 11804 10609 10896 14297 10214 10654 6326 5756 8455
15667 8455 7846 8654 9877 10565 9262 -456 -8820 -9667 -6584 -1365 -3109 2253 7103 10738 6362 3770
15651 3770 1053 3492 -3632 -4129 742 434 4880 12831 7418 1424 2831 5148 -2265 728 2156
15636 2156 5182 1590 3608 9312 8109 6841 6839 1567 6565 5101 5822 -2255 -9028 -8500 -8640 -10461
15620 -10461 -15352 -13401 -10426 -5715 3443 7846 6085 6867 4982 10 -3194 -3679 -3717 -3743 -4996 -6658
15604 -6658 -7188 -5687 -5230 -7054 -7014 -3110 -2112 -4427 -10276 -9532 -9909 -15092 -11264 -3991 1676 5522
15588 5522 1083 -2237 -6343 -2776 1667 -1823 -6560 -11498 -3480 613 1685 8113 5751 2330 3545
15573 3545 1158 -3645 -4931 -5042 -11053 -18873 -16184 -3128 5637 4259 -5858 -5490 -9700 -16016 -13557
15558 -13557 -1943 3119 -4267 -9919 -13186 -15834 -10927 -8616 -8203 -9619 -9385 -12257 -12963 -14695 -14608
15543 -14608 -14648 -16260 -10685 -13920 -13300 -5610 851 5416 1144 -4694 -10051 -17057 -23736 -22917 -16953
15528 -16953 -8710 -9254 -12573 -11058 -8283 -12591 -6108 4852 2840 2008 8618 12108 6622 -3142 -3896
15513 -3896 -1105 -253 -4785 -5360 -5167 -9267 -11079 -9074 -2361 -1036 -1593 -1804 -1523 1588 3087 4813
15497 4813 2510 3339 1260 -412 -1632 -1869 -6306 -9947 -6927 -1912 -3896 -259 -3718 -5383 -21
15482 -21 578 -2593 -9676 -10105 -15543 -10800 -1 -2983 2856 7757 3567 -1250 7747 13862 12423
15467 12423 17542 18360 9511 8880 7778 7222 14025 15052 8136 5726 11998 13147 17723 25795 33599
15452 33599 35068 26584 38274 62263 86070 115428 142780 173839 203941 226580 254723 288722
15440 288722 327562 352618 357655 358504 353571 353435 354871 348485 322073 284343 242945 206092 176924
15427 176924 150856 129229 107508 77564 56409 45433 36772 25637 21271 17875 16468 18500
15415 18500 16968 11190 7304 11202 14230 9391 7325 6104 2100 4308 2053 2245 6265 5706 4682
15400 4682 5932 9898 5258 2370 6205 9138 9320 -2221 -4946 -4022 -6058 -5161 -916 -2583 -6629
15385 -6629 -7821 -2510 -1138 -691 4244 11056 9777 5046 7248 -2571 -8191 -7231 -6172 -7492 -7452 -8541
15369 -8541 -9464 1871 6245 -1183 -11203 -10086 -11482 -14626 -8756 -10588 -13469 -8164 4467 2070
15355 2070 -1531 -5178 -4932 1387 1706 -1577 -6450 -5988 -2254 -2212 -5228 -11297 -19072 -17679 -11440 -15675
15339 -15675 -18310 -16336 -20740 -18854 -13738 -10690 -10853 -16811 -12286 -6988 -3065 -5092 -1936 -755 -1763
15324 -1763 -6070 -1285 7560 6655 1177 -2105 -4191 -10806 -8778 -4091 -9282 -9674 -9486 -5455 -7347
15309 -7347 -10289 -8411 -6318 -6678 -7170 -4677 -12286 -16951 -13570 -10208 -8525 -7591 -1628 -9726 -9567 -5940
15293 -5940 -2061 -4514 -6614 -7690 -9519 -11054 -7817 -1767 90 1358 2854 -3407 -11521 -9791 -8152
15278 -8152 -10822 -15842 -13994 -11126 -9128 -18603 -12589 -5142 -3955 -2554 1596 -1019 -6109 -13783 -8247
15263 -8247 -8745 -8496 -13875 -14410 -15232 -16985 -15317 -10773 -7468 -10069 -7324 -11743 -20665 -17582 -13733 -13594
15247 -13594 -12907 -15759 -10472 -4752 -6835 -5359 -3905 2086 -1294 291 3113 350 -4240 -9726 -13339
15232 -13339 -10203 -6872 -11014 -12201 -6545 -5677 -4168 -5840 -6689 -1042 -837 -10236 -9158 -7081 -13712
15217 -13712 -11950 -10612 -6372 -4277 -2616 1699 243 -393 -5285 -14313 -16735 -9543 -2132 -2793 375
15202 375 -2204 -11724 -13390 -13694 -12911 -4327 -9543 -17069 -22109 -28592 -26048 -18834 -14896 -18544 -17934 -14632
15186 -14632 -10700 -13655 -4900 -1750 -488 -2173 -6768 -5128 -6555 -10760 -15558 -21780 -13278 -10637
15172 -10637 -12466 -7146 -3933 -9088 -8109 -4840 -6477 -10501 -10292 -9884 -5989 -5156 -3775 -7817 -12471
15157 -12471 -13832 -14153 -13334 -10479 -16598 -19628 -14938 -7602 -5548 724 -2110 -1904 -5684 -2916 -1352
15142 -1352 922 -1109 -2583 2572 3386 -2781 -7072 -125 -2319 -4454 -5929 -11953 -14711 -21595 -28559
15127 -28559 -27269 -23672 -18340 -11234 -13563 -16962 -16665 -13244 -6357 -6487 -6325 -6242 -7932 -3080 -878 -2491
15111 -2491 1342 2062 448 -6983 -10326 -5724 -4031 -6054 -6685 -11571 -11918 -7987 -12898 -14366 -19957
15096 -19957 -15767 -11104 -7195 -6806 -6036 -1909 750 -3964 -9066 -7930 -2285 -2548 -3602 3943 3647
15081 3647 693 3930 -2491 2709 3327 4882 -2219 -4247 -8190 -18073 -18638 -4426 8064 12059 5424
15066 5424 -2187 -4774 -10259 -16073 -10897 -7128 -7114 -9046 -5536 -2512 -5739 -9110 -11779 -13541 -9250
15051 -9250 -8021 -7059 -10958 -15209 -15679 -4418 3372 8553 2533 -1428 -3140 -9652 -16681 -16811 -16520
15036 -16520 -9805 -3540 1203 -85 -8295 -11422 -12533 -11852 -11927 -9341 -7638 -12554 -11493 -12288 -6987
15021 -6987 -6482 -9467 -7508 -11622 -16370 -13638 -7628 -9448 -12053 -12212 -8784 -7497 -9293 -11211 -11724
15006 -11724 -10898 -9518 -10591 -6900 -8224 -9180 -6061 -9351 -11610 -7328 -936 1549 3523 -1597 -2513
14991 -2513 82 714 17 1029 5182 5450 -563 -3667 -3477 -7281 -8005 -10027 -14187 -11460 -5875 -7011
14975 -7011 -9779 -14540 -19831 -18291 -12069 -9854 -11041 -5501 -1113 -6064 -12352 -14614 -8867 -1949 -236
14960 -236 -3202 -5150 -11778 -15089 -11534 -11454 -13910 -12867 -10001 -8893 -6429 -10391 -7212 -6567 -5742 -4164
14944 -4164 -8685 -8978 -9968 -7963 -5187 -3731 -7118 -3891 -1757 -643 -1971 602 -2683 -9072 -6175
14929 -6175 -12302 -9127 -7240 -11791 -10016 -4392 1585 -125 -6769 -10833 -5527 -5884 -3848 179 2462
14914 2462 -6695 -15176 -16614 -15418 -18571 -20259 -12394 -10026 -7721 -7696 -1993 -4372 -9304 -8426 -7046
14899 -7046 -7574 -9058 -8692 -13062 -11378 -20088 -23763 -19057 -12889 -18363 -12951 -12481 -11808 -3378 -7928 -14384
14883 -14384 -14806 -5751 -6712 -5793 -3441 -1166 -5660 -12676 -16215 -16310 -12780 -11335 -6187 -5217 -7199 -6322
14867 -6322 -10899 -11358 -4429 -7759 -17398 -19262 -10197 -4782 -9509 -9441 -7362 -9204 -10148 -2620 -6429 -7745
14851 -7745 -6028 -3270 -4174 -6014 -8039 -13807 -11645 -10281 -14260 -16751 -17449 -15752 -14209 -10266 -8127
14836 -8127 -2883 -956 -11990 -13862 -15037 -11181 -8332 -12304 -11272 -12733 -12909 -8640 -6473 -4072 -2177
14821 -2177 -7255 -5344 -3894 -10754 -6984 -5417 -6024 -6004 -1174 198 -3158 -3571 -2855 -881 -2604 2253
14805 2253 3489 3503 1025 4344 1688 -2928 -6400 -9868 -9431 -5802 -5183 -3029 4548 11051 8251 -2580
14789 -2580 -3688 -6517 -5699 -5926 -7734 -8597 -5067 -4665 -12499 -6052 35 -9167 -10400 -10147 -9302 -8641
14773 -8641 -13122 -13071 -16520 -17279 -10231 -11571 -18153 -16678 -11062 -14531 -24280 -22207 -18063 -11227 -3414
14758 -3414 -4881 -8883 -13363 -13576 -6022 -3361 -4805 -5841 -3358 -9729 -16197 -17718 -11873 -14142 -11804
14743 -11804 -13067 -10835 -961 5690 6499 -605 -4027 -42 4009 4499 986 7015 9973 6677 5911
14728 5911 1085 -2232 -846 -3899 -10422 -13096 -17309 -10257 -8349 -8386 -1566 -2219 -3801 -8540 -11368
14713 -11368 -2855 4263 5173 -2000 -4867 -6025 -7765 -6765 -2122 -3799 -8219 -12230 -13062 -13120 -9521
14698 -9521 -2128 -116 -607 -4520 -5572 -4633 -1651 8119 8737 2708 -1681 -4341 -8270 -9554 -6943
14683 -6943 -4802 -1181 941 -5547 566 6716 5695 -1934 -318 922 -1923 -9104 -10705 -8062 -8378
14668 -8378 -6769 -4926 -8272 -9702 -9432 -11593 -10941 -4499 2019 -2463 -5831 791 -6460 -8133 -7468
14653 -7468 -8602 -5397 -3512 -6966 -7974 -18160 -22111 -15058 -12384 -15484 -13819 -8600 -6014 -2944
14639 -2944 -5307 -1066 4597 7760 1808 139 591 1924 3781 3026 2020 -1605 2066 2761 -11317
14624 -11317 -16589 -15053 -14215 -7657 -1874 -5730 -9038 -4754 697 -1685 -869 152 1094 -1551 -5913
14609 -5913 -9393 -9354 -4035 146 -8503 -15799 -18332 -16694 -15903 -10795 -13410 -14916 -11928 -12118 -10001 -7503
14593 -7503 -9669 -11012 -9198 -6747 -12368 -12863 -19830 -20889 -18058 -13267 -17358 -15511 -10316 -4540 110
14578 110 -138 -974 -2238 -6601 -5093 -4840 3003 5906 -3332 -7072 -2988 -7136 -8586 -7557 -6248 -6539
14562 -6539 -11382 -16444 -16620 -16885 -12380 -12342 -8805 -6595 -12614 -20469 -18765 -16821 -18347 -18222 -20503 -21772
14546 -21772 -15234 -10223 -6479 -6911 -11668 -9413 -4122 -4553 -7891 -7837 -2055 -2218 -9932 -5442 -938 -935
14530 -935 -7944 -9655 -11528 -16429 -12464 -12629 -14555 -17081 -13537 -7404 -10969 -6913 -586 875 -2125
14515 -2125 -5206 -1751 -2663 -4035 -7249 -15618 -18919 -19097 -19203 -20327 -18763 -14876 -14246 -5894 -2041 -6296
14499 -6296 -4133 2577 2703 4550 2449 -57 4290 1343 -73 -751 2323 7511 4194 3691 609
14484 609 2988 -4893 -7587 -9094 -8271 -9479 -10425 -11232 -9214 -7212 -2253 -6971 -12911 -6680 -3202 -6183
14468 -6183 -4173 -3383 -8350 -11803 -11301 -5815 -3671 -4240 -6945 -4194 -2764 -6239 -15326 -26383 -25162
14453 -25162 -25668 -27270 -22380 -17465 -10967 -3176 -4427 -12070 -10301 -6204 -6289 -7792 -1517 -1509 -1246 3548
14437 3548 5148 -5281 -15641 -10801 -9583 -6668 -3394 -4388 -6241 -9391 -15326 -16172 -13555 -4959 2309
14422 2309 4027 -542 -5595 -9090 -14590 -8455 -10604 -5535 -4391 -8208 -4392 -1671 -9411 -8238 -7930
14407 -7930 -8964 -6517 -1656 696 -661 -4529 -9356 -11626 -9914 -14355 -16212 -18567 -25475 -29780 -25786
14392 -25786 -10658 -2051 -8169 -5331 -3483 2282 1140 -6598 -12632 -7777 -10797 -12931 -18504 -15739
14378 -15739 -14657 -13635 -9930 -8412 -10383 -16609 -17053 -12182 -9614 -12224 -15062 -13042 -8326 -5601 -7357
14363 -7357 -2516 -4599 -11006 -17218 -14651 -13444 -11218 -5068 256 364 -5497 -118 3824 2446 5096
14348 5096 3087 -3661 -7728 366 548 516 1651 -5427 -8688 -6881 -6923 -12200 -13501 -13630 -13104 -14629
14332 -14629 -13591 -11876 -12845 -8996 -6092 -4930 -2390 -1282 -7562 -15157 -14005 -8865 -10162 -11327 -7827
14317 -7827 -3991 -4014 -5539 -2852 2569 -3886 -9007 -1461 5042 9799 6296 2176 -2682 -2937 -463
14302 -463 -700 1635 1450 -7737 -4343 -1268 -924 161 3980 5568 3261 814 -4962 -4536 -1562 -8682
14286 -8682 -12543 -12915 -14061 -10343 -15923 -21206 -20301 -15529 -11742 -13293 -18833 -22802 -21883 -14149 -9324
14271 -9324 -7238 -7566 -11867 -9554 -6102 -5599 -4756 -5430 -5716 -3128 -1883 -4253 810 3047 -3866 -2025
14255 -2025 -3162 -11264 -16942 -15610 -11142 -13146 -16913 -8269 -287 -10890 -18747 -24863 -19024 -17829
14241 -17829 -16722 -16478 -11172 -2333 7305 8921 3187 2498 4576 -3114 -8452 -10384 -12650 -14243 -16869
14226 -16869 -16112 -14441 -17133 -24397 -19808 -9028 -6761 -10248 -2332 2028 -1522 -8739 -15193 -21166
14212 -21166 -17901 -18486 -13109 -8076 -4115 -1826 -2623 -6344 -3012 -2117 -3709 -12018 -18819 -20339 -14787
14197 -14787 -14760 -12417 -12981 -5646 -242 -1532 -6589 -8823 -7656 -7963 -7864 -10601 -9897 -11329 -20282 -21406
14181 -21406 -16790 -10371 -1756 -3850 -10741 -18982 -20066 -15108 -5570 -12171 -17058 -14249 -15393 -13900
14167 -13900 -12509 -8706 -12224 -13826 -10775 -12146 -18674 -13212 -8073 -7730 -5328 -8473 -7001 -5336 -5388
14152 -5388 -9066 -9477 -3675 -1241 -3784 1112 6578 1992 887 -5109 -5475 -6916 -6750 -8957 -6391
14137 -6391 -5083 -4675 -5077 -4645 1232 6718 2691 -4347 -3894 -3804 -4643 -2115 -4304 -2441 -2524 -6011 -3651
14120 -3651 2210 -4142 -7399 -4282 -6033 -7602 -10390 -9885 -4756 -7308 -13491 -11570 -6169 -6401 -4273
14105 -4273 -6439 -7166 -7374 -3695 -2212 -8695 -11970 -5462 -5052 -7089 -4209 -2911 -9307 -7191 -8096 -8636
14089 -8636 -10975 -13015 -8335 -9345 -10375 -8504 -7986 -4121 1184 -3181 -5312 -7190 -3133 319 4737
14074 4737 950 -8137 -15908 -18384 -14128 -7277 -5327 -6291 -14626 -19455 -14104 -16487 -19533 -26356 -25266
14059 -25266 -14242 -5079 -2532 -6331 -10803 -7636 560 3635 -3691 -10756 -17068 -11440 -4067 -5494
14045 -5494 -1157 1513 1145 -1749 -340 -247 248 -5442 -4732 -12336 -6451 -538 -821 -6356 -8463 -2990
14029 -2990 885 1025 -4147 -7706 -7987 -10243 -8182 -12190 -19540 -20189 -15853 -10392 -10549 -13315 -12498 -9057
14013 -9057 -9210 -14973 -15015 -9157 -7041 -6262 -6972 -10258 -11087 -4861 -2006 -4388 -10796 -17785 -19760 -13093
13997 -13093 -10969 -7067 -796 2575 4010 262 -5830 -6943 -15695 -15744 -6471 -3581 -9543 -11638 -8847
13982 -8847 -15871 -19017 -17226 -15349 -10471 -6198 -8137 -13213 -16445 -20852 -12312 -1990 -4017 -10840
13968 -10840 -15486 -14233 -7018 -6957 -8430 -6431 -11651 -12049 -5812 -6789 -10760 -16033 -14072 -7742 -8478 -11678
13952 -11678 -10195 -8134 -14082 -11009 -4190 -10829 -15901 -10003 -12222 -11543 -12685 -8344 -3640 -2735 -5069
13937 -5069 -2089 935 -4472 -5759 -4471 -6797 -8051 -3834 5192 12358 11044 10082 7410 13537 26404
13922 26404 34202 44039 41652 34317 23978 16005 14070 15103 11482 6030 2539 7295 6053 3668
13908 3668 5320 6694 4033 7419 3165 -9455 -8129 -1729 2811 3112 127 2452 1707 1515 -3849
13893 -3849 -6786 -13148 -20991 -22326 -9767 -6229 -11579 -17122 -17544 -12839 -8801 -15626 -12571 -13214 -13265
13878 -13265 -8921 -6098 4124 13052 7413 4542 6505 3430 157 -4255 -121 -3289 645 -1957
13864 -1957 -7368 -9624 -13675 -4966 286 1742 -715 -2951 -817 -5941 -11315 -15262 -13632 -15553 -12665
13849 -12665 -7619 -5103 1483 7125 11659 5626 -8811 -8536 -3413 -1108 -3860 -2259 -7112 -12085
13835 -12085 -9609 -10144 -8117 -2588 -2361 -5571 -3291 -1562 -9152 -11288 -7593 -8976 -14336 -18048 -17022
13820 -17022 -10742 -5802 -4771 955 895 -8642 -12043 -6652 -6954 -13523 -20053 -27914 -26751 -15042 -7318
13805 -7318 -10044 -15096 -14020 -13108 -7185 -5302 -10756 -14493 -9984 -1888 -1333 -6800 698 2068 -2964
13790 -2964 -7819 -4069 -1901 -990 -7587 -9570 -8861 -8420 -8873 -5251 -4189 -5590 -680 -2742 -6654 -6558
13774 -6558 -10345 -12962 -8404 -4053 -5475 -1244 -7790 -14059 -12942 -12758 -12777 -8865 -6110 -4375 -2027
13759 -2027 -4556 -7847 -8175 -3540 718 93 -4188 -6743 -9570 -5313 -4948 -4059 -7276 -8415 -5551 -6466
13743 -6466 -11285 -9035 -11335 -10812 -11532 -16970 -12039 567 10664 8374 7124 3428 -1012 -5704 -2660
13728 -2660 -289 310 2666 11767 7112 6652 2769 4571 -666 -3996 -2003 -3778 -11441 -13336 -11061
13713 -11061 -10407 -4313 -253 4636 6508 -424 -4841 -10981 -9082 -11889 -9131 -4110 2077 -917 -700
13698 -700 2609 3273 -3161 -2090 5423 4048 -796 5019 2795 -3646 -2889 -4423 -7635 -7116 -4601 -4216
13682 -4216 2961 4565 -658 1012 12319 8765 4446 12473 6594 4896 1981 6032 6042 8275 6847
13667 6847 7080 14266 12624 10727 5272 10960 21706 17757 11138 12493 3316 -1119 2259 6902 9493
13652 9493 9629 3263 1461 5155 13492 13939 17255 20540 19321 9817 4337 6005 10769 14676 14790
13637 14790 10969 14388 18922 19984 19940 16862 16392 13973 14333 15015 3900 -1385 -4286 -1862 -883 2249
13621 2249 11665 13082 17208 20313 22288 22354 12669 11455 19087 19011 25034 28102 21163 14431 10764 9485
13605 9485 5546 13615 15668 17668 17245 21083 25724 17011 14981 11864 8882 11360 20159 21543 23733
13590 23733 19523 15010 11689 9100 9173 5243 3576 8782 8561 10477 12403 8372 5689 6029 10669
13575 10669 16180 19700 20916 10063 13616 13519 15831 11595 7892 8439 9820 10725 7244 6232 -4712
13560 -4712 -9573 -2683 -2187 -5285 -8829 -2704 38 161 5982 13918 9720 6398 6185 8246 6426
13545 6426 6497 4231 3750 750 -2744 -5726 -635 -3676 -8888 -6439 -1395 -4001 -136 4854 3335
13530 3335 5922 4413 6460 9941 8003 2759 6984 5755 4780 4466 4766 8280 9318 6519 6170 11337
13514 11337 17531 25244 19080 16060 13987 7567 -958 -4844 -8206 -4924 -3249 -4610 -2206 -2058 -4259
13499 -4259 -8130 -6904 -4246 4480 6611 3753 4558 1860 547 -3783 -10029 -14689 -11760 -18296 -21105
13484 -21105 -15883 -10737 -8942 -7698 -10689 -5824 -9870 -12869 -10672 -13447 -14235 -11524 -5013 1588 6011
13469 6011 7055 6179 2108 -3482 44 3492 852 5606 3726 -3182 -10497 -11374 -6000 -4430 -7562
13454 -7562 -5704 -7018 -9776 -3384 3117 -722 1300 -2027 -4576 -845 740 -2619 4882 -120 -3919
13439 -3919 1640 -2087 -5183 -3220 -7456 -20400 -17517 -12981 -10573 -5437 -1097 -2465 4937 4545 2069
13424 2069 1378 -6565 -5677 -2271 -4904 -965 5551 12543 12590 7625 7035 8481 4451 -2761 -5406 -3962
13408 -3962 -6237 -6295 -3515 -3460 -2741 -8235 -4225 4690 917 -3361 -11994 -12823 -17107 -6289 -1482 -3299
13392 -3299 -4894 -1726 -3969 -1158 -1414 -9468 -13815 -12590 -11883 -10109 -8901 -12084 -9867 -14487 -11959
13377 -11959 -10719 -12393 -14672 -10687 -10082 -10408 -8052 -3498 -3860 -4549 921 12842 18273 13046 17522
13362 17522 13477 9218 -430 2213 7952 8927 6354 -7347 -15165 -7666 2880 5046 2800 2210
13348 2210 1282 -5143 -9607 -10320 -5476 5954 -514 -229 -165 -4437 -5776 -7451 -5815 -4906 -16027 -21197
13332 -21197 -14266 -16013 -14871 -16735 -9435 -3132 -2654 1900 14198 18190 9114 3108 -1522 -73
13318 -73 2627 3933 1408 -177 1754 3151 2492 280 -132 -957 2481 404 -5631 -7599 1854 2505
13302 2505 254 -8498 -16547 -14665 -11196 -8268 -6133 -11121 -6132 4359 6504 6032 3605 3189 4305
13287 4305 -613 -9981 -7488 -8192 -8356 -3776 4171 8818 18311 18429 12298 7583 -1902 -1568 -5221 -4304
13271 -4304 2014 6352 -2089 -8756 -8593 -7238 -11654 -14126 -14197 -18307 -10673 -802 780 -1860 -2032 -3744
13255 -3744 -2975 -5242 -10146 -9895 -7634 -7937 -7966 -6531 -7317 -4487 1957 -5887 -6690 -1365 3188 2943 4414
13238 4414 1031 -5612 -13121 -8759 -9778 -12574 -10336 -7577 -3510 -1213 -5341 -6484 -6325 -9201 -15507
13223 -15507 -21068 -11091 -1379 411 -6733 -8926 -11476 -9472 -8793 -7989 -7360 -6635 -5622 -2781 242
13208 242 3968 5769 8908 9130 4386 -5192 -2325 7885 8513 -4906 -11949 -9693 -2366 -2488 -5267
13193 -5267 -1359 -9 5108 9781 2837 4408 2471 3134 296 3477 6961 6242 533 -1828 -1879 -1286
13177 -1286 1886 1407 -953 -4903 -4190 -4782 -2494 751 3269 3285 -3475 -6307 -8823 -6609 -1833 2099
13161 2099 -2398 -4696 199 3795 -257 566 1037 2897 8981 12764 10092 1741 441 -3488 1243
13146 1243 7676 1346 -6976 -3069 -1006 2354 7821 6607 -324 -6670 -8278 -602 -3235 -5642 -1591
13131 -1591 -5615 -12590 -8214 -5031 -1939 2644 4614 -1795 -6414 532 -5047 -6177 -6820 -10777 -10406
13116 -10406 -7848 -2064 -1194 -4013 -1869 -2122 -6403 -858 2514 5839 10486 8469 210 3223 3292
13101 3292 670 -1213 -5925 -10890 -8579 -6897 -7013 -5294 -1551 1081 2018 -968 475 4504 -13
13086 -13 -2675 880 1730 -3232 -941 8399 12126 5525 4398 9318 6020 173 -863 -1451 5931 9309
13070 9309 8222 9173 8097 4740 4912 4317 -572 -1994 1182 -855 3925 5592 5423 3644 2796 9763
13054 9763 11354 10314 14249 14405 8796 8962 5062 319 -3339 -984 3361 4403 5835 5530 16626
13039 16626 18648 18136 17157 16779 10114 7777 13239 18290 14512 10646 12622 13671 11213 14910 20147
13024 20147 19618 12034 4867 -1763 -9002 -9592 -5119 4802 2481 -3937 -4911 -1255 3742 9580 14180
13009 14180 11075 16103 15752 20340 20595 10897 8869 10229 12695 14462 17721 17388 20675 18061 32460
12994 32460 47251 50909 48772 42972 40885 38839 44783 49867 46365 40439 37661 32415 32005 32156 32014
12979 32014 44117 51577 53716 59253 67605 77753 86099 87953 101428 116503 138325 177968 222473
12966 222473 278964 352943 448004 582739 741433 923338 1093113 1202022 1210657 1108408
12956 1108408 930486 730458 545974 405871 313579 251329 208809 178894 155234 139977
12946 139977 122790 105931 101038 96793 95914 88209 81944 75929 61633 49893 37873 31507 32784
12933 32784 32783 33834 32976 25099 21228 12906 14153 18008 19717 15984 20935 25395 21053 17176 20135
12918 20135 26905 30927 32972 33389 24731 20566 21814 21115 17407 14772 16171 12600 4424 3486 4657
12903 4657 6257 9383 6735 6807 9936 14975 18351 12529 8995 10593 16175 12891 10731 5476 3449
12888 3449 3304 8308 5455 3121 3200 2651 5547 -478 -2951 -3875 -703 -1277 -2033 -407 6120 7225
12872 7225 -1385 -4758 785 1235 387 -3845 -2894 -3612 -2785 -3318 -935 -306 598 -2993 -6549 -12539 -14255
12855 -14255 -15659 -20469 -20178 -26167 -35035 -34148 -35390 -36254 -47486 -62546 -84709 -112687 -133346 -153127
12841 -153127 -180327 -188433 -179854 -161340 -129853 -81420 -41591 -19062 -6557 8094 21973 29736
12829 29736 37799 42404 48193 54732 57394 49516 46168 36828 30455 30407 27865 28792 25149 27161 31140
12814 31140 30421 25913 34716 36447 40396 43150 41482 38392 33108 34678 35957 40071 45845 53095 57664
12799 57664 56709 60823 66635 68542 77117 85720 105156 125005 145262 164532 186574 199768 215570
12786 215570 234323 241932 242286 236599 211767 186347 156720 133210 119214 110394 96385 80937
12774 80937 73140 68792 60437 48952 49637 44519 43301 45252 46614 50398 49449 51260 53050 51783 54887
12759 54887 55027 51272 43200 42714 42112 44137 40897 34445 38021 47003 49571 50885 51291 54438 57743
12744 57743 61785 65066 64133 61509 60274 60779 60772 57667 42983 35096 32114 28058 16594 3529 3154
12729 3154 6960 19144 29752 40517 53215 58176 62470 71455 79184 85747 88669 80878 68037
12716 68037 48974 48932 52062 49804 54116 60377 67906 71696 71299 64211 60606 55338 56397 57555 58444
12701 58444 59070 56582 51837 49311 48064 45542 43997 55601 65867 75160 76944 76115 80867 87012
12687 87012 99090 113541 133571 157734 168694 163180 153350 149019 138093 127862 128352 128751 130445
12674 130445 134104 139151 148866 163774 170721 175837 187389 194613 203352 218222 232286 251432 269302
12661 269302 295042 333930 372024 403064 424896 426995 397727 357096 319751 290976 275016 255229
12649 255229 246315 231147 224521 225436 220003 219589 225596 227683 231923 240266 248405 251141 259710 271871
12635 271871 278068 274908 271362 274085 269152 263217 257491 251314 252399 260089 265121 272494 281609 286408
12621 286408 292041 292797 290333 294402 305929 317271 332612 337046 343455 352501 358230 360710 371357
12608 371357 381347 392451 403675 410689 415213 430786 453348 465157 476851 489197 506852 519034
12596 519034 534337 547422 564080 574773 585035 598018 609001 614614 627540 641816 662423 684369
12584 684369 715225 748850 776724 804731 839555 879438 915386 949265 982544 1025620 1074177
12573 1074177 1131866 1186414 1244527 1319256 1410705 1507082 1601301 1703801 1816445 1927550 2035681
12562 2035681 2147351 2265275 2399324 2557639 2751455 2982898 3273633 3614370 4022848
12553 4022848 4528643 5155359 5920065 6854933 7959937 9208598 10551506 11978239 13593808
12544 13593808 15634486 18464218 22550144 28377291 36393764 47037995 60813815 78518832
12536 78518832 101300589 130054855 163712686 197274808 222083102 229702219 216637983
12529 216637983 186296434 147517517 110212202 80560888 59725522 46004767 37094055
12522 37094055 31138939 26895116 23640776 21022954 18893933 17171497 15754247 14520421
12514 14520421 13349832 12187029 11017164 9891423 8888673 8022528 7286410 6667728
12506 6667728 6144969 5689428 5296628 4943626 4618419 4318608 4056075 3818832 3614755
12497 3614755 3440658 3291526 3167029 3050968 2933082 2822789 2721587 2631372 2534446 2431306
12487 2431306 2329104 2236208 2148479 2072949 2004837 1931318 1855715 1790871 1733435 1675800 1620771
12476 1620771 1563165 1500570 1435920 1374361 1317530 1259911 1215322 1179193 1143370 1110212 1077125
12465 1077125 1045815 1008346 975008 950708 916287 889332 856810 823094 792132 774401 752249
12454 752249 728537 716668 701263 682624 670080 659024 656982 645559 630158 612875 595793 577131
12442 577131 558261 546328 531927 507172 484163 465269 444819 433114 416174 401021 384380
12431 384380 366434 353991 337583 329008 324795 319889 315641 314685 313573 314699 314149 312165 297741 289263
12417 289263 281989 281968 285480 297154 306429 307063 309137 318197 336838 355800 377120 396959 419422
12404 419422 426328 410640 381582 338048 300854 272176 240886 215624 202588 198939 192683 176566
12392 176566 158723 157911 158945 155121 160091 154737 145511 135923 124432 109529 96355 88056 84766
12379 84766 97605 104131 109292 124414 138716 141911 146569 148401 148584 147523 150973 153885 152961 146735
12365 146735 143185 139497 120667 113900 108656 107473 104769 94754 94059 97668 102272 103607 114664 116234
12351 116234 111873 110726 113584 115003 106324 97843 93791 80942 69135 68725 69951 67761 65707 66416
12337 66416 66282 72712 76618 80195 89316 95830 95463 98408 97909 88622 81102 76333 59699 45961 42024
12322 42024 37193 35810 37960 30963 34853 46191 47718 45542 47277 50918 52128 49762 49500 49043 59089
12307 59089 55709 44541 40157 38958 27271 25050 27245 23547 31889 37610 40337 42423 46355 40429
12293 40429 37824 37941 38126 30211 27299 21656 17794 22301 22785 22612 29288 41522 53027 61373 69630
12278 69630 70223 67817 67664 68681 67157 54714 40747 37126 28062 22827 26517 22214 19553 19792 11512
12263 11512 9366 14339 14729 16382 25486 24595 23554 18908 9787 7003 9395 12086 15667 16722 7637
12248 7637 11174 18573 14057 19168 17076 4868 493 -3075 -672 -1539 -2527 -1864 1332 -4731 -2744
12233 -2744 6760 14659 26168 35758 52922 73492 100272 135069 166789 201147 222322 223741 212352
12220 212352 190763 159392 137587 122617 107788 92703 75692 72513 70476 61411 59758 56792
12208 56792 49573 42619 44710 49321 51605 51506 46973 41736 38349 33223 37480 37768 36724 32778 32291
12193 32291 36867 40498 38784 34084 34128 40878 41527 43256 48159 49821 56392 66276 65289 61165 62705
12178 62705 58971 61567 69417 69286 72571 78990 80938 75876 73747 75930 68970 58981 56972 54245 47571
12163 47571 46915 42249 35666 31480 34998 32653 31195 29165 25454 24999 28588 25578 15225 8632 20779
12148 20779 20133 12969 8961 16777 19100 23381 24824 28050 24287 14217 11474 4464 -542 2841
12134 2841 13513 20817 23655 20413 17026 16287 19246 25595 36999 45912 41006 36693 31259 29665
12120 29665 33640 38336 37818 40265 42963 48676 57824 71449 86834 107275 114969 118344 142122 175810
12106 175810 222525 286354 364904 474934 612750 786231 965264 1132039 1230407 1226197 1117758
12095 1117758 929599 722967 534957 387827 287405 223181 175583 155774 142318 126812
12085 126812 111460 99099 100193 98734 85884 87867 93575 85861 71482 59408 61143 68050 72510
12072 72510 80812 101401 127222 156423 197294 248413 316343 403781 521350 649939 802809
12061 802809 970439 1109902 1204522 1228650 1170953 1042305 872230 695353 539331 411436
12051 411436 320756 261804 218232 186829 160464 142046 136880 131242 122944 109792 96127 77700
12039 77700 67239 69035 69560 62467 64499 60489 53831 47875 42769 40693 39263 37313 38450 29413
12025 29413 24369 27467 26251 23940 24615 24449 23094 18150 20234 21221 20411 27094 34842 24157 11689
12010 11689 11645 14500 17636 26195 27656 31567 30812 30851 27707 24357 20059 21395 17211 9636 9853 15483
11994 15483 14744 13673 12647 16179 16583 11724 17790 21044 19477 21746 14499 5492 -2631 931 7779
11979 7779 3628 -2454 -5622 955 7285 10121 12769 13933 13705 12303 9886 7523 7386 7797 6681
11964 6681 7829 7879 14451 19300 16915 18649 15341 12709 17158 11355 8287 25029 34271 40449 40970
11949 40970 36392 31062 17376 13210 4349 1214 1215 6492 12872 16238 6564 -2013 1306 1159 3214
11934 3214 10379 7006 6363 7804 5662 5181 9035 -1025 -4593 2270 4850 3043 -1425 -1588 -9744
11919 -9744 -10623 -8294 -4615 1567 3566 1034 6658 7713 9155 8638 3224 -3078 1289 3368 8953
11904 8953 15777 14851 6916 -7470 -10736 -8166 -12021 -13094 -7746 1276 8371 11170 14057 13735 10953
11889 10953 11042 10273 14560 13896 4751 -5180 -9592 -7831 -5160 -3760 -3573 -773 1335 2607 3172 10363
11873 10363 10710 11148 9387 8618 5184 6751 7152 7081 3679 2324 -4340 -1679 1319 1195 -1150 1819
11857 1819 -5055 -9136 -9234 -2438 6624 6831 13179 16449 15117 12688 13144 13154 13855 9107 11578 16001
11841 16001 17763 16533 11228 7705 9549 7258 11920 11624 8786 10553 12219 10962 8862 4728 10140
11826 10140 11330 5500 973 -2173 -2007 658 2149 5596 6198 5165 -1599 -7469 1328 3656 1486
11811 1486 4106 1049 310 4430 9676 17553 16334 8711 4391 5573 9462 7412 3223 2103 -104
11796 -104 -2589 -4706 -579 -1375 4575 7764 2623 -836 2388 8473 8195 8957 7236 10028 1154 -8000
11780 -8000 -8941 -7386 3054 5541 -4014 -6549 -4621 -3131 -4868 -2126 -2760 -9030 -8818 -6326 -9890
11765 -9890 -6062 -5348 -5216 -1410 10903 9189 2788 -3376 -8343 -8711 -1044 3255 -242 -2759 -71
11750 -71 -488 -4833 -7409 -11525 -9167 -9536 -8433 -2056 2536 7763 7855 -280 -8620 -8998 6877 12478
11734 12478 6642 2942 -331 2649 362 -5502 -6153 -1700 3824 6012 5326 4108 2362 3442 1531
11719 1531 -2682 -5868 -2899 -469 1457 2458 4016 5109 3691 2704 3282 -912 -123 3023 -3677
11704 -3677 -3604 -2950 -2551 -2998 1294 856 -1305 -7446 -4698 -5460 -4160 -1947 2777 71 -3415 -5900
11688 -5900 -8126 -357 3059 3207 2120 -4187 -4694 786 6104 6617 14168 9781 2158 -990 3275
11673 3275 6877 11095 12602 7265 12228 22352 21132 15766 16387 11049 10252 13801 18889 10089 -1752
11658 -1752 -6990 -6973 -4015 -1023 4615 3629 768 -6250 -3402 5772 3812 3992 7063 1463 -1936 -2336
11642 -2336 982 6539 9038 7084 5528 1868 1626 -5490 -97 2233 705 8400 16026 15330 17070
11627 17070 17338 12086 9072 -474 -6334 -2403 -466 40 5074 -1191 -3799 -5594 -7534 -9883 -4170
11612 -4170 4748 11634 10323 13519 10529 7125 5306 -658 245 -7438 -7048 -7056 -3389 -2003 -5650 -3975
11596 -3975 4305 6720 8917 10291 10846 15978 23978 19130 15485 13172 -2945 683 1415 -1435 -5644
11581 -5644 -2900 2825 -4799 -6685 -1102 3063 3975 -4117 -5640 -4374 -505 6395 9657 9926 3520
11566 3520 -4514 -5586 -5382 -2379 936 3666 -137 -2678 -6247 -1625 3337 6719 2618 -994 8560
11551 8560 15339 15417 13626 10725 10177 9712 5050 101 3042 9769 7362 5305 4796 4541 4587 4215 6306
11534 6306 2695 -8214 -8765 -3675 -3567 -1197 -7168 -6938 -6472 -5039 -1577 -5438 -6262 -3674 -4725 -7926
11518 -7926 -8785 -10655 -11797 -13751 -18004 -9752 -2609 2420 9430 10280 4211 -1644 -3637 -9184 -11212
11503 -11212 -9124 -8892 -9064 -6518 -1635 -1714 1107 2696 2306 2480 6388 3805 5580 7965 820 -1123
11487 -1123 -2428 -2128 4667 5198 2301 868 -2408 -3788 -2504 -5568 -4374 -4506 -5515 -9764 -8482
11472 -8482 -8245 -4929 -8150 -17389 -18869 -6626 -580 -6505 -6340 -9194 2159 2704 -6936 -757 3950
11457 3950 -4235 -10665 -14237 -13600 -11359 -9042 802 912 5862 10825 13243 6233 -2643 -7903 -429
11442 -429 4298 -2976 -8596 -11011 -10805 -9517 983 8116 4870 -480 1676 1750 -604 -3837 -6843
11427 -6843 -8659 -8244 -4967 948 799 2437 4438 3119 98 -5536 -4069 -3592 -7429 -4738 7861
11412 7861 13612 4921 -3855 -5063 -4329 -2278 2295 1334 -2673 -9259 -2614 12372 14076 -330 -3173
11397 -3173 -6477 -12886 -12678 -9979 -6698 -10836 -383 5545 13071 11840 6010 1556 2529 -508 -225
11382 -225 -75 -1149 -1581 -1752 1296 -673 2861 11194 11329 5273 11341 15186 11537 10604 13807 17496
11366 17496 13987 7112 6695 6006 10009 8876 922 -969 7020 11547 9886 9976 13579 11435 8474
11351 8474 4061 3475 8553 7918 9109 11962 7885 4904 7804 3297 1792 471 1779 5970 5392
11336 5392 1644 2739 -3235 -6020 -5723 -2647 -3953 -11240 -10002 863 -3391 -699 3411 2339 1403
11321 1403 6942 1846 4175 12252 19571 18447 13129 10502 7343 3198 6546 12234 21248 21316 13099
11306 13099 6255 2088 6203 7125 1838 12754 20219 24593 24317 24441 24805 27795 37886 49259 64748
11291 64748 91096 124469 158687 173922 157011 117668 83073 63059 47026 36754 29506 29885
11279 29885 20454 20362 30390 33365 32170 31950 34329 38859 32059 23712 20345 21853 29179 46912 53978
11264 53978 63411 68844 80802 92661 105973 127861 161891 197816 210284 198670 166482 143148
11252 143148 141048 146524 160515 189528 231621 288784 361242 462218 595618 773497 1013921
11241 1013921 1308529 1571558 1691610 1675638 1573156 1352074 1028490 727426 520334 385571
11231 385571 297099 240142 211687 191777 173775 160006 148639 139329 129151 114574 98141 86553
11219 86553 79646 70324 61746 65450 67054 59785 52929 46728 38433 30603 36745 42443 40898 34857
11205 34857 32634 35760 41292 38278 37375 40857 53358 49806 42015 37629 39116 37274 38337 40004
11191 40004 34932 35436 29882 34557 35339 34327 30030 30624 36208 37403 36826 36384 29476 25292 27169 25627
11175 25627 30444 36262 34038 34292 31857 31451 37128 39862 47421 44800 35148 28698 26587 28775 35105
11160 35105 42131 40303 36035 37477 37933 41384 37156 35823 39099 38638 39132 49136 56460 56774 52325
11145 52325 47782 43425 47025 53315 54604 54350 58121 57609 56202 62246 63531 67426 69759 84844 95463
11130 95463 105101 118176 134375 158644 188154 226643 281713 352127 445626 574496 747221
11119 747221 984051 1253225 1471525 1540946 1502133 1469002 1422147 1253960 967862 694631
11109 694631 497242 372418 291799 245418 215228 190808 174347 153652 137316 120932 116586
11098 116586 117086 112198 109092 103673 91278 86335 81531 78776 77813 73446 72839 65618 56136 52594 55212
11083 55212 59687 59142 57953 55070 49296 48194 48278 49536 46895 47988 52282 50271 42764 45569 49233
11068 49233 49743 58189 53128 47704 51159 52012 45441 38965 39064 39324 34494 32279 30698 37092 45158 46379
11052 46379 41028 39670 35461 43915 50903 41634 35535 33708 30681 27352 32926 33381 31787 34556 35028
11037 35028 33521 26390 23901 17740 17149 23453 29306 26766 30967 26879 25567 29481 33470 33868 39642
11022 39642 46026 49754 45467 39841 29796 25507 25682 30303 34357 39850 41241 39994 27098 22836
11008 22836 28172 30018 23026 17013 22068 16573 15551 19511 19097 23259 26182 25904 28295 25525 25350
10993 25350 30885 34527 28588 31593 41717 46045 42009 27815 21295 19818 28829 33508 32116 29780
10979 29780 24419 22863 21536 29779 31159 31656 32679 27768 29483 24967 22311 21690 19191 20593 26018
10964 26018 28441 29886 25980 30955 29598 37199 47368 43447 46580 56370 59900 48772 37527 37996
10950 37996 37600 31757 24388 21746 25792 22887 24338 23470 23913 26887 22393 19497 19322 23976 21025
10935 21025 13511 19559 26322 29387 30322 36562 41646 44993 43230 40738 34493 31913 26574 15656
10921 15656 19559 23723 29550 40232 47656 51686 49188 46321 46271 56329 71305 82421 87100 90709
10907 90709 98154 96455 83424 76847 75210 70771 63076 64511 63685 60760 65243 67714 69969 70566 76905
10892 76905 79010 79889 81489 79685 83461 87416 85007 88349 90031 101687 125120 151394 189176 234562
10878 234562 290303 373656 478945 621079 795155 1015236 1315900 1689335 2057338 2234101
10868 2234101 2066546 1649859 1208918 864514 637529 490927 386148 322959 274171 239418
10858 239418 211075 182713 161777 148083 139400 131756 128180 122169 111448 105514 99963 92382 82335
10845 82335 76395 76654 75470 71095 73513 69012 61302 57062 55334 56355 50903 45894 49051 50465 51579
10830 51579 55381 57301 62466 72269 87532 100507 95196 94317 90808 89450 95413 96162 90951 86096
10816 86096 82872 77814 63012 54525 50883 53935 57329 55250 48565 48473 54928 55240 58128 61798 59336
10801 59336 61281 65029 65957 62044 60700 58112 54523 54901 60051 62921 72154 79010 80203 88867 94539
10786 94539 96512 103639 125156 148994 178452 223235 280471 350341 437795 558767 726653 947737
10774 947737 1203282 1421688 1497064 1421441 1323834 1303178 1348248 1347092 1186432 902685 622730
10763 622730 401382 237612 125915 31574 -49963 -105867 -127112 -97573 -35361 24085 69868
10752 69868 98177 120671 132766 134334 131584 125760 125473 133210 134051 130619 124528 121615 111036 107207
10738 107207 98602 92387 81677 78995 81676 83284 87646 88609 92665 99356 100075 101999 105875 109090
10724 109090 104565 90949 86647 88142 90576 92810 94637 93672 87689 93846 107015 121971 139936
10711 139936 160900 189274 224422 260443 296541 330646 356072 376512 396900 424353 420779 370191
10699 370191 301537 243086 213138 197735 180693 161051 139791 122546 104187 91073 85085 86809
10687 86809 80886 70802 51406 45494 46016 45534 37495 31264 17255 -501 -26545 -60869 -99489
10674 -99489 -137935 -167383 -169246 -146926 -124612 -109993 -95108 -68242 -16810 41106 86183 111204
10662 111204 124993 142290 163282 181723 184035 181508 178756 169632 158110 142567 125552 107026
10650 107026 101898 98453 96716 99958 103471 111965 129725 152950 171371 171438 172295 180135 193216 199060
10636 199060 191169 164806 146356 143901 149847 160788 176834 192356 209011 224954 241293 260863
10624 260863 278506 297983 319423 344499 371234 392413 411013 426810 423848 407758 391634 382871
10612 382871 388960 378488 351039 319601 289545 271475 269359 277030 301005 338926 368091 373637
10600 373637 360240 347983 334075 315295 302705 294937 293769 301187 307570 312972 328602 342349
10588 342349 355420 361307 362257 374059 391260 406952 428966 457225 493389 535723 602081 682742
10576 682742 768751 831647 828273 773853 687445 605788 544857 503003 472853 451694 436226 429476
10564 429476 426262 416211 409748 396781 398102 417411 437745 457279 473792 499776 522969 538341
10552 538341 546190 540172 525924 517217 509605 502888 502686 496910 487929 491505 511097 531094 540911 540602
10538 540602 539137 542541 559577 578106 597546 616752 625469 633192 634238 649346 671919 686488
10526 686488 698956 717279 745135 767279 783089 804974 841616 887529 925675 950764 978922
10515 978922 1013873 1044711 1068745 1105579 1142842 1166434 1182695 1189980 1197596 1205383 1215877 1246053
10503 1246053 1293867 1353461 1422151 1486789 1551473 1621037 1699664 1773135 1852807 1939629 2044144
10492 2044144 2166811 2296613 2417409 2524204 2629839 2751847 2897429 3060562 3212416
10483 3212416 3347924 3483523 3623214 3767308 3920720 4104836 4353818 4667655 5040989
10474 5040989 5486181 5996640 6615403 7389644 8340444 9468638 10699463 11888701 12968615
10465 12968615 14151295 15743920 17925443 20903830 24964741 30595043 38683731 50407392
10457 50407392 66669763 87661773 113530713 145767332 187640113 242982256 310339789
10450 310339789 373112073 399455606 365410548 288744950 209207244 147762077 105962283
10443 105962283 78936752 61649942 50486650 43023731 37626798 33311386 29629610
10436 29629610 26470700 23830007 21705440 20075394 18813241 17702138 16500343 15123905
10428 15123905 13725911 12480860 11438244 10559385 9813853 9162202 8599097 8102331 7646202
10419 7646202 7226269 6842593 6507312 6222265 5993988 5820175 5680090 5558191 5445386
10410 5445386 5348972 5254525 5161299 5065379 4974879 4891907 4824398 4785038 4765322 4756492 4758218 4777365
10398 4777365 4818293 4869193 4922092 4997774 5089766 5208676 5364597 5553743 5786701 6093523
10388 6093523 6502362 7024664 7568438 8020363 8397902 8883167 9616077 10622111 11805484
10379 11805484 13101477 14656054 16786832 19812102 24112109 30163336 38502911 49560514
10371 49560514 63669457 81644958 105366707 137586918 179759964 226572739 262428132
10364 262428132 270289421 254274687 239507212 240975249 251885958 251089726 221556957
10357 221556957 172912466 126869011 92812789 69830197 54653592 44580577 37828215
10350 37828215 33135826 29550441 26454441 23676881 21267727 19291926 17751776 16554010
10342 16554010 15524629 14478044 13407838 12459809 11707155 11083409 10444034 9682238 8859821
10333 8859821 8134778 7543426 7068456 6676906 6334927 6035971 5798287 5609362 5452935
10324 5452935 5310267 5164863 5022635 4856913 4648784 4415436 4186484 3978479 3805848
10315 3805848 3651690 3508050 3366843 3243244 3130823 3026051 2928752 2835220 2741330 2640096
10305 2640096 2546846 2459398 2373430 2272399 2172763 2073125 1984888 1913260 1859376 1823200 1805999
10294 1805999 1798811 1780988 1747062 1703160 1653433 1608470 1565407 1523255 1480902 1448286 1427583
10283 1427583 1410532 1380722 1333718 1291716 1262226 1233871 1208245 1179303 1148249 1118263 1085252
10272 1085252 1059721 1041199 1022865 1005215 977666 944908 911677 880530 851278 811526 768890
10261 768890 725418 699701 690114 693105 698783 708469 709742 703473 712151 713720 706175 706324 702436 694670
10247 694670 686125 666636 639092 620873 611001 622414 647240 677375 702758 719793 747218 751110
10235 751110 738342 713119 685420 668451 643462 602245 557127 516896 484882 460008 433476
10224 433476 413811 395683 375759 362429 351008 348366 342062 335209 323964 319307 313816 300899
10212 300899 291392 290440 289134 285640 281867 276437 278012 288007 313218 332389 343408 359330 380254
10199 380254 390697 388674 378961 376388 379954 374778 362025 344136 324363 308218 301749 307292 315118
10186 315118 325025 333612 325235 310513 309495 305823 294361 282760 269255 260393 270942 274734 263280
10173 263280 255426 258606 271746 290384 315084 332872 351248 374050 395049 418061 441657 471282
10161 471282 514635 581896 696098 848375 1051906 1322847 1674783 2136660 2748887 3486720
10151 3486720 4171360 4554934 4422131 3800426 2994279 2257716 1722976 1392832 1211693
10142 1211693 1119830 1060443 983442 883363 782836 690576 614166 550243 503531 464405 436013
10131 436013 411102 384808 362393 347443 326831 301025 278950 260449 253961 246089 241777 229003
10119 229003 215115 211405 210999 215274 222112 227592 226396 214578 218028 222664 227087 225305 213190 204250
10105 204250 209972 207509 200174 191519 180094 178338 184630 192125 190885 179391 171244 172770 176230 174514
10091 174514 169124 159554 153836 151746 145726 140208 134989 130075 122895 114710 120390 129336 130706 121879
10077 121879 115507 112471 113963 119378 117822 110111 102701 93674 84812 80194 76791 75832 81530 94284
10063 94284 114758 134026 157573 189483 226659 263338 303635 325933 332643 337823 340300 354090
10051 354090 366538 354247 315673 279765 255019 238256 229395 230571 227262 224727 215624 206829 207750
10038 207750 217748 226835 248777 270888 296397 329453 376319 451728 553121 677258 830089
10027 830089 1042179 1326348 1689237 2066005 2284774 2177137 1787644 1329913 967351 723384
10017 723384 565094 458672 388082 344363 311013 287485 259205 237225 212804 197094 197541
10006 197541 191357 180565 162816 153277 159615 165244 159110 154664 153079 157884 170350 184054 207297
9993 207297 245656 303897 390910 483659 511409 416645 305489 233512 191852 170579 162009 157321
9981 157321 146429 143260 141527 144406 138978 130554 129174 130765 131690 130756 130234 126248 130467 125882 127215
9966 127215 149959 164342 166420 174081 189878 220816 263236 317682 382951 461120 568976 717717
9954 717717 923808 1174127 1420688 1551138 1517741 1417461 1378775 1416710 1442187 1343104 1103109
9943 1103109 834464 622627 479349 380479 316208 272770 239798 221473 211297 202063 185993
9932 185993 166528 157105 149202 144783 139439 132302 128924 126479 110692 103100 97745 95290 97385 92474
9918 92474 88021 86345 81558 79144 71780 65941 62039 64886 61886 42655 29881 32413 32456 32034 32520
9903 32520 35174 37756 32781 36091 37920 45303 51802 61780 72316 66621 63945 65856 70224 66064
9889 66064 61657 57480 60835 64921 63593 61356 55645 54586 56961 63629 66138 64695 57245 52727 57184
9874 57184 55288 56220 55129 60263 62302 60158 62767 58870 51296 45910 47771 52708 64925 73224 71748
9859 71748 65249 66444 58949 46340 45375 46801 53467 56467 53538 56252 54593 54696 50955 49281 51366
9844 51366 55036 51349 47935 49699 49712 47339 48894 53704 49387 53495 53498 46414 40758 39764 40032 42887
9828 42887 41002 43592 48045 50011 61299 58756 49224 48760 53810 48391 49252 46141 39927 43133 43773
9813 43773 51166 53483 55208 48575 40699 35972 43318 36577 31265 29809 31241 33551 33394 33361 33403 43561
9797 43561 46419 42808 32822 31823 34893 32779 31931 31495 30624 32660 32314 30527 32407 33587 34185 32340
9781 32340 34160 36101 40966 37089 33108 32778 39569 38861 39578 42760 40343 42168 41250 44569 45759 44597
9765 44597 41217 41439 43984 47898 45154 40145 35878 32357 30024 29272 34861 41361 43248 40477 40434 44035
9749 44035 41558 43605 47750 45729 35294 29737 25401 28558 31955 38799 44035 50254 52216 51097
9735 51097 49075 48156 48833 47433 43644 37813 36073 38400 41473 50058 53373 51787 50626 47837 43487
9720 43487 47399 51571 46809 43205 38730 42668 43229 46491 46340 44126 38941 46371 49514 44310 40022
9705 40022 37749 36992 34842 36375 32227 21533 19815 25116 27285 28818 38257 38066 34157 24728 24733 27973
9689 27973 38010 46248 51814 45788 48113 52353 47807 51238 49643 47395 53791 52546 42769 44148
9675 44148 44992 53121 62015 64418 58091 53039 56906 50087 43781 44415 47308 47307 46876 42566 40918 44861
9659 44861 46758 44036 45568 42615 32956 29401 30265 33972 32466 31773 30234 32678 32302 28979 31175
9644 31175 33066 33591 38382 40351 35446 35568 39876 37532 34248 37236 45681 45252 37085 32284 32650 36664
9628 36664 35027 33285 37124 37774 31274 19316 16219 22207 29798 34951 37233 28424 22227 22027 19993
9613 19993 24176 24351 28496 34347 34320 42932 40452 42150 40907 36462 46663 47527 44613 41805 33852
9598 33852 29788 31240 33059 30548 28282 33395 29761 30194 30757 32110 34161 33624 36079 41662 38074
9583 38074 28972 23838 27800 27017 31653 28337 23308 29657 27077 24301 29881 32618 34391 32460 27710
9568 27710 30234 24628 24359 27483 23265 28530 35834 37995 31153 30306 31670 32272 32670 36323 30412 24625
9552 24625 30791 34843 30870 32137 36193 32482 31317 29694 31067 30380 26929 26070 30925 28412 25794
9537 25794 19530 11276 8329 10643 13111 21805 32958 30283 32260 25990 19251 29226 34868 39481
9523 39481 42158 37701 39966 39864 35686 32269 34020 31213 35739 31803 29340 29512 29846 33402 28982
9508 28982 24419 24749 28102 22037 23375 27566 29156 34761 37036 42203 53055 45866 36352 37960 33806
9493 33806 32780 32598 28083 25614 24665 22215 19054 18978 26281 29268 27423 35147 44997 46693 46367 42894
9477 42894 40358 41992 44388 37044 33028 28153 33604 36522 30785 29774 33933 32163 37393 40266 34634
9462 34634 39290 43323 37681 33686 32264 23754 18489 18027 17287 17663 22518 27914 33656 34045 31273 22746
9446 22746 19686 24693 27740 28163 30565 32638 37299 30091 29945 32567 30849 27565 28556 37857 35003
9431 35003 39780 46665 49610 46698 45356 38576 35360 31227 26664 30909 31834 32713 43523 48385 47822
9416 47822 38715 33527 27018 25411 27524 30821 38118 40288 41019 40742 38988 38722 32632 25568 21791
9401 21791 24977 26082 27537 28547 31004 26710 33023 36345 40382 40489 37801 41212 37932 37710 41596
9386 41596 37744 44081 46294 43026 40299 44367 44364 43700 35325 36614 36360 31203 28417 28430 30006 30268 30746
9369 30746 25485 30097 40354 40110 34946 40816 47738 44531 41509 37797 36632 38254 40042 36793 33189
9354 33189 35837 36318 35538 34423 40824 41289 46584 39227 31050 26906 33122 35295 32803 35673 35153 34287
9338 34287 39228 40891 41092 40109 40525 34000 26950 35962 46879 47056 44072 42406 39688 34387 32153
9323 32153 31618 34471 31223 33225 35034 34064 37479 38044 43676 49346 47434 46583 47258 44175 44838 44996
9307 44996 51726 49778 55077 60936 63569 59294 55124 52996 47786 52878 52485 52191 46121 36527 35195
9292 35195 35456 43529 52832 50411 49280 52321 45460 36676 36572 39701 40182 38989 31774 33169 46280
9277 46280 43533 44722 49589 46505 36272 31079 33164 32621 34087 38011 42204 42652 41914 42093 43027 40151
9261 40151 41343 40683 39272 39311 36527 37083 40079 42486 39726 42771 51958 58608 55361 47529 48017 49543
9245 49543 46825 45669 46121 46899 40851 38633 39678 40657 40638 41934 42029 41355 39204 35796 35817 37171 47574
9228 47574 54222 53912 45494 35767 32192 38443 44865 41677 43300 37238 29548 28111 34733 39692 45524
9213 45524 45097 39932 34922 33847 39074 41041 39060 36065 37742 43923 50822 49328 50343 53445 45996
9198 45996 44072 44659 40032 35923 35813 37323 39253 36035 34323 37993 42959 42593 40922 45530 47773
9183 47773 47211 47395 48183 48055 46755 44503 42743 45685 45869 41335 36078 36791 40112 39532 38159 36596
9167 36596 32606 33711 31740 27985 31100 34161 33908 29700 30110 35160 33693 32230 28879 33167 45045
9152 45045 51638 56093 58269 47697 47609 52897 55104 60298 58787 63032 63189 67555 67718 62954 70556
9137 70556 70232 67258 73660 77769 78102 81898 88459 90554 91949 96320 98528 91653 87461 85122 94650
9122 94650 100450 93863 92179 94567 100135 104606 107808 113278 118808 120447 125157 127402 128923 127102 127514
9107 127514 130006 134575 136620 134096 136667 137738 141089 144736 143650 141481 141027 133529 134518 133589 134652
9092 134652 133559 129956 126501 129494 136068 140597 136716 137025 129362 124857 121594 120557 123220 118721 121854
9077 121854 120091 120839 123093 121195 118338 120858 125170 132441 134035 135971 136848 137853 134305 136160 144505
9062 144505 156233 167348 171807 171431 174464 184825 183472 180795 172464 168837 161888 152333 147545 151612
9048 151612 160970 159612 157182 160214 161318 158720 154466 154838 153926 152307 148124 150661 157414 164019 166662
9033 166662 167133 168900 173889 175713 176301 182906 187240 197341 200377 196462 198596 198253 195180 194704 195844
9018 195844 198098 203294 205128 201704 198573 198654 201914 205338 210118 209143 215280 224561 241284 248165 254531
9003 254531 257425 264194 271638 274483 276402 277402 275627 276709 283491 291080 293386 295179 301159 314206
8989 314206 324450 326064 324198 324073 332931 338189 347454 356623 364744 365468 374077 381412 388736 402932
8975 402932 406885 402541 405408 413904 417497 420838 428989 431583 431894 438587 446646 449428 448576 457285 468416
8960 468416 474832 477055 487977 488260 481079 486772 503841 520962 534832 544799 550134 556889 563297 572945
8946 572945 582348 584965 596067 613267 624300 632943 646347 659167 673139 688571 702769 711642
8934 711642 731750 751015 760157 778065 800203 820399 844327 863513 879075 900415 912593 937606
8922 937606 970679 1001049 1023085 1047045 1081131 1113826 1138619 1169589 1205142 1243437 1282983 1322246
8910 1322246 1366712 1401721 1443338 1495233 1549372 1602028 1654375 1707539 1768776 1835001 1901337
8899 1901337 1967117 2039943 2118169 2202265 2295408 2394309 2495912 2604987 2722250 2844021 2971921
8888 2971921 3105723 3252654 3417585 3593451 3782021 3977568 4199347 4439990 4695099 4964530
8878 4964530 5258680 5587172 5944558 6335976 6770400 7244437 7770395 8353277 8998047 9711970
8868 9711970 10502818 11397082 12396670 13503811 14736955 16116376 17649555 19343914 21209618
8859 21209618 23252847 25467224 27822523 30291238 32828447 35344570 37744907 39911118
8851 39911118 41721291 43049868 43793760 43876013 43298279 42116377 40427175 38349443 36024593
8842 36024593 33582993 31129541 28743254 26477218 24357572 22407477 20621726 18999452
8834 18999452 17531072 16199133 14991125 13903798 12913624 12014844 11197935 10461109 9790819
8825 9790819 9178387 8613509 8098189 7627361 7196161 6804802 6438812 6098013 5781041 5492306
8815 5492306 5229444 4981334 4748072 4535998 4327983 4132120 3959308 3804136 3654942 3512487
8805 3512487 3375588 3245201 3124355 3016626 2910779 2800786 2695677 2597966 2501947 2415318
8795 2415318 2334929 2260054 2187837 2119522 2048821 1984328 1923383 1871177 1820132 1762224 1707190
8784 1707190 1655027 1600999 1558254 1509961 1464468 1423632 1388817 1350386 1319209 1287546 1253629
8773 1253629 1225584 1193839 1163858 1140669 1111790 1079345 1053659 1031555 1005709 987210 971437
8762 971437 950258 925357 898145 874894 851692 836583 826442 809397 788849 765240 746398 730962
8750 730962 721393 704806 694736 685298 671289 658171 645946 632008 616076 602326 596888 588339
8738 588339 576518 561821 553078 550053 544721 543321 535446 536331 530105 516813 506397 498686 492929 493678
8724 493678 488498 475537 468587 462940 458895 454083 442501 435616 430129 418879 413668 403546 390916
8711 390916 385615 379304 371011 359536 357627 351705 346939 341426 333622 323815 319402 312346 302565 298594
8697 298594 298166 292107 281179 276098 280239 284108 282375 271953 268844 267715 271757 272445 266832 264934
8683 264934 272003 274575 266806 260529 256006 252070 244905 238846 237371 238606 238503 235413 229664 228083 231214
8668 231214 223292 215536 213130 214932 219162 221074 215417 213814 213255 205362 195481 191210 185561 188300 188042
8653 188042 188897 185107 184787 185216 182024 176709 170660 168127 168031 164831 160709 164164 162333 155096 152563 153045
8637 153045 153670 154080 145656 139219 145670 146821 147430 147706 146326 142796 136954 134211 136426 135315 137141
8622 137141 133325 132619 139735 144080 142314 130572 127840 128453 127321 125327 130703 138709 140630 135765 131682
8607 131682 129507 126007 120422 115199 115472 114947 117241 118412 114756 114628 111722 112113 117574 121704 116783
8592 116783 111757 107250 107409 100529 99393 108605 112201 112076 111255 105541 111770 115539 110780 103410 97717
8577 97717 102085 106854 106505 107969 102624 97189 94236 94260 90908 95699 93046 82051 79878 78185 79743
8562 79743 92044 100030 99645 95225 92519 92241 89625 94595 97519 99946 102043 102958 110275 114818 110671
8547 110671 117719 125075 124293 128743 141963 152902 158140 160034 161849 161844 160569 163074 159756 154146 153315
8532 153315 149079 145804 138260 135850 131053 121656 116876 113564 109983 113002 108481 100619 103597 106228
8518 106228 98890 99718 102914 99938 94066 91360 97923 96881 93745 93305 91777 88180 80116 79535 85174
8503 85174 84439 78943 76316 77379 71758 69594 68917 64489 65481 62299 64156 71953 73391 67926 72967
8488 72967 74312 73371 68399 67214 73094 78105 79914 77483 75032 75426 75174 72304 62469 57516 56240
8473 56240 55294 62276 71088 76456 70088 61055 65132 74906 70088 65605 66117 72394 66279 63001 60986
8458 60986 55035 50202 50901 54911 60727 59676 55926 56387 62952 62750 60572 65255 68241 67455 68701 63239
8442 63239 57535 57400 56295 55637 56632 55929 55251 56881 48712 44597 39751 41371 39408 47322 53240 57453
8426 57453 58715 61588 60909 53825 53565 42897 41389 37098 34474 36208 34478 36886 41852 37160 30692
8411 30692 36843 41903 45057 45809 42990 39934 36461 31080 28073 26982 33860 36352 36127 30489 27342
8396 27342 31367 36876 42443 43095 39308 35886 32053 26670 23145 22239 24748 27627 30968 33442 39182
8381 39182 40410 35212 30874 36485 38997 36552 34351 33226 33547 31892 41825 49074 49197 48739 44261
8366 44261 34547 31474 26115 17796 15746 21738 28443 37312 46239 49887 53998 54511 51021 40003 38701
8351 38701 45786 44595 37802 36349 36714 33198 30405 28540 30900 34438 36946 42610 44920 46009 44534
8336 44534 33997 26564 28321 32378 31884 30741 23596 26034 28668 30629 33623 41799 41102 39784 41384
8321 41384 36476 38844 38859 42363 47227 45461 37792 33627 34086 31629 28467 31791 26602 23012 29450
8306 29450 23042 18277 28452 35723 42318 41393 42151 41736 36713 26970 23709 23911 32133 33296 31404
8291 31404 36648 35576 32241 34207 34318 32779 38130 45639 51007 49115 46967 47845 44330 44146 48492
8276 48492 54446 45387 33226 30901 26823 19136 15028 23596 28295 25538 24210 26629 31957 32151 29253
8261 29253 27337 31760 28789 21975 20559 28550 33829 45399 44356 35218 31936 36577 40274 39317 36981
8246 36981 35234 34883 34026 37307 42672 47569 49254 58319 65560 70177 64201 66145 57692 49913 48636
8231 48636 43634 41765 38984 35592 34467 31604 28644 34582 40977 32564 19624 25255 41045 42118
8217 42118 39668 30069 28065 23190 26281 28682 29071 27405 20982 23098 29984 28210 31506 29736 26915
8202 26915 28915 34795 46718 52612 57861 70095 71095 66756 62865 53064 43019 34936 34652 37935
8188 37935 42430 38879 35731 36239 37891 32139 27284 27596 30641 25060 19238 18163 19053 19812 14501 16631
8172 16631 22795 19813 20051 26955 29066 28557 22682 19277 19520 25170 24929 21495 23985 24740 23562 23054
8156 23054 19459 17525 17254 18895 27023 30284 28293 26374 20662 16626 15393 14527 19351 20828 20243
8141 20243 13978 9899 11193 9024 12166 21986 26320 23977 16807 11870 7980 6716 13500 18716 24125
8126 24125 30798 27409 21249 17437 23251 22806 28607 28731 33622 32763 26277 27160 26559 22638 27050 29012
8110 29012 22333 20568 20051 18250 17037 15278 20331 22276 25757 27427 25811 27693 21701 20622 20167
8095 20167 17291 11393 17497 24840 26146 22203 21512 15731 12664 14308 17661 18158 13249 12811 16415
8080 16415 13157 9939 14475 22324 19902 13346 12085 10882 14724 19872 32843 32336 26142 22710 16362
8065 16362 15142 14580 22123 26463 25497 20787 17290 15850 19148 23933 18357 11625 13719 12484 11594
8050 11594 20912 24267 18598 14795 18849 26709 22302 17171 14869 20595 26074 24135 22883 24631 19828
8035 19828 22955 31181 28555 23407 22818 22030 16871 18907 17104 15607 20842 22467 20119 15267 13245
8020 13245 22982 26540 22967 27925 27559 24657 16142 14933 22054 21144 11322 8232 13909 18216 22222
8005 22222 27844 26196 26368 23047 19872 18163 15450 14635 19704 33126 31354 29247 24132 18824 16951
7990 16951 8342 7620 9377 14007 18708 21748 27933 30376 33377 36100 30565 21554 22966 19349 15520
7975 15520 20761 26286 25126 25284 17418 13697 16686 19412 20951 20180 18738 20123 19690 18167 9952
7960 9952 4856 2618 8799 16341 25452 23256 28742 32340 32058 25268 15077 15609 20539 22122 30344
7945 30344 36830 30132 28619 25398 17942 21394 31779 24430 17044 13585 13424 19947 21936 18191 17632
7930 17632 20269 20600 22985 21827 18433 17498 12133 3083 -4253 -3075 3031 9309 15373 21961 25598
7915 25598 24146 19528 13263 13513 14234 23461 28689 25687 25689 28889 33174 37020 29786 26028 20129 26997
7899 26997 35385 38130 39814 39063 29022 20229 17294 18621 17350 18496 20545 17752 13367 10382 19039
7884 19039 35124 39959 39375 40137 33883 31106 28129 29643 30632 27955 29264 22895 17243 15328 17020
7869 17020 17041 22497 25444 23347 23071 25593 18397 24147 26622 27728 27486 28041 26044 25854 25226 27458
7853 27458 28860 28145 20314 19246 11582 12253 13982 13477 17804 16924 13516 18941 21389 20511 15069 10422
7837 10422 3175 3356 6675 5475 2821 -2914 -3242 -4965 -6244 1734 7553 12203 12397 10038 -94
7822 -94 -6805 -5389 1471 14464 27455 24050 13885 10637 16806 16019 18108 15016 11480 9928 10018
7807 10018 9229 7542 10497 8604 11807 16180 20411 21542 20206 23467 24890 21422 15008 11585 12663
7792 12663 14705 10439 15281 20961 24933 24275 16588 13288 20125 12044 15041 16773 10108 14882 17725
7777 17725 20215 22551 21096 26112 23964 21168 20237 19406 23913 26167 24591 25517 22768 25073 22694
7762 22694 21941 22679 23178 15621 5075 4387 6745 8692 7731 8040 6209 4880 8985 8818 6519 6843
7746 6843 9659 15974 18975 13699 10522 10221 10386 8743 6175 6808 14299 17123 12602 9771 10659 11291
7730 11291 10706 5296 2661 733 2228 9205 16798 26460 21322 13404 8696 6873 4142 8975 10630
7715 10630 8721 8265 13524 21370 24455 16400 15248 11222 8985 7696 15462 16897 15541 12344 6625
7700 6625 9706 9458 13549 14852 11595 8029 8560 14772 13589 12240 11587 18994 19270 13922 10571 12479
7684 12479 10482 6416 4432 8163 13341 19615 15158 16949 14957 12635 20748 24849 20662 16351 17830
7669 17830 20513 18723 18483 19656 14212 3710 -3794 -5564 -5243 -659 2620 5881 2882 -4394 -2465
7654 -2465 -392 -3629 -1626 2233 1098 -2821 -7518 -5392 1523 4286 2489 -643 -388 518 1877
7639 1877 2153 6181 8490 10703 1164 2180 1205 -844 -5232 1352 4608 1190 -3590 -3904 -836 2984
7623 2984 2824 6586 12244 16651 15587 15378 7971 4767 12345 20340 18084 11329 4283 2427 -1868
7608 -1868 -183 5737 8793 5179 771 67 2446 6567 13848 16168 16120 17162 14009 11952 12131 14040
7592 14040 15784 14698 13461 17679 10424 11784 14242 9792 -211 528 6652 4249 6861 10377 14686
7577 14686 6906 -3948 -9834 -8898 -2939 -439 -302 -5087 -3742 -2022 2485 11881 11904 2986 -5463
7562 -5463 -3047 325 169 -8170 -9319 -8154 -1329 12051 12773 14693 3668 -4442 -2514 -11008 -9539
7547 -9539 -3540 -2402 -4746 -4281 -5912 -6690 3370 8169 5145 -708 1541 3778 6455 6637 5804 4067
7531 4067 -2368 -5401 -3029 5687 7670 12504 21095 22383 24546 25909 25884 21570 11369 3473 3936
7516 3936 9740 15832 21867 23597 19885 22765 22028 18816 10361 5180 6991 6588 4266 -1194 -4285
7501 -4285 -10035 -5775 9128 14696 18122 19716 16701 14404 12138 16565 17209 13867 10351 9468 12671
7486 12671 13232 7820 2800 4540 5516 7086 7890 4150 108 6458 9185 2829 -408 10374 14553
7471 14553 14004 9017 2790 3681 10390 18344 17883 11468 7851 7686 2973 -1875 -2173 -4466 -11024 -7379
7455 -7379 -4159 -2954 -4539 -1508 3685 1617 3739 1606 2125 -351 2466 7764 9548 3288 65
7440 65 -53 -54 2540 1150 8508 13373 16900 15560 10534 2890 1365 1231 8697 11655 15750 14901 12079
7423 12079 9418 5922 7733 7241 10293 12229 14439 11118 13814 17929 16671 12026 14284 15387 11598
7408 11598 1801 -1563 -3471 -79 677 -1457 1161 8360 6165 -5887 -7235 -6797 -7206 -3455 1446
7393 1446 -287 4853 2334 1645 -1993 -5763 -7601 757 13782 10992 4765 5051 6419 1393 716
7378 716 2257 747 228 -820 -6369 -1483 -1972 -126 2567 2408 8869 8209 2485 2480 4158 3664 -779
7361 -779 3831 10240 10870 6452 713 418 -876 -2390 -3199 -959 1150 2336 -342 -4495 -646 5492
7345 5492 7557 4261 -5356 -7822 -2550 4402 6313 -802 -2446 -2580 4199 13568 12876 4568 3585 4484
7329 4484 2542 -785 355 -6940 -5981 -4852 -6286 -5798 -1133 -12306 -18030 -14455 -8190 -1327 2567
7314 2567 4666 6698 4617 -1666 -6694 -8654 -5063 823 8528 10022 5263 1976 915 -773 2390
7299 2390 3505 9296 9127 8441 5710 3996 -3191 245 5700 6850 13034 6417 5125 7120 9144
7284 9144 11774 12364 9502 3671 6980 5371 455 1299 9109 10623 11665 5970 9870 10141 4740 4520
7268 4520 -479 -2368 -4062 -3481 -786 614 2804 7765 7050 -2501 -2981 3326 2318 5488 9237 13239
7252 13239 11796 8801 7269 6741 3078 -821 1624 8680 20136 16496 11161 14639 21319 20455 8950
7237 8950 3865 2326 3474 -1158 2565 6974 8727 7961 6318 3154 5735 5744 9053 9617 6767 8492
7221 8492 7552 7170 9915 11563 16171 15917 13413 13226 11354 11924 5413 -4580 -150 6199 8938 9990
7205 9990 3512 -4070 1312 -85 -10024 -7412 -5212 -5162 -923 1734 1235 -2287 483 3681 5493 7895
7189 7895 8487 12790 10789 10206 4953 3605 5569 8844 4727 4319 -755 -2226 1284 6239 7478 1174
7173 1174 -5064 -8616 -5880 1349 5283 6513 10729 12680 5794 3832 596 -1598 -1941 -1248 86
7158 86 1369 413 -8007 -6713 -3608 -570 4126 2386 4793 6639 7777 4689 -1406 -6060 -3896 -3453
7142 -3453 -3516 -1667 -1864 -7790 -9897 -1812 1158 -6035 -3246 3700 4318 985 -3679 -3213 -1568 959
7126 959 2306 11268 12264 11009 9023 5358 5347 -465 -2897 1036 2064 5346 3550 -105 -1305 -441
7110 -441 12 1358 849 1458 -3067 -1424 1061 5289 3273 6635 1244 -706 6762 8629 6181 10869
7094 10869 9598 3926 8184 7668 3542 5339 5940 5570 8026 14925 12858 -439 -5485 -632 8511
7079 8511 15120 12527 5246 304 -843 2096 4431 5982 6409 1910 -1340 -3764 -5461 -4415 -6296
7064 -6296 -6761 -5506 -2014 1501 1674 -1700 -5871 -7453 -6514 -5462 -2989 4609 8974 5526 -915 3826
7048 3826 1658 3281 6685 9916 10201 9957 3538 3176 3598 12116 17860 10994 2846 797 -1833 3015
7032 3015 9818 5909 93 -4913 -4954 -1242 -37 -288 2015 2925 4254 4756 -2377 -4207 -6365 1076
7016 1076 4965 6127 15659 21043 16663 13531 10071 6944 6113 1751 -5849 -5777 -4309 -111 2425 5093
7000 5093 6538 6243 -2091 -1621 -686 2576 17863 21195 16017 11055 14066 13990 470 -1278 1371 1543
6984 1543 3209 10650 13775 8644 -2848 -5463 -6660 -1211 1714 3782 2272 3910 5553 3933 5633
6969 5633 5645 10093 5773 -1910 -8900 -9785 -4452 -3947 541 2191 810 -1767 -5434 -3356 -3414 -3907 -4670
6952 -4670 4214 10157 9471 5788 5266 3654 3051 3420 3070 4402 4798 2951 1777 -379 1320 2256 -686
6935 -686 -871 4957 2900 -4294 -3184 -1534 -4279 -3631 -1270 -4450 -6369 1651 10407 5836 2107 5629
6919 5629 3155 9532 16486 11469 9706 8533 4575 1280 1837 -2281 -3053 1350 -510 -5549 1162
6904 1162 7084 11068 805 -2434 -1008 -3326 -9075 -4173 8832 11335 5708 -1836 -5444 -6783
6890 -6783 -8429 -6541 -7189 -5493 -8744 -10870 -4190 2066 846 -5016 -8298 -9844 -6261 -2936 -10105
6875 -10105 -15241 -15767 -12349 -3880 2840 3078 -1109 3431 3815 7024 6951 7889 1605 2497 1877 -2061 26
6858 26 1567 5538 14587 20050 20231 19696 10612 941 6678 1434 -2693 -3473 -2252 179 3259 269
6842 269 2706 456 527 5248 7681 6019 -2438 -2963 -7591 -4798 -317 626 -1512 -1445 1388 -2152 408
6825 408 3041 377 -1378 -7807 -6132 3674 7682 2330 -5078 -5782 -3543 -6397 -6030 -4031 -2013 2850
6809 2850 -2144 -2397 -572 751 -5305 -4976 -2897 -478 4513 1602 -1816 2818 5404 -72 -5089
6794 -5089 -736 4151 9918 15757 8527 1112 2368 8792 14155 12496 7973 5812 -35 827 -3879
6779 -3879 -5462 -1013 219 -3008 -3319 -4062 3540 10035 8927 8189 8400 14353 12848 11231 13395 13814
6763 13814 8289 7041 3739 4219 3101 -6690 -5863 -3644 -7917 -7599 -9073 -7141 -5244 645 3953
6748 3953 3974 6282 4691 -313 3646 5221 1951 7985 963 -2437 -1309 -5647 -4911 1688 3835 -1220
6732 -1220 -4838 -3518 822 209 2006 11586 15985 20261 11514 677 -10897 -8994 -1776 1532 -1506
6717 -1506 370 2166 8114 13598 15074 12417 8957 -1936 -6645 -2268 1190 4208 4396 9387 14140
6702 14140 10183 4297 2633 4696 11157 8532 6970 6685 -18 -251 5351 6001 5710 2655 -3204 -7520
6686 -7520 -9462 -9078 -8160 -4240 4695 2854 2235 1213 3225 3102 6113 10331 5056 4652 6582 4311
6670 4311 -4171 -9395 -12044 -5196 -3060 3076 14267 16551 16421 13695 10472 8626 666 1384 7070
6655 7070 8865 668 -3740 -6041 -4464 -2266 -1203 -2568 6985 13486 10256 8876 8785 -5148 -7024
6640 -7024 -10718 -7393 -1053 -5498 -3137 5331 9645 1852 -2114 -2582 4076 3736 133 -905 -879 -2965
6624 -2965 -1402 318 729 2748 4888 4395 6922 6583 -5337 -12242 -4285 1242 4534 2522 -3094
6609 -3094 2358 6575 12234 21403 22516 14755 10230 4516 343 543 5370 14544 9399 4925 5797
6594 5797 6444 9468 6859 1038 -4932 -6068 -2261 -1855 5055 5 -3060 -229 2614 3923 -253
6579 -253 -4056 4656 6140 5256 -984 -9079 -13975 -10916 -8397 -6143 -9682 -8673 -4930 2534 2350 2793
6563 2793 -3833 -4661 -7341 -7701 -6011 -3022 5128 4927 1147 -2311 -4913 -1489 2238 174 852 2582
6547 2582 2990 1310 4961 4053 3906 -3598 -6454 -2849 -1255 4150 3464 5278 7491 6469 10034 7259
6531 7259 3598 7454 3896 6008 10880 4683 1550 -1819 -7953 -5062 -8110 -10642 -10056 -3657 1892
6516 1892 -590 -665 2249 4323 1307 -2652 -2442 -2544 -5453 -4856 -6092 -7439 -10328 -3590 -3305 -1756
6500 -1756 -1518 862 4574 1258 3584 3997 5790 8981 5965 291 3345 2138 -4161 2007 4198
6485 4198 4618 7608 13180 7203 6317 9364 11895 9964 6759 2695 3847 6355 4167 3112 5845
6470 5845 8483 5066 4994 3200 -764 2568 9369 4749 -2206 -3350 -6160 -3923 877 1530 -2980 1987
6454 1987 3676 -1699 -2041 -92 -566 -1612 -4368 -9470 -11074 -13600 -13778 -12488 -971 1697 -5032
6439 -5032 -5846 -2956 -5308 -5065 -3537 -2738 1635 5814 15530 20471 10878 7470 2851 3269 2375 -405
6423 -405 -350 -3231 -1491 4350 1559 -2079 -3277 1111 -3610 -6804 -2131 -3439 -9709 -7734 -5536 -5823
6407 -5823 -1766 561 -502 1189 -5193 -8388 -11724 -11094 -9165 -6758 -13945 -13661 -6297 2560 -2451
6392 -2451 -3368 753 1925 1384 -4422 -6150 -978 5115 2271 -7548 -5084 -2075 -7673 -6194 -7680
6377 -7680 -13816 -7655 1458 -1153 -3327 -4401 -9437 -13982 -12150 -8901 -6692 -6693 -3605 -6794 -10998 1011
6361 1011 7772 6047 -1201 -3388 -1682 4572 6275 5171 2298 2710 -1443 -9233 -1675 5148 6204
6346 6204 3050 -2462 2046 9591 4752 2447 2086 610 -2051 -2677 -181 2455 8047 3614 493
6331 493 415 1458 -5452 -5634 -1996 -13 143 -4593 -4959 -6562 -10230 -8306 -9192 -10877 -8945 -3339 4027
6314 4027 3729 -4426 -6499 -6949 1711 -565 -8859 -7775 -4140 -451 441 3197 5495 4640 1525 1715
6298 1715 2288 -87 -1952 -2235 1569 -200 -3548 -6456 -1310 1740 3189 674 -1464 -2203 -2186 -2271 -3999
6281 -3999 1135 7300 9308 4766 -2580 -10816 -11097 -4187 -3768 -5949 -5317 -9115 -14921 -12782 -10032 -7098
6265 -7098 -3000 -4845 -2112 -3706 -7113 -4281 -5609 -7949 -3163 -4569 -8710 -8542 -6055 -5354 -1334
6250 -1334 -2964 -5838 -6905 -5450 -4686 -575 -2929 -8903 -13350 -13342 -8126 -3262 -5911 -7803 -4460 -4083
6234 -4083 -1724 5298 8107 13318 9005 -270 2379 5666 3510 8644 8288 6845 5855 328 -6623
6219 -6623 -4645 1013 2277 6938 10137 13657 16767 17303 19017 15527 18269 19700 14915 2539 -9910
6204 -9910 -10789 -3461 2237 92 -1842 -2809 -3195 -7624 -8302 -936 496 1945 -598 -2282 -1153 104
6188 104 931 -2680 -4502 2924 5456 1883 -3601 -1377 883 4653 6255 11838 13344 5965 -2552
6173 -2552 1426 3947 2879 2306 3843 -2180 -8532 -6789 -3505 -6550 -10937 -16009 -17544 -16703 -8490
6158 -8490 -1375 379 -3825 -3233 -3882 86 6976 6662 8813 7023 2843 4324 9483 9765 10595 4152
6142 4152 -690 -6114 -7599 -8121 -12043 -10747 -10911 -12240 -14636 -9079 -9847 -6425 -5663 -7851 -8672 -5770
6126 -5770 -1861 3385 3159 -1536 -2478 320 2566 -6629 -10737 -8925 -13326 -15530 -3192 3375 -4302
6111 -4302 -12036 -9249 -1753 -5341 -13538 -19691 -18872 -16401 -17984 -15321 -10267 -2010 5393 6894 6164
6096 6164 3032 3897 1495 -1973 -3420 -9593 -8815 -8969 -12151 -11186 -11146 -11483 -4143 4103 -3365 -4879 347
6079 347 3647 5281 9876 6376 4961 7421 10965 12169 6982 -1629 -3797 -7560 3436 3478 749
6064 749 779 533 -2012 -3397 -885 -4860 -6463 -4218 6406 5184 -1860 -5579 901 182 -9443 -5675
6048 -5675 -2358 965 6088 6679 4084 501 -2039 -2257 764 4997 4583 658 -5627 -12442 -8359 -10298
6032 -10298 -9560 -12599 -8335 -2426 2040 1406 4050 -3082 -6780 -2909 -1650 3169 1501 3212 12362
6017 12362 10656 -293 -8724 -6193 418 1018 228 336 -2178 455 661 -531 3481 5101 -1694
6002 -1694 -1836 -248 -5006 -9231 -11960 -14527 -11497 -11258 -12599 -7374 1828 10098 5474 -10 6132
5987 6132 8410 3380 249 -5050 -9601 -4520 -3297 -4371 -7094 -3262 -1246 -3733 -2993 -1704 3506
5972 3506 6166 2388 -5883 -5210 -5168 -4728 -7132 -8933 -2186 -2343 -5654 -11701 -10872 -7553 -10031 -4415
5956 -4415 994 3172 5154 8682 7339 7240 3021 1661 931 -1625 -2001 -7392 -15791 -11533 -3585 -10089
5940 -10089 -9092 -12109 -12382 -3766 3675 6783 11205 15852 9344 1776 922 -2436 -7334 -6072 -7479
5925 -7479 -10553 -10835 -13403 -15752 -4328 -1356 1210 2605 121 -7654 -4116 5208 11071 7752 -1303
5910 -1303 -13534 -20375 -16116 -7304 -4792 -4795 -4702 -1280 -1772 3374 2367 -4104 -17488 -13394 -5697 224
5894 224 7330 7714 5825 -253 -1846 2506 4498 8173 6309 1023 -680 2252 7170 6838 6848 3480
5878 3480 7353 9543 2267 3722 6229 -3253 -10780 -1527 6379 6529 3376 2967 722 5027 8695
5863 8695 2741 -3507 -5784 -8825 -7272 -5468 -4551 3949 6522 -721 3480 2181 -1572 599 -6893
5848 -6893 -8862 -2459 806 2475 114 -384 -4681 -11483 -6362 3095 6659 573 -5993 1059 -1092
5833 -1092 -1672 -6648 -4888 -5972 -711 4224 2147 7002 -1458 -3066 1140 2877 4283 2277 -2958
5818 -2958 -713 -1532 -5162 -4759 -2423 4091 4678 -2069 -2322 -4338 -4494 -4636 -12752 -7756 -5788 -5607 -11389
5801 -11389 -17162 -12388 -8168 -9581 -8041 -5567 1108 2368 -2983 -4082 -1488 6303 -25 -9335 -7383
5786 -7383 -1097 -10837 -11388 -6112 -5194 -3812 -2991 -576 416 2349 606 -1516 -3977 -7551 -10250 -11194
5770 -11194 -14196 -9609 233 -3761 310 10895 13370 5695 7118 3968 -3980 -5918 -3884 -6007
5756 -6007 -12240 -16274 -13434 -9506 -10932 -5063 -2523 -4196 -8300 -17601 -9425 -10843 -8778 -8469 -11434
5741 -11434 -13360 -6149 -4732 -1600 637 2117 -3077 -4760 -1651 199 1436 2399 4540 5437 -540
5726 -540 624 -1001 -1157 -8320 -7632 -1643 -1003 2757 5556 5219 1460 -5219 -9016 -14219 -11684 -9449
5710 -9449 -5533 -2835 -2570 -2942 -2478 -2897 -1032 -2837 -3555 -3326 -2002 128 -9980 -17332 -16095 -8742
5694 -8742 -5360 -3463 -5101 -3613 2148 7954 13759 11615 4773 -2034 -8814 -10699 -5692 -4235 -5125
5679 -5125 -3848 -4698 -2611 -4649 -5047 607 3826 4460 2911 6265 7839 2360 -4873 -1362 -1016 -2065
5663 -2065 1579 -5799 -5767 -8441 -3726 -485 -21 328 -1898 -753 -4419 -6618 -8668 -12058 -7749 -3583
5647 -3583 -2029 2849 7190 4353 3350 6201 8022 3565 2054 -3730 -2579 -6405 -14420 -14221 -11353
5632 -11353 -6026 -3781 -160 8837 7005 111 -1350 -1244 4607 5229 -1938 -2364 1333 6126 5128 4442
5616 4442 3080 5694 4160 2020 -208 -4491 -3690 -1124 2385 5795 3140 3216 -4354 -7539 -6942 -6896
5600 -6896 -576 4202 -819 -2250 -6948 -13941 -12699 -14205 -14443 -14584 -9376 -4432 284 784 5457 4199
5584 4199 1600 3030 -1142 -948 -545 -3518 -3582 -4416 -5535 -8311 -3447 -2238 -5602 -645 -1402 3881
5568 3881 1006 1737 3958 777 1135 526 -2753 -5129 -3094 -382 -4460 -3483 1684 7177 3307 5495
5552 5495 7757 -1146 -9633 -11410 -5071 -5801 -10119 -9237 -11082 -14155 -7299 -10072 -16740 -8478 2940
5537 2940 -409 -6919 -4056 669 7335 6773 2511 -909 -818 -2022 -2186 -1121 -9265 -10075 -216 4737
5521 4737 7184 6047 -2181 -10710 -13171 -16792 -10632 -6352 -1953 -5398 -9416 -1769 160 -5550 -7714
5506 -7714 -6870 -3749 7148 -415 -394 8267 11847 10701 12503 6248 4263 -2396 -3017 -2270 1228 5075
5490 5075 4194 5769 10778 8897 4536 6572 8383 7519 2677 544 165 285 5611 15238 14533 13881
5474 13881 11021 4526 1420 -2167 -2385 -2980 -711 -3122 -1363 1053 -6551 -14113 -15754 -10827 -6627
5459 -6627 -1243 1153 1938 1233 -1393 -6613 -6645 -221 3970 238 -2383 -5658 -7038 -12185 -9298 -4872
5443 -4872 -7495 -8888 -3801 312 -4867 -4465 -272 -6882 -15453 -17526 -10426 -8042 827 3374 5157
5428 5157 9790 14375 13230 2472 -9475 -11937 -9716 -11449 -12082 -2430 4658 1545 -3857 -6260 -6906
5413 -6906 -9640 -11366 -12460 -4517 -2481 -1622 1132 -2278 -9142 -6449 312 -1140 -7511 -13205 -14593
5398 -14593 -9701 -15151 -19729 -18328 -12533 -11185 -10474 -6338 -7870 -7724 -2744 1395 4110 2060 675
5383 675 -2811 -4603 -2567 -3860 -8728 -6371 -10488 -10767 -4082 -4592 -1248 8754 5349 -534 -1118 2229
5367 2229 -2640 -6901 -5422 3062 6482 6065 2098 -147 522 -2091 -5894 -5115 -3808 -8149 -4171 -672
5351 -672 -1170 -2519 33 5445 5234 5146 10853 12536 7136 1670 -5228 -10295 -9969 -8886 -15099 -14115 -8399
5334 -8399 -6930 -3428 1915 10215 14835 7714 -1513 -5119 -2443 -54 8902 7186 2717 2575 3260
5319 3260 -3879 -1776 2001 3497 2525 6210 3437 -889 -6784 -8265 -8942 -8373 -9661 -7939 -6673 -12428
5303 -12428 -14247 -13948 -19484 -14178 -10855 -11818 -18473 -22204 -17506 -8556 -2933 -4030 -9251 -10438 1270
5288 1270 4463 -1968 -7704 -10087 -9566 -12945 -8520 -3951 -2171 -3378 -4677 -2958 -1478 -5134 -5901
5273 -5901 -2978 1007 2960 -3572 -5873 -7792 -9722 -12488 -11363 -14254 -8493 -5935 -3118 -3366 -7300
5258 -7300 -14204 -15480 -12795 -17160 -16329 -16485 -12567 -6676 -8657 -8426 -3633 -3778 -1178 -5737 2495 -1221
5242 -1221 -8964 -3877 -4779 -3570 3152 6683 14944 17476 14849 9207 3073 -2284 -6111 -7732 -5784
5227 -5784 -6794 -1254 -1610 -5123 -7866 -7780 -717 7627 7334 4608 3305 3751 1739 -925 5840 2486
5211 2486 -3232 -2992 -2862 -4843 -7145 -6490 -9767 -8498 -8560 -12807 -13699 -14744 -6136 -4446 -8828 -7814
5195 -7814 -6539 -5277 800 6187 1270 -2860 -1262 -120 2003 2059 -520 4665 -5400 -492 6241
5180 6241 4419 6507 7152 2482 1631 2758 5349 3436 3757 -882 -5903 -5399 1833 3921 1334 -447
5164 -447 7173 9853 9527 11411 9054 8264 2911 1282 8459 7704 5085 5058 4527 3228 -1017 -7234 -5643
5147 -5643 -1957 -5368 -6163 -3652 -2111 -753 -4475 -8361 -11864 -5311 155 -8356 -9116 -8977 -6759 -6444
5131 -6444 -5632 -3916 5669 5354 4066 -1164 -4048 -13702 -23077 -18151 -11562 -5447 -4818 -9849 -12801 -8042
5115 -8042 -4741 -5015 -5094 632 -5564 -10789 -4868 6040 7905 7270 6298 -64 -4394 -1127 387 2165
5099 2165 1573 -14 -2247 -457 -252 -4412 -1647 7004 13386 11150 -261 -3871 1068 5092 5297
5084 5297 8261 8944 5676 7763 2547 -1589 4117 5771 -846 -19 5462 1469 -5840 -3952 2001
5069 2001 -179 -6504 -7618 -9478 -5887 -2921 -2198 -3413 -2755 -1713 472 3907 5366 11742 13078
5054 13078 14859 13964 5310 -289 -2009 1998 797 -1456 6927 10509 13037 13595 12795 4801 -4484
5039 -4484 -6957 -5429 1070 2575 4379 9128 10098 11262 8810 6612 4604 -2436 -3995 -6422 -6363 -5633
5023 -5633 -5070 -6005 -10448 -11171 -7293 -6351 994 2014 1469 -1627 1025 5944 4419 -663 -1119 122
5007 122 -2740 -5428 -9631 -13769 -9144 -3096 -5332 -6061 -8040 -9559 -14180 -13794 -12254 -8369 -8843 -7119
4991 -7119 -10014 -2388 2660 5700 6188 3247 -2053 -3052 -2733 -2024 342 -1730 -6975 -10776 -7761 -7392
4975 -7392 -7129 -3241 3278 2260 -3245 -298 2385 436 1057 6467 10288 3783 -3705 -1616 3989
4960 3989 -2758 -11718 -7014 -9588 -13027 -19020 -17685 -15054 -8552 1303 6427 6588 5920 -1147 -5994
4945 -5994 -4097 -2852 -2098 4855 4983 4425 -1547 -9442 -9418 -6773 -8642 -11974 -4805 1620 6228 8443
4929 8443 7461 2031 -5811 -3273 4670 7728 4555 4244 6156 6337 4473 5679 2341 425 -690 -2308
4913 -2308 -160 -5211 -5040 -4355 -871 -1915 -4038 -1521 1477 1966 -2449 2776 -3944 -4825 -1514 -1318
4897 -1318 -6412 -10419 -11629 -7102 155 -1538 367 -1977 4707 8306 2538 -1253 -6409 -7221 -339
4882 -339 -590 563 -1941 -1008 -2518 -243 2777 -1422 -5977 -9890 -13091 -12274 -6738 5064 2905 -5734
4866 -5734 6400 9536 9292 7181 662 -1883 659 -3375 -5378 -3451 -3167 11 -341 -9963 -12580
4851 -12580 -7116 -529 -840 -5867 -1677 4874 -1466 1123 -317 -1796 -5015 -6463 -7155 -1564 646
4836 646 1780 -4385 -8943 -11460 -12065 -12974 -8920 -360 -1857 -4680 -6305 -2855 -2398 2049 1029 2604
4820 2604 3692 1755 -6113 -12885 -17520 -12908 -7238 -10322 -14182 -8862 -5384 -2295 393 -1442 755
4805 755 4781 7594 1587 -4578 -4438 149 2104 3003 878 -3278 -3506 -5735 -8394 -2616 -6079 -9299
4789 -9299 -8346 -2538 1472 -7490 -7881 -11945 -7820 -2838 -4033 -5609 -4524 2251 8829 9672 4446 6499
4773 6499 7932 3584 -4158 -4826 -881 -8031 -2180 2734 -8867 -14253 -8933 -4486 25 -2267 -14639
4758 -14639 -13144 -5304 1878 11020 11704 277 -3647 -8645 1130 -657 -2199 6841 6174 7289 6773
4743 6773 -1170 -5186 -882 -805 -3032 -822 1751 3193 -3979 -2701 -4368 1580 -2295 -7894 -6055
4728 -6055 -4535 -8393 -9989 -11058 -7427 -6652 -2784 3114 1319 4403 9408 2704 -645 2991 3724
4713 3724 1879 3503 -26 -7292 -7216 -4199 -3516 -11037 -5980 -266 198 -6558 -7902 -2661 942 3642
4697 3642 2016 -1819 -4425 -721 4070 -952 -5250 -2754 -1840 2662 -5118 -6442 -492 755 -3939
4682 -3939 -6252 -6847 -3828 -4239 -8875 -11609 -13652 -10495 -6291 -7819 -12387 -9436 -5764 -2598 1122
4667 1122 -7580 -5094 4171 8138 7557 6231 1257 -948 2036 -6796 -6402 968 1620 3301 6812 4894
4651 4894 1232 257 -1733 -10777 -10956 -5469 -2249 -24 -1106 -550 6130 4289 219 539 -244 1346
4635 1346 -4715 -9026 -6454 1900 5106 6907 -1499 -2214 -4985 -5124 -5551 -12244 -9088 -8196 -8156 -9471
4619 -9471 -5398 -4805 -3686 -3201 -6751 -6408 -6806 -5536 -9894 -9994 -4800 1657 2224 876 2845 3971
4603 3971 -18 39 -4049 -5279 -1116 3102 2072 515 8539 8095 4050 2936 -519 -2362 -705 -922
4587 -922 -6630 -3747 -1158 6506 5628 849 6017 8598 4333 -5210 -8018 -4237 -631 154 6084 3958
4571 3958 1217 -1139 -1498 9068 10565 8448 -118 -305 459 -1207 -2346 -1729 -1016 -6073 -8678 -527
4555 -527 3881 6241 5579 728 -948 -2249 -5803 -8059 392 7595 5146 2836 2778 6469 863 -5442
4539 -5442 -7506 810 3422 -146 -3283 4108 4272 156 6703 5897 966 -4067 -2415 -2946 -3727 -7341
4523 -7341 -8609 -9417 -7817 -4572 -1665 -2419 -3281 -5291 -9445 -5863 1761 2949 2178 4218 4275 1326
4507 1326 -4712 -2885 1729 -1245 -6545 -8564 -12461 -12892 -15706 -14626 -12229 -5526 -3251 -7846 -6278
4492 -6278 -9342 -2231 1221 -783 -1272 1410 655 -3473 -6820 -2857 1446 229 -2120 221 3603
4477 3603 1308 4115 6064 6917 5895 -173 -9129 -8240 -2194 -4985 -12567 -14811 -13394 -13315 -15928 -10189
4461 -10189 -1598 26 642 -1058 -6468 -9107 -9517 -1042 -2452 -8890 -12921 -13795 -7630 -6344 -4254
4446 -4254 177 -1594 2596 8203 3073 5458 6625 -2511 -5187 21 4448 2146 3973 6125 4982
4431 4982 4382 6522 1599 -2975 -7788 -13559 -19131 -15175 -9280 -9112 -7260 -3145 479 11619 15844
4416 15844 10677 6543 5746 -143 -3654 -4534 -4656 3998 7351 6774 10806 10724 8189 8129 2899 -5010 -6273
4399 -6273 -2434 2112 -1365 -5444 -8850 -9409 -11799 -9773 -8143 -5583 -2079 -1134 995 1358 5627 5171
4383 5171 1094 2890 -102 1561 5244 7549 8221 4142 2495 210 -419 -956 -4559 -2529 -5574 -3823
4367 -3823 120 -982 -1179 -750 -7928 -8354 -2428 4217 5625 3871 2974 3875 2560 4172 5612 747
4351 747 -8652 -6502 -2682 -2840 -7825 -3031 -1329 1960 -1749 -2131 -2735 -2719 -3544 487 4843 3308 5082
4334 5082 -2303 -7715 630 3745 -1715 -4932 -3572 -3898 1103 2214 5098 6255 1144 -6257 -8963
4319 -8963 -3081 1314 739 3683 -7035 -10167 -6975 -6417 -851 7643 10981 5211 6079 5539 4731 3384
4303 3384 2814 -903 -1197 -2076 -3109 -1176 -4288 -9854 -12371 -5862 -3744 -1766 -12169 -13735 -8482
4288 -8482 -10520 -10629 -4355 1374 1306 -2820 -1325 1429 -2894 -5169 -4989 -10128 -10147 -5822 -3924 -5961
4272 -5961 -11103 -13717 -5761 6106 10822 5404 372 -3180 3451 6524 4992 1063 856 13647 12052
4257 12052 -4103 -8837 -7288 -8348 -10776 -8027 362 6299 4204 841 4467 588 1173 -1110 -6036
4242 -6036 3848 4796 2225 1941 -4840 -13965 -7359 1365 -2370 -602 2016 227 -4392 -3551 -2009 -1452
4226 -1452 -3046 548 -2759 -3726 -3447 -2158 -1460 -2038 -3472 280 681 -3719 201 -4355 -13571 -7514
4210 -7514 -4037 -5034 -12059 -10895 -2882 -2559 -4331 -3030 -10360 -14267 -11441 -12307 -7944 -3810 -6848 -6154
4194 -6154 -639 401 -3193 -3577 725 3996 121 -4787 -3374 -584 -2013 3656 1290 -4261 -1369
4179 -1369 -2549 -4486 -6932 -4124 1842 2677 -2393 -4311 -7933 -11013 -8913 -6298 -3152 -597 -4063
4164 -4063 -1309 1985 3470 1902 -5101 -3148 -2496 -3786 -9295 -4653 2989 506 -4076 -3389 2104
4149 2104 5153 4536 65 -3631 -2943 -6552 -8776 -8869 -5603 -3146 -740 1042 7485 13527 12355 5980
4133 5980 2109 395 -3621 491 -1207 -7604 -8225 -8151 -9527 -8298 -5966 -7887 -1927 8103 9766
4118 9766 -261 -4238 -4657 -1245 -4954 -12659 -7653 -3234 -4187 -8212 -6252 -4181 -6410 -11390 -14506
4103 -14506 -5946 1438 -1667 -4792 -3309 1093 1896 -1016 -2450 -466 -1651 -5626 -11797 -2503 3416
4088 3416 3166 5167 6670 2754 2357 5235 7301 -1086 -1573 -699 -5348 -7907 -6729 -5592 3594 12267
4072 12267 12118 1843 9328 10121 7600 3911 4378 -2480 -6229 -6900 -1862 -1714 607 -5129 -4603 -576
4056 -576 2946 4282 3735 2166 4655 6254 -576 -5486 -9694 -10908 -6780 -5306 -4013 2642 -347
4041 -347 -4311 -10375 -8425 707 -1405 -8049 -7646 2715 9968 10945 10151 8397 9298 4412 347 -5026
4025 -5026 226 3666 7527 8966 4733 -1258 -5596 -7859 -8352 -10785 -5183 -6369 -3700 -4917 -5369
4010 -5369 -3930 3093 7779 9715 12053 11224 5691 3130 4186 2032 1568 3370 958 -524 942
3995 942 3208 3380 -5518 -5869 -5354 -2437 -828 -2890 -2940 -9041 -14837 -15255 -10341 -2654 1783 778 -4171
3978 -4171 -1144 4017 1225 -423 -169 -1742 -1663 2333 -362 -6922 -5337 -1821 178 -356 -5339 -3505
3962 -3505 -4215 -11894 -10821 -8113 -5163 -3161 -5696 -7263 -5139 -3334 -4587 534 2963 -4449 -14003
3947 -14003 -14614 -6589 -6914 -10590 -9599 -11281 -7504 -7026 -4929 -2790 -1675 5561 4782 -1219 -4886 -7293
3931 -7293 1113 13258 11637 4686 2207 -1217 -4232 -2464 -5086 -10168 -8792 2111 10003 6496
3917 6496 -1348 -328 2253 -1365 -3481 -2371 -2864 -10098 -19559 -19120 -9685 716 2467 -1081 -6654
3902 -6654 -8430 -4912 -5123 271 432 -2939 777 -5485 -11146 -6430 -7214 -9028 -4602 -4249 -8992 -7820
3886 -7820 -2007 -1828 -670 -154 -2148 -4702 -2828 -3910 -1201 8647 8040 1581 1499 -2478 -2681 -2023 -3059
3869 -3059 -10354 -14726 -12466 -10490 -9927 -1652 269 -1253 4824 7052 6103 5321 820 -5899 -7740 -2500
3853 -2500 -1093 -779 2207 9507 11927 9792 9362 11273 9822 8579 9186 7182 4854 1391 -1235 -400
3837 -400 -4160 -5462 -7379 -3167 -3842 11 -745 -2580 -222 603 -5450 -7987 -11484 -6351 -2248 -9722
3821 -9722 -18230 -14981 -8921 -533 2587 -268 554 -3327 -9601 -9392 -8649 -5421 2577 1996 2320 919
3805 919 -3383 -3068 3346 3705 8987 5851 3394 2661 -6259 -13094 -6775 -2634 -1730 -1323 1583 651 -3118
3788 -3118 -3420 -1162 -5139 -3742 -8039 -7720 -880 -308 -3317 -3236 -9000 -9500 -8868 -12189 -7865 -4859 -5843
3771 -5843 -12010 -6976 -1289 -2628 -6009 -11071 -8511 -4958 -4017 -1648 -3825 -10115 -12974 -14909 -14910 -12922
3755 -12922 -760 1776 3827 5806 5291 5964 4760 2093 3869 -3465 -7583 -8429 -7542 -9575 -11055
3740 -11055 -7064 -4143 2163 -1815 -10513 -8941 -11177 -14738 -9874 -9746 -9900 -5631 -2932 2455 6821
3725 6821 653 -3801 -1208 2253 -527 -5444 -7833 -7647 -5113 -7639 -3747 -4360 -13646 -18750 -24144
3710 -24144 -14806 -10859 -11272 -11739 -15165 -13484 -11542 -10762 -6284 146 -2853 -2315 -10005 -10816 -10195 -12130
3694 -12130 -14969 -13315 -12768 -7638 -6141 -17705 -20479 -8554 -38 236 -552 5669 7434 8734 3373
3679 3373 1533 3555 -1530 -3439 -10174 -6777 -3190 -20 4273 3130 922 3673 5258 2769 4371
3664 4371 -4311 -10275 -15455 -9586 -5933 -6795 -11405 -9289 299 3025 3264 4830 8325 6433 5509 4571
3648 4571 4947 1745 -6155 -11287 -11371 -7818 -1927 -2627 -4762 -2618 -2880 478 -3969 -8282 -9713 -9039
3632 -9039 -9124 -8779 -8661 -6297 -4604 -4946 -9211 -12598 -17978 -15585 -7790 2875 3274 3819 4234 3088 -3224
3615 -3224 -6135 -3277 -2127 -6457 -11181 -15823 -19555 -13081 -3973 -4124 1083 -1506 -4086 -4452 -8659
3600 -8659 -4704 3079 1343 270 -9644 -15725 -14141 -7819 -6526 -934 -2244 -10163 -8194 1040 2430
3585 2430 -5895 -4402 1555 43 -6765 -6592 -2243 8014 7046 5649 9588 3879 344 1874 4129
3570 4129 6135 7773 3149 2127 2217 -1607 -1780 1409 2965 -2054 -9346 -1060 7680 3655 -2674 -3325
3554 -3325 -5026 -3670 -1534 -3361 -4224 -10528 -15599 -15785 -11348 -5393 -3185 -1350 -2373 -4397 -7312
3539 -7312 -8152 -1002 -3271 -7885 -6494 -5630 -2189 -6328 -12660 -11867 -13169 -11063 -12508 -14293 -15478 -11085
3523 -11085 -12016 -13044 -6864 -10241 -5584 -5286 -6694 -5290 -2217 -3502 -6716 -11012 -6062 -298 -7545
3508 -7545 -8276 -4154 -3482 3046 12201 17588 12541 3876 2714 1680 2146 2371 4926 5612 4797 5443 4081
3491 4081 523 553 2577 -1939 -4914 -11437 -7208 -4438 -5760 -6002 -13047 -7157 -1700 4598 5723 1617
3475 1617 -904 -2171 2530 5513 5356 6747 55 -2693 -3312 -358 2191 -693 -6129 -6426 -8809 -13584
3459 -13584 -7268 -2542 971 -312 1941 -2965 -7499 -8026 -2569 518 -5988 -8547 -9840 -12487 -14150
3444 -14150 -8606 -7105 -4047 -5233 -5630 -2982 984 -520 -8091 -14077 -16626 -11564 -6990 -5173 -3227
3429 -3227 2177 1124 -2304 960 2980 4639 7622 13418 9291 4528 -694 -4823 -4547 2240 -1949
3414 -1949 -5292 -9276 -15219 -12234 -5444 -5629 -4205 -793 -877 -1658 -761 -385 2997 1233 -3660 -2273
3398 -2273 -7852 -11684 -10326 -9547 -9888 -3544 360 3233 5694 6198 708 1511 2295 3066 -1777 -1249 128
3381 128 -136 2701 3637 563 2382 2254 -105 -4432 -6855 -3248 -2016 -2627 -2959 1145 -483 -3370
3365 -3370 -858 2873 4598 -874 -9811 -8142 -5798 -2615 -761 4073 4797 1917 -2663 -7714 -8244
3350 -8244 -6624 -5070 -8635 -5547 -259 5837 8732 8130 811 -2158 -674 -421 -1104 683 93 -5648
3334 -5648 -8399 -3292 -1649 -6390 -14754 -20275 -15266 -10862 -8472 -4863 -3982 -6413 -6424 -3179 5269 5448
3318 5448 -587 414 6134 6096 2747 2943 1009 2184 -3292 -4086 -4615 -3499 -2251 -4337 -11058 -8222
3302 -8222 -7854 -2323 -75 -1043 3116 1205 5043 14162 11742 2620 -1631 -13 201 1306 604 6266
3286 6266 1505 1353 2425 2576 6155 2286 3752 3255 2977 407 -354 6153 2373 -3045 -4464 -3050
3270 -3050 -8318 -13959 -19589 -12660 -7761 -1050 -1717 -4112 -9718 -7708 -5855 -5819 -5637 -543 4545 4291
3254 4291 1424 1222 1192 -604 -11692 -12965 -11768 -10207 -9862 -8583 -1714 1055 -823 -9154 -8826 -666
3238 -666 169 2906 8048 14736 14895 8301 3260 -2562 -11038 -7510 -6108 -4201 -6115 -10642 -11976 -8917
3222 -8917 -5722 -8470 -11797 -11937 -7343 -8315 -8414 -4007 2053 5176 10509 7256 6160 4710 -4620 -15004
3206 -15004 -13489 -6567 -5458 -5540 -2709 1150 5626 3460 -235 -7792 -8572 -2332 2050 3382 3304 3486
3190 3486 1660 3014 -3258 -679 1472 2463 6726 10427 13315 13313 8215 6361 11115 6805 -1212 -7763
3174 -7763 -10781 -9618 -3730 -767 1362 -4288 -3215 -1266 -1486 -2014 2779 8796 12198 5301 -7817
3159 -7817 -11196 -14070 -8275 -10017 -2912 3949 5064 1457 180 -6949 -6763 2071 7581 6863 357
3144 357 5698 16740 14027 5837 -945 -4638 -7 4386 7261 4063 -3382 -3332 -3214 -3428 -1469 1545
3128 1545 1872 7114 4985 6959 5257 -5182 -12485 -5590 2078 1872 -1336 161 3824 2964 1992 6055
3112 6055 -1179 -5939 -6808 -9144 -7879 -7630 -6463 -3762 -766 123 631 1479 -841 -3733 621 4626
3096 4626 5057 59 3079 5589 3443 -3202 -4482 -9592 -7729 -11554 -15948 -12945 -10303 -12515 -9597
3081 -9597 -5723 -6994 -2084 19 1376 -2835 -7089 -4020 57 -4216 -5292 -3402 -619 2270 5244
3066 5244 5350 9939 -164 -3123 -2866 -3271 -11479 -9853 -2439 3735 3826 2518 -3554 -4728 -3195 -336
3050 -336 5266 -2172 -2506 659 -4349 -354 4442 7335 5586 -592 -3852 3489 7193 7136 -3559 -7294
3034 -7294 343 3400 -1108 -4426 -3636 819 -477 -4277 -8950 -11462 -7274 -4697 -4343 -6032 -3493
3019 -3493 -3524 -7205 -7542 -2736 -1216 -5984 -9520 -11092 -11723 -4044 -1513 -2153 -2019 -1202 -4895 1069 -3132
3002 -3132 -2290 -3666 -7528 -5448 -5933 -4793 -2800 -2796 -3483 -4292 -7268 -4997 1587 5645 607 2046 6652
2985 6652 10264 10362 11871 14239 4975 -2241 -6243 -8075 -1543 2893 -3896 -2724 2386 5383 2004
2970 2004 -686 -3472 -6695 2030 8699 16481 11215 7026 1189 -4266 -3177 -540 -5538 -5294 -5292 257
2954 257 1584 -2419 -109 2859 121 1257 3549 521 -3076 -13334 -9503 -2391 3129 8782 8157
2939 8157 4839 8334 6047 2063 2204 -4694 31 3821 6773 3077 -8220 -6745 3194 3572 -26
2924 -26 3386 7005 6089 4575 6972 8610 7984 17046 13596 5327 827 -274 587 1995 17 -3554
2908 -3554 -7555 -2396 -2084 5335 6566 1442 -7193 -6753 -3669 7099 6677 4232 7016 9953 4609
2893 4609 2576 -2034 -7065 -4647 -7535 -10587 -10439 -6435 -1747 5023 660 -261 1812 5782 4041
2878 4041 595 379 -7025 -4749 316 2113 -817 -2100 3344 -540 -4714 -48 5080 10613 4298
2863 4298 764 -6685 -9994 -2171 -3133 1129 1624 4837 6642 3974 1911 95 -180 6105 3068 1480
2847 1480 1714 -329 2684 5144 7672 12416 7736 -159 -6746 -2672 7543 7293 5577 606 -8450
2832 -8450 -9683 -5188 3074 -1101 -2902 3146 -2126 -2189 -6953 -8852 -6639 -3843 -2619 6202 12942
2817 12942 10136 6287 11166 6990 2210 57 2106 1044 -1142 4193 4060 3160 4421 7269 3838
2802 3838 4686 6116 -2195 -7162 -12340 -9969 -1554 4857 -807 -2596 1943 1174 4574 2736 4461
2787 4461 5374 2449 1105 2384 1797 -4085 3175 12353 9276 6144 7037 2060 -2066 -3696 -3625 -3436
2771 -3436 -6077 -3034 -4945 -9830 -8780 -6623 -591 -2604 -6158 -553 -2622 -4615 -3009 -3402 1669
2756 1669 -1013 -1190 -931 4742 1211 -1016 -3258 -7346 -13534 -10926 -6847 -10527 -10943 -5164 -5408 857
2740 857 799 -3324 -574 -6091 -13198 -16156 -15031 -8902 -5764 -7720 -9893 -6329 2814 5172 9030 5906
2724 5906 10036 14369 14935 11561 5531 -220 -27 5075 17559 17136 15140 12756 15332 20147 15468
2709 15468 11747 13698 7933 2819 -987 470 494 3616 8379 7878 3400 -2418 -4313 1314 -180
2694 -180 524 2992 3921 348 564 6143 10521 4345 -9 -1950 -2101 -3915 -2022 -1104 -3469 2463
2678 2463 3877 4990 5940 2161 -419 1973 8525 10317 5951 5087 7640 4433 4073 3257 6089 4030
2662 4030 -3119 -5647 -2582 -1935 -6823 -6715 -1345 -2706 -5632 -8684 -16531 -19780 -9238 1430 -1831
2647 -1831 -7094 -10175 -8273 -2787 -11360 -6665 -1891 5344 5552 -1670 -922 3261 12409 8669 -8647
2632 -8647 -10883 -10776 -6140 4786 14972 8956 -1012 -3115 1341 -3486 -3316 -1452 -5007 668 -14
2617 -14 -4898 -2808 5157 10558 5516 -241 1675 740 -1853 -3364 -2885 363 -2461 -3327 -850 -7278
2601 -7278 -17036 -13038 -3092 1979 3254 5082 377 4637 7751 6787 7725 7229 9011 7757 6937 527
2585 527 1177 7900 13817 12596 4851 -2995 4335 7442 7846 13390 11974 7934 9979 8948 4810 -3441
2569 -3441 -10075 -4102 -262 -4325 -6904 -11886 -4368 1363 3326 72 492 -2245 -2070 -2592 -6724 2336
2553 2336 2857 1603 4178 3788 1836 206 -3901 -6908 -7475 -1080 -3303 -5041 -8355 -13689 -13021 -7848
2537 -7848 -5086 -5034 -6334 -1208 -3754 -10533 -13965 -8700 -6288 -4025 -3049 -232 -938 4531 9852 6389
2521 6389 6588 14567 11009 6403 8676 11619 10353 -1186 -9528 -1087 2098 1178 1785 -624 2113
2506 2113 1966 298 2359 4295 15166 14528 13820 13021 13989 11302 12102 7945 -2454 4523 6341 -2524
2490 -2524 -7027 -1446 4397 8140 10554 10512 9660 7583 7210 6819 2316 83 -2322 -1833 -1960 -3154 827
2473 827 2170 -423 -7004 -4273 -7260 -8669 -1710 5914 5499 -2430 -2667 -2345 1125 8605 13750 13933
2457 13933 9116 4762 3142 -5128 -7794 -2681 3119 3596 9252 15114 8866 10149 9942 7899 9314
2442 9314 640 -5143 -3949 -2728 -1285 -4105 4408 9610 12937 8535 -1929 -6239 -7543 -4783 -2575
2427 -2575 3556 2223 939 -5427 -4716 -7 -2238 -3702 -6539 -7447 -7644 -2803 2166 4001 108 -3533
2411 -3533 -8707 -8756 -7454 -579 3180 7352 3360 -6060 -2800 3218 -5556 -2955 -1568 -3044 -1483
2396 -1483 403 773 2702 10493 11081 8303 4711 -560 329 3260 5990 2478 -2639 -4732 -5352 -12256
2380 -12256 -19289 -12301 -7357 -5266 -8160 -5305 -4476 72 -18 576 2936 2693 -3639 2218 -2979 -6010
2364 -6010 -604 7363 2355 -5547 3393 9 -3909 -3508 -1166 -7087 -9929 -5568 3332 5055 4922
2349 4922 3267 4436 4394 1268 -3585 -5628 -5291 -7797 -4127 7266 10240 6992 -1519 -5984 -4036
2334 -4036 -1269 -3662 -7005 -7948 -9826 -11063 -3644 2923 5459 4697 -2197 159 -7373 -10561 -3420
2319 -3420 -828 1781 6602 6241 3318 -1002 1275 -1824 -4230 -658 -1188 1413 6226 8336 5459
2304 5459 1214 1886 5087 192 1517 5456 7839 2656 -306 -6194 -7001 220 8382 12300 6922
2289 6922 -887 -6655 -7230 -4098 1427 4412 3039 -3596 -8528 -9351 -6719 4243 4425 9935 6597
2274 6597 -5171 -3065 4013 5701 -83 -1402 -3054 -4405 -7440 -8509 -7447 -6212 -7352 -5777 -6373
2259 -6373 3361 6919 3978 -504 5561 2233 -3510 393 2479 6570 11196 13113 8192 6774 2431
2244 2431 1363 7476 3786 -4366 -11533 -7750 -6952 -4137 546 -4691 -7978 -4378 -5194 -5861 -2589 -2054
2228 -2054 -2559 -2655 -5874 -3185 -6453 -6496 -5162 -3211 -5651 -3428 5763 4863 2695 -4740 -930 898
2212 898 2736 2375 5550 11338 8772 6569 7691 7960 8791 9733 7224 2412 2798 1697 4479 1550
2196 1550 8203 8464 6930 8385 8136 7515 2980 3681 2078 -569 1776 4138 -1538 -3846 -7034 -1479
2180 -1479 2901 5818 6238 4044 8170 8615 6586 -3729 -5201 -6091 -9728 -9786 -7373 -4854 -2851 -7951
2164 -7951 -10720 -11395 -11716 -7488 -5435 -10092 -10333 -14246 -19129 -22140 -19630 -13561 -6072 -235 2744 698
2148 698 -1244 -1247 -853 -3411 -596 2694 3482 2345 8938 13540 5405 3810 280 -3787 -2209 -2366 -2702
2131 -2702 -1667 4598 5374 1868 -6522 -9368 -1169 4355 4634 -180 -5494 -9157 -2332 955 -6305
2116 -6305 -7362 -4074 -95 3980 1157 -3688 -567 374 -3485 -2086 2077 -960 -426 4185 5350
2101 5350 4369 5014 696 -5616 -11925 -5804 -1725 4013 2907 2830 1421 2054 -8569 -9568 -1147 4070
2085 4070 7288 12602 11386 1944 1822 364 -1589 -7238 -4839 1098 811 -1398 3139 5827 1671
2070 1671 -3522 -3085 -1234 -3325 -3290 -6436 -2832 3062 -46 -3859 -929 -3550 -6001 -6070 -382 -3209
2054 -3209 -4780 -6710 -11680 -17212 -6593 2872 9309 10449 13805 12284 12074 4401 2637 8476 7537
2039 7537 690 -1564 4670 637 4823 5178 1790 -3527 2045 6448 1266 4028 89 670 -1187
2024 -1187 -5211 -1569 -491 -4598 2178 -368 296 2391 2972 2750 6739 6985 2826 4274 6984 1602
2008 1602 231 382 7573 5789 8015 7109 10055 6038 2112 1263 2415 -1363 1554 1622 936 -927
1992 -927 -9716 -12985 75 40 3919 7156 5574 7033 4066 4804 3316 -1753 -4299 -8836 -10716 -8772
1976 -8772 -6751 -12155 -19042 -18340 -15379 -10478 -11472 -10857 -7358 -2856 -1272 -11 -1110 -1714 -2960 -5719
1960 -5719 -2273 -1284 2162 4717 1051 -4256 552 111 -5619 -2723 -3888 -9319 -6089 982 -1453
1945 -1453 -1911 -2209 -2130 4529 3076 6453 2714 -3766 2539 6157 10668 17392 8496 -3139 -5576 -6037
1929 -6037 -10400 -10195 -2026 2364 -5965 -6781 -3483 -1017 -2992 -6461 -494 5441 7189 4428 -27
1914 -27 -3448 3552 7001 1996 -2533 -5653 -4447 -9007 -8912 -8626 -3646 -8462 -12821 -7003 -4788 129
1898 129 1641 3153 -1241 1452 -1974 -1887 2620 4040 -334 -401 5236 2231 -3834 -5546 -3247 -2056
1882 -2056 -2984 -265 4649 2216 -4774 -6439 -1154 6785 6683 3393 6154 13464 11681 4523 2835
1867 2835 5004 8503 6866 1857 -1753 -4045 -6298 -10278 -13556 -12743 -4437 -768 -2816 -2356 -7390
1852 -7390 -5756 -7631 -8656 -2507 3794 599 -2478 254 1323 -1112 3216 9545 8076 3677 -334
1837 -334 2185 2309 2545 5336 7432 824 -1440 1248 2245 7348 6736 1073 -2967 3431 10026 8441
1821 8441 1667 4193 4730 -1669 -804 288 -1227 -4740 -6229 -7675 -4690 -3935 -9079 -8249 -6032 -7304
1805 -7304 -7432 -1397 2917 -1359 1165 -210 -7339 -9390 -7645 -4691 -9154 -8615 -380 8274 8657 9721
1789 9721 7628 10360 7429 3855 2062 5101 6615 3105 -3966 -526 472 7729 3320 -3900 -6237
1774 -6237 -8334 285 -1258 -4437 -2729 -4976 -14871 -17629 -5287 -3509 4412 9423 10097 9197 10528
1759 10528 4636 -985 735 4588 -2029 -7395 -928 -1420 79 1696 880 -4315 -2096 -153 -275
1744 -275 -1694 -4359 -7037 -1494 5454 244 -2648 1570 2520 2715 5602 4015 -1553 -3031 -1223 -4429
1728 -4429 -5693 -5478 -3018 546 679 4361 5444 3537 -3760 -6337 -2564 2041 -7 -4655 -4192 1552
1712 1552 -1025 -5620 861 6800 9937 14108 12346 9565 8782 10434 8925 8423 6531 7035 5875 -1967
1696 -1967 -5669 -16371 -9201 659 -2514 -3767 -3441 -613 3389 8220 3413 5844 6524 5866 13656
1681 13656 13645 12625 12417 11300 6440 11337 13049 9807 9676 8111 8921 3632 813 -2509 -6717 -6468
1665 -6468 -4713 125 7729 8073 4700 2247 2273 1791 2496 -4431 -3367 -2449 -1867 1599 6881 2234 -3136
1648 -3136 -5299 -2743 -2189 -1295 -7670 -2979 3007 4858 7632 7320 11007 9622 12149 11964 11165 9082
1632 9082 4082 4089 1163 824 3391 12124 15551 3405 -1326 -3702 -9894 -3793 -2165 -2978 1682 387
1616 387 3547 901 -1386 -1129 2683 724 -5421 -1167 3825 -1908 -5448 -1236 -3545 -2255 -5298
1601 -5298 -6378 -6488 -1636 -102 1775 3514 -3623 -1005 2336 4251 5842 6158 3120 1043 286 -2152
1585 -2152 -1728 2632 -2520 -6050 -5974 5332 8149 7331 12819 8200 -2101 -6493 -3515 574 5722
1570 5722 9031 5359 7046 4490 1589 -445 -12089 -12886 -9468 -7379 -7960 -4294 3062 -5759 -9775
1555 -9775 -8276 -3995 1654 2814 -369 -917 1077 4985 4300 3049 6354 5917 -4258 -1414 -3691
1540 -3691 -7204 -7004 2103 5749 -537 1726 -1390 1990 3050 1534 -2201 -1158 6656 8907 5368
1525 5368 12061 16032 9080 4863 5634 238 -3752 2401 692 5538 10655 2913 -2993 625 4279
1510 4279 5646 4730 -692 -3930 -3455 1153 3874 3015 -4717 -5489 -2679 -5385 -12715 -17137 -19159 -19240
1494 -19240 -14221 -2970 2984 -1040 -4981 -6173 -4661 -3867 -7410 -7334 -3480 3534 8476 12310 6412
1479 6412 -3367 -4397 -2149 -885 5825 6975 3746 678 166 806 533 -630 -968 -135 1333 3241
1463 3241 4046 2853 3426 763 1854 3250 6355 662 1447 628 -1122 -5329 -10874 -9619 -6791 -2972
1447 -2972 831 983 -4432 -655 930 -1220 -7868 -6320 -204 -619 -732 1903 6685 8021 3301 1109
1431 1109 2942 11152 11413 6259 -1766 -3779 194 1812 326 -249 2528 1519 4428 -602 2289
1416 2289 3671 683 -518 -2535 4444 11840 9995 16293 13874 11259 8796 8403 4219 2982 -281
1401 -281 -3353 -1416 -1493 302 4104 6846 7995 8945 8988 8993 1750 -4330 -5279 -2411 4421 1814 -3646
1384 -3646 -4293 -9266 -6582 -717 5237 1924 -408 -2546 2209 1853 -4674 -1548 1771 -2325 -4227
1369 -4227 -5551 -7304 -4190 1505 8797 6384 339 -302 638 447 -4732 -6453 2012 4336 7600 11133
1353 11133 8927 2179 4842 5127 347 -1391 1158 -3274 -6695 -4074 625 3486 3137 5221 2181
1338 2181 5466 6467 4269 2028 2598 4524 6389 10593 8609 4733 -1517 -2661 2843 3431 -2749
1323 -2749 -3067 5706 9278 8908 9723 5046 6616 9894 9816 4562 -7658 -11906 -2678 -454 -4763 -7038
1307 -7038 -5652 -5146 -3214 -1710 4618 5648 6418 5622 -1206 1704 3260 -2861 -7255 290 7108 7124
1291 7124 2061 -5714 -4320 -1114 5479 5224 6342 13383 17809 16289 11887 10203 6031 -3393 -4100
1276 -4100 -4155 -366 -3376 -5660 -3230 -2441 917 3267 2769 2802 4278 8589 13630 19008 15477 12362
1260 12362 13036 13735 10530 5285 -5214 -3195 -7119 -7771 -2002 9162 7073 2911 6236 2182 2432
1245 2432 1627 5996 8747 8846 12430 12360 7584 3046 1792 -4377 4142 3884 -126 -5193 -3542 -2672 -1328
1228 -1328 -3225 -1772 4198 5140 2013 -6225 -12265 -12775 -15047 -14258 -8983 -936 -879 7574 7892 11897
1212 11897 17227 11232 9456 9297 6561 6149 -616 -1479 5685 3178 2188 4606 7297 5904 9540 11619
1196 11619 5419 -91 -3556 -2712 5078 5655 936 3248 8392 10797 7946 5351 6802 7506 4241
1181 4241 2691 -2546 -216 1100 5718 8661 13528 5605 -3565 -11798 -18772 -21458 -9957 2596
1167 2596 714 -4469 -2391 -1733 -6854 -8062 -6907 -3349 6446 8500 9847 5598 3506 3463 585 3395
1151 3395 3054 5109 6372 11813 6649 2115 -3304 -6674 -6116 -3842 -2693 295 2644 746 -3380
1136 -3380 -2568 4099 2223 -4493 569 1905 -312 3180 1239 -2891 -5063 -937 2331 4157 6069
1121 6069 3285 -792 5994 10812 6011 7408 6777 7972 5218 -634 1417 6016 5442 1061 -5767
1106 -5767 -9489 -12329 -14401 -15631 -16566 -12133 -9319 -3006 -674 3653 12212 8641 11228 1703 -5869
1091 -5869 -1251 -748 -3345 1724 8299 -837 -6760 180 -1641 3669 7956 8553 6479 -2454 -2945 2394
1075 2394 5263 -985 4299 6537 7680 8577 5727 4762 5565 4252 350 -2534 784 8945 8759 8718
1059 8718 5161 7469 9499 2386 -537 3421 4132 1697 -255 -25 780 100 -3493 -4627 -2140 -3019
1043 -3019 1263 9287 6922 -2201 -1683 1316 8037 6930 10341 8531 7257 8523 15674 8212 4244
1028 4244 2027 6705 9007 6402 1288 -4199 -2343 -7852 25 4560 2374 5056 14448 10636 5305
1013 5305 2731 3802 5380 984 -4699 -6804 -2655 -342 3313 7843 13109 3434 -2515 -5914 -11141
998 -11141 -6754 -5198 -505 -1611 -2985 3110 -162 -4002 -1305 -1977 -1117 -2005 -2886 3611 8105 914
982 914 -4483 -5668 -8955 -7586 -2652 2697 2586 911 -3576 -5768 -1676 11057 13733 11264 7028
967 7028 7108 8471 8209 9507 11363 8571 4632 4477 13009 13715 12842 13880 13972 14579 5981 5222 8281 5781
949 5781 3957 -3064 -5456 -5251 -5176 2408 2595 -187 3966 -427 -7966 -10239 -1214 4403 -1403 3438
933 3438 8701 8519 6262 8025 9028 1874 -2873 -7459 -6084 -3596 -2485 1673 8308 9452 5326
918 5326 2666 4360 10732 7475 -29 3603 9409 4999 764 5612 6285 7342 7471 8181 4043 3521
902 3521 5072 6145 11961 13391 10292 5112 3624 4734 4012 6197 2406 -5593 -5656 -1124 -2244 -8996
886 -8996 -5523 3590 9396 4739 773 1376 -1454 -2283 2812 -3980 -4935 -2878 -8139 -13277 -11975 88
870 88 3646 -250 -3083 -2789 -1899 -2990 371 2283 -1061 -381 -7130 -5806 1917 3842 495 -2056
854 -2056 -6223 -7856 -7843 -4233 -2328 -5346 670 8271 5804 11014 14298 12731 10249 1708 -6675 -1640
838 -1640 7926 6238 5191 4606 5296 -909 -770 949 3486 6556 -301 -5158 -4082 1652 2182 -2695
822 -2695 -1113 4565 -686 -6741 -5916 -3339 -898 -418 911 -142 5256 7853 8297 7093 7061 11782
806 11782 18129 19318 15686 12388 1570 -4594 -1772 320 -258 3026 10177 10084 8017 3786 4081 425
790 425 -1422 3383 4091 -1741 -3300 1605 -1422 1170 2461 2781 12181 7752 5662 10864 5637 5119
774 5119 9280 7820 -224 -4787 -6128 -11345 -9476 -5195 -268 2158 2945 4054 5436 11833 11327 17434
758 17434 16242 11850 7786 5672 9571 10901 11628 7192 6894 10713 12815 3994 -7129 -7970 -2517
743 -2517 -1411 -8069 -6803 -5575 -7782 -9247 -7094 -3945 -1379 4161 5286 8335 11367 7904 5551
728 5551 9043 15550 15444 16984 18995 19964 15945 14453 17851 13656 10016 12326 12580 6875 8180 13057
712 13057 7732 1997 3774 6340 6536 8652 7010 1196 -2055 4832 3793 2698 9202 11933 -84
697 -84 977 11292 14159 12282 4998 9450 16097 18758 20553 17133 9123 1329 12432 16113 13549
682 13549 8073 -4501 -9756 -8531 -8615 -1400 6805 6684 6865 4226 1029 7553 13814 15115 9719 6949
666 6949 4327 -494 -3769 -3775 -4542 -204 2567 3961 8253 12638 10364 6517 3946 6655 9396 10922
650 10922 2467 -3198 1571 9911 11393 2757 -1345 -823 1667 -2353 -3096 200 1420 8009 14258
635 14258 9217 6115 5422 1414 -2798 -2968 -2680 669 3797 5536 3404 1116 3534 2128 -626 -621
619 -621 -2002 -2021 2048 7363 12632 7013 1766 1654 2031 -7396 -2842 1036 1772 -2617 -676 2168 -2773
602 -2773 -6786 -10638 -15823 -12154 3030 1431 -5305 -6339 3528 7136 2696 3060 -1913 -7812 -7688
587 -7688 3261 4414 -1511 -1626 6094 13080 11104 14080 16988 16814 18404 18487 13195 12020 13948 13169
571 13169 14376 19253 14882 5845 1542 3277 1192 -1599 2237 7754 12206 12452 10743 7215 9278
556 9278 5378 5668 5073 8135 8551 5630 -614 -1709 -498 -2726 -1815 1561 5270 3241 8679 8166
540 8166 7344 7057 2195 -4255 -912 6722 14010 9842 6742 4148 3235 -2118 -1422 -138 -2322 -102
524 -102 -392 10337 10623 7367 1777 -4555 282 2444 1735 6858 5811 7478 6004 5207 2685 2972
508 2972 8730 6489 4655 7477 8566 4163 2127 3543 9754 7170 2522 -2940 3528 11507 7134
493 7134 3945 6283 6571 7201 6460 7626 15274 14458 14333 11160 10378 6315 2650 95 -103 -1342 1959
476 1959 7738 13619 9422 3359 876 5302 9116 5339 3152 4993 6628 8677 7303 5306 -2440
461 -2440 -1086 2036 412 -4013 3049 9218 7833 9160 10008 8243 10789 11351 2750 4498 6370 1962
445 1962 -2580 -8408 -9735 -12542 -13745 -5031 4718 414 -3416 1985 4623 1417 -2272 -5491 -5697
430 -5697 -4591 -5719 -3330 250 2712 6924 8471 8516 6585 1251 -3945 -420 547 3746 3367 6690
414 6690 3033 3324 13058 14951 12516 15413 17366 16013 14136 10183 2140 4105 13788 19958 9982
399 9982 6214 9109 7307 14789 14991 8501 8805 5584 6852 -4157 -9828 -588 9050 8051 4201 6659
383 6659 9443 10532 6137 8473 5237 9104 17225 21257 17355 10152 10149 7255 4068 -142 1783 2907
367 2907 1218 6605 3677 10992 13935 9239 2856 8172 12157 9883 1172 1818 -1164 -1865 2885 1206
351 1206 1075 6913 7891 2686 5199 7952 9718 7806 9557 5280 5139 8759 6589 2189 9051 12409
335 12409 5811 5541 10131 13798 14762 5502 -3730 2581 1081 623 -165 -2840 1087 9222 18682 14423
319 14423 10967 15174 15192 18149 19058 8208 1299 4108 11525 11659 7477 5729 7625 8708 4856 3534
303 3534 5840 7349 11384 7929 2948 -570 561 2433 2128 -3452 -9065 -1831 -4381 -5974 3230
288 3230 13276 19851 17984 11836 7099 6276 6923 9113 10914 12110 9075 5059 3093 2327 3432 -926
272 -926 -424 -256 -1619 -4552 -2380 -3217 -1478 1417 2197 3547 9504 6881 4685 4889 4146 1773 5756
255 5756 5228 4865 5895 6302 3668 -3398 -3281 428 2111 235 -928 478 -1381 -1356 -1669 2918 9436
238 9436 13396 9619 4346 10680 11623 6619 -1644 1154 2690 1109 6507 9234 17138 21122 22273
223 22273 21243 14600 5527 4393 4074 5832 8294 11148 12164 11240 10534 8221 3213 5430 6070 3580
207 3580 6333 8775 935 2863 2277 4873 5730 7458 9227 12357 15520 16064 14949 14445 11246 7381
191 7381 5410 5738 5148 4870 3267 6563 9419 11072 11424 10086 5687 4289 3242 4146 -350 -4206
175 -4206 -1779 305 5034 5220 2203 -331 -737 -1761 -469 1034 -2682 226 3266 2505 -1088 -5843
159 -5843 -959 885 -2815 -3172 -5219 2834 1443 -3633 -2023 -2156 5110 5984 6082 10420 8844 10923
143 10923 6401 4033 3563 321 -90 -2191 1807 4238 -1749 -3985 845 2314 -1714 -6808 -845
128 -845 6860 3033 2086 2921 6883 1925 -123 1498 5767 9874 10344 10350 10661 10647 10455 5638 4536 8244
110 8244 9481 2515 2977 4233 5108 7826 6184 5654 3316 2225 4675 5208 5260 6075 5382 10608 10616 11023
92 11023 11344 9819 10269 10095 12970 12860 10640 8828 9551 10480 14310 14146 14241 14003 8416 8359 8961 13034
74 13034 13088 11896 9742 4006 4792 9174 12704 17767 15903 11336 3668 1900 6809 7893 3432 1163
58 1163 -796 4044 8065 8543 8941 7967 3642 -1928 -1063 1175 -1091 -1473 -88 1433 4327 5456 3124
41 3124 8288 12825 10252 7933 12516 13662 8689 5494 3564 5021 4379 7869 5798 3035 575 -563
25 -563 1721 5921 6979 8007 10494 6576 1194 -1647 2101 5054 5896 4696 2217 3265 6275 6529
9 6529 6560 11208 11676 8735 7476 6844 2422 360 -2221
0 -2221
$$ Imaginary data points
##PAGE= N=2
##DATA TABLE= (X++(I..I)), XYDATA
32767 45426 42069 42221 41844 43006 39405 41426 41471 40798 43842 45739 46085 47034 42478 39316 39992 44324
32751 44324 48282 46002 41546 39596 41875 41225 46018 49088 50458 48397 48728 51448 53046 53588 54179
32736 54179 57184 58732 56699 55815 62541 63658 58477 56672 55134 55418 60437 65887 69349 75123 72388
32721 72388 68447 63523 68630 72829 74120 72218 67373 65517 68664 70661 71882 72048 71156 72291 74236
32706 74236 70866 71430 70107 73825 80372 75739 76512 78968 71974 73970 71065 72424 75001 74432 80520
32691 80520 88473 92512 95593 91576 91482 88376 88580 89231 90367 92735 89387 91273 94753 96330 92544
32676 92544 92706 92347 92485 87018 87789 89178 91872 95178 97926 101609 97954 93635 96592 98602 99010 99285
32660 99285 102942 96549 93896 98464 101274 100762 103958 104270 106522 110016 109563 109360 108903 106177 105813 109220
32644 109220 119048 117487 114650 115374 115587 117686 116520 120030 118842 114608 112603 117240 112526 107601 111011
32629 111011 113624 112815 114313 114209 118918 119372 117113 116162 117782 121174 125086 125884 123429 122876 128066 126569
32613 126569 125487 126686 132549 134925 132133 128953 128710 128842 128174 130164 128801 125967 128196 126722 128014
32598 128014 131009 129773 128706 128336 131889 134931 137961 137815 139682 139938 141429 143771 143707 149208 150528
32583 150528 150364 145254 140308 146559 153702 153648 148886 151048 152002 144690 145271 155123 155438 158595 154122 150068
32567 150068 153567 150862 146027 148660 156046 156263 147845 149189 152991 151015 151989 154953 155590 149478 149948
32552 149948 149751 148949 150019 152560 152956 152345 156200 156285 162185 167948 167129 165097 166013 170734 173336 171377
32536 171377 170143 170319 169791 163537 164084 167732 172015 166953 160003 156773 153399 157485 163998 167499 174210
32521 174210 174574 167455 165883 166078 166130 170691 169912 173377 177073 176269 179118 182399 180669 177863 176927 176622
32505 176622 172680 174180 177831 178245 179273 183320 178437 170754 175501 179788 175606 172430 176640 177768
32491 177768 181388 185428 184218 188549 189189 184620 184367 190578 192426 192999 188230 182719 181851 184324 185790
32476 185790 185350 183416 182131 186338 197741 203807 204810 200781 198851 198772 195754 190866 189382 190951 191933
32461 191933 187949 185526 189591 196675 199659 197164 192202 191599 192480 191548 188381 180933 184444 181943 180547
32446 180547 188485 194235 191793 191951 196251 193359 189096 197200 198080 192851 191027 191197 199355 204700 204531
32431 204531 205256 201456 198979 192912 196657 197739 196245 199597 194670 196844 198660 198533 198649 198204 197979
32416 197979 195371 195669 202403 206009 204560 203769 206540 206331 206699 209952 207874 207998 207722 203135 201918 200467
32400 200467 199693 203017 203570 199566 199947 205362 211262 210120 204771 208610 214934 212313 208314 205965 206193
32385 206193 209241 211088 217620 221300 220412 222249 219415 216335 214798 214043 220824 223086 225588 217978 216504
32370 216504 218635 216906 220308 219933 219602 218800 215493 218747 220731 217761 213360 216833 221511 221456 214877
32355 214877 204647 206976 208336 207610 205421 205453 210092 214285 209455 216871 226409 226300 227257 226609 219132
32340 219132 222778 216345 214088 217494 223520 224963 222123 227068 232378 225138 216915 218191 219536 217616
32326 217616 218979 215809 219205 220508 223645 226088 226250 226148 227896 233016 232407 227515 230308 232463 233596
32311 233596 235664 230215 225596 220735 223573 223361 216481 213414 218739 217812 221943 225084 221225 220662 218881
32296 218881 221923 221582 219495 219449 222078 225490 223458 219926 218792 219136 221788 226169 223627 226048 233577
32281 233577 229665 226659 224409 223687 227421 227927 229012 229709 223935 221806 227333 234767 238486 237831 237570
32266 237570 237713 235053 227404 223659 225042 228013 229171 225889 230342 228427 230065 232231 237459 242490
32252 242490 238514 233594 230555 231235 232837 227304 225084 225419 222233 222522 225211 229039 232468 234355 231503
32237 231503 233611 236072 237996 233051 228862 227636 232442 231056 226009 220601 225241 230445 230670 227635
32223 227635 224100 224920 221360 226010 233639 236129 239122 238385 229828 230464 232255 239919 243247 238064 233271
32208 233271 226868 229268 232681 233743 236277 237843 238259 230620 231793 231396 229142 226136 219513 222682 228885
32193 228885 229312 233864 236710 229679 227985 229912 230382 226094 226607 227791 233459 231480 226996 228963 228298
32178 228298 230969 236123 229961 229926 234335 233929 232320 234049 235354 233142 234477 234325 224324 227833 235609
32163 235609 242234 242065 234724 222181 223315 230740 232550 228584 226539 229036 231824 229678 237410 243116
32149 243116 234869 224750 224964 232557 243979 254144 257108 248735 238931 239173 239727 243470 236834 229783
32135 229783 226834 234049 242956 247197 245942 248578 247971 242291 240202 237820 235577 239648 241007 232786
32121 232786 229587 234837 242400 243453 241982 236385 238726 233785 233916 237414 239693 239428 235133 238803 234595
32106 234595 228534 225595 221974 228583 226744 222700 225164 231384 233192 229577 230817 230585 230427 232858 237144
32091 237144 242660 244618 245359 237093 237159 234315 234865 229814 225548 227536 229330 237796 235845 230645 227477
32076 227477 229342 235737 237142 240580 238998 236118 237562 234144 233354 243786 242841 236103 238124 237744 235925
32061 235925 232702 228801 229087 226315 230570 238078 238630 237701 243597 244062 245189 244479 247564 249353 248443 239995
32045 239995 227168 227043 234043 240294 238641 230684 227980 229998 229686 236106 237150 236014 238372 240152
32031 240152 240158 240737 237502 232224 231905 235003 233709 234578 244431 238839 234759 236144 236985 240817 242877 247414
32015 247414 246368 241301 235101 229727 230963 235606 227818 232259 238775 243641 244352 239615 240039 234977 236737
32000 236737 242722 238591 236100 230577 228451 228531 233660 233222 230900 229375 226250 225258 226928 230740 227842
31985 227842 230844 237100 243336 237596 226750 231557 231003 232606 235777 239122 236664 235504 235577 236044 230607
31970 230607 229258 235904 237315 241759 240925 241982 237963 237394 236339 232158 234532 237842 235971 228336 224595
31955 224595 223702 228588 230668 229718 237615 242544 239818 241325 235826 233617 234004 237376 232805 231756 237283
31940 237283 243446 238110 234153 238407 245586 247995 241745 240367 242101 246511 249746 247771 241639 237785
31926 237785 232998 229772 232921 237161 240582 240750 235609 234831 236295 236614 236476 233301 232591 234355 232482
31911 232482 235215 241377 243224 238167 239117 241213 242500 240926 235283 237112 232615 233609 237370 235847 233776
31896 233776 234140 234794 238144 237807 239047 231417 230369 233421 231866 230300 234015 233365 235334 231685 231066
31881 231066 232792 231454 235439 237333 237128 239223 237734 244059 248386 242821 237174 240458 246790 251155
31867 251155 247626 248582 246533 241429 240286 247443 251033 242348 238731 245291 243986 240318 240331 237238 234737
31852 234737 236848 231614 234754 236259 233072 231850 230736 230317 229689 234965 235387 241435 241991 238886 242201
31837 242201 239843 240359 244696 252153 247902 245884 243715 238065 234836 236940 241315 234703 233132 235400
31823 235400 234829 232985 234657 234927 236707 234299 232232 234802 237290 234972 232744 230521 237844 243027 247004
31808 247004 242987 242279 245491 249372 247083 248294 244830 248288 244934 240830 237896 241158 243534 238479
31794 238479 235709 244559 247996 243738 243318 240064 233707 233040 230554 235801 238850 242721 241728 241298 237317
31779 237317 239339 245338 243817 239547 238959 235190 228938 229585 235208 239484 235313 229856 236796 241198 242448
31764 242448 239382 241978 244467 237965 231998 232957 238235 239523 241540 246971 250708 244780 244929 246931 243476
31749 243476 244834 242698 241551 248594 254856 242428 242620 237934 232243 233950 238100 242913 242933 241374 239985
31734 239985 246005 241707 240805 239964 236545 240809 246021 248559 253358 256078 252506 242865 235522 243472 244795
31719 244795 246127 247442 243971 238092 236916 241959 242769 241727 237329 241073 237358 234364 235819 236386 235421
31704 235421 236428 239079 241577 240463 235704 234284 237299 240643 238413 238305 240705 242849 235733 229251
31690 229251 225388 233619 237223 235629 233935 236518 239463 240054 238160 237967 235746 241266 240755 240812 237499
31675 237499 235570 239404 240973 240366 236406 235426 230740 232831 244667 244650 238635 240465 243350 242579 239907
31660 239907 241809 246843 246491 244663 238533 240784 239896 242010 238293 233684 233811 233946 235941 239734 246042
31645 246042 250913 252390 249967 247558 243258 244683 244768 239930 240190 237399 238657 235042 230607 233822 239062
31630 239062 233394 230815 234261 236896 240774 243059 242958 243196 242192 242701 251289 252909 245043 232349 229110
31615 229110 237227 240595 244163 244450 243392 244148 248450 245207 239500 232616 230689 238029 241653 241344 243093
31600 243093 246734 246244 249048 249267 249776 244056 240112 241215 238934 239011 242057 239117 234329 233829 236397 240018
31584 240018 244568 242255 241779 243037 238853 236767 240252 244771 241208 237046 236838 231245 232591 236560 239036
31569 239036 235165 234379 229931 235416 237346 224021 227338 225789 229438 234675 240373 241527 238654 235976
31555 235976 235208 236380 244286 246316 246622 248875 252360 255835 249983 244615 240745 240734 240337 235893 245344
$$ [...]
##END NTUPLES=NMR SPECTRUM
##END=
