##TITLE=Analysis number 323728
Compound Code cc 17502
Project Code adrs
Chemist Name prosynth
##JCAMPDX= 6.0         $$ Bruker NMR JCAMP-DX V2.0
##DATA TYPE= NMR SPECTRUM
##DATA CLASS= NTUPLES
##ORIGIN= Bruker BioSpin GmbH
##OWNER= nmr
$$ XWIN-NMR		Version 3.5
$$ Mon Nov  6 11:13:58 2006 GMT Standard Time (UT+0h)  MAYBRIDGE\nmr@NMR_250MHZ
##.OBSERVE FREQUENCY= 250.131544655141
##.OBSERVE NUCLEUS= ^1H
##.ACQUISITION MODE= SIMULTANEOUS (DQD)
##.ACQUISITION SCHEME= undefined
##.AVERAGES= 16
##.DIGITISER RES= 18
##SPECTROMETER/DATA SYSTEM= dpx250
##.PULSE SEQUENCE= zg30
##.SOLVENT NAME= CDCl3
##.SHIFT REFERENCE= (INTERNAL, CDCl3, 0, 16.522)
##AUDIT TRAIL= $$ (NUMBER, WHEN, WHO, WHERE, WHAT)
$$ ##TITLE= Audit trail, XWIN-NMR		Version 3.5
$$ ##JCAMPDX= 5.01
$$ ##ORIGIN= Bruker BioSpin GmbH
$$ ##OWNER= nmr
$$ C:\u/data/dgb/nmr/ADRS/2260/pdata/1/auditp.txt
$$ ##AUDIT TRAIL=  $$ (NUMBER, WHEN, WHO, WHERE, WHAT)
(   1,<2006-11-06 11:13:33.07 +000>,<MAYBRIDGE\nmr>,<NMR_250MHZ>,
      <created by zg, POWCHK disabled, PULCHK disabled
       configuration hash MD5:
       49 4B E0 1D 92 C2 6B 37 9F E6 65 BC 52 41 86 1D
       data hash MD5: 64K
       EA 66 FF 35 1F 38 02 B9 C8 8F 41 FF E6 52 39 4C>)
(   2,<2006-11-06 11:13:47.83 +000>,<MAYBRIDGE\nmr>,<NMR_250MHZ>,
      <Start of raw data processing
       ef LB = 0.3 FT_mod = 6 PKNL = 1 SI = 32K 
       data hash MD5: 32K
       84 6A 9E 7C 6D C2 37 E4 AD C6 0D 91 C4 19 E8 BD>)
(   3,<2006-11-06 11:13:49.47 +000>,<MAYBRIDGE\nmr>,<NMR_250MHZ>,
      <apk 
       data hash MD5: 32K
       AD 9E 55 71 48 AD FC 4F BF EC C6 C2 E1 CB 6A 37>)
(   4,<2006-11-06 11:13:50.32 +000>,<MAYBRIDGE\nmr>,<NMR_250MHZ>,
      <abs ABSG = 5 
       data hash MD5: 32K
       AC 40 B9 15 5D 03 8B 5B 82 AD CB 68 D0 11 15 A5>)
$$ ##END=
$$ 
$$ hash MD5
$$ 39 70 5F E3 05 20 A6 57 30 DC 28 4B 7A C6 8E 1B
##$RELAX= 
##$RELAX= 
##$RELAX= 
##$RELAX= 
##$RELAX= 
##$RELAX= 
##$RELAX= 
$$ Bruker specific parameters
$$ --------------------------
##$DU= <C:\u>
##$EXPNO= 2260
##$NAME= <ADRS>
##$PROCNO= 1
##$TYPE= <nmr>
##$USER= <dgb>
##$AMP= (0..31)
100 100 100 100 100 100 100 100 100 100 100 100 100 100 100 100 100 100 
100 100 100 100 100 100 100 100 100 100 100 100 100 100 
##$AQSEQ= 0
##$AQ_mod= 3
##$AUNM= <au_zg>
##$AUTOPOS= <1 >
##$BF1= 250.13
##$BF2= 250.13
##$BF3= 250.13
##$BF4= 250.13
##$BF5= 500.13
##$BF6= 500.13
##$BF7= 500.13
##$BF8= 500.13
##$BYTORDA= 1
##$CFDGTYP= 0
##$CFRGTYP= 5
##$CHEMSTR= <none>
##$CNST= (0..31)
1 1 145 1 1 1 1 1 1 1 1 1 1 1 1 1 1 1 1 1 1 1 1 1 1 1 1 1 1 1 1 1 
##$CPDPRG= <>
##$CPDPRG1= <>
##$CPDPRG2= <>
##$CPDPRG3= <>
##$CPDPRG4= <mlev>
##$CPDPRG5= <mlev>
##$CPDPRG6= <mlev>
##$CPDPRG7= <mlev>
##$CPDPRG8= <mlev>
##$CPDPRGB= <>
##$CPDPRGT= <>
##$D= (0..31)
0 1 0 0 0 0 0 0 0 0.06 0 0 0 0 0 0 0.0002 0 0 0 0 0 0 0 0 0 0 0 0 0 0 
0 
##$DATE= 1162811611
##$DBL= (0..7)
120 120 120 120 120 120 120 120 
##$DBP= (0..7)
150 150 150 150 150 150 150 150 
##$DBP07= 0
##$DBPNAM0= <>
##$DBPNAM1= <>
##$DBPNAM2= <>
$$ [...]
##$SUBNAM7= <"">
##$SUBNAM8= <"">
##$SUBNAM9= <"">
##$SW= 20.6930455092707
##$SWIBOX= (0..15)
0 0 3 0 0 0 0 0 0 0 0 0 0 0 0 0 
##$SW_h= 5175.983436853
##$TD= 65536
##$TD0= 1
##$TE= 683.16
##$TE2= 300
##$TE3= 300
##$TEG= 300
##$TL= (0..7)
0 120 120 120 120 120 120 120 
##$TP= (0..7)
150 150 150 150 150 150 150 150 
##$TP07= 0
##$TPNAME0= <>
##$TPNAME1= <>
##$TPNAME2= <>
##$TPNAME3= <>
##$TPNAME4= <>
##$TPNAME5= <>
##$TPNAME6= <>
##$TPNAME7= <>
##$TPOAL= (0..7)
0.5 0.5 0.5 0.5 0.5 0.5 0.5 0.5 
##$TPOFFS= (0..7)
0 0 0 0 0 0 0 0 
##$TUNHIN= 0
##$TUNHOUT= 0
##$TUNXOUT= 0
##$USERA1= <user>
##$USERA2= <user>
##$USERA3= <user>
##$USERA4= <user>
##$USERA5= <user>
##$V9= 5
##$VALIST= <valist>
##$VCLIST= <CCCCCCCCCCCCCCC>
##$VD= 0
##$VDLIST= <DDDDDDDDDDDDDDD>
##$VPLIST= <PPPPPPPPPPPPPPP>
##$VTLIST= <TTTTTTTTTTTTTTT>
##$WBST= 1024
##$WBSW= 4
##$XGAIN= (0..3)
0 0 0 0 
##$XL= 0
##$YL= 0
##$YMAX_a= 427746
##$YMIN_a= -348974
##$ZGOPTNS= <>
##$ZL1= 120
##$ZL2= 120
##$ZL3= 120
##$ZL4= 120
##$ABSF1= 16.522
##$ABSF2= -4.171173
##$ABSG= 5
##$ABSL= 3
##$ALPHA= 0
##$AQORDER= 0
##$ASSFAC= 0
##$ASSFACI= 0
##$ASSFACX= 0
##$ASSWID= 0
##$AUNMP= <proc_1d>
##$AZFE= 0.1
##$AZFW= 0.1
##$BCFW= 0
##$BC_mod= 0
##$BYTORDP= 0
##$COROFFS= 0
##$CY= 12.5
##$DATMOD= 1
##$DC= 0
##$DFILT= <>
##$DTYPP= 0
##$F1P= 14.0000005364418
##$F2P= -0.99999901652339
##$FCOR= 0.5
##$FTSIZE= 32768
##$FT_mod= 6
##$GAMMA= 0
##$GB= 0
##$INTBC= 1
##$INTSCL= 1
##$ISEN= 128
##$LB= 0.3
##$LEV0= 0
##$LPBIN= 0
##$MAXI= 10000
##$MC2= 0
##$MEAN= 0
##$ME_mod= 0
##$MI= 0
##$NCOEF= 0
##$NC_proc= -4
##$NLEV= 6
##$NOISF1= 0
##$NOISF2= 0
##$NSP= 0
##$NTH_PI= 0
##$NZP= 0
##$OFFSET= 16.522
##$PC= 1
##$PHC0= -36.30562
##$PHC1= -1.067809
##$PH_mod= 1
##$PKNL= yes
##$PPARMOD= 0
##$PSCAL= 4
##$PSIGN= 0
##$REVERSE= no
##$SF= 250.13
##$SI= 32768
##$SIGF1= 0
##$SIGF2= 0
##$SINO= 400
##$SIOLD= 32768
##$SREGLST= <1H.CDCl3>
##$SSB= 0
##$STSI= 32768
##$STSR= 0
##$SW_p= 5175.98343685301
##$SYMM= 0
##$S_DEV= 0
##$TDeff= 65536
##$TDoff= 0
##$TI= <Analysis number 999999
Compound Code 99
Book Reference 9
Project Code 9>
##$TILT= no
##$TM1= 0
##$TM2= 0
##$TOPLEV= 0
##$USERP1= <user>
##$USERP2= <user>
##$USERP3= <user>
##$USERP4= <user>
##$USERP5= <user>
##$WDW= 1
##$XDIM= 32768
##$YMAX_p= 390268696
##$YMIN_p= -484365
$$ End of Bruker specific parameters
$$ ---------------------------------
##NTUPLES= NMR SPECTRUM
##VAR_NAME=  FREQUENCY,     SPECTRUM/REAL,   SPECTRUM/IMAG
##SYMBOL=    X,             R,               I
##VAR_TYPE=  INDEPENDENT,   DEPENDENT,       DEPENDENT
##VAR_FORM=  AFFN,          ASDF,            ASDF
##VAR_DIM=   32768,         32768,           32768
##UNITS=     HZ,            ARBITRARY UNITS, ARBITRARY UNITS
##FACTOR=    0.157963299565203, 1,           1
##FIRST=     4132.6476996994, 0,             0
##LAST=      -1043.33573715361, 0,           0
##MIN=       -1043.33573715361, -484365,     0
##MAX=       4132.6476996994, 390268696,     0
$$ Real data points
##PAGE= N=1
##DATA TABLE= (X++(R..R)), XYDATA
$$ [...]
$$ plain form
17965 1524783 1479511 1534635 1574052 1652044 1703595 1814423 2057329 2289690 2441003 2585295
17955 2585295 2786089 2980285 3133614 3331489 3563979 3769046 3959671 4096834 4234837
17946 4234837 4325871 4330134 4446406 4423893 4449876 4404734 4442797 4435863 4313774 4127773 3911679
17935 3911679 3766732 3427147 2999393 2558557 2193213 1927068 1618264 1334726 1083556
17926 1083556 942164 918594 846191 775043 685550 662808 834970 804589 781238 825320 823663
17915 823663 754680 623349 659221 597281 611449 565008 475742 433040 591237 658826 696376
17904 696376 714181 759469 806811 696269 567499 560052 651948 620909 705300 821619 822233
17893 822233 640276 674806 742642 793712 711684 584411 486819 393862 411898 451765 404658
$$ packed form
17965A524783m5272N5124L9417P7992N1551J10828K42906K32361J51313J44292
17955B585295K00794J94196J53329J97875K32490K05067J90625J37163J38003
17946D234837R1034M263J16272k2513K5983m5142L8063o934j22089j86001k16094
17935C911679j44947l39585m27754m40836l65344k66145l08804k83538k51170
17926A083556j41392k3570p2403p1148q9493k2742J72162l0381k3351M4082j657
17915H23663o8983j31331L5872o1940J4168m6441q9266m2702J58197O7589L7550
17904F96376J7805M5288M7342j10542j28770p447R1896l1039Q4391J16319O14
17893H22233j81957L4530O7836N1070q2028j27273r7592r2957J8036L9867m7107
$$ plain form
17882 404658 277365 239073 186108 162147 71966 -35421 -70451 47167 97271 -12119 -111155
17871 -111155 -103559 -182171 -166879 -150975 -74172 -71118 -27720 76229 64429 9392 16244 86677
17859 86677 23760 -54949 -71111 -140436 -289569 -252487 -152594 -53421 74917 189166 127715
17848 127715 215993 275142 201324 35777 2032 -34223 -96884 -151848 -232490 -264293 -133228
17837 -133228 -52356 -45180 -196992 -295858 -246422 -260077 -167128 6574 113745 73305 48185
17826 48185 -9045 -117258 -99707 60854 209132 139058 113100 44331 83956 157832 65085
17815 65085 44414 -91944 -218354 -166235 34985 89509 67096 22998 -34038 63270 106437
17804 106437 153075 104339 125124 69128 24828 -83951 -44797 36451 30682 -79812 -122823
$$ packed form
17882D04658j27293l8292n2965k3961r0181j07387l5030J17618N0104j09390r9036
17871a11155P596p8612J5292J5904P6803L054M3398J03949j1800n5037O852P0433
17859H6677o2917p8709j6162o9325j49133L7082R9893R9173J28338J14249o1451
17848A27715Q8278N9149p3818j65547l3745l6255o2661n4964q0642l1803J31065
17837a33228Q0872P176j51812r8866M9436j3655R2949J73702J07171m0440k5120
17826D8185n7230j08213J7551J60561J48278p0074k5958o8769L9625P3876r2747
17815F5085k0671j36358j26410N2119K01220N4524k2413m4098n7036R7308M3167
17804A06437M6638m8736K0785n5996m4300j08779L9154Q1248n769j10494m3011
$$ plain form
17793 -122823 -131095 -63422 -51498 -95404 -99997 -154989 -251252 -184352 -62143 5936 -63513 -31448
17781 -31448 -32500 -113654 -67493 1792 30559 29077 31703 -110816 -173755 -188083 -167316 -256123
17769 -256123 -226238 -186401 -212059 -304414 -192360 -56273 -92120 -122023 -121852 -162224 -188644
17758 -188644 -80020 57753 16435 -28293 -78500 -61836 -122744 -176742 -58029 -5625 -10935
17747 -10935 -103375 12307 140287 140082 79282 14936 -66385 -86972 -114277 14298 -9917
17736 -9917 -58813 -150237 -183371 -139302 -37476 19237 78046 48650 33494 66708 22685 -56373
17724 -56373 -81707 -27473 61805 96140 130554 89115 25958 84739 201646 179123 141158
17713 141158 47447 66478 115976 170353 271375 296708 268354 241015 203401 179859 151874
$$ packed form
17793a22823q272O7673J1924m3906m593n4992r6263O6900J22209O8079o9449L2065
17781c1448j052q1154M6161O9285K8767j482K626j42519o2939j4328K0767q8807
17769b56123K9885L9837k5658r2355J12054J36087l5847k9903J71m0372k6420
17758a88644J08624J37773m1318m4728n0207J6664o0908n3998J18713N2404n310
17747a0935r2440J15682J27980k05o0800o4346q1321k0587k7305J28575k4215
17736i917m8896r1424l3134M4069J01826N6713N8809k9396j5156L3214m4023p9058
17724e6373k5334N4234Q9278L4335L4414m1439o3157N8781J16907k2523l7965
17713A41158r3711J9031M9498N4377J01022K5333k8354k7339l7614k3542k7985
$$ plain form
17702 151874 194806 190794 100796 34852 -36577 -58783 21694 8411 101857 351681 452718
17691 452718 451770 574966 822168 965735 1054559 1062782 1137947 1135765 1220992 1156655 1035849
17680 1035849 1047456 1177290 1052515 914735 737452 576233 518722 455695 370722 467480
17670 467480 570500 579470 517041 519914 507435 412612 497587 428506 400445 279521 202378
17659 202378 262796 362496 473149 623410 666052 589107 537507 515934 466748 431972 363448
17648 363448 380796 264425 221569 256461 343190 387848 330544 332790 341407 309794 465500
17637 465500 561601 547442 517212 555131 557622 612936 642670 708890 779325 854057 984533
17626 984533 1045992 1086580 1084378 1098297 1130434 1071658 1003950 835970 765400 634307 578905
$$ packed form
17702A51874M2932m012q9998o5944p1429k2206Q0477j3283R3446K49824J01037
17691D52718r48J23196K47202J43567Q8824Q223P5165k182Q5227o4337j20806
17680A035849J1607J29834j24775j37780j77283j61219n7511o3027q4973R6758
17670D67480J03020Q970o2429K873j2479r4823Q4975o9081k8061j20924p7143
17659B02378O0418R9700J10653J50261M2642p6945n1600k1573m9186l4776o8524
17648C63448J7348j16371m2856L4892Q6729M4658n7304K246Q617l1613J55706
17637D65500R6101j4159l0230L7919K491N5314K9734O6220P0435P4732J30476
17626I84533O1459M0588k202J3919L2137n8776o7708j67980p0570j31093n5402
$$ plain form
17615 578905 608411 558569 397436 261755 129596 191286 294437 228247 172574 339539
17605 339539 462586 467949 461710 421671 451678 471643 471199 578497 624674 543306 480450 534965
17593 534965 504794 499888 402815 218284 211618 160874 222295 371690 275441 158424 74512
17582 74512 177820 337109 175197 92389 -29848 -28446 15758 39726 167080 243131 146241
17571 146241 142893 105155 8645 -71410 -76466 -120589 -221554 -165027 -105194 -66459 -26952 3571
17559 3571 5080 27768 7421 -49662 -62482 -93265 80627 20534 134957 159403 180501 252758
17547 252758 259817 260626 172254 61447 55835 -20274 28532 47418 79384 74830 187787 171210
17535 171210 184439 142625 92062 143749 52758 663 22822 4587 20502 42585 70402
$$ packed form
17615E78905K9506m9842j61133j35681j32159O1690J03151o6190n5673J66965
17605C39539J23047N363o239m0039L0007J9965m44J07298M6177q1368o2856N4515
17593E34965l0171m906r7073j84531o666n0744O1421J49395r6249j17017q3912
17582G4512J03308J59289j61912q2808j22237J402M4204K3968J27354P6051r6890
17571A46241l348l7738r6510q0055n056m4123j00965N6527N9833L8735L9507L0523
17559C571J509K2688k0347n7083j2820l0783J73892o0093J14423K4446K1098P2257
17547B52758P059Q09q8372j10807n612p6109M8806J8886L1966m554J12957j6577
17535A71210J3229m1814n0563N1687r0991n2095K2159j8235J5915K2083K7817
$$ plain form
17524 70402 51296 50915 39844 -15710 -68512 -71151 -95185 -74417 -33834 -31200 -22997 -96432 -110255
17511 -110255 -74441 85129 42073 11469 119392 154257 136498 15051 164075 220410 138387
17500 138387 133782 175210 252593 308691 203288 186871 261984 191627 118642 181337 244891
17489 244891 170512 80578 43673 84798 175294 358256 438289 499255 569932 529857 474706
17478 474706 558252 636979 589115 469806 469612 502106 517365 562248 534301 599903 433821
17467 433821 334635 250222 227634 155976 56710 50288 95184 159546 199114 171571 76679 50034
17455 50034 166673 176710 108845 121621 207543 319082 337933 403500 326101 347392 616778
17444 616778 856309 921001 970079 878326 737937 543963 316012 294653 246656 311206 431585
$$ packed form
17524G0402j9106l81j1071n5554n2802k639k4034K0768M0583K634Q203p3435j3823
17511a10255L5814J59570m3056l0604J07923L4865j7759j21447J49024N6335q2023
17500A38387m605M1428P7383N6098j05403j6417P5113p0357p2985O2695O3554
17489B44891p4379q9934l6905M1125R0496J82962Q0033O0966P0677m0075n5151
17478D74706Q3546P8727m7864j19309j94L2494J5259M4883k7947O5602j66082
17467D33821r9186q4413k2588p1658r9266o422M4896O4362L9568k7543r4892k6645
17455E0034J16639J0037o7865J2776Q5922J11539J8851O5567p7399K1291K69386
17444F16778K39531O4692M9078r1753j40389j93974k27951k1359m7997O4550J20379
$$ plain form
17433 431585 448829 445820 422182 418550 547139 585406 452947 440869 586743 773743 812237
17422 812237 689773 530953 669986 789523 672243 526618 512553 489639 494641 483218
17412 483218 367290 241135 200907 272377 409756 339792 425993 466219 491663 394606 317144
17401 317144 179600 95852 188567 183865 60047 133404 227177 183571 110697 257159 270304
17390 270304 162542 237778 184529 142039 149125 222333 162790 9276 -66368 24794 61527
17379 61527 -54401 -175011 -289848 -204662 -58618 -85237 -94497 -49904 52648 58070 -30086
17368 -30086 -72553 -89656 -233765 -233061 -241155 -202048 -117126 -26468 35293 121055 107043 62612
17356 62612 125179 171190 104370 67394 119791 160198 194840 134436 94549 30444 35766 55257
$$ packed form
17433D31585J7244l009k3638l632J28589L8267j32459j2078J45874J87000L8494
17422H12237j22464j58820J39033J19537j17280j45625j4065k2914N002j1423
17412D83218j15928j26155m0228P1470J37379o9964Q6201M0226K5444r7057p7462
17401C17144j37544q3748R2715m702j23818P3357R3773m3606p2874J46462J3145
17390B70304j07762P5236n3249m2490P086P3208n9543j53514p5644R1162L6733
17379F1527j15928j20610j14837Q5186J46044k6619r260M4593J02552N422q8156
17368c0086m2467j7103j44109P04q094L9107Q4922R0658O1761Q5762j4012m4431
17356F2612O2567M6011o6820l6976N2397M0407L4642o0404l9887o4105N322J9491
$$ plain form
17344 55257 162068 313933 266895 124947 60867 188026 189254 99734 129342 145375 120234
17333 120234 127721 122662 195871 134814 93574 63732 58028 153870 44808 128018 245517 166229
17321 166229 81306 105598 98537 277304 300935 94423 41533 59946 -38380 -83839 -92133
17310 -92133 -108820 -26556 9483 168207 155317 36034 -54081 15505 33717 -2454 -40289
17299 -40289 -91063 -184477 -129533 -8312 144539 242669 236232 183924 113127 111971 110588 80635
17287 80635 75366 89912 175448 142222 117913 94820 207508 114943 74052 178699 194249
17276 194249 144674 91317 67675 -12785 -2429 -29123 -98131 -64615 83641 256253 256001
17265 256001 124138 77882 249834 391794 413749 238342 259780 287178 263565 346981 351144
$$ packed form
17344E5257J06811J51865m7038j41948o4080J27159J228q9520K9608J6033k5141
17333A20234P487n059P3209o1057m1240k9842n704R5842j09062Q3210J17499p9288
17321A66229q4923K4292p061J78767K3631k06512n2890J8413r8326m5459q294
17310i2133j6687Q2264L6039J58724j2890j19283r0115O9586J8212l6171l7835
17299d0289n0774r3414N4944J21221J52851R8130o437n2308p0797j156j383k9953
17287H0635n269J4546Q5536l3226k4309k3093J12688r2565m0891J04647J5550
17276A94249m9575n3357k3642q0460J0356k6694o9008L3516J48256J72612k52
17265B56001j31863m6256J71952J41960K1955j75407K1438K7398k3613Q3416M163
$$ plain form
17254 351144 313181 282322 136574 39014 80597 93128 157168 99646 119559 178360 200785
17243 200785 38175 28157 108940 272189 330266 265245 347526 308493 262444 257952 311104
17232 311104 386675 404484 385619 543340 622836 616716 525129 455405 324010 285297 441880
17221 441880 447183 375180 405826 420302 491989 572010 587231 622995 498686 360953 340871
17210 340871 240970 311912 615172 707954 632513 540104 657681 823754 857990 852081 822961
17199 822961 850265 972511 1124436 1252031 1401957 1480818 1482135 1520616 1722924 2102095
17189 2102095 2340536 2489329 2607697 2628694 2817770 3174310 3514337 3792113 4180095 4765714
17179 4765714 5419411 6037004 7017096 8266787 9876433 12246829 15479323 19902255 25910093
$$ packed form
17254C51144l7963l0859j45748r7560M1583J2531O4040n7522J9913N8801K2425
17243B00785j62610j0018Q0783J63249N8077o5021Q2281l9033m6049m492N3152
17232C11104P5571J7809j8865J57721P9496o120r1587o9724j31395l8713J56583
17221D41880N303p2003L0646J4476P1687Q0021J5221L5764j24309j37733k0082
17210C40871r9901P0942L03260R2782p5441r2409J17577J66073L4236n909k9120
17199H22961K7304J22246J51925J27595J49926P8861J317L8481K02308L79171
17189B102095K38441J48793J18368K0997J89076L56540L40027K77776L87982N85619
17179D765714O53697O17593R80092J249691J609646K370396L232494M422932O007838
$$ plain form
17170 25910093 33779802 43567110 54005686 63420809 70323276 73782753 74468618 73011002
17162 73011002 69167190 62436723 52970228 42730543 33675089 26468991 21075388 17348085
17154 17348085 14558492 12254801 10542220 9269284 8271455 7294744 6473139 6051728 5693274
17145 5693274 5315918 4939827 4655797 4460942 4341835 4119936 3976796 3759101 3506751
17136 3506751 3404324 3423266 3489196 3476285 3533471 3657096 3818934 3828713 3993137 4062980 4185154
17125 4185154 4484726 4713303 4755072 4990772 5430346 6000717 6593302 7540583 8775635
17116 8775635 10427123 12535946 15423863 19663276 25489150 33086117 42255528 52151344
17108 52151344 61072456 67507942 70889933 71313836 69568472 65665539 59166140 50003020
$$ packed form
17170B5910093P869709R787308J0438576R415123O902467L459477O85865j457616
17162G3011002l843812o730467r466495j0239685r055454p206098n393603l727303
17154A7348085k789593k303691j712581j272936r97829r76711q21605m21411l58454
17145E693274l77356l76091k84030j94855j19107k21899j43140k17695k52350
17136C506751j02427J8942O5930j2911N7186J23625J61838R779J64424O9843J22174
17125D185154K99572K28577M1769K35700M39574N70371N92585R47281J235052
17116H775635J651488K108823K887917M239413N825874P596967R169411R895816
17108E2151344Q921112O435486L381991M23903j745364l902933o499399r163120
$$ plain form
17100 50003020 40090149 31254361 24535206 19513323 15944044 13279211 11086713 9557935
17092 9557935 8393196 7291999 6546707 5893739 5241543 4826422 4396374 4100358 3927794
17083 3927794 3726292 3435487 3156653 2886160 2649795 2506961 2261494 2167617 2032892 1903169
17073 1903169 1811401 1708170 1651232 1580052 1470985 1374011 1376874 1371621 1313576 1263115 1271220
17062 1271220 1284155 1276054 1143658 1043378 983371 914324 933972 888243 770373 720401 736611
17051 736611 817860 818105 826422 780129 626698 575293 548232 505182 470925 490300 602780 628215
17039 628215 597009 480993 423886 450688 393156 383367 426315 326014 288909 303081 332755
17028 332755 341760 417092 349411 323764 300000 253093 278205 315506 282533 303955 365291 428076
$$ packed form
17100E0003020r912871q835788o719155n021883l569279k664833k192498j528778
17092I557935j164739j101197p45292o52968o52196m15121m30048k96016j72564
17083C927794k01502k90805k78834k70493k36365j42834k45467r3877j34725j29723
17073A903169r1768j03231n6938p1180j09067r6974K863n253n8045n0461Q105
17062A271220J2935q101j32396j00280o0007o9047J9648m5729j17870m9972J6210
17051G36611Q1249K45Q317m6293j53431n1405k7061m3050l4257J9375J12480K5435
17039F28215l1206j16016n7107K6802n7532r789M2948j00301l7105J4172K9674
17028C32755R005P5332o7681k5647k3764m6907K5112L7301l2973K1422O1336O2785
$$ plain form
17016 428076 420234 465163 471462 373420 248723 159887 221277 224074 171914 177295 116915 -4601
17004 -4601 -24567 97167 206289 228922 156148 94900 99481 35628 -34059 103454 102793 93384
16992 93384 69682 6639 -85773 -76618 13618 35952 17371 -31801 -64896 -95539 -88359 38641
16980 38641 231596 339012 443297 416485 311782 362287 316370 228984 95121 -69501
16970 -69501 -76311 49933 182532 146283 95309 165144 105354 56825 100050 116439 9390
16959 9390 -75483 -159947 -193226 -132278 -174031 -208115 -177828 -174660 -162293 -206884 -161940 -144091
16947 -144091 -101362 -90844 -91513 -99223 -6019 153987 136918 69736 103557 41800 61188 31412
16935 31412 13973 -16680 -36032 54553 98923 76396 -7407 -57335 -64856 -62205 72792 59072
$$ packed form
17016D28076p842M4929O299r8042j24697q8836O1390K797n2160N381o0380j21516
17004d601j9966J21734J09122K2633p2774o1248M581o3853o9687J37513o61r409
16992I3384k3702o3043r2412R155R0236K2334j8581m9172l3095l0643P180J27000
16980C8641J92955J07416J04285k6812j04703N0505m5917q7386j33863j64622
16970f9501o810J26244J32599l6249n0974O9835n9790m8529M3225J6389j07049
16959I390q4873q4464l3279O0948m1753l4084L0287L168J2367m4591M4944J7849
16947a44091M2729J0518o69p710R3204J60006j7069o7182L3821o1757J9388k9776
16935C1412j7439l0653j9352R0585M4370k2527q3803m9928p521K651J34997j3720
$$ plain form
16923 59072 -30778 -19849 -76723 -112388 -41505 -118946 -169313 -24819 45075 -197489 -230028
16912 -230028 -70690 -7880 29531 41301 46228 29490 40840 54584 -42256 -72981 -64586 -152813
16900 -152813 -170951 -231855 -257043 -133463 -129150 -182600 -166617 -48313 -62603 -68283 19990
16889 19990 140257 39027 -5275 -49086 -116754 -192123 -166894 -129460 -202401 -225172 -205210
16878 -205210 -242839 -289414 -335041 -237337 -137822 -58920 79047 123039 152913 32748 -153459
16867 -153459 -89521 74288 114485 94562 57395 -11281 -26513 83210 78805 -22749 -73939
16856 -73939 -107360 -125527 -114174 -48813 -43153 -148725 -40045 10107 -191711 -127369 -17904
16845 -17904 -58157 -43711 -63053 -70107 -35339 27408 90042 113151 25439 -75672 -171696 -124652
$$ packed form
16923E9072q9850J0929n6874l5665P0883p7441n0367J44494O9894k42564l2539
16912b30028J59338O2810L7411J1770M927j6738J1350J3744r6840l0725Q395q8227
16900a52813j8138o0904k5188J23580M313n3450J5983J18304j4290n680Q8273
16889A9990J20267j01230m4302m3811o7668p5369K5229L7434p2941k2771J9962
16878b05210l7629m6575m5627R7704R9515P8902J37967M3992K9874j20165j86207
16867a53459O3938J63809M0197j9923l7167o8676j5232J09723m405j01554n1190
16856g3939l3421j8167J1353O5361N660j05572J08680N0152k01818O4342J09465
16845a7904m0253J4446j9342p054L4768O2747O2634K3109q7712j01111r6024M7044
$$ plain form
16833 -124652 -46115 26663 34452 82451 42658 -50759 -77029 -154223 -241846 -294674 -275584 -374793
16821 -374793 -433249 -470546 -370519 -321829 -239285 -92066 -115042 -132227 -129445 -329475 -378530
16810 -378530 -311631 -104192 -77108 -151283 -164389 -110105 38104 35797 -84509 -178904 -169643
16799 -169643 -25305 -120211 -130398 75624 170177 85101 5379 -146662 -140005 -89846 -83302
16788 -83302 -11544 -60017 -101575 -79893 -12665 -8050 12389 -28885 28002 15731 -56930 -184941
16776 -184941 -262478 -317319 -176226 -240465 -317466 -270776 -239691 -270002 -226285 -247897 -145262
16765 -145262 -42603 19604 42545 88631 129710 75974 158826 133374 81799 -19332 -236721
16754 -236721 -312705 -324132 -296657 -230481 -156938 61305 142034 96089 120639 -24083 -186403
$$ packed form
16833a24652P8537P2778P789M7999l9793r3417k6270p7194q7623n2828J9090r9209
16821c74793n8456l7297J00027M8690Q2544J47219k2976j7185K782k00030m9055
16810c78530O6899K07439K7084p4175j3106N4284J48209k307j20306r4395R261
16799a69643J44338r4906j0187K06022R4553q5076p9722j52041O657N0159O544
16788h3302P1758m8473m1558K1682O7228M615K0439m1274N6887j2271p2661j28011
16776a84941p7537n4841J41093o4239p7001M6690L1085l0311M3717k1612J02635
16765a45262J02659O2207K2941M6086M1079n3736Q2852k5452n1575j01131k17389
16754b36721p5984j1427K7475O6176P3543K18243Q0729m5945K4550j44722j62320
$$ plain form
16743 -186403 -206014 -167513 -231309 -411451 -413637 -345101 -238177 -106715 56039 134338 -11511
16732 -11511 -69449 -65149 -17677 4740 87517 103808 20479 -138916 -267169 -251510 -111701
16721 -111701 5522 -138752 -207766 -196419 -216360 -208734 -161216 -146204 -112324 -203132 -161978
16710 -161978 -23858 -93373 -91242 -57812 -168642 -222279 -241942 -283269 -241934 -168694 -94266
16699 -94266 56506 93622 -7135 34196 42706 37328 10114 -43726 -127181 -20629 131115
16688 131115 85892 -115305 -239396 -165170 -185508 -204689 -84179 -59201 -161482 -164813 -115053
16677 -115053 -104316 -35421 117865 71644 69812 108442 91560 119750 22993 -124201 -68926
16666 -68926 -881 -38163 -48440 -110263 -210372 -136992 -79913 -116483 -47537 -15596 41550
$$ packed form
16743a86403j9611L8501o3796j80142k186O8536J06924J31462J62754P8299j45849
16732a1511n7938M300M7472K2417Q2777J6291q3329j59395j28253J5659J39809
16721a11701J17223j44274o9014J1347j9941P626M7518J5012L3880r0808M1154
16710a61978J38120o9515K131L3430j10830n3637j9663m1327M1335P3240P4428
16699i4266J50772L7116j00757M1331Q510n378k7214n3840q3455J06552J51744
16688A31115m5223k01197j24091P4226k0338j9181J20510K4978j02281l331M9760
16677a15053J0737O8895J53286m6221j832L8630j6882K8190r6757j47194N5275
16666f8926O8045l7282j0277o1823j00109P3380N7079l6570O8946L1941N7146
$$ plain form
16655 41550 141695 67048 -10971 38473 106111 84317 45189 -43466 -111162 -30032 46757
16644 46757 117264 297033 382438 482063 506643 383458 338128 307687 253718 263977 226651
16633 226651 75793 65767 -26121 -104711 -38822 45427 110717 27958 -57781 -17549 18049
16622 18049 97596 167317 4997 -120064 -42157 25246 69214 -4684 -93872 -130994 -216330
16611 -216330 -199411 -14892 114090 130699 112128 20693 -65934 -57019 11304 147579 229429
16600 229429 128162 27336 -89247 -153534 -150058 -125161 -123986 -177874 -133757 -53891 -36981
16589 -36981 -80159 19828 113929 63563 86765 50400 -5388 10730 63180 118546 89201 137757
16577 137757 204734 245884 120048 72663 192087 216860 82946 65416 88149 -69098 -134717
$$ packed form
16655D1550J00145p4647p8019M9444O7638k1794l9128q8655o7696Q1130P6789
16644D6757P0507J79769Q5405R9625K4580j23185m5330l0441n3969J0259l7326
16633B26651j50858j0026r1888p8590O5889Q4249O5290q2759q5739M0232L5598
16622A8049P9547O9721j62320j25061P7907O7403M3968p3898q9188l7122q5336
16611b16330J6919J84519J28982J6609j8571r1435q6627Q915O8323J36275Q1850
16600B29429j01267j00826j16583o4287L476K4897J175n3888M4117P9866J6910
16589c6981m3178R9987R4101n0366K3202l6365n5788J6118N2450N5366k9345M8556
16577A37757O6977M1150j25836m7385J19424K4773j33914j7530K2733j57247o5619
$$ plain form
16566 -134717 -66743 -96587 -42743 5271 -97777 -247486 -196178 -121390 -91689 -60068 107888
16555 107888 110948 -147398 -220129 -125539 12258 -42227 -54137 39422 -6682 -44191 -38540
16544 -38540 -57655 -151152 -187585 -148557 -121414 -21356 -24623 -71089 1837 16264 29030 -49493
16532 -49493 -67779 223 -34306 -42824 68233 158846 36803 22622 60723 160872 123413
16521 123413 306225 265769 129810 330 -133447 -53564 95774 133370 79402 77981 41413
16510 41413 -19149 -27442 -57085 -92957 -69371 12222 -113728 -146671 -114640 -109385 -45720 -51143
16498 -51143 -56388 -233801 -196933 -177806 -214552 -126581 -70938 -47868 -116699 -134202 66158
16487 66158 145950 40404 -66287 1140 2145 -135892 -66424 -14284 -125788 -244290 -175340
$$ packed form
16566a34717O7974k9844N3844M8014j03048j49709N1308P4788K9701L1621J67956
16555A07888L060k58346p2731R4590J37797n4485j1910R3559m6104l7509N651
16544c8540j9115r3497l6433L9028K7143J00058l267m6466P2926J4427J2766p8523
16532d9493j8286O8002l4529q518J11057R0613j22043j4181L8101J00149l7459
16521A23413J82812m0456j35959j29480j33777P9883J49338L7596n3968j421l6568
16510D1413o0562q293k9643l5872K3586Q1593j25950l2943L2031N255O3665n423
16498e1143n245j77413L6868J9127l6746Q7971N5643K3070o8831j7503K00360
16487F6158P9792j05546j06691O7427J005j38037O9468N2140j11504j18502O8950
$$ plain form
16476 -175340 -84001 -101947 -53608 -9966 -46016 -57540 -45919 -17970 57149 44042 29827
16465 29827 -25103 -83333 -36377 39950 77670 28887 -184947 -353255 -419109 -321759 -147618
16454 -147618 -101484 -64180 -1825 48665 -26165 -86184 -61088 -18063 -25464 -28267 -30811 -49475
16442 -49475 -53330 -69802 -116865 -127385 -195972 -115433 -139325 -142682 -101861 -196251 -269983 -227596
16430 -227596 -243757 -166839 -190716 -164986 -208462 -209688 -131102 -204729 -262282 -158371 -71515
16419 -71515 -57502 19156 -17843 -190563 -58141 -26476 24270 87653 9608 -97560 -102033
16408 -102033 -124304 -111184 -54271 -82661 -179666 -154434 -140553 -169501 -145080 -119905 -179780
16397 -179780 -301626 -302533 -270566 -129840 -81774 -18473 39327 63627 -21599 37581 52530
$$ packed form
16476a75340R1339j7946M8339M3642l6050j1524J1621K7949P5119j3107j4215
16465B9827n4930n8230M6956P6327L7720m8783k13834j68308o5854R7350J74141
16454a47618M6134L7304O2355N0490p4830o0019K5096M3025p401k803k544j8664
16442d9475l855j6472m7063j0520o8587Q0539k3892l357M0821r4390p3732M2387
16430b27596j6161P6918k3877K5730m3476j226P8586p3627n7553J03911Q6856
16419g1515J4013P6658l6999j72720J32422L1665N0746O3383p8045j07168m473
16408a02033k2271J3120N6913k8390r7005K5232J3881k8948K4421K5175n9875
16397a79780j21846r07L1967J40726M8066O3301N7800K4300q5226N9180J4949
$$ plain form
16386 52530 126518 161503 70587 -12995 -59584 -154277 -141254 -255980 -369253 -319901 -272836
16375 -272836 -253042 -221493 -234190 -313052 -239215 -165726 -140076 -107913 -132530 -166392 -117041
16364 -117041 -212054 -208756 -164195 -105802 32236 78104 -24412 -42423 -113487 -187885 -161196
16353 -161196 -228298 -217011 -158105 -155752 -130251 -133108 -113121 -132723 -129093 -103097 -45207 -186914
16341 -186914 -121834 -86599 -84202 -33091 104275 118296 -436 -72975 53651 -9673 -33758
16330 -33758 20741 162535 149104 5838 -110932 -1331 64262 -25263 -107610 -75474 5302
16319 5302 -29258 923 -59702 -58413 127258 72020 5573 -21869 -72925 -27879 -121373 -191784
16307 -191784 -150396 -174427 -259873 -201788 -80808 24267 -9163 -112605 -191011 -182942 -73801
$$ packed form
16386E2530P3988L4985r0916q3582m6589r4693J3023j14726j13273M9352M7065
16375b72836J9794L1549j2697p8862P3837P3489K5650L2163k4617l3862M9351
16364a17041r5013L298M4561N8393J38038M5868j02516j8011p1064p4398K6689
16353a61196o7102J1287N8906K353K5501k857J9987j9602L630K5996N7890j41707
16341a86914O5080L5235K397N1111J37366J4021j18732p2539J26626o3324k4085
16330c3758N4499J41794j3431j43266j16770J09601O5593q9525q2347L2136Q0776
16319E302l4560L0181o0625J289J85671n5238o6447k7442n1056M5046r3494p0411
16307a91784M1388k4031q5446N8085J20980J05075l3430j03442p8406Q069J09141
$$ plain form
16296 -73801 -9250 -54942 -24317 56268 14128 -52624 -5104 -121377 -141369 -42909 -58361
16285 -58361 -86330 -100599 -241290 -257157 -287993 -172798 -39950 -25185 -109081 -44132 -146780
16274 -146780 -290810 -366687 -408606 -314904 -110145 -107994 -186799 -229118 -158384 -121205 -44134
16263 -44134 32791 -28081 -172610 -257431 -315707 -285988 -202018 -144012 -153688 -150070 -213838 -163827
16251 -163827 -214064 -207577 -179394 -142852 -67105 -54156 -91047 -218531 -337083 -312076 -156779
16240 -156779 -118235 -114375 -110149 -149985 -167936 -290866 -362079 -371545 -330319 -184548 -143828 4971
16228 4971 -13718 -116578 -123472 -95549 -15907 -101710 -204285 -145182 -99136 -61399 16152 -112150
16216 -112150 -128323 -158736 -219133 -322215 -337925 -215661 -71292 -88943 -163728 -84022 -159221
$$ packed form
16296g3801O4551m5692L0625Q0585m2140o6752M7520j16273j9992R8460j5452
16285e8361k7969j4269j40691j5867l0836J15195J32848J4765q3896O4949j02648
16274a46780j44030p5877m1919R3702K04759K151p8805m2319P0734L7179P7071
16263d4134P6925o0872j44529q4821n8276K9719Q3970N8006r676L618o3768N0011
16251a63827n0237O487K8183L6542P5747J2949l6891j27484j18552K5007J55297
16240a56779L8544L860M226l9836j7951j22930p1213r466M1226J45771M0720J48799
16228D971j8689j02860o894K7923P9642q5803j02575N9103M6046L7737P7551j28302
16216a12150j6173l0413o0397j03082j5710J22264J44369j7651p4785P9706p5199
$$ plain form
16205 -159221 -69648 22125 -42771 -125674 -204514 -117631 -59531 -81687 -162300 -160145 -117532 2092
16193 2092 -110409 -203174 -147626 -75658 -37783 18737 65867 41080 -51845 -135844 -123598 -77771
16181 -77771 -27007 -50309 19320 46111 9823 -91275 -193212 -328432 -309142 -162701 -69343
16170 -69343 28163 -18195 -112743 -22053 11041 -68943 -17555 95870 65231 -73147 -49671
16159 -49671 -48201 -229646 -248014 -149872 -204053 -158755 -98489 -68858 -63510 -4594 31924 -8528
16147 -8528 -12061 -159141 -160289 -77503 -65421 -79263 -89304 -43392 -64260 15317 98187 21957
16135 21957 -62248 19198 -19566 -154978 -222623 -109376 -51672 113559 33002 -175631 -85361
16124 -85361 -60968 4012 -22852 45100 10858 -92739 -219079 -182693 -86297 -97679 -9682
$$ packed form
16205a59221Q9573R1773o4896q2903p8840Q6883N8100k2156q0613K155M2613J19624
16193B092j12501r2765N5548P1968L7875N6520M7130k4787r2925q3999J2246M5827
16181g7771N0764k3302O9629K6791l6288j01098j01937j35220J9290J46441R3358
16170f9343R7506m6358r4548R0690L3094p9984N1388J13425l0639j38378K3476
16159d9671J470j81445j8368R8142n4181M5298O0266K9631N348N8916L6518m0452
16147h528l533j47080j148Q2786J2082j3842j0041M5912k0868P9577Q2870p6230
16135B1957q4205Q1446l8764j35412o7645J13247N7704J65231q0557k08633R0270
16124h5361K4393O4980k6864O7952l4242j03597j26340L6386R6396j1382Q7997
$$ plain form
16113 -9682 -60595 -196842 -93878 29208 -5300 -141578 -224102 -283293 -266289 -260829 -275596
16102 -275596 -228903 -258776 -210609 -173582 -178534 -167409 -155473 -141657 -133536 -113194 -170452 -191407
16090 -191407 -115429 -144635 -146879 -83697 44087 143294 109135 61050 -16645 -48026 -56100 -151038
16078 -151038 -196099 -89068 -48966 -7646 30754 18190 -11597 -16327 -26114 66527 -17396 -149567
16066 -149567 -160945 -120261 48438 20108 -1241 57092 79664 67485 -75059 -135925 -200259
16055 -200259 -156358 -51186 -21173 44783 35917 -7160 3289 -72187 5706 62205 76452
16044 76452 -14644 10234 47209 49063 85699 96968 95345 119019 73888 -7632 10442 -3210
16032 -3210 10969 59022 -43165 -90405 -24255 -42572 38410 65402 56101 -50173 -64605 -110414
$$ packed form
16113i682n0913j36247J02964J23086l4508j36278q2524n9191J7004N460j4767
16102b75596M6693k9873M8167L7027m952J1125J1936J3816Q121K0342n7258k0955
16090a91407P5978k9206k244O3182J27784R9207l4159m8085p7695l1381q074r4938
16078a51038m5061J07031M0102M1320L8400j2564k9787m730r787R2641q3923j32171
16066a49567j1378M0684J68699k8330k1349N8333K2572j2179j42544o0866o4334
16055b00259M3901J05172L0013O5956q866m3077J0449p5476P7893N6499J4247
16044G6452r1096K4878L6975J854L6636J1269j623K3674m5131q1520J8074j3652
16032c210J4179M8053j02187m7240O6150j8317Q0982K6992r301j06274j4432m5809
$$ plain form
16020 -110414 -94695 -100017 -167816 -216035 -284106 -308722 -191633 -196755 -310301 -263612 -149277
16009 -149277 -87592 -67763 -86524 11656 79674 -76332 -169936 -21621 40115 66876 174292
15998 174292 129476 24428 13027 -33767 -167792 -235283 -230590 -52643 -34441 -71833 59098
15987 59098 15256 -35706 21913 101403 41725 -42972 -44929 36734 283044 293669 266424 262220
15975 262220 171839 67093 43702 93603 75137 141818 88306 124088 154351 104341 173455
15964 173455 261681 182892 114767 97716 106985 -14047 -35114 25180 6224 -33370 46256
15953 46256 45697 -21388 -8221 -35626 -118233 -113852 -112749 -149386 -106979 -154826 -254678 -379398
15941 -379398 -359476 -288753 -180621 -201735 -227053 -81349 -117861 -139194 -219982 -191433 -78621
$$ packed form
16020a10414J5719n322o7799m8219o8071k4616J17089n122j13546M6689J14335
16009a49277O1685J9829j8761R8180O8018j56006r3604J48315O1736K6761J07416
15998A74292m4816j05048j1401m6794j34025o7491M693J77947J8202l7392J30931
15987E9098m3842n0962N7619P9490n9678q4697j957Q1663K46310J0625k7245m204
15975B62220r0381j04746k3391M9901j8466O6681n3512L5782L0263n0010O9114
15964A73455Q8226p8789o8125j7051R269j21032k1067O0294j8956l9594P9626
15953D6256n59o7085J3167k7405q2607M381J103l6637M2407m7847r9852j24720
15941c79398J9922P0723J08132k1114k5318J45704l6512k1333q0788K8549J12812
$$ plain form
15930 -78621 -88187 -125257 -127215 -154390 -28235 58130 5846 -57512 -95334 -124732 -31480 137421
15918 137421 177389 204973 268096 243875 131643 68319 -8323 -101542 -9750 27951 56195
15907 56195 -29814 90205 10419 -89281 -71769 -417 -172555 -256649 -191920 -111785 -756
15896 -756 51206 88287 87957 41377 -27535 12746 99196 186323 205861 165738 107483 39099
15884 39099 187108 216306 217048 94954 28771 37433 -137532 -181175 -175970 -73964 -54760 -127727
15872 -127727 -91577 -40120 -108473 -242290 -112057 -29726 -56412 -64035 -145158 -228726 -259407
15861 -259407 -242691 -305757 -389002 -323844 -81937 -69653 -70968 -155838 -314529 -333182 -141323
15850 -141323 8595 -118741 -125817 -42884 -171747 -180484 -4375 9332 -39961 -58412 -38097
$$ packed form
15930g8621r566l7070j958k7175J26155Q6365n2284o3358l7822k9398R3252J68901
15918A37421L9968K7584O3123k4221j12232o3324p6642r3219R1792L7701K8244
15907E6195q6009J20019p9786r9700J7512P1352j72138q4094O4729Q0135J11029
15896g56N1962L7081l30m6580o8912M0281Q6450Q7127J9538m0123n8255o8384
15884C9099J48009K9198P42j22094o6183Q662j74965m3643N205J02006J9204p2967
15872a27727L6150N1457o8353j33817J30233Q2331k6686p623q1123q3568l0681
15861b59407J6716o3066q3245O5158K41907J2284j315q4870j58691j8653J91859
15850a41323J49918j27336p076Q2933j28863q737J76109J3707m9293j8451K0315
$$ plain form
15839 -38097 2721 -5566 46546 -56391 -202173 -193524 -50965 51170 14347 -43034 -28603
15828 -28603 -51212 67043 123138 10583 23844 -100142 -70791 -116787 -157048 -93021 -75101
15817 -75101 -133232 -130862 -42012 42442 -59866 -131064 -236285 -223686 -204357 -249010 -123165
15806 -123165 -94652 -166255 -114531 -95014 -130737 -62426 -92370 -117750 -41376 9776 20794
15795 20794 3798 -47312 -77019 -29655 58767 131198 136656 -4280 -59469 -51465 53950 112603
15783 112603 29210 -155250 -71978 -37059 -67657 -168179 -213761 -157751 -188142 -55519 4834
15772 4834 142322 122320 35978 78666 111338 161345 134310 182184 70293 -55723 -5586
15761 -5586 -73834 -189305 -127825 -78819 -62563 -75160 -35527 -109310 -105434 -117870 -106480 -115909
$$ packed form
15839c8097M0818q287N2112j02937j45782Q649J42559J02135l6823n7381J4431
15828b8603k2609J18255N6095j12555J3261j23986K9351m5996m0261O4027J7920
15817g5101n8131K370Q8850Q4454j02308p1198j05221J2599J9329m4653J25845
15806a23165K8513p1603N1724J9517l5723O8311k9944k5380P6374N1152J1018
15795B0794j6996n1110k9707M7364Q8422P2431N458j40936n5189Q004J05415N8653
15783A12603q3393j84460Q3272L4919l0598j00522m5582N6010l0391J32623O0353
15772D834J37488k0002q6342M2688L2672N0007k7035M7874j11891j26016N0137
15761e586o8248j15471O1480M9006J6256j2597L9633p3783L876j2436J1390r429
$$ plain form
15749 -115909 -97233 -58327 -89428 -93933 -173606 -162075 -222010 -167574 -210366 -140036 -100104 -187634
15737 -187634 -124401 -117274 -119737 -165210 -137577 -185736 -167473 -152725 -302399 -199363 -214084
15726 -214084 -95722 -133923 -173172 -137017 -50185 33521 49495 98607 41737 98826 13538
15715 13538 -19231 -95435 -29180 28475 -78567 -53288 31677 67230 -12900 -68071 -129339
15704 -129339 -182635 -164544 -185111 -180487 -135943 -101128 -86578 -24183 -93294 -173422 -60015
15693 -60015 50963 38856 101997 1333 -30826 103274 200150 108427 47696 -85883 -2603
15682 -2603 108337 6467 -54313 -51346 156532 206222 81695 9272 36863 84666 115852
15671 115852 109900 -5548 -44438 -26383 54220 106567 86762 -56390 -19552 -32334 -193430
$$ packed form
15749a15909J8676L8906l1101m505p9673J1531n9935N4436m2792P0330L9932q7530
15737a87634O3233P127k463m5473K7633m8159J8263J4748j49674J03036j4721
15726b14084J18362l8201l9249L6155Q6832Q3706J5974M9112n6870N7089q5288
15715A3538l2769p6204O6255N7655j07042K5279Q4965L5553q0130n5171o1268
15704a29339n3296J8091k0567M624M4544L4815J4550O2395o9111q0128J13407
15693f0015J10978j2107O3141j00664l2159J34100R6876r1723o0731j33579Q3280
15682b603J10940j01870o0780K967K07878M9690j24527p2423K7591M7803L1186
15671A15852n952j15448l8890J8055Q0603N2347j9805j43152L6838j2782j61096
$$ plain form
15660 -193430 -342441 -362593 -234406 -166570 -259882 -143189 -36754 6443 140376 54645
15650 54645 -47003 -226437 -195141 -203438 -207598 -114981 -129546 -201743 -185704 -133459 -89910 -67375
15638 -67375 -145370 -86741 20519 -13184 29505 57585 10289 -79983 -21395 46127 143014
15627 143014 45728 -38624 -63955 -98922 -55837 -49739 -152841 -177701 -210280 -189646 -157589
15616 -157589 -116542 -20323 -104823 -71222 -69537 -249571 -227631 -81037 -87506 -103362 -7682
15605 -7682 10662 -90576 -60184 -10546 15349 -80020 -40648 -87328 -146880 -72808 -72282 -64431
15593 -64431 -54862 -94887 -190092 -190391 -226251 -294992 -175770 -126018 -124327 -152263 -192517 -157981
15581 -157981 -86548 -54950 -24138 -56538 -37917 -78116 -37316 -53582 -89993 -176346 -117586
$$ packed form
15660a93430j49011k0152J28187O7836r3312J16693J06435M3197J33933q5731
15650E4645j01648j79434L1296q297m160R2617j4565p2197J6039N2245M3549K2535
15638f7375p7995N8629J07260l3703M2689K8080m7296r0272N8588O7522R6887
15627A43014r7286q4352k5331l4967M3085O098j03102k4860l2579K0634L2057
15616a57589M1047R6219q4500L3601J685j80034K1940J46594o469j5856R5680
15605g682J8344j01238L0392M9638K5895r5369L9372m6680n9552P4072N26P851
15593f4431R569m0025r5205k99l5860o8741J19222M9752J691k7936m0254L4536
15581a57981P1433L1598L0812l2400J8621m0199M0800j6266l6411q6353N8760
$$ plain form
15570 -117586 -125102 -6197 51337 3661 -2839 15636 -83948 -53333 -18336 26968 -41397 -92151
15558 -92151 -150711 -233208 -282672 -349269 -385142 -295255 -207901 -201761 -160358 -155815 -200184 -216814
15546 -216814 -205676 -175108 -189241 -236893 -210475 -92649 -22908 -36585 -101446 -31558 -7048
15535 -7048 -28693 -23449 25326 -95450 -232198 -272661 -186016 -84214 -91067 41657 21413
15524 21413 -27041 -38084 -48064 -127403 -7635 -51585 -110759 -53490 46693 30059 46141
15513 46141 75415 -19835 -30154 -21759 -156067 -128906 -106377 -147861 -8059 214263 170169
15502 170169 36809 -3404 -1537 37948 -30682 -65061 -160148 -300062 -246539 -161081 -76133
15491 -76133 -25590 -142692 -296505 -299294 -172669 -109504 -87255 -15917 -101380 -45196 87290
$$ packed form
15570a17586p516J18905N7534m7676o500J8475r9584L0615L4997M5304o8365n0754
15558i2151n8560q2497m9464o6597l5873Q9887Q7354O140M1403M543m4369j6630
15546b16814J1138L0568j4133m7652K6418J17826O9741j3677o4861O9888K4510
15535g048k1645N244M8775j20776j36748m0463Q6645J01802o853J32724k0244
15524B1413m8454j1043r980p9339J19768m3950n9174N7269J00183j6634J6082
15513D6141K9274r5250j0319Q395j34308K7161K2529m1484J39802K22322m4094
15502A70169j33360m0213J867L9485o8630l4379r5087j39914N3523Q5458Q4948
15491g6133N0543j17102j53813k789J26625O3165K2249P1338q5463N6184J32486
$$ plain form
15480 87290 105311 -9898 -64103 -131303 -196864 -258682 -240091 -265165 -321921 -293280 -369379
15469 -369379 -376289 -343556 -338739 -251764 -156667 -103814 -98169 -116617 -145365 -62667 12273 76752
15457 76752 170477 289751 200473 66454 27983 31124 86051 181905 150547 26036 -186079
15446 -186079 -161285 -163292 -188099 -300077 -280505 -274660 -141065 -81971 -61619 26742 65182
15435 65182 -11492 -156693 -163719 -78895 -88844 -74776 -45281 -22889 -23152 -53030 -22556 -48885
15423 -48885 -25990 23184 7359 -34484 -58378 -113167 -156420 -73153 -87334 -249876 -275211
15412 -275211 -174841 -112450 -99322 -73838 -23142 -42784 -25562 51707 -18866 -132489 -87282
15401 -87282 -22766 2324 67466 33522 -95665 -4646 39497 94079 7523 7882 16239 -7462
$$ packed form
15480H7290J8021j15209n4205o7200o5561o1818J8591k5074n6756K8641p6099
15469c69379o910L2733M817Q6975R5097N2853N645j8448k8748Q2698P4940O4479
15457G6752R3725J19274q9278j34019l8471L141N4927R5854l1358j24511k12115
15446a86079K4794k007k4807j11978J9572N845J33595N9094K0352Q8361L8440
15435F5182p6674j45201p026Q4824r949J4068K9495K2392k63k9878L0474k6329
15423d8885K2895M9174j5825m1843k3894n4789m3253Q3267j4181j62542k5335
15412b75211J00370O2391J3128K5484N0696j9642J7222P7269p0573j13623M5207
15401h7282O4516K5090O5142l3944j29187R1019M4143N4582q6556L59Q357k3701
$$ plain form
15389 -7462 -87022 -135752 -266426 -215160 -32006 122342 43395 34367 211841 234149 20041
15378 20041 -22687 -122403 -18402 16431 12459 36536 -20101 -19639 68948 -383 -39461 -37924
15366 -37924 -73051 -70393 -33305 -68621 -35258 -39861 -9191 -105695 -149686 -162206 -158191 -81787
15354 -81787 -104643 -31019 -14979 -21061 -20599 -199828 -279498 -186759 -72059 -30271 -63790 -99977
15342 -99977 -148427 -144782 -46489 -57022 -76545 -93 47297 4871 35297 -58699 -171831 -187804
15330 -187804 -126986 -49047 -124860 -157048 -93559 -156643 -174423 -159117 -117086 -15891 -34749
15319 -34749 -71002 -128571 -38025 166076 92994 110777 5257 -82439 78493 25000 22315
15308 22315 80115 100008 -1553 -46727 -62202 -176522 -124940 -56830 -45130 -77274 -112686
$$ packed form
15389g462p9560m8730j30674N1266J83154J54348p8947r028J77474K2308k14108
15378B0041m2728r9716J04001L4833l972K4077n6637M62Q8587o9331l9078J537
15366c7924l5127K658L7088l5316L3363m603L0670r6504m3991j2520M015P6404
15354h1787k2856P3624J6040o082M62j79229p9670R2739J14700M1788l3519l6187
15342i9977m8450L645R8293j0533j9523P6452M7390m2426L0426r3996j13132j5973
15330a87804O0818P7939p5813l2188O3489o3084j7780J5306M2031J01195j8858
15319c4749l6253n7569R0546K04101p3082J7783j05520q7696J60932n3493k685
15308B2315N7800J9893j01561m5174j5475j14320N1582O8110J1700l2144l5412
$$ plain form
15297 -112686 -102831 -39148 -83504 -134177 -197075 -200268 -142933 26797 100632 -44419 -23311
15286 -23311 36701 1886 -62974 -20492 -115724 -134137 -159646 -41965 39770 45935 32417 9317
15274 9317 74637 101085 148864 39247 -20701 -18116 -79270 -88999 -193005 -218761 -107793 100757
15262 100757 128382 3539 59325 1195 26270 -67295 -196609 -130900 -14218 -19061 -231062
15251 -231062 -199262 -91904 -127437 -31399 7440 44742 -17442 -36776 -4968 -77370 -129098
15240 -129098 -186247 -49989 -1639 -641 -106491 -125968 -103306 -120301 -162461 -206450 -121016
15229 -121016 -75441 -67011 -48353 -134808 -183637 -152385 -154750 -140846 -68440 82562 37331 -51394
15217 -51394 -100059 -93396 -74683 -109911 -155928 -183631 -121891 -6413 -18048 -44309 -147740
$$ packed form
15297a12686R855O3683m4356n0673o2898l193N7335J69730P3835j45051K1108
15286b3311O0012l4815o4860M2482r5232j8413k5509J17681Q1735O165j3518k3100
15274I317O5320K6448M7779j09617n9948K585o1154r729j04006k5756J10968K08550
15262A00757K7625j24843N5786n8130K5075r3565j29314O5709J16682m843k12001
15251b31062L1800J07358l5533R6038L8839L7302o2184j9334L1808p2402n1728
15240a29098n7149J36258M8350R98j05850j9477K2662j6995m2160m3989Q5434
15229a21016M5575Q430J8658q6455m8829L1252k365J3904P2406J51002m5231q8725
15217e1394m8665O663J8713l5228m6017k7703O1740J15478j1635k6261j03431
$$ plain form
15206 -147740 -188611 -83326 -31741 -33153 -87425 -179851 -184102 -185779 -117111 -77701 7046 41299
15194 41299 -16208 -29989 4362 33285 18083 -42996 -118655 -96791 -21483 -20064 -137900 -117353
15182 -117353 10283 44567 158742 229834 170715 114307 63780 -2682 60933 -24952 -145680
15171 -145680 -95707 -20346 68227 142042 150001 97249 -10728 -39774 -92207 -125880 -114196
15160 -114196 -284128 -256045 -277637 -303416 -208346 -134904 -99822 -164016 -197217 -223533 -140067
15149 -140067 -21676 -7353 11615 81885 101149 73241 35949 -68521 -75390 -89637 -189378
15138 -189378 -64708 100639 95573 58321 -39817 -137407 -176089 -176773 -65792 12915 -18752
15127 -18752 -41864 347 5755 -146041 -156578 -102433 -69735 1349 -58027 -142608 -184977 -202241
$$ packed form
15206a47740m0871J05285N1585j412n4272r2426m251j677O8668L9410Q4747L4253
15194D1299n7507j3781L4351K8923j5202o1079p5659K1864P5308J419j17836K0547
15182a17353J27636L4284J14175P1092n9119n6408n0527o6462O3615q5885j20728
15171a45680M9973P5361Q8573P3815P959n2752j07977k9046n2433l3673J1684
15160a14196j69932K8083k1592k5779R5070P3442L5082o4194l3201k6316Q3466
15149a40067J18391J4323J8968P0270J9264k7908l7292j04470o869j4247r9741
15138a89378J24670J65347n066l7252r8138r7590l8682o84J10981P8707l1667
15127a8752k3112M2211N408j51796j0537N4145L2698P1084n9376q4581m2369j7264
$$ plain form
15115 -202241 -124561 10508 -8367 46117 71923 83950 68316 -21470 2034 -5669 -43723
15104 -43723 10482 122088 -7542 -79491 -258021 -368747 -386467 -348882 -412181 -353444 -227205
15093 -227205 -87868 13205 -54411 -73768 -70668 -121099 -187132 -122006 31479 123884 184647
15082 184647 78498 40333 -20391 7843 -18859 18974 53706 75932 44215 119806 77478
15071 77478 -60629 -234395 -227996 -198165 -96827 -128920 -202788 -192115 -151193 -84317 -66106
15060 -66106 29078 91554 24646 -30740 -34164 18117 117506 135324 17493 -82985 -142326
15049 -142326 -200717 -176197 -73065 -19254 18535 22946 7385 8087 22380 146168 166305 150181
15037 150181 43990 -624 353 -78703 -86933 -52229 -51561 -72219 -84375 -66357 -221616 -253466
$$ packed form
15115b02241P7680J35069j8875N4484K5806J2027j5634q9786K3504p703l8054
15104d3723N4205J11606j29630p1949j78530j10726j7720L7585o3299N8737J26239
15093b27205J39337J01073o7616j9357L100n0431o6033O5126J53485R2405O0763
15082A84647j06149l8165o0724K8234k6702L7833L4732K2226l1717P5591m2328
15071G7478j38107j73766O399K9831J01338l2093p3868J0673M0922O6876J8211
15060f6106R5184O2476o6908n5386l424N2281R9389J7818j17831j00478n9341
15049a42326n8391K4520J03132N3811L7789M411j5561P02J4293J23788K0137j6124
15037A50181j06191m4614R77p9056q230L4704O68k0658j2156J8018j55259l1850
$$ plain form
15025 -253466 -230325 -168495 -15874 38811 -17575 -105922 -71352 -129597 -289915 -242634 -259911
15014 -259911 -285283 -288307 -247553 -138088 -182624 -109680 -49721 -79283 -46249 -193020 -204689
15003 -204689 -199485 -257168 -282351 -203377 -135243 -13657 74780 95236 -68122 238 46042
14992 46042 -163853 -186690 -113704 -49117 -130466 -155480 -177616 -223092 -180792 -141633 -165246
14981 -165246 -95786 -39131 105386 222486 261247 236704 162758 255 -162255 -151692 -136962
14970 -136962 -156722 -104860 -11543 45350 221387 144139 28286 -19660 24193 -123036 -154307
14959 -154307 -82124 -106730 -139010 -121476 -46761 35858 53604 19189 -73235 -61899 -43414
14948 -43414 -4235 15096 -328 -72001 -104126 -100373 -18847 -26582 25036 87861 42890 45750
$$ packed form
15025b53466K3141O1830J52621N4685n6386q8347L4570n8245j60318M7281j7277
15014b59911k5372l024M0754J09465m4536P2944N9959k9562L3034j46771j1669
15003b04689N204n7683k5183P8974O8134J21586Q8437K0456j63358O8360M5804
14992D6042k09895k2837P2986O4587q1349k5014k2136m5476M2300L9159k3613
14981a65246O9460N6655J44517J17100L8761k4543p3946j62503j62510J0563J4730
14970a36962j9760N1862R3317N6893J76037p7248j15853m7946M3853j47229l1271
14959a54307P2183k4606l2280J7534P4715Q2619J7746l4415r2424J1336J8485
14948d3414L9179J9331j5424p1673l2125L753Q1526p735N1618O2825m4971K860
$$ plain form
14936 45750 -34790 -70544 -89286 -39231 16162 67617 127127 140921 116237 26074 -77452
14925 -77452 -33690 93686 110928 191818 201197 145847 33846 -55296 -22478 17751 -5171
14914 -5171 74772 144247 120085 124554 120453 29508 -104674 -14917 31940 39679 40401 128540 191553
14901 191553 38378 93897 148819 38655 37043 -62741 -135699 -142774 -149845 -13702 189545
14890 189545 146119 37957 -59308 -51549 -46844 -3544 -21045 -149521 -217475 -117732 14130
14879 14130 -13333 -77551 -23322 -19983 -67651 -66902 58586 117311 82963 -32662 -143986 -165867
14867 -165867 -192983 -309344 -163245 -122271 -256156 -275334 -335953 -402834 -223570 -156398 -225651
14856 -225651 -202604 -277095 -211430 -95618 -110093 -123215 -72782 -35244 -63822 -161882 -250740
$$ packed form
14936D5750q0540l5754j8742N0055N5393N1455N9510J3794k4684r0163j03526
14925g7452M3762J27376J7242Q0890R379n5350j12001q9142L2818M0229k2922
14914e171P9943O9475k4162M469m101r0945j34182Q9757M6857P739P22Q8139O3013
14901A91553j53175N5519N4922j10164j612r9784p2958p075p071J36143K03247
14890A89545m3426j08162r7265P759M705M3300j7501j28476o7954R9743J31862
14879A4130k7463o4218N4229L339m7668P49J25488N8725l4348j15625j11324k1881
14867a65867k7116j16361J46099M0974j33885j9178o0619o6881J79264O7172o9253
14856b25651K3047p4491O5665J15812j4475j3122N0433L7538k8578r8060q8858
$$ plain form
14845 -250740 -300438 -148116 -125358 -219087 -111190 -41738 -39290 -62535 -64998 -125645 -76657
14834 -76657 7051 -113839 -159669 -70044 -120791 -73189 -107254 -77170 -51729 70227 83739
14823 83739 -38245 -107872 -40935 16798 3176 30562 73663 109180 2202 -70917 -41027
14812 -41027 -75 14383 -48713 -23680 -154448 -152011 -134836 -170006 -155682 -151345 -147856 -37045
14800 -37045 160684 226735 160172 162288 53124 441 60773 177053 165972 34440 91230
14789 91230 157010 219469 240722 157622 62028 -86904 -100248 -70641 -14233 25922 47348
14778 47348 109307 -42547 -36509 -16199 -41614 -6401 -71568 -56443 879 79999 -37497
14767 -37497 -39230 -139584 -176486 -159435 -318352 -358528 -308170 -189470 -107173 -79940 29890
$$ packed form
14845b50740m9698J52322K2758r3729J07897O9452K448k3245k463o0647M8988
14834g6657Q3708j20890m5830Q9625n0747M7602l4065L0084K5441J21956J3512
14823H3739j21984o9627O6937N7733j3622K7386M3101L5517j06978p3119K9890
14812d1027M0952J4458o3096K5033j30768K437J7175l5170J4324M337L489J10811
14800c7045J97729O6051o6563K116j09164n2683O0332J16280j1081j31532N6790
14789I1230O5780O2459K1253q3100r5594j48932j3344K9607N6408M0155K1426
14778D7348O1959j51854O038K0310k5415L5213o5167J5125N7322P9120j17496
14767c7497j733j00354l6902J7051j58917m0176N0358J18700Q2297K7233J09830
$$ plain form
14756 29890 1157 -78116 -129063 -170307 -152403 -133972 -98510 -88925 -55005 -76085 -140473 -202111
14744 -202111 -207086 -98128 -61501 -157685 -177428 -182901 -191035 -150066 -56087 -50817 35633 17204
14732 17204 -29795 -128326 -111070 -45451 -110648 -75060 -100756 -129792 -179663 -162604 -76139 12549
14720 12549 50890 85543 62905 100749 143291 88990 127424 96734 107027 132827 188821 110930
14708 110930 77435 80956 20729 -9706 31655 59441 32107 -125338 -228188 -81789 -79738
14697 -79738 -178452 -230297 -100180 -10589 91995 39933 -40865 26214 -27120 39897 62477
14686 62477 24762 12352 23828 -51266 -178757 -59695 -24635 -83172 -29733 11930 -8168
14675 -8168 12505 62556 69911 93214 77811 9790 -129242 -161605 44088 22950 70760 100800
$$ packed form
14756B9890k8733p9273n0947m1244J7904J8431L5462R585L3920k1080o4388o1638
14744b02111m975J08958L6627r6184j9743n473q134M0969R3979N270Q6450j8429
14732A7204m6999r8531J7256O5619o5197L5588k5696k9036m9871J7059Q6465Q8688
14720A2549L8341L4653k2638L7844M2542n4301L8434l0690J0293K5800N5994p7891
14708A10930l3495L521o0227l0435M1361K7786k7334j57445j02850J46399K051
14697g9738r8714n1845J30117Q9591J02584n2062q0798O7079n3334O7017K2580
14686F2477l7715j2410J1476p5094j27491J19062L5060n8537N3439M1663k0098
14675h168K0673N0051P355K3303j5403o8021j39032l2363K05693k1138M7810L0040
$$ plain form
14663 100800 135036 90993 184183 325624 322158 221811 167617 141148 101406 36552 -78199
14652 -78199 -105866 -70724 -186238 -145491 -135713 -29978 -142346 -294407 -210608 -44145 35163
14641 35163 25631 35688 69500 102907 24403 -84041 -123275 -26501 -56563 -159594 -197337
14630 -197337 -187667 -118057 -38719 -39395 -35360 74108 107485 78896 3432 49523 75435 67607
14618 67607 98164 82899 197590 252493 126385 65593 122425 -38401 -128371 -182046 -139062
14607 -139062 -111750 -44630 32564 75152 4988 -106808 -186248 -205282 -257499 -350784 -258132
14596 -258132 -175093 -102409 51448 49437 -47020 -81853 -44170 -63099 -73690 3099 -29119
14585 -29119 31748 15369 -60277 -185305 -93145 88335 73902 46360 -94809 -120703 -38989
$$ packed form
14663A00800L4236m4043R3190J41441l466j00347n4194k6469l9742o4854j14751
14652g8199k7667L5142j15514M0747R778J05735j12368j52061Q3799J66463P9308
14641C5163r532J0057L3812L3407p8504j08444l9234R6774l0062j03031l7743
14630a97337R670O9610P9338o76M035J09468L3377k8589p5464M6091K5912p828
14618F7607L0557j5265J14691N4903j26108o0792N6832j60826q9970n3675M2984
14607a39062K7312O7120P7194M2588p0164j11796p9440j9034n2217r3285R2652
14596b58132Q3039P2684J53857k011r6457l4833L7683j8929j0591P6789l2218
14585b9119O0867j6379p5646j25028R2160J81480j4433k7542j41169k5894Q1714
$$ plain form
14574 -38989 -6442 -4294 -72453 -81800 -91311 -28079 68174 50002 -11537 56467 87809 15781
14562 15781 -95998 -136503 -125205 40584 146815 243622 206841 168872 120700 38094 -31737
14551 -31737 -25210 -198171 -241427 -100056 73437 114597 202424 206113 213783 230349 216763 163974
14539 163974 153965 140695 146211 184922 126551 111191 2325 -110660 -66799 -20774 -83317
14528 -83317 -31320 83994 98965 151303 103179 79854 14340 -2965 85319 205628 116849
14517 116849 77113 -206081 -281734 -140280 -74172 24987 2358 -49283 -84866 -115812 -48150
14506 -48150 139777 114029 -114808 -253939 -190030 -122517 -153987 -78557 -129943 -20902 165443
14495 165443 149689 2595 -40770 23624 35736 13637 -31496 -13102 -26503 -2355 -122145
$$ packed form
14574c8989L2547K148o8159r347r511O3232R6253j8172o1539O8004L1342p2028
14562A5781j11779m0505J1298J65789J06231R6807l6781l7969m8172q2606o9831
14551c1737O527j72961m3256J41371J73493M1160Q7827L689P670J6566j3586n2789
14539A63974j0009j3270N516L8711n8371j5360j08866j12985M3861M6025o2543
14528h3317N1997J15314J4971N2338m8124k3325o5514j7305Q8284J20309q8779
14517A16849l9736k83194p5653J41454O6108R9159k2629n1641l5583l0946O7662
14506d8150J87927k5748k28837j39131O3909O7513l1470P5430n1386J09041J86345
14495A65443j5754j47094m3365O4394J2112k2099m5133J8394j3401K4148j19790
$$ plain form
14484 -122145 -145994 -113996 -189592 -120477 25963 -18641 -49245 -74512 -65950 -33742 20134
14473 20134 -22367 -63841 -81287 -80102 14094 36286 72920 133569 232440 233521 176866 65319
14461 65319 91303 138974 121162 172717 114250 39387 56684 113688 125068 67884 107628 154594
14449 154594 144454 97507 43731 -1277 -9728 -58330 11407 48394 -18592 -72269 -142880 -138389
14437 -138389 -102494 -3029 57123 126021 207898 218648 226767 153524 44856 80750 160658
14426 160658 22196 -115060 -81854 -67670 -60484 -101634 -130902 -142137 -176319 -96995 37475
14415 37475 117680 120770 77521 -49855 -740 79269 2169 -33597 77877 184695 199038
14404 199038 156611 101402 116015 -68906 -99598 -100724 -16228 114477 210981 34646 -3755
$$ packed form
14484a22145k3849L1998p5596O9115J46440m4604l0604k5267Q562L2208N3876
14473B0134m2501m1474j7446J185R4196K2192L6634O0649R8871J081n6655j11547
14461F5319K5984M7671j7812N1555n8467p4863J7297N7004J1380n7184L9744M6966
14449A54594j0140m6947n3776m5008q451m8602O9737L6987o6986n3677p0611M491
14437a38389L5895R9465O0152O8898Q1877J0750Q119p3243j08668L5894P9908
14426A60658j38462j37256L3206J4184P186m1150k9268j1235l4182P9324J34470
14415C7475Q0205L090m3249j27376M9115Q0009p7100l5766J11474J06818J4343
14404A99038m2427n5209J4613j84921l0692j126Q4496J30705R6504j76335l8401
$$ plain form
14393 -3755 116178 190931 46767 -22140 -32276 -91079 -192538 -160123 -89736 -100060 -9129
14382 -9129 118307 37967 89242 94623 71360 90089 141600 242255 235332 110055 181349 185702
14370 185702 31773 -27609 30409 135249 165119 90622 5164 83502 37647 -87380 -50696
14359 -50696 65637 116930 33268 15904 115051 176168 147621 90266 121057 112828 17416 22167
14347 22167 86145 144855 139931 98494 60201 21998 -105020 -88462 -71039 -56177 -39072 -79089
14335 -79089 -159339 -86504 -28963 -4910 -83377 -55284 -3771 -97975 -94298 -37247 85039 220360
14323 220360 159433 26856 61123 95739 54739 147904 282151 309319 164110 161735 62622
14312 62622 -46607 -55344 -21881 -136114 -192957 -235034 -74841 85791 120643 165814 91018
$$ packed form
14393c755J19933P4753j44164o8907j0136n8803j01459L2415P0387j0324R0931
14382i129J27436q0340N1275N381k3263J8729N1511J00655o923j25277P1294M353
14370A85702j53929n9382N8018J04840K9870p4497q5458P8338m5855j25027L6684
14359e0696J16333N1293q3662j7364R9147O1117k8547n7355L0791q229r5412M751
14347B2167O3978N8710m924m1437l8293l8203j27018J6558J7423J4862J7105m0017
14335g9089q0250P2835N7541K4053p8467K8093N1513r4204L677N7051J22286J35321
14323B20360o0927j32577L4267L4616m1000R3165J34247K7168j45209k375r9113
14312F2622j09229q737L3463j14233n6843m2077J60193J60632L4852M5171p4796
$$ plain form
14301 91018 -2043 -38014 -119647 -146695 -47090 143254 236817 226008 212177 188595 43443
14290 43443 40349 119342 83609 -4335 -83041 -174501 -86767 -100230 -31893 -12981 76107 136103
14278 136103 115720 173387 9763 -23910 30542 118053 143006 201852 97523 -86915 -55337
14267 -55337 32605 62626 24587 -88618 -137941 -85666 -106499 -45214 29258 109872 -2008
14256 -2008 -156177 -202238 -174017 -110002 -4231 136717 138662 67110 26811 58763 75518
14245 75518 161560 124138 92898 -41008 -56837 33377 66626 152396 99353 137106 62473
14234 62473 -33201 7409 -1400 114246 131251 38726 74204 121666 158681 136294 178238 134324
14222 134324 221276 254950 289722 147868 -86654 -105201 -42040 -38663 -54573 -111768 -75638
$$ packed form
14301I1018r3061l5971q1633k7048R9605J90344R3563j0809j3831k3582j45152
14290D3443l094P8993l5733q7944p8706r1460Q7734j3463O8337J8912Q9088N9996
14278A36103k0383N7667j63624l3673N4452Q7511K4953N8846j04329j84438L1578
14267e5337Q7942L0021l8039j13205m9323N2275k0833O1285P4472Q0614j11880
14256b008j54169m6061K8221O4015J05771J40948J945p1552m0299L1952J6755
14245G5518Q6042l7422l1240j33906j5829R0214L3249Q5770n3043L7753p4633
14234F2473r5674M0610q809J15646J7005r2525L5478M7462L7015k2387M1944m3914
14222A34324Q6952L3674L4772j41854k34522j8547O3161L377j5910n7195L6130
$$ plain form
14211 -75638 -1791 33164 42370 66291 98883 114667 22782 24238 -75047 -75485 -34721 -57726
14199 -57726 -84354 -129867 -99335 -65744 -49957 -104763 -130760 -157696 -135247 -60085 -102508 -68425
14187 -68425 -47686 25172 -58277 -116209 -127431 -5414 -12100 -58198 -204167 -288536 -237836
14176 -237836 -115776 29271 85469 28307 113670 98804 -96001 -173325 -111766 -126201 -72130
14165 -72130 -52592 -56025 -54599 75731 41605 -30390 -136882 -84275 104541 196619 99125
14154 99125 61740 154398 238187 200548 69762 14465 -69783 -69129 -156904 -132156 -10408 78991
14142 78991 134612 71450 -38874 -106008 -12006 125486 124910 99822 96601 204824 288158 291609
14130 291609 215894 107687 33375 26771 -10214 8439 18581 16065 9410 78638 99254 25751
$$ packed form
14211g5638P3847L4955R206K3921L2592J5784r1885J456r9285m38M0764k3005
14199e7726k6628m5513L0532L3591J5787n4806k5997k6936K2449P5162m2423L4083
14187f8425K0739P2858q3449n7932j1222J22017o686m6098j45969q4369N0700
14176b37836J22060J45047N6198n7162Q5363j4866j94805p7324O1559j4435N4071
14165g2130J9538l433J426J30330l4126p1995j06492N2607J88816R2078r7494
14154I9125l7385R2658Q3789l7639j30786n5297q4248O54q7775K4748J21748Q9399
14142G8991N5621o3162j10324o7134R4002J37492n76k5088l221J08223Q3334L451
14130B91609p5715j08207p4312o604l6985J8653J0142k516o655O9228K0616p3503
$$ plain form
14118 25751 -42666 -132718 -96463 -184002 -97521 -52968 39499 79935 128331 216154 220421 218521
14106 218521 8257 -108292 -67735 -55117 105473 238713 112724 -102484 19350 158867
14096 158867 197072 159240 114943 186269 153543 49751 67948 92015 80176 -32966 -93616
14085 -93616 59292 176799 150159 152851 91946 162053 180642 66800 1413 10752 -18959
14074 -18959 -16160 49 31825 108526 118825 213041 216966 30468 60373 86304 93973 163454
14062 163454 273979 271140 186010 23542 -38118 23708 86411 76854 126402 12150 -79690
14051 -79690 30115 109450 42356 61455 2738 91053 85158 76058 23882 76008 33936 -26172
14039 -26172 22276 72239 103696 150684 140260 87289 -10038 -132398 -136110 -75281 79366
$$ packed form
14118B5751o8417r0052L6255q7539Q6481M4553R2467M0436M8396Q7823M267j900
14106B18521k10264j16549M0557J2618J60590J33240j25989k15208J21834J39517
14096A58867L8205l7832m4297P1326l2726j03792J8197K4067j1839j13142o0650
14085i3616J52908J17507k6640K692o0905P0107J8589j13842o5387R339k9711
14074a8959K799J6209L1776P6701J0299R4216L925j86498K9905K5931P669O9481
14062A63454J10525k839q5130j62468o1660O1826O2703r557M9548j14252r1840
14051g9690J09805P9335o7094J9099n8717Q8315n895r100n2176N2126m2072o0108
14039b6172M8448M9963L1457M6988j0424n2971r7327j22360l712O0829J54647
$$ plain form
14028 79366 244431 159462 -44245 -103842 -77733 -86175 -88440 -121657 -122795 -168855 -91011 35132
14016 35132 228249 167498 7116 -69973 -86897 -25339 9693 83183 32345 -12580 41666
14005 41666 183989 275779 291457 179921 116054 153631 69402 152790 234618 142129 139852
13994 139852 130802 223438 184060 134901 121399 38649 -77525 -156313 -126046 -56989 -45588
13983 -45588 -120340 -55364 -9964 34699 43269 64167 64000 26894 27661 -76485 -45002 141909
13971 141909 175829 133780 111347 192812 279862 296999 217674 224990 242805 224859 101767
13960 101767 -47559 -65877 -19733 -10857 34463 99235 177447 171412 142032 164378 108756 -1362
13948 -1362 -51631 -102933 4717 30220 89035 200979 164324 186427 92250 -24539 -1412
$$ packed form
14028G9366J65065q4969k03707n9597K6109q442k265l3217j138m6060P7844J26143
14016C5132J93117o0751j60382p7089j6924O1558L5032P3490n0838m4925N4246
14005D1666J42323R1790J5678j11536o3867L7577q4229Q3388Q1828r2489k277
13994A39852r050R2636l9378m9159j3502q2750j16174p8788L0267O9057J1401
13983d5588p4752O4976M5400M4663Q570K0898j67l7106P67j04146L1483J86911
13971A41909L3920m2049k2433Q1465Q7050J7137p9325P316J7815j7946j23092
13960A01767j49326j8318M6144Q876M5320O4772P8212o035k9380K2346n5622j10118
13948a362n0269n1302J07650K5503N8815J11944l6655K2103r4177j16789K3127
$$ plain form
13937 -1412 58735 70874 61109 36620 148020 268574 148308 59998 -32089 -6528 -51671
13926 -51671 39338 -29799 -134833 -47536 13484 -27722 -92654 -32614 104924 136529 162089
13915 162089 68462 64162 91969 68203 37973 93951 186495 87908 34405 37283 16674 57190
13903 57190 103734 58346 118722 139732 -12522 -87326 124992 280858 207098 164121 193889
13892 193889 54607 3202 58441 88848 88303 127807 165934 124736 127546 216806 274514 291001
13880 291001 330442 246202 156730 239779 108059 -1054 91002 116525 85913 49668 -17970
13869 -17970 6051 27015 5756 79225 -14411 -177678 -32030 8381 10670 -25194 9933
13858 9933 -56983 -57408 -90071 -9794 120819 62550 145008 244012 283750 339499 182035 68114
$$ packed form
13937a412O0147J2139r765k4489J11400J20554j20266q8310r2087K5561m5143
13926e1671R1009o9137j05034Q7297O1020m1206o4932O0040J37538L1605K5560
13915A62089r3627m300K7807k3766l0230N5978R2544r8587n3503K878k0609M0516
13903E7190M6544m5388O0376K1010j52254p4804K12318J55866p3760m2977K9768
13892A93889j39282n1405N5239L0407n45L9504L8127m1198K810Q9260N7708J6487
13880B91001L9441q4240q9472Q3049j31720j09113R2056K5523l0612l6245o7638
13869a7970K4021K0964k1259P3469r3636j63267J45648M0411K289l5864L5127
13858I933o6916m25l2663Q0277J30613n8269Q2458R9004L9738N5749j57464j13921
$$ plain form
13846 68114 178853 261294 284204 306164 286373 116351 -43036 -76079 -103761 -52892 101792
13835 101792 50639 -23346 -14627 23515 62866 32968 -22635 -75218 69846 85850 117345
13824 117345 -15463 -102850 -42218 29860 -47363 11857 79779 190814 168767 136761 154758
13813 154758 211742 140892 123848 20856 12576 80634 182096 210939 200391 231691 221967
13802 221967 213258 167028 231682 230438 154347 121360 147400 184124 233009 118514 155852 191708
13790 191708 77971 70554 58356 84976 7388 50243 103134 42525 22631 78521 263946
13779 263946 342124 183475 28131 -63261 -3033 87742 81326 178385 292369 240253 88365
13768 88365 28460 73071 85644 130278 98724 165896 250652 154776 -35420 73975 217226
$$ packed form
13846F8114J10739Q2441K2910K1960j9791j70022j59387l3043k7682N0869J54684
13835A01792n1153p3985Q719L8142L9351k9898n5603n2583J45064J6004L1495
13824A17345j32808q7387O0632P2078p7223N9220O7922J11035k2047l2006J7997
13813A54758N6984p0850j7044j02992q280O8058J01462K8843j0548L1300r724
13802B21967q709m6230O4654j244p6091l2987K6040L6724M8885j14495L7338L5856
13790A91708j13737p417j2198K6620p7588M2855N2891o0609j9894N5890J85425
13779B63946P8178j58649j55344r1392O0228R0775o416R7059J13984n2116j51888
13768H8365n9905M4611J2573M4634l1554O7172Q4756r5876j90196J09395J43251
$$ plain form
13757 217226 228546 156779 114778 74173 26276 -66824 -23976 38448 45549 72016 144658 94055
13745 94055 59422 174374 295446 315294 287408 162220 -57375 -120814 -61444 86882 118515
13734 118515 68963 -70181 -58398 71397 76558 97756 80557 30447 -4013 76074 160947
13723 160947 229025 183778 74053 -25732 45922 173298 295696 308089 185275 176510 184466
13712 184466 262608 239767 147129 269604 267585 257510 252974 208512 111705 27349 58244 150211
13700 150211 55677 127780 139752 158890 168773 107364 179108 316039 353645 208725 121856
13689 121856 -82995 -35281 73567 161949 108606 84872 104895 214342 273338 259876 322922
13678 322922 283132 180843 133349 115471 183359 133565 104283 180467 280736 234394 109644
$$ packed form
13757B17226J1320p1767m2001m0605m7897r3100M2848O2424P101K6467P2642n0603
13745I4055l4633J14952J21072J9848k7886j25188k19595o3439N9370J48326L1633
13734A18515m9552j39144J1783J29795N161K1198j7199n0110l4460Q0087Q4873
13723A60947O8078m5247j09725r9785P1654J27376J22398J2393j22814q765P956
13712A84466P8142k2841r2638J22475k019j0075m536m4462r6807q4356L0895R1967
13700A50211r4534P2103J1972J9138R883o1409P1744J36931L7606j44920q6869
13689A21856k04851M7714J08848Q8382n3343k3734K0023J09447N8996j3462O3046
13678C22922l9790j02289m7494j7878O7888m9794k9282P6184J00269m6342j24750
$$ plain form
13667 109644 147991 191994 121832 152405 324057 298549 227937 159383 224550 415081 428691
13656 428691 404481 287272 90349 79487 -4328 46584 23239 30698 43341 88324 196704
13645 196704 233389 220395 193133 178789 228070 246933 164915 156765 125684 193251 126656 151864
13633 151864 74476 78908 14881 -61752 -162108 -79836 -39474 -84698 -39115 52608 208080
13622 208080 238131 261731 205975 140039 48946 159833 303778 364843 204630 77699 17856
13611 17856 55740 195164 197703 69225 -20074 55860 156068 229777 335687 374017 310180
13600 310180 257194 212492 102812 58761 47403 87493 91743 138885 292079 363149 348675
13589 348675 206361 38390 -70153 14648 -8267 1407 70237 191732 255941 187883 94653
$$ packed form
13667A09644L8347M4003p0162L0573J71652k5508p0612o8554O5167J90531J3610
13656D28691k4210j17209j96923j0862q3815N0912k3345P459J2643M4983J08380
13645A96704L6685j2994k7262j4344M9281J8863q2018q150l1081O7567o6595K5208
13633A51864p7388M432o4027p6633j00356Q2272M0362m5224M5583R1723J55472
13622B08080L0051K3600n5756o5936r1093J10887J43945O1065j60213j26931n9843
13611A7856L7884J39424K539j28478q9299P5934J00208P3709J05910L8330o3837
13600C10180n2986m4702j09680m4051j1358M0090M250M7142J53194P1070j4474
13589C48675j42314j67971j08543Q4801k2915R674O8830J21495O4209o8058r3230
$$ plain form
13578 94653 127600 84984 83475 68691 26889 42410 77753 72730 205068 248648 166501 187782
13566 187782 172999 224140 253366 214401 134732 95225 89036 129704 114167 62083 8875 125319
13554 125319 232933 157300 -47349 30211 165622 155269 45476 37612 64107 92488 134861
13543 134861 57737 420 -27405 67626 186803 171577 202363 207902 186878 240013 98791
13532 98791 -32414 146911 214396 331283 391316 268787 133937 128087 -6950 -118631
13522 -118631 -116767 -95935 -48865 80309 129250 83032 5052 -84180 -83697 44155 102196 150200
13510 150200 201837 226374 75219 127254 244681 270195 147927 81588 -12371 -34818 88952
13499 88952 196073 231078 226806 298967 248925 252567 72195 -15031 -41766 -73114 51317
$$ packed form
13578I4653L2947m2616j509j4784m1802J5521L5343n023J32338M3580q2147K1281
13566A87782j4783N1141K9226l8965p9669l9507o189M0668j5537n2084n3208J16444
13554A25319J07614p5633k04649P7560J35411j0353j09793p864K6495K8381M2373
13543A34861p7124n7317k7825R5031J19177j5226L0786N539k1024N3135j41222
13532I8791j31205J79325O7485J16887O0033j22529j34850n850j35037j11681
13522a18631J864K0832M7070J29174M8941m6218p7980q9232M83J27852N8041M8004
13510A50200N1637K4537j51155N2035J17427K5514j22268o6339r3959k2447J23770
13499H8952J07121L5005m272P2161n0042L642j80372q7226k6735l1348J24431
$$ plain form
13488 51317 264115 229681 230974 203427 142307 138406 8588 -97915 -26679 -63231 -9667
13477 -9667 95545 157585 162201 275304 291103 294950 236969 238590 317359 244503 120030 -9546
13465 -9546 -30578 15382 208034 203028 10023 18789 142927 229417 353648 325003 202793
13454 202793 122704 125348 115339 129181 171329 164044 304416 388189 416283 312587 170654
13443 170654 218979 310230 337705 225061 305660 257874 116541 134900 186787 262894 275075
13432 275075 239229 252402 217613 233065 384513 393422 430552 545518 437122 157335 63826
13421 63826 119208 313330 415348 334142 232252 216677 210385 156245 110739 76161 149621
13410 149621 267520 312608 334062 302191 171012 131726 243770 224620 205150 244839 195998
$$ packed form
13488E1317K12798l4434J293k7547o1120l901j29818j06503P1236l6552N3564
13477i667J05212O2040M616J13103J5799L847n7981J621P8769p2856j24473j29576
13465i546k1032M5960J92652n006j93005Q766J24138Q6490J24231k8645j22210
13454B02793q0089K644j0009J3842M2148p285J40372Q3773K8094j03696j41933
13443A70654M8325R1251K7475j12644Q0599m7786j41333J8359N1887P6107J2181
13432B75075l5846J3173l4789J5452J51448Q909L7130J14966j08396k79787r3509
13421F3826N5382J94122J02018q1206j01890j5575o292n4140m5506l4578P3460
13410A49621J17899M5088K1454l1871j31179l9286J12044j9150j9470L9689m8841
$$ plain form
13399 195998 216534 213936 165400 188095 219384 207320 257771 411775 361637 312464 405361
13388 405361 339609 353131 371329 358920 281253 272232 262075 230145 200772 288071 351666 356120
13376 356120 315294 299800 308596 314032 377011 445882 442474 404877 459051 345607 327990 235186
13364 235186 264162 236944 203942 248399 260863 168250 168672 144587 99638 135845 193095 378587
13352 378587 488022 383359 205275 316184 249275 249448 274215 310782 379693 467268 293827
13341 293827 250187 167785 73854 62289 152908 118098 198362 316218 317847 367948 476750
13330 476750 360509 298801 246690 163876 259162 392662 474930 436515 330162 284968 291622
13319 291622 247995 210700 290791 422021 300245 173925 234588 321028 489922 395016 304992
$$ packed form
13399A95998K0536k598m8536K2695L1289j2064N0451J54004n0138m9173R2897
13388D05361o5752J3522J8198j2409p7667r021j0157l1930k9373Q7299O3595M454
13376C56120m0826j5494Q796N436O2979O8871l408l7597N4174j13444j7617r2804
13364B35186K8976k7218l3002M4457J2464r2613M22k4085m4949L6207N7250J85492
13352C78587J09435j04663j78084J10909o6909J73K4767L6567O8911Q7575j73441
13341B93827m3640q2402r3931j1565R0619l4810Q0264J17856J629N0101J08802
13330D76750j16241o1708n2111q2814R5286J33500Q2268l8415j06353m5194O654
13319B91622m3627l7295Q0091J31230j21776j26320O0663Q6440J68894r4906r0024
$$ plain form
13308 304992 360521 343685 343286 359862 351005 265343 211299 244345 245537 256938 326334 364270
13296 364270 277642 183277 230991 208810 102569 206415 247120 205998 251841 313868 318275
13285 318275 349530 370976 390383 387891 359404 342118 351551 357681 256129 238734 202566 209578
13273 209578 151939 168421 202947 328959 362324 323245 318348 334690 408603 381553 384665 383686
13261 383686 310528 310028 269570 230482 213827 95401 87275 185157 217605 248062 272798 411412
13249 411412 429221 373474 275029 304031 274578 323504 382415 346319 234504 283407 301564
13238 301564 264211 233676 375344 402889 288359 254063 420128 580170 506823 527672 603338
13227 603338 556777 385989 326616 296259 325898 354462 438298 413432 353617 360195 456101
$$ packed form
13308C04992N5529j6836l99J6576q857q5662n4044L3046J192J1401O9396L7936
13296C64270q6628r4365M7714k2181j06241J03846M0705m1122M5843O2027M407
13285C18275L1255K1446J9407k492k8487j7286R433O130j01552j7395l6168P012
13273B09578n7639J6482L4526J26012L3365l9079m897J6342P3913k7050L112r79
13261C83686p3158n00m0458l9088j6655j18426q126R7882L2448L0457K4736J38614
13249D11412J7809n5747r8445K9002k9453M8926N8911l6096j11815M8903J8157
13238C01564l7353l0535J41668K7545j14530l4296J66065J60042p3347K0849P5666
13227F03338m6561j70788n9373l0357K9639K8564Q3836k4866n9815O578R5906
$$ plain form
13216 456101 498577 435390 366436 308732 293438 306852 321313 266111 286562 294062 264205 232560
13204 232560 307067 367162 183147 219254 348264 447950 408818 434299 388979 358229 384002
13193 384002 358686 320599 321332 308116 309706 349303 399281 331890 331370 398349 495984 369646
13181 369646 302036 358911 367649 409796 428102 499913 501723 561373 503186 446120 407543 382410
13169 382410 405505 509285 678089 721016 918065 1104212 1194023 1280982 1378873 1241792
13159 1241792 1109380 984119 991778 916311 848826 846152 804686 774273 767277 693513 729018
13148 729018 744377 817448 818170 776989 807698 776979 743462 814976 838679 939126 1156530
13137 1156530 1252241 1328290 1304093 1244628 1366819 1408925 1348052 1409565 1475950 1491008 1479369
$$ packed form
13216D56101M2476o3187o8954n7704j5294J3414J4461n5202K0451P500k9857l1645
13204B32560P4507O0095j84015L6107J29010R9686l9132K5481m5320l0750K5773
13193C84002k5316l8087P33j3216J590L9597M9978o7391n20O6979R7635j26338
13181C69646o7610N6875Q738M2147J8306P1811J810N9650n8187n7066l8577k5133
13169C82410K3095J03780J68804M2927J97049J86147Q9811Q6959R7891j37081
13159A241792j32412j25261P659p5467o7485k674m1466l0413o996p3764L5505
13148G29018J5359P3071P22m1181L0709l0719l3517P1514K3703J00447K17404
13137A156530R5711P6049k4197n9465J22191M2106o0873O1513O6385J5058j1639
$$ plain form
13126 1479369 1533253 1472475 1331104 1315687 1302862 1207038 1082751 1018581 946742 964215 996882
13115 996882 997546 901830 884873 920136 914731 866739 886527 941793 974970 917822 935175 1060294
13103 1060294 1229455 1395559 1470092 1496149 1596184 1660137 1632689 1641660 1585294 1391436 1352789
13092 1352789 1309404 1196186 1098843 1110757 1099217 936965 931161 908564 926687 849146 752117
13081 752117 742390 884056 955447 997027 1046411 1127829 1113708 1040721 1020473 1041661 1113592
13070 1113592 1189983 1267315 1387767 1451302 1420588 1471272 1469084 1380821 1396511 1229072 1228663
13059 1228663 1248410 1135872 1039650 965807 1082063 1105552 1103636 1028000 800466 673794 684601
13048 684601 728457 843434 961587 1112553 1081665 1132839 1012608 993556 1036765 1114666 1263054
$$ packed form
13126A479369N3884o0778j41371j5417j2825r5824j24287o4170p1839J7473L2667
13115I96882O64r5716j6957L5263n405m7992J9788N5266L3177n7148J7353J25119
13103A060294J69161J66104P4533K6057J00035O3953k7448Q971n6366j93858l8647
13092A352789m3385j13218r7343J1914j1540j62252n804k2597J8123p7541r7029
13081G52117r727J41666P1391M1580M9384Q1418j4121p2987k0248K1188P1931
13070A113592P6391P7332J20452O3535l0714N0684k188q8263J5690j67439m09
13059A228663J9747j12538r6222p3843J16256K3489j916p5636k27534j26672J0807
13048F84601M3856J14977J18153J50966l0888N1174j20231j9052M3209P7901J48388
$$ plain form
13037 1263054 1332770 1411140 1491863 1432491 1348564 1424888 1481119 1411965 1272528 1178560 1142144
13026 1142144 1109690 1062059 1147069 1186135 955253 941868 969269 877606 928235 938056 856657
13015 856657 867013 776857 891968 965979 934565 850877 845835 770205 836414 901460 902850 923108
13003 923108 1064272 1028090 1085267 1140650 1092077 1038116 928206 884320 900059 1057182 1022879
12992 1022879 1154690 1312756 1337291 1257274 1238225 1202237 1126725 1202076 1224138 1177484 1357716
12981 1357716 1392999 1482027 1573092 1598053 1571670 1466681 1486307 1542193 1569521 1457834 1477266
12970 1477266 1556418 1614459 1600718 1629730 1549321 1559920 1707799 1809968 1816686 1793486 1778993
12959 1778993 1834494 1889259 1925830 2015020 2159312 2203030 2203693 2161169 2151211 2264946 2212773
$$ packed form
13037A263054O9716P8370Q0723n9372q3927P6324N6231o9154j39437r3968l6416
13026A142144l2454m7631Q5010L9066k30882j3385K7401r1663N0629R821q1399
13015H56657J0356r0156J15111P4011l1414q3688n042p5630O6209O5046J390K0258
13003I23108J41164l6182N7177N5383m8573n3961j09910m3886J5739J57123l4303
12992A022879J31811J58066K4535q0017j9049l5988p5512P5351K2062m6654J80232
12981A357716L5283Q9028R1065K4961k6383j04989J9626N5886K7328j11687J9432
12970A477266P9152N8041j3741K9012q0409J0599J47879J02169O718k3200j4493
12959A778993N5501N4765L6571Q9190J44292M3718O63m2524r958J13735n2173
$$ plain form
12948 2212773 2191452 2224644 2271832 2337269 2375581 2462591 2510937 2517624 2544711 2570896 2494685
12937 2494685 2544003 2752708 2803848 2792002 2826293 2881306 2908200 2883478 2871616 2821211 2915491
12926 2915491 2985002 3048826 3216008 3286543 3334900 3532148 3602273 3582452 3485037 3493916 3509445
12915 3509445 3471864 3644190 3782102 3749333 3595563 3567108 3636883 3633556 3642983 3697099 3711587
12904 3711587 3783862 3819518 3704643 3723363 3727608 3751103 3853459 3907575 3902151 3810703 3768028
12893 3768028 3726653 3650710 3586937 3578487 3436636 3280248 3314699 3328387 3223101 3130293 3011770
12882 3011770 3004949 3056213 3010902 2949782 2904779 2921896 3026301 3007348 2980884 2929234 2769723
12871 2769723 2741448 2754579 2714217 2748064 2714213 2778698 2870986 2842772 2990324 3079027 3160465
$$ packed form
12948B212773k1321L3192M7188O5437L8312Q7010M8346O687K7087K6185p6211
12937B494685M9318K08705N1140j1846L4291N5013K6894k4722j1862n0405R4280
12926B915491O9511O3824J67182P0535M8357J97248P0125j9821r7415Q879J5529
12915C509445l7581J72326J37912l2769j53770k8455O9775l327R427N4116J4488
12904C711587P2275L5656j14875J8720M245K3495J02356N4116n424r1448m2675
12893C768028m1375p5943o3773q450j41851j56388L4451J3688j05286r2808j18523
12882C011770o821N1264m5311o1120m5003J7117J04405j8953k6464n1650j59511
12871B769723k8275J3131m0362L3847l3851O4485R2288k8214J47552Q8703Q1438
$$ plain form
12860 3160465 3408480 3588149 3693822 3726805 3811251 3868352 4090306 4401136 4566913 4814681
12850 4814681 5098042 5348772 5684442 5924260 6216487 6488355 6762775 7116418 7398615
12841 7398615 7723630 8395317 9184453 9860169 10082937 9709041 8818175 7927411 7267748
12832 7267748 6819812 6401229 6075378 5969681 5861403 5837047 5883826 5830425 5923320 5938167
12822 5938167 5841612 5604256 5517794 5539382 5563277 5515741 5523316 5542122 5528978 5655532 5840111
12811 5840111 5789458 5679922 5579431 5475660 5406812 5467321 5519918 5553087 5446250 5420078
12801 5420078 5501495 5493327 5417873 5357092 5337596 5281859 5355779 5479559 5603630 5815496 5911076
12790 5911076 6053351 6206036 6344137 6541975 6746450 6997527 7366946 7667582 7976140
$$ packed form
12860C160465K48015J79669J05673L2983Q4446N7101K21954L10830J65777K47768
12850D814681K83361K50730L35670K39818K92227K71868K74420L53643K82197
12841G398615L25015O71687P89136O75716K22768l73896q90866q90764o59663
12832G267748m47936m18583l25851j05697j08278k4356M6779n3401R2895J4847
12822E938167r6555k37356q6462K1588K3895m7536P575J8806j3144J26554J84579
12811E840111n0653j09536j00491j03771o8848O0509N2597L3169j06837k6172
12801E420078Q1417q168p5454o0781j9496n5737P3920J23780J24071K11866R5580
12790E911076J42275J52685J38101J97838K04475K51077L69419L00636L08558
$$ plain form
12781 7976140 8199987 8548378 8993095 9438444 9811497 10280829 10736023 11128649 11251163
12772 11251163 11226067 11024413 10986385 10754339 10429573 10048586 9533509 9149878 8724170 8183863
12762 8183863 7698383 7282347 6981984 6734216 6492536 6219743 5865764 5774452 5865877 5794719
12752 5794719 5643349 5635373 5669189 5653278 5642248 5740378 5894236 6079963 6266985 6293049 6399410
12741 6399410 6530087 6706929 6949888 7239374 7510556 7872480 8194751 8524815 8733051
12732 8733051 8985083 9391060 9880686 10756441 11625254 12842961 14476182 16479662 18793855
12723 18793855 21269115 23603455 25398691 26128048 25649369 24387201 22988560 22133334
12715 22133334 21705050 21782928 22474489 23887981 25909399 28616920 32036571 36535485 41789807
$$ packed form
12781G976140K23847L48391M44717M45349L73053M69332M55194L92626J22514
12772A1251163k5096k01654l8028k32046l24766l80987n15077l83631m25708n40307
12762H183863m85480m16036l00363k47768k41680k72793l53979r1312R1425p1158
12752E794719j51370p976L3816j5911j1030R8130J53858J85727J87022K6064J06361
12741F399410J30677J76842K42959K89486K71182L61924L22271L30064K08236
12732H733051K52032M05977M89626Q75755Q68813J217707J633221K003480K314193
12723A8793855K475260K334340J795236P29357m78679j262168j398641q55226
12715B2133334m28284P7878O91561J413492K021418K707521L419651M498914N254322
$$ plain form
12706 41789807 47382717 52724765 56705797 58405326 57472924 54211624 50032265 46226946
12698 46226946 43481206 41926563 41605535 42181326 43116488 43887732 44424086 45030797 46222478
12689 46222478 48368422 51831171 56945050 63070226 69402330 74891790 78325119 79694683
12681 79694683 79989562 80682227 83082199 88147824 95967129 105738975 116787785 128249849
12673 128249849 139199156 149162682 157858134 165007760 169916845 172011853 172066406 172723406
12665 172723406 177466200 188586747 207619528 234925718 268648049 305253888 339945791
12658 339945791 367544301 384519763 390268696 386217930 375078755 359532415 342986142
12651 342986142 328882321 320269162 318613052 323400877 332688225 343474264 352510919 356491859
$$ packed form
12706D1789807N592910N342048L981032J699529r32402l261300m179359l805319
12698D6226946k745740j554643l21028N75791R35162P71244N36354O06711J191681
12689D6222478K145944L462749N113879O125176O332104N489460L433329J369564
12681G9694683K94879O92665K399972N065625P819305R771846J1048810J1462064
12673A28249849J0949307R963526Q695452P149626M909085K095008N4553O57000
12665A72723406M742794J1120547J9032781K7306190L3722331L6605839L4691903
12658C39945791K7598510J6975462N748933m050766j1139175j5546340j6546273
12651C42986142j4103821q613159j656110M787825R287348J0786039R036655L980940
$$ plain form
12643 356491859 353582540 342583036 323931428 299576053 272161806 244972578 220592285
12636 220592285 200821031 185935030 175529634 168733539 164252918 160535905 156503715
12629 156503715 151101505 144163353 135967961 127091169 118155789 109589568 101645793 94733345
12621 94733345 89038754 84716420 81555011 79195395 77125215 74722788 71707088 68110480
12613 68110480 64029543 59973668 56357396 53404185 51202189 49404129 48002123 46820464
12605 46820464 45554632 44634182 43986248 44030056 44794940 46190929 47938394 49698685 51069310
12596 51069310 51629931 51138194 49294046 46304101 42632112 38723332 35008836 31783127
12588 31783127 29134710 27043815 25700946 24857571 24497826 24544339 24844529 25228388 25453802
$$ packed form
12643C56491859k909319j0999504j8651608k4355375k7414247k7189228k4380293
12636B20592285j9771254j4886001j0405396o796095m480621l717013m032190
12629A56503715n402210o938152q195392q876792q935380q566221p943775o912448
12621I4733345n694591m322334l161409k359616k070180k402427l015700l596608
12613F8110480m080937m055875l616272k953211k201996j798060j402006j181659
12605D6820464j265832r20450o47934M3808P64884J395989J747465J760291J370625
12596E1069310N60621m91737j844148k989945l671989l908780l714496l225709
12588C1783127k648417k090895j342869q43375l59745M6513L00190L83859K25414
$$ plain form
12579 25453802 25316405 24514370 23134499 21345697 19333086 17421640 15776550 14267903
12571 14267903 12948864 11979998 11117508 10293753 9702419 9206385 8714415 8210696 7673838
12562 7673838 7067542 6672072 6358255 6166718 5887142 5609260 5357344 5146990 4939258
12553 4939258 4821417 4708458 4675901 4672230 4438511 4238058 4103192 3978786 3885588 3596947
12543 3596947 3387906 3289960 3276039 3317872 3290206 3237577 3195424 3110296 2964817 3000008 2858799
12532 2858799 2596709 2547550 2510117 2502819 2489738 2390306 2302087 2331382 2231832 2012289 2066038
12521 2066038 2117418 2044407 1933990 1804618 1849217 1745448 1700625 1711967 1618701 1480340
12511 1480340 1470603 1535753 1475835 1407083 1374269 1310189 1282940 1123001 1023313 917319 926894
$$ packed form
12579B5453802j37397q02035j379871j788802k012611j911446j645090j508647
12571A4267903j319039r68866q62490q23755n91334m96034m91970n03719n36858
12562G673838o06296l95470l13817j91537k79576k77882k51916k10354k07732
12553D939258j17841j12959l2557l671k33719k00453j34866j24406r3198k88641
12543C596947k09041r7946j3921M1833k7666n2629m2153q5128j45479L5191j41209
12532B858799k62090m9159l7433p298j3081r9432q8219K9295r9550k19543N3749
12521B066038N1380p3011j10417j29372M4599j03769m4823J1342r3266j38361
12511A480340r737O5150n9918o8752l2814o4080k7249j59939r9688j05994R575
$$ plain form
12500 926894 1025658 1053782 983545 914266 933043 915670 857452 715575 764934 784417 809323
12489 809323 665125 586990 601409 692851 702407 521381 499319 453383 361142 247767 241581
12478 241581 218275 238663 316224 376612 318348 224319 191059 333958 434349 466194 490958
12467 490958 435268 433711 558798 516768 470419 360933 362391 357194 359559 263092 290405 408999
12455 408999 357968 366088 276532 234307 180166 163376 241489 267336 328357 254343 191897 156662
12443 156662 154052 107126 114006 110908 198128 204815 148382 120897 205899 269708 341541 288133
12431 288133 182347 87885 95496 43115 147302 174481 126675 120177 229674 347366 314928
12420 314928 196077 124163 99079 141708 271453 259261 280374 178869 61970 50830 103375
$$ packed form
12500I26894R8764K8124p0237o9279J8777j7373n8218j41877M9359J9483K4906
12489H09323j44198p8135J4419R1442R556j81026k2062m5936r2241j13375o186
12478B41581k3306K0388P7561O0388n8264r4029l3260J42899J00391L1845K4764
12467D90958n5690j557J25087m2030m6349j09486J458n197K365r6467K7313J18594
12455D08999n1031Q120q9556m2225n4141j6790P8113K5847O1021p4014o2446l5235
12443A56662k610m6926O880l098Q7220O687n6433k7485Q5002O3809P1833n3408
12431B88133j05786r4462P611n2381J04187K7179m7806o498J09497J17692l2438
12420C14928j18851p1914k5084M2629J29745j2192K1113j01505j16899j1140N2545
$$ plain form
12409 103375 35173 -12720 124973 184260 126975 13855 -119767 -77261 564 -5087 57859
12398 57859 166435 240078 59149 -160444 -148004 -3863 69704 124926 298624 323994 215622
12387 215622 73787 -161165 -286637 -236611 -27524 91679 215428 170582 37791 -35181
12377 -35181 -126713 -137312 -73798 -47049 15836 75559 77774 33115 152489 150647 206217 174105
12365 174105 44105 64839 102269 17072 13382 111172 84108 -14505 34919 46973 83496
12354 83496 102271 90314 36356 -55698 62642 87030 48889 107134 111157 -22708 70959
12343 70959 167066 196865 126293 42827 21550 84125 127307 151419 232024 158050 132033 163770
12331 163770 167410 159456 194379 178706 163931 196852 194707 238550 142036 37321 54455 129715
$$ packed form
12409A03375o8202m7893J37693N9287n7285j13120j33622M2506P7825n651O2946
12398E7859J08576P3643j80929k19593J2440J44141P3567N5222J73698K5370j08372
12387B15622j41835k34952j25472N0026K09087J19203J23749m4846j32791p2972
12377c5181r1532j0599O3514K6749O2885N9723K215m4659J19374j842N5570l2112
12365A74105j30000K0734L7430q5197l690R7790k7064r8613M9424J2054L6523
12354H3496J8775j1957n3958r2054J18340K4388l8141N8245M023j33865R3667
12343G0959R6107K9799p0572q3466k1277O2575M3182K4112Q0605p3974k6017L1737
12331A63770L640p954L4923j5673j4775L2921k145M3843r6514j04715J7134P5260
$$ plain form
12319 129715 39935 -75836 -115011 4623 48140 71830 -27160 -24804 -72249 -99275 -72536
12308 -72536 65763 130900 148738 -270 -117105 -94430 -79937 9656 -3329 -20007 -36996
12297 -36996 -8367 192898 179142 63741 63811 113645 150973 70080 66225 16792 -12408 -62387
12285 -62387 -4172 27344 -38368 -125591 -160933 -138445 -86947 -92486 -48468 -980 -9182 -49744
12273 -49744 94992 240647 110791 -6862 -60410 -43524 -14825 40193 12426 117589 201425
12262 201425 118530 48888 27066 -43633 -56129 -40848 16540 36076 -85180 -115580 24801
12251 24801 116498 162366 193647 249179 461075 586255 805585 1034974 1109183 1106582 1019414
12240 1019414 909588 859554 747701 734983 616502 571731 534821 500337 571335 513713 445173
$$ packed form
12319A29715q9780j15771l9175J19634M3517K3690r8990K356m7445k7026K6739
12308g2536J38299O5137J7838j49008j16835K2675J4493Q9593j2985j6678j6989
12297c6996K8629K01265j3756j15401P0M9834L7328q0893l855m9433k9200m9979
12285f2387N8215L1516o5712q7223l5342K2488N1498n539M4018M7488q202m0562
12273d9744J44736J45655j29856j17653n3548J6886K8699N5018k7767J05163Q3836
12262B01425q2895o9642k1822p0699j2496J5281N7388J9536j21256l0400J40381
12251B4801R1697M5868L1281N5532K11896J25180K19330K29389P4209k601q7168
12240A019414j09826n0034j11853j2718j18481m4771l6910l4484P0998n7622o8540
$$ plain form
12229 445173 409219 402609 428643 585653 696747 791003 826099 912794 956041 827115 853708
12218 853708 953685 1170890 1329604 1538474 1705567 1816551 1775027 1656316 1638383 1618076
12208 1618076 1644543 1484037 1356754 1248136 1084754 941991 853973 731303 716101 624596
12198 624596 617338 606752 641169 718161 674254 645770 664272 765619 753952 625110 723992
12187 723992 922401 976546 1167137 1246713 1302896 1291777 1312283 1416873 1341299 1266438 1236966
12176 1236966 1120167 964875 944747 889943 852915 670753 500495 542098 644984 581673
12166 581673 586247 468912 438830 458965 462799 446430 506332 426900 407757 521789 509298
12155 509298 446524 400094 484577 453827 401135 546772 563916 502177 474069 376660 266524
$$ packed form
12229D45173l5954o610K6034J57010J11094R4256L5096Q6695M3247j28926K6593
12218H53708R9977K17205J58714K08870J67093J10984m1524j18711j7933k0307
12208A618076K6467j60506j27283j08618j63382j42763q8018j22670j5202r1505
12198F24596p258j0586L4417P6992m3907k8484J8502J01347j1667j28842R8882
12187G23992J98409N4145J90591P9576N6183j1119K0506J04590p5574p4861k9472
12176A236966j16799j55292k0128n4804l7028j82162j70258M1603J02886o3311
12166E81673M574j17335l0082K0135L834j6369N9902p9432j9143J14032j2491
12155E09298o2774m6430Q4483l0750n2692J45637J7144o1739k8108r7409j10136
$$ plain form
12144 266524 301764 314836 198903 240739 156424 62651 122396 54304 -3502 26364 97595
12133 97595 144557 231600 266342 138790 14799 25487 -102788 -171594 -118448 -30474 42500
12122 42500 99551 31781 -8253 -36636 -17315 -34734 -30681 -71703 -65584 7127 67634 120050
12110 120050 56519 -53351 -68206 -93439 -114396 -46056 -54226 -46926 -137820 -140099 -71125 16327
12098 16327 53394 16811 -55703 -150714 -157885 -128767 -120543 -119428 -44954 -9428 -111276 -120231
12086 -120231 -146931 -179998 -76737 -30814 18690 -61391 -237344 -154193 -60547 112520 -923
12075 -923 -47328 20243 -50797 -59584 -101809 -100934 -74290 -73168 -70583 -176243 -158030 -62144 -163586
12062 -163586 -232535 -227424 -172288 -128680 -164510 -201454 -73962 70315 114409 82365 -60206
$$ packed form
12144B66524L5240J3072j15933M1836q4315r3773N9745o8092n7806K9866P1231
12133I7595M6962Q7043L4742j27552j23991J0688j28275o8806N3146Q7974P2974
12122D2500N7051o7770m0034k8383J9321j7419M053m1022O119P2711O0507N2416
12110A20050o3531j09870j4855k5233k0957O8340q170P300r0894k279O8974Q7452
12098A6327L7067l6583p2514r5011p171K9118Q224J115P4474L5526j01848q955
12086a20231k6700l3067J03261M5923M9504q0081j75953Q3151R3646J73067j13443
12075i23m6405O7571p1040q787m2225Q75K6644J122K585j05660J8213R5886j01442
12062a63586o8949N111N5136M3608l5830l6944J27492J44277M4094l2044j42571
$$ plain form
12051 -60206 -147762 -144386 -184480 -118634 -93130 -76740 -26146 30432 54216 34447 53480 60192
12039 60192 110210 99015 11462 -1558 -73815 -71796 -93782 -135511 -132434 -110002 -155960 -162126
12027 -162126 -137806 -62280 -74723 -53283 -33926 11921 114042 108776 -56453 -104029 -79728
12016 -79728 -88747 29846 59159 -25323 -91765 -18201 147511 154668 46283 -88537 -55784
12005 -55784 -24218 -102114 -15178 -44225 -94308 -8218 -102666 -187964 -217485 -168832 -195089 -189123
11993 -189123 -242917 -218680 -175310 -120171 -41942 -96327 -134874 -87990 -134735 -218687 -208459
11982 -208459 -22833 152143 69299 79271 156887 133536 101738 66034 -30636 108 42357
11971 42357 108868 72415 15148 -109914 -279913 -331315 -153821 -127223 -145866 -107745 -103624
$$ packed form
12051f0206q7556L376m0094O5846K5504J6390N0594N6578K3784j9769J9033O712
12039F0192N0018j1195q7553j3020p2257K019k1986m1729L077K2432m5958o166
12027a62126K4320P5526j2443K1440J9357M5847J02121n266j65229m7576K4301
12016g9728r019J18593K9313q4482o6442P3564J65712P157j08385j34820L2753
12005e5784L1566p7896Q6936k9047n0083Q6090r4448q5298k9521M8653k6257N966
11993a89123n3794K4237M3370N5139P8229n4385l8547M6884m6745q3952J0228
11982b08459J85626J74976q2844R972P7616k3351l1798l5704r6670L0744M2249
11971D2357O6511l6453n7267j25062j69999n1402J77494K6598j8643L8121M121
$$ plain form
11960 -103624 -72592 -161249 -131882 -51768 16394 -98333 -201587 -83774 -48396 62098 -2443
11949 -2443 -101268 -67428 -66966 -59214 -37312 -112271 -220251 -150247 -125482 -111166 -27826 112308
11937 112308 -6631 -13617 -48518 -6930 3481 -59629 -52813 -19613 -41019 -238111 -150205
11926 -150205 16761 120432 54887 61632 -75442 -208068 -120675 -12841 -37213 -135996 -111908
11915 -111908 -130548 -197086 -221099 -207206 -213709 -170841 -107909 -98786 -184489 -225621 -109506 38264
11903 38264 120237 70124 104674 94667 75768 124899 94590 98039 78796 51649 63675 3420
11891 3420 -67710 -32610 111809 73041 -57082 -85758 -92554 -127477 -267229 -333735 -218474
11880 -218474 -170920 -234270 -245390 -189328 -143735 -130440 8144 5079 -118795 -31602 120939
$$ packed form
11960a03624L1032q8657K9367Q0114O8162j14727j03254J17813L5378J10494o4541
11949b443r8825L3840M62P752K1902p4959j07980P0004K4765J4316Q3340J40134
11937A12308j18939o986l4901M1588J0411o3110O816L3200k1406j97092Q7906
11926a50205J66966J03671o5545O745j37074j32626Q7393J07834k4372r8783K4088
11915a11908j8640o6538k4013J3893o503M2868O2932R123q5703m1132J16115J47770
11903C8264Q1973n0113L4550j0007j8899M9131l0309L449j9243k7147J2026o0255
11891C420p1130L5100J44419l8768j30123k8676o796l4923j39752o6506J15261
11880b18474M7554o3350j1120N6062M5593J3295J38584l065j23874Q7193J52541
$$ plain form
11869 120939 122400 -17397 -76870 -65813 -9358 67517 73000 125348 135466 76438 95818 183706
11857 183706 197411 313675 267405 113374 -40168 -29953 -41874 -14980 -30712 59642 177824
11846 177824 163489 140265 71424 -25871 16315 -7715 -18808 26241 -15286 14833 88914
11835 88914 251480 253553 255359 71025 66327 160045 99225 54321 105415 113708 14376 -129069
11823 -129069 -194331 -145160 -95327 -16319 68477 -22515 4611 -78106 -12951 -35181 -6978
11812 -6978 -230 17545 12010 -54941 -152820 -88243 -89414 -83591 -98993 -92970 -79776 -149115 -79475
11799 -79475 -17944 19403 93371 87706 44914 -125896 -196484 -118912 -65646 -90240 -110326 -68428
11787 -68428 -130562 -156955 -82777 1938 41068 153412 209708 63277 11970 -94700 -155604
$$ packed form
11869A20939J461j39797n9473J1057N6455P6875N483N2348J0118n9028J9380Q7888
11857A83706J3705J16264m6270j54031j53542J0215j1921K6894j5732R0354J18182
11846A77824j4335k3224o8841r7295M2186k4030j1093M5049m1527L0119P4081
11835H8914J62566K073J806j84334m698R3718o0820m4904N1094Q293r9332j43445
11823a29069o5262M9171M9833P9008Q4796r0992K7126q2717O5155k2230K8203
11812f978O748J7775n535o6951r7879O4577j171N823j5402O023J3194o9339O9640
11799g9475O1531L7347P3968n665m2792j70810p0588P7572N3266k4594k0086M1898
11787f8428o2134k6393P4178Q4715L9130J12344N6296j46431n1307j06670o0904
$$ plain form
11776 -155604 -20498 1953 9752 90269 188944 215222 19316 -120856 -108038 -58532 -30526
11765 -30526 -72197 -23002 54575 121174 39665 35035 127985 208195 101459 30497 31702 -69415
11753 -69415 -149545 -204583 -119195 56255 166228 143888 96965 130511 88779 119952 245724
11742 245724 332265 402104 313364 190793 161359 179774 134162 28876 -35993 -59841 -25514
11731 -25514 -30525 -36063 -8624 241056 277060 191600 138122 98480 96529 69618 95828 189703
11719 189703 173319 73465 -2478 44284 -15752 -115631 -131131 -65191 -40109 -63793 -210184
11708 -210184 -158238 -77468 -58166 23777 25567 30953 47102 9616 -8062 -42737 -84893 -62749
11696 -62749 -38966 71866 35357 47458 121894 54930 42022 91166 165172 222089 186684
$$ packed form
11776a55604J35106K2451P799Q0517R8675K6278j95906j40172J2818M9506K8006
11765c0526m1671M9195P7577O6599q1509m630R2950Q0210j06736p0962J205j01117
11753f9415q0130n5038Q5388J75450J09973k2340m6923L3546m1732L1173J25772
11742B45724Q6541O9839q8740j22571k9434J8415m5612j05286o4869k3848L4327
11731b5514n011n538K7439K49680L6004q5460n3478l9642j951k6911K6210R3875
11719A89703j6384r9854p5943M6762o0036r9879j5500O5940K5082k3684j46391
11708b10184N1946Q0770J9302Q1943J790N386J6149l7486j7678l4675m2156K2144
11696f2749K3783J10832l6509J2101P4436o6964j2908M9144P4006N6917l5405
$$ plain form
11685 186684 92174 74691 19700 -62129 -33399 -101407 -96388 -87531 -57901 -136964 -90744 -46021
11673 -46021 -67526 -180590 -172700 -146342 -17819 64220 49918 -16813 -58958 -807 48165
11662 48165 -341 34183 82552 54845 -1460 -49858 -120689 -90878 -1595 63490 66143 60702
11650 60702 11433 38434 65934 118865 43117 -38365 -40065 26131 142559 128592 135006 78133
11638 78133 12805 -18735 -116347 -45349 -131521 -198592 -95533 -37892 52555 136782 15454
11627 15454 -10773 -106255 -283070 -370037 -297096 -157709 -7289 65132 63964 49566 -35240
11616 -35240 9258 86344 92356 133758 217751 109568 109148 106919 79343 -18547 -50170 87365
11604 87365 117611 129306 75908 73215 206677 267649 183716 257420 146004 -63695 -118797
$$ packed form
11685A86684r4510j7483n4991q1829K8730o8008N019Q857K9630p9063M6220M4723
11673d6021k1505j13064P890K6358J28523Q2039j4302o6731m2145N8151M8972
11662D8165m8506L4524M8369k7707n6305m8398p0831K9811Q9283O5085K653n441
11650F0702m9269K7001K7500N2931p5748q1482j700O6196J16428j3967O414n6873
11638G8133o5328l1540r7612P0998q6172o7071J03059N7641R0447Q4227j21328
11627A5454k6227r5482j76815q6967P2941J39387J50420P2421j168j4398q4806
11616c5240M4498P7086O012M1402Q3993j08183m20k229k7576r7890l1623J37535
11604H7365L0246J1695n3398k693J33462O0972q3933P3704j11416k09699n5102
$$ plain form
11593 -118797 -165611 -216451 -249771 -296186 -295652 -291179 -197084 -184424 -23743 140933 210901 26042
11581 26042 31593 83488 -6655 -86969 -115832 -44987 53746 20852 -60762 -97283 9086 17911
11569 17911 -72385 -22828 -89690 -104460 79794 136616 -75946 -154284 -212105 -99360 -19444
11558 -19444 36573 -22723 -130737 -217440 -236995 -143032 -33664 54085 18296 29850 114834
11547 114834 78058 61728 -9184 -75156 -99268 -84379 -38726 18507 30682 -2555 -43353
11536 -43353 37061 14227 -129507 -229772 -127862 -76797 -43202 -29977 -66087 24619 159819
11525 159819 135188 160279 144280 161554 66036 66900 86142 -26727 3523 20277 50653 51855
11513 51855 -25240 11593 81638 62088 -106980 33001 220527 236883 46796 -3424 -24959
$$ packed form
11593a18797m6814n0840l3320m6415N34M473R4095J2660J60681J64676O9968j84859
11581B6042N551N1895r0143q0314k8863P0845R8733l2894q1614l6521J06369Q825
11569A7911r0296M9557o6862j4770J84254N6822k12562p8338n7821J12745P9916
11558a9444N6017n9296j08014q6703j9555R3963J09368Q7749l5789J1554Q4984
11547A14834l6776j6330p0912o5972k4112J4889M5653N7233J2175l3237m0798
11536d3353Q0414k2834j43734j00265J01910N1065L3595J3225l6110R0706J35200
11525A59819k4631K5091j5999J7274r5518Q64J9242j12869L0250J6754L0376J202
11513E1855p7095L6833P0045j9550j69068J39981J87526J6356j90087n0220k1535
$$ plain form
11502 -24959 -2883 14926 75229 127297 117466 51773 22445 7267 -28063 -106066 -151236 -105334
11490 -105334 22816 45620 173617 248547 144116 109179 15234 -32767 -38962 -143056 -162127
11479 -162127 -88927 -30690 82509 70637 118455 221870 70937 -71684 -63608 -78295 -29034
11468 -29034 33695 145359 142847 76269 100407 20515 26528 46218 -50997 -51911 74363 49753
11456 49753 89217 64833 15703 787 -23598 44136 194147 275571 220344 190638 63455
11445 63455 41837 45061 -48280 -44701 63195 71378 126360 76459 19354 49254 46322 19680
11433 19680 -1735 -33304 -99910 -68479 -1255 102551 131599 146425 53534 -18443 -15471 -180975
11421 -180975 -211779 -173515 -37726 70251 47216 -4744 -25062 57251 47134 -98143 -133350
$$ packed form
11502b4959K2076J7809O0303N2068r831o5693k9328j5178l5330p8003m5170M5902
11490a05334J28150K2804J27997P4930j04431l4937r3945m8001o195j04094j9071
11479a62127P3200N8237J13199j1872M7818J03415j50933j42621Q076j4687M9261
11468b9034O2729J11664k512o6578K4138p9892O013J9690r7215r14J26274k4610
11456D9753L9464k4384m9130j4916k4385O7734J50011Q1424n5227k9706j27183
11445F3455k1618L224r3341L579J07896Q183N4982m9901n7105K9900k932k6642
11433A9680k1415l1569o6606L1431O7224J03806K9048J4826r2891p1977K972j65504
11421a80975l0804L8264J35789J07977k3035n1960k0318Q2313j0117j45277l5207
$$ plain form
11410 -133350 -74061 45860 72456 -7491 -7814 -4329 42915 30033 16839 63918 98852 59153
11398 59153 17457 -12854 13508 -12030 -16428 -58602 -13804 140690 176127 60103 -103814
11387 -103814 -159899 -68638 163177 231060 236790 44481 70430 122932 61724 47214 148240
11376 148240 121601 87158 82109 56249 7381 3507 27054 -25111 -88787 -64794 -1902 44257
11364 44257 69996 -2902 -43462 -63790 2757 8168 53093 43938 1262 12716 54534 68838
11352 68838 28750 107716 278475 265272 215188 186270 162634 126733 108565 118061 159012 150255
11340 150255 175601 233842 251465 200388 114246 116275 80184 79525 150790 145479 90697 123184
11328 123184 -16282 16875 142838 229071 178152 65059 130545 58666 103997 110119 108265
$$ packed form
11410a33350N9289J19921K6596p9947l23L485M7244j2882j3194M7079L4934l9699
11398E9153m1696l0311K6362k5538m398m2174M4798J54494L5437j16024j63917
11387a03814n6085R1261K31815O7883N730j92309K5949N2502o1208j4510J01026
11376A48240k6639l4443n049k5860m8868l874K3547n2165o3676K3993O2892M6159
11364D4257K5739p2898m0560k0328O6547N411M4925r155m2676J1454M1818J4304
11352F8838m0088P8966J70759j3203n0084k8918k3636l5901j8168R496M0951q757
11340A50255K5346N8241J7623n1077q6142K029l6091o59P1265n311n4782L2487
11328A23184j39466L3157J25963Q6233n0919j13093O5486p1879M5331O122j854
$$ plain form
11317 108265 156907 154962 193409 249274 179449 86807 95940 58204 187264 303924 359555
11306 359555 413056 479009 556323 682210 708303 903069 1246798 1346536 1259526 1096817 908445
11295 908445 742004 406582 253537 359393 383394 214131 116445 84056 22723 -12321
11285 -12321 -50435 -120982 -116624 -127529 -99641 88838 65694 88012 109553 67045 105000 151323
11273 151323 134281 39424 28397 17441 -367 107881 183038 163911 215175 187971 206497
11262 206497 294781 249883 175950 157413 203307 152014 157498 146100 109529 107918 172940 307154
11250 307154 290206 107871 80574 105376 16414 -103188 -24502 81993 81456 180920 101606
11239 101606 -41872 -77154 33315 96909 135902 205381 187987 190436 85106 7242 -67503
$$ packed form
11317A08265M8642j945L8447N5865o9825r2642R133l7736J29060J16660N5631
11306C59555N3501O5953P7314J25887K6093J94766L43729R9738q7010j62709j88372
11295I08445j66441l35422j53045J05856K4001j69263r7686l2389o1333l5044
11285a2321l8114p0547M358j0905K7888J88479k3144K2318K1541m2508L7955M6323
11273A51323j7042r4857j1027j0956j7808J08248P5157j9127N1264k7204J8526
11262B06497Q8284m4898p3933j8537M5894n1293N484j1398l6571j611O5022J34214
11250C07154j6948j82335k7297K4802q8962j19602P8686J06495n37R9464p9314
11239A01606j43478l5282J10469O3594L8993O9479j7394K449j05330p7864p4745
$$ plain form
11228 -67503 -56417 -19714 21917 121481 90186 112940 222663 213715 178596 143916 105189 113648
11216 113648 118289 63373 105637 219427 175355 202437 191059 198933 248727 249161 291884 217941
11204 217941 149337 134955 111155 127936 143580 90957 123955 120310 199828 328280 239532
11193 239532 217063 236999 249241 218737 169751 99758 345403 553859 603697 735297 1075678
11182 1075678 1230639 1193587 1187729 1075463 1055945 1006392 806577 627189 479316 369856
11172 369856 265977 255933 221946 -28902 -46827 3645 3543 59787 25290 18356 70946 122264
11160 122264 130884 58625 64899 213611 155774 170038 88797 -39274 -53278 -49196 -4686 48050
11148 48050 10831 -43444 -29118 -63855 -91129 -53624 3979 49301 49850 205811 193336 94686
$$ packed form
11228f7503J1086L6703M1631R9564l1295K2754J09723q948l5119l4680l8727Q459
11216A13648M641n4916M2264J13790m4072K7082j1378P874M9794M34M2723p3943
11204B17941o8604j4382k3800J6781J5644n2623L2998l645P9518J28452q8748
11193B39532k2469J9936J2242l0504m8986o9993K45645K08456M9838J31600L40381
11182A075678J54961l7052n858j12266j9518m9553j99815j79388j47873j09460
11172C69856j03879j0044l3987k50848j7925N0472j02N6244l4497o934N2590N1318
11160A22264Q620p2259O274J48712n7837J4264q1241j28071j4004M082M4510N2736
11148D8050l7219n4275J4326l4737k7274L7505N7603M5322N49J55961j2475r8650
$$ plain form
11136 94686 21779 -63685 -187748 -162942 -18818 38481 -10949 -41209 -41177 -79181 -128080 -56762
11124 -56762 -25898 -143984 -94570 138440 187231 8103 -96955 22948 76766 32321 -90579
11113 -90579 -44408 -28306 78808 43141 96640 41212 -43036 12166 162440 241071 290429
11102 290429 181799 98856 20412 -53780 -64977 -42352 -34528 13468 68701 59850 18433 -20534
11090 -20534 -58463 -188534 -144708 -133671 -54941 -59905 -32691 -59784 42171 17165 77815
11079 77815 65396 38351 46655 79985 -19598 80234 111523 146681 235595 282731 293209 252596
11067 252596 211019 157864 129936 15680 -68657 -168566 -213370 -90691 100445 133803 205570
11056 205570 215823 213863 139161 162 39440 23661 66761 -6268 -54507 -17691 -15149 55892
$$ packed form
11136I4686p2907q5464j24063K4806J44124N7299m9430l0260L2l8004m8899P1318
11124e6762L0864j18086M9414K33010M8791j79128j05058J19903N3818m4445j22900
11113i0579M6171J6102J07114l5667N3499n5428q4248N5202J50274P8631M9358
11102B90429j08630q2943p8444p4192j1197K2625P824M7996N5233q851m1417l8967
11090b0534l7929j30071M3826J1037P8730m964K7214k7093J01955k5006O0650
11079G7815j2419k7045Q304L3330r9583R9832L1289L5158Q8914M7136J0478m0613
11067B52596m1577n3155k7928j14256q4337r9909m4804J22679J91136L3358P1767
11056B05570J0253j960p4702j38999L9278j5779M3100p3029m8239L6816K542P1041
$$ plain form
11044 55892 25070 26503 107212 178744 80044 -39753 54248 197835 139495 148248 216952 286863
11032 286863 202556 160123 198157 217066 239749 161599 39168 125131 171678 39674 92310
11021 92310 1265 -34027 -14857 -46373 -78721 14641 78963 49683 113370 140456 101805 -11807
11009 -11807 -151414 -115099 -63921 -174515 -210926 -191826 -22838 93662 165376 181615 67987
10998 67987 -4075 5823 117696 219870 298949 329695 187715 73068 -45721 -46425 46753
10987 46753 97057 89963 36493 -39582 -88755 -207018 -204751 -110624 -27019 -104887 -268622 -365077
10975 -365077 -262771 -108009 -5841 -26856 -44836 -130328 -99536 -157318 -118287 -51795 -14072
10964 -14072 -152885 -30276 170154 103233 -90722 -169967 -19634 99495 -1048 -133858
$$ packed form
11044E5892l0822J433Q0709P1532r8700j19797R4001J43587n8340Q753O8704O9911
11032B86863q4307m2433L8034J8909K2683p8150j22431Q5963M6547j32004N2636
11021I2310r1045l5292J9170l1516l2348R3362O4322k9280O3687K7086l8651j13612
11009a1807j39607L6315N1178j10594l6411J9100J68988J16500P1714J6239j13628
10998F7987p2062R898J11873J02174P9079L0746j41980j14647j18789p04R3178
10987D6753N0304p094n3470p6075m9173j18263K267R4127Q3605p7868j63735r6455
10975c65077J02306J54762J02168k1015j7980q5492L0792n7782L9031O6492L7723
10964a4072j38813J22609K00430o6921j93955p9245J50333J19129j00543j32810
$$ plain form
10954 -133858 -116955 -104071 -103951 -84727 -49469 6435 9303 102097 62687 -29892 -83596 -58713
10942 -58713 -40457 -1450 7690 -50183 4563 62596 -54446 -67823 -34051 -58496 -145630 -116549
10930 -116549 -41612 -130348 -72969 23754 125528 89886 109163 103047 118198 199489 298500
10919 298500 172169 -51463 29006 -36654 8778 157629 315367 399319 404103 176983 11368
10908 11368 89368 43990 -19756 33026 7144 63252 77066 25355 -30403 -45639 -85071 -118560
10896 -118560 -88834 -132716 -185099 -168941 -157980 -117065 34402 52548 54054 90529 -6426
10885 -6426 -43613 -46012 33443 21864 6475 -71619 15991 101285 107480 56809 -7087 26128
10873 26128 41109 953 -52369 -80131 11443 -41938 -136788 -69513 136026 112482 12168
$$ packed form
10954a33858J6903J2884J20J9224L5258N5904K868R2794l9410r2579n3704K4883
10942e8713J8256L9007R140n7873N4746N8033j17042j3377L3772k4445q7134K9081
10930a16549P4937q8736N7379R6723J01774l5642J9277o116J5151Q1291R9011
10919B98500j26331k23632Q0469o5660M5432J48851J57738Q3952M784k27120j65615
10908A1368P8000m5378o3746N2782k5882N6108J3814n1711n5758j5236l9432l3489
10896a18560K9726m3882n2383J6158J0961M0915J51467J8146J506L6475r6955
10885f426l7187k399P9455j1579j5389p8094Q7610Q5294O195n0671o3896L3215
10873B6128J4981m0156n3322k7762R1574n3381r4850O7275K05539k3544j00314
$$ plain form
10862 12168 52170 -27185 57174 53133 29588 91963 114692 189923 226126 235305 158950 31375
10850 31375 15514 -25143 -37840 -29394 -121428 -147403 4691 174485 286376 224121 107438
10839 107438 12287 37853 80199 195647 163143 99956 39924 20952 50687 -22346 -31633
10828 -31633 -25424 -172998 -23836 18203 -87028 -116006 -79583 -136731 -153470 -149681 -170618
10817 -170618 1683 13270 54525 84096 50954 -22904 22866 106564 123712 133178 91828
10806 91828 169336 161442 133431 187304 156122 107789 43561 19473 -23221 83701 64275 12031
10794 12031 -55523 -15485 -14818 -26285 14710 109384 226412 194017 84482 69465 11289 -29947
10782 -29947 55206 -4480 -105526 -66830 7055 -18577 -74890 -83024 27575 48076 -54793
$$ packed form
10862A2168M0002p9355Q4359m041k3545O2375K2729P5231L6203R179p6355j27575
10850C1375j5861m0657j2697Q446r2034k5975J52094J69794J11891o2255j16683
10839A07438r5151K5566M2346J15448l2504o3187o0032j8972K9735p3033r287
10828c1633O209j47574J49162M2039j05231k8978L6423n7148j6739L789k0937
10817a70618J72301J1587M1255K9571l3142p3858M5770Q3698J7148R466m1350
10806I1828P7508p894k8011N3873l1182m8333o4228k4088m2694J06922j9426n2244
10794A2031o7554M0038O67j1467M0995R4674J17028l2395j09535j5017n8176m1236
10782b9947Q5153n9686j01046L8696P3885k5632n6313q134J10599K0501j02869
$$ plain form
10771 -54793 75313 195093 124323 -9594 3775 38290 30675 -14100 27996 60864 116156
10760 116156 117447 70079 184389 176502 216280 278952 334664 250696 194525 268765 258587 104314
10748 104314 53641 -30719 29840 121644 177132 163906 108877 170554 289028 253271 286241
10737 286241 203003 222185 243493 130892 39509 35530 153872 140310 129259 176240 106447
10726 106447 54872 15829 14886 3196 -30307 -38729 -11144 -114887 -131431 -16348 132321
10715 132321 256315 421842 392798 276338 154733 86132 32131 -55765 -77297 -4368 62100
10704 62100 63784 60812 52666 -33675 -37188 -56463 4149 32862 2012 -146520 -120600 -131710
10692 -131710 -46821 127960 203640 210030 178042 138453 229989 313117 248160 289447 192422
$$ packed form
10771e4793J30106J19780p0770j33917J3369L4515p615m4775M2096L2868N5292
10760A16156J291m7368J14310p887L9778O2672N5712q3968n6171P4240j0178j54273
10748A04314n0673q4360O0559R1804N5488j3226n5029O1677J18474l5757L2970
10737B86241q3238J9182K1308j12601r1383l979J18342j3562j1051M6981o9793
10726A06447n1575l9043r43j1690l3503q422K7585j03743j6544J15083J48669
10715A32321J23994J65527k9044j16460j21605o8601n4001q7896k1532P2929O6468
10704F2100J684k972q146q6341l513j9275O0612K8713l0850j48532K5920j1110
10692a31710Q4889J74781P5680O390l1988l9589R1536Q3128o4957M1287r7025
$$ plain form
10681 192422 215774 299990 350758 281285 235365 154774 113793 67864 113965 71407 73172 23215
10669 23215 57211 59490 36491 74681 44657 113161 127597 51196 42182 -17475 2572 -74778
10657 -74778 -66578 -98559 -41360 -46308 -27213 -38219 15450 28522 -5614 37111 46286 -49133
10645 -49133 -103162 -98446 -142199 -76704 18922 -21224 -55414 4077 1007 105884 76917 35002
10633 35002 11739 -12513 -35936 51289 135587 171375 194921 93870 66758 -15356 -108013
10622 -108013 -185100 8632 108383 122341 -3655 -51200 9324 128570 132153 41709 18124
10611 18124 -66408 -85752 -15542 -54878 -42353 41674 142627 153442 213772 170997 68952
10600 68952 -78560 -63291 -72613 -12700 28999 81575 6363 -42069 26385 170878 161952 104466
$$ packed form
10681A92422K3352Q4216N0768o9473m5920q0591m0981m5929M6101m2558J765m9957
10669B3215L3996K279k2999L8190l0024O8504J4436p6401r014n9657K0047p7350
10657g4778Q200l1981N7199m948J9095j1006N3669J3072l4136M2725R175r5419
10645d9133n4029M716m3753O5495R5626m0146l4190N9491l070J04877k8967m1915
10633C5002k3263k4252k3423Q7225Q4298L5788K3546j01051k7112q2114r2657
10622a08013p7087J93732R9751J3958j25996m7545O0524J19246L583r0444k3585
10611A8124q4532j9344P0210l9336J2525Q4027J00953J0815O0330m2775j02045
10600F8952j47512J5269r322N9913M1699N2576p5212m8432O8454J44493q926n7486
$$ plain form
10588 104466 35157 -108914 -71015 2461 119985 178712 119836 110531 89991 54518 95152
10577 95152 150815 163765 260793 77248 16960 -12462 -56024 -42860 -29607 -48167 -29620
10566 -29620 46182 42039 16992 246 -50194 -54657 12830 -72304 -153378 -20790 56709 113481
10554 113481 187809 176145 149933 103747 145751 82563 -54379 -73244 67406 182538 124268
10543 124268 141641 47770 83196 211978 144407 81606 206052 325715 338460 311262 108906
10532 108906 41184 -20765 147002 264592 254141 252519 130793 86924 88515 -19842 -17614
10521 -17614 47720 86083 200008 156029 111023 -106527 -226060 -252962 -259963 -103863 156958
10510 156958 175224 82350 5299 57471 143959 151374 258173 247179 114660 67051 169149
$$ packed form
10588A04466o9309j44071L7899P3476J17524N8727n8876r305k0540l5473M0634
10577I5152N5663J2950R7028j83545o0288k9422m3562J3164J3253j8560J8547
10566b9620P5802m143k5047j6746n0440m463O7487q5134q1074J32588P7499N6772
10554A13481P4328j1664k6212m6186M2004o3188j36942j8865J40650J15132n8270
10543A24268J7373r3871L5426J28782o7571o2801J24446J19663J2745k7198k02356
10532A08906o7722o1949J67767J17590j0451j622j21726m3869J591j08357K228
10521a7614O5334L8363J13925m3979m5006k17550j19533k6902p001J56100K60821
10510A56958J8266r2874p7051N2172Q6488P415J06799j0994j32519m7609J02098
$$ plain form
10499 169149 262735 164184 120207 57276 -61372 25590 27981 -31720 -5347 24098 30379 74774
10487 74774 217157 166373 66142 100881 198512 118490 179307 157956 164706 238972 176299
10476 176299 216378 384423 470072 523484 573216 627863 723952 614402 525585 472550 439502
10465 439502 558303 533586 409829 305423 154977 135773 232668 237597 184216 145373 37937
10454 37937 -4893 26673 192377 425728 354722 302736 330217 270009 144152 51607 95445
10443 95445 281319 285877 290923 253262 303129 315619 313248 275176 168787 50547 100675 5756
10431 5756 -147908 -103917 -11251 27491 160564 94107 144148 213628 249114 261350 262847 173045
10419 173045 216843 197607 253275 276749 172668 164081 119532 63690 66570 60230 36798 167192
$$ packed form
10499A69149R3586r8551m3977o2931j18648Q6962K391n9701K6373K9445O281M4395
10487G4774J42383n0784j00231L4739R7631q0022O0817k1351O750P4266o2673
10476A76299M0079J68045Q5649N3412M9732N4647R6089j09550q8817n3035l3048
10465D39502J18801k4717j23757j04406j50446j9204R6895M929n3381l8843j07436
10454C7937m2830L1566J65704K33351p1006n1986K7481o0208j25857r2545M3838
10443I5445J85874M558N046l7661M9867J2490k371l8072j06389j18240N0128r4919
10431E756j53664M3991R2666L8742J33073o6457N0041O9480L5486J2236J497q9802
10419A73045M3798j9236N5668K3474j04081q587m4549n5842K880o340k3432J30394
$$ plain form
10407 167192 154581 124494 23592 -17096 10750 63445 158401 308672 243954 152613 154687
10396 154687 127219 156654 196175 245725 339316 101849 117838 252324 308252 400514 446714
10385 446714 432050 412158 373905 372924 313732 227582 256735 410733 354734 293855 266177 198831
10373 198831 236653 361235 427666 424671 386293 498059 606425 640745 603279 520109 481952
10362 481952 615991 785320 865001 894044 1025366 1236099 1337181 1361442 1396922 1406905 1639413
10351 1639413 1999510 2407963 3050502 3994937 5225902 6837698 8846894 11254207 13718515
10342 13718515 16212196 18666512 20642975 21886968 22361362 22082132 21107139 19610182
10334 19610182 17439764 14946460 12384919 10083604 8111034 6455427 5104089 4024163
$$ packed form
10407A67192j2611l0087j00902m0688K7846N2695R4956J50271o4718r1341K074
10396A54687k7468K9435L9521M9550R3591k37467J5989J34486N5928R2262M6200
10385D46714j4664j9892l8253r81n9192q6150K9153J53998n5999o0879k7678o7346
10373A98831L7822J24582O6431k995l8378J11766J08366L4320l7466q3170l8157
10362D81952J34039J69329P9681K9043J31322K10733J01082K4261L5480R983K32508
10351A639413L60097M08453O42539R44435J230965J611796K009196K407313K464308
10342A3718515K493681K454316J976463J243993M74394k79230r74993j496957
10334A9610182k170418k493304k561541k301315j972570j655607j351338j079926
$$ plain form
10326 4024163 3270190 2776956 2443333 2241229 2065435 1833711 1577265 1416219 1263207
10317 1263207 1081993 1006995 981635 854580 712828 691068 614006 520036 529271 562813 520842
10306 520842 575833 579065 570176 530236 360512 316070 371022 323055 339144 285207 154305
10295 154305 190306 179216 82456 72108 101946 149763 151865 286937 411906 411235 390973 345901
10283 345901 406573 366724 392977 300304 140799 84238 90470 72805 102972 175245 221754
10272 221754 254911 253123 160634 142903 272270 361690 281869 211433 141832 134205 126539 147613
10260 147613 277545 295634 181526 75841 45743 28966 -5676 -34019 -29769 45372 71083
10249 71083 -12191 -94112 -97220 -121125 43633 152435 160539 145497 2162 -18068 -81730
$$ packed form
10326D024163p53973m93234l33623k02104j75794k31724k56446j61046j53012
10317A263207j81214p4998k5360j27055j41752k1760p7062r3970R235L3542m1971
10306E20842N4991L232q889l9940j69724m4442N4952m7967J6089n3937j30902
10295A54305L6001j1090r6760j0348K9838M7817K102J35072J24969o71k0262m5072
10283C45901O0672l9849K6253r2673j59505n6561O232j7665L0167P2273M6509
10272B21754L3157j788r2489j7731J29367Q9420p9821p0436o9601p627p666K1074
10260A47613J29932J8089j14108j05685l0098j6777l4642k8343M250P5141K5711
10249G1083q3274q1921l108k3905J64758J08802Q104j5042j43335k0230o3662
$$ plain form
10238 -81730 -93589 -157443 -117564 -39165 43416 73631 80998 213880 183832 152740 188058 110374
10226 110374 203696 173672 217492 149033 92230 139599 225888 247397 80105 13311 -13523
10215 -13523 -36564 -58632 121989 66765 66693 147025 79858 51639 -31289 -40826 -163401 -155120
10203 -155120 -121703 -106557 -182627 -249294 -183857 125623 91515 55822 -39204 -96906 -35270
10192 -35270 19686 36104 11604 31115 71465 43400 21282 109536 52922 41931 7294 -10232
10180 -10232 -41085 -90733 -62417 -91660 -78165 2175 51872 109166 8152 -21969 -38844
10169 -38844 -43766 20179 9679 -32406 -99362 -104513 -70492 -117839 -179599 -47257 70632 23224
10157 23224 -135153 -135956 19368 -21462 8542 110680 33842 31564 183596 231806 269520
$$ packed form
10238h1730j1859o3854L9879P8399Q2581L0215P367J32882l0048l1092L5318p7684
10226A10374R3322l0024M3820o8459n6803M7369Q6289K1509j67292o6794k6834
10215a3523k3041k2068J80621n5224p2Q0332o7167k8219q2928r537j22575Q281
10203a55120L3417J5146p6070o6667O5437L09480l4108l5693r5026n7702O1636
10192c5270N4956J6418k4500J9511M0350k8065k2118Q8254n6614j0991l4637j7526
10180a0232l0853m9648K8316k9243J3495Q0340M9697N7294j01014l0121j6875
10169c8844m922O3945j0500m2085o6956n151L4021m7347o1760J32342J17889m7408
10157B3224j58377q03J55324m0830L0004J02138p6838k278J52032M8210L7714
$$ plain form
10146 269520 227228 92762 54798 -103097 -70868 26490 -17916 -37691 98478 37603 -15639
10135 -15639 34931 147269 143066 130899 27304 12289 90257 97676 48381 134643 104151 103670
10123 103670 116972 43697 -54322 -41320 12504 -48292 -69652 41900 6106 -36798 120195
10112 120195 230408 215366 114201 -15465 -122858 -106347 -27913 46679 49735 -35080 -200464
10101 -200464 -273671 -209944 -28164 5671 40349 145098 134300 79688 84965 239673 381250
10090 381250 234499 93277 114258 99110 116144 77680 34636 57497 38448 24960 -29520
10079 -29520 -2875 62314 5113 -45060 20522 84614 57842 143150 94196 21805 -57787 -234114
10067 -234114 -305993 -256858 -188568 -4580 7375 -38236 -159891 -161021 -124798 -24602 21962
$$ packed form
10146B69520m2292j34466l7964j57895L2229R7358m4406j9775J36169o0875n3242
10135a5639N0570J12338m203j2167j03595j5015P7968P419m9295Q6262l0492m81
10123A03670J3302p3275r8019J3002N3824o0796k1360J11552l5794m2904J56993
10112A20195J10213j5042j01165j29666j07393J6511P8434P4592L056q4815j65384
10101b00464p3207O3727J81780L3835L4678J04749j0798n4612N277J54708J41577
10090C81250j46751j41222K0981j5148J7034l8464m3044K2861j9049j3488n4480
10079b9520K6645O5189n7201n0173O5582O4092k6772Q5308m8954p2391p9592j76327
10067b34114p1879M9135O8290J83988J1955m5611j21655j130L6223J00196M6564
$$ plain form
10056 21962 -71541 -210670 -162540 -149141 -23950 -32026 -175766 -127295 -85620 -125275 -170876
10045 -170876 -33295 10880 113707 147158 111173 105296 72432 106470 106312 -2123 -26745
10034 -26745 47354 -3755 -64442 -71315 -97552 -100782 -67860 -29027 42494 131188 176451 74992
10022 74992 -23271 -86358 -52128 7656 747 -39732 -65486 -33895 6418 15702 -39099 27092
10010 27092 5461 81014 116190 129252 92107 35634 -9845 -4598 25246 -65880 -100622 -158827
9998 -158827 -191525 -175728 5073 171951 70768 -104029 -159474 -131534 -51138 40237 115186
9987 115186 65958 7471 2074 19756 81278 151560 145461 106566 97231 135190 165600 127759
9975 127759 182926 282922 254301 261118 279869 199017 -15181 -37335 -62486 -77809 -68298 -55164
$$ packed form
10056B1962r3503j39129M8130J3399J25191q076j43740M8471M1675l9655m5601
10045a70876J37581M4175J02827L3451l5985n877l2864L4038j58j08435k4622
10034b6745P4099n1109o0687o873k6237l230L2922L8833P1521Q8694M5263j01459
10022G4992r8263o3087L4230N9784o909m0479k5754L1591M0313R284n4801O6191
10010B7092k1631P5553L5176J3062l7145n6473m5479N247K9844r1126l4742n8205
9998a58827l2698J5797J80801J66878j01183j74797n5445K7940Q0396R1375P4949
9987A15186m9228n8487n397J7682O1522P0282o099l8895r335L7959L0410l7841
9975A27759N5167R9996k8621O817J8751q0852k14198k2154k5151j5323R511J3134
$$ plain form
9963 -55164 -114873 -40144 177313 259567 154116 -17758 -180841 -132236 -48504 11060 42205
9952 42205 76986 160723 147468 159964 126288 57481 6738 28000 122836 62497 -8265 92091
9940 92091 85726 205799 390614 342856 230022 167844 271015 436515 418266 400296 407744
9929 407744 459218 508364 460902 209234 144467 132256 163546 58478 30020 72306 130544
9918 130544 80527 65669 17872 1738 10191 60416 227123 263974 108329 11637 28876
9907 28876 75004 63793 64938 129785 148490 164022 222484 228509 40287 -47710 36360 46992
9895 46992 52532 83978 -34355 -64987 -100000 -75399 -129398 -181208 -132806 -123165 151 114906
9883 114906 36822 -20439 121739 130731 39402 -51469 40577 24167 52557 77605 -7242 -49601
$$ packed form
9963e5164n9709P4729K17457Q2254j05451j71874j63083M8605Q3732N9564L1145
9952D2205L4781Q3737j3255J2496l3676o8807n0743K1262R4836o0339p0762J00356
9940I2091o365J20073J84815m7758j12834o2178J03171J65500j8249j7970P448
9929D07744N1474M9146m7462k51668o4767j2211L1290j05068k8458M2286N8238
9918A30544n0017j4858m7797j6134Q453N0225J66707L6851j55645r6692J7239
9907B8876M6128j1211J145O4847J8705J5532N8462O025j88222q7997Q4070J0632
9895D6992N540L1446j18333l0632l5013K4601n3999n1810M8402R641J23316J14755
9883A14906p8084n7261J42178Q992r1329r0871R2046j6410K8390K5048q4847m2359
$$ plain form
9871 -49601 -34156 -48960 -71869 -54664 -55883 -10355 -46800 -21781 -28011 -64481 -85170 -111851
9859 -111851 -7587 -7684 65237 74745 69752 43547 13639 14687 83201 53274 -13563 40042 50938
9846 50938 98218 69614 38607 5910 -69895 -62965 40805 63868 69669 5200 -7144 29544
9834 29544 6174 -6778 -42295 -56640 35980 92328 -24443 -66495 23638 24861 58370 149450
9822 149450 113392 103461 -10708 -64706 -42505 -63907 -110396 -47276 154744 139486 100270
9811 100270 102745 149357 211628 93839 29719 -15348 946 47887 -14778 -64443 25935 74617
9799 74617 101131 78119 164859 153250 83481 64084 60208 -36547 -55855 -33268 29192 -46358
9787 -46358 -71792 -10499 126020 126791 117535 91262 138655 165990 84596 62236 159065 215188
$$ packed form
9871d9601J5445j4804k2909J7205j219M5528l6445K5019o230l6470k0689k6681
9859a11851J04264r7P2921R508m993k6205k9908J048O8514k9927o6837N3605J0896
9846E0938M7280k8604l1007l2697p5805O930J03770K3063N801o4469j2344L6688
9834B9544k3370j2952l5517j4345R2620N6348j16771m2052R0133J223L3509R1080
9822A49450l6058r931j14169n3998K2201k1402m6489O3120K02020j5258l9216
9811A00270K475M6612O2271j17789o4120m5067J6294M6941o2665m9665R0378M8682
9799G4617K6514k3012Q6740j1609o9769j9397l876r6755j9308K2587O2460p5550
9787d6358k5434O1293J36519P71r256k6273M7393K7335q1394k2360R6829N6123
$$ plain form
9775 215188 196619 163288 96164 28733 -15766 -20224 -135851 -98476 6818 39596 33400 55410
9763 55410 -20274 -16050 -1219 1323 -50023 -9501 43574 90427 36904 -13017 -6021 -34381
9751 -34381 -34680 44356 3302 -91528 -12416 85324 100520 59878 32391 -3972 -30305 -149383
9739 -149383 -121256 -55145 -103177 -129106 -143053 -81969 -95845 -114673 -163350 -115514 -93297 -133341
9727 -133341 -149681 -19443 42803 -69143 -186708 -233618 -78368 -19781 -15140 112468 113560
9716 113560 11516 -91260 -113453 -915 -106667 -147993 -97890 -74041 -199880 -194671 -48793
9705 -48793 -104483 -156243 -185485 -266843 -333411 -203815 -66599 -19813 -97618 4004 -72546
9694 -72546 -240478 -233592 -135335 -35368 -22741 113331 90329 54580 2720 47536 88705 54256
$$ packed form
9775B15188j8569l3331o7124o7431m4499m458j15627L7375J05294L2778o196K2010
9763E5410p5684M224J4831K542n1346M0522N3075M6853n3523m9921O996k8360
9751c4381k99P9036m1054r4830P9112R7740J5196m0642k7487l6363k6333j19078
9739a49383K8127O6111m8032k5929j3947O1084j3876j8828m8677M7836K2217m0044
9727a33341j6340J30238O2246j11946j17565m6910J55250N8587M641J27608J092
9716A13560j02044j02776k2193J12538j05752m1326N0103K3849j25839N209J45878
9705d8793n5690n1760k9242q1358o6568J29596J37216M6786p7805J01622p6550
9694g2546j67932O886R8257R9967J2627J36072k3002l5749n1860M4816M1169l4449
$$ plain form
9682 54256 46316 38681 95354 89887 77353 83267 25345 23298 111610 96903 102065 97067 61370
9669 61370 10210 16113 132779 72559 85298 71384 67429 23393 -35318 -75498 -122206 -94919
9657 -94919 -130629 -201329 -156618 -91579 -109936 -34139 -39489 77258 55118 -11640 -24407 8836
9645 8836 -74835 -182543 -40278 -13338 -91606 -26439 152695 188980 82115 82468 107104 133295
9633 133295 56798 -100774 -70650 -113825 -109742 -76302 -8251 43078 74797 27600 -8765 -9169
9621 -9169 24906 113745 104427 34347 -101094 -147515 -12243 146245 208788 179550 62801
9610 62801 36412 71727 64562 59210 2966 -21993 -6202 56905 120422 169716 120667 128600
9598 128600 175040 33913 -91865 2239 31292 28955 -93238 -21585 133725 100455 -14534
$$ packed form
9682E4256p940p635N6673n467j2534N914n7922k047Q8312j4707N162m998l5697
9669F1370n1160N903J16666o0220J2739j3914l955m4036n8711m0180m6708K7287
9657i4919l5710p0700M4711O5039j8357P5797n350J16747k2140o6758j2767L3243
9645H836q3671j07708J42265K6940p8268O5167J79134L6285j06865L53K4636K6191
9633A33295p6497j57572L0124m3175M083L3440O8051N1329L1719m7197l6365m04
9621i169L4075Q8839r318p0080j35441m6421J35272J58488O2543k9238j16749
9610F2801k6389L5315p165n352n6244k4959J5791O3107O3517M9294m9049P933
9598A28600M6440j41127j25778R4104K9053k337j22193P1653J55310l3270j14989
$$ plain form
9587 -14534 -107011 -167175 -183943 -155602 -16816 -42017 -21233 62658 32360 -72932 -201565
9576 -201565 -124955 -1883 73018 139163 256627 244105 109189 177461 201001 136528 111206
9565 111206 -24178 -73331 2765 44455 97521 -73 -35406 66264 -1980 -44088 -59390
9554 -59390 -193485 -155884 -54239 25785 72687 8542 24449 -91851 -233187 -214969 -189193
9543 -189193 -121915 -51985 -39144 -29247 -82353 -20918 82533 37818 27746 17139 -95507
9532 -95507 -172881 -197695 -101048 -189847 -228206 -106379 6751 -78599 31830 75584 -35440
9521 -35440 -102633 -82919 -120564 -138125 -29935 8573 3552 35943 66095 62684 27563 11783
9509 11783 -16450 -75069 348 107023 157279 57043 38229 32667 18963 -18108 -85816 -35787
$$ packed form
9587a4534r2477o0164j6768K8341J38786k5201K0784Q3891l0298j05292j28633
9576b01565P6610J23072P4901O6145J17464j2522j34916O8272K3540o4473k5322
9565A11206j35384m9153P6096M1690N3066r7594l5333J01670o8244m2108j5302
9554e9390j34095L7601J01645Q0024M6902o4145J5907j16300j41336J8218K5776
9543a89193O7278O9930J2841R897n3106O1435J03451m4715j0072j0607j12646
9532i5507p7374k4814R6647q8799l8359J21827J13130q5350J10429M3754j11024
9521c5440o7193J9714l7645j7561J08190L8508n021L2391L0152l411l5121j5780
9509A1783k8233n8619P5417J06675N0256j00236j8814n562j3704l7071o7708N0029
$$ plain form
9497 -35787 -3936 -74403 -19790 -20005 -70744 -42392 -81879 -135717 -136040 -139271 -180038 -137095 -133954
9484 -133954 -148029 -10316 29520 5378 40089 -66118 -94707 -83983 -156706 -250766 -241774
9473 -241774 -167071 -102903 -117665 -129491 -151115 -171931 -146008 -15465 -32459 -28730 -141247
9462 -141247 -184062 -217306 -303506 -165698 -19225 14790 -30947 -84852 -75330 -91292 -127358
9451 -127358 -56482 -6176 76959 47368 8934 -3453 -47766 3222 25420 40178 98575 51844
9439 51844 -103624 -250656 -137412 -34193 -73071 -199474 -80326 161444 76111 -19204
9429 -19204 -63153 -75962 -55166 -69074 -89472 -110694 61672 76882 127209 106258 79279 98142
9417 98142 218859 163835 120690 96694 76449 106597 147478 116222 107985 105332 61893 129556
$$ packed form
9497c5787L1851p0467N4613k15n0739K8352l9487n3838l23l231m0767M2943L141
9484a33954j4075J37713L9836k4142L4711j06207k8589J0724p2723r4060Q992
9473b41774P4703O4168j4762j1826k1624k0816K5923J30543j6994L729j12517
9462a41247m2815l3244q6200J37808J46473L4015m5737n3905R522j5962l6066
9451a27358P0876N0306Q3135k9591l8434j2387m4313N0988K2198J4758N8397m6731
9439E1844j55468j47032J13244J03219l8878j26403J19148K41770q5333r5315
9429a9204m3949j2809K0796j3908k0398k1222J72366J5210N0327k0951k6979J8863
9417I8142J20717n5024m3145k3996k0245L0148M0881l1256q237k653m3439O7663
$$ plain form
9405 129556 154557 53928 3286 90710 85344 126941 138270 139273 107116 95588 43854 36689
9393 36689 -44126 -103434 -70021 -22680 94026 88463 111843 115343 37377 -11426 -136503 -108747
9381 -108747 17651 -1679 -42264 -1731 -2081 21383 54013 8187 52438 183985 241049 232736
9369 232736 164184 21900 -32567 1638 44988 60972 2952 39497 -19700 67525 28825
9358 28825 84543 193793 238532 154441 81910 60211 114770 36964 81918 133019 142354 49273
9346 49273 29921 -15809 13645 122295 88551 93641 42657 36742 29304 52260 37253 -81209
9334 -81209 -36974 14399 41215 80840 56489 121930 242260 107389 136619 173290 111792
9323 111792 79417 62351 56002 104040 72169 86920 -44662 1998 143173 203763 139372
$$ packed form
9405A29556K5001j00629n0642Q7424n366M1597J1329J003l2157j1528n1734p165
9393C6689q0815n9308L3413M7341J16706n563K3380L500p7966m8803j25077K7756
9381a08747J26398j9330m0585M0533l50K3464L2630m5826M4251J31547N7064q313
9369B32736o8552j42284n4467L4205M3350J5984n8020L6545n9197Q7225l8700
9358B8825N5718J09250M4739q4091p2531k1699N4559p7806M4954N1101R335r3081
9346D9273j9352m5730K9454J08650l3744N090n0984n915p438K2956j5007j18462
9334h1209M4235N1373K6816L9625k4351O5441J20330j34871K9230L6671o1498
9323A11792l2375j7066o349M8038l1871J4751j31582M6660J41175O0590o4391
$$ plain form
9312 139372 12447 55791 133959 81335 154747 215438 69682 75606 18337 -13873 -59473
9301 -59473 -141659 -154327 4512 -686 -123768 -213065 -80938 131758 328412 237376 68728
9290 68728 5758 12878 -115791 -17431 109884 239155 155522 103226 89938 195540 137733
9279 137733 90199 73094 77427 146071 156500 221895 155902 168689 266247 235475 244490 59272
9267 59272 -42621 -48772 -49541 -92079 -60100 69524 64429 37945 -95884 -181704 -113645 -41078
9255 -41078 -18343 -28574 -6581 -13150 -31921 9175 -79574 -137883 -60396 93715 110838 142508
9243 142508 199364 202664 279310 281519 138288 -25428 -20526 -9374 -71040 15904 50883 120714
9231 120714 116227 30782 53141 103688 147680 57298 101460 239357 276070 76457 -41282
$$ packed form
9312A39372j26925M3344P8168n2624P3412O0691j45756N924n7269l2210m5600
9301e9473q2186j2668J58839n198j23082q9297J32127K12696J96654r1036j68648
9290F8728o2970P120j28669R8360J27315J29271q3633n2296j3288J05602n7807
9279A37733m7534j7105M333O8644J0429O5395o5993J2787R7558l0772R015j85218
9267E9272j01893o151p69m2538L1979J29624n095k6484j33829q5820O8059P2567
9255d1078K2735j0231K1993o569j8771M1096q8749n8309P7487J54111J7123L1670
9243A42508N6856L300P6646K209j43231j63716M902J1152o1666Q6944L4979O9831
9231A20714m487q5445K2359N0547M3992r0382M4162J37897L6713j99613j17739
$$ plain form
9220 -41282 -76013 -36384 17375 -21574 1411 9653 28503 -4314 6478 15313 -67399 -65232
9208 -65232 -57257 -109417 -50390 -76686 -69965 -2828 216621 363211 256784 104943 -41314
9197 -41314 -16253 78959 113641 -1901 -1661 163741 265433 213921 87984 -31733 -94780
9186 -94780 -113155 -169866 -70365 52843 13008 5670 79408 128811 264061 380974 328305
9175 328305 308999 260217 102616 -1330 -44054 -28614 -110059 -175204 -84536 90764 158053
9164 158053 106372 -16955 -76577 -27096 -123593 -147200 -13805 100294 201865 219777 195971
9153 195971 199159 58754 37890 92278 22754 4174 117787 205397 178885 201411 292117
9142 292117 288460 225635 222599 166672 158822 198717 82735 68006 112036 88452 105605 150744
$$ packed form
9220d1282l4731L9629N3759l8949K2985Q242J8850l2817J0792Q835q2712K167
9208f5232P975n2160N9027k6296O721O7137K19449J46590j06427j51841j46257
9197d1314K5061R5212L4682j15542K40J65402J01692n1512j25937j19717o3047
9186i4780j8375n6711R9501J23208l9835p338P3738M9403J35250J16913n2669
9175C28305j9306m8782j57601j03946m2724J5440q1445o5145R0668J75300O7289
9164A58053n1681j23327n9622M9481r6497k3607J33395J14099J01571J7912k3806
9153A95971L188j40405k0864N4388o9524j8580J13613Q7610k6512K2526R0706
9142B92117l657o2825l036n5927p850L9895j15982j4729M4030k3584J7153M5139
$$ plain form
9130 150744 82070 48796 48259 10844 -37782 68978 102084 -13844 -159103 -171241 -116677
9119 -116677 47360 129751 69346 2016 88467 221770 116642 29060 54271 169924 202957
9108 202957 132646 155306 166744 199352 152205 129106 181579 228362 219227 273259 227049 259034
9096 259034 157744 94252 17764 157340 226671 94859 71656 166101 212207 220086 140131
9085 140131 141390 125371 121927 206920 162564 303855 291895 124080 36605 -65002 -79218
9074 -79218 -1349 131685 189368 225476 125542 105262 61207 67196 92427 151875 181369 86710
9062 86710 58688 152787 80607 -11344 -44869 -6708 37696 185601 280602 373440 295638 145585
9050 145585 65625 26717 12320 86805 74873 69152 -52107 -54227 -36495 -12780 -107472 -107451
$$ packed form
9130A50744o8674l3274n37l7415m8626J06760L3106j15928j45259j2138N4564
9119a16677J64037Q2391o0405o7330Q6451J33303j05128q7582K5211J15653L3033
9108B02957p0311K2660J1438L2608m7147k3099N2473M6783r135N4032m6210L1985
9096B59034j01290o3492p6488J39576O9331j31812k3203R4445M6106P879p9955
9085A40131J259j6019l444Q4993m4356J41291j1960j67815q7475j01607j4216
9074g9218P7869J33034N7683L6108r9934k0280m4055N989K5231N9448K9494r4659
9062H6710k8022R4099p2180r1951l3525L8161M4404J47905R5001R2838p7802j50053
9050A45585p9960l8908j4397P4485j1932n721j21259k120J7732K3715r4692K1
$$ plain form
9038 -107451 -50435 -117162 -76815 101930 102386 78315 78557 80749 172238 122210 173676 144506
9026 144506 199845 134474 57508 15201 120635 68904 43061 66716 65501 89475 106270 210231
9014 210231 216097 174356 150338 208006 247935 228527 128331 83934 91767 76479 15819 -26822
9002 -26822 45540 120402 101448 204584 242179 60446 1603 90968 27059 5417 -3721 37677
8990 37677 62829 -894 18499 32245 -63565 -48158 3918 84798 65471 46048 -12482 -24378
8978 -24378 13556 36750 44538 147401 152676 3423 -77268 -8886 130294 191957 203642 177614
8966 177614 87908 128088 183760 196737 103626 155065 260655 381407 295173 215316 209346
8955 209346 128038 -34494 -95252 -37725 -12908 -43225 -112000 -144234 -76957 -51401 12671
$$ packed form
9038a07451N7016o6727M0347J78745M56k4071K42K192R1489n0028N1466k9170
9026A44506N5339o5371p6966m2307J05434n1731k5843K3655j215K3974J6795J03961
9014B10231N866m1741k4018N7668L9929j9408j00196m4397P833j5288o0660m2641
9002b6822P2362P4862j8954J03136L7595j81733n8843Q9365o3909k1642r138M1398
8990C7677K5152o3723J9393J3746r5810J5407N2076Q0880j9327j9423n8530j1896
8978b4378L7934K3194P788J02863N275j49253q0691O8382J39180O1663J1685k6028
8966A77614q9706M0180N5672J2977r3111N1439J05590J20752q6234p9857n970
8955B09346q1308j62532o0758N7527K4817l0317o8775l2234O7277K5556O4072
$$ plain form
8944 12671 75797 43500 147483 17080 -12407 -32441 -1533 62977 76723 128443 127526 87112
8932 87112 94584 52446 -19841 104824 71142 170057 132584 2998 -76606 17767 84477 49778
8920 49778 65081 198545 156453 108456 199976 342593 225042 133584 236565 226540 189946
8909 189946 264356 317941 241990 151574 89174 203233 212021 134332 4676 -68030 -43111
8898 -43111 -54865 -46405 60909 -2934 72407 154633 174549 314688 456165 463426 392514 385952
8886 385952 390036 366937 370676 282459 201795 206621 173421 212862 206600 104853 119194 150456
8874 150456 146962 83985 86352 112454 102266 -793 1236 107865 21877 -4898 73196 140562
8862 140562 126788 123970 24630 -48420 -11589 80240 72925 17618 64564 89924 77061 60678
$$ packed form
8944A2671O3126l2297J03983j30403k9487k0034L0908O4510J3746N1720r17m0414
8932H7112P472m2138p2287J24665l3682R8915l7473j29586p9604R4373O6710l4699
8920D9778J5303J33464m2092m7997R1520J42617j17551r1458J02981j0025l6594
8909A89946P4410N3585p5951r0416o2400J14059Q788p7689j29656p2706K4919
8898d3111j1754Q460J07314o3843P5341Q2226J9916J40139J41477P261p0912o562
8886C85952M084k3099L739q8217q0664M826l3200L9441o262j01747J4341L1262
8874A50456l494o2977K367K6102j0188j03059K029J06629q5988k6775P8094O7366
8862A40562j3774k818r9340p3050L6831R1829p315n5307M6946K5360j2863j6383
$$ plain form
8850 60678 53786 -24926 6767 78150 100787 30993 -16696 64323 176120 203571 211994 157295
8838 157295 148345 84784 95232 54784 120567 151433 143529 90898 45050 203498 136976 -56143
8826 -56143 -73570 80482 255697 196199 33555 84406 88184 173603 178010 147027 219558 316203
8814 316203 244312 138240 136628 80130 -42840 -39741 22049 -837 9455 115908 231623
8803 231623 273990 148080 2344 56339 137571 236711 210222 253234 197481 61522 57801
8792 57801 28633 142755 268447 244164 187400 199774 104888 28992 48694 215393 253076
8781 253076 90093 -80922 -59010 -26460 -30804 -12402 74414 114713 142872 92724 -71496
8770 -71496 -141842 -142064 3168 135003 228179 233176 225652 150607 200766 232383 231116 386466
$$ packed form
8850F0678o892p8712L1693P1383K2637o9794m7689Q1019J11797K7451Q423n4699
8838A57295q950o3561J0448m0448O5783L0866p904n2631m5848J58448o6522j93119
8826e6143j7427J54052J75215n9498j62644N0851L778Q5419M407l0983P2531R6645
8814C16203p1891j06072j612n6498j22970L099O1790k2886J0292J06453J15715
8803B31623M2367j25910j45736N3995Q1232R9140k6489M3012n5753j35959l721
8792E7801k9168J14122J25692k4283n6764J2374r4886p5896J9702J66699L7683
8781B53076j62983j71015K1912L2550m344J8402Q6816M0299K8159n0148j64220
8770g1496p0346k22J45232J31835R3176M997p524p5045N0159L1617j267J55350
$$ plain form
8758 386466 366730 199816 183090 288684 254798 93560 37037 -24706 9167 30788 64444
8747 64444 54186 66088 194711 256906 222164 204519 178841 139241 144339 242444 310298 269660
8735 269660 183943 215733 183286 281996 330459 320421 342993 245637 201192 285240 409862
8724 409862 462435 500653 470465 540746 507041 525080 596782 715822 690324 555088 375990
8713 375990 437621 409526 384478 370797 304453 308710 445358 524872 487710 405405 370202 386670
8701 386670 304144 250789 318107 309001 283163 252610 328053 392337 559728 587967 578250 534348
8689 534348 523785 537127 495910 386250 436500 464453 454104 374834 254838 237025 367679
8678 367679 431949 519420 506489 362313 210844 187541 250891 281456 367031 415082 371251
$$ packed form
8758C86466j9736j66914j6726J05594l3886j61238n6523o1743L3873K1621L3656
8747F4444j0258J1902J28623O2195l4742j7645k5678l9600N098R8105O7854m0638
8735B69660q5717L1790l2447R8710M8463j0038K2572r7356m4445Q4048J24622
8724D09862N2573L8218l0188P0281l3705J8039P1702J19040k5498j35236j79098
8713C75990O1631k8095k5048j3681o6344M257J36648P9514l7162q2305l5203J6468
8701C86670q2526n3355O7318r106k5838l0553P5443O4284J67391K8239r717m3902
8689E34348j0563J3342m1217j09660N0250K7953j0349p9270j19996j7813J30654
8678C67679O4270Q7471j2931j44176j51469k3303O3350L0565Q5575M8051m3831
$$ plain form
8667 371251 483160 556774 463077 358431 254657 216781 341132 456227 429928 442052 480365
8656 480365 458754 493639 547089 478704 414261 418761 496033 570688 575834 611002 752894 855840
8644 855840 877842 963878 981019 974591 1112937 1074460 1011457 910374 868477 809447 863484
8633 863484 800084 793548 744768 707491 726721 787580 860839 815102 821305 878794 851380 786968
8621 786968 950372 1037667 1077957 1150150 1091911 1014959 1077335 1308495 1502979 1698972 1715789
8610 1715789 1730895 1810889 1922519 1943236 2008204 2120207 2196324 2253106 2388719 2624883 2880584
8599 2880584 2978544 3255801 3611311 3822697 4103256 4348616 4664616 4918977 5053812 5115057
8589 5115057 5217612 5213384 4967168 4623793 4175461 3761855 3435905 3230533 2940279 2670584
$$ packed form
8667C71251J11909P3614r3697j04646j03774l7876J24351J15095k6299J2124L8313
8656D80365k1611L4885N3450o8385o4443M500P7272P4655N146L5168J41892J02946
8644H55840K2002Q6036J7141o428J38346l8477o3003j01083m1897n9030N4037
8633H63484o3400o536m8780l7277J9230O0859P3259m5737O203N7489k7414o4412
8621G86968J63404Q7295M0290P2193n8239p6952O2376K31160J94484J95993J6817
8610A715789J5106P9994J11630K0717O4968J12003P6117N6782J35613K36164K55701
8599B880584R7960K77257L55510K11386K80559K45360L16000K54361J34835O1245
8589E115057J02555m228k46216l43375m48332m13606l25950k05372k90254k69695
$$ plain form
8579 2670584 2442133 2050355 1936081 1856215 1763591 1707673 1606700 1462080 1447493 1299759
8569 1299759 1062199 944783 917409 854017 802543 864015 819601 805006 768662 832370 922799
8558 922799 1037941 964879 817236 704335 555573 590346 725165 694236 735913 779820 728889
8547 728889 627875 588225 739004 805120 750162 700107 703596 729919 688787 705580 784674
8536 784674 693607 618151 518900 441016 452311 535596 601099 435033 333274 301911 289719
8525 289719 335243 369035 401053 411850 440108 423089 485983 518635 437053 460623 494751 629542
8513 629542 483973 365151 387597 435740 401084 350105 351677 455021 386090 296554 230642
8502 230642 151218 131021 194910 252547 298920 295487 271203 136921 137584 130629 195063 178495
$$ packed form
8579B670584k28451l91778j14274p9866r2624n5918j00973j44620j4587j47734
8569A299759k37560j17416k7374o3392n1474O1472m4414j4595l6344O3708R0429
8558I22799J15142p3062j47643j12901j48762L4773J34819l0929M1677M3907n0931
8547G28889j01014l9650J50779O6116n4958n0055L489K6323m1132J6793P9094
8536G84674r1067p5456r9251p7884J1295Q3285O5503j66066j01759l1363j2192
8525B89719M5524L3792L2018J0797K8258j7019O2894L2652q1582K3570L4128J34791
8513F29542j45569j18822K2446M8143l4656n0979J572J03344o8931q9536o5912
8502B30642p9424k0197O3889N7637M6373l433k4284j34282O63o955O4434j6568
$$ plain form
8490 178495 95674 14742 -16539 19658 -1547 49617 82387 19871 5199 59410 150288 163398
8478 163398 212127 299223 322334 388070 386385 415451 478374 490464 421068 341643 262222 297311
8466 297311 396538 332272 166499 162536 236555 195402 127681 138712 172870 155342 117669 214804
8454 214804 258975 288634 366532 340126 336043 349816 272120 203955 320700 235291 81003
8443 81003 90658 119448 222116 260080 190758 262749 300170 209409 40856 8832 91193 171031
8431 171031 108525 198678 277032 388189 399483 260165 135487 216360 279622 390055 354241
8420 354241 288572 285689 249954 125821 30776 -29370 99914 147837 22062 -18355 -43671
8409 -43671 -47765 14396 109693 71646 56184 98018 101102 64705 76833 -52806 20125 111185
$$ packed form
8490A78495q2821q0932l1281L6197k1205N1164L2770o2516j4672N4211R0878J3110
8478A63398M8729Q7096K3111O5736j685K9066O2923J2090o9396p9425p9421L5089
8466B97311R9227o4266j65773l963P4019m1153o7721J1031L4158j7528l7673R7135
8454B14804M4171K9659P7898k6406m083J3773p7696o8165J16745q5409j54288
8443H1003R655K8790J02668L7964o9322P1991L7421r0761j68553l2024Q2361P9838
8431A71031o2506R0153P8354J11157J1294j39318j24678Q0873O3262J10433l5814
8420C54241o5669k883l5735j24133r5045o0146J29284M7923j25775m0417k5316
8409d3671m094O2161R5297l8047j5462M1834L084l6397J2128j29639P2931R1060
$$ plain form
8397 111185 44645 -56003 28689 65770 165 -3361 43055 38914 -33781 3089 139695 261073
8385 261073 181239 172435 211423 260207 157053 20632 99163 260024 151475 99785 56308
8374 56308 110717 179383 252550 137985 165093 239407 273225 287589 294679 172722 202456 248063
8362 248063 283964 223094 140656 43654 21777 151616 241252 194150 156077 216199 236242
8351 236242 181754 113139 62765 12798 24892 83138 23005 53459 195264 122673 75310
8340 75310 100432 215353 176484 62225 16733 42655 52840 82469 126724 234488 144700
8329 144700 -20285 -140106 -91465 -62989 21766 174315 157545 130939 102031 -69966 -93244
8318 -93244 -111684 -101612 12473 1502 -36910 19180 57718 127742 181756 164468 42097
$$ packed form
8397A11185o6540j00648Q4692L7081o5605l526M6416m141p2695L6870J36606J21378
8385B61073p9834q804L8988M8784j03154j36421P8531J60861j08549n1690m3477
8374E6308N4409O8666P3167j14565K7108P4314L3818J4364P090j21957K9734M5607
8362B48063L5901o0870q2438r7002k1877J29839Q9636m7102l8073O0122K0043
8351B36242n4488o8615n0374m9967J2094N8246o0133L0454J41805p2591m7363
8340G5310K5122J14921l8869j14259m5492K5922J0185K9629M4255J07764q9788
8329A44700j64985j19821M8641K8476Q4755J52549j6770k6606k8908j71997k3278
8318i3244j8440J0072J14085j0971l8412N6090L8538P0024N4014j7288j22371
$$ plain form
8307 42097 35135 30681 86371 -910 67998 177394 143725 141763 51435 -9822 -61584 -94083
8295 -94083 107447 110487 265685 303451 135716 76778 217910 258402 186940 98216 181494
8284 181494 178797 51140 90516 142988 166362 140531 -13873 -17818 160322 251996 251986 203218
8272 203218 43996 -74607 -72388 60151 79137 61513 94234 35023 -44807 -25044 -8667
8261 -8667 74443 27433 -15496 -17519 -65750 -142491 -152144 -103967 -64771 -10505 146977 210110
8249 210110 127232 7109 46330 21320 115368 204934 238582 227774 164568 135604 166037
8238 166037 175999 181060 140248 90947 -26121 -76571 -10535 25873 84140 56753 46299 80472
8226 80472 6198 -47155 -19506 80205 149032 113953 133818 192668 104695 52868 137386 136002
$$ packed form
8307D2097o962m454N5690q7281O8908J09396l3669j962r0328o1257n1762l2499
8295i4083K01530L040J55198L7766j67735n8938J41132M0492p1462q8724Q3278
8284A81494k697j27657L9376N2472K3374k5831j54404l945J78140R1674j0m8768
8272B03218j59222j18603K219J32539J8986j7624L2721n9211p9830J9763J6377
8261h667Q3110m7010m2929k023m8231p6741r653M8177L9196N4266J57482O3133
8249B10110q2878j20123L9221k5010R4048Q9566L3648j0808o3206k8964L0433
8238A66037R962N061m0812m9301j17068n0450O6036L6408N8267k7387j0454L4173
8226H0472p4274n3353K7649R9711O8827l5079J9865N8850q7973n1827Q4518j384
$$ plain form
8214 136002 26268 115706 207620 88355 77962 161357 191912 60254 46817 66863 80168
8203 80168 172170 151480 17569 -123675 -109779 -31216 151592 236707 167387 80214 -88166
8192 -88166 -51900 82728 207174 220635 182471 125657 24271 50118 102500 55148 5070
8181 5070 -50095 57023 122083 -14255 -109319 12086 125282 54635 10454 -10280 1994
8170 1994 40571 -62109 -91137 -49369 -17543 -45887 46017 74726 231059 310051 386680 289672
8158 289672 274838 384888 462381 339439 264461 169733 148534 44467 38893 170695 258542
8147 258542 306171 216245 334278 375598 268945 161086 114943 246819 175523 168266 206369
8136 206369 213691 55588 -65924 7535 -12563 30960 144649 156291 133964 107812 114977
$$ packed form
8214A36002j09734Q9438R1914j19265j0393Q3395L0555j31658j3437K0046J3305
8203H0168R2002k0690j33911j41244J3896P8563J82808Q5115o9320q7173j68380
8192h8166L6266J34628J24446J3461l8164n6814j01386K5847N2382m7352n0078
8181E070n5165J07118O5060j36338r5064J21405J13196p0647m4181k0734J2274
8170A994L8577j02680k9028M1768L1826k8344R1904K8709J56333P8992P6629r7008
8158B89672j4834J10050P7493j22942p4978r4728k1199j04067n574J31802Q7847
8147B58542M7629q9926J18033M1320j06653j07859m6143J31876p1296p257L8103
8136B06369P322j58103j21512P3459k0098M3523J13689J1642k2327k6152P165
$$ plain form
8125 114977 28011 -1345 -44083 53199 151163 180882 156865 258875 320391 316115 393551 458705
8113 458705 484602 437799 293187 197744 250821 172700 78668 62941 61913 -43732 -22719
8102 -22719 80104 96416 148656 95533 45644 37391 116801 136486 193264 149479 145717 138905
8090 138905 124214 77053 91887 131373 223298 326038 233183 37565 -8159 -63430 84743
8079 84743 108257 115778 90165 134690 180219 103117 36037 962 52779 215497 307972 261788
8067 261788 121648 118645 100739 71823 129830 94123 127337 272280 328317 284016 247866
8056 247866 279588 271633 260227 351850 282198 287738 238518 222192 332352 406389 429114 430158
8044 430158 483082 489941 407635 417517 534404 622617 652687 613309 553781 551943 491716 424806
$$ packed form
8125A14977q6966k9356m2738R7282R7964K9719k4017J02010O1516m276P7436O5154
8113D58705K5897m6803j44612r5443N3077p8121r4032j5727j028j05645K1013
8102b2719J02823J6312N2240n3123m9889q253P9410J9685N6778m3785l762o812
8090A38905j4691m7161J4834L9486R1925J02740r2855j95618m5724n5271J48173
8079H4743K3514P521k5613M4525M5529p7102o7080l5075N1817J62718R2475m6184
8067B61788j40140l003j7906k8916N8007l5707L3214J44943N6037m4301l6150
8056B47866L1722p955j1406R1623o9652N540m9220j6326J10160P4037K2725J044
8044D30158N2924O859q2306R882J16887Q8213L0070l9378n9528j838o0227o6910
$$ plain form
8032 424806 328649 309942 304784 261679 283286 360068 414094 455040 511698 434444 280848 311636
8020 311636 387513 466897 492142 425495 517738 550855 682682 707734 562922 529963 489648
8009 489648 651073 841002 1015823 1016246 1027066 1122593 1257483 1209026 1132696 1202202 1154606
7998 1154606 1168657 1239843 1109106 1081388 1047508 1061215 991606 946650 992277 922421 696166
7987 696166 628499 609951 573387 515168 571900 641837 588654 683957 697784 732035 708016 682574
7975 682574 723514 641797 623131 722079 651815 713421 907824 1084874 926692 773897 739894
7964 739894 851071 884049 859682 931609 985570 1071283 1177348 1121914 1045819 1115957 1127016
7953 1127016 1149431 1235995 1357163 1293947 1152282 979154 938076 994883 1134743 1043646 914669
$$ packed form
8032D24806r6157j8707n158m3105K1607P6782N4026M0946N6658p7254j53596L0788
8020C11636P5877P9384K5245o6647R2243L3117J31827K5052j44812l2959m0315
8009D89648J61425J89929J74821M23J0820R5527J34890m8457p6330O9506m7596
7998A154606J4051P1186j30737k7718l3880J3707o9609m4956M5627o9856k26255
7987F96166o7667j8548l6564n8219N6732O9937n3183R5303J3827L4251k4019k5442
7975F82574M0940q1717j8666R8948p0264O1606J94403J77050j58182j52795l4003
7964G39894J11177L2978k4367P1927N3961Q5713J06065n5434p6095P0138J1059
7953A127016K2415Q6564J21168o3216j41665j73128m1078N6807J39860r1097j28977
$$ plain form
7942 914669 930690 924503 834938 743015 733048 713701 701702 648460 670103 790331 783322 599258
7930 599258 587023 622114 751338 905833 776445 596014 600106 688833 739031 856973 869519
7919 869519 820231 798938 843168 928516 876278 807014 798106 794928 687074 634880 738699 795538
7907 795538 853640 798397 606163 581847 598295 647721 702519 680129 625902 673109 792836
7896 792836 838107 788609 780155 665017 674128 624163 483177 418124 476131 422943 364263 515318
7884 515318 538316 528455 383299 332338 454131 579140 605338 488813 475411 378377 383467
7873 383467 491291 372843 322735 458348 425605 299733 343454 267661 352706 390150 252963
7862 252963 77006 25519 130515 180102 254992 330650 405390 320228 145536 179327 347583
$$ packed form
7942I14669J6021o187q9565r1923r967j9347j1999n3242K1643J20228p009j84064
7930E99258j2235L5091J29224J54495j29388j80431M092Q8727N0198J17942J2546
7919H69519m9288k1293M4230Q5348n2238o9264q908l178j07854n2194J03819N6839
7907G95538N8102n5243j92234k4316J6448M9426N4798k2390n4227M7207J19727
7896G92836M5271m9498q454j15138R111m9965j40986o5053N8007n3188n8680J51055
7884E15318K2998r861j45156n0961J21793J25009K6198j16525j3402r7034N090
7873C83467J07824j18448n0108J35613l2743j25872M3721p5793Q5045L7444j37187
7862B52963j75957n1487J04996M9587P4890P5658P4740q5162j74692L3791J68256
$$ plain form
7851 347583 286630 113853 38270 204679 262161 323904 366771 214828 123370 215120 330679
7840 330679 237051 209604 274141 291749 354492 323577 96325 -5162 -89255 -88331 18279
7829 18279 13271 2403 39363 -53474 -54282 -45211 27393 91034 -8320 22653 40318 174362
7817 174362 277884 352997 285652 156124 146824 96758 -9401 -50321 -22257 -13616 -105407
7806 -105407 -82270 29774 135167 219201 240515 226015 154624 178153 194581 155447 306564
7795 306564 329141 315520 236024 75081 42124 128067 208947 233863 95273 -60560 -71806
7784 -71806 -1770 76828 56405 -76865 -46954 -5982 94907 114662 73514 108438 194597
7773 194597 225053 107065 -20188 -6499 25572 20287 11185 38892 -82447 -176285 -202107
$$ packed form
7851C47583o0953j72777p5583J66409N7482O1743M2867j51943r1458R1750J15559
7840C30679r3628k7447O4537J7608O2743l0915k27252j01487q4093R24J06610
7829A8279n008j0868L6960r2837q08R071P2604O3641r9354L0973J7665J34044
7817A74362J03522P5113o7345j29528r300n0066j06159m0920K8064Q641r1791
7806a05407K3137J12044J05393Q4034K1314j4500p1391K3529J6428l9134J51117
7795C06564K2577j3621p9496j60943l2957Q5943Q0880K4916j38590j55833j1246
7784g1806P0036P8598k0423j33270K9911M0972J00889J9755m1148L4924Q6159
7773A94597L0456j17988j27253J3689L2071n285r102K7707j21339r3838k5822
$$ plain form
7762 -202107 -130520 -67003 11312 94087 99298 33193 -57173 -29017 -72568 -196762 -184139 -15860
7750 -15860 111684 183152 195639 32317 -128325 -155550 -118849 -124887 -151346 -151335 -67383 -52524
7738 -52524 -33099 -4378 70528 110047 11818 29882 115238 111003 157587 115980 91411 42350
7726 42350 -31696 -7454 35183 1700 49690 54649 9006 -17646 36410 86982 150636 88763
7714 88763 -7551 -26827 -35944 1267 -24792 -116911 -135222 -71790 81764 34834 -28612 -127144
7702 -127144 -197602 -110284 -141852 -165911 -126271 -110085 -83464 -144755 -143954 -181372 -115630 -14012
7690 -14012 61985 5057 -18033 21198 90070 110077 42512 1828 11406 -11869 16418 -144722
7678 -144722 -243028 -140407 -22007 106412 11632 -82435 -43360 -120289 -45297 65896 35820
$$ packed form
7762b02107P1587O3517P8315Q2775N211o6105r0366K8156m3551j24194J2623J68279
7750a5860J27544P1468J2487j63322j60642k7225L6701o038k6459J1Q3952J4859
7738e2524J9425K8721P4906L9519r8229J8064Q5356m235M6584m1607k4569m9061
7726D2350p4046K4242M2637l3483M7990M959m5643k6652N4056N0572O3654o1873
7714H8763r6314j9276r117L7211k6059r2119j8311O3432J53554m6930o3446r8532
7702a27144p0458Q7318l1568k4059L9640J6186K6621o1291Q01l7418O5742J01618
7690a4012P5997n6928k3090L9231O8872K0007o7565m0684R578k3275K8287j61140
7678a44722r8306J02621J18400J28419r4780r4067L9075p6929P4992J11193l0076
$$ plain form
7667 35820 -13614 81852 157253 92530 -61259 -58475 -12016 -103093 -124193 -31457 18239 -112279
7655 -112279 -220581 -170186 -158486 -207145 -236592 -193607 -98466 -2148 51940 -37420 -118019
7644 -118019 -98767 -63528 -42750 -92880 -37200 29304 -31237 -16730 2679 -40283 -115299 -209457
7632 -209457 -200459 -259518 -237519 -168257 -216966 -250275 -342807 -378415 -334457 -269030 -199554 -108681
7620 -108681 -94938 -53649 -70048 -56094 -82989 -54309 -21342 -47947 -113802 -96223 -126656 -95553
7608 -95553 -43007 -17279 30569 18559 -60092 -113569 -133614 -191297 -164921 -83793 -73786 -88548
7596 -88548 -102149 -66209 -24680 -8884 -3589 31048 46675 49566 -58347 -119584 -266885 -247588
7584 -247588 -204705 -271669 -173030 -24305 3387 36837 -48139 5903 134926 74260 23364
$$ packed form
7667C5820m9434R5466P5401o4723j53789K784M6459r1077k1100R2736M9696j30518
7655a12279j08302N0395J1700m8659k9447M2985R5141R6318N4088q9360q0599
7644a18019J9252L5239K0778n0130N5680O6504o0541J4507J9409m2962p5016r4158
7632b09457Q998n9059K1999O9262m8709l3309r2532l5608M3958O5427O9476R0873
7620a08681J3743M1289j6399J3954k6895K8680L2967k6605o5855J7579l0433L1103
7608i5553N2546K5728M7848j2010p8651n3477k0045n7683K6376Q1128J0007j4762
7596h8548j3601L5940M1529J5796N295L4637J5627K891j07913o1237j47301J9297
7584b47588M2883o6964R8639J48725K7692L3450q4976N4042J29023o0666n0896
$$ plain form
7573 23364 87605 211823 272814 175056 -3213 53922 116479 70371 57573 72687 58423
7562 58423 7352 20254 55052 94062 107024 188452 268260 212019 55704 81044 67729 -1204
7550 -1204 19857 -57025 -125845 -121116 -59372 58516 94272 112426 33550 -44496 -36438 122166
7538 122166 74916 -25354 44190 24489 -47005 -81191 -122297 -180111 -179719 -167981 -104056 -61829
7526 -61829 -83200 -62255 -177234 -252343 -140994 -120319 -143995 -239412 -178574 6050 44928
7515 44928 44795 114307 159412 70407 -38633 -115212 -38518 51162 -18880 -49386 -162600 -128630
7503 -128630 4695 18248 -62964 -141061 -146376 -91294 -33159 -100924 -141205 -14334 65019
7492 65019 7913 -60152 -96054 -141913 -89779 -172116 -249458 -185793 -190507 -273720 -248944 -205297
$$ packed form
7573B3364O4241J24218O0991r7758j78269N7135O2557m6108j2798J5114j4264
7562E8423n1071J2902L4798L9010J2962Q1428P9808n6241j56315K5340j3315o8933
7550a204K1061p6882o8820M729O1744J17888L5756J8154p8876p8046Q058J58604
7538A22166m7250j00270O9544j9701p1494l4186m1106n7814L92J1738O3925M2227
7526f1829k1371K0945j14979p5109J11349K0675k3676r5417O0838J84624L8878
7515D4928j33O9512M5105q9005j09040p6579P6694Q9680p0042l0506j13214L3970
7503a28630J33325J3553q1212p8097n315N5082N8135o7765m0281J26871P9353
7492F5019n7106o8065l5902m5859N2134q2337p7342O3665m714q3213K4776M3647
$$ plain form
7480 -205297 -144667 -100533 -36129 -75315 -120789 -134983 -100897 -21015 11569 -955 -32284 -79298
7468 -79298 -53447 -80165 8411 -12005 -164888 -248456 -248603 -131340 -155608 -72807 -3708 13573
7456 13573 18311 -9791 -75884 -99397 -217784 -173950 -34514 7338 -45361 -77265 -1728 89866
7444 89866 59324 78449 108103 -4215 -88224 -246521 -325864 -271429 -159938 -182193 -139766
7433 -139766 -76187 46532 23140 -35821 46055 57151 -33549 -48577 -46409 -83820 -40759 -6814
7421 -6814 60655 29321 20238 79375 132602 2135 -62174 -84393 -6872 48079 127776 102108
7409 102108 -53493 27795 80453 107139 127825 180139 216082 218253 120785 42192 45316 56383
7397 56383 -26537 -29363 -53980 -67771 -32568 -56362 5264 84512 147766 99325 18416 -63935
$$ packed form
7480b05297O0630M4134O4404l9186m5474j4194L4086P9882L2584j2524l1329m7014
7468g9298K5851k6718Q8576k0416j52883q3568j47J17263k4268Q2801O9099J7281
7456A3573M738k8102o6093k3513j18387M3834J39436M1852n2699l1904P5537R1594
7444H9866l0542J9125K9654j12318q4009j58297p9343N4435J11491k2255M2427
7433a39766O3579J22719k3392n8961Q1876J1096r0700j5028K168l7411M3061L3945
7421f814O7469l1334r083N9137N3227j30467o4309k2219P7521N4951P9697k5668
7409A02108j55601Q1288N2658K6686K0686N2314L5943K171r7468p8593L124J1067
7397E6383q2920k826k4617j3791L5203k3794O1626P9248O3254m8441q0909q2351
$$ plain form
7385 -63935 -11335 30905 -15249 -9946 -15784 3651 -4388 -20935 -79436 -93761 -116504 -65138
7373 -65138 -6703 -133346 -198824 -108840 -90073 -11953 124699 75353 12561 45232 33856
7362 33856 -63017 -36861 -94949 -92710 21135 -32581 -123493 -91035 -261976 -306197 -147257
7351 -147257 -62697 -17943 -5122 -108134 -173160 -179439 -204182 -207226 -308742 -302746 -266148 -169022
7339 -169022 -76441 -155838 -318006 -383357 -211564 31701 157330 70961 25477 49561 112777
7328 112777 -690 -109079 -55045 -74577 -44956 -82299 15842 -12649 -124950 -71060 92834
7317 92834 57256 -33213 -48764 -47720 -145123 -184594 -115916 37037 12448 21571 -107805 -110875
7305 -110875 -137045 -136708 -54265 51210 32286 24011 -157255 -184314 -166620 -80681 33654 21083
$$ packed form
7385f3935N2600M2240m6154N303n838J9435q039j6547n8501j4325k2743N1366
7373f5138N8435j26643o5478Q9984J8767P8120J36652m9346o2792L2671j1376
7362C3856r6873K6156n8088K239J13845n3716r0912L2458j70941m4221J58940
7351a47257Q4560M4754J2821j03012o5026o279k4743l044j01516N996L6598R7126
7339a69022R2581p9397j62168o5351J71793K43265J25629q6369m5484K4084O3216
7328A12777j13467j08389N4034j9532K9621l7343R8141k8491j12301N3890J63894
7317I2834l5578r0469j5551J044r7403l9471O8678J52953k4589R123j29376l070
7305a10875k6170L37Q2443J05475j8924q275j81266k7059J7694Q5939J14335j2571
$$ plain form
7293 21083 -65934 -48684 25642 -67463 -21219 51116 -28639 -66435 -34629 -116468 -9160 93478
7281 93478 64114 97246 68318 -34050 -86590 -48711 -89034 -155137 -14109 111763 119741
7270 119741 106173 -83695 -95933 -38058 -24369 70624 95132 133727 135986 48266 18104 57920
7258 57920 36565 -100522 -167302 -198302 -284241 -381204 -435770 -327400 -184070 -59979 -29085
7247 -29085 -110362 -205504 -135520 -64799 -45727 45456 108323 6488 -63531 -98976 -102320 -82887
7235 -82887 -28332 130885 198500 125133 118363 92981 80068 84695 117685 128796 77939 -15243
7223 -15243 -124777 -163669 -98442 -92200 -37945 -101107 -86366 -62693 -70429 -114888 -166631 -69183
7211 -69183 84372 53600 -19167 -110349 -41892 -114864 -149699 -158142 -134579 -41458 41662 -43554
$$ packed form
7293B1083q7017J7250P4326r3105M6244P2335p9755l7796L1806q1839J07308J02638
7281I3478k9364L3132k8928j02368n2540L7879m0323o6103J41028J25872P978
7270A19741j3568j89868j2238N7875J3689R4993K4508L8595K259q7720l0162L9816
7258E7920k1355j37087o6780l1000q5939r6963n4566J08370J43330J24091L0894
7247b9085q1277r5142O9984P0721J9072R1183O2867j01835p0019l5445l344J9433
7235h2887N4555J59217O7615p3367o770k5382j2913M627L2990J1111n0857r3182
7223a5243j09534l8892O5227O242N4255o3162J4741K3673p736m4459n1743R7448
7211f9183J53555l0772p2767r1182O8457p2972l4835q443K3563R3121Q3120q5216
$$ plain form
7199 -43554 -68244 -43351 9638 171034 130708 60526 -23488 17219 8369 122539 103029 -30468
$$ packed form
7199d3554k4690K4893N2989J61396m0326p0182q4014M0707q850J14170j9510j33497
$$ [...]
##END NTUPLES=NMR SPECTRUM
##END=
