##TITLE=Analysis number 324646
Compound Code cc 17507
Project Code adrs
Chemist Name fudan
##JCAMPDX= 6.0         $$ Bruker NMR JCAMP-DX V2.0
##DATA TYPE= NMR SPECTRUM
##DATA CLASS= NTUPLES
##ORIGIN= Bruker BioSpin GmbH
##OWNER= nmr
$$ XWIN-NMR		Version 3.5
$$ Tue Nov 28 14:08:35 2006 GMT Standard Time (UT+0h)  MAYBRIDGE\nmr@NMR_250MHZ
##.OBSERVE FREQUENCY= 250.131544655141
##.OBSERVE NUCLEUS= ^1H
##.ACQUISITION MODE= SIMULTANEOUS (DQD)
##.ACQUISITION SCHEME= undefined
##.AVERAGES= 16
##.DIGITISER RES= 18
##SPECTROMETER/DATA SYSTEM= dpx250
##.PULSE SEQUENCE= zg30
##.SOLVENT NAME= CDCl3
##.SHIFT REFERENCE= (INTERNAL, CDCl3, 0, 16.4536)
##AUDIT TRAIL= $$ (NUMBER, WHEN, WHO, WHERE, WHAT)
$$ ##TITLE= Audit trail, XWIN-NMR		Version 3.5
$$ ##JCAMPDX= 5.01
$$ ##ORIGIN= Bruker BioSpin GmbH
$$ ##OWNER= nmr
$$ C:\u/data/dgb/nmr/ADRS/1360/pdata/1/auditp.txt
$$ ##AUDIT TRAIL=  $$ (NUMBER, WHEN, WHO, WHERE, WHAT)
(   1,<2006-11-28 14:08:09.70 +000>,<MAYBRIDGE\nmr>,<NMR_250MHZ>,
      <created by zg, POWCHK disabled, PULCHK disabled
       configuration hash MD5:
       49 4B E0 1D 92 C2 6B 37 9F E6 65 BC 52 41 86 1D
       data hash MD5: 64K
       61 14 E8 B4 7C BB 64 49 4A CD DC B2 48 4C D2 3E>)
(   2,<2006-11-28 14:08:26.22 +000>,<MAYBRIDGE\nmr>,<NMR_250MHZ>,
      <Start of raw data processing
       ef LB = 0.3 FT_mod = 6 PKNL = 1 SI = 32K 
       data hash MD5: 32K
       AD 51 F6 0C 7C B1 7D C8 A8 43 55 EF 61 71 A6 6E>)
(   3,<2006-11-28 14:08:27.84 +000>,<MAYBRIDGE\nmr>,<NMR_250MHZ>,
      <apk 
       data hash MD5: 32K
       3A 31 5C 58 06 CD 62 32 7A E4 7A 0E C1 5A A0 1D>)
(   4,<2006-11-28 14:08:28.59 +000>,<MAYBRIDGE\nmr>,<NMR_250MHZ>,
      <abs ABSG = 5 
       data hash MD5: 32K
       07 86 9D B1 0A 6B 7F DE EB 38 FA E0 E2 9C 9F BF>)
$$ ##END=
$$ 
$$ hash MD5
$$ FA 5D 7D 4C 15 EE 49 1B E3 F4 E2 28 A8 4F B3 26
##$RELAX= 
##$RELAX= 
##$RELAX= 
##$RELAX= 
##$RELAX= 
##$RELAX= 
##$RELAX= 
$$ Bruker specific parameters
$$ --------------------------
##$DU= <C:\u>
##$EXPNO= 1360
##$NAME= <ADRS>
##$PROCNO= 1
##$TYPE= <nmr>
##$USER= <dgb>
##$AMP= (0..31)
100 100 100 100 100 100 100 100 100 100 100 100 100 100 100 100 100 100 
100 100 100 100 100 100 100 100 100 100 100 100 100 100 
##$AQSEQ= 0
##$AQ_mod= 3
##$AUNM= <au_zg>
##$AUTOPOS= <46 >
##$BF1= 250.13
##$BF2= 250.13
##$BF3= 250.13
##$BF4= 250.13
##$BF5= 500.13
##$BF6= 500.13
##$BF7= 500.13
##$BF8= 500.13
##$BYTORDA= 1
##$CFDGTYP= 0
##$CFRGTYP= 5
##$CHEMSTR= <none>
##$CNST= (0..31)
1 1 145 1 1 1 1 1 1 1 1 1 1 1 1 1 1 1 1 1 1 1 1 1 1 1 1 1 1 1 1 1 
##$CPDPRG= <>
##$CPDPRG1= <>
##$CPDPRG2= <>
##$CPDPRG3= <>
##$CPDPRG4= <mlev>
##$CPDPRG5= <mlev>
##$CPDPRG6= <mlev>
##$CPDPRG7= <mlev>
##$CPDPRG8= <mlev>
##$CPDPRGB= <>
##$CPDPRGT= <>
##$D= (0..31)
0 1 0 0 0 0 0 0 0 0.06 0 0 0 0 0 0 0.0002 0 0 0 0 0 0 0 0 0 0 0 0 0 0 
0 
##$DATE= 1164722888
##$DBL= (0..7)
120 120 120 120 120 120 120 120 
##$DBP= (0..7)
150 150 150 150 150 150 150 150 
##$DBP07= 0
##$DBPNAM0= <>
##$DBPNAM1= <>
##$DBPNAM2= <>
$$ [...]
##$SUBNAM7= <"">
##$SUBNAM8= <"">
##$SUBNAM9= <"">
##$SW= 20.6930455092707
##$SWIBOX= (0..15)
0 0 3 0 0 0 0 0 0 0 0 0 0 0 0 0 
##$SW_h= 5175.983436853
##$TD= 65536
##$TD0= 1
##$TE= 294.16
##$TE2= 300
##$TE3= 300
##$TEG= 300
##$TL= (0..7)
0 120 120 120 120 120 120 120 
##$TP= (0..7)
150 150 150 150 150 150 150 150 
##$TP07= 0
##$TPNAME0= <>
##$TPNAME1= <>
##$TPNAME2= <>
##$TPNAME3= <>
##$TPNAME4= <>
##$TPNAME5= <>
##$TPNAME6= <>
##$TPNAME7= <>
##$TPOAL= (0..7)
0.5 0.5 0.5 0.5 0.5 0.5 0.5 0.5 
##$TPOFFS= (0..7)
0 0 0 0 0 0 0 0 
##$TUNHIN= 0
##$TUNHOUT= 0
##$TUNXOUT= 0
##$USERA1= <user>
##$USERA2= <user>
##$USERA3= <user>
##$USERA4= <user>
##$USERA5= <user>
##$V9= 5
##$VALIST= <valist>
##$VCLIST= <CCCCCCCCCCCCCCC>
##$VD= 0
##$VDLIST= <DDDDDDDDDDDDDDD>
##$VPLIST= <PPPPPPPPPPPPPPP>
##$VTLIST= <TTTTTTTTTTTTTTT>
##$WBST= 1024
##$WBSW= 4
##$XGAIN= (0..3)
0 0 0 0 
##$XL= 0
##$YL= 0
##$YMAX_a= 324019
##$YMIN_a= -341352
##$ZGOPTNS= <>
##$ZL1= 120
##$ZL2= 120
##$ZL3= 120
##$ZL4= 120
##$ABSF1= 16.45359
##$ABSF2= -4.239582
##$ABSG= 5
##$ABSL= 3
##$ALPHA= 0
##$AQORDER= 0
##$ASSFAC= 0
##$ASSFACI= 0
##$ASSFACX= 0
##$ASSWID= 0
##$AUNMP= <proc_1d>
##$AZFE= 0.1
##$AZFW= 0.1
##$BCFW= 0
##$BC_mod= 0
##$BYTORDP= 0
##$COROFFS= 0
##$CY= 12.5
##$DATMOD= 1
##$DC= 0
##$DFILT= <>
##$DTYPP= 0
##$F1P= 14.0000005364418
##$F2P= -0.99999901652339
##$FCOR= 0.5
##$FTSIZE= 32768
##$FT_mod= 6
##$GAMMA= 0
##$GB= 0
##$INTBC= 1
##$INTSCL= 1
##$ISEN= 128
##$LB= 0.3
##$LEV0= 0
##$LPBIN= 0
##$MAXI= 10000
##$MC2= 0
##$MEAN= 0
##$ME_mod= 0
##$MI= 0
##$NCOEF= 0
##$NC_proc= -5
##$NLEV= 6
##$NOISF1= 0
##$NOISF2= 0
##$NSP= 0
##$NTH_PI= 0
##$NZP= 0
##$OFFSET= 16.45359
##$PC= 1
##$PHC0= 220.703
##$PHC1= 8.983393
##$PH_mod= 1
##$PKNL= yes
##$PPARMOD= 0
##$PSCAL= 4
##$PSIGN= 0
##$REVERSE= no
##$SF= 250.130017109227
##$SI= 32768
##$SIGF1= 0
##$SIGF2= 0
##$SINO= 400
##$SIOLD= 32768
##$SREGLST= <1H.CDCl3>
##$SSB= 0
##$STSI= 32768
##$STSR= 0
##$SW_p= 5175.98343685301
##$SYMM= 0
##$S_DEV= 0
##$TDeff= 65536
##$TDoff= 0
##$TI= <Analysis number 999999
Compound Code 99
Book Reference 9
Project Code 9>
##$TILT= no
##$TM1= 0
##$TM2= 0
##$TOPLEV= 0
##$USERP1= <user>
##$USERP2= <user>
##$USERP3= <user>
##$USERP4= <user>
##$USERP5= <user>
##$WDW= 1
##$XDIM= 32768
##$YMAX_p= 386703970
##$YMIN_p= -453258
$$ End of Bruker specific parameters
$$ ---------------------------------
##NTUPLES= NMR SPECTRUM
##VAR_NAME=  FREQUENCY,     SPECTRUM/REAL,   SPECTRUM/IMAG
##SYMBOL=    X,             R,               I
##VAR_TYPE=  INDEPENDENT,   DEPENDENT,       DEPENDENT
##VAR_FORM=  AFFN,          ASDF,            ASDF
##VAR_DIM=   32768,         32768,           32768
##UNITS=     HZ,            ARBITRARY UNITS, ARBITRARY UNITS
##FACTOR=    0.157963299565203, 1,           1
##FIRST=     4115.53684652591, 0,            0
##LAST=      -1060.4465903271, 0,            0
##MIN=       -1060.4465903271, -453258,      0
##MAX=       4115.53684652591, 386703970,    0
$$ Real data points
##PAGE= N=1
##DATA TABLE= (X++(R..R)), XYDATA
$$ [...]
17994D3380N5950J85598M2960q8694j57685L1035N6947j14922p4368L998O5384
17983D9583Q2298M4430m8654M4385l5859j11377L564R3908J64953M0169l2935
17972B94465j9759p2720p9188r6160n1254J12810r1247l0399R3480k7410K0143
17961E2761k9276j4977Q0628o1545j08497P4361L1261L3739J23503J01529J4632
17950B98119J14722n5684j44578j0442j0741j0433j0850k8688n5084j0674L1623
17939A07290L9912l1605l8523l397o9525J9489J09416n5040j947q3375l0281J666
17927c5920p909J0502P9485N8713M6890j07508m5879r373K4874J1634q8791J7230
17915d6052l7548m1946J68855P7120m698j0878J0652l8186Q1690J35187Q1181
$$ plain form
17994 43380 99330 284928 327888 239194 81509 112544 169491 54569 -19799 -15801 49583
17983 49583 131881 176311 127657 172042 136183 24806 28370 122278 287231 327400 294465
17972 294465 274706 201986 122798 26638 -24616 88194 -3053 -33452 60028 32618 52761
17961 52761 23485 8508 89136 27591 -80906 -6545 24716 58455 181958 283487 298119
17950 298119 412841 357157 212579 202137 191396 180963 170113 141425 86341 75667 107290
17939 107290 147202 115597 77074 73677 4152 23641 133057 78017 76070 -7305 -37586 -35920
17927 -35920 -43829 -33327 46158 104871 151761 44253 -1626 -10999 13875 25509 -63282 -46052
17915 -46052 -83600 -125546 43309 120429 115731 104853 115505 77319 159009 294196 375377
17904C75377R2155j1665j03351p4231L7746J2693L5011n157p0749j6375L6785
17893C08239Q1556J94332M8988k14437k22737m4426p593k7070Q3861L3587k9071
17882B05229j10229k0765J2831m9861j17466J4296o4733Q9865K04307l7129L0199
17871A56544l7842j33484o8965J686Q3111R4312M0136o0493p2389k5981N3485
17860C0120L0624k6125J6928M481J6150J4144q679L6056o105j00665k0723J9627
17848E833J5883k2257m3252j37698J3282J4015O700P132K9207J19457P1249l6686
17836D2865j1728j4657r3243j67554R592k7193L5227R3720J31261J00762Q5164
17825A84216j31804j16496j22361l0708L2702n9056Q7730R8950N2987J6565j43702
$$ plain form
17904 375377 467532 455867 352516 278285 316031 328724 363735 358578 287829 271454 308239
17893 308239 389795 584127 633115 418678 195941 151515 143922 116852 200713 234300 205229
17882 205229 95000 74235 87066 37205 -80261 -65965 -130698 -40833 163474 126345 156544
17871 156544 118702 -14782 -83747 -82061 1050 95362 135498 75005 2616 -23365 30120
17860 30120 60744 34619 51547 56028 72178 86322 77643 113699 107594 6929 -13794 5833
17848 5833 21716 -541 -43793 -181491 -168209 -154194 -147494 -140362 -111155 8302 79551 42865
17836 42865 31137 16480 -76763 -244317 -234725 -261918 -226691 -132971 -1710 99052 184216
17825 184216 52412 -64084 -186445 -217153 -184451 -243507 -155777 -56827 -3840 12725 -130977
17814a30977o0488Q1482K56111K5337k5131j33358j56551N7838J28167O657j08618
17803e9531o1714J380K2552K2170N7397J4469m4240L5716m9595l6526J33790J15343
17791A51211J15025l6454j06895j26696N8089J60759k870J587l7907K5553J3152
17780B14554N657J3837J5169K9664k2304j47638j24240L9940J36699l2709L9891
17769A68520n1904k3582Q8995N1632K3075L6978o4665L5149l9101k6353P260r0353
17757A15651p2315N8180j9019R1901L2609o085m5961L9515J10142L0774k0762
17746C14630m679M0659P4618m6270j94418n6173O6301j1159l8720j27303m0744
17735b3258O6248J9489J187j31810p7620N5006P8967n7077r518O6579j07550m3313
$$ plain form
17814 -130977 -191465 -109983 146128 171465 146334 12976 -143575 -85737 42430 49087 -59531
17803 -59531 -121245 -119865 -97313 -75143 -17746 -3277 -47517 -11801 -61396 -97922 35868 151211
17791 151211 266236 229782 122887 -3809 54280 215039 212169 213756 175849 201402 214554
17780 214554 220211 234048 249217 278881 256577 108939 -15301 24639 161338 128629 168520
17769 168520 116616 93034 182029 233661 256736 293714 229049 264198 225097 198744 206004 115651
17757 115651 43336 101516 82497 174398 207007 200922 154961 194476 304618 335392 314630
17746 314630 309951 350610 425228 378958 184540 128367 194668 183509 144789 17486 -23258
17735 -23258 42990 62479 63666 -68144 -145764 -90758 -11791 -68868 -78386 -11807 -119357 -162670
17723a62670N7560J01065M3580j0464R97r6285J01867N8588R533p9842N5554N097
17711H4580L626J22482L7871N600J00359J65088j0981J13386j7004j59190j16736
17700C29081j66025r1539J00867J26699P8947K8273o0717o274r500N3584o9733
17689C13663n626N9575r328O8821m0771r1446j26994j17319L1029J59298M9269
17678B90171k3211l6475K5302r3202p8516K579o2753k9359K05303J99186J20276
17667E19301J18368j7350p1784L821J95639J46446q8650m3778r53O721M1819r3483
17655G16117q8748q7831m6096j38010k02287r4496r612J8778p5403p7598N7796
17644b7390k0374n1389J4051O4167M4304L202n1968M2962P4313Q9894j5678j09950
$$ plain form
17723 -162670 -105110 -4045 39535 29071 30068 -66217 35650 94238 103771 23929 79483 84580
17711 84580 88206 210688 248559 254159 354518 519606 508625 622011 605007 445817 329081
17700 329081 163056 71517 172384 299083 378030 406303 345586 339312 329812 383396 313663
17689 313663 308037 367612 358284 427105 386334 294888 167894 50575 81604 240902 290171
17678 290171 266960 230485 255787 162585 84069 86648 23895 -5464 199839 399025 519301
17667 519301 637669 620319 548535 552356 747995 894441 805791 762013 761060 767781 809600 716117
17655 716117 627369 539538 493442 355432 153145 58649 49037 67815 -7588 -85186 -27390
17644 -27390 -47764 -99153 -85102 -20935 23369 26571 -25397 17565 91878 181772 166094 56144
17632E6144j83523o6029M9303J02041R8966r658j01025L5057Q1104r750p4114
17621b1484J558l706p2257m757p9836m7605J7370M3230J10887k5173m2893j14207
17609b38873M2475K22615L8213j13413P2814j1867m5306N06q6015j68669M4208
17598b43312J47991Q8794J09585p8591k2691j037r9670j47989M4425R5150M6474
17587f0871o0760p928k350n1521N3342K4131o623R2944l0698n5348J6927p943
17575i6698P8320J08715Q947P2018K0277o4815J10544L1504l1867p3678o4420
17564I8847P5314J28686N386k5400J5873j07415o8593j6959J47500J08992K6806
17553C89037N6144O1756M1571Q8086J35938P0273j08840j24309r6216p0912j67961
$$ plain form
17632 56144 -127379 -193408 -144105 -42064 56902 47244 -53781 -18724 62380 52630 -21484
17621 -21484 -19926 -23632 -95889 -100646 -180482 -228087 -210717 -167487 -56600 -81773 -124666 -238873
17609 -238873 -196398 26217 64430 -48983 23831 11964 -33342 -32836 -118851 -287520 -243312
17598 -243312 -95321 -6527 103058 24467 1776 739 -98931 -246920 -202495 -107345 -60871
17587 -60871 -121631 -129559 -131909 -183430 -130088 -105957 -112580 -19636 -50334 -105682 -88755 -96698
17575 -96698 -18378 90337 99284 171302 191579 126764 237308 268812 236945 163267 98847
17564 98847 174161 302847 308233 282833 298706 191291 122698 105739 253239 362231 389037
17553 389037 445181 506937 548508 636594 772532 842805 733965 609656 513440 442528 274567
17542B74567j51825j13042j6596J36167N2689q8134J7383M1333q2153j27581N9813
17531B621j18536m1880K4382n6725M6988M9486k600k2376O1056m127m6479R5053
17519a3137K8118P2352M422M854r859j18325l0503R521J62538O5935o2741l3850
17507G9325j5816M4402j0902k04966N0893Q2341N7334K20695J77822J4191n1812
17496D43507Q1586M048Q0473m9756p0851j1631j3710o4564k2212j06075m9661
17485B21154Q266r4114j548p4971o8790p4519j7512R0640J19048j01961m6460
17474d0767r559K275k6346Q9337O9121N030p2516k9480J8888L9343P868P7662
17462A30856J13870J33711M3464p0036j13735l5456k6027R4894K0970J86396P1326
$$ plain form
17542 274567 122742 9700 -6896 129271 181960 93826 111209 152542 70389 -57192 2621
17531 2621 -115915 -157795 -133413 -190138 -143150 -93664 -96264 -118640 -57584 -61711 -108190 -13137
17519 -13137 14981 87333 91755 96609 86750 -31575 -62078 -52557 109981 175916 113175 79325
17507 79325 63509 107911 97009 -107957 -57064 25277 82611 303306 481128 495319 443507
17496 443507 525093 529141 609614 559858 489007 477376 463666 399102 376890 270815 221154
17485 221154 229420 135306 133758 58787 -10003 -84522 -102034 -11394 107654 5693 -40767
17474 -40767 -50326 -48051 -74397 14940 84061 89091 16575 -12905 5983 45326 53194 130856
17462 130856 244726 378437 421901 351865 238130 202674 176647 271541 292511 478907 550233
17451E50233j15702j70793m0749J98400J95585J89066Q6916J08704K99215K63338
17441A564213J87075k50581m95880l83882j72104r4437j40435l9781j8903R616
17431A64901L1509n1210R2465P9103Q3655N0745j44503k24291L696N2772j2423
17420A26419p6091m0850L4451l8312j3252m2806M1869N4766O1003O915R610r6019
17408B7703M7534J08989m372p7026n2105m6687K0098M4801J13613k005q04J23970
17396C03709J592j39595j59949l1306J20822J8035m3965K2736J52574J16339j14432
17385B46560M2035J6707P0291N117n7387m8081L340m7453m6851n7750o4096J24523
17373A86955n8323k07111M0225Q2203l5041l0625L7586P7802j57942J908J62233
$$ plain form
17451 550233 434531 263738 222989 421389 616974 806040 892956 1001660 1300875 1564213
17441 1564213 1751288 1500707 1004827 620945 448841 354404 213969 174188 155285 164901
17431 164901 196410 145200 237665 316768 400423 451168 306665 82374 86070 138842 126419
17420 126419 50328 9478 43929 5617 -7635 -50441 -8572 46194 107197 114112 123722 27703
17408 27703 75237 184226 179854 102828 50723 4036 24134 68935 182548 180543 179739 303709
17396 303709 305301 165706 5757 -25549 95273 113308 69343 92079 244653 360992 246560
17385 246560 288595 305302 375593 380710 323323 275242 278582 231129 184278 126528 62432 186955
17373 186955 128632 -78479 -38254 43949 8908 -21717 15869 93671 -64271 -62363 99870
17362I9870P0476l4197q0424m2561K5348J9425O797j2975M0726j0548R1762J9995
17350A93694l8074q6117o9496j595o377J20173J75955q1512j05682R908q1086
17339B9791q2509J2838l6949N9925j04076J0668Q3050L2113n8242M2078j2996
17328b4309K8031j34012n2702K6080J51280j9057k4109M200k1725M6675N2711
17317C3063P0375m9456o1154L9342R9642m9956r8863j05877L150J13814k5002
17306c0922p5256J4114p3453M6677n1788J25313K726J20729K05140n7636q4339
17295A41305q1450J03793K2671M770l6071J13077r3249O156l5526L2420O7749
17284B45645k7347j20891j54230k8112j11021P3997J15610L6321p8714L095J16449
$$ plain form
17362 99870 170346 136149 55725 13164 38512 57937 64734 51759 92485 81937 173699 193694
17350 193694 155620 69503 7 -1588 -7965 112208 288163 206651 100969 110877 29791
17339 29791 -52718 -39880 -76829 -16904 -120980 -110312 -27262 4851 -53391 -11313 -24309
17328 -24309 3722 -130290 -182992 -156912 -5632 -24689 -48798 -44598 -66323 -19648 33063
17317 33063 103438 53982 -7172 32170 131812 81856 -17007 -122884 -119734 -5920 -30922
17306 -30922 -106178 -92064 -165517 -118840 -170628 -45315 -42589 78140 283280 225644 141305
17295 141305 59855 163648 186319 191089 155018 268095 174846 181002 145476 177896 245645
17284 245645 218298 97407 -56823 -84935 -195956 -121959 -6349 29972 -48742 -45647 70802
17273G0802j19090j18796R6580O8524L3169J1123j3102L734j45930j3769Q2928
17262d3827K1193K1073J1465j03643l8311j06050q8254K14898J50473Q8893p0816
17251E7094p7429P4287N3856n8561m5951K6956j1835L7453K0329k4873n3332o1904
17239f3910j2571K456K5768n2715j15926O1520R4019p4974K8187J15909J44132
17228A51895q6327r5994r2393P1509J93869J7109J22283J0436R2568N5127j61461
17217B78621o9029m0925j6360k7081Q4965l8855j8201j15565L4907J05595L0362
17206B08434k2320q2091J3431Q4820M9285q3887k1043m170M8362k3731o8915j620
17194I6555L6546r581n781L0903l8769J6502K2491J8010j0883k8614J3556K8156
$$ plain form
17273 70802 -48288 -167084 -70504 -1980 31189 42312 29210 32944 -112986 -126755 -43827
17262 -43827 -22634 -1561 9904 -93739 -132050 -238100 -326354 -111456 39017 127910 57094
17251 57094 -20335 53952 107808 49247 3296 30252 18417 55870 76199 51326 -2006 -63910
17239 -63910 -76481 -74025 -48257 -100972 -216898 -155378 -61359 -136333 -108146 7763 151895
17228 151895 65568 -30426 -122819 -51310 142559 159668 281951 292387 384955 440082 278621
17217 278621 209592 168667 152307 125226 210191 171336 153135 37570 72477 178072 208434
17206 208434 186114 104023 117454 202274 251559 167672 146629 142459 190821 167090 98175 96555
17194 96555 133101 123520 117739 148642 109873 126375 148866 166876 155993 127379 140935 169091
17182A69091l5308Q9263q8036r1994j16177n2980J9447Q8490R4267k3298P8690
17171A31455N1988p1977l2782o9686n2555o7089P3972J72007N7583p3190q2775
17160C6951L4956M9907J7088L1583J2799R9868J67702O4031m7049M5871J7511
17149E31218j08327j80866k6923n6652K0236N7238Q8338K3084j18852n7373J02531
17138B73652K9617L1927K5873L4098K3087j87057l7569J15549J13354M9978R09
17127D73418L3964n806r7478p0464n638O8998k6753l5156N6973j5759p2019j35785
17115A68495M3043R1440j4392J85444k0380k26873o4336J17306J38513M313L6328
17104D58901P2687O3797N7205J2665n9896l4573K9866K6693R9490N1104k534j24116
$$ plain form
17182 169091 133783 223046 135010 43016 -73161 -126141 -106694 -18204 76063 52765 131455
17171 131455 183443 111466 78684 8998 -43557 -110646 -36674 135333 192916 119726 36951
17160 36951 71907 121814 138902 170485 183284 283152 450854 514885 467836 513707 531218
17149 531218 422891 242025 215102 158450 178686 235924 324262 347346 228494 171121 273652
17138 273652 303269 335196 361069 395167 418254 231197 193628 309177 422531 472509 473418
17127 473418 507382 501576 404098 333634 327996 396994 370241 335085 392058 376299 304280 168495
17115 168495 211538 302978 288586 474030 453650 226777 162441 279747 418260 422573 458901
17104 458901 531588 595385 652590 665255 605359 570786 600652 627345 726835 777939 775405 651289
17092F51289l6238J2409K5468J61764K26355O8028L4228k3985m1270q013P2463
17081A142498J02664j25778k6379K2295J7815O6800K24825K33916K50927K0744
17071A930327K02566K15267K03046L51595N20335O24772N97347O63019N95071
17062E903345N25777P46965R23757J057293J065695J107151J307651J376278J428479
17053A5442391J591604J841107K057073K233106K573449L202850M158724N695747
17045C8796051P475673R627681J1482079J2789173J4665080J7285810J9430989
17038A31552536J7071777P035749n202689r890401p490458p122275j4265432k2777718
17030H8911089k4328671j9331847j3052260q421880n416169l707799k593010j880947
$$ plain form
17092 651289 615051 627460 652928 814692 1041047 1109075 1143303 1119318 1078048 1070035 1142498
17081 1142498 1245162 1119384 1093005 1115300 1133115 1199915 1424740 1658656 1909583 1930327
17071 1930327 2132893 2348160 2551206 2902801 3423136 4047908 4645255 5308274 5903345
17062 5903345 6429122 7176087 8099844 9157137 10222832 11329983 12637634 14013912 15442391
17053 15442391 17033995 18875102 20932175 23165281 25738730 28941580 33100304 38796051
17045 38796051 46271724 55899405 67381484 80170657 94835737 112121547 131552536
17038 131552536 148624313 155660062 150457373 140566972 133076514 125954239 111688807 88911089
17030 88911089 64582418 45250571 32198311 23776431 18360262 14652463 12059453 10178506
17022A0178506j406788j068994p27003m84964m09488k98416j36546j59632l4497
17013E452178K05449Q3173Q2054R2795K27725L14284L37481M12569M48453M18661
17003H074822N86293P29191Q43079R61901Q39711J070995J221289J396202J577918
16994A7301401J684310J885681K322651K595892L483587M539750N938446P969806
16986D7721524R770093J1262761J2607865J4424087J6704991J7111503J1565288
16979A41168112M26900q521407r399706o700987r151547j7405469k2935190k0817016
16971D6663690j4684315r110958n786129l972107k596389j615914j418509j135372
16963F343997q05063n62112o11951l54235k38861k34305k34395k20739k09959
$$ plain form
17022 10178506 8771718 7702724 6975721 6490757 6081269 5782853 5646307 5486675 5452178
17013 5452178 5657627 5740800 5822854 5915649 6143374 6457658 6795139 7207708 7656161 8074822
17003 8074822 8661115 9390306 10233385 11195286 12034997 13105992 14327281 15723483 17301401
16994 17301401 18985711 20871392 23194043 25789935 29273522 33813272 39751718 47721524
16986 47721524 57491617 68754378 81362243 95786330 112491321 129602824 141168112
16979 141168112 141595012 133073605 123673899 116972912 107821365 90415896 67480706 46663690
16971 46663690 31979375 22868417 17082288 13110181 10513792 8897878 7479369 6343997
16963 6343997 5538934 4976822 4364871 4010636 3771775 3537470 3303075 3082336 2872377
16954B872377p400j36886j63743j78462j69825r5485k07036k76065k31889q9768
16944A315818l9318n9886j25782j22690k47076o3295L048J7968K8911n566j08755
16933E93377l4401q0746o2964J02146k4108q5799p4458J46322J19084K7743k7198
16922E98998j38233r6274j7689M0265N1934m7885m282K8940r1217j0599N2347
16911C66305K3737o3900j33093j07922J00376O1143M5000p6158m4221K3526l4956
16900A59837n9902o6772q6785M4732J25979o972m4183j2849j1566k599n9564O3009
16888D2365Q9366k3721p135l1546N3092l5958K7065j392L5709k8128l6864P023
16876H9876l7956j41389O2023J28233J5532k9329p3906p0875L7434n9740J0206
$$ plain form
16954 2872377 2864977 2728091 2564348 2385886 2216061 2120576 1913540 1637475 1405586 1315818
16944 1315818 1276500 1216614 1090832 968142 721066 657771 660819 678787 707698 702132 593377
16933 593377 558976 478230 415266 517412 493304 407505 333047 479369 598453 626196 598998
16922 598998 460765 364491 346802 387067 439001 391116 386834 415774 324557 313958 366305
16911 366305 390042 326142 193049 85127 185503 246646 291646 215488 171267 194793 159837
16900 159837 99935 33163 -53622 -8890 117089 110117 65934 53085 41519 38920 -20644 42365
16888 42365 131731 108010 100875 69329 122421 86463 113528 112136 147845 119717 82853 89876
16876 89876 51920 -89469 -27446 100787 116319 86990 13084 -57791 -20357 -80097 -69891
16865f9891J01144k0274j09581j28665J08712J00264Q0689L5576j18465l2115
16855e2606O8930P9024m0103n8792p2359l4995l6670J5778M6978k2491J20851
16844A3545o6450R598m2854j5020O4277J93216j05900o3305J06686J13422q4435
16833A22780n1769j0520l0836j13855k5947J49572R7226L2331j69526J0033k8627
16822a9138q0870j7073l8473k1044o7045Q392J63988J63633Q5201o5191j6197
16811I6183L1594j12966m6759J8599r8249m1377M1215Q9741m9974k7386j06M805
16799i4680N8319O1453n8754P3302P3950j5720q2386n3077n4554O3330k5899R0389
16787C5673k8117j57843k6205J07705M6627J6990J10473M2431o3767q2374j09266
$$ plain form
16865 -69891 31253 10979 -98602 -227267 -118555 -18291 62398 97974 -20491 -52606
16855 -52606 16324 95348 55245 -3547 -75906 -110901 -147571 -131793 -84815 -107306 13545
16844 13545 -52905 -43307 -86161 -101181 -36904 156312 50412 -12893 93793 207215 122780
16833 122780 71011 60491 29655 -84200 -110147 39425 136651 168982 -544 9489 -19138
16822 -19138 -100008 -117081 -155554 -176598 -243643 -235251 -71263 92370 177571 112380 96183
16811 96183 127777 14811 -31948 -13349 -111598 -152975 -111760 -22019 -71993 -99379 -99485 -94680
16799 -94680 -36361 25092 -33662 39640 113590 97870 15484 -37593 -92147 -28817 -54716 35673
16787 35673 7556 -150287 -176492 -68787 -22160 -5170 105303 147734 83967 1593 -107673
16776a07673n0925k246P4815O4770J5004p196l45J11796L2845R3522o378n9307
16764A58682q1341q0361p0108K6202r0335J30711Q5509j30263j65448M008K9487
16753a83257N7426N8824K434n6529j915j20956m2664K9135R3628L9276J20751
16742c847Q9398q9237m9964K8123j43895O8794P4174Q1852j14877k7458j6853
16731a03790j4142k6636p680J44408L7944N3918l0150L164p6122q3379m6033K7605
16719a20893J5666k0673N6186l132r5933n1670l109O2038L6350N9591J71899l4803
16707G1517j61806j59378R1506R8784O9539p7607j08311K6654P1365J09275J163
16696C2701n441m816j7948R588N632J2126j3824L3695j1523r8895j5329n8006
$$ plain form
16776 -107673 -158598 -160844 -86029 -21259 -6255 -13451 -13796 98000 130845 224367 217989 158682
16764 158682 77341 -3020 -73128 -46926 -137261 -6550 78959 -51304 -216752 -212744 -183257
16753 -183257 -125831 -67007 -64573 -121102 -123017 -243973 -286637 -257502 -163874 -124598 -3847
16742 -3847 85551 -3686 -53650 -25527 -169422 -100628 -26454 55398 -59479 -86937 -103790
16731 -103790 -117932 -144568 -152248 -7840 30104 84022 53872 57036 -19086 -102465 -148498 -120893
16719 -120893 -105227 -125900 -69714 -72846 -168779 -220449 -223558 -161520 -125170 -65579 106320 71517
16707 71517 -90289 -249667 -158161 -59377 10162 -67445 -175756 -149102 -77737 31538 32701
16696 32701 27260 22444 4496 14084 19716 31842 18018 51713 40190 -58705 -74034 -132040
16684a32040o3128o1045N5684o0620n0457M8143J41999M6085J7098N9075p085
16673f291l5451j3764j05457k5226O1792l0799l981N7163k4147L233J47278l420
16661B0930M7576r7787p4114r3466k1256l3266j2871J00413J21531O0367k1540
16650c483m5006q2510M7165k0482J13969K41748L4995j24945j69209j33932L6926
16639a04764P5696m9332j11203r521n609N4593J8724j3028q5151J6118P2015Q1961
16627e9501J3373K3186r703n0725R1456k51m2088J3770m3484j18472j8508j1675
16615b12622P0177N3870J41215J29731j46857j30820j53000m8417L6525K7975
16605b32223J72766J2302J05404L6912n0185r9614j37788k2241K1800P99k591
$$ plain form
16684 -132040 -195168 -256213 -200529 -261149 -311606 -263463 -121464 -75379 -58281 794 -6291
16673 -6291 -41742 -55506 -160963 -186189 -124397 -155196 -159177 -102014 -126161 -122928 24350 20930
16661 20930 68506 -29281 -103395 -196861 -218117 -251383 -264254 -163841 -42310 18057 -3483
16650 -3483 -48489 -130999 -83834 -104316 9653 251401 286396 161451 -7758 -141690 -104764
16639 -104764 -29068 -78400 -189603 -199124 -204733 -150140 -131416 -144444 -229595 -213477 -141462 -59501
16627 -59501 -46128 -22942 -32645 -83370 8086 7835 -34253 -20483 -63967 -182439 -200947 -212622
16615 -212622 -142445 -88575 52640 182371 35514 -95306 -248306 -296723 -260198 -232223
16605 -232223 -59457 -47155 58249 95161 44976 -54638 -192426 -214667 -192867 -192068 -194659
16594a94659O3090O1723m4660q4905J7785q9853j7153P6466R4494l039o9514l5822
16582b26047k9630K6460m893k6917P51J7807q0979m0437J32422J50088J77320
16571I5945n9676l0774k9550O1095m8660L3283J9562q5565r2280j30704k3998
16560b91322J44098j5127J126l0964M8891R3907q2913n3522J11202K6175J04703
16549E6254M7792j88800m899Q950p9136r1396p4689Q0436J91025J67688j7997
16538I5228P886j4531j01726j25619Q3614R8020Q2440R5880l7213l8255O016J65640
16526C17380J9031p4897r65P9956K61435J90319P7392J85J4786j59135j06383
16515F19104j7972J5775K2231j93794j82641r3595r8123j58012k563J9908m6188
$$ plain form
16594 -194659 -131569 -69846 -114506 -199411 -181626 -271479 -288632 -212166 -117672 -120711 -190225 -226047
16582 -226047 -255677 -229217 -234110 -261027 -260276 -242469 -323448 -363885 -231463 -81375 95945
16571 95945 36269 5495 -24055 37040 -11620 21663 41225 -44340 -136620 -267324 -291322
16560 -291322 -147224 -162351 -161225 -192189 -143298 -49391 -132304 -185826 -74624 -48449 56254
16549 56254 104046 -84754 -89653 -80703 -159839 -251235 -325924 -245488 -54463 113225 95228
16538 95228 103114 88583 -13143 -138762 -55148 42872 125312 221192 183979 145724 151740 317380
16526 317380 336411 261514 260549 340505 601940 792259 869651 869836 884622 725487 619104
16515 619104 601132 616907 639138 445344 262703 169108 70985 -87027 -89590 -69682 -115870
16504a15870l0456l4766j70421j4694J37943Q2296O4345m7797O4411N7734o5930
16493g3205o1310J09684K6942l2328K9579M8877j45060p4397K5402K640K8584
16482a14592n527j7614L4185R6661n926P4366q962J13110J9612j33614O7288P7804
16470A96791M6673j0718j33626N9365K25469J48507l9937l3036j50449j6840L4692
16459C26891l2350J37246J6696r371j41075j85990p7550J06420j0578j14560o5293
16448d9514K928J11612Q6850j5303r2878L8559P1321p0247O595q0911l8776L6536
16436F772O3732N7927n4960j18551Q3697k6692j20918M6458r2055L2885N8074
16425f3631r1125L0732k2062r486N9572J5401j2797R728K8016n1481M6053o234
$$ plain form
16504 -115870 -146326 -181092 -351513 -366207 -228264 -145968 -81623 -129420 -65009 -7275 -73205
16493 -73205 -134515 -24831 2111 -30217 -638 48239 -96821 -171218 -145816 -143176 -114592
16482 -114592 -120119 -137733 -103548 -6887 -12813 61553 52591 165701 185313 51699 118987 196791
16470 196791 243464 232746 99120 158485 383954 532461 492524 459488 309039 292199 326891
16459 326891 294541 431787 448483 439112 298037 112047 34497 140917 130339 15779 -49514
16448 -49514 -46586 65026 151876 136573 43695 82254 153575 83328 89923 9012 -29764 6772
16436 6772 70504 128431 73471 -45080 38617 11925 -108993 -62535 -154590 -121705 -63631
16425 -63631 -154756 -124024 -146086 -155572 -96000 -80599 -93396 -83668 -55652 -107133 -61080 -67314
16413f7314M9679k0526o9088K1750Q8503M7624m2006k0329j19471Q6623M3344
16402a211l5526m8751j44246N6608J25316J46811J2445j07885j75417L1678O9475
16391g0703N1440K3742r9933o4133L4767l8583J84024J479P5881J4962r5911q8105
16379g1073n99N015q9110M0791P5051M5216r7J24025K9152r3081j07511j6528
16367e8749M852j09347L2619N9807O2737M3679K25r2353L327P939k9323r4425
16355a69012K7071J276m0854p6593J04611J26396J30984o0874m6842R5526k8765
16344F2924m5904R3104N0394r6471j52249p0936P4494R7854R7534P9798r3685
16333I6857R8369Q4593k4864j36938j68828J7444J1396K2852j17999k284J05432
$$ plain form
16413 -67314 -17635 -38161 -107249 -85499 3004 50628 8622 -11707 -131178 -44555 -1211
16402 -1211 -36737 -85488 -229734 -173126 -47810 99001 111446 3561 -171856 -140178 -70703
16391 -70703 -19263 4479 -95454 -159587 -124820 -163403 20621 22100 97981 112943 17032 -71073
16379 -71073 -71672 -66657 -155767 -114976 -39925 5291 5194 129219 158371 65290 -42221 -58749
16367 -58749 -53897 -163244 -130625 -70818 -8081 35598 35823 -56530 -53203 -45264 -74587 -169012
16355 -169012 -141941 -140665 -181519 -258112 -153501 -27105 103879 43005 -3837 91689 62924
16344 62924 17020 110124 160518 64047 -88202 -159138 -84644 13210 110744 190542 96857
16333 96857 195226 279819 254955 118017 -50811 -33367 -21971 881 -117118 -119402 -13970
16322a3970m6260O4456J8360k3262O3424L33r629l8890O1821J47652J26573P9822
16310D30430j7605j15567k8456j6810j24444M0656r0504q1169j1767k0124N3778
16299A8418Q0899L0535J4612j3247n6277M5031O18M1526Q280j17516j0757J0481
16287E2603O3751L3793m1512J7154J18058j13242j46551l1981m719j10420p8948
16276b42014J13159P4336M9456j7551J3918j02155j2941Q5137O6621N6703K499
16265H7168n166J00867p5399q267L5857J0749K8420j11833K1320J17189r280J35239
16253C26864K3269j48806n4289o7455Q2648J2031o2211l9251j7958M6006k8249
16242G2599l5859r4427j41019M1968J16330N5022j7671j17615n355J82082J01988
$$ plain form
16322 -13970 -60230 4226 22586 -676 62748 63081 53452 14562 76383 224035 350608 430430
16310 430430 412825 297258 268802 251992 127548 168204 77700 -3469 -15236 -35360 18418
16299 18418 99317 129852 144464 131217 74940 119971 120589 162115 170395 52879 42122 52603
16287 52603 116354 150147 108635 125789 243847 130605 -15946 -47927 -52646 -163066 -242014
16276 -242014 -128855 -54519 -5063 -22614 -8696 -110851 -123792 -38655 27966 84669 87168
16265 87168 82002 182869 107470 99203 135060 145809 174229 62396 83716 200905 191625 326864
16253 326864 350133 201327 147038 79583 162231 174262 112051 72800 54842 100848 72599
16242 72599 36740 -57687 -198706 -156738 -40408 14614 -3057 -120672 -126027 56055 158043
16231A58043k005l8961j14797k6799J4900l3255n8210l8028J03857p9092o3735
16220a78082j4430l3467R5985J07397N5341J8998j17253K5429k4932L0868J36622
16209A02476n5895p6605l0064k0411L7248L0214M121K5517j74337j80476n0050
16198c88262J0913P8103O0548m9842p4417m2988J67027J71990n1448r875j782
16187a30033p9728J9204J01109j25142R2758R548J16962J0952r9859J0015n541
16176g9755o6672j14358M6723J83891N8357j41442n1572J44533J27385q486l3409
16165F5195j7927r2464N0184J56334K2787p7219J4084N4305k1613q1405n5367
16154A6894r2828j33479n9817M9412N4008N0822m8681M0143J66082N013p9231
$$ plain form
16231 158043 156038 117077 2280 -24519 -9619 -42874 -101084 -139112 -35255 -114347 -178082
16220 -178082 -192512 -225979 -129994 -22597 32744 51742 -65511 -40082 -65014 -34146 102476
16209 102476 46581 -30024 -60088 -80499 -43251 -13037 -8916 16601 -157736 -338212 -388262
16198 -388262 -377349 -299246 -238698 -288540 -362957 -405945 -238918 -66928 -118376 -128251 -130033
16187 -130033 -209761 -190557 -89448 -214590 -121832 -112284 4678 15630 -84229 -74214 -79755
16176 -79755 -146427 -260785 -214062 -30171 28186 -113256 -164828 -20295 107090 98604 65195
16165 65195 47268 -45196 4988 161322 184109 106890 120974 175279 153666 72261 16894
16154 16894 -75934 -209413 -269230 -219818 -165810 -114988 -163669 -123526 42556 47569 -31662
16143c1662J3170N4384j1616j4185J46673J7199M8761r9933n8100j0177r7684
16132d3170p4701k3379J5538N4905M1928N5210n8357p0555N487Q1564Q0078K261
16120F6809O643J20837j12196j12240o1373m7725m7754r692Q0878J8494J46877
16109D9558J12116P782k12775q7601R7819J1970L9711l2019p2872N8173K4887
16098c251q6277j77949n0397J30299J76210M3137p6119J00926l7891p0152K3836
16087b7628K5520l9670r0050l3571j9713J10740M9944L0151k8993J3561N3542
16076D3833j44360m4504O4357P4048j365P8816m8850j13462n8344K1241P0414
16065e8176o0989p9246P9216J473N0188l1998m4030P814k1001j4271k866J46940
$$ plain form
16143 -31662 -18492 35892 24276 10091 156764 173963 222724 122791 64691 54514 -43170
16132 -43170 -117871 -141250 -125712 -70807 -28879 26331 -32026 -102581 -97094 -15530 64548 66809
16120 66809 73452 194289 82093 -30147 -91520 -139245 -186999 -196691 -115813 -97319 49558
16109 49558 161674 169456 -43319 -130920 -33101 -21131 18580 -13439 -86311 -28138 -3251
16098 -3251 -89528 -267477 -317874 -187575 -11365 31772 -44347 56579 18688 -51464 -27628
16087 -27628 -2108 -41778 -131828 -165399 -185112 -74372 -24428 5723 -23270 -9709 43833
16076 43833 -100527 -145031 -80674 -6626 -7991 70825 21975 -91487 -149831 -128590 -58176
16065 -58176 -119165 -198411 -119195 -117722 -67534 -99532 -143562 -135748 -156749 -171020 -173886 -26946
16053b6946Q3631K4180m9798J894J06415J36962j08254j63655j63850O7658J58034
16042F6271k1986j27602J3215o794M528q115P5738k5992o7043p6234r9460K1030
16030b52444J22948J06714q4588p3177n481l1445J61896K5080J1952j8424j55089
16019a92058K6343J02087M1028P271j0087O9792K2245P9895j64646k37549R51
16008b54728O7885J1255o467P3672k6335Q1844L4878k1582Q227o0526l5806p5847
15996b03530p4076n7567P1367O0978J7087j10627O6035J19846Q0596N5609m3116
15985a7398m3637M7846M6858O0234r4519J4660o7510O4375k3662o9302n4156l4695
15973a70906q6654J7308J9359r1570J24326J14044R950N7606M3359N1095n7342
$$ plain form
16053 -26946 56685 80865 31067 32961 139376 276338 168084 4429 -159421 -91763 66271
16042 66271 44285 -83317 -70102 -76896 -72368 -80483 -4745 -30737 -97780 -174014 -273474 -252444
16030 -252444 -129496 -22782 -107370 -180547 -186028 -217473 -55577 -30497 -18545 -36969 -192058
16019 -192058 -165715 -63628 -22600 -15329 -25416 44376 66621 146516 -18130 -255679 -254728
16008 -254728 -186843 -175588 -182055 -108383 -134718 -52874 -17996 -39578 -31351 -91877 -127683 -203530
15996 -203530 -277606 -335173 -263806 -202828 -185741 -296368 -230333 -110487 -29891 25718 -17398
15985 -17398 -61035 -13189 33669 93903 -616 14044 -53466 10909 -12753 -82055 -136211 -170906
15973 -170906 -257560 -240252 -220893 -312463 -188137 -74093 -64143 -6537 36822 87917 30575
15962C0575l6565r1613o2084Q6162J56899P9827N01q9750q0790p0072K0902K5225
15950c0783l2502k450r1544p9494l5126k7857K3944Q5947L47O076m730N0673p9821
15937b17320m5156R1498J21057n761o4064q615R6065J8447P9546o0645j45663
15926a40611k9909N8100J9674N0864O8288m461K3607j0951j1922p5995j7574K0700
15914e0190k7649n1647P2390k3294k1676P725K5054l7575K215p7309L5120P9770
15902f7066N7386L7971M039k6779j59301r4407J7434K3919J39312J02366j0194
15891B4680l3976Q1342K8185j02157m754P0401o0897k0950m7825J8098R1867n4275
15879a0261j584K3048n2742k0159J9977K0031J64661J51947k0066n2917r4952
$$ plain form
15962 30575 -5990 -97603 -159687 -73525 83374 163201 163702 73952 -6838 -76910 -56008 -30783
15950 -30783 -63285 -65735 -157279 -236773 -271899 -299756 -275812 -189865 -189518 -183442 -188172 -137499 -217320
15937 -217320 -262476 -170978 -49921 -55682 -119746 -128361 -32296 -13849 65697 5052 -140611
15926 -140611 -170520 -112420 -92746 -41882 26406 21945 45552 34601 22679 -53316 -70890 -50190
15914 -50190 -77839 -129486 -57096 -80390 -102066 -94341 -69287 -106862 -104647 -181956 -146836 -67066
15902 -67066 -9680 28291 32330 5551 -153750 -248157 -230723 -206804 -67492 34874 24680
15891 24680 -9296 72046 100231 -1926 -6680 63721 2824 -18126 -65951 -47853 44014 -10261
15879 -10261 -11845 11203 -41539 -61698 -41721 -21690 142971 294918 274852 221935 126983
15868A26983p5035n8545O694O5610P3811n0412o9156o8714m4171J59659R3897
15857A60621O5823r7229j23424J11544J11301n3194M4925J2178p4493M0233r5470
15846A02815l5574l9856K9989j12303q0020K3499m5056M1657k7395j09247r024
15835b60515R2368J5444n2057O7715J24132N5729L3656q6471l2289n4193o9743
15824a66224J51342J36769M511l9177N0117K2703j47432l9007N4983L8193o3877
15813B901O7674Q9262p6917q1345n7483K8283q2368K4224K7716r5529m6842J91816
15801h608N0357K6801Q8864q564j35007o1603p1117M1572Q0079M5725n1935L4686
15789C1250J195l1148k513n331M4478k012O601M0352k0842j90351o1491J9268
$$ plain form
15868 126983 51948 -6597 97 65707 139518 89106 19950 -48764 -92935 66724 160621
15857 160621 226444 129215 5791 117335 228636 175442 220367 232545 158052 198285 102815
15846 102815 67241 27385 57374 -54929 -134949 -111450 -156506 -114849 -142244 -251491 -260515
15835 -260515 -168147 -152703 -204760 -137045 -12913 42816 76472 -9999 -42288 -96481 -166224
15824 -166224 -14882 121887 126398 87221 137338 160041 12609 -26398 28585 66778 2901
15813 2901 70575 159837 82920 1575 -55908 -27625 -109993 -85769 -58053 -153582 -200424 -8608
15801 -8608 41749 68550 157414 148850 13843 -47760 -118877 -77305 2774 48499 -3436 31250
15789 31250 32445 1297 -1216 -6547 37931 35919 42520 82872 62030 -128321 -189812 -170544
15777a70544M9981o901j84029J0795J25203J08092q754j8670O4195l4373q7802
15766a52807N2651N4918l6065P6780L6560M080j2535m179j00278n5993n3797m6182
15754b36847K165L7506J15486M8614M6893n5733r6461O7041j399j43655j35590
15743c51980q5266R6351K94882J48078j98990j11266J44614P7241l9813n0854
15733g7003K3309O4735k5529j9929J2973N7890o4880p1298o8732q3436L0675k1482
15721b42707N2887J50074Q5956l4755j16387j8350l5629Q6613Q8687J31324O722
15710A54435j68944p4971Q0966J02686p037r4236p4213o7522M9040J46112L9908
15699H6224K9089J8594Q6253j02317j4178j16732p7045J952J8085l287q1260J00510
$$ plain form
15777 -170544 -120563 -127464 -311493 -300698 -175495 -67403 -76157 -94827 -30632 -65005 -152807
15766 -152807 -100156 -45238 -81303 -4523 32037 36117 23582 19403 -80875 -136868 -190665 -236847
15754 -236847 -234682 -197176 -81690 -33076 13817 -41916 -138377 -71336 -72735 -216390 -351980
15743 -351980 -437246 -340895 -46013 102065 -96925 -208191 -63577 13664 -26149 -77003
15733 -77003 -53694 11041 -14488 -34417 -21444 36446 -28434 -99732 -168464 -251900 -221225 -242707
15721 -242707 -189820 -39746 46210 11455 -104932 -123282 -158911 -72298 16389 147713 154435
15710 154435 -14509 -89480 -8514 94172 87135 -7101 -81314 -148836 -99796 46316 86224
15699 86224 115313 133907 220160 117843 103665 -13067 -90112 -88160 -70075 -73362 -154622 -54112
15687e4112M5207r9456P8122J08530l2210j1646j156J1244l0928j03432O579l3598
15675a16856N4789J12170K0454l2304j05289j6615J46421k1726n3253N0306j5026
15664B3071M267l0057n3630K7055O233l8359M9732j8027n2746J68410R7651l8033
15652A45567r5852j35221j5363q611n560J06721J08248j25883m4763Q667j6223
15641g8273K353n3545O8002m1082p7150N083J06474m5433m9829J9725K6012N1684
15629f5979L5417j57203O128M0251L2240L2968k2093R8016O3633J06653M6841
15618B16872q8474n4631J5217n6514j90579q3786Q5382J24109P6293j06790r2545
15607a55446k7002m6963J8324J00448R4049J22872J03635r9210m6667m9160k3804
$$ plain form
15687 -54112 -8905 -108361 -30239 78291 46081 34435 33279 44523 13595 -89837 -83258 -116856
15675 -116856 -62067 50103 70557 38253 -67036 -83651 62770 41044 -12209 38097 23071
15664 23071 27338 -2719 -56349 -29294 -23061 -61420 -11688 -29715 -82461 85949 183600 145567
15652 145567 49715 -85506 -100869 -109480 -115040 -8319 99929 -25954 -70717 -62050 -78273
15641 -78273 -75920 -129465 -61463 -102545 -179695 -174612 -68138 -113571 -163400 -143675 -117663 -65979
15629 -65979 -30562 -187765 -181637 -141386 -109146 -76178 -98271 -255 63378 170031 216872
15618 216872 128398 73767 88984 32470 -158109 -241895 -156513 -32404 43889 -62901 -155446
15607 -155446 -182448 -229411 -211087 -110639 -16590 106282 209917 110707 64040 14880 -8924
15596h924m4297R1107j8127J5076n4422l3341j01028L910K9196J6334l2243J37295
15584E36Q9034o6197j14894M4537J38189P4164r4335o3536Q1392o8833l0397q7815
15572i8155r3033O0570O7584J2825j5472o0451K3015j5791j0401K3178n2643O8097
15560i0677N2984P2488k6358m9414L5062o7504p596L4169L5687L8647J0252m8998
15548a1258q2573k1358l3295N9354R0219j43509j05252J5570r521J0437J42742
15537h8444q62m4958l9656J76857O2445o7917K3836J8826K0953l0400j10481M4105
15525c5696K2217N824J26395J8229j81390q997j8263J7809K9205p1991N0616j5269
15513f1311K6412J42921m7732j27104n866J34739J7867J658J3397m3687o9652
$$ plain form
15596 -8924 -53221 37886 19759 34835 -19587 -52928 -153956 -150046 -120850 -104516 -136759 536
15584 536 89570 23373 -91521 -46984 91205 165369 71034 7498 88890 20057 -10340 -98155
15572 -98155 -191188 -130618 -63034 -50209 -65681 -126132 -103117 -118908 -129309 -106131 -158774 -90677
15560 -90677 -37693 34795 8437 -40977 -5915 -73419 -81015 -46846 -11159 27488 37740 -11258
15548 -11258 -93831 -115189 -148484 -89130 1089 -142420 -247672 -232102 -241623 -231186 -88444
15537 -88444 -89306 -134264 -173920 2937 65382 -2535 21301 40127 61080 30680 -79801 -35696
15525 -35696 -13479 -7655 118740 136969 -44421 -53418 -71681 -53872 -24667 -96658 -46042 -61311
15513 -61311 -34899 108022 60290 -66814 -72680 62059 79926 81584 94981 51294 -18358
15502a8358q8510j509J4126P7070L3942K6373m0051j30022J7313K8701K4158l4868
15490i1635M2536N5843M5698L2337p0984N604K3955m0724P4450J63130j17010
15479A23200m1894M0885j0232j02721q079J09517j75193r6044O6278J25980j183
15468C0514n2153o2803m095n4530o6120j83736j6939J34027o9547m2987J32812
15457b55557J37237J22578m0898J4488O3960m3600k1682N5225Q2576J1961j1153
15446A15135j60503k3741K9889J0080J5773K157o7172l1421M5317Q1441j10319
15435i3364R438R2694j35610j1689L5144Q8921K6470j7559l1258l9828P6005l7895
15423c8531l1406n4636O3842M2640K6675q231J3834O8164L678Q1558m1699l9213
$$ plain form
15502 -18358 -106868 -108377 -94251 -17181 16761 43134 3083 -126939 -109626 -80925 -56767 -91635
15490 -91635 -49099 6744 52442 84779 13795 19399 43354 2630 77080 240210 123200
15479 123200 81306 122191 111959 9238 1159 110676 -64517 -160561 -94283 31697 30514
15468 30514 -21639 -84442 -88537 -143067 -209187 -392923 -409862 -275835 -345382 -388369 -255557
15457 -255557 -118320 4258 -36640 -22152 41808 -1792 -23474 31751 114327 126288 115135
15446 115135 -45368 -69109 -39220 -29140 -13367 -11210 -78382 -109803 -64486 16955 -93364
15435 -93364 -83926 8768 -126842 -138531 -103387 -14466 12004 -5555 -36813 -76641 -636 -38531
15423 -38531 -69937 -124573 -60731 -18091 8584 353 14187 82351 86029 167587 125888 86675
15411H6675m145n0663j30395q9316j0274J67083K3874o9841n0996j55304O6758
15400b16544J56008j1615N3965K7442j08562J6684o5084r778l5086o5674m148
15389b62392R5845N9813l3614o1818j0924o2377R4035J73506M605n7730L0483
15378c0568j8250K1364J925M8551L0811k137P3792j6673j15210J0502m272n7737
15366e7902o9422n4557J40955O3261N9676l5306J8049K0833J6499k2930j43934
15355f4778n6664O1960R3512o6015p8142K7360j09346L1261J04421k8006Q339
15344g6098o9037n5356O0620O5181m9931j0359N9706O5540o0413l4321p9688M6309
15332a37847J54545j11422L3639K1170j5382q511N2006K7767j45977o866N0518
$$ plain form
15411 86675 82530 31867 -98528 -187844 -198118 -31035 -7161 -77002 -127998 -283302 -216544
15400 -216544 -60536 -72151 -18186 9256 -99306 -82622 -147706 -157484 -192570 -258244 -262392
15389 -262392 -166547 -106734 -140348 -202166 -213090 -275467 -181432 -7926 -3321 -61051 -30568
15378 -30568 -48818 -27454 -25529 23022 53833 51696 125488 108815 -6395 4107 -165 -57902
15366 -57902 -127324 -181881 -40926 22335 82011 46705 64754 85587 102086 79156 -64778
15355 -64778 -121442 -59482 34030 -31985 -110127 -82767 -192113 -160852 -56431 -84437 -76098
15344 -76098 -145135 -200491 -139871 -74690 -124621 -134980 -75274 -9734 -70147 -104468 -184156 -137847
15332 -137847 16698 -94724 -61085 -39915 -55297 -63808 -11802 15965 -130012 -136878 -86360
15321h6360p3235j9455P8803O1414N6521o0762j63131L3873J12854l788l1182
15310i4448j23554L2483P8238J2743k8556j3417L404O928r256M833O1815j15427
15298a84214r8134K4962K6362Q7155N9071J91163J62722P0660p2922p4282o4147
15287A28396J05214R2366l729l4119q6938j13408m3058R118O491p9974r519j772
15275c0932R2330k2256j40381j8789J38312Q5899J26731p508j00063M6023l8540
15264A30826j73016K9891J32816L327q4050l4193k2434k5992p2126J5709n0054
15253a49296K4554J31455N8452m810k3040R0147p903m0525m6510p7369j7296N4853
15241g288l2261n8754m5724P9969N488p9796j07719L4924J28096J51230n1134
$$ plain form
15321 -86360 -159595 -179050 -100247 -38833 17688 -43074 -206205 -172332 -59478 -63266 -94448
15310 -94448 -218002 -185519 -107281 -94538 -123094 -136511 -133107 -126179 -135435 -130602 -68787 -184214
15298 -184214 -282348 -257386 -231024 -143869 -84798 106365 269087 339747 266825 192543 128396
15287 128396 233610 325976 322247 288128 201190 87782 44724 53842 60333 -19641 -29160 -30932
15275 -30932 61398 39142 -101239 -120028 18284 104183 230914 223406 123343 169366 130826
15264 130826 -42190 -12299 120517 123844 39794 5601 -16833 -42825 -114951 -99242 -149296
15253 -149296 -124742 6713 65165 60355 37315 127462 119559 79034 32524 -44845 -62141 -7288
15241 -7288 -39549 -98303 -144027 -64058 -58570 -138366 -246085 -211161 -83065 68165 17031
15230A7031p3174j6361O0362m7278j19436q6062O4476O3805J08401N3111O310
15219C1185Q2939n5767r7138p8496l5348j6741M3054p1098M9185J46360R899M6356
15207E4390j0221R9176K1603j23019j71813J6665J18017K4665M1895P6281j12699
15196C4940p4334P823j7339K8915j24817N6457L704j16723M2579P0885P4997j05555
15184a18468o6122Q8763J11719N0434K0007J00927p0940j32527l9111P0013p0105
15173e5410R8991J32516m9132j54968l1859j0740K1071M3380l9116l2779J2733
15162f5313M9922P2164j04632j74939K6185J23588J14662Q6322n0148k7480p4030
15151b3699J1769o3159J4171O9348N4034J0933m4448q2966K3867l5243R0053k8459
$$ plain form
15230 17031 -56143 -72504 -12142 -59420 -178856 -264918 -200442 -136637 -28236 24875 31185
15219 31185 114124 58357 -38781 -117277 -152625 -169366 -126312 -197410 -148225 -1865 8034 54390
15207 54390 44169 143345 164948 41929 -129884 -113219 4798 29463 71358 147639 34940
15196 34940 -39394 -31571 -48910 -19995 -144812 -88355 -84651 -201374 -158795 -87910 -12913 -118468
15184 -118468 -184590 -95827 15892 66326 86333 187260 116320 -16207 -55318 14695 -55410
15173 -55410 43581 176097 126965 -28003 -59862 -70602 -49531 -6151 -45267 -78046 -65313
15162 -65313 -15391 56773 -47859 -222798 -196613 -73025 41637 127959 77811 50331 -23699
15151 -23699 -11930 -75089 -60918 8430 62464 73397 28949 -54017 -30150 -65393 24660 -3799
15139c799p61K3522j58N4040J01771j23747r5119Q6388N0660p8182m5437R9861
15127F9039k3689N3041K4325P5648j03119k23084R1886L0972q1007q3491K4488
15116a44991J31162J02402M5696m3146r1056K5808J1099J6795K4704j70353j35198
15105b27078Q3752M2323J8908K9437J3948j56183j05296N8396L3282O473L8222
15094a63816j2646o1723o9890P9102O4042P0743P2720j4573N8135O6970o8588
15083B0476N1880Q5629p0147q262l4081j55535p8205O4159K6120J7125J716K1907
15071e7218R5001P8919L6002j6436j86992O332J98791p1018r8053k2024M8454
15060A1758J05983j625o5588n2350o206N0010K4580n7493m8352j2864P4140k2072
$$ plain form
15139 -3799 -4560 18962 18804 72844 174615 50868 -44251 42137 92797 14615 -30822 69039
15127 69039 45350 98391 122716 198364 95245 -127839 -35953 -4981 -85988 -169479 -144991
15116 -144991 -13829 88573 134269 91123 67 25875 36974 53769 78473 -91880 -227078
15105 -227078 -143326 -101003 -82095 -52658 -38710 -194893 -300189 -241793 -208511 -202038 -163816
15094 -163816 -176462 -238185 -308075 -228973 -164931 -94188 -21468 -36041 22094 89064 20476
15083 20476 72356 157985 87838 79576 45495 -110040 -188245 -124086 -97966 -80841 -79125 -57218
15071 -57218 37783 116702 152704 136268 -50724 -44392 154399 83381 -14672 -36696 11758
15060 11758 117741 116116 50528 -1822 -8028 41982 66562 9069 -39283 -52147 21993 -79
15048g9r9385k409J03461K7693p2935R1238J04215j21011j9678J21156L5105j01260
15036F6111j6524j7604R6392N5028M4744m8356m200n9271R2971l3172J7896Q0896
15024B74911q1175K7835J0663l5825K9941Q5478M5704o1644j81986j7119M5134
15013A41917J00152P4941J48684K05241R0038K50500J96068K82587J71327K69786
15003A931241L84633O29252P82662m26186j443427r68133l79731j52806j12615
14994B44890j98431q2969N1381J75902J9248j8274j46135l4732n5208k3902P735
14983f0495p1744J1705J77065N924p5245o4960J53048k1757o9188p490j9763n4521
14971i7421J25964L2504j6858j40735p7237R8470K2666K3027l2074L1037R6151
$$ plain form
15048 -79 -99464 -101873 1588 29281 -43654 47584 151799 30788 11110 132266 167371 66111
15036 66111 49587 31983 128375 183403 228147 179791 175591 116320 209291 176119 194015 274911
15024 274911 193736 221571 232234 196409 226350 311828 357532 295888 113902 96783 141917
15013 141917 242069 317010 465694 670935 760973 1011473 1207541 1490128 1661455 1931241
15003 1931241 2315874 2945126 3727788 3301602 1858175 890042 510311 357505 244890
14994 244890 46459 -36510 14871 190773 210021 191747 45612 10880 -44328 -68230 -60495
14983 -60495 -132239 -120534 56531 62455 -12790 -77750 75298 53541 -15647 -23137 -42900 -97421
14971 -97421 28543 61047 44189 -96546 -173783 -75313 -52647 -29620 -61694 -30657 65494
14960F5494m3697j0589l583P9852R7699n5796l6702p6462o4184L2803K9898r4399
14948g9666j03559Q6896J14738j1763m8486L0577p7727L0740j05330P7374J60164
14937G3958M524o0224K5164q9629q513J13367l2690O068q726j60571m8252O8335
14925a17189O9920J07633p6928q2991J47637o083j70099q6211j2613m7838m5761
14914c20523J16088J8998L346N6379n8417J39110j0109N5661k5499N67J7796L715
14902b888L863j25660n6983Q5585J6920J0292K5307o174L8256n3035O6424n7543
14890e5636j9895q1435J44833j9562P8708O0957J3796j39997p7674k756N4471
14879d4190p6750K7010k0165R5083P6353K9088L2114k5069m030j17289O0147R1476
$$ plain form
14960 65494 21797 11208 7625 87477 185176 129380 92678 16216 -47968 -15165 14733 -79666
14948 -79666 -183225 -96329 18409 6646 -41840 -11263 -88990 -58250 -163580 -86206 73958
14937 73958 78482 18258 43422 -46207 -54720 58647 25957 32025 23299 -137272 -185524 -117189
14925 -117189 -47269 60364 -16564 -99555 48082 41999 -128100 -214311 -226924 -274762 -320523
14914 -320523 -204435 -185437 -182091 -125712 -184129 -45019 -55128 533 -24966 -24399 -6603 -2888
14902 -2888 975 -124685 -181668 -96083 -79163 -68871 -43564 -49738 -11482 -64517 1907 -55636
14890 -55636 -75531 -156966 -12133 -31695 47013 107970 121766 -18231 -95905 -98661 -44190
14879 -44190 -120940 -93930 -114095 -19012 57341 86429 118543 93474 89444 -27845 32302 123778
14867A23778k1731n7776N2157J11813q322j52486j2748o5820k9124Q3617m9217
14856b5859N4130O5598r4502q0423J4648L3958j1332K0264Q4205k9719O4523r3271
14844B220l6007o9059p6848l2580L7057l978j82333P187K02597R0005j10151Q387
14832a63503K23440J46601j23575m4617J72486j00186l1310P9059j00365J9704
14822G7734L5823j59923q185J2466n0488N784J59930Q8083k0954k2161j5329K1902
14810A24682l3228j19337O5307j0807n5157k8132m3433J05736o0309p5909j4519
14799a45106L8479J04148N7953K7169q3179M3686N4528J51291R121j04681j6902
14788A36507k6862l1973q3749j07478P6760P5775n511O7455k403p2159o0124J35253
$$ plain form
14867 123778 102047 44271 96428 208241 199919 47433 34685 -31135 -60259 23358 -25859
14856 -25859 28271 93869 -633 -81056 -66408 -32450 -43782 -23518 60687 30968 95491 2220
14844 2220 -33787 -102846 -179694 -212274 -175217 -179195 -361528 -354341 -151744 -61739 -171890 -163503
14832 -163503 59937 206538 82963 38346 210832 110646 79336 158395 58030 77734
14822 77734 113557 -46366 -54551 -42085 -92573 -86789 73141 161224 140270 118109 102780 124682
14810 124682 91454 -27883 37424 26617 -28540 -56672 -100105 5631 -54678 -130587 -145106
14799 -145106 -106627 -2479 55474 82643 -536 43150 97678 248969 258090 153409 136507
14788 136507 109645 77672 -6077 -113555 -36795 38980 33469 100924 98521 26362 -33762 101491
14776A01491P0919j23183q8881j3228K2754j67775R8792P9321L827J7293p6591
14765g5261M2672K2612k9725n0856p2656P1858R1739k5960P5131K414P9088J0985
14753A42041L0254j5374j08888o7440l9001J0597J31292J13632j37533j04725
14743d5145M0988R2629K4765o6859J64197K0717O530l3018m3891M9542K8677j14030
14731A25102o4993l4044k9678P6505j2188M8091L9238J9854q2500m924l9300k6000
14719A5163N766l2898l1526L4616O1779L5475k4533L7316J11380N0238o633j96815
14707E9328J5704J8712M6170l9070o5199J9298k7851j23528j53647k5911J10203
14696a65791J10350K5130L0994J38461J16555j66096j49269J1375R2665P7726
$$ plain form
14776 101491 172410 49227 -39654 -52882 -30128 -197903 -99111 -19790 -15963 1330 -75261
14765 -75261 -32589 -9977 -39702 -90558 -163214 -91356 383 -25577 49554 51968 131056 142041
14753 142041 172295 156921 48033 -19407 -58408 -47811 83481 197113 59580 -45145
14743 -45145 -4157 88472 113237 46378 210575 231292 237822 204804 160913 210455 239132 125102
14731 125102 60109 26065 -3613 72892 60704 108795 148033 167887 85387 80463 41163 15163
14719 15163 20929 -11969 -43495 -8879 52900 88375 63842 101158 212538 262776 256143 59328
14707 59328 75032 93744 139914 100844 35645 54943 27092 -96436 -250083 -275994 -165791
14696 -165791 -55441 -30311 683 139144 255699 89603 -59666 -48291 44374 122100
14686A22100p3549j3108o568k6164N7781j1629p9238j2619j8909q3419K7945J24632
14674G255l2812p7519J5306k7258J680Q1299N1686K1430K9157l7435p5146J25129
14662H2772K7072k0036K2289m2561M0166N054p6408J3213p3301j06360J04129
14651b3971J29934L0530K0599n2730k8817j12122n2288n4159k8872J30731Q7709
14640D6544j4598R8660q985n8960L4450n8937p5701M4076N7358k8718n1251j25063
14628a41125j05560J6395K1714l1053N9929J16763J22453R6110J3424Q899j30301
14617D7648l7441j19758j0950R3923L9450j1397N8187k7974j39125k9092p318
14606a43847q389J59624Q7280p0880l6470n4445J07603J21015j0952q2251J149
$$ plain form
14686 122100 48551 35443 28875 2711 60492 48863 -30375 -42994 -61903 -145322 -117377 7255
14674 7255 -25557 -103076 -87770 -115028 -113348 -32049 19637 41067 70224 32789 -42357 82772
14662 82772 109844 89808 112097 69536 109702 114756 38348 51561 -21740 -128100 -23971
14651 -23971 105963 136493 157092 104362 75545 -36577 -88865 -143024 -171896 -41165 46544
14640 46544 31946 130606 121621 62661 97111 38174 -37527 6549 63907 35189 -16062 -141125
14628 -141125 -246685 -230290 -208576 -239629 -179700 -62937 59516 155626 169050 177949 47648
14617 47648 10207 -109551 -120501 -26578 12872 1475 59662 31688 -107437 -136529 -143847
14606 -143847 -152236 7388 94668 23788 -12682 -67127 40476 161491 150539 68288 69437
14595F9437O8194N2455j24513o0666M8969j4288K5858q5062o9097k1982J07791
14584b904J13442M4581m8714K7489N6053j24518l8750p8492R7414m7146j8535
14573b0080N0362K4574j7305N436P7749k1808j28335O2298K0133j1627M1854N1566
14561A34817J55120J16315p9697q0875l8254k7283K3329K64447L25074k655q5026
14550G05312k8819k16143r9469q6740j26879r989j8048j40920J22426L5674j60790
14539b4385L6138o6923l9841o4602l333j2296m7977J81857k8062q6396J2307Q2741
14527f0772k4485m16k4574M2481N8170L0913R981l9364J22786M2488r144l9882
14515A08182q9481m0066q7819k7514j176L8341M438o9110o3694n261j6782j0341
$$ plain form
14595 69437 137631 190086 65573 4907 53876 39588 65446 -19616 -88713 -110695 -2904
14584 -2904 110538 155119 106405 133894 189947 65429 26679 -51813 45601 -1545 -20080
14573 -20080 30282 54856 37551 42987 120736 98928 -29407 32891 53024 41397 83251 134817
14561 134817 289937 406252 326555 245680 207426 180143 203472 467919 792993 790338 705312
14550 705312 676493 460350 360881 274141 147262 137273 119225 -21695 100731 136405 -24385
14539 -24385 11753 -55170 -95011 -159613 -162946 -175242 -223219 -41362 -69424 -155820 -143513 -60772
14527 -60772 -85257 -85673 -110247 -67766 -9596 21317 31298 -8066 114720 157208 148064 108182
14515 108182 18701 -21365 -109184 -136698 -137874 -99533 -95095 -164205 -227899 -233160 -249942 -260283
14503b60283K8771j9942J03113J35769K2372R039O3223o4022n8802O5387l8351
14492a3726j02813Q5385l556p8267L3816J663K3431p470p8010J35653o301O6019
14480E5824J23155p3630M1594L2975p7019j93950R099O3601P1136m1467R2545
14469A03863q946j52734j07423j3832J45909J78173j2963q8560j4325N8371P8927
14458A66460k3633j22175J7505p1983K2005K13116j02893j62057K1082P0244K0213
14447D7884p1936P3751j15925j11596r1207K1986Q7259M6803M5201j9921L5094
14436e2607M7871P131o1567l2089O7146L5806O1593j08561K7516p9482n2673J14468
14424b5448J89235Q0342m9918N1021o7171n1550k2555j07546n6274K9388J41601
$$ plain form
14503 -260283 -231512 -251454 -148341 -12572 9800 18839 82062 18040 -40762 24625 -13726
14492 -13726 -116539 -31154 -34710 -112977 -79161 -77498 -54067 -61537 -139547 -3894 -10195 55824
14480 55824 178979 105349 146943 179918 102899 -91051 -81952 -18351 52785 11318 103863
14469 103863 94917 -57817 -165240 -179072 -33163 145010 132047 43487 29162 87533 166460
14458 166460 142827 20652 38157 -33826 -11821 201295 98402 -63655 -42573 27671 47884
14447 47884 -24052 49699 -66226 -177822 -269029 -247043 -159784 -112981 -67780 -87701 -52607
14436 -52607 -4736 2395 -59172 -91261 -24115 11691 73284 -35277 -7761 -87243 -139916 -25448
14424 -25448 163787 244129 194211 245232 178061 126511 103956 -3590 -59864 -30476 111125
14413A11125j4358j2703m5348J92L4434K6800k8437J14450J26498m7556j3208
14402B51889p0476q3181q1663k9965K4960K8904O209n6127m0586m0169J41704
14391E1499o100M1226P1954l1390q4947J18311N4107j61647j47592L6707l6250
14380i4122R9145J9534k3458J05683p9289J2422p3108j3182P5438p184k4750p3868
14368g6739m3427K1297L6433l2332J3067j07105K2870Q4357J02618k7544r4739
14357a01244o5636Q6917J49313o3811p2814m4248p1428o9295N5810J27305J5005
14346e4126j18822j10858L0448R4346J01907R9166L4611P7088K3816m9476j04771
14335B3329O024l7843r3382K1416J2948j9481P8433Q4386k1903j00161r9459k0957
$$ plain form
14413 111125 96767 84064 38716 38908 73342 100142 71705 186155 312653 265097 251889
14402 251889 181413 98232 16569 -13396 11564 40468 46677 -9450 -50036 -90205 51499
14391 51499 45399 86625 158579 127189 42242 160553 214660 53013 -94579 -57872 -94122
14380 -94122 5023 24557 1099 106782 27493 39915 -33193 -46375 29063 21879 -2871 -76739
14368 -76739 -120166 -98869 -62436 -94768 -81701 -188806 -165936 -81579 21039 -6505 -101244
14357 -101244 -166880 -79963 69350 5539 -67275 -111523 -182951 -252246 -196436 -69131 -54126
14346 -54126 -172948 -283806 -253358 -159012 -57105 42061 76672 153760 177576 128100 23329
14335 23329 29353 -8490 -101872 -80456 -67508 -86989 -8556 75830 53927 -46234 -145693 -166650
14323a66650J38723L6079O1915J8215n6354o3259J1450J6189k1612k3186k5754
14312g4244r0363n3738N3173J7927O8467Q6553j30402p2111P2844P3939Q1404
14301C3449n0022M4435R9420n4025m4058l5261P945l6679p6080R3254L1876J11933
14289A26187K3353o9625j41534o3067P9915J02679Q2429p8804m7989M6687O632
14278F6863p8141k0529J7861m7430m9013O3912N4425j16670q2577m1767N7084
14267a75982J72851J03178k9987r0518o2975o7918K2191J7702N9258O7506o238
14256I068q4636M9157P8408Q058p0313M917l3490J72432p3938j12250n8679K6325
14244h4941O3863k0596l5180k1593m2733N8408J5578j29816j7462R0649K0168
$$ plain form
14323 -166650 -27927 8152 70067 88282 31928 -31331 -19881 -3692 -25304 -48490 -74244
14312 -74244 -164607 -218345 -165172 -147245 -78778 7775 -122627 -194738 -121894 -47955 33449
14301 33449 -16573 27862 127282 73257 29199 -6062 1883 -34796 -110876 -17622 14254 126187
14289 126187 149540 79915 -61619 -124686 -44771 57908 140337 61533 13544 60231 66863
14278 66863 -11278 -31807 -13946 -61376 -110389 -46477 7948 -108722 -191299 -233066 -175982
14267 -175982 -3131 100047 70060 -20458 -83433 -151351 -129160 -111458 -52200 15306 9068
14256 9068 -75568 -26411 51997 60055 -10258 -5341 -38831 133601 59663 -52587 -111266 -84941
14244 -84941 -21078 -41674 -76854 -98447 -141180 -82772 -67194 -197010 -214472 -123823 -103655
14233a03655j056k7044L0244n4013m0088n2236j40213J92181K07972k0533j8886
14222b7327p3392n6537P3397P1157J08993m5568m7016k788N5252L0549j10114
14211b3394j17399J03172J69170L2519M028k4692o7362J8558j11099o500O2281
14200C9282R0285n1330N476J2911n7253K4400j12547k5468J13821k174K5926r9043
14188c5714J8885J2169J2041K2362p3729o4050j9589L9937J68656N2963k6312
14177A07619J3813j3577l2740j16501j55305q5495J2724J02458M1631Q6697Q9457
14166E0781m5986j70504k9857L3651O5516K2078N54p1518K3581Q960Q8247N2926
14154B8429J00055P072o8573k4861n283p7588q9311m9232k6835l6879J33257J97895
$$ plain form
14233 -103655 -104711 -131755 -101511 -155524 -195612 -247848 -388061 -195880 12092 -8441 -27327
14222 -27327 -100719 -157256 -83859 -12702 96291 50723 3707 919 56171 86720 -23394
14211 -23394 -140793 -37621 131549 164068 168096 143404 76042 94600 -16499 -22999 39282
14200 39282 129567 78237 83713 96624 39371 63771 -48776 -74244 39577 37403 63329 -35714
14188 -35714 -16829 -4660 7381 29743 -43986 -108036 -127625 -87688 80968 133931 107619
14177 107619 121432 107855 75115 -41386 -196691 -282186 -269462 -167004 -125373 -38676 50781
14166 50781 4795 -165709 -195566 -161915 -96399 -74321 -73767 -145285 -121704 -112744 -24497 28429
14154 28429 128484 135556 66983 42122 36839 -40749 -130060 -179292 -206127 -243006 -109749 88146
14142H8146O0897l4287P8362j03826j25792L6113M0467o0972o7239O102J59439
14131G7410L4000n9750J1334m0139j4642P346L2280j29074J8700Q3508n5108M685
14119b9450J8468m618l8284j08051J05574Q1168n2562m1517m4122K1955j27564
14108b19003M4598J21319P9661k3459q0471o2028K2806J6788J05853R6033k3780
14097G8317j3615p1845l0110n5917n8214n3734l0749O1248R7369L9352n1241K4082
14085f5057l4314L0354J52508r384p4719J5084K202M9782M765j34932M4864L8069
14073A9222m5416J0563J7609o9855l4859r4795j584P5585L4638J24532N9206r5845
14061i99k35087q7795k2997N6812O0485j0734L4229J18800L3123K9667L697L5220
$$ plain form
14142 88146 149043 114756 193118 89292 -36500 -387 40080 -20892 -88131 -82029 77410
14131 77410 111410 51660 62994 22855 8213 15559 47839 -81235 -62535 20973 -34135 -29450
14119 -29450 -10982 -15600 -53884 -161935 -56361 24807 -27755 -69272 -113394 -91439 -219003
14108 -219003 -174405 -53086 26575 3116 -77355 -139383 -116577 -99789 6064 102097 78317
14097 78317 64702 -7143 -37253 -93170 -151384 -205118 -235867 -174619 -77250 -37898 -89139 -65057
14085 -65057 -99371 -69017 83491 74107 -612 14472 16674 66456 71221 -63711 -18847 19222
14073 19222 -26194 -15631 1978 -67877 -102736 -197531 -199115 -123530 -88892 35640 94846 -999
14061 -999 -236086 -323881 -346878 -290066 -229581 -240315 -206086 -87286 -54163 -24496 -20799 14421
14049A4421o220j22457L7407J02494M8367m4000j9384k7939m0588J9493J24628
14038H6222k3467q8782m1500R0248J49238l8070j81247o5261J829p8777q6280
14027b75847J80677l534O1499N7513L4130j71417o2355N8855P398M8102J2118
14016e2861Q4136l0279l4286l3197l9426J03996O3764N109l004n1483K0334m9993
14004a7190j37161k0276m6927Q9075L4892K1425J3766J01310p3523L4052N9564
13993E9007J00453o0524p6404r0387m3431M301J2362R3969K9342K2078j1768J7350
13981E6348N0819P5325j0325p945O0268K698n2808j9170j88705N8454J12942Q0564
13969B18465j47030j46204m4101J8602n4291J2744K9345Q8917J32646m9312j4476
$$ plain form
14049 14421 8201 -114256 -76849 25645 74012 30012 10628 -17311 -57899 -38406 86222
14038 86222 62755 -26027 -67527 22721 171959 133889 -47358 -112619 -110790 -189567 -275847
14027 -275847 -95170 -98704 -37205 20308 54438 -116979 -179334 -120479 -113081 -64979 -52861
14016 -52861 31275 996 -33290 -66487 -105913 -1917 61847 66956 63952 12469 32803 -17190
14004 -17190 -154351 -174627 -221554 -132479 -97587 -76162 -62396 38914 -34609 -557 59007
13993 59007 159460 98936 22532 -67855 -111286 -106985 -94623 -654 28688 50766 38998 56348
13981 56348 107167 182492 172167 164222 224490 227188 174380 155210 -33495 24959 137901 218465
13969 218465 71435 -74769 -118870 -100268 -154559 -141815 -112470 -23553 109093 59781 45305
13958D5305p6330J4104R7577P0597n7952j25369m4941o1019J9625L1156o4473
13947a51720j24569K4652R9069N751K1636J20541O8900q9848J05115J38951p8651
13936A39827O0386N5127j2801r9719K2375N596j60035m9801K0992J4417l271n6623
13924f3530J3974M1806p6596q1196P7904J26411q1964q0532K0048j2269P6315
13913c9629J30692N6403j00922m4613L0080O4575m081k6045N2654L235Q328k114
13901A28563P137J6778K9959k4998j57620p1831Q6551m419l2353n733k0908j8658
13889f7532J3031o7137o410J4272r7972P7876R4279L6774o183l4446p297K6686
13877b4059k0095p4933k8297l5716l271Q760M5901J37184k8298l8366K2106n3352
$$ plain form
13958 45305 -31025 -16921 80656 151253 93301 -32068 -77009 -138028 -118403 -87247 -151720
13947 -151720 -276289 -251637 -152568 -146817 -125181 -4640 64260 -25588 79527 218478 139827
13936 139827 200213 255340 242539 142820 165195 170791 10756 -39045 -18053 -3636 -6907 -63530
13924 -63530 -49556 -7750 -84346 -165542 -87638 38773 -43191 -123723 -103675 -115944 -39629
13913 -39629 91063 147466 46544 1931 32011 96586 92505 66460 119114 122349 130677 128563
13901 128563 135700 152478 182437 157439 -181 -72012 14539 10120 -22233 -27966 -48874 -67532
13889 -67532 -54501 -121638 -128048 -113776 -211748 -133872 -39593 -2819 -9002 -43448 -50745 -24059
13877 -24059 -44154 -119087 -147384 -183100 -186371 -177611 -131710 5474 -22824 -61190 -39084 -92436
13865i2436P0455N5513n6606k6390j3473q3763k5786K20811m453l1119o7861j2606
13853f7714P6081j3738L2878L5331J12106p0518M0629j17544j21304l9214p7622
13842b10629J7365R7578O957p7380O8736L7664R5919R3672p919p9860m6185P5357
13830G1275l2162M3334J69394j24626j78911p3571L8116J36252L8432m0501n3549
13819f517L275l9338m7072L2661K4461P134k5528L4343J8259k5808j5425Q209
13807c1346k3927M0674N310N7733K2557R6022L6094j31250p7549j36503n0454
13796a92639Q9295Q1417O1606J2106J9142N6145N5545r1215o9013N9386K0342
13785A02117j74737r7171K9062R3737j8313M9020j527n7438l2284n1635r061K0638
$$ plain form
13865 -92436 -21981 33532 -23074 -49464 -62937 -146700 -172486 48325 43872 12753 -55108 -67714
13853 -67714 8367 -5371 27507 62838 174944 104426 145055 27511 -93793 -133007 -210629
13842 -210629 -193264 -95686 -88729 -166109 -97373 -59709 36210 129882 121963 42103 -4082 71275
13830 71275 39113 82447 251841 127215 -51696 -125267 -87151 49101 87533 47032 -6517
13819 -6517 -3242 -42580 -89652 -56991 -32530 -25396 -50924 -16581 1678 -24130 -39555 -31346
13807 -31346 -55273 -14599 -9289 48444 71001 167023 203117 71867 -5682 -142185 -192639
13796 -192639 -103344 -21927 39679 51785 70927 127072 182617 91402 22389 81775 102117
13785 102117 -72620 -169791 -140729 -46992 -65305 -16285 -17812 -75250 -107534 -159169 -168230 -147592
13773a47592j8609K0210l7238N7225k288k676J7143P6172l2209n9689K3833J07030
13761A312J17983M4036K4506J12820k0802j25891j08228r0818R874q5678o420
13750a27306K5550K0031J04133L9347j08270k3198N9027j4727j0029M1572j2808
13739f678J647K1291j5686J7378q6410j08861J82286N7200m1988J1813p3505J03505
13727F1992J19997j4134j27299k3261l0781p4581J12846K7021Q3878N632q6273
13716E5037J22618m9698o6195n7577j0713L9996l4979O0890P1813N03r5847L2778
13704F8626J01395j9797j53291L655p9960o0868L2803J8241O0287J5919P310l6376
13692d2056l1711O2391l2389j71897o2893J16785J81107K1872l5247N995J11882
$$ plain form
13773 -147592 -166201 -145991 -183229 -126004 -128292 -130968 -113825 -37653 -69862 -129551 -105718 1312
13761 1312 119295 163331 187837 300657 279855 153964 45736 -45082 -35208 -120886 -127306
13750 -127306 -101756 -81725 22408 61755 -46515 -69713 -10686 -25413 -35442 6130 -6678
13739 -6678 -5031 16260 574 17952 -68458 -177319 4967 62167 20179 31992 -41513 61992
13727 61992 181989 167855 40556 17295 -13486 -88067 24779 51800 135678 141310 55037
13716 55037 177655 127957 61762 4185 -6528 33468 -1511 59379 131192 131695 35848 68626
13704 68626 170021 150224 -3067 588 -79372 -140240 -107437 -89196 -28909 -12990 -5680 -42056
13692 -42056 -73767 -11376 -43765 -215662 -278555 -161770 19337 41209 5962 11957 123839
13681A23839J42177p1381r5426p1157j02934m0228N0273N9437n6079m9027J12399
13670A893Q8480P9077p4551j0775J32224K4524n0937J7558o1075o8502j3095J1994
13658G6815K9407L9464p2901k9997j224J2580M7767J954j55093m2761J13062J22825
13646A41898q1200m6652L830J04133J054m6031m0927q5827m8383M5286J6535k8252
13634f4536P7289K0217P967j38023j13106M7127J48594O6667j08658n1064K7594
13623g9932m2055j15727o1316P5362N7805J064O8384l5371l1486J66508R5975
13612I9211N6019L3348j77798p3866k7259M9862Q9004o0222r8118m9127Q7M7665
13600a11194L3476J09698P5483l0271J01872J5713j61214q7711K0593J1440O1964
$$ plain form
13681 123839 266016 194635 99209 28052 -74882 -115110 -64837 -5400 -61479 -110506 1893
13670 1893 90373 169450 94899 84124 216348 240872 189935 207493 146418 77916 64821 76815
13658 76815 106222 145686 72785 42788 41564 54144 101911 103865 -51228 -93989 19073 141898
13646 141898 60698 14046 17876 122009 123063 77032 36105 -49722 -98105 -52819 -36284 -64536
13634 -64536 12753 32970 40937 -97086 -210192 -163065 -14471 52196 -56462 -107526 -79932
13623 -79932 -121987 -237714 -299030 -223668 -165863 -164799 -96415 -131786 -163272 3236 99211
13612 99211 155230 188578 10780 -63086 -90345 -40483 48521 -11701 -109819 -158946 -158859 -111194
13600 -111194 -77718 31980 107463 77192 179064 194777 33563 -54148 -33555 -22115 39849
13589C9849K8059M3862q1043j565l3802K1798Q2227m516n9461J13793n080j7477
13577A26644l3614l7952J2599J01787r3140j3264K660K4874P6426N101p098r6631
13565F8392p2315p7124L7038O6797Q4081j05939q949N1837j19980m9932J218J01212
13553b3664O4768k9605m3451l9567J00926L4566J8255l1376o2910Q4845L3176
13542A05963o7237r1433k3823j28661n6141R0989J70108N1855J22855M3142n7562
13531A60055r5124j25767j1659J67385Q5641J334p6827l4703q5478J1920M560
13520A337n8187Q0431J6351j2585k0278j48525q387J6036J39247M2986l884J04890
13508A49432J8264K7935o5465K0813j0556q7271r821n7544J09728L4366J38177
$$ plain form
13589 39849 67908 111770 30727 29162 -4640 17158 99385 94869 35408 149201 144121 126644
13577 126644 93030 55078 67677 169464 76324 63060 65720 90594 167020 172121 165023 68392
13565 68392 -3923 -81047 -44009 22788 106869 930 -8019 43818 -76162 -126094 -124876 -23664
13553 -23664 41104 11499 -31952 -71519 29407 63973 82228 50852 -12058 72787 105963
13542 105963 38726 -52707 -76530 -205191 -261332 -170343 -235 51620 174475 217617 160055
13531 160055 64931 -60836 -72495 94890 180531 181865 105038 70335 -15143 -3223 1337
13520 1337 -56850 23581 39932 27347 7069 -141456 -149843 -133807 5440 48426 44542 149432
13508 149432 167696 195631 130166 150979 140423 53152 43331 -14213 95515 129881 268058
13497B68058P7483k12592j50181l2679N9271N558r499L9026R3989j63108L2514
13486G840K4000K1041M082l9149j43881q0949P036Q1091J24804J1798l5665k1977
13474c9929o6101O3522J68681M7487k133o4463j1253J38221Q5939n7801n8813
13463B03357O2220K6694o7138q5639p2106q5257n592O2322o7020l9418N5954j05601
13451a17224J4913L629O2127Q1581r3994L5100K8184o8389j6305J3459Q3846m056
13439B2871j26757K5815Q9105J7181l451o0786k6828l6328J3371J30090N7661
13428A01944k9062j6751k6484J4986N9487p1926K9509N0655N1041k462l4622k8630
13416I7685r6920K1965N8419l3628n9858p9313j20998M5230K03500J78300J399
$$ plain form
13497 268058 345541 132949 -17232 -49911 9360 14918 5419 44445 138434 -24674 7840
13486 7840 31840 52881 56963 17814 -126067 -207016 -199980 -118889 5915 17713 -17952 -39929
13474 -39929 -106030 -42508 126173 173660 171527 107064 95811 234032 319971 262170 203357
13463 203357 265577 292271 225133 139494 67388 -17869 -23461 38861 -28159 -67577 -11623 -117224
13451 -117224 -102311 -98682 -36555 45026 -48968 -13868 14316 -54073 -70378 -56919 26927 22871
13439 22871 -103886 -78071 11034 28215 24764 -36022 -62850 -99178 -85807 44283 101944
13428 101944 72882 56131 29647 44633 104120 32194 61703 112358 163399 160937 126315 97685
13416 97685 765 22730 81149 47521 -12337 -91650 -212648 -167418 36082 214382 215781
13405B15781k7281j49861p5301R9516Q3271k8714r1903M3884K9735n8151q6325
13394d5349P8334K0390L7756j23885n5712M8345M0320N6679n6386p3484K4562
13383d8430J04962O568K3461q268j24023J8773k2138N0119J02424M8991l5411
13372A17028j0483k0875n3615l3696r9194J01431R3403J48258N361q5602J03543
13361B65559l4149l2552j15527j29369j6450L4825q475N4549j1084J08393K7387
13350A43107o7593J11526p1047j02145R1541l37j22962l2340O9956R4503j1512
13339A02697J2832l2989R1593k7533o1860J42207Q7556j98443j25213N3324K2421
13328F6592j05250j01672P5311Q045J57722O2756K4646J6005r7331k3607J01508
$$ plain form
13405 215781 188500 38639 -36662 62854 146125 117411 25508 69392 99127 40976 -45349
13394 -45349 32985 53375 91131 -32754 -88466 -40121 199 56878 492 -72992 -48430
13383 -48430 56532 63100 86561 78293 -45730 -26957 -49095 1024 103448 152439 117028
13372 117028 106545 85670 32055 -1641 -100835 596 93999 242257 247618 162016 265559
13361 265559 231410 198858 83331 -46038 -62488 -27663 -36138 18411 7327 115720 143107
13350 143107 75514 187040 115993 13848 105389 105052 -17910 -50250 19706 114209 102697
13339 102697 115529 82540 174133 146600 84740 226947 314503 116060 -9153 44171 66592
13328 66592 -38658 -140330 -65019 -56974 100748 163504 188150 204155 106824 83217 184725
13317A84725J56169p0244n3650q5181j55625K8600J31192M0359N7519j1299r2792
13306A29773j62524o0419J7818L5296K7110K7504n6915L055J01684q7122k825
13295b7565O0235P2089q1261N0035P8821K4868m9685j6388q0562p8938L8510p1601
13283h1442O305R6848O7335K704O2450L6930M8629p0228q9035J8411n92j29522
13271c1207K2829K4619R1903n670q6002j03533M5541m455k2457Q5840N627J7923
13259D0958N9615J23281j7361o9830k1731m1302l0529L277j26690j2914k5501
13248a18727n0418R7490J74363k3220q6817o9428k9929J02808P4872j8788q7611
13237c5405P9614K52095r6401k43761J1510J23265P692o3305l2280L2518Q5448
$$ plain form
13317 184725 340894 270650 217000 131819 -23806 4794 135986 176345 233864 222565 129773
13306 129773 -32751 -93170 -75352 -40056 -12946 14558 -42357 -39302 62382 -24740 -27565
13295 -27565 32670 104759 23498 73533 152354 177222 127537 111149 30587 -48351 -9841 -81442
13283 -81442 -75137 21711 89046 91750 154200 191130 239759 169531 80496 98907 98315 -31207
13271 -31207 -8378 16241 108144 102474 16472 -87061 -41520 -45975 -68432 17408 23035 40958
13259 40958 100573 223854 206493 136663 114932 73630 43101 46378 -80312 -93226 -118727
13248 -118727 -169145 -71655 102708 79488 -7329 -76757 -106686 -3878 70994 52206 -35405
13237 -35405 44209 296304 199903 -43858 -32348 90917 98609 35304 3024 35542 120990
13226A20990O1255p2566p4994n3274J33619J24496j641q0380j5535k9352k6886
13215H5732j62657q8413J01688K25291K0836K00636J37804r2888k14838J30297
13205C43488J569j62510r5736n2144l1711m214m8513l2988p1838j2733K7747N0870
13193h8713M2556P5856j12880O6179J00524J87894J00646J20311J0602r9779j16444
13182B86752r4711p8511j3292r0165k0075K8052R4967R9932r7807L5047Q669k0726
13170A38132L2753N963N384J48370K3105j53984j78267K6956q78k6442K9634p9180
13158b8454m3208p177n7079M0672J08585Q5125k987o3254n2994J7493N5353O0719
13146A12794M6441P5326j5343p367J19199J63622J0349j37334k3494k5353L5365
$$ plain form
13226 120990 182245 109679 34685 -18589 115030 239526 237885 157505 141970 112618 85732
13215 85732 -76925 -165338 -63650 161641 182477 383113 520917 428029 213191 343488
13205 343488 345057 182547 86811 34667 2956 -1258 -49771 -82759 -154597 -167330 -139583 -88713
13193 -88713 -46157 29699 -83181 -17002 83522 271416 372062 492373 502975 403196 286752
13182 286752 192041 113530 100238 10073 -10002 18050 113017 212949 115142 150189 158858 138132
13170 138132 170885 176848 182232 330602 353707 199723 21456 48412 47534 21092 50726 -28454
13158 -28454 -71662 -78839 -135918 -95246 13339 98464 95477 32223 -20771 -3278 52075 112794
13146 112794 159235 234561 219218 211851 331050 494672 505021 367687 344193 318840 354205
13135C54205j8340J8484N7554j068P9711m1954k3231J38435J13701J08455R6615
13124H82567M5594K32916J65532J30208J01492K48093J37372j10973q9549k09976
13114A533276k85454k21735r7874r5636O2375M3272j24035p9457n8769J28168
13104H04131J92030m2231O3468P1088l1602N1585J0234J7090J32670J07564R3444
13093A469471J52103P1580M5213P0798K6187K2832P2345k3723m2991k20244k69615
13082A373956j32624j13257K1313M4548m73l1971p7582j49888j2130Q5491l4317
13071I73066j61510q634N1267J13219L3205p7108l6473M1636J45480R3553N7877
13060A225578J31882J70401J89036R5038J28990j8704l9686k61974l50055k14903
$$ plain form
13135 354205 335865 354349 411903 410835 490546 448592 425361 563796 677497 785952 882567
13124 882567 928161 1161077 1326609 1456817 1558309 1806402 1943774 1832801 1743252 1533276
13114 1533276 1247822 1026087 928213 832577 894952 938224 814189 734732 675963 804131
13104 804131 996161 953930 1017398 1088486 1056884 1108469 1118703 1135793 1268463 1376027 1469471
13093 1469471 1621574 1693154 1738367 1809165 1835352 1858184 1930529 1906806 1863815 1643571 1373956
13082 1373956 1241332 1128075 1149388 1193936 1193463 1161492 1083910 934022 921892 1007383 973066
13071 973066 811556 802922 854189 967408 1000613 923505 887032 928668 1074148 1167701 1225578
13060 1225578 1357460 1527861 1716897 1811935 1940925 1922221 1882535 1620561 1270506 1055603
13050A055603k05229k16861n0954p8126j51505o6137J66505n6468n9188k6763
13040C10877r6380M0922r8945j2883M4926J7969o3826L217O3304J00928j2355
13029B97754K3337L8660m1669K1260k7091j04509j1703J08731p9772j35528j8673
13018G0797K1262n7297K8001k6264L1044P9528J5224j0687k5048L8377o6612p9559
13006A8766L9288L6703J2235K870j06474L1069K882j2006M9724k0843M1019O0617
12994A55850J9837O3739o5756k9427L9026j3457j0307P9554J6218k3086l8834
12983A93357o1244l8203J3703L4612K4565k2484K3190N614j7981M8045m4976n3747
12971A04451j6324m9054r002M8343P6255j27907o0343j5881N2062N5885L8693
$$ plain form
13050 1055603 850374 633513 582559 504433 352928 286791 453296 396828 337640 310877
13040 310877 214497 255419 156474 143591 188517 206486 142660 145877 209181 310109 297754
13029 297754 321091 359751 318082 339342 312251 207742 196039 304770 224998 89470 70797
13018 70797 92059 34762 62763 36499 67543 147071 162295 151608 126560 164937 98325 18766
13006 18766 58054 94757 106992 109862 3388 34457 37339 25333 75057 54214 95233 155850
12994 155850 175687 239426 173670 144243 183269 169812 159505 239059 255277 232191 193357
12983 193357 132113 93910 107613 142225 166790 144306 167496 173110 155129 203174 158198 104451
12971 104451 88127 39073 30071 78414 154669 26762 -33581 -49462 2600 58485 97178
12960I7178Q2869l3152r8840N4822J30701n716j19817n1649j7542P1598R752J04131
12948B24335J8044o8776r5496J9280r0857q5258J16352N3773o1220n5033m6158
12937g1014j2507J62245K9313o4394P0961R2780j02163j46978M3849J48749R407
12926A60248J9171J6991j1611o1634k8807J49386Q4190J0790j02886p6514m2008
12915A17316k1381J32566N7282r3860m5799l4454P7569P7793J62393L8855k18878
12904B49402j80424l3530P5183K5196J29219K48811P6403j46552j16265K5027
12894C52470l6841O0199K3016N0896k2258K3890M0949J1117j17240j23773J7123
12883B79548O9719M9298j44968j56933l5468N5451J23176L1890m0772P1692m1623
$$ plain form
12960 97178 180047 146895 48055 102877 233578 227862 108045 56396 38854 110452 120204 224335
12948 224335 242379 173603 78107 97387 6530 -78728 37624 91397 30177 -24856 -71014
12937 -71014 -83521 78724 108037 43643 114604 207384 105221 -41757 2092 150841 160248
12926 160248 179419 196410 184799 123165 94358 243744 327934 338724 235838 159324 117316
12915 117316 95935 228501 285783 191923 146124 111670 189239 267032 429425 468280 249402
12904 249402 68978 35448 110631 135827 265046 513857 590260 443708 327443 352470
12894 352470 315629 375828 398844 449740 427482 451372 492321 503438 386198 262425 279548
12883 279548 349267 398565 253597 96664 61196 116647 239823 271713 230941 302633 261010
12872B61010q0230l537j0452l70Q6513m3375k3195K257P2799m998o3396M1585
12860B34611J58209O0175j6818P4909j3091K7363m1586N2503o1087j45175R995
12849C40008L5199o4580j03274K9411J61509J1511m743q0548m1647L2507P6655
12838C92008n7013J37634l3859o7713m1696m9651P5607r0470j23567Q8646R8106
12827C28032l9797k5384j7680Q8363O4698P6464K2290n0421n0628N8990R8074
12816E53001j1783p5404j05114O6203J6717L9256K7396J14002R0642M4121K8397
12805G87434k8446l3902R4511Q5704O3585M3890j24496J9764l8608L4082O6582
12794I70100J49163J80332K3652L2830L1632m6759j35086j36026j17830n1346
$$ plain form
12872 261010 180780 177243 166791 166421 252934 209559 186364 188621 261420 256422 193026 234611
12860 234611 392820 452995 436177 511086 497995 525358 483772 536275 475188 330013 340008
12849 340008 375207 310627 207353 236764 398273 409784 405041 324493 282846 315353 392008
12838 392008 334995 472629 438770 371057 329361 279710 355317 264847 141280 229926 328032
12827 328032 288235 262851 245171 333534 398232 474696 496986 446565 395937 454927 553001
12816 553001 541218 465814 360700 426903 443620 482876 510272 624274 714916 759037 787434
12805 787434 758988 725086 819597 905301 968886 1012776 888280 908044 869436 903518 970100
12794 970100 1119263 1299595 1323247 1356077 1387709 1340950 1205864 1069838 952008 900662
12784I00662o4183J8197P4030L7510Q5282O5214Q841j63365j50471p2931J0531
12773G49317l046m752M9595R250l5358m6640O8587N9478P9107Q5612M0767K2931
12761A074848R7723J50558R6291J7207O6373n7598M4835l4950J5596P3169J25809
12750A669861j7553p9907P98Q018Q3739J13031J75784J53609L63o660L551N7154
12738B161788L0139P5687Q2539O08o2983l0385j3562k9487M0993J8756j5276R1125
12726B349942J79686K05309R3334m1074O3982J16362R2735J23648K03663M3297
12716C430884K00292J37722n5959L8522J58586K38750K34888J29957P9729Q0019
12706D673390L48736K39388R8534K33718K71912K81768L31245M96976O18619O41488
$$ plain form
12784 900662 836479 854676 928706 966216 1051498 1116712 1125553 962188 811717 738786 749317
12773 749317 746271 741519 791114 800364 765006 718366 786953 846431 925538 1011150 1051917 1074848
12761 1074848 1172571 1323129 1419420 1436627 1503000 1445402 1490237 1455287 1470883 1544052 1669861
12750 1669861 1652308 1572401 1573199 1581217 1664956 1777987 1953771 2107380 2107743 2101083 2104634 2161788
12738 2161788 2191927 2267614 2350153 2350761 2287778 2257393 2243831 2214344 2255337 2274093 2258817 2349942
12726 2349942 2529628 2734937 2828271 2787197 2851179 2967541 3060276 3183924 3387587 3430884
12716 3430884 3631176 3768898 3712939 3751461 3910047 4148797 4383685 4513642 4593371 4673390
12706 4673390 5022126 5261514 5360048 5593766 5865678 6147446 6478691 6975667 7594286 8235774
12696H235774Q62947R29830R62038J102861J496941J723795J982360K164196K515166
12687B1975908K698116K641541K968781L087222L216702L477084L732011M114599
12679D7911964N142948O234118P768625J0058925J3101406J6865621K1022450
12672A28106057K4593702K6934109K8250657K8739557K7606453K0990739M889975
12665B90111249j7880375l6285057m1603962l6134779k6450400j7417097j0036973
12658A04302606m329143j86970K856356N029275O719094Q026532R140799J0077688
12650A41636237J0282836R551484R172782J0626723J4741034J9856635K4994611
12643B40862342K8626029K8780876K5390798K0186575J6067700J4018150J1043942
$$ plain form
12696 8235774 9098721 10028551 10990589 12093450 13590391 15314186 17296546 19460742 21975908
12687 21975908 24674024 27315565 30284346 33371568 36588270 40065354 43797365 47911964
12679 47911964 53054912 59289030 67057655 77116580 90217986 107083607 128106057
12672 128106057 152699759 179633868 207884525 236624082 264230535 285221274 290111249
12665 290111249 272230874 235945817 194341855 158207076 131756676 114339579 104302606
12658 104302606 99973463 99786493 102642849 107672124 114391218 122417750 131558549 141636237
12650 141636237 151919073 161470557 170643339 181270062 196011096 215867731 240862342
12643 240862342 269488371 298269247 323660045 343846620 359914320 373932470 384976412
12636C84976412J727558j7388700l6892403m2798042l5264348k3517246j3879944
12629B16963287p448163m065112l139382l574490n670395q935277j0893945j0337429
12621A62899094p558523m366322k196372j707362k798331m057948k400285J694033
12613A39507984O903152J2702805J8828250K5013037K9681305L2659008L3963563
12606B99259104L2550866K5400412R266811j6289731m5411981o3546680o1153218
12599A80075583m7258380l3789594k3534378j6364370j1271368p832778n994013
12592C4030702m500695l559494k864835k263770j946803j816758j604914j444813
12584A4028620j180477r95561j020899q25924p46102p32935n34847n46593m55629
$$ plain form
12636 384976412 386703970 369315270 332422867 289624825 254360477 230843231 216963287
12629 216963287 209515124 205450012 202310630 198736140 193065745 184130468 173236523 162899094
12621 162899094 155340571 150974249 148777877 147070515 144272184 140214236 137813951 139507984
12613 139507984 146411136 159113941 177942191 202955228 232636533 265295541 299259104
12606 299259104 331809970 357210382 366477193 350187462 304775481 241228801 180075583
12599 180075583 132817203 99027609 75493231 59128861 47857493 40024715 34030702
12592 34030702 29530007 25970513 23105678 20841908 18895105 17078347 15473433 14028620
12584 14028620 12848143 11852582 10831683 10005759 9259657 8526722 7991875 7445282 6989653
12575F989653m92982l06446l20687l56884j81577k58461j61117k13374k57557
12566D440568j42756j86774l42251k11004j55506r0443j79972j08875M0855j27205
12556B936637j36861p2578j63328j16037j66815L7703J6263n044j17565o4713
12546B147662n0264o9936p1750r1284o8292j15662o6788L1164o9181O8071Q0689
12535A724429m9050J7475Q6626n4860k47824O7629K6407o3025k0474k5839m5180
12524A416314j9820j34954p3263P768o3485j60768N5996j6780j44292K0691p1593
12513H15814j5532L4763L2437l7590J39968J33114L1911R006P6499M0318o3453
12502A197255K3001r6040o7327l8116O804K5605R9898N5584p9788o2838N7003
$$ plain form
12575 6989653 6496671 6190225 5869538 5512654 5331077 5072616 4911499 4698125 4440568
12566 4440568 4297812 4111038 3768787 3557783 3402277 3311834 3131862 3022987 3063842 2936637
12556 2936637 2799776 2727198 2563870 2447833 2281018 2318721 2334984 2329940 2212375 2147662
12546 2147662 2097398 2027462 1955712 1864428 1796136 1680474 1613686 1644850 1575669 1643740 1724429
12535 1724429 1675379 1692854 1779480 1724620 1476796 1544425 1570832 1507807 1487333 1461494 1416314
12524 1416314 1396494 1261540 1188277 1196045 1132560 971792 1027788 1011008 866716 887407 815814
12513 815814 800282 835045 867482 829892 969860 1102974 1134885 1143891 1220390 1260708 1197255
12502 1197255 1220256 1124216 1056889 1018773 1025577 1051182 1151080 1206664 1126876 1064038 1121041
12491A121041R3814Q2760P7177N9874J94076K10841R2375J26652J28124P3979
12481B260713J28772R7670j24474k03789k34631k71354k87584q567R109j37650
12471A228215o3054l4806m3340m8076r3411j4811j29J8906P0749o9272n8660n7965
12459H34346j58772n6980K2202q1142J7852M9200j4951j8182o5049o5345R0887
12448E54066J41090L1076o103r4286J00778J0627l3417n4162j1640L0208P2425
12437G40662L3049p257M1322o7421M2956J05024j55181j5559N5744o8462j56573
12426E48304n2440j2198Q1573R3918n7876M8889J74159J2343o2963o0485o4750
12415F48474P4536J11276M6481k0935L7705O085N8610M9344J4746l7411L033Q390
$$ plain form
12491 1121041 1214855 1297615 1374792 1434666 1628742 1839583 1931958 2058610 2186734 2260713
12481 2260713 2389485 2487155 2362681 2158892 1924261 1652907 1365323 1356756 1365865 1228215
12471 1228215 1165161 1130355 1087015 1038939 945528 930717 930588 949494 1020243 950971 892311 834346
12459 834346 675574 618594 640796 559654 577506 626706 611755 593573 528524 463179 554066
12448 554066 695156 726232 720129 625843 726621 737248 703831 649669 638029 668237 740662
12437 740662 773711 766454 807776 740355 783311 888335 733154 717595 773339 704877 548304
12426 548304 495864 483666 565239 659157 601281 650170 824329 836672 773709 713224 648474
12415 648474 723010 834286 880767 859832 897537 903622 962232 1011576 1026322 988911 991944 1000334
12403A000334n8562n7506m6059j15938r8076K6167R1332p0123n0813L3060L3875
12392F87691J3786n2170k3767N6309J06913k0458n3543J0356J37015N1550p3385
12381H40297q3885J1974p6955P315J5593N729L0492k3491j16747K2135J17942
12370G50399M8732N7898j01288R2389J61136K8484J11305L4225j52241j57907
12360H73132j11588L6246L8572J32894L0542m1434L4075J57112O1365M393n3153
12349A162156J00711L5571M072J64630P6003L7118N1911j4691K88996L54630K91108
12338B552215J74925J01716O1657J4172p9653l78691k58911k36459j12958j46342
12328A691671K5141j66292j02960K6476m0581j6561k2732o8933j02699m9120O3374
$$ plain form
12403 1000334 941772 884266 838207 722269 624193 650360 741692 671569 620756 653816 687691
12392 687691 701477 649307 625540 681849 788762 768304 714761 725117 862132 913682 840297
12381 840297 756412 768386 691431 698746 714339 720068 750560 727069 610322 632457 750399
12370 750399 799131 857029 755741 848130 1009266 1037750 1149055 1183280 1031039 873132
12360 873132 761544 797790 836362 969256 999798 958364 992439 1149551 1210916 1215309 1162156
12349 1162156 1262867 1298438 1302510 1467140 1543143 1580261 1632172 1617481 1906477 2261107 2552215
12338 2552215 2727140 2828856 2890513 2904685 2825032 2446341 2187430 1950971 1838013 1691671
12328 1691671 1716812 1550520 1447560 1474036 1433455 1416894 1394162 1325229 1222530 1173410 1236784
12317A236784N3312k2226m0960n3256o8762r379P2769N5948l9100J1419K5081
12306A221630O6053K0056J5398j393J01075l6951l0654J01167O998m284n6533
12295A402562K0143K0253L639q3002L4030L5041j05799M3842N651q6480l5485
12284A254395n0657J52198J95188Q2252P1247M4758n0243Q5292O1013Q1115J82889
12273B109447N3385R6365N2502j01670M1466J25158K7928O5700J58950j7552r922
12262B601757M3774J13132R1364J60697L06184L41128J95674O9920J33450J28049
12252D185129K36307K24585L31121M10522N50839N44340P32007O11584O40088
12243H466522P81619Q95994J200577J582369J800927K052762K213346K691520
$$ plain form
12317 1236784 1290096 1267870 1226910 1173654 1104892 1095513 1168282 1224230 1185130 1196549 1221630
12306 1221630 1287683 1307739 1323137 1321744 1422819 1385868 1355214 1456381 1463379 1459095 1402562
12295 1402562 1422705 1442958 1446597 1363595 1397625 1432666 1326867 1370709 1376360 1289880 1254395
12284 1254395 1203738 1355936 1551124 1633376 1704623 1749381 1699138 1784430 1845443 1926558 2109447
12273 2109447 2162832 2259197 2311699 2210029 2251495 2376653 2404581 2470281 2629231 2611679 2601757
12262 2601757 2645531 2758663 2850027 3010724 3316908 3658036 3853710 3923630 4057080 4185129
12252 4185129 4421436 4646021 4977142 5387664 5938503 6482843 7214850 7826434 8466522
12243 8466522 9248141 10144135 11344712 12927081 14728008 16780770 18994116 21685636
12235B1685636K860238L045835L329500L638536L780388L970865M320890M930418
12227E1562306N558278O460018P641559R291235J1800282J5118441J9318634K4433582
12219A51184335K9624508L3545696L6141129L7654661L7561219L2483365J7595739
12212C75790652p777963l5078041n1718151n3173079m3636337l0078407j8049440
12205A36279234r129254l114606J183091M103680N996898P093805O485583M788525
12197A53686956L933163N491505Q630383J1711365J4050223J6006524J6855173
12190B30365292J5192427J1065423P104066O516428J0949338J7839934K3575364
12183C22608272K5577379K2800021J4423362N75529j6010822k8553677l2803068
$$ plain form
12235 21685636 24545874 27591709 30921209 34559745 38340133 42310998 46631888 51562306
12227 51562306 57120584 63580602 71222161 80513396 92313678 107432119 126750753 151184335
12219 151184335 180808843 214354539 250495668 288150329 325711548 358194913 375790652
12212 375790652 368012689 332934648 281216497 228043418 184407081 154328674 136279234
12205 136279234 127149980 124035374 125218465 129322145 135319043 142412848 148898431 153686956
12197 153686956 157620119 163111624 171742007 183453372 197503595 213510119 230365292
12190 230365292 245557719 256623142 263727208 270243636 281192974 299032908 322608272
12183 322608272 348185651 370985672 385409034 385984563 369973741 341420064 308616996
12176C08616996l1497179k9541881k8263020k6802375k3893439j9193011j3707426
12169A35718665q791377n263761k940616j955526k767948m598575n275505l429709
12161A00695648K02746M499752Q699821J2602644J6599783K0241212K2831374
12154A86372980K3562935K2724776K0652047J5627843L021912j8267848l8620043
12147B15074602m6514997m1651191l1694151k2490501j5783588j1184547p992184
12140C7763443n793178m526914l870158l196264k541640j960863j648831j474233
12132A2751362j222806q71390p06509n77413n81905n66707n43099n45598l36254
12123F799681k33063m20392l74896k80480j62021k13695k71291k91596l89439
$$ plain form
12176 308616996 277119817 247577936 219314916 192512541 168619102 149426091 135718665
12169 135718665 126927288 121663527 118722911 116767385 113999437 109400862 104125357 100695648
12161 100695648 100898394 105398146 114097967 126700611 143300394 163541606 186372980
12154 186372980 209935915 232660691 253312738 268940581 271962493 253694645 215074602
12147 215074602 168559605 126908414 95214263 72723762 56940174 45755627 37763443
12140 37763443 31970265 27443351 23573193 20376929 17835289 15874426 14225595 12751362
12132 12751362 11528556 10657166 9950657 9373244 8791339 8224632 7681533 7135935 6799681
12123 6799681 6566618 6146226 5771330 5490850 5328829 5115134 4843843 4552247 4162808
12114D162808k38135j34653k30458j55290n7211N863p0363k11400r4268R144j3971
12103B972066j95192j68300l4304M6080j22312m2193k9749J5365L4097j79647
12093B295911k76909j15743m5649j4103p211R891q3599l4170J37942k8381J2593
12082A850572m0916o1755j10806r4255l8121J4208l749L7219p7183j26250j55118
12071A193846o8285j0434R1771l6456k46218R468O0869k4009k6554L1943K3544
12060I99485j22879P8407r5492j68538k0446J46619R8318p2370o7984J07340J72311
12049A054771p9993j02261m0250o503J37781L1353m1894l8326o8709r1536M9699
12038H04132M4695n3518O6854k4885K3365q0909K4412l2812k0490N9755M8904
$$ plain form
12114 4162808 3924673 3790020 3559562 3404272 3347061 3352924 3282561 3071161 2976893 2986037 2972066
12103 2972066 2776874 2608574 2574270 2620350 2498038 2455845 2426096 2441461 2475558 2295911
12093 2295911 2019002 1903259 1857610 1843507 1836296 1846187 1762588 1728418 1866360 1837979 1850572
12082 1850572 1809656 1747901 1637095 1542840 1504719 1518927 1515178 1552397 1475214 1348964 1193846
12071 1193846 1125561 1115127 1206898 1170442 924224 933692 994561 970552 943998 975941 999485
12060 999485 876606 955013 859521 690983 670537 817156 915474 843104 775120 882460 1054771
12049 1054771 974778 872517 832267 825764 963545 994898 953004 914678 845969 754433 804132
12038 804132 848827 795309 862163 837278 860643 779734 804146 771334 750844 810599 859503
12027H59503K9247n6354p2307o514l8289J40602R6967j13703K995J5056o5204
12016G91999j79365j4001N7038o896j04058P381Q0380P3595L630j01308j42192
12005D66203j0352N2850N166J8568k7698M8671K6954k780j5379m7931Q8232O6777
11993F69281J8609R1407L5413o2301n5958p3j5072n7254N0591J95184K03373j2212
11981A060988J171n6583r8744M7931k4068j34794j28951r516p4873O6420J5138
11970F64119j0083P9370q5335m6858Q9117J35470M8296n927k7222n540R5736N9712
11958I90855P6968J01271P2937q8092j27434j5562R1347j03817j22635J4053N3322
11947I43213J100O0984o8071j08910n4077l8318K0892M7337n173M7940q5454p9421
$$ plain form
12027 859503 888750 832396 760089 753575 715286 855888 952855 839152 842147 857203 791999
12016 791999 612634 598633 655671 648775 544717 552098 632478 706073 709703 608395 466203
12005 466203 455851 508701 513867 532435 504737 553408 580362 577582 562203 514272 602504 669281
11993 669281 687890 779297 814710 752409 696451 696378 681306 624052 674643 869827 1073200 1060988
11981 1060988 1062159 1005576 906832 954763 930695 795901 666950 657434 582561 648981 664119
11970 664119 654036 733406 648071 601213 690330 825800 874096 868169 840947 835407 931143 990855
11958 990855 1067823 1169094 1242031 1153939 1026505 1010943 1102290 998473 875838 889891 943213
11947 943213 944313 1005297 937226 828316 774239 735921 756813 804150 798977 846917 761463 682042
11935F82042r8052j51743J2162J08057M6434M2260J13669j94146j3729J19636
11925F66590J90446J02917L5428j20422r5997L7820M2110n825j55535j43234k48427
11914C05871j9901Q8829R4213N9759r9443l4815L2024n918r6767J6229M5373n0973
11902C34481N0100j6431J2141N8474N8640l202r1033m9135L0581m3860M013N2156
11890C96925r7661j30765J07487J34895p4043k6645j3224l5778m2266m6191L6787
11879B09521Q4323J8021p8318J17442o0263J7026O1018L1875j5491K2629J01724
11868E09507N1393n6651j24282k0592j26625j01347O4952r5346o0501J30233P4476
11857B45217k084p0449j06732J0961L1928L2846l3389Q3450J92803r149j30618
$$ plain form
11935 682042 583990 432247 444409 552466 598900 641160 754829 560683 546954 666590
11925 666590 857036 959953 995381 874959 778962 816782 858892 853067 697532 554298 305871
11914 305871 285970 374799 469012 528771 429328 394513 426537 420619 323852 340081 385454 334481
11902 334481 384581 368150 380291 438765 497405 494203 403170 354035 384616 340756 344769 396925
11890 396925 299264 168499 275986 410881 336838 310193 296969 261191 218925 172734 209521
11879 209521 293844 311865 233547 350989 290726 307752 368770 400645 385154 407783 509507
11868 509507 560900 504249 379967 359375 232750 131403 196355 101009 40508 170741 245217
11857 245217 243133 172684 65952 76913 108841 141687 108298 191748 384551 375402 244784
11846B44784j30625L0708P5107K4383m4774J1084Q8120L2646j2604p5806J0359
11835B53382j53313n2777R807o4760n9567q9417J61272J47070M9041l9859q101
11824A52778j18839K1798k4184O8322J62439r4281j7592O558L6496N1737j8020
11813B27212M7730r1864K6065J00902L339k6214n7561j30513m9854K3582Q1497
11802A54321K7006J82045P4829J9508j1564j01492j28024Q5420O0962N7016j9989
11791D00038P8499M1210r1121j2848N7663j5163N1773O7028J86314J26748J24704
11780A014845J71233O9468J60592J93662R5244P1094K452j12667k12548j94938
11770A258437o4726j00505k16725j5114L3601m0665J21851P8164P8941j04260
$$ plain form
11846 244784 114159 144867 219974 244357 199583 210667 298787 331433 318829 243023 253382
11835 253382 100069 47292 57099 -7661 -67228 -156645 4627 151697 200738 160879 152778
11824 152778 33939 55737 31553 99875 262314 168033 150441 156999 193495 245232 227212
11813 227212 274942 183078 209143 310045 313384 287170 229609 99096 49242 72824 154321
11802 154321 181327 363372 438201 457709 446145 344653 216629 302049 363011 420027 400038
11791 400038 478537 519747 428626 415778 473441 458278 510051 577079 763393 890141 1014845
11780 1014845 1186078 1255546 1416138 1609800 1705044 1776138 1778590 1665923 1453375 1258437
11770 1258437 1193711 1093206 876481 861367 894968 854303 976154 1054318 1133259 1028999
11760A028999j02195K3582J19951J41119j2481J81853P1708L2446J3144P569L8195
11749A543890Q880Q8956J34448O5047N1753M6110J7711j76648k75185q2413O3878
11738A486427q9036j65757j20105j09480o9441P7116k14628l6691O0099q664K9768
11727H39608j6497K4734j7461q1746m7106p2353N4550J23308J07624K12809J69252
11716A296722J81016N1679K8764m3351q5033j10773k22565k12813k71645j12521
11706D99480k8972o4709k3664j30546l339J7663O2417m2006O0005k9234J23302
11695D40397n7698j35712j29601r6154m0665R0105M6454l4378q5529n174J19523
11684A11568k0916k422l6807l1303M564M8205j4930n5754J3949P6657m4099K9776
$$ plain form
11760 1028999 926804 950386 1070337 1211456 1198975 1380828 1452536 1484982 1498126 1505695 1543890
11749 1543890 1552770 1641726 1776174 1841221 1892974 1939084 1956795 1780147 1504962 1422549 1486427
11738 1486427 1397391 1231634 1111529 1002049 932608 1009724 795096 758405 818504 809840 839608
11727 839608 823111 847845 830384 748638 701532 629179 683729 807037 914661 1127470 1296722
11716 1296722 1477738 1529417 1558181 1514830 1429797 1319024 1096459 883646 612001 499480
11706 499480 470508 405799 382135 251589 248250 265913 328330 286324 346329 317095 440397
11695 440397 382699 246987 117386 21232 -19433 70672 117126 82748 -2781 -7955 111568
11684 111568 90652 88230 51423 20120 24684 72889 57959 2205 16154 92811 48712 78488
11672G8488j4385j35569J9275M1513J35331j62q5104Q612R6666M4702O8491k8932
11660B28926o992r892q4295j8149N9748J43728J50942R2294J08157J7209M0473
11649G22149j9959o1818j5118r7499k30191k300M519k7978m5970L9886P794l6919
11637B36596j4270p5391j8930P0934M6874j3031P7581q9696O8626o234r411R605
11625B83253m474P6604L3824Q6628R1080r2110l2813j39199Q4534L6148j44176
11614B79299p0998o945M4896P9920Q7287p879j306O6826j12812j47830o6402J0309
11602A54365J1954L3716k6870m7056P561J30328M2113j3074m6307m5089m0971
11591A60670R8397J43501P9949N255l8804l2236J06854J3929j04055j61965o5329
$$ plain form
11672 78488 64103 -71466 -52191 -10678 124653 124491 39387 47999 144665 189367 257858 228926
11660 228926 221934 212042 127747 109598 169346 313074 464016 556310 664467 681676 722149
11649 722149 702190 640372 625254 527755 297564 295264 299783 271805 225835 265721 273515 236596
11637 236596 222326 146935 128005 198939 245813 232782 310363 220667 289293 283059 273648 283253
11625 283253 278779 355383 389207 475835 566915 474805 441992 302793 387327 423475 279299
11614 279299 208301 201356 246252 326172 413459 405580 404274 471100 358288 210458 144056 154365
11602 154365 166319 200035 173165 126109 133670 263998 306111 293037 246730 201641 160670
11591 160670 259067 402568 482517 487772 448968 416732 523586 537515 433460 271495 206166
11580B06166J61342P4324j32220j67234j06016L154K5851j7500o3013R3331P0415
11569A48600J6588k6622k12763j26110R0196J08397P9725J35045l1625p4521M4952
11558A51862j34008p9580p1784J14730M7896N0933m1650j10504K5525O5631L8892
11547E7943n7567l1340j0917j7145J28836L9738o4140k0051K3502L6254k4256
11536F0857o2356m1196K3164l0410m6891N1045K778J470r759l4209o563K867K2483
11523f6720J14955R0079o3113k32206n8820O2283P9304J46585M0927m2866M7398
11512A17806m1884j9090P1106R899j00757K893o6285m5715K0972L0284Q9043N8763
11500A27035O6253m2035k705J7621j34986j5134J25504M6224M5953l8107r5704
$$ plain form
11580 206166 367508 441832 309612 142378 36362 39516 65367 47867 -15146 78185 148600
11569 148600 165188 138566 -74197 -200307 -110111 -1714 78011 213056 181431 106910 151862
11558 151862 17854 -61726 -133510 -18780 29116 80049 38399 -72105 -46580 19051 57943
11547 57943 376 -30964 -41881 -59026 69810 109548 45408 25357 48859 85113 60857
11536 60857 -1499 -42695 -19531 -49941 -96832 -45787 -43009 -41539 -51298 -85507 -92070 -89203 -66720
11523 -66720 48235 138314 75201 -157005 -215825 -153542 -74238 72347 113274 70408 117806
11512 117806 75922 56832 127938 137837 37080 39973 -26312 -72027 -51055 -20771 68272 127035
11500 127035 193288 151253 148548 166169 31183 16049 141553 187777 233730 195623 99919
11489I9919l8539r0256r0837L0881R4399Q4948J44070J09957l1065j70415q6757
11478E6305p3773M780J52269P2372j44096j20770J32487Q9156l3923r9778k32884
11467a97855m9347J8673K29448O9754l9441M5527j8247j05979j5450J14595Q3923
11456A35601J29931J7689l2986N678j02414J9201p7353k0671q366l6462J09138
11445A38986K3678l7847l5271J0983M5655r5122K1199P3923p1422j48285O1762
11434a1761k7012j10765p5627k8107J88452M4189m6696J0762o3377L2346j4866
11423a02462n5816P1076j0441L5984K399m2273J42797L8838n4205p6991Q196j12739
11411a55637p587J27353J25556k3194j29381M3910N3234N3584P3011j2214r8203
$$ plain form
11489 99919 61380 -28876 -119713 -88832 5567 90515 234585 344542 313477 143062 56305
11478 56305 -17468 -12688 139581 211953 67857 -52913 79574 168730 134807 35029 -197855
11467 -197855 -247202 -228529 919 70673 31232 76759 58512 -47467 -62917 51678 135601
11456 135601 265532 283221 250235 255913 153499 172700 95347 74676 66310 29848 138986
11445 138986 162664 124817 89546 100529 146184 51062 72261 146184 74762 -73523 -11761
11434 -11761 -38773 -149538 -225165 -253272 -64820 -20631 -67327 -56565 -119942 -87596 -102462
11423 -102462 -158278 -87202 -97643 -61659 -59260 -101533 41264 80102 25897 -51094 -42898 -155637
11411 -155637 -163224 -35871 89685 66491 -62890 -18980 34254 87838 160849 148635 50432
11400E0432p0057J640O8370j0697n203j5218J37342J39355J6453r6989j62594
11389E2834j23764M4589P1702m0854o4021P180M3698L0480J9449p973K8682m3019
11377A8983p0734j5738K78507L5170l5376q8376r7377K7488j3245k2692J25239
11366A41849J5378j67311l1011Q566J04661O3267j57062k3505J31448l0600j2039
11355D3641M687K9055j8693j04492Q8723K5086k8005o4234j9090j0758L9950M7926
11343C3796p4124L8594N5388r3368l3553P740K9271l1367L147J22865J315j03569
11331d3865l7872q8809N4863M4099K5498p988n894K6740N1549Q039q1290j16227
11319a71157P9859M5303m6396n3639Q0172J2434r5190J1714P8163K4219Q5405
$$ plain form
11400 50432 -19625 -17985 50385 39688 34485 19267 156609 295964 312417 215428 52834
11389 52834 -70930 -26341 45361 4507 -59514 -52334 -8636 21844 41293 33320 62002 18983
11377 18983 -51751 -67489 211018 246188 210812 122436 25059 52547 39302 16610 141849
11366 141849 157227 -10084 -41095 -32529 72132 135399 -21663 -45168 86280 55680 43641
11355 43641 48328 77383 58690 -45802 42921 68007 40002 -24232 -43322 -54080 -14130 33796
11343 33796 -40328 -1734 53654 -39714 -73267 -65527 -36256 -67623 -64476 58389 59704 -43865
11331 -43865 -81737 -170546 -115683 -71584 -46086 -54074 -59968 -33228 18321 26360 -54930 -171157
11319 -171157 -91298 -45995 -92391 -146030 -65858 -53424 -148614 -136900 -58737 -34518 50887
11308E0887k5629j02378L1429O233k3351k6444J24319n1236n0281P9196O4755
11297G7500K757J6583L5523K3933l6379m1626N1579n467j20931J0802J26200m2203
11285I8271p5504j768N828P1276j7205J19357O6814j57052j19819j13631J7857
11274a05576p217k0560m6027m2653L7797P4959P2864j26616m5282R01j9103L9402
11262a87111j8532K1306J6934l1661N900J22479M0792m127M304j45192K9641L2115
11250a13152O2275O4704j11499k15464l228O587p737J59663J19846o5051n0661
11239a53717O4457k4065m6918Q6565J39921m4097k9263j00560M2969J13115M3752
11228I2159j36863m1623P6537P9420P7044r9992P575l5894Q3172J65989l5991
$$ plain form
11308 50887 25258 -77120 -45691 -39458 -62809 -89253 35066 -16170 -66451 12745 77500
11297 77500 80257 96840 132363 156296 119917 78291 129870 124403 3472 14274 140474 98271
11285 98271 22767 20999 26827 98103 80898 200255 267069 110017 -9802 -123433 -105576
11274 -105576 -112793 -133353 -179380 -222033 -184236 -109277 -36413 -163029 -208311 -207410 -226513 -187111
11262 -187111 -205643 -184337 -167403 -199064 -193164 -70685 -29893 -34020 -29716 -174908 -145267 -113152
11250 -113152 -50877 13827 -97672 -313136 -316364 -309777 -317514 -157851 -38005 -103056 -153717
11239 -153717 -89260 -113325 -160243 -73678 66243 22146 -7117 -107677 -64708 48407 92159
11228 92159 -44704 -86327 -9790 69630 146674 46682 54257 18363 101535 267524 231533
11217B31533n4078n9292K4159M3459M996l875l7612n614N115o7115M2076J05816
11205B29568N1663Q7393j48147j31923R5325l2148r7058M1918r9644L2851r364
11194B0434o3601j05440q3645k4715J08094J04243L0567O4357j02144k4936M134
11183g2652P2856o3995J4564n6765j02235J49267N8228q4698J4494P1217L0908
11172C1189O7310j5895j9232m0926l0724L7606o3003q5765q2033M9123P9237o3906
11160a37019k5668K4343K2547r2248j6273K03923J57727p5534L3815m6373l8563
11149A0677j9303j14947K5586J88150L9193l9380o3391o2298K7735K8412J32793
11138A53227o0737r4990P4278K7599n0335k8445M5327J6734P5747m7375n4487
$$ plain form
11217 231533 177455 118163 142322 185781 190777 186902 149290 143676 148791 81676 123752 229568
11205 229568 281231 368624 220477 88554 183879 151731 54673 96591 -3053 29798 20434
11194 20434 -43167 -148607 -232252 -256967 -148873 -44630 -14063 50294 -51850 -76786 -72652
11183 -72652 204 -63791 -49227 -105992 -208227 -58960 -732 -85430 -70936 281 31189
11172 31189 98499 82604 63372 22446 -8278 29328 -33675 -119440 -201473 -152350 -73113 -137019
11160 -137019 -162687 -138344 -115797 -208045 -224318 -20395 137332 61798 95613 49240 10677
11149 10677 -8626 -123573 -97987 90163 129356 89976 26585 -35713 -7978 20434 153227
11138 153227 92490 -2500 71778 99377 49042 20597 65924 82658 158405 111030 56543
11127E6543l9113J6959K4577k2917j32449J1444L188m9316K1233J26106J27939
11116A44194m6522j0565M588Q6060j4569p2766m3310k45518j487K17379J2821
11105C0305q0719j56139l9407M8615M8038O8060n581J49694M0484m8615K5833
11094H0568n6344j5391n6351J54793m7288q3287O6207k0975l6545m9479n1148
11083a15240l1473p8502j4739j08254K3229J25383Q6138J15875Q1077K524o0718
11072B5300k4081j8256m0310J32658R8116j14370p5551p0564o5926R0344N426
11061e7214m4748M7615P5783j16324n8952K0825J67173l69p5945O6437J48349
11050A72630r2316m2144m4496p3555k0241J23307J38758n3665j32406L554p812
$$ plain form
11127 56543 17430 34389 58966 36049 -96400 -84956 -81768 -131084 -109851 16255 144194
11116 144194 97672 87107 91695 177755 163186 90420 47110 -198408 -199895 17484 30305
11105 30305 -50414 -206553 -245960 -197345 -149307 -81247 -86828 62866 103350 54735 80568
11094 80568 24224 8833 -47518 107275 59987 -23300 42907 21932 -14613 -64092 -115240
11083 -115240 -146713 -225215 -239954 -348208 -324979 -199596 -113458 2417 83494 86018 25300
11072 25300 1219 -17037 -57347 75311 173427 59057 -16494 -87058 -152984 -62640 -57214
11061 -57214 -101962 -54347 21436 -94888 -153840 -133015 34158 33789 -42156 24281 172630
11050 172630 80314 38170 -6326 -79881 -100122 23185 161943 108278 -24128 -20574 -28386
11039b8386k5827j43238P9492m8601l629L4728o23R4668p9779k4151N1080K5250
11027f9016J12345N8130m2383j6737J47700P6580k0182j52746j28916M3771j552
11016F994p1828J70835P5419r9447j32832K1041l7416p6907m5743N4969k0904
11005a55819J5630L7128j7701n3432q7517m4170K1042O0806Q9399p496N6475J05644
10993A9989o9637J6798M0443K3249m4382o9988L1662l478J28717k1735l2774J4906
10981C3770m1541L4273n0298j27937j8300J7073M3901m5400j45987M8075J65172
10970h7199L9943o1151M9305m3831p791Q2260k6027j23414M1024J25647K8862
10959A7628K1249J821j40900j73142Q835O9324Q68O0676l9177l4588l0125Q6563
$$ plain form
11039 -28386 -54213 -197451 -117959 -166560 -170189 -135461 -136084 -41416 -121195 -145346 -94266 -69016
11027 -69016 43329 101459 59076 42339 190039 266619 246437 93691 -35225 8546 6994
11016 6994 -64834 106001 181420 81973 -50859 -29818 -67234 -144141 -189884 -134915 -155819
11005 -155819 -140189 -103061 -120762 -174194 -261711 -305881 -284839 -224033 -134634 -142130 -85655 19989
10993 19989 -49648 -32850 7593 30842 -13540 -83528 -51866 -55344 73373 51638 18864 33770
10981 33770 -7771 26502 -23796 -151733 -170033 -152960 -109059 -154459 -300446 -252371 -87199
10970 -87199 -47256 -108407 -59102 -102933 -110724 -28464 -54491 -177905 -136881 -11234 17628
10959 17628 38877 40698 -100202 -273344 -264509 -195185 -194317 -133641 -172818 -207406 -237531 -150968
10947a50968J77844K7015k7919N8685P5578R2163P901O484l4123m9640J6849K9155
10935B29024r0263r9357r1935j75496M1156R8292J37534M9826j5328q72n5792
10924B6789r669m6317o4686M0003P5656K4897l3761J4091p5812j04567k9906N8648
10912a24634N0450k1096O8284q4267q7959M5385K5090J61432J33819m371O140
10901A68273J10271j43084j18662J30195n0702r4890m1763J91209L7170m6102
10891A41915J1383p3944l9152N189M2451n0815k3628Q8144J27874j41818j37223
10880d9624n3140n7751k4658K6599j1479L6870L6217M3041K5320P9492j08979
10869e8092j50146j00593O1970P3223N4908P0357J39376J25010O3790J5468j31045
$$ plain form
10947 -150968 26876 53891 25972 84657 160235 252398 260299 266783 232660 183020 199869 229024
10935 229024 138761 39404 -52531 -228027 -186871 -88579 48955 98781 83453 82581 26789
10924 26789 17120 -29197 -93883 -53880 21776 46673 12912 27003 -48809 -153376 -183282 -124634
10912 -124634 -74184 -95280 -26996 -111263 -199222 -153837 -128747 32685 166504 162133 168273
10901 168273 278544 135460 16798 146993 96291 1401 -40362 150847 188017 141915
10891 141915 153298 79354 40202 45391 87842 37027 13399 101543 229417 87599 -49624
10880 -49624 -102764 -160515 -185173 -158574 -170053 -133183 -96966 -53925 -28605 50887 -58092
10869 -58092 -208238 -308831 -246861 -173638 -118730 -48373 91003 216013 279803 295271 164226
10858A64226j40383r9852k3035J66351N6707O469m0420j4851l8065l9899j4569
10847a7321o4036n5247Q0171Q362q4652m3991J11319k9791j1057L2339J15509
10836D1605J00936N7279j19240j09435p0308J24213l4725J4264j569K4700J4352
10825D2072q6360L5423R2927l0752p6451J6056K015J4269j61327P0700j2164N2848
10813d0744J58593P3650m633j30897r6758p4344J7867M6637L5845L893r3735O377
10801i8249k5182m2092J71514Q4547o8028K6030M3274O0476J8526j71066r7688
10790i7938K7204r212J2533o4790L7020k9871J5829K25026k7020m3863J4510J0552
10778F9980l8026L7776j5104J2930j29410j01294M7250Q278j5487j11963l9622
$$ plain form
10858 164226 23843 -76009 -99044 67307 124014 130483 90063 75212 37147 -2752 -17321
10847 -17321 -81357 -136604 -56433 -48071 -132723 -176714 -65395 -95186 -106243 -73904 41605
10836 41605 142541 199820 80580 -28855 -99163 25050 -9675 4589 3020 27720 42072
10825 42072 -44288 -8865 84062 53310 -23141 -7085 -5070 9199 -152128 -81428 -93592 -40744
10813 -40744 117849 191499 186866 55969 -40789 -115133 -97266 -50629 -14784 -10891 -104626 -98249
10801 -98249 -123431 -165523 5991 90538 22510 48540 91814 152290 170816 -250 -97938
10790 -97938 -70734 -79946 -67413 -132203 -95183 -125054 -109225 115801 88781 44918 59428 69980
10778 69980 31954 69730 54626 67556 -61854 -163148 -115898 -107620 -123107 -235070 -274692
10767b74692k3216M616M1529J05552Q2356Q941L9905o260R063k6519R3523Q6311
10755A41109r7500n0326R6126k3907p8310L1012O1159O4914l6045j4858q2210
10744A1164n0436k34932M6190K28809j6069J15084Q928p0477L0237p6261j22539
10733a30302q8686m3184P1728J00769k1076j24940L4055J28814O7516O6360n8168
10722B886M6351O7523N0826p1729q2866j81781r3794N3319J4141j5594Q6680K2528
10710a01510J26116M0008M6258k8240M4076L096m1615p6407m0309k2522j14081
10699a65130P4900O0798O3221q383j06305j19848o7641J19064K09480j00520n0031
10688i0395L0837N4581N066Q4660q4081m2987Q3659r7713j7402k8854k4643j4152
$$ plain form
10767 -274692 -297908 -293292 -251763 -146211 -63855 -54914 -15009 -21269 -12206 -38725 54798 141109
10755 141109 43609 -6717 89409 65502 -12808 18204 79363 144277 108232 93374 11164
10744 11164 -39272 -274204 -228014 795 -15274 99810 108738 38261 68498 -7763 -130302
10733 -130302 -218988 -262172 -190444 -89675 -110751 -235691 -201636 -72822 -5306 61054 2886
10722 2886 49237 116760 167586 95857 12991 -168790 -262584 -209265 -195124 -210718 -124038 -101510
10710 -101510 24606 64614 110872 82632 126708 129804 88189 11782 -28527 -51049 -165130
10699 -165130 -90230 -29432 33789 25406 -80899 -200747 -268388 -149324 60156 -40364 -90395
10688 -90395 -59558 -4977 89 84749 668 -42319 41340 -56373 -73775 -102629 -127272 -141424
10676a41424K0867J24532l741m7554n1112J0512M1098K9605k7365L2364R042L0519
10664B7343j23129m0821Q2265l8819J20049J79635m0207o6146j07783l673n1645
10653f2931p2814j2957m0021L3458P3442M4484J04353J8117J0212j02389q5271
10642i2317N0376m9515q2375P4934O1442Q781j5276k4964K4088n8287K0367m8117
10630a30863l2302m3248j084J76138k5107J1072O167p7512K0179L4170K1136M999
10618c6255J08092m4163m5874n9483O2881J1341R612m8760M698n4775O3414J837
10606b7435m836K352N816k1524m5941k0599J81337k3073j5852r5790j6389j10613
10594a92547O0715l5977M5374L8463j7508l7595O9312O7944m8157N2680J05965
$$ plain form
10676 -141424 -120557 3975 234 -47320 -98432 -87920 -46822 -17217 -44582 -12218 -3176 27343
10664 27343 -95786 -136607 -54342 -93161 26888 206523 166316 100170 -7613 -11286 -62931
10653 -62931 -135745 -148702 -188723 -155265 -81823 -37339 67014 85131 95343 -7046 -92317
10642 -92317 -41941 -91456 -173831 -98897 -37455 -28674 -43950 -68914 -44826 -103113 -82746 -130863
10630 -130863 -163165 -206413 -207497 -31359 -56466 -45394 -39227 -116739 -96560 -62390 -41254 -36255
10618 -36255 71837 27674 -18200 -77683 -14802 -3461 6151 -42609 -37911 -92686 -29272 -27435
10606 -27435 -32271 -29919 -24103 -45627 -91568 -112167 69170 46097 30245 -65545 -81934 -192547
10594 -192547 -131832 -167809 -122435 -83972 -101480 -139075 -69763 -1819 -49976 2704 108669
10583A08669n2617N8286j71580J8494J15343o1527R2387J26804j5536j26020l4218
10572E8485k6819q2137j3443j36851O5280R3766q566M3703J04288J0055n0049
10561E7712l3252j04473q6124k1491N6691O5751J9719P3721J9257l9272p0578
10550f2339q012j6696l3108l815M9126J24266N3470J7071m0680j01J9283k0517
10538G7948n5884n9217J3384L0542J3254J8459l4989r9161l285q6974J5488L2811
10526a37624k8657L0586J27262M3032j8701R255j3668j7762m8834r742n2231r726
10514a26810k9901L0469R0522Q8101O9175Q5910m2893p4929K2228p3929N4172
10503I2115j08871j41726j159J38907L6642l7593k2669L1012m694P307L5812o8539
$$ plain form
10583 108669 56052 114338 -57242 -38748 76595 15068 107455 234259 218723 92703 58485
10572 58485 31666 -50471 -63914 -200765 -135485 -41719 -50285 -6582 97706 107761 57712
10561 57712 24460 -80013 -166137 -187628 -130937 -65186 -45467 28254 47511 8239 -62339
10550 -62339 -70351 -87047 -120155 -123970 -74844 49422 102892 119963 79283 79182 98465 77948
10538 77948 22064 -37153 -23769 6773 20027 38486 3497 -95664 -98949 -185923 -170435 -137624
10526 -137624 -166281 -135695 -8433 34599 15898 25153 11485 -6277 -55111 -64853 -117084 -126810
10514 -126810 -156711 -126242 -35720 52381 121556 207466 164573 89644 111872 37943 92115
10503 92115 -16756 -158482 -159641 -20734 15908 -21685 -44354 -13342 -18036 -10729 25083 -43456
10491d3456L7835N4336q1556K0402J34262o6816j11549R8488K6107l8640j01205
10480g1792q9504M5406K7815o0257J14414J26506P7664m9014k04722k4260M8714
10469e9030j890j6101k2485K9590p5752k4120J5504R6599N6578J67395J21959
10458B88247j1427j7996j07497j21572j13132K134o1865m8862Q3225l6560N0813
10447i4492Q3872n9964j75859m4017J65282M7085M9449P0395P2189j11125j9089
10436a6274J51449P6294J512j51648n8763P453K4132N0658j8440K9036P3049n9372
10424A09086k7404j12285j85328M0294J31363j00754P0516J9682j05454m8804
10414b09088J5143J2357L7146j2854J801J14669L4630J4997K0374K0437J43J2606
$$ plain form
10491 -43456 -5621 48715 -32841 -12439 121823 55007 -56542 41946 68053 29413 -71792
10480 -71792 -161296 -115890 -88075 -148332 -33918 92588 170252 121238 -83484 -107744 -59030
10469 -59030 -60920 -77021 -99506 -69916 -145668 -169788 -154284 -57685 -1107 166288 288247
10458 288247 276820 258824 151327 29755 -83377 -81243 -143108 -191970 -108745 -145305 -94492
10447 -94492 -10620 -70584 -246443 -290460 -125178 -78093 -28644 41751 113940 2815 -16274
10436 -16274 135175 211469 212981 61333 2570 10023 34155 84813 66373 95409 168458 109086
10424 109086 81682 -30603 -215931 -175637 -44274 -145028 -74512 -54830 -160284 -209088
10414 -209088 -193945 -181588 -144442 -157296 -155495 -40826 -6196 8801 29175 49612 49755 62361
10402F2361n3655O7324M6192r5099K8752l4056j35919O6381Q2769O869L328m9213
10390c966K5197n4748k2070J2117J22134K6755q5763j11509k2821L4086m302q508
10378i3398L4906l1176Q7221O7328K9449J8544M0971j201n3241J941j01650r2455
10366i2761N9772M1900N3120J215j3313K004l3280L444r693k7502R5212K9925
10354A10043K62L7315l7053J10738P3756j19005p1311N5912K0116J2952J1961
10343B05686j34319J29503N1044j26583j02140Q07l3935l7027m2380P2208J61156
10332A44020k2308k5392l7173p8634K5040J33431m0982p1669J0028o5812J6509
10321a2942K8730m035o9709m4448m4429K8575j6838N7933k1997Q8863M0509p7361
$$ plain form
10402 62361 8706 76030 122222 27123 55875 21819 -114100 -47719 35050 41919 45247 -3966
10390 -3966 21231 -33517 -55587 -43470 78664 105419 19656 -91853 -114674 -80588 -84890 -93398
10378 -93398 -58492 -89668 -2447 64881 94330 112874 153845 152644 99403 101344 -306 -92761
10366 -92761 -32989 8911 62031 63246 49933 51937 18657 22101 12408 -15094 80118 110043
10354 110043 110305 147620 110567 221305 295061 176056 104745 160657 180773 193725 205686
10343 205686 71367 200870 251914 125331 23191 23998 -9937 -46964 -89344 -17136 144020
10332 144020 121712 96320 59147 -19487 5553 138984 98002 26333 36361 -29451 -12942
10321 -12942 15788 11753 -57956 -102404 -146833 -118258 -135096 -77163 -99160 -10297 30212 -47149
10309d7149K1986m308q5383M7197r455m6126j8916J2660q701J06367J59584m4400
10297H3356j17334o6534k3740N7159O1542J02350m33q4689o6746p710l0488J02326
10285I059o5454k5647J29342M8925k1597m670k066N2213N2273l9270m8633J36987
10273B21462q192j34380k9104P533j12760j05135L9391K2069k2576J44736j6944
10262F100n7162j09462Q8020K07880P8145N5117n8268o0791j4232j05327j65289
10251a35269K2475N2865j00358J24302P8575l865J9471N7006j37056m0104M0140
10240b1818l3269L9322Q4164n9549q0348k8272j6534N0894j237P7628n4556k6776
10228g0351Q9718j1661r580j581L9027R2734J08418K851n4329j25805k8386J37592
$$ plain form
10309 -47149 -25163 -29471 -114854 -67657 -77112 -123238 -142154 -129494 -138195 -31828 127756 83356
10297 83356 -33978 -100512 -124252 -67093 -5551 96799 96366 11677 -55069 -62779 -93267 9059
10285 9059 -56395 -82042 47300 96225 74628 69958 67892 120105 172378 133108 84475 221462
10273 221462 213270 78890 49786 57319 -55441 -160576 -121185 -99116 -121692 23044 6100
10262 6100 -51062 -160524 -72504 135376 213521 268638 210370 149579 135347 30020 -135269
10251 -135269 -112794 -59929 -160287 -35985 42590 38725 58196 115202 -21854 -61958 -21818
10240 -21818 -55087 -15765 68399 8850 -71498 -99770 -116304 -65410 -66647 10981 -43575 -70351
10228 -70351 19367 7706 -1874 -3455 35572 128306 236724 239575 185246 59441 31055 168647
10216A68647J17701Q5741P9029J47884K4309M4915Q8380P4803J17465J40882N1305
10205A141061L1926K08852J35436l4313k47035j06481p0103j09744k66968k00718
10195D81913k31751q1082O0558q5391j23160m5469J06704J11645R8723m7495n0831
10184A94364O9693k9383M7352r5036j72013J3131L2342n9639m0162j7780R7291
10173D0160P2873Q273K7357N9214J9370k9188p4737n6155n9203N6805P9135l1625
10161A12279L3462Q467m1699p1182J6073n4484Q0524K4275J5433L2005q64j8923
10149A35366k736j07537q2530P1726K26237l7557j54686O9625R3111n4318j33133
10138B3568p946P8660m6982j44445m5564J035q6768N2074R6912O4206q366n7204
$$ plain form
10216 168647 286348 372089 451118 599002 623311 668226 756606 831409 948874 1089756 1141061
10205 1141061 1172987 1381839 1517275 1482962 1235927 1129446 1059343 949599 682631 481913
10195 481913 250162 169080 229638 144247 21087 -24382 82322 193967 292690 245195 194364
10184 194364 264057 234674 282026 186990 14977 28108 60450 811 -39351 -57131 40160
10173 40160 113033 121306 148663 207877 227247 198059 123322 67167 7964 64769 143904 112279
10161 112279 145741 154208 112509 41327 57400 2916 83440 107715 123148 155153 154289 135366
10149 135366 132630 25093 -57437 14289 240526 202969 48283 117908 211019 156701 23568
10138 23568 15622 94282 47300 -97145 -142709 -141674 -228442 -176368 -79456 -15250 -23616 -80820
10126h0820J3967k2973m0232N7473K5121N1673K6173o1827K8597P0068p4940p5837
10114h3557P3290N1811j7525K2062J21688M5891p3556n0453j6192q5390L400j78
10102h709q4915j34608J9811J73484J02939J27783P1325m6378Q033j20282j30427
10091b1944l3208O8717L9635n6024n1954j0205L072q630j3061J9000O0196O4116
10079E9710O4492n6074r8770m6148n2764J9105P3119Q4239K0179M8647o9944j10824
10067f5033K3497Q470m4751O3634R3501l479o9153k5964L5693l595P7474M0383
10055A30677j22717n9775J05175M1220M5641J5871n9974o3661r9031P7849P1499
10044H2774K2523K010o1623J6916l1483Q37k9765j36610m9449k0562J48086Q9523
$$ plain form
10126 -80820 -66853 -89826 -130058 -72585 -47464 4209 30382 -31445 -2848 67220 -7720 -83557
10114 -83557 -10267 41544 24019 46081 167769 213660 140104 89651 73459 -11931 -8531 -8709
10102 -8709 -93624 -228232 -208421 -34937 68002 195785 267110 220732 228765 108483 -21944
10091 -21944 -55152 13565 53200 -2824 -54778 -64983 -61911 -70541 -83602 -64602 -4406 59710
10079 59710 124202 68128 -30642 -76790 -129554 -110449 -37330 46909 67088 115735 45791 -65033
10067 -65033 -41536 -33066 -77817 -14183 79318 75839 6686 -19278 16415 12820 90294 130677
10055 130677 7960 -51815 53360 94580 140221 156092 96118 32457 -66574 11275 82774
10044 82774 105297 107307 45684 62600 31117 31954 2189 -134421 -183870 -204432 -56346 33177
10032C3177m84j04648r7765l480O1808P3982n0945j26514o05M7862L0922p3440
10020b10130J8671J928J87060L7462O618K3818q6858m2353J35370m4063j67217
10009a39694p8509n7368J14616K11869P6529p0489K0390m5367M8684k3936j13400
9998e6675j3074m3290L1054Q7768O3055j2969l4231j47732p8955M2262K4736Q5589
9986e2462N8342l5415R137p8622n1923p1365J7703J32063r527l123j4946N9709
9974d0429N9255p3138p052k0895Q109M4851M9465L172J1256J38789q5376k7947
9962F0060L8219Q1751J4543j40768j47244o4305J7704J66153J47173M1684m9900
9951A65070n8901J1249n7497l2099L0331Q605j24367J2802J3101P304r9406p748
$$ plain form
10032 33177 32693 -71955 -169720 -173200 -111392 -37410 -88355 -214869 -215474 -167612 -136690 -210130
10020 -210130 -191459 -189531 -2471 34991 41609 65427 -21431 -63784 71586 27523 -139694
10009 -139694 -218203 -275571 -160955 50914 127443 56954 77344 31977 80661 56725 -56675
9998 -56675 -69749 -113039 -81985 5783 68838 55869 21638 -126094 -205049 -162787 -138051 -52462
9986 -52462 5880 -29535 -20398 -99020 -150943 -222308 -204605 -72542 -82069 -85192 -100138 -40429
9974 -40429 18826 -54312 -61364 -82259 -74150 -29299 20166 23338 34594 173383 88007 60060
9962 60060 98279 180030 194573 53805 -93439 -157744 -140040 26113 173286 214970 165070
9951 165070 106169 117418 59921 27822 58153 66758 -57609 -44807 -31706 -24402 -123808 -131556
9939a31556k0709j3266L0558j3247P099Q6644K4655J20179N139l7491J45662J67532
9927C71199R252o0061j2700L9586j60757L8549L87l5967J35414l6919r9231j09910
9915G8842q3451J03830j293o3442L1541O1052k8533n319q9369M3686J17205n3402
9903A11347j02813k9162Q375K7080P8784p2072k7711k5033k8069J07N5842o5946
9891f9271N3158J5038k2373J0002k1159N5887J14550J14668l1172j03826p7898
9880C7604n4539L9264O0960q0143j05291L2534P1632k5259K7538Q780j9181L0525
9868B4424P441q4228k6396M0105P4911q9374j25236J01815J71452m6751K6032
9857G4195P8563p5345J0506k0442k8316j3442M2316j0547J0883J4622j10505K032
$$ plain form
9939 -131556 -152265 -165531 -134973 -148220 -141121 -54477 -29822 90357 95496 58005 203667 371199
9927 371199 380451 320390 307690 347276 186519 225068 225455 189488 324902 287983 188752 78842
9915 78842 -4609 99221 97928 34486 66027 127079 98546 93227 3858 47544 164749 111347
9903 111347 8534 -20628 -12253 14827 93611 21539 -6172 -31205 -59274 -59167 -3325 -69271
9891 -69271 -16113 -1075 -23448 -13446 -34605 21282 135832 250500 219328 115502 37604
9880 37604 -16935 22329 83289 3146 -102145 -69611 2021 -23238 4300 13080 -6101 24424
9868 24424 31865 -52363 -78759 -38654 36257 -53117 -178353 -76538 94914 48163 74195
9857 74195 152758 77413 87919 67477 39161 25719 68035 57488 68371 82993 -27512 -25480
9845b5480L9928J768j08467j32205q0275O6595K6437p609P1946K06907K33585
9834B93130k861k20954j14389J40253N1907j53916l6777J29608k255j16014q6186
9823a18454J08731L1189r6414j8949o8213n6031R02L854J6372o1278Q4124L7638
9811a36529q576Q8100K1181q2328Q7179Q5449j4255o6243K4266n089k8422K4926
9799a0341R9395M8171j6646k0609l8334J3198l0815l9387q1291K5745J25388l6424
9787C8050j61065r7288J5371j2854N6325M3502J09011M5523p5748L0227p7624
9776h6570r8314O9808M4543K1352n1858J8854m1490k0070O4479K1072j26992k8516
9764b13702R8274R0342L7638p0743l7776o4354N6478P0690m2682L6390k4618r802
$$ plain form
9845 -25480 14448 16216 -92251 -224456 -304731 -238136 -211699 -219308 -147362 59545 293130
9834 293130 290269 69315 -45074 95179 147086 -6830 -43607 86001 83746 -32268 -118454
9823 -118454 -9723 21466 -74948 -93897 -162110 -218141 -217239 -213385 -197013 -258291 -174167 -136529
9811 -136529 -145105 -57005 -35824 -118152 -30973 54476 40221 -26022 -1756 -6845 -35267 -10341
9799 -10341 89054 137225 120579 99970 61636 74834 44019 4632 -76659 -50914 74474 38050
9787 38050 -123015 -220303 -204932 -217786 -161461 -117959 -8948 36575 -39173 -8946 -86570
9776 -86570 -184884 -115076 -70533 -49181 -101039 -82185 -123675 -143745 -79266 -58194 -185186 -213702
9764 -213702 -115428 -25086 12552 -58191 -95967 -160321 -103843 -33153 -75835 -39445 -64063 -73865
9752g3865O0842p9004o231J50239J2891o2240M0024M4377J14924M6517j00814
9741A47660o1314J15172r7039k9728j3524N2894l8226j9710P3805o9096j5396
9730D5498J06022o788j16979n3912N9253m5360M4697K2829k3222j30894l1056
9719a29912J10346L6292o6700N5222P2180Q9147k4848j5788R5261N9767j11466
9708A69501j42826l5388P8084K1257k9524n4840q2707O7402J5745l6611q5973
9697a15880m7254J00002Q4795N6152o0238j02821l1862Q3906j8069K4016M0861
9686A3608j09365K7959J42737q3046p7534p6228L9439O2562m6253K8051N0246
9675b7824p8496j3798p889m16m4511m4027O8900J71157O4353M1866j12829P3285
$$ plain form
9752 -73865 -13023 -92027 -98258 51981 64872 2632 42656 87033 201957 248474 147660
9741 147660 86346 201518 104479 74751 61227 114121 75895 56185 129990 60894 45498
9730 45498 151520 144732 27753 -26159 33094 -12266 32431 55260 32038 -98856 -129912
9719 -129912 -19566 16726 -49974 5248 77428 166575 141727 125939 221200 280967 169501
9708 169501 26675 -8713 69371 90628 61104 6264 -76443 -9041 6704 -29907 -115880
9697 -115880 -163134 -63132 21663 77815 17577 -85244 -117106 -33200 -51269 -27253 13608
9686 13608 -95757 -67798 74939 -8107 -85641 -161869 -122430 -59868 -106121 -78070 -27824
9675 -27824 -106320 -120118 -128007 -128423 -172934 -216961 -148061 23096 87449 129315 16486 89771
9663H9771j59132r2856j2881O4344J46091J08574n9152j3955k2406j6361J62722
9652A94759L3559m1627P4806j13513j42123r859J29182j02488j00116n8006O8293
9641f7133O9817j66938L8512P3310P7854r4442m135K8512N3500j38440k03188
9630c32771L2832l4284J15771J07170J31843N0920l1429O6218K7933k7931K8956
9619A35228j18674j58884q8700N6538N913N6155l4120L8776L56J8514J16346J7937
9607D5385N327r8567M5335k9268Q722n6775l6994q816k8483Q748J71066O3845
9595H9525n6996K7354k802P859j04017o0478O0189l1389Q3021P4186N4336j77964
9583c7176n2039P231O693K3213q3642R6135K1122j8943k6091L7960M8702j0801
$$ plain form
9663 89771 -69361 -162217 -175098 -110754 35337 143911 84759 70804 48398 32037 194759
9652 194759 228318 186691 261497 147984 5861 -3998 125184 22696 -77420 -135426 -67133
9641 -67133 2684 -164254 -125742 -52432 25422 -69020 -73155 -44643 8857 -129583 -332771
9630 -332771 -299939 -334223 -218452 -111282 20561 71481 40052 106270 134203 106272 135228
9619 135228 16554 -142330 -231030 -174492 -168579 -112424 -146544 -107768 -107412 -88898 27448 45385
9607 45385 50712 -47855 -2520 -31788 -23066 -79841 -116835 -125651 -154134 -145386 25680 89525
9595 89525 32529 59883 57081 64940 -39077 -99555 -39366 -70755 12266 86452 140788 -37176
9583 -37176 -89215 -81984 -75291 -52078 -135720 -39585 -18463 -37406 -63497 -25537 23165 12364
9571A2364L6739R7141l1523j44823P5441R9385r7796j31279J9361M4021O8124
9560D7155P0379n8503n9433J39483M1913J6392r9654j6844n891j05323O9225J5405
9548E4304M0293o6533J3266l6557q6408k7442n4962Q901O6035Q6820m3361O9177
9536B3533m0746P136L1898o5064K1461N7875M4125Q591m6602L4924p2868k9100
9524b4837M5858O9288j50643l6318j6270p0496P9358m6912J40563J0171r9372
9513i9610j30119N5571J5243l5224O7774J27375J3792k6002m4377q35Q36p3436
9501a29012N7367j9393p314J1102k145q9465L447j5235k3252K7465J19434j4718
9489h1719J8673r889k840L9633L1419K7977K1059o0210k564n8310M6714P3329
$$ plain form
9571 12364 49103 146244 114721 -30102 45339 144724 46928 -84351 -64990 -20969 47155
9560 47155 117534 59031 -402 139081 180994 197386 97732 80888 74997 -30326 38899 54304
9548 54304 94597 28064 41330 4773 -81635 -109077 -164039 -155138 -89103 -2283 -45644 23533
9536 23533 -17213 -10077 21821 -43243 -21782 36093 80218 88809 42207 77131 4263 -24837
9524 -24837 21021 90309 -60334 -96652 -112922 -183418 -104060 -150972 -10409 -238 -99610
9513 -99610 -229729 -174158 -158915 -194139 -126365 1010 14802 -11200 -55577 -56412 -55576 -129012
9501 -129012 -71645 -91038 -98352 -87250 -89395 -178860 -175413 -190648 -213900 -186435 -67001 -81719
9489 -81719 -63046 -72935 -75775 -36142 -4723 23254 44313 -15897 -18461 -76771 -30057 43272
9477D3272n1871M6241P1924n7595j4590m1793j63339q8336M8643J08370L777J82348
9465H7051m2632j20141Q42o1528m8608J0811J28734Q8683j7042q2722K9714K7084
9453B46p798m8581m57J5608k9409p879J48171k8129r6630n8934l5119p2082M5433
9440a75560J84550J24329J0342o0477k6696j03832J112J1388J11508J39361K1887
9429B37912j950q6040j18586p4027L5644J08367R148J6005p3091Q1294l7304n3356
9417D4016j3938J9667Q038M5898L0519K2829r5556j03268K7917l4209k0886Q1168
9405A2195R2010L266p8908n0016j8844N2344O7008j4934k6694o3426j210p0345
9393i7554r0717K0709R6117J08940P3101k3874r8837J15263Q7122O198p9612o01
$$ plain form
9477 43272 -8599 37642 109566 51971 37381 -4412 -167751 -256087 -207444 -99074 -95297 87051
9465 87051 44419 -75722 -74880 -136408 -185016 -174205 -45471 43212 26170 -56552 -26838 246
9453 246 -7552 -56133 -56590 -40982 -70391 -78270 69901 41772 -54858 -113792 -148911 -220993 -175560
9440 -175560 8990 133319 143661 83184 56488 -47344 -46232 -34844 76664 216025 237912
9429 237912 235962 149922 31336 -42691 -7047 101320 110468 126473 53382 134676 97372 44016
9417 44016 30078 49745 57783 103681 134200 157029 61473 -41795 -13878 -48087 -68973 12195
9405 12195 104205 107471 28563 -21453 -40297 12047 79055 64121 37427 -25999 -27209 -97554
9393 -97554 -188271 -167562 -71445 37495 110596 86722 -12115 103148 190270 196468 116856 116255
9381A16255r937l8148j55753n7011K8393O8266k4927o8729J3259k1839N7841M3393
9369d8937r7587n1098M5592M8638N0025n8715m5503Q4440P9359K3291q2724j062
9357e4281k6095O6442J01107l0190n8137q1970M7378Q6984P4229k14315j16711
9346b05559m3978J34544P9546Q7496J784L2784m2259N8023N1449r0160m085N0006
9334A09591O7225j9291p7379p1564N1032K4076K5357J7709j35061M578q4558K4874
9322f3411N9668q931Q669l6773p0615q9870j23973J73286J49478r6563j4213O6429
9310d6819Q616O6402M2320j05112j2925k5532L8092N9609p1245M4487J59835m825
9298A52903j7487J0069n3349q2598j5381K2475N0953j2591r6065o43Q3927l3778
$$ plain form
9381 116255 106318 68170 -87583 -144594 -116201 -47935 -72862 -141591 -128332 -150171 -92330 -48937
9369 -48937 -146524 -197622 -152030 -103392 -53367 -112082 -157585 -73145 6214 29505 -53219 -54281
9357 -54281 -80376 -13934 87173 56983 -1154 -83124 -35746 51238 125467 -88848 -205559
9346 -205559 -249537 -114993 -35447 52049 53833 86617 44358 102381 153830 63670 59585 109591
9334 109591 176816 157525 80146 8582 59614 83690 109047 126756 -8305 -3727 -88285 -63411
9322 -63411 -3743 -12674 -4005 -40778 -111393 -201263 -325236 -151950 -2472 -99035 -113248 -46819
9310 -46819 -38203 28199 70519 -34593 -47518 -73050 -34958 24651 -46594 -2107 157728 152903
9298 152903 135416 145485 92136 9538 -5843 16632 67585 54994 -41071 -41714 42213 8435
9286H435j23733p6204R2283k8837k398J59379j9917j5393J0091L7369M8715L3943
9274A23733L2483Q7161K7495j08197q0754N7387o0489m4173m3210O1489K4909
9263G7834q5992k3183J29595l7522L525M3454k8357p263L0491o7816p9291R0505
9251D5980K02609N5392n593j5410p1506j46208q8472j6567K3866K19808J80638
9240C84537l963p7858n4748j38339j7606m9714L6857M3453O4902O4924P25P6307
9228C29477K300j14447N2893J60987N8840j06075j06214o2128J01030J78969k7480
9217D68152j25068p4039j9932M5018N8342l3882k2481k0914n9052l2534J0867
9206A94477R2186K5583n1838p952J78734N9532n2405L8882j388N7553o071K9658
$$ plain form
9286 8435 -115298 -191502 -99219 -128056 -130454 28925 9008 -6385 3706 41075 89790 123733
9274 123733 156216 243377 270872 162675 81921 139308 78819 34646 -8564 52925 77834
9263 77834 -8158 -31341 98254 60732 64257 107711 79354 72091 102582 34766 -44525 45980
9251 45980 248589 303981 298388 282978 211472 65264 -23208 -39775 -15909 203899 384537
9240 384537 380574 302716 247968 109629 92023 42309 79166 122619 187521 252445 253170 329477
9228 329477 331777 217330 270223 431210 490050 383975 277761 215633 316663 495632 468152
9217 468152 343084 269045 249113 294131 352473 318591 296110 275196 216144 183610 194477
9206 194477 286663 312246 260408 252456 431190 490722 438317 477199 475811 533364 527293 556951
9194E56951n5883J5163R8016J670r5804P0091l3727k3181J0552P0316J00628L8083
9182G52875J02541P5860M5056l9901L3756k3444O7815O7034J32263K1115o151
9171A228819K25986J65398J44535J5487m925P3206J27338J40430J65330K47436
9161B529040K75961K38133L15438M11364L86781M13174M34555N12012O48263P80638
9151F945359Q28220P89622R86313R59304Q99543J058991J270845J545939J616199
9142A6900335J770416K299453K850823L230116L549856L524843L440185L263715
9134D0829742K701955J588359n1861j928285l651877m727175n088916m777410
9126B4894532m134197l418060k693673k073852j628833j447385j241233q95532
$$ plain form
9194 556951 501068 516231 614247 615917 520113 590204 556477 533296 543848 614164 714792 752875
9182 752875 855416 931276 976332 936431 970187 946743 1014558 1081592 1213855 1234970 1228819
9171 1228819 1454805 1620203 1764738 1780225 1775300 1848506 1975844 2116274 2281604 2529040
9161 2529040 2805001 3043134 3358572 3769936 4156717 4569891 5004446 5516458 6164721 6945359
9151 6945359 7773579 8563201 9549514 10508818 11408361 12467352 13738197 15284136 16900335
9142 16900335 18670751 20970204 23821027 27051143 30600999 34125842 37566027 40829742
9134 40829742 43531697 45120056 45068195 43139910 39488033 34760858 29671942 24894532
9126 24894532 20760335 17342275 14648602 12574750 10945917 9498532 8257299 7361767
9118G361767q52121p01146o04980n08977l55266k61697m22174k84437j97202k88845
9108B884922j58559j51405l47990j95079j2521q5360o5458n9879j13332j46191
9098A549148j35575j56788O6232m323j69230m4794O0874N3655n8241q2642j20540
9087I57776o3506m0108n0419k4337N6061n336n243k0803r1282o4630j3216m2876
9075E92081j05579n0591r0254m6525O9437N176l5788J56940M3200r476l5304q4400
9063D08917l0401l667m1805j90346J5459P7250m043l427K5780L6931J10741m9049
9051C52340o6755M0614j04151j23775K6323J0405J42532J12498q5766k3659k255
9040B78351j28043O7752o2444o8442l0625J06595l8658j6416J50807O2667j38555
$$ plain form
9118 7361767 6509646 5808500 5203520 4694543 4339277 4077580 3655406 3370969 3173767 2884922
9108 2884922 2726363 2574958 2226968 2031889 2019368 1934008 1868550 1808671 1695339 1549148
9098 1549148 1413573 1256785 1323017 1318694 1149464 1104670 1165544 1219199 1160958 1078316 957776
9087 957776 894270 854162 803743 779406 835467 830131 824888 804085 712803 648173 634957 592081
9075 592081 486502 435911 345657 299132 368569 373745 337957 494897 538097 528621 493317 408917
9063 408917 378516 374849 333044 142698 158157 235407 231364 227937 253717 290648 401389 352340
9051 352340 285585 326199 222048 98273 124596 135001 277533 390031 304265 280606 278351
9040 278351 150308 218060 155616 87174 56549 163144 124486 108070 258877 321544 182989
9029A82989q1549l5022p764J36947M1992J5655j39685m8422Q4754O333o7524n0141
9017C8563J55996O7447o4340p5053l9993K5052M4562m3664j4108m6187P4754J24825
9005B47854J36517K7181j8759j18269k9855p210O7060N409r2607J1177q3567Q419
8993A53350l3255j23352m6699M6390N6692p9305M5338K9509P3179M3202P241N5306
8981B27596j9694j38836l0941P4095k0414K208Q8814Q5585K5141O8573m2817o7545
8969B51765K9630J3754r6979M6696m6621k1715P542j67607p8322K7839R5569Q5096
8957A46647O2773l8705j17630O0537l5624p6238j02930J1704L8103O5319l1851
8946a7895o440J06033J15275O077m4498r6739n0923j5216n097m4501K4308J39670
$$ plain form
9029 182989 101440 66418 58654 195601 237593 253248 113563 65141 149895 156228 88704 38563
9017 38563 194559 262006 197666 122613 82620 107672 152234 108570 94462 48275 123029 247854
9005 247854 384371 411552 392793 274524 244669 237459 304519 309928 217321 228498 144931 153350
8993 153350 120095 -3257 -49956 -3566 53126 -26179 19159 48668 121847 165049 172290 227596
8981 227596 207902 69066 38125 112220 91806 94014 182828 268413 293554 362127 319310 251765
8969 251765 281395 295149 198170 244866 198245 176530 184072 16465 -61857 -34018 61551 146647
8957 146647 209420 170715 53085 113622 77998 1760 -101170 -89466 -51363 13956 -17895
8946 -17895 -24335 81698 196973 203050 158552 61813 10890 -4326 -9423 -53924 -29616 110054
8934A10054l8543k5245O0163j4943q6759j2490P3294J6791O3558R0010k2252p4556
8922A39082J01020N2114l0585L2880j24887j44396n4851K1909J26226K5957N9547
8911B04016l3684q0003m438J81113K1872p0335M1167J5660O845O3809k4042j2452
8899C09528J58919R6404k833Q8380Q53L1957N139j5562L3020J46001l677R2473
8887I40602L30814J17508P5464K81225J99924J55346K49400L77573M64924O68015
8877C860795R24235J156905J131771J086775J245869J620039J276012q59287k871384
8868H571730k762747j783752j143292o17262l46666l29058l39622j95081j25432
8859I28818r3779j27754j83865m5849J01936j50289r3106l5363Q961j3435J4114
$$ plain form
8934 110054 71511 46266 106429 91486 4727 -7763 65531 82322 145880 235890 213638 139082
8922 139082 240102 292216 261631 294511 169624 25228 -29623 -7714 118512 144469 204016
8911 204016 170332 90329 85891 267004 288876 218541 259708 275368 282213 346022 321980 309528
8899 309528 468447 564851 562018 650398 651251 683208 688347 672785 705805 851806 848129 940602
8887 940602 1271416 1388924 1464388 1745613 1945537 2100883 2350283 2727856 3192780 3860795
8877 3860795 4785030 5941935 7073706 8160481 9406350 11026389 12302401 11443114 8571730
8868 8571730 5808983 4025231 2881939 2264677 1918011 1588953 1249331 1054250 928818
8859 928818 835039 707285 523420 477571 579507 429218 336112 300749 309710 296275 310389
8848C10389r9256q1720k4j9466Q461k4529j3509P2635k5119p8263q8753O4102
8836B4948J55026M3350J18429m6007n9784Q9391j5750o7957j38677j899o8377
8825C2693L0485l2745k8770O8979p832m5161n3282J3546M7824O3065J06989j2090
8813A83701r5662k2430J4027m9793j4156n7512r7179K6499L7862O4231N2876P2297
8801A14761N1090R8364N4483j12356m751J688n9283J17363l4283j21179K7810
8790A33707J27566m8517k6125L103k6285l6134j42990j20763J08849J28228p9628
8779B1011M1801Q5050M6308q516o82r3624p851p3159K4683P676J0815j86922o7809
8766b01219J90337R7408j14459K7089k7516k8538J59816K50837q2916k25976j3687
$$ plain form
8848 310389 211133 129413 129389 109923 118384 93855 80346 152981 127862 49599 -39154 24948
8836 24948 179974 223324 341753 295746 235962 325353 309603 241646 102969 101070 32693
8825 32693 63178 30433 1663 70642 62810 17649 -35633 -22087 25737 88802 195791 183701
8813 183701 88039 65609 79636 29843 15687 -41825 -139004 -112505 -74643 -10412 42464 114761
8801 114761 165851 264215 318698 206342 201591 203279 143996 261359 227076 105897 133707
8790 133707 261273 212756 186631 189734 163449 127315 -15675 -136438 -27589 100639 21011
8779 21011 62812 147862 194170 185654 184972 91348 83497 10338 35021 42697 53512 -133410 -201219
8766 -201219 -10882 86526 -27933 -844 -28360 -56898 102918 353755 270839 44863 31176
8755C1176l0792o1319M7072N7399j7303J9378K241n568J07369J35632P4684K6030
8743C85999l7867j45990n1000L087n0501j10424N2647R190j3090l8359P1983M3128
8731A18803R3578j0808N9588l374j22803o2244n0265J14568K4225j58343m3783
8720d0858P7517J15337J31571J05841P3858P1080R946J6108m7277K0027j6342
8709E16808j12455j16414N0719J9626r6603K8242j9128p0830j3089R0698j21239
8698A56335P3179n406r9389K5743R2012J01819J06527j17041o4573q4336l39J52295
8686C36826J48359O569J5642n0632j23616M9498k4141j06300P0059K675o276j1277
8674C07386j17137J8208J72958L3749k1727J9749J07623P3790K7550j01166k5301
$$ plain form
8755 31176 384 -60935 -13863 43536 26233 45611 47852 42284 149653 285285 359969 385999
8743 385999 348132 202142 151142 154229 103728 -6696 45951 55141 42051 3692 75675 118803
8731 118803 212381 201573 261161 257787 134984 72740 22475 137043 161268 2925 -40858
8720 -40858 36659 151996 283567 389408 463266 534346 544292 560400 513123 533150 516808
8709 516808 404353 287939 338658 358284 261681 289923 270795 199965 186876 277574 156335
8698 156335 229514 224108 124719 150462 242474 344293 450820 333779 269206 184870 184531 336826
8686 336826 485185 491754 507396 456764 333148 382646 358505 252205 322264 324939 318663 307386
8674 307386 190249 208457 381415 415164 393437 413186 520809 594599 622149 520983 495682
8663D95682j9377m488J3315j34591j42972l105J0825O9220K58690J12212j90226
8652D65185j82022J00187k0717k9777J06024K5031l2080l8466k3355M2653L9602
8641D52265k160J61255J46890J11474L5679l4383n5005K1137m0658k8958J6104
8630G83640L6231R6871Q4962n0490P5677J36923n4477o2898j06501P5218o7281
8619I47875l0930P9909J00823L6781J62718J25213K2482J07276K19165O2089o2446
8608A770955m1054K43575K56131K15609K65655J54920Q2244K40099J38792K56405
8598C583331K53500J82589L35561K52786K26910J39907L38027M28084L41899K57582
8588F340176m4895q8284k23113o07657o76644p29529n77768m31489m48559m57477
$$ plain form
8663 495682 476305 471817 485132 350541 207569 204464 215289 284509 543199 655411 465185
8652 465185 283163 383350 362633 332856 438880 463911 431831 393365 370010 412663 452265
8641 452265 450105 611360 758250 869724 905403 871020 816015 837152 796494 767536 783640
8630 783640 819871 916742 1001704 951214 1026891 1163814 1109337 1046439 939938 1015156 947875
8619 947875 916945 996854 1097677 1134458 1297176 1422389 1444871 1552147 1771312 1833401 1770955
8608 1770955 1729901 1973476 2229607 2445216 2710871 2865791 2948035 3188134 3326926 3583331
8598 3583331 3836831 4019420 4354981 4607767 4834677 4974584 5312611 5740695 6082594 6340176
8588 6340176 6295281 6206997 5983884 5376227 4699583 3970054 3392286 2960797 2512238 2054761
8578B054761k66354j78059m7847j29105j45388j9535n1513j81606j23398n3340
8568H58616Q951q8978j45746J14625N9328n8343k4129l2590L5633k6763k6038
8557F74566l9627j9914j4840K1029J0721j60223l7888p5583L7332k0843J9856
8546C94586J4910P9348j8468Q800R2664k7110j6998j0415O5101R2678l8505R8802
8534G35393k2953j18632j24306l2798L9884r0712o3787l5626j1066M6480P8227
8523D00104L4408j6227j83002j5855p2390K5563N4424L416n0407R3112P2399q8914
8511B56631l1729M4684l3832n8090o5644O9411P212m8752O5469j05833m1712K0466
8499G8281K6808Q3226M0656J675j5833k443O3910r6776K0886K0483p2170L0393
$$ plain form
8578 2054761 1788407 1610348 1562501 1433396 1288008 1268473 1216960 1035354 911956 858616
8568 858616 867567 778589 632843 747468 806796 748453 724324 691734 727367 700604 674566
8557 674566 634939 615025 600185 621214 631935 471712 433824 358241 395573 374730 394586
8546 394586 409496 488844 470376 479176 571840 544730 527732 517317 582418 675096 636591 735393
8534 735393 712440 593808 469502 436704 476588 385876 322089 286463 275397 321877 400104
8523 400104 434512 418285 235283 219428 147038 172601 227025 230441 180034 273146 345545 256631
8511 256631 224902 269586 235754 177664 112020 181431 188643 139891 205360 99527 57815 78281
8499 78281 105089 188315 228971 230646 214813 212370 276280 179504 200390 220873 148703 179096
8487A79096J74575q7151l0565K9298J4434j06466o3727m8827n317j4151J949K2734
8475F5882J11250K5422j9679k6193J3564K1207P6883M7483K8001m8192J5557j1217
8463B99968k4001o3319n8463p9927K5914R9401K6151O3923j05865q5077P6751
8452A75456n7370M847O496k826k0372J3823k5865L5414J04811k3955n4836O3464
8440B19087j0076L0269K1370J8413j44525j59166j3251M912M2492J56885o3046
8429A03364k5386L5670K1847l7732j06735n4306R247N1643K4175p1925J7420j7722
8417e0440J05187J20240J2802r3810J5267Q059j1023j27937j09456K4905L8850
8406f7356L1615N0318P0603R851j61727l0297O3986M3880m8381j9817l8223M4829
$$ plain form
8487 179096 353671 266520 235955 265253 279687 173221 109494 60667 55350 41199 43148 65882
8475 65882 177132 202554 182875 156682 170246 191453 268336 315819 343820 295628 311185 299968
8463 299968 275967 212648 154185 74258 100172 199573 225724 289647 183782 98705 175456
8452 175456 118086 122933 129429 126603 106231 120054 94189 129603 234414 210459 155623 219087
8440 219087 209011 239280 260650 279063 134538 -24628 -37879 -32967 9525 166410 103364
8429 103364 77978 113648 135495 97763 -8972 -63278 -54031 -2388 21787 -50138 -32718 -50440
8417 -50440 54747 174987 187789 93979 109246 117305 106282 -21655 -131111 -106206 -67356
8406 -67356 -35741 14577 85180 95031 -66696 -96993 -33007 10873 -37508 -57325 -95548 -50719
8394e0719Q5103Q4429M4871j1189l3909M2201j10343j25530Q2611M4500k0023
8383C2002N072K9089n6879p6108j81500J87011J22985M3621j8011j81537L7305
8372e6950M1788P6923P5604N560J72476p868o0623r3232l0905L8756j2172j37724
8360A1633r4043L6078J27538J09882m1691n5827K3312o4391p7265p7618Q8231
8349a4161l2397q9272p1785N7960O0374J00662j927j02704n1067l1077J8920r1821
8337b48295J01639R1192M7085N3798L5894r5058j09236J23236R9304j14517k4297
8326c9255M2052J0989L8959q8635m8500J13085J71090q4251m1536J1304P8777
8315A64079L6187j18635N6219j6744N5975L1928r522o9675O905J2015p0010m5825
$$ plain form
8394 -50719 34384 118813 163684 152495 118586 160787 50444 -75086 7525 52025 32002
8383 32002 37074 66163 9284 -66824 -248324 -61313 61672 105293 87282 -94255 -56950
8372 -56950 -15162 61761 137365 142925 315401 307533 246910 153678 122773 161529 149357 11633
8360 11633 -82410 -46332 81206 191088 149397 93570 116882 52491 -24774 -102392 -14161
8349 -14161 -46558 -135830 -207615 -149655 -89281 11381 9454 -93250 -144317 -175394 -156474 -248295
8337 -248295 -146656 -55464 -8379 45419 81313 -13745 -122981 255 99559 -14958 -39255
8326 -39255 2797 13786 52745 -35890 -84390 28695 199785 115534 73998 85302 164079
8315 164079 200266 81631 137850 121106 177081 209009 199487 129812 136717 148732 78722 32897
8303C2897M0602j5734n1487R5946O767j20404k8427J65878J81089j30952k23192
8292d7017P6591J29234Q707p6687n1364m5821N4006q5689L0456n3535j0174R5313
8280B4020j6655Q052j0800K3832o044O2934J4992r1219J0564N1132k892K9250
8268I7166K6849j75156l5196Q4338k3753l4584M0491K14665j0802j31179J08419
8257A61258K0352j44229j04809k8935J02208M0113p0562O2607J2090K050q3180
8246c1037k9239Q5349j05980J05612J69073l7350M202m2333M7271J36516j09497
8235A92587l0510k4207j26332N4137o6083j2740J931L6060O412k3158k8848J8505
8223b246O0291J7366K8399k641j19540l9106N4912J91531j10794m5689J01794
$$ plain form
8303 32897 73499 57765 6278 102224 108991 -11413 -39840 126038 307127 176175 -47017
8292 -47017 29574 158808 167515 90828 39464 -6357 47649 -38040 -7584 -61119 -71293 24020
8280 24020 7365 15417 4617 28449 22405 85339 100331 9112 19676 70808 67916 97166
8268 97166 124015 -51141 -86337 -1999 -25752 -60336 -19845 194820 184018 52839 161258
8257 161258 181610 37381 -67428 -96363 5845 45958 -24604 38003 50093 52143 -31037
8246 -31037 -60276 25073 -80907 24705 193778 156428 160630 118297 165568 302084 192587
8235 192587 162077 137870 11538 65675 -408 -13148 -11217 24843 31255 8097 -20751 -2246
8223 -2246 58045 75411 103810 101169 -18371 -57477 -2565 188966 78172 32483 134277
8212A34277l278Q1354r9569M4313M3065L3138q9111K9897L3104K6882m2456p7682
8200A13934K710K8913m6263o7517N961J11729j0162j34408r7434J2011o7669l1401
8188a79596J84718J15311j06145j84963R2325J22110K4466k5075m5555M9235J6718
8177F3549o6059j8852K0752J6688K2223p0361l8751J37579L7379l0099K5817q9561
8165A0304j52150n3990K05418J10569j5387o3491j06023r2241R6128J62439P9250
8154A80826M3596n9103j61854o3100M2968O8818K0948L7512k7674j5483o1435
8143F019M539K0547l5142J45661R1612L3007o1838n7214j20174o4457K5633j0683
8131b2490L281O6477K8624Q5508N4856j38500J2531n3555K1265M301q6457k8197
$$ plain form
8212 134277 130999 212353 112784 157097 200162 233300 144189 174086 207190 234072 191616 113934
8200 113934 116644 145557 99294 31777 37738 149467 139305 4897 -92537 -80526 -148195 -179596
8188 -179596 5122 120433 14288 -170675 -78350 43760 68226 43151 -2404 46831 63549
8177 63549 -2510 -21362 -610 16078 38301 -32060 -70811 66768 104147 74048 99865 10304
8165 10304 -141846 -195836 9582 120151 104764 41273 -64750 -156991 -60863 101576 180826
8154 180826 224422 165319 3465 -59635 -16667 52151 73099 110611 82937 67454 6019
8143 6019 10558 31105 -4037 141624 233236 266243 204405 147191 27017 -37440 -11807 -22490
8131 -22490 -19209 47268 75892 161400 216256 77756 90287 36732 57997 62298 -24159 -52356
8119e2356m2945k4225j7511J7226K4588N0685Q855j16782k4477Q9967J5174N2972
8107a8829j69738k0025P3254J0565O496K5522O9679N0469l9773P3996J5057O0625
8095A37298K8072j35645r5598K3029k1299j21144M2351O323J12054R6373j1868
8084E9946m7072p7127p7956K5394L0480M8523l775L6914N9604L425N6280J8900
8072A33536R390o0523r1162L0979J28022J16766O021j04197n6155k6839K978P4831
8060A63647J9422m2055n889o9329r150R3589N1460O1339n2659l9497K6947J30513
8048C28338K0421J0202j31926m0543o9330k0437L1358O946J8886J708Q0094J00362
8036C36079m4387q1581O2615p658j13150M2669P0006O3717J9229L8651L7390k2720
$$ plain form
8119 -52356 -95301 -119526 -137037 -119811 -95223 -44538 -35683 -152465 -176942 -86975 -71801 -18829
8107 -18829 -188567 -208592 -135338 -124773 -118277 -92755 -23076 27393 -12380 61616 76673 137298
8095 137298 165370 29725 -65873 -42844 -64143 -185287 -142936 -136613 -24559 71814 59946
8084 59946 12874 -64253 -142209 -116815 -86335 -37812 -41587 -4673 54931 58356 114636 133536
8072 133536 142926 82403 -8759 22220 150242 267008 273029 168832 112677 85838 88816 163647
8060 163647 183069 141014 135125 65796 56646 150235 201695 263034 210375 170878 197825 328338
8048 328338 348759 358961 227035 186492 117162 96725 128083 135029 153915 155623 235717 336079
8036 336079 291692 210111 272726 265068 151918 194587 264593 328310 347539 386190 423580 400860
8024D00860j69427k6347m8263l4119n7867J84285O9833N1644J15852m3963p4658
8013C67830M4011r8360J29196J19070p7133o6509j15673J9631L7153P5619Q4571
8002E19406N2179n3085j8982Q5336J23716p121M1043j6125j2144n0816r0512o1967
7990E10928r7500O0610K4602j641J20449q6791n1719L8996m6145j4990M9203O3702
7978E69704k1591k8627j3021r3470l4839j5468p2716k1195J4509J29186K2887
7967D35359k533N4967L4106O3416K7421J0800r2790k735R5988M5443j40145r8883
7955D30414O924j5497q032R135N8876P5942J38444o981r0001j50868q6659J17367
7943D79064P3718M4162r1590o8814j21392l9859l5294o1717n9414j00492j09406
$$ plain form
8024 400860 231433 205086 156823 122704 64837 249122 318955 370599 486451 442488 367830
8013 367830 411841 313481 442677 561747 484614 418105 302432 322063 359216 434835 519406
8002 519406 571585 518500 499518 584854 708570 701449 742492 726367 714223 663407 572895 510928
7990 510928 413428 474038 498640 496999 617448 530657 478938 517934 471789 456799 506002 569704
7978 569704 548113 519486 506465 412995 378156 362688 289972 268777 283286 412472 435359
7967 435359 432826 487793 521899 585315 612736 623536 530746 528011 623999 669442 529297 430414
7955 430414 437338 421841 413809 422944 481820 557762 696206 689225 599224 448356 361697 479064
7943 479064 552782 596944 505354 436540 315148 275289 239995 178278 118864 18372 -91034
7932i1034K32040J25760l8266J4236j09654K519n1981K6397n9247l2401O3795
7921H2164J77020L9823k2626J1440m4741r5436K2535J34433P2706M6489K8793
7910D52600j01631j52537M0227J11425m8300o1962J3770J2784j0003j48937j04528
7899B908J06760P7025J237K5030L2920k4274j386L250P2751R7019j38125p2794
7887A82321n5189J0084j58436l1825R4671n2915M3642J20339P0868m2173m4847
7876A36540j15133N9801J9975K0822J78125k0911j2967j00097r4672Q0174L8805
7865A90462M2739m6702j18234j8861P4932J06452L8256r5729p5428r6288o8514
7854f6915M159J08171J31845L4901O7915N7571p3649p0778l9995j7523n978K7255
$$ plain form
7932 -91034 141006 266766 228500 242736 133082 135601 83620 110017 50770 18369 82164
7921 82164 259184 299007 276381 287821 243080 147644 170179 304612 377318 423807 452600
7910 452600 350969 198432 238659 350084 301784 239822 253592 266376 256373 107436 2908
7899 2908 109668 186693 187930 212960 245880 221606 220220 223470 296221 393240 255115 182321
7887 182321 127132 137216 -21220 -53045 41626 -11289 32353 152692 223560 181387 136540
7876 136540 21407 81208 101183 122005 300130 279219 266252 166155 71483 151657 190462
7865 190462 233201 186499 68265 49404 124336 230788 269044 173315 97887 1599 -66915
7854 -66915 -62756 45415 177260 212161 280076 337647 263998 193220 153225 135702 129724 156979
7842A56979L1742K4809j42718o3446J0781O7068L6071j21778K2769J06279o9380
7831E9176J4860j02348m1225J57182R0668N8431k2052l6710q1710j18029m96n8549
7819h0802L2445J1146O0151J9335l4006K3688P7600N4296j20457j48494Q221J28885
7807C2008J08109j15197j7522K05355O0285o2759q8258R5613j27302q2581J28991
7796A36742N5414j28567m1200L2533j3650j3123N7657M8966o1062j21658n8622
7785a06570J5970j2179J5921O1459k8361J9515j8997K9682J5326o3299L0373M9409
7773H249j67403j46709j4361Q443L9019N724Q3154K6556j12620O3831R2967N9547
7761e3603J8685Q4570J0471O9456r030j7619j05181p8689k6559n9730J58077R1182
$$ plain form
7842 156979 188721 213530 70812 7366 18147 85215 121286 -492 22277 128556 59176
7831 59176 74036 -28312 -69537 87645 178313 236744 214692 177982 96272 -21757 -22253 -80802
7819 -80802 -48357 -37211 22940 42275 8269 31957 109557 163853 43396 -105098 -96877 32008
7807 32008 140117 24920 7398 212753 273038 210279 122021 217634 90332 7751 136742
7796 136742 192156 63589 22389 54922 41272 28149 85806 134772 73710 -47948 -106570
7785 -106570 -90600 -102779 -86858 -25399 -53760 -34245 -53242 -23560 -8234 -71533 -41160 8249
7773 8249 -159154 -305863 -320224 -311781 -272762 -267038 -183884 -157328 -269948 -206117 -113150 -53603
7761 -53603 -34918 49652 60123 129579 120549 102930 -2251 -80940 -107499 -167229 -9152 82030
7749H2030r640O0904j3582r2504r4532l6266j22172J70324J21927q1298N3756
7738C8947P4095l778j63614m0821j0611o1813J03993J31121l5002N348Q1916p1117
7726D8664r5810J97196N101N2215j02381p4696o5108r7197Q569P6303L4473J14692
7714A02021l1617j86524m0863K2009R3913J16330O093P8335J1517o5332n8996
7703D6886k3318M2140j04417R0171Q5393L7454l0775l3899r3551K6277p2316Q464
7691b1491J4491O8249J6872l0548Q653M2596L809N3079n1862o0007o5599L8350
7679A6592Q3690K590m1240L9042J8559r8015k2805p634l4188M5887K7498j66026
7667a36050q9409O7770l9495r2929J16133K40449k9290m2289L506l2666l197J18394
$$ plain form
7749 82030 72390 133294 119712 27208 -67324 -103590 -225762 -55438 66489 -14809 38947
7738 38947 113042 109264 -54350 -95171 -105782 -167595 -63602 67519 32517 37865 119781 48664
7726 48664 -47146 150050 155151 207366 104985 30289 -34819 -132016 -123447 -47144 -12671 102021
7714 102021 70404 -116120 -156983 -134974 -41061 75269 81362 159697 171214 105882 46886
7703 46886 23568 65708 -38709 51462 136855 174309 143534 109635 16084 42361 -29955 -21491
7691 -21491 -7000 61249 78121 47573 56226 98822 102631 155710 103848 43841 -21758 16592
7679 16592 100282 102872 61632 100674 119233 21218 -1587 -9221 -43409 2478 29976 -136050
7667 -136050 -225459 -157689 -197184 -290113 -173980 66469 37179 -5110 -1604 -34270 -37467 80927
7655H0927N6455m7223n1316m8233k8797O9478L3648l1755K8684M4946l1492p3442
7643A880j671N3960Q529M2747L2321L9713P213j17359p5066p2621k3990m9938
7631a54282l6252N8941J5788J0795J3869j04361J592P0894M7677J929j36308j8084
7619b27802J05842J48112k0639j25020o3214q3087o1330M9560Q2267l7478p2452
7608c05241Q7721J56923J93441K3745j51646j44419k1758M9976L1037J44858J94518
7597B59155J5212j99182r0984M1211j3114q4415J18726L4369o176K7972J8827
7586A21601K8226p8871j24510O5615Q4259K4314j87772o1038l1106J5014n766
7575a50034p3819l2602r4100J00831Q9951Q6139p5783O3325J76634L3195j39450
$$ plain form
7655 80927 137382 90159 38843 -9390 -38187 31291 64939 33184 61868 106814 75322 1880
7643 1880 209 54169 62698 105445 137766 177479 184692 67333 -7733 -80354 -104344 -154282
7631 -154282 -190534 -131593 -115805 -105010 -91141 -195502 -193910 -123016 -75339 -73410 -209718 -227802
7619 -227802 -121960 26152 5513 -119507 -182721 -265808 -327138 -277578 -195311 -232789 -305241
7608 -305241 -217520 -60597 132844 156589 4943 -139476 -161234 -111258 -80221 64637 259155
7597 259155 274367 75185 -15799 25412 12298 -72117 46609 80978 74802 102774 121601
7586 121601 149827 70956 -53554 12061 96320 120634 -67138 -128176 -159282 -144268 -150034
7575 -150034 -223853 -256455 -350555 -249724 -159773 -73634 -149417 -86092 90542 123737 -15713
7564a5713l2075l8718n1812j50421L4200Q7058Q6512K3582n3260n9357L1356J12163
7552b6485J6943j05334j21652J22583O4982N0328l721j38648j026J3414P3165
7541e5451J75751K9640p9420j09131m5281M2382p3930O8860J10352j22027k25620
7530b83875J08717J93097K104J7580m1732j1765p897o0270o296m3994J9160Q0523
7518c4648m0559n4755n9315j06074j35370O8482O9257J17543L967j17408O6673
7507b22207Q3321J07633J27582q6382j67863o6673m2688J5927K4807J35297L5292
7496e5954m268k1133o109J1262K244r7246J7988P1418J3185M1415K5464Q171J00059
7483A06496j70169j4379R1112k7160p5498J36221K1365j37126j5474K4506k4304
$$ plain form
7564 -15713 -47788 -86506 -138318 -288739 -254539 -167481 -80969 -57387 -110647 -170004 -138648 -26485
7552 -26485 -9542 -114876 -236528 -113945 -48963 1365 -2356 -141004 -142030 -128616 -55451
7541 -55451 120300 149940 70520 -38611 -83892 -41510 -115440 -46580 63772 -58255 -283875
7530 -283875 -175158 17939 20043 37623 -4109 -15874 -23771 -84041 -90337 -134331 -115171 -34648
7518 -34648 -75207 -129962 -189277 -295351 -430721 -362239 -292982 -175439 -171472 -288880 -222207
7507 -222207 -138886 -31253 96329 9947 -157916 -224589 -267277 -251350 -226543 -91246 -55954
7496 -55954 -60222 -81355 -87464 -76202 -73958 -171204 -153216 -81798 -68613 -27198 -1734 6437 106496
7483 106496 -63673 -78052 13060 -14100 -89598 46623 67988 -69138 -84612 -60106 -84410
7472h4410j01521J8147Q5608Q3020k0733j9593n681j1484P5339O5916p404k7599
7460D9605m7343j5854L6509O3026M5743p1080J4394R4826n6547o0438K2696p5776
7448b39j5220J16120j32065n5416J4018N1922j01991L8414k1406M101M2737q6050
7436a45075O3490l9145j8398o293R1120q9307n2544M1515J44651P1599p6227p7940
7424i2554N5827J30388L5148k6046N9000K0143J1833j20190j68894l089M9599
7413d8835m2560O9527Q0947p4210J7028k8220k7712R9555q222m9123q2824N0034
7401d4615J06727K8141L6422j11460r3270L0781O6185j21722j3571K53443M7747
7390A84808q8429j48311l1383J02502k0178R451J01987M9351j50097m3278M9815
$$ plain form
7472 -84410 -185931 -167784 -82176 844 -19889 -39482 -45163 -56647 18692 84608 77204 49605
7460 49605 2262 -13592 22917 85943 131686 60606 75000 169826 113279 52841 75537 -239
7448 -239 -15459 100661 -31404 -86820 -72802 -20880 -122871 -84457 -105863 -101762 -59025 -145075
7436 -145075 -81585 -120730 -139128 -145421 -54301 -143608 -196152 -154637 -9986 61613 -14614 -92554
7424 -92554 -36727 93661 128809 102763 161763 181906 193739 73549 -95345 -98434 -48835
7413 -48835 -91395 -21868 59079 -15131 1897 -26323 -54035 45520 37298 -11825 -94649 -44615
7401 -44615 62112 90253 126675 15215 -78055 -47274 18911 -102811 -116382 137061 184808
7390 184808 96379 -51932 -83315 19187 -991 8460 110447 159798 9701 -33577 16238
7379A6238J58075J12308N5619o4088j22858j77725N787Q8394J25509P1051j16356
7368A51954j36281p0744K2319n2498L3034M3901k3164k077l8273m298o5639K0833
7356a20933o6558j487N9796j813P4515M4834J4261k8901J6755K5524m0923j0795
7344c5725M3120J7855J896r69p3316J25928K26043j42969m9144Q3170j03674j00751
7332h536l4312N8278K4107n8758j5404k7700n8784k2874k8259r2957j51983l6076
7320d53258J35939j4009J58763R4690J4196K6042n4800n2635p8679j1034J81928
7309e2857J7850N6327K6167r4936n8958O3856K5995j08534j22119p1819J6864
7298c02164J37260j0715R9396J30179m7010k5834K9340J0020R0954n2566j22451
$$ plain form
7379 16238 174313 286621 342240 278152 155294 -22431 -16644 71750 197259 268310 151954
7368 151954 15673 -55071 -32752 -85250 -52216 -8315 -31479 -33556 -71829 -76127 -141766 -120933
7356 -120933 -187491 -188978 -129182 -130995 -56480 -11646 2615 -26286 -9531 15993 -24930 -35725
7344 -35725 7395 25250 27146 26177 -47139 78789 304832 161863 112719 195889 92215 -8536
7332 -8536 -42848 15430 39537 -19221 -34625 -62325 -121109 -143983 -172242 -265199 -417182 -453258
7320 -453258 -317319 -331328 -172565 -77875 -63679 -37637 -92437 -145072 -223751 -234785 -52857
7309 -52857 -35007 21320 47487 -47449 -106407 -42551 -16556 -125090 -247209 -319028 -302164
7298 -302164 -164904 -175619 -76223 53956 6946 -18888 10452 20472 111426 58860 -63591
7287f3591j13707M9782J47052J1914j150j4819p1911j9699J27664M1101q3784
7276H852j2329O5739o0820j38600N8527M5721O94J4596n4243O8510q9172j56763
$$ plain form
7287 -63591 -177298 -127516 19536 31450 30300 15481 -56430 -76129 51535 92636 8852
7276 8852 -3477 62262 1442 -137158 -78631 -32910 -32216 -17620 -71863 -3353 -92525 -249288
$$ [...]
##END NTUPLES=NMR SPECTRUM
##END=
