##TITLE=Analysis number 323672
Compound Code cc 36524
Book Reference 468/181
Project Code adrs
Chemist Name colinb
##JCAMPDX= 6.0         $$ Bruker NMR JCAMP-DX V2.0
##DATA TYPE= NMR SPECTRUM
##DATA CLASS= NTUPLES
##ORIGIN= Bruker BioSpin GmbH
##OWNER= nmr
$$ XWIN-NMR		Version 3.5
$$ Wed Nov  1 15:58:21 2006 GMT Standard Time (UT+0h)  MAYBRIDGE\nmr@NMR_250MHZ
##.OBSERVE FREQUENCY= 250.131544655141
##.OBSERVE NUCLEUS= ^1H
##.ACQUISITION MODE= SIMULTANEOUS (DQD)
##.ACQUISITION SCHEME= undefined
##.AVERAGES= 16
##.DIGITISER RES= 18
##SPECTROMETER/DATA SYSTEM= dpx250
##.PULSE SEQUENCE= zg30
##.SOLVENT NAME= CDCl3
##.SHIFT REFERENCE= (INTERNAL, CDCl3, 0, 16.522)
##AUDIT TRAIL= $$ (NUMBER, WHEN, WHO, WHERE, WHAT)
$$ ##TITLE= Audit trail, XWIN-NMR		Version 3.5
$$ ##JCAMPDX= 5.01
$$ ##ORIGIN= Bruker BioSpin GmbH
$$ ##OWNER= nmr
$$ C:\u/data/dgb/nmr/ADRS/1980/pdata/1/auditp.txt
$$ ##AUDIT TRAIL=  $$ (NUMBER, WHEN, WHO, WHERE, WHAT)
(   1,<2006-11-01 15:57:59.79 +000>,<MAYBRIDGE\nmr>,<NMR_250MHZ>,
      <created by zg, POWCHK disabled, PULCHK disabled
       configuration hash MD5:
       49 4B E0 1D 92 C2 6B 37 9F E6 65 BC 52 41 86 1D
       data hash MD5: 64K
       26 BB 10 C8 47 FF B4 49 21 65 81 8E 80 00 87 02>)
(   2,<2006-11-01 15:58:12.04 +000>,<MAYBRIDGE\nmr>,<NMR_250MHZ>,
      <Start of raw data processing
       ef LB = 0.3 FT_mod = 6 PKNL = 1 SI = 32K 
       data hash MD5: 32K
       28 1B 0F 96 45 E8 66 49 52 B2 9C D1 83 99 C5 4E>)
(   3,<2006-11-01 15:58:13.67 +000>,<MAYBRIDGE\nmr>,<NMR_250MHZ>,
      <apk 
       data hash MD5: 32K
       57 62 44 9F 5C F9 91 32 07 A3 E1 58 CA 5E DB 37>)
(   4,<2006-11-01 15:58:14.48 +000>,<MAYBRIDGE\nmr>,<NMR_250MHZ>,
      <abs ABSG = 5 
       data hash MD5: 32K
       4E AA 52 9D 3D 75 C2 7D 3A E9 40 D2 BD 8A 70 29>)
$$ ##END=
$$ 
$$ hash MD5
$$ B9 A2 1A A2 61 9C 2F AB B3 A9 CE 08 6F 7F B8 1B
##$RELAX= 
##$RELAX= 
##$RELAX= 
##$RELAX= 
##$RELAX= 
##$RELAX= 
##$RELAX= 
$$ Bruker specific parameters
$$ --------------------------
##$DU= <C:\u>
##$EXPNO= 1980
##$NAME= <ADRS>
##$PROCNO= 1
##$TYPE= <nmr>
##$USER= <dgb>
##$AMP= (0..31)
100 100 100 100 100 100 100 100 100 100 100 100 100 100 100 100 100 100 
100 100 100 100 100 100 100 100 100 100 100 100 100 100 
##$AQSEQ= 0
##$AQ_mod= 3
##$AUNM= <au_zg>
##$AUTOPOS= <41 >
##$BF1= 250.13
##$BF2= 250.13
##$BF3= 250.13
##$BF4= 250.13
##$BF5= 500.13
##$BF6= 500.13
##$BF7= 500.13
##$BF8= 500.13
##$BYTORDA= 1
##$CFDGTYP= 0
##$CFRGTYP= 5
##$CHEMSTR= <none>
##$CNST= (0..31)
1 1 145 1 1 1 1 1 1 1 1 1 1 1 1 1 1 1 1 1 1 1 1 1 1 1 1 1 1 1 1 1 
##$CPDPRG= <>
##$CPDPRG1= <>
##$CPDPRG2= <>
##$CPDPRG3= <>
##$CPDPRG4= <mlev>
##$CPDPRG5= <mlev>
##$CPDPRG6= <mlev>
##$CPDPRG7= <mlev>
##$CPDPRG8= <mlev>
##$CPDPRGB= <>
##$CPDPRGT= <>
##$D= (0..31)
0 1 0 0 0 0 0 0 0 0.06 0 0 0 0 0 0 0.0002 0 0 0 0 0 0 0 0 0 0 0 0 0 0 
0 
##$DATE= 1162396679
##$DBL= (0..7)
120 120 120 120 120 120 120 120 
##$DBP= (0..7)
150 150 150 150 150 150 150 150 
##$DBP07= 0
##$DBPNAM0= <>
##$DBPNAM1= <>
$$ [...]
##$SUBNAM7= <"">
##$SUBNAM8= <"">
##$SUBNAM9= <"">
##$SW= 20.6930455092707
##$SWIBOX= (0..15)
0 0 3 0 0 0 0 0 0 0 0 0 0 0 0 0 
##$SW_h= 5175.983436853
##$TD= 65536
##$TD0= 1
##$TE= 683.16
##$TE2= 300
##$TE3= 300
##$TEG= 300
##$TL= (0..7)
0 120 120 120 120 120 120 120 
##$TP= (0..7)
150 150 150 150 150 150 150 150 
##$TP07= 0
##$TPNAME0= <>
##$TPNAME1= <>
##$TPNAME2= <>
##$TPNAME3= <>
##$TPNAME4= <>
##$TPNAME5= <>
##$TPNAME6= <>
##$TPNAME7= <>
##$TPOAL= (0..7)
0.5 0.5 0.5 0.5 0.5 0.5 0.5 0.5 
##$TPOFFS= (0..7)
0 0 0 0 0 0 0 0 
##$TUNHIN= 0
##$TUNHOUT= 0
##$TUNXOUT= 0
##$USERA1= <user>
##$USERA2= <user>
##$USERA3= <user>
##$USERA4= <user>
##$USERA5= <user>
##$V9= 5
##$VALIST= <valist>
##$VCLIST= <CCCCCCCCCCCCCCC>
##$VD= 0
##$VDLIST= <DDDDDDDDDDDDDDD>
##$VPLIST= <PPPPPPPPPPPPPPP>
##$VTLIST= <TTTTTTTTTTTTTTT>
##$WBST= 1024
##$WBSW= 4
##$XGAIN= (0..3)
0 0 0 0 
##$XL= 0
##$YL= 0
##$YMAX_a= 572917
##$YMIN_a= -472963
##$ZGOPTNS= <>
##$ZL1= 120
##$ZL2= 120
##$ZL3= 120
##$ZL4= 120
##$ABSF1= 16.522
##$ABSF2= -4.171173
##$ABSG= 5
##$ABSL= 3
##$ALPHA= 0
##$AQORDER= 0
##$ASSFAC= 0
##$ASSFACI= 0
##$ASSFACX= 0
##$ASSWID= 0
##$AUNMP= <proc_1d>
##$AZFE= 0.1
##$AZFW= 0.1
##$BCFW= 0
##$BC_mod= 0
##$BYTORDP= 0
##$COROFFS= 0
##$CY= 12.5
##$DATMOD= 1
##$DC= 0
##$DFILT= <>
##$DTYPP= 0
##$F1P= 14.0000005364418
##$F2P= -0.99999901652339
##$FCOR= 0.5
##$FTSIZE= 32768
##$FT_mod= 6
##$GAMMA= 0
##$GB= 0
##$INTBC= 1
##$INTSCL= 1
##$ISEN= 128
##$LB= 0.3
##$LEV0= 0
##$LPBIN= 0
##$MAXI= 10000
##$MC2= 0
##$MEAN= 0
##$ME_mod= 0
##$MI= 0
##$NCOEF= 0
##$NC_proc= -3
##$NLEV= 6
##$NOISF1= 0
##$NOISF2= 0
##$NSP= 0
##$NTH_PI= 0
##$NZP= 0
##$OFFSET= 16.522
##$PC= 1
##$PHC0= -42.37284
##$PHC1= 10.03834
##$PH_mod= 1
##$PKNL= yes
##$PPARMOD= 0
##$PSCAL= 4
##$PSIGN= 0
##$REVERSE= no
##$SF= 250.13
##$SI= 32768
##$SIGF1= 0
##$SIGF2= 0
##$SINO= 400
##$SIOLD= 32768
##$SREGLST= <1H.CDCl3>
##$SSB= 0
##$STSI= 32768
##$STSR= 0
##$SW_p= 5175.98343685301
##$SYMM= 0
##$S_DEV= 0
##$TDeff= 65536
##$TDoff= 0
##$TI= <Analysis number 999999
Compound Code 99
Book Reference 9
Project Code 9>
##$TILT= no
##$TM1= 0
##$TM2= 0
##$TOPLEV= 0
##$USERP1= <user>
##$USERP2= <user>
##$USERP3= <user>
##$USERP4= <user>
##$USERP5= <user>
##$WDW= 1
##$XDIM= 32768
##$YMAX_p= 349591590
##$YMIN_p= -220521
$$ End of Bruker specific parameters
$$ ---------------------------------
##NTUPLES= NMR SPECTRUM
##VAR_NAME=  FREQUENCY,     SPECTRUM/REAL,   SPECTRUM/IMAG
##SYMBOL=    X,             R,               I
##VAR_TYPE=  INDEPENDENT,   DEPENDENT,       DEPENDENT
##VAR_FORM=  AFFN,          ASDF,            ASDF
##VAR_DIM=   32768,         32768,           32768
##UNITS=     HZ,            ARBITRARY UNITS, ARBITRARY UNITS
##FACTOR=    0.157963299565203, 1,           1
##FIRST=     4132.6476996994, 0,             0
##LAST=      -1043.33573715361, 0,           0
##MIN=       -1043.33573715361, -220521,     0
##MAX=       4132.6476996994, 349591590,     0
$$ Real data points
##PAGE= N=1
##DATA TABLE= (X++(R..R)), XYDATA
$$ [...]
19510G933l072P1209L2490K0646j2588j4331m5263k4947M2000L6353j9148K1656
19498A12938N0674k5771m6805o760M8059K5556M9356l222k5615O242K8262k6482
19486A86432p8270k8270M2404m8133K5450R6208r740k2977J826M579j061J0441
19474A78889l35j1089k0281J5258K4944K683n1297k8741o9548k2575N5940J2983
19462H6831j1245N6964R2268r471M6747K3913o5639k8828O5469K0455m364m6186
19450B26914L856O8149o985L1795J2189P611j6782Q778m557l715n2721n0363l293
19437B20876m4593m5307j9408l5320L3241N6456J2436J6197Q4575N1909k8524
19426C02538k839r837q547j34o374l6297J0550O0739j6486n6565q9745q286L3347
$$ plain form
19510 7933 4861 76070 108560 129206 116618 102287 57024 32077 74077 110430 91282 112938
19498 112938 163612 137841 91036 84276 132335 157891 207247 204025 178410 184652 212914 186432
19486 186432 108162 79892 122296 74163 99613 195821 186081 163104 164930 169509 168448 178889
19474 178889 178554 167465 147184 162442 187386 190069 138772 110031 40483 17908 73848 86831
19462 86831 75586 132550 224818 215347 262094 286007 220368 191540 257009 277464 273100 226914
19450 226914 230770 298919 291934 323729 335918 343529 326747 335525 330968 327253 274532 224169 220876
19437 220876 176283 130976 111568 76248 109489 165945 178381 194578 279153 331062 302538
19426 302538 299699 289862 281315 281181 274807 238510 249060 309799 293313 236748 147003 138717 172064
19413A72064N8504O761L1740j565M6059P0766j4910k7689k9027M5970j3662j567
19401C43444m8537q2609m2086L2660M6743J01213O916l7857m3773J397O1153j5958
19389C22706n1834L7548L2243K3109K1774K8826l7213M8104L5541K4730l134j7792
19377D64608L7548M2171j5525p8380O3308N4406k1876M0862K7270K6786M2621
19366F83799J0512M9786K4482N8986L4767j651r961K3658j652K1686L6640J7538
19354I48590L6586J422j045P813n8324K9720Q9810L3146Q6042J40864J43673R2983
19342A551280J97301J88525Q0632P6315J82876J97407K66043K80026K55041L23954
19332C599400M62037O87712Q47024J131146J673496K348033L096899L333920L446825
$$ plain form
19413 172064 230568 237329 269069 267504 313563 384329 369419 341730 312703 358673 345011 343444
19401 343444 294907 212298 170212 202872 249615 350828 357744 319887 276114 277511 338664 322706
19389 322706 270872 308420 340663 363772 385546 414372 377159 425263 460804 485534 482400 464608
19377 464608 502156 544327 528802 450422 513730 568136 546260 587122 614392 641178 683799
19366 683799 694311 744097 768579 827565 862332 860681 850720 874378 872726 894412 931052 948590
19354 948590 985176 986598 985553 993366 935042 964762 1054572 1087718 1173760 1314624 1458297 1551280
19342 1551280 1748581 1937106 2017738 2094053 2276929 2474336 2740379 3020405 3275446 3599400
19332 3599400 4061437 4749149 5596173 6727319 8400815 10748848 13845747 17179667 20626492
19323B0626492L653543L447302K706059K591137L442490M392637M839338N556750
19315E1255748O284144N106180K960715K034097J926552J184688p7433m15710
19307G0258981n02060j328957k340278k862327k999306k643204j885037k036053
19299E3661759k551431k737227k925590k985921l680744m583540m708611m581888
19291B4906807m441626l939939l262697k366091j623027j196072r72846p29836
19283F374673n29955l84221l65087l49867k21216j82317j36237k18044j74234
19274C813495j10179j11476p4446p3294j04087o0460n9994O869L5065K896p7057
19263C187332q3002l6122N222k2562p4628p4439l8903l0906r6364q6269k1733
$$ plain form
19323 20626492 24280035 27727337 30433396 33024533 36467023 40859660 45698998 51255748
19315 51255748 57539892 62646072 65606787 67640884 69567436 70752124 70674691 70258981
19307 70258981 69756921 68427964 66087686 63225359 60226053 57582849 55697812 53661759
19299 53661759 51110328 48373101 45447511 42461590 38780846 34197306 29488695 24906807
19291 24906807 20465181 16525242 13262545 10896454 9273427 8077355 7104509 6374673
19283 6374673 5844718 5460497 5095410 4745543 4524327 4342010 4205773 3987729 3813495
19274 3813495 3703316 3591840 3517394 3444100 3340013 3279553 3219559 3226428 3261493 3264389 3187332
19263 3187332 3104330 3068208 3073430 3050868 2976240 2901801 2862898 2831992 2735628 2649359 2627626
19252B627626j6605p0712p8444m9969j04216q0029o9897m9298r9496r2940j5911
19241A900109r5999n7038r3039j32340j45542j01014l3391m6464k188j2999n0442
19230A129653m8345l3427k5168o1215L3295k2435J0730p505k2887m351L523j6717
19218I35151l0194j9923L788P8034R3786l6466o3602Q3504J6758o2752j9262o927
19206I71895L6450P2584K18703J64552J14495J53174K98483K56155K73569L15397
19196B875457K76971K25909M5029m4944r6027k07142k10161j67233k3105K19949
19186B894703K60360K57851K86336L56405L29579J33752K7527j10829r7673j0082
19176D327929O0805L05237O92921J197407J873059K819364L828798M249203L935377
$$ plain form
19252 2627626 2611021 2540309 2461865 2411896 2307680 2227651 2157754 2108456 2008960 1916020 1900109
19241 1900109 1804110 1747072 1654033 1521693 1376151 1275137 1241746 1195282 1193094 1180095 1129653
19230 1129653 1081308 1047881 1022713 961498 994793 972358 983088 975583 952696 948345 951868 935151
19218 935151 904957 885034 888822 966856 1060642 1024176 960574 1044078 1060836 998084 978822 971895
19206 971895 1008345 1080929 1299632 1464184 1578679 1731853 2030336 2286491 2560060 2875457
19196 2875457 3152428 3378337 3423366 3378422 3282395 3075253 2865092 2697859 2674754 2894703
19186 2894703 3155063 3412914 3699250 4055655 4385234 4518986 4546513 4435684 4338011 4327929
19176 4327929 4388734 4693971 5386892 6584299 8457358 11276722 15105520 19354723 23290100
19167B3290100K560662P5382k064115l296413l308871k393883j006253M88091
19159A4344700J982907L010661L378146K733864J033005o12222j672066j714645
19151B2484350r17629k73694J84650Q01661J220404L48226j037175j603308j469181
19142A9738304j453582j497027j052533k10063J029466K304992L232190M037609
19134B6129356N185893O707540O486563K662937k385391n250853n663955m412050
19126B9460040k312323J63349K396208K855233L97537k740439m112853l593055
19118B2513697k090268l75731J309908L046075M719311O272257P556110Q227364
19110E1178723Q388850R317970J1990990J5573910J5068155M922410q642015j6067607
$$ plain form
19167 23290100 25850762 25926144 23862029 20565616 17256745 14862862 13856609 14344700
19159 14344700 16327607 19338268 22716414 25450278 26483283 25871061 24198995 22484350
19151 22484350 21566721 21293027 21477677 22279338 23499742 23847968 22810793 21207485 19738304
19142 19738304 18284722 16787695 15735162 15525099 16554565 18859557 22091747 26129356
19134 26129356 31315249 38022789 44509352 47172289 44786898 39536045 33872090 29460040
19126 29460040 27147717 27311066 29707274 32562507 32960044 30219605 26106752 22513697
19118 22513697 20423429 20047698 21357606 24403681 29122992 35395249 42951359 51178723
19110 51178723 59567573 68885543 80876533 96450443 111518598 116441008 107798993 91731386
19102I1731386j5990605j1517178p122617m891919n008192n663939n947163n157051
19094C0432722l620451j807223J73784K303996M677365Q084820J2459189J7667408
19086G0371610K1204853J6721552K122399j2410224j9535023j9381476j5243205
19079D3850486j0616753p040846m621573k990947j726904r58521p27145r74083
19071A4193714j344738j555291j528961j233676r17651o98208n07547l77908k26123
19062E803611p3250j6236M433K5783k5513j52749k20657j29035j39978j69919
19052D906490k66215k38445j95709j93938k67000k51102j61081j03747q7302o4545
19042C077406l1242J0269Q7638J06259J12446M9055p23j977p7337j72048j90772
$$ plain form
19102 91731386 75740781 64223603 57100986 52209067 47200875 41536936 35589773 30432722
19094 30432722 26812271 25005048 25178832 27482828 32160193 40245013 52704202 70371610
19086 70371610 91576463 108298015 110420414 98010190 78475167 59093691 43850486
19079 43850486 33233733 26192887 21571314 18580367 16853463 15894942 15167797 14193714
19071 14193714 12848976 11293685 9764724 8531048 7613397 6915189 6407642 6029734 5803611
19062 5803611 5730361 5714125 5718558 5744341 5718828 5566079 5345422 5216387 5076409 4906490
19052 4906490 4640275 4401830 4206121 4012183 3745183 3494081 3333000 3229253 3141951 3077406
19042 3077406 3046164 3056433 3144071 3250330 3362776 3411831 3411108 3409131 3331794 3159746 2968974
19031B968974k30132k71120k74252j88062j54440j17484j43182j10337n0407J5406
19021A444964k3283q695o3027j34389j13127r011Q452K5959k1671j4816m327o9006
19009A018023r2902m7556m7169m0258R075j5128o42m5064p2371l8512O7348Q976
18997G03820r0250l3881m429m461N2629K6973n6560j9104o3987K937R597M5160
18985E68444n343m1255R848p288N8019L9086K0100j2405l9039j12947K335O8513
18973E48068K5097l6236P420R3699N8469N8939J7787q0997k9297k1056k4582l1957
18961E85354q6289J6973j1920L6446L3974l886q580P977l546o3130q055M144j7179
18948D82283j6142j592l9348K683m1539n3446J2180k4569m3217k2207m3451q03
$$ plain form
19031 2968974 2738842 2467722 2193470 2005408 1850968 1733484 1590302 1479965 1429558 1444964
19021 1444964 1421681 1412986 1349959 1215570 1102443 1093432 1101884 1127843 1106172 1091356 1087029 1018023
19009 1018023 925121 877565 830396 790138 799213 784085 783443 738379 666008 627496 694844 703820
18997 703820 613570 579689 575260 570799 623428 650401 593841 574737 510750 513687 523284 568444
18985 568444 563101 521846 531694 524406 582425 621511 641611 629206 590167 477220 479555 548068
18973 548068 573165 536929 544349 638048 696517 755456 773243 692246 662949 641893 617311 585354
18961 585354 499065 516038 504118 540564 574538 570652 562072 570049 566503 503373 495318 499462 482283
18948 482283 466141 464549 425201 427884 386345 332899 345079 320510 277293 255086 211635 210832
18936B10832P0025N1378K4735n163m3745j1007P5659J1747M1692J5632N1150P2761
18924E65696M6940L7917J6369O9246P4795N4701K2035n8911n8853K439n0463o0452
18912F61459l2671p0533k3096l87n1294K3084J7312j6225k5180j5672n302q5013
18900C76482k1212k563m8150j5393k1297J0815l0686m143m9670j2064K7179P2068
18888B81366K0152k2666K8544k5036n5155J4602l0842k0837L4071K1053N7816
18877C03068L8132N4409J62395J71457J50844J01767r148m6450j07304k07860
18867F11310j66677j17059m8770n4805m9927J8328l4531l8957k6702L5970L017
18856A31197L4294N7483J47385J43997P4822O1538k9540j33568p9755p0090n1681
$$ plain form
18936 210832 280857 332235 356970 351807 308062 297055 372714 384461 426153 441785 492935 565696
18924 565696 612636 650553 666922 736168 810963 865664 887699 828788 769935 772374 721911 661459
18912 661459 628788 558255 535159 534772 483478 506562 523874 507649 482469 466797 461495 376482
18900 376482 355270 352707 304557 289164 267867 278682 247996 243853 194183 182119 209298 281366
18888 281366 301518 278852 307396 282360 227205 241807 210965 190128 224199 245252 303068
18877 303068 341200 395609 558004 729461 880305 982072 972924 926474 819170 611310
18867 611310 444633 327574 278804 223999 174072 192400 157869 118912 92210 128180 131197
18856 131197 165491 222974 370359 514356 589178 650716 621176 487608 407853 337763 286082
18845B86082K6239j1668Q416k8755m2042k8424j972J329J8567L3782j2579j3651
18833B35324n5528r262L6262J4067p0427k9129L1005J922J5003J9775L0713L444
18821B23169p7155k3763Q2072r367Q295L1488J3787k422L2846L9866N9411N3700
18809D31927k1141j5823N3700J8850j3882J9513j0461k0449K0076L8217M5110
18798E45637M1887n5673j6619J7880l6960l8179p2365p039O147n2461m1545l0063
18786B60647o960O1386l7101J6479l6553j065k5177J0398J1673l2412n5446k9866
18774A36003R8565Q2609L52L6894O3662J02382Q4618j7576j07040j18808m3723
18763C17938p4938l4236L243k6239k6620l5161P31j402L5480M530k8432M1751
$$ plain form
18845 286082 312321 300653 309069 280314 238272 209848 207876 209205 227772 261554 248975 235324
18833 235324 179796 170534 206796 220863 150436 121307 152312 154234 169237 189012 219725 223169
18821 223169 146014 122251 204323 194956 203251 234739 248526 246104 278950 318816 378227 431927
18809 431927 410786 394963 448663 467513 453631 473144 462683 442234 462310 500527 545637
18798 545637 587524 531851 515232 533112 496152 457973 385608 378569 384716 332255 290710 260647
18786 260647 253687 315073 277972 294451 257898 256833 231656 242054 253727 221315 165869 136003
18774 136003 234568 317177 317529 354423 418085 520467 605085 587509 480469 361661 317938
18763 317938 243000 208764 212007 185768 159148 123987 124718 123316 158796 163326 134894 176645
18751A76645N0444q0281o5213N0166K6553Q4272o5842r7254j8864N738O4516L9240
18739A70120p345P9867Q4310k1172m1513R507r0340k0552M149l9405Q278l413
18727A32491J1066p5706l0619o290M8443M9901k981r620j2182l5096J6783Q397
18715I4587K2207J9158l8827J0431O5630l5068o0475m7778j4423J4254K2227J8147
18703G0070L9114k0130M0478M3088k2495k8646K3972Q594O680K6462M2568j6353
18691B13402K5589M826n3477r999l9806n229p271j255J4385J1849k6398J0709
18679A37325K5406L3389K2800N3368m329n0453J292K3391O2153M403n7513J8497
18667B69729P036l9098M3046N2711M5649J5683L3289K3316k5554J0706P123R179
$$ plain form
18751 176645 227089 146808 81595 131761 158314 242586 176744 79490 60626 66364 130880 170120
18739 170120 162775 242642 326952 305780 264267 273774 183434 162882 167031 127626 135904 132491
18727 132491 143557 67851 37232 30942 79385 129286 126305 116685 104503 69407 86190 94587
18715 94587 116794 135952 97125 107556 173186 138118 77643 29865 15442 29696 51923 70070
18703 70070 109184 89054 129532 172620 150125 121479 145451 154045 160725 187187 229755 213402
18691 213402 238991 243817 190340 180341 140535 135306 128035 126780 141165 153014 126616 137325
18679 137325 162731 196120 218920 272288 267959 217506 218798 242189 304342 308745 251232 269729
18667 269729 276765 237667 280713 333424 379073 394756 428045 451361 425807 436513 443636 452815
18655D52815J5689l0326J452k2257J0019O324M734k0189J8602J400o352n7898
18643C74013n9067j7365j9593l858J6423l4847q6161p585K1828K4036M4543J8985
18631B71352l2187l1179k0984K8717L5091K7403R2977j0138q0696j6016Q7505
18620C51845M6688j1168j4054k8297p1972P3102J3376l8556N060K4041p7287o6093
18608B06685m5724N9102J19465J0751k3169K5635M0015L7033o891K1446K995m2830
18596D04513m7497M2705L1505J3402m53P844N6725l7887o8235n3672n318K9341
18584C72973l3994L195Q6612J8233q2314k0610J9500J6635K3566o6461k0141k9062
18572B88132N1990J0661J0495k0945K4235O2029l7920k0372L2168J0216J3023
$$ plain form
18655 452815 468504 438178 439630 417373 427392 433716 438450 418261 436863 438263 431911 374013
18643 374013 314946 297581 277988 274130 290553 255706 169545 161960 183788 207824 252367 271352
18631 271352 239165 207986 187002 215719 250810 278213 371190 361052 280356 264340 351845
18620 351845 398533 387365 373311 345014 273042 346144 359520 320964 326024 350065 272778 206685
18608 206685 160961 220063 339528 350279 327110 352745 392760 429793 422902 444348 447343 404513
18596 404513 357016 399721 431226 444628 444175 452019 508744 470857 402622 348950 343632 372973
18584 372973 338979 342174 428786 447019 364705 344095 363595 380230 403796 337335 317194 288132
18572 288132 340122 350783 361278 340333 364568 426597 388677 368305 400473 410689 423712
18561D23712L286M683l1825l1235J5180J1981k5430k3074L5560J1055L0897k5718
18549C99072k1835k5801k2183J6460J2070K2384M4109J2745q496q380j3259k6388
18537C80498N2369O7669K8988J3185J9337P2429m6270N345L6201l4185k6885Q074
18525E76755r2173j21292n8466R197M4765O5321N8923J4456j544j9407N5008J46070
18513F77613J34413P6436P3232J27120n9628r1060m4741M4762l2861l5067N4619
18502I24838m0022k6187m2908K0438M8398M562m6218N1904O0790Q5903J58275
18491A199773J46388J65359Q6116j4846q5040o9808L034R7944J60039J67306J72662
18480B028927J53658K4966p4016j13851j489P1760K05820K76123M84033P30726
$$ plain form
18561 423712 426998 431681 399856 368621 383801 395782 370352 347278 382838 393893 424790 399072
18549 399072 377237 351436 329253 345713 357783 380167 424276 437021 428525 420145 406886 380498
18537 380498 432867 500536 529524 542709 562046 634475 588205 593550 629751 595566 568681 576755
18525 576755 484582 363290 304824 314021 358786 424107 483030 497486 495942 476535 531543 677613
18513 677613 812026 888462 961694 1088814 1029186 938126 893385 938147 905286 870219 924838
18502 924838 884816 858629 815721 836159 884557 889119 842901 894805 955595 1041498 1199773
18491 1199773 1346161 1511520 1597636 1582790 1497750 1427942 1430976 1528920 1688959 1856265 2028927
18480 2028927 2182585 2207551 2133535 2019684 2018195 2089955 2295775 2571898 3055931 3786657
18470C786657J012517J245977J186265J059657N03704k73203o39934o84185n29576
18461F667879j46820L34393O77057Q31547Q12960N18799P3359k38700m04185k71776
18451H854513J16258M75461O90705J064774J318956J853498L022989M868419P732039
18442B9997612J2012379J8303361K5938726K8943764J6612454m463847j6456369
18435A10888080j5798656n620066P683289J7730639J4881087j598276j7094101
18428A11071996k4100185k2140325j5793547r440520m603016j031886J818894
18421C5781411M083012N470898N693361M217260O14470k743532m806535n048649
18413D3261696l328572m46509K830297N384160O489762N945122L323680R09864
$$ plain form
18470 3786657 4799174 6045151 7231416 8291073 8794777 8521574 7881640 7197455 6667879
18461 6667879 6521059 6855452 7532509 8364056 9177016 9695815 9769174 9530474 9126289 8854513
18451 8854513 8970771 9446232 10136937 11201711 12520667 14374165 17397154 22265573 29997612
18442 29997612 42009991 60313352 86252078 115195842 131808296 127344449 110888080
18435 110888080 95089424 89469358 97152647 114883286 129764373 128166097 111071996
18428 111071996 86971811 64831486 49037939 39597419 34994403 33962517 35781411
18421 35781411 39864423 45335321 51028682 55245942 55860412 53116880 48310345 43261696
18413 43261696 39933124 39486615 42316912 47701072 54190834 60135956 63459636 64369500
18405F4369500M17660K477064M769866L153163j425677l575729j672503J189156
18397F9702500o29113o896312j1271249j1695954r358501o434424m280032k906210
18389A6230705k110233j575970j199618q62903p19661o75477m68522k32560j80525
18380H205236l08722l61691l25349m11680l97234l44736l46724l67820k81953
18371E059327k55031k51841o2511j4478R29P515j3521O95J6039p828L487N8249
18359D541031K51139L48029O04262J014607J391382J341351O16541j90423n27344
18350I390575l23411n6941l42306j003127j288320j216002r37856o52382m15878
18341C154352k62691k33027j48731j26131q5605j17216r8223l9286j12087m6033
$$ plain form
18405 64369500 64787160 67264224 72034090 75187253 73761576 70185847 68513344 69702500
18397 69702500 69073387 62177075 50905826 39209872 29851371 23416947 19136915 16230705
18389 16230705 14120472 12544502 11344884 10481981 9762320 9086843 8618321 8385761 8205236
18380 8205236 7896514 7534823 7209474 6797794 6400560 6055824 5709100 5341280 5059327
18371 5059327 4804296 4552455 4489944 4475466 4476395 4483910 4470389 4471084 4487123 4479295 4482782 4541031
18359 4541031 4792170 5140199 5744461 6759068 8150450 9491801 10108342 9917919 9390575
18350 9390575 9067164 9010223 8667917 7664790 6376470 5160468 4222612 3570230 3154352
18341 3154352 2891661 2658634 2509903 2383772 2298167 2180951 2082728 2043442 1931355 1885322
18331A885322j4432r0507m1223L4649o366m0813J5355l8653o4563o6736j06850
18320A465183P802j739r9131n1661R664k9655L1011L8784N7673L9962M302J6788
18308A488983N9774M8998J2715J8556K8690L6509N7154J87722K44768K14744K07392
18297B606005L03678L28490J87179L4578r7532M1112J45830K00691L28582M68396
18287D547009O73775Q85006J181826J870378L021397M774734P607099J2068897
18279C6630121J8694797K7026760K9418634J3566721j1058923k5111927k6444430
18272F2721753j9933961j2509279p319937m436564k881605j843634j084442m09571
18264A2302760L40156J294707K773030M925636Q198136J3086277K0162730K7509817
$$ plain form
18331 1885322 1870890 1780383 1739160 1773809 1767443 1726630 1741985 1703332 1638769 1572033 1465183
18320 1465183 1472985 1471246 1372115 1320454 1330118 1300463 1331474 1370258 1427931 1467893 1472195 1488983
18308 1488983 1548757 1597755 1610470 1629026 1657716 1694225 1751379 1939101 2183869 2398613 2606005
18297 2606005 2909683 3238173 3425352 3459930 3362398 3403510 3549340 3750031 4078613 4547009
18287 4547009 5220784 6105790 7287616 9157994 12179391 16954125 24561224 36630121
18279 36630121 55324918 82351678 111770312 125337033 114278110 89166183 62721753
18272 62721753 42787792 30278513 22958576 18522012 15640407 13796773 12712331 12302760
18264 12302760 12642916 13937623 16710653 21636289 29834425 42920702 63083432 90593249
18256I0593249K4870308M504203j7037650k6254561k4285441j6947064j0317387
18249B5125657o192498l992257k794121k077388j602336j221744r18692o27630
18241E698991m07932k98599j58392j15066m4533J77251J15743k0389n8833k76685
18231D611556l85971k70567j97264j18603j18253j46950j09152j70957j99580
18222B894259j91976k33668j32253j15765o4007n2408n5540o1603m0951p6455
18212A869633n1158K3604M5817J11180P2451k807K8966M1089o0561j80840j57192
18201A740182j33607j17458q7960j00990q8230m5933k6560j18655q0468l2340
18191I07981J9664m2978q6841k5614M0001L996k0966k6869o7927m2400M7691m0757
$$ plain form
18256 90593249 115463557 119967760 102930110 76675549 52390108 35443044 25125657
18249 25125657 18933159 14940902 12146781 10069393 8467057 7245313 6326621 5698991
18241 5698991 5291059 4992460 4834068 4719002 4674469 4851720 4967463 4947074 4888241 4611556
18231 4611556 4225585 3955018 3757754 3639151 3520898 3373948 3264796 3093839 2894259
18222 2894259 2702283 2468615 2336362 2220597 2156590 2104182 2048642 1987039 1946088 1869633
18212 1869633 1818475 1842079 1887896 1999076 2071527 2068720 2097686 2138775 2078214 1897374 1740182
18201 1740182 1606575 1489117 1401157 1300167 1211937 1166004 1139444 1020789 940321 907981
18191 907981 927645 884667 797826 772212 812213 816209 795243 768374 700447 658047 705738 664981
18179F64981j35J9280O3059m5432k5280q5344n5081j8709J2961P3066O449L3083
18167F42898L4481m5448q5834k8801R349J7738J7767J6244j9756k706M5715L6134
18155F37781k9238j1031N6236N3091p8223n1962O049N4430O9874J6965l634n5743
18143F64595l2552J242P9788J6978l9150K686L474L3173L3578N5644n733L2324
18131H46047R0921P3367P1870R9866Q5013J99968K39892K12479J69108K38107
18121B326638L51489M81659P04718J005076J444420K466413M149020O666690J0551357
18112C0147480J6583880K3718980K1231717J92097j6591020k2266562j8580185
18105C4436387j1812564o851160m039085k542965j827960j280091r55177p39961
$$ plain form
18179 664981 664846 684126 747185 701753 676473 591129 536048 517339 530300 603366 609815 642898
18167 642898 677379 631931 546097 517296 526645 544383 562150 578394 558638 555932 601647 637781
18155 637781 608543 597512 653748 706839 628616 576654 582703 637133 707007 723972 720338 664595
18143 664595 632043 633285 713073 730051 690901 693587 697061 730234 763812 819456 813723 846047
18131 846047 936968 1010335 1082205 1182071 1267084 1467052 1706944 1919423 2088531 2326638
18121 2326638 2678127 3159786 3864504 4869580 6314000 8780413 12929433 19596123 30147480
18112 30147480 46731360 70450340 91682057 91874154 75283134 53016572 34436387
18105 34436387 22623823 15772663 11733578 9190613 7362653 6082562 5127385 4387424
18097D387424n80885m77231l66626l25127k13003k25359j78292j08501r0839p2738
18087A748823q0030o3603p1542r3610j3266j8635q7488o6591j6391m6505q1566
18076A109596p2495J7564j9358q6395m4933k64R1409L2786N7980O0648L6628L3589
18064A216755M0876R7785R7556P1412K9203L5277k4125j10371j69844j62125j48527
18053I73872r0499n3174p5896j25304l7035j5288m6956p7061l6958J5948K3029
18042D54678l5247M5735K3357m0997j06163n9949m1995l5624J4973N28O1079J7588
18030B97963m3419o127J6165M6245J640m3201L2275k6274k1713m796k4457k173
18018B22128n0095l6726O6285J6817m6007k843L6590L3535O1952O0401J14265
$$ plain form
18097 4387424 3806539 3329308 2962682 2637555 2424552 2199193 2020901 1912400 1821561 1748823
18087 1748823 1668793 1605190 1533648 1440038 1426772 1408137 1320649 1254058 1237667 1191162 1109596
18076 1109596 1037101 1054665 1035307 948912 903979 903715 995124 1027910 1085890 1146538 1183166 1216755
18064 1216755 1257631 1355416 1452972 1524384 1553587 1588864 1564739 1454368 1284524 1122399 973872
18053 973872 883373 830199 754303 628999 591964 576676 529720 452659 415701 431649 454678
18042 454678 419431 465166 488523 447526 341363 281414 239419 203795 218768 219296 280375 297963
18030 297963 254544 248417 264582 310827 312467 269266 301541 275267 253554 248758 224301 222128
18018 222128 172033 135307 201592 218409 172402 169559 206149 239684 301636 362037 476302
18007D76302K198m2350j150J6501J4883P5613J16492M5051j850p653J7645O3067
17995G74749l46q552L1976l6797o8719k804p2366p8996r8427k6017j9785K4392
17983D18308m5353q2494l8905n245Q931p4308m7222n881j9542k3667m3064O9200
17971A10758M917M0365K8750L4980K5101M8540P4384k7054n6198r012n707l5786
17959B34038q052K7042Q4306R2198L4430J2142l3293K7812N9659O9229K0812M2831
17947F63154J32348O9775k158K4249l5354j09789m0945o3265j03169j24520j7464
17936C92862J5324n7412n4560l3779J2009k8882l0362k643n4495R661l89o2901
17924A04433M3738O281m7568j9172K7049J9450k3954K1440K0647k6832m0960O0687
$$ plain form
18007 476302 478500 436150 435000 451501 466384 541997 658489 703540 701690 694037 711682 774749
17995 774749 774403 765851 797827 761030 692311 689507 617141 538145 439718 413701 393916 418308
17983 418308 372955 290461 251556 246311 255242 180934 133712 127831 108289 84622 41558 110758
17971 110758 115675 156040 184790 219770 244871 293411 367795 340741 284543 275531 269824 234038
17959 234038 225986 253028 337334 429532 463962 476104 442811 470623 530282 599511 620323 663154
17947 663154 795502 865277 863119 887368 852014 742225 701280 638015 534846 410326 392862
17936 392862 408186 350774 296214 262435 274444 245562 215200 212557 158062 167723 167334 104433
17924 104433 148171 154452 106884 87712 114761 134211 110257 131697 152344 125512 84552 145239
17912A45239O7527m5806k2233N2839N5633q936l278m1970O5997P7913M1793L6361
17900D21079P4728O8707L9835R746M8871j6105n556q6582r1024m450o4828j02337
17888B92084P269j8431o7938J0201J9640m1112o0705l4928m648j6321l1668m0947
17876A2496j2327n1605M54P6299K5340n039n937l6840p037J8697K8080L0361J0838
17863H3780K9470r242J6543J6065k3230p1967j6906K8587m6461l9939Q7479L5877
17851I0056J487K3103K0919L7407O203L234J6240j0153k9691m692j5422n9231
17839G9460n4909m6357n317m2725O4986M0090k9889m4594j2604N6125k6746l9393
17827f1873j72K1576M402m0902J2461O244L938L0281P9215K9929k838q0555o6609
$$ plain form
17912 145239 212766 166960 144727 197566 253199 244263 240985 199015 265012 342925 384718 421079
17900 421079 495807 564514 604349 614095 662966 646861 641305 554723 463699 459249 394421 292084
17888 292084 299353 280922 212984 223185 242825 201713 141008 106080 101432 85111 53443 12496
17876 12496 169 -51436 -50982 25317 50657 45618 39681 2841 -4196 14501 42581 72942 83780
17863 83780 113250 104008 120551 136616 113386 41419 24513 53100 6639 -33300 54179 90056
17851 90056 91543 114646 135565 172972 179175 182409 198649 188496 158805 154113 138691 79460
17839 79460 24551 -21806 -27123 -69848 -4862 35228 5339 -39255 -51859 4266 -22480 -61873
17827 -61873 -62045 -40469 -36067 -76969 -64508 -58264 -54326 -24045 55170 85099 82261 1706 -64903
17814f4903Q846P432L2568M223M3375p83m7434l0404L6224N7026M0652j3563m3708
17801B9551K9416m718p3727n8324K6525J1062J9905K4711k2639K9279l1133k7064
17789d7156O1535O162k9967l1755j3651o2836k3867P484P740N7384M0616N7170
17777B8859L1898k3980n4355n7269Q4732J9956J9838l1117o2299o967j8163J8220
17765e0647l6677k6132k850L0855J1195L8676k2634j4005M108K209J6337k5355
17753g4920k1194J1424N6629O5989M0737k8222l4678l7973J1287q653l4666K66
17741e3974J3312J4940L9655J3091J7818m2940K1410Q757J5141k7011l1215J8997
17729G981O95K2287j2413n755L9757M05q5074k8037J8989N6764L817m4984m8889
$$ plain form
17814 -64903 -56057 -48625 -16057 -11834 31541 30758 -16676 -47080 -10856 46170 86822 73259 29551
17801 29551 58967 54249 -19478 -77802 -51277 -40215 -20310 4401 -18238 11041 -20092 -47156
17789 -47156 14379 20541 -9426 -41181 -54832 -117668 -141535 -134051 -126311 -68927 -28311 28859
17777 28859 60757 36777 -17578 -74847 9885 29841 49679 18562 -43737 -50704 -68867 -50647
17765 -50647 -87324 -113456 -116306 -85451 -74256 -35580 -58214 -72219 -68111 -65902 -49565 -74920
17753 -74920 -96114 -84690 -28061 37928 78665 50443 15765 -22208 -10921 -19574 -54240 -53974
17741 -53974 -40662 -25722 13933 27024 44842 1902 23312 32069 47210 20199 -11016 7981
17729 7981 8676 30963 18550 12795 52552 52957 -32117 -60154 -41165 15599 19416 -25568 -74457
17716g4457M8448P600j0830K4669K2543j0691o635k861l1312m0938k552m4572
17704a21588Q303N4126K4822J1966m453q0676j7667P3725K7484K3032l653l2155
17692c6734L8780L4425n470N9604k1382o8994n8273M4069Q4356L566l8218O3156
17680I8885J952q813N4179N6893R8552O8798J25917J61203J0907j39988j50833
17669C77652j05147q1164l4695k2121k2030M275m7586l0346k5577J3125N4754
17658H1140O9439N696K3100N2122J15473J73521J00905m3025q6644j81310j25156
17647A85261m8959l1187q2600k6866M9319M4287j5186N507K9614L471q288K6032
17635A30405K930K6330p2511j04914o626k0125o3399j12611M2183J31197L9842
$$ plain form
17716 -74457 -26009 -18409 -29239 -4570 17973 7282 647 -2214 -33526 -74464 -77016 -121588
17704 -121588 -113285 -59159 -34337 -22371 -26824 -107500 -125167 -51442 -23958 -926 -4579 -36734
17692 -36734 2046 36471 31001 90605 69223 229 -58044 -13975 70381 73947 35729 98885
17680 98885 100837 92024 146203 203096 301648 370446 496363 657566 668473 528485 377652
17669 377652 272505 191341 156646 134525 112495 116770 69184 38838 13261 26386 81140
17658 81140 150579 156275 179375 231497 346970 520491 621396 578371 491727 310417 185261
17647 185261 136302 105115 22515 -4351 44968 89255 74069 79576 109190 112661 104373 130405
17635 130405 133335 159665 87154 -17760 -24386 -44511 -107910 -220521 -178338 -47141 -7299
17624g299o621L5135L9795L6145n3293n0371n822L987J6326k6480K4647M8833
17612E4982m4940l9236J0665j6125j9363N988N0582P013K930K2179Q5313j4659
17600A05329o4270L061m395k9171J8530O728L7814k2646p9036L380j5043j6339
17588e6058N1501K0442M8718j5159k8992j4636J7904L0080k7792l4390m7839Q566
17576d7655k9801Q1685L8996m5666l6189k6295N5587L2069L6833K711L9037J6018
17564A17330k6641n9102k9501l9813k7740J0016J7946m7728l3612L7923O1023
17553a9899J6504n3430K9960M1637P015K2552k4160m4000k1329j7248J2047L9787
17541a0564j654l6454N8205J7698m5662l8124l5573M978M0188m201J2832K3909
$$ plain form
17624 -7299 -13920 21215 61010 97155 43862 -6509 -12331 -8344 7982 -18498 6149 54982
17612 54982 10042 -29194 -18529 -34654 -54017 -48029 2553 9566 12496 34675 119988 105329
17600 105329 41059 44120 39725 10554 29084 35812 73626 50980 -28056 -24676 -39719 -56058
17588 -56058 -4557 15885 64603 49444 20452 5816 23720 53800 26008 -8382 -56221 -47655
17576 -47655 -77456 4229 43225 -2441 -38630 -64925 -9338 22731 59564 62275 101312 117330
17564 117330 90689 31587 2086 -37727 -65467 -55451 -37505 -85233 -118845 -80922 -19899
17553 -19899 -3395 -56825 -26865 14772 21787 44339 20179 -23821 -45150 -62398 -50351 -10564
17541 -10564 -12218 -48672 9533 27231 -18431 -56555 -92128 -87150 -46962 -51163 -38331 -14422
17529a4422m7785j0086l2810J6847L2625O0950j2030j5586o7867k1615L9402N1972
17517b0405O3837N8510O5672n1751q5813m602j3611l6751l9921Q364K3743J126
17505c1602J7411r376L0634K4964j3189q1912p0036L0786J07591j5818q193P3127
17493E4387J5919n2583m1509l6239l3103K9246J0508M737o419N0935J2941l3371
17481b4551j0474J0878M8198k6649l7339k3952L4794j4449k984J2612J4702k3967
17469d3181K2053L7248m6241N1980L7316j7448K6203M9690l6721p6500m4400k5975
17457f5976N6240M5058k0541j2972K5105m1220m202N1453Q4813K0653N7560L9939
17445B35910J40146J05788M2672o5799j00300j22420j25756n1448L791l2727k2839
$$ plain form
17529 -14422 -62207 -72293 -105103 -88256 -55631 5319 -6711 -22297 -90164 -111779 -72377 -20405
17517 -20405 43432 101942 167614 115863 30050 25448 11837 -24914 -64835 -56471 -32728 -31602
17505 -31602 -14191 -23567 7067 32031 18842 -63070 -133106 -102320 5271 -10547 -18740 54387
17493 54387 70306 17723 -23786 -60025 -93128 -63882 -53374 -48637 -55056 -4121 8820 -24551
17481 -24551 -35025 -24147 24051 -2598 -39937 -63889 -29095 -43544 -46528 -33916 -19214 -43181
17469 -43181 -21128 16120 -30121 21859 59175 41727 67930 117620 80899 4399 -40001 -65976
17457 -65976 -9736 35322 14781 1809 26914 -14306 -18508 32945 117758 138411 195971 235910
17445 235910 376056 481844 524516 458717 358417 235997 110241 58793 62584 29857 7018
17434G018N1711L3774k4614K698l3238m730N398L6224k2737p3536l0209J7886
17422c4355M2334K4447K6252K5823J8546j6706J0792r91q3410m2682L3291k5437
17410b2096k2492K5227M5724M9154L6371O595o0796r0484K1114L5043L0881l4653
17398A9588q4309k5719L4590M2020L4457M7663K7843k0028j162k8458P53P785
17386E5023o3281l9279j3709K5249M5402M0123R880J825j1309n7411n196j0323
17374b3006M9189M3985o4715K3086k3255l7277j5543J5769P4317L2542j0762K3438
17362H7768l253p7131m6658l9619l8306P829N1618R2898k3955o0802O770N1851
17350I010L2229J3235P927o2630K5497k707k7305p3470O03N6860k6018j2227M0930
$$ plain form
17434 7018 58729 92503 67889 70587 37349 32619 38017 74241 51504 -22032 -52241 -34355
17422 -34355 7979 32426 58678 84501 103047 86341 97133 96142 12732 -29950 3341 -22096
17410 -22096 -44588 -19361 26363 75517 111888 118483 57687 -32797 -11683 23360 54241 19588
17398 19588 -64721 -90440 -55850 -13830 20627 68290 96133 76105 74943 46485 47238 55023
17386 55023 -8258 -47537 -61246 -35997 9405 49528 59408 61233 49924 -7487 -12683 -23006
17374 -23006 26183 70168 5453 28539 5284 -31993 -47536 -31767 42550 75092 64330 87768
17362 87768 84515 7384 -39274 -78893 -117199 -109370 -57752 35146 11191 -49611 -42841 9010
17350 9010 41239 54474 62401 -229 25268 22561 -4744 -78214 -77611 -20751 -46769 -58996 -18066
17337a8066P9626K6299l1251k7352j4188N4419M6964N4802m9909j10240k2261
17326a1157K0908k2080R905Q1664l511n8463q0283l0684k335R78L2262J7690J4573
17313c0533J51Q034M0153n818k9967j6550l4145m3216M8621L3327K3168J9402
17301A2627l0682j6003j4969l6701J8194Q7297N6369n7406l6416K7815L5266J5179
17289F0570l4983o4927l1103J7174N8493O1254r805n9250p0458o174P4894L3753
17277B9438m2015L684P0035p460k0257o8790J275k9209J8781j8172L8000L6005
17265A1315l569m50k1896j2077K3134M1368J2061p7207l8846o3729K4756M3736
17253f1404l330N3712P656O6600L4661q6569n5107k1118L980J1955O6197r460
$$ plain form
17337 -18066 61560 87859 56608 29256 15068 69487 116451 171253 121344 11104 -11157
17326 -11157 9751 -12329 -2424 79240 75729 17266 -63017 -93701 -96036 -95058 -62796 -45106 -30533
17313 -30533 -30382 -22348 17805 11987 -17980 -34530 -68675 -111891 -63270 -29943 -6775 12627
17301 12627 -18055 -34058 -49027 -85728 -67534 19763 76132 18726 -17690 10125 45391 60570
17289 60570 25587 -39340 -70443 -53269 5224 66478 56673 -2577 -73035 -79209 -4315 29438
17277 29438 -12577 -8893 61142 53682 33425 -35365 -34090 -63299 -44518 -62690 -24690 11315
17265 11315 7746 7296 -14600 -26677 -3543 37825 49886 -27321 -66167 -129896 -105140 -61404
17253 -61404 -64734 -11022 -3366 63234 97895 11326 -43781 -64899 -60919 -48964 17233 7773
17241G773k128j5587O308j6911J2973O02l1730j6679j2182K0908M5129l3823L7321
17228A974k663o0592m7974J6697P7972K5781L34Q1950K9034N1J2173j02276j1701
17215B0760M1186L950k4043p6429m9940M611p522N2774M6128o7447k7449J2036
17203g1385K2659J2264J6752l445R896L2584P3175N5826l3627j1448m9541n6531
17191b821k8046j3096N3238K6364l9146p6244K0838k7293n0850M1659P5038N9117
17179C8758O477o1361J4135J2663l868q726J1575n8191M3845J5777j6255K3529
17167A8358l7022m0641q0471l3429P5057Q2493P653q6429m9382L3118M0894M7690
17155b2111K7287k2459K0402L5487K461o7005j0585N383N2195j4220k2331L9649
$$ plain form
17241 7773 5645 -9942 -3634 -20545 -7572 -6970 -38700 -55379 -67561 -46653 -1524 -35347 1974
17228 1974 -689 -61281 -109255 -92558 -14586 11195 11529 93479 122513 122564 134737 32461 20760
17215 20760 61946 65896 41853 -34576 -84516 -79905 -87427 -34653 11475 -55972 -83421 -71385
17203 -71385 -48726 -36462 -19710 -23155 -13259 19325 92500 148326 114699 103251 53710 -2821
17191 -2821 -30867 -43963 9275 35639 -3507 -79751 -58913 -86206 -137056 -95397 -20359 38758
17179 38758 45235 -16126 -1991 10672 6804 -1922 9653 -48538 -4693 11084 -5171 18358
17167 18358 -18664 -59305 -139776 -173205 -98148 -15655 -8002 -94431 -143813 -110695 -69801 -22111
17155 -22111 5176 -17283 3119 38606 41067 -25938 -36523 -31140 21055 6835 -15496 24153
17143B4153J4164R810K8045p317l3340k6837l8422j271P215K9843k9711r205J1162
17130b1711M1392k9706J5752l1833p4224L6282M8051j4780j0346j8670K5403J3037
17118b1353k7988j8552j5339k1603n0471K0530M7574L3828O7617M5901n0246m4160
17106c4262K0921L4296k1850n516J3535M4242K0545k9000m9963n4671K1570J2632
17094b7521l2050k5668P4663L505M949j1943k7878r539o226m1118N8713l747q1058
17081a24918o493K8160K5784R3659M7312l7015l1520j7935j4848J4650n468M3525
17069A4893L9727K8284m4220n6460p7979M1275L3354k8138O5039J1347n9755j0290
17057d2923N0451l8864j15059K9372K6694O8861L8235l7980j3968J3500l4305
$$ plain form
17143 24153 38317 48127 76172 68855 35515 8678 -29744 -31015 -23800 6043 -23668 -32873 -21711
17130 -21711 19681 -10025 5727 -26106 -100330 -64048 -15997 -30777 -41123 -59793 -34390 -21353
17118 -21353 -49341 -67893 -83232 -104835 -155306 -134776 -87202 -53374 14243 60144 9898 -34262
17106 -34262 -13341 20955 -895 -6411 7124 51366 71911 42911 -7052 -61723 -40153 -27521
17094 -27521 -59571 -85239 -10576 -7071 -2122 -14065 -41943 -51482 -57708 -98826 -40113 -43860 -124918
17081 -124918 -131411 -103251 -77467 16192 63504 26489 -5031 -22966 -37814 -23164 -28632 14893
17069 14893 54620 82904 38684 -17776 -95755 -54480 -21126 -49264 15775 27122 -32633 -42923
17057 -42923 7528 -31336 -146395 -117023 -90329 -21468 16767 -21213 -35181 -21681 -55986
17046e5986m8879K7388O2730L0433j7163k2762k2316K4090K9882k0185l6103K7721
17034b1150L6303m4779l1269K3184j0367n7232j3969O2619M0192J9716k7212J9848
17022d116N0j005K856n329j9290K040r098K2893j1472r177Q457j2754k5473J0801
17008e0617O888o1162L3530P221O907J1298o6706n316q730K3792L2734l385j6476
16995i0022O765n5N4671Q19K0943J9796k8680L3247n6435q0992M8268K1937l8336
16982h8074N297O7744K8027N5158J0668j5173l2862j4360r727p121m2502l501
16970d6426j0777p218L451k2179k4203j6133K9003L7492l2210j5477O1846K1492
16958b1339l6547l6348J4748J8851m726m8297m8922j7474L9646K7721J07586P3209
$$ plain form
17046 -55986 -104865 -77477 -14747 15686 -1477 -24239 -46555 -22465 7417 -12768 -48871 -21150
17034 -21150 15153 -29626 -60895 -37711 -48078 -105310 -119279 -56660 -16468 3248 -23964 -4116
17022 -4116 -4066 -5071 -2215 -7544 -26834 -24794 -33892 -10999 -22471 -31648 -23191 -35945 -61418 -50617
17008 -50617 -43729 -104891 -71361 -64140 -57233 -45935 -112641 -117957 -126687 -102895 -70161 -73546 -90022
16995 -90022 -83257 -83312 -28641 -27822 -6879 12917 -15763 17484 -38951 -119943 -71675 -49738 -88074
16982 -88074 -82777 -15033 12994 68152 78820 63647 30785 16425 6698 -423 -42925 -46426
16970 -46426 -57203 -64421 -60970 -83149 -107352 -123485 -94482 -56990 -89200 -104677 -42831 -21339
16958 -21339 -57886 -94234 -79486 -60635 -65361 -113658 -162580 -180054 -140408 -112687 -5101 68108
16946F8108l0309j0871M307N6897m6764K105J7457l3625k9376J2079J463j303
16934A0168r3262n0681j4185J1244Q3065Q5004M2694k155k9379m0057l4552n9529
16922i1625J7270O9701n9j5613j1967L6692K3868k5478m435j4424k5457O1414
16910A9887M3295L4832m4288l6421K3241k7899j3024M9810l6678n1987j5283l343
16898e7858M3913J7176N7271m7246n0052J9212K016r751k1799j8384N3974L3474
16886B1946m6631L480L5427M7969n402p6760K0726K3659o7211K1121k2231j5478
16874e9385J0816j888O2549M692m4252J3385l445M3993n9685l9415O3845L009
16862e781K6261l9268Q672M0859l880L4400l8348q8420r052N6008J7143J6965
$$ plain form
16946 68108 37799 26928 31235 88132 41368 43473 60930 27305 -2071 10008 11471 10168
16934 10168 -83094 -133775 -147960 -136716 -53651 31353 74047 71892 42513 2456 -32096 -91625
16922 -91625 -74355 -4654 -4713 -20326 -32293 4399 28267 2789 -1646 -16070 -41527 19887
16910 19887 63182 98014 53726 17305 40546 12647 -377 49433 12755 -39232 -54515 -57858
16898 -57858 -13945 3231 60502 13256 -36796 -17584 -15568 -25319 -47118 -65502 -11528 21946
16886 21946 -24685 -21205 14222 62191 56789 -19971 755 24414 -42797 -21676 -43907 -59385
16874 -59385 -48569 -50457 12092 16784 -27468 -14083 -17528 26465 -33220 -72635 -8790 -5781
16862 -5781 20480 -18788 -10116 30743 26863 61263 22915 -65505 -74557 -18549 -1406 15559
16850A5559N5106q631o0480k9791j1304J0119m003j9834k8837P2077N9768J2735
16838F2484j4383j5755K1246m2278m4962j861P9687O7008j5921p5914j9922N7683
16826E7112O3432k612K492k1157n5283n8976j862L6940K5016K403K8123K598n5524
16813B2702k5667r558M939k1041K6665L2766R742q9282J3075L4598J1420L224
16801A3583k1983j5916j6827N1148j8197Q360m426k3565m5514K4196N4489k0452
16789a5104L5018p742k6606J7249K7652j4694l7388j9680O908J8594j1754m623
16777c2170L8238K1492q0346m4757k8485M965O5692M4346K8050M9962R778P523
16765H4288K0268l6537m0430q5047L3380k6008O7586N8064o1634j9503J3130j619
$$ plain form
16850 15559 70665 62034 1554 -28237 -39541 -29422 -33425 -53259 -82096 -10019 49749 62484
16838 62484 48101 32346 53592 11314 -33648 -35509 44178 111186 95265 19351 -571 57112
16826 57112 120544 117932 120424 99267 43984 -14992 -16854 20086 45102 47505 75628 78226 22702
16813 22702 -2965 -12523 -7584 -28625 -1960 30806 40548 -48734 -35659 -1061 10359 13583
16801 13583 -8400 -24316 -41143 10005 -8192 168 -4258 -27823 -73337 -49141 5348 -15104
16789 -15104 19914 12172 -14434 2815 30467 15773 -21615 -41295 -34387 -15793 -27547 -32170
16777 -32170 6068 27560 -52786 -97543 -126028 -121063 -55371 -11025 17025 66987 76765 84288
16765 84288 104556 68019 27589 -57458 -24078 -50086 17500 75564 13930 -5573 7557 5938
16753E938l5630l7133k4626M8890J9526k5729K8636J8323N1820r6968n5658Q801
16741i3810J0766L6056J0545J1068K6307L0695J2665p3230P750o561M1834k7326
16729a3241l5806J8710p809j4143k906n817j6882k695M0340M8445j9162J1224
16717B58M2273n0627m3494J7603o061j7120L7600K6465n524K1376K001l5344k4081
16704c4675k3755J3524K1180K4048L1169K2630K3884J7417j159J4539l2034n1392
16692B5376l0643j324k6504M9244N6018L8904m1156q5915r660L0156k5994o2397
16680h3895O91N6413K5772K3024j9397j0633j7454j3919J57O1541j3709j0664
16668b073J0306J9139Q597L384m6479J0546N0112j495o5525J6203k2662j5930
$$ plain form
16753 5938 -29692 -66825 -91451 -42561 -23035 -48764 -20128 -1805 50015 -46953 -102611 -93810
16741 -93810 -83044 -46988 -36443 -25375 932 31627 44292 -28938 -21188 -27749 14085 -13241
16729 -13241 -49047 -30337 -38146 -52289 -55195 -61012 -77894 -80589 -40249 8196 -10966 258
16717 258 42531 -8096 -51590 -33987 -40048 -57168 -19568 6897 1373 22749 24750 -10594 -34675
16704 -34675 -58430 -44906 -23726 322 31491 54121 78005 95422 94263 108802 76768 25376
16692 25376 -5267 -6591 -33095 16149 72167 111071 69915 -16000 -25660 4496 -21498 -83895
16680 -83895 -83204 -26791 -1019 22005 2608 -8025 -25479 -39398 -39241 22300 8591 -2073
16668 -2073 8233 27372 35969 39353 -7126 3420 53532 52037 -13488 2715 -19947 -35877
16656c5877K62J6408K3752N2799j3648J267k3290o6613n7184O5345Q159k8190
16644e6810P566O43k438O0013J8727M0372J2791o6536l9127M2471k5890m2335
16632e0553n656M4494L9463j9879o2145j1378l1225K3511N2499P8326k2793l6457
16620a793J7857k0590r56l2131N0543n893j3846M8451k4775k9786k2396L4312
16608a003p1506k9717j5957N2358M7863K599N589n500J7545k6920l5247o769m6849
16595a13514J9976O799N734L7483J6468j1276j428N3079q380j7922J7762k4414
16583a9633o98J0779R414M9650k3760p4776j3708O3037N5882m4769p5273L6405
16571b7450N65r389k5985l5283M3735M5041L9560n2159k8383K9308L5539P3264
$$ plain form
16656 -35877 -35615 -19207 4545 57344 43696 44963 21673 -44940 -102124 -36779 -28620 -56810
16644 -56810 -49244 -48601 -51039 8974 27701 68073 80864 14328 -24799 17672 -8218 -50553
16632 -50553 -56209 -11715 27748 7869 -54276 -65654 -96879 -73368 -20869 57457 34664 -1793
16620 -1793 16064 -4526 -5482 -37613 12930 7037 -6809 41642 16867 -12919 -35315 -1003
16608 -1003 -72509 -102226 -118183 -65825 -17962 -15363 -9774 -15274 2271 -24649 -59896 -66665 -113514
16595 -113514 -93538 -86739 -81005 -43522 -27054 -38330 -39758 13321 4941 -12981 4781 -19633
16583 -19633 -20331 -9552 -138 49512 25752 -49024 -62732 305 56187 11418 -63855 -27450
16571 -27450 -26885 -36274 -62259 -97542 -53807 -8766 30794 -21365 -49748 -20440 15099 88363
16559H8363k9485n5108j10438P131J0166L5961N3294q386L115L8197j8864j8323
16547d377j3594p6061j0391Q1148K8852j0666j5648k4743n5308p643O7420J02113
16535F1102J0702J1154k1586r555n7543p4862k3789m240J5155L8106M8942m987
16523a1401l4167L2497K2484M575m992m7314J467K8771l2561o8245m215N2248
16511f0853m8985k8959J8149L4174l006M4235L6460M6247k4151K209L7406L6381
16499H9307j06l2838l3592Q454j4432o7108o5817l1719M9951L9452L915j9997
16487g4530J9833j9175K7749k8514l1449R76J4285O3571M1836l1464J878k868
16475a7872O0312M903J020N4j4636l2088l0354k9428L04O3881Q521q0172o330
$$ plain form
16559 88363 58878 3770 -106668 -99537 -89371 -53410 -116 -8502 -5387 32810 13946 -4377
16547 -4377 -17971 -94032 -104423 -23275 5577 -5089 -20737 -45480 -100788 -108431 -41011 61102
16535 61102 71804 82958 61372 51817 -5726 -80588 -104377 -108617 -93462 -55356 -6414 -11401
16523 -11401 -45568 -13071 9413 13988 8996 -38318 -36851 -8080 -40641 -108886 -113101 -60853
16511 -60853 -109838 -138797 -120648 -86474 -89480 -45245 -8785 37462 13311 15520 52926 89307
16499 89307 89201 56363 22771 31225 16793 -50315 -116132 -147851 -97900 -58448 -54533 -74530
16487 -74530 -54697 -73872 -46123 -74637 -106086 -105110 -90825 -27254 14582 -16882 -15004 -17872
16475 -17872 42440 47343 48363 48417 33781 1693 -28661 -58089 -57785 6096 14617 -65555 -71885
16462g1885N2500J3125l7627N0883k2962r436K9246R631L3858o5172k0381L270
16450c4950K0479K0325L7208P0587J0395k9013j1434j4072K7928k9927k2454J9110
16438F4182R705p0266l8870M1320M6541k5847J3005k9715p471L1183J3210j5987
16426C0990P436m9078k6035J1620j7571J8049j670p020l2266O5663M5055n3404
16414h231m4333O4181L3184k5395L1202k5017l5400N1300J0120L130j4784j7424
16402B2533l476k8837k7932M291j4456k553m6816L27J4613K5982J0342J0881M9619
16389A4518J737j4999q0676L687O6681K0528l7670O4010J2123k911l0793m6360
16377c0125k7679N9524K9713p8458R713L1635k4934L6671J8461p0486k9137m6496
$$ plain form
16462 -71885 -19385 -6260 -43887 6996 -15966 -25402 3844 13475 47333 -17839 -38220 -34950
16450 -34950 -14471 5854 43062 113649 124044 95031 83597 69525 97453 67526 45072 64182
16438 64182 73887 3621 -35249 6071 52612 26765 39770 10055 2584 33767 46977 30990
16426 30990 38426 -10652 -36687 -25067 -42638 -24589 -26259 -33279 -65545 118 45173 -8231
16414 -8231 -52564 11617 44801 19406 50608 25591 -9809 41491 51611 54741 39957 22533
16402 22533 19057 -9780 -37712 -33421 -47877 -50430 -97246 -96919 -82306 -56324 -45982 -35101 14518
16389 14518 16255 1256 -79420 -75733 -9052 11476 -26194 37816 49939 47028 16235 -30125
16377 -30125 -57804 1720 31433 -47025 -37312 -5677 -30611 6060 24521 -45965 -75102 -121598
16365a21598K4887q464M430Q88J965L4381P179M5944Q768p75k9030J7523J4814
16352I12m5575M5672O5704J9432k8656j0388L6825l9701L176k9637j7024M2003
16340D2743q682K751p617M019l6902L129P9501K0808k4062k2507j9172m4750M0202
16327B9461R128P174O509M1109L2687M6282N8800n8426l482L7952n1983m5899
16315A09312K7424K1273l4483k9499n2444k1086M4736k7399l9326K5189Q1973
16304A05670q414l8586K6125r440l0763m9623M040j6654l8215K7541O7694N5654
16292I5029p0098l9946k409K2718M1538l771j5425o0378l0725k6334P1565L7915
16280A9679L2072m9370P684j2589l2769K8936j0940K5142j3986l3528K2580N8940
$$ plain form
16365 -121598 -96711 -105175 -100745 -99857 -97892 -63511 -56332 -10388 -1620 -2395 -31425 -13902 912
16352 912 -44663 1009 66713 86145 57489 47101 83926 44225 47401 17764 740 42743
16340 42743 34061 36812 29195 33214 -3688 -559 78942 99750 75688 53181 34009 -10741 29461
16327 29461 38589 45763 52272 93381 126068 172350 231150 172724 169242 207194 155211 109312
16315 109312 136736 158009 123526 94027 41583 20497 65233 37834 -1492 23697 105670
16304 105670 97256 58670 84795 75355 44592 -5031 -991 -17645 -55860 -28319 39375 95029
16292 95029 24931 -15015 -17424 5294 46832 43061 27636 -32742 -63467 -89801 -18236 19679
16280 19679 51751 2381 10065 -2524 -35293 -6357 -17297 7845 -6141 -39669 -17089 41851
16268D1851l3842n146J5095l2749K7125k7173m7324N4129J0031o0958J8035J9523
16256b1403n8343R314L2909j6448M3893P7149L3899k9232k7402N1013M165m7777
16244E1737p6848j3331k2473k1599j1633P801m497J6132L9232K1369M6040M2992
16232G4922L592K8792K3358l1873n4640k1647m470r219p456L0756K2724l4480
16220B0359p4657n99K1508j8815M0273L8823l2587K7578k8770l5711J7642l6902
16208f1858K3313m882K8986M2285q0351L541m235o0161K1898N7003N0890o1196
16196d4767n9841K6318N8576j7836q661L0587l3179J6623J1610n8769j1736K0483
16184g0592m5938J6667K6583k653j7523j5706l9368M7197N7351m9856m0799l5144
$$ plain form
16268 41851 8009 2863 17958 -14791 12334 -14839 -62163 -8034 1997 -58961 -40926 -21403
16256 -21403 -79746 -70432 -37523 -53971 -10078 67071 100970 71738 44336 95349 99514 51737
16244 51737 -25111 -38442 -60915 -82514 -94147 -86346 -90843 -74711 -35479 -14110 31930 74922
16232 74922 78514 107306 130664 98791 44151 22504 18034 8815 1359 32115 54839 20359
16220 20359 -54298 -54897 -33389 -52204 -11931 26892 -5695 21883 -6887 -42598 -24956 -61858
16208 -61858 -38545 -43427 -14441 27844 -52507 -48966 -53201 -113362 -91464 -34461 16429 -44767
16196 -44767 -104608 -78290 -19714 -37550 -46211 -15624 -48803 -32180 -20570 -79339 -91075 -70592
16184 -70592 -116530 -99863 -73280 -75933 -93456 -109162 -148530 -101333 -43982 -93838 -134637 -169781
16172a69781J7929R6466K9834K8409K2934m6093m9593k4053M0336O0873O1313
16161F8574O1434j1755K7594M5575p2173o2628n5943M651k0181R306j0512R334
16149f724K9963m3064m0869k4696J1318M9130O1599O5482J488l911o7652m9321
16137a7257K4819L5749K4927j3913K9826o3934n2253r2208m857L4861L0167n451
16125f9524j2260l0972l269K7551N3649P0490L8838n1383n2377n7311K3164O4198
16113G94K310l4583o160K3918j1856J8022k5089n6914K4564M2700J5791L2538
16101B6035L3700M1145k0948j0720j922n5109m2559j9298O565p464k7476Q1719
16089C668K1048q2808l8684O134K6859R2824L8309j0006p1552j5444P502m1064
$$ plain form
16172 -169781 -151852 -55386 -25552 2857 25791 -20302 -69895 -93948 -53612 7261 68574
16161 68574 130008 118253 145847 191422 119249 56621 678 5329 -14852 -5546 -16058 -6724
16149 -6724 23239 -19825 -60694 -85390 -74072 -24942 36657 102139 103627 99716 32064 -17257
16137 -17257 7562 43311 68238 54325 84151 20217 -32036 -124244 -129101 -94240 -64073 -69524
16125 -69524 -81784 -112756 -116025 -88474 -34825 35665 74503 23120 -29257 -86568 -63404 794
16113 794 3104 -31479 -37639 -13721 -25577 -7555 -32644 -89558 -64994 -22294 -6503 26035
16101 26035 59735 100880 79932 69212 67290 12181 -30378 -49676 -43111 -50575 -78051 3668
16089 3668 24716 -58092 -96776 -90642 -63783 29041 67350 57344 -14208 -29652 -22150 -63214
16077f3214n5383K6228Q4804Q2725J0030K576L8043J6118k6836l6976r390p6898
16065h173q7389j6847J255K1536j4429L7423J3248p743K5541M465k7084M1598
16053a6599N3744j495J0719o2810j1068P1236K1842j0507k0065n592L5944o1219
16041D130k9325L2046m08o3014n957K1762J0057O7502n1001o6673J7519L6134
16029b7228L4974k986k8389p1951k2684J0798K3162J6554K6135j7742M0113L9273
16017B0029m327Q116K9755k8674q313J1728n3587n9739l334Q113J1838O7669K8558
16004B7832l1075m8641P2377K7934l875q870j00117j716j0601K4573J3361L0933
15992g885m2803m5551k4411K1775M0193L6634K1846L0139j575K2082n7913n5495
$$ plain form
16077 -63214 -118597 -92369 -7565 75160 85190 87766 125809 141927 115091 78115 68725 -8173
16065 -8173 -95562 -112409 -111154 -89618 -104047 -66624 -53376 -61119 -35578 -31113 -58197 -16599
16053 -16599 37145 35650 46369 -16441 -27509 43727 65569 55062 34997 29405 65349 4130
16041 4130 -25195 6851 6443 -56571 -62528 -40766 -30709 36793 -14208 -80881 -63362 -27228
16029 -27228 7746 4760 -23629 -95580 -118264 -107466 -84304 -67750 -41615 -59357 -19244 20029
16017 20029 15702 23818 53573 24899 16586 28314 -25273 -85012 -88346 -80233 -68395 -726 27832
16004 27832 -3243 -51884 20493 48427 44552 35682 -64435 -66151 -76752 -52179 -38818 -7885
15992 -7885 -50688 -96239 -120650 -98875 -58682 -22048 -202 29937 28362 50444 -7469 -62964
15980f2964o1858j364K4336l5588J7543Q1907K307J6091L5965J3785j4183M5700
15968F1677q3453m9561O9157K0196n721k365J0358K491M744J2349n2332q7140
15956i9600j8739N3120Q4528m4960l257p99M4929O4836j6301J1768j381j3539
15944F0605j6803K3465m3748l0094J2845J406J6550k9458l0621q3642k3076M0026
15932a02545O4628P4099O3725K0427k5537j17194n1192L6017K9922M5197m2772
15921e225p66J245J136N7k0094m9297M6076P78J2923k7212M536O949j1477l9276
15907g9647j6010R1630L0978J5228K3647k8239l3526J270j4902L9707L4656J9569
15895H4361M853o8343n4818K6765P0086L0159k1923J695L0929j254j7468m2400
$$ plain form
15980 -62964 -124822 -126186 -101850 -137438 -119895 -37988 -35681 -19590 16375 30160 15977 61677
15968 61677 -21776 -71337 -2180 18016 12295 9930 20288 22779 27523 39872 -12460 -99600
15956 -99600 -118339 -65219 19309 -25651 -28908 -29707 15222 80058 63757 75525 74144 60605
15944 60605 43802 67267 23519 -6575 6270 7676 24226 -5232 -35853 -119495 -142571 -102545
15932 -102545 -37917 36182 99907 120334 94797 -22397 -73589 -37572 -7650 37547 -5225
15921 -5225 -5991 -4746 -3610 -3553 -23647 -72944 -26868 -26090 -13167 -40379 -35843 -28894 -40371 -79647
15907 -79647 -95657 -4027 26951 42179 65826 37587 4061 5331 -9571 30136 64792 84361
15895 84361 89214 20871 -33947 -7182 62904 93063 71140 72835 103764 102510 85042 42642
15883D2642n4578l4959K2882L0021J6338j0882K5016j1073j0579K0144p865N761
15871C2868K7831N161q0225J8674N4729L4375m2352M414R203L2156l1751j261
15859F3822r611m5359L1932L1877m7458K7385J01063O835l2228q2904j32801l1138
15847a18585R118J7645j6554L4790P3772l043l035k4401m002J5365k9557L653
15835d4834O843J2855J2045k312J0365o7913q8610J6167R1270O2229L1370O229
15823D5704k3591J2483k2578R789M8408m9119k2102L7875M8135R079r532o9945
15811A4606L2653N5739O980l984j7811q5456p1963J0538P1286O194p31j3459k6870
15798b2278J0866M5449j1198q2333R443K9000k3813k0328j8625q8238O481O7439
$$ plain form
15883 42642 -11936 -46895 -24013 6008 22346 11464 36480 25407 14828 34972 27107 32868
15871 32868 60699 65860 -14365 4309 59038 93413 51061 55475 64678 96834 65083 63822
15859 63822 54211 8852 40784 72661 25203 52588 153651 160486 128258 45354 -87447 -118585
15847 -118585 -109467 -91822 -108376 -73586 186 -2857 -5892 -30293 -34295 -18930 -48487 -44834
15835 -44834 -37991 -25136 -13091 -15403 -5038 -72951 -161561 -145394 -54124 8105 39475 45704
15823 45704 22113 34596 12018 21807 70215 21096 -1006 36869 85004 94083 84551 14606
15811 14606 47259 102998 109978 105994 88183 2727 -69236 -58698 12588 18782 18051 4592 -22278
15798 -22278 -11412 34037 22839 -59494 -50051 -21051 -44864 -65192 -83817 -172055 -165574 -98135
15786i8135M1841J0328m1158R584J9330J6411K8841K6970M2650q738j1925n015
15774C0984l7692l4739k3888m862K2386p198k1760r903L1348L4832K3166J2996
15762A5670k1723k108o2758l6200K2235L7792J387N274M865k2527l1072J3110
15750g6055J5326L2483Q494J5543L5749k6775L7027m3756J6449K1182k4307l5879
15738b4519p611k650L4030r620O724o3817k1661K4499K2099m297L4975j5448n1872
15725g9168m6118J6741K1382L1970L7741O2075K2792j2389m3523K1175m6998l5831
15713e0151L8895N1992k7157m7851J8897K59j6965K6054K2721J1234M16O0680
15701H9024j4769n7364m4578l535K5715J8943M0766L6360r7092r8817n4746n056
$$ plain form
15786 -98135 -56294 -45966 -87124 -77540 -58210 -41799 -12958 14012 56662 47924 35999 30984
15774 30984 -6708 -41447 -65335 -70197 -47811 -55009 -76769 -86672 -55324 -20492 2674 15670
15762 15670 -6053 -8161 -70919 -107119 -84884 -47092 -45705 -40431 -35566 -58093 -89165 -76055
15750 -76055 -60729 -28246 -19752 -4209 31540 4765 41792 -1964 14485 35667 11360 -24519
15738 -24519 -32130 -34780 -750 -10370 -3646 -67463 -89124 -64625 -42526 -46823 -11848 -27296 -79168
15725 -79168 -125286 -108545 -87163 -55193 -17452 44623 67415 55026 11503 32678 -14320 -50151
15713 -50151 -11256 40736 13579 -34272 -15375 -15116 -32081 -6027 16694 27928 28344 89024
15701 89024 74255 16891 -27687 -31222 -5507 13436 54202 90562 -6530 -105347 -160093 -165149
15689a65149M4244J9397N5327m731q36j0114l1652L915L8245K0801N8151K5311
15677E2909K6799L7174M602o7120k105j7707J3498J474q0889K7220K1091r360
15665G586r126j0317m1605j4353k709Q6655M2431K569o2024k1958j1399K070j22
15652c2302N4339N3401p0471j5789j8087o8074Q53J8758M6310M9342m1235r9475
15640a22430N2M8368J0749L6555l3295l2274J4944l5559l4750L2451N3662M6341
15628a5186K6372O040n3484k5505j2124R1413K9828p996Q056k4063K089l7170
15616a1730M763o525m37m541q329j3014m05K0563J9364J9145q1844n6836L9830
15603g9996O9482O3309O797m0409N871j522k9117l2977n3705k8564N0761M8750
$$ plain form
15689 -165149 -120905 -101508 -46181 -50912 -51748 -61862 -93514 -89599 -51354 -30553 27598 52909
15677 52909 79708 116882 121484 54364 52259 34552 48050 49524 -31365 -4145 16946 7586
15665 7586 -1540 -11857 -53462 -67815 -70524 16131 58562 61131 -893 -22851 -34250 -32180 -32302
15652 -32302 22037 75438 4967 -10822 -28909 -96983 -96130 -77372 -31062 18280 -22955 -122430
15640 -122430 -122378 -74010 -63261 -26706 -60001 -92275 -77331 -112890 -147640 -115189 -61527 -15186
15628 -15186 11186 17226 -36258 -61763 -73887 17526 47354 39358 47414 23351 25440 -11730
15616 -11730 -6967 -13492 -13929 -18470 -26799 -39813 -40218 -19655 -291 18854 -62990 -119826 -79996
15603 -79996 -10514 52795 59592 19183 25054 23532 -5585 -38562 -92267 -120831 -70070 -21320
15591b1320k7131K4435K6873r663j5695M233J5468N519J4509k9843l866K1336
15579D855Q530l0525n3752j2404N121J988Q650k0258K7299k646L7743J7932j7628
15566b5095l6934j7212L6050J8736K7762j5807J2545j7471o1790o6326M2912O0598
15554d2032L3395L0941O0723K8904o6278o6467p434J4945j8339j7911l3220R685
15542g3088J6141Q4029L5790l9465j8641K8195J8575k5146l3247k6683o213J5382
15530b4371j1439l0759l6989J3635J6161J7426P9695k83l5793k3638j9852k6632
15518h2839j0460M8819J0805N7419M5691k2514m1826l0916J9799m3170K4611J6300
15506h281m7372j3712N345J301L1781P1885l4081l399M0254r135n1641k1377j426
$$ plain form
15591 -21320 -48451 -24016 2857 -6806 -22501 -18268 -2800 2719 17228 -12615 -16481 4855
15579 4855 13385 -17140 -70892 -83296 -78175 -76187 -67537 -87795 -60496 -63142 -25399 -7467 -25095
15566 -25095 -62029 -79241 -43191 -24455 3307 -12500 45 -17426 -79216 -145542 -102630 -42032
15554 -42032 -8637 22304 83027 111931 45653 -20814 -28248 -13303 -31642 -49553 -82773 -73088
15542 -73088 -56947 27082 62872 23407 4766 32961 51536 26390 -6857 -33540 -39753 -24371
15530 -24371 -35810 -66569 -103558 -89923 -73762 -56336 23359 23076 -12717 -36355 -56207 -82839
15518 -82839 -93299 -44480 -33675 23744 69435 46921 5095 -25821 -6022 -49192 -24581 -8281
15506 -8281 -55653 -69365 -64020 -62719 -30938 40947 6866 3467 43721 34586 -17055 -38432 -39858
15493c9858K1716K4448k2252Q3l7624M9234K7669m6944m7589l3477N2129l1819
15481h4284k8940l569N5579N5152M3336j8879L449N5279k8966m5073L0275L7826
15469G1185r0923j5676Q943O2642M4551n8291o5946j6027k6405M7943J7155p1777
15457i2626k8232q176M470M3266L7290l9459P4116M5819O243N2008k5327p9231
15445i839M599K4359j578J6303j5586k4016j6912j3835N1082L00j5585J7144K4000
15432D0436l2272k4902J9681o777j0133m9812J5081L0554L1122O68K3518J3356
15420E0520j1778j9259L8732k8156n4179j8532k1460K2412K0774P772O31o831
15408a9354m6659j0456M0142L5582j9709n3596M7827K343p0506m1128J0855J6834
$$ plain form
15493 -39858 -18142 6306 -15946 -15863 -53487 -4253 23416 -23528 -71117 -104594 -52465 -84284
15481 -84284 -113224 -116793 -61214 -6062 37274 18395 21844 77123 48157 3084 33359 71185
15469 71185 -19738 -35414 -26471 36171 80722 22431 -43515 -59542 -85947 -38004 -20849 -92626
15457 -92626 -120858 -129034 -124564 -81298 -44008 -83467 -9351 36468 42711 94719 69392 -9839
15445 -9839 -5240 19119 17541 33844 18258 -5758 -22670 -36505 14577 14877 -708 16436 40436
15432 40436 8164 -16738 2943 -3834 -13967 -63779 -48698 -18144 12978 13646 37164 50520
15420 50520 38742 19483 58215 30059 -24120 -42652 -64112 -41700 -20926 -13154 -12523 -19354
15408 -19354 -66013 -76469 -36327 -745 -20454 -74050 -26223 -23880 -94386 -135514 -124659 -107825
15396a07825N8081k1718j2739N8854Q0585M8949m5495q242K2280L402m2867o4191
15384c0926p4033j3749O9309O1537M8030k6110p7758k353o594k5043P258R446
15372f0986m704K9703L7134J8965J1645l1290q0731l7861J3094L8842O0248M6429
15360D0488p167k5827O6367l1413r4583o3210R0282j0295o0859J8192Q1230Q424
15348A1629k0588k5722J3327k2465k5193M6015O2865M2435k8155n4551J2588j9854
15336g669n7575k9088M9953R5978J9033l1481l1029k1627N1500K1770o1561J625
15324a71K4855n6567k0123L9324J4825L7310m024m0720n2140N5135N8708r815
15312D6597m2889l1165K1648N2925j2393o8496k6936P2791M7883k1828M992J2336
$$ plain form
15396 -107825 -49744 -71462 -84201 -25347 55238 104187 58692 50450 72730 76132 33265 -30926
15384 -30926 -104959 -118708 -49399 12138 60168 34058 -43700 -46053 -52647 -77690 -70432 -60986
15372 -60986 -65690 -35987 1147 20112 31757 467 -80264 -118125 -105031 -66189 -5941 40488
15360 40488 33321 7494 73861 42448 -52135 -115345 -25063 -35358 -96217 -78025 3205 11629
15348 11629 -8959 -34681 -21354 -43819 -69012 -22997 39868 82303 54148 -403 12185 -7669
15336 -7669 -65244 -94332 -44379 51599 70632 39151 8122 -13505 37995 59765 -1796 -171
15324 -171 24684 -31883 -52006 -12682 2143 39453 35429 -5291 -57431 -2296 56412 46597
15312 46597 3708 -27457 -5809 47116 34723 -33773 -60709 12082 59965 38137 43129 55465
15300E5465j1535j574n321k6177k0244n913k0320j4563J8087o9237K0147L9350
15288d1835p527k597K7805L9041M034J5017K087L6531L2933o2478m5108K6421
15276B4324m907N228j3579l4234j5549N2163L667J3784m0583j5614K8485l6003
15264c2818J9664J6608m212K0661M5018L1993j3798L6204J787o0517l4226J0372
15252C6736j0862o9456m3256l6332M9744L9400m6548K0435R1410O9785l6727o0329
15240D000n1247l3827M5668M9997m609j5334o905O3392L5065n4285r1454L280
15228e6259p148j7208Q559j5177n0424M3034o432q575K8222J06695r080q8942
15216g2735L954J9635J8518N737J2509J6440r734J7916N7807k1829j1497k3416
$$ plain form
15300 55465 43930 42356 37035 10858 -9386 -15299 -35619 -50182 -32095 -101332 -81185 -41835
15288 -41835 -49362 -51959 -24154 14887 18921 33938 36025 72556 105489 43011 -2097 24324
15276 24324 19417 24645 11066 -23168 -38717 13446 17113 30897 -9686 -25300 3185 -32818
15264 -32818 -13154 3454 -758 19903 64921 96914 83116 119320 121107 60590 26364 36736
15252 36736 25874 -43582 -86838 -123170 -73426 -34026 -80574 -60139 31271 101056 64329 4000
15240 4000 -47247 -81074 -35406 14591 9982 -5352 -12257 51135 86200 31915 -59539 -56259
15228 -56259 -63407 -80615 -72056 -87233 -137657 -94623 -101055 -109630 -81408 25287 16207 -72735
15216 -72735 -68781 -49146 -30628 -24891 -12382 4058 -5676 12240 70047 48218 36721 13305
15204A3305m9612o619M9723Q880l8873l7321M4279P0939p750p011J1502Q9402
15192A40844k1848j1918n7946o1148k9521R283L2170o021o5180q956N1004q3p6021
15179a05341l0304K2107m086M881Q668J9185L8475n03N3654P6658o4886o5736
15167d7228l4810M6260L9914L7317N061k4181l6705o4786K6646K7025L9478j6936
15155b945P12J4784j3461q659L0992j3215P452n5762l0528k5533J6693L7927l0325
15142g1868K0547R7026N8391J1365l6348k8451j5813l2507n5448j7143M1723N27
15130b7999q288O9874M7463o3609j0291M0492l8353j6793k274K5344j3592l8534
15118c6560m3213P8550N7143M657j9160k257p3292J045M3110M2117J3744K4123
$$ plain form
15204 13305 -36307 -42926 6797 15677 -23196 -60517 -16238 54701 46951 39940 51442 140844
15192 140844 118996 107078 49132 -12016 -41537 -32254 -84 -6105 -71285 -80241 -29237 -29320 -105341
15179 -105341 -135645 -113538 -117624 -112743 -104075 -84890 -46415 -46918 6736 83394 18508 -47228
15167 -47228 -82038 -35778 4136 41453 46514 22333 -14372 -79158 -52512 -25487 13991 -2945
15155 -2945 -2233 12551 -910 -9569 21423 8208 15660 -40102 -70630 -96163 -79470 -41543 -71868
15142 -71868 -51321 45705 104096 115461 79113 50662 34849 2342 -53106 -70249 -28526 -27999
15130 -27999 -36287 33587 81050 17441 7150 47642 9289 -7504 -9778 15566 1974 -36560
15118 -36560 -79773 -1223 55920 60577 41417 39160 -34132 -33087 10023 52140 65884 90007
15106I0007k918L305k7414m3971j25982l3479L9092L3406L0907J3084o9570J0246
15094h3287k0393N0536Q3511k6940k2251R455j4668l8634L4071K7899l7215p2552
15082a10468j3423m7829j0224K4476O6613O8436K3700k9639P987K0589N3550j5661
15070C8107o4445K5491N9685j2984n3210o6091j7917K9896J8827J1494k7924K486
15058e6585N330r24P4144j7123K0279k8679l4378k7040J4953K3958K2324l1131
15046c4872j7956P2382k9015n721R4570J9897o2840j463N612o2960J6967M4409
15034C9010J3548q2575L3248P4048j270L699p5464l6319J8122l3369J3455j9433
15022e3300M3127r53J3604q281N5419K9542n3620j3292j688p5848l7998N4585
$$ plain form
15106 90007 87089 90394 62980 19009 -106973 -140452 -101360 -67954 -37047 -23963 -93533 -83287
15094 -83287 -103680 -53144 30367 3427 -18824 -9369 -24037 -62671 -28600 -701 -37916 -110468
15082 -110468 -123891 -171720 -181944 -157468 -90855 -22419 1281 -28358 -20371 218 53768 38107
15070 38107 -26338 -847 58838 45854 -7356 -73447 -91364 -61468 -42641 -31147 -59071 -56585
15058 -56585 -51255 -52179 21965 4842 25121 -3558 -37936 -64976 -50023 -26065 -3741 -34872
15046 -34872 -52828 19554 -9461 -15182 79388 99285 36445 34982 40594 -22366 -5399 39010
15034 39010 52558 -30017 3231 77279 76009 79708 4244 -32075 -13953 -47322 -33867 -53300
15022 -53300 -10173 -11126 2478 -5803 49616 79158 25538 12246 10558 -65290 -103288 -48703
15010d8703J05271O356o492p9923k9990L9448p255p376K8752R176n934j7879k8393
14997d2942Q479k1914J9931r908J633M1293M8099m5863L541K1844j2714q7331
14985g5852J3075P2404o665m596K7634L0640L1928m5131j0065j2192n2064l7222
14973f8106o9470J9882O8846Q226k335M0299J7404n3891l6132L3651k881L3668
14961a0839L095n6718n6643N0135K4003l077K3464m4869j23N6309L7l4735K8150
14948b1811k6528p207L0243j3371K6259N6037J2015j3949p604K6663m1258P168
14936B6657l0488k9258J3703r737L408J518Q997M4615l6302n61p529l6449R2560
14923D1134M6517m7839j12537J468O9646M8476j7965L076K0991k1991k1717o233
$$ plain form
15010 -48703 56568 62924 56432 -23491 -53481 -14033 -21288 -28664 88 9264 3330 -14549 -42942
14997 -42942 -34463 -56377 -36446 -46354 -44721 -3428 44671 -1192 2349 24193 11479 -75852
14985 -75852 -62777 9627 2962 -1634 26000 56640 88568 43437 33372 21180 -30884 -68106
14973 -68106 -137576 -117694 -48848 -40622 -42957 -2658 14746 -39145 -75277 -41626 -44507 -10839
14961 -10839 -7744 -64462 -121105 -70970 -46967 -50044 -26580 -71449 -71572 -15263 -15226 -49961 -21811
14948 -21811 -48339 -55546 -25303 -38674 -12415 43622 55637 41688 34084 60747 19489 26657
14936 26657 -3831 -33089 -19386 -29123 -25715 -24197 -15200 29415 -6887 -7448 -14977 -51426 41134
14923 41134 87651 39812 -72725 -71257 -1611 46865 28900 31976 52967 30976 9259 3026
14911C026L775J8046J1375k4833k0945L5032m4198m8130M740J6594l8151L4834
14899d8835P0328O6519k813n1539l2486n5088j1447O169k733L7270N5959P4430
14887A05734m8953n4598o1769o4639o397L229R9882Q0900m7478K4310l8670k7896
14875c6345m9979n8622q830R5139P9852N2830k1756p3052n8447M6882M6136L0251
14863D4059l9603j24321p3908J2607J17570J7671j0218L0930m510J1055l7114
14852e5782L063j2459k116J8533K2897Q8633M0558n0601J640j1641j4503p7834
14840d9612n3293O5295J8591K3069K305l2201o1144Q677P0185k013L4m1434K97
14827e1244N2741J0084j2740m6536Q2706L157q4341Q244P4909K7282K7839L5709
$$ plain form
14911 3026 6801 24847 36222 11389 -9556 25476 -18722 -66852 -62112 -45518 -83669 -48835
14899 -48835 21493 88012 85199 33660 1174 -53914 -65361 -59192 -61925 -24655 31304 105734
14887 105734 56781 2183 -59586 -124225 -130622 -127393 -27511 53389 5911 30221 -8449 -36345
14875 -36345 -86324 -144946 -153776 -58637 21215 74045 52289 -20763 -79210 -32328 13808 44059
14863 44059 4456 -119865 -193773 -181166 -63596 -45925 -56143 -25213 -29723 -18668 -55782
14852 -55782 -52719 -65178 -67294 -48761 -25864 62769 103327 52726 54366 42725 28222 -49612
14840 -49612 -102905 -37610 -19019 4050 6355 -25846 -86990 -78313 -8128 -10141 -10107 -51541 -51244
14827 -51244 1497 11581 -1159 -47695 35011 38168 -46173 -37929 36980 64262 92101 127810
14815A27810l7671m4595o5257N212J8544J609O5745K5600N7906j4657L129j7855
14803A25520k9396K9238J4025L3714J04260O6377J53198R5928J49155J77782J28144
14792A047945J1830k8532n3133q5743j25304j61401j42959j16675n5166m7170
14782B43692N533m1268m2764n684K9764K9182j02200n0674L586j9603m2318R151
14770A6397n652n124P2394O1204n6339o8536j3870Q940l6336N4175j0206l9203
14758b2156N611K6626j8240J079l3634N8459Q7073K9607j9372o7318n6102m551
14746a2918J9389K3360l9372L4958M437j3009k4854k9560n8041j0856N1760P594
14734d7112J8109O8133N71j7077j8182r480o1132K6108R1724R443j9589n2093
$$ plain form
14815 127810 90139 45544 -19713 -14501 4043 5652 71397 96997 154903 140246 143375 125520
14803 125520 96124 125362 139387 173101 277361 343738 496936 592864 742019 919801 1047945
14792 1047945 1059775 1031243 978110 892367 767063 605662 462703 346028 290862 243692
14782 243692 249225 207957 165193 159509 189273 218455 116255 65581 69167 49564 7246 16397
14770 16397 10745 5621 78015 139219 82880 14344 474 9414 -26922 27253 17047 -22156
14758 -22156 -16545 10081 -8159 -7080 -40714 17745 104818 134425 115053 47735 -8367 -12918
14746 -12918 6471 29831 -9541 25417 29854 16845 -8009 -37569 -95610 -106466 -54706 -47112
14734 -47112 -29003 39130 39701 22624 4442 -5038 -66170 -40062 51662 61105 41516 -10577
14722a0577n3038j5136R934l5945J6323K2146J02221J8492j3554j8310J5142l5416
14710B282n6806j086P9150J1750k8434p3666K8005L7487L8619k784Q866o641K1995
14697E8737k9894l1722j9419L2055Q9262j6262l7184J4336k1541j0487J3059l3067
14685G873k2735K4102O4901o246l2164L5359o7765n2360R3878O6464m50q627l9997
14672F2233m3099m2904j8816J3224L0786N356k8908Q025P812q763J6226k8927
14660b7755o0784J7149P4614M2377k9953k5966J7983Q7914m310j6059l7509j4393
14648B3308j5890k1816l5824K6228j763K9890J6541q038k1430K0639l9758K7496
14636d17J6623J7356k2685J7584m2146o2017n8264K3054L5146N8173k645K1192
$$ plain form
14722 -10577 -63615 -78751 -68817 -104762 -88439 -66293 35928 54420 40866 22556 37698 2282
14710 2282 -54524 -55610 23540 35290 6856 -66810 -38805 -1318 37301 34517 43383 36742 58737
14697 58737 28843 -2879 -22298 9757 99019 82757 45573 59909 38368 27881 40940 7873
14685 7873 -14862 9240 74141 67895 35731 71090 3325 -49035 44843 111307 110857 102230 62233
14672 62233 19134 -23770 -42586 -29362 1424 6780 -22128 -14103 -6291 -15054 1172 -27755
14660 -27755 -88539 -71390 3224 45601 15648 -10318 7665 95579 91269 75210 37701 23308
14648 23308 7418 -14398 -50222 -23994 -25757 4133 20674 12636 -8794 11845 -27913 -417
14636 -417 16206 33562 10877 28461 -13685 -75702 -133966 -110912 -75766 -17593 -20238 954
14624I54J2015k9761o8645o4894J7719J9808K899L8676O2417J7925M6626l4329
14612B1410o8402K6415M4819j1322j0721k2929J1874O201J1280p488Q182k1075
14600a1756P35k1004j3070K2K433K8164n65l8865j4487r710j3393J4725L1095
14587d5676j4618k0433o902J8887M4830r756k3897L4759R46K2748k2932j1194
14575c3238n7021q7083M8435N396j8443M9200M2839K7064j7714L247l7298L9754
14563c4862N0744m8292j7540K906K2978N2749K9372J1939l9184L0344J5561K75
14551G6990J8162j0824n9423m2802n011M3130J9413N730N8059l8305m6950k8242
14539a0073j8103k6940n617n59l0408k0278j5254L4737N7604N6572o527P5125
$$ plain form
14624 954 12969 -16792 -85437 -150331 -132612 -112804 -109905 -71229 -8812 9113 55739 21410
14612 21410 -46992 -20577 24242 12920 2199 -20730 -8856 -2655 8625 1137 9319 -11756
14600 -11756 -11021 -32025 -45095 -45073 -42640 -14476 -15041 -53906 -68393 -78103 -91496 -76771 -45676
14587 -45676 -60294 -80727 -87629 -68742 -23912 -33668 -57565 -22806 -21860 888 -22044 -33238
14575 -33238 -90259 -177342 -128907 -123511 -141954 -92754 -49915 -22851 -40565 -37318 -74616 -34862
14563 -34862 15882 -32410 -49950 -47044 -24066 28683 58055 69994 30810 61154 76715 76990
14551 76990 95152 84328 24905 -17897 -22908 20222 39635 45365 103424 65119 18169 -10073
14539 -10073 -28176 -55116 -60733 -61292 -91700 -111978 -127232 -92495 -34891 21681 15154 90279
14527I0279M1362J5083J937m4986q8127j08569k6488Q1872l9771n6623K8522j0241
14515a15750n465M3911K9726K4477L0502K1978k6384o9723m0396m996j8524M7708
14503h2936O7344j994l4397J7056K45Q134M376K0107l0561l9822K1770L4725L6355
14490B0402j4253l2156K4249m2481J0084K4939r503K4799L1920K3091Q418p541
14478F1968j7206m916R006J4742K9028m9666m771J9792l7679j536R4353j9101
14466I4014n5557K4795L5075k2996o2368r306N4950L4359M3134l9782o6933J1478
14454D0863O6373O5491J75408K01760K19773J97031L02651L68047K07158M6012
14444A890567l0124r1860k54855l60772l04406k41135k05106j39295r2281o0934
$$ plain form
14527 90279 131641 146724 148661 103675 15548 -93021 -119509 -37637 -77408 -134031 -105509 -115750
14515 -115750 -121215 -77304 -47578 -23101 7401 29379 2995 -66728 -107124 -112120 -130644 -82936
14503 -82936 -15592 -17586 -51983 -34927 -34682 -26548 -22172 -2065 -32626 -72448 -50678 -15953 20402
14490 20402 6149 -26007 -1758 -44239 -34155 -9216 -18719 6080 38000 61091 69509 61968
14478 61968 44762 39846 48852 63594 92622 42956 38185 57977 20298 18762 113115 94014
14466 94014 38457 63252 98327 75331 12963 3657 58607 92966 136100 96318 29385 40863
14454 40863 107236 172727 348135 549895 769668 966699 1269350 1637397 1844555 1890567
14444 1890567 1860443 1768583 1513728 1152956 848550 607415 402309 263014 170733 109799
14434A09799o7543j7819k8211J2124L6197k5587m9378r154N5229K0602m7222N7769
14422D6806l428p535l1066k4091N5608R543j9664m1423j2945l3479P1730M2320
14410E2376k0563L5574P6024o3979P488M0435k5994m0077m3873l3639M1227J4625
14398C9624n9160j7526M274l474M6526P97J0602j2717j1132j8033J0437M3027
14386C3245r353o3190q785J7148q731N1300K0650j0960R739m270q020l8962L0070
14373I881N8229O932l8737p6079k9216k1889J9064k1282K2312N2719J0740J5815
14361H489J7821n334q99N8370L966n8740K3048j9246O348M0625K6908m6008o5644
14348a0296N030L9866J8043k5715p7579o496R5431J3488l2677l2693N313P0909
$$ plain form
14434 109799 42256 24437 -3774 8350 44547 18960 -30418 -39572 15657 36259 -10963 46806
14422 46806 43378 35843 4777 -19314 36294 45837 26173 -15250 -28195 -61674 10056 52376
14410 52376 31813 67387 143411 79432 86920 127355 101361 61284 17411 -16228 24999 39624
14398 39624 -19536 -37062 -32788 -36262 10264 11061 21663 8946 -2186 -20219 -9782 33245
14386 33245 23892 -39298 -48083 -30935 -39666 11634 32284 21324 31063 26793 18773 -20189 9881
14373 9881 68110 75042 36305 -39774 -68990 -90879 -71815 -93097 -70785 -18066 -7326 8489
14361 8489 26310 20976 20077 78447 82413 23673 46721 27475 33823 74448 101356 55348 -10296
14348 -10296 -5266 34600 52643 26928 -50651 -57147 38284 51772 19095 -13598 -8285 62624
14336F2624k8034n6245p546K6254K1626k8902j8889m3993p557M1422K9578p123
14324a6785j4658k3470K3242O0810L3252j5954k1193j7420O265K2672k2539m2601
14312b8379m2677K7366O3926K3545l8405J4451J7335M202J2932J3103J3422q8947
14300h126m1236l925K1581R7652j8886m1790r189L1219j8906N4753O0098n7853
14288F5392q9806k4172j4399k9522N404L9767O2404L4203l6186o1400J4767L4731
14276A183L4887N9870P782k6380m5160J6904L3873M8498l0657m5088l0214J21
14264B5619K0881M3968Q857M0469M012n3111n2454l9302K5685j2831Q1063M3102
14252A35958K8427j8165r277q1389l6472n1375J9069j7623J9588K0644N1084O045
$$ plain form
14336 62624 34590 -21655 -29201 -2947 18679 -10223 -29112 -73105 -80662 -39240 -9662 -16785
14324 -16785 -31443 -54913 -31671 29139 62391 46437 25244 7824 14089 36761 14222 -28379
14312 -28379 -71056 -43690 20236 43781 5376 19827 37162 41364 54296 67399 80821 -8126
14300 -8126 -49362 -53287 -31706 65946 47060 5270 -3919 27300 8394 63147 123245 65392
14288 65392 -24414 -48586 -62985 -92507 -87103 -47336 15068 49271 13085 -48315 -33548 1183
14276 1183 36070 95940 103722 77342 32182 49086 82959 131457 100800 55712 25498 25619
14264 25619 46500 90468 99325 139794 143806 90695 38241 -1061 24624 11793 92856 135958
14252 135958 164385 146220 136943 55554 19082 -32293 -13224 -30847 -11259 9385 60469 66514
14240F6514j9459p1778m4702l2842O916L9140N4624K0398P043r811J0609O3916
14228I0568J02303Q0840L4897N8924L351l373m6272n7006k8337j3412j6086l1635
14216A74762q0568r635K4972J6678J5527q2808k4832K4408L8835L8216M0157m6576
14204A29136j883K0273K0022r70N598M7647P547j298k7477L913M5659N6820n583
14191B99404l1483k2867J5374J3052M0046M186j3047R9206N1488k7528N7422m9534
14179D35719o5418m1079J5825O4866l1039l7150o1811o4126j4288n5099j7389
14168A29011Q2041k0391m6244J7743l163m509R940j9464l63L2702R360l661n1095
14155A31907j5405J2930k2557m7206j5413L8994L5155L160o2220l0831O8667K1386
$$ plain form
14240 66514 47055 -24723 -69425 -102267 -95351 -56211 -1587 18811 25854 16043 26652 90568
14228 90568 192871 273711 308608 367532 370883 367510 321238 264232 235895 222483 206397 174762
14216 174762 94194 84559 109531 126209 141736 58928 34096 58504 97339 135555 175712 129136
14204 129136 127253 147526 167548 166578 172176 219823 227370 226072 198595 202508 248167 304987 299404
14191 299404 267921 245054 260428 273480 313526 317712 304665 403871 455359 427831 485253 435719
14179 435719 370301 329222 345047 409913 378874 341724 279913 215787 201499 146400 129011
14168 129011 211052 190661 144417 162160 158997 154488 164428 144964 144601 177303 186663 183002 131907
14155 131907 116502 129432 106875 59669 44256 83250 118405 121565 59345 28514 97181 118567
14143A18567j0874K5366j5709k3112M7363L0641k3431o7798J1152J05691N9170
14132B57026K1190j6151J8918l0632l8494l4852k2331n4389j3990j952j476K1048
14120A03915j1379L6869r732k8902M5555n2491q093P0673J7226j3976L5872L7551
14108B23088l0306P979q599o0178j5109Q7958L2192j5536m9958L4162O973p5127
14096A37539n2439K3844K7070q973m1967k2542Q0099O7693j2382o5628Q808j9045
14084A22077o8465M8795o5418j4450j5403L8470J9320k3527j3974O646L7678Q9274
14072A61023K3193l285j1430K2153p785j226o5163m5246L1929K1353K967O5666
14060A94149k0003J6890K7303K6788K8557N5944N928k4083J6338k6508O085L5182
$$ plain form
14143 118567 107693 133059 117350 94238 141601 172242 148811 81013 92165 197856 257026
14132 257026 278216 262065 280983 250351 211857 177005 154674 100285 86295 84343 82867 103915
14120 103915 92536 129405 119673 90771 136326 83835 75742 146415 163641 149665 185537 223088
14108 223088 192782 200761 192162 131984 116875 204833 237025 221489 171531 205693 212666 137539
14096 137539 85100 108944 136014 127041 85074 62532 142631 210324 197942 132314 141122 122077
14084 122077 53612 102407 36989 22539 7136 45606 64926 41399 27425 34071 71749 161023
14072 161023 184216 180931 169501 191654 183869 182643 117480 72234 104163 125516 128483 194149
14060 194149 174146 191036 218339 245127 273684 329628 335556 311473 327811 301303 307388 342570
14048C42570o445Q503k0942n1380k5386P9904M2876L7959R699J7035O0826J8262
14036E13481j9839J9363P1734L4862q1477l7279q150L0286P8340K8800L3324K2152
14024F85597n4822K3600L4265P1823L9908O7498K1647R1636J36686M9019P5380
14013A242237k201J3643N0361J27821J19383J36772J06546J32867Q2066J14504
14003B123999P7571J01464J06475J22684J84329K05712K40921M14240M68435M70904
13993D516734O06716P90372R05321R97569J172585J339120J413835J465641J498266
13984A4706159J579231J830718K240918L204510M977933Q054675J2976297K0542010
13976G0112451L1256513M3255809N2563785N7997402N3879320L3503428P022882
$$ plain form
14048 342570 336125 344628 323686 272306 246920 326824 369700 407659 417358 434393 495219 513481
14036 513481 493642 513005 584739 619601 538124 500845 492695 522981 601321 630121 663445 685597
14024 685597 630775 654375 688640 760463 800371 867869 889516 981152 1117838 1166857 1242237
14013 1242237 1240036 1253679 1304040 1431861 1551244 1688016 1794562 1927429 2009495 2123999
14003 2123999 2201570 2303034 2409509 2532193 2716522 2922234 3163155 3577395 4045830 4516734
13993 4516734 5123450 5913822 6819143 7816712 8989297 10328417 11742252 13207893 14706159
13984 14706159 16285390 18116108 20357026 23561536 28539469 36594144 49570441 70112451
13976 70112451 101368964 144624773 197188558 255185960 309065280 342568708 349591590
13969C49591590j4379952l4489896n2877837n9184136n2689714l9402404k6115320
13962G0452331j6509824j0620199p092131m845300l417612k599322k173851j926800
13954B1267292j818473j797244j719181j574030j401844j122692r05540p53769
13946A0174519o67214n30937m73222m63127l90654l27314l38242k78414l07972
13937F397423k55389j60558j72930j78071j03602n1073o9439n5705l1992N7414
13927E376078Q7560R3284J49831J09065J64388J90808J06021m4145j55184l23827
13917E753879l44288l81394m61052l86656l22104k35113k01452k39774k41120
13908B940926k04860j79786j06062o3100p6988j12899j03467r1119l6884p4830
$$ plain form
13969 349591590 335211638 300721742 247843905 188659769 135970055 96567651 70452331
13962 70452331 53942507 43322308 36230177 31384877 27967265 25367943 23194092 21267292
13954 21267292 19448819 17651575 15932394 14358364 12956520 11833828 10928288 10174519
13946 10174519 9507305 8976368 8503146 8040019 7649365 7322051 6983809 6705395 6397423
13937 6397423 6142034 5981476 5808546 5630475 5526873 5475800 5406361 5350656 5318664 5376078
13927 5376078 5463638 5556922 5706753 5815818 5980206 6171014 6277035 6232890 6077706 5753879
13917 5753879 5409591 5028197 4567145 4180489 3858385 3623272 3421820 3182046 2940926
13908 2940926 2736066 2556280 2450218 2387118 2310130 2197231 2093764 2002645 1965761 1890931
13898A890931l6863m3606q5036n1565o9963m7488k0952m1031q9320l3693l8806
13887A332608j01711n2086M3245J5356l0724n0780l6632o2903K4000m067q0819
13876I95487o8398j3115M8459L9461m4603j22092m5794l5907o7850r23K2460K0298
13864G27483K5806l5146o0237P493O1232J6430J4530j8482j8881P194J256q7135
13852F41543n7649N8154L5476m2316J4749L1819l206N8616N0222l5687l8658m8079
13840F64984l7101j597k8076k8434p5528p1205o0789l6243J8777j9712P278L3824
13828C66178L2140p3716o5397M776Q7912L7494Q142L1972J9557j9369p4309l4781
13816C20599n3956k616J1472j3874l0944n240j4847L0200o142k2498K2352n033
$$ plain form
13898 1890931 1854068 1810462 1725426 1673861 1603898 1556410 1535458 1494427 1405107 1371414 1332608
13887 1332608 1230897 1178811 1222056 1237412 1206688 1155908 1119276 1056373 1080373 1076306 995487
13876 995487 927089 913974 962433 1001894 957291 835199 789405 753498 685648 684725 707185 727483
13864 727483 753289 718143 657906 665399 726631 743061 757591 739109 720228 727422 728678 641543
13852 641543 583894 642048 677524 635208 649957 681776 678570 737186 787408 751721 713063 664984
13840 664984 627883 626286 598210 569776 494248 423043 362254 326011 344788 325076 332354 366178
13828 366178 398318 324602 259205 263981 351893 389387 397529 429501 449058 429689 355380 320599
13816 320599 266643 264027 275499 261625 230681 225441 210594 240794 234652 212154 234506 229473
13804B29473j6327J9386j617M2768P0388l398l9985p352j2132o9321l0278K2168
13792B03773j6363K7293L8284k7880p2080p9766j8221n6209l1545L1645Q261K0954
13780B8146L9002L7605N2349M6933j0131P201J7368n012J0764Q3832L3573l6561
13768C05069l3052q2388k8242L2446J9743l3712J6955J2080j8458l6565m110J08186
13756B57952K7642n772j06450j8779L3034L6650j8207k0933L152l6794m3543j0724
13744I7228q4892J98M3016N7729l6585J0724J9644n497n0974K2084J12689K9098
13732B14462l5488j9496p9292l7098q401j4442Q612k0809j943J6485k0103O3034
13720F5521M0828L8924N9486P8122l5911j01154J0222n6880o1730O5953Q0317
$$ plain form
13804 229473 213146 232532 230915 273683 344071 340673 300688 293336 281204 211883 181605 203773
13792 203773 187410 214703 252987 225107 153027 73261 55040 -1169 -32714 -1069 7192 28146
13780 28146 67148 104753 157102 204035 193904 201105 218473 213461 224225 308057 341630 305069
13768 305069 272017 189629 161387 193833 213576 179864 196819 208899 190441 153876 149766 257952
13756 257952 285594 279822 173372 154593 187627 224277 206070 185137 188289 151495 107952 97228
13744 97228 12336 12534 55550 113279 76694 87418 107062 101565 50591 72675 185364 214462
13732 214462 178974 159478 80186 43088 34687 20245 28857 8048 6105 22590 2487 65521
13720 65521 106349 145273 204759 282881 246970 145816 156038 99158 37428 103381 183698
13709A83698j4335o2685j2686J369J2483K5394j5103L9358J4398r3114p7926p0845
13697f9994J6735R2132P8853k4813j4131K4944L740N8187K7514m8793l8849m4508
13685F1017m8889n3627L3385O3579R2263J1052o9896m9042K9664k236j1700K8251
13673H3821J5418L2472J0330j5498K0065k6776l0686J2931K865k0364l9952l9377
13661E249K4491M5351j0090r9550J461K8196L913M5333N1552p2042k4724m1932
13649d2792l5948R5933M0381L1253j10484o1525M5546N7220M71m7439l0027n437
13637f2848N1215K9749L5396O1270L2532j9343r4467n9922L9060J9594k6513l7466
13625c1743L2094L7635l9926m5195O208L3073J3052j3642L0488J7715k2533j0595
$$ plain form
13709 183698 169363 106678 93992 95361 107844 133238 118135 157493 171891 78777 851 -69994
13697 -69994 -53259 38873 117726 92913 78782 103726 107466 165653 193167 144374 105525 61017
13685 61017 12128 -41499 -8114 55465 147728 158780 88884 39842 69506 67270 55570 83821
13673 83821 99239 131711 142041 126543 146608 119832 89146 102077 104942 84578 44626 5249
13661 5249 29740 75091 65001 -34549 -33088 -4892 -979 44354 95906 23864 -860 -42792
13649 -42792 -78740 17193 57574 88827 -21657 -83182 -37636 19584 20055 -27384 -57411 -62848
13637 -62848 -11633 18116 53512 114782 147314 127971 33504 -26418 12642 32236 5723 -31743
13625 -31743 351 37986 -1940 -47135 -40927 -7854 5198 -8444 22044 39759 17226 6631
13613F631J0738p356l2690J1376L1174L5098m1750k4772J030k8445j2399N7374
13601F009L8527l4197L3736j4572m675N765p138n0512n3938R704O9359P975Q747
13588A4790L73m4958r770K5137m9681l8816J6302j1433M4164K1517j2716J5544
13576b9547J9801j0641p1880J5988O7315J3832j4081r497J9671l8360l8362P9774
13564D013L9639l7347k776K3351p036L2706K056p6434M7119J3239l9629K9264
13552B8165r65j4157k4675k3466m5378j2564o6637O7906N5861J3353N5637K4240
13540E7320m9071J9159K0047l5408j6587m1986k5739k6742J7301J2819P223l4892
13528i6556J9917L8184L4407J7697J7432N189n459J9394L1005K2830j1046L229
$$ plain form
13613 6631 17369 10013 -22677 -11301 19873 54971 13221 -11551 -10521 -38966 -51365 6009
13601 6009 44536 10339 44075 29503 24828 30593 23455 -27057 -80995 -71291 -1932 6043 14790
13588 14790 15163 -29795 -39565 -14428 -64109 -102925 -86623 -98056 -53892 -32375 -45091 -29547
13576 -29547 -9746 -20387 -92267 -76279 -8964 4868 -9213 -18710 961 -37399 -75761 4013
13564 4013 43652 6305 3529 26880 19844 52550 54606 -21828 25291 38530 -1099 28165
13552 28165 27200 13043 -11632 -35098 -80476 -93040 -159677 -91771 -35910 -22557 33080 57320
13540 57320 8249 27408 47455 12047 -4540 -46526 -72265 -99007 -81706 -68887 -61664 -96556
13528 -96556 -76639 -38455 -4048 13649 31081 36270 30811 50205 81210 104040 92994 96223
13516I6223M2154j8930o9221P025L6395J6433l5277J1668M6776q370r4379j0462
13504B0035P4319P5825K8070Q7791j7845m555j7801m1392P1885J56594J71102
13493F04028K55275L20371L17070K64917J32598J876p4865j63392k78328l41765
13483A037785l12723j23590j02691j45649j10423n7334J3436n4485m8955j5961
13473G9410J6165j0254K2150K5069j6271n440M780j7431n8268J691K6230O7880
13461A35711j5377o840K6731Q6383n6743o5874j436l1265j5625Q981J140J0887
13449G6673J31l6665k4254P837N8183N7291m0869l0991l9577l3820Q0845O4708
13437A39492M4875p614o964k7428j7298q1066l3414N6888J5137n0523O872L6751
$$ plain form
13516 96223 138377 119447 50226 57251 93646 110079 74802 86470 133246 124876 30497 20035
13504 20035 94354 170179 198249 286040 268195 263640 245839 204447 276332 432926 604028
13493 604028 859303 1179674 1496744 1761661 1894259 1896135 1821270 1657878 1379550 1037785
13483 1037785 725062 601472 498781 353132 242709 185375 198811 144326 95371 79410
13473 79410 95575 85321 107471 132540 116269 110829 115609 98178 39910 41601 67831 135711
13461 135711 120334 113494 140225 226608 169865 103991 102555 71290 55665 64646 65786 76673
13449 76673 76804 40139 15885 23722 81905 139196 98327 67336 27759 -6061 74784 139492
13437 139492 184367 176753 169789 142361 125063 43997 10583 67471 82608 32085 38957 75708
13425G5708K2837n3112l0919n0538o5004o284M4338J4395O797P372M1754J8991
13413B6335L492j1260k487j86l1653l6747k9712J345M2403L6832P4946K5539L105
13400A01952q2340k6375L0394J1310m5082J7367M9156P417j0807k9963k0566L75
13388B838M6558L0823o459j0858p950j281l8141L1361j8954K4912q27j4805L434
13375D0651M4443M0744J4923j2090n6419m9760k7124M3962k2004l619l748L3929
13363D3888J2248n9805n2935R054L7194k7523J8392J09273K125p9488k8072J5319
13351c30k1377M8325L7230l2802l5537N8950K7679J3472k9756j0266l4563k5694
13339d669k3857K760j1355L5179r99l2321j7161K4116N469j6227J3388k466K525
$$ plain form
13425 75708 98545 45433 14514 -36024 -101028 -107312 -62974 -48579 -41782 -34410 7344 26335
13413 26335 29827 18567 16080 15894 -15759 -52506 -82218 -80873 -38470 -1638 73308 98847 101952
13400 101952 19612 -6763 23631 34941 -10141 7226 56382 63799 52992 23029 2463 2838
13388 2838 49396 80219 73760 62902 54952 53671 15530 46891 27937 52849 52022 37217 40651
13375 40651 85094 125838 140761 128671 72252 22492 -4632 39330 17326 13707 9959 43888
13363 43888 56136 -3669 -56604 -47550 -10356 -37879 -19487 89786 91911 12423 -15649 -330
13351 -330 -21707 26618 63848 31046 -4491 54459 82138 95610 65854 55588 21025 -4669
13339 -4669 -28526 -25766 -37121 -1942 -2941 -35262 -52423 -28307 -22838 -39065 -25677 -28143 -25618
13326b5618J9549n860j1359j3101m2766L9825L7724m3529N212N3399M5454J1128
13314G0058m1364o6723k5947j6180L2969M2235P649M1095m857j85j9107k2353
13302b710j712L6700L7934K6417K7357k8368o1898m5195Q824K7104M1352o247
13290E9558p676r8945r997j2264k3829O8735M6072L5492J6131j2754J4960o146
13278F9337Q825N769m2610k7567L7181j9214l7967n4551k9254q965J4596l824
13266h8244L4142J1285N4153O8928Q91l7008R949Q4038l7081j8893J0054l0442
13254F1772l7963j0206L1562L928m1232l3775M8796M484L9006k3464K984k3253
13242B2639o3387K841L8792J8356K8796k6369k6357N118m621M6108J1146K0018
$$ plain form
13326 -25618 -6069 -11929 -23288 -36389 -79155 -39330 -1606 -45135 -39923 13476 58930 70058
13314 70058 28694 -38029 -63976 -80156 -47187 -4952 2697 43792 38935 38750 19643 -2710
13302 -2710 -4422 32278 70212 96629 123986 95618 33720 -11475 -2651 24453 65805 59558
13290 59558 51882 -47063 -57060 -69324 -93153 -24418 21654 57146 73277 60523 75483 69337
13278 69337 78162 83931 41321 13754 50935 31721 -6246 -60797 -90051 -99016 -84420 -88244
13266 -88244 -54102 -42817 11336 80264 81155 44147 54096 138134 101053 82160 92214 61772
13254 61772 23809 13603 45165 49093 7861 -25914 22882 27366 66372 42908 45892 22639
13242 22639 -40748 -37907 885 19241 48037 21668 -4689 429 -4192 41916 53062 73080
13230G3080K4232l4954n1808m6606n7863q850M6338J2269L8786L9851P155n0610
13218h980p1391M629j078K4380P5474N5026K7569k1252N491L3330k0249k9153
13206G3796m7483k4184n8921j0199L6359n683p750J9869P0328M3419n6640o3304
13194c0393M054L2279J08731N7666m1379o1182q7429m9532J9993n7198j7924q454
13182a30768Q1818K9835L6904J1152m0867N9869J08715m4621n8922L4188J5058
13171A02361k6286l0576l0083k9922J3745K4985O3262K7792k1179L4844k1809
13160A07134k1023L0018k0476q5105m7800K8591L0487P7846n935j14843K6062
13149D956L1851o3199o3292J00094M1152R496R337r578m3900m8615n8338m4274
$$ plain form
13230 73080 97312 62358 10550 -36056 -93919 -102769 -56431 -44162 -5376 34475 41630 -8980
13218 -8980 -80371 -75742 -76820 -52440 23034 78060 105629 84377 89868 123198 102949 73796
13206 73796 26313 2129 -56792 -66991 -30632 -36315 -44065 -24196 46132 89551 32911 -30393
13194 -30393 -26339 5940 114671 172337 130958 69776 -17653 -67185 -47192 -104390 -122314 -130768
13182 -130768 -48950 -19115 17789 28941 -11926 47943 156658 112037 53115 87303 102361
13171 102361 76075 45499 15416 -14506 -761 24224 87486 115278 94099 128943 107134
13160 107134 86111 116129 95653 10548 -37252 -8661 21826 99672 93737 -21106 4956
13149 4956 36807 -26392 -89684 10410 51562 61058 70395 60817 16917 -31698 -90036 -134310
13137a34310N0488M18M741M7127l3901k1111l7683l3348l935N4060O2293M435
13125d0726j2793j4557k4215J1267J8387M3122M0977M3505l3213m9083L966j6512
13113b9875k757K778J8155J2367L1359Q6272M184l6782k3626L5114n2680k4705
13101A9804R811n7836m3059j971P850R783j5191j3703P8525L9555M6263m7203
13089C2628r9361K5217N1258p117l2684K6960L5291N6826j3284l3200k768k1341
13077A8425m4897l9923J5569Q385N4636Q4438j9346m8880J7916k0717k3723M2079
13065D3962L4016n544J5630K1280n1086l3257J3826K3681L8667K432p2478l7709
13053f580p725j0866L5241K8575K442m6954l6960K3627K1025L8309J07188M0396
$$ plain form
13137 -134310 -83822 -83404 -78663 -31536 -65437 -86548 -124231 -157579 -161514 -107454 -45161 -40726
13125 -40726 -53519 -68076 -92291 -81024 -62637 -19515 21462 64967 31754 -17329 -13363 -29875
13113 -29875 -32632 -29854 -11699 668 32027 118299 122483 85701 62075 97189 44509 19804
13101 19804 29615 -28221 -71280 -73251 -65401 -55618 -70809 -84512 -5987 33568 79831 32628
13089 32628 -66733 -41516 9742 2625 -30059 -3099 32192 89018 75734 42534 39766 18425
13077 18425 -26472 -66395 -50826 -42441 12195 96633 77287 28407 46323 25606 1883 43962
13065 43962 77978 72434 88064 109344 58258 25001 38827 62508 101175 103607 31129 -6580
13053 -6580 -14305 -25171 10070 38645 41087 -5867 -42827 -19200 1825 40134 147322 187718
13041A87718q319k2166l0804j4664o8639o9894k1707P137J00956J21081l6784
13030A43915j17530j9873J5609M0969r47m1577m1228j1228K5137K2479j5914J9794
13018A9606O6423m4365K1665K8086M5425q7876n3471j116M3104P890r166n273
13006C0932l1399m2889o0654J3464L8220k5726K2122J13483L748o1026p701k4753
12994c2179J7036L2454J0940k6363L2604M4241k8932j6671K6963j9543l6105o3980
12982e9535j0174m5872J3546Q7031K5690L9268m4443k1673m5221M262P0069M902
12970A7850L1658J2592m9042l0079k1248m3159j1868J314J1246P0570J5613m2571
12958c7124r1012m829J15323L1493r771k9635k9623j4659l2742M4331K4493Q2855
$$ plain form
13041 187718 179399 157233 126429 111765 43126 -26768 -48475 -41338 59618 180699 143915
13030 143915 26385 6512 22121 63090 62143 20566 -20662 -31890 -6753 15726 -188 19606
13018 19606 86029 41664 63329 91415 136840 48964 -4507 -5623 37481 45371 36205 30932
13006 30932 -467 -43356 -104010 -90546 -52326 -78052 -55930 57553 61301 275 -7426 -32179
12994 -32179 -15143 17311 28251 1888 34492 78733 49801 33130 60093 40550 4445 -59535
12982 -59535 -69709 -115581 -102035 -15004 10686 49954 5511 -16162 -61383 -57121 12948 17850
12970 17850 49508 62100 13058 -17021 -38269 -81428 -93296 -91982 -80736 -10166 5447 -37124
12958 -37124 -128136 -132965 -17642 13851 4080 -25555 -55178 -69837 -102579 -58248 -33755 49100
12946D9100M1730m7433j3573L799r0560k7889M4665M740M6743k1253K5979J2807
12934B8855M320M07k0251q799j1626O493k0022K6796r373L4369M2847p875J4519
12921H0660M3093K4499m1282p1280k8654l9728j0564J4542M618L7227k4722n02
12909a2093L9225L7869l230p1293l1057K5478l925k780k0475j5065j4950l013
12897g5309k3808o20O0978L6160J3251M426m3301p443K961Q3726K0652m817j4012
12884E2844j2372m0955l919m9956l1039L8531M2989J1816j6931l6703p618J1554
12872d1759Q1596N7887L3048r094r8206o8657j1230L5796K6119M9937K1013l2142
12860D4308k0635K607P9599L1435k7652l7953k0003K967Q199j8092O093j7631
$$ plain form
12946 49100 90830 43397 29824 33623 -56937 -84826 -40161 -35421 11322 -9931 16048 28855
12934 28855 33175 33582 13331 4532 -7094 -601 -20623 6173 -3200 31169 74016 66141 80660
12921 80660 123753 148252 106970 35690 7036 -32692 -43256 -28714 -24096 13131 -11591 -12093
12909 -12093 27132 65001 61771 -9522 -40579 -15101 -19026 -21806 -42281 -57346 -72296 -75309
12897 -75309 -99117 -99737 -38759 -2599 10652 15078 -28223 -35666 -32705 51021 71673 66856 52844
12884 52844 40472 -483 -4402 -54358 -85397 -46866 -3877 7939 -8992 -45695 -53313 -41759
12872 -41759 39837 97724 130772 121678 23472 -45185 -56415 -20619 5500 55437 76450 44308
12860 44308 23673 26280 105879 137314 109662 71709 51706 54673 62872 44780 50873 33242
12848C3242j3715j4167j590J6021j122j902p7306J0924k273k3280L472p725K981
12835g6440N9389O3047J0916p3197l2662k3944p619M1116L0688M4299O262J1956
12823E3811Q504k8066j3091j9156J57L7709l1887M438K1123j9883M8j1675j7956
12810a5924M4995L891j5333l1614k657m1167l3710P601m4190Q834j125O2227O5594
12797G422k5258j3397m3j1135L5480J9345N6795J4014l3737M89M3536K8244n6141
12784F5614n3362K609k9538r780q436K9613k6096L382M033m6876k7390Q0243N0842
12771C4858n706J8189p401m5873k9345J6368L7647K9669l8037J1381l5920R533
12759d637p07k2111n8337J9863Q325L7970K9342m479n1041L9761K5016Q18L6639
$$ plain form
12848 33242 19527 5360 3770 19791 18669 16767 -60539 -49615 -51888 -75168 -71696 -79421 -76440
12835 -76440 -17051 45996 56912 -16285 -48947 -72891 -80510 -39394 -8706 35593 41855 53811
12823 53811 62315 34249 21158 2002 2159 39868 7981 12419 33542 13659 13707 2032 -15924
12810 -15924 29071 32962 17629 -13985 -16642 -57809 -91519 -83918 -128108 -119274 -120399 -58172 7422
12797 7422 -17836 -31233 -31276 -42411 -6931 12414 69209 83223 49486 49975 93511 121755 65614
12784 65614 12252 14861 -14677 -24457 -32893 -3280 -29376 -25994 -21961 -68837 -96227 -15984 34858
12771 34858 29152 47341 39940 -5933 -35278 -18910 18737 48406 10369 21750 -14170 -4637
12759 -4637 -5344 -27455 -85792 -65929 -57604 -19634 9708 5229 -45812 -6051 18965 19783 56422
12746E6422l7220m693k2124k5391K4837J650n4039K7780K5512l9211k369j5442
12734f4288J9132M6785O2399q662k4628j3445K7012n9166l1050j0969m870M4914
12722a6836l7913k4196R1267L9442K90J2082n1810j139K6079K8604k6785J9873
12710E8958j3094K4191M8147J4038n4498j6467k7707l8205n834J5301L2398K0433
12698E7661o2460J4726M1802j7462O495k1373K9701r348Q717m9459j0370m0742
12686e2112M9128p395J4750M4075M455j6912J1287k455J5279n1608J0065Q845
12674B7402j3187O924M2978j5481j5445J6175P3666K2127q8191n4560N5566N095
12662F3069r5847n0752J6421K6144K7069j3070K8280K9168k914j496k9011J1328
$$ plain form
12746 56422 19202 14509 -7615 -33006 -8169 -6519 -60558 -32778 -7266 -46477 -48846 -64288
12734 -64288 -45156 1629 64028 55366 30738 17293 44305 -14861 -45911 -56880 -61750 -16836
12722 -16836 -54749 -78945 12322 51764 52054 64136 12326 11187 37266 65870 39085 58958
12710 58958 45864 70055 118202 132240 77742 61275 33568 -4637 -10471 4830 37228 57661
12698 57661 -4799 9927 51729 34267 40762 19389 49090 39742 48459 -1000 -11370 -52112
12686 -52112 -2984 -10379 4371 48446 52901 35989 47276 44821 60100 8492 18557 27402
12674 27402 14215 21139 64117 48636 33191 49366 123032 145159 56968 2408 57974 63069
12662 63069 -32778 -83530 -67109 -40965 -13896 -26966 1314 30482 27568 26072 -2939 8389
12650H389R784j5319j8950L7115o8801o691J0579L1801L9307K2407J3466J0591
12638G3678j47M2953j6797n7302K8428n1511l8181n2926N5652M9256P0639K3788
12626A27530o9915K8585J8159o304l6983o1125K2037k6765N6243K8993k4904j0778
12614D4773J0515j7767k2105J1802k4358n5322r063R929J1080l7841P046O4829
12602f482m4341J0323O1758J3049Q4634N8904m7474n9457K6875M5308n1037l2043
12590F0017j2611j907p8619l3676M5973O9943o013M484m7053j4653l4676K9221
12578a9570L0156L073P315j1543k2637M3342N8086K036n5845l1405L9158J9566
12566F1732l6794r659J7462Q621J5211J5165j7236N37L8986k3869l6179p931k0574
$$ plain form
12650 8389 18173 2854 -16096 21019 -47782 -54473 -43894 -12093 27214 49621 63087 73678
12638 73678 73531 116484 99687 42385 70813 19302 -18879 -71805 -16153 33103 103742 127530
12626 127530 57615 86200 104359 98055 61072 -53 21984 -4781 51462 80455 55551 44773
12614 44773 55288 37521 15416 27218 2860 -52462 -61525 -51596 -40516 -78357 -71311 -6482
12602 -6482 -50823 -40500 21258 34307 118941 177845 130371 70914 97789 143097 92060 60017
12590 60017 47406 45499 -33120 -66796 -20823 49120 43107 47591 538 -14115 -48791 -19570
12578 -19570 10586 13659 20974 9431 -13206 30136 88222 90258 34413 3008 42166 61732
12566 61732 24938 15279 32741 41362 56573 71738 54502 55039 94025 70156 33977 26046 5472
12553E472p098J8805M14J8236K7625l4508m8647j0785K4531M2306j1324k3632
12541A395m208j9497j9780J08396K2946l8176q3547m923L1213l4972K716J9976
12529a8461O8675J3005k5034j0742j08987J9958N4657j8807M8323K6945l5792
12518A3740k6190k9542J7934K8093k1395r584K4022O0180p2922p3581p649K2670
12506g4224j2303K243M1121L4750j6316k878L0355n2631p227k4766l3764L4132
12494h1508K7358q7l96j1477J7242j4860p4130L7288L9433K1508L2996L6827m1792
12481a1598j3146R852j9887m0295L6506J792k7884M1730L6770j0469K4461R399
12469C7231M2405Q163o6521n5920k1782r116J8837K8083j2255M9552N892j5642
$$ plain form
12553 5472 -1626 17179 17593 35829 63454 28946 -19701 -30486 -5955 36351 25027 1395
12541 1395 -2813 -22310 -42090 66306 89252 51076 -32471 -37394 -6181 -41153 -38437 -18461
12529 -18461 50214 63219 38185 27443 -81544 -61586 -6929 -25736 22587 49532 13740
12518 13740 -12450 -41992 -24058 4035 -17360 -26944 -2922 57258 -15664 -89245 -96894 -74224
12506 -74224 -86527 -84284 -43163 -8413 -24729 -27607 2748 -49883 -57110 -81876 -115640 -81508
12494 -81508 -54150 -54237 -54633 -66110 -48868 -63728 -137858 -100570 -61137 -39629 -6633 30194 -11598
12481 -11598 -24744 -14892 -34779 -75074 -38568 -36776 -64660 -22930 13840 3371 27832 37231
12469 37231 79636 87799 21278 -34642 -56424 -65540 -46703 -18620 -30875 18677 24569 8927
12457H927o8482j9219L8646j282k3067K0678M6240k8714l4425J3587R250L1927
12445e934K6533m887l792l0825l8536l9798J4059J8057N4388K6081m8380n6153
12433h9187K4589O0254m9946j2937M6415K2555K8885j3428L8185k7812p9742k9586
12421h1755N6754k2112J4163r913j09l208L611k8517P224n790n7325J1459Q8093
12408b7425N5250j0457k3588O316l305j0722J6556j9721j2994n865L823k8105
12396f0237O380M7229N5594j1764k8497K2112l0980P496l0687k3872L3218l2133
12384d6141q171J6537Q992P9846j2719k9552L4584N9264r0344j21738r1326O9796
12372a30972k8069J0850P4941P4940K0527J1579O730N7359j9125j8317j9057o668
$$ plain form
12457 8927 -59555 -78774 -40128 -41410 -64477 -43799 2441 -26273 -60698 -47111 -37861 -5934
12445 -5934 20599 15712 11920 -18905 -57441 -97239 -83180 -65123 -10735 15346 -33034 -89187
12433 -89187 -64598 -4344 -54290 -67227 -20812 1743 30628 17200 55385 27573 -52169 -81755
12421 -81755 -25001 -47113 -32950 -42863 -42972 -46180 -42569 -71086 -63862 -69652 -126977 -115518 -27425
12408 -27425 27825 17368 -6220 96 -3209 -13931 2625 -17096 -30090 -35955 -32132 -60237
12396 -60237 -53857 -6628 48966 37202 8705 30817 -163 7333 -23354 -47226 -14008 -46141
12384 -46141 -54312 -37775 -28783 51063 38344 8792 43376 102640 12296 -109442 -200768 -130972
12372 -130972 -159041 -148191 -73250 1690 22217 33796 40526 97885 78760 60443 41386 34718
12360C4718l7771n5773l165K2140L4051K0401L7056M615k7058Q3370J1612o1354
12348F2842q6302l4682J557J5874L2301k6007n872Q681K8388J392l8123j709J4897
12335b6763J8410J8572l9347J2709N245m8497l5662K8349Q4860l3594n3627J1450
12323e7895p164K2436k1993J4776k5885J4391L2928J4344J160j0938L5486L3448
12311D5094o0982n6753q997N0074M6424j3537l4486j5097K4439M3670l3612o2254
12299g6017j4381K2730N5866L7117L3562J4982m2787n4708k3106j1532J477l0042
12287h6839J10791n36n0935j698l788K121K5458L9944M2991n292j02873qN7438
12274B6774L0674M1458q488l27m0866n4874j9094n8431L282L5246L19N8407O8470
$$ plain form
12360 34718 -3053 -58826 -61991 -39851 -5800 14601 51657 56272 29214 112584 124196 62842
12348 62842 -23460 -58142 -56585 -40711 -8410 -34417 -40289 -31608 -3220 -1828 -39951 -41660 -26763
12335 -26763 -8353 10219 -29128 -16419 -11174 -59671 -95333 -66984 17876 -15718 -69345 -57895
12323 -57895 -65059 -42623 -64616 -49840 -75725 -61334 -28406 -14062 -12902 -23840 11646 45094
12311 45094 -15888 -72641 -81638 -31564 14860 1323 -33163 -48260 -23821 19849 -13763 -76017
12299 -76017 -90398 -67668 -11802 25315 58877 73859 31072 -23636 -46742 -58274 -56797 -86839
12287 -86839 23952 23416 -27519 -29217 -33005 -30884 -5426 34518 77509 72217 -30656 -30664 26774
12274 26774 57448 98906 90418 90091 49225 -5649 -24743 -83174 -79892 -44646 -44327 14080 82550
12261H2550J1141m354O1j9221l1086m2862Q330J2995K7238J6475m9546K168J3536
12248B7425l8611j3127P507l7858l8647m0733L1617N8415j0632n981N9297O525
12236E197j9480m1368J8649O863L7935j8996n3179k1231L2764j5550J4621O806
12224d6969J8246K5051J897j851J0998M5223J0683K5038m2472p5849p915J0678
12212b7242L4409L0916J0485n6864r188l3824l0945K6293n8112o491K161n589
12200a23991m236j5625P6230L0400J1674m5396j7550r20J4053M3076K0686k6618
12188c8217k5111J0637M6295L6374J2793L5767o844k1300o4427n4542l2279M2892
12176e7962M0835K3289K6089m0111j316N802O6561l0101r4085j7856L0035N7406
$$ plain form
12261 82550 93691 89337 89398 70177 39091 -3771 4559 17554 44792 61267 11721 13889 27425
12248 27425 -11186 -24313 -16806 -54664 -93311 -134044 -102427 -44012 -54644 -60625 -1328 5197
12236 5197 -14283 -55651 -37002 -30139 7796 -11200 -64379 -85610 -52846 -68396 -53775 -46969
12224 -46969 -28723 -3672 -1775 -3626 7372 52595 63278 88316 45844 -30005 -37920 -27242
12212 -27242 7167 38083 48568 -8296 -17484 -51308 -82253 -55960 -114072 -120563 -118402 -123991
12200 -123991 -128227 -143852 -67622 -37222 -25548 -70944 -88494 -89414 -75361 -32285 -11599 -38217
12188 -38217 -63328 -52691 -6396 29978 42771 78538 71694 50394 -14033 -68575 -100854 -57962
12176 -57962 -17127 6162 32251 -7860 -9176 -3374 63187 33086 -60999 -78855 -48820 8586
12164H586pl5300L2587M049l9628J6012K7453j3069o1400n752O3561M1405p5327
12151c6830J2155k3285Q1825N4853P509k1330k5839l549R0962L531m8312l2600
12139E9090n8331n987l8325L6079J9080n5601k6301k0162K0716K1560K9134p356
12127b6404n626O1333k8374n2963k6066N5713Q6589k2795q195q765Q789k8968
12115D268N0L1751J9900J1896m1414Q468J7491L50p6834o1857l8228k0551M7430
12102i7280O0237l6682m3184j0161K5671o509L3665P0959J2875L7409q969n3499
12090a5468M954l1083j8678l8998k405L4389m0165j5012M0421j5138K6131Q8300
12078A7248j5982j4814M3814K2131n4498j5457L4391K3240M5359j265k2910K7528
$$ plain form
12164 8586 8579 -26721 5866 9915 -29713 -13701 13752 683 -60717 -66469 -2908 38497 -36830
12151 -36830 -24675 -47960 33865 88718 96227 74897 49058 45509 136471 140002 91690 59090
12139 59090 759 -5228 -43553 -7474 11606 -43995 -70296 -90458 -69742 -48182 -19048 -26404
12127 -26404 -32030 29303 929 -52034 -78100 -22387 64202 41407 33212 24447 33236 4268
12115 4268 4318 36069 55969 67865 26451 34919 52410 52760 -24074 -85931 -124159 -144710 -97280
12102 -97280 -37043 -73725 -116909 -127070 -101399 -107908 -74243 -3284 9591 47000 38031 -15468
12090 -15468 -10514 -41597 -60275 -99273 -101678 -67289 -107454 -122466 -82045 -97183 -71052 17248
12078 17248 1266 -13548 30266 52397 -2101 -17558 16833 40073 85432 84167 61257 88785
12066H8785j0703m4050n3925n9141L3133L4479p839p515k2665k4138n791L1994
12054d7376n20j5041N2078K0506O4372K5708r6661l3479K5446l5179J6721M6692
12042B3267L5846m7025j4416J2741o080J0518o5065j1471K6696L2995K299M4212
12030D4517l2368m5722L6617N0314l5627n1737L7881Q9706l1704o9509J6423L4937
12018D3728j3966L1844l5734o1183l3832O4533K8486j6272l5635o110M8061J2618
12006B6538j6662l0959L2694p233j0070n0712K2374p566k0299o565J9209M2523
11994f728j4697k5029N783K4782K0443L6860k8718j8824J1110m066n5660L2646
11982b2098O3302j5089M0045O256N540p241J3922J2520n726j3688l6349j27804
$$ plain form
12066 88785 78082 34032 -19893 -79034 -45901 -11422 -19261 -26776 -49441 -73579 -79370 -47376
12054 -47376 -47896 -62937 -10859 9647 74019 99727 3066 -30413 -4967 -40146 -23425 23267
12042 23267 59113 12088 -2328 10413 4333 14851 -50214 -61685 -34989 -1994 305 44517
12030 44517 12149 -33573 3044 53358 17731 -34006 3875 93581 61877 -7632 8791 43728
12018 43728 29762 61606 25872 -35311 -69143 -4610 23876 7604 -28031 -34141 13920 26538
12006 26538 9876 -21083 11611 4378 -5692 -56404 -34030 -41596 -61895 -68460 -49251 -6728
11994 -6728 -21425 -46454 -40671 -15889 4554 41414 12696 -6128 4982 916 -54744 -22098
11982 -22098 41204 26115 66160 72416 77956 70715 84637 97157 91431 77743 41394 -86410
11970h6410L2263J00998L8201m8977K1031m2879l6549k0600J021L5881K388L4811
11958C1179n0607m5033R062l3959n5153n529K2173R6229L6252m7136N467J2544
11946b4511p8734l7532P1015J1752m3649l5055j0753P1085J01422O4198n7074
11935C2164m4029N554n506K6761P846J337p760n2110K9921n5651k6371N7156J8407
11922a2281M2054J8416L517l5882N13j04m7063J388K1609K9136m5804n532j2405
11909d2438l018K7545J3131m1478k7784K6704L7954O619n9164k0945k6306L8898
11897g0282M9159L9537R627n7609J0663K9695k6675R954K6133j634j2584k2139
11885a6155j651L5730L9622k0351l8755J9235P282j329m1073l1932J8710L3060
$$ plain form
11970 -86410 -54147 46851 85052 36075 57106 14227 -22322 -42922 -41901 -6020 -3632 31179
11958 31179 -19428 -64461 -55399 -89358 -144511 -150040 -127867 -31638 4614 -42522 -37055 -24511
11946 -24511 -103245 -140777 -69762 -58010 -101659 -136714 -147467 -76382 25040 89238 32164
11935 32164 -11865 -6311 -11817 14944 22790 24127 16367 -35743 -5822 -61473 -87844 -30688 -12281
11922 -12281 29773 48189 51706 15824 16337 16233 -30830 -29442 -7833 21303 -24501 -30033 -42438
11909 -42438 -45456 -17911 -4780 -46258 -74042 -47338 -9384 -2765 -61929 -82874 -109180 -70282
11897 -70282 -21123 18414 28041 -29568 -18905 10790 -15885 -5931 20202 18568 5984 -16155
11885 -16155 -17806 17924 57546 37195 -1560 17675 24957 23628 -17445 -49377 -30667 2393
11873B393J6947K0309n8251m3389k2270j9574n1463j4737L9348J11833K7403r266
11861g17O8039L1962l3388n8506r7681q9747J0311J5396l3881j79J7373l4503
11849b05521K6216N5926R6343Q1366P4883l3425o2606k1793k4347m7495J067J348
11837e8038p1505r919l193O794M7659Q1167K0518L1310n254J3534J1251j7630
11825D6694o781J6483j7567l1912K5193N0781j6258k6538K7897j0931k0942l832
11813C2287j8106k2027m3980l4686N9384M6682m46k4137k8147O0988K0214n0740
11801b714n0589L6763N0829k2359N184k6617m3055j7665k8349M0948J9028L8208
11789c88k7277n5920m861M2374J8174K3874N8007l4515n799K7958m0280K2074
$$ plain form
11873 2393 19340 39649 -18602 -61991 -84261 -103835 -155298 -170035 -130687 -18854 8549 -717
11861 -717 67322 99284 65896 7390 -90291 -180038 -169727 -154331 -188212 -188391 -171018 -205521
11849 -205521 -179305 -123379 -27036 54330 129213 95788 33182 11389 -12958 -60453 -59386 -58038
11837 -58038 -129543 -139462 -142655 -135861 -88202 -7035 13483 44793 39539 53073 64324 46694
11825 46694 39913 56396 38829 6917 32110 82891 66633 40095 67992 57061 36119 32287
11813 32287 14181 -7846 -51826 -86512 -27128 19554 19108 -5029 -33176 27812 48026 -2714
11801 -2714 -53303 -16540 34289 11930 17114 -9503 -52558 -70223 -98572 -57624 -38596 -388
11789 -388 -27665 -83585 -88446 -46072 -27898 -4024 53983 19468 13669 41627 1347 23421
11777B3421N8602j1350m8639j4557j4347N2741m749j835K2330K1684l097j229
11765G8975k9221p1853O5949J12410J2766p6659l0722L088n3588q34Q56l0967
11753a9800m5443m6083N133M8345K6076k2470N0980P847k4749M3276O2521j7579
11741F8054J4136j5357k958M738k2538j4576R51k3259K2431K0036m6428m0026
11729c4796k5728l49J1973k8628k8843p2130J7712O9276n317m0174M1135K4862
11717g1007k5251l7482J746J3151N9677K4086M5130N5216L3842k5015m3103k3585
11705G405j3933n4741O0807O4819n961m716J0043n9774m8617L9835l4360m5334
11693h4527m7985M9652M3713j6825n077r40L2863L1914J0962K0797M9292o253
$$ plain form
11777 23421 82023 70673 22034 7477 -6870 45871 41122 39287 61617 83301 80204 78975
11765 78975 49754 -22099 43850 156260 169026 92367 61645 64733 11145 10311 11167 -19800
11753 -19800 -65243 -111326 -106193 -57848 -31772 -54242 -3262 4585 -20164 23112 85633 68054
11741 68054 82190 66833 63875 68613 46075 31499 32450 9191 31622 51658 5230 -34796
11729 -34796 -60524 -60873 -48900 -77528 -106371 -178501 -160789 -91513 -96830 -137004 -95869 -71007
11717 -71007 -96258 -133740 -131994 -118843 -59166 -35080 10050 65266 99108 74093 30990 7405
11705 7405 -6528 -61269 -462 64357 58396 53680 63723 3949 -44668 -4833 -39193 -84527
11693 -84527 -132512 -82860 -39147 -55972 -61049 -61989 -29126 2788 13750 34547 83839 77586
11681G7586m1723j31009q0143J1071R1156L2882k167K3628J8208K6601l295m683
11669A8112k5013j5293J6346l9826k9842P079K8435Q023k1149o192k7564M185
11657h2699O4994J256l4482J4492P467M2561O413j937k7524n5173K3171O8743
11645B7282j6211k7561M460n4340m8165J5726J6570O4552K4956O851k6868L0148
11633A7400j3343n532M6259m5074j8234K2675K2489J2943k9599l4281o257O5250
11621C4696O8032m6342k2883q386q458J3385l6227q6610M773M6967N1520l5531
11609b5064l8321k909J1964K5095m90K5607K7937N043J4153r71N4115l8453o6583
11596h877l26k9083q363q2M7238K7723L2005k3201j4737K6266l6989k6296M979
$$ plain form
11681 77586 35863 -95146 -175289 -164218 -73062 -40180 -42347 -18719 -511 26090 22795 18112
11669 18112 -6901 -22194 -5848 -45674 -75516 -68437 -40002 -31979 -53128 -59320 -86884 -82699
11657 -82699 -17705 -16449 -50931 -36439 -28972 13589 20002 18065 -9459 -64632 -41461 27282
11645 27282 11071 -16490 -12030 -66370 -114535 -98809 -82239 -17687 7269 14120 -12748 17400
11633 17400 4057 -1475 44784 -290 -18524 4151 26640 39583 9984 -24297 -30554 34696
11621 34696 102728 56386 33503 25117 16659 30044 -6183 -92793 -88020 -41053 10467 -25064
11609 -25064 -63385 -66294 -54330 -29235 -29725 -4118 23819 28862 43015 42044 96159 57706 -8877
11596 -8877 -9203 -38286 -46649 -46731 507 28230 60235 37034 22297 48563 11574 -14722 -9743
11583i743J9649K5791N923l846m1649m5898L223P82q504r611L6035K1847J1676
11570E675k3656k3225L0963o496j9536N252j166K0594M258m6697p642K1901J7631
11557b2144Q637K0921M8638j7477n7967K8231Q152K5555k1517l5564q571K5237
11545B131M4684K5530j2072l9728k9328o940k9012l3378J1410K8387l5223L3760
11533c9779O4182Q162j5481M387J050o7437P225l6788j5347L9569j6269k1574
11521h8100k3834J7625M5442o930O9984K7486k9138m5317K3409J3148l7425J5227
11509a8423M49k1395l6293j0555M1884J1718q52j3865j6810M2246J13738o481
11497H5361n7699m0282M000l9774k9716P3563L5474j0980L3002J512n6662l891
$$ plain form
11583 -9743 9906 35697 41620 37774 -3875 -49773 -46550 -45768 -54272 -63883 -27848 -6001 5675
11570 5675 -17981 -41206 -10243 -16739 -36275 -31023 -32189 -11595 -7337 -54034 -61676 -39775 -22144
11557 -22144 -13507 7414 56052 38575 -19392 8839 16991 42546 21029 -14535 -23106 2131
11545 2131 46815 72345 60273 20545 -8783 -15723 -44735 -78113 -66703 -38316 -73539 -39779
11533 -39779 24403 32565 17084 21471 22521 -44916 -37691 -74479 -89826 -50257 -66526 -88100
11521 -88100 -111934 -94309 -48867 -55797 14187 41673 12535 -32782 -9373 3775 -33650 -18423
11509 -18423 -17974 -39369 -75662 -86217 -44333 -32615 -33467 -47332 -64142 -21896 91842 85361
11497 85361 27662 -12620 -8620 -48394 -78110 -4547 30927 19947 52949 54461 -2201 -6092
11485f092J8164j5292n6884K754o546K4198M388j4550J1313O2636N6486j1599
11473F8976n5818k0836K5256L5577k6731k3765j6949k6304K9788j2746j7206j4452
11461e5210J1019p984k8613L9904K7833k4449l0619K8762K4801J3744L882n6174
11449e3104N2214K7319m9651m9493Q652O5704Q5078j8003k6018k0528l8461j0437
11437b6728L4879L0621l262L073j7696k412O7666q1741l0934P4988j8447j0784
11425A9223k4834l7334k970L854j6017q184L2355M7901o107j5413l6581K0614
11413b3493L757M4131L5665r583l5054k476m445J2036k4337j0364K8285j9363
11401e241r903K508J974K5008m3969k0767L4413l3829k6268O38j6467l0408J3535
$$ plain form
11485 -6092 12072 -3220 -60104 -57350 -63896 -39698 -35310 -49860 -38547 24089 80575 68976
11473 68976 13158 -7678 17578 53155 26424 2659 -14290 -40594 -10806 -23552 -40758 -55210
11461 -55210 -44191 -52175 -80788 -40884 -13051 -37500 -68119 -39357 -14556 -812 3070 -53104
11449 -53104 -890 26429 -23222 -72715 -64063 1641 86719 68716 42698 22170 -16291 -26728
11437 -26728 8151 38772 35510 38583 20887 18475 86141 4400 -26534 48454 30007 19223
11425 19223 -5611 -42945 -45915 -42061 -58078 -66262 -33907 13994 7887 -7526 -44107 -23493
11413 -23493 -19736 24395 60060 50477 15423 12947 8502 20538 -3799 -14163 14122 -5241
11401 -5241 -15144 -12636 -10662 14346 -29623 -50390 -15977 -49806 -76074 -75436 -91903 -122311 -108776
11388a08776l8046K5499L4913J4798M8525j684q2254o365N2744K1739J752N6195
11376A9040l0465P938N4783j5948n5394m6787j6336N1087K4462J4857k8835q192
11364b9790j2056m3371M681M9540J6530J7480m5314j3025L508k6821L1587j6400
11352f3451m0296J5369K9162P304J017j9548l0878j5206M0488R0524J6779r744
11340B1520m2453O2198P1788m6555l6811q3995o1972K0593M5726P7957M2720J0237
11328H0953k332n7586l8767J9344K0191m9372j5915J5806m1400M5320j1952L0370
11316e340L4858l0796o228J01854J7193m9786l4079K1961J5357j9139n7101k4212
11304c5458j1753j7593P2231L4243o2685m4255L8933N793m0117l709r347L8866
$$ plain form
11388 -108776 -146822 -121323 -86410 -71612 -23087 -24771 -107025 -113390 -60646 -38907 -37155 19040
11376 19040 -11425 -3487 51296 35348 -20046 -66833 -83169 -32082 -7620 7237 -21598 -29790
11364 -29790 -41846 -85217 -80536 -30996 -14466 3014 -42300 -55325 -51817 -78638 -47051 -63451
11352 -63451 -103747 -88378 -59216 -51912 -50895 -70443 -101321 -116527 -76039 14485 31264 21520
11340 21520 -20933 41265 113053 66498 29687 -54308 -116280 -95687 -49961 27996 70716 80953
11328 80953 78621 21035 -17732 1612 21803 -27569 -43484 -27678 -69078 -23758 -35710 -5340
11316 -5340 29518 -1278 -7506 94348 111541 61755 27676 49637 64994 45855 -11246 -35458
11304 -35458 -47211 -64804 7427 41670 -21015 -65270 -26337 -20544 -60661 -64370 -73717 -34851
11292c4851k6497j8270O8795N699J208j6537k4819N3456J9828p7967M8346Q150
11280F541o9943L7034N7597J6616L7550N29m5623n2861k8928J8660P2654J4272
11268F4098q5739l5687K135n859l0636K2282L3647L761K3603M2732m5721j8795
11256c0179j0296l4479K3124L41k3885M0694L9507m270k6424O379Q179o126l1056
11243d8491K7228n2852K5658K2776J3686l0532K3391k0437M9017O3777o2722o2193
11231e1694K2138L7330J5248K3979K1834o8565k3101O3955M2891l2824j3691l4498
11219C002j3281l48l669P501m3806o1776j7013p676M3828N9402q124p6538O399
11206a12099M5093J2561k8126j8209M4766P1044M3881k7737o3059K529j6526l2469
$$ plain form
11292 -34851 -61348 -79618 -10823 -5124 -3916 -20453 -45272 8184 28012 -49955 -1609 6541
11280 6541 -63402 -26368 31229 47845 85395 85924 40301 -12560 -41488 -22828 49826 64098
11268 64098 -21641 -57328 -55193 -61052 -91688 -69406 -35759 -31998 -8395 34337 -11384 -30179
11256 -30179 -40475 -74954 -51830 -51489 -75374 -34680 4827 557 -25867 -19488 -11309 -17435 -48491
11243 -48491 -21263 -74115 -48457 -25681 -11995 -42527 -19136 -39573 9444 73221 10499 -51694
11231 -51694 -29556 7774 23022 47001 68835 270 -22831 41124 84015 51191 37500 3002
11219 3002 -10279 -10627 -14296 -6795 -50601 -112377 -129390 -137066 -93238 -33836 -41960 -118498 -112099
11206 -112099 -67006 -54445 -82571 -100780 -56014 15030 58911 31174 -31885 -29356 -45882 -78351
11194g8351K0316P9691j363K150m4646K9162k413m0779K7608M2686o2324p9817
11182a08080P490L4833J297K0713N1607n5171q4093K8554L6477Q3128L3770j7933
11170C2592L3516k0172n4176p2221j194L5250K692l5799J4595J1510K7583j6003
11158d1827j6370J5344m1108k3663J5028j4884K1528j6522N9613O6337L4965J1825
11146G0266l8164M817k4977k280l147l7511m215R6261K1398m6223l8980k7934
11134c0689J447K6701O1879j541p9985j6497O0876n518o8578P489P8885O9478
11122A03947R563p2544j6088n3847k1867J2460J5843O9496O2450p8044l8125K3583
11110A6827m1211q873J7096M0354o1033o2442M7463P8266L4997l8370o6238m785
$$ plain form
11194 -78351 -58035 21656 20293 22443 -22203 6959 4546 -36233 -8625 34061 -28263 -108080
11182 -108080 -100590 -65757 -64460 -43747 7860 -47311 -131404 -102850 -66373 16755 50525 32592
11170 32592 66108 45936 -8240 -80461 -81655 -46405 -43713 -79512 -64917 -53407 -25824 -41827
11158 -41827 -58197 -42853 -83961 -107624 -92596 -107480 -85952 -102474 -42861 23476 58441 70266
11146 70266 32102 36919 11942 9662 6515 -30996 -35211 61050 82448 36225 -2755 -30689
11134 -30689 -29242 -2541 59338 57797 -22188 -38685 22191 16673 -51905 -44416 34469 103947
11122 103947 113510 40966 24878 -28969 -50836 -38376 -22533 46963 109413 31369 -6756 16827
11110 16827 -24384 -33257 -16161 24193 -36840 -99282 -51819 26447 61444 23074 -43164 -47949
11098d7949K5506J6049l5651k6630j1692k3107K5910P3134N3081k4633j9435J4004
11086A8587L4408L5500n2400r485k4090m3849l850l009j6241k3207L3297m258
11074e8597J5830K9999m6629J6315N151J0934K4727M1211L5622k6601j7447r593
11062B0922q242l7835L5570J4158j6322j7218q72o2k2970J992j5228m6283K2120
11049g0270J4712j0213O222o782j9392N297j107N5944R386L0772j3564m4992J6362
11036b7625M0289M8059r387j0316m459L521j0105J8368r577j13587j7204M8375
11024d3648K4594j201n7446l3004K892Q4466L0047m9079p832K7741M1762M9965
11012F9257l1560l2387m8072L4145L1377L493j3176m339k7408L0370M4988m3647
$$ plain form
11098 -47949 -22443 -6394 -42045 -68675 -80367 -103474 -77564 -4430 48651 24018 4583 18587
11086 18587 52995 88495 36095 26610 2520 -41329 -45179 -48188 -64429 -87636 -54339 -58597
11074 -58597 -42767 -12768 -59397 -43082 -37931 -26997 -2270 38941 74563 47962 30515 20922
11062 20922 12680 -25155 10415 24573 8251 -8967 -9839 -9901 -32871 -30879 -46107 -92390 -70270
11049 -70270 -55558 -65771 -59549 -66331 -85723 -80426 -81533 -25589 -16203 14569 1005 -43987 -27625
11036 -27625 12664 60723 51336 41020 36561 40082 29977 48345 38768 -74819 -92023 -43648
11024 -43648 -19054 -20255 -77701 -110705 -107813 -23347 6700 -42379 -50211 -22470 19292 69257
11012 69257 37697 5310 -42762 -8617 22760 26253 13077 8738 -18670 11700 56688 13041
11000A3041m4548K8336o760J298J6246L1010N1233J1598n7676j6823K7404l3001
10988B1358O868j1251R262r798l77N2740n4354m2274m8052j1427J259J7215J6692
10975e2139k5486k5374r369Q028L2782K9183N8707m533l5543o353O671J7263R235
10962C072N0127L9779k2130j9643l6048n1812n8404o6848l7338M9732K8476J6347
10950a04690N2527J0240L985j5751J8205M617l46M6370Q147n356n0238K086M4356
10937A4152M5102K1361J1175q849m4317p4674l5200L8514K4494J861K2929J8974
10925C5522J22O0807P1892j2407k2740j7636r73l3425j6988N173J981j5186l1931
10912B4211k7580L4460k0998n5137m0576j4515O81K7612n350M7762M4618K3800
$$ plain form
11000 13041 -31507 -3171 -9931 -8633 7613 38623 89856 101454 43778 26955 54359 21358
10988 21358 28226 16975 26237 16439 16062 68802 14448 -27826 -75878 -87305 -86046 -68831 -52139
10975 -52139 -77625 -102999 -112368 -104340 -71558 -42375 16332 11799 -23744 -30097 -23426 -6163 3072
10962 3072 53199 92978 70848 51205 15157 -36655 -95059 -161907 -199245 -149513 -121037 -104690
10950 -104690 -52163 -41923 -37938 -53689 -35484 -30867 -31213 15157 23304 17948 -32290 -30204 14152
10937 14152 59254 80615 91790 82941 38624 -36050 -71250 -32736 -8242 -6381 16548 35522
10925 35522 35644 96451 168343 155936 133196 115560 114587 81162 64174 69347 71328 56142 24211
10912 24211 -3369 31091 10093 -45044 -85620 -100135 -99454 -71842 -77192 -29430 15188 38988
10900C8988K4259j7801L26l7732l3099N6097O2999J526k9930J7807m672l957l5914
10887C8897r902j0948j2828K2491K9434J7235M94j851l2194l8118j4332l4772
10875d6394J8043J7107n8960l438M26j9371K1381O8557k812j1565J021l729J6427
10862c307l4296l1769M940J5169M8157M4876Q361O142J081l5624m9999o191q933
10849d1393l2342k0045P3922K1289o1566k2769N2158P762k6675j5100K1282P1691
10837B8214j7012n2065L2119P3377o943l0990J2508M5891r117k6098K0823k4719
10825D5988n5232q8126l5787n393R705q115m2381M5015J10212K8383j9911n1288
10813f6930J5148K126K3241M673m8652K4891L029L1020J04457N955m2639n3449
$$ plain form
10900 38988 63247 45446 45772 8040 -25059 31038 94037 95563 65633 83440 78768 74811 38897
10887 38897 28995 18047 5219 27710 57144 74379 74873 73022 40828 2710 -11622 -46394
10875 -46394 -28351 -11244 -70204 -73642 -73216 -92587 -71206 -2649 -5461 -17026 -16005 -19734 -3307
10862 -3307 -37603 -69372 -64432 -49263 -1106 43770 52131 58273 59354 23730 -26269 -32460 -41393
10849 -41393 -73735 -93780 -19858 1431 -60135 -82904 -30746 -22984 -49659 -64759 -43477 28214
10837 28214 11202 -40863 -8744 64633 57690 26700 39208 85099 75982 49884 70707 45988
10825 45988 -9244 -97370 -133157 -138550 -128845 -136960 -179341 -134326 -24114 4269 -15642 -66930
10813 -66930 -51782 -49656 -26415 -21742 -70394 -45503 -42474 -11454 93003 98958 56319 2870
10801B870j0358o3664n7507k6231k2499O2393L9571J5299J9114M0036J2095l8243
10789b7124J1837L8250j6594K1882j8609o0188k4822N255M1471L9630O4927M9272
10777A25187l5077p2184j7478r7499j0565O1174l529K9901K0569l1469o5773j5901
10765a12644K9976L0650J2195N219l6707J188Q5520j6411j4570k7724m3776L4990
10753e2094N1194K2547L472o9742j7011L885J0977M8162L4673k9687m4527l1724
10741f9875n1449L9735L0636n8265J0067O4531l9352m6585K2012N6268K2875L8061
10729A8659L7878l3604l1684L3673K6307M0432J0431m6498l7539L854l3893l6588
10717d8572L7024M7198M870J538M7263M819R870j6639l47j19909j8967K1031k3618
$$ plain form
10801 2870 -7488 -71152 -128659 -154890 -177389 -114996 -75425 -60126 -41012 -976 11119 -27124
10789 -27124 -15287 22963 6369 28251 9642 -50546 -75368 -70113 -28642 10988 75915 125187
10777 125187 90110 17926 448 -97051 -107616 -46442 -49971 -20070 499 -30970 -96743 -112644
10765 -112644 -82668 -52018 -39823 -34604 -71311 -70123 15397 -1014 -15584 -43308 -87084 -52094
10753 -52094 -900 21647 25119 -44623 -61634 -57749 -46772 1390 36063 6376 -38151 -69875
10741 -69875 -121324 -81589 -50953 -109218 -99151 -34620 -73972 -120557 -98545 -42277 -19402 18659
10729 18659 56537 22933 -8751 24922 51229 91661 102092 55594 18055 21909 -11984 -48572
10717 -48572 -11548 35650 40520 42058 89321 94140 104010 87371 87024 -32885 -51852 -30821 -54439
10704e4439j5483K2717l5084j0817N0171M7718r0124m2022N1024M0805L4959M4052
10692D3477J6374n3559k4033l3883k8736j5302J9341M1244L2580J7709L0187k5047
10680B0352j057M4239L9324J5131l1075m1552l1830j4674J7826k0635m4519j9404
10668f7874J2870l215J6380j8855q828P265p702o659J0036K5703K0820N0635L079
10655C3655r267l073L3561M6604j8960l747k1087q2219m6187K5096M8362p844
10643e106j599L5292K2624o2567k3669M1991L7001k5816m1998M1245M1446j1409
10631D7435l8919j476j9003M806P405M2215k5297o0339Q559m611r75Q536P7232
10618D5568K3215R349m1873j6624j5529j2527k6195m9685k1194M592k8349L2892
$$ plain form
10704 -54439 -69922 -47205 -82289 -93106 -42935 4783 -85341 -127363 -76339 -35534 -575 43477
10692 43477 59851 6292 -17741 -51624 -80360 -95662 -76321 -35077 -2497 15212 45399 20352
10680 20352 19295 63534 102858 117989 86914 45362 13532 -1142 16684 -3951 -48470 -67874
10668 -67874 -55004 -58219 -41839 -60694 -69522 -62257 -69959 -76618 -66582 -40879 -20059 30576 33655
10655 33655 24388 21315 54876 101480 82520 78773 57686 -24533 -70720 -45624 2738 -5106
10643 -5106 -6705 28587 51211 -11356 -35025 6966 43967 18151 -23847 17398 58844 47435
10631 47435 8516 7040 -11963 -7157 248 42463 17166 -43173 -34614 -39225 -40200 -31664 45568
10618 45568 68783 78132 36259 19635 4106 -8421 -34616 -84301 -105495 -100903 -129252 -96360
10606i6360L9869P0293P2072k0220o2882p438q3170m6090P1053J2982k2808j3518
10594h6217J00373M9092k7629k8600n418m9513J3445R252K4213K1612J9597j1125
10582B9082o1934K706M7140J9178k8473k2629J3098J7369l6375l2680L189l6096
10570h6425L193M0510L7890L7474J0095o4887m7061J1816N847P5250m1352o2079
10558g9729J7253P588N3512L0331n747J3438L0102L7641r401j8829l7443o1229
10546b2513p139k6206k0248r310o463l2981J146O9480M6582R607J1450l8178l8600
10533f3373p1414P009K9507M9959P7143R526K432p194K5346J5366N452q0381k7309
10520b7931l2871J515p741O7668k7107l3266K7331k6952k3073j7069M3698N7202
$$ plain form
10606 -96360 -56491 13802 85874 65654 2772 -4666 -87836 -133926 -62873 -49891 -72699 -86217
10594 -86217 14156 63248 35619 7019 1601 -47912 -34467 -25215 -1002 20610 40207 29082
10582 29082 -32852 -30146 16994 36172 7699 -14930 -1832 15537 -20838 -53518 -50329 -86425
10570 -86425 -83232 -42722 -4832 32642 42737 -22150 -69211 -57395 -51548 23702 -17650 -79729
10558 -79729 -62476 -54888 -1376 28955 23208 36646 66748 104389 94988 76159 38716 -22513
10546 -22513 -29652 -55858 -76106 -85416 -91879 -124860 -123714 -54234 -7652 1955 13405 -24773 -63373
10533 -63373 -134787 -127778 -98271 -48312 28831 38357 40789 33595 58941 74307 79759 -622 -27931
10520 -27931 -60802 -59287 -67028 640 -26467 -59733 -32402 -59354 -82427 -99496 -55798 1404
10508A404J4496N8136K6955k1379r729o861P0150J8566m4974n0811Q740l5595
10496B9098n7972k3753J7211n386M2445P3114R512M6533j01308j15806J8443P1771
10484C902j262J2939k5791o1395R000L990k2016K9880M1364L3998J7018l4220
10472G407j6106L409L1228j6811J2172P15j7742n3655O0554N4677L8410n4099
10460E0159m2731O9049K67o5670k7719P1289J8164J0258j6610q602M8571k7950
10448G8475J0956l9282m7749j4569K5710K1222m9622m3439j7343M2883L9289m737
10436A794l0652j0855J3728M984N6205k2446N431J4789p126L611o735j2986l4350
10423b4608j9863N3002p305k7953j6296K1089K424M1826r245q4315o3472L0601
$$ plain form
10508 1404 15900 74036 100991 79612 69883 63022 133172 151738 106764 55953 64693 29098
10496 29098 -28874 -52627 -35416 -40802 1643 74757 84269 130802 29494 -86312 -67869 3902
10484 3902 2640 15579 -10212 -71607 -62607 -58617 -80633 -50753 -9389 24609 41627 7407
10472 7407 -8699 -5290 25938 9127 21299 22014 4272 -49383 11171 65848 104258 50159
10460 50159 7428 76477 76744 11074 -16645 54644 72808 83066 66456 57854 106425 78475
10448 78475 89431 50149 2400 -12169 13541 34763 -14859 -58298 -75641 -32758 6531 1794
10436 1794 -28858 -39713 -25985 -21001 35204 12758 18189 32978 25852 29463 22728 9742 -24608
10423 -24608 -44471 8531 1226 -26727 -43023 -21934 -19510 22316 13071 -71244 -134716 -104115
10411a04115P7680K1518M872n7707m1844L5079J9620R743l9480j0203K1675L8873
10399b4289N313N0726L3942J8329K1803q4417l6169k8537o8200j2723o731L9846
10387i1107M4896M4251L0728L0469K6940k7822o8669l4624K2434Q240J5726K9414
10375C0876L3227j5784L0011J1559l6755p1546o2407M6747K7526p477J715k2879
10363c5187J3121Q9473P3575n000o9446q2028J1295L6696P3926L4459O9703O177
10351B16764N1819J43735J89781J63347J83776K20797K00502J79308J41491J11749
10341A803069k4617p7802j19337j56458k53247k47940k03506j36131j52361j01573
10331C30097j33798j395M272j2784K7484k1111K531o1290l1637r533l2163j4856
$$ plain form
10411 -104115 -26435 -4917 -45 -57752 -99596 -64517 -44897 -35154 -74634 -84837 -63162 -24289
10399 -24289 -18976 31750 65692 84021 105824 21407 -14762 -43299 -111499 -124222 -130953 -91107
10387 -91107 -46211 -1960 28768 59237 86177 58355 -10314 -44938 -22504 -14264 1462 30876
10375 30876 64103 48319 78330 89889 53134 -18412 -80819 -34072 -6546 -14023 -12308 -35187
10363 -35187 -22066 67407 140982 135982 66536 -15492 -4197 32499 106425 140884 210587 216764
10351 216764 268583 412318 602099 765446 949222 1170019 1370521 1549829 1691320 1803069
10341 1803069 1778452 1700650 1581313 1424855 1171608 923668 720162 584031 431670 330097
10331 330097 196299 194904 199176 186392 213876 192765 195296 134006 102369 92836 60673 45817
10319D5817J6117m9071j5462N614J672K2348P684k1998P152Q769L8763K7173k8064
10306F6514k5300n405j344N3800k1791j0898o8792o0533M9934M6880l169M5597
10294F5493L6326o252j6526P7913L3376m7575j4422j9242l0352l6003m552k0956
10282A7228K5509M9426K477N4714j6216m5500K618L9389l5663k1147J3961n2029
10270C4767L8942L1621n4702k4604j2377k3672r948N364l5219O587K5742L9202
10258B1703k1586k4424O2106K050r925J5596K6679K7485k5387o6562l8460o426
10246c7151j9341N5546P9255m0647r017J6080n412m0284L8978j4327O206j8212
10234A1674M8918M877M47j9280l8840p8515M8595J5837l8224r986J3530j740J1328
$$ plain form
10319 45817 61934 12863 -2599 3015 4687 27035 34719 12721 19873 28642 67405 94578 66514
10306 66514 41214 35809 34465 88265 66474 55576 -13216 -73749 -23815 23065 19896 65493
10294 65493 101819 95567 79041 156954 190330 142755 128333 109091 78739 42736 38184 17228
10282 17228 42737 92163 94640 149354 133138 87638 90256 129645 93982 72835 86796 34767
10270 34767 73709 105330 50628 26024 13647 -10025 -19973 -14609 -49828 -43241 -17499 21703
10258 21703 117 -24307 37799 39849 29924 45520 72199 99684 74297 7735 -30725 -37151
10246 -37151 -56492 -946 78309 37662 28645 44725 39313 -971 38007 23680 29886 11674
10234 11674 60592 65469 65916 46636 7796 -70719 -22124 -6287 -44511 -54497 -40967 -42707 -31379
10221c1379L430J0972K7770L6751l7273l1505k7738m4535r51K5274J4485J5467
10209c9232N3216L2846L1707m9078q6855L1061j7005k6460l2832M7465L6999K059
10197a6109K4735m2046j7120J5325M0601L3654N6108k9103n7199o0923J6682q317
10185d3712J3942K6126j804L883o450P844M589k3746l8138j2863L1575L0087J7032
10172H365J928L184l228l5499n8902L1777N0561L3168l6851m2715K2283J0954
10160a4975j8004j4827M4068k9396p7301o49M6899N4424p511j2516K9732J137
10148A081j7850K9583J9848J8910K624j1184k4701K5115M4194K814n0056m8313
10136g935k285J4516L7562n987K5311j3008k1648m6557J619p315K4818j1669r082
$$ plain form
10221 -31379 -27949 -16977 10793 47544 10271 -21234 -48972 -93507 -94458 -69184 -54699 -39232
10209 -39232 13984 46830 78537 29459 -57396 -26335 -43340 -69800 -102632 -55167 -18168 -16109
10197 -16109 8626 -33420 -50540 -35215 5386 39040 95148 66045 8846 -52077 -35395 -43712
10185 -43712 -29770 -3644 -5448 -1565 -8015 -171 4418 -19328 -57466 -70329 -38754 -8667 8365
10172 8365 10293 13477 10249 -25250 -84152 -52375 -1814 31354 -5497 -48212 -25929 -14975
10160 -14975 -32979 -47806 -3738 -33134 -110435 -111084 -64185 -9761 -17272 -29788 -56 1081
10148 1081 -16769 12814 32662 51572 54196 43012 18311 43426 87620 90434 40378 -7935
10136 -7935 -10220 4296 41858 35871 61182 48174 26526 -20031 -18412 -25727 -909 -12578 -21660
10123b1660J3092L0168m311j9632j254k5627O5346L0992J4637m7163M6505j0792
10111G0301k6919J5738R327o7615q461L2776J6085k6079L7230N4924j8814k1499
10099F6994l2003q4336l1339L6011J26644r801P560k273k1208q8740n8445j277
10087i2213O3336m883J5904k120j1714j0092j9284o510K1727O8347J2639J1825
10075D6962n7901n4668L658M4983J6099k9926Q37K5280N5269M2634K0571k7838
10063H5960n7003k8585p570m007j0001j3208J0351Q0135K1834l8861k0717m4685
10051b6357o4878k1474J9923R7812j5966M893P470n0434J1448K9172M4817j49
10039C6277l3765L5041k9045Q134K193K1239K549J5314j8768J0981O1055J2413
$$ plain form
10123 -21660 -8568 21600 17289 -2343 -3597 -29224 36122 67114 81751 34588 81093 70301
10111 70301 43382 59120 68447 832 -7629 25147 41232 15153 52383 107307 88493 66994
10099 66994 34991 -49345 -80684 -44673 81971 72170 79730 77457 56249 -32491 -90936 -92213
10087 -92213 -28877 -33760 -17856 -19976 -31690 -41782 -61066 -67576 -45849 22498 35137 46962
10075 46962 -10939 -65607 -61949 -16966 -867 -30793 -29956 -4676 50593 93227 113798 85960
10063 85960 28957 372 -7198 -11205 -21206 -34414 -24063 56072 77906 39045 18328 -26357
10051 -26357 -91235 -112709 -92786 5026 -10940 -6047 1423 -49011 -37563 -8391 36426 36277
10039 36277 2512 37553 8508 16642 18835 40074 42623 57937 39169 50150 111205 123618
10027A23618o8897q7194M899N402k3990R837M091M3065J0695L0724o422O083j550
10014E0361l1052j8414n5488j763K5509J7733J0742N2059m822l4493P3481J6731
10002A00584K7441M1173M0112j2312p0632j7889P6172O0867J43565K50434L65885
9991A005400M80553N03673L34077m7995l53844m85639m66786l33059j67195j35847
9981C33338p1628r7021n5702J7621L3219J4093N691j8528n5041p1064L7433l8322
9969C4089p6709J0159K6349j822j5129L9672P9106J7460l2228k6070l5135Q608
9957B8350o861K3976N662L6355R88m3915m0530j2849l6558k2420N1488M8654J8654
9944E0994l9332M9039N0694n9726J245K7752q048k0946J6391J5352j4510j4124
$$ plain form
10027 123618 54721 -32473 -27574 -22172 -46162 -36325 -32234 10831 21526 52250 45828 51911 50361
10014 50361 19309 895 -54593 -56356 -30847 -13114 -2372 49687 44865 10372 83853 100584
10002 100584 128025 169198 209310 196998 126366 108477 184649 245516 389081 639515 1005400
9991 1005400 1485953 1989626 2323703 2275708 1921864 1436225 969439 636380 469185 333338
9981 333338 261710 164689 108987 126608 159827 173920 179611 161083 106042 34978 72411 34089
9969 34089 -42620 -32461 -6112 -7934 -23063 16609 95715 113175 80947 54877 19742 28350
9957 28350 21489 45465 51127 87482 88470 44555 4025 -8824 -45382 -67802 -16314 32340 50994
9944 50994 11662 60701 111395 51669 52914 80666 72618 51672 68063 83415 68905 54781
9932E4781q939L5961J9158l6277j1353M8818p4200p0300j0658J6487n528N6715
9920A4665K4992j2103j9971P354O2589J6274n0283m4227k2133K7204j2476n0761
9908e8876k8389J9389N0600L7683j8654K1882n096J466Q3565K4825m0568o2943
9896B4884j7911K0342m823m035R340m7839k4982m4371k1588m0419k078K5066m162
9883a32576M4574L9336K4918o1629r382K0168L017Q9619J9887p604N64k9711L1750
9870C2931k9779M4414L626J5473k3896k8637M1938k4940L3956P25K0571m4184
9858D2198n8737j7376M5268P597N6288L1985n8820j7244O199j8949m847M5565
9846E9127L4902j446j3618o0504m3393j6122P019J2996L1089L99k8685Q548M0282
$$ plain form
9932 54781 45842 81803 100961 64684 53331 102149 27949 -42351 -53009 -36522 -42050 14665
9920 14665 39657 27554 7583 14937 77526 93800 43517 -710 -22843 4361 -8115 -58876
9908 -58876 -87265 -67876 -17276 20407 1753 23635 18539 20005 103570 128395 87827 24884
9896 24884 6973 27315 22492 18457 27797 -20042 -45024 -89395 -110983 -151402 -153480 -128414 -132576
9883 -132576 -88002 -48666 -23748 -85377 -94759 -74591 -71574 18045 37932 30328 30892 1181 32931
9870 32931 3152 47566 51192 66665 42769 14132 56070 31130 65086 65811 86382 42198
9858 42198 -16539 -33915 11353 18950 75238 107223 48403 31159 37358 18409 13562 59127
9846 59127 94029 92583 78965 18461 -24932 -41054 -34035 -21039 10050 10449 -18236 -9688 30594
9833C0594k7636J2054m3903o2791L6791Q0471L4576J8138m7864j4955r4802L642
9821g5685N6486K8220M5674n4794j6919M8404K5261o135J2350l0597k3471k0105
9809a1311J1906K2175l2875l360M6939L3311k0796p5258k5692j2737Q786O9221
9797A0309M9280k4960O0194k5616J415M0007n5693l0626j777m1083j20926n976
9785a45452K7599m0144L0656M5860N1619M5277K2632k525K8140k4694p484j0611
9773B0873k3014M0582l6649o9363l7140J9666L9199K7407Q2200M2977l97p2385
9761C3956K7216K1277l5902n3865K5672j6565K4264J4456J5093j431l9765J7622
9749C2028j6076j6270k6604j0230J10791J7571r2169l2988J877K7832K3012M2150
$$ plain form
9833 30594 2958 15012 -28891 -91682 -54891 25580 60156 78294 30430 15475 -79327 -75685
9821 -75685 -19199 9021 54695 -99 -17018 31386 56647 50512 62862 32265 8794 -11311
9809 -11311 595 22770 -10105 -13465 33474 66785 45989 -29269 -54961 -67698 -58912 10309
9797 10309 59589 34629 94823 69207 70622 110629 54936 24310 22533 -18550 -139476 -145452
9785 -145452 -117853 -157997 -127341 -81481 -29862 15415 38047 35522 63662 38968 31484 20873
9773 20873 -2141 38441 1792 -67571 -104711 -85045 -45846 -18439 63761 106738 106341 33956
9761 33956 61172 82449 46547 -7318 18354 1789 26053 40509 55602 54171 14406 32028
9749 32028 15952 -318 -26922 -37152 73639 91210 -959 -33947 -32070 -4238 18774 60924
9737F0924L7744p8629p2767m5611N459J870K2031Q4871M9185l7361R77P4047j3457
9724H9283l1580O303l208p1578l619K5580K0022p031l8558q22j1715j2716L6020
9711c619R8764O2576j2701q8656q5771N814L2482p860N426k20l0417L7668O2164
9698G5650l1541K7770N7882j4562o3271k3187J8444L0515K3283k610n6314O174
9686D8233J053j5116K1350j6092L065k5606j9771m2542J14477L0868k5651n2099
9674B2169J2108o7q652L834M0266J4156K8143J5022k7976o6223K47M1354p6213
9661a832q671L9533k7038K530q50J1123k555j6219j7336J9298J6049J6203Q304
9648C8539L398J2244j6544l8090J4761P5567J5529j05043K9638K460J1843k3689
$$ plain form
9737 60924 98668 20039 -52728 -98339 -92880 -91010 -68979 15892 65077 27716 28693 102740 89283
9724 89283 57703 64006 60798 -10780 -14399 11181 31203 24172 -14386 -15208 -26923 -39639 -3619
9711 -3619 95145 157721 145020 56364 -29407 -23593 8889 1029 6455 6235 -24182 13486 75650
9698 75650 44109 71879 129761 115199 51928 28741 47185 77700 100983 98373 42059 48233
9686 48233 49286 34170 55520 39428 42493 16887 -2884 -45426 69051 99919 74268 22169
9674 22169 34277 34210 25558 29392 69658 83814 111957 126979 99003 32780 33027 74381 -1832
9661 -1832 -10503 29030 1992 4522 3672 14795 12240 -3979 -21315 -2017 14032 30235 38539
9648 38539 41937 54181 37637 -453 14308 89875 105404 361 29999 32459 44302 20613
9636B0613M800k440Q055J6451K6894l408r524K8644K3964p1987l9611M6017L3723
9623H2191J1082o3960j9934k5774n1396n81j9332k4646O9636K7855J5730P0585
9611G1456J2941n361l0110j1064N3238J5440J4695P325m0728l5276m4766k7628
9599a9838K5563N0668J7238j3894j8470P059J5863k3230o97K4206L4801k2975
9587G6294n9741M5665P7862K1100J0461l8774n1434K0258k1979n4761n9885m1701
9575g6635M1853M7419L7623Q42J2749M976j3867K0469m7519P654j3685k0142p680
9562e943L8787O6609M6009n9711p3969M499L7034L4381M1435L1398l4603q4835
9550D1091j855J4440J9355K6818k0716l2739l778J3402o172m8556m535q133J4744
$$ plain form
9636 20613 25413 22973 31028 47479 74373 70965 61441 90085 114049 42062 2451 48468 82191
9623 82191 93273 29313 9379 -16395 -67791 -68372 -87704 -112350 -42714 -14859 871 71456
9611 71456 84397 79036 48926 37862 91100 106540 121235 128560 87832 52556 7790 -19838
9599 -19838 5725 56393 73631 59737 41267 48326 64189 40959 40262 64468 99269 76294
9587 76294 16553 62218 140080 161180 171641 132867 81433 101691 79712 24951 -34934 -76635
9575 -76635 -34782 12637 50260 51102 63851 68827 54960 75429 27910 35564 21879 1737 -5943
9562 -5943 32844 99453 145462 85751 11782 16281 53315 87696 129131 160529 125926 41091
9550 41091 39236 53676 73031 99849 79133 46394 42616 56018 49846 1290 -3245 -11378 3366
9537C366M6929L9271j2580n5990J1287K4673j1935p4772L6375N9754K1645o3141
9525B4882N891K4439K0981K9531o8415q8945l5199j942R073N7326L6470L2608
9513D6700j7592r849J4295M0635n799m3287J7251M1814l8957k2336k6426O8824
9501F5273m07k9136P445N749m6778R004M1409l6709J2760l8056J9532M7340j6376
9488D1050l2575N7546L159q4223K0968K3403p568J2343L1835K4834N169K978l4938
9475F3981k0734K2487K4329L2321m440l1102o271J4988K3147j2666j7133N672
9463I4579j8390J8142L904l0601n6752O395R152j4151O9561p1797j9504K6698
9451A7236k0485Q404L6974j4726N2921p880j2719N9224o9137p3856J7975L1960
$$ plain form
9537 3366 50295 89566 76986 20996 32283 56956 45021 -29751 6624 66378 88023 24882
9525 24882 30773 55212 76193 105724 37309 -51636 -86835 -88777 -79704 -22378 14092 46700
9513 46700 29108 19259 33554 74189 68390 25103 42354 84168 45211 22875 -3551 65273
9501 65273 64866 35730 43175 48924 2146 11150 52559 15850 28610 -9446 10086 57426 41050
9488 41050 8475 66021 69180 -15043 5925 29328 21760 34103 65938 90772 95941 98919 63981
9475 63981 43247 65734 90063 122384 117944 86842 80571 95559 118706 106040 88907 94579
9463 94579 76189 94331 98235 67634 10882 17277 26429 12278 81839 10042 -9462 17236
9451 17236 -3249 5155 42129 27403 80324 72444 59725 118949 49812 -24044 -6069 25891
9439B5891N5722N7208l1944p6841j7853k126O1493M912k4276L6285k8602K639
9427F2508K0014L28J4453J7269k2010m7417k3356O6531j2547l1500N6211m177
9415I6307n5965l4946L0140M2231k2018k8269K4391J1359K2290N533m0095K4393
9403G5351l240k0331j8621j4525P096M3963J4602K8861P139l2301o417n3654k7222
9390G01P44K4230Q757m5855K083M409M087J7547r122q174l3940q219K547K3582
9376a6623j0147J5407l1081N6000O7791l9207K39j1979R957k0889j199j7713J9445
9363B0001R1449K7564q3055q5635L5992M4600j3358J6718K8967O5947N641K332
9351A57163m3348l0523r127k4915K4990j7335K1930j6813j1426j3128L5280k3244
$$ plain form
9439 25891 81613 138821 106877 30036 12183 10057 71550 76462 52186 88471 59869 62508
9427 62508 82522 82850 97303 114572 92562 45145 21789 88320 75773 44273 100484 96307
9415 96307 40342 5396 35536 77767 55749 27480 51871 63230 85520 91053 50958 75351
9403 75351 72111 51780 33159 18634 25730 69693 84295 113156 120295 87994 81577 27923 701
9390 701 1445 25675 34432 -11423 -9340 -4931 -844 16703 7581 -593 -34533 -42752 -40205 -16623
9376 -16623 -26770 -11363 -42444 13556 81347 42140 42379 30400 40357 19468 18269 556 20001
9363 20001 111450 139014 55959 -29676 6316 50916 37558 54276 83243 149190 154831 157163
9351 157163 113815 83292 74165 49250 74240 56905 78835 62022 50596 37468 72748 49504
9339D9504p08P062k771j7165k2881M4191L3571o999m0173q71N0724M2769P5838
9326B12091j0529k6508K9311j5791l9193l8050K5131K7726r313L6784k6437l6783
9314A28439N3399K2908j3087M340n08k277K6035k3881l9399k2227K9534K3062
9302A86338j3416M1421L8664k929k4875k2927l135R683j9361j1079k2993M73N041
9289A60905j4091O955O227K1428J6630N268J3169J0982Q4084r381K5512m0605
9277B87083j5797o985J6862M5013M9566K9510n8915J8255M5528P8874J14002O631
9265F09627o2779k5592m145l5942M8238M865k8818k1538K1226J00972k8415k1705
9253E55994K225P2210J6849L2352O4863L778n2613j9084N193N1985P4616J16250
$$ plain form
9339 49504 48796 55858 53087 35922 13041 57232 90803 83804 43631 42760 93484 136253 212091
9326 212091 201562 175054 204365 188574 149381 111331 136462 164188 154875 191659 165222 128439
9314 128439 181838 204746 191659 195999 195491 193214 219249 195368 155969 133742 163276 186338
9302 186338 172922 214343 253007 250078 225203 202276 199141 208824 189463 178384 155391 155864 160905
9289 160905 146814 153769 159996 181424 198054 203322 216491 227473 311557 302176 327688 287083
9277 287083 271286 264301 281163 326176 375742 405252 346337 364592 410120 488994 602996 609627
9265 609627 546848 521256 517111 481169 529407 534272 505454 483916 505142 606114 577699 555994
9253 555994 558219 630429 647278 679630 744493 748271 695658 676574 681767 733752 808368 924618
9241I24618L8634K1690O6321L250q045N9622L438j2468N5655R0822J22174M7427
9229A413138Q6020J56689J09139R671J10702J12827J3146J59J15227K04525J14980
9218B446223R0925M3979J58347J57525P9381P9527J94355J31677J54428J12771
9208C649138R5175J28107J31054P9215k0509M1132Q0097J9155o9956o0650k8516
9197D043442l1535j10318n3668l9568n3511j31048j62886j09357j10077j64307
9187C077167j25716r9878q0003r3370q7560j47163j06057P167o0796q1537j41656
9176B060598j28835n8141m7975j9882j6172j23889j15949q6153j3510j1006n8977
9165A380109p6993n7743m8442o8987m2172O836P813o9574q6518j5180J6229j4384
$$ plain form
9241 924618 963252 984942 1051263 1054513 1046468 1106090 1109528 1097060 1152715 1243537 1365711 1413138
9229 1413138 1499158 1655847 1764986 1774657 1885359 1998186 2011332 2011491 2126718 2331243 2446223
9218 2446223 2537148 2581127 2739474 2896999 2976380 3055907 3250262 3381939 3536367 3649138
9208 3649138 3744313 3872420 4003474 4082689 4062180 4103312 4183409 4202564 4132608 4071958 4043442
9197 4043442 4011907 3901589 3847921 3808353 3754842 3623794 3460908 3351551 3241474 3077167
9187 3077167 2951451 2851573 2771570 2678200 2590640 2443477 2337420 2344587 2283791 2202254 2060598
9176 2060598 1931763 1873622 1825647 1805765 1789593 1665704 1549755 1463602 1450092 1439086 1380109
9165 1380109 1303116 1245373 1196931 1127944 1085772 1092608 1100421 1030847 944329 929149 945378 930994
9153I30994o2076m2842o273r65p4702R027K567j0598k8078j3432K3156L5751j0234
9140G52295k9065J8145n6297q1724o7264J4811k6569L4305j1007m3502p2597j1034
9128D20497N3625k0129l3215L2710J0957J930n748l1286j6644l8443n834k5816
9116C42604p4088o2618R971K4747M5690O2142P8131l813k7843n091J5052p34o4557
9103C39593n8087l8872l1345O3063O277j6983n1232l546K0399n046J3956k5747
9091B12430r7012k0731L991K8485O7346Q1635o2571r4295o339K9435k9498k9592
9079H3284Q0148K6112m160M0212K2362m402l0443R747K1686l8877l5927K2237
9067A91979L0510r24j8110J106K6051m5249r5999J5623N8307L571j5942J0479
$$ plain form
9153 930994 868918 826076 819803 818838 744136 753163 755730 745132 717054 703622 726778 762529 752295
9140 752295 723230 741375 685078 603354 536090 550901 524332 558637 547630 504128 431531 420497
9128 420497 474122 453993 420778 453488 464445 466375 460627 429341 412697 374254 368420 342604
9116 342604 268516 205898 215869 240616 286306 348448 426579 422766 394923 389832 404884 404150 339593
9103 339593 281506 242634 211289 274352 280629 263646 212414 208868 229267 224221 238177 212430
9091 212430 115418 94687 98678 127163 194509 276144 213573 119278 112939 142374 112876 83284
9079 83284 163432 189544 185384 225596 247958 243556 213113 222860 244546 205669 169742 191979
9067 191979 222489 221565 203455 204561 230612 185363 89364 104987 163294 166865 150923 161402
9055A61402k9950K5802L6908l2256m6209l6879J5973L0886m3211k0215r225p574
9043D5452M2171J1006J8767L6290L3394n2187m1466L662K3138L7005k8967r6702
9031C1563r0240M0209O2047M5983k9138q3851j6079M4457R0010K9146P947k1411
9019A10643k7955K0386J8023q0719R676O2817j0303o731J8304l4823l0656O6656
9007A15318N8699k1947n8234l0646n312n203J2828J8971j4198r717K3932O3504
8995A47995K7268n636K4102r200j6414k2962o3380l3748L7555q456l0433K4949
8983G1640o1396r7151J7549P5536Q849K1840j1559J921o780k0472j9499R458L9532
8970B9468J2887o8502K6315L1591K7958L1236j4629j384k8573L8175M7087j8480
$$ plain form
9055 161402 131452 157254 194162 161906 115697 78818 94791 125677 82466 62251 53026 45452
9043 45452 87623 98629 117396 153686 187080 134893 93427 97089 120227 157232 128265 31563
9031 31563 -58677 -18468 43579 89562 60424 -23427 -39506 4951 94961 124107 132054 110643
9019 110643 82688 103074 121097 40378 50054 112871 102568 95837 114141 79318 48662 115318
9007 115318 174017 152070 93836 63190 57878 52675 65503 84474 70276 60559 84491 147995
8995 147995 175263 169627 193729 184529 168115 145153 81773 48025 85580 77124 46691 71640
8983 71640 10244 -86907 -69358 6178 15027 36867 25308 27229 20449 -23 -19522 -10064 29468
8970 29468 42355 -26147 168 31759 59717 90953 76324 74940 46367 84542 131629 113149
8958A13149m2686k0123k3613J4327K0344O7932J3567k1077j05190o3908J2915
8947c4363N0308K3952J9676M1328k1489m2229J4057j5550M2999L1474J2602k350
8935A20415M5250o05m5831r4715m8243L8397n529k0689K5275K8343K0995j4319
8923D8744j2887J9051K5694K8420J8527j9836m6638n2760p452L3869j7074m1441
8911b3783R584P843K8522M579k4743j8518R100J1573j2315j1254m0208J5514O4067
8898A9961N0387P905l3555k2230K1387J7056j3840M387L3952j2200n5641m6618
8886b9049M9861K0499k1225j2515L8787O4616M4555M0709o6713j15740j5772O9139
8874F7152l1374j1566O1385k8088n1525J7958l8897m0952L6833L5099m657j2002
$$ plain form
8958 113149 70463 50340 26727 41054 61398 129330 142897 121820 16630 -47278 -34363
8947 -34363 15945 39897 59573 100901 79412 37183 51240 35690 78689 110163 122765 120415
8935 120415 165665 165060 119229 24514 -23729 14668 9139 -11550 13725 42068 63063 48744
8923 48744 35857 54908 80602 109022 127549 107713 61075 8315 863 34732 17658 -23783
8911 -23783 -14199 -6356 22166 26745 2002 -16516 -7416 4157 -8158 -19412 -59620 -44106 19961
8898 19961 70348 78253 44698 22468 43855 60911 47071 51458 85410 73210 17569 -29049
8886 -29049 20812 41311 20086 7571 46358 110974 155529 196238 129525 13785 -1987 67152
8874 67152 35778 24212 85597 57509 5984 23942 -14955 -55907 -19074 16025 11368 -634
8862f34K4611J6624k2084n789k2615m992M3781j6437l4585m957K786j9543m9369
8849i3203J5132P5018M5271K1272l7921q2278J2262K8588L4932K5822q42n3774
8837i721N2385L6521L1858N1725K84l3386J8199M466m493l3776o6002m6550j2517
8824a1007N3800N3399J6526j3832m1828m0129l6801L4126j0469r458J8278J16203
8812A28808K5452o3727o5516j1787Q0371K2681K431r8913o0378K7093k492O1376
8800D5399M1017j5447q5737o1181L8173R6952M3952k6542l1235j9336M1931O0435
8788A28381k2348k1437J0465l3737l5771L6283M6622l6052n0969l0227J1069N3957
8776E6236m624J6514j5204J9408P585j2300J0737l008n1208N079L4234K0722m7828
$$ plain form
8862 -634 23977 40601 18517 12728 -9887 -14879 28902 12465 -22120 -27077 -24291 -43834 -93203
8849 -93203 -78071 -3053 42218 63490 25569 -56709 -44447 -15859 19073 44895 44053 -9721
8837 -9721 42664 79185 111043 162768 163052 129666 147865 152331 147838 114062 48060 1510 -11007
8824 -11007 42793 96192 112718 98886 57058 16929 -19872 14254 3785 -5673 12605 128808
8812 128808 154260 90533 25017 13230 93601 116282 118713 19800 -40578 -13485 -15977 45399
8800 45399 86416 70969 -14768 -75949 -37776 59176 103128 76586 45351 26015 67946 128381
8788 128381 106033 84596 95061 61324 25553 61836 108458 72406 21437 -8790 2279 56236
8776 56236 51612 68126 52922 72330 79915 67615 78352 75344 24136 29215 63449 84171 36343
8763C6343o2677p194N8760l1935p9750Q072M0151L3264k4784L3239L8101O945
8751D8535J6450k856l7855m364O9135j766k1483j3172n788k3677m615N2628M6323
8738A17495q183p6828k437O365n2853K3780M3899O7596j1000m7496K9738P5357
8726A65433m2637k3979J7910l3829J170j3164O835k1340M834k059l9498r5424
8714g5748j5321O6685P2723j7834o9452L3403N2094Q87k0617o0455m077M9348
8702A1636P7328k2036n1756J4769J8056M1922O978m903L0838q074J7215j14600
8690A7373n0440L4285L4728L6662K8623n1079m3498N2492j687r9802o371L5765
8678a2949n77J5679l2419j3454r8863J6270J07141L5294K2059P4185N662l1395
$$ plain form
8763 36343 -26334 -33528 25232 -6703 -86453 -78381 -38230 -4966 -29750 3489 41590 48535
8751 48535 64985 62129 24274 19910 89045 87279 65796 52624 46836 23159 18544 71172 117495
8738 117495 109312 32484 30047 36412 -16441 7339 51238 118834 107834 60338 90076 165433
8726 165433 122796 98817 116727 82898 84068 70904 77739 56399 61233 59174 19676 -75748
8714 -75748 -91069 -24384 48339 30505 -38947 -5544 46550 47437 26820 -33635 -37712 11636
8702 11636 88964 66928 15172 29941 47997 89919 96897 91994 122832 114758 131973 17373
8690 17373 -33067 1218 35946 72608 101231 50152 6654 59146 57459 -42343 -48714 -12949
8678 -12949 -13526 2153 -30266 -43720 -142583 -126313 -19172 16122 38181 112366 118028 86633
8666H6633j5324N134J3610n0690j8587N8923N2676K944j2716K6801p4379m1204
8654C3821N232J0285j6139K3803R250k0963L5823j6308k4392M1500J1683J3153
8642A06748N8574p7455r7006J9489N6475J3795o632J8927K7296n3622m1751k1763
8630C075K5319P783j6985N494n4618J2697M8025l201K6299J5239k5133l0521J7624
8617C1097N5684k0927l987j6072j216p935q986K5884R2133Q01k1900j6663o59
8604A07254N1691O3592n120k2235J710L7602j8229K552Q24J6576J9876K2833K6116
8591C05042q9730k3735j6702k2117j666k6634L9768N3148o8101r9682J4415O1452
8579A25458L6163K1849n1475j21408n4426L5180j3875K3536R5947k248j8310k1517
$$ plain form
8666 86633 71309 76443 90053 39363 20776 79699 132375 135319 122603 149404 75025 33821
8654 33821 39053 49338 33199 57002 66252 45289 81112 64804 40412 81912 93595 106748
8642 106748 165322 87867 -9139 10350 66825 80620 73988 92915 120211 66589 24838 3075
8630 3075 28394 36177 19192 24686 -29932 -17235 30790 27589 53888 69127 43994 13473 31097
8617 31097 86781 65854 61867 45795 44579 36644 27658 53542 145675 146476 124576 107913 107254
8604 107254 158945 222537 217417 195182 196892 234494 216265 218817 219641 236217 256093 278926 305042
8591 305042 215312 191577 174875 152758 151092 124458 164226 217374 149273 49591 64006 125458
8579 125458 161621 183470 131995 10587 -43839 -8659 -22534 1002 96949 94701 76391 54874
8567E4874l8126J0437L2953N168j7328Q387l444M7483j2557j9555L480j0598m5773
8554A5401j8301K6187l247K5216j4624K7189M5477m3858l8239O0234N5851k0356
8542A16930j3290J4668n985q332l7778l6849K855K2034L3891j3314K9761k4070
8530H0521l1913L0745N8998p94J3232L464n2151j5111k2625J3876j1747J9528
8518H6023l2388k4792K9624k7182L9563N0285l7711k7992o0869k2154P3809M3624
8506H9840J1108K2901N1264k8655o3613p9704k5410r514Q261P058j670L6024k7601
8493i711N885k1441l9691l1352M7605J0732L3957k0357j7967j195K0502L3703
8481A0670K7706k0044j5869O8268m1965l3676q899O5891L2014p1018m3621K3270
$$ plain form
8567 54874 16748 27185 60138 65306 47978 56365 52921 100404 87847 68292 71772 61174 15401
8554 15401 -2900 23287 20040 45256 30632 57821 103298 59440 21201 81435 137286 116930
8542 116930 103640 118308 112323 103991 66213 29364 32219 54253 88144 74830 104591 80521
8530 80521 48608 79353 138351 137557 150789 154253 102102 86991 64366 78242 66495 86023
8518 86023 53635 28843 58467 31285 70848 121133 83422 55430 -5439 -27593 46216 89840
8506 89840 100948 123849 175113 146458 82845 3141 -22269 -31783 -23522 -16464 -18134 17890 -9711
8493 -9711 -3826 -25267 -64958 -96310 -48705 -37973 -4016 -24373 -42340 -43535 -23033 10670
8481 10670 38376 18332 2463 70731 28766 -4910 -13809 52082 84096 13078 -30543 -7273
8469g273R5631L4921p0218P041N246q0460o5341J6186Q744N4235L0938l7130R449
8456A969M113k5317N765N4287P869m3955M1989J4989j5654k9132P340J277J5116
8443D0656K4434k4438l0168O607k381n7830l0899K7698K7095q3K0690K1315j9433
8430C263L3506L4902l2899n2951L880N9207J0368Q092j7673p448k0032l7848K1400
8417E767l4535J3219L2954J5813M925k6399K3002J4146m4811o7061j8393k0477
8405a01850K5847O8677N1409j909k2136K817k6485l6067n724L9965j083k3902
8393c0441l316J2506o407K3113k69n888k485k2428n0443Q5050L2206k3475j5659
8380g936J5961m1668j1044K8872K0469q877K1389m8315M2409K0166j1590j3357
$$ plain form
8469 -7273 88358 123279 53061 60102 65348 -15112 -80453 -64267 -55523 -1288 29650 -7480 1969
8456 1969 6082 -19235 -13470 40817 48686 4731 46720 61709 46055 16923 24263 25540 40656
8443 40656 65090 40652 10484 17091 14710 -43120 -74019 -46321 -19226 -19309 1381 22696 3263
8430 3263 36769 71671 38772 -14179 -10299 48908 59276 67368 49695 42247 22215 -15633 5767
8417 5767 -28768 -15549 17405 33218 38143 11744 34746 48892 4081 -62980 -81373 -101850
8405 -101850 -76003 -7326 44083 42174 20038 22855 -3630 -39697 -45421 -5456 -6539 -30441
8393 -30441 -33757 -21251 -27658 -4545 -4814 -10702 -13187 -35615 -86058 -1008 31198 7723 -7936
8380 -7936 8025 -33643 -44687 -15815 4654 -4223 17166 -31149 11260 31426 19836 6479
8368F479l5995K9370o9468j465J0405L9905o5528K4543L6417l9873j5138K9434
8356e0914L8606J8266j5258m7324K6763P254p351R418j1217M2988O8350J1863
8344I1444j5290j8896M025m3972l3068K4050M5248k4678m0885J5691j3534l289
8332a3154J5976Q1502j7367j3895m3854J0979K6276Q621l7383Q027L8936j3734
8320E0930k6734P1203k6288o3223K1548j4624p778K2640J9981r418j7904j0255
8308A0078o0294k2650J5133L3782M4613L4612k7909m4120J3125R9800M162j7564
8296H2768K287p3060q9374n6216L9757O7842J1861M9048J6628l2245m747J5218
8284B9767L6763m0704n4196k0645R838k3817j0152k1150M4394l5388J196M3326
$$ plain form
8368 6479 -29516 -146 -69614 -71079 -60674 -20769 -86297 -61754 -25337 -65210 -80348 -50914
8356 -50914 -12308 5958 -9300 -56624 -29861 -22607 -29958 -20540 -31757 11231 79581 91444
8344 91444 76154 57258 61283 17311 -15757 8293 53541 28863 -12022 3669 -9865 -13154
8332 -13154 2822 84324 66957 53062 9208 20187 46463 55084 17701 25728 64664 50930
8320 50930 24196 95399 69111 5888 27436 12812 5034 27674 47655 38237 20333 10078
8308 10078 -50216 -72866 -57733 -23951 20662 55274 27365 -16755 -3630 96170 100332 82768
8296 82768 85055 11995 -77379 -133595 -93838 -25996 -14135 34913 51541 19296 14549 29767
8284 29767 66530 25826 -28370 -49015 -39177 -62994 -73146 -94296 -49902 -85290 -84094 -40768
8272d0768M8212J2440p614j2506n982k297n2295l6857O2470N6528J3252K8440
8260F3023M1256M3522n413j05143o6937L317N2294O494j2216j726N055n717m547
8247A3262K9779q176K7567r551o62k2543j6416Q231k1580J7931q502o9899J2399
8234d8160M6556N4533q415j4040j9397L215n3165o941l7875j0413Q3836M8917
8222C8651m7328l7189J0111K0913K3046k7022n0449Q1706N3514m47m5504K0353
8210D0355L0580j4426k5639K0354N5319M9506j0234j5320r062p3897m3774K0575
8198B4337L039q695M1857l9413k9463N8352J0182P828K5709q2122p8353p17Q7483
8185B0024O1004k7760j1341K7640j3746o5530K212o698r320P8251M9100n6139
$$ plain form
8272 -40768 7444 19884 12270 -236 -6218 -8515 -60810 -97667 -35197 21331 34583 63023
8260 63023 104279 147801 142388 37245 -29692 -26375 25919 32413 20197 18471 23526 17809 13262
8247 13262 43041 34865 62432 52881 52219 29676 13260 21491 -89 17842 9340 -60559 -48160
8234 -48160 -1604 52929 44514 30474 11077 14292 -38873 -45814 -83689 -94102 -10266 38651
8222 38651 -8677 -45866 -35755 -14842 8204 -18818 -69267 12439 65953 65506 20002 40355
8210 40355 70935 56509 30870 51224 106543 156049 145815 130495 121433 47536 3762 24337
8198 24337 27376 18681 60538 21125 -8338 50014 60196 68024 93733 11611 -66742 -67459 20024
8185 20024 81028 53268 41927 69567 55821 -9709 -7497 -14195 -23515 54736 103836 47697
8173D7697n6011r225j1035K5790L6975J2007J2572M1043l7424j2966q384o1819
$$ plain form
8173 47697 -8314 -17539 -28574 -2784 34191 46198 58770 99813 62389 49423 41039 -20780
$$ [...]
##END NTUPLES=NMR SPECTRUM
##END=
