##TITLE=Analysis number 324412
Compound Code cc 40213
Book Reference 518/3
Project Code adrs
Chemist Name colinb
##JCAMPDX= 6.0         $$ Bruker NMR JCAMP-DX V2.0
##DATA TYPE= NMR SPECTRUM
##DATA CLASS= NTUPLES
##ORIGIN= Bruker BioSpin GmbH
##OWNER= nmr
$$ XWIN-NMR		Version 3.5
$$ Tue Nov 21 09:46:00 2006 GMT Standard Time (UT+0h)  MAYBRIDGE\nmr@NMR_250MHZ
##.OBSERVE FREQUENCY= 250.131544655141
##.OBSERVE NUCLEUS= ^1H
##.ACQUISITION MODE= SIMULTANEOUS (DQD)
##.ACQUISITION SCHEME= undefined
##.AVERAGES= 16
##.DIGITISER RES= 18
##SPECTROMETER/DATA SYSTEM= dpx250
##.PULSE SEQUENCE= zg30
##.SOLVENT NAME= CDCl3
##.SHIFT REFERENCE= (INTERNAL, CDCl3, 0, 16.522)
##AUDIT TRAIL= $$ (NUMBER, WHEN, WHO, WHERE, WHAT)
$$ ##TITLE= Audit trail, XWIN-NMR		Version 3.5
$$ ##JCAMPDX= 5.01
$$ ##ORIGIN= Bruker BioSpin GmbH
$$ ##OWNER= nmr
$$ C:\u/data/dgb/nmr/ADRS/740/pdata/1/auditp.txt
$$ ##AUDIT TRAIL=  $$ (NUMBER, WHEN, WHO, WHERE, WHAT)
(   1,<2006-11-21 09:45:29.46 +000>,<MAYBRIDGE\nmr>,<NMR_250MHZ>,
      <created by zg, POWCHK disabled, PULCHK disabled
       configuration hash MD5:
       49 4B E0 1D 92 C2 6B 37 9F E6 65 BC 52 41 86 1D
       data hash MD5: 64K
       9A 61 E6 72 FB 7B F4 09 68 08 6E B9 D1 22 33 95>)
(   2,<2006-11-21 09:45:47.98 +000>,<MAYBRIDGE\nmr>,<NMR_250MHZ>,
      <Start of raw data processing
       ef LB = 0.3 FT_mod = 6 PKNL = 1 SI = 32K 
       data hash MD5: 32K
       04 37 E1 4E A4 3F 6D 0C D7 7E C5 D4 11 BF 87 20>)
(   3,<2006-11-21 09:45:49.89 +000>,<MAYBRIDGE\nmr>,<NMR_250MHZ>,
      <apk 
       data hash MD5: 32K
       E7 3F BE 51 EC CE E4 B5 4E 19 90 1C A7 E2 E4 C2>)
(   4,<2006-11-21 09:45:50.64 +000>,<MAYBRIDGE\nmr>,<NMR_250MHZ>,
      <abs ABSG = 5 
       data hash MD5: 32K
       67 64 BA 28 17 26 15 0A 0C 1B C9 61 37 E6 7B 49>)
$$ ##END=
$$ 
$$ hash MD5
$$ EC 57 91 C3 5C E8 40 14 3A E1 F8 91 C3 F8 02 77
##$RELAX= 
##$RELAX= 
##$RELAX= 
##$RELAX= 
##$RELAX= 
##$RELAX= 
##$RELAX= 
$$ Bruker specific parameters
$$ --------------------------
##$DU= <C:\u>
##$EXPNO= 740
##$NAME= <ADRS>
##$PROCNO= 1
##$TYPE= <nmr>
##$USER= <dgb>
##$AMP= (0..31)
100 100 100 100 100 100 100 100 100 100 100 100 100 100 100 100 100 100 
100 100 100 100 100 100 100 100 100 100 100 100 100 100 
##$AQSEQ= 0
##$AQ_mod= 3
##$AUNM= <au_zg>
##$AUTOPOS= <45 >
##$BF1= 250.13
##$BF2= 250.13
##$BF3= 250.13
##$BF4= 250.13
##$BF5= 500.13
##$BF6= 500.13
##$BF7= 500.13
##$BF8= 500.13
##$BYTORDA= 1
##$CFDGTYP= 0
##$CFRGTYP= 5
##$CHEMSTR= <none>
##$CNST= (0..31)
1 1 145 1 1 1 1 1 1 1 1 1 1 1 1 1 1 1 1 1 1 1 1 1 1 1 1 1 1 1 1 1 
##$CPDPRG= <>
##$CPDPRG1= <>
##$CPDPRG2= <>
##$CPDPRG3= <>
##$CPDPRG4= <mlev>
##$CPDPRG5= <mlev>
##$CPDPRG6= <mlev>
##$CPDPRG7= <mlev>
##$CPDPRG8= <mlev>
##$CPDPRGB= <>
##$CPDPRGT= <>
##$D= (0..31)
0 1 0 0 0 0 0 0 0 0.06 0 0 0 0 0 0 0.0002 0 0 0 0 0 0 0 0 0 0 0 0 0 0 
0 
##$DATE= 1164102327
##$DBL= (0..7)
120 120 120 120 120 120 120 120 
##$DBP= (0..7)
150 150 150 150 150 150 150 150 
##$DBP07= 0
##$DBPNAM0= <>
##$DBPNAM1= <>
$$ [...]
##$SUBNAM7= <"">
##$SUBNAM8= <"">
##$SUBNAM9= <"">
##$SW= 20.6930455092707
##$SWIBOX= (0..15)
0 0 3 0 0 0 0 0 0 0 0 0 0 0 0 0 
##$SW_h= 5175.983436853
##$TD= 65536
##$TD0= 1
##$TE= 683.16
##$TE2= 300
##$TE3= 300
##$TEG= 300
##$TL= (0..7)
0 120 120 120 120 120 120 120 
##$TP= (0..7)
150 150 150 150 150 150 150 150 
##$TP07= 0
##$TPNAME0= <>
##$TPNAME1= <>
##$TPNAME2= <>
##$TPNAME3= <>
##$TPNAME4= <>
##$TPNAME5= <>
##$TPNAME6= <>
##$TPNAME7= <>
##$TPOAL= (0..7)
0.5 0.5 0.5 0.5 0.5 0.5 0.5 0.5 
##$TPOFFS= (0..7)
0 0 0 0 0 0 0 0 
##$TUNHIN= 0
##$TUNHOUT= 0
##$TUNXOUT= 0
##$USERA1= <user>
##$USERA2= <user>
##$USERA3= <user>
##$USERA4= <user>
##$USERA5= <user>
##$V9= 5
##$VALIST= <valist>
##$VCLIST= <CCCCCCCCCCCCCCC>
##$VD= 0
##$VDLIST= <DDDDDDDDDDDDDDD>
##$VPLIST= <PPPPPPPPPPPPPPP>
##$VTLIST= <TTTTTTTTTTTTTTT>
##$WBST= 1024
##$WBSW= 4
##$XGAIN= (0..3)
0 0 0 0 
##$XL= 0
##$YL= 0
##$YMAX_a= 497682
##$YMIN_a= -403181
##$ZGOPTNS= <>
##$ZL1= 120
##$ZL2= 120
##$ZL3= 120
##$ZL4= 120
##$ABSF1= 16.522
##$ABSF2= -4.171173
##$ABSG= 5
##$ABSL= 3
##$ALPHA= 0
##$AQORDER= 0
##$ASSFAC= 0
##$ASSFACI= 0
##$ASSFACX= 0
##$ASSWID= 0
##$AUNMP= <proc_1d>
##$AZFE= 0.1
##$AZFW= 0.1
##$BCFW= 0
##$BC_mod= 0
##$BYTORDP= 0
##$COROFFS= 0
##$CY= 12.5
##$DATMOD= 1
##$DC= 0
##$DFILT= <>
##$DTYPP= 0
##$F1P= 14.0000005364418
##$F2P= -0.99999901652339
##$FCOR= 0.5
##$FTSIZE= 32768
##$FT_mod= 6
##$GAMMA= 0
##$GB= 0
##$INTBC= 1
##$INTSCL= 1
##$ISEN= 128
##$LB= 0.3
##$LEV0= 0
##$LPBIN= 0
##$MAXI= 10000
##$MC2= 0
##$MEAN= 0
##$ME_mod= 0
##$MI= 0
##$NCOEF= 0
##$NC_proc= -4
##$NLEV= 6
##$NOISF1= 0
##$NOISF2= 0
##$NSP= 0
##$NTH_PI= 0
##$NZP= 0
##$OFFSET= 16.522
##$PC= 1
##$PHC0= -50.31659
##$PHC1= 7.806417
##$PH_mod= 1
##$PKNL= yes
##$PPARMOD= 0
##$PSCAL= 4
##$PSIGN= 0
##$REVERSE= no
##$SF= 250.13
##$SI= 32768
##$SIGF1= 0
##$SIGF2= 0
##$SINO= 400
##$SIOLD= 32768
##$SREGLST= <1H.CDCl3>
##$SSB= 0
##$STSI= 32768
##$STSR= 0
##$SW_p= 5175.98343685301
##$SYMM= 0
##$S_DEV= 0
##$TDeff= 65536
##$TDoff= 0
##$TI= <Analysis number 999999
Compound Code 99
Book Reference 9
Project Code 9>
##$TILT= no
##$TM1= 0
##$TM2= 0
##$TOPLEV= 0
##$USERP1= <user>
##$USERP2= <user>
##$USERP3= <user>
##$USERP4= <user>
##$USERP5= <user>
##$WDW= 1
##$XDIM= 32768
##$YMAX_p= 417533527
##$YMIN_p= -189490
$$ End of Bruker specific parameters
$$ ---------------------------------
##NTUPLES= NMR SPECTRUM
##VAR_NAME=  FREQUENCY,     SPECTRUM/REAL,   SPECTRUM/IMAG
##SYMBOL=    X,             R,               I
##VAR_TYPE=  INDEPENDENT,   DEPENDENT,       DEPENDENT
##VAR_FORM=  AFFN,          ASDF,            ASDF
##VAR_DIM=   32768,         32768,           32768
##UNITS=     HZ,            ARBITRARY UNITS, ARBITRARY UNITS
##FACTOR=    0.157963299565203, 1,           1
##FIRST=     4132.6476996994, 0,             0
##LAST=      -1043.33573715361, 0,           0
##MIN=       -1043.33573715361, -189490,     0
##MAX=       4132.6476996994, 417533527,     0
$$ Real data points
##PAGE= N=1
##DATA TABLE= (X++(R..R)), XYDATA
$$ [...]
18459A334161M982P6160J04509P5002O5865O9350J6171j0925p9966r1664l7085
18448A526560j16026l8197j5166j8444L1365L4071J9059J8712J8857n247O4679
18437A520223J32576J17962J27894J08114j9490j41857j32130o9292n6180p8228
18427A509592q4049m5906M9568J21855P9000O7406O1135M0846P1665m9273l1731
18416A790108J0881J6025K7966L0240k1090L5915K3438J1555J9069r359k6279
18405A908469K6097O3831J6664L2561J1763M9023O6939K6776O835N7929O2147
18394B329034R1994O0453Q3331J02778K8904L7300j643k0855n014j017N0922P4256
18382B830443O2835P1534J23186J24330J41025J22572J15095J57761K08146K46513
$$ plain form
18459 1334161 1339143 1415303 1519812 1594814 1660679 1730029 1746200 1735275 1655309 1563645 1526560
18448 1526560 1410534 1372337 1357171 1338727 1370092 1404163 1423222 1441934 1460791 1455544 1520223
18437 1520223 1652799 1770761 1898655 2006769 1987279 1845422 1713292 1644000 1587820 1509592
18427 1509592 1425543 1379637 1429205 1551060 1630060 1697466 1758601 1799447 1871112 1821839 1790108
18416 1790108 1800989 1817014 1844980 1875220 1854130 1890045 1913483 1925038 1944107 1934748 1908469
18405 1908469 1934566 1998397 2015061 2047622 2059385 2108408 2175347 2202123 2208958 2266887 2329034
18394 2329034 2421028 2481481 2564812 2667590 2696494 2733794 2732151 2711296 2706282 2705265 2756187 2830443
18382 2830443 2893278 2964812 3087998 3212328 3353353 3475925 3591020 3748781 3956927 4203440
18372D203440K95660K61513K44766K82855L90918L57521L56506M60968N74603
18363G428750N88172O09040P08694Q63599J083850J414219J920119K396006K637475
18354A9649924K759281K952846L308377L498569L163251K812521L261437M670770
18346D6076976P160758J0565588J3945270J5805307J6640968J8616476K0472764
18339A49284107J8020559J0478533L584751p83793m994379j0404927j4265601
18332A50919250j4953860j3937507j2539942j0811013q377201n840799m376697
18325H0082231m721653n442108n701565n729049n856894n945213n636234m972114
18317C6077401m150692l211821k342910j630526j178295q81270o14279k71180
$$ plain form
18372 4203440 4499100 4760613 5005379 5288234 5679152 6036673 6393179 6854147 7428750
18363 7428750 8016922 8625962 9334656 10198255 11282105 12696324 14616443 17012449 19649924
18354 19649924 22409205 25362051 28670428 32168997 35332248 38144769 41406206 46076976
18346 46076976 53237734 63803322 77748592 93553899 110194867 128811343 149284107
18339 149284107 167304666 177783199 181367950 180584157 175589778 165184851 150919250
18332 150919250 135965390 122027883 109487941 98676928 90299727 84458928 80082231
18325 80082231 75360578 69918470 64216905 58487856 52630962 46685749 41049515 36077401
18317 36077401 31926709 28714888 26371978 24741452 23563157 22681887 22067608 21796428
18309B1796428o5987J82215N65233J065011J802034K866214M021822M732777M949300
18300D1915047N176880N700188O038413N309318M135116L965693N119192O655879
18292H4015726P928558R940474J2867145J4391469J2482967R436071Q059352N980597
18284A65102359k95418q147804j2912402j4479983j5111525j5685472j5017736
18277H3452019j3114626j0514539p844700n449302l739311l153322l029228k944453
18269C3662538k788506k676450k755823k629828k363322k013398j683798j396404
18261A5355009j101529r13460p52680p31818o22299o13441o20483m96167n07997
18252H995135m76782m30419l96056k97707k75887k68997k21795j48531j65811
$$ plain form
18309 21796428 21730441 21912656 22477889 23542900 25344934 28211148 32232970 36965747 41915047
18300 41915047 47091927 52792115 58830528 64139846 68274962 72240655 77359847 84015726
18292 84015726 91944284 101884758 114751903 129143372 141626339 151062410 159121762 165102359
18284 165102359 164806941 156659137 143746735 129266752 114155227 98469755 83452019
18277 83452019 70337393 59822854 51978154 46528852 42789541 39636219 36606991 33662538
18269 33662538 30874032 28197582 25441759 22811931 20448609 18435211 16751413 15355009
18261 15355009 14253480 13340020 12587340 11855522 11233223 10619782 9999299 9503132 8995135
18252 8995135 8518353 8087934 7691878 7394171 7118284 6849287 6627492 6478961 6313150
18243F313150j52996j42723j82950j62369j05290q7185q8018j14765n8933n7059
18233E160862j18655p5399l0527k0119J7745o521o928k034j1785J7207j1167L1406
18221D944085N9955N2654J06264J49665J46054J99758L22705L65745M96684N98772
18211G442341O02814M97529L83979K46223K88123M09390N50303P51804R90060
18202A2162566J243828J677909K301273L248477M729676O936803J0753815J7444039
18194F0498386K7833214L7978547L7123603J8139765p351305k4705042l0386031
18187A19131137k7615791k1692084j5370436j0339419o778533m371198k659427
18180C0304249j177972K14759J645523L480306O147395J0481778J7659505K8035715
$$ plain form
18243 6313150 6160154 6017431 5834481 5672112 5566822 5479637 5391619 5276854 5217921 5160862
18233 5160862 5042207 4966808 4936281 4916162 4933907 4927386 4920458 4918424 4906639 4923846 4912679 4944085
18221 4944085 5004040 5056694 5162958 5312623 5458677 5658435 5981140 6346885 6843569 7442341
18211 7442341 8045155 8542684 8926663 9172886 9461009 9870399 10420702 11172506 12162566
18202 12162566 13406394 15084303 17385576 20634053 25363729 32300532 43054347 60498386
18194 60498386 88331600 126310147 163433750 181573515 174222210 149517168 119131137
18187 119131137 91515346 69823262 54452826 44113407 37334874 32963676 30304249
18180 30304249 29126277 29341036 30986559 34466865 40614260 51096038 68755543 96791258
18172I6791258L6557478L2285093J1271238j2534467k6853349l0115628k6297955
18165H1103668k0218333j4299290r829911o802072m820356l537551k641194k035425
18157A6919536j554470j113978q94030o89621m08946k32290j91636j78674l27391
18148A1328500n36283o53336o64639o59453n84039m70132l67062k49783k18966
18139F924807r2286J18598K54303M59494P35338Q74376O84477K54533l48451p39083
18129I126106q28374o99148n37968m00520j76840l8562l155J07923K05483L68705
18119G123650O41678R61396J398206K140945L345730N549662R618007J4968283
18111D5747557J6997517R928571k208388j0303125j3188811j1687220r137176
$$ plain form
18172 96791258 133348736 165633829 176905067 164370600 137517251 107401623 81103668
18165 81103668 60885335 46586045 36756134 29954062 25133706 21596155 18954961 16919536
18157 16919536 15365066 14251088 13357058 12667437 12258491 12026201 11834565 11655891 11328500
18148 11328500 10792217 10138881 9474242 8814789 8230750 7760618 7393556 7143773 6924807
18139 6924807 6832521 6951119 7205422 7664916 8400254 9274630 9959107 10213640 9865189 9126106
18129 9126106 8297732 7598584 7060616 6660096 6483256 6444694 6441539 6549462 6754945 7123650
18119 7123650 7765328 8726724 10124930 12265875 15611605 21161267 30779274 45747557
18111 45747557 62745074 72673645 70465257 60162132 46973321 35286101 26148925
18104B6148925o489068m350781k891133k037397j483843j063525q44038o72015
18096F317125n50672l72757l11332l21037l14153k03302j56475k06627j72144
18087C708626k04849k08601j95218j84974j24773q0584q6893j05679q3269m4806
18077B388980p4066n0535j11633p6169m3465o8003l7726Q791n8411q4427M039
18066A797375k886P07L8550Q249j3713q7321j21971m7660q9063k6935K3591K2192
18054A501115r623k6810J8387j0152l8592L2628O6115J077l1470m2325p0489o3464
18042A326397l6945m1110j02666j27264o6190k2696n1728r1744k6224J971n6224
18031G05577k6147M0105K1015p555k9839J5804l0797j7921n3166k0999m5857q0748
$$ plain form
18104 26148925 19659857 15309076 12417943 10380546 8896703 7833178 6989140 6317125
18096 6317125 5766453 5393696 5082364 4761327 4447174 4243872 4087397 3880770 3708626
18087 3708626 3503777 3295176 3099958 2914984 2790211 2709627 2622734 2517055 2433786 2388980
18077 2388980 2314914 2264379 2152746 2076577 2033112 1965109 1927383 1936174 1877763 1793336 1797375
18066 1797375 1794489 1795196 1833746 1841995 1828282 1740961 1618990 1571330 1482267 1455332 1478923 1501115
18054 1501115 1491492 1464682 1483069 1472917 1434325 1466953 1533068 1534145 1502675 1460350 1389861 1326397
18042 1326397 1289452 1248342 1145676 1018412 952222 929526 877798 786054 759830 761801 705577
18031 705577 679430 719535 740550 732995 703156 718960 688163 670242 617076 596077 550220 469472
18019D69472l1750N316J3771j6281L4643M2518J1697j698p534J3869j9243K443
18007E17223J0091m4215p4513L6352K5398O601k975K792l2178l9404J2227J4376
17995D31775o7101n2373k8777m398N795N674j87O927J4414K8695K1249P65m645
17982C57813j213K2300l1114k7453j5226J1040k1310k6966n8129q173j29M85k5784
17969A76141K4930L757j0246r278L9662M511n5865k6807J0865N6869J0418l1104
17957A93853j3262K5789N2418J7371L0956j0614l6788l0947k3040l3544k8112
17946A44080j4098p9714m849K0139L4009j0013k8113K6027L2039L8933m235r3
17934A54112N1807n6k2826J4909j5625J0046O4429K7648l0608l2765j2711m3518
$$ plain form
18019 469472 437722 443038 456809 440528 475171 517689 529386 527688 520154 534023 514780 517223
18007 517223 527314 483099 408586 444938 470336 476937 473962 476754 444576 405172 417399 431775
17995 431775 364674 312301 283524 279126 284921 290595 290408 297335 311749 340444 361693 362458 357813
17982 357813 356600 378900 347786 320333 305107 316147 294837 267871 209742 201569 201440 201925 176141
17969 176141 201071 204828 194582 185304 224966 229477 173612 146805 157670 214539 224957 193853
17957 193853 180591 206380 258798 276169 307125 296511 259723 228776 205736 172192 144080
17946 144080 129982 50268 45419 65558 99567 89554 61441 87468 119507 158440 154205 154112
17934 154112 205919 205863 183037 197946 182321 192367 256796 284444 253836 221071 208360 164842
17922A64842m1711j5334K4741P038P095m0603L1022J5516j6648k4136J2706k470
17910A22058l8506m8200K1077O2575N5024k0890l6205k6984J0608L3048J7343
17899A50948l7269Q316O936m397l1247L4417j0983k228M27n950M36J6410j1217
17886A14599n6963M148L153O493j3776O6471K0776L434J7186j2842m9800O222
17874A09101J174n4333M1998K1250K4388j7740k3459L3919k2020J8498m9790k6451
17862E6535J2865m966M2145l450j1030j0404j0712P882J5659k0892n134N0725
17850A19223M2834O4777K4672Q245J001Q6566P8625L1682M5621N9228Q4333O7592
17838G14399p709j0341J074m308M5871Q7815N1123K7458M9179o0280j06754o5103
$$ plain form
17922 164842 123131 107797 132538 139576 146671 106068 137090 152606 135958 111822 124528 122058
17910 122058 83552 35352 56429 119004 174028 153138 116933 89949 100557 133605 150948
17899 150948 113679 121995 128931 124534 93287 127704 116721 114493 114920 108970 109406 125816 114599
17886 114599 57636 61784 64937 71430 57654 124125 144901 148335 165521 152679 102879 109101
17874 109101 110275 55942 97940 119190 143578 125838 102379 136298 114278 132776 82986 56535
17862 56535 69400 64434 106579 103129 92099 81695 70983 78865 94524 73632 68498 119223
17850 119223 162057 226834 251506 259751 260752 347318 425943 457625 503246 562474 646807 714399
17838 714399 706690 696349 697423 693115 738986 826801 877924 905382 954561 894281 787527 722424
17826G22424l5814k1020n9934j03764q5780r7947J1028j0478j3968k3815m0772
17815B40160R140N758l0463o3931j6406K6195L5292j7717j4287K2109J9911j0197
17803B05564p213j7273M1446M9258q08M6461K0415J7992N2740P7603L5156P857
17791E29198J7837Q0653K4609J0808k8527J7069k3745p0330l7627r058K956M2420
17779E56263J7776K6350L344N0141L9879k8390j6612n0432l7514n5128p9483k5674
17767D00520l6867l3409q5835j00893j9540K4271P2857K0981k996m7305j7999
17756A73785M0916l3613m7811j2803M425J4999J5231L3595k2213k3433l3508K6247
17744A35817k9462n5652o586J1130k398j918K4943n571j1277M2187O2000O862
$$ plain form
17826 722424 686610 665590 605656 501892 416112 318165 329193 318715 304747 280932 240160
17815 240160 249300 255058 224595 160664 144258 170453 205745 188028 173741 195850 215761 205564
17803 205564 198351 181078 222524 271782 270974 317435 337850 355842 408582 486185 521341 529198
17791 529198 547035 627688 652297 663105 634578 651647 627902 557572 519945 510887 513843 556263
17779 556263 574039 600389 603733 653874 693753 665363 648751 598319 560805 505677 426194 400520
17767 400520 363653 330244 244409 143516 123976 148247 221104 242085 239089 191784 173785
17756 173785 214701 181088 133277 120474 124899 139898 155129 188724 166511 143078 109570 135817
17744 135817 106355 50703 44117 55247 52849 50931 75874 70303 59026 101213 163213 170075
17732A70075m4733j0119J8699K9616j1562l2909O784M3716k0839M286L0928J1004
17720A94946K815o1380L588k0631k5698n886j2384k2127J0678m6421m983J4105
17708B6622L8406L266J5732K0520K7400r24k7008j8184J3759k5837j8834M3689
17696I8607J4128p372K7819J4976l0531m779j9049K5756J6384K2832N729o7052
17684I7448j1638k2592L0060L211J63j1727J5248K5146L6530L6753L5275m1216
17672A92661l0105O588M3658Q730K3139N4492N6021K3399Q3028J32756K02654
17661G97021J49708K00910J91984J87700K15289J49865J25055N9229N821o889
17651B075693j16540k19737k39253k48858k06984j72593j44782j50619j28544
$$ plain form
17732 170075 125342 115223 133922 163538 151976 119067 125851 169567 148728 153014 183942 194946
17720 194946 197761 136381 139969 119338 93640 87754 75370 53243 63921 17500 12517 26622
17708 26622 65028 68294 84026 104546 131946 131022 104014 85830 99589 73752 54918 98607
17696 98607 112735 105363 133182 148158 117627 112848 93799 119555 135939 158771 164500 97448
17684 97448 85810 63218 93278 96489 96652 84925 100173 125319 161849 198602 233877 192661
17672 192661 162556 169144 212802 221532 244671 299163 355184 378583 461611 594367 797021
17661 797021 946729 1147639 1339623 1527323 1742612 1892477 2017532 2076761 2082582 2075693
17651 2075693 1959153 1739416 1500163 1251305 1044321 871728 726946 576327 447783
17642D47783r9427n3335l3875J3162J4224n2999m7960r071j0723l3567l3700k3925
17630G6587K5225L840k0911M108J5125l547J9555l6654l5658L0542M1664j6037
17618A03839m0911m9066M7898P9237j1715m0778J5980k2830N370Q482L6283n4815
17606G6974j9346M2463K7158M470m2470o4966P0259L4770j1871L256M788K2135
17594A47620N6291J06684J16838J42080J52096J32820P6514J697n4643j62078
17584G15919j32020j27676m6245r5600r4475j7814J4626L0416K2554L0986K2463
17573C23134M1002M7147M4021J06499K08845J21476N7253m4416q7244j59453j57267
17562E00997j24972p5532n0463n3009k8715j0623n1494l2790k1098Q501o900K8665
$$ plain form
17642 447783 348356 295021 261146 274308 288532 235533 187573 178502 167779 134212 100512 76587
17630 76587 101812 105652 84741 88849 103974 100427 119982 83328 47670 78212 119876 103839
17618 103839 62928 13862 61760 140997 129282 88504 104484 81654 87024 95506 131789 76974
17606 76974 57628 100091 127249 131719 89249 24283 94542 129312 117441 120697 125485 147620
17594 147620 203911 310595 427433 569513 721609 854429 930943 932640 877997 715919
17584 715919 583899 456223 409978 314378 219903 202089 216715 247131 269685 300671 323134
17573 323134 364136 411283 455304 561803 770648 892124 949377 904961 817717 658264 500997
17562 500997 376025 300493 250030 197021 168306 157683 106189 73399 52301 60802 53902 82567
17550H2567N9695L047n5852j489m094k7649M335j5142k7648N1264J7559R420K8106
17537A24119j101l2624o8705o549M0148L4914l9289l7784L908Q6219K7266l4505
17525I6017n1470K0062M4387K5875q848j3537l3020l1116o4220R177J1383K8033
17513C2723j4742k8180p363R937K6541j6405l5539m0750j492J0035M4952L3297
17501A3014j6358J9935J2453j29J8646Q431n8086j3243j5909k7307K6288M7265
17489A5000J1625k7099M7258J0683j7296K5911J4006m3545l2440n255L3122P079
17477C9049K6113L8301p113k1917q118j6694o976q227n845k027M693J3072Q326
17464E2637k4056M421k0260j4571j7742L0282N2572N834N5453j5525J62p5599
$$ plain form
17550 82567 142262 145309 89457 87968 83874 56225 60560 45418 17770 69034 86593 96013 124119
17537 124119 123018 90394 21689 15140 55288 90202 50913 13129 17037 103256 130522 96017
17525 96017 44547 64609 108996 134871 126023 112486 79466 48350 -15870 -6693 4690 32723
17513 32723 17981 -10199 -17562 -7625 18916 2511 -33028 -73778 -75270 -65235 -20283 13014
17501 13014 -3344 16591 29044 28915 47561 55992 -2094 -15337 -31246 -58553 -32265 15000
17489 15000 26625 -474 46784 57467 40171 66082 80088 36543 4103 -1152 31970 39049
17477 39049 65162 103463 96350 74433 66315 49621 42645 34418 28573 26546 31239 44311 52637
17464 52637 28581 33002 12742 -1829 -19571 10711 63283 69117 124570 109045 109207 33608
17452C3608j4918j0981M3510N2427K9329L6647R0240P3103N4890L5996n8665j18201
17440B46985n5084r7860p1311K134r670q99k6462O8254N9390j2960l6048l4512
17428C1957l3558K1048P5657l3010m1973J1290r119K4044L7284K8040l0529j9375
17416F1756n2131P683J6230K5966r882m0733j8450K2921l556P827K4502J9037
17404F1170j2351j3103l9682k8037P3l2439j1912O6154O8580j901j9623l8764
17392a835k11j6762j1955L3146L395J5765K7140o542j2555J4301n198k9873j6914
17379h098n5221j6859K1201Q6330K4364m4817o1152k7463K144K5829j541K0241
17367c5042N0360K9504K6590K1697j5924n1499l3546K174J342L4733J0437m1617
$$ plain form
17452 33608 18690 7709 51219 103646 132975 169622 259862 332965 387855 423851 365186 246985
17440 246985 191901 94041 22730 24864 15194 14295 -12167 56087 115477 102517 66469 31957
17428 31957 -1601 19447 95104 62094 20121 31411 22292 46336 83620 111660 81131 61756
17416 61756 9625 17308 33538 59504 49622 8889 -9561 13360 9804 17631 42133 61170
17404 61170 48819 35716 -3966 -32003 -31930 -64369 -76281 -10127 58453 56552 36929 -1835
17392 -1835 -2046 -18808 -30763 2383 5778 21543 48683 42141 29586 43887 38689 8816 -8098
17379 -8098 -63319 -80178 -58977 27353 51717 6900 -54252 -81715 -79571 -53742 -55283 -35042
17367 -35042 15318 44822 71412 93109 77185 25686 -7860 -5686 -4344 30389 40826 -791
17355g91J1088K4214r638J7315l688p268M302N163J1843o161K6692J0482m2449
17342D1104l3465k6155Q44N3088j3724P454J8859L216J2326q811k4718k8378k1683
17329b0043l5822K8932J8834n772J3976K4355K9235k144l3785o4945L1322L6470
17317B0613k2418n4631l0269M5793P7323J9701q511l3220m2612l1446J0256O4706
17305A5285L8328p021N415M7336O556j2544j7984n7344q651L7736L086m6253j849
17292B096M051q479m029L831m911p469J2042L5022j8219k3925j9625P791K0013
17279a811j0590R646O1038Q527j7754K2841p362o2632k5594K5978K9538J0064
17267D1889l7417J5116q255l3462K4900M603k5715M984K1537l424J6553J8877
$$ plain form
17355 -791 10297 34511 24873 42188 38500 31232 35534 40697 52540 46379 73071 83553 41104
17342 41104 7639 -18516 -17672 35416 21692 29146 48005 51221 63547 54736 30018 1640 -20043
17329 -20043 -55865 -26933 -8099 -13871 105 24460 53695 51551 17766 -47179 -15857 20613
17317 20613 -1805 -56436 -86705 -40912 36411 56112 47601 14381 -28231 -59677 -49421 15285
17305 15285 53613 46592 52007 99343 105899 93355 75371 18027 9376 47112 50198 3945 2096
17292 2096 6147 -2332 -6361 -2530 -7441 -14910 -2868 32154 13935 -9990 -29615 -21824 -1811
17279 -1811 -12401 -2755 58283 66810 49056 71897 64535 1903 -23691 2287 31825 41889
17267 41889 4472 19588 11333 -22129 2771 7374 -18341 -13357 8180 4756 21309 40186
17255D0186m591m8p139k7786k1408l8681m1238K4543K5698j0479L2072n082k2068
17242e6021M9824N3394l5465l0538k1393l1761k4447M095J7100M1368L2337K9967
17230B8460P614J658L1653K8452m5573k6718k2573j9349j5140M3180K5827k1624
17218A5867j3870J8662j8913l6130O856r022K0299N295P718L2102q235j4238J6575
17205B2966L3140m328k7516J0724J1142M860K2119m8122m7273k4077l5714m6128
17193a28207M5891Q0871L6646j5714j4974k3029q249N6006L4095j3341j5469J2553
17181D7079n6402K4200P3380J9000j4105j7433n6950l9389K0923L8579p706l6740
17169e564K1942O0459j1123j7807M0168l3059k0812p1888m7570P5024M616j168
$$ plain form
17255 40186 35595 35547 28408 622 -20786 -59467 -100705 -76162 -50464 -60943 -28871 -33953 -56021
17242 -56021 -6197 47197 11732 -18806 -40199 -71960 -96407 -92312 -75212 -33844 -1507 28460
17230 28460 36074 37732 69385 97837 52264 25546 2973 -16376 -31516 11664 37491 15867
17218 15867 1997 20659 1746 -34384 -27528 -36550 -16251 -10956 -3238 28864 20629 6391 22966
17205 22966 56106 51778 24262 34986 46128 50988 73107 24985 -22288 -46365 -82079 -128207
17193 -128207 -82316 -1445 35201 19487 4513 -18516 -26765 29241 63336 49995 34526 47079
17181 47079 -9323 14877 88257 107257 93152 75719 18769 -20620 303 38882 31176 -5564
17169 -5564 16378 76837 65714 47907 88075 55016 34204 -37684 -85254 -10230 -5614 -6782
17157f782M6032L6663k51q65J6200o095o6155j868N9296j2531m792j0041j9066
17144B9745M660r040O2160p236L992k8433n6616N7560K3114l7438k9280M625L8214
17131E6027k2879m4799M0929L9802n2310K0631J8573j4921N43J1142K3773l845
17119G2666l6209L5650r288L7119q920k6695l7263n0956P160k0483K4681M140
17107h398n0158O493M1653K3531J2253N4731j5240q094L3121k3258l5385O685
17095C7934K6324l4885j4515L7610Q951j6587n2221j2319O2547K744L8404N1877
17083A35864l6612k3375J4692l0266o2506J7783K0131J409j6964j5325K5936L1959
17071F2726O748L000k5197n1160k2589J0484p310J5757J7113o2044k1292K3477
$$ plain form
17157 -6782 39250 75913 75662 74797 90997 84902 18747 16879 76175 63644 58852 48811 29745
17144 29745 34405 25365 87525 80289 84281 55848 -768 56792 79906 42468 13188 17813 56027
17131 56027 33148 -11651 29278 69080 16770 37401 55974 41053 41596 52738 76511 72666
17119 72666 36457 72107 62819 99938 91018 64323 27060 -23896 -16736 -37219 -12538 -8398
17107 -8398 -58556 -52063 -10410 13121 25374 80105 64865 56771 89892 66634 31249 37934
17095 37934 64258 29373 14858 52468 61419 44832 -7389 -19708 42839 45583 83987 135864
17083 135864 99252 75877 90569 60303 -2203 15580 35711 37120 20156 4831 30767 62726
17071 62726 69474 72474 47277 -3883 -26472 -15988 -23298 -7541 9572 -52472 -73764 -50287
17059e0287l2059N6655N7061O424M912j1118j3219N0702P995k7398k444j464m1439
17046D321l9229M5853l43J7016j8127l8914m983O709N9147L7287m271m7074J1318
17033B8710M3860J9218l4156j0828q301q053l1875k2246k1136K5339K2252J2172
17021A4956j3884l7551l4792j3756K4779N4197L2570J9392n3207l7129K2032J3462
17009h931M046O24J007K4521n778O238L9534P587k8755o2878l7444L3552J8884
16996g793P6225l6373o5460o245K9306J4243J6001m668l6628R331K9251J0815
16984B8005M4834K1812j6802j8923j1317j0602m7044k3344j3190L1022L5140L3543
16972E3134J673j9707n412j6153m6677K3428Q611j7515j6495p311L055J5257L0234
$$ plain form
17059 -50287 -82346 -25691 31370 37794 42706 31588 18369 69071 77066 49668 47224 45760 4321
17046 4321 -34908 10945 10602 27618 9491 -29423 -34406 -27697 31450 68737 64466 17392 28710
17033 28710 72570 91788 57632 46804 38503 30450 -1425 -23671 -44807 -19468 2784 14956
17021 14956 1072 -36479 -71271 -85027 -60248 -6051 26519 45911 -7296 -44425 -22393 -8931
17009 -8931 -4885 -4261 -3254 21267 15489 21727 61261 68848 40093 -22785 -60229 -26677 -7793
16996 -7793 68432 32059 -33401 -39646 -10340 3903 19904 15236 -21392 -12061 17190 28005
16984 28005 72839 94651 77849 58926 47609 37007 -10037 -33381 -46571 -15549 19591 53134
16972 53134 54807 35100 29688 13535 -33142 -9714 -1103 -18618 -35113 -42424 -39369 -24112 6122
16959F122j681J1409J0159l6525m9282K9379L996r784m3069R967N5389J2054J01
16946a765J0462j081k7943j6947j8648n9583L5167K8234J5310J5787K75O6245
16934D5513M0322m038l104l2345o0552l4739L6631L2055j8078k4806j8889K2885
16922a9145K9467l3395l3586J2303L6837L9737P522l0925R379J1989L3930P302
16910G1415l0899k1039J0109k915l3678J3291L0440J1608j9985J5709R863j0191
16898D3728q061j0700Q082n6000n819N3288J546J5436j3672j2947p218j3895R17
16885e315J3925R401j024J7466j7899m6711l7231l498k1818k2040N7649M2655
16873a4440J7264K0167l9276k9926L3179M01l3081l5024J2089K5751M0874l783
$$ plain form
16959 6122 4441 15850 26009 -10516 -59798 -30419 -26423 -36207 -79276 -69309 -13920 -1866 -1765
16946 -1765 8697 7616 -20327 -37274 -55922 -115505 -80338 -52104 -36794 -21007 -20732 45513
16934 45513 85835 81797 78693 46348 -14204 -48943 -12312 19743 1665 -23141 -42030 -19145
16922 -19145 10322 -23073 -56659 -44356 -7519 32218 39740 8815 18194 30183 64113 71415
16910 71415 40516 19477 29586 26671 -7007 6284 36724 48332 28347 44056 53919 43728
16898 43728 35667 24967 33049 -22951 -28770 24518 26064 41500 27828 14881 7663 -6232 -5315
16885 -5315 8610 18011 16987 34453 16554 -30157 -67388 -70886 -92704 -114744 -57095 -14440
16873 -14440 2824 22991 -16285 -46211 -13032 -12631 -45712 -80736 -68647 -42896 -2022 -5805
16861e805P531K3434j0145j8227N899L4070m2143k3764j9143K1097M118o622K8567
16848a133l5442m7049L6319N0860K3555m3120O550j6150j9811P883j3883J4906
16836c6515k6549M290O7413j3522j5173R796J3178J2240o4136N523K8411L6556
16824B1512r480m2765k1517J1316K628k8355o231r700J1496N4867J0983j1701
16812a6947k949k620j6194J9332L6893L9553k822m0249r516R459J2080o324j6273
16799C423j2412k3451m7261M2375K6147N99P2542J0580k8491J7016l7330m3281
16787a9544k7160j539L3511l0258j8566Q283L4762R277m19K1290P533O82k0424
16774b572k7779N1172K9411J3927l3451Q679K1322K0511j7157l8414O0707M1194
$$ plain form
16861 -5805 1726 25160 15015 -3212 2687 36757 -5386 -29150 -48293 -27196 -23078 -29700 -1133
16848 -1133 -36575 -83624 -47305 3555 27110 -16010 -9460 -25610 -45421 -37538 -51421 -36515
16836 -36515 -63064 -58774 8639 -4883 -20056 -10260 2918 15158 -48978 -43455 -15044 21512
16824 21512 12032 -30733 -52250 -40934 -38306 -66661 -72892 -82592 -71096 -16229 -5246 -16947
16812 -16947 -19896 -22516 -38710 -19378 17515 57068 54246 13997 4481 13940 26020 19696 3423
16799 3423 -8989 -32440 -79701 -37326 -11179 -10580 61962 72542 44051 61067 23737 -19544
16787 -19544 -46704 -48243 -14732 -44990 -63556 -55273 -20511 -11234 -11653 9637 17170 17852 -2572
16774 -2572 -30351 20821 50232 64159 30708 39387 60709 81220 64063 25649 86356 127550
16762A27550m7398p5168j1738j239N884K3864L7276L391J7090p637q9669l2923
16750e0717L6723K2678K3347J830k066L7505l1324n3032l8602j1746m735L9940
16738c0199L1698m9765m1077K6186O539O4802J364M245J9770q090m0116k2347
16726c6990m5472m389R4725J2290l9708L4464K3500o8883J8867N9121m347M0219
16714H3397k5576k2292m7721j7994K7318L7642j6650k3639J2602q206j3329L7197
16702B2749J531l4251J0145j7152k0797J7471J0704J3721J9928n7421m457O7439
16690B9610k6563l0461L734K8193J1047o0631K736L7773r301k2781K988M4947
16678A1291M9530R554k0497J1204p27j5073q702k9355L239j7399J3459L7423J6055
$$ plain form
16762 127550 80152 4984 -6754 -7993 -2109 21755 59031 62422 79512 71875 -17794 -50717
16750 -50717 -13994 8684 32031 33861 31795 69300 37976 -15056 -53658 -65404 -70139 -30199
16738 -30199 1499 -48266 -89343 -63157 -56618 8184 9548 13793 33563 25473 -14643 -36990
16726 -36990 -82462 -86851 7874 20164 -19544 14920 38420 -30463 -11596 47525 43178 83397
16714 83397 57821 35529 -12192 -30186 -2868 34774 18124 -5515 7087 -1119 -14448 22749
16702 22749 24280 -9971 174 -16978 -37775 -20304 -9600 4121 24049 -33372 -37829 29610
16690 29610 3047 -27414 -23680 4513 15560 -45071 -42335 -4562 -13863 -36644 -33656 11291
16678 11291 60821 70375 49878 61082 60355 45282 36580 7225 10464 -6935 6524 43947 60002
16665F0002k0495L625K7091P696k3060M229k4671m9628j0202L1144K919k6479
16653a7829K8164M3176j6098m7303l6944M1358L0188L823n156j8860J0249P061
16641B1829j5959J1219J1191k5528K5761k3353l7038m3921M320K3220L6176p135
16629a9218L2372l570K4662N698m8406j6238j1587M99K3228M4876j6900j3779
16617A637k484l5583L2577J1675j491M4098k6214o5282l2777R790J2808l7109
16605h8355q32M1823L4449Q818k745j8751q471k6923l1866k77J334M0100J5664
16592c6032J5109j738q983L901K9558j6796j328J3588k952l7266J5455L9239J5531
16579B7286M013k2831m1609j4449M2566P859K054j5461m6590J3801L6580P1933
$$ plain form
16665 60002 39507 43132 70223 77919 54859 59088 34417 -15211 -25413 5731 8650 -17829
16653 -17829 10335 53511 37413 -9890 -46834 -5476 24712 28535 23379 4519 14768 21829
16641 21829 5870 17089 28280 2752 28513 5160 -31878 -75799 -71479 -48259 -12083 -19218
16629 -19218 13154 9584 34246 39944 -8462 -24700 -36287 -35788 -12560 32316 15416 1637
16617 1637 -847 -36430 -3853 7822 6331 50429 24215 -41067 -73844 -64054 -51246 -88355
16605 -88355 -89187 -47364 -12915 -4097 -6842 -25593 -34064 -60987 -92853 -93130 -91796 -51696 -36032
16592 -36032 -20923 -22661 -31644 -27743 1815 -14981 -16309 -2721 -5673 -42939 -27484 11755 27286
16579 27286 31299 8468 -33141 -47590 -5024 2835 4889 -10572 -57162 -43361 -6781 65152
16567F5152j4702k4071q1400m3226l233L5677O6083m673L434k5730m9795r379
16555h5863N4132Q102M4085j2164k451q365m2920M8616K8905J8535k1553L640
16543C2699k4553J6270r370n3640j2401N8404L5904n9010j0795O864J1192M229
16531d207Q618J026k0057l8476K4001L5413K65L106p4778m0144m852j1271K2706
16518i8650P662m188o788N1283L6732J1727j2689M3111M6732m1443j4902K5362
16506D3949m6340L22L9386m7929j1804j3498n3480l7564K8982M3696K8239J7466
16494h575j9937N057k3354J2409L3078M9619j417n7391n818L9504n715k6886R057
16481c69j4495l4215M436j5897J9626l8701n630J1928Q2175M5772m1475j993k9006
$$ plain form
16567 65152 50450 26379 -55021 -98247 -101480 -65803 280 -4393 -959 -26689 -76484 -85863
16555 -85863 -31731 -23629 20456 8292 5841 -2524 -45444 3172 32077 50612 29059 32699
16543 32699 8146 24416 15046 -38594 -50995 7409 43313 -15697 -26492 -19628 -8436 -4207
16531 -4207 4411 5437 -14620 -53096 -29095 6318 6583 9689 -65089 -105233 -110085 -121356 -98650
16518 -98650 -90988 -95176 -101964 -50681 -13949 -2222 -14911 28200 74932 33489 18587 43949
16506 43949 -2391 -2069 37317 -10612 -22416 -35914 -89394 -126958 -97976 -54280 -26041 -8575
16494 -8575 -28512 -23455 -46809 -34400 -1322 48297 46880 -10511 -16329 23175 17460 -9426 -369
16481 -369 -14864 -49079 -44643 -60540 -40914 -79615 -85245 -73317 8858 54630 13155 11162 -17844
16468a7844O39J7377j1800k9648J0407N4752P639j4000j610j4588n873k1277k0284
16455d6110J6510N8380n620p3419J6912k3508j9272K2342k8294r697M2530N0609
16443A363q733r317M244J2045J0312J3970j905o4894j5282j3641J1881J3341K601
16430d4015l443J1236K2978l4069n944O012m2643Q091K3760K054N559P467J2849
16417c0108k5189l3696K1843L2909m213O353J194P786k5930J0735k1987K5959
16405c4344O938l7100j0425L776o54J7282j667N2283r910o2872n1575M0277J2254
16392g5737O558J2474L4955K6275j0708n801k8581p853K9573k6751L8349l158
16380a0405k978J147m1104K4857Q5048K7505n0486l623K1427k6291j7980N0956
$$ plain form
16468 -17844 -17205 172 -11628 -41276 -30869 23883 31522 17522 15912 1324 -4549 -25826 -46110
16455 -46110 -29600 28780 23160 -50259 -33347 -56855 -76127 -53785 -82079 -91776 -49246 1363
16443 1363 -7370 -16687 -12443 -398 9914 23884 21979 -42915 -58197 -71838 -59957 -46616 -44015
16430 -44015 -47458 -36222 -13244 -47313 -53257 -47245 -89888 -81797 -58037 -55983 -50424 -42957 -30108
16417 -30108 -55297 -88993 -67150 -34241 -38454 -32101 -30907 -23121 -49051 -38316 -60303 -34344
16405 -34344 -27406 -64506 -74931 -71155 -71809 -54527 -56194 -3911 -13821 -76693 -128268 -87991 -75737
16392 -75737 -69179 -56705 -21750 4525 -6183 -11984 -40565 -48418 -18845 -45596 -7247 -10405
16380 -10405 -13383 -12236 -53340 -28483 56565 84070 33584 29961 51388 25097 7117 58073
16368E8073j2096k4058l4267k4236k9106K2106O3394O438o482k1295R995K3870
16356C2336M9863l869L9509j2860n0368n1809l2210M6537q173K2786O207k3632
16344A4317l75k2455M410K0145J1095j5300j9351K3990m951K525L2540m1K4431
16331G0980l7333n8663o0627J0775N4472J9689j984n7996m7841K4592K2506N5877
16319e553m3384O696Q090K4110M2516L4232k6870j9883j1866K6057J3332l0995
16307A6482m6521j3817O2184k7169r4745m8032o1M1898K5418K4544k3079J508
16295h1390O6K2316O9207O9147J6733j8924n618j7380J6329J827l6574n366k7420
16282B953m0669j8202K4823j0247R300L2301J8297j1010o07m2381j333J9318J2276
$$ plain form
16368 58073 45977 21919 -12348 -36584 -65690 -43584 19810 26248 19766 -1529 8466 32336
16356 32336 82199 78330 117839 104979 54611 2802 -29408 17129 8956 31742 37949 14317
16344 14317 13942 -8513 -4103 16042 27137 11837 -7514 16476 11525 14050 46590 46549 70980
16331 70980 33647 -25016 -85643 -74868 -20396 -707 -2691 -60687 -108528 -83936 -61430 -5553
16319 -5553 -48937 -42241 -34151 -10041 32475 66707 39837 19954 8088 34145 47477 16482
16307 16482 -30039 -43856 18328 -8841 -103586 -151618 -151679 -109781 -84363 -59819 -82898 -81390
16295 -81390 -81324 -59008 10199 79346 96079 77155 71537 54157 70486 72313 35739 30373 2953
16282 2953 -37716 -55918 -31095 -41342 -32042 259 18556 7546 6939 -35442 -36775 -17457 -5181
16269e181R466k7214J7291j2026r29K505K7596m0305o6031K0140M2847m431L6822
16256E50J4351J3688J389n5540k2878M2179J0281k5736k3672M588j1185O936k1422
16243f6471m5767n8749N0255P1536k0094n9173M0125K7161K5164N0384L4488J0903
16231E9762k9576j007l410M895n0192L2307p250l5000j4224l3030j4635J2299
16219g9061L2939M8650K8386j2108l5100k0369j632J7706K1429M018k1934k3874
16207d0950K575K4309J2420k2865k3779r581p957K7000J4004m031L3424j4805
16195a0236L296j4351K780r372m6050J3127L5603L740K7743m194k2062L36k724
16182b2364K4040J3232N047l2702N133M8193L4599l9472l388O0592p1314m5732
$$ plain form
16269 -5181 4285 -22929 -5638 -17664 -18593 -16088 11508 -28797 -94828 -74688 -31841 -36272 550
16256 550 14901 28589 29978 -25562 -48440 -6261 4020 -21716 -45388 -40800 -51985 -45049 -66471
16243 -66471 -112238 -170987 -120732 -49196 -69290 -128463 -88338 -61177 -36013 14371 48859 59762
16231 59762 30186 29179 25769 30664 -19528 12779 5529 -29471 -43695 -76725 -91360 -79061
16219 -79061 -46122 2528 30914 18806 -16294 -36663 -38295 -20589 840 4858 -17076 -40950
16207 -40950 -38375 -14066 -1646 -24511 -48290 -57871 -65828 -38828 -24824 -28855 4569 -10236
16195 -10236 -6940 -21291 -18511 -27883 -73933 -60806 -25203 -21463 6280 2086 -19976 -19640 -22364
16182 -22364 1676 14908 19955 -12747 -7614 40579 75178 35706 32318 92910 21596 -24136
16170b4136L0226j6532l7061P668J2374R843l339L4007O4083P331r631J1135l3415
16157E2553m2646N465k3163m6481l3800N0973L8436K6660J7296j7850o8116Q83
16145c9790P794J4944J5786M0234M3529N706o3930n3227l5972O323L5132K5014
16133A543P77n8542k816J1812O8394J4074n6864K1393m608j1665J5456Q874j8646
16120a0818m0259q409K3323k4323L1702N0738N1443j308m1614K271j4993k5265
16108g512K680O296K4605k8141k0193R414J5775M790l2666N5735L4131J0662J3753
16095H9329j04673N75K9894k142n7001O398K7231l5431K1234L9981J5615J0379
16083D1389j3074m5514k0674K20J3416n096j8256M6951L2463P001l9196m8067
$$ plain form
16170 -24136 6090 -10442 -47503 -39835 -27461 -17618 -20957 13050 77133 84464 74833 85968 52553
16157 52553 9907 15372 -7791 -54272 -88072 -37099 1337 27997 45293 27443 -40673 -39790
16145 -39790 -31996 -17052 -1266 38968 82497 88203 24273 -28954 -64926 -58603 -23471 1543
16133 1543 2320 -56222 -59038 -47226 21168 35242 -21622 -229 -4837 -16502 -1046 7828 -10818
16120 -10818 -51077 -59486 -36163 -60486 -28784 21954 73397 72089 30475 32746 17753 -7512
16108 -7512 -4832 1464 26069 -2072 -22265 -12851 2924 7714 -24952 30783 64914 75576 89329
16095 89329 -15344 -14769 15125 12983 -44018 -37620 -10389 -45820 -24586 15395 31010 41389
16083 41389 28315 -17199 -37873 -37653 -24237 -29333 -47589 -638 31825 38826 -370 -48437
16071d8437J1601j6387j9339n0860J8601j8704N2188N9623L5260j616K4712K6097
16059G2739j78J7258j8493m0342o235q022K0738K8962j0462k6104O736l6562k8048
16046b8013O743J4112N0265m2380l2206M4022N432j9537n963j3562Q27R0108j37
16033F9711k6848k9096j3404N807K1258Q436l5728k541L6772k4898l5728k272
16021b8531L4128m7376j7953P0020k0542n7498l6853K4374J9585K5198L8323j4012
16009a1137k6719O2088M1964j532n1571l7579k1883M6401J9245R737m593j4266
15997A0155N777l6620K8001n0668k2555J6373K4214j6169L1139L8300Q611l197
15985C3361l2564K324p544l2312N245K4985l1009K910j0605J9971L1170k880j7962
$$ plain form
16071 -48437 -36836 -53223 -72562 -123422 -104821 -123525 -71337 -11714 23546 21930 46642 72739
16059 72739 72561 89819 71326 30984 24749 16727 37465 66427 55965 29861 36597 35 -28013
16046 -28013 -21270 -7158 43107 727 -31479 12543 17975 -1562 -7525 -21087 -20260 69848 69711
16033 69711 42863 13767 363 6170 27428 35864 136 -2405 34367 9469 -26259 -28531
16021 -28531 5597 -41779 -59732 10288 -10254 -67752 -104605 -80231 -60646 -35448 2875 -11137
16009 -11137 -37856 24232 66196 64664 13093 -24486 -46369 32 19277 29014 24421 10155
15997 10155 15932 -20688 7313 -43355 -65910 -49537 -25323 -41492 -10353 27947 36558 33361
15985 33361 797 3121 -4423 -36735 -31490 -6505 -37514 -34604 -45209 -25238 5932 3052 -14910
15972a4910O2878L2505p014j107o3107o2937l929l4985R418P790L3120K06M414
15959c7658J204N099J1289j9111K2765k3663J4299l9790k2529r167J0449q369
15947i5182k8452K9136L8561k2046k8799N8055M5235J3277j6187K545k2253j5873
15935d1983j7566L694J4697k5694k6235o9548K8484P7262K4014m6902l8587J1682
15923a06682J1370M2902J3424J2765r255m8399j2139O7745P2213K0143k0361K0997
15911F4723J7697J7079l5518j6328k5361j6938q3629N558L2912M5778P575k4330
15899a0782m360j672Q061J0425J1873K5752l7344j4628K8808k5614K2821N7940
15887G1280q875r849K3024n4539k3504K2791k4942n9334Q076O5353L594J8384
$$ plain form
15972 -14910 47968 80473 73459 72352 9245 -53692 -57621 -92606 -83188 -75398 -42278 -42072 -37658
15959 -37658 -36454 -31355 -20066 -39177 -16412 -40075 -25776 -65566 -88095 -97262 -86813 -95182
15947 -95182 -123634 -94498 -55937 -77983 -106782 -48727 -3492 9785 -6402 -3857 -26110 -41983
15935 -41983 -59549 -55855 -41158 -66852 -93087 -162635 -134151 -56889 -32875 -79777 -118364 -106682
15923 -106682 -95312 -52410 -38986 -26221 -35476 -83875 -96014 -28269 43944 64087 43726 64723
15911 64723 82420 99499 63981 47653 22292 5354 -78275 -72717 -39805 5973 13548 -10782
15899 -10782 -15142 -16814 -8753 1672 13545 39297 1953 -12675 16133 -9481 13340 71280
15887 71280 62405 52556 75580 21041 -2463 20328 -4614 -63948 -55872 9481 13075 31459
15875C1459K6782m0438p60k8633j9586L9235N4239j3265l8407Q824n861k6259
15863a2670m157J3810J1163j7205j5075O021K6531j4378k5217K3736K1909O356
15851B0824m4630k9668K638j889k2760J9397Q970j7889k0482J3583Q8843j9334
15839b397m592l193l2288k6347L4486r001P597J3544n4494j6343P0793Q1054l1956
15826B6863j2910J8095o412m0778M457l437m3930l65K7678J2698J3996L206m4017
15813d4856k4312K5813L5296J4013R019k4978l7472q081J2008m3990K440K9814
15801e5286O5269N2597j9091k951N797k578k0098k28o149m6183J0860k5606n0488
15788i4135j7274K0973K8002R674k2111K3999L2442o3916m863O696O2174M6815
$$ plain form
15875 31459 58241 17803 17043 -11590 -31176 8059 62298 49033 10626 19450 13589 -12670
15863 -12670 -16827 -3017 8146 -9059 -24134 -18113 8418 -5960 -31177 -7441 14468 20824
15851 20824 -23806 -53474 -50836 -52725 -75485 -56088 -47118 -65007 -85489 -71906 16937 -2397
15839 -2397 -6989 -10182 -42470 -68817 -34331 -43332 -35735 -22191 -76685 -93028 -22235 58819 26863
15826 26863 13953 32048 25636 -15142 -10685 -14122 -58052 -58417 -30739 -18041 -4045 -839 -44856
15813 -44856 -69168 -43355 -8059 5954 14973 -10005 -47477 -55558 -43550 -87540 -85100 -55286
15801 -55286 9983 62580 43489 40538 46335 43757 23659 23431 17282 -28901 -18041 -43647 -94135
15788 -94135 -111409 -90436 -62434 -52760 -74871 -50872 -18430 -82346 -87209 -80513 -18339 28476
15776B8476K6529J209k0031p3486l8791L8357O4966l3002k6309k2247m9569J9273
15764h4625J8846K232J6953o368m6134l8464K899R773p749l031M6636J2486M2014
15751c4532K4137K0137m6862k7044L5608J4565j7202P541j0021p4746J0455K8271
15739f9693O9794J9350m8981m3533O155j0390j3187M1908k944k3015K7567J3231
15727c3738j285j7791J5167K2259M646k5686r766K9488n7468K4780Q6480o197
15715C0889n5314K5174r591j670J9677J5536Q177L8496r717k9430J8955k9368
15703B1814R35k632q220N691K596L1884l9964j843k8533O72p090L3251J5854n273
15689A9142j5479K8809J7332q020l4238l9769J0633Q928J820o854j247N68L4134
$$ plain form
15776 28476 55005 56214 36183 -37303 -76094 -37737 27229 -5773 -32082 -54329 -103898 -84625
15764 -84625 -65779 -63547 -46594 -52962 -99096 -137560 -134661 -124888 -132637 -135668 -89032 -76546 -34532
15751 -34532 -10395 9742 -37120 -64164 -28556 -13991 -31193 -23652 -33673 -108419 -97964 -69693
15739 -69693 101 19451 -29530 -73063 -66908 -77298 -90485 -48577 -51521 -74536 -46969 -33738
15727 -33738 -35023 -52814 -37647 -15388 -10742 -36428 -46194 -16706 -74174 -49394 37086 30889
15715 30889 -24425 749 -8842 -10512 9165 24701 32878 71374 61657 32227 51182 21814
15703 21814 22749 20117 11897 17588 20184 52068 12104 10261 -18272 -17600 -24690 8561 24415 19142
15689 19142 3663 32472 49804 41784 7546 -32223 -21590 -12662 -10842 -17696 -18943 -18375 15759
15676A5759N6809J7803n8440o2175n813K8985l98o641k2518k3985n644l3332J3012
15663h6578K5712M7320K814j304L750l0555m1760L68L2378M0304Q524R417l6948
15650b6558o469N915M8129M2049k4224n0969k747K3606n1481J3541K9360p736
15638g584k2654L5967J3971l402j956j8080n032l6221K7769R534o275j5583n918
15625c5464K2462K6674l5882L4589j95j721K5430j6169n8504k011m9415m5438
15613a35644M8093N2967J6951L4428J4442m1869j6341J6134M497j326J4478k4088
15601a7278j5859M344R755J0779j2575K928j4090Q96k034l1210l344J5084O912
15588d5692J6001P37O438j741L2255J9320K332j2799l3591k4676O0368r313M532
$$ plain form
15676 15759 72568 90371 31931 -30244 -36057 -7072 -7470 -14111 -36629 -60614 -66258 -99590 -86578
15663 -86578 -60866 -13546 -10732 -12036 -8286 -38841 -80601 -80233 -47855 -7551 973 10390 -26558
15650 -26558 -33027 -27112 21017 63066 38842 -12127 -14874 8732 -42749 -29208 152 -7584
15638 -7584 -30238 5729 19700 16298 14342 -3738 -8770 -44991 -17222 -7688 -13963 -29546 -35464
15625 -35464 -13002 13672 -22210 12379 12184 10463 35893 19724 -38780 -40791 -90206 -135644
15613 -135644 -87551 -34584 -17633 16795 31237 -10632 -26973 -10839 -6342 -7668 6810 -17278
15601 -17278 -33137 -28793 -19038 -8259 -20834 -17906 -31996 -31100 -33134 -64344 -67688 -52604 -45692
15588 -45692 -29691 -28954 -22516 -24257 7998 27318 29650 16851 -16740 -41416 18952 9639 14171
15575A4171M5203l2532o6329l6537K2308K3318M98M3535O5433J461p2644p93o508
15562E84p784j4211L1948o865P035j9189M3098M5182l8332o6441K8366L179Q79
15549G449j6469m885M9598L1129j8514k7462n948J2543k0932J431j4050l2947
15537c9057K21j8705r177j8854k187j121p767k9629J5500M6499R9451N3266k5745
15524F2695k9869n379m6788L0442M6755R324j4648k9386r099m0473L0991K2812
15512B7377l2895J7893p344l0594J9374p561R270O0981O032m3778J8564K5512
15500F2831P03j0493l4137m2602k8996l0878J8371J2286L7704j3542l3230K6596
15488c5387L1677K2318l9496j0790K0305l0613l4532o5508K4988L3741N1500J1515
$$ plain form
15575 14171 59374 26842 -39487 -76024 -53716 -30398 -29900 13635 79068 80529 7885 7092 584
15562 584 -7200 -21411 10537 3672 10707 -8482 34616 79798 41466 -24975 3391 6570 7449
15549 7449 -9020 -13905 35693 66822 48308 20846 14898 27441 6509 7940 -6110 -39057
15537 -39057 -38836 -57541 -66718 -85572 -87759 -88880 -96647 -126276 -110776 -64277 35174 88440 62695
15524 62695 32826 27447 -19341 11101 57856 67180 52532 23146 14047 -26426 4565 27377
15512 27377 -5518 12375 5031 -25563 -6189 -13750 -4480 56501 62533 18755 37319 62831
15500 62831 63534 53041 18904 -23698 -52694 -83572 -65201 -52915 -15211 -28753 -61983 -35387
15488 -35387 -3710 18608 -20888 -31678 -11373 -41986 -76518 -142026 -117038 -83297 -31797 -20282
15476b0282k2153j7582j0502o3259K3438N4464J6682K4948J0106j6295m8869J6288
15464e3016M4387K8648j6578l4856L2322L377L2496j3548P150L3069R00k3665
15452D0686k9883M398k0779k4051N613K6594K3525J4270L692o4861j3908J9167
15440a5537J214m8258j4154k8226M6227L9316p51K0141Q727k2639l6030l1925
15428h1895p554K1165L1663J9730J0535k1682K0374R210J988l2400k4653k0604
15416g4123j4319k9340J564L762n645j7762M1202K4022L1476N0059L587R30J08514
15403A23927k8970k5446j5984n2169k760k4849L0109p224l5849J2539J8895j376
15391i157r67O922k8928j672K4546K3500j4931l2269j621k8887l9506R40K4750
$$ plain form
15476 -20282 -42435 -60017 -70519 -133778 -110340 -55876 -39194 -14246 -4140 -20435 -69304 -53016
15464 -53016 -8629 20019 3441 -31415 907 4284 36780 23232 30382 63451 64351 40686
15452 40686 10803 15201 -5578 -29629 -24016 2578 26103 40373 44065 -20796 -34704 -15537
15440 -15537 -14323 -62581 -76735 -104961 -58734 -19418 -20169 -28 8699 -13940 -49970 -81895
15428 -81895 -89449 -68284 -36621 -16891 -6356 -28038 -7664 1546 3534 -28866 -53519 -74123
15416 -74123 -88442 -117782 -116218 -112456 -118101 -135863 -94661 -70639 -39163 10896 14483 15413 123927
15403 123927 94957 69511 53527 1358 -1402 -26251 3858 -3366 -39215 -26676 -7781 -9157
15391 -9157 -10124 -3202 -32130 -33802 -9256 14244 -687 -32956 -34577 -63464 -102970 -102030 -77280
15378g7280K6105p946m5475n4795N4863L8418M416k6178K3263q304r8J8111J9749
15365c5151K6078J5843j2307q028J3433k0001J968M570n4337J0826O535j4954
15353f5525L0987L4537k1990N027N2468j7007j9019j1052L5720J3612k6197j4358
15341b797p6530k0640J2097j4163r407j4719R180N0455M056l096L4000m233k5879
15328f1676k6988J0302J7026L8543K9841m663j7347K6049j7981k7568j734k5333
15316f1529M7120K3632J5193l6457O73K2320j5008o4834m9903J5438J0564k9365
15304a22156K2123M2143J5012k7043j9477K9593L3718P309J4391M3462Q857l7892
15292A0040m7075l0274k0648m555N4013L5733K6957J3877j926o254m697m1674
$$ plain form
15378 -77280 -51175 -59121 -104596 -159391 -104528 -66110 -61694 -87872 -64609 -72913 -73011 -54900 -35151
15365 -35151 -9073 6770 -5537 -13565 -132 -20133 -18165 -13595 -67932 -57106 -50571 -65525
15353 -65525 -34538 -1 -21991 -16964 35504 18497 -522 -11574 24146 37758 11561 -2797
15341 -2797 -79327 -99967 -87870 -102033 -111440 -126159 -116979 -66524 -62468 -65564 -31564 -35797 -61676
15328 -61676 -88664 -78362 -61336 -22793 7048 2385 -14962 11087 -6894 -34462 -36196 -61529
15316 -61529 -14409 9223 24416 -12041 -11368 10952 -4056 -68890 -118793 -103355 -92791 -122156
15304 -122156 -100033 -57890 -42878 -69921 -89398 -59805 -26087 -18778 -4387 39075 47932 10040
15292 10040 -37035 -67309 -87957 -92512 -38499 -2766 24191 38068 36142 29888 25191 -16483
15280a6483l7786N23l258m3762n5489l3235O6232K3318L6243J7012L6230L774
15268f681k5742l4518j4265p966J317K9039J5109M372m5303k5664L7652M5106
15256b7544k638K1704k835J1860K7399J2731k9393k4144J7058K7891j7317r3821
15244g9049j3633L2319k2414L3557J1435L4424K5467q338m828l2008K8668L8819
15232D4419n905M5724Q913o4962k4846J3167K22N111l8820n3738j1545l7849r2
15219a20201P1797j4653k9872L3089j8494k9094O0927O817n5268J7892L9159q513
15207d6414L1198j870j7670M0491J5161n4187l4901k4191M1284Q177k2648j007
15195f6577m5041l7648K5263K7101j6400J7717O0326L4130n7623m6370k3330M1987
$$ plain form
15280 -16483 -54269 -53746 -57004 -100766 -156255 -189490 -123258 -99940 -63697 -46685 -10455 -6681
15268 -6681 -32423 -66941 -81206 -89172 -87855 -58816 -43707 -39335 -84638 -110302 -72650 -27544
15256 -27544 -30182 -8478 -11313 547 27946 40677 11284 -12860 4198 32089 14772 -79049
15244 -79049 -92682 -60363 -82777 -49220 -37785 -3361 22106 13768 8940 -23068 5600 44419
15232 44419 38514 84238 93151 28189 3343 16510 16732 21843 -16977 -70715 -82260 -120109 -120201
15219 -120201 -48404 -63057 -92929 -59840 -78334 -107428 -46501 -39684 -94952 -77060 -37901 -46414
15207 -46414 -15216 -17086 -34756 5735 20896 -33291 -68192 -92383 -51099 -42922 -65570 -66577
15195 -66577 -111618 -149266 -124003 -96902 -113302 -95585 -35259 -1129 -58752 -105122 -128452 -86465
15183h6465Q8472M2979q230o3079M1l570j7531K3707J5092k3207J0848J9567K1110
15170A9734K884j7880k1355l0660J5000L2776k3821k8908L9891j288J818j8737
15158c0546k0586L8523k3732m7213o33J1353N3330J9398J1569l9178n0847J1854
15146f6708N1137k1994k0761M3541K3548j1859j9907k3458k6679l4512L1044O9074
15134g534l0987r75M1893J1346j5563m3504o406o08L9329L13j1269M109l9620
15121e9476l7218J9920N2049M3446L7653p311j5353o4231j05514m023O6892M9116
15109b4050K5716n3602j4614r108m8998k4098k3464n399L9078K1462L6465K5705
15097e4907L5412J6544m3972p3885J0357K5978j7159Q892L2424L6287j3385j2641
$$ plain form
15183 -86465 2007 44986 36756 -26323 -26282 -29852 -47383 -23676 -8584 -31791 -20943 -1376 19734
15170 19734 22618 4738 -16617 -47277 -32277 499 -23322 -52230 -12339 -13627 -11809 -30546
15158 -30546 -51132 -12609 -36341 -83554 -84187 -72834 -19504 -106 11463 -27715 -78562 -66708
15146 -66708 -15571 -37565 -58326 -14785 8763 -3096 -23003 -46461 -73140 -107652 -76608 -7534
15134 -7534 -38521 -39496 2397 13743 -1820 -45324 -51730 -52338 -13009 -12696 -23965 -19856 -59476
15121 -59476 -96694 -76774 -24725 18721 56374 49063 33710 -30521 -136035 -140058 -73166 -24050
15109 -24050 1666 -51936 -66550 -75658 -124656 -148754 -172218 -177617 -138539 -117077 -80612 -54907
15097 -54907 -19495 -2951 -46923 -120808 -110451 -84473 -101632 -92740 -60316 -24029 -37414 -50055
15085e0055m591K8350p67k9070q786M1861K032K1095K9355k2994l6272J487K4006
15072d349K7574m2111m0976p2K0933j036J1702L2631M7348k2344m999J0245q037
15059B6509k4906p789l9034j2895j4325L0854j4924k6332J9624J4329R488Q470
15047c0931j9762q801J5550j7183K2854K5315k4332L482M133j7382J1619j1875
15035d7313m1603n2485n277j1513Q851J4872N2298Q072o583J0778K1211N0048
15023A356K532j8263K6607n554j8192K214q637J8207j4238K0584K5918M9257J399
15010H3190j1341o8475n1543j6387k0975P0910o579q888k984J1246J2478q079
14998a7427k1529N4019J7904k0525K5174j6325o9846n6258m4352O361L1280L3783
$$ plain form
15085 -50055 -54646 -26296 -27063 -56133 -64919 -23058 -21026 69 29424 6430 -29842 -28355 -4349
15072 -4349 23225 -18886 -59862 -59934 -39001 -40037 -28335 4296 51644 29300 24301 34546 26509
15059 26509 1603 -6186 -45220 -58115 -72440 -41586 -56510 -82842 -63218 -48889 -39401 -30931
15047 -30931 -50693 -59494 -43944 -61127 -38273 -12958 -37290 -33808 -29675 -47057 -35438 -47313
15035 -47313 -88916 -141401 -146678 -158191 -149340 -134468 -82170 -74098 -80681 -69903 -48692 1356
15023 1356 3888 -14375 12232 6678 -11514 -9300 -17937 270 -13968 6616 32534 81791 83190
15010 83190 71849 3374 -48169 -64556 -85531 -14621 -21200 -30088 -33072 -21826 -9348 -17427
14998 -17427 -38956 15063 32967 12442 37616 21291 -48555 -104813 -149165 -142804 -111524 -77741
14986g7741j9593r157J9154J6585L2015P8504j4774m8928k6264Q621J4693J1447
14974a5438J5571o447j8683m1692l5372J4093j016J9635J8445k090L4297l927
14962b2624m5465l085N1056J9536j8094m342l637M0459l0507p9581l2555M9159
14950g9680Q8106o797O202j2499p381L7049j123k7085R879j0671k7048K9687l6055
14937c7416m3714k0352L4874n689J1494J2856n976l2517J6676J4153k959L8432
14925b0138j5188N7755L9860k7623M534K3694j7412j2586j074k5331P721l817
14913A0395n5440j4067j2152j7991q127L7430J7133K856K7218k0270j6379P737
14901d1657O825J5179K4405K7474M2354J642k1094j5424k7102r4459K4101K4367
$$ plain form
14986 -77741 -97334 -106491 -87337 -70752 -38737 39767 24993 -23935 -50199 -41578 -26885 -15438
14974 -15438 133 -6314 -24997 -66689 -102061 -87968 -88984 -69349 -50904 -52994 -18697 -22624
14962 -22624 -68089 -71174 -20118 -582 -18676 -23018 -26655 13804 -16703 -96284 -128839 -79680
14950 -79680 8426 1629 7831 -4668 -12049 25000 23877 -3208 6671 -4000 -31048 -1361 -37416
14937 -37416 -81130 -101482 -66608 -72297 -60803 -47947 -53923 -86440 -69764 -55611 -58570 -20138
14925 -20138 -35326 22429 62289 34666 39200 62894 45482 32896 31822 6491 14212 10395
14913 10395 -45045 -59112 -71264 -89255 -97382 -59952 -42819 -39963 -12745 -33015 -49394 -41657
14901 -41657 -34832 -19653 4752 32226 74580 76222 55128 39704 12602 -81857 -57756 -33389
14889c3389j6416j6338J4351J0196l7337k2475K1029N4099M5205Q150j6978K3656
14877C3753M557k8831k592J9159J5906j9532j7477J2374j3302l4192q102l2849
14865g1128j6775K7136K9905J14J7622J6758j9155K1624j838j4296J2255j2859
14853a0637j1383j1006J4373K6032m3693m3679L527m411P4362p419l307N4786
14841C7545K2818p7351q369J9447o983j7784J3087J488Q828M4865j2783q024n071
14828A1713j8959k9904Q597J2268J7614k5812j7602j2694M1493Q157j6728Q073
14816a3784K9644m3985o983M0731M0294k4593o5478j8058M0159k0994j2181K1537
14804c3691K5262N168m4703l443K1508L0125K3896n3760J3801l4540m1051k0795
$$ plain form
14889 -33389 -49805 -66143 -51792 -41596 -78933 -101408 -80379 -26280 18925 27075 10097 33753
14877 33753 38310 9479 6887 26046 41952 22420 4943 17317 4015 -30177 -38279 -71128
14865 -71128 -87903 -60767 -30862 -30748 -13126 3632 -15523 6101 4263 -10033 2222 -10637
14853 -10637 -22020 -33026 -18653 7379 -36314 -79993 -76466 -80877 -6515 -13934 -17241 37545
14841 37545 60363 -16988 -25357 -5910 -12893 -30677 -17590 -16102 -7274 37591 24808 16784 11713
14828 11713 -7246 -37150 -28553 -16285 1329 -24483 -42085 -54779 -13286 -5129 -21857 -13784
14816 -13784 15860 -28125 -35108 5623 45917 21324 -44154 -62212 -22053 -43047 -55228 -33691
14804 -33691 -8429 -3261 -47964 -51407 -29899 226 24122 -29638 -15837 -50377 -91428 -112223
14792a12223K4876Q9523K5175Q147l1898m0046q654M345l8673J4849K8547M117
14780c1915n599K3366K0557n8207l0851L3285M2138O563j6733L8233J2928j9784
14768A3981j9668n888k1643n1851M39O5568p929o0980o007M3027M6115m0557m803
14755e0196j4578m254o004J2102L8674N7771O961L559L597j4088n3707L4217K514
14742A6568K2847j8657O582J3436o9665n1608n739K1315L5368L201P499o998J6448
14729i403j8180k145m263r944r935O267M8788j005K9163J4534j2575o0014k1179
14716d9891K8147j9875m5306o122p77p757L9227Q5376K4193q1663n3089L7108
14704e0429L7203j7193P904M5366K2086L815j1427r493J7073q5189j6047L0419
$$ plain form
14792 -112223 -87347 2176 27351 35498 3600 -36446 -45100 -40755 -79428 -64579 -36032 -31915
14780 -31915 -37514 -14148 6409 -51798 -82649 -49364 -7226 -663 -17396 20837 33765 13981
14768 13981 -5687 -11575 -33218 -85069 -84630 -19062 -26991 -87971 -93978 -50951 -4836 -45393 -50196
14755 -50196 -64774 -69028 -75032 -62930 -24256 33515 40476 44035 47632 33544 -20163 14054 16568
14742 16568 39415 20758 27340 40776 -28889 -80497 -86236 -64921 -29553 -26352 -18853 -25851 -9403
14729 -9403 -27583 -29728 -33991 -43935 -53870 -47603 1185 180 29343 43877 31302 -28712 -49891
14716 -49891 -21744 -41619 -86925 -93047 -93824 -101581 -62354 23022 47215 -34448 -87537 -50429
14704 -50429 -13226 -30419 -22515 22851 44937 48752 37325 27832 44905 -40284 -56331 -25912
14692b5912N596k1228Q157J4820j2574j1435L7602L0855J5818k2371l8679j792
14680b1143j692P551l1842K9331N1350L4681J254J4347k575k9503r911j2278N434
14667C5004n1Q791M193j5737J2661o044k3907k3018K1152J3869k6763o912n9903
14654f6665o0064K0364R013N0525K5027N216j8278M1092N0428K3185q429M927
14642G6341K9008j4346J4979m6203m6658k7677J8661L8M0090N6413l168p4083
14630B3395l1832M6954K3508k3012m3947j3909J5940j5929L0751K1084q191J324
14618B6136J0300K4971L0607j6613j5333k7230n3384j4059M6526N4800L8099Q827
14606A13647r22M535k2399l8402m636l7656K3969k9396l664L5714k5753p7K477
$$ plain form
14692 -25912 -20316 -41544 -33387 -18567 -31141 -42576 -4974 25881 41699 19328 -19351 -21143
14680 -21143 -22835 -15284 -47126 -17795 33555 68236 69490 83837 81262 51759 41848 29570 35004
14667 35004 34953 43744 47937 32200 44861 38817 14910 -8108 13044 26913 150 -6762 -66665
14654 -66665 -126729 -106365 -97352 -46827 -21800 -16584 -34862 6230 56658 79843 71414 76341
14642 76341 105349 91003 105982 59779 13121 -14556 4105 4143 44233 100646 97478 23395
14630 23395 -8437 38517 62025 39013 -4934 -18843 -2903 -18832 11919 33003 24812 26136
14618 26136 36436 61407 92014 75401 60068 32838 -20546 -34605 11921 66721 104820 113647
14606 113647 112725 117260 94861 56459 51823 14167 38136 8740 5076 40790 15037 14960 17437
14593A7437J192J991l7208J9880J519n7352l042M0267J1354J0154R578K2118n794
14580C2094k779q513j6996J8668J4784l7883k2218L5341q677J3371m774o952N9838
14567F5304J9928L097k7428q857J9391o185m5460m0180o58r888q723Q039N7319
14554B5699N4894j4183o476O064l0379l2624K757j2487k695l0226K355N2911K247
14541A7857o528p032j5900j1852Q8129O344k8458l0184O92J7625O271k2413m3507
14528b8956K4898L7705J2221l6054k3817J9292J8842J5436M8320K8889l1678j2891
14516G2207n675K1118K7883k8106p2229j8536J5250m692J0338j5856P87M197n061
14503A625K397p293Q973K0195L0832J3624j2829j8523J620j99j5585o634m3274
$$ plain form
14593 17437 18629 20620 -16588 3292 4811 -52541 -55583 -15316 -3962 6192 15770 37888 32094
14580 32094 29315 20802 3806 22474 37258 -625 -22843 12498 3821 17192 12418 5466 65304
14567 65304 85232 88329 60901 52044 71435 65250 19790 -20390 -21048 -30936 -39659 -31620 25699
14554 25699 80593 66410 59934 65998 35619 2995 5752 -6735 -9430 -39656 -37301 15610 17857
14541 17857 11329 4297 -11603 -23455 64674 71018 42560 12376 13068 30693 36964 14551 -28956
14528 -28956 -4058 33647 45868 9814 -14003 5289 24131 39567 87887 116776 85098 72207
14516 72207 66532 87650 115533 87427 15198 -3338 11912 7220 17558 1702 2489 6686 1625
14503 1625 4022 -3271 5702 25897 56729 70353 57524 39001 40621 40422 24837 18203 -25071
14490b5071l4807N405M1792J2324J2016o1941m7485N33K2532L7815M174k8941
14478f1654j5590j3721o3478J2270J4219M6371M1581K6682L3313J1537j1663O826
14466B6693N672l8967m9710K2553O4027k8693j7657N7244L816O009j286J5928
14454F5629n172L1763k8091l0023j5822l2712j3615K3451Q184l7119L77j9441
14442e2591k398K3521L6076J1736O482J7067j0747K0l1595j5829J6415K7546k1853
14429C850l501j6596M998m588L1727J8150J6188n6328k8636J1391J2898J1653
14417A206r597K2867j0089q347l6395r9j3254r735K2470K3180j3415J4291r240
14404b6157m8223j471N1386l8870j2988k1324L5050R311M9409q874j8482l2085
$$ plain form
14490 -25071 -59878 -54473 -12681 -357 11659 -50282 -97767 -97234 -74702 -36887 -32713 -61654
14478 -61654 -77244 -90965 -154443 -142173 -127954 -81583 -40002 -13320 19993 31530 19867 26693
14466 26693 32365 -6602 -56312 -33759 30268 1575 -16082 41162 44978 50987 49701 65629
14454 65629 60457 92220 64129 34106 18284 -14428 -28043 -4592 3592 -33527 -33150 -52591
14442 -52591 -54989 -31468 4608 16344 22826 39893 29146 29166 -2429 -18258 -1843 25703 3850
14429 3850 349 -16247 -11249 -15837 15890 34040 50228 -6100 -34736 -23345 -10447 1206
14417 1206 -8391 14476 4387 -3960 -40355 -40454 -53708 -63443 -40973 -17793 -31208 -16917 -26157
14404 -26157 -74380 -75851 -24465 -63335 -76323 -97647 -62597 -53286 -3877 -12751 -31233 -63318
14392f3318n2619q895J7766N3286J1906O333L3259l6066Q328M7111k8137o8048
14380g9094j9940L7861j9l9147m82N1821n2552m9474N1759K4925J2781N3154M9964
14367D1557q106p7902m6097K5290j0506k2684J0957M5008M3814R199l1305n725
14355b6500K1874N566J153l654M4514J4781M1746k618K2682k763l9236l05J0324
14342H7564p956N989J6562K795j2902l9304m783m91N10J2700r529K0200M7258
14329A18613j8780j0315j060K2917l1758k8449k5455j38k0921J1014n4385q4259
14317a22976j124Q1523L2182m5193k3522K1590M5365O2918K735l6731k4826l6392
14305d4451N1313M5152O581j9939K8894n0912l5922k7067L1794j2862j554K3730
$$ plain form
14392 -63318 -115937 -124832 -107066 -53780 -41874 -35541 -2282 -38348 -30020 17091 -11046 -79094
14380 -79094 -99034 -61173 -61192 -100339 -100821 -49000 -101552 -151026 -99267 -74342 -61561 -8407 41557
14367 41557 33451 -44451 -90548 -65258 -75764 -98448 -87491 -42483 1331 10530 -20775 -26500
14355 -26500 -4626 940 2093 -1561 42953 57734 99480 96862 119544 116781 77545 77240 87564
14342 87564 79608 85597 102159 104954 92052 52748 47965 47474 47984 60684 51155 71355 118613
14329 118613 99833 89518 88458 111375 79617 51168 25713 25575 4654 15668 -38717 -122976
14317 -122976 -124100 -42577 -10395 -55588 -79110 -57520 -12155 50763 53498 16767 -8059 -44451
14305 -44451 6862 52014 58595 38656 67550 16638 -19284 -46351 -14557 -27419 -28973 -5243
14293e243J3183k4456m1528r853M6381M413J7001j8122l1640Q525O504K3743J9839
14280H747j0092L4482L901q3086l0088M8231M5538L3836j1336l2364r867L467
14268A369n0434j6897o966N1428j4916q893n3098K2994N2627M4882N190q659o9520
14255e0893j3254K7525K7700J2628j8110p25n004n0306P617l2122l8441Q0305
14243e3080M2162K776J9847l4625J214r56L2593J4718l1995j7080l9018m9369
14231a12813p839K6526J5316k2477J9772L7168j1426K2981j4888J0558P6163J2393
14219E1434l5263k8778n768k2212j9985n5265r029N3342M0066j1037O141J3685
14207b2669j3047P149K130R871O2891N913l2063j3074K1872K2441j8419j558l1598
$$ plain form
14293 -5243 7940 -16516 -58044 -67897 -21516 -17103 -102 -18224 -49864 -41339 -34835 -11092 8747
14280 8747 -1345 33137 37038 -46048 -76136 -27905 17633 51469 40133 7769 -2098 1369
14268 1369 -49065 -65962 -72928 -21500 -36416 -45309 -98407 -75413 -22786 22096 27286 18627 -50893
14255 -50893 -64147 -36622 -8922 3706 -14404 -15129 -20133 -70439 -62822 -94944 -133385 -53080
14243 -53080 -10918 -8142 11705 -22920 -21706 -22662 9931 24649 -7346 -24426 -63444 -112813
14231 -112813 -120652 -94126 -78810 -101287 -81515 -44347 -55773 -32792 -47680 -37122 39041 51434
14219 51434 16171 -12607 -18375 -40587 -60572 -115837 -124866 -71524 -31458 -42495 -36354 -22669
14207 -22669 -35716 -28567 -26437 -16566 46325 52238 20175 7101 28973 51414 32995 31437 -161
14194a61q9376j8298M2776J5828j8626K169K4678k3401J7858R53p469L5451L3736
14181A6118K2630m2032j0156j7706j5439j5577P404K3415k323l9677l6185j4247
14169a23775M789j1862K0185N7147L0393O163m963l2655j8936k211j3770O125
14157h3370K3845J1980N4506k8206l0178k4129N2093J4462J7031j3695J1517R09
14145F765k4453j3237j4554O319N401q623n806L3554k5810n939K574J117j0062
14132e2754p677P5743K796o1478m5738J0579N6206M0493j0266k7118k1016n557
14120d5787j4627l291R909K7890j1097l5920M5256p172o7596P078M9791M9631
14108D065N233K3184L7247o2632l5272q181J5860P1189P721m1097J3636L7299
$$ plain form
14194 -161 -89537 -107835 -65059 -49231 -67857 -65688 -41010 -64411 -46553 -45600 -53069 -17618 16118
14181 16118 38748 -3284 -13440 -31146 -46585 -62162 -54758 -31343 -33666 -73343 -109528 -123775
14169 -123775 -118986 -130848 -110663 -53516 -23123 -16960 -21923 -54578 -73514 -75725 -89495 -83370
14157 -83370 -59525 -47545 6961 -21245 -51423 -75552 -23459 -8997 8034 -5661 5856 6765
14145 6765 -17688 -30925 -45479 -39160 -33759 -42382 -48188 -14634 -40444 -46383 -43809 -42692 -52754
14132 -52754 -60431 15312 18108 -43370 -89108 -78529 -22323 18170 7904 -19214 -40230 -45787
14120 -45787 -60414 -63705 -53796 -25906 -37003 -72923 -27667 -34839 -102435 -95357 -45566 4065
14108 4065 9298 32482 69729 7097 -28175 -36356 -20496 50693 58414 17317 30953 68252
14096F8252q614N668R308P643L5178R076N711n4218K3756N9620L0544p684o1275
14083A22965l294o025j0883K3430n712j7554n7459m6353j9012J2731K7711N197
14071B5742K770L2839J4341j5605p913K0683j3888n2425m3803k2837n34L6173
14059b4457p875q008J1032K6783k1032L7687P0966n078n0000n5304Q435J7180
14047C29J3030P09q501L1753O066K0249j4742j4136l9116l2871Q732k6128j2524
14034f7150k9462N3748K0308n083L5203M003L01l2685k5781K122J4923J5248k417
14021a6722K3174l7945K4781O1826l3863K4029l0546k6049j0123J1324J8117J7040
14009B5043l592J4725P776j7587m38J302n3387j7117M2585L7361J7728j7649o3002
$$ plain form
14096 68252 59638 65306 74614 82257 117435 126511 132222 78004 101760 161380 191924 184240 122965
14083 122965 119671 113646 102763 126193 120481 102927 45468 -885 -19897 -7166 20545 25742
14071 25742 28512 61351 75692 60087 52174 72857 58969 6544 -37259 -60096 -60630 -24457
14059 -24457 -32332 -40340 -29308 -2525 -23557 14130 85096 80018 30018 -25286 -16851 329
14047 329 13359 14068 5567 37320 43386 63635 48893 34757 -4359 -37230 -28498 -54626 -67150
14034 -67150 -96612 -42864 -22556 -27639 7564 11567 11868 -20817 -46598 -44476 -29553 -14305 -16722
14021 -16722 6452 -31493 -6712 55114 21251 45280 14734 -11315 -21438 -10114 8003 25043
14009 25043 21451 36176 43952 26365 25927 27229 -26158 -43275 -690 36671 54399 36750 -26252
13996b6252J3717J8976j9601K7004L8213l610k9712R218k9185k4687J4279M4785
13984C3145L7519j3759m9897q215K590J541L4426j0842l256J4831j3893K510L2304
13971E9004j1563l7431m8429n576J6326m6531R498O5712R776p6497J506K3587
13959d0618K2472J6641J3750L4324n549j3365l6653n7770k6194n384j4633j3142
13947a26121M2771O8548k980p5842r837L5419k2595L5432j9167j3438L8713J6851
13935c2246L0579j2977N066l8629J2303J7684j2724M483P616k7846L3431J6329
13923C069K1414L9030l3652j7074k3039k2446n261J8649K4284J2920l122j6966
13911b194q751q552n4885r776m759M1910M2963Q293K320j618J7446m0011l3816
$$ plain form
13996 -26252 -12535 6441 -13160 13844 52057 48447 18735 27953 -1232 -25919 -11640 33145
13984 33145 70664 56905 7008 -1207 1383 2924 37350 26508 23252 38083 24190 26700 59004
13971 59004 47441 10010 -38419 -43995 -27669 -74200 -64702 1010 10786 -65711 -64205 -40618
13959 -40618 -18146 -1505 12245 46569 41020 27655 -8998 -66768 -92962 -98346 -112979 -126121
13947 -126121 -83350 -14802 -17782 -93624 -103461 -68042 -90637 -55205 -74372 -87810 -49097 -32246
13935 -32246 -1667 -14644 -9578 -48207 -35904 -18220 -30944 -26461 -18845 -46691 -13260 3069
13923 3069 24483 63513 29861 12787 -10252 -32698 -37959 -19310 4974 17894 14772 -2194
13911 -2194 -10945 -19497 -74382 -84158 -88917 -47007 -4044 4249 6569 4951 22397 -17614 -51430
13898e1430Q851p3559J4414N6107N3356K6116j8116k4842l4399M0850J1393L063
13886A1804n450j0173K2515k986J6404M3349j9604j6725j3091m7060K6266K6469
13874C1718M0928j867N09K7291k0416O938M2923j0982K7574l3705n3619k1184
13862C6108K2796j2600k5978K0149J4081q488m0495J4967L0698K3832j1291K79
13850F4058M7857p176L4349L774j5909J5469K8086N840j3168J9300k4256m8136
13838A10088j4091j8885o0507m0699J3170R2975n7508o1480r936M7415J9p412
13826f851o0662l7750L6980J976K4849l1568l8627J7303K5970q051M3534o824
13814c9721m9397K4632N0585M2824L267r15k7042j1337j9076j1253m7263j7620
$$ plain form
13898 -51430 -42579 -116138 -101724 -45617 7739 33855 15739 -9103 -43502 -2652 8741 11804
13886 11804 6354 -3819 18696 15710 32114 75463 55859 39134 26043 -21017 5249 31718
13874 31718 72646 70779 71288 98579 78163 85101 128024 117042 144616 110911 57292 36108
13862 36108 58904 46304 20326 40475 54556 46068 5573 20540 51238 75070 63779 64058
13850 64058 111915 104739 139088 142862 126953 142422 170508 176348 163180 182480 158224 110088
13838 110088 95997 77112 16605 -24094 -10924 82051 24543 -36937 -46873 542 561 -6851
13826 -6851 -67513 -105263 -68283 -66307 -41458 -73026 -111653 -94350 -68380 -76431 -32897 -39721
13814 -39721 -89118 -64486 -13901 28923 32190 31275 4233 -7104 -26180 -37433 -84696 -102316
13802a02316N4764K9338j5901m195J9831K4703n20k3593p428J6407M9066k4349
13790A5807o2048m0800p055n916K1542l455N7286K4426L8761l7962m2492L3882
13778h024m580J6605J7572k1575j4687q937O929O485o7134m0767n54K0968L1297
13765f6402P1077J4294L578J2704j6700j280m2060k6156M5257L6446q298k132
13753B0328N41j1149n7219l2550k1838L3681J7460N40K0016j7974k0616j065J2415
13740e7430k3570M8485Q2973k7818p9291o7639L9441M8026m409k0012J3665J5021
13728c2558M834q07L6598J1654L4466J8893l9653j1759J2126K8196Q441m463k3635
13715D2333j7090j8888m6029j295K0819p095K0252j3247J4108O141o768L5649
$$ plain form
13802 -102316 -47552 -18214 -34115 -38310 -18479 6224 5704 -17889 -25317 -8910 40156 15807
13790 15807 -46241 -87041 -94096 -100012 -78470 -81925 -24639 -213 38548 586 -41906 -8024
13778 -8024 -12604 4001 21573 -2 -14689 -23626 -16697 -10212 -77346 -118113 -118667 -97699 -66402
13765 -66402 4675 18969 22547 35251 18551 17271 -24789 -50945 -5688 30758 22460 20328
13753 20328 20869 9720 -47499 -80049 -101887 -68206 -50746 -50206 -30190 -48164 -68780 -69845 -57430
13740 -57430 -81000 -32515 50458 22640 -56651 -124290 -84849 -36823 -41232 -61244 -47579 -32558
13728 -32558 -27724 -28531 8067 19721 54187 73080 33427 21668 33794 61990 70431 65968 42333
13715 42333 25243 6355 -39674 -40969 -20150 -27245 -6993 -20240 -6132 9 -6759 28890
13703B8890m5616l140m7411P13K2149J4036k4606N0084P987m2932j5075m2069
13691i6990l916j9078L3297K3400o196J8523K4665J3480l6136J167K8823k231
13679b1192n2845J5963n770J2978Q201k4073m253R710J4566J0892L8943k2783
13667a9663J7230M44m4416k128K710J2810j6711l3308o565M7455k7058K394J554
13654f5252K8653M478m7688n1880L7629M5010m350K6699p540K3093m327K688q351
13641b1138k7083k5906N1971L0121l6908l0705o145M1737K0426L6878l038l97
13629B9813K1803M760k39J5509K6630q6256l9516L6511L9395k7136j5500k8547
13617b2773l5205j942k9225Q879K6903O0297K417p0584J0235K0166j1837p819
$$ plain form
13703 28890 -16726 -19866 -67277 -66564 -44415 -30379 -54985 -4901 3086 -39846 -54921 -96990
13691 -96990 -100906 -119984 -86687 -63287 -69483 -50960 -26295 -12815 -48951 -47784 -18961 -21192
13679 -21192 -74037 -58074 -63844 -50866 -42665 -66738 -70991 -61281 -46715 -35823 3120 -19663
13667 -19663 -2433 -1989 -46405 -48533 -45823 -33013 -49724 -83032 -89597 -42142 -69200 -66806 -65252
13654 -65252 -36599 -32121 -79809 -131689 -94060 -49050 -53400 -26701 -34241 -11148 -15475 -12787 -21138
13641 -21138 -48221 -74127 -22156 7965 -28943 -59648 -65793 -24056 -3630 33248 30210 29813
13629 29813 51616 56376 56137 71646 98276 12020 -27496 9015 48410 21274 5774 -22773
13617 -22773 -57978 -59920 -89145 -80266 -53363 6934 9351 -61233 -50998 -30832 -42669 -50488
13605e0488L3401n5387j2441K786M7596J8454K1965M93n3691k9512r030N9570
13593b6284L8072j6119L5293J1307R00k517J3579N63k0021J3065ro0794j497l2582
13579d7044l3113K4932j2743m653J0866J3498K4690K0382J5150J6784l7314n0424
13567e8989M9635l2967K088K9228P648j898J3585O653J8020m709j9441k7665j2484
13554c1296j6577j9601j0300L5881L6916L164j9905k5889j9646l1922k162K5250
13542g6087P43J8307L7438M1168J2872r586k2925j2995j0800J551j7371r533o8118
13529a15336j3821J0055J2224N2242L0817K1695J2092l0913m6750J437J2726n620
13517e9152M0264n270l0920j6190K4507L9337l06J524k7835N872l3097k5188j8857
$$ plain form
13605 -50488 -17087 -72474 -84915 -82129 -34533 -16079 5886 6379 -47312 -76824 -85854 -26284
13593 -26284 11788 -4331 30962 42269 43169 40652 54231 54794 34773 47838 47829 -12965 -14462 -47044
13579 -47044 -80157 -55225 -67968 -72621 -61755 -48257 -23567 -3185 11965 28749 -8565 -58989
13567 -58989 -9354 -42321 -40233 -11005 -3357 -5255 8330 14983 33003 28294 8853 -18812 -31296
13554 -31296 -47873 -67474 -77774 -41893 -4977 -1813 -21718 -47607 -67253 -99175 -101337 -76087
13542 -76087 -75344 -57037 -19599 21569 34441 24855 1930 -11065 -21865 -20314 -37685 -47218 -115336
13529 -115336 -129157 -119102 -106878 -54636 -23819 -2124 9968 -20945 -67695 -66258 -53532 -59152
13517 -59152 -18888 -24158 -55078 -71268 -46761 -7424 -7730 -6206 -34041 -28169 -61266 -86454 -105311
13504a05311K1220j0307J3710P090N199M2078K5675J3633m7025K5877L4341L6
13492B6216K6260k7909n4006o18L0863N6490K5815p4799n9480J8922k835j4105
13480d9186L9381N273M787J8224m7526j86N2685K6460o118k0831J3025q409j3945
13467A3634K2416K143n9832o3649Q084N8391N2060r381l2302J2770k3119l1843
13455e0628n458m714J4635j2920m3571K8417N6321j576J0983K2218J5951J4310
13443D3968J30k5711m3158m3485J81L8078k6968r982L0496J8603O8315k7303m4556
13430b1392j7864j8294K691L2456J7346N7948L2728l4245m5463m167q818m4408
13418e1482n9483m8502J9303L4457J3342L9289K9684j424L804K4915j8762j6482
$$ plain form
13504 -105311 -84091 -94398 -80688 -73598 -68399 -26321 -646 12987 -34038 -8161 26180 26216
13492 26216 52476 24567 -29439 -30057 806 57296 83111 8312 -51168 -32246 -35081 -49186
13480 -49186 -9805 -4532 255 18479 -29047 -29233 23452 49912 43794 22963 35988 27579 13634
13467 13634 36050 38193 -21639 -85288 -77204 -18813 33247 23866 -8436 4334 -18785 -50628
13455 -50628 -56086 -60800 -46165 -59085 -102656 -74239 -17918 -19494 -8511 13707 29658 43968
13443 43968 44098 18387 -24771 -68256 -68075 -29997 -56965 -66947 -36451 -17848 50467 23164 -21392
13430 -21392 -39256 -57550 -54859 -22403 -5057 52891 85619 51374 5911 1744 -7074 -51482
13418 -51482 -110965 -159467 -140164 -105707 -92365 -53076 -23392 -24816 -21012 3903 -14859 -31341
13406c1341L0093j485K9908k9943l8836J29M0224N9116k5482o0125o1376J3490
13394g5628L3382j9183J3283K5354m4788J5400j7183j0279j3178L4542J7198j47
13382d1227l3316L6652L8288J5439k3216Q116J5863L0341j8194m3500m5129O4138
13370D255L0844k9560o7428l065N5177J3756O6698j9273k6696J2764J4428Q246
13358F0146m0910m4080J9288K4334l7592o5816r993L5814L5786L5905l4386m9832
13346g1336l1705L0435N0619j734K2016l0232l6231N4324K5849l8508q108j5156
13334d9767k6933l1845J005j685J7797L8310J1997K6795K934K8397J8716N2897
13322H8618j0872j8874m0370k6376L3483j8404l9747K6914O0541J4393n2096l4061
$$ plain form
13406 -31341 -1248 -2733 27175 -2768 -41604 -41475 -1251 57865 32383 -27742 -89118 -75628
13394 -75628 -42246 -61429 -48146 -22792 -67580 -52180 -69363 -79642 -92820 -58278 -41080 -41227
13382 -41227 -74543 -37891 397 15836 -7380 736 16599 46940 28746 -14754 -59883 4255
13370 4255 35099 5539 -61889 -64954 -9777 3979 70677 51404 24708 37472 51900 60146
13358 60146 19236 -24844 -5556 18778 -18814 -84630 -94623 -58809 -23023 12882 -21504 -71336
13346 -71336 -103041 -72606 -21987 -23721 -1705 -31937 -68168 -13844 12005 -26503 -34611 -49767
13334 -49767 -76700 -108545 -107540 -109225 -91428 -53118 -41121 -14326 -11392 17005 35721 88618
13322 88618 77746 58872 18502 -7874 25609 7205 -32542 -5628 54913 69306 17210 -16851
13310a6851M2587j0083k0488L1657k6446K3009L7449N056J3337Q032o837n8368
13298B2054m7385K2576O1962k5782P480N5664k3545l7345j4809o663k1456m079
13286a1328M2182J9723j7866j9453L0718K7972j122N521j1789K9827J6638r1908
13274A9115n5156P138J5071O0201M2556j3333k6741K5041L5572K0232J2296l3926
13262A08066J5949N5733M4531K3094O0349N2966l8570q8650l5443l0365n218M0176
13250B02618J3631p380R928L710K7789P5749L8264M7800O2797K7566J30132K02519
13238H35123K07058K06890K17308K53591K26626J56643Q6613L4245l7477o3871
13228B122749j61278k60646k24309k22276k09848j44389j15345j73212j03222
$$ plain form
13310 -16851 25736 15653 -4835 26822 376 23385 60834 65890 79227 87259 80422 22054
13298 22054 -25331 -2755 59207 33425 40905 96569 73024 35679 20870 14207 -7249 -11328
13286 -11328 30854 50577 32711 13258 43976 71948 70826 76347 64558 94385 111023 19115
13274 19115 -36041 -28903 -13832 46369 88925 75592 48851 73892 109464 129696 141992 108066
13262 108066 124015 179748 224279 247373 307722 360688 322118 233468 198025 167660 162442 202618
13250 202618 216249 208869 218797 222507 250296 326045 364309 412109 474906 502472 632604 835123
13238 835123 1042181 1249071 1466379 1719970 1946596 2103239 2189852 2224097 2186620 2122749
13228 2122749 1961471 1700825 1476516 1254240 1044392 900003 784658 611446 508224
13219E08224j23425n9691l0006m1973K1860K1727k1926j2330k1578k1101k846
13208B16935k9174J5768R138m4933m9120j7665K6031j7401P64n0294k6191J1761
13196D5619M8735p13o4804J9231M8115L2887o4325j6601q651L785k5243p241K1232
13183C2026N9862j8210m7144M785K6436N6323J6224R560k500j6826j1298J921
13171A11159k2024J9647J6099n6349q4454k1099J5042j7277j8095J0274L0535
13160a6542L4413M1750K2207l544j5333L6480j2537M066j9023j4617m0192P702
13148B4830L4346N1928J7190k1108n2984k685m2908m0661N4512P5381M1758k0757
13136A18842m8918p5834K7934O2316k4149m482L3766j2600o539L4703M231l5813
$$ plain form
13219 508224 384799 325108 295102 253129 274989 296716 274790 262460 240882 219781 216935
13208 216935 187761 203529 212667 167734 118614 100949 126980 109579 110343 60049 33858 45619
13196 45619 94354 93641 28837 48068 96183 129070 64745 48144 39493 43278 18035 10794 32026
13183 32026 91888 73678 26534 31319 57755 114078 130302 139862 137362 120536 109238 111159
13171 111159 89135 108782 124881 68532 -15922 -37021 -21979 -39256 -57351 -47077 -16542
13160 -16542 17871 59621 81828 78284 62951 99431 86894 90960 71937 57320 17128 24830
13148 24830 59176 111104 128294 107186 54202 51517 8609 -32052 22460 97841 139599 118842
13136 118842 69924 -5910 22024 84340 60191 55709 89475 76875 70336 105039 109270 73457
13124G3457j6959J8596j0895k3851K3279R863N6245L330k1745l9786K3866O2086
13112A57486O1566M1693k9562r0109l1320j6711L0613J8768l2553k6177n4435
13101B9259l342J2617J2611k1036j3623J6413J9229k7734j7087K9887J7832n446
13089D9580M842O275K1573q296m7509l42K6020K7590k246j9532j163M5767Q708
13076A11267J2172L0924p422J9661M559j5512O5994K5656J8590M8161M3337M4796
13064D02183K8348J1647M6654l3071J6688L4710J7048n2870n7750k4851p5993
13053C12743q1973k1551m092k1006j7184m1723K8766K4955l6799j3992r946L1854
13041A50052M3974J171n926j3186p952j1046j8028k963k613m4759k6997L4233
$$ plain form
13124 73457 56498 75094 64199 40348 63627 73490 129735 133065 111320 71534 95400 157486
13112 157486 219052 260745 231183 141074 109754 93043 123656 142424 109871 83694 29259
13101 29259 25917 38534 51145 30109 16486 32899 52128 24394 7307 37194 55026 49580
13089 49580 54422 60697 82270 73974 26465 26123 52143 79733 77487 57955 56792 102559 111267
13076 111267 123439 154363 146941 166602 171161 155649 221643 247299 265889 314050 357387 402183
13064 402183 430531 442178 488832 455761 472449 507159 524207 471337 413587 388736 312743
13053 312743 230770 209219 205127 184121 166937 125214 153980 178935 142136 128144 118198 150052
13041 150052 194026 195197 189271 176085 168133 157087 139059 136096 133483 88724 61727 95960
13029I5960J08614J7626o1919j1844k1212K2364M9636J856j6441o7740j121K1863
13017A37642l4298m605M071M4064M596M313N0167M7977p007k4924J5374m6185
13005A91185m8649L4335N354R353L7485q141l1025r92K5321K638m5712P798M985
12992A83935N857j6126J0246J6952k1613j077l3190m4715J8523K1383L2344J913
12980A74432P719Q320J0008J2323J1028J3264k5538L337O363j9499Q52J340l942
12967B00007l4921n3835l705L3396J4290N0802L8788K1624L6868k1827L8347N3910
12955C73744q341K7777L079K792k0891n1135j4289J4434K9116k651N0280R6418
12943E00333J7712L8959Q2268Q8831O0796N8312R1560J01711J0905j4118J7246
$$ plain form
13029 95960 204574 222200 160281 148437 127225 149589 199225 201081 184640 116900 115779 137642
13017 137642 103344 98739 102810 146874 151470 155783 205950 253927 246920 221996 237370 191185
13005 191185 142536 176871 182225 191578 229063 220922 189897 188905 214226 216864 171152 178950 183935
12992 183935 189792 173666 183912 200864 179251 178174 144984 100269 118792 140175 172519 174432
12980 174432 182151 190471 200479 212802 223830 237094 211556 214893 221256 201757 202609 203949 200007
12967 200007 165086 111251 107546 140942 155232 206034 244822 266446 303314 281487 319834 373744
12955 373744 365403 393180 396259 399051 378160 327025 312736 327170 356286 353635 403915 500333
12943 500333 518045 557004 639272 728103 788899 847211 938771 1040482 1051387 1037269 1054515
12932A054515M2835l8208o9968r2182j21993o3686j8824p3406p2245J832j1465
12921E37205n4583k3614J004N345p557J2649J1871q698J7589j5562J825K2365
12909D99839O7527Q2080M6540O329j2333j1539j710J5259J0674K2297L3086l6354
12897G21695J4009P7300O7911N1088N44j1172o632J5834k5439j7708N8385P406
12885I53221j4618M1321O1134j2440Q4025J7558J3602O6136Q7010R0969J12298
12874A500216N7346P9779Q5546K0587r355L2711Q4200R2804M3163P0416P5903
12863B133316J49373J08805Q7712J05165P8892P6650J30128R9395J16275K14897
12853C300608J99376J65664J88792J87315J69190J92563K63540K37494K20218
$$ plain form
12932 1054515 1097350 1059142 989174 896992 774999 711313 692489 619083 546838 548670 537205
12921 537205 482622 459008 460012 465357 457800 470449 482320 473622 491211 475649 477474 499839
12909 499839 567366 649446 695986 702315 689982 678443 676733 691992 702666 724963 758049 721695
12897 721695 735704 813004 880915 932003 932547 921375 914743 930577 905138 887430 945815 953221
12885 953221 938603 979924 1041058 1028618 1112643 1130201 1143803 1209939 1296949 1387918 1500216
12874 1500216 1557562 1637341 1722887 1743474 1734119 1766830 1851030 1943834 1986997 2057413 2133316
12863 2133316 2282689 2391494 2479206 2584371 2663263 2739913 2870041 2969436 3085711 3300608
12853 3300608 3499984 3665648 3854440 4041755 4210945 4403508 4667048 4904542 5124760
12844E124760J96102J44717K45043L39012L51723L12344M23579M90252N66468
12835H194000O18447O87374Q02612R05483J133472J314746J566354J945469K307371
12826A9475328K591675K866315L300308L808278M515726N384748O753932Q933891
12818E7630201J2347154J7400332K4099110L1464044L8032806M2820622M5151900
12811B68946169M4682062M1039340L3488326K2023226P354404p495809k0950823
12804C89086895l1337595l8549636m2448390m3244798m0917181l5834431k9364263
12797A27390601k2864985j7192551j2799204r672470p477259n952988m878223
12790D6552921m238580l771155l309048k930530k643589k316922k064089j823676
$$ plain form
12844 5124760 5320862 5465579 5710622 6049634 6401357 6713701 7137280 7627532 8194000
12835 8194000 8812447 9499821 10302433 11207916 12341388 13656134 15222488 17167957 19475328
12826 19475328 22067003 24933318 28233626 32041904 36557630 41942378 48696310 57630201
12818 57630201 69977355 87377687 111476797 142940841 180973647 223794269 268946169
12811 268946169 313628231 354667571 388155897 410179123 417533527 410037718 389086895
12804 389086895 357749300 319199664 276751274 233506476 192589295 156754864 127390601
12797 127390601 104525616 87333065 74533861 64861391 57384132 51431144 46552921
12790 46552921 42314341 38543186 35234138 32303608 29660019 27343097 25279008 23455332
12782B3455332j606217j471455j332400j134111r72909r62623q71929p46839o24633
12773A3732216o17321o25178n48967m96292m47360l93037l75562l99936l80984
12764I447579l72772l37181k90664k79632k72760k68308k70970k48589k80220
12755F826483l38627l07136k18963k38610k18071j36334k02504k11570j70016
12746D784652j55075j04609j05913j12113p6685j39721j18027q0297n1465l2362
12736C808385q1673m5719n4357J2072R6112J20787k7543j8237r114l8531j55369
12725C606813j70070j20618r1898j12304j13972j9128j6845J6672n6255o0605
12715B861790P869P2573R5883J01438J68515K50021M02930N98113P13934O82668
$$ plain form
12782 23455332 21849115 20377660 19045260 17911149 16938240 15975617 15103688 14356849 13732216
12773 13732216 13114895 12489717 11940750 11444458 10997098 10604061 10228499 9828563 9447579
12764 9447579 9074807 8737626 8446962 8167330 7894570 7626262 7355292 7106703 6826483
12755 6826483 6487856 6180720 5961757 5723147 5505076 5368742 5166238 4954668 4784652
12746 4784652 4629577 4524968 4419055 4306942 4230257 4090536 3972509 3892212 3840747 3808385
12736 3808385 3726712 3680993 3626636 3638708 3734820 3855607 3828064 3809827 3800713 3762182 3606813
12725 3606813 3436743 3316125 3224227 3111923 2997951 2978823 2961978 2978650 2922395 2861790
12715 2861790 2869659 2942232 3038115 3139553 3308068 3558089 3961019 4559132 5273066 5955734
12705E955734M08528k6066l78470n85698o69250o64392n51497m24814l19689k47279
12695B497107j50329j60013j26066n9926R194k5662n8126n7226L632R1147J1713
12684A975445N9874K3573K1124J817j2555p5672m6176m5201j34579j34231r8957
12673A534462j16310j23640m8474n4840q7605n0034p320l2017p8687l5213Q367
12662I08689k3890j3494j5309j7297k4924l7697j9180m876N2342j4013j9838j4743
12650G55770J1203j8401l3193N706M0125K7771J8929k9069l3061q1444r2920m7851
12638E23565n9270l6161K2298M1691r033m0613o5797k0326M3692M3382J1971k3110
12626D32289m8822j2457J3235L5798O8415k072l6390n3807m4609J9335K2495j104
$$ plain form
12705 5955734 6364262 6338196 5959726 5374028 4704778 4040386 3488889 3064075 2744386 2497107
12695 2497107 2346778 2186765 2060699 2000773 2009967 1984305 1926179 1868953 1872585 1963732 1975445
12684 1975445 2035319 2058892 2080016 2081833 2069278 1993606 1947430 1902229 1767650 1633419 1534462
12673 1534462 1418152 1294512 1246038 1191198 1103593 1053559 1046239 1014222 935535 900322 908689
12662 908689 884799 871305 855996 838699 813775 776078 756898 752022 804364 790351 770513 755770
12650 755770 766973 748572 715379 721085 761210 788981 807910 778841 745780 664336 571416 523565
12638 523565 464295 428134 450432 492123 483090 442477 376680 356354 400046 443428 455399 432289
12626 432289 383467 371010 384245 420043 488458 486386 449996 396189 351580 370915 393410 392306
12614C92306k7379K6103L3662j3243k1315k2239l3235m4130k0152M5683J2547
12603C28608M6619M7514m4997p2904m3240J0475J9204j4480p416l1252J5989L734
12591B57854m4844J4541p00O062l310K9634N0030O9028j1382k0144k6147o319
12579C14303l7331l988J0492k3481J1481K4157j8084j3159R141K5874k0941l2336
12567B46128k7294n562L6651K369K2367n0046J747K4182J5882k3522j7269l3264
12555A92369m0099P987q402P0183K899O063J07J4819j4205K340K7776k6252l9471
12542A96114l028K571j2638j2821M1681N8683j1430N47N233l2076o2706k6205
12530A43925q496J2822K0666j4571l5478J7199J1616L1864J6868r277L6183K3311
$$ plain form
12614 392306 364927 391030 424692 411449 390134 367895 334660 290530 270378 316061 328608
12603 328608 375227 422741 377744 304840 261600 272075 291279 276799 269383 238131 254120 257854
12591 257854 213010 227551 226851 232913 229603 259237 309267 378295 366913 346769 320622 314303
12579 314303 276972 272984 283476 259995 271476 295633 277549 264390 273531 299405 278464 246128
12567 246128 218834 213272 249923 252292 274659 224613 226360 250542 266424 242902 225633 192369
12555 192369 152270 160257 151855 222038 224937 231000 231107 245926 231721 234061 261837 235585 196114
12542 196114 193086 195657 183019 170198 211879 270562 259132 259679 264912 232836 170130 143925
12530 143925 135429 148251 168917 154346 118868 136067 147683 179547 196415 187138 223321 246632
12518B46632k7649J6133N2138k2724n1768o377k7591q3789r3858O761O6265P770
12506H1943p6852o1402k0074K1729M0266K6091N8591K7079j6599r8393j0509M2186
12494A4056M4336N755j0510j0136L3382K6554N050m6596j3520L5765P767N210
12482I7113J0955j6162j5867j0163q071M4625k460k6024o792N4022L510n923L4803
12469A53566M5992n0289J098j9389N580o137j1956K7170Q606l0519m2390L505
12457H4837K5459M6976j0746K5359m949p3403K0167N3973J5059k8150k590J17368
12445B69360N6878Q9999J46542Q2227j5382r9160m7859m9760o7935l8360L6646
12434C63196j3924k3043L3919L5125K483j4444L2275O4515L871m47K4391p10J799
$$ plain form
12518 246632 218983 235116 287254 264530 212762 206385 178794 95005 1147 7908 74173 81943
12506 81943 5091 -56311 -76385 -54656 -14390 11701 70292 97371 80772 -17621 -28130 14056
12494 14056 58392 64147 53637 43501 76883 103437 108487 61891 48371 84136 91903 97113
12482 97113 108068 91906 76039 65876 57805 102430 99970 73946 67154 121176 124686 118763 153566
12469 153566 199558 149269 150367 130978 136558 130421 118465 145635 154241 123722 81332 84837
12457 84837 110296 157272 146526 171885 166936 93533 113700 167673 182732 154582 151992 269360
12445 269360 326238 416237 562779 645006 629624 530464 482605 432845 364910 326550 363196
12434 363196 349272 326229 360148 395273 397756 383312 415587 480102 483973 483526 507917 507207 509006
12421E09006N1176K1097k8828N3050J2243m3203l539m024J9733J9273O4728M9418
12409G20130R7435J62412J82756J84330J15823K5542m0156p2749j46812j51290
12399A077421j26330n9059k7726j6522J39N6030J13804Q9279J5009Q7045N1509
12388A260599N956L5361M8910P5387J28750J89556J98986J88876J38650J32095
12378B403126J13973R4409k1085q7239j96354j61119j27902j52977j21801j05401
12368A637630j42321j64734j43410j30046j14245k07779j19492m6623p7131o9892
12358D21957j5373j4109j9605L0920o3418l6284j0058j7384j9022m3255J4625
12347B28994K7956m0758o914n3627N299m8575k6044m705L9190J3096m5827j7084
$$ plain form
12421 509006 560182 581279 552451 605501 617744 574541 571002 566978 586711 605984 670712 720130
12409 720130 817565 979977 1162733 1347063 1462886 1488428 1448272 1375523 1228711 1077421
12399 1077421 951091 892032 864306 847784 847923 903953 1017757 1107036 1122045 1209090 1260599
12388 1260599 1266555 1301916 1350826 1426213 1554963 1744519 1943505 2132381 2271031 2403126
12378 2403126 2517099 2611508 2590423 2503184 2306830 2145711 2017809 1864832 1743031 1637630
12368 1637630 1495309 1330575 1187165 1057119 942874 735095 615603 568980 491849 421957
12358 421957 406584 392475 372870 403790 340372 304088 294030 276646 257624 214369 228994
12347 228994 256950 216192 209278 155651 160950 112375 86331 81626 120816 133912 88085 71001
12335G1001J2982K8823L2043k7048j2640o371N5010K81m6381m7850n5347K2102
12323B6605K2389O415L4280L8289k933l4501l9778k4348k1807N829J5604M4410
12311G0454K9186n8244P092J4851Q1j1589J5028M3209K7394k121j1192j2377l5903
12298G5869m2931l0702L7866M8298J3636j7343j4041K4230L7823J9825k5256m8594
12286G8680L8750K6547j1093L606L978K0008l113o5311l801j4623n884K1517k5926
12273F3335J4814l5255K359L8482j0301J0679K1661J7550j0118p562J5358l7989
12261H3013J6225j4550l9953N946M2578K4188j8096R604m8253j683M5118J3J85
12248A04335L7709j2011m4818J2968L6006q2498k4649J6344j4817M4117L8281
$$ plain form
12335 71001 83983 112806 144849 117801 105161 98790 153800 154081 107700 59850 4503 26605
12323 26605 48994 55409 89689 127978 125045 90544 50766 26418 4611 10440 26044 70454
12311 70454 99640 41396 48488 63339 63420 51831 66859 110068 137462 135341 124149 111772 75869
12298 75869 32938 2236 40102 88400 102036 84693 70652 94882 132705 152530 127274 78680
12286 78680 117430 143977 132884 136490 140468 160476 157363 92052 88251 73628 67744 89261 63335
12273 63335 78149 42894 45253 83735 73434 84113 105774 123324 113206 105644 121002 83013
12261 83013 99238 84688 44735 50681 93259 117447 99351 108955 60702 59019 104137 104150 104335
12248 104335 142044 130033 85215 98183 134189 51691 27042 43386 28569 72686 110967
12237A10967J7227o838K912J6501j1315o0202k5848K7348m0342j4401m5562M2092
12225A2539L6111k2865k6563k4727q723K0049K2621J2157j4045P758J0531l8899
12213a4056J7037O0092K2923K0365N237p2864l2281M013P843L3261j0523k8618
12201A2429k5231n6J4921Q589N717L09J1992L9013o711J2436L4989P754j4197
12188A01954l737j3306m5012J2792K2152N6772L0128m1532j7547q752p174l0441
12176E6297J9713J5408J9498M06M402r8230l1330L2777j988j7702R566J542j812
12163H547k1064l1452p153K8210L9572k014j5163q91M4075j5490K4729M5582o3388
12150C4100J0704j2619l4506L2467N099O8141J2797O208m3334k2867O470j8974
$$ plain form
12237 110967 128194 121356 124268 140769 129454 69252 43404 70752 30410 16009 -29553 12539
12225 12539 48650 25785 -778 -25505 -34228 -14179 8442 20599 6554 14312 24843 -14056
12213 -14056 2981 63073 85996 106361 111598 38734 6453 10466 18309 51570 41047 12429
12201 12429 -12802 -12858 2063 10652 16369 16678 28670 67683 60972 73408 108397 116151 101954
12188 101954 98217 84911 39899 52691 74843 131615 161743 120211 102664 93912 86738 56297
12176 56297 76010 91418 110916 111322 115724 17494 -13836 18941 16953 -749 8817 10359 8547
12163 8547 -12517 -43969 -51122 -22912 16660 14646 -517 -1408 42667 27177 51906 97488 34100
12150 34100 44804 32185 -2321 30146 35245 103386 116183 122391 79057 56190 62660 43686
12138D3686O475O787j5378m1783k5385J9482K2973Q453R359j7802J602k0763K3610
12125B1316M3300M446L2969L223l3645k9571j6646N169p061q309L244j3655j5491
12112a0711J967J1865j8908k9345J5146M743J6065m0036P6216r024m2668K9569
12100D879N8112j152n4985l9489J9389R746K0682m0817k1767K0873k0103L3587
12088a1045K3675p009l1214P866L3265k0885j1192K7044J0033k3858m4040K1017
12076b6343M0454J9413O557k0926J8853J3676L099o214l7398K4494L5893J144
12064G2702j8703n6286j8884J6446J7355o82j7091K0304L3909j2413j1718l0190
12052e251J337J1243j6020l4179M9493L0642Q955K781j6635k8017l573J8149n352
$$ plain form
12138 43686 50161 56948 41570 -213 -25598 -6116 16857 25310 34669 16867 18469 -2294 21316
12125 21316 64616 69062 102031 105254 71609 42038 25392 30561 23500 15191 18435 4780 -10711
12112 -10711 -8744 3121 -15787 -45132 -29986 -25243 -9178 -49214 27002 17978 -24690 4879
12100 4879 62991 61839 6854 -32635 -13246 -3500 17182 -23635 -45402 -24529 -44632 -11045
12088 -11045 12630 5621 -25593 -17727 15538 -5347 -16539 10505 20538 -3320 -47360 -26343
12076 -26343 14111 33524 40081 19155 38008 51684 54783 48569 11171 35665 71558 72702
12064 72702 53999 -2287 -21171 -4725 12630 11948 -5143 15161 49070 36657 24939 -5251
12052 -5251 -3914 7329 -8691 -42870 6623 37265 46220 49001 32366 4349 776 18925 13573
12039A3573k1916M507L8037N490m7076p93k874M0214l22n0385k6897L6922K920
12026h600j5442K5753K0195J1417l881l2964O036K1516k2721j0822J4124J0893
12014A5504M9985j8581n3641K7314R736N285o941J4106M069m4216J6388K0568
12002C9576p338r957l132j4832k0118M0369l974j1094K3890O3929L4195J825l6269
11989I7070m4641k8568k4875n572L411k4619n7079J8379P3536Q5674k6523k2660
11977D3533j5192o13M5713k7085m6574K354j0519k6494R078q936k8634J4841J6316
11964c2212J9224J5720O400J2260J072j0153o3912K6425J9537N370K7223L6735
11952F3689m5614n7265P929O4610K7254l0447J5669k0166L5886J4773j3044j310
$$ plain form
12039 13573 -8343 -3836 34201 39691 -7385 -8178 -11052 29162 28840 -21545 -48442 -11520 -8600
12026 -8600 -24042 1711 21906 33323 29442 -3522 2514 24030 1309 -9513 4611 15504
12014 15504 65489 46908 -6733 20581 30317 35602 28661 42767 46836 2620 19008 39576
12002 39576 32238 22281 19149 4317 -15801 24568 20594 9500 33390 97319 131514 133339 97070
11989 97070 52429 23861 -1014 -6586 -3175 -27794 -84873 -66494 7042 92716 66193 43533
11977 43533 28341 27728 73441 46356 -218 2136 -8383 -34877 -25799 -34735 -63369 -48528 -32212
11964 -32212 -12988 2732 9132 21392 22464 12311 -51601 -25176 -5639 -269 26954 63689
11952 63689 18075 -39190 -31261 33349 60603 30156 45825 25659 61545 76318 63274 61964
11940F1964J8320o7740l4570k993L1314l9974J7300J2507k0596K4693R53J5892
11928A7070l5077n1612j4099J6940M018K5657M0429K4921j1745K0319n4770l2456
11916e0405J5207J6008J5023K4044L3034P877k2477k2691m2493l6304m414K1142
11904d6449K6224j1688j5803N6187N584N9j4314R272L8448J583R82P685j217j174
11890E5379m4772m0214o4906k8450L0241K5703j3602N138j593m472k2579K9301
11878g4826L0495K5139M0253m6327j3383L4901L0490l2141N731l8974K80L993
11866c4369O622J8240k2452J0409J9954j4136J1532O5235M2918j7529l2367m9891
11854D166l3909M001L1107j6917n052l0409J1569Q292k56L358P570K783K1027
$$ plain form
11940 61964 80284 12544 -22026 -25019 6295 -33679 -16379 -3872 -24468 225 1178 17070
11928 17070 -18007 -69619 -83718 -66778 -62760 -37103 3326 28247 16502 36821 -17949 -50405
11916 -50405 -35198 -19190 -4167 19877 52911 60788 38311 15620 -26873 -63177 -67591 -46449
11904 -46449 -20225 -31913 -47716 8471 14055 14114 -200 9072 47520 49103 50085 57770 56553 55379
11890 55379 10607 -29607 -94513 -122963 -92722 -67019 -80621 -75483 -77076 -81548 -104127 -74826
11878 -74826 -44331 -19192 21061 -25266 -38649 -3748 26742 -5399 332 -38642 -38362 -34369
11866 -34369 -27747 -9507 -31959 -21550 -1596 -15732 -4200 61035 103953 86424 54057 4166
11854 4166 -29743 -25742 5365 -11552 -16604 -47013 -35444 -27152 -27408 -24050 -16480 -13697 7330
11841G330L9491p376j4618p085r607k4582j8907p305j2632J9713k9790K7317K7247
11828a0804o6773j8392N6743O770j2090j7394J2912J3026J0155J7502k4223m9428
11816h1996k0769J3228L8707L0100L7159K5831N077l048l1108l6226P939M2838
11804B7732J2788l5037n0077j7012N337R22k44j7513M312N3137J1338R725Q633
11791A4041K9636k7089j5286l4555k1439k1888J9192K6240K9529L1527j470O566
11779C5004l092m0083K9244N0184r714o491o440L1712Q388j1163p077M4243j231
11766A13484J5141l6520j1464l8170l7072M8810R468l2962j8548j9828M7654K1567
11754F1560m1223l5618O349J03K4442M4423L0975l690j2440k6675J2058k2054
$$ plain form
11841 7330 46821 39445 24827 17742 8135 -16447 -35354 -42659 -55291 -35578 -65368 -38051 -10804
11828 -10804 -77577 -95969 -39226 -32456 -44546 -61940 -49028 -36002 -25847 -8345 -32568 -81996
11816 -81996 -102765 -89537 -50830 -20730 16429 42260 47337 44289 13181 -23045 -15106 27732
11804 27732 40520 5483 -44594 -61606 -56269 -55347 -55591 -73104 -68792 -15655 -4317 5408 14041
11791 14041 43677 16588 1302 -33253 -54692 -76580 -57388 -31148 -1619 29908 28438 35004
11779 35004 31912 -8171 21073 71257 61543 55052 48612 80324 88712 77549 70472 114715 113484
11766 113484 128625 92105 80641 42471 5399 54209 63677 30715 12167 -7661 39993 61560
11754 61560 20337 -15281 -8932 -8829 15613 60036 91011 87321 74881 48206 60264 38210
11742C8210j3580J5277m5931k4994L2309M539J0917L744J5746p43J2194L6030
11730H3718J9893n4559k4011j1757m6940j2050n702L4107K9367K0380l4711J5089
11718A2824K4195k0419N416O928o1704j0792J3023L1416l2061k9606J9595L3815
11706g370K5488p424j5945k6537k4856J9856K9367J0220l333m401M956q913k4982
11693c3874L3779l237J7982k5339J3009N4580N9659j12j02364m7030j663M9431
11681A4821L5617J8993k0717k1992K7176R313J5144o7468k6603q11l418k5028
11669d4973J0870P9229K5019k6231o828j8495j0893M7787k1281K725m0244m1590
11657d4905l4936P0223O4270j6701l4962J4889K774n240k5386j5128J1422k9981
$$ plain form
11742 38210 24630 39907 -6024 -31018 1291 5830 16747 20491 36237 35494 47688 83718
11730 83718 103611 49052 25041 13284 -33656 -45706 -51408 -17301 12066 32446 -2265 12824
11718 12824 37019 16600 22016 28944 -32760 -43552 -30529 887 -31174 -60780 -41185 -7370
11706 -7370 18118 10694 -5251 -31788 -56644 -36788 -7421 2799 -534 -4935 21 -8892 -33874
11693 -33874 -95 -3332 14650 -10689 2320 56900 116559 116447 14083 -32947 -34610 14821
11681 14821 50438 69431 48714 26722 53898 63211 78355 10887 -15716 -16527 -19945 -44973
11669 -44973 -34103 45126 70145 43914 37086 18591 7698 55485 34204 36929 -3315 -44905
11657 -44905 -79841 -9618 54652 37951 2989 17878 20652 15412 -9974 -25102 -13680 -43661
11645d3661M597J4740J7906N1668K7505M0939o5048m0721l3009m944j6985p967
11633e4980k1655K7728L113l8457L2925K9269J4909m374J3367m3599j2007K5987
11621b7774j7750K8072l475k1390k0198J751J9690j423L6833j0603k1178L6847
11609e98M2683m746p927J3675l959M0221j1948m6441M8903j7871J9183K4313m1641
11596E3847m5382N954p621n0801l1520k749J4488N1842J1197q327J363J1765J4706
11583A8762K5334j788k4861K347k172j6993l4873K1812j9689j6327Q78K8513N2147
11570C3090K1504L5460p445k3234k6404J0592l6525n3432K2678L3535k0770J88
11558a0763J1596J6321j1502j4633k1902K6706j5310J3635j8836O6198K400k4067
$$ plain form
11645 -43661 -39064 -24324 -6418 45250 72755 113694 48646 7925 -25084 -30028 -47013 -54980
11633 -54980 -76635 -48907 -45794 -84251 -51326 -22057 -7148 -11522 1845 -41754 -53761 -27774
11621 -27774 -45524 -17452 -20927 -42317 -62515 -60764 -41074 -42497 -5664 -16267 -37445 -598
11609 -598 42085 37339 29412 43087 39128 79349 67401 20960 69863 51992 71175 95488 53847
11596 53847 8465 14419 6798 -44003 -75523 -78272 -63784 -11942 -745 -9072 -7709 4056 18762
11583 18762 44096 42308 17447 19794 17622 629 -34244 -12432 -32121 -48448 -47570 -19057 33090
11570 33090 54594 90054 82609 59375 32971 43563 7038 -46394 -23716 9819 -10951 -10763
11558 -10763 833 17154 5652 -8981 -30883 -4177 -19487 -5852 -24688 41510 43910 19843
11546A9843o319m7375j8841j4687j0201P259N2933L1493N1620J2018n6362j7925
11534C456l020j0768m810k6995Q839m627K6352K755N0617j440j1850L6289O832
11521G1630k9162k7784o0889j4829N8086n512j6083l8437J0769M119j5323J398
11509f2017o399l7180L0187N6858N71l9253j5277M6461J4700L4764M1030j0724
11497E3721L0277K3274n1119m5570j1883L4898M8036K6554k8409o0149n1917o5094
11485i7381j7436M5711J914m7898K2691L7645J6619L3189k1956K9529J2901q028
11473G500j0320K0869j2323O138J14j5878m0273o87J7761j112J2872o349L00n699
11459b7087j0804J7616K9329J3606l99j3936p6793m6656O4676L1962N289n789
$$ plain form
11546 19843 13524 -33851 -52692 -67379 -77580 -70321 -17388 14105 65725 77743 21381 3456
11534 3456 436 -10332 -15142 -42137 -33298 -37925 -11573 -8818 41799 40359 28509 64798 71630
11521 71630 42468 14684 -46205 -61034 -2948 -8460 -24543 -62980 -52211 -48092 -63415 -62017
11509 -62017 -68416 -105596 -75409 -18551 -17980 -57233 -72510 -26049 -11349 23415 64445 53721
11497 53721 83998 107272 56153 10583 -1300 33598 81634 108188 79779 19630 -32287 -97381
11485 -97381 -114817 -69106 -67192 -115090 -92399 -54754 -38135 -4946 -26902 2627 15528 7500
11473 7500 -2820 18049 5726 11864 11978 -3900 -44173 -44860 -27099 -28211 -15339 -21688 -21388 -27087
11459 -27087 -37891 -20275 9054 22660 22261 8325 -68468 -115124 -50448 -18486 -13197 -18986
11447a8986L1516k3104o7374M0552N2306k57Q33J4490K2539l4710m6369o106K3472
11434a1198L4057k6095m4913K5882J9577m7736o9142K3803K6791l1883L0869O6404
11422c584L0437K0283K8023n1080J0262P7629K4370K1433k406n9982p8439k6194
11410i248N10K9841J707m0472K4274j7559m3944K9102l7795L9706N9171n843o5685
11397c6235j3720M4348J1810o708J1250J750m6642k0634N608P1341K4248N576
11385E1992m137m0352K7656k5226n0524r74J5586j2716K325K8912M0615m1961
11373h804N980n4260m2757k082J8026L9624M2311J7024K0469J1139J142k5612
11361B2200k4670k2358P691O385r799K488J4855l9846n3095K5004J9396J99N272
$$ plain form
11447 -18986 12530 -10574 -77948 -37396 14910 14653 15486 29976 52515 17805 -28564 -34670 -11198
11434 -11198 22859 -3236 -48149 -22267 -2690 -50426 -119568 -95765 -68974 -100857 -69988 -3584
11422 -3584 26853 47136 75159 24079 34341 111970 136340 157773 155367 95385 16946 -9248
11410 -9248 -8738 21103 22810 -17662 6612 -10947 -54891 -25789 -63584 -23878 35293 29450 -36235
11397 -36235 -49955 -5607 6203 -505 10745 12495 -34147 -54781 -49173 22168 46416 51992
11385 51992 47855 7503 35159 9933 -40591 -41565 -25979 -38695 -36370 -7458 33157 -8804
11373 -8804 -2824 -57084 -99841 -101923 -83897 -44273 -1962 15062 35531 46670 47812 22200
11361 22200 -2470 -24828 -17137 -10752 -20551 -18063 -3208 -43054 -96149 -71145 -51749 -51550 -46278
11348d6278K1364N8253j5616j90M88j614k0900r053L5931k3977J3049L7186R466
11335E8109l965l4157k0794l9372j0018p746J8228Q527K1107K2403l9715j9336
11323d6729k9282K5241K2287J1889j4843M2538K5494j7868j0709m2169K0447N9310
11311D5606j9558n4988k511j8658J799N775J6775J8047m2034j0989O740N189j2780
11298f1587k9415k9993J6568N6158m783j7489J5069P889l7881J334K5702J3929
11286d4499L7919M4509J9088l1764L351L9365N939j1345l8685n2156J8081K7430
11274A7233j8079M427M3604n815L3247m0516q5307L7265J5497l8054l9567m9034
11262a25099j1157J7838L2388M7777J0321K4311r48K6822L8695J1261R204l6542
$$ plain form
11348 -46278 -24914 33339 17723 17533 18021 16407 -4493 -13546 22385 -1592 11457 48643 58109
11335 58109 54144 19987 -807 -40179 -50197 -57943 -39715 -31188 -10081 12322 -27393 -46729
11323 -46729 -76011 -50770 -28483 -16594 -31437 11101 36595 18727 8018 -34151 -13704 45606
11311 45606 26048 -28940 -31451 -50109 -48310 -42535 -25760 -7713 -49747 -60736 -53996 -48807 -61587
11298 -61587 -91002 -120995 -104427 -48269 -53052 -70541 -55472 -47583 -85464 -84130 -58428 -44499
11286 -44499 -6580 37929 57017 25253 28604 67969 73908 62563 23878 -28278 -10197 17233
11274 17233 -846 3581 47185 41370 74617 34101 -51206 -13941 1556 -36498 -76065 -125099
11262 -125099 -136256 -118418 -86030 -38253 -27932 -3621 -4569 22253 60948 72209 81413 44871
11250D4871n8517k1881K3821L2615l173m640m447k1109m7330k1612K8978J2590
11238c9834j3025N2540l749n5111J1623J3340J0754J7140L2263P073r716k6665
11226c367J5591N5064L550o395l9717l9801P231J5698J1146m4488L8621j8691
11214e558j577k1590M279j1876J7690K7335L918O3397J3100m0693n6801j7635
11202b6011L5846L3841l7727n143N1621Q999m1185m7295J691P8398M0712L651
11190I7398j6304l8330j9466j1697k2931J9496l1266j0853J5527j3560j8722K699
11178d8009L5164J7621k1756J6505L8287j5788L1474r712j7179o527J605K5409
11166D7094J0585M738N2257q075J7988L5074j7024O008O870o519j9846j1269K7465
$$ plain form
11250 44871 -13646 -35527 -11706 20909 17736 13096 8649 -12460 -59790 -81402 -52424 -39834
11238 -39834 -52859 -319 -4068 -59179 -47556 -34216 -23462 -6322 25941 33014 23298 -3367
11226 -3367 12224 67288 70838 64443 24726 -15075 -7844 7854 19000 -25488 13133 -5558
11214 -5558 -7135 -28725 -24446 -36322 -18632 8703 12621 76018 89118 48425 -8376 -26011
11202 -26011 9835 43676 5949 806 52427 61426 20241 -27054 -25363 53035 93747 97398
11190 97398 81094 42764 23298 11601 -11330 8166 -23100 -33953 -18426 -31986 -50708 -48009
11178 -48009 -12845 4776 -16980 -475 37812 22024 53498 43786 26607 20080 21685 47094
11166 47094 57679 62417 114674 106599 124587 159661 142637 148645 155515 148996 129150 117881 145346
11153A45346N3712L3514K5578j2062n268l7286l6999J8851L1947o4426k6902o6397
11141E9608Q180M3927j626n0364n3892L763J0172L2363K500r976R426k9067l236
11128B1778O9958K5564K940J2003m4602J9614P5663L7359l5276m3676j5088M1265
11116A67502N4054M0427N5936K5899k0984k2860K6111j0919M528n1775l2727M766
11104B39958m1383l1305p260M6439O3866K01p1196k4849k5657k8133k2572L6147
11092A34256J2473P804j1797k4570m1618J7654l2689K5224K6064j2999P5175O956
11080A81933m3153j0702q439N781m519k2530J8392k596k5607m7043M9777L9499
11068A30793J6169L322K2981k6111k2410m855N4681J784l6257m341L31l3824m3711
$$ plain form
11153 145346 199058 232572 258150 246088 240820 203534 166535 185386 217333 152907 126005 59608
11141 59608 67788 111715 110089 59725 5833 9596 19768 52131 54631 44655 54081 25014 21778
11128 21778 91736 117300 120240 132243 87641 107255 182918 220277 185001 141325 126237 167502
11116 167502 221556 261983 317919 343818 322834 299974 326085 315166 319694 267919 235192 239958
11104 239958 198575 167270 160010 206449 270315 270516 199320 174471 148814 120681 98109 134256
11092 134256 146729 154533 142736 118166 76548 94202 61513 86737 112801 99802 174977 181933
11080 181933 138780 128078 119639 125420 120901 98371 116763 114167 88560 41517 91294 130793
11068 130793 146962 150284 173265 147154 124744 119889 174570 176354 140097 135756 136087 102263 58552
11055E8552l7473n3027l085J710q414m596M7093J9417k1635M6337k6533o270L4699
11042D6775R352J0845o1599k0171J2977l7431R054K3884M271j251n3631J6964
11030c9961K9161J6690K5356J4436K4473k8563k9971j4982O5987J5482m962j3641
11018E9505j3559j7954k7532j6556K7984k4370r6945J3982M4111J0340L36O927
11006c3731P5805K5803m3999l6661n3596J0649N8501k0093o423M8759J8101m557
10994C8558l6279l1043J2237K1360L6473j3863N50O5683j8201j6328l5198j6254
10982G695k2079m7654J0614L6625J5405l1332j6428M686Q297K9522L5146L6410
10970F6907j6946r488k6732J2128o485o253j6182N691L7152k6472Q145l0676K2458
$$ plain form
11055 58552 21079 -31948 -35033 -33323 -41737 -46333 760 20177 -1458 44879 18346 12076 46775
11042 46775 56127 66972 5373 -14798 -1821 -39252 -30198 -6314 -2043 -3294 -56925 -39961
11030 -39961 -10800 5890 31246 45682 70155 41592 11621 -3361 62626 78108 73146 59505
11018 59505 45946 27992 460 -16096 11888 -12482 -109427 -95445 -51334 -40994 -40658 -33731
11006 -33731 42074 67877 23878 -12783 -66379 -55730 2771 -17322 -23745 25014 43115 38558
10994 38558 2279 -28764 -16527 4833 41306 27443 27993 93676 75475 59147 23949 7695
10982 7695 -14384 -62038 -51424 -14799 606 -30726 -47154 -42468 -34171 -4649 30497 66907
10970 66907 49961 40473 13741 25869 19384 13131 -3051 2640 39792 13320 21465 -9211 13247
10957A3247N84K9885k8935l5762l9247m5295P209N4171J3946n010J4897J813r735
10944b8232k1266J6089J8122L4534K6013K6883l5925k6087k3508j0238M508J3417
10932e690J3863o933j5469n9311N5253K9218J7229M7683N33l3943k3293K2186
10920D1326P161l133j4594J6531r935k2494n3115O6802M5329l0052K876O9394
10908A16096L712m0459K0393J0572l2212K264L225o579J7322K2553k539N148J3302
10895A32798k678j1946K1051m068j6334j3686J6234j3459Q82O383J5015K194m7088
10882H5298K1217L9127j9165j1588j1321K1242r505j4749P19J712K5426j3953
10870A14460L6270K8391l006L0836Q0502k323j8339j1008J7718M0522P596k8792
$$ plain form
10957 13247 13831 43716 14781 -20981 -60228 -105523 -98314 -44143 -30197 -35207 -20310 -18497 -28232
10944 -28232 -49498 -33409 -15287 19247 45260 72143 36218 10131 -13377 -23615 -19107 -5690
10932 -5690 8173 1240 -14229 -73540 -18287 10931 28160 75843 76376 42433 19140 41326
10920 41326 48487 45354 30760 47291 37356 14862 -38253 28549 73878 43826 46702 116096
10908 116096 119808 79349 99742 110314 78102 80366 83591 77012 94334 116887 114348 119496 132798
10895 132798 130120 118174 139225 135157 118823 105137 121371 107912 108794 115177 130192 132386 85298
10882 85298 106515 145642 126477 114889 103568 124810 115305 100556 101275 102987 128413 114460
10870 114460 150730 179121 176115 206951 287453 285130 266791 255783 273501 314023 321619 292827
10858B92827k3521L6322l563j4452Q210j917j8101J2494l1322j6960n081R786
10846B44722k1608j2344L8010j3514n5965M354j9132j7304L4344L4189N951l0910
10834A90793m0630l2713J6300L4493K5729o094n1462j0416O2304Q7047O0809M653
10822C40813l2193j7361l702N630k8889l3885k9728j2246J7995M2463J1987l0494
10810B30390m6052j4649J75m0470J7909L5139n673l1254j2011l2755p8962j0144
10798A1643L182K7697l732j5009k400k602M422R981J2236o678j429j5990O2929
10785H4250k4935n2841K879P6892p037n116k5899l6727k8558L3651R830J6335
10773D2724l944l2447m7655l2804L0003K0227J3318j7979M0023M6888q212l8181
$$ plain form
10858 292827 269306 305628 302065 287613 295823 293906 275805 288299 256977 240017 234936 244722
10846 244722 223114 210770 248780 235266 179301 183655 164523 147219 181563 215752 221703 190793
10834 190793 150163 117450 133750 168243 193972 187878 136416 126000 188304 275351 336160 340813
10822 340813 308620 291259 287557 293187 264298 230413 200685 188439 206434 248897 260884 230390
10810 230390 184338 169689 169864 129394 147303 182442 176769 145515 133504 100749 21787 11643
10798 11643 14825 42522 38790 23781 21381 18779 23201 33182 45418 38740 37311 21321 84250
10785 84250 59315 6474 9353 86245 79208 74092 48193 11466 -17092 16559 26389 42724
10773 42724 38780 6333 -41322 -74126 -44123 -23896 -10578 -28557 11466 58354 50142 11961
10761A1961K389K7976k0703k2614j8045k7746j1019k5609K1164M3053O6510M4849
10749I2166m352k3092n1634q644l1864j029M4394O86l020L8477j2442Q412j2028
10736C6030N5623J1647j4411m75K7197m12n4967k6803K8619J3028p020j4877M955
10723E8134k973j2614m1524m4078l7754L0677j2448P4384K6507L35K9753k5597
10711D2802j9844j7904q4866j2071N6457K7311J8387J1118l5682m229J134l3882
10699e1269j1269O856l9607p166O0121L4333l5926J4124N323o688L9971R464j3032
10686E235K7337j5395l271j3259l937P202j2468M872J3508o31p114P308P045k0182
10672c750m9393O3834N7127l3316k1325k2273l6274k5729j8467l730K1449j0739
$$ plain form
10761 11961 14350 42326 21623 -991 -19036 -46782 -57801 -83410 -62246 -19193 47317 92166
10749 92166 87814 64722 13088 4444 -27420 -28449 15945 16631 13611 52088 39646 48058 36030
10736 36030 91653 103300 88889 88414 115611 115199 60232 33429 62048 75076 68056 53179 58134
10723 58134 55161 42547 1023 -43055 -80809 -50132 -62580 11804 38311 38646 68399 42802
10711 42802 22958 5054 -79812 -91883 -35426 -8115 10272 21390 -14292 -18521 -17387 -51269
10699 -51269 -62538 -55682 -95289 -102455 -42334 -8001 -43927 -29803 -24480 -31168 8803 18267 5235
10686 5235 32572 17177 13906 647 -3290 3912 -8556 -3684 9824 9193 2079 9387 16432 -3750
10672 -3750 -53143 10691 67818 34502 13177 -9096 -45370 -71099 -89566 -93296 -71847 -82586
10660h2586J3955l237N6824k134k4599O078j4293Q182P6940Q1274M4549m3978
10648A16975m2629o7325j3075k048L8428J687J0022J6841j2424J2122K6001J535
10636H6110k8759j5310o443k0579n308J2885j4009J0401K2855J1219j7288p8980
10624d3206R737K3105P490M0054O5965R794J333j8884J4634p654J930j5385m1431
10611D7482K0464M290j3452L5499n4039m4424J7113L5500K125L2415K5629J4773
10599A23375n9797m2333R8275N5100L5613l3980l0244j9648n1627k7089j3372
10588C4273j6622K2082p100j1744J9612Q016o7727j5246N2804J2233m8808m1146
10576e9373r759K5910Q2249L2739n2944l5436j8981J3737N7706K5335j8491j2562
$$ plain form
10660 -82586 -68631 -71868 -15044 -17178 -41777 -35699 -49992 -41810 35130 116404 160953 116975
10648 116975 74346 7021 -6054 -8102 30326 32013 42035 58876 46452 58574 84575 86110
10636 86110 57351 42041 35598 15019 9711 22596 8587 18988 41843 53062 35774 -43206
10624 -43206 -33469 -10364 -2874 37180 103145 112939 114272 95388 110022 102368 104298 88913 47482
10611 47482 67946 72236 58784 94283 40244 -4180 12933 48433 50558 82973 108602 123375
10599 123375 63578 21245 119520 174620 210233 176253 146009 126361 74734 47645 34273
10588 34273 17651 39733 32633 20889 40501 48517 -19210 -34456 18348 30581 -18227 -59373
10576 -59373 -69132 -43222 39027 71766 18822 -16614 -35595 -21858 35848 61183 42692 30130
10564C0130K1375K5209K8493K3217j5213k6480l7870j9085J8726j7636l4499o54
10552d287q962J3971M1452L3609J2959o138j5973l7197n6569o7339o1834M6528
10540a09780P1256l3493J9J1660Q547L1100J1794J2356K5045r397K6468J3878
10528E9453m7854m5983Q664M629K2724M5929L2104n1059m5720J0911n720q407
10516b0329K2897K4653J3308j1221J250L5410M176n6067j6871l6835j0069L6183
10504a3515M8149R120p618J414N4282K3504k5938k7889Q8r813L3333m6079m2355
10491c317L3176L7216J0743p161J7358j0954k6001K0576j5048n6270j559K2379
10479B1138M0138K4846l2969o5182J6496N2256L4334J0318j4394m9315k5224K2718
$$ plain form
10564 30130 51505 76714 105207 128424 113211 86731 48861 29776 48502 30866 -3633 -4287
10552 -4287 -13249 722 42174 75783 88742 82604 66631 29434 -27135 -94474 -156308 -109780
10540 -109780 -38524 -72017 -71998 -60338 -51791 -20691 -8897 3459 28504 19107 45575 59453
10528 59453 11599 -34384 -25720 -21091 1633 47562 79666 28607 -17113 -6202 -11922 -20329
10516 -20329 2568 27221 40529 29308 30558 65968 70144 14077 -2794 -39629 -49698 -13515
10504 -13515 34634 43754 36136 37550 91832 115336 89398 61509 61597 51784 85117 39038 -3317
10491 -3317 29859 67075 77818 70657 88015 77061 51060 71636 56588 318 -1241 21138
10479 21138 61276 86122 53153 -12029 4467 56723 91057 101375 86981 37666 12442 35160
10467C5160q823k9248m1806J3466J4698L5108J1880J944n6082l300L8306k3845
10455a2542K8789l3454q4898j15Q4790L5145k927j2690J6206J5603O4525J6875
10443A15307l6580N892J3827j2192k7542k1542l9025k3098J2816k534L2230M3136
10431F0695L0271o207k5006L887K4630N6777j4638l6777l1277k8473M3095L6178
10419A13155j5714m9949M1619k6084n8364N1591L6345M1316L3473r035o299j1087
10407A40967K851P749K6005J6757J2699M2056K9215K0735O7945K01236J29002
10396F97217J31092J29715K17684K16930J68486J50216J42199P2781j6675q4148
10386A825497q4069j26595j96395j96649j80689j93748j50198r2857j01107o0391
$$ plain form
10467 35160 26337 -2911 -44717 -31251 -16553 18555 30435 32379 -23703 -27003 11303 -12542
10455 -12542 16247 -17207 -102105 -102220 -17430 17715 14788 2098 18304 33907 98432 115307
10443 115307 78727 84619 98446 86254 58712 37170 -1855 -24953 -12137 -14671 17559 60695
10431 60695 90966 84759 59753 63640 88270 145047 130409 93632 62355 33882 76977 113155
10419 113155 97441 47492 89111 63027 4663 56254 92599 133915 167388 158353 152054 140967
10407 140967 143818 151567 177572 194329 207028 249084 278299 299034 366979 568215 697217
10396 697217 828309 958024 1175708 1392638 1561124 1711340 1853539 1926320 1909645 1825497
10386 1825497 1741428 1614833 1418438 1221789 1041100 847352 697154 604297 503190 442799
10376D42799n1629p1205l0461J082j176n4157k6816K911K958l8198q025k4692
10364A43391j8785n539R67M16J7905L608k6987Jj6570j8226O6573P1075n2557
10351A65272m9010J5807j975j6321K4633P720J4841j5782k0146j9669j5559M955
10339I4766q668J8003L3453Q982P495k9353m1306j4258J6225k5452J925K5590
10327H7402M32l1629l5727N47P225L8947J163K7886o336k350o743k6044J8323
10314G3096M0293k455m7343m9638L540O5637L6305l4856m4013K740J3947K46j3941
10301D3558L1240K5082k8286o7137k8489K4684K41K3981L5072L7252k5925j3410
10289E7863N2010L8538K0712j4620m1189p981J0139j6206m8267l9659j0310m089
$$ plain form
10376 442799 391170 319965 289504 290586 289410 235253 208437 211348 214306 176108 168083 143391
10364 143391 124606 119067 120034 120450 138355 141963 114976 114977 98407 80181 146754 217829 165272
10351 165272 116262 132069 130094 113773 138406 146126 160967 145185 125039 105370 89811 94766
10339 94766 86098 104101 137554 146536 154031 124678 83372 69114 85339 59887 61812 87402
10327 87402 87834 56205 20478 21025 28250 67197 68360 96246 89910 87560 80817 54773 73096
10314 73096 113389 110934 63591 13953 17493 83130 119435 84579 40566 43306 57253 57499 43558
10301 43558 74798 99880 71594 4457 -24032 652 893 24874 59946 97198 71273 57863
10289 57863 109873 148411 169123 154503 113314 105333 115472 99266 50999 11340 1030 -3059
10277c059j4621J1737O5819Q392q2421j979P245m2349P158N2971M4871j3348K5673
10264F6089j0769R454R75L2512J2041m5962Q262P369n8327o809L0674k6216K0588
10251C9881J8633o897K493j667m4860J7412r006Q054K4384J6114m671l1400M631
10238C3101k977P657K0832K4251J8984q228r760J2683l9027m8584o841N1383p478
10225D5996K8296j1486k523J4053J7069L3645K8724O3p295K5912K4504M4267j756
10212B39469j6162J8182M8714J00590J00115Q2358J74094K77832L78077L72557
10202A775826M13381L77793L46098L37373J97777j7599k11638k90554l00212l49607
10192B278638m35371m22620l51361k34167j29195j25749j16806j9333l8312l3189
$$ plain form
10277 -3059 -17680 -5943 59876 68268 -14153 -16132 -8887 -51236 -44078 8893 53764 40416 66089
10264 66089 55320 64774 65749 98261 110302 64340 72602 79971 21644 14835 45509 19293 39881
10251 39881 58514 51617 54110 52443 7583 24995 15989 24043 48427 64541 59870 28470 33101
10238 33101 30124 37781 58613 82864 101848 93620 83860 96543 57516 8932 2091 53474 45996
10225 45996 74292 62806 60283 74336 91405 125050 153774 153837 146542 172454 196958 241225 239469
10212 239469 223307 241489 290203 390793 490908 573266 747360 1025192 1403269 1775826
10202 1775826 2189207 2567000 2913098 3250471 3448248 3430649 3219011 2928457 2628245 2278638
10192 2278638 1843267 1420647 1069286 835119 705924 580175 463369 444036 405724 372535
10182C72535j2592j9373k0625k4573n6012o7416K801M4464P7275L4223o1627k4596
10170B44484K075m2777l4458n2827j9997K5260O894n1684K1289M2446M2786k7693
10158A55798l4478j548l5214q0636Q702P4752r795n68K703o1603n1731p252O0640
10145A9770J9824L6808j3057l6143O994M70J4343j8701J9436k6448J082N98k6441
10132a465k6982m5838K848Q975J5896L9745K5703K0388J1015r380k4911k655l4160
10119b0821L6592K9097m863J8265J1362N242J6984n5572J1944k0893L2257J4608
10107G4202k1207k0711l5931k7729J8342J7089J4361K1965J0195L1562N034k7798
10095E9374n8801K0170J1211j8870j2414n6544K3147N9893j8865n5165k8336J3765
$$ plain form
10182 372535 359943 340570 319945 295372 239360 171944 174745 219209 296484 330707 269080 244484
10170 244484 246559 203782 169324 116497 96500 121760 128654 76970 98259 140705 183491 155798
10158 155798 121320 119772 84558 3922 12624 87376 77581 77013 79716 18113 -33618 -40870 19770
10145 19770 39594 76402 63345 27202 34196 34666 49009 30308 49744 23296 24378 24976 -1465
10132 -1465 -28447 -74285 -71437 -62462 -46566 -6821 18882 39270 50285 40905 15994 13339 -20821
10119 -20821 15771 44868 40005 58270 69632 74874 91858 36286 48230 27337 59594 74202
10107 74202 52995 32284 -3647 -31376 -13034 4055 18416 40381 50576 82138 87172 59374
10095 59374 573 20743 31954 13084 670 -55874 -32727 27166 8301 -46864 -75200 -61435
10083f1435L7901L7169K1206l5764n95L6163L5838M1116k0390J6919K1963j6209
10071A13882j844j1790N2301O7625L5483q173n1016n9556J0020J0158p948l6850
10059A12292L7659K764P263J9076J9625J6176K5204Q683Q775j2494O0574R5451
10047D01048P056Q403M7326L8430O0768O7084J31861K11706J65415K82489M82364
10036A903950P13806J253366K188777L029764K851301Q52606j145362k253037
10028I395171k331589j916779j451197r84674o41476m45661k77051j80270j33104
10019A033370j39759n2503p8505o9878j5601p2988n5032J1744n3421n0296o8049
10008C89082l7344n3868m8226N6955L2150j7945l3266l2069Q765J4967n4783l7069
$$ plain form
10083 -61435 -23534 13635 34841 -923 -1518 34645 70483 111599 91209 108128 130091 113882
10071 113882 112038 100248 152549 220174 255657 247484 196468 136912 146932 157090 149142 112292
10059 112292 149951 152715 159978 179054 198679 214855 240059 248742 257517 245023 305597 401048
10047 401048 408104 416507 463833 502263 563031 630115 761976 973682 1139097 1421586 1903950
10036 1903950 2617756 3871122 6059899 9089663 11940964 12793570 11648208 9395171
10028 9395171 7063582 5146803 3695606 2710932 2069456 1623795 1346744 1166474 1033370
10019 1033370 893611 841108 762603 692725 677124 604136 549104 560848 507427 457131 389082
10008 389082 351738 297870 249644 306599 338749 320804 287538 255469 264234 279201 224418 187349
9996A87349K3754K2315P044K7471j1571n3715k0263j4083j3319J5927l548k6224
9984A41137k6066j2424L2365K4090J0789l2564j7016J3894J521K561J8352k2561
9972A34078l5039j5748p433L6784J0776k0424m3409k754J9726k4019m2725j3556
9960c743K0554j7948N5941L4213N7651L4110k8835n3040l3243k7954k10K6645
9948F4141M3477L8609J9999o837n099j7705m8341k5179m067j2726m1K1405j1202
9935E6434q544k2384j6009m583K4992J8966L9040j0970k2950j5037P816L5296
9923H2067P1q979j7751O520o460j1208k4894n2644L5332M7479L3283q929l160
9910G0727j1930K8228j6481O22J850k9676O1774K8174l7266k9158Q859k6401K5035
$$ plain form
9996 187349 211103 233418 240462 267933 256362 202647 182384 168301 154982 170909 167361 141137
9984 141137 115071 102647 135012 159102 169891 137327 120311 134205 135726 138287 156639 134078
9972 134078 99039 83291 75858 112642 123418 102994 59585 56831 76557 52538 9813 -3743
9960 -3743 16811 -1137 54804 89017 146668 180778 151943 98903 65660 37706 37496 64141
9948 64141 107618 146227 166226 159389 154290 136585 88244 63065 58998 46272 46231 67636 56434
9935 56434 47890 25506 9497 4914 29906 48872 87912 76942 53992 38955 46771 82067
9923 82067 82138 73159 55408 61928 55468 44260 19366 -33278 2054 49533 82816 73887 70727
9910 70727 58797 87025 70544 71166 73016 43340 105114 133288 96022 66864 75723 49322 74357
9897G4357n7168n228l3920k6717O8634P0852K4538R044m7239l47K3479r665J2486
9884A03106n8310l1131L2139N183j6749J4985L7243N8755K2481m3433l2997J4312
9872A05584j1437L1850K7237J4990o5206n1405M8836J3711q726n539k0513P052
9860H6434K892K3181L3860j7082j2665j8734P959M049m3128l1596j8604L4774
9848E1340P3104K1998m9661k0985m3307k5115j937J9327k086k91K0800M7812K6848
9835A17847m0979J022K2636K3985J4159n3270m8071r202N1707P5093N9016J7575
9823B31518k5425l0611O092J3256k9930k7177N216J6247m015k7125j6161J1523
9811A23408k0291m2142l3192O441j124L587m209k2266M6987K7168o8295j4865
$$ plain form
9897 74357 17189 11961 -21959 -48676 19958 90810 115348 124392 77153 76806 100285 90620 103106
9884 103106 44796 13665 45804 50987 34238 49223 86466 145221 167702 124269 91272 105584
9872 105584 94147 125997 153234 168224 103018 51613 100449 114160 105434 99895 79382 86434
9860 86434 89326 112507 146367 129285 116620 97886 105845 109894 66766 35170 16566 51340
9848 51340 124444 146442 96781 75796 32489 7374 5437 24764 22678 22387 43187 90999 117847
9835 117847 76868 77890 100526 124511 138670 85400 37329 28127 79834 154927 213943 231518
9823 231518 206093 175482 181574 194830 164900 137723 142939 159186 155171 128046 111885 123408
9811 123408 103117 60975 27783 34224 33100 36687 32478 10212 57199 84367 16072 1207
9799A207P1753K6461k3024K1294k461k5209K0931k3125k3665K5277M6379k2006
9787I3812k1835l479J8336J3872l3155k5256J9869O573o7746l921Q2614k7228
9775E2456k3672J0536J2374k4555m9794P979L3449J7860j2633K0393n36j5425
9763B8432J0791M2387O200m2939R516J4433J4796l701m8123l8281J9950O1357
9751G4818k4549j7812k5695L933L4787j2919K136J4630L515k4391K460N827J5590
9738E2330M9064l2883l2235L0995o037k7227m1167j0103K6017J8907j443J125
9726B7343K4208k344K1665J3601j9328k3604Q33M0955K6518l8336m3570j6539
9714A1402l916L189J9350O2383K5722R919K8831j8166j9845j7777j931J355p0059
$$ plain form
9799 1207 72960 99421 76397 97691 95230 70021 90952 67827 44162 69439 115818 93812
9787 93812 71977 68498 86834 100706 67551 42295 62164 68737 991 -2930 79684 52456
9775 52456 28784 39320 51694 27139 -22655 -14676 18773 36633 24000 44393 43857 28432
9763 28432 39223 81610 87810 44871 54387 68820 83616 79915 31792 -6489 13461 74818
9751 74818 50269 32457 6762 10695 45482 32563 34699 49329 52844 28453 30913 36740 52330
9738 52330 101394 68511 36276 67271 61234 34007 -7160 -17263 8754 27661 26218 27343
9726 27343 51551 49207 70872 84473 65145 41541 42374 83329 109847 71511 27941 11402
9714 11402 7486 10675 30025 92408 118130 128049 156880 138714 118869 101092 99161 100516 30457
9701C0457m3294K4735J7379K5917K8230Q114j7843p742n0184L2426L0559M8287
9689A27041P8600j2226L235m1880k4969N2430J1548m6762J0138J722J9427n4224
9677A24080k7706k8215L7914J9494l6225j7241m899K0344l459k5376l3938J6131
9665D0904K9663o326k808K3040K0192r766N321j9337r012l0570N0958L8321j4089
9652A16491n9658l0353Q920K4523N4523L4525R738K2361k6433q65K6321l5123
9640A44970k2075l384j981J0248J6590k6543n590k4427p543N4052M0319j0483
9628A64153J7708L4167O149J5017l8884k1540j0420j8956l5092K5114k4827k8607
9616H3982m1493N684P4580O9808j9056m6043M251K2818R4988J7433k9876l7315
$$ plain form
9701 30457 -12837 11898 29277 55194 83424 91538 73695 65953 15769 48195 78754 127041
9689 127041 205641 193415 196650 154770 129801 182231 193779 147017 157155 158877 178304 124080
9677 124080 96374 68159 106073 125567 89342 72101 67202 87546 84087 58711 24773 40904
9665 40904 70567 64241 61433 84473 104665 94899 100220 80883 71871 41301 92259 130580 116491
9652 116491 56833 26480 35400 59923 114446 148971 158709 181070 154637 153772 180093 144970
9640 144970 122895 119511 117530 127778 144368 117825 112235 87808 80265 134317 174636 164153
9628 164153 181861 216028 222177 237194 198310 176770 166350 147394 112302 137416 112589 83982
9616 83982 42489 48173 122753 192561 173505 127462 131713 154531 249519 266952 237076 199761
9604A99761j2599L4712K7185M696o0024j7581L5488j5424o875P802R014j0562
9592A95593L1008Q731J5613j083J56K1131k1332j9062k1326j0364n181m4697j2568
9579A36619J8707j7600K4523Q3704K3928j1303N5909R729l4924n5840j115K1531
9567B53868L2399O0142J5032q008o2448n9744J7578m537j8323M7828M5896j5179
9555C04504m5564j1423O090N783k8890l6425J4199M4556K4784J6656m76j1052
9543B82742k7829l5006J7737k3445j2624R335j3561j0040L4666Q481j8748M4921
9531B56629J0347o3775r188P790O5290M0207M28o0076m3042M8685L5358j4469
9519B74184m999N0530J124o4786o2967J3636O8536L4457j6489Q064K6602r962
$$ plain form
9604 199761 187162 221874 249059 253755 193731 176150 211638 196214 189339 197141 206155 195593
9592 195593 226601 235332 250945 249862 250018 271149 249817 230755 209429 199065 193884 149187 136619
9579 136619 155326 137726 162249 245953 269881 258578 314487 324216 289292 233452 232337 253868
9567 253868 286267 346409 361441 353433 290985 231241 248819 244282 225959 273787 319683 304504
9555 304504 258940 247517 253607 259390 230500 194075 208274 252830 277614 294270 293794 282742
9543 282742 254913 219907 237644 214199 201575 210910 197349 187309 221975 230456 211708 256629
9531 256629 266976 203201 194013 201803 267093 307300 307728 247652 204610 253295 288653 274184
9519 274184 269185 319715 320839 256053 193086 206722 275258 309715 293226 301290 327892 317930
9507C17930o7725k1604J0832K0493J7328n4038m3361J0187L1881Q009k4131J9761
9495B25562O1417K0807j6915K3761K3497n1380p211J2977k1146K0187q034l193
9483B80329L3231K6170J2384l7516j5267K1321J9026J1841K4756K3276q547q166
9471C82838o5655m3874J2422l2419l9904J3875M1241O788M2578M8040K855k1455
9459C47330K241l0801O8759K2512j0967M172j6569k760N516j6340m2503k17n108
9446C25265k8893j0680K9143m113N0348O2356n042j4038Q942q923J4149N215n0970
9433C72759J6454M3110K9924n4015j6322l5400l748N655K2168M1244R1409M2001
9421E55239l5305l5611m028j1450m4173P137K162K7033l9149p5088l681j1806
$$ plain form
9507 317930 250205 228601 239433 259926 277254 223216 179855 190042 221923 229932 205801 225562
9495 225562 286979 307786 290871 314632 338129 286749 279538 292515 271369 291556 283522 280329
9483 280329 313560 339730 352114 314598 299331 320652 339678 351519 376275 399551 391004 382838
9471 382838 317183 273309 285731 253312 213408 227283 268524 275312 317890 365930 368785 347330
9459 347330 349571 318770 387529 410041 399074 403246 386677 383917 389433 373093 330590 330373 325265
9446 325265 296372 285692 314835 310722 361070 423426 418384 404346 413288 404365 418514 423729 372759
9433 372759 389213 432323 462247 408232 391910 356510 352762 358417 380585 421829 513238 555239
9421 555239 519934 484323 480295 468845 424672 431809 433971 461004 421855 346767 343086 331280
9409C31280o0095M0202J4502k3607K3421N7193O4233L3444j1657L033R262O202
9397D87413M521m8850m3641j7821J6913R949p38m5921j0596K3400J8219L73K2742
9384D15963m7751m637N9318n13k4693J1587K9168K5857r187n1725j1220m0567
9372C51600J0685o106j2123o324J9431J3193p373O938k475l4825n2745L4355K6420
9359C40651O0006L368j8007n2766j8992L7806K6312N5689J3012j6712j5990l5184
9347C79193L997k8873n1670j3074K5794P5006l43m6823K7304J1595J951J1891
9335C95948J2336L077m502J8697J8644j7224n4092L291J7006l7021O277M6628
9323D09065l1298o995K0555P18k76K3088L5710K3107q576l2930j611q708j6214
$$ plain form
9409 331280 271185 311387 325889 302282 325703 382896 447129 480573 468916 471949 481211 487413
9397 487413 491934 443084 399443 381622 398535 408484 407746 361825 351229 374629 392848 393221 415963
9384 415963 368212 363575 422893 422380 397687 409274 438442 464299 455112 403387 392167 351600
9372 351600 362285 356179 344056 337732 357163 370356 362983 369921 367446 332621 279876 314231 340651
9359 340651 400657 404025 386018 333252 314260 352066 378378 434067 447079 430367 414377 379193
9347 379193 383190 354317 302647 289573 315367 390373 390030 343207 370511 382106 384057 395948
9335 395948 408284 411361 406859 425556 444200 426976 372884 376175 393181 356160 362437 409065
9323 409065 377767 370772 391327 392045 391769 414857 450567 473674 465098 432168 430557 421849 405635
9310D05635m3086p248j5254j7476m338j7316L9833k6446M9211O4496P307k4889
9298D10429J6952J1093r129K4553K8935j1620J1513K2505j4758M6630O3067N9474
9286F59644Q3752R8911K8501J6100L776m7183o5482o5678l2850n0820r723K1303
9274F40251j893L9893Q1220L7238Q0525Q4573M4321L0147M8833J4051j4588O286
9262A090857M7566K3706P328q859m8425q1147p3040o954P579Q3282J03708P7515
9250A223116J86232K08385K05749J94762J0620j10785j18809j59249j74622j51805
9240A313594j28841n6257p0187m7688k7363L1410k1428q500Q950K9372N6873L6446
9228A116381L1021k1382J2940Q091j2578k109m8956j00447n2925l2493m4279q273
$$ plain form
9310 405635 362549 355301 340047 322571 318233 300917 340750 314304 363515 428011 435318 410429
9298 410429 427381 438474 429345 453898 482833 471213 482726 505231 490473 537103 600170 659644
9286 659644 743396 842307 870808 886908 890684 843501 778019 712341 679491 628671 618948 640251
9274 640251 638358 678251 759471 796709 877234 961807 1006128 1036275 1085108 1099159 1084571 1090857
9262 1090857 1138423 1162129 1169457 1160598 1112173 1031026 957986 951032 958611 1041893 1145601 1223116
9250 1223116 1409348 1617733 1823482 2018244 2028864 1918079 1799270 1640021 1465399 1313594
9240 1313594 1184753 1128496 1058309 1010621 983258 1014668 993240 984740 993690 1023062 1079935 1116381
9228 1116381 1147402 1126020 1138960 1147051 1134473 1132364 1083408 982961 930036 897543 853264 844991
9216H44991l203M5329N7173N3937O9636N5988K9495p076q369J5345k2054p7305
9204A053887j19327o9575q9286j670O1912k0036j4030m085l6946J5284M6670M2717
9192H65515m00j6146k6181n4137K1025Q847L265M4490p094J5902l3780m84M8653
9179H69475M0705k0360l3529k1858m112N5942J5614l7096j6765p427j8536M4820
9167H66873M4778m2300j3210q777J1266k0724m3050K0280P917K4078J8109J0717
9155H75957L5044K38o6835j3866J4390J3947J2048P4310M5544N2266J0547m1836
9143A011754j539M632j7142l0770K4476P1415N339p590N7716L3213K632k736n2035
9130A099365j1360K8215L9868K7845r691j091k9017p791O043K8186l622j0832
$$ plain form
9216 844991 841788 887117 944290 998227 1067863 1123851 1153346 1146270 1137901 1153246 1131192 1053887
9204 1053887 934560 864985 775699 774029 835941 815905 801875 797790 760844 776128 822798 865515
9192 865515 865115 848969 822788 768651 789676 798523 801788 846278 839184 855086 821306 820822 869475
9179 869475 910180 889820 856291 834433 830321 886263 901877 864781 848016 840589 822053 866873
9167 866873 911651 869351 856141 847364 858630 837906 794856 815136 823053 847131 865240 875957
9155 875957 911001 911239 844404 830538 844928 858875 870923 945233 990777 1043043 1053590 1011754
9143 1011754 1010215 1014847 997705 966935 991411 1062826 1068165 1060575 1118291 1151504 1154136 1151400 1099365
9130 1099365 1088005 1116220 1156088 1183933 1174242 1173151 1144134 1136343 1142386 1170572 1166950 1156118
9118A156118M3260N3354Q596K1728N830m7361J6518L8420K9617l254K6809L1674
9106A381309L7863p346J3049j5835M2200L0289L0285L237K0653M2633m135k9493
9094A544709L4094J5638K5643m157l4257K7745J7133Q5481N7777L3639J7264K1502
9082A842211n376J2907J7067N3138K1557N8724Q8864K3351k8774n841j153R6742
9070B173417M1563P3512K0033M0520K8946K9997O7384Q2807K9697Q6352K9971
9059B704199l3991J0732L971r842J3363O6190L9678P6186N1644N5845O0299L2259
9047C070533M4176J5712O7268L7059k894J9320M5287M7772M8112R7195M7459N0040
9035C587039L4354Q2722M1639K0736M1155J01928J37680P2556N8498P3332J30461
$$ plain form
9118 1156118 1199378 1252732 1261328 1283056 1288886 1241525 1258043 1296463 1326080 1322826 1349635 1381309
9106 1381309 1419172 1411826 1424875 1409040 1451240 1481529 1511814 1515051 1535704 1578337 1574202 1544709
9094 1544709 1578803 1594441 1620084 1615927 1581670 1609415 1626548 1712029 1769806 1803445 1820709 1842211
9082 1842211 1836835 1849742 1866809 1919947 1941504 2000228 2089092 2112443 2083669 2077828 2076675 2173417
9070 2173417 2214980 2288492 2308525 2349045 2377991 2407988 2475372 2558179 2587876 2674228 2704199
9059 2704199 2670208 2680940 2684911 2675069 2688432 2754622 2794300 2870486 2922130 2977975 3038274 3070533
9047 3070533 3114709 3130421 3197689 3234748 3231854 3251174 3296461 3344233 3392345 3489540 3536999 3587039
9035 3587039 3621393 3704115 3745754 3766490 3807645 3909573 4047253 4119809 4178307 4251639 4382100
9024D382100J45848J09104P5758J34574J50021Q8131J01699J38186J43063R6492
9014E564976P0849Q9977J43262J62698J85801J80381J85238J47155J83985J71287
9004G085609J58325J45247J95573K79731K89583K77471K47875K88983K58968K20566
8994I447931K66966L67057L32628K75362K70882L39004M00211M14397M27469M34594
8984A2976501M56681M80991M95054N43143N22087N92703O72640O69076P09781
8975A8118657P27864P54808Q39175R08402R69851J029976J082444J101563J252119
8966B6784859J335677J341024J486498J670473J770039J849584J970861K139521
8958D0348536K300325K471433K689009K938240L163531L346069L631387L981396
$$ plain form
9024 4382100 4527948 4637052 4712810 4847384 4997405 5085536 5187235 5325421 5468484 5564976
9014 5564976 5635825 5725802 5869064 6031762 6217563 6397944 6583182 6730337 6914322 7085609
9004 7085609 7243934 7389181 7584754 7864485 8154068 8431539 8679414 8968397 9227365 9447931
8994 9447931 9714897 10081954 10414582 10689944 10960826 11299830 11700041 12114438 12541907 12976501
8984 12976501 13433182 13914173 14409227 14952370 15474457 16067160 16739800 17408876 18118657
8975 18118657 18846521 19601329 20440504 21348906 22318757 23348733 24431177 25532740 26784859
8966 26784859 28120536 29461560 30948058 32618531 34388570 36238154 38209015 40348536
8958 40348536 42648861 45120294 47809303 50747543 53911074 57257143 60888530 64869926
8950F4869926M181341M559813M848200N127399N446287N651087N928068O169112
8942A06781233O302431O324157O179403N913273N562420M997953M210581L356494
8934A49627945K365803J210603M7809j109037k124187l082664l948153m600803
8926A38387316n151567n529894n795305n822158n851833n730246n560780n351148
8918I3594385n092602m838322m609965m316516m031831l770980l525279l262273
8910F0146617l074965k837905k670777k524321k310335k161288k012872j909084
8902D0645070j769699j697963j599481j499749j415158j308366j265595j192781
8894B8896278j061871j040048r59784q52696q61988q31810p79069p56128o30228
$$ plain form
8950 64869926 69051267 73611080 78459280 83586679 89032966 94684053 100612121 106781233
8942 106781233 113083664 119407821 125587224 131500497 137062917 142060870 146271451 149627945
8934 149627945 151993748 153204351 153252160 152143123 150018936 146936272 142988119 138387316
8926 138387316 133235749 127705855 121910550 116088392 110236559 104506313 98945533 93594385
8918 93594385 88501783 83663461 79053496 74736980 70705149 66934169 63408890 60146617
8910 60146617 57071652 54233747 51562970 49038649 46728314 44567026 42554154 40645070
8902 40645070 38875371 37177408 35577927 34078178 32663020 31354654 30089059 28896278
8894 28896278 27834407 26794359 25834575 24981879 24119891 23288081 22509012 21752884 21122656
8885B1122656n90854n62246m99278m47472m93467l80872l33833l07747k42541
8876A7264346k43826j69388m6028J13625L46823P15794J294299K198441L505311
8867B4979397M779020M919028K917597m72848l214903m493095m443730l811589
8859B1158877k987353k180982j588970j151805q40626o29150n36959m87488m19637
8850A0335907l82893l40615l16491l14881k97653k52040k90244l53363k49543
8841G538184k49430k47577j69234j64328j44510j30488r6598j44952j57689j65615
8831E867763j49963r7704o3881j29539j05804m7358j26983j34320p1059q5832
8821D855320k2824o2202j17468r5030q9626q7014q7297n3773P744n248r8320p7666
$$ plain form
8885 21122656 20531802 19969556 19470278 19022806 18529339 18148467 17814634 17506887 17264346
8876 17264346 17020520 16851132 16805104 16918729 17265552 17981346 19275645 21474086 24979397
8867 24979397 29758417 34677445 37595042 37122194 33907291 29414196 24970466 21158877
8859 21158877 18171524 15990542 14401572 13249767 12409141 11779991 11243032 10755544 10335907
8850 10335907 9953014 9612399 9295908 8981027 8683374 8431334 8141090 7787727 7538184
8841 7538184 7288754 7041177 6871943 6707615 6563105 6432617 6336019 6191067 6033378 5867763
8831 5867763 5717800 5620096 5556215 5426676 5320872 5273514 5146531 5012211 4941152 4855320
8821 4855320 4832496 4770294 4652826 4557796 4468170 4381156 4293859 4240086 4247830 4242582 4144262 4066596
8809D066596m9475m6645p1337p3744p6744p3520n8680q3287o8211p4968m1515
8798C348470k0437o4980p1389o6525o4669o9044o5786m2079o2126o3485n3068
8787B704882K2857K9760m5986j18479j11837J8854K840L952k735o8741j22849
8776B312518j11675p0529k0915J985L567p347l7132L952r992l6894k6573k5528
8764A975437M106j9072q822m9468r5504l8498k0686j7451J2106p1006j2450k5522
8752A633170l279R284j7212J5269L137n0700j3216M4901k2162p5977n4260k7982
8740A440973K0931n826j4186K906n1261J3112j7060k2717j7507M158l7590o187
8728A309746l3860n3513m2116j693j1307l5786k0252l108J0770r867K3909k4003
$$ plain form
8809 4066596 4017121 3970476 3899139 3825395 3748651 3675131 3616451 3533164 3464953 3389985 3348470
8798 3348470 3328033 3263053 3191664 3125139 3060470 2991426 2925640 2883561 2821435 2757950 2704882
8787 2704882 2727739 2757499 2711513 2593034 2481197 2500051 2502891 2506843 2504108 2435367 2312518
8776 2312518 2200843 2130314 2109399 2111384 2114951 2107604 2070472 2074424 2064432 2027538 2000965 1975437
8764 1975437 1979543 1960471 1951649 1902181 1806677 1768179 1747493 1730042 1742148 1671142 1658692 1633170
8752 1633170 1629891 1639175 1621963 1637232 1640369 1589669 1576453 1621354 1599192 1523215 1468955 1440973
8740 1440973 1461904 1456078 1441892 1444798 1393537 1406649 1389589 1366872 1349365 1353523 1315933 1309746
8728 1309746 1275886 1222373 1180257 1178564 1167257 1131471 1111219 1108111 1118881 1109014 1132923 1108920
8716A108920q543L1755l0968k935k571J9550J9294m2859m2544l5910l4407J7082
8704I95864j8967n639J7095k1283l0176J7467m8949k8797N5392K8992o664m8978
8692I05357k7917J1242M0234J3187m6231k9237K1807M1681Q433j1099l6800l4570
8680H56087J3580j356K9672p064j5894J5449j5370L2097N2556j8222m412J4555
8668I51678M5297l237m2273n6983m9045L154K6236K1230j4629M416l0877l3472
8656H21495q3287o530O727N88R9631K3870o21M5830J6206L2422L9624j6741m5649
8643I33565j17920k8232K5823n0626l3521K24k6495j7458j9412J1191K7950l0767
8631F74322l7241J2469K0974j061J6470j9795k1734R596l4823j6460L4763L5772
$$ plain form
8716 1108920 1100377 1132132 1101164 1098229 1095658 1115208 1134502 1091643 1049099 1013189 978782 995864
8704 995864 976897 971258 988353 967070 936894 954361 905412 876615 932007 960999 954335 905357
8692 905357 877440 888682 928916 942103 895872 866635 888442 930123 938556 927457 890657 856087
8680 856087 869667 868311 897983 890919 875025 890474 875104 907201 959757 941535 937123 951678
8668 951678 996975 993738 951465 894482 845437 848591 874827 896057 881428 885844 854967 821495
8656 821495 738208 731678 738405 738993 838624 862494 861873 907703 923909 956331 995955 979214 933565
8643 933565 815645 787413 813236 762610 729089 729313 702818 685360 665948 677139 705089 674322
8631 674322 637081 649550 670524 669463 685933 666138 644404 654000 619177 602717 637480 673252
8619F73252l1337k5736J404k4599m273J6413K8370l5380l5623K6407J2098M4220
8607F45216J7698k4948k608q125k0234l2286O3762N2346m7342o5726Q303P119
8595E93175J2265J1452N5498L3917J4370K5589K1323J4286K2069L2473L0708L1741
8583H98866m4082m2243k390j9625k1723n6050J0445L7737k2606k4331N6086r177
8571G60907n0958l4937K213l0786m2899k3659J2420k9664l5126j4767J705K0435
8559E34884l9582l0138K3500O2297J715k0859l0593n4277k5525n654l1302K9144
8547D13610m092M373J5197N0420J6048m011K905l6803k3510j5371J6920L4838
8535D70524L209P132j4426o312J3849l7573O333m0917M7955j4776R623k7128n3603
$$ plain form
8619 673252 641915 616179 617583 592984 588711 605124 633494 598114 562491 588898 600996 645216
8607 645216 662914 637966 635358 627233 606999 574713 638475 690821 643479 577753 586056 593175
8595 593175 605440 616892 672390 706307 720677 746266 767589 781875 803944 836417 867125 898866
8583 898866 854784 812541 810151 790526 768803 712753 723198 760935 738329 713998 770084 760907
8571 760907 709949 675012 677225 646439 603540 579881 592301 562637 527511 512744 514449 534884
8559 534884 495302 465164 488664 550961 552676 531817 501224 446947 421422 415768 384466 413610
8547 413610 409518 413891 429088 479508 495556 491545 494450 457647 434137 418766 435686 470524
8535 470524 473733 480865 466439 460127 473976 436403 442736 401819 449774 434998 444621 417493 363890
8522C63890j7767O1421K7712N5611J6464k7180J9935K6388j0855j1728j8929k9107
8510D55855K4179O529j034m1115k5191k006K194l7356M620m218J2174k1643K8004
8497D00992j1611j5480k1576l2597N1584K8146K4195J7939L4620j8249l4977k2631
8485D00355m7417j286J6207L4952k6915l059k1210Q340J3608m56k0766J2466K0143
8472C84962m5811L704m843J4108O01p966K1187M6552j1577n349K5278K0530k6816
8459D14560M207m1587j0074J1765O2894l2176k4590K9940L0843m9854k8349l3056
8447C34523l1740J319J7535L7668N995k0908j6235j2807n8192l3926N9483K8265
8435C10980j9050j6496J566j3290K2012j8788L0543K3091m834l0354k371k0692
$$ plain form
8522 363890 346123 407544 435256 490867 507331 480151 500086 526474 515619 503891 484962 455855
8510 455855 480034 486563 485529 444414 419223 417217 419411 382055 386675 382457 394631 372988 400992
8497 400992 389381 373901 352325 319728 371312 399458 423653 441592 476212 457963 422986 400355
8485 400355 352938 351652 367859 402811 375896 372837 351627 359967 373575 373119 352353 364819 384962
8472 384962 339151 342855 338012 352120 352721 344755 365942 412494 400917 395568 420846 441376 414560
8459 414560 418767 377180 367106 378871 441765 409589 384999 414939 445782 395928 367579 334523
8447 334523 302783 304102 321637 359305 365300 344392 328157 315350 257158 223232 282715 310980
8435 310980 291930 275434 277000 263710 285722 266934 297477 320568 315734 285380 283009 262317
8423B62317K131Q852m947l397L7198K0778j3924J2580M0277J4534m4551l0497
8411C01351r962j0147q130j9061L1254J3580K9220O705J5712P574m4329k9508
8399B84259P765m1732n3k5683j141Q155j0804j091k9984j039K5010L3515L1134
8386B78311m4875n9258n8354K7789M9386j6437o19M7855M4589j4039l9438J1161
8374B26071J6176J1418P3460j02m0464j5363k5540m8050j0836q928R873k4163
8362A63552l0726J1315K238j1411K2136K571L6672R782K071j3857K047N446k7791
8349A74045j0393K8215k3378J6664J0769K6920N7870O723m7679m5871k9904k5600
8337A38381j2238J9709K6138o15j4326k0658J8466J3566N7684K9313m7024k5098
$$ plain form
8423 262317 264448 273300 268353 264956 302154 322932 309008 321588 361865 376399 331848 301351
8411 301351 291389 281242 273112 254051 285305 298885 328105 334810 350522 358096 313767 284259
8399 284259 292024 250292 250239 224556 223415 231570 220766 219675 189691 188652 213662 247177 278311
8386 278311 233436 174178 115824 143613 192999 176562 175943 223798 268387 254348 214910 226071
8374 226071 242247 253665 327125 327023 286559 271196 245656 197606 186770 177842 187715 163552
8362 163552 132826 144141 146379 134968 157104 159675 196347 206129 208200 194343 196390 201836 174045
8349 174045 163652 191867 168489 185153 195922 222842 280712 287435 239756 193885 163981 138381
8337 138381 126143 145852 171990 171375 157049 136391 154857 168423 226107 255420 208396 183298
8325A83298m5215N144M1206J5075q354j6604j013K759K824q275K6001L8851k5389
8312B10308k4148m3073K4368K5322j9002m0970K5875J7245K385J5613m0644n2693
8300A00586P613L898J4946P4206K2283m6462l4012K7531J445m6146K7791K8191
8288A81870J0274J5210k1204k9490l8826J1417p138j7545j6656R395J2214J7752
8276A27273L1451J5205n3132k568N2333J625j2847j0510J700L9766j744k2082
8264A66470m158K8730p1485l6723K2100K4116n7330n930J8859O0462o312l424
8252A35375l8372k3322K5755J9494K7768o613j8246K1215O4079K6394l3809J4930
8240B14648j1681m3876m7166l6204J8633J2833J8889J8813l072K6704l0030k4218
$$ plain form
8325 183298 138083 143227 184433 199508 191154 174550 173537 176296 179120 170845 196846 235697 210308
8312 210308 186160 143087 167455 192777 173775 132805 158680 175925 178310 193923 153279 100586
8300 100586 108199 112097 127043 201249 223532 177070 143058 170589 172034 125888 153679 181870
8288 181870 192144 207354 186150 156660 117834 129251 122113 104568 87912 97307 109521 127273
8276 127273 158724 173929 120797 118229 170562 172187 159340 148830 150530 190296 188552 166470
8264 166470 162312 191042 119557 82834 104934 129050 71720 65790 84649 145111 138799 135375
8252 135375 97003 73681 99436 118930 146698 140085 121839 143054 207133 233527 199718 214648
8240 214648 202967 159091 111925 75721 94354 107187 126076 144889 141817 168521 138491 114273
8228A14273J883k5962K650J4644k9257k695N0717J538J0779j4197m6212k987M4480
8215A19654P5286Q679k6989j9226j5802r914J9642K7855k5193n037j4467O292
8203A40780k3372N8978J8071l1118j6091l4889j0799k8437m4175P348M7647j0901
8191G3042M399L2257j030n048q334N122j691O5783m938l8373l9983m619l774J8778
8177I1591o326k0496o720K2486K5653O8144j4511n773l4002n825J7847Q901m140
8164A36829J5502J2912K2527K9781q979l407j628k1020k802K3259m839n7837M047
8151A44345k77J6444l951R47j3388L8595j5916m9938l0116k1988j0788L8315N4122
8138A46406L9105j5073o0985m8867K5041L4774L851K0006k6308j9K7505K7965
$$ plain form
8228 114273 116156 90194 92844 107488 78231 75536 126253 127791 138570 124373 78161 75174 119654
8215 119654 194940 203619 176630 157404 141602 131688 151330 179185 153992 148955 134488 140780
8203 140780 117408 176386 194457 163339 147248 112359 101560 73123 28948 36296 83943 73042
8191 73042 77441 109698 108668 103620 95286 100408 98717 164500 159562 121189 81206 76587 72813 91591
8177 91591 85265 64769 58049 80535 106188 174332 159821 154048 120046 114221 132068 140969 136829
8164 136829 152331 165243 187770 217551 208572 205165 203537 182517 179715 202974 198135 140298 144345
8151 144345 144068 160512 156561 157508 144120 182715 166799 116861 86745 64757 53969 92284 146406
8138 146406 185511 170438 109453 60586 85627 120401 124252 144258 117950 117931 145436 173401
8126A73401K808l5782l3006r254L572l8599k5197K8096J3285J3853o2419l4811
8114d053N758l784O0455O6905J3635o9611K0559K5076n0735J9818l5351L3722
8102H2394N2315K3621k3135k481j0271K885j1413k7316j9703K1012K1057j1339
8090I7626m616j5228k6961J2778j4341O558K7993k9627L2286j2178m257j3064
8078E6969K9402J5159l645m2710k7770M7211R37l6306M5850L936J0897n622J5559
8065A09867K3203l9194j6869L2310J6214K1537N711o8621O50L2146K3763k2182
8053A18535R007L3686m5294j1145j4527J8910L4445K6137l5587J9573L0021J80
8041A83941n3340J0579K7526n1884r6711J4729M2360N4141K706l4818Q529o263
$$ plain form
8126 173401 176209 140427 107421 98167 101739 63140 37943 66039 79324 93177 30758 -4053
8114 -4053 1705 -2079 58376 125281 138916 69305 89864 114940 64205 84023 48672 82394
8102 82394 134709 158330 135195 132714 122443 125328 113915 86599 66896 87908 108965 97626
8090 97626 93010 77782 50821 63599 49258 55816 83809 54182 86468 74290 70033 56969
8078 56969 86371 101530 97885 55175 27405 74616 75553 39247 85097 89033 99930 94308 109867
8065 109867 133070 93876 77007 109317 125531 147068 152779 84158 84808 116954 140717 118535
8053 118535 127542 161228 115934 104789 90262 109172 143617 169754 134167 153740 183761 183941
8041 183941 130601 141180 168706 116822 20111 34840 77200 131341 134047 99229 107758 101495
8029A01495l9029m3319M8597O6668N0598K4343k8632j1112m2966m2209k6079m420
8017E3935J5659J3871j1419m0713n328l341O016P203K029L5552k1110m0205k3254
8004a1105J7370j5707K5757P5745O2327m0371K874L010N393j1073j731J6111J3976
7991A42576M6646l0558Q761M9813k4489l6921O281j960l1625n7462K6543M4636
7979A42241j9698j0673Q796O445k6390L5453J5668k3423k3954n535k7974J4268
7967H5224M2614Q662k7614n3606K6511J0399J7851J8809R37k3443m1598k743N0151
7954A12154J1234J7269M4642q20j3545p4L222K4043j4041l8174k0410j4035j9019
7941I2446n4007J5159P9058K469n4675k8453Q366L1347L7938j0566j8049k3426
$$ plain form
8029 101495 62466 19147 67744 134412 185010 209353 180721 169609 126643 84434 58355 53935
8017 53935 69594 83465 72046 31333 26005 22664 28680 35883 37912 73464 52354 12149 -11105
8004 -11105 6265 -9442 16315 92060 154387 114016 116890 119900 125293 114220 112489 128600 142576
7991 142576 189222 158664 167425 217238 192749 155828 162109 160149 128524 71062 97605 142241
7979 142241 122543 111870 120666 127111 100721 136174 151842 128419 104465 98930 70956 85224
7967 85224 127838 136500 108886 55280 81791 92190 110041 128850 129787 106344 64746 62003 112154
7954 112154 123388 140657 185299 184479 170934 170860 174082 198125 184084 145910 125500 111465 92446
7941 92446 38439 53598 132656 135125 80450 51997 60363 91710 129648 119082 101033 77607
7929G7607l5442L0684P0386j2705k2403P879k8051K2222J3187J9805k2174j6209
7917A04786K0059L0048M82j2678M51k099K4726J2710p580j9230o3981P128Q672
7904A03494j9720j1920N6162J1289p116j00l5372L8426K0136O6317M684l8658
7892A87622k2570K041l3383r965k4754q644J5800P00m7498K0281p849j2955P426
7879F6252L3778k1197k2493J1032O599j1443J1223K2051l8011k8705M0889P124
7867G7099M831l1881l779j1707P845J7329K8286K3424J5087m588j9976n878K5810
7854A21902n518n4546R39j3121M109j4244J6843J2558m4475R346j3035m004R307
7841B6061O421N327L8843N3252m3322R138L6502n8632O864j375K3703J4004j5929
$$ plain form
7929 77607 42165 72849 143235 130530 108127 116006 87955 110177 123364 143169 120995 104786
7917 104786 124845 154893 155375 142697 143148 141049 165775 178485 170905 151675 87694 94822 103494
7904 103494 83774 71854 128016 139305 132189 132089 96717 135143 155279 221596 226280 187622
7892 187622 165052 167093 133710 123745 98991 90347 106147 106847 59349 79630 71781 58826 66252
7879 66252 100030 78833 56340 67372 73971 62528 73751 95802 57791 29086 69975 77099
7867 77099 81930 50049 46270 34563 42408 59737 88023 111447 126534 121946 101970 96092 121902
7854 121902 116384 61838 62777 49656 53765 39521 56364 68922 24447 33793 20758 16754 26061
7841 26061 32482 37809 76652 129904 86582 95720 132222 73590 80454 79079 102782 116786 100857
7828A00857n1175m9404j4175J3868M7509N8038K4905l347k5366l0726k7605r873
7816C3506o653J4280J4151K8385k5829n1125J7441M543j4101m614M1020l0252
7804B0752k9017N2918M4138j92k2259j5699M515j2167l913k8124l967K247m310
7791D922K8211J8879k9724l6747L0760k5506K8851K2109K53k5835M4285J5524
7779G5982J9200l2889l5429J5912k8550j5912j7382l8006j258j2832K1693O331
7767d3140j0906M0632M7240o253Q734k0503k2821m331k9998K065M4292k1554L7175
7754B0632K7795l865Q313q737k610n401K0368J8762P730l932J817o5738k4525
7741i391K3666O898K1626O657m770P658J5528K0722m062J1913m4323J413l8509
$$ plain form
7828 100857 49682 278 -13897 -29 47480 105518 130423 127076 101710 70984 43379 33506
7816 33506 26853 41133 55284 83669 57840 6715 24156 28699 14598 9984 51004 20752
7804 20752 -8265 44653 88791 88599 66340 50641 55156 42989 39076 10952 6985 9232 4922
7791 4922 33133 52012 22288 -14459 16301 -9205 19646 41755 42008 16173 60458 75982
7779 75982 95182 62293 26864 42776 14226 -1686 -19068 -57074 -58332 -71164 -49471 -43140
7767 -43140 -54046 -13414 33826 27573 36307 15804 -7017 -11348 -41346 -39281 5011 -16543 20632
7754 20632 48427 44562 52875 44138 41528 36127 56495 75257 82987 79055 80872 15134 -9391
7741 -9391 14275 21173 42799 49456 44686 52344 67872 88594 84532 96445 52122 53535 15026
7728A5026l414M059K113K2115Q917M13J5185N298K6950K0600O5353j540o3144
7715A17931m3348k8398j1436j1056m5714K8745N7909m7349J0307k4098R202j0342
7703B353J7805K0763N9541K2663m8541n752p4598l7537K0284j2690P981L7129
7691I401P3185m043k0631L0498k654l9664j4338p286p258K8181M152L0393K205
7678H2141J8982j5963j7748m2913p1061k2627j991K5442K1211L6603j2376m3316
7666d3616l6548J0684L7305M573k898M151O165m8424M4947M2171p808m1362k522
7653c3182M9652N284J0092L7712j1568l8155q485L4386M4869j104j4156l4653
7641D0692J0327m7934l5392k5310o188L0773N1517J5865l6681N939K3200m9085
$$ plain form
7728 15026 11612 15671 17784 39899 48816 49229 64414 69712 96662 117262 182615 181075 117931
7715 117931 74583 46185 34749 23693 -22021 6724 64633 17284 27591 3493 12695 2353
7703 2353 20158 40921 100462 123125 74584 68832 -5766 -43303 -23019 -35709 -27728 9401
7691 9401 82586 78543 57912 88410 85756 46092 31754 24468 17210 45391 49543 79936 82141
7678 82141 101123 85160 67412 24499 -46562 -69189 -71180 -45738 -24527 12076 -300 -43616
7666 -43616 -80164 -69480 -32175 -27602 -30500 -26349 -20184 -68608 -23661 18510 10702 -30660 -33182
7653 -33182 16470 21754 31846 69558 57990 19835 11350 45736 90605 89501 75345 40692
7641 40692 51019 3085 -32307 -57617 -63805 -33032 18485 34350 -2331 3608 26808 -22277
7629b2277j1554M3632K1580k2107k1656l3821j119J571J4657M4332J2516M190
7617B9944L1334k2989K1539K4969m4581o8063j2209P5O0980j2757J7972k3748
7605B466m4674j9122j4910J7335N0862O4459M0960J2738L807j3923k3383o1168
7593A5447n1639k3048j967K6634M0587k0262L5510K6608L1828K0201j215j5338
7581H3346o5050o5974L2102R0653K4657R11J894P232J169P919l0136L027l1451
7568F0299p5539l8848j248M350R2978M0549n7420l9221j2767K1621K626J3288
7556A0668q481N0128N3568q839j7011p6138m5854N1850M7059j0246j9472J0247
7544C7479j6232L150k7702j8690k2860j3482J926J3507M7671J7552l6833J1288
$$ plain form
7629 -22277 -33831 9801 31381 9274 -12382 -46203 -47322 -45751 -31094 13238 25754 29944
7617 29944 61278 38289 59828 84797 40216 -27847 -40056 -39981 20999 8242 26214 2466
7605 2466 -42208 -61330 -76240 -58905 -8043 56416 97376 110114 113921 99998 76615 15447
7593 15447 -36192 -59240 -61207 -34573 6014 -14248 21262 47870 79698 99899 98684 83346
7581 83346 18296 -47678 -15576 75077 99734 100645 102539 109771 110940 118859 88723 91750 60299
7568 60299 -15240 -54088 -55336 -50986 41992 82541 25121 -14100 -26867 -5246 -2620 10668
7556 10668 2187 52315 105883 97044 80033 3895 -41959 9891 56950 46704 27232 37479
7544 37479 21247 24397 -3305 -21995 -44855 -58337 -56411 -42904 4767 22319 -14514 -3226
7532c226J3988N1262K7739N9J5983k7027J2643J2724m0461q924P26J1050l1559
7519C4977j1262L2516j0992k1138j3308n1183N438K1607j1622L5003N6775R994
7507G6805l0223m3583j4404O470p917R428J6465K7150J5748l6854k5678k8796
7495c5389j0297n616O660L3437J1364L4907J3990p4401j8484K4227K4523k1231
7483a6310j6168K6261J2320L1502q81m013J4609r566k3838N943l5691l4798l7026
7470h7656p131J9567M2725k478J790L7976o991j7221J8524n830j0275L341l81
7457a4040N1135k153L968K6644m3464q690K9840L6866j5905k6061M8495M1312
7445A27947l6283l4641k8498o1952k1252K0114K3437R527N3736O066k1788n3422
$$ plain form
7532 -3226 10762 62024 89763 89822 105805 78778 91421 104145 63684 54760 55486 66536 34977
7519 34977 23715 56231 45239 24101 10793 -40390 -34952 -13345 -24967 10036 66811 76805
7507 76805 46582 2999 -11405 -4935 -12852 -3424 13041 40191 55939 19085 -6593 -35389
7495 -35389 -45686 -51302 -44642 -11205 159 35066 49056 -25345 -43829 -19602 4921 -16310
7483 -16310 -32478 -6217 6103 37605 36724 32711 47320 37754 13916 19859 -15832 -50630 -87656
7470 -87656 -94787 -75220 -32495 -34973 -33183 4793 -2198 -19419 -895 -6725 -17000 -13659 -14040
7457 -14040 37095 34942 38910 65554 22090 13400 43240 80106 64201 38140 86635 127947
7445 127947 91664 57023 28525 -33427 -54679 -34565 -11128 -1601 52135 58201 36413 -17009
7433a7009N006M2456K2914R092k6181K0774j7742M8526j1730k5167M1871J2834
7421A05644j6128j7631J7068M017n2245o8635O061N8378N8206O7097o8046r3064
7409G22K689J8265j8663k9240K9965L2176M0436J97l8401k7044m5036j0488K9954
7396a4468L1394L0574r131o3Q090l2127j388l480J4133k3775j0288k247P707M3501
7382C8432k0986J2522l970l1142R369l7707j3870N8845K3445n8372l7910J5712
7370d5632L8408j790k6434K811P8603j6394j6073J5483J5672p738P57O044L9703
7357H3420m253j649k3988n3696j260L0145L7400k1685n7968m8890j3357J8234
7345e7547N2831l2114l4617l1192J8407N2427J9968J0871M9549M4464k0367k4129
$$ plain form
7433 -17009 -12003 30453 53367 62459 36278 57052 39310 87836 76106 50939 92810 105644
7421 105644 89516 71885 88953 92970 40725 -27910 -21849 36529 94735 161832 93786 722
7409 722 3411 21676 3013 -26227 3738 35914 76350 76547 38146 11102 -33934 -44422 -14468
7396 -14468 16926 47500 38369 38306 46396 14269 12881 9401 23534 -241 -10529 -12776 -5069 38432
7382 38432 17446 29968 25998 -5144 4225 -33482 -47352 11493 34938 -23434 -61344 -45632
7370 -45632 -7224 -9014 -35448 -32637 45966 29572 13499 28982 44654 36916 37673 43717 83420
7357 83420 79167 77518 53530 -166 -1426 28719 66119 44434 -13534 -62424 -75781 -57547
7345 -57547 -4716 -36830 -71447 -102639 -84232 -31805 -11837 -966 48583 93047 72680 48551
7333D8551j6915K6796m4088p316j6045j6609J1925K0707K2912j5535m0107R573
7321a6151M4049J4436P59O569m1933k3356N049J7034K3304J5063k7402p218K6195
7308C6398r034L6064j2432r5828n4541R786K813J5731M3603L0090J1605l452J3162
7295B3965L2241k6125l5234L0840q873o415N837L1739K5115k2957l8968j0210
7283I55J5017j7657P667J6358K1246N271L0562N6071j86j5749k2684m0475k7404
7270B8992l6967j233J9604J6301n9593l0052P358M2746K118j1111J7858M0088
7258C6109J333O695J8194O293n8318l0118N924K0868k607k7086n898r3J8305n409
7244a5808K1277J562m4593n0186L2680M014k4354K8260J4608K3893M8972P068
$$ plain form
7333 48551 31636 58432 14344 7028 -9017 -25626 -13701 7006 29918 14383 -25724 -16151
7321 -16151 27898 42334 43093 49662 7729 -15627 -10578 6456 29760 44823 17421 10203 36398
7308 36398 27364 63428 50996 -44832 -99373 -89587 -86774 -71043 -27440 2650 14255 10803 23965
7295 23965 56206 30081 -5153 25687 16814 10399 16236 47975 73090 50133 11165 955
7283 955 15972 -1685 5982 22340 43586 48857 79419 135490 135304 119555 96871 56396 28992
7270 28992 -7975 -9208 10396 26697 -32896 -62948 -55590 -12844 -10726 -21837 -3979 36109
7258 36109 37442 44137 62331 68624 10306 -19812 -13888 6980 4373 -22713 -28611 -28704 -10399 -15808
7244 -15808 5469 7031 -37562 -87748 -55068 -51054 -75408 -47148 -32540 -8647 40325 47393
7232D7393o0977m9679N2349P6375M3203j8707k7476m9470m2433k8407Q673j1132
7220f0288j413L9854K3771j9003n22l7746L3665J759n3640l3303L027M8869N34
7207e4436J0026N0901l3475L1227Q980j7429O125K7187j0747k6090L2724L0159
7195E5152m5580Q482l0711n9105l0850L7066M5501K0731J1705K186K9584L4513
7183G8674n8590l0157K2846K141l1544M4940m4491o3357p467K6584K6400K4553
7171i468P6642K4579l1193j1912J7986j8010j7597l1623l1852m5665K5667K9940
7159b2506J4645j9366J1454o612K9557o773J7981L4275m8560l3249J5196N0405
7147C6447M1805j2879n9854k5649J8289K9467k3821M310J7843n0236j4392K6263
$$ plain form
7232 47393 -13584 -63263 -10914 65461 108664 89957 62481 13011 -29422 -57829 -49156 -60288
7220 -60288 -61701 -21847 1924 -17079 -17601 -55347 -21682 -19923 -73563 -106866 -103839 -54970 -54436
7207 -54436 -44410 6491 -26984 4243 13223 -4206 1919 29106 18359 -7731 24993 55152
7195 55152 9572 18054 -12657 -71762 -102612 -65546 -20045 686 12391 14577 44161 78674
7183 78674 20084 -10073 12773 14914 -16630 28310 -16181 -79538 -87005 -60421 -34021 -9468
7171 -9468 67174 91753 60560 48648 66634 48624 31027 -596 -32448 -78113 -52446 -22506
7159 -22506 -7861 -27227 -15773 -22385 7172 399 18380 52655 4095 -29154 -13958 36447
7147 36447 78252 65373 5519 -20130 -1841 27626 3805 8115 25958 -24278 -38670 -12407
7135a2407M6700n2181o9453J7943K8681J2545M0705J7156P393k2194l308k4367
7123a2787K4948K8017L9033J0887Q850j3741J772l5665n4976k4642j964K1565
7111h703K8001q896M8236m497l4115L9641J9649j9666l4242k1712l2665l701K1008
$$ plain form
7135 -12407 34293 -17888 -87341 -69398 -40717 -28172 12533 29689 37082 14888 11580 -12787
7123 -12787 12161 40178 79211 90098 98948 85207 86979 51314 -3662 -28304 -30268 -8703
7111 -8703 19298 10402 58638 54141 20026 59667 79316 59650 25408 3696 -28969 -32670 -11662
$$ [...]
##END NTUPLES=NMR SPECTRUM
##END=
