##TITLE=Analysis number 323724
Compound Code cc 47524
Book Reference 508/14/2
Project Code adrs
Chemist Name antons
##JCAMPDX= 6.0         $$ Bruker NMR JCAMP-DX V2.0
##DATA TYPE= NMR SPECTRUM
##DATA CLASS= NTUPLES
##ORIGIN= Bruker BioSpin GmbH
##OWNER= nmr
$$ XWIN-NMR		Version 3.5
$$ Fri Nov  3 16:04:48 2006 GMT Standard Time (UT+0h)  MAYBRIDGE\nmr@NMR_250MHZ
##.OBSERVE FREQUENCY= 250.131544655141
##.OBSERVE NUCLEUS= ^1H
##.ACQUISITION MODE= SIMULTANEOUS (DQD)
##.ACQUISITION SCHEME= undefined
##.AVERAGES= 16
##.DIGITISER RES= 18
##SPECTROMETER/DATA SYSTEM= dpx250
##.PULSE SEQUENCE= zg30
##.SOLVENT NAME= CDCl3
##.SHIFT REFERENCE= (INTERNAL, CDCl3, 0, 16.453)
##AUDIT TRAIL= $$ (NUMBER, WHEN, WHO, WHERE, WHAT)
$$ ##TITLE= Audit trail, XWIN-NMR		Version 3.5
$$ ##JCAMPDX= 5.01
$$ ##ORIGIN= Bruker BioSpin GmbH
$$ ##OWNER= nmr
$$ C:\u/data/dgb/nmr/ADRS/2230/pdata/1/auditp.txt
$$ ##AUDIT TRAIL=  $$ (NUMBER, WHEN, WHO, WHERE, WHAT)
(   1,<2006-11-03 16:04:23.37 +000>,<MAYBRIDGE\nmr>,<NMR_250MHZ>,
      <created by zg, POWCHK disabled, PULCHK disabled
       configuration hash MD5:
       49 4B E0 1D 92 C2 6B 37 9F E6 65 BC 52 41 86 1D
       data hash MD5: 64K
       71 F1 43 BC 9E 7B D7 CF 56 DB A3 AC 0D 22 D4 67>)
(   2,<2006-11-03 16:04:36.97 +000>,<MAYBRIDGE\nmr>,<NMR_250MHZ>,
      <Start of raw data processing
       ef LB = 0.3 FT_mod = 6 PKNL = 1 SI = 32K 
       data hash MD5: 32K
       EE B8 96 14 66 E0 F3 D2 E9 3E 57 C2 9B A2 40 E2>)
(   3,<2006-11-03 16:04:38.72 +000>,<MAYBRIDGE\nmr>,<NMR_250MHZ>,
      <apk 
       data hash MD5: 32K
       19 8A CC 63 DC F3 47 E3 36 29 7C 81 C2 BC 46 8C>)
(   4,<2006-11-03 16:04:39.45 +000>,<MAYBRIDGE\nmr>,<NMR_250MHZ>,
      <abs ABSG = 5 
       data hash MD5: 32K
       80 F7 6B D9 DB 67 A2 D2 42 E9 20 E8 B5 40 5A C9>)
$$ ##END=
$$ 
$$ hash MD5
$$ CD 4B 9A 15 D6 5E 25 EE E7 F2 8E B5 8C DC FA 4B
##$RELAX= 
##$RELAX= 
##$RELAX= 
##$RELAX= 
##$RELAX= 
##$RELAX= 
##$RELAX= 
$$ Bruker specific parameters
$$ --------------------------
##$DU= <C:\u>
##$EXPNO= 2230
##$NAME= <ADRS>
##$PROCNO= 1
##$TYPE= <nmr>
##$USER= <dgb>
##$AMP= (0..31)
100 100 100 100 100 100 100 100 100 100 100 100 100 100 100 100 100 100 
100 100 100 100 100 100 100 100 100 100 100 100 100 100 
##$AQSEQ= 0
##$AQ_mod= 3
##$AUNM= <au_zg>
##$AUTOPOS= <39 >
##$BF1= 250.13
##$BF2= 250.13
##$BF3= 250.13
##$BF4= 250.13
##$BF5= 500.13
##$BF6= 500.13
##$BF7= 500.13
##$BF8= 500.13
##$BYTORDA= 1
##$CFDGTYP= 0
##$CFRGTYP= 5
##$CHEMSTR= <none>
##$CNST= (0..31)
1 1 145 1 1 1 1 1 1 1 1 1 1 1 1 1 1 1 1 1 1 1 1 1 1 1 1 1 1 1 1 1 
##$CPDPRG= <>
##$CPDPRG1= <>
##$CPDPRG2= <>
##$CPDPRG3= <>
##$CPDPRG4= <mlev>
##$CPDPRG5= <mlev>
##$CPDPRG6= <mlev>
##$CPDPRG7= <mlev>
##$CPDPRG8= <mlev>
##$CPDPRGB= <>
##$CPDPRGT= <>
##$D= (0..31)
0 1 0 0 0 0 0 0 0 0.06 0 0 0 0 0 0 0.0002 0 0 0 0 0 0 0 0 0 0 0 0 0 0 
0 
##$DATE= 1162569862
##$DBL= (0..7)
120 120 120 120 120 120 120 120 
##$DBP= (0..7)
150 150 150 150 150 150 150 150 
##$DBP07= 0
##$DBPNAM0= <>
##$DBPNAM1= <>
$$ [...]
##$SUBNAM7= <"">
##$SUBNAM8= <"">
##$SUBNAM9= <"">
##$SW= 20.6930455092707
##$SWIBOX= (0..15)
0 0 3 0 0 0 0 0 0 0 0 0 0 0 0 0 
##$SW_h= 5175.983436853
##$TD= 65536
##$TD0= 1
##$TE= 683.16
##$TE2= 300
##$TE3= 300
##$TEG= 300
##$TL= (0..7)
0 120 120 120 120 120 120 120 
##$TP= (0..7)
150 150 150 150 150 150 150 150 
##$TP07= 0
##$TPNAME0= <>
##$TPNAME1= <>
##$TPNAME2= <>
##$TPNAME3= <>
##$TPNAME4= <>
##$TPNAME5= <>
##$TPNAME6= <>
##$TPNAME7= <>
##$TPOAL= (0..7)
0.5 0.5 0.5 0.5 0.5 0.5 0.5 0.5 
##$TPOFFS= (0..7)
0 0 0 0 0 0 0 0 
##$TUNHIN= 0
##$TUNHOUT= 0
##$TUNXOUT= 0
##$USERA1= <user>
##$USERA2= <user>
##$USERA3= <user>
##$USERA4= <user>
##$USERA5= <user>
##$V9= 5
##$VALIST= <valist>
##$VCLIST= <CCCCCCCCCCCCCCC>
##$VD= 0
##$VDLIST= <DDDDDDDDDDDDDDD>
##$VPLIST= <PPPPPPPPPPPPPPP>
##$VTLIST= <TTTTTTTTTTTTTTT>
##$WBST= 1024
##$WBSW= 4
##$XGAIN= (0..3)
0 0 0 0 
##$XL= 0
##$YL= 0
##$YMAX_a= 580565
##$YMIN_a= -341973
##$ZGOPTNS= <>
##$ZL1= 120
##$ZL2= 120
##$ZL3= 120
##$ZL4= 120
##$ABSF1= 16.45304
##$ABSF2= -4.240133
##$ABSG= 5
##$ABSL= 3
##$ALPHA= 0
##$AQORDER= 0
##$ASSFAC= 0
##$ASSFACI= 0
##$ASSFACX= 0
##$ASSWID= 0
##$AUNMP= <proc_1d>
##$AZFE= 0.1
##$AZFW= 0.1
##$BCFW= 0
##$BC_mod= 0
##$BYTORDP= 0
##$COROFFS= 0
##$CY= 12.5
##$DATMOD= 1
##$DC= 0
##$DFILT= <>
##$DTYPP= 0
##$F1P= 14.0000005364418
##$F2P= -0.99999901652339
##$FCOR= 0.5
##$FTSIZE= 32768
##$FT_mod= 6
##$GAMMA= 0
##$GB= 0
##$INTBC= 1
##$INTSCL= 1
##$ISEN= 128
##$LB= 0.3
##$LEV0= 0
##$LPBIN= 0
##$MAXI= 10000
##$MC2= 0
##$MEAN= 0
##$ME_mod= 0
##$MI= 0
##$NCOEF= 0
##$NC_proc= -4
##$NLEV= 6
##$NOISF1= 0
##$NOISF2= 0
##$NSP= 0
##$NTH_PI= 0
##$NZP= 0
##$OFFSET= 16.45304
##$PC= 1
##$PHC0= -44.69082
##$PHC1= 8.437582
##$PH_mod= 1
##$PKNL= yes
##$PPARMOD= 0
##$PSCAL= 4
##$PSIGN= 0
##$REVERSE= no
##$SF= 250.130017247132
##$SI= 32768
##$SIGF1= 0
##$SIGF2= 0
##$SINO= 400
##$SIOLD= 32768
##$SREGLST= <1H.CDCl3>
##$SSB= 0
##$STSI= 32768
##$STSR= 0
##$SW_p= 5175.98343685301
##$SYMM= 0
##$S_DEV= 0
##$TDeff= 65536
##$TDoff= 0
##$TI= <Analysis number 999999
Compound Code 99
Book Reference 9
Project Code 9>
##$TILT= no
##$TM1= 0
##$TM2= 0
##$TOPLEV= 0
##$USERP1= <user>
##$USERP2= <user>
##$USERP3= <user>
##$USERP4= <user>
##$USERP5= <user>
##$WDW= 1
##$XDIM= 32768
##$YMAX_p= 544407645
##$YMIN_p= -238197
$$ End of Bruker specific parameters
$$ ---------------------------------
##NTUPLES= NMR SPECTRUM
##VAR_NAME=  FREQUENCY,     SPECTRUM/REAL,   SPECTRUM/IMAG
##SYMBOL=    X,             R,               I
##VAR_TYPE=  INDEPENDENT,   DEPENDENT,       DEPENDENT
##VAR_FORM=  AFFN,          ASDF,            ASDF
##VAR_DIM=   32768,         32768,           32768
##UNITS=     HZ,            ARBITRARY UNITS, ARBITRARY UNITS
##FACTOR=    0.157963299565203, 1,           1
##FIRST=     4115.39897118763, 0,            0
##LAST=      -1060.58446566538, 0,           0
##MIN=       -1060.58446566538, -238197,     0
##MAX=       4115.39897118763, 544407645,    0
$$ Real data points
##PAGE= N=1
##DATA TABLE= (X++(R..R)), XYDATA
$$ [...]
19374I099930k64384k17701k38326k18133j85207k94869k96796l19440l26715
19365F738359l91641l19890k48913k85067j99911k01237k24152k15088j73395
19356D479065j56070k26624j80041j24594q0693o3529j19291j35091m584q7449
19346C301099j38609p0609l8560n7249j21798n8212n1578p1207n7652J6227m4554
19335B607298r1843p1913k0415J5777J584N220p7536l3044k7520J515n6887m6434
19323B205802q588j6227J9849O989o721J20522K9164j0253j6386l1973M619K4085
19311B320882m957k1131N6595L5397M4095M2814J4031L5411K5667J0680O8693
19300B628177J00817R1951R7454N1754P2352J29229J21498J27643J25268J15663
$$ plain form
19374 9099930 8835546 8617845 8379519 8161386 7976179 7681310 7384514 7065074 6738359
19365 6738359 6346718 6026828 5777915 5492848 5292937 5091700 4867548 4652460 4479065
19356 4479065 4322995 4096371 3916330 3791736 3711043 3647514 3528223 3393132 3388548 3301099
19346 3301099 3162490 3091881 3053321 2996072 2874274 2816062 2764484 2693277 2635625 2651852 2607298
19335 2607298 2515455 2443542 2423127 2438904 2440488 2445708 2368172 2335128 2307608 2309123 2252236 2205802
19323 2205802 2197214 2180987 2200836 2207825 2201104 2321626 2350790 2340537 2324151 2292178 2296797 2320882
19311 2320882 2315925 2294794 2351389 2386786 2430881 2473695 2487726 2523137 2548804 2559484 2628177
19300 2628177 2728994 2820945 2918399 2970153 3042505 3171734 3293232 3420875 3546143 3661806
19290C661806J01046R2385J34761J90229J78226N0596J25775J81564J45220J84454
19280E046062K55146K45683K43086L42997L45332M69521N17942N00969O53373
19271H620111O79046P02826O51468O61350Q98146J018950J102269J324329J538100
19262A7196595J811130K216699K723212L316533M066861N077028O268975P798661
19254E0475694R934333J2537294J5673361J8989817K1679919K2464112J9881768
19247A71636298J3258815L660565o765774j5486349k0681323k2038147k0510178
19240A03073907j7551164j4207782j1346896q911664p062701n636603m527478
19233C3829619l689714l019263k510932k042124j814774j544961j302039j179477
$$ plain form
19290 3661806 3762852 3855237 3989998 4180227 4358453 4409049 4534824 4716388 4861608 5046062
19280 5046062 5301208 5546891 5789977 6132974 6478306 6947827 7465769 7966738 8620111
19271 8620111 9299157 10001983 10653451 11314801 12212947 13231897 14334166 15658495 17196595
19262 17196595 19007725 21224424 23947636 27264169 31331030 36408058 42677033 50475694
19254 50475694 60410027 72947321 88620682 107610499 129290418 151754530 171636298
19247 171636298 184895113 188555678 181789904 166303555 145622232 123584085 103073907
19240 103073907 85522743 71314961 59968065 51056401 43993700 38357097 33829619
19233 33829619 30139905 27120642 24609710 22567586 20752812 19207851 17905812 16726335
19225A6726335j005729q51968p80263p36350p34939p59100o85900o76764o13152
19216I882170m95284m64972m46023l99099l71457k65496k67947k40949k42247
19207F688696k59891k02336j09472j46749j74387j91377j65297j56784j56929
19198E125474j42057j53740k47942k35861j46888j87163k41379j59473j45339
19189C465632j82755r9144n4640l8964o1748q2563j33333j06643k5670m4211o2467
19178B573494l1597J8640l1250j12209j27530j11705n4894q0344p1814j9207q7536
19167A864048q2383m3007m3274J9371p323M1069p391j14384o3372q2792j09637
19156A370925r5997N4927K9311j2839m7351o9732l7827m946J5006L3021k0813
$$ plain form
19225 16726335 15720606 14868638 14088375 13352025 12617086 11857986 11172086 10495322 9882170
19216 9882170 9386886 8921914 8475891 8076792 7705335 7439839 7171892 6930943 6688696
19207 6688696 6428805 6226469 6116997 5970248 5795861 5604484 5439187 5282403 5125474
19198 5125474 4983417 4829677 4581735 4345874 4198986 4011823 3770444 3610971 3465632
19189 3465632 3282877 3183733 3129093 3090129 3028381 2945818 2812485 2705842 2680172 2635961 2573494
19178 2573494 2541897 2560537 2529287 2417078 2289548 2177843 2122949 2042605 1970791 1951584 1864048
19167 1864048 1781665 1738658 1695384 1714755 1707432 1748501 1741110 1626726 1563354 1480562 1370925
19156 1370925 1274928 1329855 1359166 1346327 1298976 1229244 1191417 1186471 1201477 1234498 1213685
19145A213685k1191m8358o4051l463K7603o9953J4319K5932p0913l7774J1119
19134I76955j5786k7812L1656k0052l2005J6107R885m5378o4124k1475O4454J054
19122H73479J0164m2295k1810l3925k9157k231L1052j2929l2563q424k7063j6877
19110F87421k1372k1239m7166l7126p274K3943O3185R1529l5334J939j2294m5712
19098F40500J3195J673l9983J8982J2601m0781l8192O218J0175o3598m6301q297
19086D66192k9738k477L0146M9718O7140M7646p0489n1917J8200K7289k1216l9184
19074D91310m8539j2189M6094P3870J2628m1811L5771o700o3080J056O2863L6365
19062E87638m208j5326l1061m580p0592o4352L1116J037K3693L5418m093m788
$$ plain form
19145 1213685 1192494 1144136 1080085 1076622 1104225 1034272 1048591 1074523 1003610 965836 976955
19134 976955 961169 933357 965013 944961 912956 929063 938948 893570 829446 807971 872425 873479
19122 873479 883643 841348 819538 785613 756456 754225 785277 772348 739785 731361 704298 687421
19110 687421 666049 644810 597644 560518 553244 577187 640372 731901 696567 698506 686212 640500
19098 640500 653695 655368 615385 634367 646968 606187 567995 574213 584388 520790 474489 466192
19086 466192 436454 433977 464123 513841 580981 628627 558138 506221 524421 551710 530494 491310
19074 491310 442771 430582 476676 550546 563174 521363 557134 550434 487354 488410 551273 587638
19062 587638 583430 568104 537043 532463 461871 397519 428635 429672 453365 488783 484690 479902
19050D79902K0539L7336j853n2678n4079n0056j9305J0619P4532N5473m8647m2579
19038D09204m226j1246L185n4763n1741K5734N5887J2269J6040m0504n3967l8266
19026B67606K6796O4398o3723j8882J9987K1373L0643q0897p4211k604l284J0709
19014A97911m212N886j505Q720k6754n840N9064Q0561K8699l9075j01306M2947
19002B45096O3421J7028k5922K2838P852l8203l9747l8132J2530k9410K0884j288
18990B16947m9085J8406M726l759k3655N8729O2017K7023L4248K1599j2358j02444
18978B52394M912L778m9876m4857o338j5138q796M5646J4623M476M7929p250k9456
18965B12047J3165J2142n04j7519m4061k9333l0368l0630j6434l488N4457M7042
$$ plain form
19050 479902 500441 537777 535924 483246 429167 379111 359806 370425 444957 500430 451783 409204
19038 409204 404978 393732 396917 342154 290413 316147 372034 384303 400343 359839 305872 267606
19026 267606 294402 358800 295077 276195 296182 317555 348198 267301 193090 190486 187202 197911
19014 197911 193699 199585 198080 206800 180046 174206 233270 313831 342530 303455 202149 245096
19002 245096 308517 325545 299623 322461 330313 292110 252363 214231 226761 197351 218235 216947
18990 216947 167862 186268 190994 187235 163580 222309 284326 311349 345597 367196 354838 252394
18978 252394 257306 261084 211208 166351 160013 144875 136079 181725 196348 200824 248753 241503 212047
18965 212047 225212 237354 236850 219331 175270 145937 115569 84939 68505 65017 119474 166516
18953A66516L3675K0953m3191o423p1015k7514O5178K1408o5110O399J9147q560
18941A11463K2152M5342o592L5627l5268m3488k8027K0769J6290P312l9406n763
18929A00411k9876L5705O0386J6203q10R392k1508l0148l6371J8203K5621L7455
18917A84663q212l3152k3694o1290n3154N2967J7890L8012M2159j9676n3719M3661
18905A26455J6738k1898L252M0029n8295l0750L1721n316L4832M2879n2593n5560
18893G1494K6870M5950K5645O7748J3071J2141m8323j1937L4923R0481K9980l8835
18881C19208m6575n8951J8919Q3867J6031j6391k5003j3069r327J6688q081k3559
18869B53757j1953J0417R8693o079r642l5266K0534J04407L1349P1350M9149l7939
$$ plain form
18953 166516 200191 221144 177953 171530 100515 73001 138179 159587 94477 100876 120023 111463
18941 111463 133615 178957 172365 207992 172724 129236 101209 121978 138268 145580 106174 100411
18929 100411 70535 106240 166626 182829 182019 191411 169903 139755 103384 121587 147208 184663
18917 184663 176451 143299 119605 58315 5161 58128 76018 114030 156189 136513 82794 126455
18905 126455 143193 121295 124547 164576 106281 75531 107252 101936 136768 179647 127054 71494
18893 71494 98364 144314 169959 237707 250778 262919 214596 202659 237582 328063 358043 319208
18881 319208 272633 213682 232601 316468 332499 316108 291105 278036 268709 285397 277316 253757
18869 253757 241804 252221 350914 344835 335193 299927 320461 424868 456217 527567 576716 538777
18857E38777L7818J48566N5875m6054n5626r4570j40374K681M240j8254O3184
18846D96263L8578q993R354L8602J1034L5506R302m7126l7918m4611K4888P9125
18834F04004K343j748J12341O3616J36110L8324l1482m7185m60Q5k0408J3859
18822H69399p812l7075l7391K5105l4654k105o3408n2966q6269l2698N5283l9935
18810E55474j04679k5948k601Q959M0135L8119J2927J3663O0865K6648k2782l0539
18798E70241M3695O5504n0611L4684n5087q7246N6086O5656N4232l5468o607O1743
18786G16822J45139J7963K1134n665K3911J6600K5174M1858Q6082l5729M4135
18775A097424r062p5424L7410n73n1243L62M5567K3166m6654j04738j66841j43016
$$ plain form
18857 538777 576595 725161 781036 734982 679356 584786 444412 447093 451333 433079 496263
18846 496263 534841 525848 535202 573804 584838 620344 629646 582520 544602 499991 524879 604004
18834 604004 606347 604599 716940 780556 916666 954990 923508 876323 875863 875948 855540 869399
18822 869399 861587 824512 787121 812226 777572 775467 712059 659093 572824 540126 595409 555474
18810 555474 450795 424847 422246 431205 471340 509459 522386 536049 596914 623562 600780 570241
18798 570241 613936 679440 628829 663513 608426 521180 577266 642922 697154 661686 655079 716822
18786 716822 861961 879924 901058 895393 919304 935904 961078 1002936 1089018 1053289 1097424
18775 1097424 1088362 1012938 1050348 1049775 998532 998894 1044461 1067627 1020973 916235 749394 606378
18763F06378j01660l2454l3403j9308J0607j9057q569L3687k8384N337L9619O3691
18751E16484K1856K7419M3830O1837O8548N3464R3345Q8847O8014J18095J15891
18740A277630J48335N3786N3927k844k5544q6652k12242q4927r1939n2260m7520
18729I29750L0050P93n7647k5075j4670l6345l9922j05765n9241r034j5750J8136
18717F15280l6520q3938p2319j2100M9871K726N255k4309m6538K2478M2890N1370
18705E14146l6802j5724N1113K4743j7927l1071p2144M1611L7542J3962l9366
18694D70083l7323Q1556K956o5031j2770k388J0674p427J9150J8807P2773k9598
18682E21462J3873j5016K6834Q896J3382m4147j7528q746p501N1841N5464q6830
$$ plain form
18763 606378 504718 472264 438861 419553 430160 411103 402534 436221 407837 413174 452793 516484
18751 516484 538340 565759 609589 671426 739974 793438 886783 975630 1043644 1161739 1277630
18740 1277630 1425965 1479751 1533678 1530834 1505290 1418638 1206396 1121469 1029530 977270 929750
18729 929750 959800 960593 902946 877871 863201 826856 786934 681169 621928 612894 597144 615280
18717 615280 578760 494822 422503 410403 460274 463000 468255 443946 397408 419886 462776 514146
18705 514146 477344 461620 512733 537476 519549 488478 416334 457945 495487 509449 470083
18694 470083 432760 514316 517272 452241 439471 437083 447757 440330 459480 478287 551060 521462
18682 521462 535335 520319 547153 556049 569431 525284 507756 499010 491509 543350 598814 511984
18670E11984n4670M9366J0203J0382K0074N8379K7467M5623K8943p6190n7288
18659E74273l4986J5873l5874k612j2152j0549J6477J8574k777j8737k8600K5338
18647E04248q484O995Q4263J8738K346k8948l1278J154J5322L6542P2832K5650
18635F99380N02J7559j142j6216j061J4767K1124k7578k1337k9061p6158J7734
18623E98513L6927K7101M3567K0673L6888N97k9157n288L634k9611K3134N2903
18611G79881q366k8558p4547K0350J8217K112N477R788m555r249K8960m892N9160
18598G93778Q5853O7188R0620N3043J0183l0258Q141J33551N6037J26950J47918
18587A543004M7973L7803J0355M1259m7540m9781r0599q7569q3448o1775q3198
$$ plain form
18670 511984 457314 506680 516883 527265 547339 605718 633185 678808 707751 631561 574273
18659 574273 539287 555160 519286 516674 504522 493973 510450 529024 526247 507510 478910 504248
18647 504248 495764 502759 587022 605760 608106 579158 547880 549034 564356 600898 673730 699380
18635 699380 699882 717441 716299 700083 699022 713789 734913 707335 685998 656937 580779 598513
18623 598513 635440 662541 706108 726781 763669 764266 735109 729821 733455 703844 726978 779881
18611 779881 771515 742957 668410 688760 706977 709089 714566 724354 719799 710550 739510 734618 793778
18598 793778 879631 946819 1037439 1090482 1100665 1070407 1078548 1212099 1268136 1395086 1543004
18587 1543004 1590977 1628780 1639135 1680394 1632854 1583073 1492474 1404905 1321457 1259682 1176484
18576A176484j17699r3834n3607j6616K0943K3576m632L7106m5622n2528J9150
18565H92721Q1043j3737l7989n4205k4766j55k4781J822J5942K6200j5300l2802
18553H13993J5396L0369R740o773k340j5604n842o6223j8561L5986L9340J3864
18541H43345o5431n5159J3251J3112p2409l9294m9289L584l6061m0994K9847N3308
18529E97810J6441M8803K102n693m3505K0436N6123j0346K1810P7315j18l3597
18517G47581m9016k2290j7729n2096J5656J067K4603N4964L4409M7520J2844J6420
18505H13933O641j9859j6008P9423K8740L5243Q32k4559K7563M2517K5548K1584
18493A021598J56708Q8656M7799K6409N7302L0543L6240o968r0005j51005p7494
$$ plain form
18576 1176484 1058785 964951 911344 894728 915671 939247 934615 971721 926099 873571 892721
18565 892721 973764 960027 922038 867833 843067 842912 818131 819953 835895 862095 846795 813993
18553 813993 829389 859758 869498 862725 860385 844781 838939 772716 754155 790141 829481 843345
18541 843345 777914 722755 736006 749118 676709 637415 588126 591710 555649 514655 544502 597810
18529 597810 614251 663054 665156 659463 615958 636394 692517 682171 703981 781296 781178 747581
18517 747581 698565 676275 658546 606450 622106 623173 647776 702740 737149 784669 797513 813933
18505 813933 820574 800715 784707 864130 892870 928113 928945 904386 931949 974466 1000014 1021598
18493 1021598 1178306 1266962 1314761 1341170 1398472 1429015 1465255 1458287 1368282 1217277 1139783
18482A139783M3798M2001l7715n1662o3941m926k6457J6869Q3121L3490M9564
18471A223925O0021n2794Q386J8806k3603J155J1038N8770L4544R9048k487J7733
18459A454542n867n5583M3007R72K0515J7866k1859J3962J13377L1166j8623K1327
18447A614802M7956j2106j7257M2069j4585K6848N6035N8146O2764J48959J65681
18436B179312Q3338P29L4329L7731L7557J0910J9581K2271P7694R9069J41307
18425B743828J47893O1965N1669k5835p9992p2802j09945j19189j92078j27019
18415B278495n7856L2730M3181J8699n105k9753R299j2934k4188L8797J7706k3589
18403B285482q5374N244J33352J17473J26590N2766M2065R4790J52926K17127
$$ plain form
18482 1139783 1183581 1225582 1187867 1136205 1072264 1067338 1040881 1057750 1140871 1174361 1223925
18471 1223925 1283946 1231152 1239538 1258344 1234741 1235896 1246934 1305704 1340248 1439296 1436809 1454542
18459 1454542 1448675 1393092 1436099 1437071 1457586 1475452 1453593 1467555 1580932 1612098 1593475 1614802
18447 1614802 1662758 1650652 1633395 1675464 1660879 1687727 1743762 1801908 1864672 2013631 2179312
18436 2179312 2262650 2263379 2297708 2335439 2372996 2383906 2403487 2425758 2503452 2602521 2743828
18425 2743828 2891721 2953686 3005355 2979520 2899528 2826726 2716781 2597592 2405514 2278495
18415 2278495 2220639 2253369 2296550 2315249 2310144 2280391 2289690 2276756 2252568 2291365 2309071 2285482
18403 2285482 2200108 2205352 2338704 2456177 2582767 2635533 2677598 2772388 2925314 3142441
18393C142441J77372J36761J77507J87626K48061J36702J42096J59229J17840
18384D625635M6302n3197j8443j8433K1987J3262J69814L24800M09463O45863
18374F167053Q60464J183575J694267K066495K081591J586298P86937L72062K19227
18365A7017969M4795m43052j120148j701016j832807j527526j099835o26464k90569
18356H421347l8577J49677M27470O79385R56424J309463J632093J895429K029078
18347A7461789J932539J615427J135657R99645J214363J886211K548602K319382
18339C1113615J008360l94293j093875n43973J060724K850242L954901L663270
18331D1618971K219199M14288o93308j183082j433017j893018k345070k373505
$$ plain form
18393 3142441 3319813 3456574 3634081 3821707 4069768 4206470 4348566 4507795 4625635
18384 4625635 4671937 4618740 4600297 4581864 4603851 4617113 4786927 5111727 5521190 6167053
18374 6167053 7027517 8211092 9905359 11971854 14053445 15639743 16426680 16798742 17017969
18365 17017969 17062764 16619712 15499564 13798548 11965741 10438215 9338380 8711916 8421347
18356 8421347 8382770 8532447 8959917 9639302 10595726 11905189 13537282 15432711 17461789
18347 17461789 19394328 21009755 22145412 23145057 24359420 26245631 28794233 31113615
18339 31113615 32121975 31727682 30633807 30089834 31150558 34000800 37955701 41618971
18331 41618971 43838170 44252458 43559150 42376068 40943051 39050033 36704963 34331458
18323C4331458j830266q02109M86017K036599L821788N717301P696968R211234
18315F0668990R300802P748323O466261O672248Q233215R609959R127527O508515
18307A24335840L047234L28220j140637k348565m149654o159236p249722o193239
18299A00470241k731562K974515J0764662K0106374K8326647K9663756K1569786
18292B11144419O544000j1610602k4295695k7587874k2839410j4456238q249053
18285A08649547o185959o823695p944125p853813o308477m006914j879263m14021
18277F7233280R66394L057727O640609J1577806J6526913J8522917J4127489L353013
18269A42006148q775860j6641003j7927439j4153186q496118k911271K418497
$$ plain form
18323 34331458 32501192 31699083 32185100 34221699 38043487 43760788 51457756 60668990
18315 60668990 69969792 77718115 84184376 90856624 99089839 108699798 117827325 124335840
18307 124335840 127383074 127711294 126570657 124222092 120072438 113913202 106663480 100470241
18299 100470241 97738679 100713194 111477856 131584230 159910877 189574633 211144419
18292 211144419 217688419 206077817 181782122 154194248 131354838 116898600 108649547
18285 108649547 102463588 95639893 87695768 79841955 73533478 69526564 67647301 67233280
18277 67233280 68199674 71257401 77898010 89475816 106002729 124525646 138653135 142006148
18269 142006148 133230288 116589285 98661846 84508660 76012542 73101271 75519768
18262G5519768P589221J1625258J1927183O747344k017069r824864j3111403j2073465
18254G6381973r777628q401407p682196o885058n603435m109624k820882j880536
18246B9221207j245063q54953l64934L62793J085720K234341L691186N777033
18238C9907330Q936928J3340415J7649785J6474692N728873p724637j6854809
18231G7458577j8312258j4019120r381753o215763m297689l028795k138903j487897
18223A8576399j021475o97916n26028k86553O9058M64306J005351J161001N95551
18214A9339694m09744j233415j383465j154717r87399r46049j080570j195143
18206A0949192j093747r26059p55925n72269n12319l84677l07992k96237k93717
$$ plain form
18262 75519768 83108989 94734247 106661430 113408774 111391705 101566841 88455438 76381973
18254 76381973 66604345 58202938 50520742 43635684 38032249 33922625 31101743 29221207
18246 29221207 27976144 27121191 26756257 27119050 28204770 30439111 34130297 39907330
18238 39907330 48844258 62184673 79834458 96309150 102038023 94313386 77458577
18231 77458577 59146319 45127199 35745446 29529683 25231994 22203199 20064296 18576399
18223 18576399 17554924 16857008 16330980 16044427 16113485 16577791 17583142 18744143 19339694
18214 19339694 18929950 17696535 16313070 15158353 14170954 13224905 12144335 10949192
18206 10949192 9855445 8929386 8173461 7601192 7088873 6704196 6396204 6099967 5806250
18197E806250k13814j98576j33253j05328j6025o255j2042q7094j99457k87612
18187D546794k37572j48629j24397j03825L962r8803j85352r4941q1679j6749
18177C458809J2137j00527j25423j72173j09825k1146M574q6110p7236o4060j18421
18166B600599k1285R756j3571o1293n2541m7706j6027m3288j4883m4968m0837
18155B253956J2231j3499M8825N010m2227o7313L6929L2893k7888K7539L0969
18144B297425J3234J083o524j6780l7275j7648M815O1228K5625n2060r534J29692
18132B393281J52115J08309O7196J31037J18438J76003K11693J95002L09095L68001
18122D230170M55440O13918P88034R28235J237947J772043K463321L647196N528978
$$ plain form
18197 5806250 5592436 5393860 5260607 5155279 5139254 5132999 5120957 5033863 4834406 4546794
18187 4546794 4309222 4160593 4036196 3932371 3936333 3837530 3652178 3557237 3475558 3458809
18177 3458809 3470946 3370419 3244996 3072823 2962998 2941852 2946426 2860316 2783080 2719020 2600599
18166 2600599 2579314 2589070 2575499 2514206 2461665 2413959 2397932 2354644 2339761 2294793 2253956
18155 2253956 2266187 2252688 2301513 2306523 2264296 2196983 2233912 2266805 2238917 2266456 2297425
18144 2297425 2310659 2311742 2305218 2288438 2251163 2233515 2238330 2299558 2325183 2273123 2263589 2393281
18132 2393281 2545396 2653705 2720901 2851938 2970376 3146379 3358072 3553074 3862169 4230170
18122 4230170 4685610 5299528 6087562 7015797 8253744 10025787 12489108 16136304 21665282
18113B1665282Q546013J3153548J7285089J3698664J419338j0148418j6366108
18106D9253408j4737887r854471o195924l952765k688995j943128j385819r97687
18098G496732p79384o16725n29757m13466l53165l07281l42150k02093q4168j57065
18088C711478j09499j58461j26750j50086k12036j89460r4721m6281o9993j02942
18078B451249j17996j26390l8926q9773l5005K9220L327p8588q0376n0651p6566
18067A789525k4567K6499j7894o8270m1529L378l2585J2610m721M5747M1861J7020
18055A747074R0996J10261J8830k2415l2403J4232J9500n3894o9281r4227j58809
18044A569864j28336M2817Q2068L8951K1222j8288J6086M7939j2432k8633r400
$$ plain form
18113 21665282 30211295 43364843 60649932 74348596 75767934 65619516 49253408
18106 49253408 34515521 24661050 18465126 14512361 11823366 9880238 8494419 7496732
18098 7496732 6717348 6100623 5570866 5157400 4804235 4496954 4154804 3952711 3868543 3711478
18088 3711478 3601979 3443518 3316768 3166682 2954646 2765186 2670465 2624184 2554191 2451249
18078 2451249 2333253 2206863 2167937 2078164 2043159 2072379 2075706 1997118 1916742 1866091 1789525
18067 1789525 1764958 1791457 1773563 1705293 1663764 1667142 1634557 1647167 1642446 1688193 1730054 1747074
18055 1747074 1838070 1948331 1967161 1944746 1912343 1926575 1946075 1892181 1822900 1728673 1569864
18044 1569864 1441528 1484345 1566413 1605364 1626586 1608298 1624384 1672323 1659891 1631258 1621858
18033A621858r5274m3473l0945j6645Q6831k4539j1989o106J2967J1037M5416
18022A549138R7397P6816J21693R7422J10019J69067J68338K02633K22501K37456
18012C052480L22378M23682N62413P41134Q69107R75199Q85751R73012J057871
18003I863027J061743J042647J070964Q03528J93219m68756r81994j165925r40708
17994A0477745n86532k19462P7478L05905N79988J004789J510053K128535K848183
17985A8126682L661272M475052N060985N498821N513983N194476M414582L380802
17977E5326655J982460M82085j068765k714632m125180n011258n343080n100728
17969C4427557m518809l519650k332427j157293j18138O65078J492637K166284
$$ plain form
18033 1621858 1526584 1483111 1452166 1435521 1522352 1497813 1485824 1479718 1492685 1503722 1549138
18022 1549138 1646535 1723351 1845044 1942466 2052485 2221552 2389890 2592523 2815024 3052480
18012 3052480 3374858 3798540 4360953 5102087 5971194 6946393 7832144 8805156 9863027
18003 9863027 10924770 11967417 13038381 13841909 14035128 13566372 12584378 11418453 10477745
17994 10477745 9891213 9671751 9749229 10055134 10635122 11639911 13149964 15278499 18126682
17985 18126682 21787954 26263006 31323991 36822812 42336795 47531271 51945853 55326655
17977 55326655 57309115 57791200 56722435 54007803 49882623 44871365 39528285 34427557
17969 34427557 29908748 26389098 24056671 22899378 22781240 23446318 24938955 27105239
17961B7105239K838723L612385M397383N230271N548996M773892K934865O42449
17953E7084203j343901k269058k120186j354784m49525l8175n73054j743844k822355
17944D4369321l225094k957048k299604j549599r46381n86017o31709r39932j165398
17935C0068539j191625j161225j092261q28908k22959M66221J152242J832980
17927B9023004K378992K761225K830607K554166J981274J126953J81479p56349
17919D2081351j897528k822796l629382m055577m001738l774567l463038k917873
17911A5518852k247716j671730j197940q22012n11412k45052o5207R2880J62381
17902I013044R0290L9566n2828j59000l32771m20880m15623l88237m00959m95329
$$ plain form
17961 27105239 29943962 33556347 37953730 43184001 48732997 53506889 56441754 57084203
17953 57084203 55740302 53471244 51351058 49996274 49546749 49508574 48935520 47191676 44369321
17944 44369321 41144227 38187179 35887575 34337976 33391595 32805578 32173869 31233937 30068539
17935 30068539 28876914 27715689 26623428 25794520 25571561 26037782 27190024 29023004
17927 29023004 31401996 34163221 36993828 39547994 41529268 42656221 42837700 42081351
17919 42081351 40183823 37361027 33731645 29676068 25674330 21899763 18436725 15518852
17911 15518852 13271136 11599406 10401466 9579454 9068042 8822990 8757783 8850663 9013044
17902 9013044 9103334 9142900 9090072 8931072 8598301 8177421 7761798 7373561 6972602 6477273
17892F477273m79764m54146l66200l20447l12368k23425k17307k60713k64753
17883C578150k57867k14733k06984j71222q5804r1178j51527j22093j08849j03305
17873B064588j00138J920K4520p0469j05892p5710k6989m3073l5965n2168l2883
17862A547741l5272j08116o7386n9798N934M631J7339m6946l8107J9112m707o510
17850A227915j0696L5880k1689M1683Q302M4628q8787j21517l375J0188m4778
17839A077754l6283k6944r4421l8674j6829L983O0327P8265J754k4580k7971o8953
17827H87428m155M2751l5082l4438j351L5378Q1752j929M5366k2912m5674k5226
17815I21908r164j3760j1483j0250P251J0150m2468n4600j7046P4881O4368O0250
$$ plain form
17892 6477273 5997509 5543363 5177163 4856716 4544348 4320923 4103616 3842903 3578150
17883 3578150 3320283 3105550 2898566 2727344 2641540 2550362 2398835 2276742 2167893 2064588
17873 2064588 1964450 1966370 1990890 1920421 1814529 1738819 1711830 1668757 1632792 1580624 1547741
17862 1547741 1512469 1404353 1336967 1277169 1283103 1287734 1305073 1258127 1220020 1239132 1234425 1227915
17850 1227915 1217219 1253099 1231410 1273093 1281395 1326023 1237236 1115719 1112344 1122532 1077754
17839 1077754 1041471 1014527 920106 881432 864603 868586 928913 1007178 1008932 984352 956381 887428
17827 887428 883273 926024 890942 856504 855153 890531 972283 970354 1015720 992808 947134 921908
17815 921908 912744 898984 887501 877251 884502 894652 852184 797584 780538 855419 919787 980037
17803I80037O1350j2759K8086l6654l2731P0951l469l4051L351j0278k4885k3293
17791I65655l7392l5033M744J3454l1649j2134K2370o3833k5228o7704n3751q041
17779F71458o9756o6025N039M9726o138m2239l4376r7263J2433N8673o325j9628
17767D55579N3752k5k7191M2171O4894J18551R4683L4726n8140J1663M8276M8702
17755H87641l5429o3321l0022M0429K5177K3519K4860O3436J6694k6075m7928
17744H78981q2090r9802p3696p7399m7409L6815Q543o0817j373l6728r1368L1981
17732C85638N0834l2029o2170m1602J5634n996m4219L832l0799J1520k7194o1
17720B23388O0804N5509N086M707P145K6855N1449K5792k3198j2749k3124M696
$$ plain form
17803 980037 1041387 1028628 1056714 1020060 987329 1058280 1054811 1020760 1024111 1013833 988948 965655
17791 965655 928263 893230 897974 911428 879779 867645 890015 826182 800954 733250 679499 671458
17779 671458 601702 535677 540716 590442 584304 542065 507689 410426 422859 481532 475207 455579
17767 455579 509331 509306 482115 524286 589180 707731 802414 837140 779000 790663 838939 887641
17755 887641 852212 788891 758869 799298 824475 847994 872854 936290 952984 926909 878981
17744 878981 796891 697089 623393 545994 498585 535400 543943 483126 481753 445025 353657 385638
17732 385638 436472 404443 342273 300671 316305 310309 266090 269922 239123 250643 223449 223388
17720 223388 284192 339701 344787 349494 356639 383494 434943 460735 437537 424788 401664 406360
17708D06360n7954J1967L3102j2224l6176q57J0864j207j7660l3291J3362J5899
17696C32185k6737n0574P627l493o5313k1512J1742k1101l041n664J7637k2737
17684A49019o4961K6976O6039K4813j1562p015P0049p732j19211n017J2833j0035
17672A24196K1708M5854j3608p4264J6708K8404J1283j2363M1992l642q2429k8974
17660G4865R9706L0091p483n2812l6145J0448m277K6329K6030J1441K4734j1753
17648A91174k5080o5922J4120k5774k9743P9830R559j3339M0423n16k1206K2876
17636A76402m7632m9147K0378M19J7433n70Q150L875n6101k4545j9231K6556P1998
17623A27985J288k75k3390k8626m3188K0798N1759M5515P505j5646m1291k9311
$$ plain form
17708 406360 348406 360373 393475 381251 345075 344218 355082 353875 336215 302924 316286 332185
17696 332185 305448 254874 262501 259008 193695 172183 183925 162824 159783 154119 171756 149019
17684 149019 84058 111034 177073 201886 190324 183309 253358 245626 126415 121398 134231 124196
17672 124196 145904 191758 178150 103886 120594 148998 160281 147918 189910 186268 103839 74865
17660 74865 174571 204662 197179 144367 108222 118670 114393 140722 166752 178193 202927 191174
17648 191174 166094 100172 114292 88518 58775 138605 148164 134825 175248 174732 153526 176402
17636 176402 128770 79623 100001 100420 117853 117283 125433 129308 73207 48662 29431 55987 127985
17623 127985 129273 128998 105608 76982 33794 54592 106351 151866 159371 143725 102434 73123
17611G3123q240p696k021J0465l460j3788j2774l825M8566O5352L5743j9071j09406
17598E2968l0204J4882k7208j1814L9189J566Q649P137K1774m2355k3222O1030
17586G2392O9477M035l0722j1262m3660J4428L1406j3604J7723L8517m3490m5463
17574E9777j6040j0772L0080O881N690o035q051l866K1623M9188k9814k5110L587
17561G7138J437o8185k6389M9814j6259k1175M9716J00869J7072l3147l4917j2408
17549H3566L3377j3450M9270k0422j6068J4315N5055k7117q4040l9812n5791K7923
17537F806m472J8492P37q73m8634P5743O0777M681m3247m1709J8067j4626m0131
17524h389l3419K1884J05511Q6910l0759l4510o8384n378q49p757O166n468R95
$$ plain form
17611 73123 64883 57187 55166 65631 62171 48383 35609 31784 80350 145702 181445 162374 52968
17598 52968 22764 37646 10438 -1376 37813 39379 48028 55165 76939 34584 11362 72392
17586 72392 141869 145904 115182 103920 60260 74688 106094 92490 110213 148730 105240 59777
17574 59777 43737 32965 63045 69926 75616 69581 61530 57664 79287 128475 98661 73551 77138
17561 77138 78575 10390 -15999 33815 17556 -3619 46097 146966 164038 130891 95974 83566
17549 83566 116943 103493 152763 132341 116273 130588 185643 158526 74486 34674 -21117 6806
17537 6806 2334 20826 21563 20690 -27944 47799 108576 113257 70010 28301 46368 31742 -8389
17524 -8389 -41808 -19924 85587 172497 141738 107228 38844 33466 32617 24860 31026 25558 26553
17511B6553M089J8699M7375J1859m6958n7307q673M3983j2593K6269M6320O050
17499A05666J1723Q743p608K735j3968k9801L607o3358o241L786R5661J5660k6747
17486I9858l4266R7015P2647j9291K803J8994k3606l7372J125P5603J03453j5728
17474C41235n5425N5844M7393o4166j19885j0919M0483K1342j9076m4725j045
17463A91056j406L6065o1620j0193O2966J9885L4561L7619l4666N2710M0831P618
17451C75426k6104k8515Q3212O6358j885j2548N5401Q7594M1331L2083m0754j19799
17439E11800j23295m2368o6741m0161L7635k4750o7193l1074K8341K7070J5075
17428B24339P1962J1269J5133n2267k3819P1157J6292m7118K4440M4862o119R381
$$ plain form
17511 26553 30642 49341 96716 108575 61617 4310 -4363 39620 27027 53296 99616 105666
17499 105666 117389 126132 118524 121259 107291 77490 81097 17739 11498 15284 110945 126605 99858
17486 99858 65592 162607 235254 215963 218766 237760 214154 176782 177907 253510 356963 341235
17474 341235 285810 341654 389047 324881 204996 194077 234560 255902 236826 192101 191056
17463 191056 189650 225715 164095 153902 216868 236753 271314 308933 274267 326977 367808 375426
17451 375426 349322 320807 404019 470377 468492 455944 511345 598939 640270 672353 631599 511800
17439 511800 388505 346137 279396 239235 276870 252120 184927 153853 182194 209264 224339
17428 224339 296301 307570 322703 270436 246617 317774 334066 286948 311388 356250 350131 359512
17416C59512Q624j01122l8505L8963n699j9666m7561o3306J1582n8865o1155N0084
17404G2886M1252J2655K6570l2959j51717n8069L5234N4063J9482Q18L437P1697
17392I5349O3760k6347k4917j5725n8078m67K6130l71o7136J7653m108j7389j1167
17379b2813k958N7066J5740l1949P343M7175M7970N5390q1352p2983p0324m0815
17367i2510r267M4733N2392J6380l5506j6852J7387L3561l7439j400K3269J6512
17355A1260K5000J8455k1931n87L0617k0930j9838j591R68K276o5052l1348K6163
17342d6538Q0876k095n261m7194N854N8669k5810L153j7920l8260l0182p4168
17330a38876J6706J34201L0760k1218m5978r999J587j858K4451o406P6263K3604
$$ plain form
17416 359512 368136 267014 228509 267472 261773 242107 194546 131240 142822 83957 22802 72886
17404 72886 114138 126793 153363 120404 -31313 -89382 -54148 -85 19397 20215 23652 95349
17392 95349 159109 132762 107845 92120 34042 33575 59705 59334 -7802 9851 5743 -11646 -22813
17379 -22813 -25771 31295 47035 15086 22429 69604 117574 172964 91612 18629 -51695 -92510
17367 -92510 -101777 -57044 -4652 11728 -23778 -40630 -23243 10318 -27121 -28521 -5252 11260
17355 11260 36260 54715 32784 32197 62814 41884 22046 20455 21423 23699 -41353 -72701 -46538
17342 -46538 34338 32243 26982 -20212 -14358 44311 18501 21654 3734 -34526 -64708 -138876
17330 -138876 -122170 12031 42791 21573 -24405 -34404 -32817 -34675 -10224 -16630 59633 83237
17318H3237l6623l4004N150K0231J9422q235l1963K7596K430q1273J8129o869
17306b2772r214J6292M5601M6L1389N7673L3797j9640o1310m6741l3657J6429
17294G893P1862j8098q1240k9015m474P9609N0883J9899m2825O716p615l8283
17282A5312r887o486p286l03P154l3826K2428P4850N9899l4904k7762k7189O727
17269C8727J3275O7700O458K8058n6653p2691q6373L0171M853K638K023n816J7014
17256a0616l2788j6816J1736K6192k5328K2362N2015l0187r203L5846k770o2928
17244d2485O995L4062L0454Q801k5633k4419k4324N627p6318N6145P3865l5277
17232a2507l6217L5147M6051P0496M7929m9087k5427O69M4877k783n032r4400
$$ plain form
17318 83237 46614 12610 17760 37991 57413 49178 17215 44811 47241 -34032 -15903 -22772
17306 -22772 -31986 -15694 29907 29953 61342 119015 152812 133172 71862 25121 -8536 7893
17294 7893 79755 61657 -19583 -48598 -53072 26537 77420 97319 54494 61210 53595 15312
17282 15312 5425 -1061 -8347 -8650 -1496 -35322 -12894 61956 121855 86951 59189 32000 38727
17269 38727 52002 119702 126160 154218 97565 24874 -61499 -31328 -26475 -23837 -21814 -27630 -10616
17256 -10616 -43404 -60220 -48484 -22292 -47620 -25258 26757 -3430 -12633 23213 20443 -42485
17244 -42485 -35490 -1428 29026 37827 12194 -12225 -36549 -30922 -107240 -51095 22770 -12507
17232 -12507 -48724 -13577 32474 102970 150899 101812 76385 77054 121931 119148 114116 19716
17220A9716l1516R452J8598k5146J5682K6307J8496L2189m4098J6440q244M6222
17208I4098n249j8562l6204k3968l0202K8160M4520j9258K1617m338J1852J8204
17196H0670k4645j7041l0566K2968l994N2187K1483J1206m4643j29l4288j09905
17184g6697q210Q3241N7994J06L8087m3101J6182M8955l3157K232p2987R915n406
17171A7154J0448Q227J8159k847j8150k9327k9195k5501M9902m726j9554M0010
17159A4600j2435r0377m9250j1463R7618Q8324n0910q6855n9662O2599J20307
17148B2496M4914r768L6618r6524j8630O981J7422J4187n6460l8209K9815j3110
17136f0268J1283M2675n123M5727J2290M5670o5805m319N5658O362M4619k9057
$$ plain form
17220 19716 -11800 -2348 16250 -8896 6786 33093 51589 83778 39680 56120 47876 94098
17208 94098 88849 70287 34083 10115 -20087 8073 52593 33335 54952 50614 62466 80670
17196 80670 56025 38984 8418 31386 27392 79579 101062 112268 67625 67496 33208 -76697
17184 -76697 -84907 -1666 56328 56434 94521 51420 67602 116557 83400 85632 12645 22560 17154
17171 17154 27602 35829 53988 51141 32991 3664 -25531 -51032 -1130 -5856 -25410 14600
17159 14600 2165 -88212 -137462 -148925 -51307 37017 -13893 -100748 -160410 -97811 22496
17148 22496 67410 57642 94260 -2264 -20894 -13913 3509 17696 -38764 -76973 -47158 -60268
17136 -60268 -48985 -6310 -11433 34294 46584 92254 26449 22130 77788 84150 128769 99712
17124I9712k040j3216j5280p088m5670k7755M1301Q3599k7121m6604n1662O692
17112e132K2651n183m977p030n676J0096K0584k0710K717K462K552j8355j1744
17099a7745J0584L1556k0293l0464k9605J0948N6016j1739o8587L121j6093l790
17087h6091p250k865o200M0051J07214O364k2611p6755l7953j0131j2220L5326
17075g3121O6364M8116o1928k1996M0411K269Q415l244k8992k5416N5322R843
17063A6043p2078R861O1241K3139o5479j7386L2779K1671r961l1407J0089O336
17051a5152j770k4665k4514K6057Q1848L4875j6929p7959k0705m439o062l2751
17039h2166j6520L6929L3104O6707M6831q9702l525K4540m2992m0565l848O4185
$$ plain form
17124 99712 97672 84456 69176 62088 16418 -11337 29964 113563 86442 39838 -11824 -5132
17112 -5132 17519 12336 7359 329 -5347 4749 25333 4623 7340 9802 12354 -6001 -17745
17099 -17745 -7161 24395 4102 -26362 -55967 -45019 10997 -742 -69329 -66208 -82301 -86091
17087 -86091 -93341 -96206 -102406 -62355 44859 51223 28612 -48143 -86096 -96227 -108447 -73121
17075 -73121 -6757 41359 -20569 -42565 -2154 115 8530 5286 -23706 -49122 6200 16043
17063 16043 -56035 -46174 15067 38206 -27273 -44659 -11880 9791 -170 -31577 -21488 -15152
17051 -15152 -16922 -41587 -66101 -40044 41804 76679 59750 -18209 -38914 -43353 -49415 -82166
17039 -82166 -98686 -61757 -28653 38054 84885 -4817 -8342 16198 -26794 -67359 -71207 -7022
17027g022J7913k7898k5762J1429J793M8364J9607j4275l3212m9423L4878o8341
17015i1949k503N4195K3781Q8823k0819n3178n0112L5746R9761L0202l6659n1947
17003B5341P414j5777j7746J5399K4452k1114o1351K3307R4242O349j8817j42
16991F1557j4589N9041m7406o0898J4184j265P0827l7799o0089j1469J6965l383
16979a4324l5168k2822K2831N317J0186M1788J3066j3739k7839K4304J7727m8083
16967b6756M6549j9938j3534M049j8333K3423L4783m355j9147k2874O127O0415
16955E0409K1810J5022M6469j959k9131l3660j2006l8884k5049k7568k4606m9070
16943a08223K0737N3649j9713k8802j3658K199M8885l7260k9488L8217L7789K2778
$$ plain form
17027 -7022 10891 -17007 -42769 -31340 -29547 18817 38424 24149 -9063 -58486 -23608 -91949
17015 -91949 -94452 -40257 -16476 72347 51528 -1650 -51762 -16016 83745 113947 77288 25341
17003 25341 32755 16978 -768 14631 39083 17969 -43382 -20075 74167 80516 61699 61557
16991 61557 46968 106009 58603 -2295 11889 10624 81451 43652 -16437 -27906 -10941 -14324
16979 -14324 -49492 -72314 -49483 -44166 -33980 7808 20874 7135 -20704 3600 21327 -26756
16967 -26756 19793 -145 -13679 -9630 -27963 -4540 30243 25888 6741 -16133 -10006 50409
16955 50409 72219 87241 133710 131751 102620 68960 56954 18070 -6979 -34547 -59153 -108223
16943 -108223 -87486 -33837 -53550 -82352 -96010 -93811 -44926 -82186 -111674 -73457 -35668 -12890
16931a2890n4298P069L8653K8394m6883j7538j1299n391P425j8373O0410l938
16919b8659K2821P4881n1836n4426N7150O0610l0839n3739l9571j1165m5993N041
16907i5725J0453n4924L2856O4271K4557J7325j4844l4422L2167L6767n4578n6987
16895i3084N3973n71L6695o164r456K1545L2872Q040M1017K7328m1512L172K6937
16882A00792P4853l4899r0729n2087m8277l5896K0552J1670M734K9862l5598L198
16870e1825P1130J3037j0063N1588K5452n1178J126p158l4442M697J7970j4392
16858A5942o44J7729j5264m2031K2603j6541J0990O4233J6888m4767n517k4316
16846f95O198o139n0023J7421p736n6709M34O2376L1551M0305j3166o8919r608
$$ plain form
16931 -12890 -67188 -60119 -21466 6928 -39955 -57493 -68792 -74183 -66758 -85131 -24721 -28659
16919 -28659 -5838 69043 17207 -37219 19931 80541 49702 -4037 -43608 -54773 -100766 -95725
16907 -95725 -85272 -140196 -107340 -43069 -18512 -1187 -16031 -50453 -18286 18481 -36097 -93084
16895 -93084 -39111 -39682 -2987 -9151 -18607 2938 35810 43850 84867 112195 70683 73855 100792
16882 100792 175645 140746 50017 -2070 -50347 -86243 -65691 -54021 -49287 -19425 -55023 -51825
16870 -51825 19305 32342 22279 73867 99319 48141 49267 42109 7667 12364 30334 15942
16858 15942 15298 33027 17763 -24268 -1665 -18206 -7216 57017 73905 29138 23621 -695
16846 -695 5503 -636 -50659 -33238 -40974 -97683 -97249 -34873 -3322 36983 23817 -45102 -54710
16833e4710N6985p242k6145p5619M3523N4952r777o8519L7444L3062l9212n7774
16821a13032L2322j2708m3364N7064O8212M2670k1657j9433O8465N4662o6304
16810D6897j8205k0391j701J4690J3917J6802J8133L4588j01951Q830P0981m74
16798H2116o3391R44k9294n6520l8868J5751J2034K3109q292j0289k436R565l6891
16785a02462K2555J9537M4308O7929M3646p057m4039J7514M890o2861k3851r546
16773b9437L920k19j7740L6554j4965N587K29L7551l2780J4930k8343O8164N8571
16760A02022o606q1112l8692r618N9179j8565j0175j5882J0785j2770M995r6808
16748a13247o0996N2263M1235N4176L9900m2954j0302j134K3744N5195l0898l2751
$$ plain form
16833 -54710 2275 -4967 -31112 -106731 -63208 -8256 -18033 -86552 -49108 -16046 -55258 -113032
16821 -113032 -80710 -93418 -136782 -79718 -11506 31164 9507 -9926 58539 113201 46897
16810 46897 28692 8301 6600 21290 35207 52009 70142 104730 2779 11609 82590 82116
16798 82116 18725 19669 -9625 -66145 -105013 -89262 -77228 -54119 -62411 -72700 -75136 -65571 -102462
16785 -102462 -79907 -60370 -16062 51867 95513 88456 44417 61931 66821 3960 -19891 -29437
16773 -29437 -25517 -25736 -43476 -6922 -21887 -16300 -16071 21480 -11300 3630 -24713 43451 102022
16760 102022 95416 14304 -24388 -34006 25173 6608 -3567 -19449 -8664 -21434 -16439 -113247
16748 -113247 -174243 -121980 -80745 -26569 13331 -29623 -39925 -41059 -17315 37880 6982 -25769
16736b5769P05L4748q546K3324O5492l4794m4693l7953k8184k4554p704Q577l8950
16723a18301k084N0628K534L2672L2259L3437M9569M1440j5649r2176p202l6039
16711b8912n9483M4344O7272l0515p5304L0330l7693K3743l323l1530k5599N0927
16699g5743P9535R1589J3358m0920l8963l5590l2195p80J2317K050K2859k3749
16687b6232K359K4218j6723O069j322j9221M6432R7934K0716k6683k6631K0167
16675A01083j6277q521N5453k9230l4909q0277k0102k2917j9693L892j3333J407
16663h3424M9399K2019l2945J1543K5529o1865O348J8323L0020J5211k0993N5158
16651C4323j0418j9846p5863L5803M2788l0440J6698m595l1794J2957M2832l0749
$$ plain form
16736 -25769 -25064 9684 1138 24462 89954 55160 10467 -27486 -55670 -80224 -87928 -79351 -118301
16723 -118301 -120385 -69757 -67223 -34551 -2292 31145 80714 122154 106505 14329 7127 -28912
16711 -28912 -88395 -44051 23221 -7294 -82598 -52268 -89961 -66218 -69541 -101071 -126670 -75743
16699 -75743 3792 95381 108739 67819 28856 -6734 -38929 -39709 -27392 -25342 -2483 -26232
16687 -26232 -23873 345 -16378 -10309 -11631 -30852 15580 113514 134230 107547 80916 101083
16675 101083 84806 76285 131738 102508 67599 -12678 -32780 -55697 -75390 -71498 -84831 -83424
16663 -83424 -34025 -12006 -44951 -33408 -7879 -69744 -63396 -45073 -15053 158 -20835 34323
16651 34323 23905 4059 -71804 -36001 6787 -23653 -6955 -11550 -43344 -30387 12445 -18304
16639a8304j9608m1083J9528J0385K4748j0128K1866N712J2184k3307Q267k3468
16627c3208j7758N6788K3695L3701M65J1681o742o810k1638l0422Q049O3259m977
16614G6083n3483m1854l0671p755J2464j7566O9761l7238j6378m544Q703P132
16602c5346o0628P105K6740O1332K1098Q477l4518l0421K1635j3530k803N1845
16590B0986P077p7109K4335q443J6431L7808m8237n5617l0961o487K3881K7620
16578f8716J3310M1859r311l417K6189k085K3845q609J9696j1196p8466m9772
16566a06673N1072Q8022K1343r3474k8928k8322N901K7468K2244N2769j1528o5615
16554f5721l8945m3436P7664O7396k2770j9089m4278L777L0012J6880L6386j8022
$$ plain form
16639 -18304 -37912 -78995 -59467 -49082 -24334 -34462 -12596 -6884 5300 -18007 -9740 -33208
16627 -33208 -50966 5822 29517 63218 63683 75364 68622 61812 40174 9752 17801 81060 76083
16614 76083 22600 -19254 -49925 -57680 -45216 -62782 6979 -30259 -46637 -51181 -42478 -35346
16602 -35346 -95974 -88869 -62129 -797 20301 28778 -5740 -36161 -14526 -28056 -30859 20986
16590 20986 28063 -49046 -24711 -33154 -16723 21085 -27152 -82769 -113730 -120217 -96336 -68716
16578 -68716 -55406 -13547 -22858 -26275 -86 -2171 21674 13065 32761 21565 -56901 -106673
16566 -106673 -55601 32421 53764 -39710 -68638 -96960 -91059 -63591 -41347 11422 -106 -65721
16554 -65721 -104666 -148102 -70438 -3042 -25812 -44901 -89179 -85402 -55390 -38510 -2124 -20146
16542b0146L4778j3610r6926K8377O3170J5570j5362L0167L3004l5779r767k717
16530A0759j1937j0376k9339j103R209k3641M837N7394L3009p863N6863j5937
16518G1875j5170n6594Q448n8189k029J5705L3989M9396l6252O462K9348k5801
16506B1188k5776j5144J1563M2677J8768n8506o2741N705L067Q7861M8143l4553
16494D2252m3264J1165J8206k6239m0614q566l2784k3953M7261J3838N115j8795
16482e6378n7156N9229K5031L8778O056p09K5294p543L240j3781L8734m1987j5704
16469C104K1989M5361K2440n5810q7394N3658K0664J3457L7273L948k5840p0249
16457a7399O949K4883m0539O179Q202k9809K1218J9075M3588J4927q5341l5918
$$ plain form
16542 -20146 14632 1022 -95904 -67527 -4357 11213 -4149 26018 59022 23243 13476 10759
16530 10759 -1178 -11554 -40893 -41996 -32787 -56428 -51591 5803 38812 30949 87812 71875
16518 71875 56705 111 8559 -49630 -51659 -35954 -1965 47431 11179 17641 46989 21188
16506 21188 -4588 -19732 -8169 34508 53276 -5230 -67971 -62266 -59199 28662 76805 42252
16494 42252 -1012 10153 28359 2120 -38494 -47060 -79844 -103797 -56536 -42698 -37583 -56378
16482 -56378 -113534 -54305 -29274 9504 15560 14851 40145 32602 35842 22061 60795 18808 3104
16469 3104 25093 70454 92894 37084 -50310 3348 24012 37469 74742 78690 52850 -17399
16457 -17399 -10450 14433 -26106 -19927 -11725 -41534 -20316 -1241 42347 57274 -28067 -63985
16445f3985Q472Q0101K779n0528j5916L1624J4798k109N4706O423k6001J4513
16433E4877O192k5231N0499K9073L1377r529k5132J4169m6334l6041l2026j6407
16421d513P661P589M8259K5192l0402k8029K1153J3049J6293J0604j9912m0897
16409B6047p074Q026R862j0300R425n094J2340M1997p541p3854j2653J5791j3945
16396f973L9434P9116J1792m2884m6456k6673l2626P705M0709K5868L1701q873
16384G1840j9357r271o1762M3687J02362j8502K4153M9175Q454j4609L2623L4740
16372B43533m3963p5153J6757O1150j5874n1134k2685L1814L6992L2514k6689
16361A87262m2377q216M6317m7293m7130J1337M3580O357n6254j8042j8065L6161
$$ plain form
16445 -63985 -55513 24588 27367 -23161 -39077 -7453 7345 5236 59942 66365 40364 54877
16433 54877 61069 35838 86337 115410 146787 137258 112126 126295 79961 43920 11894 -4513
16421 -4513 3148 10737 58996 84188 53786 25757 46910 59959 76252 86856 66944 26047
16409 26047 18973 26999 36861 26561 35986 30892 43232 85229 77688 3834 -8819 6972 -6973
16396 -6973 32461 111577 123369 80485 34029 7356 -25270 -17565 23144 49012 80713 71840
16384 71840 52483 43212 -18550 25137 127499 108997 133150 182325 190779 176170 208793 243533
16372 243533 199570 124417 141174 202324 186450 135316 112631 144445 181437 213951 187262
16361 187262 144885 136669 182986 135693 88563 99900 143480 149837 93583 75541 57476 93637
16349I3637K4597K0995O23j929m1995L2642J4123l6031M2980P2345N003q7247
16337A39743l1380Q201K4800N3629J1319M6158L234k8795q216J5854m4932m4436
16325A45179j9862K3289O1422K1127L8220J0711O411k3443n9756P543L3926M1939
16313B86706j7002M189O5329J7562n7683o5707J3771M1763L9581o605j9725j5642
16301B86537q175L0602o0255n8526P800M6806M399L810M8942K3276m8389M2340
16289C19167P7062j3387q0929m3910m8893o0216j601O3388q7068k8356K8973J727
16277A25957l723j0244l2697J3065k6349J7988K8837J0283j3048j9053J4344K5463
16265A30823J6386J1913J3715j5099k4241l1304Q708j5974l4506M7402l374K4941
$$ plain form
16349 93637 118234 139229 139852 137923 95928 128570 142693 106662 149642 221987 226990 139743
16337 139743 108363 116564 141364 194993 206312 252470 255704 226909 218693 234547 189615 145179
16325 145179 125317 148606 210028 231155 269375 280086 286497 263054 203298 210841 244767 286706
16313 286706 269704 273893 339222 356784 299101 233394 247165 288928 328509 321904 302179 286537
16301 286537 278362 308964 248709 190183 197983 244789 249188 252998 301940 325216 276827 319167
16289 319167 396229 382842 301913 258003 209110 148894 147293 210681 123613 95257 124230 125957
16277 125957 122234 111990 79293 92358 66009 83997 112834 123117 110069 91016 105360 130823
16265 130823 147209 159122 172837 157738 133497 102193 110901 94927 60421 107823 104449 129390
16253A29390L5631L4861O879J053l0410m9919j1787O5299J2801n611j11J5525
16241B03601k6001m7280O2820K7624l2798L8478J9904n2723q1268o73L6303Q0021
16229B28008M632m1192o127l69M6114J6752m529o8516J5705J2918r554n7811l7598
16216I8433M8829Q6660J6469N0964L8893r3136r5722K7663R0619L2809L9711K481
16204C44673J603R676j075k9545n3260l4958O9635O0742K4495n577J7673K3565
16192D27647N6082J1358r158m9399J817J5056j9519k3198l2330Q629M8872L1237
16180D67094L4998K8649K7692J697n791K5332K7803l581J3817K7692M8298N5226
16168G48926R4362J53141J20791K0631J14030P1846P5053m3532q2772o0933j11522
$$ plain form
16253 129390 165021 199882 206761 207814 177404 127485 115698 180997 193798 188187 188076 203601
16241 203601 177600 130320 193140 220764 187966 226444 246348 193625 112357 111684 147987 228008
16229 228008 232640 191448 185321 184952 231066 247818 243289 174773 190478 203396 193842 136031 98433
16216 98433 147262 233922 250391 301355 340248 247112 151390 179053 269672 302481 342192 344673
16204 344673 346276 355952 354877 325332 272072 237114 306749 367491 391986 386409 404082 427647
16192 427647 483729 495087 485929 436530 438347 453403 433884 410686 378356 386985 435857 467094
16180 467094 502092 530741 558433 560130 554339 579671 607474 603893 617710 645402 693700 748926
16168 748926 843288 996429 1117220 1137851 1251881 1323727 1398780 1355248 1272476 1211543 1100021
16157A100021q9666k3174o0312q4300p3522j0494L88m6629r4859o8413m8143M9070
16145E49967n5749o3006o8701K4777J6160j8620r499N3081j9240N344K3926m4862
16133C93578o295o75j1985k9835q865j3433L711m426J5531k7960K0969J3365k7833
16120C15847k2750m3215M4237n855o4607l7218P541N521L2302K0991K9351l9205
16108B42940o6527k24K6036K0070K3888k209j27M5781m6760o3104L5041j0845
16096B03960q5503k6471O0349j5441q087r407M7168m4925j5264j6144O0020L8866
16084A89121O067q273L6666m5626O216j2656J3961m5957k6250m4229M188O3191
16072A36419P7453L6038l1692k9026n2528l8670O6213N4092p3853M7804R4566
$$ plain form
16157 1100021 1010355 987181 926869 842569 769047 758553 758941 712312 617453 549040 500897 549967
16145 549967 494218 431212 362511 387288 403448 384828 375329 428410 409170 414514 438440 393578
16133 393578 387283 386608 374623 344788 335923 322490 326201 321775 337306 309346 330315 343680 315847
16120 315847 293097 249882 294119 288264 223657 186439 193980 199501 231803 252794 282145 242940
16108 242940 176413 176189 202225 222295 246183 243974 243847 289628 242868 179764 214805 203960
16096 203960 118457 91986 152335 136894 128807 119400 166568 121643 106379 90235 150255 189121
16084 189121 195188 186915 223581 177955 184171 171515 185476 139519 113269 69040 73228 136419
16072 136419 213872 249910 218218 189192 136664 97994 164207 218299 144446 192250 286816
16061B86816m4463m9325j1407m7038J0282M3103p692l9152o0743j3356P4047M7938
16049A89010P5514J5261k9947k0712R119L5557j0837N8776j1172o8408o3710K0303
16037A98754O2143M923P0291R087j7190j8106K951J619J8433J7919O128J462L8439
16024C96853M2456K1994M4654K6616J8783n8549n1547j3811l238k4510L920L2447
16012D36068j8519n6002l7759o4039p101L2417J605k8018P218N2322K6978l7925
16000C07245K5322k7050K6606K0007j1943p3593k5635k8404j8197k8699L147J3383
15988A82189q679o2040K0964L2770m8952j3389m4902n1187P105Q8395P8366J8402
15976A99042J4369o1920k1093J549P919m673R830j3974P802N1413Q9039K1163
$$ plain form
16061 286816 242353 193028 181621 134583 144865 187968 180276 141124 80381 67025 141072 189010
16049 189010 264524 279785 249838 229126 238245 273802 262965 321741 310569 242161 178451 198754
16037 198754 260897 265820 336111 345198 328008 309902 312853 314472 332905 350824 356952 358414 396853
16024 396853 439309 461303 505957 532573 551356 492807 441260 427449 424211 399701 403621 436068
16012 436068 417549 361547 323788 259749 252648 285065 286670 258652 265870 318192 345170 307245
16000 307245 332567 305517 332123 352130 340187 266594 240959 212555 194358 165659 168806 182189
15988 182189 173510 111470 132434 165204 116252 102863 57961 6774 13879 102274 180640 199042
15976 199042 213411 151491 130398 131947 139866 135193 145023 131049 138851 190264 279303 300466
15964C00466n1445o444P148p7089j8310K8219O8568K3100P591O0046p526p4372
15952B59952J0380K3942N0079l8192P328K9828Q7887P0596J2663N031n4621m6581
15940D18292k638K0601l1219m3976r7858m2286j3304K9506l02r589l6406P819
15928A98640k9347P5492P410m5834m6274j1741M1509O712J0547K0351k8193o5984
15916A33288j06655l1568M0289j4069k0597M80K2827L2016J6626O105M4847m1337
15904H2252L2222N3215k9133K5799n935L4488q1828j25819l406N8474J4752K5694
15892H0775j1530N9440J3481m0344K147N2903L7060j3217K096k4373r387O8347
15880B17398j4470l4951o806o2727j0859P720m53J1414N5170M1275K4059p5999
$$ plain form
15964 300466 249021 242577 249725 172636 154326 182545 251113 274213 281804 341850 334324 259952
15952 259952 270332 294274 344353 306161 313489 343317 431204 501800 514463 519494 464873 418292
15940 418292 415654 436255 405036 361060 263202 220916 207612 237118 236816 227227 190821 198640
15928 198640 169293 244785 252195 206361 160087 148346 189855 196567 207114 227465 199272 133288
15916 133288 26633 -4935 35354 21285 688 1168 23995 56011 72637 78742 123589 82252
15904 82252 114474 167689 138556 164355 158420 192908 111080 -14739 -18145 40329 55081 80775
15892 80775 69245 128685 142166 101822 103969 156872 193932 180715 182811 158438 149051 217398
15880 217398 202928 167977 161171 98444 87585 95305 94852 106266 161436 202711 226770 150771
15868A50771m150M1973p707n0653n2027N7212N093K919K6655l2165J7504K8883
15856A84308m4255n007l7553M645M4473L3620K7396m0274l3281L8101j5138k2027
15844A35008K4353o471p665L6299m1546k5106K4876Q2315m886M4887L8370K4615
15832C25049J2706k806j8668j7866J9171m594m5410j6655M555n4697l2714p909
15820A60162L0457K7070L4561J5938k5231J7145J40925J71710J68887K09070K66892
15809A217586K64621K32979J64680K16517N8689m0078r9515j89217k61017k63630
15799A301615k29645j66177j24317j28712n3069q0832q2544l8107L513o9307j13943
15788B18475l1438K417L9915j038l87Q4304J3752m9495p2219J3214M1464J6400
$$ plain form
15868 150771 146621 188594 180887 130234 78207 135419 140512 143431 170086 137921 155425 184308
15856 184308 140053 135046 97493 102138 146611 180231 207627 167353 134072 172173 157035 135008
15844 135008 159361 152890 145225 181524 139978 114872 139748 222063 217177 262064 300434 325049
15832 325049 337755 334949 316281 298415 317586 312992 267582 250927 255482 200785 168071 160162
15820 160162 190619 217689 252250 268188 242957 260102 401027 572737 741624 950694 1217586
15809 1217586 1482207 1715186 1879866 2096383 2155072 2114994 2015479 1826262 1565245 1301615
15799 1301615 1071970 905793 781476 652764 599695 518863 436319 398212 401725 332418 218475
15788 218475 187037 189454 229369 228331 227944 312248 326000 276505 204286 217500 258964 275364
15776B75364J3990l868L1263O3390l2554L3655Q7448J08779R3924P8840J19024
15765H69255J83694R2110Q6122L8568N2833K2416l4833k8868o5779j19477k11375
15754H84666j86412j21490j12696j0404l1220l1246l8601n9554J1226K9876K1145
15743C55290p2288j6137J963M4445j6640r7548j4524l9986l2586k2353j1673J4121
15731I2084N6206O7314m4983p5435k2091J4343Q4791r172l6278o7556k4144J7876
15719E2955O7447M5596k1643k5607j827l4533l6325l5014L3454L545l4959j3204
15707a15Q2809O9208l8911m1881K5055K2814J9072J5173j5320j2475J01791o53
15695B26567p3460m1460N3839l1997l330N91j3035N5248j2394k6479l5481n4852
$$ plain form
15776 275364 289354 285486 316749 380139 347585 381240 468688 577467 671391 750231 869255
15765 869255 1052949 1145059 1231181 1269749 1322582 1344998 1310165 1281297 1215518 1096041 884666
15754 884666 698254 576764 464068 453664 422444 391198 352597 293043 304269 334145 355290
15743 355290 283002 266865 268828 313273 296633 199085 184561 144575 111989 89636 77963 92084
15731 92084 148290 215604 170621 95186 73095 87438 172229 163057 126779 59223 35079 52955
15719 52955 120402 165998 144355 118748 116921 82388 46063 11049 44503 48048 13089 -115
15707 -115 82694 151902 112991 71110 96165 118979 138051 153224 137904 125429 227220 226567
15695 226567 153107 111647 165486 133489 130159 130750 117715 172963 160569 134090 98609 43757
15683D3757o5391N198M2049N165l2821K8696L5646P0438k117j6782J534R5751
15671B11123l6621j43058K5991L5124J5k923Q078O2890l783L902K3338K2450k7821
15658A78705n4819M6855j6252N8066L1932L0040m9679k4809r206J4442M6418J2817
15646B64510l7186k2063K1834N6313m9053r6146j8150k5911K7791j8250k194O1497
15634A62992L0755m5278j3975k6389N4597O3896O8304L2198K4513j5564j0917
15623C25132L8220J3679K6597R6326O2846M1556J7057M2574M9591P7752J01993
15612H93323k3596j23181j05074p5105J788m0915m1236J8053l2040m194k328j0605
15600D54890n0984k7177j1576p314J4532K9057j0587l0271K1603L5668J5690l1668
$$ plain form
15683 43757 -21634 -16436 25613 30778 -2043 26653 62299 132737 130620 113838 115372 211123
15671 211123 174502 31444 57435 92559 92574 89651 97729 160619 156836 160738 184076 206526 178705
15658 178705 123886 170741 154489 212555 244487 274527 224848 200039 190833 205275 251693 264510
15646 264510 227324 205261 227095 283408 234355 138209 120059 94148 121939 103689 101495 162992
15634 162992 193747 148469 134494 108105 162702 226598 294902 327100 351613 336049 325132
15623 325132 363352 377031 403628 499954 562800 604356 621413 663987 713578 791330 893323
15612 893323 869727 746546 641472 566367 568155 527240 486004 504057 472017 467823 465495 454890
15600 454890 403906 376729 365153 357839 372371 401428 390841 360570 382173 417841 433531 401863
15588D01863M72M5906K2241j7794L3580O7489L4848l493J1814L2956J2290l4682
15576F07490j1693K6881N7894m1404p1668k9301o75R812l0135k8366n1343p4875
15564C62617m9205k6294K8890J6372l960m321l7783n7763p4298K9003P2601N2050
15552C07909p979L600L861k469K80j1103p601j253l565N7248O367M7812N7955
15539D51062N6751K8924L9479R6502L4378N7286J75396J57101J50914J28010P2300
15528A448103M1359K836j28527j08672j68434j52934q4862j24919r1090l4679
15518E98181m1544j5384m1344j5987l4690J4613l1107j1931R025j9071m2589K4054
15506C92226J8848k61j7187L3109n5794j3854o687K9608J2397M1195N2229O8661
$$ plain form
15588 401863 402335 448241 470482 452688 486268 553757 588605 585112 596926 629882 642172 607490
15576 607490 595797 622678 680572 639168 567500 538199 537524 547336 517201 488835 437492 362617
15564 362617 313412 287118 316008 332380 328420 324099 286316 228553 154255 183258 255859 307909
15552 307909 299930 303530 307391 304922 305202 294099 286498 285245 281680 338928 345295 393107 451062
15539 451062 507813 536737 576216 672718 707096 764382 939778 1096879 1247793 1375803 1448103
15528 1448103 1489462 1492298 1363771 1255099 1086665 933731 848869 723950 632860 598181
15518 598181 556637 541253 499909 483922 449232 463845 432738 420807 429832 410761 368172 392226
15506 392226 411074 410813 393626 426735 370941 357087 350400 380008 392405 433600 485829 554490
15494E54490Q2378k5404m8871N8680P1130j8667J9464j9902J1603M1427J825L354
15482G31507n2360p8211O79k8980k850Q399o366o9139j0680P261M5393M9853r354
15469E85152j390L9370j2140l8469K4909O8725K8911R6066N4969k0662k2893o0114
15457G42434l8641j1917Q8002K4863K2834P3722J0811l0168j823p7775k8667L8398
15445H12073K5620P3216J01548L020r029j1478J17222R2141O9331L3435L3259
15434A340358L747M0453N0151M3268N7601R286k717N7362j1835R899O8446P6891
15422A742910Q9110J24115O7562J38361J05047Q1088O7783N6031Q9377O5996J9618
15411B646998K0847L4291Q003Q5777O8975O6983J09629R9959J00372J45376J42573
$$ plain form
15494 554490 636868 611464 562593 621273 692403 673736 693200 673298 684901 726328 728153 731507
15482 731507 679147 600936 601615 572635 569785 578184 571818 502679 491999 499260 544653 594506 585152
15469 585152 583762 623132 610992 572523 597432 666157 695068 791134 846103 825441 802548 742434
15457 742434 703793 691876 779878 804741 827575 901297 912108 881940 880117 802342 773675 812073
15445 812073 837693 910909 1012457 1015477 1006448 994970 1112192 1204333 1273664 1307099 1340358
15434 1340358 1344105 1384558 1434709 1477977 1535578 1544864 1542147 1599509 1587674 1597573 1666019 1742910
15422 1742910 1832020 1956135 2023697 2162058 2267105 2348193 2415976 2472007 2561384 2627380 2646998
15411 2646998 2667845 2702136 2710139 2795916 2864891 2931874 3041503 3141462 3241834 3387210 3529783
15400C529783J59067J99619K33897K41847K36949K57562L55142M19262M36185
15391F069313M80377N41194N69090O48864P30984R06683R72738J184663J394894
15382A3498800J726275K002769K440473K865173L269955L621725M088364M720496
15374C8234030N531796O792247Q527705J1252757J5289556K1215351K9686087
15367A36529529M0201569N0497472N6987694N7197272N0086733L5283762J3981948
15360D40765979r431211l0184232m5219866n3077554n3974672m9187616m0891418
15353A58799410l1730680k3588149j7214354j2573104r411715p310933n871839
15346E1098636m913641m267056l773434l467749l135099k766603k449140k125779
$$ plain form
15400 3529783 3688850 3888469 4122366 4364213 4601162 4858724 5213866 5633128 6069313
15391 6069313 6549690 7090884 7659974 8308838 9039822 9946505 10919243 12103906 13498800
15382 13498800 15225075 17227844 19668317 22533490 25803445 29425170 33513534 38234030
15374 38234030 43765826 50558073 59085778 70338535 85628091 106843442 136529529
15367 136529529 176731098 227228570 284216264 341413536 391500269 426784031 440765979
15360 440765979 431334768 401150536 355930670 302853116 248878444 199690828 158799410
15353 158799410 127068730 103480581 86266227 73693123 64281408 56970475 51098636
15346 51098636 46184995 41917939 38144505 34676756 31541657 28775054 26325914 24200135
15338B4200135j806412j529592j353381j178562j138390r78581q69806p74802
15330A4570609o59924o27340n82308n03002n20390n15803m92108m18610m45385
15321I805739m00582l25698k96273k92352l40063l21630k93241k69828k76640
15312F989432k56949k28706k69467j81861k49053k21322k02794k36106j99898
15303D943276j71978j45354j51254j53285j22283j15503r7929j10114j16111j23042
15293C636423j27180j36346j50934j72034n1150J8247q4529j8324P865m4524r1195
15282B786319k1106m281m8378o1638o5349k5719o7692k7768m5975j16458r3936
15271B208019j01358r3598o4004m316n031o2327M2094M6884o1063n9740m6286
$$ plain form
15338 24200135 22393723 20864131 19510750 18332188 17193798 16215217 15345411 14570609
15330 14570609 13910685 13283345 12701037 12198035 11677645 11161842 10669734 10251124 9805739
15321 9805739 9405157 9079459 8783186 8490834 8150771 7829141 7535900 7266072 6989432
15312 6989432 6732483 6503777 6234310 6052449 5803396 5582074 5379280 5143174 4943276
15303 4943276 4771298 4625944 4474690 4321405 4199122 4083619 3985690 3875576 3759465 3636423
15293 3636423 3509243 3372897 3221963 3049929 2998779 3017026 2932497 2914173 2922038 2877514 2786319
15282 2786319 2765213 2760932 2712554 2650916 2585567 2559848 2492156 2464388 2418413 2301955 2208019
15271 2208019 2106661 2013063 1949059 1944743 1939712 1877385 1919479 1966363 1905300 1845560 1799274
15260A799274k8662r5302o6505r6989j8619o2448M494p878N93m7757n6632l6375
15248A287194M6689l0533n5243m0599j07177l0083K8562Q3087M8950m1550o0902
15237A128395J1995O7974P3673K043n9431r240l3116l2081m2288l0612o3268p7915
15225I36129k9773n8762n2441m4102l2285j8208K8635N4459j4368j273m381m706
15213G58924J9142J866L447k1933m8142j8826L4807k4158m7788j4023M785M1986
15201F90087K0294q170r321l6985j8346P574M613O0318N4561M9077L551L3317
15189H50570n153M5391Q5210N9331J1664N3501l239j31528j14122j01681k3194
15178G26750J5200O4374n9690j02814l5877r112j0644n3655p8517k1662N748k644
$$ plain form
15260 1799274 1770612 1675310 1608805 1511816 1493197 1430749 1435243 1427365 1427958 1380201 1323569 1287194
15248 1287194 1333883 1303350 1248107 1207508 1100331 1070248 1098810 1181897 1230847 1189297 1128395
15237 1128395 1140390 1208364 1282037 1284080 1224649 1215409 1182293 1150212 1107924 1077312 1014044 936129
15225 936129 906356 847594 795153 751051 718766 700558 729193 783652 769284 768011 763630 758924
15213 758924 778066 779932 783379 761446 713304 694478 729285 705127 657339 643316 648101 690087
15201 690087 710381 702211 692890 655905 637559 645133 649746 710064 764625 813702 817253 850570
15189 850570 845417 890808 976018 1035349 1047013 1100514 1097275 965747 851625 749944 726750
15178 726750 741950 806324 746634 643820 607943 598831 588187 534532 456015 434353 440101 437457
15166D37457j9708j1258K1284N4513l7881j3482q647n768M8167L5478k4421l5415
15154D40319j7942n1055k0445k3209l146Q568q4275k0411M9575J8081L381O7071
15142C66512M6461j7931k9275n3810J119J2963q5581M3102Q840K1831l4509r6895
15130A82827K1680J2942n8122n1407P3585J40090M7803L0029l2051p5710k1264
15119B70402o0399l5659k4351j746L6365m52J385p318j0429K183L9989O9762N739
15106B85471k8345q9218l1516k2063J1491O1968l1694O716N8385m1733n0431K2849
15094A51880k3679j4715J9379O9986R778j1656P526N2521j2367q759n6472n4625
15082A28797K9808p832L598M1006P2920j2890J7641p533q839L044J6877L4346
$$ plain form
15166 437457 417749 406491 427775 482288 444407 430925 422278 416510 464677 500155 475734 440319
15154 440319 422377 371322 350877 327668 324522 333090 248815 228404 277979 296060 299441 366512
15142 366512 412973 395042 365767 311957 313076 326039 240458 283560 292400 314231 279722 182827
15130 182827 204507 217449 159327 107920 181505 321595 369398 399427 367376 291666 270402
15119 270402 210003 174344 149993 148247 184612 184160 185545 178227 167798 169981 209970 279732 285471
15106 285471 257126 167908 136392 114329 125820 187788 156094 162810 221195 179462 129031 151880
15094 151880 128201 113486 132865 202851 212629 200973 208499 261020 248653 239894 183422 128797
15082 128797 158605 150773 154371 195377 268297 255407 273048 265515 256676 259720 276597 310943
15070C10943n8235o4977j9056m1817P878J8322l9150l5336K2581K9048k6005r522
15058I4674N5171O8710K4233k6177L2101K2039k7893p1472l6456K6030K6579K4233
15046B11772p7762o9481J9481L0271l597K6293J85j6078n5741k5654J1378L7185
15034H8252J7271k7376J2572k7689j5120k7034M9500L4988P846j304k9806k146
15022G9954k7288N4695K470n0905p108N1321J2727j6511J6375M4151l909M9882
15010B05854J6279l6813m0853l0304o6766O0746j0605l0528k9616L0636q722K0343
14998G9651l4391p751l6991K8930R6455L5716l912j2260l1989n6163K3390K8468
14986A09153j7488K3932j0974N666N9097K0527n9560k3768m1005p486N8929o875
$$ plain form
15070 310943 252708 187731 168675 126858 134736 153058 113908 78572 101153 130201 104196 94674
15058 94674 149845 218555 242788 216611 248712 270751 242858 171386 134930 160960 187539 211772
15046 211772 134010 64529 84010 114281 110684 136977 137162 121084 65343 39689 51067 88252
15034 88252 105523 78147 90719 63030 47910 20876 70376 105364 113210 111906 82100 79954
15022 79954 52666 107361 109831 58926 51818 103139 115866 99355 115730 159881 155972 205854
15010 205854 222133 185320 144467 114163 47397 108143 97538 67010 37394 68030 59308 79651
14998 79651 45260 37509 518 29448 125903 161619 157707 145447 113458 57295 80685 109153
14986 109153 91665 115597 104623 110289 169386 189913 130353 106585 65580 58094 117023 110148
14974A10148l1088J9425K3088K4128j7492o5297M562Q848L1160L2735K8690k4978
14962A43929Q19j4813l7389m9954l944J0431N8591N1639K4052J6410l2220j3959
14950A53592O007L0861K6723M419q1947o431J380M1882K7691j6617J6137K2892
14938B26589m3094j3662O6035P223l0900o2978l1292k3513O3122R0089K4216j3628
14926B58207J3654M8319J1591P63K6571R1004J09108R8615J08497K16714K19002
14915A202045K98351L22569K49722K04342J12243m7502j71942k48349k28019k12660
14905A480800k02203k56571j53186j64545j65692n2952q7034k1156j4715o7970
14895B94776m6797m2958m5903O8083j1203m2999k7242n7113J8070J8047m9584
$$ plain form
14974 110148 79060 98485 121573 145701 128209 62912 67474 76322 107482 140217 168907 143929
14962 143929 144748 129935 92546 42592 38648 49079 107670 159309 183361 199771 167551 153592
14950 153592 159599 190460 217183 221602 139655 133224 134604 176486 204177 187560 203697 226589
14938 226589 183495 169833 235868 243091 212191 149213 117921 94408 157530 247619 271835 258207
14926 258207 271861 320180 331771 332534 359105 450109 559217 657832 766329 983043 1202045
14915 1202045 1500396 1822965 2072687 2277029 2389272 2341770 2169828 1921479 1693460 1480800
14905 1480800 1278597 1022026 868840 704295 538603 485651 398617 377461 362746 294776
14895 294776 247979 205021 159118 227201 215998 172999 145757 88644 106714 124761 75177
14884G5177j2462L8763M5697o132J029k7456k318l8856j5442M4059p388q551k3488
14871F2632p5536m533J194N0988K7772N8318p162p006k1559K3255K6904L5768
14859A71035k503k5419m9384n1477r601L3817L3091l3494j0658N554J0513l8421
14847C3053p1861l7750L4483M0196K3593K1226J5216L866k3797L5499P3768M4066
14835A91558p4697l5752o6644o73N646N7070M2670k8208J4883k6387p3703j4273
14823h510K5499k2589O4177k9682Q396J550K7834r612j149p142p3721O136K6755
14810G942M3124J8125k1469l3259k4902k8680M9023J6082m3050L2403k6717k159
14798a3537L9816K6576L9953j1575p6971k3337j1052L9093K9220P946q2623j5915
$$ plain form
14884 75177 62715 101478 147175 141043 142072 114616 112298 73442 58000 102059 94671 86120 62632
14871 62632 -12904 -17437 -16243 34745 62517 120835 113673 106667 85108 108363 135267 171035
14859 171035 168532 143113 93729 42252 32651 66468 99559 66065 55407 60961 71474 33053
14847 33053 -38808 -76558 -42075 -1879 21714 42940 58156 62022 38225 73724 147492 191558
14835 191558 116861 81109 14465 13792 19438 76508 119178 90970 105853 79466 5763 -8510
14823 -8510 16989 -5600 58577 28895 37291 38841 66675 57063 55914 48772 -24949 -18813 7942
14810 7942 51066 69191 47722 14463 -10439 -39119 9904 25986 -17064 15339 -11378 -13537
14798 -13537 26279 52855 92808 81233 4262 -19075 -30127 8966 38186 46132 -36491 -52406
14786e2406L6193K1738j01791k1047K2300L0625P9410J8826N8126q50q6107k7368
14774b2351M8154r469L9461M7716N2228j9851k9827J2066m0640n165l4105n3591
14762a5374J8612L1531J4084j6506O903K9226l3202J5846M9864J2569o5858n992
14750D1703k3668K1518O664j4314n4708l8581p246N2293M9075L9442m8946r840
14738A3392Q298J921n0536j6847k9908K497J4498M1923L4678n2128j2829L3857
14726a1184n163J4203k9799l964k9073J4410L635K6612P29N8217K5903K2961p228
14713H0259j13616n6879L6376J0162j1824M2840M0810L4597J3092N793k6008J5561
14701G1163Q8977K2675l1293n5264o466K8275L6992K3223r0727m0357M342K7600
$$ plain form
14786 -52406 -16213 5525 -96266 -117313 -95013 -64388 15022 33848 91974 91124 5017 -22351
14774 -22351 25803 16334 55795 103511 155739 135888 106061 118127 77487 72322 38217 -15374
14762 -15374 3238 34769 48853 32347 39250 68476 35274 51120 100984 113553 47695 41703
14750 41703 18035 39553 46217 31903 -22805 -61386 -68632 -16339 32736 72178 23232 13392
14738 13392 21690 23611 -26925 -43772 -73680 -71183 -56685 -14762 19916 -32212 -45041 -11184
14726 -11184 -16347 -2144 -31943 -35907 -64980 -50570 -46935 -20323 -19594 38623 64526 87487 80259
14713 80259 -33357 -90236 -53860 -43698 -55522 -12682 28128 62725 75817 81610 55602 71163
14701 71163 160140 182815 151522 96258 89792 118067 155059 178282 87555 47198 51540 79140
14689G9140j9351L0729p389j5361J4988M206K4492k5460j739n8531k8333N3205
14677E0596M7648m147n3128L5313n114n0519n6883J5039K2514J0993J4471L5586
14665F2369n7610j7002L6879K6755K3628j074j1094N0177k71o4109l4195K1263
14653C5716L8626L8450k7375J8533l9839M7884P616p2301J1647j1526k9170m9171
14641c0910L3927K6235M4340R752j0859m301m5301J4418O5842l715r5563m5921
14629d2056K5922N1594k2913r552j0559k0109l4793L764l1056k9436Q0568K2563
14617a6063j0846M4573K6263o6531k922Q1896j2151o6521K1220K2939l4744k3845
14605c6732K2015j2233l879l1905J3651k4479j2262p850L2509Q225p769J5959
$$ plain form
14689 79140 59789 90518 83129 67768 82756 86962 111454 85994 84255 25724 -2609 50596
14677 50596 98244 94097 40969 76282 71168 20649 -36234 -21195 1319 12312 26783 62369
14665 62369 4759 -12243 24636 51391 75019 73945 62851 113028 112757 48648 14453 35716
14653 35716 74342 112792 85417 103950 64111 111995 119611 47310 58957 47431 18261 -30910
14641 -30910 3017 29252 73592 83344 72485 68184 22883 37301 103143 99428 3865 -42056
14629 -42056 -16134 35460 12547 2995 -7564 -27673 -62466 -58702 -89758 -119194 -38626 -16063
14617 -16063 -26909 17664 43927 -22604 -25526 56370 44219 -22302 -1082 21857 -12887 -36732
14605 -36732 -14717 -26950 -30829 -62734 -49083 -73562 -85824 -93674 -61165 -52940 -60709 -44750
14593d4750M8897K7373J1162q1823m1328P7978L483L1429k3211k4932K3632k1223
14581a3313k9893O4761J8527L0974k6806m4937l3485l1585K7035M5047K4087K4559
14569E4971N7068l2161j1252Q87K913P280M993r399j5721l5105J5854r776L8416
14556F8968j5876l9497n081n5558K9099K9366J9658K876M9979k2091n8646P613
14544A0810m428O2962j0626k0228L7341K7013j7275l0685n1689J8940K1059o2622
14532a9428Q095k6634J5041N9258K6197J8776j8002K1000j2264n592J6348J065
14520H3860O8901K1025r80K9538o5297o6680l7155o8594k3473N0557M3664k2431
14508A2935j2233O4312P1005O0962P915P0505n2184k3636N7892L9589n2042m1095
$$ plain form
14593 -44750 4147 31520 42682 -39141 -80469 -2491 992 32421 9210 -15722 7910 -13313
14581 -13313 -43206 21555 40082 71056 44250 -687 -34172 -65757 -38722 6325 30412 54971
14569 54971 112039 79878 68626 69513 72426 79706 84699 75300 59579 24474 40328 30552 68968
14556 68968 53092 13595 8514 -47044 -17945 11421 31079 33955 83934 61843 3197 10810
14544 10810 6382 69344 58718 38490 75831 102844 85569 54884 3195 22135 43194 -19428
14532 -19428 -11333 -37967 -22926 36332 62529 81305 63303 84303 72039 66447 82795 83860
14520 83860 152761 173786 172806 202344 137047 70367 33212 -35382 -58855 -8298 35366 12935
14508 12935 702 65014 136019 196981 204896 275401 223217 199581 257473 297062 245020 203925
14496B03925l7494k4502J05444R6076J22054J55866J86296J76755K36255L56559
14486A577234M35578L97438L03473O0487j52621l84327m19582m24860l18116k28503
14476H46201k12856j17658k9263M686o0645l6529l7539q2998o7944J6003m0509
14465A80949j2804K2575L6190l5145L441j3211q0822q4155l1569M4021J9683j106
14453D8047N0558O1899N823k352r958J6136l8728n5159m3L6870m894n7843k4064
14440B6292n0484n9695L3390L8685M0492l0975k1233M0856P97l0550q522J5248
14428e699K2771l4917l3434j2307M8586k438J1918n958m1214K4148R0818J8245
14416H0519J8011M1523p2326p7344r656j9957P106M5298J2487q540m2104L5754
$$ plain form
14496 203925 166431 141929 247373 343449 465503 621369 807665 984420 1220675 1577234
14486 1577234 2012812 2410250 2713723 2774210 2621589 2237262 1817680 1392820 1074704 846201
14476 846201 633345 515687 486424 491110 430465 393936 356397 273399 205455 221458 180949
14465 180949 168145 190720 226910 191765 195206 181995 101173 17018 -14551 29470 49153 48047
14453 48047 98605 160504 166327 163975 154017 170153 131425 76266 76223 113093 108199 50356 26292
14440 26292 -24192 -83887 -50497 -11812 28680 -2295 -23528 17328 18125 -12425 -20947 -5699
14428 -5699 17072 -17845 -51279 -63586 -15000 -17438 -5520 -11478 -52692 -28544 62274 80519
14416 80519 98530 140053 67727 -9617 -19273 -39230 -32124 13174 25661 17121 -24983 10771
14404A0771J2211k7413K0288j4615J9394r964l7403m4608J4541K2624Q715L9149
14392A3690J5786n9418k1318N45m0036N7718l001K7841m0692j8351L8154M6373
14380A7291O3098l0884q866R060m305l768n484J0799O4927n657l9226R03n6209
14367A1679k6261L3833J4579o414N805k0857n81p4461r330K7554n7384O424R9057
14354C643K1460R604r576k6909p1554o8125Q521M5608O5479L1518L2142o267m7119
14341a1575k3508O743L3451L3066M560n3819L5093M4395J1167j2561J3026j9347
14329F0691k2275L5377k6619q1877o430O6479L0435j152J2617k8063r637l831
14317B5715k980l6379j3840j2734K3896j8585M9822J42016J07873L2858q075n9555
$$ plain form
14404 10771 22982 -4431 15857 1242 20636 10672 -26731 -71339 -56798 -34174 -25459 13690
14392 13690 29476 -29942 -51260 -50715 -90751 -33033 -36034 -8193 -48885 -67236 -29082 17291
14380 17291 80389 49505 40639 49699 45394 41626 36142 46941 111868 106211 66985 67888 11679
14367 11679 -14582 19251 33830 27416 33221 12364 11783 -62678 -72008 -44454 -101838 -95414 3643
14354 3643 25103 34707 25131 -1778 -73332 -141457 -132936 -87328 -21849 9669 41811 35544 -11575
14341 -11575 -35083 -28340 5111 38177 42737 -11082 24011 68406 79573 67012 80038 60691
14329 60691 38416 73793 47174 -34703 -41133 25346 55781 54629 67246 39183 29546 25715
14317 25715 22735 -13644 -27484 -40218 -16322 -34907 14915 156931 264804 297662 289587 230032
14305B30032o4685p921K0597J5462N5738L4252K5150L9017J2996N5495M6478Q6570
14293E49181K6208J4729k8090n9580l2446q260l1256J8657j8289l6260o989m6165
14281C41440j0489j6883R923j7200l5357N8286R6763l2166k5553m4441P7181N7656
14269D59160J6719M2726R0227J03153P1942J29469K05155K76386L06194K33694
14259A934825R0394J387p8061k04260k34618k84889j92548j09494r3215p4744
14249G54777q6845j41062r3464N073k5336l1321o598J242o4423o6295L684K9924
14237B79356K4939m1287l7238M7982l7248k5306m3978J4147P477J44n5716j6533
14225A16739J1993j7823j8169O1958J5391R7N2717j4306n7126q256j895n303O7542
$$ plain form
14305 230032 165347 157426 178023 193485 249223 283475 308625 347642 360638 416133 462611 549181
14293 549181 575389 590118 562028 502448 470002 461742 430486 449143 430854 394594 387605 341440
14281 341440 330951 314068 323991 306791 271434 329720 426483 394317 368764 324323 401504 459160
14269 459160 475879 518605 608832 711985 783927 913396 1118551 1394937 1701131 1934825
14259 1934825 2025219 2026606 1948545 1744285 1509667 1224778 1032230 922736 829521 754777
14249 754777 667932 526870 433406 438479 413143 381822 375224 376466 312043 245748 249432 279356
14237 279356 304295 263008 225770 273752 236504 211198 167220 181367 188844 188988 133272 116739
14225 116739 128732 110909 92740 154698 170089 170186 222903 208597 151471 143215 141320 136017 203559
14212B03559k7923j8285m4566j1280m3715L5826Q1147m975N1958k9666p4439m5748
14200G1893L7424O7436J3173m1334j00559r822j9446M3375r304J293m091o502
14188D3536L9996N7590O3575m8928l9164N0265l3530l3647l0540n4187P459j6050
14176F375N17K7507P8444j1828k0269L126K8393J4409N5845Q1380Q5121O5496
14164D14516L1793J1457m7404n595M1281J1272n106l1637l5546p377l5876m1050
14152C00728k2501N3669J7859q953M5942j6313J7310L0094P1578J2769N615L1280
14140E39077M3852O6244K1385K26799J37693L8128j8589j0242j27588j74422j23758
14129F18579j00328k7040N8026J8790m8894k3769r087J2293K5758k1433J9224
$$ plain form
14212 203559 175636 157351 112785 101505 57790 93616 174763 169788 221746 192080 117641 71893
14200 71893 109317 176753 189926 148592 48033 38211 18765 62140 52836 54129 50038 43536
14188 43536 83532 141122 204697 155769 116605 166870 133340 99693 69153 14966 22425 6375
14176 6375 6892 34399 112843 101015 80746 83872 112265 126674 182519 263899 349020 414516
14164 414516 446309 457766 410362 404767 446048 457320 452214 420577 385031 377654 341778 300728
14152 300728 278227 331896 349755 340802 386744 370431 387741 417835 489413 502182 507797 539077
14140 539077 582929 649173 670558 897357 1035050 1073178 1054589 1044347 916759 742337 618579
14129 618579 518251 491211 549237 568027 519133 495364 486277 498570 524328 502895 522119
14118E22119P8179l2993o8965J3674K8473o9818p2096M2395O1144J8365J1149
14107E31626j852L8671m427j7257q828j7903P1800Q6868j97K7831m7707o8611
14095E90014L3711R7832J05519m1644J160k940J5597l1481l675M3382N4320P9808
14083I41603M9610O5845N6623P3774P5282l52R546r302j1416N8014J9986k4788
14071A304425m1034L1925R3600J23169J4372Q3323L2209K9476J16308J02124J20656
14060B010553O2552N970J7857O9260Q8157N9746R1677J02017R1754J68291J08329
14049B876163J75343J73625J68103J79883J73066K06471K72787L11950K50388
14040D787779L22056M23334N41598N55484M40732N95398P12117P62182R30461
$$ plain form
14118 522119 600298 567305 498340 512014 540487 470669 398573 440968 502112 520477 531626
14107 531626 529774 568445 564018 546761 537933 520030 591830 678698 678501 706332 658625 590014
14095 590014 623725 721557 827076 785432 786592 783652 799249 767768 764093 807475 861795 941603
14083 941603 991213 1057058 1113681 1187455 1262737 1262385 1271931 1262629 1251213 1309227 1329213 1304425
14071 1304425 1263391 1295316 1388916 1512085 1526457 1609780 1641989 1671465 1787773 1889897 2010553
14060 2010553 2073105 2079075 2096932 2166192 2254349 2314095 2405772 2507789 2599543 2767834 2876163
14049 2876163 3051506 3225131 3393234 3573117 3746183 3952654 4225441 4537391 4787779
14040 4787779 5109835 5533169 6074767 6630251 7070983 7666381 8378498 9140680 10071141
14031A0071141J146377J325824J626297J941930K174311K471321K829679L003179
14023B6590059L264265L667981M320984N206077O420343Q201040J0970188J5076180
14015H3717117K1518325L1167097M4726831O1670210P9069705R0449489Q3267641
14008D95586415M8821230l881160n5399545q6624814r0934967p7095595n7027766
14001A73443798l9418323k6874577j8571484j3177820r429280o952400n490226
13994E3529688m692423m174831l802352l494311l170413k942019k665748k353065
13986B6234526k022433j805745j583555j422080j174328j021193r60980q81881
13978A5362331q04035o83216o58008n75582n05133m87290n06331n20145m70986
$$ plain form
14031 10071141 11217518 12543342 14169639 16111569 18285880 20757201 23586880 26590059
14023 26590059 29854324 33522305 37843289 43049366 49469709 57670749 68640937 83717117
14015 83717117 105235442 136402539 181129370 242799580 321869285 412318774 495586415
14008 495586415 544407645 540526485 485126940 398502126 307567159 230471564 173443798
14001 173443798 134025475 107150898 88579414 75401594 65972314 59019914 53529688
13994 53529688 48837265 44662434 40860082 37365771 34195358 31253339 28587591 26234526
13986 26234526 24212093 22406348 20822793 19400713 18226385 17205192 16244212 15362331
13978 15362331 14558296 13875080 13217072 12641490 12136357 11649067 11142736 10622591 10151605
13969A0151605l73292l65418l57473l27085k67724k90987k82385l01145k97208
13960G288888k37957k99513k97399k47937j94092j86742k53410k27155j66298
13951E178385q9680j46615k13636j73555j36658r9428j42862j56273j29605j08648
13941C781425j67019j47364j25990j55215j17152j22130m0564r69n0561k6134
13931B828327j2481m1074m4897p3430r9119o5817q6187n9006q6583o9598j8024
13920B172111n9486n9725n7660n3291k2501l8282o198J9534l7853p4000o3575
13909A719074q0182N507m568q5756l0578J2895N329k087p0098q1077k3491R367
13897A374335j2788j3653p1989m231k4734r553j5765j2238k9574q614P3638Q1759
$$ plain form
13969 10151605 9778313 9412895 9055422 8728337 8460613 8169626 7887241 7586096 7288888
13960 7288888 7050931 6751418 6454019 6206082 6011990 5825248 5571838 5344683 5178385
13951 5178385 5088705 4942090 4728454 4554899 4418241 4318813 4175951 4019678 3890073 3781425
13941 3781425 3614406 3467042 3341052 3185837 3068685 2946555 2905991 2905022 2854461 2828327
13931 2828327 2815846 2774772 2729875 2656445 2557326 2491509 2405322 2346316 2259733 2190135 2172111
13920 2172111 2112625 2052900 1995240 1941949 1919448 1881166 1874968 1894502 1856649 1782649 1719074
13909 1719074 1638892 1644399 1639831 1554075 1523497 1536392 1541721 1539634 1469536 1388459 1364968 1374335
13897 1374335 1361547 1347894 1275905 1271674 1246940 1237387 1221622 1209384 1179810 1171196 1244834 1326593
13885A326593L1680k8159L6730K7519o5461Q641M1332J5407l3239p6294j18772
13874A165977j34455p4707l5985M6813j4604m2492J8316k9628j7843j18573n3314
13863G09505O0705K3332L3322J6438m4329j8377J1048k1184L874j0470l9135l2004
13851F92725Q77J2646j9279l7656J7682L4765m2106k1030K3644m7621j3121K7562
13839F29088m48L8693m3386K3616l8219o4952j2888K0356l0531L6939L8430J5119
13827F11817k8261L6578N022Q693O6406K3217j2053J1064O5115N2206O3057K1772
13815I24633j0725j1226n2524r4691r0276l5117p7526o9357j1468p9793K7442
13804D19372P2318j5010m798j7127m3174J4533j0893O561m0783M759m7769m3882
$$ plain form
13885 1326593 1358273 1330114 1366844 1394363 1328902 1337543 1378875 1394282 1361043 1284749 1165977
13874 1165977 1031522 956815 920830 967643 953039 910547 928863 899235 881392 762819 709505
13863 709505 770210 793542 826864 843302 798973 780596 791644 770460 774334 763864 724729 692725
13851 692725 693602 706248 686969 649313 666995 701760 659654 638624 662268 614647 601526 629088
13839 629088 628640 667333 623947 647563 609344 544392 531504 551860 521329 558268 596698 611817
13827 611817 583556 620134 625156 633849 700255 723472 711419 722483 787598 839804 902861 924633
13815 924633 913908 902682 850158 755467 665191 630074 552548 483191 471723 391930 419372
13804 419372 491690 476680 471882 454755 411581 426114 415221 421782 380999 385758 337989 294107
13792B94107N7795M3161k3502m5383M822J778O563K610p025j5670K5922n0330
13780B94848Q402l9444k7735N011O6398k7730k0660l1351m1613L2916j3745J8882
13768B24179l5795l6975L9143P2977K7501n2003N150J16J7862J769j4782R864
13756B59006j3242j2923k02l2300m5414j3269q10K2741K6906j3377n1264R657
13744A35509M2264k3065K908M5671J8612m0541O573K4149m759l1882n7386k879
13732A15174J20076M4054o2755j26817k5797K4687M7218j2851j8654L33J6234
13721A20902R6919M3660j8116p2749n4921m790n7941j1621M6551P2048k3015j9371
13709A17556k7167M81j238j7105K1185J9794J0246P0265N3360j3531j2277r327
$$ plain form
13792 294107 351902 395063 371561 326178 331000 332778 339341 341951 334926 319256 345178 294848
13780 294848 303250 263806 236071 241082 307480 279750 259090 227739 186126 219042 205297 224179
13768 224179 188384 151409 190552 263529 291030 239027 244177 244293 262155 263924 249142 259006
13756 259006 245764 232841 232639 200339 154925 141656 140846 163587 190493 177116 125852 135509
13744 135509 177773 154708 157616 203287 221899 181358 187931 212080 207321 175439 118053 115174
13732 115174 235250 279304 216549 89732 63935 88622 135840 122989 104335 104668 120902
13721 120902 217821 261481 243365 170616 115695 110905 52964 41343 87894 159942 136927 117556
13709 117556 90389 90870 89632 72527 93712 113506 123752 194017 247377 233846 221569 212242
13697B12242O319q3679l9071N5193L80l8307M4755n4328n2639j185k8409J370
13685B2641K3681M6121M0993k7169k6594L3151J9499j0723O1698L7625L6907l8142
13673B19688O116j1257k6179J0832q3085l6775J8598j8284J6656M0278K2145J2518
13661A71251l1435o9231o9031j0572M6728P8075M3286m6579M760J4188N0463q399
13649A73504j923j3465k420q0956l2885O8514M6328j4094j8284J9002l3270m7873
13637F2178N9062J0232p3161J9285j4360J2864O7777J2308j3127j3509l7123J5155
13625A07581J1669p825K35o088j0658m056k9806j8314m3695N5201K5720q990N2153
13612A23127l8350o5675p266J0894O6490j1949M4110O8068n1573o6492o9291J0191
$$ plain form
13697 212242 218561 134882 95811 151004 151384 113077 157832 103504 50865 49680 21271 22641
13685 22641 46322 92443 133436 106267 79673 112824 132323 121600 183298 220923 257830 219688
13673 219688 225804 214547 188368 199200 116115 79340 97938 79654 96310 136588 158733 171251
13661 171251 139816 70585 1554 -9018 37710 115785 159071 112492 117252 131440 181903 173504
13649 173504 171581 158116 155696 74740 41855 110369 156697 142603 124319 143321 110051 62178
13637 62178 121240 131472 58311 77596 63236 76100 143877 156185 143058 129549 92426 107581
13625 107581 119250 111425 111660 105572 94914 90858 61052 42738 -957 54244 79964 70974 123127
13612 123127 84777 19102 11836 22730 89220 77271 121381 189449 137876 71384 2093 12284
13600A2284N9219o869q148J8323J7237K9554j9059J2153K1679l2487m077j9147
13588H0662K5463J05328O855l1389L0168p1473o0826Q5338M2728j4560o0852k6355
13576A11087o5342j433K8252L8074m2680L8326r489K1406Q121M805l4401K465
13564I9191k2255Q5416L9315m6251o1070r154n375O846O0631M9294m7324k3165
13552A26099m4885J7187K6467P1132N5630m4373o8092j4819J2208N249j7012J5439
13540A40230K6509K3280m37P0075L8744N0667J5198O2664J40582J97713K86342
13529A051567L27792L59725M36794L31249K73275k9719l00160m16235m17895l47103
13519A269290k51463j96847j40354k9124l6479j08133r8102p5986n3139l3961
$$ plain form
13600 12284 71503 64634 56486 74809 92046 121600 102541 114694 136373 103886 99809 80662
13588 80662 106125 211453 218308 186919 217087 145614 84788 170126 212854 198294 137442 111087
13576 111087 45745 44312 72564 110638 67958 106284 96795 118201 126322 131127 96726 99191
13564 99191 76936 162352 201667 155416 94346 85192 79817 86663 147294 196588 149264 126099
13552 126099 81214 98401 124868 196000 251630 207257 139165 124346 136554 141803 124791 140230
13540 140230 166739 190019 189582 259657 298401 349068 364266 426930 567512 765225 1051567
13529 1051567 1379359 1739084 2175878 2507127 2780402 2750683 2450523 2034288 1616393 1269290
13519 1269290 1017827 820980 680626 651502 615023 506890 408788 332802 279663 245702
13509B45702l4503P76k9378m0452J1441J5181k5918j4596O6727K9714N197J267
13497B31158K1338l0846o2914p2883K7362M1884K0365m4814n8584k0845P549L3998
13485I2768N8981K3298m0794m8560l0774j2739l6333J0599P5635M4330L063M597
13473A44071J3563j0577m0882k2604l5073K7197Q6428p6756m2815O9127p7819
13462C3860J6682N6123L0892J0691L067l3883l2129O938N3117j2255j1442K4667
13450A46328O7026N417l1889R142L884J8366k715k0712m3810k731J29L742o2318
13437H9859m8883j490O9182j149k7802J5397J4997j8752M6638j3627o0094P393
13425G1669K1261j5715j1957O237q931M774M9572K2377J0726L8034l9594p1552
$$ plain form
13509 245702 211199 211975 182597 142145 153586 168767 142849 128253 194980 224694 229891 231158
13497 231158 252496 221650 158736 85853 113215 155099 175464 130650 72066 51221 58770 92768
13485 92768 151749 175047 134253 85693 54919 42180 5847 16446 92081 136411 139474 144071
13473 144071 157634 147057 106175 83571 48498 75695 162123 85367 42552 111679 33860
13462 33860 50542 106665 137557 148248 151315 117432 85303 92241 145358 133103 121661 146328
13450 146328 213354 218771 186882 196024 199908 218274 215559 194847 151037 148306 148435 152177 89859
13437 89859 40976 39486 108668 107519 79717 95114 110111 91359 137997 124370 64276 71669
13425 71669 92930 77215 65258 71495 62564 67338 116910 139287 150013 188047 148453 76901
13413G6901j13640K2172J2326L159n2443k6347R9282M2901m0944J6971N044l1502
13401A3880N114O0932L0400n4398o1112j3040K4235J8020K4807J2482n0297k3300
13389a2277m4577N318K0061j128J2639r311J2567Q019l923J0677o806K3065l9182
13376b4858L1850M5623k1903p7857n810M105m049J7266N9822J8926J7949K3119
13364H4183J6106o654m3436L135M5254m6287l2361j8913o2817l1714O632M7459
13352c9413R0019O1033m2480l4097r543L007O4996k753k5041j5004l1511K220
13340B1433J4958J5330o9333K6623J6394L0457r720p3320p8598M1644q596p385
13328h0113N6321r489K8645N376J7681r102N3413L5438n9435n5030n3636J2537
$$ plain form
13413 76901 -36739 -14567 -2241 918 -51525 -77872 21410 64311 23367 40338 45382 13880
13401 13880 18994 79926 110326 55928 -5184 -18224 6011 24031 48838 61320 11023 -12277
13389 -12277 -56854 -51536 -31475 -32603 -19964 -29275 -16708 -8689 -12612 -1935 -8741 14324 -24858
13376 -24858 6992 52615 30712 -47145 -52955 -48850 -52899 -35633 24189 43115 61064 84183
13364 84183 100289 93635 50199 53334 98588 52301 19940 1027 -61790 -93504 -86872 -39413
13352 -39413 50606 111639 69159 35062 25519 28526 93522 90769 65728 50724 19213 21433
13340 21433 36391 51721 -17612 9011 25405 55862 46142 -27178 -105776 -64132 -72728 -80113
13328 -80113 -23792 -33281 -4636 740 18421 9319 62732 98170 38735 -16295 -69931 -57394
13316e7394L4390J7885l3884j4050m002L8983m1060r822N0357k525M2455L2203
13304E3536L0454J0284n371n2845P598M3096q878k1788k8310L7685K7108l7270
13292E5299m1252k0523k9266R897K3890j2781J4765k4295p749N8837M2966K6176
13280I5964k4970n5871k182L7951q090N158M0914q180K2330M8043L1392o4095
13268A18364q7922p1768r51o404k7431J1270Q9479P6494o652j3826Q707Q7114
13256A76474J2189k3574j2158J624k6109Q94o6590p8777l1275r915M4075K2753
13244I611M5752L1070n9610m37N5389K2899k7594o3341n768j594j5072O6367j5340
13231D2332l1105K5640j6028l1766J0241M4867O8222m6523k1332L2571o0220n9695
$$ plain form
13316 -57394 -23004 -5119 -39003 -53053 -57055 -18072 -59132 -68954 -18597 -21122 21333 53536
13304 53536 83990 94274 88903 36058 43656 86752 77874 56086 27776 65461 92569 55299
13292 55299 14047 -6476 -35742 -25845 -1955 -14736 29 -24266 -32015 26822 69788 95964
13280 95964 70994 15123 12941 50892 42802 47960 88874 80694 103024 151067 182459 118364
13268 118364 30442 -41326 -42277 -48681 -76112 -64842 24637 101131 94479 80653 89360 176474
13256 176474 188663 165089 152931 154555 128446 129340 62750 -16027 -47302 -57217 -13142 9611
13244 9611 55363 86433 26823 26386 81775 104674 77080 13739 7971 6377 -8695 57672 42332
13231 42332 11227 36867 20839 -10927 -686 44181 112403 65880 44548 77119 16899 -42796
13219d2796M4915O0096M09m4010q494L8652m7004Q348J02Q072K8252K5907O0346
13206A32795k5999n8912M3730K5066k5373k1245J5106m4581n3865n2200k1394
13195h6872M5438J8693J46N908L9604J5628L924J357L6961j227J2140J9843k8559
13182H2984m2180J2880k4981M303k4346M8076j1362j7085k123O585m7456l9762
13170e4467k8989P2681P6990o5677o2389M2240J3173M5938O097k3197L3489q442
13158D7447L0302N2111L0535j2258n7693m0856K2928l4674N686k7962m9701k6139
13146f0274J5949K8158N4404L4462o285L228l749Q969O718l9516J5087l935J2289
13133F5505N95m875o4665l8549l6172J688K3013m716k723N5248K8690n780j2203
$$ plain form
13219 -42796 2119 62215 62624 18614 10120 48772 1768 10116 10218 18290 46542 72449 132795
13206 132795 106796 47884 91614 116680 91307 70062 85168 40587 -13278 -65478 -86872
13195 -86872 -41434 -22741 -22595 -16687 22917 38545 42469 43826 80787 79560 91700 111543 82984
13182 82984 40804 53684 28703 33006 8660 56736 45374 28289 26166 32751 -14705 -54467
13170 -54467 -83456 -10775 66215 538 -61851 -19611 -6438 39500 45597 22400 55889 47447
13158 47447 77749 129860 160395 148137 90444 49588 72516 37842 43528 15566 -34135 -60274
13146 -60274 -44325 -16167 38237 72699 66414 69642 65893 74862 81580 42064 57151 53216 65505
13133 65505 66100 61225 -3440 -41989 -78161 -76473 -53460 -58176 -60899 -5651 23039 17259 5056
13120E056l3274j1916k0893n836k2572K9349N0200M2581K9838j7695k9522m2753
13108b7437J5639J8339P561k6617M115M2810J4410R156j168m9364n880M2347k7270
13095A6641l2607l6385J7458l137Q874Q662m1726O643M0144M5194L4298k2432
13083D1627k9850j830K7952j9125M088P403J3146l410L612k305l6378K5849q342
13070B2437K9625K4334j2153o2410m6538K0911l3693J4510K9526M338k7508m1969
13058g8590J9013N1994L3680j6396j3179K9049R620l7307N1577L345q0799m1355
13046f9348N227K5425L9646O8808j0632l5541m2121q094K5549M524N1632O6945
13034A22020K637m5330j7572l8669M917L1797p2940j1622J07650P0519l3089l8520
$$ plain form
13120 5056 -28218 -40134 -61027 -66863 -89435 -60086 -9886 32695 62533 44838 15316 -27437
13108 -27437 -11798 6541 14102 -12515 -8400 34410 48820 57976 56808 7444 1564 43911 16641
13095 16641 -15966 -52351 -34893 -38030 -29156 -20494 -62220 -55577 -15433 29761 64059 41627
13083 41627 11777 9947 37899 18774 22862 30265 43411 40001 43613 41308 4930 30779 22437
13070 22437 52062 76396 64243 1833 -44705 -23794 -57487 -42977 -13451 -9113 -36621 -78590
13058 -78590 -59577 -7583 26097 9701 -3478 25571 35191 -2116 49461 52806 -27993 -69348
13046 -69348 -64121 -38696 950 69758 59126 23585 -18536 -26630 -1081 3443 55075 122020
13034 122020 124657 79327 61755 23086 28003 59800 -13140 -24762 82888 153407 120318 81798
13022H1798m3803j0687K7881K7751N6801j8163o1242j2469R258J0382k1413M863
13010E0957q877K6796r539J4827K4829p2041n9872M818P4660j361l0002m643N169
12997A5721n4988J1380J8468K2198N2955r988q4488L816O4243P2009m5088m4432
12985B1806j5578K5344K7273j6610K5680k467o7877q937J1251L0475N5391O162
12973I1913l5003o881o6767k5861m4568J3957K2256O3664M0845K5114P907L1673
12961A18249m6796o3032m8215n868L5628Q1464J6796j5317k5138K2844p5421m2794
12949d7600P1801N5268k2488n5584j8513j061O0824j1711l7629l2493m588M2082
12937a692J7057J8234J999J5138J4961j6828j992M2158j3283K407r4494j11656
$$ plain form
13022 81798 37995 27308 55189 82940 139741 121578 60336 47867 57125 67507 46094 50957
13010 50957 42080 68876 59337 74164 98993 26952 -32920 -28102 46558 45197 15195 10552 15721
12997 15721 -39267 -27887 -9419 12779 65734 55746 -28742 -24926 39317 111326 66238 21806
12985 21806 6228 31572 58845 42235 67915 65448 -2429 -11366 -115 30360 85751 91913
12973 91913 56910 50029 -16738 -42599 -87167 -73210 -50954 12710 53555 78669 86576 118249
12961 118249 71453 8421 -39794 -45662 -10034 71430 88226 72909 47771 70615 -4806 -47600
12949 -47600 24201 79469 56981 1397 -17116 -18177 42647 30936 -6693 -39186 -43774 -1692
12937 -1692 15365 33599 35598 50736 65697 48869 46877 89035 75752 78159 -16335 -127991
12925a27991L7587O9746N2164O080j3838M4577n6747o28j3172l7380J3886L2253
12913F537J7753L4602M1880j0577m1670l0709J5355j6739o5009j4437R970m03
12901e3447J7192K7352K9880l9288q198N0642j0235l7099K9063m068j4999P091
12889f114k8797o931L9855q281o1334k1310P1773P477K1836Q79k0852q0548J737
12876i0610P0350L0510N2884N9715j854o9822n386m5463l1404J514k5141o534
12864f1241O322M646l5528j1961k8773L7871N3837O6629K20j2798K5070L8879
12852H3173K5021k8950j25905l3314K2487J4542M762q208k3983l0566L6572Q1113
12840A6744P6829n4760j06043l8703P792J4097M3145K5870M8884k0768m3493P161
$$ plain form
12925 -127991 -90404 -20658 31506 37586 23748 68325 11578 10950 -2222 -39602 -25716 6537
12913 6537 24290 58892 100772 90195 48525 17816 33171 16432 -48577 -63014 -53044 -53447
12901 -53447 -36255 -8903 20977 -18311 -26509 24133 13898 -23201 5862 1794 -13205 -6114
12889 -6114 -34911 -41842 -1987 -10268 -71602 -92912 -21139 -13662 8174 9053 -11799 -92347 -90610
12876 -90610 -20260 10250 63134 122849 120995 51173 45787 324 -31080 -29566 -54707 -61241
12864 -61241 -54919 -50273 -85801 -97762 -126535 -88664 -34827 31802 32022 19224 44294 83173
12852 83173 108194 79244 -46661 -79975 -57488 -42946 -38184 -46392 -70375 -100941 -64369 16744
12840 16744 93573 38813 -67230 -105933 -98141 -84044 -40899 -15029 33855 13087 -30406 -23245
12828b3245N095J6364m1991j433N6826M7602K5058j30974o5988K1800M3740M0567
12816f579j8638m7178j7252N1843N3989L5321j2780l4411M0002j9320l8631J2676
12804i58n7359r762R554J5173o593l2558p540l6956o079K9630N9125j7761P675
12791e4409M8683K8533k6798k9743k0481N4034K4388j1132k4613M0585J0643K0044
12779E9734J7173j3575m0699m9646J2687L0957o4127m2613L2591K0283J6387N6463
12767C5615j0516J1676K4302L432N452l1787J610j869l9233q231J13348p653q9936
12754F210j5827J261j071j9659l3809O8985Q176o9012j7839o184j3952P148M6701
12741c8872K3808k835R511Q676M1954J9716o5021l0995n868m3300L9095N2305
$$ plain form
12828 -23245 -18150 -1786 -43777 -45210 11616 59218 84276 -46698 -112686 -90886 -47146 -6579
12816 -6579 -25217 -72395 -89647 -37804 16185 51506 38726 4315 44317 24997 -13634 -958
12804 -958 -58317 -68079 -58525 -43352 -49945 -82503 -90043 -126999 -133078 -103448 -44323 -62084 -54409
12791 -54409 -5726 22807 -3991 -33734 -54215 -181 24207 13075 -11538 29047 39690 59734
12779 59734 76907 63332 22633 -27013 -14326 16631 -47496 -90109 -57518 -37235 -20848 35615
12767 35615 25099 36775 61077 64509 69961 38174 39784 37915 -1318 -9549 103799 96146 6210
12754 6210 -9617 -8356 -9427 -29086 -62895 6090 14266 -54746 -72585 -78769 -92721 -85573 -38872
12741 -38872 -15064 -17899 -8388 288 42242 61958 -3063 -34058 -39926 -83226 -44131 8174
12729H174q137k0820J80k244K3849L271N7043P0193L0762p551j1526k6995k9986
12716H6213l2338J5672l7769l0425P195m5518J0808j1124m4047j978M14j9844
12704a02741l0208P116L4170M4019J8250L5328L8311N82n9441l7259N2676l6761
12692c5958k5601j7491L5713j518P3523J8535n248l2394L388R922l2133m2201
12680e1463L7747M0255j084k1542J1203P224N6023P56n7865j6891k8089o651n4160
12667h4537l5168Q0466J5045l7642j7339L8990M2299q806K1506M1913R491K9868
12655I6086l9539p6533P974N3698N7024n4657o7725p760k7917j1713M0768j5335
12643d5629K1093k13k046R769M6541O499j5545J5892l123o1264l8484p611r055
$$ plain form
12729 8174 37 -20783 -20603 -22847 1002 4273 61316 131509 162271 154720 143194 116199 86213
12716 86213 53875 69547 31778 1353 8548 -36970 -26162 -37286 -81333 -83311 -82897 -102741
12704 -102741 -132949 -125833 -91663 -47644 -29394 5934 44245 44827 -14614 -51873 803 -35958
12692 -35958 -61559 -79050 -43337 -44855 28668 47203 41955 9561 12949 22871 -9262 -51463
12680 -51463 -13716 26539 25455 3913 15116 22340 78363 79119 21254 4363 -23726 -30377 -84537
12667 -84537 -119705 -39239 -24194 -61836 -79175 -40185 2114 -6692 14814 56727 66218 96086
12655 96086 56547 -19986 -12012 41686 98710 44053 -23672 -31432 -59349 -71062 -30294 -45629
12643 -45629 -24536 -24749 -26795 -17026 29515 36014 20469 36361 33238 -28026 -66510 -74121 -83176
12630h3176J844k362L7423K9619M1492p157j8570L7489N2721k7685P178n484m6738
12617A6594L7250N289p8294l0344p667k1139P1419k5448l7999j6608m4830l435
12605a35212Q4121P5041k928m769M027o2007R067l745L2119J1418L4645K1010
12593F2787k9694k7833m6645K6777N2725n61n3925j2620J5781j1444J7738L6475
12581B9561K9555K2831n9745j38393l9178N3485M1692R754J8665j1686l1848j4658
12569h9965N063J9804o002K0224L928k2237K4041O1013O206j7767n4587j6188
12557f6467L9360N1792l510K0703K2181k625o7892J3202M7857j0737o0454J9352
12545B762M1724l8561L483L5783O1628M9527n2373m3894l49m0105k0333N3254
$$ plain form
12630 -83176 -81332 -83694 -46271 -16652 24840 17683 -887 36602 89323 61638 68816 63332 16594
12617 16594 53844 59133 -19161 -49505 -57172 -78311 -6892 -32340 -70339 -86947 -131777 -135212
12605 -135212 -51091 23950 21022 16253 20280 -41727 -32660 -36405 -4286 7132 41777 62787
12593 62787 33093 5260 -41385 -14608 38117 37556 -16369 -28989 -13208 -24652 -6914 29561
12581 29561 59116 81947 22202 -116191 -155369 -101884 -60192 -50438 -31773 -43459 -75307 -89965
12569 -89965 -84902 -65098 -71100 -50876 -46948 -69185 -45144 15869 22075 4308 -50279 -66467
12557 -66467 -27107 24685 21175 41878 64059 61434 -6458 6744 54601 43864 -16590 2762
12545 2762 44486 5925 9408 45191 106819 156346 103973 60079 59730 19625 -708 52546
12533E2546L7949K197q6505m3235O358L1543N7402m0053k7756n756k070J4786
12521b594K995m0792P376J5833K9292P3412J2871K4651J2203K062M8746l6164
12509A49891q2057P184J4455L4362k5529p63J1151q7513j3206n9481o798J9779
12497c8525J7074m1642j5111N051M7296m8551l2358L8332O296n8542k148R4922
12485b7906N8380K5702J4077j3737k8079N0877K0625n5928j2698Q5168m407l7979
12473G4095j938R648k6231o7080o0j0682O571k201j3880j3029j5299j3076j1140
12460h4302Q8573r953K335N9893j3309n4794Q055J24877l3967M441K1626r5338
12448A8137o2949L9392n605o330Q76l2864J2426P9283K7530L870k9224j1180j6279
$$ plain form
12533 52546 90495 92692 6187 -37048 -30690 853 58255 18202 -9554 -15310 -17380 -2594
12521 -2594 401 -40391 -33015 -17182 12110 85522 98393 123044 135247 137309 186055 149891
12509 149891 67834 75018 89473 123835 98306 97543 108694 21181 7975 -51506 -58304 -38525
12497 -38525 -21451 -63093 -78204 -73153 -25857 -74408 -106766 -68434 -62138 -120680 -122828 -27906
12485 -27906 30474 56176 70253 56516 28437 79314 99939 44011 31313 116481 112074 74095
12473 74095 72157 81805 55574 -11506 -11566 -22248 -15677 -17878 -31758 -44787 -60086 -73162 -84302
12460 -84302 4271 -5682 -3347 56546 43237 -11557 -3502 121375 87408 91849 113475 18137
12448 18137 -44812 -5420 -11025 -17355 -16479 -49343 -36917 42366 69896 73766 44542 33362 17083
12435A7083J7432R098k1898J9657J0412q871J9917N5990N1669k7128n6632n8216
12423B8513m3495p908q984O882m751j0341O018L0545l8370r9954N2715O0852p0
12410b8348J7973K7604J922L7097P529r5928p538j9729K0173J749J8440j247r2447
12397a12750P919J9200p587K9988Q9826K2180o236j3933p745q4383l8087M6415
12385e5193n224k9105M1488L7221N5129O8037m144n7171l2201N520k6844j1896
12373a4383r311L695K3806j6571J3821m509l6212J9953l1243m1212o789Q2110
12361a6845L2311M2705K8880m108l3036n354N9866k600k7151o7011o7952N3360
12349f935J1638k1871J0265M6859k3461m3248n2756j9862L0815N1990K8897m3835
$$ plain form
12435 17083 34515 43613 21715 41372 51784 42913 62830 118820 170489 143361 86729 28513
12423 28513 -14982 -22890 -31874 -24992 -29743 -40084 -34066 -3521 -41891 -141845 -89130 -28278 -28348
12410 -28348 -10375 17229 19151 56248 63777 -32151 -39689 -59418 -39245 -37496 -19056 -20303 -112750
12397 -112750 -104831 -85631 -93218 -63230 26596 48776 42540 28607 20862 -63521 -101608 -55193
12385 -55193 -60417 -89522 -48034 -10813 44316 112353 108209 51038 18837 24357 -2487 -14383
12373 -14383 -23694 -19999 3807 -12764 1057 -3452 -39664 -19711 -50954 -92166 -98955 -16845
12361 -16845 15466 58171 87051 82943 49907 44553 104419 101819 74668 7657 -60295 -6935
12349 -6935 4703 -17168 -6903 39956 16495 -26753 -79509 -99371 -68556 -16566 12331 -31504
12337c1504J3210K8303n7539M317J0909M3702Q4620M3307J6117p201l2048j4555
12325A01638K1764l6942l1716M217M8254M2779k0601j08821j11089l5291m2454
12314a68262L1509L6491N7549M3307o9879k8415P814l8975P796J7486J9157O3639
12302b0783O8085k4430o3935n6482j2610j8581L9559O8446L5895M0699l1429j6672
12290G762M349K1291N235l2815J4163L0514r0486R693J8391m7743J5913K6322
12278a7411K0208J1316J6011J6417l7150k5923J8092P102o8421q5290M2209J14054
12266A1214L4211j3354l2072p9754l9764M8670j2749m275j1188K9717K6542n1885
12254i4687M422P2264L3986o832m5259P913R8325P0718m6722m6313m5238R485
$$ plain form
12337 -31504 -18294 10009 -47530 -43213 -32304 11398 96018 139325 155442 148241 116193 101638
12325 101638 123402 86460 54744 58961 107215 149994 129393 20572 -90517 -125808 -168262
12314 -168262 -136753 -100262 -42713 594 -69285 -97700 -89886 -128861 -121065 -103579 -84422 -20783
12302 -20783 47302 22872 -41063 -97545 -110155 -128736 -89177 -20731 15164 55863 24434 7762
12290 7762 12111 33402 38637 5822 19985 50499 -39987 -30294 -11903 -59646 -43733 -17411
12278 -17411 2797 14113 30124 46541 9391 -16532 1560 8662 -59759 -145049 -102840 11214
12266 11214 45425 32071 -1 -79755 -119519 -70849 -83598 -87873 -99061 -69344 -42802 -94687
12254 -94687 -90265 -18001 15985 9153 -36106 -28193 70132 140850 94128 47815 2577 12062
12242A2062j2436q3575o9308K4631n823M4989N1314n6038m0652M5868k3929l2217
12230a45114l492M7274K6568N2970J0519K8168L433j9650L2890L391j0086j1429
12218A5442k0944l27o1524l9984M1160J6582n0035j0961L5991L0971j5931N527
12206e4033M7913k2134M7810k0673J7601J2279J7435L12N3691o1116j8134K4326
12194D5277N1595K9689k8613k7136j3767l3144q2356K9065n083l869M1524M578
12182G760j397M8007K9043n8978m5312L2310j3228k3302K4213o510K7855J6290
12170C6751n625m4196J1220J4387k1187j0930L8190k4743K0194q0856k6608K5111
12158f8292K8244M620J11645N4559k3021m1819p7664m368j748M3484l8683k410
$$ plain form
12242 12062 -374 -83949 -153257 -128626 -134449 -89460 -38146 -94184 -134836 -88968 -112897 -145114
12230 -145114 -148606 -101332 -74764 -21794 -11275 16893 20326 676 33566 36957 26871 15442
12218 15442 -5502 -5829 -67353 -107337 -66177 -49595 -99630 -110591 -74600 -43629 -59560 -54033
12206 -54033 -6120 -28254 19556 -1117 16484 28763 46198 46510 100201 39085 20951 45277
12194 45277 96872 126561 97948 70812 57045 23901 -58455 -29390 -34473 -38342 3182 7760
12182 7760 6363 54370 83413 24435 -20877 11433 -1795 -25097 -884 -7394 20461 36751
12170 36751 31126 -13070 -1850 12537 -8650 -19580 18610 -6133 14061 -66795 -93403 -68292
12158 -68292 -40048 -35428 76217 130776 107755 65936 -11728 -16096 -17844 25640 -13043 -15453
12146a5453J6748N3545N0709l7273k9610K9712j1309p2851l4642L6792K6852J5827
12134B9047j1474l5093n302r63q979r637j2748J3715Q557J290M5601N9015k2552
12121E0477p943k1881l6409O767l5567O852J3421K4265r596k7658J5249k6202
12109d8225O0921L5910K6442p848l1070J0803M2566L3410J649n1132o9737o493
12097b804k4915l5292j9135m7407o9989J9796M9369O4705J0201L5334J0380j0526
12085b0283l8547K003L4028N2177K7943k9384m1071j6118N5484j3929R420n895
12073A5828m0328l4171J6605K2874L2886L7409K1900k1932r522m1734k2947k37
12061b3369k0924k2913Q564P5990J8690l5139K7510K3522k4065O283k8317q0645
$$ plain form
12146 -15453 1295 54840 105549 68276 38666 68378 57069 -15782 -50424 -13632 13220 29047
12134 29047 17573 -17520 -22822 -23785 -32764 -42401 -55149 -41434 -32877 -31587 14014 73029 50477
12121 50477 42534 20653 -15756 -8989 -44556 -37704 -24283 -18 -9614 -37272 -22023 -48225
12109 -48225 12696 48606 75048 67200 36130 46933 89499 122909 124558 73426 3689 -2804
12097 -2804 -27719 -63011 -82146 -129553 -199542 -179746 -130377 -65672 -55471 -20137 -9757 -20283
12085 -20283 -58830 -56827 -22799 29378 57321 27937 -13134 -29252 26232 12303 21723 15828
12073 15828 -24500 -58671 -42066 -19192 13694 51103 73003 51071 41549 -185 -23132 -23369
12061 -23369 -44293 -67206 -58642 17348 36038 899 28409 51931 27866 34149 5832 -74813
12049g4813L387j5907o1469j6547O3202Q7681K055o836l9387M4878m183M0290
12037B2351n069m7046q929j0242J8660j572k979L1700J4716q909m3937N6162K3610
12024C8516J0757m5940n4890J7149O758l0220J4626j1611j6740K3038k0373k1783
12012i0713j3497L3773N072j8142k6739j0414m1915N5716R8235Q4835K3303j19097
12000a9583k3271P6430M3102L4519l0081p429K3321m5632k4896k3306k0793J8876
11988A257N6021K578o1716j7644Q4271L8768m2484j3491n0796n2317m5798k3288
11976a24639K8644M7273K2319J7028j611K2902J5562K1150K655k3143K269r883
11964B0526n3227m6199j5747j3745M4667L8349k1667K380k9893K2765N4630k05
$$ plain form
12049 -74813 -71426 -87333 -148802 -165349 -102147 -14466 -12411 -19247 -58634 -13756 -17939 22351
12037 22351 17282 -29764 -38693 -48935 -30275 -31847 -34826 -3126 11590 2681 -41256 14906 38516
12024 38516 49273 3333 -51557 -34408 -27650 -57870 -43244 -54855 -71595 -48557 -68930 -90713
12012 -90713 -104210 -70437 -65365 -83507 -110246 -120660 -162575 -106859 -8624 76211 99514 -19583
12000 -19583 -42854 33576 76678 111197 81116 73687 97008 51376 26480 3174 -17619 1257
11988 1257 57278 59856 -1860 -19504 64767 103535 61051 47560 -3236 -55553 -101351 -124639
11976 -124639 -95995 -48722 -26403 -9375 -10986 11916 27478 48628 51283 28140 30409 20526
11964 20526 -32701 -78900 -94647 -108392 -63725 -25376 -47043 -44663 -74556 -51791 2839 2634
11952B634k9073o6350q1779j0385M3908O9429L6669O8022k1522P8782J1051k1407
11940G9979l5218q7636P420j5252N2635K2188k7929j43m7634j9583O5637N5909
11928E0373m4243o2928m7101K1536j7024k4684j4374K7202N3628L9606k1953j2926
11916e2888K8862n08K8374L2032l2315o1104o998K853j0373q661J2878M6922K5639
11903D713J3866J5699l2947k7295j5086K4900m9671m3793o243O5029J6300J5450
11891a9078J9548j0247J3612j6500j9336m5167k5927J3760O069J3134N3536j8241
11879c4837J3788p754j0734K252L9806K0446j9705J166j9701q158k7068K0444
11867c0055N920P526L8688p827M3342M0321o036p582m1026q298l140M549k1673
$$ plain form
11952 2634 -26439 -92789 -174568 -184953 -141045 -71616 -34947 33075 11553 90335 101386 79979
11940 79979 44761 -42875 -35455 -50707 1928 24116 -3813 -3956 -51590 -71173 -5536 50373
11928 50373 6130 -56798 -103899 -82363 -99387 -124071 -138445 -111243 -57615 -18009 -39962 -52888
11916 -52888 -24026 -24534 3840 35872 3557 -57547 -64545 -61692 -72065 -80726 -67848 -20926 4713
11903 4713 18579 34278 1331 -25964 -41050 -16150 -65821 -109614 -115857 -50828 -34528 -19078
11891 -19078 470 -9777 3835 -12665 -32001 -77168 -103095 -89335 -83266 -70132 -16596 -34837
11879 -34837 -21049 -28803 -39537 -37285 2521 22967 3262 4428 -15273 -23431 -50499 -30055
11867 -30055 -24135 -16609 22079 14252 57594 97915 91879 84297 43271 34973 31833 36382 14709
11854A4709P104O5495m6869m9835m2014j0364K3156J9J9531J1725j2370j7932
11842c7645L1483k0847R995j2479J0560j8335o6833J9349M0838l5174J1016k35
11830f8307l5962l760J9136K3389J7751j3312J0202l4824O8202N813k0451J2294
11818a9829L8353j9858P614N479n053o972L3324K045r2226J259J8305o122l2881
11805g6562L4475M9491L3831k1546n5630j4154J0885j3551J9055k0529Q2631L9818
11793F8214l9809M3646L6080m6167p8628n3991P1724L7347O5391M4540q991n9247
11781H0109q1169j6783l8026n3680K7926L2233O241j389m438k7499M5448o411
11769c7438m9422l0114K6612K6416K9792L9981l1305M1124R585M047J1507J0802
$$ plain form
11854 14709 21813 87308 40439 -9396 -51410 -61774 -38618 -38599 -19068 -7343 -19713 -37645
11842 -37645 -6162 -27009 -17014 -29493 -18933 -37268 -104101 -84752 -43914 -79088 -68072 -68307
11830 -68307 -104269 -108029 -88893 -65504 -47753 -61065 -50863 -85687 -17485 -11672 -32123 -19829
11818 -19829 18524 -1334 6280 11759 6706 -266 33058 35103 -57123 -55864 -37559 -43681 -76562
11805 -76562 -42087 7404 41235 19689 -35941 -50095 -39210 -52761 -33706 -54235 28396 68214
11793 68214 28405 72051 108131 61964 -16664 -70655 1069 38416 103807 148347 139356 80109
11781 80109 -1060 -17843 -55869 -109549 -81623 -49390 -43149 -44538 -48976 -76475 -31027 -37438
11769 -37438 -86860 -116974 -90362 -63946 -34154 5827 -25478 15646 25231 29278 40785 51587
11757E1587k0820l0588M5441l6729k5848m3316n804J9810m7478Q201P0083J0954
11745d507N2592J3367n4997l4993p2143J4760J4718k7442j2491m0928K0807N5758
11733g5499m2000K182Q278N9169N8726P090m1472P463M8895L1863k1177p0181
11721b6663k7658M4809j6821K457m5762m4166M720M9794K3026J1566j0810R169
11709b6339L374j2819j5158R220M6328L1688L7708l5275p2073j4903l5792K4878
11697e9163N1165O8076k7824m3040j4692J491j1726j1416j8235p2026m4828L8983
11685a43235Q599O6315O6174O5847m5466n2264j2889k764J8970M0593j5998k053
11673h171L1817k589j781l5436K4166l7368o8013P941L0104N08K9886K0018k2421
$$ plain form
11757 51587 30767 179 45620 8891 -16957 -60273 -66077 -46267 -93745 -85544 -15461 -4507
11745 -4507 48085 61452 6455 -28538 -100681 -85921 -71203 -98645 -111136 -152064 -131257 -75499
11733 -75499 -117499 -115317 -107039 -47870 10856 17946 -23526 -16063 32832 64695 43518 -26663
11721 -26663 -54321 -9512 -26333 -23876 -69638 -113804 -109084 -59290 -36264 -24698 -35508 -26339
11709 -26339 -22965 -35784 -50942 -41722 4606 36294 74002 38727 -33346 -48249 -84041 -59163
11697 -59163 -7998 60078 32254 -10786 -25478 -23987 -35713 -47129 -65364 -137390 -182218 -143235
11685 -143235 -134636 -68321 -2147 63700 18234 -34030 -46919 -49683 -30713 9880 -6118 -8171
11673 -8171 23646 21057 19276 -16160 8006 -29362 -97375 -89434 -59330 -58822 -28936 -8918 -31339
11660c1339j2672l5524j8211J2453r192O3110K6601J211Q923J8036m6374l8395
11648f1373l4770M7705O0543n166L1921m4200j5464J6515P814O209K9115K0151
11636E9000L0747o3829p435p633J8735k7832k2715l4998L1147J9965m123l4574
11624d3545J3441O761p417N296N2034j8859n2188M181K8091m5436P785P4774j2125
11611A2793l3632m7281K96l7147N1456O0809l5294k532m3818j177N550n867L6615
11598c9229J9446K4851N1963L016n6307k3277N066j0522k0440j7845K8618M6675
11586A2015l5265J0043j6001N1916O6725k4157n9357K5342K1750j8386p3382J3390
11574b5367M165m0124j7921m2398M2564O7265J7743K8538K3833l5422p1163J2554
$$ plain form
11660 -31339 -44011 -79535 -97746 -85293 -94485 -31375 -4774 -3563 5360 23396 -22978 -61373
11648 -61373 -96143 -48438 12105 6939 38860 -5340 -20804 -4289 3525 9734 38849 59000
11636 59000 89747 25918 18483 10850 29585 1753 -20962 -55960 -24813 -4848 -8971 -43545
11624 -43545 -30104 -23343 -30760 -25464 26570 7711 -44477 -40296 -12205 -57641 -49856 24918 12793
11611 12793 -20839 -68120 -67824 -104971 -53515 7294 -28000 -30532 -74350 -75527 -69977 -75844 -39229
11598 -39229 -19783 5068 57031 60047 3740 -19537 -14471 -24993 -45433 -63278 -34660 12015
11586 12015 -23250 -13207 -29208 22708 89433 65276 5919 31261 53011 34625 -38757 -25367
11574 -25367 -21202 -61326 -79247 -121645 -79081 -11816 5927 34465 58298 22876 -48287 -35733
11562c5733K6710r848n0099p750J5510K2607k6302p7794P046K8494K1895O5812
11550a9452q693J3916o7791l2057P4966N6392j2241n805L67j3934k2328M430K4563
11537g667O7048m6941n7717K294o996J5620Q712o8801J4277P4422o3071j3698
11525h2518K5708O5555J7067J195J9578j0142m2830l813l527k8145J5181l3966
11513f0657l1166K8764R167m629M599L2760l0736N3952j1027n2773N1431J4630
11501D315J3039m330J7686O190l5150j6981J5295N1143J5702o361m3264l1626
11489a4342R280l462K6379n4437j4786k446j7900K6573o212l5404J9872r5701
11477a62586L1686q846l566M2946o983L9753J7953k2894q524L3540M446l560j0448
$$ plain form
11562 -35733 -9023 -18871 -68970 -76720 -61210 -38603 -64905 -142699 -135653 -107159 -85264 -19452
11550 -19452 -28145 -14229 -82020 -114077 -39111 17281 5040 -765 -398 -14332 -36660 -32230 -7667
11537 -7667 59381 12440 -45277 -42983 -49979 -34359 -25647 -94448 -80171 -5749 -68820 -82518
11525 -82518 -56810 8745 25812 27007 46585 36443 -6387 -10200 -13727 -41872 -26691 -60657
11513 -60657 -91823 -63059 -53892 -58521 -53922 -21162 -51898 2054 -8973 -61746 -10315 4315
11501 4315 17354 13024 30710 36900 1750 -15231 64 51207 66909 60548 17284 -14342
11489 -14342 -5062 -8524 17855 -36582 -51368 -53814 -71714 -45141 -51353 -86757 -66885 -162586
11477 -162586 -130900 -139746 -143312 -100366 -107349 -67596 -49643 -72537 -81061 -47521 -43075 -46635 -57083
11464e7083L8299R433m5058L815R336N6267k5771p2303k9020K3095M2736K1377
11452b4877K8554M8344j9533k6225l576n1192o0244r128k7403L2018R0141P436
11440a5685m6545J5265P1660j9744K726k9104m992J3777j8498m3274m4175L4961
11428h3628K4442L3036o9615n9962M6899M0869N5280K1037j1708j1079L1635P0541
11416H7747j9471m7646k5191k7331J2717k1923m6025Q502l302L2770l5022P15
11404h3460Q876p252p355j243J0932l1571J7562O5701M4914L5837k9170n7731
11392c3960K8845K7665j1741o0055K8718k530K8537K3884k0183J3120J1130M5458
11380G8888o374l1436l1691p766L5232l4075p4162o750j1044l571L2405M2907
$$ plain form
11464 -57083 -18784 -9351 -54409 -50594 -41258 15009 -10762 -83065 -112085 -88990 -46254 -24877
11452 -24877 3677 52021 32488 6263 2687 -48505 -108749 -117877 -145280 -113262 -23121 -15685
11440 -15685 -62230 -46965 24695 4951 7677 -21427 -26419 -12642 -31140 -74414 -118589 -83628
11428 -83628 -59186 -26150 -95765 -155727 -108828 -67959 -12679 8358 -3350 -14429 17206 87747
11416 87747 68276 20630 -4561 -31892 -19175 -41098 -87123 -78621 -81923 -49153 -84175 -83460
11404 -83460 -74584 -81836 -89191 -90434 -79502 -111073 -93511 -27810 17104 52941 23771 -33960
11392 -33960 -5115 22550 10809 -49246 -20528 -23058 5479 29363 9180 22300 33430 78888
11380 78888 72514 41078 9387 1621 36853 2778 -71384 -78134 -89178 -92749 -60344 -17437
11368a7437J757o3191J0837J3985J6240l7264M6266M1321k8549J7921l8311l6720
11356g3145O713J6784L7187M0186k5350m0260M9580J5412q8913J2676L4245k6025
11344d0910J408O1696n6449m9588O3978j7077j5184J9596l5456k1773K7221l1242
11332i3780n9927K0847R1923O0709k6011l5572j2902j2391k8063p658l1014K3772
11320a10067O685r94J9277M9158k3332J1044o606K9047L4179K8366o3524o671
11308c3438o1m5272j0280M9482L5737j9207j5738J6856j9926n1036L0385M8194
11296a4304L8163k9646r944j0465m6917l2202K7078n365K2480j0979k4266k8876
11284a25243L7127P5951J7933j3137o049j7587k4808K2834p280j7127k0149P9586
$$ plain form
11368 -17437 -15680 -78871 -68034 -54049 -37809 -75073 -28807 12514 -16035 1886 -36425 -73145
11356 -73145 -66432 -49648 -12461 27725 2375 -37885 11695 27107 -61806 -49130 -14885 -40910
11344 -40910 -39502 22194 -34255 -83843 -19865 -36942 -52126 -32530 -67986 -89759 -62538 -93780
11332 -93780 -153707 -132860 -40937 19772 -6239 -41811 -54713 -67104 -95167 -102825 -133839 -110067
11320 -110067 -103382 -104376 -85099 -35941 -59273 -48229 -54835 -25788 8391 36757 -26767 -33438
11308 -33438 -33499 -78771 -89051 -39569 -3832 -23039 -38777 -21921 -41847 -92883 -62498 -14304
11296 -14304 23859 -5787 -15731 -26196 -73113 -105315 -78237 -83602 -61122 -72101 -96367 -125243
11284 -125243 -88116 -12165 5768 -7369 -13418 -31005 -55813 -32979 -40259 -57386 -77535 2051
11272B051P101k5086j2644k7774K3986L01k2915O0095M7738o378j2567L9533j8079
11259E5362l2421j1747K0624o727o2211n2998r680r037P5887O3637l9733j7533
11247b6577J3807j7407r9808p1079P5854Q539N1959k8272l150N8381k6533k2954
11235h7240j7661M7997J4000K6507N855k4440l9939N4771O1325j583n9481l9743
11223e9632M2007j5321q7593J1719J9768M4378M1533r893M5033m0572j8980M3853
11211A6300M791j1904K0428l199N729J2153n1551l2264k7452K6893P7059l0780
11199F203n1396p267j801j5968p1983k9059R136K2734L7697K9825J4572N2277
11187e030P3894n8164o5521J1019J1487M893k2829O807k9170k5330J5165k7329
$$ plain form
11272 2051 9152 -15934 -28578 -56352 -32366 -32065 -54980 5115 52853 46475 33908 73441 55362
11259 55362 22941 11194 31818 25091 -37120 -90118 -99798 -108835 -32948 30689 -9044 -26577
11247 -26577 -12770 -30177 -129985 -201064 -125210 -116671 -64712 -92984 -96134 -37753 -64286 -87240
11235 -87240 -104901 -56904 -42904 -16397 -10542 -34982 -74921 -20150 41175 39592 -19889 -59632
11223 -59632 -17625 -32946 -120539 -108820 -89052 -44674 -3141 -13034 31999 -8573 -27553 16300
11211 16300 21091 9187 29615 26416 32145 44298 -7253 -39517 -66969 -40076 36983 6203
11199 6203 -45193 -52460 -54261 -70229 -142212 -171271 -162135 -139401 -101704 -71879 -57307 -5030
11187 -5030 68864 10700 -54821 -43802 -32315 -27422 -50251 -43444 -72614 -97944 -82779 -110108
11175a10108J9889M4677K2313j8563l5238J1973Q648L7137L5991n5474n6677K8071
11163f7361n1373K6174J6475J2224L9615O527R886m0182j4192N1958n510j4997
11151c0756q8023j9175l3742J1448M6730j0684M3688M9044l8363o2786k7793R1205
11139f9207P3717K1681j4833J8022L6746m0248J7819j789m0887J106J3945l4380
11127a8308k9909k1331k2374j0946l9416j7293L0410Q0266O1700r131o5747K2602
11115c9477M5449K6857M129J3073j7842m7543j7704k068j1942J0849o150l4929
11103g7298k4170P246L6465j7498k6364L6136K0613l0631l6692l642L8964l0710
11091a07581M583M3104L2207K9349q176k4672K2046R419l5881n0342K5974K5818
$$ plain form
11175 -110108 -90219 -45542 -23229 -41792 -77030 -65057 -56409 -19272 16719 -38755 -95432 -67361
11163 -67361 -118734 -92560 -76085 -63861 -24246 -17719 -7833 -48015 -62207 -10249 -15759 -30756
11151 -30756 -118779 -137954 -171696 -160248 -113518 -124202 -80514 -31470 -69833 -132619 -160412 -69207
11139 -69207 4510 26191 11358 29380 66126 25878 43697 41908 1021 2127 16072 -18308
11127 -18308 -48217 -69548 -91922 -102868 -142284 -159577 -129167 -48901 12799 3668 -62079 -39477
11115 -39477 5972 32829 36958 50031 32189 -15354 -33058 -35126 -47068 -36219 -42369 -77298
11103 -77298 -101468 -94222 -57757 -75255 -101619 -65483 -44870 -75501 -112193 -115835 -76871 -107581
11091 -107581 -102998 -59894 -27687 1662 -6514 -31186 -9140 279 -35602 -85944 -59970 -34152
11079c4152j3298j6171N2599N4544j8987p1229l8091j7959L8866N0802K9798j9906
11067c184m5769k6488K9168R034J7596K4851J4255O371p0037p3427J7619N1203
11055d8808N6400M398j2687o6401m8977j7196N4864M9906K1390l0733J227K9964
11043f653J5091l3120J3937L5108l0092m857K9680k3979r873K8222l3235k4881
11031d4652R610j8840j3772M8119L3647P0393j5339n4254o6823j4432L9706P338
11019a9299L2476m9549l6535K6740l69L6119j9236M3185k1401l8983q095M1268
11007a3679k8193o196K5694L3894l0107l5723K6801O270Q011L2688M2577k0609
10995D1428o5280j0476j4891m1649M6726K0641k0000M626J8966K1555j6580p904
$$ plain form
11079 -34152 -47450 -63621 -11022 43522 24535 -46694 -84785 -102744 -63878 -13076 16722 -3184
11067 -3184 -48953 -75441 -46273 -37239 -19643 5208 19463 25834 -44203 -117630 -100011 -48808
11055 -48808 7592 11990 -697 -67098 -116075 -133271 -78407 -28501 -7111 -37844 -36617 -6653
11043 -6653 8438 -24682 -10745 24363 -5729 -10586 19094 -4885 -14758 13464 -19771 -44652
11031 -44652 -35042 -53882 -67654 -19535 14112 84505 69166 14912 -51911 -66343 -26637 -19299
11019 -19299 13177 -36372 -72907 -46167 -46536 -10417 -29653 13532 -7869 -46852 -54947 -13679
11007 -13679 -41872 -48068 -22374 11520 -18587 -54310 -27509 -21239 -13228 19460 62037 41428
10995 41428 -23852 -34328 -49219 -90868 -44142 -23501 -43501 -38875 -19909 1646 -14934 -22838
10983b2838n1837K8038M8394L1357J8302M7879p5o564N0497L887k0198l7671m4853
10970D4318K347L0222M1590l4282o5628j5436k0038k1190L0128M4894m670J222
10958C3477m9812k8670j4457n601K6861N0965O21o0578o398K150L0592j0283j5829
10945d6962n1751m49L1295J8959m1099p2001p6189M6736P4306J09727L1502n5744
10933c1670j8593M1649M8595l7436M2899k5825j06950j2247O2548L1650K645j5952
10921a8687K5541L1581m8265k175r368l8375L2702K2362j0225O65K309m5334O175
10908e1094J14317p100m6772k2815m7257M9986L122l3472k3213K015K4313K4654
10896a3316n6173k7084R3097K0765m1369J7239K3353r210M9122l1861n4395l1431
$$ plain form
10983 -22838 -74675 -46637 1757 33114 51416 99295 99220 92656 143153 147040 126842 89171 44318
10970 44318 46665 76887 118477 84195 18567 3131 -16907 -38097 -7969 36925 32255 33477
10958 33477 -16335 -45005 -59462 -65063 -38202 12763 13384 -47194 -53592 -51442 -20850 -31133 -46962
10945 -46962 -98713 -99162 -67867 -48908 -90007 -162008 -238197 -191461 -117155 -7428 24074 -31670
10933 -31670 -50263 -8614 39981 2545 45444 19619 -87331 -99578 -37030 -5380 -2735 -18687
10921 -18687 6854 38435 -9830 -12005 -21373 -59748 -27046 -4684 -14909 -14244 -11935 -57269 -51094
10908 -51094 63223 56123 9351 -13464 -60721 -10735 -7613 -41085 -64298 -62283 -37970 -13316
10896 -13316 -69489 -96573 -3476 17289 -24080 -6841 16512 7302 56424 24563 -29832 -61263
10884f1263L4087j6855j0763l1458r831M7492P9939k9946J4051O1362J714n0591
10872B7938p8463p0858M5850P3126J9019M021J4976l1753l7381o18P428K7002
10860B87J2440j0014k288n5934J3149K0271L3161N8758L8777Q707n7017o4574
10848d277p8653J7058J0744M0439K5274o180l232j2271K1722L6284N2350p8619
10836B0639o1536R741l3381l3886l8978L6262L3564l2944K0220M5516P7141p8222
10824c5864j608M2403M8391K0220J5152j4543K4681p151N210m6716q1058J0330
10812b0553Q240m421n2987j1932M9362O5787p704J8296l7788m6125J557j7004
10800e5272j3032K7556k3087m5206o648P312R204l7428M6042K3352K3907m663
$$ plain form
10884 -61263 -27176 -44031 -54794 -86252 -96083 -48591 31348 1402 15453 76815 78529 27938
10872 27938 -50525 -121383 -75533 -2407 16612 20633 35609 3856 -33525 -34143 -26715 287
10860 287 12727 2713 425 -55509 -42360 -22089 11072 69830 108607 117314 60297 -4277
10848 -4277 -82930 -65872 -55128 -14689 10585 4405 1173 -11098 10624 46908 99258 20639
10836 20639 -40897 -31156 -64537 -98423 -137401 -101139 -67575 -100519 -80299 -34783 42358 -35864
10824 -35864 -37472 4931 53322 73542 88694 74151 98832 91681 96891 50175 -30883 -20553
10812 -20553 -12313 -16734 -69721 -81653 -32291 33496 25792 44088 6300 -39825 -38268 -55272
10800 -55272 -68304 -40748 -63835 -109041 -115689 -108377 -99173 -136601 -90559 -67207 -43300 -47963
10788d7963j2382j9747k7299l4968M3610O6671L689K4119p6061m2216P4881O7600
10776A9934n8035J5982K3939l737k5216n342k6587J7255J7860l403l732j7218
10764d8300j1894O7696o27n9627j1012K1820j0467J2841M6519K0543q255q473
10752A0764l001J3056m3230k6179J505k7803L6854J2241l0152k4923q658J9081
10740g0445k8437J811J90K175K6919R1765K9145l2810k0007R41L1973m2416o1041
10727g0237L6421J9517K4014l9561k9144L6192J1J3512l4732n3493K9485M4872
10715b3143O0549l5103j0395l4675n9782P5962N2978p636n1236r535j7064j4991
10703g4071k831j8520J6606N4407N5056j0702j7803K1492N796J8855l7765o2179
$$ plain form
10788 -47963 -60345 -80092 -107391 -142359 -98749 -32078 -28389 -4270 -80331 -122547 -47666 19934
10776 19934 -38101 -22119 1820 -1917 -27133 -32475 -59062 -41807 -23947 -27350 -31082 -48300
10764 -48300 -60194 7502 6875 -52752 -63764 -41944 -52411 -39570 6949 27492 19237 10764
10752 10764 7763 20819 -22411 -48590 -47085 -74888 -38034 -25793 -55945 -80868 -89526 -70445
10740 -70445 -98882 -97071 -96881 -94706 -67787 23978 53123 20313 306 1247 33220 -9196 -70237
10727 -70237 -33816 -14299 9715 -29846 -58990 -22798 -22787 -9275 -44007 -97500 -68015 -23143
10715 -23143 37406 2303 -8092 -42767 -102549 -26587 26391 18755 -32481 -42016 -59080 -74071
10703 -74071 -76902 -95422 -78816 -24409 30647 19945 2142 23634 29430 48285 10520 -51659
10691e1659K1406p123n7617N0967K0295L1026K8427j2306m9149Q8495L2835m3871
10679E1726p3820l0500N2328J7926o565M4926k1404m0371j2737J8672n9348j0754
10667f9921M2023J5338r327n4781J0012N9087J5794m2858p3366K6259N5908K4877
10655i55M8346j3411P146L2587O5413n0790p8353Q535r745k2731l7855O2k0874
10642g2625m5628k0394j6723N9354J0103m7452N702O3701K1724J5721M380l917
10630b6054K9964n5737m0534O956K9039K6140l0207o0185p063j9781L1368L9016
10618g7078k755O9845j3500k5791N4586Q201m5385j6338m028l9109j9812K0879
10606i0285L8152P0958N5372Q573l2165L2278j8174K1964k2173j6272K5267m6330
$$ plain form
10691 -51659 -30253 -37376 -94993 -44026 -23731 7295 35722 23416 -25733 62762 95597 51726
10679 51726 -22094 -52594 -266 17660 11095 56021 34617 -5754 -18491 181 -59167 -69921
10667 -69921 -27898 -12560 -21887 -76668 -66656 -7569 8225 -34633 -107999 -81740 -25832 -955
10655 -955 47391 33980 41126 73713 139126 88336 9983 18518 8773 -13958 -51813 -51751 -72625
10642 -72625 -118253 -138647 -155370 -96016 -85913 -133365 -127663 -63962 -42238 -26517 -22137 -26054
10630 -26054 3910 -51827 -92361 -85405 -56366 -30226 -60433 -120618 -127681 -147462 -116094 -77078
10618 -77078 -79833 -9988 -23488 -49279 5307 13508 -31877 -48215 -52243 -91352 -111164 -90285
10606 -90285 -52133 18825 74197 82770 50605 82883 64709 86673 64500 48228 73495 27165
10594B7165k0208l2087r2037K4401N2591L5668l009n3147k1225J0372K3955M0667
10582f894L9063L0010k2015m6126k2714k4453l2282k5804K0498k2059M8437N3849
10570a0490j6466J6349R946k7802k3694k5509o323M0406J4450k8946j7357L7755
10558c7681K994K1217n8602k325O1215J7520o535K8430m2804M524J3119K433k4255
10545b0750r766N3330n4718K7888K3588K4111J1693j0038O652M287n6698Q6236
10533H5815k2004m8393q017J0611J3208M5929n0882j9199j7055L3672n724N3019
10521G0980k4651o1954R772Q008m0247m7526j2654K9559M2397N049n9858j05988
10509a87113J3646O1893L1863K8793L8596K6512j1659k7794p5825j1398M4563
$$ plain form
10594 27165 6957 -25130 -117167 -92766 -40175 -4507 -7516 -60663 -81888 -71516 -47561 -6894
10582 -6894 32169 62179 40164 -5962 -28676 -53129 -85411 -111215 -90717 -112776 -64339 -10490
10570 -10490 -26956 -10607 -661 -28463 -52157 -77666 -83989 -43583 -29133 -58079 -75436 -37681
10558 -37681 -34687 -13470 -72072 -74397 -13182 4338 -2197 26233 -16571 -12047 1072 3505 -20750
10545 -20750 -30516 22814 -31904 -4016 19572 43683 55376 45338 51990 56277 -421 85815
10533 85815 63811 15418 7401 18012 31220 77149 26267 7068 -9987 23685 17961 70980
10521 70980 46329 -15625 -5853 2155 -38092 -85618 -98272 -68713 -26316 -21267 -81125 -187113
10509 -187113 -173467 -111574 -79711 -50918 -12322 14190 2531 -25263 -101088 -112486 -67923
10498f7923K9645P5078J0138K3962M269J8095l2017n8005j1322N675j0010j4158
10486b6573L049J2630J2280J1611k3902k1840m3429K4018N9269J8616K7676J4404
10474F7809R997J8473m1947k6309J7904L8455p1023o5855J0258O3798l50j7271
10462C939o3415K6537M0495n1705k3099Q9045K5022L3205M2709m1918l6444o4641
10450b0270m3750J1595j6418M0719M1973k2130j4111k9400M2064J3974J6494j4001
10438F739j6563K4153j5651J1289L5550k5012k3279L9833k4138o7529k458O6940
10426I874q736l7716k1838J154K9828N8016m0250p57J3123j02699k8736Q5350
10414d3387N3723j2452K0595L2626j6605L8653Q892l5197M4482r339o4673o5106
$$ plain form
10498 -67923 -38278 36800 46938 70900 75169 93264 61247 3242 -8080 -2405 -12415 -26573
10486 -26573 -23524 -10894 1386 12997 -10905 -32745 -76174 -52156 7113 25729 53405 67809
10474 67809 77806 96279 54332 28023 45927 84382 13359 -52496 -42238 21560 21210 3939
10462 3939 -59476 -32939 7556 -44149 -67248 21797 46819 80024 122733 80815 44371 -20270
10450 -20270 -64020 -52425 -68843 -28124 13849 -8281 -22392 -51792 -9728 4246 20740 6739
10438 6739 -9824 14329 -1322 9967 45517 20505 -2774 37059 12921 -54608 -57066 9874
10426 9874 1138 -36578 -58416 -57262 -27434 30582 -9668 -10425 2698 -100001 -128737 -43387
10414 -43387 10336 -2116 18479 51105 34500 73153 82045 46848 91330 81991 17318 -47788
10402d7788J5955K6479q958l9511r715K7012L5792J6342l5913K3877N1712K3230
10390G8514o953k1994r553n4575k0837J755K8433n788l3370o0885K1061K4847
10378e9345M0755n170j0710K0659J9412j7782k9118l4318J5707N4542Q5447K4017
10366A04096k3487p4048l7164l0977P0149L8438q1074m092K1981N7027k4237k8489
10354a1877K1173J4308K3828k7783k309R1621O783o6353K1621Q6596K3703q954
10342A72357q094L9148L2955J19961J74973J55864J93718K31254K18982R8947
10332A430065O8092J11993O8487m8595o5381p6932j56323k35971j99785j32106
10322G63544j59748k00871r4698k3790J6920K934m8669p4161j2331n22J6415o684
$$ plain form
10402 -47788 -31833 -5354 -14312 -53823 -63538 -36526 -734 15608 -20305 3572 55284 78514
10390 78514 71561 49567 40014 -14561 -35398 -33643 -5210 -10998 -44368 -105253 -84192 -59345
10378 -59345 -18590 -23760 -34470 -13811 5601 -12181 -41299 -75617 -59910 -5368 80079 104096
10366 104096 80609 6561 -30603 -61580 8569 47007 -34067 -38159 -16178 40849 16612 -11877
10354 -11877 9296 23604 47432 19649 17340 108961 115744 49391 71012 157608 181311 172357
10342 172357 164263 203411 236366 356327 531300 687164 880882 1112136 1331118 1430065
10332 1430065 1498157 1610150 1678637 1630042 1564661 1487729 1331406 1095435 895650 763544
10322 763544 603796 402925 308227 284437 301357 304291 255622 181461 169130 168608 185023 178339
10310A78339m1206n785O063l7477l0774L6636l0151l1691N081J0531M9676J0229
10298A19471K1481J398n4584k3356o550j9509j1074l4325j2990J9283l081j1922
10286a5758J3355J68j219m7241J5786j7089J2716m5942K9904N3817l6526K1036
10274a6993j9213r725Q653P2047N8140k7209r4302n794O6098M8274o273k6076
10262D7627m953j4314n5615K6053O7206q859k6797K03N0713k3043n3966j7743
10250a3488m4438J6948K9882M7758O0396l1902m5747N8867L2516J32k3110K8570
10238A16384j4668l6549k3015o8282j7298L5930O281R991k6795K2982Q138J2217
10226B5316k2197K3564K8421k4736j3203R704J3P837j0787J8913k4327r2806m396
$$ plain form
10310 178339 137133 131348 137411 99934 69160 105796 75645 43954 49035 59566 109242 119471
10298 119471 140952 142350 87766 64410 57860 38351 27277 -7048 -20038 -755 -3836 -15758
10286 -15758 -2403 -2235 -3454 -50695 -34909 -51998 -39282 -85224 -55320 -1503 -38029 -16993
10274 -16993 -36206 -45931 -37278 34769 92909 65700 -28602 -34396 31702 79976 73703 47627
10262 47627 42674 28360 -27255 -1202 66004 57145 30348 30551 81264 58221 4255 -13488
10250 -13488 -57926 -40978 -11096 36662 97058 65156 19409 78276 110792 110924 87814 116384
10238 116384 101716 65167 42152 -26130 -43428 -7498 -1217 8774 -18021 4961 13099 25316
10226 25316 3119 26683 55104 30368 17165 26869 26882 34719 23932 42845 18518 -74288 -78684
10213g8684K7735M6022L2235J382q668J9438k7325j0696k8535R70j9654J7542
10201b8238j4726Q527j1027M5661K9132o834K5214j460Q65r4301m9738J5775K3134
10188e8016j202j9225L9303L8323l5082n6124J0220J3128L6611O2866l8463m1419
10176d9080K8045o836J2904m1092n3631L8821P77P732P3508j522l8130k3268J9221
10163c2551o8482P280O703M1042P4075j3176j02956J90M3504O1367J3367p8071
10151d7708m4274L0700P3364Q311R9514N9459j35896l6870J299p1208K770N6178
10139d361k1255r1124M6499O981L1007O923L5241j9450K8529L337j4710J5880
10127B3497j6541j2252N0227N094n5216n1026k143L8044j7066k1668l0457j0363
$$ plain form
10213 -78684 -50949 -4927 27308 28690 20022 39460 12135 1439 -27096 -26126 -45780 -28238
10201 -28238 -42964 -34437 -45464 197 29329 22495 47709 46249 47114 -47187 -96925 -81150 -58016
10188 -58016 -59218 -78443 -39140 -817 -35899 -92023 -81803 -68675 -32064 30802 -7661 -49080
10176 -49080 -21035 -27871 -14967 -56059 -109690 -70869 -70092 -62360 11148 9626 -28504 -51772 -32551
10163 -32551 -101033 -93753 -87050 -46008 28067 14891 -88065 -87875 -44371 16996 30363 -47708
10151 -47708 -91982 -61282 12082 20393 119907 179366 43470 6600 7899 -63309 -60539 -4361
10139 -4361 -25616 -116740 -70241 -63260 -32253 -25330 9911 -9539 18990 22327 7617 23497
10127 23497 6956 -5296 44931 50025 -5191 -56217 -58360 -20316 -37382 -59050 -89507 -99870
10115i9870M0644k6956o8577J58K6281L2427k24R3407N2948j6514L1865n608k8072
10102C1909l0284l738k5999l788j425K7400K6612m3360k3734j5035l7535L0833
10090f8144M1324K8591L2449L110k4410m4708O316P7112K0256k4604o4261M3191
10078B6222J2300k0664l1119j3887J4173K1735q787j0086j4121L6494N8908l3683
10066C7485j07966J2418N0232M6447M2316m4370m1708k6308L2159l1276j6894
10055d7465K0004n5241L4114l334m4611r691K2982O6533J3499j8493J1025j6494
10043b7172j7550j338q434q797l2099k7254J249k162N289L5305K0553q1120j6517
10030a60047N0616r110Q2599N6028o1655J9427j7999J0099O406m836O419m025
$$ plain form
10115 -99870 -59226 -86182 -154759 -154601 -128320 -95893 -96117 -2710 50238 33724 65589 59981 31909
10102 31909 1625 -2113 -28112 -31900 -33325 -5925 20687 -22673 -46407 -61442 -98977 -68144
10090 -68144 -26820 1771 34220 37330 12920 -31788 -25472 51640 71896 47292 -16969 26222
10078 26222 38522 17858 -13261 -27148 -12975 8760 -27 -10113 -24234 12260 71168 37485
10066 37485 -70481 -58063 -7831 38616 80932 36562 -5146 -31454 705 -30571 -47465
10055 -47465 -27461 -82702 -48588 -51922 -96533 -106224 -83242 -16709 -3210 -21703 -10678 -27172
10043 -27172 -44722 -46060 -54494 -63291 -95390 -122644 -121395 -123557 -118268 -82963 -62410 -143530 -160047
10030 -160047 -109431 -118541 -35942 20086 -41569 -22142 -40141 -30042 -23636 -28472 -22053 -26078
10018b6078k043o9858m7268K1031O5069M4930l385l3214N1059L517o4262K458
10006e8044m5189j7637q184K5165N7675N9528J7627m1976n2033L9928M1288k8264
9994a0116M670M1617o121k2028m0976j8710P0892M4387p2593k3876q808K7609
9982a4053j6905R502j373j9291M7573J8443j7226l4384j5549J0739J9236L9882
9970B6594k2109k8372k6640j1987L01K644O0584N9994n6841R033O3211m9825K6448
9957E3035O5440J107K3200j3753n0546j4755K3368j2372L7908k7410l8639l3792
9945A2791L5454K8853o5651k7177K8986J4077k5932J3716k7704k2126l9930K4676
9933d9967O6725p9992m6385L5221M7752J0076n5598N155N8818J2920j7229k390
$$ plain form
10018 -26078 -28121 -97979 -145247 -124216 -59147 -14217 -17602 -50816 243 3760 -60502 -58044
10006 -58044 -103233 -120870 -129054 -103889 -46214 13314 30941 -11035 -63068 -23140 18148 -10116
9994 -10116 -5446 36171 30050 8022 -32954 -51664 19228 63615 -8978 -32854 -41662 -14053
9982 -14053 -30958 -21456 -22829 -42120 5453 23896 6670 -27714 -43263 -32524 -13288 26594
9970 26594 4485 -23887 -50527 -62514 -62213 -59569 1015 61009 4168 13201 76412 26587 53035
9957 53035 118475 119582 142782 129029 78483 63728 87096 74724 112632 85222 46583 12791
9945 12791 48245 77098 11447 -15730 13256 27333 1401 15117 -12587 -34713 -74643 -49967
9933 -49967 16758 -63234 -109619 -74398 -26646 -16570 -72168 -67013 -8195 4725 -12504 -14894
9921a4894K0459l139k6887j0239K5206K6551o5069r5098K1573O8898J5987j8161
9909e4813J385N9541O2174K8371l3152k3288k5604r7624L3910k8702R860J15399
9897D7457K2500m1469O2802J1893J7823m302n4707k26O3586M8756l7481n6254
9885H0378K8897P570j6703l5976j2141k4936j9265J5369j2126K0670l7430J5228
9873I535P233q960o2038k0546M7821J3398N777J3252J0996M6052J976K4245M6917
9860A35658l3177l3843K5928J0707L4602l2269o0915j17242k4991P0484P7748
9849E2690j4683J3132N9194m0351k684j3616j3039M9245J3096j0258M78l9977
9837E3227j3846M4810m0156j8289O308J3323P4557L0161m4392n5196p233J6039
$$ plain form
9921 -14894 5565 2426 -24461 -34700 -9494 17057 -48012 -143110 -121537 -52639 -36652 -54813
9909 -54813 -53428 6113 68287 96658 63506 40218 14614 -83010 -49100 -77802 -67942 47457
9897 47457 69957 28488 91290 103183 121006 116704 61997 61771 125357 174113 136632 80378
9885 80378 109275 116845 100142 64166 52025 27089 7824 23193 11067 31737 -5693 9535
9873 9535 16768 7808 -54230 -74776 -26955 -13557 -7780 5472 16468 62520 64496 88741 135658
9860 135658 102481 68638 94566 105273 139875 107606 46691 -70551 -95542 -25058 52690
9849 52690 38007 51139 110333 69982 67298 53682 40643 89888 102984 92726 93204 53227
9837 53227 39381 84191 44035 25746 32054 45377 119934 150095 105703 50507 43274 59313
9825E9313L917J5310m9279m0872n853L9888o475N119K9837N1885Q013j935p9138
9812B9730j4276l5008r466P8077L4496J3429k9385p1634j11462j2063P665K9065
9800i0832P8969O145j4505j971m9268j2938q462k6169M2222M1607M6755K0060
9788C1613p816k2487j4195J3626k1768j9061N5298J3318M3180L8421l305l8439
9776F8385k5949J4572J0761J6717l231J3825J863n3459M2907J400l5665j4386
9764C7740J7852K9002J890p61j8186L7706M5249J6909l5283R917K953p804j8051
9751A19133r55l7358k5582M0648O5099k0959k0592l5333K0048J6614j1138J8287
9739A27912k1116m8519J0931K3605j7961n2858k7008M779J6414N6021M9700K5455
$$ plain form
9825 59313 63230 78540 29261 -11611 -17464 22424 15949 21068 50905 102790 110803 108868 29730
9812 29730 15454 -19554 -29020 49057 83553 96982 67597 -4037 -115499 -127562 -119897 -90832
9800 -90832 -11863 -5718 -20223 -22194 -71462 -84400 -92862 -119031 -76809 -35202 11553 31613
9788 31613 23797 1310 -12885 741 -21027 -40088 15210 28528 71708 110129 106824 68385
9776 68385 42436 57008 67769 84486 81255 95080 96943 43484 86391 87791 52126 37740
9764 37740 55592 84594 86484 85723 67537 105243 150492 167401 132118 142035 144988 137184 119133
9751 119133 118178 80820 55238 95886 160985 140026 119434 84101 104149 120763 109625 127912
9739 127912 106796 58277 69208 92813 74852 21994 -5014 -235 16179 72200 121900 147355
9727A47355K9028k8713o4393N070L426n4531k8798N8233N6944J6069J6501k8859
9715A27332q791L6085j5705p1167p346N6957K7636O0069j410l0922J8787k3445
9703A68080j06o5734J8389J7421M9317J2222K4942j3403J3397K2963m5777m8488
9691A53223r435j1672J7985m1315o873l3570K0529M7763J6270m672J30J9019k4814
9678A42568J7360Q8698O1798k1744k7018J9359L4613L804J5289k952k3467K3185
9666C31493m3679n2808l3505M8677O8922Q2091J3516q6326r425j6794j6785m635
9654B80742k0630m318L7870L6039K4277l923k6891k696K5217Q7926J5466k8559
9642D20520O4486J2957p6090j6368K844N2229J8808l9245k4503J2854K6304L1865
$$ plain form
9727 147355 176383 147670 83277 88347 91773 37242 8444 66677 123621 139690 156191 127332
9715 127332 118541 154626 138921 67754 60408 117365 145001 205070 203660 172738 191525 168080
9703 168080 167974 102240 120629 138050 187367 199589 224531 211128 224525 247488 201711 153223
9691 153223 143788 132116 150101 108786 101913 68343 88872 136635 152905 148233 148363 167382 142568
9678 142568 159928 248626 310424 288680 261662 281021 315634 319438 334727 331775 308308 331493
9666 331493 287814 235006 201501 250178 319100 401191 414707 328381 318956 302162 285377 280742
9654 280742 260112 255794 293664 329703 353980 350057 323166 320470 345687 433613 449079 420520
9642 420520 485006 497963 421873 405505 408349 460578 479386 440141 415638 428492 454796 486661
9630D86661J6247J2099Q8178L4253m0698N962L3989N1477N5632K1191P790o644
9618G66137N787j4457M5518P2285N6903L1033j6679k7386K3948K585k3808J18535
9606A040401J30894N246l353O219L7741O6341N7406K5327N1539M1705L8133K0427
9594A518026P7398R2743R1975O5875R7555M5408O8719K4499J7166J29034J27552
9583B355950J12711J25029N8490P4458R4949J63166J31149J41888Q9632J52687
9573C500109J92300J82019J81119K10532K12122J67009K09557J78389J84434J59668
9563E377258K05770K70183K39328K03651K11057K49991K24829J26587O2978Q3538
9553G255170J14195J07645J5124O5991M3144r506m3533r7412j04888q8579j17401
$$ plain form
9630 486661 502908 515007 603185 637438 596740 602702 636691 688168 743800 764991 772781 766137
9618 766137 771924 757467 802985 875270 932173 963206 946527 919141 943089 945674 921866 1040401
9606 1040401 1171295 1176541 1173188 1179407 1217148 1283489 1340895 1366222 1417761 1459466 1497599 1518026
9594 1518026 1595424 1688167 1780142 1846017 1943572 1988980 2057699 2082198 2099364 2228398 2355950
9583 2355950 2468661 2593690 2652180 2726638 2821587 2984753 3115902 3257790 3347422 3500109
9573 3500109 3692409 3874428 4055547 4266079 4478201 4645210 4854767 5033156 5217590 5377258
9563 5377258 5583028 5853211 6092539 6296190 6507247 6757238 6982067 7108654 7171632 7255170
9553 7255170 7369365 7477010 7492134 7558125 7601269 7591763 7548230 7450818 7345930 7257351 7139950
9542G139950j90657k15357j74484k16189j78593k04430k49061j47245j02149k14123
9532E247662k26500k16169j48853j33374j35864j59300k11183j73800j39002j58670
9522C544947j38606j35821r9294j68376j48022o0920l7611q6962r4370j50746
9512B424219j37662q0017m6831j16101n3624p0867q4705O551q469l8997r1704
9501A701793q7454q9716n170n5111k2292k7174m8019p5832j07991o3069j7856
9490A102109j7395K0245j5912J1572j040j9063n6252j06394J3532N4654q3781
9479I02275r4963l6466l667J9781P3502m0461l0604m0496J3582l7143N940K3328
9467G54608l2508p571k6275l7716K0549m2573r7502m6060K965N696o265L5192
$$ plain form
9542 7139950 6949293 6733936 6559452 6343263 6164670 5960240 5711179 5563934 5461785 5247662
9532 5247662 5021162 4804993 4656140 4522766 4386902 4227602 4016419 3842619 3703617 3544947
9522 3544947 3406341 3270520 3171226 3002850 2854828 2793908 2756297 2669335 2574965 2424219
9512 2424219 2286557 2206540 2159709 2043608 1989984 1919117 1834412 1840963 1832494 1793497 1701793
9501 1701793 1614339 1524623 1519453 1464342 1442050 1414876 1366857 1291025 1183034 1119965 1102109
9490 1102109 1084714 1104959 1089047 1100619 1099579 1080516 1024264 917870 931402 986056 902275
9479 902275 807312 770846 767179 786960 860462 820001 789397 748901 762483 725340 731280 754608
9467 754608 722100 714529 688254 650538 671087 628514 531012 484952 487917 493613 487348 522540
9455E22540J07700k9701l6346L2176p156j01646k9142K3787O898j8028j7999L4835
9443D87918m2814j27015n0830P5792J2070J0115m496M4033j2868l4413M3367O059
9431D06918o8878J1276l987p8681j1919L9193p734n395P779l7865m1165M7305
9419B56847N3866N3190o5063n0196K42L4412J0225J1703k8683Q187l5448l4350
9407B14932j707j5090J3389O9163R950j3749j1201n6956l0282K0630Q2648n290
9395B76437o3616m0287l7201L8944r928L1271p587K0711P803k6785j8706k088
9383A68968O9349M9483n5904m2579K6899m1186o4157K6208K024m527K8040l1912
9371A30706L6067Q5151n1676l1765K3488K272o8115L38j097K9276k8606r668l7429
$$ plain form
9455 522540 630240 600539 564193 596369 589213 487567 458425 482212 489110 471082 453083 487918
9443 487918 445104 318089 267259 343051 355121 365236 360740 404773 391905 357492 400859 406918
9431 406918 338040 349316 345329 266648 254729 293922 286188 280793 288572 250707 209542 256847
9419 256847 310713 363903 298840 248644 248886 283298 293523 305226 276543 284730 249282 214932
9407 214932 213225 198135 211524 280687 290637 276888 265687 208731 178449 199079 281727 276437
9395 276437 212821 172534 135333 174277 164349 195620 188033 208744 216547 189762 171056 168968
9383 168968 238317 287800 231896 189317 216216 175030 110873 137081 139105 134578 162618 130706
9371 130706 166773 251924 200248 168483 191971 194243 126128 126466 125369 154645 126039 116371 78942
9358G8942M9862J9228k9207K1367K0745k5661m1015m1039L6944Q785k4351K7172
9346A01772O5009J3203j1178l3499r8602j6730L7441L2228r43J5005M6809l7819
9334A12696k9798l8143o3001M1684L4715l3186M5771j908L385J7930N8866J9347
9322A68358J6938l1888l6196l35J8268J9395l476n2178K3187N5295n7335l0234
9310H9799O6108P1333o1391j40230k5826K8474j0839L4716k436K6807K7941O6021
9298A70477l1095l3027l6574J417M6195L4248j1579m7098J1089L4201m5145j726
9286I1383j2678n7534J1245k5048L6553L5199J3357L248j759n8259m2856M1417
9274C4268N1450n2057k3077O1759k6522N591K9108J596J07J6535K2900Q704J7923
$$ plain form
9358 78942 128804 148032 118825 140192 160937 135276 94261 53222 90166 98951 74600 101772
9346 101772 166781 179984 168806 135307 36705 19975 57416 89644 88701 103706 150515 112696
9334 112696 82898 44755 -18246 23438 58153 24967 70738 68830 72215 90145 149011 168358
9322 168358 185296 153408 117212 116877 135145 154540 151064 98886 122073 177368 120033 89799
9310 89799 155907 227240 165849 25619 -207 28267 17428 52144 49708 76515 104456 170477
9298 170477 139382 106355 69781 71198 117393 151641 140062 92964 104053 138254 93109 91383
9286 91383 78705 21171 32416 7368 43921 79120 92477 95725 93966 35707 -7149 34268
9274 34268 85718 33661 10584 72343 45821 51412 80520 82116 82223 98758 121658 130362 148285
9261A48285l8726J9268L8916l8337p920L1215n9397l5274l904l1575L3329K588
9249E8468M4937K4677k2813j8234M4977J528m6925n5823n6623M9676N200R202
9237C8247q057l0258M5260J4585k51R118l2048m1082L3594M4910p528N3170K5479
9224A45139o7134q5263o5528J3447M0919P177l0038N0278O565M9081J9290k0342
9212F3591k49j6380m216N0235K2747M0286Q3312N6202k1938p5357q2706l8807
9200G6720Q036m4584j4681j550K2173P481R767J2286n0696m4633m2424N4327Q845
9187A067m2263K7185J030M7270j3405m1028r917k983L7340q013O6004J5749l0480
9174D7556k4445j1691k0301J8834L1324j9458k2823L0331K1395m3931M1299M0046
$$ plain form
9261 148285 109559 128827 167743 129406 121486 152701 93304 58030 54126 22551 55880 58468
9249 58468 103405 128082 105269 87035 132012 133540 86615 30792 -25831 23845 29045 38247
9237 38247 30190 -68 45192 59777 59526 68644 36596 -4486 29108 74018 66490 119660 145139
9224 145139 78005 -7258 -72786 -59339 -18420 -11243 -41281 8997 15562 64643 83933 63591
9212 63591 63342 46962 42746 92981 115728 156014 239326 295528 273590 198233 115527 76720
9200 76720 84756 40172 25491 23941 46114 53595 63362 75648 24952 -19681 -62105 -7778 1067
9187 1067 -41196 -14011 -12981 34289 20884 -20144 -30061 -33044 4296 -3717 62287 78036 47556
9174 47556 23111 11420 -8881 9953 41277 21819 -1004 29327 50722 6791 48090 88136
9162H8136j452k2094l290k9176M4265R1449J0053k6627o5878O8802K1511m0176
9150A35523j6939m378j7154k9870l6645q677M2722M6727m0246p242L3719L612
9138A01152l8005L060J361L8061k0110k9611k6168J8375m1926k9206l9902l4969
9126i7888J9396K4586P0542K5518J0014j6203k836l9371k9199J0343M2402M5746
9114F3050N3720l760k5874o7014n6812k3494O7694m8219l7818M95K3294P2215
9102A7477n2021K6969L7926M1041J2476j488n2097Q838N3501L2270J6771L3526
9090A75189K8379j7456o9744o0371j7962J8734j7783k6422l92O3105L1472K6764
9078A33513k8348m5548l7299J454J4808J1967K5869l0453l4307Q113J9599J8154
$$ plain form
9162 88136 86684 64590 61300 32124 76389 167838 177891 151264 85386 154188 175699 135523
9150 135523 118584 114206 97052 67182 30537 21860 64582 111309 71063 63821 97540 101152
9138 101152 63147 66207 67568 105629 85519 55908 29740 48115 6189 -23017 -62919 -97888
9126 -97888 -78492 -53906 16636 42154 52168 35965 33129 -6242 -35441 -25098 17304 63050
9114 63050 116770 113010 87136 20122 -36690 -60184 7510 -40709 -78527 -78032 -54738 17477
9102 17477 -34544 -7575 30351 71392 83868 82380 30283 39121 92622 124892 141663 175189
9090 175189 203568 186112 116368 55997 38035 56769 38986 12564 12172 75277 106749 133513
9078 133513 105165 59617 22318 23772 38580 50547 76416 45963 11656 19769 39368 57522
9066E7522o944N2587L7805K5229o7195j0101K4628J8970J6504Q738k3435p2911
9054F1397o6461L3724P1631j5107p9401J9327K3058K0093J8674j2536r915j5299
9042D9185n8420R67L8581K4031M3595j1269m070q796n124M968k4956P9336N047
9029A33075o9193l1116n6396l3403Q4720j2084l8229k0946K0685L7465l0210j1619
9017b7251j6700j9681L9524N187l985K8886N459L2143L5958n292K7389q0778m288
9004A6571O6929M202O774l8436m8316j2818L3564K8058Q3270O244m6203m4451
8992E5388o9867p6362O6410M0735M033J072j6027N7554j9158n1064L9537J6129
8980D8380m3001o0262o230L7707j5594N777m879K130L1190P4798K7158k7516m0490
$$ plain form
9066 57522 50578 103165 140970 166199 99004 88903 113531 132501 149005 157743 134308 61397
9054 61397 -5064 28660 100291 85184 5783 25110 48168 68261 86935 74399 64484 49185
9042 49185 -9235 -8268 30313 54344 97939 86670 82600 73804 68680 73648 48692 128028 133075
9029 133075 63882 32766 -23630 -57033 27687 15603 -22626 -43572 -22887 14578 -15632 -27251
9017 -27251 -43951 -63632 -24108 -18921 -22906 5980 11439 43582 79540 74248 101637 20859 16571
9004 16571 83500 87702 94476 56040 7724 -5094 28470 56528 139798 146042 99839 55388
8992 55388 -14479 -90841 -24431 16304 20337 21409 5382 62936 43778 -7286 32251 48380
8980 48380 5379 -54883 -61113 -23406 -39000 -33223 -38102 -35972 -4782 70016 97174 69658 29168
8967B9168k7856J6034J2518J9667m7637k2699J9135N3009M3304L7605J6608l3834
8955A15022n7249j1925l2807J314P380M7548k8395n3730j5836l2806M615K619
8943e4250J00020N8587k0995j7444L7651l4979m4112n6020j0730k2029L1416j6273
8931d9158j059K5984L1124l9665m5396K123M5148L5947L3383k0036j6544m5142
8919d3291j5845M4258k1844J169l822K2846J6291O0780N7925k1247l2971J0248
8907G4497j7351n817O449k5216l2571K2543l0880j1923N7573K5403K0718L5585
8895A19010j2940p5987k1378J6377k9838J1250L6622l6567J243j5860l0575K6211
8883a2432N6824K7229K2303j6363K1565k9279j1874m4451j2577M6296K4220j7245
$$ plain form
8967 29168 1312 17346 29864 49531 1894 -20805 -1670 51339 94643 132248 148856 115022
8955 115022 57773 45848 13041 14355 21735 69283 40888 -12842 -28678 -61484 -56869 -54250
8943 -54250 45770 104357 83362 65918 103569 68590 24478 -31542 -42272 -64301 -32885 -49158
8931 -49158 -50217 -24233 6891 -32774 -78170 -76047 -30899 5048 38431 18395 1851 -43291
8919 -43291 -59136 -14878 -36722 -35553 -39375 -16529 -238 60542 118467 97220 64249 74497
8907 74497 57146 51329 57778 32562 -9 22534 -8346 -20269 37304 62707 83425 119010
8895 119010 106070 30083 8705 25082 -4756 6494 43116 6549 7792 -8068 -38643 -12432
8883 -12432 44392 71621 93924 77561 99126 69847 57973 13522 945 47241 71461 54216
8871E4216m5471M6063K6103J7779O933l1342L1490N69l3815l9398L7148K2726
8859I3001J3371J5474Q882k1814m5934L3308N8146j1589k6715l2327n0734K9106
8847F2175J2578K49j1207j6451n1020j6965j6274j5266J5744o493k1195O3960
8835a65M2937L4768l5276r128j8548r0513K1277R1818L4943j0967J860R2697L294
8822A58997k6718m1244k6018J8172J4123L0577p3261m089J045k530J7233l3K807
8809F9061O751o047J2642L266K2892j8547l1972l3253K544K7535K7285l8350k1978
8796B1829J1172K6924L0N9105K732Q2230j8029j27011n9443k1047k5179M1180
8784e507O2609K0492m8762l9554k4530l4701K7300J2000m4790J2546K0389O1144
$$ plain form
8871 54216 8745 54808 80911 98690 105623 74281 105771 106340 72525 33127 70275 93001
8859 93001 106372 121846 130728 108914 62980 96288 154434 142845 116130 83803 33069 62175
8847 62175 74753 75002 63795 47344 -3676 -20641 -36915 -52181 -36437 -42930 -64125 -165
8835 -165 42772 77540 42264 33136 14588 -75925 -54648 37170 72113 61146 63006 155703 158997
8822 158997 132279 91035 65017 83189 97312 127889 54628 50539 51584 49054 66287 66254 69061
8809 69061 75812 69765 82407 85673 108565 90018 58046 24793 27337 54872 82157 43807 21829
8796 21829 33001 59925 59955 119060 121792 204022 185993 58982 -461 -21508 -46687 -5507
8784 -5507 57102 77594 28832 -10722 -35252 -69953 -42653 -30653 -75443 -62897 -42508 18636
8772A8636M2801k909m2007m3871M8468M3436m1434j4474j5014K7198m201l5491
8760a8862K7613M9119j4571J0519M6466n3768k6871r085L0939L4491K9656l6359
8748F9287o6256N2223N3128n915m9401L3898Q135p33l3897l4346k1280n96o481
8735b234K6328K9339k4707k9012L8931L7077m9302L5815K6599O9670l3435o1676
8723F3393R177k6341l3285O5192O9303n4458N928M5642K7824J9201K7892l5743
8711A83725k4326K1955p5221j3113N0402N4476L2868J007l0746o5666o4217K2498
8699I3642p234J7825L4982k1945j6348k890K6911o0562m3525P248j7534K9101
8687C9671p896k197N649N5854k2251m288l2009k7597r570N1157N7812K4352J5792
$$ plain form
8772 18636 61437 58528 16521 -27350 21118 64554 23120 8646 -6368 20830 16629 -18862
8760 -18862 8751 57870 43299 53818 100284 46516 19645 10560 41499 75990 105646 69287
8748 69287 3031 55254 108382 102467 53066 86964 95099 94366 60469 26123 4843 4247 -2234
8735 -2234 24094 53433 28726 -286 38645 75722 26420 62235 88834 158504 125069 63393
8723 63393 72570 46229 12944 78136 147439 92981 98909 144551 172375 191576 219468 183725
8711 183725 159399 181354 106133 93020 143422 197898 230766 231773 201027 135361 71144 93642
8699 93642 86408 104233 139215 117270 100922 98032 124943 64381 20856 28104 10570 39671
8687 39671 31775 29578 35227 91081 68830 64542 32533 4936 -4634 46523 104335 128687 144479
8674A44479J0384L8345J7116o0246l2825K5753m7768Q1686L6674m2084J4959L908
8662A90381j5541n518j120P027l3632l1083N3457P1041j5463m4985l6733k0134
8650A17697J0915O5717k8498J3103k9915j1683M5893Q60n1504K5337L5162n540
8638A87544m517J0691L0548l565K3460r215p630J5052M3518J2919l5220J0945
8626B74530N712l4117L7533J4802N755N5011m1464k2627J4251N0126Q2928O360
8614D48800K2930m149M2170M0771N9588L3560M902L1611R767P401J6856j5594
8602F98613N4681O3936M0718j7813n0728M9410J05469L717K9902R2295J70237
8591A240437J55808L8358k870l9131R004K7568o3607m7715j10420j50091k0299
$$ plain form
8674 144479 154863 193208 210324 150078 117253 143006 95238 176924 213598 171514 186473 190381
8662 190381 174840 169322 168202 175229 141597 110514 163971 235012 219549 174564 137831 117697
8650 117697 128612 194329 165831 178934 149019 137336 183229 184089 132585 157922 193084 187544
8638 187544 183027 193718 224266 220701 244161 234946 227316 242368 285886 298805 263585 274530
8626 274530 280242 246125 283658 298460 304215 359226 317762 295135 309386 359512 442440 448800
8614 448800 471730 467581 509751 550522 610110 643670 648572 680183 689950 697351 714207 698613
8602 698613 753294 817230 857948 840135 789407 838817 944286 948003 977905 1070200 1240437
8591 1240437 1396245 1434603 1431733 1392602 1401606 1429174 1365567 1317852 1207432 1057341 1037042
8580A037042q1533o8850n2462p7811l8504p5447o1949o0637n401q3204m3427L4086
8568D21903m3639o5932J4691j4609l734j0201m7582M4924J8241o7273K3978j919
8556B68848L0472J1812j0282l7804j6234L217L1247k6844K1222Q998o4475L0633
8544B50810R279l0418j3038K0377O607M369n5449j3197m756J87r479J2001l8275
8531A39018L0679K0861l2792K6022O9093n752j6177N2590m8429n9318m0613m2121
8519I3061J3488o6298J4838O6691L5154J1846M1373L1843m436l9805p4577n9839
8507F3339K3693j9790q014N2047J7059L802j108l7460k3499L2280L902K1145n3910
8494G3486r9145K7377k3466j835O6954J6441o539p363k4160O3868J5653J7620
$$ plain form
8580 1037042 955509 886659 834197 756386 717882 642435 580486 519849 514448 431244 387817 421903
8568 421903 378264 312332 327023 312414 308680 298479 250897 295821 314062 246789 270767 268848
8556 268848 299320 311132 300850 263046 246812 250029 281276 254432 275654 284652 220177 250810
8544 250810 260089 229671 216633 237010 243617 247986 192537 179340 174584 174771 165292 177293 139018
8531 139018 169697 190558 157766 183788 252881 247129 230952 283542 235113 175795 135182 93061
8519 93061 106549 40251 55089 121780 156934 168780 210153 241996 237560 197755 123178 63339
8507 63339 87032 67242 59228 111275 128334 132136 131028 93568 70069 102349 106251 127396 73486
8494 73486 -25659 1718 -21748 -23583 43371 59812 53273 45910 21750 85618 101271 118891
8482A18891J9134n27k9940l0198l3489M9742L2763n168j4897P466p929R386K4336
8469A39570o3299Q863P9977J9946p6109p3600n6933J1023m511j5102m4277K9229
8457d5223Q1860Q4165J0631j9778k0825n0272m0270m2776J3078j7653M4025P3917
8445G0879j0305M0122P896K2086L5585J7556k6316j04952o2697M8103J2078J7720
8433F7755p187J0554K3194j0166l4747o2022j885l230J4193o465J2513j8221K5370
8420I656M7777O0415M7504J043j83p51J9102m6575K3069N147k8011n2667k9136
8407E6390l9061K2081L9933m1963n5101l7760J5746R2824K9840l7583M1735N4278
8395A41359r269P096J0919l4394j5550L7751J1084l5246n6301L351p194j060n0437
$$ plain form
8482 118891 138025 137498 107558 77360 43871 93613 126376 121208 106311 113777 105848 115234 139570
8469 139570 76271 85134 165111 185057 108948 35348 -21585 -10562 -15073 -30175 -74452 -45223
8457 -45223 36637 120802 131433 111655 90830 40558 288 -42488 -29410 -47063 -3038 70879
8445 70879 60574 100696 108592 130678 166263 183819 157503 52551 -10146 37957 50035 67755
8433 67755 60568 71122 94316 84150 49403 -12619 -14504 -17734 -3541 -10006 2507 -15714 9656
8420 9656 57433 117848 165352 166395 166212 165461 184563 137988 161057 166204 138193 85526 56390
8407 56390 17329 39410 79343 37380 -17721 -55481 -39735 53089 82929 45346 87081 141359
8395 141359 132090 139186 150105 115711 100161 137912 148996 113750 57449 60800 53606 52546 2109
8382B109J5453j3996m5914m129J0425M4519L1893k1055r551J6612R32J240J4838
8369D3376N8820j4985j7099O6537K9049K1700o1586m8694n2180j646L1610N8013
8357A12915K157n517o2475K4878M2385L790n3184k1903k1028J5003j4940j7157
8345D924M224J2892K8679o5147k5435O1120M7425P976L4487Q791l3935L758l9295
8332E0464n0497K2653k917L5878j2274n0744L7454O1898J4588O047k1898O5310
8320A55962p232p1178j3231l247l7965L1360P9737J8046m0832j7289l9681m517
8308D9933M179j6018K195l1717J6924O5807M1943n4080l6757k395J9857m9858
8296A0013n8621K3366M9485q138j9181R212j0485L6413q7149q073J6272r950K4731
$$ plain form
8382 2109 17562 3566 -42348 -46477 -36052 8467 40360 19305 9754 26366 27298 28538 43376
8369 43376 102196 87211 70112 136649 165698 187398 125812 77118 24938 23292 54902 112915
8357 112915 115072 109555 47080 71958 114343 118133 64949 43046 22018 37021 22081 4924
8345 4924 9148 22040 50719 -14428 -39863 21257 68682 76658 111145 119936 86001 89759 50464
8332 50464 -33 22620 19703 55581 43307 -7437 30017 91915 106503 112550 90652 155962
8320 155962 148730 77552 64321 61074 23109 54469 134206 152252 111420 94131 54450 49933
8308 49933 54112 38094 40289 8572 25496 91303 133246 79166 42409 40014 59871 10013
8296 10013 -48608 -25242 24243 16105 -3076 6136 -4349 32064 -55085 -63158 -46886 -56836 -32105
$$ [...]
##END NTUPLES=NMR SPECTRUM
##END=
