##TITLE=Analysis number 324262
Compound Code cc 52201
Book Reference 467/102
Project Code adrs
Chemist Name benw
##JCAMPDX= 6.0         $$ Bruker NMR JCAMP-DX V2.0
##DATA TYPE= NMR SPECTRUM
##DATA CLASS= NTUPLES
##ORIGIN= Bruker BioSpin GmbH
##OWNER= nmr
$$ XWIN-NMR		Version 3.5
$$ Thu Nov 16 10:08:41 2006 GMT Standard Time (UT+0h)  MAYBRIDGE\nmr@NMR_250MHZ
##.OBSERVE FREQUENCY= 250.131544655141
##.OBSERVE NUCLEUS= ^1H
##.ACQUISITION MODE= SIMULTANEOUS (DQD)
##.ACQUISITION SCHEME= undefined
##.AVERAGES= 16
##.DIGITISER RES= 18
##SPECTROMETER/DATA SYSTEM= dpx250
##.PULSE SEQUENCE= zg30
##.SOLVENT NAME= DMSO
##.SHIFT REFERENCE= (INTERNAL, DMSO, 0, 16.522)
##AUDIT TRAIL= $$ (NUMBER, WHEN, WHO, WHERE, WHAT)
$$ ##TITLE= Audit trail, XWIN-NMR		Version 3.5
$$ ##JCAMPDX= 5.01
$$ ##ORIGIN= Bruker BioSpin GmbH
$$ ##OWNER= nmr
$$ C:\u/data/dgb/nmr/ADRS/440/pdata/1/auditp.txt
$$ ##AUDIT TRAIL=  $$ (NUMBER, WHEN, WHO, WHERE, WHAT)
(   1,<2006-11-16 10:08:10.80 +000>,<MAYBRIDGE\nmr>,<NMR_250MHZ>,
      <created by zg, POWCHK disabled, PULCHK disabled
       configuration hash MD5:
       49 4B E0 1D 92 C2 6B 37 9F E6 65 BC 52 41 86 1D
       data hash MD5: 64K
       95 63 8D 11 E7 F4 81 CF E7 70 55 D2 1C ED 07 FD>)
(   2,<2006-11-16 10:08:29.38 +000>,<MAYBRIDGE\nmr>,<NMR_250MHZ>,
      <Start of raw data processing
       ef LB = 0.3 FT_mod = 6 PKNL = 1 SI = 32K 
       data hash MD5: 32K
       A3 36 50 C7 96 DB 50 35 35 79 5A 2A 64 D4 0C 2D>)
(   3,<2006-11-16 10:08:31.24 +000>,<MAYBRIDGE\nmr>,<NMR_250MHZ>,
      <apk 
       data hash MD5: 32K
       71 C7 19 1F 85 3F 93 80 0A 8F 81 F3 33 DF 10 D2>)
(   4,<2006-11-16 10:08:32.02 +000>,<MAYBRIDGE\nmr>,<NMR_250MHZ>,
      <abs ABSG = 5 
       data hash MD5: 32K
       0B 03 D1 CB 46 B2 37 12 3F 9D 54 8A 93 B1 65 C9>)
$$ ##END=
$$ 
$$ hash MD5
$$ B4 A2 11 A0 76 A4 C1 97 C3 CF 58 1E 6E 05 79 17
##$RELAX= 
##$RELAX= 
##$RELAX= 
##$RELAX= 
##$RELAX= 
##$RELAX= 
##$RELAX= 
$$ Bruker specific parameters
$$ --------------------------
##$DU= <C:\u>
##$EXPNO= 440
##$NAME= <ADRS>
##$PROCNO= 1
##$TYPE= <nmr>
##$USER= <dgb>
##$AMP= (0..31)
100 100 100 100 100 100 100 100 100 100 100 100 100 100 100 100 100 100 
100 100 100 100 100 100 100 100 100 100 100 100 100 100 
##$AQSEQ= 0
##$AQ_mod= 3
##$AUNM= <au_zg>
##$AUTOPOS= <7 >
##$BF1= 250.13
##$BF2= 250.13
##$BF3= 250.13
##$BF4= 250.13
##$BF5= 500.13
##$BF6= 500.13
##$BF7= 500.13
##$BF8= 500.13
##$BYTORDA= 1
##$CFDGTYP= 0
##$CFRGTYP= 5
##$CHEMSTR= <none>
##$CNST= (0..31)
1 1 145 1 1 1 1 1 1 1 1 1 1 1 1 1 1 1 1 1 1 1 1 1 1 1 1 1 1 1 1 1 
##$CPDPRG= <>
##$CPDPRG1= <>
##$CPDPRG2= <>
##$CPDPRG3= <>
##$CPDPRG4= <mlev>
##$CPDPRG5= <mlev>
##$CPDPRG6= <mlev>
##$CPDPRG7= <mlev>
##$CPDPRG8= <mlev>
##$CPDPRGB= <>
##$CPDPRGT= <>
##$D= (0..31)
0 1 0 0 0 0 0 0 0 0.06 0 0 0 0 0 0 0.0002 0 0 0 0 0 0 0 0 0 0 0 0 0 0 
0 
##$DATE= 1163671688
##$DBL= (0..7)
120 120 120 120 120 120 120 120 
##$DBP= (0..7)
150 150 150 150 150 150 150 150 
##$DBP07= 0
##$DBPNAM0= <>
##$DBPNAM1= <>
$$ [...]
##$SUBNAM7= <"">
##$SUBNAM8= <"">
##$SUBNAM9= <"">
##$SW= 20.6930455092707
##$SWIBOX= (0..15)
0 0 3 0 0 0 0 0 0 0 0 0 0 0 0 0 
##$SW_h= 5175.983436853
##$TD= 65536
##$TD0= 1
##$TE= 683.16
##$TE2= 300
##$TE3= 300
##$TEG= 300
##$TL= (0..7)
0 120 120 120 120 120 120 120 
##$TP= (0..7)
150 150 150 150 150 150 150 150 
##$TP07= 0
##$TPNAME0= <>
##$TPNAME1= <>
##$TPNAME2= <>
##$TPNAME3= <>
##$TPNAME4= <>
##$TPNAME5= <>
##$TPNAME6= <>
##$TPNAME7= <>
##$TPOAL= (0..7)
0.5 0.5 0.5 0.5 0.5 0.5 0.5 0.5 
##$TPOFFS= (0..7)
0 0 0 0 0 0 0 0 
##$TUNHIN= 0
##$TUNHOUT= 0
##$TUNXOUT= 0
##$USERA1= <user>
##$USERA2= <user>
##$USERA3= <user>
##$USERA4= <user>
##$USERA5= <user>
##$V9= 5
##$VALIST= <valist>
##$VCLIST= <CCCCCCCCCCCCCCC>
##$VD= 0
##$VDLIST= <DDDDDDDDDDDDDDD>
##$VPLIST= <PPPPPPPPPPPPPPP>
##$VTLIST= <TTTTTTTTTTTTTTT>
##$WBST= 1024
##$WBSW= 4
##$XGAIN= (0..3)
0 0 0 0 
##$XL= 0
##$YL= 0
##$YMAX_a= 373457
##$YMIN_a= -633989
##$ZGOPTNS= <>
##$ZL1= 120
##$ZL2= 120
##$ZL3= 120
##$ZL4= 120
##$ABSF1= 16.522
##$ABSF2= -4.171173
##$ABSG= 5
##$ABSL= 3
##$ALPHA= 0
##$AQORDER= 0
##$ASSFAC= 0
##$ASSFACI= 0
##$ASSFACX= 0
##$ASSWID= 0
##$AUNMP= <proc_1d>
##$AZFE= 0.1
##$AZFW= 0.1
##$BCFW= 0
##$BC_mod= 0
##$BYTORDP= 0
##$COROFFS= 0
##$CY= 12.5
##$DATMOD= 1
##$DC= 0
##$DFILT= <>
##$DTYPP= 0
##$F1P= 14.0000005364418
##$F2P= -0.99999901652339
##$FCOR= 0.5
##$FTSIZE= 32768
##$FT_mod= 6
##$GAMMA= 0
##$GB= 0
##$INTBC= 1
##$INTSCL= 1
##$ISEN= 128
##$LB= 0.3
##$LEV0= 0
##$LPBIN= 0
##$MAXI= 10000
##$MC2= 0
##$MEAN= 0
##$ME_mod= 0
##$MI= 0
##$NCOEF= 0
##$NC_proc= -6
##$NLEV= 6
##$NOISF1= 0
##$NOISF2= 0
##$NSP= 0
##$NTH_PI= 0
##$NZP= 0
##$OFFSET= 16.522
##$PC= 1
##$PHC0= 154.6631
##$PHC1= 6.142257
##$PH_mod= 1
##$PKNL= yes
##$PPARMOD= 0
##$PSCAL= 4
##$PSIGN= 0
##$REVERSE= no
##$SF= 250.13
##$SI= 32768
##$SIGF1= 0
##$SIGF2= 0
##$SINO= 400
##$SIOLD= 32768
##$SREGLST= <1H.DMSO>
##$SSB= 0
##$STSI= 32768
##$STSR= 0
##$SW_p= 5175.98343685301
##$SYMM= 0
##$S_DEV= 0
##$TDeff= 65536
##$TDoff= 0
##$TI= <Analysis number 999999
Compound Code 99
Book Reference 9
Project Code 9>
##$TILT= no
##$TM1= 0
##$TM2= 0
##$TOPLEV= 0
##$USERP1= <user>
##$USERP2= <user>
##$USERP3= <user>
##$USERP4= <user>
##$USERP5= <user>
##$WDW= 1
##$XDIM= 32768
##$YMAX_p= 403262052
##$YMIN_p= -366825
$$ End of Bruker specific parameters
$$ ---------------------------------
##NTUPLES= NMR SPECTRUM
##VAR_NAME=  FREQUENCY,     SPECTRUM/REAL,   SPECTRUM/IMAG
##SYMBOL=    X,             R,               I
##VAR_TYPE=  INDEPENDENT,   DEPENDENT,       DEPENDENT
##VAR_FORM=  AFFN,          ASDF,            ASDF
##VAR_DIM=   32768,         32768,           32768
##UNITS=     HZ,            ARBITRARY UNITS, ARBITRARY UNITS
##FACTOR=    0.157963299565203, 1,           1
##FIRST=     4132.6476996994, 0,             0
##LAST=      -1043.33573715361, 0,           0
##MIN=       -1043.33573715361, -366825,     0
##MAX=       4132.6476996994, 403262052,     0
$$ Real data points
##PAGE= N=1
##DATA TABLE= (X++(R..R)), XYDATA
$$ [...]
23375b1584P658k0400j3415Q1145M2999P250k5478n7119j828m8375j5935M3438
23363b1644N6317M8789N3600K040q5823j31607N5616M2628M400l8227M1918N6070
23351H4077j7101l6571j7320j1463l7263o826j0666L4810J3786M364N523K9143
23339C4493m8131n77K6453M3343k9098j9591K2764q2260j4640K5171O5492N7042
23327H0461K3111K7754p7650r5545o635L2063J51690N5293k0943l9390J5231m6754
23315I8686q0178r802N696K7714J039K855m3980o1936q950N4927o7321l8425n8941
23302a78616M2633L2346p817L9260N4265J4472L0422K2490m3645j5776l1997N098
23290c6865j2486l2972K581P5405P0926m245j20351m3791p9676r224M0974K9643
$$ plain form
23375 -21584 -13926 -34326 -47741 33404 76403 83653 58175 1056 -772 -49147 -65082 -21644
23363 -21644 34673 83462 137062 139102 53279 -78328 -22712 19916 24316 -13911 28007 84077
23351 84077 66976 30405 13085 1622 -35641 -42467 -53133 -18323 -4537 -173 5350 34493
23339 34493 -13638 -14215 12238 55581 26483 6892 29656 -52604 -67244 -42073 23419 80461
23327 80461 103572 131326 53676 -41869 -48504 -16441 135249 190542 169599 130209 145440 98686
23315 98686 18508 8706 14402 42116 43155 46010 2030 -59906 -68856 -13929 -81250 -119675 -178616
23302 -178616 -135983 -103637 -111454 -72194 -17929 -3457 26965 49455 5810 -9966 -41963 -36865
23290 -36865 -49351 -82323 -79742 -4337 66589 62344 -58007 -101798 -181474 -190698 -149724 -120081
23278a20081k9369m19O9622J2568Q7612N7236L0950L1818q0639j15765N4400P3334
23266G1267r530l720P411l8648n1044K0519J30176M2708J4982n5924j18817o2816
23254e3436N3696N3839n5921k3663j9922m9456O8820K8931k9326M966K5836q1230
23242g6866o8801n61M7023O5099J081M9910j8182Q44M0457L9496K2294l3293P876
23229G6377j9700j7398m392n981j0719o8132p59p114m8882k1594J00338P1499
23217D3543q119m9711k1875N2522K054M2696K0993j4022K4939K5324q0189l7075
23205A080J13114K4306L6345l1864k4204k4232P900k6052R9643M2038n8631m2309
23193A17134p3734r1351J275M4367J9070q7485l9174M1085m2257m4643P5988M3781
$$ plain form
23278 -120081 -149450 -149869 -80247 -67679 19933 77169 108119 139937 59298 -56467 -2067 71267
23266 71267 61737 58017 65428 26780 -24264 -3745 126431 169139 184121 128197 9380 -53436
23254 -53436 260 54099 -1822 -25485 -45407 -94863 -26043 2888 -26438 -21472 4364 -76866
23242 -76866 -145667 -146228 -99205 -34106 -33025 16885 -1297 -453 40004 79500 101794 68501 76377
23229 76377 56677 39279 34887 28906 18187 -49945 -50704 -57818 -106700 -128294 -27956 43543
23217 43543 35424 -14287 -36162 16360 18414 61110 82103 68081 93020 118344 38155 1080
23205 1080 114194 138500 174845 142981 118777 94545 102445 76393 176036 218074 159443 117134
23193 117134 43400 -47951 -46676 -2309 16761 -70724 -109898 -68813 -111070 -155713 -79725 -35944
23181c5944J9724M9418j5055N810n1996r799K4108O2523q916p2450J4481o5050
23169h3146P389J0087j4106N542k5763o7558n6475J4247N8042O0374l631J4269
23157h0729J9316J7569L8274L3947n764m2958q65k3144M346q2772p010J03748
23145b6042O9411o5751j02876Q5499N6176L5386q6954k2192o5254k4168L5827
23134a10938R4668O1728j9832j5671k1996K8378k4231J8778J0068J0951n0257
23123a8354m947R9677p1675o1160L7107l8j4817O0634K0393J2387L2770O3485
23111A55462k7212l5475l2647K3631m5560q1956j6348O369L0528Q3937J3486l0779
23099D3436n669N3770P823J2709n9491M7367K0886K3493m0363l1140k3242r0866
$$ plain form
23181 -35944 -16220 33198 18143 23953 -28043 -37842 -13734 48789 39873 -32577 -18096 -83146
23169 -83146 -75757 -65670 -79776 -74234 -99997 -167555 -224030 -209783 -151741 -91367 -94998 -80729
23157 -80729 -61413 -43844 -5570 28377 22613 -20345 -21210 -44354 -40008 -122780 -129790 -26042
23145 -26042 43369 -22382 -125258 -39759 16417 51803 -35151 -57343 -122597 -146765 -110938
23134 -110938 -16270 45458 25626 9955 -12041 16337 -7894 10884 20952 31903 -18354
23123 -18354 -23301 76376 4701 -56459 -19352 -19390 -34207 26427 46820 59207 91977 155462
23111 155462 128250 92775 60128 83759 38199 -43757 -60105 -53736 -23208 60729 74215 43436
23099 43436 37767 91537 99360 112069 52578 99945 120831 144324 103961 72821 49579 -41287
23087d1287l617k5328O752N7076J4162q79n0321m5520k7284m531j4692K8953L8247
23074f8269L8860k099k3504k0687R7215M8573r189k6067p6715j8389n3180m0038
23062a53489j4873M3387K360J5420P6171P1487P480j14859l6001K5280N6655J820
23050a9162L2846L616M0272l178L6071l9196k2842M591J8996J129J1992l8430
23038B6705p1442l5665K9567J3101J6558K0657j7910k597J9340j4849j9397L4390
23026a542R92J8040P4305j8473n2481q1074j7043N6700j7231j22L7289L1471N2140
23013H2971K056m0219n8036k6777Q4180L0436n8438l8022n7994L6569l2429o1196
23001a36899J894K314K3698O5788n0114o0523l9522L6006L6169J1628R1552J21731
$$ plain form
23087 -41287 -44904 -70232 -63480 -6404 7758 6879 -43442 -88962 -116246 -120777 -135469 -106516 -68269
23074 -68269 -29409 -31508 -55012 -75699 21516 70089 60900 34833 -41882 -60271 -113451 -153489
23062 -153489 -168362 -124975 -122615 -107195 -31024 40463 47943 -66916 -102917 -77637 -20982 -19162
23050 -19162 13684 17300 57572 54394 90465 51269 28427 33018 52014 53143 65135 26705
23038 26705 -44737 -80402 -50835 -37734 -21176 -519 -18429 -21026 -1686 -16535 -35932 -1542
23026 -1542 -550 17490 91795 73322 20841 -60233 -77276 -20576 -37807 -37929 -640 30831 82971
23013 82971 85027 44808 -13228 -40005 44175 74611 16173 -21849 -79843 -43274 -75703 -136899
23001 -136899 -135005 -132691 -108993 -43205 -93319 -153842 -193364 -157358 -121189 -109561 -18009 103722
22989A03722k0132r1099k992J9069l4474P038L9490L4595J5671m5101L7450J3667
22977G6904p1967l1734j611l191P0762n1639O520N71k0618P4142r3885l6031j3775
22964i5552O142P3773N629k3L1554m8679l6339j7344O2276K1762O701O5115K2388
22951I7403m6388k0695J7111k0696K42p7189k7071k5865O857N6223N6914J8581
22939C5427m6688m9911N4556N4674l8707j08113k7303k7627M7272K9877R656M1416
22927b5471M7731J7795q1041j9251J66075Q6394o4227l5419L6829k9227r2416
22916G772J0500O8145o133K0327L2370K290q7516o2154K8407L2342m1593J3566
22904A8323O6032K3102k1234m9443n2909Q6756L1549M267p4093n8175J9806J7298
$$ plain form
22989 103722 83590 -7509 -10501 8568 -25906 -18868 20622 55217 70888 25787 63237 76904
22977 76904 4937 -26797 -28408 -31599 39163 -12476 -5956 -5385 -26003 48139 -45746 -81777 -95552
22964 -95552 -89410 -15637 -10008 -10031 21523 -27156 -63495 -80839 -18563 3199 9900 75015 97403
22951 97403 51015 30320 47431 26735 26977 -50212 -77283 -103148 -96291 -40068 16846 35427
22939 35427 -11261 -61172 -6616 48058 9351 -98762 -126065 -153692 -106420 -76543 -66887 -25471
22927 -25471 22260 40055 -40986 -60237 105838 192232 128005 92586 129415 100188 7772
22916 7772 18272 86417 80284 100611 132981 135271 47755 -14399 14008 46350 4757 18323
22904 18323 84355 107457 86223 36780 -16129 70627 102176 106443 32350 -25825 -6019 11279
22892A1279j012m0964O752M6064J8554R3297L7010n7460k7303N6846k3519j5220
22880A04324l5268Q693K6452l3232j4197K8714K5819o1062k6231M1645j7957r2572
22868d4872l3759M5271N8716J0049M7743m967o313M7551Q619j1916p530j3311
22856I5281N7578R583j1401n1603j08617P898o2954J9892J19275M2781p2044M4060
22844H9729j8446j14531o2772q963l7850O1899L4527Q613O1671M6692j1182r017
22832D0370k6357n1859J9235N0200n974J6221L9074K232p038L6097k6544j4969
22820G0688L844J36k336J397L802j0536k5224r406L0933L3059k1929J0628o7258
22807A7798k7809L1920m5638o6936K3352L3115n0221K3871L8586N1120r420l9858
$$ plain form
22892 11279 10267 -30697 -23945 22119 40673 133970 170980 113520 86217 143063 119544 104324
22880 104324 69056 77749 104201 70969 56772 85486 111305 50243 24012 65657 47700 -44872
22868 -44872 -78631 -33360 25356 35405 83148 78181 71868 119419 128038 116122 108592 95281
22856 95281 152859 162442 151041 99438 -9179 -1281 -64235 -44343 74932 117713 45669 89729
22844 89729 71283 -43248 -106020 -114983 -152833 -90934 -56407 -47794 13877 60569 49387 40370
22832 40370 14013 -37846 -18611 31589 25615 41836 80910 83142 76104 112201 85657 70688
22820 70688 74532 74668 72332 73729 77531 66995 41771 32365 63298 96357 74428 85056 17798
22807 17798 -10011 21909 -23729 -90665 -67313 -34198 -84419 -60548 -21962 29158 19738 -20120
22795b0120P90m03p904M2102j6532p654j8535j1576M0106J7762o837p5209m2683
22782a06693p400K2255K4507k3966N5606O2937O9325j1297j01448M5744l2774
22771c204k7715p3730k7095P3594N9501J4237l8074J0296K8180L5965j09887o3080
22759a21012P8440N0181P300n2333r1203Q618M2383M4664l2964O8531L1424m382
22747B9647P428L1344J6341r673O990r3245n9494L0955N7561M8447J4515o6610
22735A4206n4636j3289N5555j420N258L1576L0902n0387k81L9788J2097m1078
22723B8291m248p012m8934p5487r4543O1675P5196M3283J04830K1559o8270m8391
22711a2051m7487N5322L5920k7245n6884O439K1950N4582o0654K4421J6018L8122
$$ plain form
22795 -20120 -19330 -19733 -27637 14465 -2067 -9721 -28256 -39832 274 18036 11199 -64010 -106693
22782 -106693 -114093 -91838 -67331 -91297 -35691 27246 96571 85274 -16174 29570 -3204
22771 -3204 -30919 -104649 -131744 -58150 1351 15588 -22486 -12190 15990 51955 -57932 -121012
22759 -121012 -42572 7609 14909 -37424 -128627 -120009 -77626 -32962 -65926 2605 34029 29647
22747 29647 37075 68419 84760 75087 82077 -11168 -70662 -39707 17854 66301 80816 14206
22735 14206 -40430 -53719 1836 416 5674 37250 68152 17765 17484 57272 69369 28291
22723 28291 24043 17031 -31903 -107390 -201933 -140258 -65062 -21779 83051 104610 36340 -12051
22711 -12051 -59538 -4216 31704 4459 -52425 -45986 -24036 30546 -30108 -5687 10331 48453
22699D8453m570K085K7269j6636n1580L6691Q841q8866N2201K6242n1916l1454
22687d3240J7154p2620J3305P499M7570K6144n9441P2732K4935L0182J4197K1359
22675I9776l4686K1292L2568k4800q4009p7904k9792l1597N0055J04599M2991
22664F8493j06281L403k1850L7055k8106l3734M7212K9560O7389m6557M9543L3745
22652I9872j1171n692j11352m5764l0295L3249N4473L83p4015r942L6908Q403
22640e4943J4163J2545q296J8318M1922K8313P4966j0579m8578r2091l3739N1978
22628f021L4101L6331J2958p3124o2920M411N3746n7746P1941K142K4914q1361
22616d0628l608k4313N666m5246j029J43771J678J4109o0762m8367K8135J19235
$$ plain form
22699 48453 43883 45968 73237 56601 5021 41712 50553 -38313 13888 40130 -11786 -43240
22687 -43240 -26086 -98706 -85401 -77902 -30332 -4188 -63629 9103 34038 64220 78417 99776
22675 99776 65090 86382 118950 94150 10141 -67763 -97555 -129152 -79097 25502 68493
22664 68493 -37788 -34385 -56235 -19180 -47286 -81020 -33808 -4248 63141 16584 66127 99872
22652 99872 88701 83009 -28343 -74107 -104402 -71153 -16680 -16297 -90312 -100254 -63346 -54943
22640 -54943 -40780 -28235 -36531 -18213 23709 52022 126988 116409 67831 -24260 -57999 -6021
22628 -6021 28080 64411 77369 4245 -58675 -54264 -518 -58264 13677 15819 40733 -40628
22616 -40628 -44236 -68549 -62883 -108129 -109158 34613 36291 50400 -10362 -58729 -30594 88641
22604H8641K7998M5917m2196o4730o570K7078l2244p164N5233P9689n5406r8856
22592A7390n3312K3869J7555L7590O3723k7640l8045J9930K4487k444k7335q5368
22580b9600m2571l7789R789K4787k8710N5462P0240J5970o7544P376k6256m5097
22568i3943j3614J881M0110l9944j4343K2205M6596P4120O1609l5373l8456k3493
22556a2645n3484j118l5679j1677K0660l4706j9827j5720J27476M5637L9987k6125
22544B2779k6616K8759J4154j5800J7378L9824q657p5512N0270J7695R749L4554
22532A08577L6801P491j92071j75338K8344J45237O6327l4829P911n6762N268
22521e3044J00952L8712k5761p1092j9935L8931K0773j1830o2163j9404M55L0843
$$ plain form
22604 88641 116639 162556 120360 55630 49060 76138 43894 36730 91963 171652 116246 17390
22592 17390 -35922 -12053 5502 43092 106815 79175 41130 61060 85547 83103 55768 -29600
22580 -29600 -72171 -109960 -100171 -75384 -104094 -48632 21608 37578 -29966 -22590 -48846 -93943
22568 -93943 -107557 -105676 -65566 -105510 -119853 -97648 -51052 23068 84677 49304 10848 -12645
22556 -12645 -66129 -67247 -102926 -114603 -93943 -128649 -148476 -164196 -36720 8917 48904 22779
22544 22779 -3837 24922 39076 23276 40654 80478 71821 -3691 46579 64274 74023 108577
22532 108577 145378 152869 -39202 -214540 -186196 -40959 25368 -9461 -1550 -58312 -53044
22521 -53044 47908 86620 60859 -10233 -30168 8763 29536 17706 -44457 -63861 -63406 -32563
22509c2563R3241M7152j56335j66316M8935P3439O4255L5548k4581M9113M4952
22498G6840p3488J3625J9142N54P4312j3895L9878k9521k9525n696l58j4682r54
22485E6232L759J3498l7609q8434k1372j1089O4955K0595m9573n6313J8687P265
22473g9399J7070l29L0662k5296J7016R2400R6765P006j8438o0966n1796n3117
22461b8422j241K7481M779n1128k5550N7636m2528n6304L3756N1313n1480M2831
22449c8857M4500J0001p1134r0170n5450J9475O1573Q7728k5869k7842J4413N4811
22437a6821k338L0051k1344m1336k0897N7584k3252l5803n3024K0062N6086K7248
22425b3784L6448L1330K5551j0415o555l1420k0866P082P9164N7251M3783q2899
$$ plain form
22509 -32563 60678 107830 -48505 -214821 -165886 -92447 -28192 7356 -17225 31888 76840
22498 76840 3352 16977 36119 36673 110985 97090 136968 107447 77922 72226 71868 57186 56232
22485 56232 59991 73489 35880 -52554 -73926 -85015 -20060 535 -49038 -105351 -86664 -79399
22473 -79399 -62329 -62658 -31996 -57292 -40276 52124 148889 155895 137457 76491 24695 -28422
22461 -28422 -29663 -2182 2597 -48531 -74081 -16445 -58973 -115277 -81521 -30208 -81688 -38857
22449 -38857 5643 15644 -55490 -145660 -201110 -181635 -120062 -32334 -58203 -86045 -71632 -16821
22437 -16821 -19159 10892 -10452 -51788 -72685 -15101 -38353 -74156 -127180 -107118 -51032 -23784
22425 -23784 12664 43994 69545 59130 52575 21155 289 7371 86535 143786 187569 104670
22413A04670n4664L2290l4536P3879N0408m9193o9799q731K3419p4019l160N073
22401d363J1905O0319r0690o4436k815J5021Q7761M1839j24148m4689N326l3403
22389a42373m904o1446M5062Q1366Q647m0041l0410m2084N6416J03928N958K5896
22377F015P1674N6275p9927j8901k6249J7342J3323m034R1171J3688q7372l5257
22365A7748O367K4734n0872M812L1526L5912K6307p1947k2010l3002n7649N353
22353h2721J00149J9046r437k7773K9619M1199p896K4482R67N5388m8908j04872
22341a0757j7365k0091O579L5269N9723K5865k4063K652N715j7808k3496j6644
22329E579O4005j8056m3990O3376L8372P3323l8774o1967j0273K2119j1583J7564
$$ plain form
22413 104670 50006 82296 47760 121639 172047 122854 53055 44324 67743 -6276 -9436 -4363
22401 -4363 7542 67861 -22829 -87265 -90080 -75059 12702 54541 -69607 -114296 -108970 -142373
22389 -142373 -147277 -208723 -163661 -82295 -73648 -113689 -144099 -186183 -129767 -25839 -19881 6015
22377 6015 77689 133964 54037 35136 8887 26229 39552 35518 126689 140377 53005 17748
22365 17748 24115 48849 -2023 2789 34315 70227 96534 24587 2577 -30425 -88074 -82721
22353 -82721 17428 36474 27037 -736 28883 70082 62186 86668 87635 143023 94115 -10757
22341 -10757 -28122 -48213 -41634 -6365 53358 79223 55160 57812 63527 45719 22223 5579
22329 5579 69584 51528 7538 70914 109286 182609 143835 81868 71595 93714 82131 99695
22317I9695n4992o406L7778L1760o2765m7564k8476l614m1506K8981J23718M4962
22305A21571L117j18933q2703r391l505P037O6580j9594J3163r167k6384L3008
22293b5201R1872q681K0157L1584r0640k0199J8561N364p1865l2051J06654J7488
22281D3043q2636q56L0835n4264p4453J2449Q6968L729k338o32o4941K6118k388
22268g9366k1272k3954j9085p562P0555N5815J1084J5972M3475j3403l1167L5399
22256C6491J623J120n7229J0828n7886k4720j9731k4732M9393J03677p132k4962
22244a3260r0191M3138L9025M5044Q835K692K580J2265K9878L7530j0056m1141
22232F6339j199k6190o3998J8549J1635K2402l7246q2248O942Q5600P3873o6348
$$ plain form
22317 99695 44703 38297 76075 107835 45070 -2494 -30970 -34584 -76090 -47109 76609 121571
22305 121571 124688 5755 -76948 -86339 -89844 -82807 -16227 -35821 -22658 -31825 -58209 -25201
22293 -25201 66671 57990 78147 109731 19091 -1108 17453 22817 -49048 -81099 25555 43043
22281 43043 -39593 -40449 -9614 -63878 -138331 -125882 -38914 -35185 -37523 -38155 -103096 -76978 -79366
22268 -79366 -100638 -124592 -143677 -151239 -80684 -24869 -13785 2187 45662 32259 1092 36491
22256 36491 38114 39234 -17995 -7167 -65053 -89773 -109504 -134236 -84843 18834 11702 -13260
22244 -13260 -103451 -60313 -21288 23756 32591 35283 37863 50128 80006 117536 107480 66339
22232 66339 65140 38950 -25048 -6499 5136 27538 -9708 -91956 -85014 586 74459 8111
22220H111o1291l5555l7787K8547O5943N7468Q522n1765o966N5322n091o0310
22208c4852k7413J5492M9412q6901J3657J01067j3614q5532P536O9557J8876K7728
22196E5013l4676q8338j8274P653M4510M393r5082q490O2831P2620k4222J4019
22184h043J09946j348j02485j28981j0517L7379K5272J2844k0101k9271m4778
22173a60083N3996L9094k3954P49N6620r933j0710l0322K0696k6578M7398m9250
22161i2277N7620R5969M2133n0063n9753j5525r1358J8120L3268O4028M0870K408
22149D5440J1663j140j6860k958J2973j428l3499r4134j9338J17395M4733m4533
22137A8314p523O3648J8471J7605l9656o8163N5455K7674J5432k9263Q490j1541
$$ plain form
22220 8111 -53180 -88735 -126522 -97975 -32032 25436 33958 -17807 -24773 30549 25458 -34852
22208 -34852 -62265 -46773 2639 -84262 -70605 30462 16848 -68684 -61148 8409 27285 55013
22196 55013 20337 -68001 -86275 -78622 -34112 -29719 -124801 -133291 -70460 2160 -22062 -8043
22184 -8043 101903 100555 -1930 -130911 -141428 -104049 -78777 -65933 -86034 -115305 -160083
22173 -160083 -106087 -66993 -90947 -90198 -33578 -43511 -54221 -84543 -63847 -90425 -43027 -92277
22161 -92277 -34657 61312 103445 53382 -6371 -21896 -113254 -95134 -61866 2162 43032 45440
22149 45440 57103 55963 39103 36145 49118 47690 14191 -79943 -99281 18114 62847 18314
22137 18314 10791 74439 92910 110515 70859 2696 58151 85825 101257 71994 80484 68943
22125F8943J5318o0439p8613k8549J2581n9709J0765J6191M4110j3139M6937R0230
22113F4626L4820P6858k8012o326q3933r5400L3428O2304l6607J7311M7751k2709
22101F4111r8209k5218M6887o6195P5793N0690l0036m9206l2999K3879J11762
22090G1259j7327n9701M3303o0162k0369j1631R452m1394J9465K2018K9231j1784
22078b7640J17598J8329n2188J8827m9365l6572l7262N197J01916l441l4657m3986
22066b3244m1010J0125r049r090J1836L0228R2940O2421r7935j69289p569O9145
22054h0491J8889k7929P3546J2354L2393N460M1246j1029r3947L3622L5487M008
22042D3609n9231j8155M8350L3961m3163k4228K3801n1136L2109J9853J7798L1474
$$ plain form
22125 68943 84261 23822 -54791 -83340 -70759 -130468 -119703 -103512 -59402 -72541 -25604 64626
22113 64626 99446 176304 148292 141966 58033 -37367 -3939 58365 21758 39069 86820 64111
22101 64111 -34098 -59316 -12429 -78624 -2831 47859 17823 -31383 -64382 -40503 71259
22090 71259 53932 -5769 37534 -22628 -42997 -54628 -45176 -86570 -67105 -45087 -15856 -27640
22078 -27640 89958 108287 56099 74926 25561 -11011 -48273 -43076 58840 55399 20742 -23244
22066 -23244 -64254 -54129 -63178 -72268 -60432 -30204 62736 125157 27222 -142067 -149636 -80491
22054 -80491 -61602 -89531 -15985 -3631 28762 34222 75468 64439 -29508 4114 39601 43609
22042 43609 -15622 -33777 14573 48534 5371 -18857 4944 -46192 -14083 5770 23568 55042
22030E5042O4224m621o2074r5284l2857o7712P1190N1163N8300j9385p0403j1248
22018f3665j6126o6677M2453N3925j1321j9432K3264M3273Q142L2851L9886m720
22006F1853m122j04361J8028N3392N9924K9765o1958k2250j9436J08102J7076
21995A36013o7965r7569k1126J180N1458Q3060l0385m0689m9250m1064o26M449
21983g2514m042M6699J1959R682n1045M7111P751q84J9107N8911j4814k6769L5877
21970F7029m4133j11073p3284P4001j0803L2254M5041J1892K6074j4191L1790
21959C4597K8257p3287M8Q2352l2142l030k4936n1171J8804m4707P6246j674m0587
21946c1230O465O9161k0434q1756o4748Q5945M5928o7992J115O7668K9611k2834
$$ plain form
22030 55042 119266 114645 52571 -42713 -75570 -143282 -72092 -20929 37371 17986 -52417 -63665
22018 -63665 -79791 -146468 -104015 -50090 -61411 -80843 -57579 -14306 -6164 26687 66573 61853
22006 61853 57731 -46630 -28602 24790 84714 114479 52521 30271 10835 118937 136013
21995 136013 68048 -29521 -50647 -49467 1991 85051 54666 13977 -35273 -76337 -76963 -72514
21983 -72514 -76556 -29857 -17898 -8216 -59261 -12150 -4399 -5283 13824 72735 57921 31152 67029
21970 67029 22896 -88177 -161461 -87460 -98263 -66009 -20968 -9076 16998 2807 34597
21959 34597 62854 -10433 -10385 71967 39825 36795 11859 -39312 -20508 -65215 11031 9357 -31230
21946 -31230 -24765 44396 23962 -57794 -122542 -36597 9331 -58661 -57546 10122 39733 16899
21934A6899O975K3707J7673O8589N4283q1147R859r946m3503k6288j4631j4321
21922H149n0993q1646k4414J6190l057M8648Q1531O5115k3736l1180l1546j14414
21910a41353j616P0323K1736l7511J8475J1951J9084K6253n4157K6011M7035M8526
21898E4757r628L247k237p3726J2330N7487Q45J5979l6539o5645j9789J06518
21886D3599J7514L522Q0772N3777M53o440r0570r0292m7391j3675k802N099l6320
21873h2754j7121M1275P3304m6116j567j806q450o3516P3369M6262J4762L6446
21861F4088l7948j08886j602K4096P8805J05384k3878k5642J3j2945Q736j60161
21849h9940j2939M1533k0931m6854L138N9221j4971o9966N2119N2640P619L7841
$$ plain form
21934 16899 23874 47581 65254 133843 188126 106979 116838 106892 63389 37101 22470 8149
21922 8149 -42844 -124490 -148904 -132714 -135771 -87123 -5592 59523 35787 4607 -26939 -141353
21910 -141353 -142969 -72646 -50910 -88421 -69946 -57995 -38911 -12658 -66815 -40804 6231 54757
21898 54757 45129 48376 46139 -27587 -15257 42230 43075 59054 22515 -43130 -62919 43599
21886 43599 61113 64635 145407 199184 199637 193197 102627 12335 -35056 -48731 -51533 -46434 -82754
21873 -82754 -99875 -58600 14704 -31412 -32979 -34785 -43235 -106751 -33382 12880 27642 64088
21861 64088 26140 -82746 -84348 -60252 18553 123937 100059 74417 74430 61485 70221 -89940
21849 -89940 -102879 -61346 -82277 -129131 -125993 -66772 -81743 -151709 -99590 -46950 -39331 -1490
21837a490O020L8079P9632o9838M823m8637L359J5351j4068J3913l2072n112l3859
21824d3899l5226N2164j8127J5007J14923L3238l7760J0460M6204n7660j06463
21813b7139k8108j028L3562P7458l6834n0665Q321p444M6979R5021r8054j21101
21801a09032l6508N5098M6639k0000n5545N0361J17442J9122N5090K7364K6924
21790A76955m5389q2747K5466j4216n3182J3848L618q3769l6269l9918N4803k5325
21778a06125o1038L2806O6257M8499K9832n7087k1931O8041N3029J3219O0086
21767A25588m9606q8323L2321L4071J048k8049j3361K9982N0731Q61m6953J3831
21755F2141N681J7105p5669L589J6222K8981q292j7480o2210l1088J11916L9833
$$ plain form
21837 -1490 4530 42609 122241 52403 57226 8589 11948 27299 13231 27144 -4928 -10040 -43899
21824 -43899 -79125 -26961 -45088 -30081 84842 118080 80320 90780 136984 79324 -27139
21813 -27139 -55247 -56275 -22713 54745 17911 -32754 -24433 -31877 15102 110123 12069 -109032
21801 -109032 -145540 -90442 -43803 -63803 -119348 -68987 48455 67577 122667 150031 176955
21790 176955 131566 48819 74285 60069 6887 20735 24353 -59416 -95685 -135603 -80800 -106125
21778 -106125 -167163 -134357 -68100 -19601 10231 -46856 -68787 -746 52283 65502 125588
21767 125588 75982 -12341 19980 54051 55099 27050 13689 43671 94402 95263 48310 62141
21755 62141 67822 84927 9258 12847 29069 58050 49758 32278 -29932 -61020 50896 90729
21743I0729K5168N7983k3472p1191j6382j1440K9178l3633p0123J5662m4290o5934
21731a17745K5758O7396R7786m6002o2727k757O6148k6388m4619l6553M2671J11018
21719G3986p2520m9949m6126j8241O6245k3058P325O3531M8666o9599l1758k6722
21707g8220L4219j0381j7484Q6243J25116j921m9623j3201m5223n6425N2525j0514
21695A5111l3309k0130o2071J4265P1658Q7590q8799q1231L8587k875M0224k1283
21683d2263l0510L9560L4927L4289L4750M914r242n1680O293o975j4239K9921
21671B9745k9013K788M0943o2331K1135m3721j15877K7501L874J2615M2097n0278
21659a20522o3580K0161Q7296N5017J7742Q255l8521n252P3824n569q8083r949
$$ plain form
21743 90729 115897 173880 150408 79217 62835 51395 80573 46940 -23183 -7521 -51811 -117745
21731 -117745 -91987 -24591 73195 27193 -35534 -38291 27857 1469 -43150 -79703 -37032 73986
21719 73986 1466 -48483 -94609 -112850 -46605 -69663 -62338 1193 49859 -19740 -51498 -78220
21707 -78220 -44001 -54382 -71866 14377 139493 137572 87949 74748 29525 -26900 25625 15111
21695 15111 -18198 -38328 -100399 -86134 -14476 73114 -15685 -96916 -58329 -61204 -20980 -42263
21683 -42263 -72773 -33213 1714 36003 70753 75667 66425 14745 21038 14063 -176 29745
21671 29745 732 3520 44463 -17868 3267 -40454 -156331 -128830 -124956 -112341 -70244 -120522
21659 -120522 -184102 -163941 -76645 -21628 -3886 4369 -34152 -39404 34420 28851 -59232 -69181
21647f9181J1313K8219k5184j1599M8303M532q1219J2227N6750Q1490R6199P6259
21635B28109N451q1811j10653m0605n9150k2662M5960k3570K5521m0414q9712
21624a63536o027R6480K1293p6100R8594O6327r5538m4030q777j1472J7977K5906
21612g8903l8627M13J32435O3670m445J9983o3145k6455L9005m3922K46p2512
21600g2257m2488n922J2360Q2919P8842k7775m1740L2785J7761K1072N8535k094
21588A11998m6457j02413J3412M6847j4201J558r3025L8997N4697l9859m3688
21577g2134L2022J9078M4139L9146q770q4440m4575O6226l139k8852M1402L2528
21565C2631k4775j37420J7395k633O5627R5926M6352k0227n8478m847n933p4453
$$ plain form
21647 -69181 -57868 -29649 -54833 -66432 -18129 -13597 -94816 -82589 -25839 55651 151850 228109
21635 228109 233560 151749 41096 491 -58659 -81321 -35361 -58931 -33410 -73824 -163536
21624 -163536 -169563 -73083 -51790 -127890 -29296 37031 -58507 -102537 -111314 -122786 -104809 -78903
21612 -78903 -117530 -117117 15318 78988 74543 94526 31381 4926 43931 9 255 -72257
21600 -72257 -114745 -120667 -108307 -25388 53454 25679 -16061 16724 34485 55557 114092 111998
21588 111998 65541 -36872 -23460 23387 9186 10744 -82281 -43284 11413 -28446 -72134
21577 -72134 -40112 -21034 23105 62251 53481 -30959 -75534 -9308 -12447 -41299 103 32631
21565 32631 7856 -129564 -112169 -114802 -49175 46751 93103 72876 14398 9551 3618 -70835
21553g0835P89M7520J9931j9482m4365m0901n9946Q3775K3211l1520l0887O6240
21541e6470P7443Q702o2130j6142j40J8570L707l1991Q650j7928J1177l5076J9573
21528g2055K9688l9185l2157M1582P1935j8277L4431k2266m6920M6793m4957q4199
21516a35587J6376Q2783j022l0580K4882N6830o1865l3113Q821j0172j9304k1739
21504a23690n4904p830o26r615J05190Q3189m6090M4314J23696J7796o5608m6348
21492A9474K140J04322R975o6148o9492q8269N2669J00970J206n9406M8824M2601
21480I8866j941j0506L442l8819r9248n7301O8687N2324J9772k1450K1746r775
21468B5797K273N2841j5457p6136q170N522K8501m3065p4202j43403k7271L2009
$$ plain form
21553 -70835 -70046 -22526 -2595 -22077 -66442 -107343 -167289 -83514 -60303 -91823 -122710 -56470
21541 -56470 20973 29675 -32455 -48597 -48737 -30167 -26460 -58451 -49801 -67729 -56552 -91628 -72055
21528 -72055 -42367 -81552 -113709 -72127 -192 -18469 15962 -6304 -53224 -6431 -51388 -135587
21516 -135587 -119211 -36428 -37450 -68030 -43148 13682 -48183 -81296 -72475 -82647 -101951 -123690
21504 -123690 -178594 -186424 -187050 -196665 -91475 -8286 -54376 -10062 113634 131430 65822 19474
21492 19474 21614 125936 135911 69763 271 -87998 -35329 65641 66847 7441 56265 98866
21480 98866 96925 86419 89861 51042 -48206 -105507 -36820 15504 35276 13826 35572 25797
21468 25797 28070 80911 65454 -10682 -18852 -13330 15171 -27894 -102096 -245499 -272770 -240761
21456b40761J12368L3308R159r3267l6277J04551L7504m9172Q5822p311r6039
21445a40115K7774O1248j838J3946o3657L540L2367L1041M2621K8777L6526n5120
21433A7110k6888J0850M9490q935K6072n0270p9764M7869K2170M9565N2183M8964
21421A58416j3764k0111p1579q3932j0529M0824M6145J2372j7489n4429q7619
21410a01695J5943j764J4371J0374Q660K4216k5468m8549q591j8112J6059m063
21398a18619N6695J5046L3350q4626m4739K1153J9329O3603m669M9715K2121j1555
21386A6804R2173O513j12707r5970K1811R6219j5640j6242M1240m5726P7788O6649
21374A32912J7586p0448q0191M6235J2661l9694n8508M84K927j5446q051j3328
$$ plain form
21456 -240761 -128393 -95085 -85926 -179193 -215470 -110919 -73415 -122587 -36765 -44076 -140115
21445 -140115 -112341 -51093 -52931 -38985 -102642 -99102 -66735 -35694 6927 35704 72230 17110
21433 17110 -9778 1072 50562 41627 67699 17429 -62335 -14466 7704 57269 109452 158416
21421 158416 144652 124541 52962 -30970 -41499 -675 45470 57842 40353 -14076 -101695
21410 -101695 -85752 -87516 -73145 -62771 -54111 -29895 -55363 -103912 -112503 -130615 -114556 -118619
21398 -118619 -61924 -46878 -13528 -98154 -142893 -121740 -102411 -38808 -43477 6238 28359 16804
21386 16804 108977 115490 2783 -93187 -71376 24843 9203 -7039 34201 -11525 66263 132912
21374 132912 150498 80050 -141 46094 58755 19061 -39447 -38963 -36036 -51482 -59533 -72861
21362g2861J7988r007Q0566J4982p8836q656o0114m1383M0405o943j0686L6840
21350i7705L0097j7771k7128K1982K0664j92k5159m0012l9482J0701Q2748N4798
21338b6459j0112k2472L222n0680J6820l5775J0499R16J01366R2335k9405L62
21326E0617K4793O433j7906j15164q5019K3778R2013q455M2156j4042Q673J7807
21314B5684N3184k9516o1307O2379Q2163J75J2906m9901j862m295p3779J0788
21302B6619J3996k1478L3655K473L1447J306M402k9082q1916L5243J1373O1612
21290H9650j04883q9284N0002Q9547K8780m8314J6969m9209K817j9887M695P7698
21278D8581M189n9850k6301K2007K4178l6369m0352N915M5600l1288j2998N2868
$$ plain form
21362 -72861 -54873 -63880 16686 31668 -47168 -55824 -115938 -157321 -116916 -123859 -134545 -97705
21350 -97705 -67608 -85379 -112507 -90525 -69861 -70053 -95212 -135224 -174706 -164005 -81257 -26459
21338 -26459 -36571 -59043 -55821 -106501 -89681 -125456 -114957 -114041 -12675 79660 50255 50617
21326 50617 75410 81843 63937 -51227 -136246 -112468 -20455 -28910 13246 -796 7877 25684
21314 25684 78868 49352 -11955 50424 132587 132762 145668 95767 93905 89610 15831 26619
21302 26619 40615 19137 52792 55265 86712 88018 92420 63338 -18578 16665 28038 89650
21290 89650 -15233 -104517 -54515 35032 63812 15498 32467 -16742 -13925 -33812 -29117 48581
21278 48581 52770 -7080 -33381 -11374 12804 -23565 -63917 -58002 -12402 -43690 -56688 -3820
21266c820J0098m5842m9579P0936L3979l6015j7108j1207k7892K4895N0488M7105
21254D6038n4093l0408k8734j0979N6913N4265K3658K7054K5870N1470o0718k9343
21242G0993k7350m4934L681N9319J8976l899j01822q3221j07617L5000J67921
21231a2953k4180m6655j4394p628J2847J13429j2703j7352K3340l9671j02591
21220a28511o4925j4842Q8994O7421P2274J4386n8252j4212k3371p581J2075m3393
21208i9937P881m1957k24J3685R5721J46935j6407j00918O4711J5170m8316K0465
21196E6809L9914n8868k6556l0758l672M6076Q572j07145o0911K6110J6521m313
21184i8221j4390M346L0301M484N3884j2954l7372o9447Q7545N6613N2555P219
$$ plain form
21266 -3820 6278 -39564 -89143 -18207 15772 -20243 -37351 -48558 -76450 -51555 -1067 46038
21254 46038 -8055 -38463 -67197 -78176 -21263 33002 56660 83714 109584 161054 100336 70993
21242 70993 43643 -1291 2390 61709 80685 76786 -25036 -108257 -215874 -180874 -12953
21231 -12953 -37133 -83788 -98182 -105810 -92963 20466 7763 -9589 13751 -25920 -128511
21220 -128511 -193436 -208278 -119284 -51863 20411 34797 -23455 -37667 -61038 -68619 -56544 -99937
21208 -99937 -92056 -134013 -134237 -120552 -24831 122104 105697 4779 69490 84660 36344 56809
21196 56809 96723 37855 11299 -19459 -23131 22945 31517 -75628 -136539 -110429 -93908 -98221
21184 -98221 -112611 -108265 -77964 -73480 -19596 -32550 -69922 -139369 -51824 4789 57344 64563
21172F4563o1261O6419O2844j3321n9151k4082j0908N7412j8472l9442k6325J8296
21160A6572m6233q6527M1175L8098J4079K9048R9443k2552j648J6100n233j0064
21148H2258l114P0718l6130m6279j3474K6016K9806r573o4653O1l3064K8675K8921
21135F0168q2565j7438M9955r844j9786L9387J9795R503p1119N7625p3384o2915
21123a00618l9871R1602K4640m062M620P3932j04056n7682k6281Q974M7019j2285
21111i4068k7117M5224J750K6663L7093j5860l3796p0442M0749J26701j2436p0177
21099d5716k5282l0094j273R7047N7813l8209r79P3402N64m5605m902M1662M4912
21086A23340q5024o57J176m7522J3079K2088l9167o2492k8258n4267L4265N2143
$$ plain form
21172 64563 3302 69721 132565 119244 60093 36011 25103 82515 64043 24601 -1724 16572
21160 16572 -29661 -116188 -75013 -36915 -22836 6212 105655 83103 81455 97555 92322 82258
21148 82258 79144 149862 113732 67453 53979 79995 109801 100228 35575 35636 2572 31247 60168
21135 60168 -22397 -39835 10120 276 -19510 19877 39672 49175 -21944 35681 -37703 -100618
21123 -100618 -140489 -48887 -24247 -28309 -23689 50243 -53813 -111495 -137776 -128802 -81783 -94068
21111 -94068 -121185 -75961 -74211 -47548 -10455 -26315 -60111 -130553 -89804 36897 24461 -45716
21099 -45716 -70998 -101092 -102365 -5318 52495 14286 13307 86709 87273 41668 36766 78428 123340
21086 123340 38316 37659 38835 -8687 4392 26480 -12687 -75179 -103437 -157704 -123439 -71296
21074g1296K8397J6091r2608n7588j0107p098P1248Q5441k2089K0227J3938K5683
21062B39q345j14432o1255N3012N8934j8681Q0260R188o3322j4561J3427k5820
21050i1356k6432k1631L4134J1138m334n7535j9474j6781K4796M0201R9714k79
21038b7839j7978l6276j6715k6910k3624J18317M5884r4364l7750q711Q17j3931
21026a39080k0896N8690K8474n909M6207q4274k0604j00135l7253J20409N2619
21015a01752Q7175K6555p9251J8326J0623n1304L4265N3247n7765M3796j83O5837
21003D9569l1538J970o488K1720k1974o298L3869K0401r944l3392k7396K2181
20991A2680j8871N045m6703L9739J6288P239J6905L0097l0687l5305n3027o483
$$ plain form
21074 -71296 -42899 -26808 -119416 -177004 -187111 -194209 -122961 -37520 -59609 -39382 -25444 239
21062 239 -8106 -122538 -183793 -130781 -71847 -90528 -10268 -1080 -64402 -78963 -65536 -91356
21050 -91356 -117788 -139419 -105285 -94147 -98481 -156016 -175490 -192271 -167475 -127274 -27560 -27839
21038 -27839 -45817 -82093 -98808 -125718 -149342 -31025 14859 -79505 -117255 -125966 -125149 -139080
21026 -139080 -159976 -101286 -72812 -78721 -32514 -116788 -137392 -237527 -274780 -154371 -101752
21015 -101752 -14577 11978 -67273 -48947 -38324 -89628 -55363 -2116 -59881 -16085 -16268 49569
21003 49569 18031 20001 13513 35233 13259 6961 40830 61231 51287 17895 -9501 12680
20991 12680 -6191 -1146 -47849 -8110 8178 15417 32322 62419 31732 -3573 -56600 -63083
20979f3083N2094J34063m2921p9558m888J0591l958l3105j2727p268k5098l0495
20967a06353L9645k8551l2833N0943N2638M2433J4620n3686L1679P7296K2354
20956A10185P155n1387m3332p9062L5072K6511j8965n9462L5973M0520m3516l0543
20944g0851l5046r562P7083m572l0622o8557l089K5403P1963M3590m0821N172
20932c9909M2730m8123j10826Q269K3315M6446R6389R5827j1919j41646N1173
20921A1726Q6168K1922n1265o7627j0468l1282j1188N4240k0728k4146k7772J445
20909f8975n5635L5648O8832l6229J0495J6877l3570p5796P11J49986P3126K8477
20897A13947N7508j18114o6072j8090j6655L1538J0468l3717J1343M2617q980
$$ plain form
20979 -63083 -10989 123074 80153 595 -4293 6298 2340 -30765 -43492 -50760 -75858 -106353
20967 -106353 -66708 -95259 -128092 -77149 -24511 17922 32542 -21144 10535 87831 110185
20956 110185 117340 65953 22621 -56441 -21369 5142 -13823 -73285 -37312 3208 -40308 -70851
20944 -70851 -105897 -115459 -38376 -42948 -73570 -142127 -145216 -119813 -47850 -4260 -45081 -39909
20932 -39909 2821 -45302 -156128 -147859 -124544 -78098 18291 114118 102199 -39447 11726
20921 11726 97894 119816 68551 924 -9544 -40826 -52014 2226 -18502 -42648 -70420 -68975
20909 -68975 -124610 -88962 -20130 -56359 -45864 -28987 -62557 -138353 -137642 12344 85470 113947
20897 113947 171455 53341 -12731 -30821 -47476 -15938 -5470 -39187 -27844 14773 5793
20886E793J1155o4318n9521J4337L3649L2093l9139P2909Q0339o640p7227K9588
20874C3018n3860n5655M4141J8580p096m4004n2618l7803R8532N4943j8634o1414
20862h1870l7844l0863N1437R0452P2849j7707j8264L1254N9568j7931p8868K6395
20850D8608Q989M431o1589J02m0194N6957J43757K1480q6676j18588o9580J05603
20838A3300K5628q3961m0352K0868K5310P1508n868J113j8381k6516O1860j2291
20826C2218l3636j4536J9957P5880Q3179m1240j2614L9160N859j25491o2703r1782
20814a25749q9529O0907J12969K9813K3538J3839p795l204K0515N4876j0395n8879
20802B0906Q383L4052m1636o3594m8692k7769o899J15393k2115l0444L223N392
$$ plain form
20886 5793 16948 -47370 -106891 -92554 -58905 -26812 -65951 6958 87297 80657 3430 33018
20874 33018 -20842 -76497 -32356 -13776 -20872 -64876 -117494 -155297 -56765 -1822 -20456 -81870
20862 -81870 -119714 -150577 -99140 -8688 64161 46454 28190 59444 119012 101081 22213 48608
20850 48608 57597 62028 439 541 -39653 17304 161061 182541 95865 -22723 -92303 13300
20838 13300 38928 -45033 -85385 -64517 -39207 32301 26433 27546 9165 -17351 44509 32218
20826 32218 -1418 -15954 4003 79883 163062 121822 109208 148368 154227 28736 -33967 -125749
20814 -125749 -215278 -154371 -41402 -11589 11949 25788 17993 14789 35304 90180 79785 20906
20802 20906 29289 63341 21705 -41889 -90581 -118350 -125249 -9856 -31971 -62415 -59192 -53800
20790e3800L323M8782N0453l4441r5149k3882L1570r868K4317L559L1236k942
20778b6842O7748O3848r029m9608n4924l9790J358n0545L7239L5583k4968k5267
20766g5197p4371l824J8940L6092O7987P9988p2224l1688K6714R848o9571o9720
20754a57026K61K7083M3709P4201k8350Q5011m4465m6922N680l1766N3262P1588
20742E2266o684J621K0097n2166L0410o534l3933M1274K9559k2810J9546l9214
20730C3432p8476k6144O5753L9774k0744M1587k0995k9714k4642n405P3960L9706
20718H8092j5210o3259l1266p192j2824j2710Q190J5882l2693j865l4214K5144
20706g3925L8299O7956j0228m1727k3670N5002p5542q5125N6466N5379K0382J0310
$$ plain form
20790 -53800 -50477 -1695 48758 14317 -80832 -104714 -73144 -83012 -58695 -55136 -23900 -26842
20778 -26842 40906 104754 95725 46117 -8807 -48597 -47239 -97784 -60545 -24962 -49930 -75197
20766 -75197 -149568 -153392 -134452 -98360 -30373 49615 -22609 -54297 -27583 -17735 -87306 -157026
20754 -157026 -156765 -129682 -85973 -11772 -40122 44889 424 -46498 -40818 -72584 -19322 52266
20742 52266 45582 47203 67300 15134 45544 39010 5077 46351 75910 53100 72646 33432
20730 33432 -45044 -71188 -5435 34339 13595 55182 34187 4473 -20169 -25574 48386 88092
20718 88092 72882 9623 -21643 -28835 -41659 -54369 -46179 -30297 -62990 -64855 -99069 -73925
20706 -73925 -35626 32330 22102 -19625 -43295 11707 -63835 -148960 -92494 -37115 -16733 -6423
20694f423j7516O929K7673Q0379M3024l6051o5874o2692k1498p056N3371N0434
20682D4700j9596j5992k3230K1284j08989p7826J9937P0158M0253l0382m7316
20671a26999K9997J1301L0704O0426N6694n561O3749m4141j23222P0310P8053
20660A01311r3556n8569l84J7989N7159N1256l6325l6126K2231o6449n2856k7087
20648a21406l3477k5389J0103N1928K9513j891J2195j4416k630L6268l233m5507
20636a07942k912L0129L5028j0620K4593L8302n7628m5953M0813l7721J679K4427
20624f7805J8782N406p2998m8713J2060O8739O7317Q30o4482L3608R3062J0460
20612E6266l7766k8235K1531m2753k8475L4157j6485K142L1373R0012l782k9933
$$ plain form
20694 -6423 -23939 -17010 10663 91042 134066 98015 32141 -30551 -52049 -59105 -5734 44700
20682 44700 25104 9112 -14118 7166 -101823 -179649 -159712 -89554 -49301 -79683 -126999
20671 -126999 -97002 -85701 -54997 5429 62123 56562 120311 76170 -47052 23258 101311
20660 101311 7755 -50814 -51198 -33209 23950 75206 38881 2755 24986 -41463 -94319 -121406
20648 -121406 -154883 -180272 -170169 -118241 -88728 -90619 -78424 -92840 -95470 -59202 -62435 -107942
20636 -107942 -110854 -80725 -45697 -56317 -31724 6578 -51050 -97003 -56190 -93911 -92232 -67805
20624 -67805 -49023 -43617 -116615 -165328 -153268 -84529 -17212 -16382 -80864 -47256 45806 56266
20612 56266 18500 -9735 11796 -30957 -59432 -25275 -41760 -39618 -8245 81767 77985 48052
20600D8052l7855Q185Q248J9427p3405n137J5673J4134L5704L3633k6531k0110
20588B0018N7345O8349l5274j11355o1089K3832O9265o860m4146p0816N4094N5279
20576A8642l7446j1658k4153M6227N8778j5986m1947L8716J858k9613p2892m9000
20564a18474K7780Q482n609O7450R3404k6336k0557l0630q4029m0820k186O332
20552a25193j7176J07154j7493m8932p242J1753j4710k9413O298M5931M4924m936
20540d9035l7326N8615o076m3865N8599l2204m5306N5211K5517k9822p8717o221
20528a30630l1598K6838K8091K3562P5906J4088j09779l2886j2674m626J5112
20517a38596J1094J2408L2820N6623M4554q5181o2188P7471O1067K0294o3655
$$ plain form
20600 48052 10197 18382 26630 46057 -27348 -32485 -16812 -2678 33026 66659 40128 20018
20588 20018 77363 145712 110438 -917 -62006 -38174 31091 24231 -19915 -90731 -36637 18642
20576 18642 -18804 -30462 -54615 -8388 50390 34404 -7543 31173 33031 3418 -69474 -118474
20564 -118474 -90694 -82212 -87821 -20371 73033 46697 26140 -4490 -88519 -129339 -131525 -125193
20552 -125193 -142369 -35215 -52708 -101640 -108882 -97129 -111839 -141252 -134954 -89023 -44099 -49035
20540 -49035 -86361 -27746 -33822 -77687 -19088 -51292 -96598 -41387 -15870 -45692 -124409 -130630
20528 -130630 -162228 -135390 -107299 -83737 -7831 6257 -103522 -136408 -149082 -153708 -138596
20517 -138596 -127502 -115094 -82274 -25651 18903 -66278 -128466 -50995 10072 30366 -33289
20506c3289M8686k3830j6000p318r249n661o4109n5055p293J05193M7412m7886
20494f8399n4832J0469O73N6705j3561j09838J7123J16067J139m5930n3535l3448
20482a77367l8061M0319J10381P9470o0580p4583N1907J3775l8381J5436Q1302
20471C618m4005k3707J0360N6157l3860J6751j6952q5677q0322j9530L5641J03613
20459g7913L0756N1207M2928j525p4441j0158J3134o804j2066M4453K7488m018
20447B3041l1348k4194L4375K3009q1502N769O5214J8581p455m1874L3527O0346
20435G7489J1979p8865j0508J02895N0586j5417p6165j3935m0006K4711J3801
20424D6565r815Q5944M2453k7410p0888o7822M3962m5535n4171r7096j3433M4249
$$ plain form
20506 -33289 15397 -8433 -24433 -31751 -41000 -46661 -110770 -165825 -173118 -67925 -20513 -68399
20494 -68399 -123231 -112762 -112089 -55384 -68945 -178783 -161660 -45593 -44454 -90384 -143919 -177367
20482 -177367 -215428 -175109 -64728 14742 -45838 -120421 -68514 -54739 -93120 -77684 3618
20471 3618 -40387 -64094 -53734 2423 -31437 -14686 -31638 -117315 -197637 -217167 -181526 -77913
20459 -77913 -47157 4050 46978 45453 -28988 -39146 -26012 -32816 -44882 -429 27059 23041
20447 23041 -8307 -32501 1874 24883 -56619 -50850 14364 32945 25490 -16384 17143 77489
20435 77489 89468 10603 95 102990 153576 138159 61994 48059 8053 32764 46565
20424 46565 36750 122694 165147 137737 66849 -973 42989 -2546 -56717 -153813 -167246 -122997
20412a22997L7360l751j05968K0819J6167O3025O8116K5028j12820k3450P3092
20401f5379O0312L1375N3755o6793j12509k3843N8765k0321M2684N9312l3155
20390a5797n009m4281j52257N0976R1922n0088o6346J9159O8862O909o422J8106
20378h4266l7307q231J5783K8705p9861l5491P1188J4042n6358j4716O2114o157
20366a30555N3435L4908L4185j1742j23944R930L5852O729o7800M7067N7549l4680
20354h9066P9589J22438K0965p3935o0541k4802M8895R893n1162m1994L4133n4692
20342h0279p0807K8126o375q4544K1076N0283M4023r206N5361P7851K929k4373
20330D065p648m8375p8327m3030P9014P1943j4905P6435L1145k5765k6298l1383
$$ plain form
20412 -122997 -85637 -89388 -195356 -174537 -158370 -95345 -27229 -2201 -115021 -138471 -65379
20401 -65379 -5067 26308 80063 13270 -99239 -123082 -64317 -84638 -41954 17358 -15797
20390 -15797 -20806 -65087 -217344 -166368 -74446 -124534 -190880 -171721 -102859 -95950 -102372 -84266
20378 -84266 -121573 -129804 -114021 -85316 -165177 -200668 -129480 -115438 -171796 -186512 -124398 -130555
20366 -130555 -77120 -42212 -8027 -19769 -143713 -133783 -97931 -91202 -159002 -111935 -54386 -89066
20354 -89066 -9477 112961 133926 59991 -550 -25352 23543 33436 -17726 -59720 -25587 -80279
20342 -80279 -151086 -122960 -129335 -213879 -192803 -142520 -98497 -107703 -52342 25509 28438 4065
20330 4065 -3583 -51958 -130285 -173315 -94301 -22358 -37263 39172 70317 44552 18254 -13129
20318a3129k1422o887L0966o4485m3395P8048O3086n232p6010l2380O5064L5788
20306A0012N6635N477m4989K9042j5576m158j28084m8035O8275o6901L4381J4409
20294h9512J7497O4894O9986r3216p5381r86L7367M6098Q7507L0484K3393j00636
20282A7495q0700Q826K4361l3586p079j1032M0803q584j162m4352o5911l9031
20270a99952J61425J48963j9513o9861p2154m2296QP9367L4668j2605K2595r140
20258B1505K8051R06l4472p0873Q074L7912M0265J0131p874M7135J189j00318
20246a8369o0250K2105J9217L3411N1281L5647N0367l5677j19284J6222J4158
20235H828q9322L3748N6431n278L0476J4849O4920j3553r5552j5058k8298n0162
$$ plain form
20318 -13129 -34551 -41438 -10472 -74957 -118352 -40304 22782 17550 -58460 -90840 -25776 10012
20306 10012 66647 72124 27135 56177 40601 36443 -91641 -139676 -71401 -138302 -103921 -89512
20294 -89512 -72015 -7121 62865 -30351 -105732 -106718 -69351 -23253 64254 94738 118131 17495
20282 17495 -63205 -54379 -30018 -63604 -70683 -81715 -40912 -49496 -50658 -95010 -160921 -199952
20270 -199952 -38527 110436 90923 21062 -51092 -93388 -93380 -14013 20655 8050 30645 21505
20258 21505 49556 50462 15990 -54883 -46809 -8897 31368 41499 33625 80760 81949 -18369
20246 -18369 -78619 -56514 -37297 -3886 47395 83042 133409 97732 -21552 -5330 8828
20235 8828 -80494 -46746 9685 4407 34883 49732 114652 101099 5547 -9511 -37809 -87971
20223h7971p8629p394J6924M6898K2684L2340j3909J1932L7631l7335n7935Q1673
20211c3091K2801j4693m9764j4375M3742J5999J9895J4939J7085l0645k021R289
20199h39j0635O5340J9782j1660m7042m1759J1793O8889n4341m4119K0195J4894
20187i502m7436j11202K9280K6333n243L4665m5216j2249L3759P861k8275L5950
20175i1275l883j1795l9825J0017Q435n1375m3980J6764N2373R3302k95K5403
20163c6134M3771N8474p4748k4160O572n7052k3870j7305L8632M220M7710K4552
20151i338K7385j8014j00093r4407l2689J9940L7470M2574M8518j0187O1450Q5486
20139E8095j5290p1965p5343Q2082N7119M2824L0664p6123o4106J2794O4210m2758
$$ plain form
20223 -87971 -166600 -173994 -157070 -110172 -87488 -55148 -69057 -57125 -19494 -56829 -114764 -33091
20211 -33091 -10290 -24983 -74747 -89122 -45380 -29381 -9486 5453 22538 -8107 -10128 -839
20199 -839 -11474 53866 73648 61988 14946 -26813 -15020 53869 -472 -44591 -24396 -9502
20187 -9502 -56938 -168140 -138860 -112527 -117770 -83105 -128321 -140570 -106811 -98950 -127225 -91275
20175 -91275 -95158 -106953 -146778 -136761 -128326 -179701 -223681 -206917 -154544 -61242 -61537 -36134
20163 -36134 7637 66111 -8637 -32797 -26225 -83277 -107147 -124452 -85820 -81600 -33890 -9338
20151 -9338 18047 33 -100060 -194467 -227156 -207216 -169746 -127172 -78654 -88841 -27391 58095
20139 58095 42805 -29160 -104503 -22421 34698 77522 108186 32063 -32043 -19249 44961 2203
20127B203k7599N4721k4651m6887m8244P1462K0383J1476J4081J5224p7200J5088
20115a9943Q1466l1298l2688q334q1228k0189L6387l0457P2476J13246P7157q2657
20103G3938J8598Q664J755m3940m4323L3591m66P4889l1228L3848J4774n5742
20091H4358o9305k1665j3532P496R0503L0386k8892l3196l9650K4579J1706L7347
20079H0135m4171r1539j572l9756k8190k3954K5892p720K5918l0470k4273J07795
20067e1905Q7065L100k4981q9542k0585K5399L6212L8770K7314j1375n5539r127
20055d5194R5543K9142j34866j05622L6723N8398Q719n796L2084j7580r043m1437
20043i8929k045L7534M0387K879j1181N703m1385Q8805Q6128l1822n5731L2218
$$ plain form
20127 2203 -25396 29325 4674 -42213 -90457 -18995 1388 12864 26945 42169 -35031 -19943
20115 -19943 61523 30225 -2463 -10797 -92025 -112214 -75827 -106284 -33808 79438 156595 73938
20103 73938 92536 101200 102955 59015 14692 48283 47817 122706 91478 125326 140100 84358
20091 84358 15053 -6612 -20144 -12648 77855 108241 79349 46153 6503 31082 42788 80135
20079 80135 35964 -55575 -57147 -96903 -125093 -149047 -123155 -130875 -104957 -135427 -159700 -51905
20067 -51905 35160 38260 13279 -76263 -96848 -71449 -35237 3533 30847 19472 -36067 -45194
20055 -45194 50349 79491 -55375 -160997 -124274 -65876 -57157 -62953 -30869 -48449 -57492 -98929
20043 -98929 -100974 -63440 -23053 -20174 -31355 -25652 -67037 21768 107896 76074 20343 52561
20031E2561n663q1560r6658K6119N0116Q825j4944N2056O6009k3881j01678l9038
20019a07736j918o310K6537N3883n4234K7266K7756l9628j0564L1458m436n580
20007f3506P9667P0337M1655J653k2365l2862m1290o6979m7292q031K0616k192
19995g0589K1986j2415k2020l3902M6446P2649J05189K9778l0244r386L2351M6998
19983A76841q0987k3892m5149K9298p4144m5292N5086K7950m2341q17k2083j8090
19971f3620J7871j9603J17153J8314M276l4474n1618J7410J04589o3358k3529
19960B3411M099j12210j04225M1549K9788P6491O1014j7286J013P432K1772k542
19948C0306M9508j99o9415K6266L8499L4646M1356o9788J4090J3378j4746J6209
$$ plain form
20031 52561 46898 -34662 -131320 -105201 -55085 -46260 -61204 -9148 56861 32980 -68698 -107736
20019 -107736 -109654 -115964 -89427 -35544 -89778 -62512 -34756 -74384 -84948 -53490 -57926 -63506
20007 -63506 16161 86498 128153 129806 107441 74579 33289 -33690 -80982 -89013 -68397 -70589
19995 -70589 -48603 -61018 -83038 -116940 -70494 2155 107344 137122 106878 97492 129843 176841
19983 176841 95854 71962 26813 56111 -18033 -63325 -8239 19711 -22630 -23447 -45530 -63620
19971 -63620 -45749 -65352 51801 70115 74391 39917 -11701 5709 110298 46940 23411
19960 23411 27510 -84700 -188925 -147376 -117588 -41097 19917 2631 3644 11076 32848 30306
19948 30306 79814 79615 10200 36466 74965 109611 150967 81179 95269 108647 93901 110110
19936A10110m1312K7361J8849L493k9111r7966k0755q907M2049P3087K8933r8300
19924G531j8940K2338L1172k3157n0235R343j3902N0318o265P814N3392O7149
19912A36558K9560l3956l2795R46j16335k1203Q6683N039L3839m155n4535p4313
19900d4667j863r42m5846M853Q2552O5384L5013n0671l8575K2752m159m1464K7879
19887A0246J0130J0334j1254j4333J2951n3932N683K2390q4942Q660R4810O999
19875A7742l2589K700N5791J6365O0794K961m8800l0818p0685q5954k391L792
19863a11092K399J7911J59010M7271j13766k2080Q285L3633K9762J2170n5805
19852G698k9911O0270O519k4187p801o7408o2403n1811L9172J24711O1192P935
$$ plain form
19936 110110 68798 96159 115008 118501 89390 -8576 -29331 -38238 3811 76898 105831 7531
19924 7531 -11409 10929 42101 18944 -31291 -21948 -35850 14468 8203 16017 69409 136558
19912 136558 166118 132162 99367 100313 -16022 -37225 49458 54497 88336 84181 29646 -44667
19900 -44667 -46530 -47472 -93318 -88465 -5913 59471 94484 43813 5238 27990 23831 -17633 10246
19887 10246 20376 30710 19456 5123 18074 -35858 -30175 -7785 -92727 -84067 10743 17742
19875 17742 -14847 -12147 43644 60009 120803 123764 74964 44146 -26539 -112493 -114884 -111092
19863 -111092 -108693 -90782 68228 115499 1733 -20347 -12062 21571 51333 63503 7698
19852 7698 -22213 38057 44576 20389 12588 -54820 -117223 -169034 -129862 -5151 56041 63976
19840F3976n9499K4304j9316o6568kN4436r313M3811O4714l1772l6420J2773K9945
19827G1069M33m202j9121k4414L4451J4610j8679l5583K5861l4421m4753P179
19815b7570k2121l4669P989L5035P1946L7621n1649p509L917j0658m5845j5310
19803e8823O0891m4078K7926p922n5497R669J8776l1616j4293O5554O5876k8857
19791G606j06118L5719J13921N3592q2819j3872o3661r971K9246J00204M0519
19780A04366m6112r7429p5092M7594m7633M0826j6741K7569L9058j7998M8448
19769F856M0895k6615l5713R8973N5844p5144k1485l1273J6659L4678p478k5384
19757C0813p0249R7345k8131K8693L1595l0519n4640j0140l3952j2080N0105M685
$$ plain form
19840 63976 4477 28781 9465 -57103 -57105 -2669 -11982 31829 96543 64771 28351 41124 71069
19827 71069 71502 67300 48179 23765 58216 72826 54147 18564 44425 10004 -34749 -27570
19815 -27570 -49691 -84360 -76371 -41336 30610 68231 16582 9073 12990 2332 -43513 -58823
19803 -58823 2068 -42010 -14084 -22006 -77503 -67834 -49058 -80674 -94967 -29413 36463 7606
19791 7606 -98512 -62793 51128 104720 21901 8029 -55632 -65603 -36357 63847 104366
19780 104366 58254 -39175 -114267 -66673 -114306 -73480 -90221 -62652 -23594 -41592 6856
19769 6856 47751 21136 -14577 84396 140240 65096 43611 12338 28997 63675 56197 30813
19757 30813 -39436 57909 29778 58471 90066 59547 4907 -5233 -39185 -51265 -1160 3525
19745C525j2386M8669k7962p9776k2413Q736J7774M4147J6574K4021j4231P2566
19733G9244n0726j23012o9742m9292K0916K3227L2985N1509N7698M1917O4445
19722G9169K5070o8994L3611L4198M1973q3703p2971N4520N9941M2399k9655J6065
19710A31623p9143l0574p0815r764N1629J57327n5953r9501J0308L1748L0592
19699F7477K7700n2307N1704J6860J2569J1064p13n7087j48173o3632N1222R8536
19687A5220M5738M4710m5120j26670j097l2848k4211J6918m1639k453O8803N7663
19675b4986L7914k5221o5774m6857r42k7167k826Q4909K1269Q0562O8754k6037
19663G3598r4793J1864L3852J4564L5193L2918o5870j2392K0314L16j34837m8559
$$ plain form
19745 3525 -8861 39808 11846 -67930 -90343 -81607 -63833 -19686 -3112 20909 6678 79244
19733 79244 28518 -94494 -164236 -213528 -192612 -169385 -136400 -84891 -27193 14724 79169
19722 79169 104239 35245 68856 103054 145027 61324 -11647 42873 102814 145213 115558 131623
19710 131623 52480 21906 -48909 -58673 -7044 150283 94330 -5171 5137 36885 67477
19699 67477 95177 42870 94574 111434 124003 135067 134354 77267 -70906 -134538 -83316 15220
19687 15220 60958 105668 60548 -66122 -67219 -100067 -124278 -107360 -148999 -151452 -82649 -24986
19675 -24986 12928 -12293 -78067 -124924 -125866 -153033 -155859 -70950 -49681 30881 99635 73598
19663 73598 -21195 -9331 24521 39085 74278 107196 41326 28934 49248 49564 -85273 -133832
19651a33832J6794K4087k4656j2405r495Q525Q4929N4866k3900o6814J8176k2900
19639h6625k4799N5714k0273k8130L5773O7856M2539K7122J301l671L1953j2293
19627H6467q6225m2265K9866k8423j667N7483N119M8297P1101l2196M3198M377
19615A55132j5250N3311m2685n3338J8506n7022r9711K5241K262N5657J7168P313
19603F6584k7390l4526M3297p681j5956K654j8933q5242L0775L9868k0390k6492
19591e3432j1333M2048L6344K8670k6534m4306J382L1180r370q8955m0809O3953
19579g1162n0315L0289K7092K1616K690l2776J4563J3978k7026j2659R9763J14418
19567A30471j6419l5199m0773k3219m0636Q2914R9003n8309m0963k0176q9305
$$ plain form
19651 -133832 -117038 -92951 -117607 -130012 -139507 -130982 -46053 8813 -15087 -81901 -63725 -86625
19639 -86625 -111424 -55710 -75983 -104113 -68340 -484 42055 69177 70478 66807 98760 86467
19627 86467 242 -42023 -12157 -40580 -42247 15236 20355 68652 139753 107557 150755 155132
19615 155132 139882 193193 150508 97170 115676 58654 -41057 -15816 -13554 42103 59271 66584
19603 66584 39194 4668 47965 40284 24328 26982 8049 -77193 -46418 -6550 -26940 -53432
19591 -53432 -64765 -22717 13627 42297 15763 -28543 -27161 4019 -5351 -94306 -135115 -71162
19579 -71162 -121477 -91188 -64096 -42480 -39790 -72566 -58003 -44025 -71051 -83710 16053 130471
19567 130471 114052 78853 38080 14861 -25775 57139 156142 97833 56870 36694 -52611
19556e2611J8021P1469j2689l2204o8260p9327N9369L7956O8662n5568j2739M2899
19544a5022O1000J1080K9101r8431k4008N0584k5140r9749k0758j0965j1036O3243
19532i0101O1064m0465l8593K4992N7135j347J7674R5134l0692n2052P8596n0229
19520C1116j06730l5914Q452J6341Q3979N6045j9159m4711K378N4940o9928o8510
19508i1701L4150l5683n1522O6310M3298o2165l0620L5281N7361J03359p624l4545
19496B5899p192m4722N7764P1324l4564k78J1458n4813Q009k0733J00788L8065
19484A51005K601m3245o4647L0758M7428K2781L4072J0871j4046o6578l7091n3223
19472B0686L5549N536o6719L280j5949k9029j7119n3293L6925O950m0026n7802
$$ plain form
19556 -52611 -34590 36879 24190 -8014 -76274 -155601 -96232 -58276 10386 -45182 -57921 -15022
19544 -15022 45978 57058 86159 -12272 -36280 14304 -10836 -110585 -131343 -142308 -153344 -90101
19532 -90101 -29037 -69502 -108095 -83103 -25968 -27315 -9641 85493 54801 2749 81345 31116
19520 31116 -75614 -111528 -103076 -86735 -2756 53289 34130 -10581 -8203 46737 -23191 -91701
19508 -91701 -57551 -93234 -144756 -78446 -35148 -97313 -127933 -92652 -35291 68068 60444 25899
19496 25899 18707 -26015 31749 103073 68509 68231 79689 24876 32885 12152 112940 151005
19484 151005 153606 110361 45714 76472 123900 146681 180753 191624 177578 111000 73909 20686
19472 20686 56235 61771 -4948 -1668 -17617 -46646 -63765 -117058 -80133 -73183 -113209 -171011
19460a71011J5425O5229J6568J8319O9810Q5212j0458o3908m7945k4165l6518
19449h3442N3582K5762K750j07014o0337N4427R9596J628N5889q3683o259J16064
19437F8963K2438k4387m5272j5249m9350L7114n3516k6313L7374M3092J6131K2250
19425C3275M4665p6592m198O6396k5669M0966J5119n2447m5127K6497k3001L2232
19413C2116J2378Q613j7730O6534R6115p999k4922N66r1344j8445j3951L6178
19401G8109P120m9424R893P223O9087L3637k4984n4800J0097n9152j06117L5551
19389d3760Q9565n4163n8905j9164l9013O4330K3826K743N3964L7862P249L5973
19377A00507J9745n6378o4176L2166N0409J08976l3844o5492q902l9483l9110
$$ plain form
19460 -171011 -155586 -90357 -73789 -55470 14340 99552 89094 25186 -22759 -46924 -83442
19449 -83442 -29860 -4098 -1348 -108362 -168699 -114272 -14676 -13048 42841 -40842 -47101 68963
19437 68963 91401 67014 21742 6493 -42857 -5743 -59259 -85572 -48198 -5106 11025 33275
19425 33275 77940 1348 -2850 63546 37877 78843 93962 41515 -3612 22885 -116 32116
19413 32116 44494 53107 35377 101911 198026 190027 165105 165671 74327 55882 41931 78109
19401 78109 85229 35805 45698 52921 122008 155645 130661 75861 85958 26806 -79311 -43760
19389 -43760 45805 -8358 -67263 -86427 -125440 -61110 -37284 -34541 19423 57285 64534 100507
19377 100507 120252 63874 -302 31864 82273 191249 157405 91913 83011 43528 4418
19366D418n3559l4317R5322P8307m1689r0835R2626L0702K9016k2338j017K4711
19354A11347J4931l6939o2919n0839k6200M551n6657O558K0087o7548K0161P3417
19342e0050N220n9990q7904L3660J01393K1570K7994L4723M3266j2448l9672J2393
19330C0155M529M7598K4700m7547j4260J259m5775n3424J534l1493N333o6986
19318a44377L2633P1430P2034k1632m7662l845K656l730j8774R28N3865K7887
19306B1413m7103j2994j2275J6685M5715k0942L8366M864o9229q480N5239J2708
19294B3967L3692m8658k8979O3992M9417K0361L5525k8107l4309J6938l8396n241
19282F0202Q080j6582l432K5842j0879L4165k294m7974M599J5611k0966J5845
$$ plain form
19366 4418 -49141 -83458 11864 90171 48482 -42353 50273 80975 109991 87653 86636 111347
19354 111347 126278 89339 26420 -24419 -50619 -46068 -102725 -96167 -76080 -143628 -123467 -50050
19342 -50050 -44830 -104820 -192724 -159064 -57671 -36101 -8107 26616 69882 57434 17762 30155
19330 30155 34684 82282 106982 59435 45175 46434 659 -52765 -51231 -82724 -77391 -144377
19318 -144377 -111744 -40314 31720 10088 -37574 -41419 -38763 -42493 -61267 -60339 -6474 21413
19306 21413 -25690 -38684 -50959 -34274 11441 -9501 28865 33729 -35500 -43980 11259 23967
19294 23967 57659 9001 -19978 44014 93431 113792 149317 121210 86901 103839 65443 60202
19282 60202 68282 51700 48268 74110 63231 97396 95102 47128 51727 67338 46372 62217
19270F2217O2897K8497m6400n4240L1593M056J2478K538q2917k8577N7716M9979
19258I9837J2395K5747p435o053O3563n271J3379O0202p268l4180J1890J03710
19246C30516O7990N3035K1181Q7644P9148J23660J31722M6818M9271J33652J06238
19235A230875l9305k2104m1775K0622O3761N2264N5459R0493M2550k4940n275
19224A422625l7062o0189r2435j73343j18926j55574j20451r5659n2099n0699
19214D66188j8152O027J0694J5555J1243j0740j7506L4991J1801J5217k4014j2002
19202D89302L99M4170L1316l0917L1401J6774j229N2438J25903P2255J6377J51209
19190I99398J90418J96852N3910L8945M8690k3559j01613j24990k4555P0209O9550
$$ plain form
19270 62217 125114 153611 107211 52971 84564 88620 101098 103636 20719 -7858 49858 99837
19258 99837 112232 137979 130544 124491 188054 182783 196162 256364 249096 214916 226806 330516
19246 330516 398506 451541 472722 560366 639514 763174 894896 941714 990985 1124637 1230875
19235 1230875 1191570 1169466 1127691 1148313 1212074 1264338 1319797 1410290 1452840 1427900 1422625
19224 1422625 1385563 1325374 1232939 1059596 940670 785096 664645 568986 516887 466188
19214 466188 448036 454063 464757 480312 491555 480815 463309 498300 510101 525318 501304 489302
19202 489302 489701 533871 565187 534270 565671 582445 581216 633654 759557 831812 848189 999398
19190 999398 1189816 1386668 1440578 1479523 1528213 1504654 1403041 1278051 1253496 1323705 1393255
19179A393255P3579R5898O661Q3576p8534j71282j33618j98616j73093r2799p9456
19168G25571j26562q0946q667L3091M3285l3545l9096p2994k8433m2965L4276
19157D03015J6117q9927K0836K4917p8935M5592N6489m8811K6842m0748l8124
19146B97263m301n4088o3191n49P0397N5319j8925M0844P5564J17040O0516k5473
19134E50416K4797m3309l4017J4201k7206j25744J7556o9344m0141R915k887M2088
19122C16325J3330N581J1198R265k0222K6316p0805p0648K2721p0350k8911M3217
19110A87017m622o2161N1496Q0310p2715p9228K0091L4478M5632L0671Q064k8754
19098B10279l2164J44275L8646J6082J32006k6624n9347L0930l8230l1012P871
$$ plain form
19179 1393255 1466834 1562732 1569393 1652969 1574435 1403153 1269535 1070919 897826 805027 725571
19168 725571 599009 518063 509396 542487 585772 552227 513131 440137 411704 368739 403015
19157 403015 419132 329205 350041 374958 296023 341615 398104 349293 376135 335387 297263
19146 297263 292962 238874 175683 175134 245531 300850 281925 322769 398333 515373 575889 550416
19134 550416 575213 531904 497887 512088 484882 359138 376694 307350 267209 277124 274237 316325
19122 316325 329655 335236 346434 355699 335477 361793 290988 220340 243061 172711 143800 187017
19110 187017 182395 120234 171730 252040 179325 100097 120188 154666 200298 230969 239033 210279
19098 210279 178115 322390 361036 377118 509124 482500 423153 454083 415853 384841 392712
19087C92712K078P109n4902l6602N2291J48510J12453N7434J15630k4019n9471
19076G13223k1306r7398j60441j03046o5848j6680K1601K4206j2798m0764o9307
19065A71442J916K0611l3949J9756n642q923J2606j1726L0534L3835k5529l0912
19053A74019J6895j18908m1127L33R6461J01404N8903j00407k8773P9603L9100
19042B77503l3931P108O0228R4602K4216M164l1108m5857K6775l809L5829l4043
19030C81677Q15M2525n1700o3030j6475L920p4069L9084l7854Q174K3353k3231
19018B33189l13o299K9905Q9867P3435r9552n3805K4713L0426L179r2381k8897
19006B03467J3782P3252J35234L9426P1N2859L5719K4652M8346j980m7307L5486
$$ plain form
19087 392712 394790 401899 346997 310395 362686 511196 623649 681083 796713 772694 713223
19076 713223 691917 594519 434078 331032 265184 248504 270105 294311 281513 240749 171442
19065 171442 173358 193969 160020 179776 174134 165211 177817 166091 196625 230460 204931 174019
19053 174019 190914 72006 30879 31212 127673 229077 287980 187573 158800 238403 277503
19042 277503 243572 250680 310908 405510 429726 433890 402782 356925 383700 379891 415720 381677
19030 381677 382492 425017 373317 310287 293812 297732 223663 262747 224893 233067 256420 233189
19018 233189 232876 226577 256482 346349 419784 320232 266427 291140 321566 324745 232364 203467
19006 203467 217249 290501 425735 465161 465232 518091 553810 578462 626808 624828 577521 613007
18994F13007O8539J17309O1275J45237L5330n6458r017j033N0647J02164r719
18983A117281p4672R4361J54630Q7717R9064J45222J24664J73847J51806K18590
18973B292510K64191J33599L6580j75431j92910k28582k36415r2182o867J24413
18963A918906K49361J13760J24209K427r2899j93680k92797l03090k11697j39660
18953A174840p7785r8697l5452n711l7187P4339N4083R6763R2547J38744J0650
18942A387134k4556K2434J1017J02010J29073J28598P8859J24653P5702J17525
18932B152449K0957P1714M3745O4199J12506J93785K21264K23987K03812N2777
18922C361195o3746j30675k59669l22212l20059j65914q6076O5692J08992J19963
$$ plain form
18994 613007 681546 798855 860130 1005367 1040697 984239 975222 974189 1024836 1127000 1117281
18983 1117281 1042609 1136970 1291600 1379317 1478381 1623603 1748267 1922114 2073920 2292510
18973 2292510 2556701 2690300 2726880 2551449 2358539 2129957 1893542 1801360 1794493 1918906
18963 1918906 2168267 2282027 2406236 2408663 2315764 2122084 1829287 1526197 1314500 1174840
18953 1174840 1097055 998358 962906 957195 920008 994347 1048430 1145193 1237740 1376484 1387134
18942 1387134 1362578 1385012 1396029 1498039 1627112 1755710 1834569 1959222 2034924 2152449
18932 2152449 2173406 2245120 2288865 2353064 2465570 2659355 2880619 3104606 3308418 3361195
18922 3361195 3297449 3166774 2907105 2584893 2264834 2098920 2012844 2078536 2187528 2307491
18912B307491P0768K4090q0516j84181k80305k79467k92409l11929k05765n0021
18902G17756m5146P3111p2152q9213M3473M2537Q8028n818N9787J08047N3768
18891I74178K4965J00637M1741k1209m8681j24256m7698R3733O2788O1614L8208
18880A156020l4181j9639J1919L4344n7987l4129r5858j10444K7915J642j08444
18869G71158Q057k5110p0586j29580j50660j5809N4143M1109K2462j696o0946
18858D42542L1813J7408L970p290M808P1631J07624j5921l9939n062m2557l9110
18846E29917m0561R4150P4348m1722J2883P6141J30622m8524l9633q9224o6530
18835E91867k9516P741O0674K4869k3009L9958M5761K319L479p5372n6955k6803
$$ plain form
18912 2307491 2378259 2402349 2321833 2137652 1857347 1577880 1285471 973542 767777 717756
18902 717756 672610 745721 673569 584356 627829 670366 758394 752576 812363 920410 974178
18891 974178 999143 1099780 1141521 1120312 1071631 947375 899677 993410 1056198 1117812 1156020
18880 1156020 1121839 1102200 1114119 1148463 1090476 1056347 960489 850045 877960 879602 771158
18869 771158 779215 754105 683519 553939 403279 387470 441613 482722 505184 503488 442542
18858 442542 474355 491763 495733 488443 493251 564882 672506 656585 616646 611584 569027 529917
18846 529917 489356 583506 657854 616132 629015 705156 835778 787254 747621 658397 591867
18835 591867 562351 570092 630766 655635 632626 672584 718345 720664 724143 648771 591816 565013
18823E65013L7252K4004N6576O3162m1556J8423O8547L8198K1362P2114P1557
18812I94652N9499n8124j1815P7051J05588J32884K3513P8740M3544j6062K3017
18801A452487p3671n2677l0430J18920J23874O4679Q803P000L4447J406M282P0560
18789A729680M2753j1984L0588k5479O8304Q9195J01703O1054j0171O0720J9546
18778B155909P3404L28P7857N2776J2482N4303Q3155J49582J05842Q7210J37834
18767B990682J36570K10275J97885K40224L12753L87954L94674M60326M88142
18758E819485N38798O06274O23861M44516K80816K12514J86675K66583M52493
18749I432015O17480R26666J237900J369951J530386J598427J633893J613515
$$ plain form
18823 565013 602265 626269 682845 746007 704451 722874 791421 829619 850981 923095 994652
18812 994652 1054151 996027 984212 1061263 1166851 1299735 1323248 1401988 1445532 1429470 1452487
18801 1452487 1378816 1326139 1295709 1414629 1538503 1603182 1611985 1618985 1653432 1654838 1659120 1729680
18789 1729680 1772433 1760449 1791037 1765558 1833862 1923057 2024760 2085814 2075643 2136363 2155909
18778 2155909 2229313 2229641 2307498 2360274 2372756 2427059 2510214 2659796 2765638 2852848 2990682
18767 2990682 3127252 3337527 3535412 3775636 4088389 4476343 4871017 5331343 5819485
18758 5819485 6358283 6964557 7588418 8032934 8313750 8526264 8712939 8979522 9432015
18749 9432015 10049495 10976161 12214061 13584012 15114398 16712825 18346718 19960233
18741A9960233J736883K163652K946068M303937O222064Q838126J2927959J8836416
18733G7935338K6693182L5322248M2424405M4975824L8228201K0765728k868167
18726B83476759k3850322l5502544l3574120k0044273k851994J4530935K9571581
18719B11756022L9541935M1781994K9804069L757224k5766137m5812572n4009082
18712B01053453m9221008l6792518k5374568j7102230j1567482q023545n648793
18705D7323309m114599l062141k239429j674231j251150q14752o21561l45113
18697C3200333J28283N24710P96097R35898J228382J659288K307175L458227N116545
18688D9354938P542654J1246063J6894315K5034897L5081155M4786779N1117920
$$ plain form
18741 19960233 21697116 23860768 26806836 31110773 37332837 46170963 59098922 77935338
18733 77935338 104628520 139950768 182375173 227350997 265579198 286344926 283476759
18726 283476759 259626437 224123893 190549773 170505500 167653506 182184441 211756022
18719 211756022 251297957 293079951 322884020 326641244 300875107 255062535 201053453
18712 201053453 151832445 115039927 89665359 72563129 60995647 52972102 47323309
18705 47323309 43208710 40146569 37907140 36232909 34981759 34167007 33545446 33200333
18697 33200333 33328616 33853326 34649423 35585321 36813703 38472991 40780166 44238393 49354938
18688 49354938 56897592 68143655 85037970 110072867 145154022 189940801 241058721
18681B41058721M9166478L4033081Q435913j8943984l8430417m3881950l1944051
18674A99493791j2334046P236182K4396423L6911038M2638119L6568695J5485970
18667C50396172j4076204l9940205n4492799n6077185m6071681l3279011k3237998
18660H3221089j6043133j1134683p891068n694615m234905l160376k386233k181210
18652C0494866k082851k086334k036693j809795j579262j281381j037175p51659
18644A7829716o18138m00578m61018n64851p86279q15954p92819p94762p86880
18635A1808437o88724n45179m71873m21154l23695k37658l03740l01354k15076
18626H299984k70481l82299l54031k31840k05157k99265l55431k69309k22137
$$ plain form
18681 241058721 290225199 324258280 332694193 313750209 275319792 231437842 199493791
18674 199493791 187159745 194395927 218792350 255703388 298341507 334910202 350396172
18667 350396172 336319968 296379763 241886964 185809779 139738098 106459087 83221089
18660 83221089 67177956 56043273 48152205 42457590 38222685 35062309 32676076 30494866
18652 30494866 28412015 26325681 24288988 22479193 20899931 19618550 18581375 17829716
18644 17829716 17211578 16811000 16349982 15785131 14998852 14182898 13390079 12595317 11808437
18635 11808437 11119713 10574534 10102661 9681507 9357812 9120154 8816414 8515060 8299984
18626 8299984 8029503 7647204 7293173 7061333 6856176 6556911 6201480 5932171 5710034
18617E710034k16103k01026k21767k56922j42528j12333q1001j28396j10913p9897
18607D159148j78117r8270r1707n8080l70L9472j9081r5301m1155J9666j03265
18596C532940j45620n4496q5147o1276j51630p7507k5832q051q086N6739o8741
18585B903293j00829j46551p0114j29279j15381J0026n5173m0494k9050K4526
18575B250974J3328r2251k2648j31410r2855j3808j4457j6877J04531J7714J03084
18564B105325p472Q4441M9938l2190m9608m4820j481M1406J12734P3227J8572
18553B350072J8591j9367M6679J35159J385n2297l426N2827M2813J12394J24400
18542B809230m4481j2024k427l6045l9422M9987J01432M3160p6720J6186K3163
$$ plain form
18617 5710034 5493931 5292905 5071138 4814216 4671688 4559355 4478354 4349958 4239045 4159148
18607 4159148 3981031 3882761 3791054 3732974 3732604 3772076 3752995 3657694 3616539 3636205 3532940
18596 3532940 3387320 3332824 3247677 3186401 3034771 2957264 2931432 2923381 2915295 2972034 2903293
18585 2903293 2802464 2655913 2585799 2456520 2341139 2351165 2295992 2255498 2226448 2250974
18575 2250974 2264302 2172051 2149403 2017993 1925138 1911330 1896873 1879996 1984527 2002241 2105325
18564 2105325 2097853 2182294 2232232 2200042 2150434 2105614 2104133 2145539 2258273 2331500 2350072
18553 2350072 2368663 2349296 2395975 2531134 2532519 2480222 2476796 2529623 2572436 2684830 2809230
18542 2809230 2764749 2752725 2750298 2714253 2674831 2724818 2826250 2869410 2792690 2808876 2832039
18531B832039P4670P8228l3757N3709K2642N7455k7856N4022J16718L3782J73325
18520C434977J29206J59726J93528J95554K26474K93547K53398J30693J19122
18511E136225J25921R0250M7732J06250K11406L66762M38420M93667O21030N99687
18501H237350N71515O75983P39434P77379J049712J408386J959202K564968L469791
18492B1453720M913668O878080R768145J3623311J7977091K0980373K0969652
18485A16564040J6670854O027440q267041j8367034j8468904j2725465n989773
18478G5444117M76446O951307J2655529J5952553J5706306J0597056j018777j5284684
18470A21479853k3289192k1227777j5694997j1046954p748271n458309l885770
$$ plain form
18531 2832039 2906709 2984937 2951180 3004889 3027531 3084986 3057130 3111152 3227870 3261652 3434977
18520 3434977 3564183 3723909 3917437 4112991 4339465 4633012 4886410 5017103 5136225
18511 5136225 5262146 5352396 5400128 5506378 5717784 6084546 6522966 7016633 7637663 8237350
18501 8237350 8808865 9484848 10224282 11001661 12051373 13459759 15418961 17983929 21453720
18492 21453720 26367388 33245468 43013613 56636924 74614015 95594388 116564040
18485 116564040 133234894 139262334 130995293 112628259 94159355 81433890 75444117
18478 75444117 75920563 82871870 95527399 111479952 127186258 137783314 136764537 121479853
18470 121479853 98190661 76962884 61267887 50220933 42472662 37014353 33128583
18463C3128583k780632k020604j455257j030410p84023m91866k52116p45J63670
18454B4476600K75962M54784Q53576J260974J827789K441105L288747M324663
18446C9204200N721872P937099J1174738J5759173K1425213K6419112K8469695
18439A56111102K6583691J8655510N428199m806617k990628O612797J4882741
18432B20476795J7729135J3254984L227465n320472o735568m907255o900827j2351468
18424B18472789j4261236p955183J140735O237334M494309o250585k2101194l2385369
18416A47391600l0623696k3456222j6825016j2006349q662075o274616m749340
18409D4794286l673414k897817k220615j711647j122404o73149m25515l35669
$$ plain form
18463 33128583 30347951 28327347 26872090 25841680 25057657 24565791 24313675 24312930 24476600
18454 24476600 24752562 25207346 26060922 27321896 29149685 31590790 34879537 39204200
18446 39204200 44926072 52863171 64037909 79797082 101222295 127641407 156111102
18439 156111102 182694793 201350303 206778502 201971885 198981257 205594054 220476795
18432 220476795 238205930 251460914 254688379 249367907 242632339 237725084 230824257 218472789
18424 218472789 204211553 196256370 197397105 203634439 208128748 201878163 179776969 147391600
18416 147391600 116767904 93311682 76486666 64480317 55818242 49543626 44794286
18409 44794286 41120872 38223055 36002440 34290793 33168389 32495240 32069725 31734056
18401C1734056k67996q8955J44312N38002J093487J763988K599019L806326N466244
18392D6788483P922848J1600501J6696605K2798125K8457032L0384501K7115873
18385A91763968J5548790m896770k4531708l0459226k3587656j3403288l764116
18378A06669994N304645J3651528J9628594K1158857J6906086M467446j4168230
18371A73618920k9441755l2032763k5895248j8809315j3430475r642912o916078
18364C7450374n059181l788548k955762k305118j800649j558959j277892j126435
18356A7577830r56363r34375r22056q56397p77584o34307m37873m41460m15618
18347A1201797k85469l07756l43912l64707m77250o07988n75840n38143n51796
$$ plain form
18401 31734056 31466060 31377105 31521417 32059419 33152906 34916894 37515913 41322239 46788483
18392 46788483 54711331 66311832 83008437 105806562 134263594 164648095 191763968
18385 191763968 207312758 202415988 177884280 147425054 123837398 110434110 106669994
18378 106669994 111974639 125626167 145254761 166413618 183319704 187787150 173618920
18371 173618920 144177165 112144402 86249154 67439839 54009364 44366452 37450374
18364 37450374 32391193 28602645 25646883 23341765 21541116 19982157 18704265 17577830
18356 17577830 16621467 15687092 14765036 13908639 13131055 12496748 12058875 11617415 11201797
18347 11201797 10916328 10608572 10264660 9899953 9422703 8814715 8238875 7700732 7148936
18338G148936l48494j89439k37310k57737j97340k65577k69248k76128k00109
18329D907554j33859j73273j50428j50792r7162q19n3015k00360k03699j95954
18319C548193j60368j18328j13480l2771p3983n1066M4812l6054p4472K0107Q21
18308B953411m4052K9908p7429j5133p8321r3434m0128o8748o8642L3834k7821
18297B503445j13153L0956q9492r7337k5830p9488p2583l4681M0269p7092j77506
18286A807508p9868n3041k0347r4356Q632k4785m9498l9832j5832M5946N3684
18275A538211l1520R0036Q4211l434J8560k4810O0269N7118M2863J30675O6824
18264B029003k2140L2527m7389N2137J22916P0919J43397Q9714R0718P9372Q7521
$$ plain form
18338 7148936 6800442 6611003 6373693 6115956 5918616 5653039 5383791 5107663 4907554
18329 4907554 4773695 4600422 4449994 4299202 4202040 4201221 4148206 3947846 3744147 3548193
18319 3548193 3387825 3269497 3156017 3123246 3049263 2998197 3043009 3006955 2932483 2952590 2953411
18308 2953411 2909359 2939267 2861838 2846705 2768384 2674950 2634822 2566074 2497432 2531266 2503445
18297 2503445 2390292 2421248 2331756 2234419 2208589 2129101 2056518 2021837 2062106 1985014 1807508
18286 1807508 1727640 1674599 1654252 1559896 1568528 1543743 1494245 1454413 1438581 1484527 1538211
18275 1538211 1506691 1596727 1680938 1677504 1696064 1671254 1731523 1788641 1831504 1962179 2029003
18264 2029003 2006863 2039390 1992001 2044138 2167054 2237973 2381370 2471084 2561802 2641174 2728695
18253B728695J3357l8540M5472l8532k1961n2820j13280j14338j06759j69931
18243B131363j94802p1832r5274j28136q4503p1145r1744j786K408o325j07540
18232A280684n9879m6863N0094N2203J7656K8645r440P1864L8052L9218J07232
18221A569466J27047J40935K13762K35033J82143J98382J35454M9763j4252M3593
18211B881326J92738K21946J19062J93077R3849N8886N6475J8284j7023j11354
18201C707266j73907j84701k82915l70163m02648l80390l10373j73307j14592
18192A314270q3113k9480m6102m9545P2210K5584O02J3066o2501L8469L0778q398
18180A215840r5848p6874N054J1245j2173R1855O2302J52466J76125K18557J57608
$$ plain form
18253 2728695 2742052 2703512 2748984 2710452 2688491 2635671 2522391 2408053 2301294 2131363
18243 2131363 1936561 1864729 1769455 1641319 1556816 1485671 1393927 1392141 1394549 1388224 1280684
18232 1280684 1220805 1173942 1224036 1276239 1293895 1322540 1313100 1384964 1423016 1462234 1569466
18221 1569466 1696513 1837448 2051210 2286243 2468386 2666768 2802222 2851985 2837733 2881326
18211 2881326 3074064 3296010 3415072 3608149 3701998 3760884 3817359 3835643 3818620 3707266
18201 3707266 3533359 3348658 3065743 2695580 2292932 1912542 1602169 1428862 1314270
18192 1314270 1231157 1201677 1155575 1106030 1178240 1203824 1204426 1217492 1154991 1193460 1224238 1215840
18180 1215840 1119992 1043118 1048172 1059417 1047244 1139099 1201401 1353867 1529992 1748549 1906157
18169A906157K11301J35877J95548N1684N7596k4947p9154p2244j7165l214J18709
18158B480148J31125j4163l9298K1929P1258j37661j34380j74659j99842j83735
18148A820722k11089j90750k6793k1868n8832K0879N1436n526j6258M9179j879
18137A409221j09956J7505Q1500q0848j26571q3429L5378k9918j13783j4556o957
18126I77586m641r337N7395m96m3166J7609L0001N7080K5014j9386O0315O0567
18114A208541n1441k6949N1388l682j5454M958l5228J6561J4542n7139j2532M2669
18102A136234Q0097J00844N7884M8358L2204K4497K7085J01149J03301N5696l7024
18091A730325L7460O8204R3825o3888m3190N9031J70616q078l4514O7157J81435
$$ plain form
18169 1906157 2117458 2253335 2448883 2500567 2558163 2533216 2454062 2381818 2364653 2361439 2480148
18158 2480148 2611273 2597110 2557812 2579741 2650999 2513338 2378958 2204299 2004457 1820722
18148 1820722 1609633 1418883 1392090 1370222 1311390 1332269 1383705 1378179 1361921 1411100 1409221
18137 1409221 1299265 1316770 1398270 1317422 1190851 1107422 1142800 1112882 999099 984543 977586
18126 977586 972945 963608 1021003 1020507 977341 994950 1024951 1082031 1107045 1087659 1147974 1208541
18114 1208541 1157100 1130151 1181539 1177857 1162403 1167361 1132133 1148694 1163236 1106097 1093565 1136234
18102 1136234 1216331 1317175 1375059 1423417 1455621 1480118 1507203 1608352 1711653 1767349 1730325
18091 1730325 1767785 1835989 1929814 1865926 1822736 1881767 2052383 2044305 2009791 2076948 2258383
18080B258383J35679r1569l8594L6883L4758J51375J33780M9951k4110L7435J27021
18069B810992J48582J16088N3327J07363J5317J55581J41746R2688J30046Q0804
18059C852534L9041J38064P3653O4187J68594K28408K59682K44812K54339L12436
18049E635750L44230L94563M24572M14680N31273O18193O97032P43193Q70077
18040A0673563R68192R64426J185109J268879J321995J478876J607900J742460
18032B1211400J951438K355826K840016L426259M337657N658400P339851R739231
18024E8860078J3175777J8123238K4256752L1216556L7918349M2786434M3504849
18017B69842033L9774465L3117119K5127684J7071657J1374412O954682l39374
$$ plain form
18080 2258383 2394062 2302493 2263899 2300782 2335540 2486915 2620695 2670646 2646536 2683971 2810992
18069 2810992 2959574 3075662 3128989 3236352 3251669 3407250 3548996 3641684 3771730 3852534
18059 3852534 3891575 4029639 4103292 4167479 4336073 4564481 4824163 5068975 5323314 5635750
18049 5635750 5979980 6374543 6799115 7213795 7745068 8363261 9060293 9803486 10673563
18040 10673563 11641755 12606181 13791290 15060169 16382164 17861040 19468940 21211400
18032 21211400 23162838 25518664 28358680 31784939 36122596 41780996 49120847 58860078
18024 58860078 72035855 90159093 114415845 145632401 183550750 226337184 269842033
18017 269842033 309616498 342733617 367861301 384932958 396307370 403262052 402922678
18010D02922678j0346778k0692067l1204237m0588552m4729664m3548003l9373225
18003A72440152l3094651k5909344j9630445j4692413j1000008q359223o386538
17996E3367530m916210l825608l061181k435888k020431j609556j414071j273927
17988C2810658j139623q46130n97530m21927j65414N4085K74155N29382P00441
17979C1198097R19569J278460J625566K131478K815129L831109N293826P113818
17971E6207052R702961J3236156J7746461K3016735K8453997L3003523L5158318
17964B16525203L3975913K9884364K2966767J3931440N775751K2643n309023j0374503
17956C07398555j4535056k0136309k7246407l2836144l4636796l3328069k8946398
$$ plain form
18010 402922678 392575900 371883833 340679596 300091044 255361380 211813377 172440152
18003 172440152 139345501 113436157 93805712 79113299 68113291 59754068 53367530
17996 53367530 48451320 44625712 41564531 39128643 37108212 35498656 34084585 32810658
17988 32810658 31671035 30824905 30227375 29805448 29640034 29694119 29968274 30497656 31198097
17979 31198097 32117666 33396126 35021692 37153170 39968299 43799408 49093234 56207052
17971 56207052 65910013 79146169 96892630 119909365 148363362 181366885 216525203
17964 216525203 250501116 280385480 303352247 317283687 323059438 323082081 317773058 307398555
17956 307398555 292863499 272727190 245480783 212644639 178007843 144679774 115733376
17949A15733376k2851902j7029102j2467765r231628o996484n411118m224441
17942C7520936l487894k886545k363047j993536j778798j618624j543377j446773
17934B0402342j263611j215408j142255j054369r09954p64650p89039n88485n16695
17925A2157876m70998m07196l15709k65460k52639k12748j87363k42346k43164
17916I560253k27388k89043k87488k14364k15898j88512k79162k04217k43984
17907G410197j95010j86404k75295m16074l23343k86792l17704j67446j01684
17898E140445p9417o3184j01083j17610j24734j54350j95095o2430n5045k9294
17888D158203j17j04493j03045l6025q6964j57413j22152k9476j09225j35861
$$ plain form
17949 115733376 92881474 75852372 63384607 54152979 47156495 41745377 37520936
17942 37520936 34033042 31146497 28783450 26789914 25011116 23392492 21849115 20402342
17934 20402342 19138731 17923323 16781068 15726699 14816745 14052095 13263056 12674571 12157876
17925 12157876 11686878 11279682 10963973 10698513 10445874 10233126 10045763 9803417 9560253
17916 9560253 9332865 9043822 8756334 8541970 8326072 8137560 7858398 7654181 7410197
17907 7410197 7215187 7028783 6753488 6337414 6014071 5727279 5409575 5242129 5140445
17898 5140445 5061028 4997844 4896761 4779151 4654417 4500067 4304972 4242542 4187497 4158203
17888 4158203 4158086 4053593 3950548 3914523 3827559 3670146 3547994 3518518 3409293 3273432
17878C273432j14448m8452o5620j51915q7284m4689j9233m1604k634K4965O6130
17867B788648J21732Q4925l3064q6689j21916j16463K0417N417n3429j09153q4633
17856B415792J6393p3419n4233p954k4196p1072l9301q4355m8811m4285J8442
17845B003001n6877p0494m1094L3646Q3241Q3603j4219J4596K918N8677M5694
17834B142692M6086M3627M3189N8159J7905K315K2376K6798M1862J8863K8839
17823B492711P5294J20324M5883q2523j68261j86247o6564r243j31440m2682P2607
17812B119859k13j46328j08105r677K7847r905o9083K686J2701k7165Q4400J54867
17800B031884O1341n87p6236n5760N4962J58907R9816O0541j9957l430J33606
$$ plain form
17878 3273432 3158984 3110532 3044912 2892997 2805713 2761024 2741791 2700187 2697553 2722518 2788648
17867 2788648 2910380 2995305 2962241 2875552 2753636 2637173 2657590 2663007 2609578 2500425 2415792
17856 2415792 2432185 2358766 2304533 2296579 2272383 2201311 2162010 2077655 2028844 1984559 2003001
17845 2003001 1946124 1875630 1834536 1868182 1951423 2035026 2020807 2035403 2038321 2096998 2142692
17834 2142692 2188778 2232405 2275594 2333753 2351658 2353973 2376349 2403147 2445009 2463872 2492711
17823 2492711 2568005 2688329 2734212 2651689 2483428 2297181 2230617 2221374 2089934 2047252 2119859
17812 2119859 2119646 1973318 1865213 1855536 1883383 1873478 1804395 1807081 1819782 1792617 1877017 2031884
17800 2031884 2093225 2092638 2016402 1960642 2015604 2174511 2274327 2334868 2314911 2311481 2445087
17789B445087J07123P145M9989R164J32005R2776J24022N1412J67409J86650J20195
17778C492977K54182K63810J96166K07162K14439K65901K55277L99092O12922
17769F161928N67456N11222M65151K89850K02950K80988L62984M98647N68943
17760I910119N90326P87587R54060J141634J378553J816749K356330L036987L990926
17751B5963271N385869P432324J0383408J4815366K0733799K7078185L1672861
17744A43465083L2418359K7605509J5062538Q4939o956374l064901K408205L059428
17736B14082786m425816j9391058l2842111l5178233k8436654k0428234j4263625
17729E9117055r976812p006622m944376l608698k618498j885171j285559p88890
$$ plain form
17789 2445087 2552210 2559355 2609344 2618508 2750513 2843289 2967311 3018723 3186132 3372782 3492977
17778 3492977 3747159 4010969 4207135 4414297 4628736 4894637 5149914 5549006 6161928
17769 6161928 6729384 7240606 7705757 7995607 8198557 8479545 8842529 9341176 9910119
17760 9910119 10500445 11288032 12242092 13383726 14762279 16579028 18935358 21972345 25963271
17751 25963271 31349140 38781464 49164872 63980238 84714037 111792222 143465083
17744 143465083 175883442 203488951 218551489 218636428 211680054 208615153 211023358 214082786
17736 214082786 209656970 190265912 157423801 122245568 93808914 73380680 59117055
17729 59117055 49140243 42133621 37189245 33580547 30962049 29076878 27791319 27002429
17721B7002429m43048l33426j95082j01010p4803N21K05264M12404N76392P35619
17711B7785260Q97782J173011J631467K376927L360212M672302O456742Q964716
17703E7318419J2468583J7647088K5019153L4469495M4178827N1497796N3633666
17696B96233027M5527500K8154030R331635j959697n340238k228017o53804q547583
17688C60516853k4357078m1360682n2327273n3059884m3550090l1797046k2455692
17681I1609108j5904944j1579586q620323o382690m855044l726986k842101k129346
17673C5568088j742345j439892j201140j062394r27634q46426n88022n23404o31760
17664B6605071m79874m83557m08182j01289M90923J112389J881232K922678M179432
$$ plain form
17721 27002429 26559381 26225955 26030873 25929863 25855060 25855581 26060845 26473249 27049641 27785260
17711 27785260 28683042 29856053 31487520 33864447 37224659 41896961 48353703 57318419
17703 57318419 69787002 87434090 112453243 146922738 191101565 242599361 296233027
17696 296233027 341760527 369914557 379246192 377286495 371946257 369718240 369064436 360516853
17688 360516853 336159775 294799093 242471820 189411936 145861846 114064800 91609108
17681 91609108 75704164 64124578 55504255 49121565 44266521 40539535 37697434 35568088
17673 35568088 33825743 32385851 31184711 30122317 29194683 28348257 27760235 27236831 26605071
17664 26605071 26125197 25641640 25233458 25132169 25623092 26735481 28616713 31539391 35718823
17655C5718823O116939Q931452J2988452J8436515K3905946K7078891K6710858
17648A59887876K0396902P285142n772631q583111k785385J974891J383111o565288
17640A67221507j9497543k8841724k8024844k1459878j5159001j0623426p516644
17633C6098447n543798m121410l186595k513705j919501j488251j242099q82601
17625A5200487o74797o78065o30391n46212n74205n56632n68462n14915n41336
17616I915472n12792n03118n30970m76341l71581m41386m09781k76766k00399
17607F192338j23722j38159j38410j13599j04712k20972k48989j34312j53419
17598D816044j83488k26532k06970j21365r3614j10785j47757j04498j1426l965
$$ plain form
17655 35718823 41835762 50767214 63755666 82192181 106098127 133177018 159887876
17648 159887876 180284778 187569920 181797289 173214178 170428793 172403684 173786795 167221507
17640 167221507 147723964 118882240 90857396 69397518 54238517 43615091 36098447
17633 36098447 30554649 26433239 23246644 20732939 18813438 17325187 16083088 15200487
17625 15200487 14525690 13847625 13217234 12671022 12096817 11540185 10971723 10456808 9915472
17616 9915472 9402680 8899562 8368592 7892251 7520670 7079284 6669503 6392737 6192338
17607 6192338 6068616 5930457 5792047 5678448 5573736 5352764 5103775 4969463 4816044
17598 4816044 4632556 4406024 4199054 4077689 3984075 3873290 3725533 3621035 3609609 3605644
17588C605644q9298j20075l7688n2317j44981j17860K2500j9985N401m1904o4908
17577B944529K8493N6957J05052J3506J06431J34057K20566K53698K39681J40641
17567D243611M8226N3964O9352o535j13063j51599j76916k03256k13287j96587
17557C353910k57580k06372j38860j29683j65701j00683m9358J1608o2511J6084
17547B270854K4510J2984L495L0239O2490R6654L0852O0048J07017M3270l021
17536B739392j25663j70834r2471n8194o5853J9953J1160p8158r6664o7802n1850
17525A963016k4690m5789J51487J09070Q4447K36404L10046K98514J70540J74892
17515C427937J32760J07296J06170J20056Q5439L7556M7955P0842k9917j02824
$$ plain form
17588 3605644 3516346 3396271 3358583 3306266 3161285 3043425 3065925 3045940 3051341 3009437 2944529
17577 2944529 2973022 3029979 3135031 3148537 3254968 3389025 3609591 3863289 4102970 4243611
17567 4243611 4291837 4345801 4415153 4408618 4295555 4143956 3967040 3763784 3550497 3353910
17557 3353910 3096330 2889958 2751098 2621415 2455714 2355031 2305673 2317281 2254770 2270854
17547 2270854 2295364 2308348 2311843 2342082 2404572 2501226 2532078 2592126 2699143 2742413 2739392
17536 2739392 2613729 2442895 2350424 2292230 2226377 2246330 2257490 2179332 2082668 2014866 1963016
17525 1963016 1938326 1892537 2044024 2153094 2237541 2473945 2783991 3082505 3253045 3427937
17515 3427937 3560697 3667993 3774163 3894219 3979658 4017214 4065169 4136011 4106094 4003270
17505D003270q7779j00753n9570m5771j22877l7706M963j65665m4987m5002P8567
17494C376690L5019Q0696L2761k6897j66677o4044j35109r7696r4654j14188k03422
17483B622479j62646j25317j01570k35360k16377j55050j07918q5735p8506l3012
17473A320988n6487l6405j11267n2133l8348Q908L7448O630K8424n370N9274Q4505
17461A246167j0005O3522R1246J58475J16591J58602K22329J42635P3312P9064
17451B341938J33152M0416M8067m6161l443N5829k7161p0158r4923j61649j21310
17440B094597j33150k12544j26942q7451k2529j38772j64694j66378q9881j07844
17430H44412n1403n7256o5959L4351M1695r3895l8382K9680o8511r8729O4654
$$ plain form
17505 4003270 3915491 3814738 3755168 3709397 3586520 3548814 3553777 3388112 3343125 3298123 3376690
17494 3376690 3411709 3492405 3525166 3498269 3331592 3267548 3132439 3034743 2940089 2825901 2622479
17483 2622479 2459833 2334516 2232946 1997586 1781209 1626159 1518241 1432506 1354000 1320988
17473 1320988 1264501 1228096 1116829 1064696 1026348 1035256 1072704 1079334 1107758 1102388 1161662 1246167
17461 1246167 1236162 1299684 1390930 1549405 1665996 1824598 2046927 2189562 2262874 2341938
17451 2341938 2475090 2515506 2563573 2517412 2513969 2569798 2542637 2472479 2377556 2215907 2094597
17440 2094597 1961447 1748903 1621961 1534510 1511981 1373209 1208515 1042137 952256 844412
17430 844412 793009 735753 669794 704145 745840 651945 613563 643243 574732 476003 540657
17419E40657J4659j00675L1978O2900j4070o8373J0247p0867K3951K338o0822
17408C71923o9883L0263o3763j872m5312k5338J6007K0456l8031q703P0092M9482
17396C05321K4683j9222J402R541o4792R6203M306m6482m6148o5054m6242R563
17384A63079Q6943M6769M4200J9294j5490J5263k0402p5225p5321K0482N5679
17373B65271K0892L2306q0302p3757L5710K1622n5008K3893Q8919M21p2922o9131
17361A37914J0944N3251j3368J1289K4203J8031l2252q7977O458K9451k8623L0300
17349A59621j1809n2322R930k2553k237l881K7599J0837L5002m4195n1875Q390
17337F2507J6851L3788N5060N6692j4531r5412k6473J2319m323k9171q77M2214
$$ plain form
17419 540657 555316 454641 486619 549519 535449 467076 477323 406456 430407 432745 371923
17408 371923 302040 332303 268540 266668 221356 196018 212025 232481 194450 185747 255839 305321
17396 305321 330004 310782 312184 321725 256933 353136 357442 310960 264812 199758 153516 163079
17384 163079 250022 296791 340991 360285 344795 360058 339656 264431 189110 209592 265271
17373 265271 286163 318469 238167 164410 200120 221742 166734 190627 279546 279967 207045 137914
17361 137914 148858 202109 188741 200030 224233 242264 210012 122035 128493 157944 129321 159621
17349 159621 147812 95490 105420 82867 80630 76749 104348 115185 150187 105992 54117 62507
17337 62507 79358 113146 168206 224898 210367 114955 88482 100801 96478 67307 66430 108644
17325A08644Q103L5800L4256n4466p2222k9553m529O4728J18441L8253l081j9264
17313B25110k2213P7378M2627p2367j09738n0827O8391L9315L5905K1798j3563
17302B41816r2046m5541O679l6926J6734L7241M0992M9598n6883p83P1441j896
17290B30426j5865j6273j4486k4367l3218K8937j2310Q7402L9788j867n4030j18435
17278I5702m8943Q4445J7248m3356j8261j5105l6303K5495K8938k8532m7420Q3503
17266I7411m0167P3979n2581o1033J3301l0818J8575J31959k6733l655l8544l9417
17254D2277l3374J2472o761J1814L5930Q9738j8276m0567M7290J2151K2275P8347
17242B53316m4942n2460l0599J3564J43643N9533n3918j0528r182j1206J28952
$$ plain form
17325 108644 116747 152547 186803 132337 60115 30562 26033 90761 209202 247455 244374 225110
17313 225110 202897 280275 322902 250535 140797 89970 158361 197676 233581 255379 241816
17302 241816 149770 104229 110908 73982 90716 127957 168949 218547 161664 160881 232322 230426
17290 230426 214561 198288 183802 159435 126217 155154 142844 230246 270034 268167 214137 95702
17278 95702 46759 131204 148452 105096 86835 71730 35427 60922 89860 61328 13908 97411
17266 97411 57244 131223 78642 17609 30910 92 18667 150626 123893 120238 81694 42277
17254 42277 8903 21375 14614 26428 62358 152096 133820 93253 140543 152694 174969 253316
17242 253316 208374 155914 125315 138879 282522 342055 288137 277609 268427 257221 386173
17231C86173M2240N1199O5435R4040J32222R3799N0072M7361J4848l7860M8967
17220I88496J30535M4691k8574o8475j24173j49222j63000j33228j29876m2333
17210C24841j7744l9382K5282J4937Q8217J9735r5991o7381p1289p7166J9416
17199A23475L7294n976k6513k3502R3572J17904K1842K6936o4556m0906J4831
17188B74401R7780J07596M5627R0307j0864R3513P5093J13363K28497J45924J85743
17177A446980J65102R1384N9685N9180j9248k0462r290p2022j65502j50151j01013
17166A284643p5741j60185j74411j47391j62012j04317m6682q5276j01050l2917
17156A94661N5953R6558o9336r9700n5588n8193J09472J43010N1051L9843p7385
$$ plain form
17231 386173 428413 479612 545047 639087 771309 865108 915180 962541 977389 939529 988496
17220 988496 1119031 1163722 1135148 1066673 942500 793278 630278 497050 367174 324841
17210 324841 307097 267715 292997 307934 396151 415886 319895 252514 181225 104059 123475
17199 123475 160769 154793 128280 104778 198350 316254 338096 365032 300476 259570 274401
17188 274401 372181 479777 525404 615711 604847 698360 773453 886816 1115313 1261237 1446980
17177 1446980 1612082 1703466 1763151 1822331 1803083 1782621 1773331 1701309 1535807 1385656 1284643
17166 1284643 1208902 1048717 874306 726915 564903 460586 413904 328628 227578 194661
17156 194661 250614 347172 277836 178136 122548 64355 173827 316837 367888 407731 330346
17145C30346n5850l137J2820N038J060m5657k9016R909N5988Q0817j944R3420
17133D53794J24855J75818N6972o460P3402R9379n2312r3452J0406l961K7156
17122H65597o8538m7817j5739j00184j37253l0205j34967k0184L1668j17099o5857
17111A59422m9916K1038R0363R9757j0864o6087q5605j4323l6592m561o342O0737
17099A57027J2374j6309m2179o3394p616k2653N909k4236k4869K4930N2316l1602
17087A9698l7497n903R480j3744o3128q6675L6899K7508j6238J10063N0185J0155
17075D0803j9183M5066J888J1171l7756L3639K1911K3140o8459o27M3847K2197
17063A17637Q814P436M1061j7814p4l8205m9299J8458J6376P034j1753K2443q7372
$$ plain form
17145 330346 274496 271359 284179 289217 290277 244620 215604 225513 281501 362318 360374 453794
17133 453794 578649 754467 811439 804979 878381 977760 925448 831996 842402 838441 865597
17122 865597 797059 749242 733503 633319 496066 465861 330894 310710 342378 225279 159422
17111 159422 109506 130544 220907 320664 309800 243713 158108 143785 107193 102632 96290 157027
17099 157027 169401 153092 110913 47519 39903 17250 23159 -1077 -25946 -1016 51300 19698
17087 19698 -17799 -23702 -14222 -27966 -91094 -177769 -140870 -113362 -129600 -19537 30648 40803
17075 40803 21620 66686 68574 79745 41989 75628 97539 120679 52220 51593 95440 117637
17063 117637 126451 133887 174948 157134 157060 118855 69556 88014 104390 111424 99671 122114 34742
17050C4742J2016L4550O5699l190q0623j8423J7961o5536R348L7783P0078O7004
17038A81409J20513n4397j14284q2830o9746l7481J3725J0987l5703Q7184P4094
17027I3471l1365l9227j462P4294m2817j8226L04K9823m6750j18294k2413K4176
17015i8486J11861J18699o1473l8409j8674J3744j453M7583K0785l2745J8033
17004G9465m5255m1923k5230l0010j3147J3954K331N3573K4735L2285m2019o2334
16992e3575O405N1298K1918n165m2818N3370j2674l2120L2401Q8639k0790m0523
16980D6366M9056L8018N145j2589K9301k3841l337p23k1610k9616n5500m6743
16968b6073M7089j7856o8611j0765O8368J0320P06K6604j4194p0962Q1757j442
$$ plain form
17050 34742 46758 81308 147007 143817 63194 44771 62732 -2804 6544 44327 114405 181409
17038 181409 301922 247525 133241 50411 -19335 -56816 -43091 -32104 -67807 19377 93471
17027 93471 62106 22879 21417 95711 52894 34668 34972 64795 18045 -100249 -122662 -98486
17015 -98486 13375 132074 70601 32192 13518 27262 25809 73392 94177 61432 79465
17004 79465 34210 -7713 -32943 -62953 -76100 -62146 -59815 -6242 18493 50778 8759 -53575
16992 -53575 -47170 4128 26046 20881 -21937 31433 18759 -13361 19040 107679 86889 46366
16980 46366 95422 133440 138585 125996 155297 131456 128119 127396 105786 76170 20670 -26073
16968 -26073 21016 3160 -65451 -76216 -7848 2472 3178 29782 15588 -55374 26383 24941
16956B4941m3668j3032r8709q1196K6018k1517K6501M7612m0655N0932P4771P9791
16944C1789L9092J036o6654L5403L8366k9395L1918J0554l439j11018j00257L574
16932a19031k099L4333N7843K2107m306l3206o2131r6633K4504J31405M3706M1597
16920C8089J083J1866k2200Q142K5415j7935m8330R6491Q3435n2891m9129j28090
16908e4054l9310M5007Q53o572M0968N6099r1270o4841Q1880K2878n395M4428
16896C0671R756K065k1539o1715o6536J4867M4781L2904j1966m3321l1651N8051
16884d3633J08677M3778K8798n1227m7354m4935M1414j1073l6058r791m3310n6041
16872a20755k8396k2579J8933P1879M698l8069J4225M073M2836j437L2189K029
$$ plain form
16956 24941 -18727 -31759 -130468 -211664 -185646 -207163 -180662 -133050 -173705 -122773 -48002 31789
16944 31789 70881 71917 5263 40666 79032 49637 81555 92109 88670 -22348 -122605 -119031
16932 -119031 -121130 -86797 -28954 -6847 -11153 -44359 -106490 -203123 -178619 -47214 -3508 38089
16920 38089 39172 51038 28838 36980 62395 44460 -3870 92621 176056 123165 74036 -54054
16908 -54054 -93364 -48357 -47504 -54076 -13108 42991 -48279 -113120 -31240 -8362 -13757 30671
16896 30671 40427 42492 20953 -40762 -107298 -92431 -47650 -14746 -26712 -70033 -101684 -43633
16884 -43633 65044 108822 137620 86393 39039 -5896 35518 24445 -11613 -21404 -64714 -120755
16872 -120755 -149151 -171730 -152797 -80918 -76220 -114289 -100064 -95991 -53155 -54592 -22403 -20374
16860b0374o5523r242j8419K3274L9746M4709J3505m6566J2020P3866M8069n3885
16848D1180q0501J1332J2710L6536P7761J8746p2669J9030K3741L8055L6936p7430
16836H5427m8189k2879J074N9087j3913k5443j3435q4467n2834M8650O2388M9992
16824D5458n0101q8368K5512O6215L0627n376p9516l9658Q467M533l8612P1581
16812d9238K202n412j5055L793J15536N5467N6272o0548j22876l8980J5658M2575
16800f06K2793o929n6386m1218k4078O3104K8419K2292K0815j0003M2696j2594
16788D8305r284q8610n5866M4183Q2798O8566M3056K5138J6421M5221n3834o3634
16776A02460l3647k5989m9408L1355L1279L888n0042R246L3294j0611q6946K2686
$$ plain form
16860 -20374 -85897 -95139 -113558 -90284 -50538 -5829 7676 -38890 -26870 46996 95065 41180
16848 41180 -39321 -27989 -15279 21257 99018 117764 45095 64125 87866 125921 162857 85427
16836 85427 37238 14359 15433 74520 60607 35164 21729 -62738 -115572 -66922 -4534 45458
16824 45458 -4643 -93011 -67499 -1284 29343 23967 -55549 -95207 -86740 -82207 -120819 -49238
16812 -49238 -47036 -52448 -67503 -63710 51826 107293 163565 103017 -19859 -58839 -43181 -606
16800 -606 22187 15258 -41128 -82346 -106424 -43320 -14901 7391 28206 18203 60899 48305
16788 48305 39021 -49589 -105455 -61272 21526 90092 133148 158286 174707 219928 166094 102460
16776 102460 68813 42824 -6584 24771 56050 59938 9896 19142 52436 41825 -45121 -22435
16764b2435Q3910m5472j29176k7028K903K4827R149J131k4024Q3571J00304K5389
16752H3049m8478P1902n566o5787J1884K3078p093j04029r4034M0440N9444K7594
16740g596L9254j5000q513p36Q813n3682m2058K78j04664k1404P9988J19902O8420
16727F3002m8180n2300p4372M2051K6224Q9656O8542m1849m0903m4798J1150K0475
16715A8698k9399K08P949J1743K8402r794O362k0425j3143J6761m844m0787J775
16702b6494Q6683n7680l8184N9464K5216q2621m444P6688P6419o3392r3247l5706
16690g7298j1809K0556m8844m7438M2104J11017k2477J234m9742o8434J6531J2147
16678a22453j241J6448Q0645j1423M75k9397k0110N2660M9330l6607M6887J9645
$$ plain form
16764 -22435 61475 16003 -113173 -140201 -137298 -112471 -103322 -102191 -126215 -42644 57660 83049
16752 83049 34571 106473 100907 35120 47004 70082 62989 -41040 -135074 -94634 -35190 -7596
16740 -7596 31658 16658 8145 7409 16222 -37460 -79518 -79240 -183904 -205308 -125320 -5418 63002
16727 63002 14822 -37478 -111850 -69799 -43575 46081 114623 72774 31871 -12927 -1777 18698
16715 18698 -10701 -10493 -2544 9199 37601 27807 34169 13744 601 17362 12518 -28269 -26494
16702 -26494 60189 2509 -35675 23789 49005 -33616 -38060 38628 115047 51655 -41592 -77298
16690 -77298 -89107 -68551 -117395 -164833 -122729 -11712 -34189 -32955 -82697 -151131 -134600 -122453
16678 -122453 -123694 -107246 -26601 -38024 -37549 -66946 -87056 -34396 14934 -21673 25214 44859
16666D4859l151k6831m7091P650j8729l0238o9134K0183l1582k4739P1805J9402
16654h7596L9941l8749O700p4748o7793J3488L4449O0352N7692P524O4007k1649
16642f382o39O209K561l3856K0120K3916m3431R1572O2810k7832k8835o0808m038
16629A367J2450K0339J3351l3322n3750q5590J6365N7495J1546k00n9401n0349
16617a49699O8592M211n5935K1649N5271m2411O4513R224k2999n4392k9386N9915
16605g1447J8515n7070q186M9362M6978j2051m0931j8821J41543M684m8947J4433
16593A8062m9009N4015J5286m1846N221K1661M6008k32k7080k4355m6509K6429
16581b349k8876J4646N3011j8031l6287l1161m4847O0281L0054L013r543m9996
$$ plain form
16666 44859 41708 14877 -32214 -24564 -43293 -73531 -142665 -122482 -154064 -178803 -106998 -87596
16654 -87596 -47655 -86404 -79704 -154452 -222245 -208757 -174308 -113956 -56264 -48740 15267 -6382
16642 -6382 -7021 -812 1749 -32107 -11987 11929 -31502 60070 122880 95048 66213 5405 1367
16629 1367 13817 34156 47507 14185 -39565 -125155 -108790 -51295 -39749 -39949 -99350 -149699
16617 -149699 -81107 -76896 -132831 -111182 -55911 -98322 -33809 -24585 -47584 -101976 -131362 -71447
16605 -71447 -52932 -110002 -118188 -68826 -21848 -33899 -74830 -93651 47892 52576 3629 18062
16593 18062 -30947 23068 38354 -3492 1729 23390 69398 69166 42086 17731 -28778 -2349
16581 -2349 -31225 -16579 36432 18401 -17886 -49047 -93894 -33613 -3559 -546 -10089 -60085
16569f0085m316j0438p440R180P2111o27k3582j5191r446n8757M3351J8303j3085
16556f0022l9903j526l3459J3163M3105k0647l8311M0815L5704k2369R9176K7627
16544D3353J4639l8325n260O9627N159j2400l4325L793M4059l3221j11191j5988
16532g0080M5271k8243k8637N4602J9381j2404m7399j4446o983M0345K042k7825
16520g4376M1234m8663l6991j5875k9551N010j148R3158J3452N305L0897K7068
16508I520l8029n8252j9013j7578M0466k2719R222o547K5461K5437O5408K0507
16496C3883m5703k6414k7942K5330j3361k1419j0174K9948j0604Q584M6931N2935
16484D1994j4285j7901p300J7957k9896j02809J17872K7134o3498K7985K5504
$$ plain form
16569 -60085 -64401 -74839 -82279 -73099 -988 -1615 -25197 -40388 -49834 -108591 -65240 -46937 -60022
16556 -60022 -99925 -101451 -134910 -121747 -78642 -99289 -137600 -96785 -61081 -83450 15726 43353
16544 43353 57992 19667 14407 84034 89193 76793 42468 46261 90320 57099 -54092 -70080
16532 -70080 -24809 -53052 -81689 -27087 -7706 -20110 -67509 -81955 -88938 -48593 -46551 -74376
16520 -74376 -33142 -81805 -118796 -134671 -164222 -159212 -160360 -67202 -53750 -48445 -17548 9520
16508 9520 -28509 -86761 -105774 -123352 -82886 -105605 -96383 -102930 -77469 -52032 13376 33883
16496 33883 -11820 -38234 -66176 -40846 -54207 -75626 -85800 -55852 -66456 -57872 -10941 41994
16484 41994 27709 9808 2508 20465 -9431 -112240 5632 32766 -30732 -2747 22757
16473B2757j8097M662K1023j5739r2268R6732j5096k3830l3959L9521j0105K635
16461b1764n4337M4160J3540m0070m9650J0727J0464O76J4829O1103Q933l4917
16449c6306J5484J5600L2388J3182j6874q1424n3304M6875J23235N197p6343J1731
16437e59n5296M1657L9311J778J8782m4919k6061N6943R740k2559J8949o7805
16425c0039r6491J5567O0770J5470j4890P8502P3504r602j54775r423j2993j3627
16413i8027j78O6703L0214J2516L8797j3897l5040q8673j6953J2292n6431k7228
16401a75905k7911K5869L8104L0637N8960l147n0893p0824M5636R3599j7326n1507
16389a04708m9797l0361k0020J42982R2180k1140K4936k919o727J6764q384l2056
$$ plain form
16473 22757 4660 9322 30345 14606 -77662 19070 3974 -19856 -53815 -14294 -24399 -21764
16461 -21764 -76101 -31941 -18401 -58471 -108121 -97394 -86930 -86254 -71425 -10322 -1389 -36306
16449 -36306 -20822 -5222 27166 40348 23474 -57950 -111254 -64379 58856 64053 -12290 -559
16437 -559 -55855 -14198 25113 26891 45673 754 -25307 31636 41376 18817 37766 -30039
16425 -30039 -126530 -110963 -50193 -34723 -49613 28889 102393 92791 -61984 -71407 -84400 -98027
16413 -98027 -98205 -31502 -1288 11228 50025 36128 1088 -87585 -104538 -92246 -148677 -175905
16401 -175905 -203816 -177947 -139843 -109206 -50246 -53393 -104286 -175110 -129474 -35875 -53201 -104708
16389 -104708 -154505 -184866 -204886 -61904 30276 9136 34072 31153 24426 41190 32806 750
16377G50l4627n9695J1425O303q8463n1839O4916O9501K7363J0994l2855K39M0232
16364c5756j7013J5292J7886k0264L2851K5796L483j0462o0881R4207J4093j20553
16352f1321J2491J4074p2343K362k3489K04M7647j7831p1929M099m4537L8754
16340a71819P4098J3519J0915O8396O2440k9050m954l216j1494l818J4602l6522
16328a6903l0540J1582k5763L7365o258k6339P554l1893N4985Q1826K3961j11818
16316c2241q3139L736k9628o390N8774R1644l284K8031l4711J7963L9646l1270
16304A9131N8526L0488n5278n3998j7111l7089n8843J0632M5640J5539n4907o8961
16292a66231N4179L3548p4523j1291L6045M487O5804M5868m3018l7363J3800L8022
$$ plain form
16377 750 -33877 -93572 -82147 -75844 -164307 -216146 -151230 -81729 -54366 -43372 -76227 -75988 -35756
16364 -35756 -52769 -37477 -19591 -39855 -7004 18792 22275 11813 -49068 45139 59232 -61321
16352 -61321 -48830 -34756 -107099 -104737 -128226 -128022 -80375 -98206 -170135 -166036 -210573 -171819
16340 -171819 -97721 -84202 -73287 -4891 57549 28499 23545 20329 8835 5017 19619 -16903
16328 -16903 -47443 -35861 -61624 -24259 -30517 -56856 -49302 -81195 -26210 55616 79577 -32241
16316 -32241 -115380 -111644 -141272 -147662 -88888 2756 -528 27503 -7208 10755 50401 19131
16304 19131 77657 108145 52867 -1131 -18242 -55331 -114174 -103542 -57902 -42363 -97270 -166231
16292 -166231 -112052 -78504 -153027 -164318 -128273 -123786 -57982 -12114 -55132 -92495 -78695 -40673
16280d0673m9341l3780L6398Q859j6648j0057L9786l181K1823m2040j6106q288
16268a13248L9052N161k4015l2853N9505n691K901n2204l526r282R6757O8041
16256C0598K7415q1184r6192O0488M551k3382L1821L8095o1920r7694N486K7142
16244a34776l9285L9598P7058O448n303K8029J5108o4389j5859j4167r240L5400
16232h1378P3778n5895L5153n6478l5173O4402M4517L9176J5229P5261k6575k2172
16220F9845j31228l2796K115l8818J0321K2184j2539m2746J8521M5499l6628L5682
16208i0588N3187K9803k7682n0387j7110K4117M4454J7308q2324K4477K8636n872
16196e1981L7529q7183j15586L9908P5723J2729q896M7067Q9702O5987m2425j31341
$$ plain form
16280 -40673 -90014 -123794 -87396 -78537 -95185 -105242 -65456 -68637 -46814 -88854 -104960 -113248
16268 -113248 -74196 -69035 -93050 -125903 -66398 -72089 -69188 -121392 -124918 -134200 -37443 30598
16256 30598 58013 -23171 -119363 -58875 -54324 -77706 -45885 -7790 -69710 -167404 -161918 -134776
16244 -134776 -174061 -134463 -57405 -50957 -56260 -28231 -13123 -77512 -93371 -107538 -116778 -81378
16232 -81378 -7600 -63495 -28342 -84820 -119993 -55591 -11074 28102 43331 118592 92017 69845
16220 69845 -61383 -94179 -92064 -130882 -120561 -98377 -110916 -153662 -135141 -89642 -126270 -90588
16208 -90588 -37401 -7598 -35280 -85667 -102777 -78660 -34206 -16898 -99222 -74745 -46109 -51981
16196 -51981 -14452 -101635 -217221 -177313 -101590 -88861 -97757 -50690 39012 104999 62574 -68767
16184f8767k0091J0735P620n3579L275M9559M9680J8066J9393l0700o0485j01911
16172a77205L1896N7038Q9806L5135k0383L0147k2557q9070j6616J0716o3961
16161a35054L1670N4983m7809r3802J1808j8928R8121J14946k5624l7837o1265
16150a08791q420P4927m890p459J0395K5613n9718k5859R0202L6233p6088m8743
16138a02598l3252n1271N5884R2378L9385m2409j9580n257N1349j3232l4367k5769
16126h8739l9326o3837Q1165O1681o0040R690m6734L009L9672o3883K3738M1554
16114a02050L8574N952o1983o5794j9794N8392O4304R5314L0338j23321m1188
16103a21256n3795J00230P4238m1149M3338K4497L975J8070l3529l4258l2239
$$ plain form
16184 -68767 -88858 -78123 -70503 -124082 -120807 -71248 -21568 -3502 15891 -14809 -75294 -177205
16172 -177205 -145309 -88271 1535 36670 16287 46434 23877 -65193 -81809 -71093 -135054
16161 -135054 -103384 -48401 -96210 -190012 -178204 -197132 -99011 15935 -9689 -47526 -108791
16150 -108791 -117211 -42284 -47174 -54633 -44238 -18625 -78343 -104202 -14000 22233 -53855 -102598
16138 -102598 -135850 -187121 -131237 -38859 526 -41883 -61463 -66720 -15371 -28603 -62970 -88739
16126 -88739 -128065 -191902 -110737 -49056 -109096 -99406 -146140 -143131 -103459 -167342 -143604 -102050
16114 -102050 -63476 -57524 -119507 -185301 -205095 -146703 -82399 12915 43253 -80068 -121256
16103 -121256 -175051 -74821 -583 -41732 1606 26103 30078 48148 14619 -19639 -51878
16092e1878q470l8357J9203J4104m3846o9155l0866O9108J8950o7344m4631N5169
16080a78013J6386n5J1939l3578L3939p384M0724J22346K3583j2599l5413q0055
16068i8180K6319J08884K941r5387q8027j8157k855j1278K3309J7813M7530o1363
16056a48451J2355P2294j7243J9158q4945R478R0759j4356j1323O3026k971j6685
16044b8904o749p0428k8905r403l6611P5715Q4867j7449r2993L3530N861l8654
16032a30123K7215p1N1543M2604R407J5785j04142K1716J04255M1985l8089m6282
16020d197j9585O30Q884o4934j1807K5308R761L1131l7668M010M9478K0438o821
16007D628q7545L5809J6109q3104J2679N8174K057l7637J23144P8163k0604n8676
$$ plain form
16092 -51878 -60348 -98705 -79502 -65398 -109244 -178399 -209265 -140157 -121207 -188551 -233182 -178013
16080 -178013 -161627 -161682 -149743 -183321 -149382 -156766 -116042 6304 29887 17288 -18125 -98180
16068 -98180 -71861 37023 39964 -55423 -143450 -161607 -164462 -175740 -152431 -134618 -87088 -148451
16056 -148451 -136096 -63802 -81045 -61887 -146832 -137354 -46595 -60951 -72274 -9248 -12219 -28904
16044 -28904 -35653 -106081 -134986 -144389 -181000 -105285 -20418 -37867 -130860 -97330 -91469 -130123
16032 -130123 -102908 -102979 -51436 -8832 575 16360 -87782 -66066 38189 80174 42085 -4197
16020 -4197 -23782 -23152 -14268 -79202 -91009 -65701 -55940 -24809 -62477 -58467 -8989 11449 4628
16007 4628 -82917 -47108 -30999 -114103 -101424 -43250 -41193 -78830 44314 122477 101873 43197
15995D3197m1304K7516o2529p4075O3418K053k9723j9264Q91j8695k3533O1775
15983g0273K3845m5764l6598J3253J2797n5724j0308R0013N5164n855l0875m6186
15971a06511k0802l606J5258l148K7226L3131m2612l2612P399k1709J02384K8431
15959a7171j01477n508M8670m8915l6587M1062Q5873P8072j4749q90n1918n795
15947b9333j2933l5983M4654l494j09632n188J5660l4252O1635M716j5686O7905
15935e1931M8994j1915J037L3592L6226j9147k7669L2522n9628k7130k6847r16
15923g2812l2479m3097m1488J4580J5703L4164N1040q3363O3098O9741m1732o5519
15911a32164l0385O8511J871J1846l0830K6664J8075J4743J4931j6633j4673o9779
$$ plain form
15995 43197 1893 29409 -33120 -107195 -43777 -41724 -71447 -90711 -89820 -108515 -132048 -70273
15983 -70273 -46428 -92192 -128790 -115537 -102740 -158464 -168772 -78759 -23595 -29450 -60325 -106511
15971 -106511 -127313 -130919 -115661 -118809 -91583 -58452 -101064 -133676 -126277 -147986 -45602 -17171
15959 -17171 -118648 -124156 -75486 -124401 -160988 -119926 -34053 44019 29270 28380 -23538 -29333
15947 -29333 -42266 -78249 -33595 -37089 -146721 -151909 -136249 -170501 -108866 -104150 -119836 -51931
15935 -51931 -2937 -14852 -13815 19777 56003 36856 9187 41709 -17919 -45049 -71896 -72812
15923 -72812 -105291 -148388 -189876 -175296 -159593 -125429 -74389 -157752 -94654 -24913 -66645 -132164
15911 -132164 -162549 -94038 -92167 -80321 -111151 -84487 -66412 -51669 -36738 -53371 -68044 -137823
15899a37823k5001l9903j9039P9359J6769L0420k4697j08213l4960L3094P2868
15888a57126j7052k0279K0049j8288j8417K4236J3509N211k3120J7033J53091
15877b1153L3679j9872j3561l9190p6008o4764l2348N2303L0867J7772P5082l4591
15865i1784L126q68J0093K3921r095J9128R416n8684j8741m2711J8981j8891j8062
15852a74171N3164R3873m6959m0908L544P1337m399k9523j3511k6500k6858J150
15840a39761q4034n886L5230M8160M667n4107J3394K3409J34337j9855N54O7247
15828B3355R4150o1054j41601j3527j4035J4490K8337M676n5128n3344M4565Q3539
15816d5577K6087k5604K3829m3062n5241J8079k754j7411j0453J1789O0819Q0485
$$ plain form
15899 -137823 -162824 -202727 -221766 -142407 -125638 -95218 -119915 -228128 -263088 -229994 -157126
15888 -157126 -174178 -194457 -174408 -192696 -211113 -186877 -173368 -168157 -191277 -174244 -21153
15877 -21153 12526 -7346 -20907 -60097 -136105 -200869 -233217 -180914 -150047 -132275 -57193 -91784
15865 -91784 -88658 -89526 -79433 -55512 -64607 -45479 -36063 -94747 -113488 -156199 -137218 -156109 -174171
15852 -174171 -121007 -27134 -74093 -115001 -111457 -40120 -44519 -74042 -87553 -114053 -140911 -139761
15840 -139761 -223795 -229681 -194451 -146291 -141624 -195731 -182337 -158928 -24591 -44446 -43892 23355
15828 23355 117505 56451 -85150 -98677 -112712 -98222 -69885 -65209 -120337 -173681 -129116 -45577
15816 -45577 -19490 -45094 -21265 -64327 -119568 -101489 -104243 -121654 -132107 -120318 -59499 20986
15804B0986K6960L6863p6985o4118m2011K7822Q822O5121M2231k5080k1663j7596
15792a8648m9456q885l8761o7346M4451M4383L8028m7042p4880R5792O0795m0920
15780f2489j3825o8856j1665j6894J5601n2862L841j8349K3648O0918L1879j4694
15768a23747M9748j7356l2001l6431l7K3378P9884N7448j094K5561K4993n4492
15756d146r1677m2170L8844K2784J9003K4686m0962L2002l346m6110L840j8770
15744a06022j8726Q1958N5405Q1762l3568r1488m7013m987l423j9773m4550K9075
15732a21350O7660k8869q0626o7956o7411m2453J745J06526L2612J37102K4620
15721c8400J8823j32492N8488J17699q219m6550l7765o4591k469L0522N3628L4283
$$ plain form
15804 20986 47946 84809 7824 -56294 -98305 -70483 -61661 3460 45691 20611 -1052 -18648
15792 -18648 -68104 -76989 -115750 -183096 -138645 -94262 -56234 -103276 -178156 -82364 -21569 -62489
15780 -62489 -76314 -145170 -156835 -173729 -158128 -210990 -207149 -225498 -201850 -140932 -109053 -123747
15768 -123747 -73999 -91355 -123356 -159787 -159824 -136446 -56562 886 -208 25353 50346 -4146
15756 -4146 -95823 -137993 -99149 -76365 -57362 -32676 -73638 -41636 -44982 -91092 -87252 -106022
15744 -106022 -124748 -42790 12615 94377 60809 -30679 -77692 -82679 -86102 -105875 -150425 -121350
15732 -121350 -53690 -82559 -163185 -231141 -298552 -341005 -339260 -232734 -200122 -63020 -38400
15721 -38400 -19577 -152069 -93581 24118 15899 -30651 -68416 -133007 -135476 -104954 -51326 -17043
15709a7043o7156q1214Q489K9665K5317K2175q0722m640K3797M2364j983k2644
15697a23595j10808P5146Q8423K6336q6741M5323j0784j0056Q2P5680K2280N1623
15685D2909K0862p203J2412j42918q0736K1419M0429J6964j5754j3778q4322j4787
15673b04503L9336K1375R2111K1163k3715L2030O7931n750o2362O4174M4510o0193
15661B6107j3208l84r5010n2916l5327j850K7879L085L4083R0989J7672j9445
15649a8325j6708m3546J0397J1524K4849N2531J2241q6440l0685k7435j5328N4704
15637g2221N6522n8156K958m4507r4861J6382P7452q011n4774P2692N7586k5705
15625g4643k4288j2914j386l0350k0205K2580J2322P6716k7958j9678O2696N0645
$$ plain form
15709 -17043 -84199 -165413 -156924 -127259 -101942 -79767 -160489 -165129 -141332 -98968 -100951 -123595
15697 -123595 -234403 -159257 -70834 -44498 -131239 -85916 -96700 -106756 -106674 -30994 -8714 42909
15685 42909 63771 56568 68980 -73938 -154674 -133255 -92826 -75862 -91616 -105394 -189716 -204503
15673 -204503 -165167 -143792 -51681 -30518 -54233 -22203 45728 39978 -22384 41790 86300 26107
15661 26107 12899 12515 -82495 -135411 -170738 -172588 -144709 -141624 -107541 -16552 1120 -18325
15649 -18325 -35033 -78579 -68182 -56658 -31809 20722 32963 -53477 -84162 -111597 -126925 -72221
15637 -72221 -15699 -73855 -70897 -115404 -210265 -193883 -116431 -124442 -179216 -106524 -48938 -74643
15625 -74643 -98931 -111845 -113231 -143581 -163786 -141206 -128884 -52168 -80126 -99804 -37108 13537
15613A3537q5226L2805M7216p0854k0564O3584q285m0615J0599l0483m2505L936
15601a26855M8452Q275n8757J4682Q577K4250O5665J0345m7822m7688r2873J3795
15589a79954L6656Q4862k2881j4484M7246n363L259j5572k5256N0701j0942j4787
15577f6515l7270N1432m9030j03116l1622N0681M5068j4476M6940N0830j8814
15566g5892n5557O4992J24065L1213p7711o9861k4620m2360j3381J0343O9089
15555e9680M0410L1938Q5216p0083k2044K0583m7281k0415M8315k2347L858L703
15543g827j00888o2183P3362P7655N2972P367j8747o0794L129K6400n7472M5866
15531b1160m4265j33188k0491Q1231Q269n532m7759M2185O0228l3173J9124j1711
$$ plain form
15613 13537 -71689 -38884 8332 -62522 -83086 -19502 -27787 -68402 -57803 -88286 -130791 -126855
15601 -126855 -78403 -70128 -128885 -114203 -105626 -81376 -15711 -5366 -53188 -100876 -193749 -179954
15589 -179954 -143298 -58436 -81317 -95801 -48555 -53918 -50659 -66231 -91487 -40786 -51728 -66515
15577 -66515 -103785 -52353 -101383 -204499 -236121 -185440 -140372 -154848 -107908 -57078 -75892
15566 -75892 -131449 -66457 57608 88821 11110 -58751 -83371 -125731 -139112 -128769 -59680
15555 -59680 -19270 12668 97884 27801 5757 26340 -20941 -41356 6959 -15388 -11530 -7827
15543 -7827 -108715 -170898 -97536 -19881 33091 40458 21711 -39083 -35954 -9554 -67026 -21160
15531 -21160 -65425 -198613 -219104 -137873 -129604 -135136 -182895 -140710 -80482 -113655 -94531 -106242
15519a06242J5969n4943o2923j6060M0826L4736O5448j2953K026L7500k6290n2114
15507a35020P884N3901j4559j7123m914O9541N1201j0483J4117j00806o4460M5485
15495a05236Q1258n656N3065K9412J7260p5658o5865N475n5937q6498R805K7524
15483a71051k2261o877Q5235M0864j4654r414o6812k3958K7394L1350K2105K9345
15471g8734k9985N666k5218M3996M8529L2675R1608l3102l7916l1433j5475O54
15459b8735l9678l4645j6599l4678j136N5494P4872N6770J1753r5600J7870P0109
15447C5797J7353k222o3520j15388q5785L2031M5604j9728M2072j7753m9432J2348
15435a68623Q510M7282n3249l2198M6582O1502q202k2390o6729K6374P1908L3842
$$ plain form
15519 -106242 -90273 -145216 -208139 -224199 -183373 -148637 -83189 -96142 -94116 -56616 -82906 -135020
15507 -135020 -127136 -73235 -87794 -104917 -109831 -40290 10911 428 14545 -86261 -150721 -105236
15495 -105236 -23978 -29634 23431 52843 70103 -5555 -71420 -65945 -121882 -208380 -198575 -171051
15483 -171051 -193312 -200189 -114954 -74090 -88744 -98158 -164970 -188928 -161534 -130184 -108079 -78734
15471 -78734 -108719 -103053 -128271 -84275 -35746 -3071 88537 55435 17519 -13914 -29389 -28735
15459 -28735 -68413 -103058 -119657 -154335 -155471 -99977 -25105 31665 43418 -52182 -34312 35797
15447 35797 53150 50928 -12592 -127980 -213765 -181734 -136130 -155858 -113786 -131539 -180971 -168623
15435 -168623 -160113 -112831 -166080 -198278 -151696 -90194 -98396 -120786 -187515 -161141 -89233 -55391
15423e5391M4489k5612l4190k7259o2034k4600Q6669k1591J7615J13144o643o4990
15411f0393l7014o458j5778k5277r5136n2928N0828P9949N2080K4728O657K0112
15399e8630M5593M4688p8869n2872J9579o394o7984O3395M4278p1110K4180N4075
15387d0071L8230k4288l2631J3345R7459K7161n8686O901n5616m402K4953p3710
15375h1355j752L3562O8554M0185p8956k2919J2755P2884m3089l0965M9621j793
15363A6732q1545n2146k53J05131M4230L321m6113k0395L7222p1616L6285P3224
15351D4077j6486m6351j5744m7590q0152Q7153L4387L8714k2521l5310J2932n6419
15339a03310k5411J3563j4881L6935K5450k525l4708M28q907J5829L0714j9163
$$ plain form
15423 -55391 -10902 -36514 -70704 -97963 -159997 -184597 -97928 -119519 -101904 11240 4597 -60393
15411 -60393 -97407 -103865 -119643 -144920 -240056 -292984 -242156 -162207 -110127 -85399 -78742 -58630
15399 -58630 -13037 31651 -47218 -100090 -80511 -86905 -154889 -91494 -47216 -118326 -94146 -40071
15387 -40071 -1841 -26129 -58760 -45415 52044 79205 20519 27420 -28196 -32598 -7645 -81355
15375 -81355 -83107 -49545 19009 59194 -19762 -42681 -29926 42958 -131 -31096 18525 16732
15363 16732 -64813 -116959 -117212 -12081 32149 35470 -10643 -31038 6184 -65432 -29147 44077
15351 44077 27591 -18760 -34504 -82094 -162246 -75093 -40706 -1992 -24513 -59823 -46891 -103310
15339 -103310 -128721 -115158 -130039 -93104 -67654 -70179 -104887 -104459 -113366 -97537 -66823 -85986
15327h5986j32464L0457Q0810L4420o0062K057M722n6041r9340n918P1546m862
15315b20661o0842N8709m8230r5534N6595O2985J6095Q122J35963N7820p9895
15304a08873j80J11340K1359o7396L1025J5209r1114J5753J2902k7489p939j7506
15292a12909k5634p295K925K2855K5213k811n0203L7859L2829J4483k0434l384
15280h6506j0819r200P3549r911l9404m6652L053K5559Q536l4614O3318l8589
15268a01680j03412L9204N9373J3843K580O344o883l408Q0281L0315r0016p2589
15256a46048M78K2627j34322j4229M0154J20783M6995n5368o5182p768J921M494
15244a85465L295l0073l873L3840M6079k8013j4881L0337K6326O6942k1178m3066
$$ plain form
15327 -85986 -218450 -187993 -107183 -72763 -132825 -130768 -126046 -182087 -281427 -287345 -215799 -220661
15315 -220661 -281503 -222794 -271024 -366558 -309963 -246978 -230883 -222761 -86798 -28978 -108873
15304 -108873 -109053 2287 23646 -43750 -12725 2484 -88630 -72877 -59975 -87464 -95403 -112909
15292 -112909 -138543 -145838 -142913 -120058 -94845 -97656 -147859 -110000 -77171 -62688 -83122 -86506
15280 -86506 -97325 -106525 -32976 -42887 -82291 -128943 -125890 -100331 -91795 -126409 -63091 -101680
15268 -101680 -205092 -165888 -106515 -92672 -90092 -83748 -90631 -94039 -13758 16557 -73459 -146048
15256 -146048 -145570 -122943 -257265 -271494 -231340 -110557 -63562 -118930 -184112 -191880 -189959 -185465
15244 -185465 -182170 -212243 -216116 -182276 -136197 -164210 -179091 -148754 -122428 -55486 -76664 -119730
15232a19730j3822P0567J0402k8413m2378m1061o0485l7354K4121k52L1490k2384
15220b29299Q7285J43889M9799q506l3403m9971J3114l2863l6193r3713q4786
15209b74647N5939J30155L2056N7940j3776o1712l8894L8673M3580J0765n7629
15198g7550k342j18874m301J04484R2147k7058l2210j3089k6557L078m3138R954
15186a35456N5726m005m1604p908J5089k6327j4235L1110k3461J3882l7956K6311
15174a48834M3231N122P9311J5473J7725k8931k0345k4955n1551p1039L8299K5037
15162a21457K753N7925k4306n5042P7519K8205J1246M739m1393j10795l808o697
15150a81111J5689Q5337p11j7338K0654J6411r4307J2463P2505r0359r951K0228
$$ plain form
15232 -119730 -133552 -62985 -52583 -80996 -123374 -164435 -224920 -262274 -238153 -238405 -206915 -229299
15220 -229299 -142014 1875 51674 43168 9765 -40206 -27092 -59955 -96148 -189861 -274647
15209 -274647 -218708 -88553 -56497 1443 -12333 -74045 -112939 -74266 -30686 -19921 -77550
15198 -77550 -79892 -198766 -203067 -98583 -6436 -33494 -65704 -78793 -105350 -102272 -145410 -135456
15186 -135456 -79730 -83735 -125339 -133247 -118158 -144485 -158720 -127610 -151071 -137189 -175145 -148834
15174 -148834 -105603 -100481 -21170 -5697 12028 -16903 -37248 -62203 -113754 -184793 -146494 -121457
15162 -121457 -118704 -60779 -85085 -140127 -62608 -34403 -23157 -18418 -59811 -170606 -174414 -181111
15150 -181111 -165422 -80085 -80796 -98134 -77480 -61069 -155376 -142913 -70408 -160767 -170718 -150490
15138a50490j1035M554k4700J6511j7884L8211O7362L7001l7255P7265j469j089
15126c018p818j06201j04149J0430n1813j3379Q6779L7937P460L2514L7645j3891
15114h7504O9170l4548q0344K0331M9875l6986M254l3633j5200k3093L9770J45901
15102A7993K8467O8943j3090m1075j20714q7595N9477m4633K2214p0998j3667
15091a94678q501M2143N8520m1853o9077r315J4325m3619K6556R0496l650M8137
15079i0516J6018L8240m429q3172K8293K1329R041n5918j12541N8391L9824N5844
15067g9596m0856J0233k3532J14297j2219m7315L9400l213k9980J8658N238o4279
15055a13164o2924M0981m1893n7280O736Q8265N0590K0637m0138o2060n6144Q5502
$$ plain form
15138 -150490 -161525 -156971 -181671 -165160 -183044 -144833 -77471 -40470 -77725 -460 -1929 -3018
15126 -3018 -10836 -117037 -221186 -210756 -262569 -275948 -189169 -151232 -143772 -111258 -73613 -87504
15114 -87504 -18334 -52882 -133226 -112895 -63020 -100006 -95752 -129385 -144585 -167678 -127908 17993
15102 17993 46460 115403 102313 61238 -59476 -147071 -87594 -132227 -110013 -181011 -194678
15091 -194678 -203179 -161036 -102516 -144369 -213446 -222761 -208436 -252055 -225499 -135003 -138653 -90516
15079 -90516 -74498 -36258 -40687 -123859 -95566 -74237 -65196 -121114 -233655 -175264 -135440 -79596
15067 -79596 -120452 -110219 -133751 -19454 -31673 -78988 -39588 -42801 -72781 -54123 -48885 -113164
15055 -113164 -176088 -135107 -177000 -234280 -227544 -139279 -88689 -68052 -108190 -170250 -226394 -140892
15043a40892O9648o0943L583N3800K1476j25751l3123N1777m767L3822j3213N0281
15031i4302J4859m1790M4551m3182J8933R2793k4088M8822K9791k7780J484p4237
15019e4146n8526L0276n79L2876k3497q9710k5322o487J0135N003k5463j2563
15007b18003k5823N2475L2424K4286o3799J0196O6850L3828m308j2341n517j284
14995a11016J5492P0642j0234n4365m2137m0674l1541J05266Q6482j06447j99
14984a18731J9621k7520j0414N1541m3458K6263P7897p849p6601l8690J7726Q367
14972a21848%P3426k5541n8174L9573N6714K9341j16969J3955Q9707j9689k9783
14960f9288Q5897k9317q8023j2287m0272m2500K6292J6507O4410n7614l9352M1786
$$ plain form
15043 -140892 -71244 -132187 -128604 -74804 -53328 -179079 -212202 -160425 -165192 -131370 -144583 -94302
15031 -94302 -79443 -121233 -76682 -119864 -100931 -8138 -32226 16596 46387 18607 20091 -54146
15019 -54146 -112672 -82396 -82975 -50099 -73596 -163306 -188628 -195115 -184980 -179977 -205440 -218003
15007 -218003 -243826 -191351 -158927 -134641 -198440 -188244 -121394 -87566 -91874 -104215 -109732 -111016
14995 -111016 -95524 -24882 -35116 -89481 -131618 -172292 -203833 -98567 -12085 -118532 -118731
14984 -118731 -99110 -126630 -137044 -85503 -128961 -102698 -24801 -32650 -109251 -147941 -130215 -121848
14972 -121848 -121848 -48422 -73963 -132137 -92564 -35850 -6509 -123478 -109523 -19816 -39505 -69288
14960 -69288 16609 -12708 -100731 -113018 -153290 -195790 -169498 -152991 -88581 -146195 -185547 -143761
14948a43761j3689m6285j8036L168l735J2701j0183L1759K9278P353M3697K8143
14936g9590r5890O687J17553Q6789j7261j32609j1892R914m6248l3641P2411Q1537
14924d2240M8794l1702P266K2430n054P303J165J2604R116o2962J740K3577k6456
14911c4419k2836j6253j6879O40l5017k0476j1891n64l6020n014L0381Q3513l9326
14898a24161m6592K6470P5898O7978k7597L6574n726j20097k9567P4082n735j05533
14886a84006j9929k5891k3156O3285K2290J5489N9647j247n3146R273Q5789P849
14874d3753m3384N1927J1315p1510p2051L7811m4712n1863K928J07166J31508
14863A5382K5932m3370p9721K993m18j11737N1003L6425N4353p8524n5417k3804
$$ plain form
14948 -143761 -157450 -203735 -221771 -218603 -222338 -209637 -219820 -188061 -158783 -151430 -107733 -79590
14936 -79590 -175480 -168793 -51240 35549 18288 -114321 -126213 -116299 -162547 -196188 -123777 -42240
14924 -42240 6554 -25148 -17882 4548 -506 6797 7962 20566 29682 -33280 -31540 -7963 -34419
14911 -34419 -57255 -73508 -90387 -89747 -124764 -145240 -157131 -157695 -193715 -198729 -168348 -84835 -124161
14898 -124161 -170753 -144283 -68385 -407 -28004 8570 2844 -117253 -146820 -72738 -78473 -184006
14886 -184006 -203935 -229826 -252982 -189697 -167407 -151918 -92271 -93518 -146664 -137391 -51602 -43753
14874 -43753 -87137 -35210 -23895 -95405 -167456 -129645 -174357 -226220 -223292 -116126 15382
14863 15382 41314 -2056 -81777 -78784 -79202 -190939 -139936 -103511 -49158 -127682 -183099 -206903
14851b06903N5962O1422J6314n4033m0818L0513n1217P4873o239j6426J1226M7262
14839g8064k1144p0759M9314j1203O560M7566M5747J461m0135o5331j2234O531
14827a41691k3947k3871j06300j2024k689j8527l7776L1255J00899J4223k7608
14816b48056M3733K3170O0527L9928l9749j5913M1515n4966n4450m9460K5327
14805b28394J35571J12618l7254l5616Q480J9454K7094P1663k6859j05448l2984
14794i1675m4375o9629r254j0800J16932K2534K0585l5216k2091N6177J439o1980
14782a27353K3345N9911p0107j27283J8931J14719L2731r398m44l922R88m155
14770i2037j9588j2545N2472K7374N630O0361k1580m5255r0830n5997M7817N1812
$$ plain form
14851 -206903 -150941 -89519 -73205 -127238 -168056 -137543 -188760 -113887 -120126 -136552 -125326 -78064
14839 -78064 -99208 -169967 -120653 -131856 -125296 -77730 -31983 -30522 -70657 -135988 -148222 -141691
14827 -141691 -165638 -189509 -295809 -307833 -310522 -329049 -366825 -335570 -234671 -220448 -248056
14816 -248056 -204323 -181153 -120626 -80698 -120447 -136360 -94845 -149811 -204261 -253721 -228394
14805 -228394 -92823 19795 -17459 -53075 -44595 -25141 1953 73616 46757 -58691 -91675
14794 -91675 -136050 -205679 -214933 -225733 -108801 -86267 -65682 -100898 -122989 -66812 -65373 -127353
14782 -127353 -104008 -44097 -114204 -241487 -222556 -107837 -75106 -84504 -84948 -88870 -87882 -92037
14770 -92037 -111625 -124170 -71698 -44324 -38694 21667 87 -45168 -135998 -191995 -144178 -92366
14758i2366l871M6367N3005M1916J8479M6400p8216j05531K3613m0849r4016k5249
14746b10318J20322M0619m6340k0263O4441L2516l3965j709J1788M2413J867n6546
14734e5175n8152j8979K3593j5583p3121m6254L4673j0869Q1900n4810M0046J22415
14722c0316J6861l0746l5566J4601p5809N365L7591o8335K7244N4715j3203j4135
14710a11733l2364o064j1354l0633m0478J04975L3958L9844J5414j56328P68j944
14698a95939J2953l6218L5351P7386M7510K3525j4468J0266J145L9624Q378K6297
14686C5810q3133o043k5974j02598M74L5644J39012Q0156m0116j04368n6094j11198
14674b38428n8444O7744O3799L2135m123J8835P9854l875K1825K710M2354q552
$$ plain form
14758 -92366 -96237 -49870 3135 45051 63530 109930 31714 -73817 -50204 -91053 -185069 -210318
14746 -210318 -89996 -49377 -95717 -115980 -51539 -19023 -52988 -54697 -42909 -496 1371 -55175
14734 -55175 -113327 -132306 -108713 -124296 -197417 -243671 -208998 -219867 -137967 -192777 -152731 -30316
14722 -30316 -13455 -44201 -79767 -65166 -140975 -135610 -98019 -166354 -139110 -84395 -97598 -111733
14710 -111733 -144097 -150161 -161515 -192148 -232626 -127651 -93693 -53849 -38435 -194763 -193995 -195939
14698 -195939 -182986 -219204 -183853 -106467 -58957 -35432 -49900 -39634 -38489 1135 9513 35810
14686 35810 -47323 -53366 -79340 -181938 -181464 -145820 -6808 73348 33232 -71136 -127230 -238428
14674 -238428 -296872 -229128 -165329 -133194 -137317 -118482 -38628 -42503 -20678 -17968 24386 15834
14662A5834j8720q284j00971l3340N2083K6928J23588K4718L336m0289o8375p0268
14650i3760L4892l2445k1004m8644l5101q858K4169N3017j7344j2455J031K8760
14638a27742L675Q025Q7468P7456k8347q6244q9509m174L291k4165N3060N9540
14626f7666K7789l95J997l1755l306l3392j1232l7294Q349J3109Q6766j578k7388
14613g5996j6998m6216R023M3416O5238M0733n6980j21151J3157O7668j1365o25
14601i0096M419J6882m295M1177O7469M6949l314m5690j34079m0428P4851M4746
14589b1409m6027P488K3248M2472L8828k6833m4707N54j4759K9294l33p0743N287
14576g7640J7656l7824O9277J05929m5190j6193J5426O888J386M5831K8288j00208
$$ plain form
14662 15834 -2886 -11170 -112141 -145481 -93398 -66470 57118 81836 85172 44883 -23492 -93760
14650 -93760 -58868 -91313 -112317 -160961 -196062 -204920 -180751 -127734 -145078 -157533 -156502 -127742
14638 -127742 -124067 -116042 -28574 48882 20535 -65709 -155218 -159392 -156101 -180266 -127206 -67666
14626 -67666 -39877 -40272 -38275 -70030 -73336 -106728 -117960 -155254 -146905 -133796 -47030 -48608 -75996
14613 -75996 -92994 -139210 -130187 -86771 -21533 19200 -37780 -158931 -145774 -78106 -89471 -90096
14601 -90096 -85677 -68795 -73090 -31913 35556 82505 79191 33501 -100578 -141006 -66155 -21409
14589 -21409 -67436 -59948 -36700 5772 44600 17767 -26940 -26386 -41145 -11851 -12184 -82927 -77640
14576 -77640 -59984 -97808 -28531 77398 32208 16015 31441 38329 39715 85546 113834 13626
14564A3626j25799K1330o617O3639J02302M0637j6500m2766l0777Q7013M2358
14553A48446j3598L6408J5538K3213P2131L8840L0129L313p4933n475K7472M2046
14541C43530Q8857P669m5618l6905o1822l1530q191M9049k9884N053J2802o001
14529B87009J4632J5524p1165L1744Q4042M7791j8949l5594J78260J12083J1022
14518F56399M2731J3154r662j22244k286J6025o533n032l5883j05247Q451L6988
14506D86861k158K1329m7178j8485j0657r4017j052M3793J31946J31362J09407
14495G51151O1941L7507K9176l4646o1907l8297J4230n7511o326m6245n6354l6770
14483E55949j24754O9880P3277p3243p152M2396k17M6270P9091O1895K3209q2387
$$ plain form
14564 13626 -112173 -90843 -97460 -33821 68481 109118 92618 49852 19075 106088 148446
14553 148446 134848 171256 186794 210007 282138 320978 351107 354420 279487 274012 301484 343530
14541 343530 432387 440056 394438 357533 295711 264181 255990 305039 275155 280208 293010 287009
14529 287009 301641 317165 246000 277744 361786 409577 390628 355034 533294 645377 656399
14518 656399 699130 712284 702622 580378 578092 594117 587584 582552 546669 441422 449873 486861
14506 486861 484703 506032 458854 440369 429712 335695 334643 378436 510382 641744 751151
14495 751151 813092 850599 879775 845129 783222 744925 759155 701644 695318 649073 592719 555949
14483 555949 431195 501075 574352 501109 493957 536353 536136 582406 661497 723392 746601 664214
14471F64214L7620M3644p0113p1147n1211P632k6711m5643L9395k8521n5082n3639
14459C90438n4515m7784M7190L1120o2912r302K769n679o046j4633M6265O6854
14447C83765L9574J9926M196j0349k2537k7108J4197l3239j5810o1626j20260
14436A70729o5524K7958J07914n427p9653n7111L2464O2533J7153J2445L3342
14425B56823n9784K9321N6080j8058j01390o4666L6408m4144r710M782n3461o5443
14413c3242M6118L418K1154k3812l857L9428J4969j7963m8808o3799l9325j3312
14401a19031M6342N6430K6234l3199P8438M2564l202P9285K5182q3277o8453k0813
14389B6500J1625l8933L1286o4268n2886J3147M7492L5486O749j7593N4966K064
$$ plain form
14471 664214 701834 745478 675365 604218 553007 560639 533928 488285 527680 499159 444077 390438
14459 390438 335923 288139 335329 366449 303537 294235 297004 291325 285279 270646 316911 383765
14447 383765 423339 443265 447461 437112 414575 387467 401664 368425 352615 290989 170729
14436 170729 105205 133163 241077 235650 155997 98886 131350 193883 211036 223481 256823
14425 256823 197039 226360 282440 264382 162992 98326 134734 90590 80880 85662 32201 -33242
14413 -33242 12876 16294 37448 13636 9779 49207 64176 46213 -2595 -66394 -105719 -119031
14401 -119031 -72689 -16259 9975 -23224 55214 97778 94576 173861 199043 115766 47313 26500
14389 26500 38125 -808 30478 -33790 -86676 -73529 -26037 9449 16198 -1395 53571 55635
14377E5635r7633p2372N02N0986j0025L4889J0626m2680j0637J09134L5515m1176
14365B2764M015o9946O35L9482m5334L9877Q109k4238k9343N3364N4754R3871
14353A48010N945l6638Q136J4247n1544n986R690L3298M7249p478k8474o492p0573
14340E9390j419J5438j5377k6253M6321l8970L3909M5099l8840n4728k12R2934
14328A17292L2934n0859J0068J7374r8463k3838K4380n719J03310R4303l4378
14317A86404k7513K372J2129N2572j5567k6356o3365k3906R6365J17658j8292
14306B92501p2547j3720K4793k9209m1520L0288M6422M2287J1547j23436j1412
14295A55994K9p367R2082M8862P8122o5845k0994N9751j7006L6403L5118n1956
$$ plain form
14377 55635 -41998 -114370 -113868 -62882 -72907 -38018 -27392 -70072 -80709 28425 63940 22764
14365 22764 26779 -43167 -42532 -3050 -48384 -8507 -398 -24636 -53979 -615 54139 148010
14353 148010 153955 117317 125453 139700 88156 82170 91860 125158 172407 164929 136455 129963 59390
14340 59390 57971 73409 58032 31779 78100 39130 73039 118138 79298 24570 24358 117292
14328 117292 150226 99367 109435 126809 28346 4508 28888 23169 126479 220782 186404
14317 186404 158891 161263 173392 225964 210397 184041 120676 96770 193135 310793 292501
14306 292501 219954 206234 231027 201818 160298 190586 237008 279295 290842 167406 155994
14295 155994 156023 148656 240738 289600 367722 301877 280883 340634 323628 360031 395149 343193
14283C43193n0606K0717k9429m5708k7880K8359K2655J985m7556n1157N3826L6513
14271B54912M357j7898K0366n944K2879m5662n3846k3417O4401J8592L8297L9170
14259C16207J5378K0245p8332j45J5945J2420n7365J3896J6386N2083j3942n7389
14247B55387j125k9043o6165r5126J15649J04623J794j4860M851l6858j7962n0730
14235A70435M4665L1080K7918l3596k8917J7266N7800N9855L5543J991o9917l7376
14223B76747K1367m8679J1939n0132q7474J7495J00467P4095J3577n8974m314
14212B66114K4739J4158K4342O3132p347j068k3421p7603J1126L0351p8242J423
14200B47704J08573L9945M5679K4110l3923n8948j9638N5102J36622J01282o6145
$$ plain form
14283 343193 292587 313304 283875 238167 210287 238646 261301 263286 215730 164573 218399 254912
14271 254912 259269 241371 261737 255793 278672 233010 179164 155747 220148 238740 277037 316207
14259 316207 331585 351830 273498 273353 289298 301718 244353 258249 274635 326718 312776 255387
14247 255387 254262 225219 159054 63928 179577 284200 285994 271134 275985 239127 221165 170435
14235 170435 215100 246180 274098 240502 211585 228851 286651 346506 382049 384040 314123 276747
14223 276747 298114 249435 261374 211242 123768 141263 241730 315825 329402 270428 266114
14212 266114 290853 305011 329353 392485 385138 384070 360649 283046 294172 324523 246281 247704
14200 247704 356277 396222 441901 466011 432088 373140 353502 408604 545226 646508 580363
14189E80363P036M047k0288o171O5313J2457k3190O2081J40777l7394m2168l2616
14177G10247r3393l1140m223K1969J08154R6059R2725j8203k4501j3874m5882
14166G97938j8425J09257M281L8523r770l3653j8649Q4109J15732M9984Q8441
14155A207768k8603l2632m2996N0167J13476N9482O2257k7271L527m4014L3572
14144A354733J14870J47010J07685J51539J26058N4362K6127J56829J23317J43134
14134B505664N4756Q4255J09077O7027J28018J57076J23736J01760K07226K12207
14124C750802K30088L28098M04498M69733N14877N19708O72378P81046Q91999
14115H563227J086205J348880J602093J970773K389113K776249L127575L403830
$$ plain form
14189 580363 587399 591446 571158 564987 630300 642757 619567 681648 822425 785031 742863 710247
14177 710247 616854 585714 581491 603460 711614 807673 900398 882195 857694 843820 797938
14166 797938 779513 888770 893051 931574 921804 888151 869502 953611 1069343 1119327 1207768
14155 1207768 1179165 1146533 1103537 1153704 1267180 1326662 1388919 1361648 1365175 1321161 1354733
14144 1354733 1469603 1616613 1724298 1875837 2001895 2056257 2082384 2239213 2362530 2505664
14134 2505664 2560420 2644675 2753752 2820779 2948797 3105873 3229609 3331369 3538595 3750802
14124 3750802 3980890 4308988 4713486 5183219 5698096 6217804 6890182 7671228 8563227
14115 8563227 9649432 10998312 12600405 14571178 16960291 19736540 22864115 26267945
14107B6267945L587375L647384L497021K973486K202151J411516M82937l76000
14099D3693815j138467j581392j821621j800836j658220j187528o68690j6107
14091C3820954P89773J410768K343754L318003M207048N222725O137331O811420
14083F4061776P059633O774572O051956M761554L047582R56819j152833l035121
14075H8525938m358422n095049n407994n060345m336189l292326k113874q42358
14067E8019381N59291J980774L472494N034958O720473Q276220R608254J0616015
14059A04287860J0822024J0189075Q593152O167523L050466l47542l547488o224492
14051A32990578q184525r042160q988700q102592o750118n041490l114378j204736
$$ plain form
14107 26267945 29855320 33502704 36999725 39973211 42175362 43586878 44069815 43693815
14099 43693815 42555348 40973956 39152335 37351499 35693279 34505751 33837061 33820954
14091 33820954 34610727 36021495 38365249 41683252 45890300 51113025 57250356 64061776
14083 64061776 71121409 77895981 83947937 88709491 91757073 92713892 91561059 88525938
14075 88525938 84167516 79072467 73664473 68604128 64267939 60975613 58861739 58019381
14067 58019381 58578672 60559446 64031940 69066898 75787371 84063591 93671845 104287860
14059 104287860 115109884 125298959 133892111 140059634 143110100 142762558 139215070 132990578
14051 132990578 124806053 115763893 106775193 98672601 91922483 86880993 83766615 82561879
14043H2561879R09940K964188N095787P251098R412109J1343329J2885009J3589883
14035A46013222J3338910J1856483R123959N242047Q45603l751094p728741j0835343
14027A64105046j2714395j3386525j3034451j1714876r814369p650296n505393
14020I0284741l390197j302314P26380K629884M683547O494360P974809Q969071
14012A17070281R299347Q733696P269551M756035J598883j772697n031831p808285
14004A34114980r876135j0807600j0846802j0150631q856446p301774n654803
13997G0620789l940433k403202q92702N72123J899559L304050M448736N301021
13989G8909941N913904N912076N243177L958931K024161j97481k420004m515864
$$ plain form
14043 82561879 83471819 86436007 91531794 98782892 108195001 119538330 132423339 146013222
14035 146013222 159352132 171208615 180332574 185574621 186420224 182669130 174940389 164105046
14027 164105046 151390651 138004126 124969675 113254799 103440430 95790134 90284741
14020 90284741 86894544 85592230 86318610 88948494 93632041 100126401 108101210 117070281
14012 117070281 126369628 135103324 142372875 147128910 148727793 146955096 141923265 134114980
14004 134114980 124238845 113431245 102584443 92433812 83577366 76275592 70620789
13997 70620789 66680356 64277154 63384452 63956575 65856134 69160184 73608920 78909941
13989 78909941 84823845 90735921 95979098 99938029 101962190 101764709 99344705 94828841
13981I4828841o150131p113996p618667p466920o752288n783262m807287l827648
13973D5308642k834742j747826q83106j50741N32401J031192J558038J886867
13965D4700725J956327J802820J330857O30101r2026j118578k075669k886763
13957D4247794l365253l746021l836021l737876l453608l001509k548626k223381
13949A8335499j965777j583162j340759j157620r57436q25900p18644o71980n47200
13940H567021m79625n04257m29633l88885k91266k54434k31907k45785l12096
13931E429133j92318j66423k27483j61050j59002o0675p5750j32252j53616j45430
13921C955134j15658r0859j88216j16156p794j3923j88668j72380q2963k0684
$$ plain form
13981 94828841 88678710 81564714 73946047 66479127 59726839 53943577 49136290 45308642
13973 45308642 42473900 40726074 39842968 39692227 40224628 41255820 42813858 44700725
13965 44700725 46657052 48459872 49790729 50420830 50328804 49210226 47134557 44247794
13957 44247794 40882541 37136520 33300499 29562623 26109015 23107506 20558880 18335499
13949 18335499 16369722 14786560 13445801 12288181 11330745 10504845 9786201 9114221 8567021
13940 8567021 8087396 7583139 7153506 6764621 6473355 6218921 5987014 5741229 5429133
13931 5429133 5236815 5070392 4842909 4681859 4522857 4462182 4386432 4254180 4100564 3955134
13921 3955134 3839476 3748617 3560401 3444245 3436451 3422528 3233860 3061480 2978517 2957833
13911B957833k1666j48977j56790j30613k2435r0248m47K2346q724q3762r4498
13900B222019j1746M2648m3555p3320j15634p4288o8400j27013n9228J8562L9914
13889A749959o0526q80k639q7651l5052m7330j03188n9213Q131R375R583M2355
13877A422924L0687k3578m1129J0620k5153j1609l5074q4815o1095q0384o730
13866A094664j5633m7793K337L3238L8557n9011k2690n8801J1231M3889J9035
13855A039023l3886Q008L065j6403m5390l1939P957N062l7033o5892p8047Q135
13843G62660k9225q026j2475J8230N143p2247n1891j9418M3286q236N570J9075
13831F52446K0465j2269j35164j03278N4322L2935l6067j081N0758J3138j6355
$$ plain form
13911 2957833 2936167 2787190 2630400 2499787 2477352 2387104 2386657 2409003 2400279 2316517 2222019
13900 2222019 2210273 2252921 2209366 2136046 2020412 1946124 1877724 1750711 1691483 1710045 1749959
13889 1749959 1689433 1688553 1685914 1598263 1563211 1515881 1412693 1353480 1361611 1370986 1380569 1422924
13877 1422924 1453611 1430033 1388904 1399524 1374371 1362762 1327688 1242873 1181778 1101394 1094664
13866 1094664 1079031 1031238 1033575 1066813 1105370 1046359 1023669 964868 976099 1019988 1039023
13855 1039023 1005137 1013145 1016210 999807 954417 922478 930435 935497 898464 832572 754525 762660
13843 762660 733435 725409 712934 731164 736307 664060 612169 592751 636037 627801 633371 652446
13831 652446 672911 660642 525478 422200 476522 509457 473390 472309 523067 536205 519850
13820E19850K4042J1534L3620K8554M8902l1535j02106q9038N3876J6756P9675
13809E94130M428j03937l9396n8520n5781n3673j2442L8207P1377k671n2635l2220
13797B96867k3273k8015M5673R4726K0110p9263k2564l1951k7976j7126l2490
13786A94718O8902M7277N5513O1712p5849L3912p3766q1399o8224M1518M4428
13775B48742K8974j7329J1358K6793K0459J8399l7218l0311o8289o1861L1588
13764A71305J45039o0711m6613k5884J1597j6157M1114J01927l7233o7396L1294
13753B48282K5716p888j9474L9067O4841p1979l3958J7573o5366j4299k747K3238
13741B03006m2626k0808n8265l6056L1374O2932N7815n9706k3890j7088m895n6469
$$ plain form
13820 519850 543892 555426 589046 617600 666502 634967 532861 443823 497699 514455 594130
13809 594130 598558 494621 455225 396705 340924 287251 274809 313016 384393 381722 329087 296867
13797 296867 273594 245579 291252 385978 406088 326825 304261 272310 244334 227208 194718
13786 194718 263620 310897 366410 428122 352273 386185 312419 231020 162796 204314 248742
13775 248742 277716 260387 271745 298538 318997 337396 300178 269867 201578 139717 171305
13764 171305 316344 255633 209020 183136 194733 178576 219690 321617 284384 216988 248282
13753 248282 273998 266110 246636 285703 350544 278565 244607 262180 196814 182515 179768 203006
13741 203006 160380 139572 81307 45251 76625 139557 197372 137666 113776 96688 91793 35324
13729C5324M135K1465m8516Q7131L6157r3855J1612L2741J7997M7290j6774m1521
13717I3186L8809j7377n3414j3317o1776j3481N5449L415j088P525P0139l8030
13705G0040p7359N3324L4011l3338k6138P8371M3226q8618n8408k9670K8697K5384
13693A9522M3277J6480n6453L8276L8145P475K3156Q4985j1978o0739l3866q5451
13681B2829m1257p52O2983j5625J2069M2412N5446K1754j1489m2891m1176l520
13669F0783N4364M0418J7397J6207k545p4497o5187j6000P2212M2086n6550K3945
13657A12633l1560O8503Q0559p9424n8195o727m8119l2943j8504n9984M9342J02572
13645G8153R3319J7970j4334j02556J6173j015k6370l6394J60945O1982P7358
$$ plain form
13729 35324 39459 60924 12408 99539 135696 41841 53453 86194 104191 151481 134707 93186
13717 93186 131995 114618 61204 47887 -13889 -27370 28079 31494 30406 37931 108070 70040
13705 70040 -7319 46005 80016 46678 20540 98911 142137 53519 -4889 -34559 -5862 19522
13693 19522 62799 79279 22826 61102 99247 106722 129878 214863 202885 142146 108280 22829
13681 22829 -18428 -19180 43803 28178 40247 82659 138105 159859 148370 105479 64303 60783
13669 60783 115147 155565 172962 189169 186624 112127 46940 30940 103152 145238 88688 112633
13657 112633 81073 149576 230135 150711 92516 85789 37670 4727 -13777 -73761 -24419 78153
13645 78153 171472 189442 175108 72552 88725 87710 61340 24946 185891 247873 325231
13634C25231O3797J9380l79k9578J0066j0845l1461n3676K7587m4096L0212N9473
13622C65711n0372n0316K6309P0839j7044L175R9487M693K8725P7511j205J7458
13610E74971O9251J2409r5872q2307r089j2512M6345l1733j1870K1562k8972l4830
13598D17353R603J6010L2750l2411l8536M4017J40256J00384J0421J2623p098
13587G05372k1940K0235J07056l2035p9076j9456o6339p8922K3176M0178m1089
13576E57160r5010L7861O7730j1313l8934P4084P6024Q2070O1051M4395r129O7181
13564I13170Q978P305L442L8816L7552n6269j26210l4574o1040r8730p7736O847
13552E61551p021k1170p3559m0982n1837k741o328J29645J21695J09802m787m8761
$$ plain form
13634 325231 389028 408408 408029 378451 388517 377672 346211 292535 320122 276026 306238 365711
13622 365711 315339 265023 291332 362171 345127 348302 447789 452482 481207 558718 557513 574971
13610 574971 644222 656631 560759 478452 469363 456851 503196 471463 459593 481155 452183 417353
13598 417353 426956 442966 475716 443305 404769 448786 589042 689426 699847 712470 705372
13587 705372 683432 703667 810723 778688 699612 680156 613817 534895 558071 598249 557160
13576 557160 462150 500011 567741 556428 517494 591578 667602 749672 810723 855118 845989 913170
13564 913170 922148 929453 932895 971711 1009263 952994 826784 792210 731170 632440 554704 561551
13552 561551 554530 533360 459801 418819 366982 364241 357913 487558 609253 719055 714268 665507
13540F65507K4840P8916L7535o9126m5215J2549o5772r4485p6217j8748m4870
13529D04914k2766M0525K5642q375j23197m5292P8705K0385n7518n435M3097R2564
13517D43249L9517R77J698L198n5923m8719n2425K6344j2105m7781K5594L765
13505C27389o5334p7396L1400K0763J1175P573k0445L268M8379J3107m8149R0605
13493C42335N3544r9736o9445j2219j3164l2818m608K3841o5299p6963o7189J1940
13481i781M0351K2559L9469J7179K1832M2680j782r1428M5204O2670p5192o9320
13469D4441l3120J5115L050M2930p12q1427J4924J7431r4717p3912l1900R1862
13457h6035M3670p514L337K0907M7698M6151j8997K0294P996j0621K9148N6201
$$ plain form
13540 665507 690347 769263 806798 737672 692457 705006 639234 544749 468532 449784 404914
13529 404914 382148 422673 448315 439940 316743 271451 350156 370541 313023 307588 350685 443249
13517 443249 482766 483743 485441 488639 432716 383997 331572 357916 345811 298030 323624 327389
13505 327389 262055 184659 216059 236822 247997 255570 235125 238393 286772 299879 251730 342335
13493 342335 395879 296143 226698 214479 201315 168497 163889 187730 122431 45468 -21721 -9781
13481 -9781 30570 53129 92598 109777 131609 174289 172507 81079 126283 188953 113761 44441
13469 44441 11321 26436 29486 72416 71704 -9723 5201 22632 -72085 -145997 -177897 -86035
13457 -86035 -42365 -49879 -46542 -25635 22063 68214 49217 69511 77507 66886 96034 152235
13445A52235o0980o0563m8866J2941J00851M2544k9643K5164L6342m1988j11153
13434A6884Q607M6245O5433j8732r0893k9151K0448P7392n33l6661P2741o8636
13422F3144n5938N140l8101p6263L4317L9880J03433J06856m2521j8773N335p306
13410A19203m5837o6344l7933k8000K992J08583J0017M3817j2253k75j8831L3766
13398A08905K2888p7021n8752l8171k1294Q4285J221M2229k1717J5891J2798o5480
13386E782K2317Q1008N4996L073J1184J5735R3496J523q6720p5511p4808M66j4615
13373C7926m8414k7234o4927M3483M5711J5825M5367j23550o6214M5607K2120
13362g4300M6087O863L4433K8940P0983q288m5273n2025N511m939J4697R1942
$$ plain form
13445 152235 91255 30692 -18174 -5233 95618 138162 108519 133683 170025 128037 16884
13434 16884 25491 71736 137169 118437 27544 -1607 18841 96233 95700 59039 131780 63144
13422 63144 7206 12346 -25755 -102018 -67701 -27821 75612 182468 139947 121174 126509 119203
13410 119203 73366 7022 -30911 -58911 -55919 52664 62681 106498 94245 93970 75139 108905
13398 108905 131793 54772 -3980 -42151 -63445 20840 22061 64290 42573 58464 71262 5782
13386 5782 28099 109107 164103 167176 178360 194095 287591 289114 202394 126883 52075 52541 37926
13373 37926 -10488 -37722 -102649 -59166 -13455 2370 47737 -75813 -142027 -96420 -74300
13362 -74300 -28213 -21350 13083 42023 113006 104718 59445 7420 12931 7992 22689 114631
13350A14631M1002m0298k8722k4901M2390P6358k7212l6134k9574r3905p3382
13339g9747J25758K4934q4740K3978K5039R218k1994o2473m1431L685R1444O9571
13327H3242Q530j9316J5822k9985O4729R1561m8088o3546m9763J0827R9067O650
13315A69730n2951M800p6739p9889J1924k9991J0665R1112o2893p1095K4476M8403
13303a2448J8977l8105M561k6258o4467m5130K4757Q3553R3488o3315R5081N3411
13291A24105o3832j27291j2063K1323q911M0017K3552O0675l6880m4760l0070
13280e4135K7219M6468N9079M1818Q211k3769M008J6821J1440N9090k9205P065
13268A74110J3404l7554p2831L7302J7938M2858O3945M1204q0687q448l5429M6539
$$ plain form
13350 114631 155633 115335 86613 61712 104102 180460 153248 117114 87540 -6365 -79747
13339 -79747 46011 70945 -13795 10183 35222 44440 22446 -40027 -81458 -77773 13671 83242
13327 83242 91772 72456 88278 58293 123022 214583 166495 102949 53186 64013 163080 169730
13315 169730 116779 121579 44840 -35049 -23125 -53116 -42451 48661 -14232 -85327 -60851 -12448
13303 -12448 6529 -31576 -27015 -53273 -117740 -162870 -138113 -54560 38928 -24387 70694 124105
13291 124105 60273 -67018 -79081 -57758 -66669 -26652 -3100 57575 20695 -24065 -54135
13280 -54135 -26916 19552 78631 120449 128660 104891 108899 125720 137160 196250 167045 174110
13268 174110 187514 149960 77129 114431 132369 175227 239172 280376 199689 191241 155812 202351
13256B02351k746k1235j4271m4578L9110J26370J41381K7675J33638Q1623O443
13245F75761K0599j8384J7668O3666J770L1498j930l9223j4245m7146J5857m2510
13233F63381r2127k4342l7260j6977N4240l1169l2202N5102N4852J55059R9637
13222H48194K168O4906L1139P604K8011R351J6652q7520r2772j32729k7596N2434
13210G19842J3003m8263N9856J21356J8818o06J48695J00529J3143l0614J4657
13199A130416J9551l5907K30o7897o0194p0548l8285r3406k4696K1324J54165
13188I34753L1484k5810k537K0029K1316N7906Q9802K1384R614J4204J09998J20666
13176A402809R108J276L4950N3353K2358P3196J4974J6219k8035j28740j29406
$$ plain form
13256 202351 199605 178370 164099 119521 158631 285001 426382 454057 587695 669318 675761
13245 675761 696360 677976 695644 759310 761080 792578 790648 751425 737180 690034 705891 663381
13233 663381 571254 546912 509652 492675 546915 515746 483544 538646 593498 748557 848194
13222 848194 850362 915268 946407 954011 982022 991373 1008025 920505 827733 695004 667408 719842
13210 719842 732845 684582 744438 865794 884612 884006 1032701 1133230 1146373 1115759 1130416
13199 1130416 1149967 1114060 1114290 1046393 986199 915651 877366 783960 759264 780588 934753
13188 934753 966237 940427 937890 957919 979235 1037141 1126943 1148327 1157941 1172145 1282143 1402809
13176 1402809 1411917 1413193 1448143 1501496 1523854 1597050 1612024 1628243 1600208 1471468 1342062
13165A342062j03390j29245j02517q1536r8047j539L1325R6957J3983k4460l7717
13154I05876P1780N2195M8077N5641J28434R9181L7587n8668j00677q9758K9100
13143A178768m3608n4213m732O6994m5993j23331n5622M8395M8575R6629J09388
13132A221250K7158m2717N6225m0284Q580K4765Q3680K1097m9982j48643p1396
13121A089733j05537o3740N1756o2207p1852M7825Q464K1470j232L9558L1043
13110I85281M9664M7976K3622J3825r73n4467m1300l6222L24J0474l3741j7395
13098I47068J9501j8666j40074j15535k7197J4929K0600q1650q3306q2948m3114
13087D09608K131M7022o0130r5980m6137L2541k2166j9188R6249M8477j5266k2227
$$ plain form
13165 1342062 1238672 1109427 1006910 925374 827327 825788 857113 954070 968053 943593 905876
13154 905876 977656 1029851 1077928 1133569 1262003 1361184 1398771 1340103 1239426 1149668 1178768
13143 1178768 1135160 1080947 1076215 1143209 1097216 973885 918263 966658 1015233 1111862 1221250
13132 1221250 1248408 1205691 1261916 1221632 1230212 1254977 1338657 1359754 1309772 1161129 1089733
13121 1089733 984196 920456 972212 910005 838153 885978 894442 915912 914680 954238 985281
13110 985281 1034945 1082921 1106543 1120368 1119395 1064928 1023628 987406 987730 998204 964463 947068
13098 947068 966569 947903 807829 692294 665097 680026 700626 618976 535670 452722 409608
13087 409608 411739 458761 398631 302651 256514 289055 266889 247701 343950 392427 377161 354934
13075C54934K7580L4704K8858m386N5849r473P1771J26251Q3099N0480L742j0912
13063H12497p2272o6468q8950q2778L3436O6775o9866p5470M3279j2980n9247
13052D27956q348q885L0023j2205M5048j005Q579K1712k1532K7070j0238p511
13040D90664k0277M711j1868M2056K632j27635k0680n458M2564Q9731N3382J04047
13028F43869P9622J69379K44724K52411L17561L50677L07421J74721j01591k93388
13018B145406l50664l14990k20431j85430j30946n6803n1726j2342j22101j13966
13008E86007L3539M338l5917P6897R8693O8870p1131n2982N8133m7122l2718j3419
12996F73188P5153L4980r818j2187j28467n3705O9511J21776K6169K4157J2917
$$ plain form
13075 354934 382514 417218 446076 441690 497539 488066 559837 686088 769187 819667 823409 812497
13063 812497 740225 673757 584807 502029 535465 602240 532374 456904 500183 487203 427956
13052 427956 419608 410723 440746 428541 473589 472584 481163 502875 481343 508413 498175 490664
13040 490664 470387 475098 463230 505286 507918 380283 359603 354145 396709 486440 539822 643869
13028 643869 723491 892870 1137594 1390005 1707566 2058243 2365664 2540385 2438794 2145406
13018 2145406 1794742 1479752 1259321 1073891 942945 886142 834416 822074 699973 586007
13008 586007 619546 623884 587967 664864 763557 832427 761296 708314 766447 719325 686607 673188
12996 673188 748341 783321 773503 761316 632849 579144 648655 770431 796600 820757 833674
12985H33674J6697M3149P6925R3891K10647L24735L13245L21794K28590J15972
12975B579319j36429l29588l51668l30544j37212r4210m6667o1324n5374r9281
12965I37022k6730O995q5777m3689M7548N4602k0133k1724q5648l5974O28n409
12953G21711O098Q7932p8404q2349l2719L6250K3787M6550L285j6852j585J18927
12941H32631O6380n0513l3385J0207J7304J01379J27069Q3147P6681Q3508P8004
12930A392412Q2886M990j31193j40762n9456m702k8326j08432q4018O8273R2709
12919A084381k4386k4519j4562k0018N820M0993M129K3394j8664j3541J9859p9414
12907I83472j8961N3335L3706k3034l1818q3891R789J02892L6758N337j1213j5899
$$ plain form
12985 833674 850371 893520 970445 1064336 1274983 1599718 1912963 2234757 2463347 2579319
12975 2579319 2442890 2113302 1761634 1431090 1293878 1199668 1153001 1091677 1036303 937022
12965 937022 910292 917287 831510 787821 835369 889971 869838 848114 762466 726492 727120 721711
12953 721711 727809 815741 737337 654988 622269 658519 682306 728856 732141 715289 713704 832631
12941 832631 899011 848498 815113 825320 842624 944003 1071072 1154219 1230900 1314408 1392412
12930 1392412 1475298 1480288 1349095 1208333 1148877 1144175 1115849 1007417 923399 991672 1084381
12919 1084381 1059995 1035476 1020914 1000896 1006716 1047709 1051838 1075232 1056568 1043027 1062886 983472
12907 983472 964511 1017846 1051552 1028518 996700 912809 922598 1025490 1062248 1067585 1056372 1040473
12895A040473P3265J15415J37747J4165q3771L8553k324K1019m7529M3130N3299
12884A403442k5105m019J34187o387q8092J8367O5352O7369M9339M7364o3473
12873A598344j9787m8460o548L0114J48436N9468k5472K3703o6474K2131P6045
12862A791500N4023R5861k777k3296k6352J3024Q6201J07270J10234Q9859j5566
12851B279981N2011J57443J68458Q5071O6864l333K3955J18786J26043L3484j8413
12840C090350O0060N3076Q7318P3618J28903O0714J35049R2111L0082J61598J71125
12829D144004K21172K15514J79484J54795K41630J98641K68787M13673L96082
12820F433782L50245L88681L94835M44135N58683N65374O31617O75224Q76534
$$ plain form
12895 1040473 1113738 1229153 1366900 1381065 1297294 1335847 1333523 1354542 1307013 1350143 1403442
12884 1403442 1378337 1374318 1508505 1502118 1414026 1432393 1497745 1565114 1614453 1661817 1598344
12873 1598344 1578557 1530097 1523549 1553663 1702099 1761567 1736095 1759798 1693324 1715455 1791500
12862 1791500 1845523 1941384 1938607 1915311 1888959 1901983 1988184 2095454 2205688 2295547 2279981
12851 2279981 2331992 2489435 2657893 2742964 2809828 2806495 2830450 2949236 3075279 3108763 3090350
12840 3090350 3150410 3203486 3290804 3364422 3493325 3554039 3689088 3781199 3811281 3972879 4144004
12829 4144004 4365176 4580690 4760174 4914969 5156599 5355240 5624027 6037700 6433782
12820 6433782 6784027 7172708 7567543 8011678 8570361 9135735 9767352 10442576 11319110
12811A1319110R74532R31149R91750J176251J350363J670904J891076K236444
12803B2541579K713838L133114L914922M780745N702556O886607Q224468R635652
12795F7533481J1088705J2443356J3203344J3089268J2078815R845547O725057
12788A46007573K999300r39743m513088p281893r085143j0044347r790609q886331
12780I8465719p405098n455825l340827j257824Q83693L108292N428998P915166
12772I8342294J0472103J2783800J4548239J5391616J4905547J2820061R245816
12765A88509476M735458k36814n153984r187407j1716065j2613213j1976315j0124821
12757A32236315p395620m110884n36546K765865N669224Q207946R836250J0376556
$$ plain form
12811 11319110 12293642 13224791 14216541 15392792 16743155 18414059 20305135 22541579
12803 22541579 25255417 28388531 32303453 37084198 42786754 49673361 57897829 67533481
12795 67533481 78622186 91065542 104268886 117358154 129436969 139282516 146007573
12788 146007573 149006873 148067130 143554042 136272149 127187006 117142659 107352050 98465719
12780 98465719 91060621 85604796 82263969 81006145 81889838 84998130 90427128 98342294
12772 98342294 108814397 121598197 136146436 151538052 166443599 179263660 188509476
12765 188509476 193244934 193008120 187854136 178666729 166950664 154337451 142361136 132236315
12757 132236315 124840695 120729811 120193265 122959130 128628354 136836300 146672550 157049106
12749A57049106R964265Q183773N619994K604258q44311m091345p007111r279183
12741A62199446j0485323j0873679j0361993r018257p074867m673384k001823
$$ plain form
12749 157049106 167013371 175197144 180817138 183421396 182577085 178485740 171478629 162199446
12741 162199446 151714123 140840444 130478451 121460194 114385327 109711943 107710120
$$ [...]
##END NTUPLES=NMR SPECTRUM
##END=
