##TITLE=Analysis number 324560
Compound Code cc 52214
Book Reference 467/100
Project Code adrs
Chemist Name benw
##JCAMPDX= 6.0         $$ Bruker NMR JCAMP-DX V2.0
##DATA TYPE= NMR SPECTRUM
##DATA CLASS= NTUPLES
##ORIGIN= Bruker BioSpin GmbH
##OWNER= nmr
$$ XWIN-NMR		Version 3.5
$$ Fri Nov 24 14:09:39 2006 GMT Standard Time (UT+0h)  MAYBRIDGE\nmr@NMR_250MHZ
##.OBSERVE FREQUENCY= 250.131544655141
##.OBSERVE NUCLEUS= ^1H
##.ACQUISITION MODE= SIMULTANEOUS (DQD)
##.ACQUISITION SCHEME= undefined
##.AVERAGES= 16
##.DIGITISER RES= 18
##SPECTROMETER/DATA SYSTEM= dpx250
##.PULSE SEQUENCE= zg30
##.SOLVENT NAME= CDCl3
##.SHIFT REFERENCE= (INTERNAL, CDCl3, 0, 16.522)
##AUDIT TRAIL= $$ (NUMBER, WHEN, WHO, WHERE, WHAT)
$$ ##TITLE= Audit trail, XWIN-NMR		Version 3.5
$$ ##JCAMPDX= 5.01
$$ ##ORIGIN= Bruker BioSpin GmbH
$$ ##OWNER= nmr
$$ C:\u/data/dgb/nmr/ADRS/1090/pdata/1/auditp.txt
$$ ##AUDIT TRAIL=  $$ (NUMBER, WHEN, WHO, WHERE, WHAT)
(   1,<2006-11-24 14:09:14.19 +000>,<MAYBRIDGE\nmr>,<NMR_250MHZ>,
      <created by zg, POWCHK disabled, PULCHK disabled
       configuration hash MD5:
       49 4B E0 1D 92 C2 6B 37 9F E6 65 BC 52 41 86 1D
       data hash MD5: 64K
       2E C1 3D B9 8F 10 98 0F 35 59 DB 45 D4 47 EA 6B>)
(   2,<2006-11-24 14:09:28.17 +000>,<MAYBRIDGE\nmr>,<NMR_250MHZ>,
      <Start of raw data processing
       ef LB = 0.3 FT_mod = 6 PKNL = 1 SI = 32K 
       data hash MD5: 32K
       1C C0 4D 49 5E 2A C4 82 C2 D5 D0 87 6F F8 F5 04>)
(   3,<2006-11-24 14:09:29.88 +000>,<MAYBRIDGE\nmr>,<NMR_250MHZ>,
      <apk 
       data hash MD5: 32K
       FA D5 8F FF BB D9 C4 A6 A2 82 A3 88 3C 6D F2 22>)
(   4,<2006-11-24 14:09:30.64 +000>,<MAYBRIDGE\nmr>,<NMR_250MHZ>,
      <abs ABSG = 5 
       data hash MD5: 32K
       FA 7B 14 92 85 32 F8 D9 7D 59 E7 F4 79 E5 CD 98>)
$$ ##END=
$$ 
$$ hash MD5
$$ E9 9B 3E 78 F6 68 6F 67 93 B3 89 96 79 05 7B 27
##$RELAX= 
##$RELAX= 
##$RELAX= 
##$RELAX= 
##$RELAX= 
##$RELAX= 
##$RELAX= 
$$ Bruker specific parameters
$$ --------------------------
##$DU= <C:\u>
##$EXPNO= 1090
##$NAME= <ADRS>
##$PROCNO= 1
##$TYPE= <nmr>
##$USER= <dgb>
##$AMP= (0..31)
100 100 100 100 100 100 100 100 100 100 100 100 100 100 100 100 100 100 
100 100 100 100 100 100 100 100 100 100 100 100 100 100 
##$AQSEQ= 0
##$AQ_mod= 3
##$AUNM= <au_zg>
##$AUTOPOS= <58 >
##$BF1= 250.13
##$BF2= 250.13
##$BF3= 250.13
##$BF4= 250.13
##$BF5= 500.13
##$BF6= 500.13
##$BF7= 500.13
##$BF8= 500.13
##$BYTORDA= 1
##$CFDGTYP= 0
##$CFRGTYP= 5
##$CHEMSTR= <none>
##$CNST= (0..31)
1 1 145 1 1 1 1 1 1 1 1 1 1 1 1 1 1 1 1 1 1 1 1 1 1 1 1 1 1 1 1 1 
##$CPDPRG= <>
##$CPDPRG1= <>
##$CPDPRG2= <>
##$CPDPRG3= <>
##$CPDPRG4= <mlev>
##$CPDPRG5= <mlev>
##$CPDPRG6= <mlev>
##$CPDPRG7= <mlev>
##$CPDPRG8= <mlev>
##$CPDPRGB= <>
##$CPDPRGT= <>
##$D= (0..31)
0 1 0 0 0 0 0 0 0 0.06 0 0 0 0 0 0 0.0002 0 0 0 0 0 0 0 0 0 0 0 0 0 0 
0 
##$DATE= 1164377352
##$DBL= (0..7)
120 120 120 120 120 120 120 120 
##$DBP= (0..7)
150 150 150 150 150 150 150 150 
##$DBP07= 0
##$DBPNAM0= <>
##$DBPNAM1= <>
$$ [...]
##$SUBNAM7= <"">
##$SUBNAM8= <"">
##$SUBNAM9= <"">
##$SW= 20.6930455092707
##$SWIBOX= (0..15)
0 0 3 0 0 0 0 0 0 0 0 0 0 0 0 0 
##$SW_h= 5175.983436853
##$TD= 65536
##$TD0= 1
##$TE= 295.16
##$TE2= 300
##$TE3= 300
##$TEG= 300
##$TL= (0..7)
0 120 120 120 120 120 120 120 
##$TP= (0..7)
150 150 150 150 150 150 150 150 
##$TP07= 0
##$TPNAME0= <>
##$TPNAME1= <>
##$TPNAME2= <>
##$TPNAME3= <>
##$TPNAME4= <>
##$TPNAME5= <>
##$TPNAME6= <>
##$TPNAME7= <>
##$TPOAL= (0..7)
0.5 0.5 0.5 0.5 0.5 0.5 0.5 0.5 
##$TPOFFS= (0..7)
0 0 0 0 0 0 0 0 
##$TUNHIN= 0
##$TUNHOUT= 0
##$TUNXOUT= 0
##$USERA1= <user>
##$USERA2= <user>
##$USERA3= <user>
##$USERA4= <user>
##$USERA5= <user>
##$V9= 5
##$VALIST= <valist>
##$VCLIST= <CCCCCCCCCCCCCCC>
##$VD= 0
##$VDLIST= <DDDDDDDDDDDDDDD>
##$VPLIST= <PPPPPPPPPPPPPPP>
##$VTLIST= <TTTTTTTTTTTTTTT>
##$WBST= 1024
##$WBSW= 4
##$XGAIN= (0..3)
0 0 0 0 
##$XL= 0
##$YL= 0
##$YMAX_a= 304514
##$YMIN_a= -343740
##$ZGOPTNS= <>
##$ZL1= 120
##$ZL2= 120
##$ZL3= 120
##$ZL4= 120
##$ABSF1= 16.522
##$ABSF2= -4.171173
##$ABSG= 5
##$ABSL= 3
##$ALPHA= 0
##$AQORDER= 0
##$ASSFAC= 0
##$ASSFACI= 0
##$ASSFACX= 0
##$ASSWID= 0
##$AUNMP= <proc_1d>
##$AZFE= 0.1
##$AZFW= 0.1
##$BCFW= 0
##$BC_mod= 0
##$BYTORDP= 0
##$COROFFS= 0
##$CY= 12.5
##$DATMOD= 1
##$DC= 0
##$DFILT= <>
##$DTYPP= 0
##$F1P= 14.0000005364418
##$F2P= -0.99999901652339
##$FCOR= 0.5
##$FTSIZE= 32768
##$FT_mod= 6
##$GAMMA= 0
##$GB= 0
##$INTBC= 1
##$INTSCL= 1
##$ISEN= 128
##$LB= 0.3
##$LEV0= 0
##$LPBIN= 0
##$MAXI= 10000
##$MC2= 0
##$MEAN= 0
##$ME_mod= 0
##$MI= 0
##$NCOEF= 0
##$NC_proc= -6
##$NLEV= 6
##$NOISF1= 0
##$NOISF2= 0
##$NSP= 0
##$NTH_PI= 0
##$NZP= 0
##$OFFSET= 16.522
##$PC= 1
##$PHC0= 219.8082
##$PHC1= 6.490942
##$PH_mod= 1
##$PKNL= yes
##$PPARMOD= 0
##$PSCAL= 4
##$PSIGN= 0
##$REVERSE= no
##$SF= 250.13
##$SI= 32768
##$SIGF1= 0
##$SIGF2= 0
##$SINO= 400
##$SIOLD= 32768
##$SREGLST= <1H.CDCl3>
##$SSB= 0
##$STSI= 32768
##$STSR= 0
##$SW_p= 5175.98343685301
##$SYMM= 0
##$S_DEV= 0
##$TDeff= 65536
##$TDoff= 0
##$TI= <Analysis number 999999
Compound Code 99
Book Reference 9
Project Code 9>
##$TILT= no
##$TM1= 0
##$TM2= 0
##$TOPLEV= 0
##$USERP1= <user>
##$USERP2= <user>
##$USERP3= <user>
##$USERP4= <user>
##$USERP5= <user>
##$WDW= 1
##$XDIM= 32768
##$YMAX_p= 450801635
##$YMIN_p= -410410
$$ End of Bruker specific parameters
$$ ---------------------------------
##NTUPLES= NMR SPECTRUM
##VAR_NAME=  FREQUENCY,     SPECTRUM/REAL,   SPECTRUM/IMAG
##SYMBOL=    X,             R,               I
##VAR_TYPE=  INDEPENDENT,   DEPENDENT,       DEPENDENT
##VAR_FORM=  AFFN,          ASDF,            ASDF
##VAR_DIM=   32768,         32768,           32768
##UNITS=     HZ,            ARBITRARY UNITS, ARBITRARY UNITS
##FACTOR=    0.157963299565203, 1,           1
##FIRST=     4132.6476996994, 0,             0
##LAST=      -1043.33573715361, 0,           0
##MIN=       -1043.33573715361, -410410,     0
##MAX=       4132.6476996994, 450801635,     0
$$ Real data points
##PAGE= N=1
##DATA TABLE= (X++(R..R)), XYDATA
$$ [...]
22668d6214j5712l9422m6326J30191J1400n3883N8962j09541o4678O9937R0715
22657a4571j01608j09864R6796J36882Q5045l0018K6985M5811o4705k4255o2981
22646a6483n2654j01188N9585O5219P8552K2841m3284p5L6342j2241r802n1350
22634b4538j2800Q425L7330k306Q0807j3449j07176J27428K5854K1472p0848l9664
22622C0535Q8764l7736j00893K5401j422L5453j10093q7154J6993O5153O7227
22611g772J4720j2764j4401P3882O0811p037j94806p1455J31947J01347J131j6
22599G5587l3932K4122J8711j26745p5817O5140j6805n3542Q5414N7020j04046
22588h4893P9659k7889j17044P7965q4847o4188J20763J03108M4290k4000K2400
$$ plain form
22668 -46214 -61926 -101348 -147674 -17483 -6083 -59966 -1004 -110545 -175223 -105286 -14571
22657 -14571 -116179 -226043 -129247 7635 92680 62662 89647 135458 70753 46498 -16483
22646 -16483 -69137 -170325 -110740 -45521 33031 55872 12588 12513 48855 36614 26812 -24538
22634 -24538 -37338 -28913 8417 6111 86918 73469 -33707 93721 119575 141047 70199 30535
22622 30535 119299 81563 -19330 6071 4649 40102 -69991 -157145 -140152 -74999 -7772
22611 -7772 6948 -5816 -20217 53665 114476 107439 -87367 -158822 -26875 74472 75603 75587
22599 75587 41655 65777 84488 -42257 -118074 -52934 -69739 -123281 -37867 19153 -84893
22588 -84893 -5234 -33123 -150167 -72202 -157049 -221237 -100474 2634 46924 22924 45324
22577D5324P7997L7566k0423J6173K7559l4896L938p5331m7212r6956Q4115J45206
22565A63060q5131L9482P6316R562o3797l3640k494m6332j35754p1529M1953Q9236
22553a9068M0371K9065n6926m6694P0980P790l4416L330K8641q479q5779q1806
22541a52991k5464l0885J2220L3820k3351N9793J33962J20556j096K6585l7501
22530A15648k16886P8023J15576P506o2082M3212J47j00961q7513m2074R2112
22519e7292J0310n7590o3571J5354J4872P5508k6102K0206J707k761P5826m5292
22507c8825m8642j8048L0692O0696N3316N6842j6766j34272p1416R789J02038
22496a4596L5269j04988M2574K4479P8904K3774o4125K238N1248p8934p0783l7030
$$ plain form
22577 45324 123321 160887 140464 156637 184196 149300 153238 77907 30695 -66261 17854 163060
22565 163060 77929 117411 193727 203289 139492 105852 103358 57026 -78728 -150257 -108304 -19068
22553 -19068 21303 50368 -6558 -53252 17728 25518 -8898 -5568 23073 14594 -71185 -152991
22541 -152991 -178455 -209340 -197120 -163300 -186651 -126858 7104 127660 126564 153149 115648
22530 115648 -101238 -23215 92361 99867 37785 80997 81144 -19817 -107330 -149404 -57292
22519 -57292 -46982 -104572 -168143 -152789 -137917 -62409 -88511 -68305 -66598 -69359 6467 -38825
22507 -38825 -87467 -105515 -74823 -14127 39189 96031 79265 -55007 -126423 -116634 -14596
22496 -14596 20673 -84315 -41741 -17262 61642 85416 21291 23529 74777 -4157 -74940 -111970
22484a11970N8123l6312q2005N3207L2655M4313k6727L9121l7383K5748k2753
22473f3983k1438M4038J39248O2372M0950j61254k740r2667j5551P4116j656l1820
22461c0385J5613Q2432l2003j20168p4973j394J3943N228o9231J51010Q1043q6670
22449f5555j6577K2456R8839j53806q9392k8036J09445J27214O2359p0025K8578
22438B5500o3958K1517P8568m4552K4930j0018n0958R913l3784K1866N4176p1674
22426c8474k5778j0249J304J7216L8242M8485J20879o9057r9557n9318k7923j1695
22414a15925K7935J37942L0077j13289r1622k9832o9885O2993J07087P8983K151
22403B6615n8419j9117j7078q6620k1576j9406L7453M794O2149m8839m7847J10937
$$ plain form
22484 -111970 -53847 -90159 -172164 -118957 -86302 -41989 -68716 -29595 -66978 -41230 -63983
22473 -63983 -85421 -41383 97865 160237 201187 39933 37193 -55474 -71025 3091 1435 -30385
22461 -30385 -14772 67660 35657 -84511 -159484 -160878 -146935 -141707 -210938 -59928 21115 -65555
22449 -65555 -82132 -59676 39163 -114643 -204035 -232071 -122626 4588 66947 -3078 25500
22438 25500 -38458 -16941 61627 17075 42005 31987 -18971 -9058 -42842 -20976 33200 -38474
22426 -38474 -64252 -74501 -73197 -55981 -17739 30746 151625 82568 -16989 -76307 -104230 -115925
22414 -115925 -87990 49952 80029 -33260 -124882 -154714 -224599 -161606 -54519 24464 26615
22403 26615 -31804 -50921 -67999 -154619 -176195 -195601 -158148 -153354 -91205 -140044 -187891 -76954
22391g6954J17278O2573k6377j1041Q152O062k22329j52119K8387M557M6740J69002
22379d6069R1840O488j31466J0146Q5854p4967r1515N8446R7349k1777J8749L8728
22367D1806J4450r397m6048j23561j5975J29657q151o8339J7731J8318m3294o419
22355i9222J2019J8033l216M6091Q533J0857M9614m0681R960n2338j01348k6209
22343a67907J28327O570L3325J7322K0455j396r1233l1033M3852K924m7091o2203
22331a48088P7084M4418K0209p7373j13412n6047J5278M9874m1385M157M6572
22320a78713J48477O4941n2261O7002O0852P3832l114m3473l0050p366M9770K9589
22308A79486M7595j13594K3917j07659r3474L8947R064J2901j4322P8719j6991
$$ plain form
22391 -76954 40324 102897 76520 65479 73631 79693 -142636 -294755 -266368 -261811 -215071 -46069
22379 -46069 45771 52259 -79207 -69061 16793 -58174 -149689 -91243 6106 -15671 3078 41806
22367 41806 56256 46859 811 -122750 -138725 -9068 -17219 -85558 -67827 -49509 -92803 -99222
22355 -99222 -87203 -69170 -72386 -26295 -17762 -6905 42709 2028 11988 -40350 -141698 -167907
22343 -167907 -39580 -33010 315 17637 38092 36696 -54537 -85570 -41718 -38794 -85885 -148088
22331 -148088 -71004 -26586 -6377 -83750 -197162 -253209 -237931 -188057 -229442 -225285 -178713
22320 -178713 -30236 34705 -17556 49446 110298 184130 181016 137543 107493 100127 149897 179486
22308 179486 227081 113487 137404 29745 -63729 -24782 -15718 -2817 -17139 61580 44589
22297D4589j76195o5798j7110R1968k0533R5978o6810n6637N9270K3842K857O3153
22285b1426M6824k1738p7768J9452O1986n5886q274m7853q5435j9511K1712k6323
22273b14240L8051J12463K2913o8156N9O9531p9043R8901J3532p4808L4699L1723
22261a4375N8641j6800Q9251P5252j5905p0765L3107o1168q6735n7581L3031k3676
22249e7723r4865m0203P1315J6818R7280O1504J7637o2719m5329m441q5469j38780
22237b64975O6543P8590N1903K5675J09829J57842j02280j52899J2734R0442l0850
22226D2554n4211R910J6356j6202J7187p9614n0252M6619M7429m3945j5953n138
22214h5260k2382l8937n0234R3262Q5638k2134k1967O8125L7441m520m2493l5582
$$ plain form
22297 44589 -131606 -197404 -214514 -122546 -143079 -47101 -113911 -170548 -111278 -87436 -84579 -21426
22285 -21426 25398 3660 -74108 -54656 7330 -48556 -56830 -104683 -190118 -209629 -187917 -214240
22273 -214240 -176189 -63726 -40813 -108969 -108910 -39379 -118422 -19521 -5989 -80797 -46098 -14375
22261 -14375 44266 27466 116717 191969 176064 105299 138406 77238 -9497 -67078 -34047 -57723
22249 -57723 -152588 -192791 -121476 -104658 -7378 54126 71763 9044 -36285 -40726 -126195 -264975
22237 -264975 -198432 -119842 -67939 -42264 67565 225407 123127 -29772 -17038 73404 42554
22226 42554 -11657 -1747 14609 -1593 15594 -64020 -114272 -67653 -20224 -64169 -80122 -85260
22214 -85260 -107642 -146579 -196813 -103551 -17913 -40047 -62014 6111 43552 39032 -3461 -39043
22202c9043P1977O2747n7924J6796m3740J97r2480o1149m0077J64632O7592Q1951
22190A31479N6234M8047j53686p7088l3481N1527p6963j1759J07615j2351o4218
22179c4644N6013l3677N5573q7261n8368R9685m022j08454j7895N7585K9287J470
22167d4708k6744m4699j7314j9405o7512l6388J039P9172J17919m9350K7751P347
22155g2892J4100J227Q6769L2531O7171n30p7692r9818m8860M7702R0647J7166
22143E7521j49951P3084j3595K540K7029q539Q0012j3539p1393J4247N2624K4182
22131G4222o2492L630m3820p9428l3170J00755l2595P334o3574j868p2119n0365
22119b53490J07810J10606n7315Q556R2488O0437p4315r1074R5256J20541j3381
$$ plain form
22202 -39043 32934 95681 37757 54553 10813 11010 -81470 -142619 -182696 -18064 49528 131479
22190 131479 187713 235760 82074 4986 -28495 23032 -53931 -65690 41925 29574 -34644
22179 -34644 21369 -12308 43265 -43996 -102364 -2679 -6701 -115155 -133050 -75465 -46178 -44708
22167 -44708 -71452 -116151 -133465 -152870 -220382 -256770 -255731 -176559 -58640 -107990 -80239 -72892
22155 -72892 -58792 -57565 29204 61735 128906 128376 50684 -49134 -97994 -50292 40355 57521
22143 57521 -92430 -19346 -32941 -30401 -3372 -11911 68101 54562 -16831 -2584 50040 74222
22131 74222 11730 15360 -28460 -107888 -141058 -40303 -72898 -65564 -129138 -131006 -203125 -253490
22119 -253490 -145680 -35074 -92389 -83833 8655 69092 -5223 -96297 -1041 119500 106119
22108A06119m0221n6484j20759k9638O4835J33924P9673j2318n3745q0505K389
22097f730k6991p092o8311m2280M9274L7889l7353j02559m201M4960J45116n235
22085b3513k2584J439l1984p510N7449n2428o9359P8425O0489K5527j04696j11726
22073b00471N7839J91458Q6201j22936m6580L88O1346n0300L628L4426m3124j494
22061b9619Q5397N0175j10404o3734k21395o8442P4344J10778L3970N496M3843
22050h9591K7593N3195n888n1444J1260J96435L2629m6183J3603k8153k4730o253
22038H2473l2883J988L9682K5851o6608r1773o864J4654J01110P6023o5194k8709
22026D9750L0869k8989K161M3791L7070m1337K3404o4253n3061k34N1356P504
$$ plain form
22108 106119 65898 9414 -111345 -140983 -76148 57776 137449 125131 71386 -9119 -6730
22097 -6730 -33721 -40813 -109124 -151404 -102130 -64241 -101594 -204153 -208354 -163394 -18278 -23513
22085 -23513 -46097 -44658 -76642 -84152 -26703 -79131 -148490 -70065 -9576 15951 -88745 -200471
22073 -200471 -142632 48826 135027 12091 -34489 -34101 27245 -23055 -19427 14999 -28125 -29619
22061 -29619 55778 105953 -4451 -68185 -289580 -358022 -283678 -172900 -138930 -133434 -89591
22050 -89591 -61998 -8803 -14691 -66135 -54875 141560 174189 128006 141609 113456 88726 82473
22038 82473 49590 51578 91260 117111 50503 -41270 -48134 -33480 67630 143653 78459 49750
22026 49750 80619 51630 53791 97582 134652 93315 116719 52466 -595 -829 50527 58031
22014E8031K6589L2542k2836p2368L033J4762j63932j33839J17148Q5396p0250
22003a25724J0793K13260Q8116j53377j44174P7302J3669L7298n3153n1617q2843
21992a70450o1053k832n5782L5851M9144J6506K3670P0980L4029M250k8840M622
21980g9905P0297L7027n2240K7582J43105j396j81524J9851M846K8667K6462m2931
21968a59o2753O2166j10961n348Q6408k0350o522m8441O7703J35700J1541K5167
21956A34151m2195l6811o4282M2086l7166q3177j1310k0047j4853n3578J06585
21945h0597J34274j9920J15742m3729j34253M102O1495J9798r6386m4265R3103
21934I364l0880L8796l8083n1215N4405k500N2007N8073o4113J0835O4208k9505
$$ plain form
22014 58031 84620 117162 94326 21958 24991 39753 -124179 -258018 -140870 -55474 -125724
22003 -125724 -114931 98329 186445 33068 -111106 -33804 -20135 17163 -35990 -87607 -170450
21992 -170450 -231503 -234335 -290117 -254266 -205122 -188616 -164946 -93966 -59937 -55687 -84527 -79905
21980 -79905 -9608 27419 -24821 2761 145866 144470 -37054 -17203 -12357 16310 42772 -159
21968 -159 -62912 -746 -111707 -117055 -30647 -50997 -57519 -105960 -38257 97443 108984 134151
21956 134151 91956 55145 -9137 32949 -4217 -87394 -98704 -118751 -133604 -187182 -80597
21945 -80597 53677 33757 149499 105770 -28483 -24381 37114 56912 -39474 -83739 9364
21934 9364 -21516 17280 -20803 -72018 -17613 -20113 31894 89967 25854 36689 100897 71392
21922G1392l9033p5467o8995o791k4831N5271M3628o1932L6882K7614n9012l177
21910a04451J45292P9960o1175j13539l4924L8184J43108O8300M562j15123r5119
21899d4925L7143O5809j50573r4890m2044K5742K3113o269J31300Q6507P0725
21888A01638j7623q0982K6443L6784l0176M9573R623n4630k4367L2243J03955
21877A52481k4810j38441n0268j35861k8168Q0411Q9380J37721J9580j67501p3302
21866a38778q3718K9499M0772J54390m2471J6415R0752J2039j20279N6663K3142
21855C8426n8512k4377p788M9845j3041q7829R3435P7547M2812j1514o6973k7081
21843D950k6884J9842n4184k7968L9521K2141L5027L0703n3651N1175J11378K0497
$$ plain form
21922 71392 32359 -43108 -112103 -118894 -143725 -88454 -44826 -106758 -69876 -42262 -101274 -104451
21910 -104451 40841 120801 59626 -53913 -88837 -50653 92455 160755 165317 50194 -44925
21899 -44925 -7782 58027 -92546 -187436 -229480 -203738 -180625 -186894 -55594 30913 101638
21888 101638 84015 3033 29476 66260 36084 85657 95280 40650 16283 48526 152481
21877 152481 127671 -10770 -61038 -196899 -225067 -144656 -55276 82445 102025 -65476 -138778
21866 -138778 -222496 -192997 -152225 2165 -40306 -23891 66861 78900 -41379 15284 38426
21855 38426 -20086 -44463 -52251 -2406 -15447 -103276 -9841 67706 110518 99004 32031 4950
21843 4950 -21934 -2092 -56276 -84244 -44723 -22582 12445 43148 -10503 40672 152050 172547
21831A72547q0890n9468j5071Q662j0192J2346m7172k8998p2739M8757J7150P817
21819d7251J1142n002Q9742N4835L4935j7009J682m3955O0751R057j27334j31097
21807a09504o1880J11604p1468Q0890J30521L6336J5093L0770l4702l9884r5903
21796h127R3893Q1256m2780q0634m0820J4102q4051m1857L2030q9964q1493P1949
21784a76496O1221R73j51077N1668J58217O4548K6514O4475K5099J4718n4257
21773H5603J7257n6984r3269k0245J1967L0752N1484m4116l9019J6608M6636J186
21761G860M6840n389L0061O3231k2461j03402j03447q4521P6697P067L9093p631
21749e6002l2568M8755j5976J37309P8745j88302j10847K4001N4656n9428J39566
$$ plain form
21831 172547 91657 32189 17118 25780 15588 27934 -19238 -48236 -120975 -72218 -55068 -47251
21819 -47251 -36109 -41111 48631 103466 138401 121392 123074 79119 139870 148927 21593 -109504
21807 -109504 -171384 -59780 -131248 -50358 80163 116499 131592 162362 127660 87776 -8127
21796 -8127 85766 167022 124242 43608 2788 16890 -67161 -109018 -76988 -166952 -248445 -176496
21784 -176496 -115275 -114302 -265379 -213711 -55494 9054 35568 100043 125142 139860 85603
21773 85603 102860 45876 -47393 -67638 -55671 -24919 26565 -17551 -56570 -39962 6674 7860
21761 7860 54700 49311 79372 142603 120142 16740 -86707 -171228 -94531 -87464 -48371 -56002
21749 -56002 -88570 -39815 -55791 81518 160263 -28039 -138886 -114885 -60229 -119657 19909
21738A9909N1515K823p5019K01k4656o8987K9575Q1635r1022j2323L3363O4364
21726A1378N0647J23830n2227j05387J2853J00301J13553M9518r6418n9802n2114
21715I6132l5104M5720n9117L0775k0056o738O2035J775N311j6953j8648J4270
21703I9402r5960J3496N9526j14291j05002j2442J56965O3236j251J8354M6916
21692A28949m470k8792p447J4138j21203p0731K7186K8761M8997k7949k5559k7971
21680f6091O4115k075l1936O2999M1199R7543Q5545m1464l7609n5481q4369L8146
21668G0522Q1195j1230j80974r3222P443j4417J7022K7046P9974K1143l901k9342
21656b8741R1643k957P310j5347q9729p6250j9988o538M3936J51095O1356l2939
$$ plain form
21738 19909 71424 74247 -772 -571 -25227 -94214 -64639 16996 -74026 -86349 -52986 11378
21726 11378 62025 185855 133628 28241 41094 141395 254948 304466 208048 148246 96132
21715 96132 61028 106748 47631 78406 58350 51612 113647 115422 120733 103780 85132 99402
21703 99402 3442 16938 76464 -37827 -142829 -155271 1694 64930 63679 82033 128949
21692 128949 124479 95687 88240 102378 -18825 -89556 -62370 -33609 15388 -12561 -38120 -66091
21680 -66091 -1976 -4051 -35987 27012 68211 165754 251299 209835 172226 116745 32376 70522
21668 70522 151717 140487 -40487 -133709 -126266 -140683 -123661 -96615 -16641 4502 601 -28741
21656 -28741 62902 59945 67255 51908 -37821 -114071 -134059 -140597 -96661 54434 115790 82851
21644H2851r9776m6685p2723N2125J72632R7720m2457j84033q7797Q3577m7649
21633i2215Q621K6145M8377L1049L7552P0647n2594n6262O4743m1986J5286m625
21621E4738O2184L9086K752j46005m6056l3495k3396k7419M2640L3025l958M2940
21609b964M9148o3370Q4806O4614r8872n1006L656m7265l9333j9272R1925J38285
21597A10352k8943p6032j665N4285P7141m8062n3692l0131j31972m461J36211
21586C031k519M300j910r6133l401O5508K289r94Q3004O4436o9986j0423r7887
21573f0685m8804K9164J35425N2761p2829q2975r93N3275j17839J06258J63498
21562A56256k9647j04305p362j1487l983p268k1970N0750O562J56222M9753o2157
$$ plain form
21644 82851 -16925 -63610 -136333 -84208 88424 186144 143687 -40346 -128143 -44566 -92215
21633 -92215 -83594 -57449 -9072 21977 59529 130176 77582 21320 86063 44077 59363 54738
21621 54738 116922 156008 158760 12755 -33301 -66796 -90192 -117611 -74971 -41946 -45904 -2964
21609 -2964 46184 -17186 67620 132234 33362 -17644 -13988 -61253 -100586 -119858 -27933 110352
21597 110352 81409 5377 3712 57997 135138 87076 33384 3253 -128719 -133180 3031
21586 3031 512 4812 2902 -93231 -96632 -31124 -28835 -29829 53175 117611 47625 37202 -60685
21573 -60685 -109489 -80325 55100 107861 35032 -47943 -48936 4339 -113500 -7242 156256
21562 156256 126609 22304 14942 3455 -528 -7796 -29766 20984 27546 183768 233521 171364
21550A71364q5033n4768r1432k1299L3692N1615P6024j22989j46631J3379Q7566
21539h8512K2368M8118J8811L8442j0569o4625n8241R415l0256j7755J6838k9
21527a15995J832J2912n6247Q8588L0330j24082Q380J44973k0266J0504r029Q09
21515b7291j6908j02009q4699M2012P4088p4300l5296J15981P1020P5575k4249
21504A3924o4438L0176M1570j30327j15262O8999l3514M4345L2704l379q223j0340
21492a33765r230O0104M1683n9280L5742m143n7535N3509J8476M6572j7978j5926
21480d1771K8261l4566j00450L9912j5874n7015M9585J13411j7911L1008O3994
21469E8584n0498j31844q5026O1472l158n2265j0374O1967k1366J21899O8745
$$ plain form
21550 171364 86331 31563 -59869 -81168 -47476 4139 80163 -42826 -189457 -176078 -88512
21539 -88512 -66144 -18026 785 39227 28658 -35967 -94208 -84793 -115049 -132804 -115966 -115995
21527 -115995 -114163 -101251 -157498 -68910 -38580 -162662 -154282 -9309 -29575 -19071 -28100 -27291
21515 -27291 -44199 -146208 -230907 -188895 -114807 -189107 -224403 -108422 -37402 38173 13924
21504 13924 -50514 -20338 21232 -109095 -224357 -155358 -188872 -144527 -111823 -115202 -123425 -133765
21492 -133765 -142995 -82891 -41208 -100488 -64746 -68889 -126424 -72915 -54439 -7867 -25845 -41771
21480 -41771 -13510 -48076 -148526 -108614 -124488 -181503 -131918 -18507 -36418 -5410 58584
21469 58584 8086 -123758 -208784 -147312 -150470 -202735 -213109 -151142 -172508 -50609 18136
21458A8136p156m9583r1820J9900m8919o5889p6375P8219J60437J39539O2886
21447A39375l8969j35536q8726L0669K9650q4354r0635j48708N0804J66999J04745
21436f4686L8749L3556O6212L5659j05982J0994J3678Q869J7769N7755q2596l6168
21424f191l3169L2586P8262M1153o8063p2178l7009L6976N5273j2893n2962L1135
21412g080j04803j1510N1112o518J3248Q5279J462n0678j2095r2238J6625L9930
21400g7266n0490o128J97656Q6573r1009q3057m094J08933J0836p5202k3075N4246
21388D7923k9838j0781o5211k8760k4210K7169N8016R2322O8528l660L4801m3161
21376A23138j09082j18893j8150P0394P0835n2501L5152j3587L306L401O730J3579
$$ plain form
21458 18136 10980 -38603 -130423 -110523 -159442 -225331 -301706 -223487 -63050 76489 139375
21447 139375 100406 -35130 -123856 -93187 -63537 -147891 -238526 -387234 -336430 -169431 -64686
21436 -64686 -25937 7619 73831 109490 3508 14502 28180 37049 54818 112573 29977 -6191
21424 -6191 -39360 -6774 71488 112641 44578 -27600 -64609 -27633 27640 14747 -38215 -7080
21412 -7080 -111883 -123393 -72281 -78799 -65551 19728 21190 -29488 -41583 -133821 -117196 -77266
21400 -77266 -127756 -133884 63772 150345 59336 -23721 -27815 81118 91954 16752 -6323 47923
21388 47923 18085 7304 -57907 -86667 -110877 -83708 -25692 66630 135158 131498 166299 123138
21376 123138 14056 -104837 -122987 -52593 18242 -34259 893 -12694 -9388 -5987 743 14322
21364A4322l7118O7815m5365p3629P0916O3204J21713O9176O2412J9335p2491
21353B60290k00516m7603J9214q2381m6638J19212J05396l523P76L233J5112k6061
21341A16511l7395j2614m7762J1582l4964J2834l057L5024j120Q1238n5728m9937
21329A4612l6310p6442O9944J6183m6188J52485m1775k1390J20796M1050k7333
21318A65632m7427o5833K4511k0332q4713L2322K7060q257j02519m5525K5221
21307i9860j7295l0804O9999L0350R4047l9749j64601n499O3890M9182l1900q1867
21295a64107O1122N8133O6941l8321k7085N1844O8066m240o809q4764J8416K6809
21283B6005p0561K8404l7798j9217P8472J4096m5613m2610j8950p4809K6841n5184
$$ plain form
21364 14322 -22796 45019 -346 -73975 -3059 60145 181858 251034 313446 332781 260290
21353 260290 59774 12171 31385 -50996 -97634 21578 126974 123451 124227 127460 142572 116511
21341 116511 79116 66502 18740 30322 -4642 8192 5135 40159 39039 120277 64549 14612
21329 14612 -21698 -98140 -28196 -12013 -58201 94284 52509 31119 151915 192965 165632
21318 165632 118205 52372 76883 56551 -28162 4160 31220 22963 -79556 -125081 -99860
21307 -99860 -117155 -147959 -77960 -47610 46437 6688 -157913 -163412 -99522 -50340 -82240 -164107
21295 -164107 -102985 -44852 22089 -16232 -43317 8527 76593 72353 65544 -19220 -804 26005
21283 26005 -44556 -16152 -53950 -73167 5305 19401 -26212 -68822 -87772 -162581 -135740 -190924
21271a90924q836J00122J02187j2261n0118o6302O5228O0518K5987K9677L2446
21260H7724Q1833p9012J5061o422l8427K8119j43745j26406J02112m996k3685
21249a07844M5068k2942J213k078J03132Q0552o9996K6288Q736j14774n4589j27713
21237b34947q032K19880R3421m6119l5771N5458n2290j5442k8735q3830j25106
21226b61513P8070Q7744N1074M375L6644O8327j4982M8007q2857L9509n4478M2929
21214D2849m0816N0352o3915K8323J14758J24928N0019k5559M9576l6963r2119
21203B01433j61247p2022L842m9959K4855N4549P2758k5612J9415P292p2465m0924
21191c8085Q1951J43319j7877J8948k0353j47407J9167O0174J2645K1891P3218
$$ plain form
21271 -190924 -199760 -99638 2549 -9712 -59830 -126132 -60904 -386 25601 55278 87724
21260 87724 169557 90545 105606 99184 60757 88876 -54869 -181275 -79163 -84159 -107844
21249 -107844 -62776 -85718 -84505 -86583 16549 97101 27105 53393 62129 -52645 -107234 -234947
21237 -234947 -242979 -23099 70322 24203 -11568 43890 -8400 -23842 -52577 -136407 -261513
21226 -261513 -183443 -95699 -44625 -40250 -3606 64721 49739 97746 14889 54398 -80 42849
21214 42849 2033 52385 -11530 16793 131551 256479 306498 280939 330515 293552 201433
21203 201433 40186 -31836 -27994 -77953 -53098 1451 74209 48597 68012 75304 2839 -38085
21191 -38085 43866 187185 169308 188256 167903 20496 39663 99837 112482 134373 207591
21180B07591j01361j02594m6719M4545J8623p7976R325k6119j7165n8589O3527
21169h6912J26429N2744j27186p8611j3052o0826J25178L3900n2730j13184L4115
21158a60135L9479O0515l1598Q8351Q5989p7859J6164L0698M1124q6766k0205
21147a4243M2831K3334J2598j0362j04718J634K7226K2672j8880n7971K6584J8992
21135c0303o787m7773j7968r9552j8007J4390Q2442O4991O7653n8488o0890K603
21123a07689J32392O4370K4337j8099K9676L487q3920n4428Q651n5429M4466n1828
21111f4014k0221N225j1430L9220L6276O1979n9976k7611R937j1249l2841q2587
21099a57292P0389o4353Q7820P6782O2602l1242j6644N608L495J2646j792K9065
$$ plain form
21180 207591 106230 3636 -43083 1462 20085 -57891 -48566 -74685 -91850 -150439 -86912
21169 -86912 39517 92261 -34925 -113536 -126588 -187414 -62236 -28336 -81066 -194250 -160135
21158 -160135 -120656 -60141 -91739 -3388 82601 4742 20906 51604 92728 5962 -14243
21147 -14243 28588 51922 64520 54158 -50560 -48926 -21700 972 -17908 -75879 -49295 -30303
21135 -30303 -37090 -84863 -102831 -202383 -220390 -206000 -123558 -58567 9086 -49402 -110292 -107689
21123 -107689 24703 89073 113410 95311 124987 128474 44554 -9874 -1223 -56652 -12186 -64014
21111 -64014 -84235 -79010 -90440 -51220 -14944 47035 -12941 -40552 -30615 -41864 -74705 -157292
21099 -157292 -86903 -151256 -63436 13346 75948 44706 28062 33670 37165 49811 48019 77084
21087G7084j26107m4326N1478L1206J0419L1933k8603m158N499M2185k7172L2097
21075E1535p8795k9286q2514k7451L2357J19596N3501J00975N6747j31333j66898
21064a01566j0597J147N2433O8888k1399r5847K2497m3085N9478q3990q0939M1133
21052a91847P2320Q5575P1835p9594l3784Q2518O5666p9540j47764o5737R1662
21041a28690R8282Q623k0730p5446n7733M730P2264J6929k452M2696P9991k8286
21029A0178o9178j527M0807N0364K4048m2855K3434l9750l3177P3822m412j6667
21017A5087p5235j1497o8492L082N2564L7524l9539l7365M0838J06553O1584m5081
21005D0023p9360M0885L160K059n1658o1377Q3160N8798k6855r7254q2669K9864
$$ plain form
21087 77084 -49023 -93349 -41871 -10665 -246 31687 3084 -1074 4425 46610 19438 51535
21075 51535 -27260 -56546 -139060 -166511 -134154 -14558 38943 139918 196665 65332 -101566
21064 -101566 -112163 -111016 -58583 10305 -11094 -106941 -84444 -127529 -68051 -152041 -232980 -191847
21052 -191847 -119527 -33952 37883 -41711 -75495 7023 72689 -6851 -154615 -220352 -128690
21041 -128690 -30408 -21785 -42515 -117961 -175694 -170964 -98700 -81771 -84223 -41527 38464 10178
21029 10178 -59000 -60527 -19720 30644 54692 11837 35271 -4479 -37656 36166 31754 15087
21017 15087 -60148 -71645 -140137 -137055 -84491 -46967 -86506 -123871 -83033 23520 85104 40023
21005 40023 -39337 1548 4708 6767 -44891 -106268 -23108 35690 8835 -88419 -171088 -141224
20993a41224p0284O2027r1832K5471R3985K4985r8631o2789J42829Q0016J60967
20982A25520j02304j32035l9516j87P97l0270J3433M1012N4642J8492O918r7960
20970a41458j4186M7878J31756M2783M9045n9333m1329K7140J47323p7974j07462
20959D183m0882J9088J03931O1835p0022j40674k0341J12481N194M4842P6621
20948A56256q1831k41437l9882Q0720O7337M3229L8189P4268J3925p1170o9869
20937c0265P0616J0158j44726k3562j1916n8423N046j2343m0028Q4323P2405M3841
20925c4874q9409M2404P7721L0162J82422P1820j36191j46187l6490J1832j18550
20914a45340K795J47683M6020M5685k7832j68880r1100j6986P543N4038N622J16706
$$ plain form
20993 -141224 -211508 -149481 -241313 -215842 -121857 -96872 -195503 -258292 -115463 -35447 125520
20982 125520 23216 -108819 -148335 -148522 -147725 -177995 -164562 -123550 -68908 -50416 -43498 -141458
20970 -141458 -155644 -107766 23990 66773 115818 56485 15156 42296 189619 111645 4183
20959 4183 -36699 -17611 86320 148155 78133 -62541 -82882 29599 34793 79635 156256
20948 156256 74425 -167012 -206894 -126174 -58837 -15608 22581 96849 110774 39604 -30265
20937 -30265 40351 50509 -94217 -117779 -129695 -188118 -183072 -195415 -235443 -151120 -78715 -34874
20925 -34874 -124283 -81879 -4158 26004 208426 280246 144055 -2132 -38622 -26790 -145340
20914 -145340 -142545 5138 51158 96843 69011 -99869 -190969 -207955 -200412 -146374 -140752 -24046
20902b4046L8557q5332j01191m2943m9020k4718k2792j6603O8598K13908J32693
20891H7111k4534l5191n986n8305J8588K9312P2242l1749j15980j2593n134Q7267
20879E048K8827o3614l7099l3660k595n786l033m7154J845n3543p8323q579L4521
20866b63145R3109J48320O5442j5089r666L7531l638j0777L344O5455L2488j42736
20854F38J1492p2911j26446K9775J1729M0725n189j7307L827P385k0510J4982
20842a21810J0198P9379L5632m3651r0434K058M933L0667K2871L2278n3653n9832
20830a51364Q0416K1777Q4166L9120J11455q4283p5457j9131q0643k036l2234
20819a08214O7989J15240P4493j3067n3596k6951m0294L2810N5317l4067P165
$$ plain form
20902 -24046 14511 -70821 -172012 -214955 -263975 -288693 -311485 -328088 -259490 -45582 87111
20891 87111 62577 27386 21400 -36905 -18317 10995 83237 51488 -64492 -77085 -82219 5048
20879 5048 33875 -29739 -66838 -100498 -103093 -108879 -111912 -159066 -157221 -210764 -289087 -297666 -263145
20866 -263145 -170036 -21716 43726 28637 18971 56502 52864 42087 45431 110886 143374 638
20854 638 12130 -60781 -187227 -157452 -145723 -104998 -110187 -127494 -123667 -116282 -136792 -121810
20842 -121810 -111612 -32233 3399 -40252 -130686 -128628 -123695 -93028 -70157 -37879 -91532 -151364
20830 -151364 -70948 -49171 34995 74115 185570 101287 25830 6699 -73944 -75980 -108214
20819 -108214 -40225 75015 149508 136441 82845 55894 15600 48410 103727 69660 76825
20808G6825p5516n9107k2284J1553p6682m0214N447k495K084N1568J05388L8799
20796A5366R3100J5888o3181m0901j0126j23277q907L7997M9601r2446j9575O2813
20784h3648O4984o0170k5170O5577m260L114o7238J1128L0614O9319K4843K1406
20772E0499j7010j13250p6377k0899J07759J08j09027n5766l064M6377Q1424J0998
20760i8228j7029J638j3745r2876j3977J81285O4377Q3366Q970n1608k5807l4915
20748h549j6160o4051R652O3741K3395m6652M1254l5845k4658M6101j1824l6393
20736e9989m6756p0021J6284L8522k5346O6147o7998o3108J02391J06214L0201
20725B6541R536P0513q4249j72333l4538N1026J40877P8851l2447j87751j285
$$ plain form
20808 76825 1309 -57798 -80082 -68529 -145211 -185425 -179978 -182473 -180389 -128821 -23433 15366
20796 15366 108466 124354 61173 20272 10146 -113131 -122038 -84041 -34440 -126886 -146461 -83648
20784 -83648 -18664 -78834 -104004 -38427 -42687 -39573 -106811 -95683 -65069 4250 29093 50499
20772 50499 33489 -79761 -156138 -177037 -69278 -69170 -178197 -233963 -237027 -190650 -109226 -98228
20760 -98228 -115257 -113619 -127364 -220240 -234217 -52932 11445 94811 103781 52173 26366 -8549
20748 -8549 -24709 -88760 -79108 -15367 8028 -38624 2630 -33215 -57873 -11772 -23596 -59989
20736 -59989 -106745 -176766 -160482 -121960 -147306 -81159 -149157 -212265 -109874 -3660 26541
20725 26541 36077 106590 22341 -149992 -184530 -133504 7373 86224 53777 -133974 -135259
20714a35259N6534J03933o364j18619k4502L5367r4963q614P1985J03543p2786
20703h9745m3347L3691j12700m2430R6081R0186J15052N2152j7618m4933j14519
20692g8130J5060n4628l6141O0551Q2528m3674l4899k4081P7291J74186o2150
20681G5913l3404J6430k5591k9889o6253Q6050l5639j13371K1992L1562J7802
20670e4398M0405J04619o7221q4134k151J1057R338L8662m6161o6290l7196L529
20658a49941P1981J586J04666J40649n9303j43424l5187j18m8502Q6647M8232
20647A7286K6105K8516j21027q5863J53681N5086k5600J6265o5382J6603k2526
20636f856o728J92096L7320r8644k7828p532k5806P480n0039N6067K4888j53548
$$ plain form
20714 -135259 -78725 25208 18844 -99775 -124277 -88910 -183873 -192487 -120502 -16959 -89745
20703 -89745 -133092 -99401 -212101 -254531 -158450 -68264 46788 98940 81322 36389 -78130
20692 -78130 -63070 -117698 -153839 -93288 -10760 -54434 -89333 -113414 -36123 138063 75913
20681 75913 42509 58939 33348 3459 -62794 23256 -12383 -125754 -103762 -72200 -54398
20670 -54398 -13993 90626 23405 -60729 -62880 -51823 -42485 -3823 -49984 -116274 -153470 -149941
20658 -149941 -77960 -76374 28292 168941 109638 -33786 -68973 -69091 -117593 -30946 17286
20647 17286 43391 71907 -49120 -134983 18698 73784 48184 64449 -933 15670 -6856
20636 -6856 -13584 178512 215832 117188 89360 81828 56022 63502 13463 69530 94418 -59130
20624e9130l6810O0950K0348J5297l385l4989M0616O4632q739l3426j05821K1622
20612e8835j9218p9189n0856O0678k9179J74387J28098K6539K2204k0998k6142
20601A27489o785K9934j58093k9405p4602Q479J14262J7374j2946r3122M8343
20590b9072k301N9425k174j8036l8086K6375J121j9679K4246L0730K0222j2008
20578D0763J31216L8753j12857p802r476p2203q4307O3732R1541K2316j74776
20567g3100N8401M7163j78435o6093J12124J5227N4089J74094R6891p9711m4972
20556A15678J509k59511o41J17089Q6788n7329l2547N6755N8322n3207m7719L4397
20544A9584r1667L0779R0053N577k9977L3528m4659m6447l7100j29251j7345J9674
$$ plain form
20624 -59130 -95940 -34990 -14642 655 -2730 -37719 2897 67529 58790 25364 -80457 -58835
20612 -58835 -78053 -157242 -208098 -147420 -176599 -2212 125886 152425 174629 153631 127489
20601 127489 120704 150638 -7455 -36860 -111462 -102983 11279 28653 15707 -77415 -29072
20590 -29072 -31373 28052 25878 7842 -30244 -3869 -2748 -22427 1819 32549 52771 40763
20578 40763 171979 210732 97875 90073 80597 8394 -75913 -12181 79360 101676 -73100
20567 -73100 -14699 32464 -145971 -212064 -99940 -84713 -30624 143470 240361 160650 115678
20556 115678 117187 -142324 -142965 -25876 60912 3583 -28964 27791 86113 32906 -14813 19584
20544 19584 -72083 -41304 48749 54326 24349 57877 13218 -33229 -70329 -199580 -216925 -197251
20532a97251j9094L8777R8036K2560K7263K4200j093K687J9536P253q764K068
20520A6178L2561m6528Q2660m2145j43328j1680J09413L1078j02845l6586k0951
20509a32173j16812N6542R1732L0243n7981O6712J12554J0919j0661q4849r7724
20498a31498j1059K057L1672J61735r127p3907M0689J1571M8523m2146n1755p8841
20486a02086o7126P2285R7598R847Q395L3666R030r6613k8504J12454p8150j34911
20474a64115P7761J18125J53961l4965j62595k990L3249M864K9626n6860Q2599
20463G8660q345o0606n3464j7279n3426L8906n0939J8457L36l0709o1027J04776
20451i4660j284j32723N8559K9635R631N1141J20204K6595j9076K4283k5341j9750
$$ plain form
20532 -197251 -216345 -177568 -79532 -56972 -29709 -5509 -6602 -3915 15621 22874 14110 16178
20520 16178 48739 2211 84871 42726 -100602 -112282 -2869 28209 -74636 -111222 -132173
20509 -132173 -248985 -192443 -100711 -70468 -128449 -61737 50817 61736 51075 -33774 -131498
20498 -131498 -142557 -140500 -108828 52907 43780 -30127 10562 22133 70656 28510 -23245 -102086
20486 -102086 -169212 -96927 671 10518 18913 52579 61609 -35004 -63508 48946 -29204 -164115
20474 -164115 -86354 31771 185732 150767 -11828 -14818 18431 23295 52921 -3939 78660
20463 78660 70315 9709 -43755 -61034 -114460 -75554 -126493 -108036 -107700 -138409 -199436 -94660
20451 -94660 -95944 -228667 -170108 -140473 -130842 -79701 40503 67098 48022 72305 46964 27214
20439B7214N5245r4733j0289n2994p6841L4001Q3442Q6198j34421j01336l1317
20428b15831O0692n5037R2356P4621L3538N5914M3192K7209k9702n6341r9604
20417f8993r1381k6639l2788M0154O8453N3374J11892P093l5979K8870j5293o5781
20405b7018p1221L1165R7913L3007o3837j5184N2005p5358l0973J01365k9744
20394B120m0766o6602m7614J39385J28419l8274r0497L959l5952r001Q955J14862
20382F8994J00436J3775p414n4629p5381p9787J04017r4968p6240K6028o785o8269
20370a50223l3156O7359J21621L8867K4936r9942l7920L29m0938j13151o6985
20359b89203p3845J96949J66298L1255L2627l2388m5457j8132J3325n3152J62014
$$ plain form
20439 27214 82459 -12274 -22563 -75557 -152398 -118397 -34955 51243 -83178 -184514 -215831
20428 -215831 -155139 -210176 -117820 -43199 -9661 46253 89445 116654 86952 30611 -68993
20417 -68993 -160374 -187013 -219801 -179647 -111194 -57820 54072 61165 25186 54056 38763 -27018
20405 -27018 -98239 -67074 30839 63846 9 -15175 36830 -38528 -69501 31864 2120
20394 2120 -38646 -105248 -152862 -13477 114942 76668 -13829 -9870 -45822 -54823 -45868 68994
20382 68994 169430 183205 175791 121162 45781 -34006 70011 -24957 -101197 -75169 -81954 -150223
20370 -150223 -183379 -116020 5601 44468 69404 -30538 -68458 -68129 -109067 -222218 -289203
20359 -289203 -363048 -166099 199 31454 64081 31693 -13764 -31896 -18571 -71723 90291
20348I0291L7055n4521j4879j22046n1079M5652l9641P4529N9937J5711O8741
20337A09750j9416r5274J2520k9609K1580o3812L8996K4115O3676o7755m9242
20326e4471J17734J9608J2799J37107p5259j06480j29209l0658L9426M2104J00679
20315G3380j535M3392r3097r0693l7076N9818p3062K492Q6304p3389p6683J43020
20303c7129J00066J9855q1138r9477o609M6724q414m1850n3055N6090r1945M4260
20291a52622R903p1353K1050P9736j287j06107J1607M2956N9844K3092K5162j00376
20279a58395L6576N1029N2510o997J9743n6248J9246J01665P7731o7146r7146
20268b7432q9057p64P2066l3822J1826j22476N5149O0715P5000L7673m7204l2151
$$ plain form
20348 90291 127346 72825 57946 -64100 -115179 -69527 -109168 -34639 25298 41009 109750
20337 109750 90334 -4940 7580 -22029 -449 -64261 -25265 -1150 62526 -5229 -54471
20326 -54471 63263 82871 95670 232777 157518 51038 -78171 -108829 -69403 -27299 73380
20315 73380 71845 115237 22140 -68553 -105629 -45811 -118873 -116381 -30077 -103466 -180149 -37129
20303 -37129 62937 82792 1654 -97823 -104432 -57708 -66122 -107972 -161027 -104937 -196882 -152622
20291 -152622 -142719 -214072 -193022 -113286 -114573 -220680 -209073 -166117 -106273 -83181 -58019 -158395
20279 -158395 -121819 -70790 -18280 -25277 -5534 -61782 -42536 59129 136860 69714 -27432
20268 -27432 -116489 -117253 -45187 -79009 -67183 -189659 -134510 -73795 1205 38878 -8326 -40477
20256d0477m5886K7238N7972N6866m9591o8708k6311p1403J2605N9023M8073m3139
20244h3738r1966O0247k6025k6397L0184L6272j753J4132J25192J0237O704j5435
20232C7654J1069K8223k1356m6450j3092R7793q8979r5662m1951P510O3296J0055
20220e1890m1146P5224J6472k4729q9691O8931J0933L3669k7161l5225J79546
20209A14933J43381l5494j13591p4690j7302n498K5586o1397M411J702k5880l4641
20197g8480j4352R184K4789K02011P616l8572j2452K7281L282n1324r5051R2939
20185G6871N145O580R0765p9759j18989M7831K4649M3106M4776r1935m8289N158
20173E909q0603r3912M5491J47537J8580k8497k7958j2588K1288k8906l8164O8313
$$ plain form
20256 -40477 -86363 -59125 -1153 55713 6122 -62586 -88897 -160300 -147695 -88672 -40599 -83738
20244 -83738 -175704 -115457 -141482 -167879 -137695 -101423 -103176 -89044 36148 46385 53089 37654
20232 37654 48723 76946 55590 9140 -3952 93841 4862 -90800 -132751 -125241 -61945 -51890
20220 -51890 -93036 -17812 -1340 -26069 -115760 -46829 -35896 -2227 -29388 -64613 114933
20209 114933 258314 222820 109229 34539 17237 11739 37325 -24072 -19661 -17959 -43839 -78480
20197 -78480 -92832 -83648 -58859 143152 150768 112196 99744 127025 130307 78983 -16068 76871
20185 76871 82016 88596 179361 99602 -19387 28444 53093 96199 140975 49040 751 5909
20173 5909 -74694 -168606 -123115 24422 43002 14505 -13453 -26041 -4753 -33659 -71823 -3510
20161c510l9948r8825l1325k6299N4593R0352k9005l8601M6461m8742m2244P4127
20149i2966j7751m2818L7211J24307l7475j5772m2079J3196J10526l6214p2688
20138g2523q7255M710K2721R2104R0045j5266k0027N98L8542j8227L938K12o0191
20125b0619k7801L9425k4707p4955L8381O6143j3100p0586l3497Q131K2059k7937
20113a19063k1811q2014L9846J3320p633l9820J86232k1565r4547M4768m694R0888
20101a6093L7441J1292O6621J51341k347o5135l8348k0415j05378j34218l7651
20090a52890M9054N9419N1626K9128o5753K9069n1256K2361M2412l0313j594p2909
20078i1646J8637k0904n0133j8466N1978J36484M0954r5949J7369L64r354k7409
$$ plain form
20161 -3510 -43458 -142283 -173608 -199907 -145314 -54962 -83967 -122568 -76107 -124849 -167093 -92966
20149 -92966 -110717 -153535 -116324 7983 -29492 -45264 -87343 -74147 36379 165 -72523
20138 -72523 -159778 -155068 -132347 -40243 49802 34536 14509 15107 53649 35422 39360 39572 -20619
20125 -20619 -48420 -8995 -33702 -108657 -70276 -4133 -17233 -87819 -121316 -113185 -91126 -119063
20113 -119063 -140874 -222888 -183042 -169722 -177355 -217175 -30943 -52508 -147055 -102287 -106981 -16093
20101 -16093 21348 32640 99261 250602 248255 183120 144772 124357 18979 -115239 -152890
20090 -152890 -103836 -44417 7209 36337 -29416 -347 -51603 -29242 13170 -17143 -18737 -91646
20078 -91646 -73009 -93913 -144046 -162512 -110534 25950 66904 -29045 -11676 -11312 -20666 -48075
20066d8075J1705o6595j44804n9140l1639J0007J53762P0037p292O616J11757
20055F339P4285l586l7175r163J1132m8799o3431p2742R5289Q4937j09772N4221
20043a8465J60698P7245j14072m3682P610n9616r4948n284q4273O0048K1182Q4460
20031i097N0782k2215O1571L2923N6469o7139J2563n0567n83P9779L9334l5093
20019A48727m4175j03842Q6214k8183p6031O431m8370p7287O1721l5516L2253
20008g8058J52890K5719j7396m3231m3201L817n3726q7414j00305P6434Q1531
19997h2940Q2289j3836n0589J4761N7583m4320M164o8630m7901k813m828j6120
19985a73180N0975j392J02005P7815K0576Q5229n6226m2698J5598n3581n0155
$$ plain form
20066 -48075 -36370 -102965 -247769 -306909 -338548 -328541 -174779 -104742 -112034 -105418 6339
20055 6339 80624 77038 39863 30700 41832 -6967 -70398 -143140 -47851 37086 -72686 -18465
20043 -18465 142233 219478 105406 61724 69334 9718 -85230 -90514 -174787 -114739 -93557 -9097
20031 -9097 41685 19470 81041 113964 170433 103294 115857 65290 64707 144486 183820 148727
20019 148727 104552 710 86924 58741 -17290 -10859 -59229 -136516 -74795 -110311 -78058
20008 -78058 74832 100551 83155 39924 -3277 540 -53186 -140600 -240905 -164471 -82940
19997 -82940 -651 -14487 -65076 -50315 7268 -37052 -32888 -101518 -149419 -152232 -157060 -173180
19985 -173180 -122205 -123597 -21592 56223 76799 162028 105802 63104 78702 25121 -25034
19974b5034K1032J16721l6714n5048L2824J38386N7927j61924q3080j0132K3660
19963A8618K7696k6897p4144m4126l6663l363o4648J2627Q4992N7579l3090j5089
19951i6508L5539q8797M51R0644M501k9303l8789Q2238j247J8112M582L9424Q2195
19938A03042j4937L272j08010m1377n3275O704n5660m6207p5717L9224J09008
19927a33933O9898J480k3770J4042j0505L5533K8814J5975M7997J6053J4221j9901
19915E5904p7035j39886P5434M9657j32370M1805K5610P7855Q4620l1411m7484
19904a7301P7663q1013o390O6033j3703R261L4484J0417r1057m4268n3335o4650
19892a73859M7674O1152P4291J650j14155k1228M8180N7313R4283j22019n7643
$$ plain form
19974 -25034 -4002 112719 76005 20957 53781 192167 250094 88170 5090 -5042 18618
19963 18618 46314 19417 -54727 -98853 -135516 -138879 -203527 -190900 -105908 -48329 -81419 -96508
19951 -96508 -60969 -149766 -149315 -58671 -54170 -83473 -122262 -40024 -41271 -23159 -18577 20847 103042
19938 103042 88105 91377 -16633 -58010 -111285 -104581 -160241 -206448 -282165 -242941 -133933
19927 -133933 -64035 -62555 -86325 -72283 -82788 -47255 -18441 -2466 45531 61584 75805 55904
19915 55904 -21131 -161017 -85583 -35926 -168296 -126491 -100881 -23026 61594 30183 -17301
19904 -17301 60362 -20651 -27041 38992 25289 34550 69034 79451 -11606 -55874 -109209 -173859
19892 -173859 -126185 -65033 9258 10908 -103247 -124475 -76295 -18982 75301 -46718 -104361
19881a04361J916j4703R225q6100j8651M4666R2865R6525P6316K7565J9696K1389
19869A66348n5341r0677L38q0862J5414o2513P1430J60772J7614o1615k4502p963
19857D8443j13720n6629k1588P5916R3326m264o1711O922m093P1868j03427j34377
19845b03334o6317Q4147R7606M5802j8112j4530M3434l7486n4837l422M2470M8343
19833c6236j55222l4370N3464k3737j10491O0984J07777J18418R666M8348n0741
19822a2140L3059J35470j6169j44911J14897J71294R584p3087m5877m7029j11847
19811A3244K7483j0498p2408m8511O0298j12504j23317j053N7881o91L1668P2655
19799a05753P7909J7194O7051K4132j27692L794Q0411K19957j8595j50872q6288
$$ plain form
19881 -104361 -102445 -117148 -107923 -194023 -212674 -168008 -75143 21382 97698 125263 144959 166348
19869 166348 111007 20330 20668 -60194 -44780 -107293 -35863 124909 142523 80908 56406 48443
19857 48443 -65277 -121906 -143494 -67578 25748 21484 -40227 -33305 -37398 34470 -68957 -203334
19845 -203334 -269651 -185504 -87898 -42096 -60208 -74738 -31304 -68790 -123627 -127049 -84579 -36236
19833 -36236 -191458 -225828 -172364 -196101 -306592 -245608 -137831 -19413 -9747 38601 -12140
19822 -12140 20919 156389 140220 -4691 110206 281500 291084 217997 172120 125091 13244
19811 13244 40727 30229 -42179 -90690 -30392 -142896 -266213 -267266 -209385 -210076 -178408 -105753
19799 -105753 -27844 -10650 56401 80533 -47159 -43365 37046 257003 238408 87536 1248
19788A248p4487n7764N7128j6601l2762N5407M7091R6106O2192j234l2349l656
19776A00319J0979l4628o028L2293o933m8059j26793m2544j9447M6648N0755M4734
19764A296j05007n2063K117J22803k5076p51o9441K8978M2666J20734P2721m0945
19752I8032j41668q9753N9394J25342k0938k9239L5025l7318L4402L8643P5195
19741A47117o4421j31312o8884M0531L6425j5161m4561q865K5191O1605J15645
19730I3310o9982p1441R647j3787J7112m7175L564J11791m2951m9959P7750Q3801
19718A01680O3127k9829J6888j33645m0028L0693k2018P933P9851o7117q2283
19707g4748O523P3502J02331q4700R381M5675l0359L5245n996p4942k7833R649
$$ plain form
19788 1248 -73239 -131003 -73875 -90476 -123238 -67831 -20740 75366 137558 136324 103975 100319
19776 100319 111298 76670 70642 102935 96002 47943 -78850 -121394 -140841 -94193 -43438 1296
19764 1296 -103711 -155774 -153657 -30854 -55930 -56681 -126122 -97144 -54478 66256 138977 98032
19752 98032 -43636 -133389 -73995 51347 30409 1170 36195 -1123 33279 71922 147117
19741 147117 82696 -48616 -117500 -76969 -40544 -55705 -100266 -109131 -83940 -22335 93310
19730 93310 23328 -48113 -38466 -52253 -35141 -82316 -78752 33039 -9912 -59871 17879 101680
19718 101680 164807 134978 151866 18221 -21807 8886 -13132 -5199 74652 7535 -74748
19707 -74748 -68225 5277 107608 22908 32289 77964 47605 82850 76854 1912 -25921 -16272
19695a6272R8659J5665p9301l7716l2594J7447j6442j801L2311M2484K4205N6329
19683A02974q7572j19900L0252Q5727P7143M5286N27j54361p8990j06423p0741
19672b76078J9721J50182Q0896K1760q1616m3151M2880m700O0301J8541N655j8615
19660b4224K3169k5691m8636L0483j8391m8063L6239K0803O5594j4733m8848P151
19648d5147J34888N0482K5551p4726j19920j11459L0976P575l0642M1852J65816
19637G5246P2315o5499J5944J05742o9767n3466j0375O3531q898p2946j22308
19626g0481k5154J3026M1726O3351n4801J6701P5112K5132Q4612p1345p6570n6944
19614c5635o078p5481j8807p874M2397J7251J16208o1456j07596q9495o0429J43599
$$ plain form
19695 -16272 82387 98052 18751 -18965 -51559 -34112 -50554 -52355 -20044 22440 46645 102974
19683 102974 15402 -104498 -74246 11481 88624 133910 134437 -19924 -98914 -205337 -276078
19672 -276078 -256357 -106175 -25279 -3519 -85135 -128286 -85406 -90106 -29805 -11264 -5609 -24224
19660 -24224 -1055 -26746 -75382 -44899 -63290 -111353 -75114 -54311 11283 -3450 -52298 -45147
19648 -45147 89741 140223 165774 91048 -28872 -140331 -109355 -101780 -132422 -90570 75246
19637 75246 147561 82062 98006 203748 133981 80515 70140 133671 124773 51827 -70481
19626 -70481 -95635 -82609 -40883 22468 -32333 -15632 59480 84612 169224 97879 21309 -35635
19614 -35635 -41713 -117194 -136001 -143875 -101478 -84227 31981 -29475 -137071 -226566 -286995 -143396
19602a43396P4691J0246n026q0474m478p8157J8204K6551M8505M8206q317j15342
19590b08787j0722M5140K158M3575L5914K2948J03151L1885l1270p954J5028J53739
19578A94805p0217o6826j01752Q9694l324O852Q2162Q413j32057p3727k8250m0228
19566a34455Q953J40077m4196J895n0413k913K2508R0676l0259q5720L7831K3442
19554b2574r5355o8392L4431K07535J00179j55342p5115j4751p3066L9482L6313
19543h6655O8208O505n93m2575j18352L4606J06831Q2602J2130k0132p3110k3627
19531e4162n2639q838n6612q6393P3865J27487M4887j13987j10946r7670R9854
19520b35154J38308N3497m6575L0633n1067N5282J87810P5754l3143j02429o1082
$$ plain form
19602 -143396 -68705 -58459 -63485 -143959 -148437 -226594 -208390 -181839 -133334 -85128 -93445 -208787
19590 -208787 -219509 -174369 -172211 -128636 -92722 -69774 33377 65262 33992 26038 41066 194805
19578 194805 124588 57762 -43990 45704 42380 49232 131394 139807 7750 -65977 -94227 -134455
19566 -134455 -125502 14575 -29621 -27726 -78139 -81052 -58544 32132 1873 -83847 -46016 -22574
19554 -22574 -117929 -186321 -151890 55645 155824 482 -74633 -89384 -162450 -122968 -86655
19543 -86655 -18447 -11942 -12535 -55110 -173462 -138856 -32025 50577 62707 42575 -30535 -54162
19531 -54162 -106801 -115639 -172251 -258644 -184779 -57292 -12405 -126392 -237338 -335008 -235154
19520 -235154 -96846 -43349 -89924 -59291 -110358 -55076 132734 208488 175345 72916 11834
19509A1834P8692j1849j20494p0619J01863O2494j13182l558k5997L4186N9189
19498B559n8625K5500l3302n0694N9233J56599j3965j76020k4020K3064m0140
19487a29811m2175j3868J0260M1173J70414Q9061o8457n5230o0060J8623k8076
19476f8146n7344k7726K4598O4189J19923p673j07155K4570J79854R4942q7673
19465A52359M3462K6072q9486m9110P3463p8568m8622l2421o3927k7233l3534
19454a27545L7359j8977l6701M3228R8625P1209r9806N948R0822j19212l7558
19443i2608n1365K04q7192m6364N7835k9719l4919M1725J54395L6991r544K2480
19431c8081l771k4234j57611J2233Q2208l0551p1061J16912L5644J7717m3809
$$ plain form
19509 11834 90526 78677 -41817 -112436 -10573 51921 -61261 -64819 -90816 -56630 2559
19498 2559 -56066 -30566 -63868 -114562 -55329 101270 87305 -88715 -112735 -89671 -129811
19487 -129811 -171986 -185854 -175594 -134421 35993 125054 56597 1367 -58693 -40070 -68146
19476 -68146 -125490 -153216 -128618 -64429 55494 47821 -59334 -34764 145090 240032 152359
19465 152359 195821 221893 132407 83297 156760 78192 29570 -2851 -66778 -94011 -127545
19454 -127545 -90186 -109163 -145864 -102636 -4011 67198 -32608 -26660 64162 -55050 -92608
19443 -92608 -143973 -143769 -230961 -277325 -219490 -249209 -284128 -242403 -88008 -51017 -60561 -38081
19431 -38081 -41852 -66086 -223697 -211464 -129256 -159807 -230868 -113956 -78312 -60595 -104404
19420a04404l8845m4110L7692J7802O2271k0062L9262K5574P7258N1209n5015
19409D8632k9706k2643r1779J4255R8372o0384q9878n7247L9682J13570O2043
19398B4917r8707N5837n623p8088j23056O2023Q0774L1286n9202M4397k2178m5525
19386a33145L0411l1988Q6224j1119N4656k3618n9829k9420K8791R3687K9253
19375C3903M6990n8998q0083o957J26277J4759q7611j5041r3615k1410p0673l3123
19363b45582O6029L9870J2313J9895K9869J09249J09067j05135p6049R750O2277
19352C1553P1118j630j94893j07598N8917R2168m5824n7886M5850K5320P022M5837
19340c0046K5836m7410q2539j08577J777k6642K5744R2414N8297k2093p5241K3838
$$ plain form
19420 -104404 -143249 -187359 -149667 -131865 -69594 -89656 -50394 -24820 52438 103647 48632
19409 48632 18926 -3717 -95496 -81241 17131 -43253 -133131 -190378 -150696 -37126 24917
19398 24917 -73790 -17953 -23576 -101664 -224720 -162697 -81923 -50637 -109839 -65442 -87620 -133145
19386 -133145 -102734 -134722 -48498 -59617 -4961 -28579 -88408 -117828 -89037 4650 33903
19375 33903 80893 21895 -58188 -65145 61132 75891 -11720 -26761 -120376 -141786 -212459 -245582
19363 -245582 -179553 -139683 -127370 -107475 -77606 31643 140710 35575 -40474 -30724 31553
19352 31553 102671 101041 -93852 -201450 -142533 -50365 -96189 -154075 -108225 -82905 -75883 -30046
19340 -30046 -4210 -51620 -134159 -242736 -240959 -267601 -241857 -149443 -91146 -113239 -188480 -164642
19328a64642M5060O1414R742k4862M6247J9633Q9146o0283k8669R2282j1981j21406
19316d8319p1673L8380J4561r740j5918N8590J8983j0864J3209J11015r6489n4272
19304e2537p350m2991m8751n9015L1314K5746P9330O6891j8361m485k9411N5441
19292d179N2094p3221J6368l8149M7576k3615Q5416K5485r3994j03918j3414l5201
19280a58752O069J03104L6896m605r84L7798l1343p5785l4503J14373K0742k0649
19268g639K7242k3893n7123j3834P7674M4749M0125J3416j67201j32363K2621
19257a76226M1648J3613J90228P3799k4961j90105N9109K968k7451J07675n1144
19246A9153j8450N407k9978m0882L0455o0685l3453J6414N4898k3605j12468m8938
$$ plain form
19328 -164642 -119582 -58168 -48426 -73288 -27041 -7408 81738 21455 -7214 85068 73087 -48319
19316 -48319 -119992 -81612 -67051 -76791 -92709 -34119 -15136 -26000 -12791 98224 1735 -52537
19304 -52537 -59887 -102878 -151629 -210644 -179330 -153584 -74254 -7363 -25724 -30209 -59620 -4179
19292 -4179 47915 -25306 -8938 -47087 489 -23126 62290 87775 -6219 -110137 -123551 -158752
19280 -158752 -152683 -49579 -12683 -17288 -18272 19526 -11817 -87602 -122105 -7732 13010 -7639
19268 -7639 19603 -4290 -61413 -75247 2427 47176 87301 100717 -66484 -198847 -176226
19257 -176226 -134578 -120965 69263 143062 118101 -72004 -12895 -9927 -37378 70297 19153
19246 19153 703 6110 -23868 -64750 -34295 -94980 -128433 -112019 -57121 -80726 -193194 -242132
19234b42132N1490J8785P9335L4069j34923M0025O8858J4880K8672Q12p1120N8081
19222e3168O4332k1329k1889k0458k6200j7417k4381M7413J15665o2020j7945
19211c7397k376O7008R5818j6377l7314j45893o7721K958j4566N1138Q1577Q4886
19199F1741L0433M1362O363j06488o4543M5133J59325p0036p2577j439L1808n9092
19187A990k65J7696k1616R3752K1388j0707l4699j70540l7771N1579l5108J9090
19175a05211R4954N9532J8629J2485p1827j2847j5725p188o8453K0471P7670P704
19163A0194N6835J2566k5326k7163J8198j54576l0473K0834m3972J2209M4430
19152a06244q9528k030J07452P4255o1718P248n2730R3090m4766j21619j19158
$$ plain form
19234 -242132 -190642 -171857 -92522 -58453 -193376 -153351 -84493 -69613 -40941 -40129 -111249 -53168
19222 -53168 11164 -10165 -32054 -52512 -78712 -96129 -120510 -73097 42568 -19452 -37397
19211 -37397 -39773 27235 123053 106676 69362 -76531 -144252 -141294 -155860 -104722 -23145 61741
19199 61741 92174 133536 139899 33411 -31132 14001 173326 103290 30713 29274 61082 1990
19187 1990 1725 19421 -2195 91557 112945 102238 67539 -103001 -140772 -89193 -124301 -105211
19175 -105211 -10257 49275 67904 80389 8562 -4285 -20010 -27198 -95651 -75180 2490 10194
19163 10194 67029 79595 54269 27106 45304 -109272 -139745 -118911 -162883 -150674 -106244
19152 -106244 -195772 -197802 -90350 -16095 -77813 -70565 -123295 -30205 -74971 -196590 -315748
19141c15748O0935L14967M5429j48019j9586Q0842l3324k6877O4762q3893R4530
19130C4018K0899M9723Q6135l647j17237j39767n4314P3213j68123R4856K30321
19119A06077J1043j01962l5296Q3696J7257l9817j0677n8696K8516k0290r061
19108b9210j0501j9189j7590k9000l5696R240n3066n8009N3006K02667J9544o2499
19096c0303j259j5579R7021R7395n954o2872R556J71089M4261q3919o1751k7308
19084A30377l0435l9583n5927k4522K4665O3541R6693N4074j02286j38078j5132
19073c6613J2097O3665l4360l1557K1813L5068n6165J1731j8111p0498n2153J04714
19061e0369O6425Q076o9814k1895J9102L2843N9543J21197P3504l4962q1932o0495
$$ plain form
19141 -315748 -254813 60154 105583 -42436 -62022 18820 -14504 -41381 23381 -60512 34018
19130 34018 54917 104640 190775 187128 69891 -69876 -124190 -50977 -219100 -124244 106077
19119 106077 117120 15158 -20138 63558 80815 40998 30321 -28375 141 -20149 -29210
19108 -29210 -39711 -58900 -76490 -105490 -141186 -131946 -185012 -243021 -190015 12652 32196 -30303
19096 -30303 -31562 -47141 49880 147275 141321 78449 88005 259094 303355 219436 157685 130377
19084 130377 99942 60359 4432 -20090 4575 68116 164809 218883 116597 -21481 -36613
19073 -36613 -24516 39149 4789 -26768 -4955 30113 -26052 -14321 -32432 -102930 -155083 -50369
19061 -50369 16056 24132 -45682 -67577 -48475 -15632 43911 165108 238612 203650 121718 61223
19049F1223J3547N623m8927k6354j76948q5220L7713p6591j3969P7571J84323
19038d8009Q3678r176J6525m5969K3278M3859K9898k7688m4249q7575k1720M2715
19026d4433N8204K1648o2072j48076p0382J25402j3555q7252P2724O9700P2374
19015e718m819k4770K4999N900p650r3976n1544L6353k4390o2617l5975K38611
19003e596Q1183N520k6005r6346o0348l8209l8833j8864l4647l4897J57402M9197
18991f0443J688O935j03918j70P3634P575j797O5249J26020P4237o6545j35120
18979a2655j88058L3816Q4429k013l821M6189M6403J03533m7552j16819M8602
18968g946N438J8442j0459K9033N3144j04687k632r1974n5265J03716l427P639
$$ plain form
19049 61223 74770 80393 31466 5112 -171836 -257056 -219343 -295934 -309903 -232332 -48009
19038 -48009 35669 26493 43018 -2951 20327 64186 94084 66396 22147 -65428 -87148 -44433
19026 -44433 13771 35419 -26653 -174729 -245111 -119709 -133264 -220516 -147792 -78092 -5718
19015 -5718 -10537 -35307 -10308 -4408 -12058 -106034 -157578 -121225 -145615 -208232 -244207 -5596
19003 -5596 75587 81107 55102 -41244 -101592 -139801 -178634 -197498 -232145 -267042 -109640 -60443
18991 -60443 -58755 -51820 -155738 -155908 -82274 -74699 -76496 -11247 114773 189010 122465 -12655
18979 -12655 -200713 -166897 -82468 -84481 -88302 -42113 4290 107823 60271 -56548 -7946
18968 -7946 -2508 15934 5475 34508 87652 -17035 -19667 -111641 -166906 -63190 -66617 -58978
18956e8978L1115r3640k809K5263O6655K3943n6916O0444K71467P784K563q2380
18944A94511L463K9035l7544k8481k9806L8574P153j66q6057J0831j8559p9521
18932C433K570j3128L7781J03340J8393M3635k9427q9918m2501O3222p2892j7151
18920G357r7828l6414k9953K2258J26168J27536J52438l1929r7486j43770l546
18909e169Q0018O5364K7255M6053q338k2358l8256o3876J4870J19618J68929N2899
18897D37009o4586l0633r501o0935J1934N475M0338K5705j0749j30942j5200o5211
18885A32704j13126l1502k2002K4739M239P4908m0187q6364J07281n4046n4101
18874e7457J44917J39891M3976o672Q4663r6408k44760p6423n4K3247r258k378
$$ plain form
18956 -58978 -27863 -121503 -124312 -99049 -32394 -8451 -65367 -4923 266544 274328 276891 194511
18944 194511 197974 227009 189465 160984 131178 169752 176905 176739 90682 101513 82954 3433
18932 3433 6003 -7125 30656 133996 152389 196024 166597 76679 34178 97400 24508 7357
18920 7357 -90471 -126885 -156838 -134580 -8412 119124 271562 239633 142147 -1623 -5169
18909 -5169 74849 140213 167468 213521 205183 182825 144569 80693 95563 215181 384110 437009
18897 437009 372423 341790 332289 271354 283288 288763 329101 354806 344057 213115 197915 132704
18885 132704 19578 -11924 -33926 -9187 -4948 69960 29773 -56591 50690 -3356 -57457
18874 -57457 87460 227351 271327 264655 349318 252910 8150 -68273 -68327 -45080 -54338 -56716
18862e6716Q2783J6231M4291n4510m8552j2021L4656m5316R9804J52984L1272
18851B44906J7480k6603M2119J9411L1622M2605j24665j3231J10232l0208m23
18840C13245M2540Q4030r6710r3954l048m3685R8032R2053n9149j33639j53466
18829D6249p083J06026L2686O0237j6584k8880j28539r791o229n4564J7433j05111
18817i4150l6677J29457J59940K504l1231J1792k8907K5489n0283j20439m2568
18806g5073j3032M0061L0275q3405j154K2493p106o8732K6888J05834J6484r0002
18794i6469J4426L6937J3249r1839n1438M5068N7499j8596R7800J27315R7581
18783B31533m2246k92L2679R5173k0086j32237p6208M5339l04J0442J6308j2420
$$ plain form
18862 -56716 26067 42298 86589 32079 -16473 -28494 6162 -39154 60650 213634 244906
18851 244906 262386 235783 277902 297313 328935 371540 246875 233644 343876 313668 313245
18840 313245 355785 439815 343105 249151 246103 202418 300450 392503 333354 199715 46249
18829 46249 39166 145192 177878 238115 221531 192651 64112 54321 48092 -6472 10961 -94150
18817 -94150 -130827 -1370 158570 161074 129843 141635 112728 138217 87934 -32505 -75073
18806 -75073 -88105 -48044 -17769 -101174 -102328 -79835 -86941 -155673 -128785 -22951 -6467 -96469
18794 -96469 -82043 -45106 -31857 -123696 -175134 -130066 -72567 -91163 6637 133952 231533
18783 231533 189287 188995 221674 316847 296761 164524 88316 133655 133351 143793 160101 147681
18771A47681J05068J01757L75965O91536K72271k87862n19295m26088j46852n9157
18761B55024j02310j7351R1078j19949n4123K9314L5174O1687l1705l2342j5840
18750I8657m461O310M3761n5795N8768o1036j19762l9338M5696J5860M2336o0144
18738b9148q7643J3060J3925k3920L4360P7078K1101M3422k7372J18506j9755
18727A33614m6066K1762m0159l1889P11M498L5093o5957k7439L9866j1166R0648
18715A03516K7931q7212o9130K4431R2884J064j10707J28777N2562j6050l816
18704A44250n5962m2064l7630j13382J73268J73125J5171k6914l2683K163P659
18693B07001j7019j43739r5608P6479O2450k3024n1208m6124j0097N4710R1497
$$ plain form
18771 147681 252749 354506 730471 1422007 1694278 1406416 887121 461033 314181 255024
18761 255024 152714 135363 226441 106492 52369 81683 116857 178544 146839 114497 98657
18750 98657 94196 100506 144267 88472 147240 86204 -33558 -72896 -27200 -11340 30996 -29148
18738 -29148 -116791 -103731 -89806 -113726 -79366 -2288 18813 62235 34863 153369 133614
18727 133614 87548 109310 69151 37262 37973 42471 77564 11607 -15832 24034 12868 103516
18715 103516 131447 44235 -24895 -464 92420 93484 -17223 111554 164116 148066 144250
18704 144250 88288 46224 8594 -104788 68480 241605 256776 229862 197179 199342 207001
18693 207001 189982 46243 -49365 27114 89564 66540 15332 -30792 -40889 13821 105318
18682A05318O8780p8296m151R0408L0062j20214r9621K3496R2893K5249j07645
18671B6279L996j3358j13006M0367O4990n2224k1047k0384m2905l445J5635m4928
18659a60030O6536J59190j5496p2122o9398l1438o5564R3967N7613J22974J23725
18648B09957n7283O5675O3820L6116m4100P1503N2927m7084l1781K2822M5513
18637C88085L652P411m14L5850j11645j36916K0081N4795M9025l3994R7279k3373
18625C49836r9975n6495q7680j1406j16590p9030n4820L3341O4932P9960O9515
18614I1588o3027l4469N2236J07843J309j29243n6116j6160K7948j03505k1968
18603a43564J28226k6745K0503J07331N5198q325L057p1540J5278l5719o1781
$$ plain form
18682 105318 174098 95802 91651 182059 212121 91907 -7714 15782 108675 133924 26279
18671 26279 30275 16917 -96089 -55722 9268 -42956 -64003 -84387 -127292 -130737 -115102 -160030
18659 -160030 -93494 65696 50200 -21922 -91320 -122758 -188322 -94355 -36742 86232 209957
18648 209957 152674 218349 282169 318285 274185 345688 398615 351531 319750 342572 388085
18637 388085 391737 399148 398734 434584 322939 186023 206104 260899 309924 275930 373209 349836
18625 349836 249861 193366 105686 94280 -22310 -101340 -156160 -122819 -57887 22073 91588
18614 91588 28561 -5908 46328 154171 155480 26237 -29879 -46039 -18091 -121596 -143564
18603 -143564 -15338 -42083 -21580 85751 140949 132624 135681 64141 79419 43700 -18081
18592a8081N031L7442p3680j21926M4620J17313L4302J63302Q0919o3862o7138
18581A38242Q699n4491n6040o4241o5285o6669m1635R9170O3659K1552K2751J19868
18569A25580M2813r0148l5513M5010p183r1219q3855M183Q2408J3598r3229r5087
18557a82642N3240O865n5197j3494M1962R779k3837J37660N26o8987Q1177j9091
18545c2039n8309j3758j9685L9761K833k5860P754o2941J877M4427J09123n4816
18533f1633K7976J23201O1643L978j67798q8066N6162N9179J57128J01986L0550
18522C04306k3547N812l6730j50280r7670J0011R6159L8135l5230M115J04020
18511B19101o4137k1255J54113J01604j03601k7771M0611P656N6808r7522m3487
$$ plain form
18592 -18081 -13050 24392 -49288 -171214 -126594 -9281 25021 188323 269242 205380 138242
18581 138242 146941 92450 36410 -27831 -93116 -159785 -201420 -102250 -38591 -17039 5712 125580
18569 125580 168393 78245 42732 87742 80559 -10660 -94515 -90332 -7924 5674 -87555 -182642
18557 -182642 -129402 -122537 -177734 -191228 -149266 -139487 -163324 -25664 -25138 -94125 -12948 -32039
18545 -32039 -90348 -104106 -123791 -84030 -81197 -107057 -99303 -162244 -160367 -115940 -6817 -61633
18533 -61633 -33657 89544 151187 155165 -12633 -100699 -44537 14642 171770 273756 304306
18522 304306 280759 286571 249841 99561 1891 11902 108061 146196 110966 115081 219101
18511 219101 154964 133709 287822 389426 285825 258054 298665 306321 363129 265607 222120
18500B22120J10180K07249J17988j01437q4587p2151l1291j9618j0113o6128j06218
18489A65994p7955L7422K7681q6112L1609M1070k1069j416M9162L8708p1002j4271
18477A19821l5297o5406P1362L4183q5360k1596J16261n008l7020O490R833R1
18465A08354K6258J50885R7497J75982R6534j7492m7909J2386m5690j28791k2458
18454D05556M0000J244N158O7742J75412L0688O4213J4712m8172r5991p1420q8079
18442E01063j01212q6754M9095r6349M5696J09211j19162j20525n3295k0369k4290
18431H3109n9451O333Q6914L8819J8224L525m8486j45819l7063R6231J35228P5648
18419B53212N268j74405k15627P8423M3676Q3412J56786J09566P0688Q9875p5328
$$ plain form
18500 222120 332300 539549 657537 556100 471513 399362 368071 348453 338340 272212 165994
18489 165994 88039 125461 153142 67030 98639 139709 118640 117224 166386 205094 134092 119821
18477 119821 84524 19118 90480 124663 39303 17707 133968 128960 91940 98430 108263 108354
18465 108354 134612 285497 382994 558976 655510 638018 590109 602495 556805 428014 405556
18454 405556 445556 446800 451958 519700 695112 725800 790013 804725 756553 660562 589142 501063
18442 501063 399851 313097 362192 265843 311539 420750 301588 181063 127768 107399 83109
18431 83109 23658 29991 116905 155724 173948 177473 128987 -16832 -53895 42336 177564 253212
18419 253212 258480 84075 -131552 -53129 -9453 73959 230745 340311 410999 500874 425546
18408D25546l4045j1303j38980r7209M895k9114O0428O6427R2297M724P546p142
18396C44070k0740n0893p7065o3633K9165J04822J3767j23927j13861K7850n2261
18385A7294j08044J14205J3959k4004j963o0010n5345J10707j1214J3477M1918
18374E0980L9061j7897j4228K7644J4369O2467k3169k2760L2368N0260J13116
18363C12211R4360q4656l704n9395q3278M7147o2066o4952M3684o0441n2145L7720
18351F4485k7152K0172m3310J2004J1928j3955M171R4387l325O3776M7069J8538
18339B48788n5291j06268j00660K3804J33607N2969j5914J082l572j13178n4640
18328A0727M0270J20325R477N1840P7920l8827j04150n1777j1160k8704r862O9484
$$ plain form
18408 425546 391501 380198 241218 144009 148904 119790 180218 246645 338942 343666 351212 344070
18396 344070 323330 272437 195372 131739 160904 265726 279493 155566 41705 69555 17294
18385 17294 -90750 23455 37414 13410 11447 -48563 -103908 6799 -4415 9062 50980
18374 50980 90041 72144 57916 85560 99929 162396 139227 116467 148835 199095 312211
18363 312211 406571 321915 318211 258816 175538 222685 160619 95667 139351 78910 26765 64485
18351 64485 37333 57505 14195 26199 38127 24172 28343 122730 119405 183181 230250 248788
18339 248788 193497 87229 -13431 10373 143980 196949 181035 182117 178545 65367 10727
18328 10727 50997 171322 180799 232639 310559 271732 167582 115805 104645 75941 66079 135563
18316A35563m517J14109M1563K9339N6263n8526o5280j86026r0957N5622J24550
18305A51703n4836q9828J77930P9385L393M8845l0424n2233q6425J7035m2435
18294A22110J8420O5763R1313P4552Q0593l1605k1152r369K6465j1206j82895
18283B22989m7579Q2234l1220L6766j932l4659O4972m4794o7934K4109O5741P007
18271B75700k2283q971k0003J7269k7117P7908L9040k9164m6041O3393Q1235o7006
18259C33960m8247o691J24563J23977J0252j69626p9107J2515O035N2395J60914
18248E20940J00341r59k9324J3883m1748j31899p263M6819M7925J17182J19814
18237G55711R459j07545j42386j69261j7194j8747Q0844J15295j74757o0849k23
$$ plain form
18316 135563 131046 245155 286718 316057 372320 313794 248514 62488 -28469 27153 151703
18305 151703 96867 7039 184969 264354 267747 316592 286168 233935 147510 164545 122110
18294 122110 140530 206293 297606 372158 452751 421146 399994 390625 417090 405884 222989
18283 222989 175410 257644 226424 263190 261258 226599 291571 246777 178843 202952 268693 275700
18271 275700 253417 244446 224443 241712 214595 292503 331543 302379 256338 319731 400966 333960
18259 333960 285713 279022 403585 527562 537814 368188 289081 301596 307631 360026 520940
18248 520940 621281 620322 590998 604881 563133 431234 423971 470790 518715 635897 755711
18237 755711 765170 657625 515239 345978 328784 310037 390881 506176 331419 270570 270347
18226B70347J7413J814q5448n5330o9677K357N6754j8063j0851L297r7532R1100
18214A06181Q1473L53j8899M3478K5383p548l6697L0528K12368J04688J0389p4899
18202D76798q9539j13688K0195l2188M0004k7003n3822p5734k4969J10938J23196
18191C54188J57274R607p6700r9655q1525r5694m5500M5235L1280p099n3261Q5433
18179B23583J15405r8592j19199k3357j22878n1951J57374N2786K4894k5164Q1933
18168B14834L3355k961P4248J17152P199M479n9042P3739R1008n8032j6085Q4976
18156E64870J564o9975o0650j37617L198Q4771Q0902J38166J4107K1053r4692
18145E45697l5682J65880J42700k5145n0053K2240K8221P6086L2027J79392K18796
$$ plain form
18226 270347 287760 289574 204126 148796 79119 81476 138230 120167 109316 112613 15081 106181
18214 106181 187654 188007 169108 212586 237969 230421 193724 224252 436620 541308 551697 476798
18202 476798 387259 273571 293766 261578 301582 274579 220757 145023 120054 230992 354188
18191 354188 511462 521069 444369 344714 263189 167495 121995 167230 198510 191411 138150 223583
18179 223583 338988 240396 121197 97840 -25038 -76989 80385 133171 158065 132901 214834
18168 214834 248189 245228 319476 436628 443827 448306 389264 463003 554011 495979 479894 564870
18156 564870 566434 496459 435809 298192 301390 386161 467063 605229 619336 640389 545697
18145 545697 510015 675895 818595 793450 743397 765637 793858 869944 901971 1081363 1300159
18134A300159N4198J21222J11306L0124q9368N0790L05230L74865M75652N19070
18124C253248L66189L16000M88770P70577R69931J281928J815578K643475L977887
18115A5883583O040797Q779718J3031272K1399853M2392418Q1382938P1464008
18108B60374587k1791364o5131811o9415190m1271551k0746224j1239025o797260
18101B3982162m480979l153090k471942j935303j438661j360853j069517r78248
18093G093569r19796o91437n14133m99177l30359k09815k55982k80538k43239
18084C149093l22818l63976k67765j25371k13950k58698n228m2815j88452j54084
18074A205936m838o4208k04041k7106O7022R79q2866j3325j00853N0911p8203
$$ plain form
18134 1300159 1354357 1475579 1586885 1617009 1527641 1578431 1883661 2258526 2734178 3253248
18124 3253248 3619437 3935437 4424207 5194784 6164715 7446643 9262221 11905696 15883583
18115 15883583 21924380 30704098 43735370 65135223 107527641 188910579 260374587
18108 260374587 238583223 173451412 104036222 62764671 42018447 30779422 23982162
18101 23982162 19501183 16348093 13876151 11940848 10502187 9141334 8071817 7093569
18093 7093569 6173773 5482336 4968203 4469026 4138667 3928852 3672870 3392332 3149093
18084 3149093 2826275 2462299 2194534 2069163 1855213 1596515 1591287 1548472 1360020 1205936
18074 1205936 1201098 1136890 932849 905743 972765 973744 890878 877553 776700 827611 749408
18063G49408j58848L5529J32159M7857m3675P498m2538o2238R46J0391p0252o5961
18051E40276r401K4859J5791K8748P330O5355l3674r5634j9517j04173p3886J26378
18039D72452J04077Q7546N7755J13068j4817r5571j42831j70465j08321o6823
18029B36070m4875M5419r941p4324j9781q04M390J56413J00232o8651j21047o7586
18017A35515j7951J19443J88713Q2163n816j1647n2794n2823k5053n623J23454
18006D77581J12545p6536K6704R686n787N712M4051L2503K1983J26683N5385N2165
17994H82675L1952k3868j3810M3644o8994q495J19189R8294n3031j48263j60472
17983F98821k17261l1078K07649N5637Q044r2467j9580P024q8214m0021j10476
$$ plain form
18063 749408 590560 626089 758248 806105 762430 769928 727390 665152 666098 676489 606237 540276
18051 540276 530875 555734 571525 600273 607603 672958 639284 543650 524133 419960 346074 472452
18039 472452 576529 664075 721830 834898 820081 724510 581679 411214 302893 236070
18029 236070 191195 236614 226673 152349 132568 131764 136154 292567 392799 324148 203101 135515
18017 135515 117564 237007 425720 507883 502067 490420 437626 384803 359750 354127 477581
18006 477581 590126 513590 540294 549980 544193 549905 593956 626459 648442 775125 830510 882675
17994 882675 914627 890759 876949 920593 851599 843104 962293 1060587 1007556 859293 698821
17983 698821 481560 450482 658131 713768 721812 629345 609765 616789 528575 488554 378078
17972C78078m8386K4873k7829o6820l0471J338K8005M1410K16842J84572M6486
17961G48098n2946r7167R1145J48000J59951R6556J72008q8701q067J85339J37604
17950A491820l2223K14672K48200J92167N4192k0419J10009n9992j51754r5115
17940A951557M6326p5665K4901J18239K4535j33494j79767j93554j08856o9245
17930A404977j01374n4907J02170J19848R7846K9715L0732n1950m0669n8129m97
17919A477762O2178J30781R2635r355j41610j26272m6245j41707j87441o0272
17909A050454M7939r4754l8139J14483J8776Q5772N6261o8287J46303L02652J90631
17898A812091K47397J15472k2246q7277r6515L2164J62540J25436O6837O7482
$$ plain form
17972 378078 329692 354565 326736 259916 229445 230783 258788 300198 517040 701612 748098
17961 748098 695152 597985 689130 837130 997081 1093637 1265645 1176944 1168877 1354216 1491820
17950 1491820 1459597 1674269 1922469 2114636 2168828 2148409 2258418 2198426 2046672 1951557
17940 1951557 1997883 1922218 1947119 2065358 2089893 1956399 1776632 1583078 1474222 1404977
17930 1404977 1303603 1248696 1350866 1470714 1568560 1598275 1629007 1577057 1536388 1478259 1477762
17919 1477762 1539940 1670721 1763356 1754001 1612391 1486119 1439874 1298167 1110726 1050454
17909 1050454 1098393 1003639 965500 1079983 1098759 1184531 1240792 1172505 1318808 1621460 1812091
17898 1812091 2059488 2174960 2152714 2065437 1968922 2001086 2163626 2289062 2355899 2423381
17888B423381J4936l6384j06809k99408k69804k28917k75962j47069j8368n27
17878A055069R1679J21268K05251K06246L4115q4517j03087k5718J19388J69663
17868A789357R7122N7942J9579m1470r5342r0723j60448j13045k95701j79200
17858I88071j26365p7975q9776j3775n187K76093J73634J54224M4245j00547j10144
17847A112498l9931q2010j06095m0557j7158K1900O9386P1106j3870j14873n3676
17836H06720o4247j15836r5271l1568R5530j9792j13564n0066J22488J32124O9691
17825G36209R0538j1922r423p8234M6040K6726J12219K32908J98864J80701P3993
17814A598619o118j06097r2559n0227j89244O188L6314R1615L8458j19316k63264
$$ plain form
17888 2423381 2438317 2401933 2295124 1995716 1725912 1496995 1221033 1073964 1055596 1055069
17878 1055069 1146748 1268016 1473267 1679513 1713628 1629111 1526024 1500306 1619694 1789357
17868 1789357 1886479 1944421 1964000 1922530 1827188 1736465 1576017 1462972 1167271 988071
17858 988071 861706 783731 693955 680180 674993 951086 1124720 1278944 1323189 1222642 1112498
17847 1112498 1072567 990557 884462 843905 826747 848647 918033 989139 975269 860396 806720
17836 806720 742473 626637 531366 499798 595328 575536 461972 411906 534394 666518 736209
17825 736209 826747 814825 805402 727168 773208 799934 912153 1145061 1343925 1524626 1598619
17814 1598619 1592501 1486404 1393845 1343618 1154374 1160562 1196876 1288491 1326949 1207633 944369
17803I44369o6913q5509k3898M233K198J224M6434R8o7019N1185O8870K6417l5918
17790H65771N0379R3769Q820j41394p8828p4988J56231K32805N8671n1747m5781
17779A073708l7078J4223m9001K7340R620l0768o7566J41495K75711K10729L99910
17768A968323K39416r363r9620j84711j91109j22117j57208p9188J8155j7425
17758A365153n903J29929J07344J69967P7886N5656j25400k02859j72029q4060
17748A315684j91393l7180j6955l0373m6282j5038R420M174J33197K17692K20645
17737A563591J26317o055r2133J17795M8744j62133q8052j18099j26364P9449
17727A343060Q7809m0365J755o738j05298r0489N1418N168J00920J62803K5873
$$ plain form
17803 944369 877456 791947 768049 772282 774480 775704 822138 822236 755217 806402 875272 901689 865771
17790 865771 916150 1009919 1018739 877345 798517 723529 879760 1112565 1171236 1119489 1073708
17779 1073708 1036630 1050853 1001852 1029192 1038812 1008044 940478 1081973 1357684 1568413 1968323
17768 1968323 2207739 2198376 2098756 1914045 1722936 1600819 1443611 1364423 1382578 1365153
17758 1365153 1359250 1489179 1596523 1766490 1844376 1900032 1774632 1571773 1399744 1315684
17748 1315684 1124291 1087111 1070156 1039783 993501 978463 987883 992057 1125254 1342946 1563591
17737 1563591 1689908 1683853 1591720 1709515 1758259 1596126 1508074 1389975 1263611 1343060
17727 1343060 1430869 1390504 1392259 1385521 1280223 1189734 1241152 1246320 1347240 1510043 1535916
17716A535916o6358j85131j10705J23191O7924j13673n1297k8207j6192l1694
17706A123774N8713j669j21421L5112J7334k5909R6940L2712j00393m2570N0405
17695A123028l3390J77783P3575o479R6855P6868K24321N6134k45696k55248j03335
17684A184416k6755P8747K9577n03K0374k9205N9939N1909J51238J45551N5778
17673A721066k02090k02763j66818j11023J80L3679J2963J5479N4110O1448O3595
17662A279826K24337K05434L5219J29254J55318M3793P9248J77152J31491K0207
17652B481279j4250K01Q4531J67944O6152J15653P4269J18128L7956l8784j00673
17641B992406k00151j47623j82114k93959k65792j31896j56306J4522J03907J15764
$$ plain form
17716 1535916 1469558 1284427 1173722 1296913 1364837 1251164 1199867 1171660 1155468 1123774
17706 1123774 1182487 1180818 1059397 1094509 1111843 1085934 1182874 1215586 1115193 1072623 1123028
17695 1123028 1089638 1267421 1340996 1334517 1431372 1508240 1732561 1788695 1542999 1287751 1184416
17684 1184416 1157661 1236408 1265985 1265482 1285856 1256651 1316590 1368499 1519737 1665288 1721066
17673 1721066 1518976 1316213 1149395 1038372 1038552 1072231 1085194 1100673 1154783 1216231 1279826
17662 1279826 1504163 1709597 1744816 1874070 2029388 2073181 2152429 2329581 2461072 2481279
17652 2481279 2467029 2467230 2551761 2719705 2785857 2901510 2975779 3093907 3131863 3093079 2992406
17641 2992406 2792255 2644632 2462518 2168559 1902767 1770871 1614565 1629087 1732994 1848758
17631A848758J55387O3771M5383k946r6587k88273k06233r5862p9956q3591p0318
17620A189533k0588n6732j05677j0184J04257J15077J14516P9933K27928K57136
17610A895199L51661M37444O27025N04848r851k95565m00927k86922k52886j97971
17600B372055l4347L7836M8808J93543K34296J95198p2842k34663m43144m50585
17590A846155m18350k28616j03244P392Q055j00007j5631l9540k2096R4580J81998
17579A210696R2441l7993o6196l1428Q8759j567r7493l6786Q1805L0832m2712
17568A190358n9452O2245N6379J00311P9723n9027k5145K6304j24461j26287q1647
17557A039301J1395l241O8186P531P4384N6161J57524m2580j81259j00597j02407
$$ plain form
17631 1848758 2004145 2067916 2113299 2110353 2013766 1725493 1519260 1423398 1343442 1259851 1189533
17620 1189533 1168945 1112213 1006536 996352 1100609 1215686 1330202 1410135 1638063 1895199
17610 1895199 2246860 2684304 3311329 3816177 3806326 3510761 3109834 2822912 2570026 2372055
17600 2372055 2337708 2375544 2424352 2617895 2852191 3047389 2974547 2739884 2296740 1846155
17590 1846155 1427805 1199189 1095945 1103337 1111392 1011385 995754 956214 934118 1028698 1210696
17579 1210696 1303137 1265144 1198948 1167520 1256279 1254712 1157219 1120433 1202238 1233070 1190358
17568 1190358 1130906 1193151 1249530 1349841 1429564 1370537 1345392 1371696 1247235 1120948 1039301
17557 1039301 1050696 1047455 1115641 1123172 1197556 1253717 1411241 1368661 1187402 1086805 984398
17546I84398j564r6445L0469Q3728k6361j6738n6865j6260j4890l9599J10567
17535I40440J81806O3098O4057k7927k6934J81416j5915l1346L7504R7871J17817
17524A581887J12637J45658N3886o0405P2773K26417R2230J71535J10751L0849
17514B538218j29517l1834M4244O7908R9106O8434O3474L871m0589J5546K9673
17503B728534p9270k31051k97892k61263j2438n6856J34693J31305P9163K2260
17493B157185N730L5067J33374q9705o584Q2491P672q1540N0000j3492J20374
17482B400572P3452J31046P5435J49761K23821K47846J82174L7600r0167O6446
17472C497986J74436K90433M38360M34888N28302M93017K51128J16190J49996
$$ plain form
17546 984398 982834 886389 916858 1000586 974225 957487 900622 884362 869472 829873 940440
17535 940440 1122246 1185344 1249401 1221474 1194540 1375956 1360041 1328695 1366199 1464070 1581887
17524 1581887 1694524 1840182 1894068 1833663 1906436 2132853 2225083 2396618 2507369 2538218
17514 2538218 2408701 2376867 2421111 2489019 2588125 2656559 2720033 2723904 2683315 2698861 2728534
17503 2728534 2649264 2418213 2120321 1859058 1846620 1789764 1924457 2055762 2134925 2157185
17493 2157185 2162915 2197982 2331356 2241651 2235067 2317558 2325230 2243690 2293690 2280198 2400572
17482 2400572 2474024 2605070 2680505 2830266 3054087 3301933 3484107 3521707 3431540 3497986
17472 3497986 3672422 3962855 4401215 4836103 5364405 5857422 6108550 6224740 6374736
17463F374736L30492N98679P91750R68413J314205J361919J307793J506587K055328
17454A6609902K913421M494028Q320886J3754690J2203751K18664p087966p703619
17446D3723757l124603K141923P145173J3702495K4681446L6598289K8612940
17439A53481420P661668m51086K24558n256310j0883268j1059494j0038209n658425
17431A18020854K798039Q358814J0581637J4005704N670484q241857j4804284
17424A36389391j9847073k3008100k1555378j6721196j0617646o040361l525267
17417C5074370k445255j803476r08957n7979J048733K469533M689275P643081
17409D5709325P332521K648482P2564J413687O000504J2362634K2096824L8371930
$$ plain form
17463 6374736 6705228 7303907 8095657 9064070 10378275 11740194 13047987 14554574 16609902
17454 16609902 19523323 24017351 32338237 46092927 58296678 58515342 51427376 43723757
17446 43723757 40599154 42741077 49886250 63588745 88270191 124868480 153481420
17439 153481420 161143088 160692002 160916560 155660250 144776982 133717488 123679279 118020854
17431 118020854 120818893 129177707 139759344 153765048 159435532 151193675 136389391
17424 136389391 116542318 93534218 71978840 55257644 44639998 38599637 35074370
17417 35074370 32629115 30825639 29916682 29858703 30907436 33376969 38066244 45709325
17409 45709325 53041846 55690328 55762892 57176579 63177083 75539717 97636541 136008471
17401A36008471N4360678M6389828K0735592j9240844m0959979l7384892j9530436
17394A40378418K317180K5987143M7387927M0439799K0037511J1296675K3711
17387B87868364l468032p363999k4804951l5777363l1178824j2815354J1156647
17380A83616488L2156831L4824926K0878275Q468560q666529l4441638m9926698
17373A86910215m7745091l4526400k1532858j3116915q214084n130623l045720
17366E3598524j362392L25521K421577M974042Q798937J4220626K2456762L5153917
17358A40587514N6479693Q2854282O6986214q756954o1627358p2501478n1398829
17351A52623084k8386112j2849725J16136J5336224L0343390K1101265j3096960
$$ plain form
17401 136008471 190369149 236758977 257494569 238253725 197293746 159908854 140378418
17394 140378418 142695598 168682741 216070668 256510467 276547978 287844653 287868364
17387 287868364 284400332 277036333 252231382 216454019 185275195 172459841 183616488
17380 183616488 215773319 250598245 271476520 279945080 271278551 236836913 186910215
17373 186910215 139165124 104638724 83105866 69988951 61774867 56644244 53598524
17366 53598524 52236132 52561653 54983230 59957272 68756209 82976835 105433597 140587514
17358 140587514 197067207 279921489 346907703 338150749 276523391 204021913 152623084
17351 152623084 124236972 111387247 111503383 126839607 157182997 178284262 165187302
17344A65187302l2904384l4095305k3959201j5344912j0072677o831439m803592
17337C7175792l143742j731932n37758N95994J278649J778261J822299J230011
17329C8467574J172283J936430L893209P119814J1928574K0180646L3798644M3006504
17321A61503678L0277366K0559098J7389954q188321l1452854l4359523k1228120
17314A34501278n498896P889106K3849638N1311985R4583645J12275906L1888973
17307D50801635o6461441j06028869r1046131n6720692l2576223j8908637j1919386
17300F7140256r215504p633672n937460m187012k631813j343244k76266N1966
17292C5967251j92967R2543J779144M015723L709662J974977Q97472j572913l756070
$$ plain form
17344 165187302 132282918 98187613 74228412 58883500 48810823 41979384 37175792
17337 37175792 34032050 32300118 31762360 32358354 33637003 35415264 37237563 38467574
17329 38467574 39639857 41576287 45469496 52589310 64517884 84698530 118497174 161503678
17321 161503678 191781044 212340142 229730096 221541775 190088921 155729398 134501278
17314 134501278 129002382 136891488 160741126 212053111 306636756 418912662 450801635
17307 450801635 384340194 278311325 187265194 130544502 97968279 79059642 67140256
17300 67140256 57924752 50291080 44353620 40166608 37534795 36191551 35915285 35967251
17292 35967251 35774284 35866827 37645971 41661694 45371356 47346333 48243805 46670892 42914822
17283D2914822l767236k014564L4626K096765M094295N290541N995409O958254
17275F1602912R881052J8104057L0195101L0009069J7198838J1925740j904094
17268A77012675r847309o10106K6657691N5238600L2287522k5380234n4635156
17261B00723683n1936062l0814973j2067992L760072J8300655J9080932K446822
17254A49493137r175391l238040J5650925K0068352q249017l1009399l6277550
17247I7263017k7076520j6591860r982443o239827l839892k285846j068287J36459
17239C0314801J137538J541002J501426L22045m38524m03661p22272r34104m26787
17230C1891464N81764K167427M212274O798603J2274645K3567278L6341651K1383097
$$ plain form
17283 42914822 39147586 37133022 37167648 39264413 43358708 48649249 54644658 61602912
17275 61602912 71483964 89588021 119783122 149792191 166991029 178916769 177012675
17268 177012675 167165366 166555260 193212951 248451551 280739073 255358839 200723683
17261 200723683 148787621 117972648 105904656 109664728 127965383 147046315 149493137
17254 149493137 140317746 137079706 152730631 172798983 164549966 133540567 97263017
17247 97263017 70186497 53594637 43612194 37372367 33532475 31246629 30178342 30314801
17239 30314801 31452339 32993341 34494767 34816812 34378288 33974627 33252355 32318251 31891464
17230 31891464 32473228 34640655 38852929 45651532 57926177 81493455 117835106 139218203
17222A39218203j2485883k8100784k6016489j4049914m683024J597107Q293289
17215F3772505J8390679L0315502K5289518j188644j7980643j8167925n116021
17208I5314971J1968583K5807032J9628387N255408K14403j2616234k6202439
17201A19370111k9984711k4897052j6262841r958880o332015m344732l135292
17194B4454588k425457k096830j985218j733483j447214q55362m19685m11705
17186A3079634l11197j42803k03133k55845k38276K42728Q27733J190800J571380
17177A5761021K277426L326665M985440Q987192J6522267K3483413J1382299r956363
17169G6769360j9526393j7524524j0251318n283401k348793m78157J152949L163223
$$ plain form
17222 139218203 126732320 98631536 72615047 58565133 53882109 55479216 63772505
17215 63772505 82163184 112478686 137768204 136579560 118598917 100430992 95314971
17208 95314971 107283554 133090586 152718973 157974381 158188784 145572550 119370111
17201 119370111 89385400 64488348 48225507 38266627 31934612 27589880 24454588
17194 24454588 22029131 19932301 17947083 16213600 14766386 13911024 13491339 13079634
17186 13079634 12768437 12625634 12422501 12166656 11928380 12171108 12998841 14189641 15761021
17177 15761021 18038447 21365112 26350552 35337744 51860011 75343424 86725723 76769360
17169 76769360 57242967 39718443 29467125 24183724 21834931 21356774 22509723 25672946
17161B5672946O290061J2235819J8703303J1391827o217301j4610214j3600170
17154C9866271q263512m779249k542760k259733l477164l635592l017236k046493
17146I844532j333391r37387n38344k71227j39911q1280k35255j46726n1873m9640
17136F059498j76934l42953m88900m06904l02269j88889j89666l00340l61863
17127C300780l20049j98193j45265n4229N879l7203j18169j17747j72261r9754
17117B043789j43118j55569J03564J76905L17317L71984L74915O2719k84564m33496
17107B434446l34147j40597P0095J61245M4078J69272K73278M05182P20148J274632
17097E077632J647597P60683K2209n68569r90218j039485j110616q78622n89929
$$ plain form
17161 25672946 31963007 44198826 62902129 74293956 68076655 53466441 39866271
17154 39866271 31602759 26823510 24280750 22021017 18543853 14908261 11891025 9844532
17146 9844532 8511141 7573754 7035410 6764183 6624272 6542992 6307737 6161011 6109138 6059498
17136 6059498 5882564 5539611 5050711 4643807 4341538 4152649 3962983 3662643 3300780
17127 3300780 2980731 2782538 2637273 2583044 2588923 2551720 2433551 2315804 2143543 2043789
17117 2043789 1900671 1745102 1848666 2025571 2342888 2714872 3089787 3152506 2867942 2434446
17107 2434446 2100299 1959702 2029797 2191042 2235120 2404392 2677670 3082852 3803000 5077632
17097 5077632 6725229 7485912 7508121 6939552 5949334 4909849 3799233 2920611 2330682
17088B330682m09577j69281p1087p1641j37820l3345l8920Q2345o5946k05306
17078A210104r6388j4806o6413o5953L0297j05162l9046K3040N8900l1625j7463
17067H85485r9599k3845n0170o402K7093p2574k0516J31143l7158r9780J06003
17056G39680P339P405q7607l1585k5581j9890J9960M362P6328N9549n2578j47315
17044E50067j10733j5786J58382P1445m5048K7915k6430j8592l63J27326M6313
17033G64496o0182n1399p6420j40418q1885J6479p5548O2476J8814n8780o3800
17022B53833j1860o5329K3521Q6500O6905J24896K7779o3746k400n8519k9089
17011C52491m388p2925q7474o940P3610J6839m711m1738j6952J25915K4162m7158
$$ plain form
17088 2330682 1921105 1751824 1680737 1609096 1471276 1437931 1399011 1481356 1415410 1210104
17078 1210104 1113716 1098910 1032497 966544 996841 891679 852633 875673 934573 902948 885485
17067 885485 785886 762041 711871 705469 732562 659988 639472 770615 733457 633677 739680
17056 739680 747019 754424 666817 635232 609651 589761 609721 614083 690411 749960 697382 550067
17044 550067 439334 423548 581930 653375 608327 636242 609812 591220 590857 718183 764496
17033 764496 704314 652915 576495 436077 354192 370671 295123 357599 376413 317633 253833
17022 253833 241973 176644 200165 286665 353570 478466 506245 442499 440099 381580 352491
17011 352491 348103 275178 187704 180764 254374 271213 266502 224764 207812 333727 357889 310731
16999C10731j4006q9664q5004N3105L5651J00056j4811P4455k1888n2951J4883
16988C10557q718k1261j3570L1822J22595j4335j7512r0572j6848o7499j20837
16977I3822p4762O2544J19178J0827K5092M4741M6709r635q7927n6917q3885K8199
16965A17986J03754m8271M0000J28311N9147r1073o8243N6380O7776M6664l3659
16954C78772M6814n3329j4482n6433r342M756o7896r3832Q6579L398m3438M8462
16942B30029O8406N7280Q3633K12697K23065J52917K40392J44222K09161K29493
16932A851295J99170Q4253n4234n0705K5698p8322j95640j55252lL7356K655k01010
16920A465261l04779k40657j22584p9583j99514l4090q080Q2293m7011p4472j5259
$$ plain form
16999 310731 296725 207061 122057 175162 210813 310869 296058 370513 348625 295674 310557
16988 310557 301839 280578 267008 298830 421425 407090 389578 299006 282158 214659 93822
16977 93822 19060 81604 200782 211609 236701 281442 328151 318516 230589 173672 89787 117986
16965 117986 221740 173469 213469 341780 400927 309854 241611 297991 365767 412431 378772
16954 378772 425586 372257 357775 301342 292000 296756 228860 135028 221607 225005 181567 230029
16942 230029 298435 355715 439348 652045 875110 1028027 1268419 1412641 1621802 1851295
16932 1851295 2050465 2134718 2080484 2029779 2055477 1977155 1781515 1626263 1626260 1663616 1666271 1465261
16920 1465261 1160482 919825 797241 717658 518144 484054 475974 558267 511256 436784 421525
16909D21525k3809o9629O8102J7272k7303P4787m2220j0420n3557j11537K7531
16898B70742R8062O539M1276K7099N6201j08025l6917P0143J12998J89374K18418
16887I45910K73109K40174J43848J78763K10090L708k29659j77705j31229j59204
16877A297805J24709K29478K19152J34511l8301l64498l61936k75665j96078j37272
16867F31905n3358k5732J04162j19053l5635m6042P901n6782q9355k7795r905
16856B80311Q1448M5072J34579O3798j02852K1486J09579J263n5320p667p990
16845E63707J9597k229J21401M2005J238k02587n4794j8825J32174R2015L476
16834F97178K6590j087L7178L2814J87994L89822K25295J32350j752r1877j57029
$$ plain form
16909 421525 397716 328087 396189 413461 386158 460945 418725 408305 354748 243211 270742
16898 270742 368804 375343 416619 443718 499919 391894 354977 425120 538118 727492 945910
16887 945910 1219019 1459193 1603041 1781804 1991894 1995602 1765943 1588238 1457009 1297805
16877 1297805 1422514 1651992 1871144 2005655 1967354 1602856 1240920 965255 769177 631905
16867 631905 578547 552815 656977 537924 502289 456247 464148 407366 318011 290216 280311
16856 280311 361759 406831 541410 605208 502356 523842 633421 634684 579364 571697 563707
16845 563707 583304 581075 702476 744481 745719 543132 488338 469513 601687 693702 697178
16834 697178 723768 722681 759859 792673 980667 1370489 1595784 1728134 1726382 1634505 1477476
16823A477476r1648j17740j27908r0634l6515m9921p6524J8889l08248k81314
16813C15913k6318J36543P4426n1287o010j9249j0244j50450p0629j7741J4977
16802A89931N0919n9880Q9239J6174k1749m4343J6089r3959l4980J8842R0208
16791B16491r392Q3849J0026p984J19696M4742K8852m5974J82137K11656K14772
16780A048871J52215J20534P8701r724j37768j59457k37294j64712n7268n9946
16770E74152M459M9826K06040J58244j55691k24374o0319M4888J6995k1380Q8895
16759F81735J39143q3190j33938j1219J0299j07552j5100L4769m3080j40828Q0200
16748D11239j1254J45989J88662m0492j98194n7386l9340O707L7807P195m8118
$$ plain form
16823 1477476 1385828 1268088 1140180 1049546 1013031 963110 886586 905475 597227 315913
16813 315913 289595 426138 500564 449277 443267 424018 413774 263324 192695 174954 189931
16802 189931 240850 180970 270209 286383 264634 220291 236380 142421 107441 126283 216491
16791 216491 207099 290948 300974 292990 412686 457428 486280 440306 622443 834099 1048871
16780 1048871 1201086 1321620 1400321 1390597 1252829 1093372 856078 691366 634098 574152
16770 574152 578611 628437 834477 992721 837030 612656 552337 597225 614220 592840 681735
16759 681735 820878 737688 603750 592531 602830 495278 480178 514947 471867 331039 411239
16748 411239 399985 545974 734636 694144 495950 438564 399224 405931 443738 450933 402815
16737D02815j79804M490q9946K6299L5591L8928P3434n7372j44500o174p4752
16726B9009L6508J9215O5487j2022K7005R7608K26805J6531p0720q67o2891N7993
16714D29661J64971J60677J05823l7537j53330M7322J53728J03586k3163J1335
16704I63073k09183j97492o1727J37130K06565Q8244M3049M0311p173j6364k04901
16693G81532k01032k9629n7913J3151L5737o8342j29284q283R1075j2308l4543
16682C80161L8230m4991j1591J4875L4322j04803l4700k4824r1881k0043J13835
16671B48590J55501K9024P8599L6557j12637n1179J07684J22734J54356R067l1173
16660G47123j32778n9565j27542j28804o7060k981j6697N8883k1768J53045K78270
$$ plain form
16737 402815 223011 227501 137555 163854 199445 238373 311807 254435 109935 103761 29009
16726 29009 65517 84732 150219 138197 165202 262810 489615 506146 435426 434559 371668 429661
16714 429661 594632 755309 861132 823595 670265 717587 871315 974901 951738 963073
16704 963073 753890 556398 494671 631801 838366 926610 969659 1009970 1002797 986433 781532
16693 781532 580500 550871 492958 506109 541846 473504 344220 335937 427012 414704 380161
16682 380161 418391 373400 361809 376684 411006 306203 271503 246679 154798 134755 248590
16671 248590 404091 433115 511714 548271 435634 384455 492139 614873 769229 778296 747123
16660 747123 614345 554780 427238 298434 231374 228393 211696 270579 248811 401856 680126
16649F80126l1405j75521q2771m5782j19161l4742p860q7152M7983j72363n7384
16638h6032J38125J00680j32041j12228k8348Q147O5337L3300K915m2011N1753
16627d03J22522M3828j2306q0304K7346M570P7188M6539p9018k00116L7604J05786
16615I3236J3541P0249n8237q8562q4941N408M3689l8595m3234k8959J10099J17143
16603A10837J12619l2003m3456m4798j20847Q709J19154Q8098p3862j6808j11064
16592c421O15j28835k3049N8157O2784J39945K6981r3445l0898J08095j7197l4261
16580F5471k3624J8367L4932J116m2163q8392L2816J39815q6313m1384K5291O5546
16568A01478k2355M116N9776l9546o8186J1846j00751p3601O4323k0437L8447
$$ plain form
16649 680126 648721 473200 390429 344647 225486 190744 182884 95732 143715 -28648 -86032
16638 -86032 52093 152773 20732 -91496 -119844 -111697 -46360 -13060 -10145 -52156 -403
16627 -403 122119 165947 153641 73337 100683 105253 182441 228980 149962 -50154 -12550 93236
16615 93236 106777 177026 118789 30227 -54714 -49306 -5617 -44212 -87446 -116405 -6306 110837
16603 110837 223456 191453 147997 103199 -17648 -8939 110215 198313 124451 107643 -3421
16592 -3421 -2806 -131641 -154690 -96533 -33749 106196 133177 39732 8834 116929 99732 65471
16580 65471 41847 60214 95146 96262 54099 -34293 -1477 138338 52025 10641 35932 101478
16568 101478 79123 83239 143015 103469 35283 47129 -53622 -127223 -62900 -83337 -44890
16557d4890J14445K6527N5394L8108O2574M3270j7252k788r2873o9506l009k8007
16545H1993j883N5239L2138l6475m0512k9190j9247J085p4591M925J24882J4209
16533A12573Q998j37410N6229O8750l4884j16440j6092Q0181N8914P6488O9218
16522B26525L3696q1510j44853q4820N8181J8159K6667m0136q4189n6463j5803
16511a44546R379o6628N0597K6267Q9639J43885j3865P1726J9779l0545j4302
16500A41386L9347j11160o0084p4469k4808Q315j6053M0451q071J19572p158j18616
16488g1348k139j1599N226Q9457R9249N4203J7610j11906j33709P2599Q1760j7590
16476G1813n8441N6661M3835J7011J6913j13632o3710l1647J04880K7064M4365
$$ plain form
16557 -44890 69555 96082 151476 189584 252158 295428 278176 275388 182515 113009 110000 81993
16545 81993 80110 135349 167487 131012 90500 61310 42063 43148 -31443 -26518 98364 112573
16533 112573 121571 -15839 40390 109140 74256 -42184 -58276 21905 80819 157307 226525
16522 226525 260221 178711 33858 -50962 7219 25378 52045 11909 -72280 -128743 -144546
16511 -144546 -135167 -201795 -151198 -124931 -35292 108593 94728 166454 186233 155688 141386
16500 141386 180733 69573 9489 -64980 -89788 -81473 -97526 -57075 -65146 54426 47268 -71348
16488 -71348 -73487 -85086 -79860 9597 108846 163049 180659 68753 -64956 7643 89403 71813
16476 71813 13372 70033 113868 130879 147792 34160 -29550 -61197 43683 70747 115112
16465A15112n836k3516m1998j8163N8147J780j95500o4340l1389l5832K5841P6179
16453a39515P5211M9327J4213j52821k8045K7372L8534K4685j12094O1164R7191
16442d4778J6430j13791m2516N6892N752j05375o7245m7275O5261R2112J8298
16431a66235L5696j8952N2598O2942R3558N666n5417K1298M6942l700N1628K5192
16419A51216Q1336O0873K02729J33069K5951N6981k813j43832j64146Q916L7100
16408D47380j716m9756j48110j4787O6686J33827j1968o3417J9846J25103p3436
16397D29652j67885q7729j8378K0837n6249m2641j6448j37268l0498P4909l081
16386c4779J08256J49576L4496M96q992j53928q2304J3738m531Q8868J37905j8940
$$ plain form
16465 115112 109276 85760 43762 25599 83746 85526 -109974 -174314 -205703 -241535 -215694 -139515
16453 -139515 -64304 -14977 -764 -153585 -181630 -154258 -115724 -91039 -203133 -141969 -44778
16442 -44778 -28348 -142139 -184655 -127763 -122011 -227386 -294631 -341906 -276645 -184533 -166235
16431 -166235 -130539 -149491 -96893 -33951 59607 65273 9856 31154 78096 74396 126024 151216
16419 151216 232552 293425 496154 629223 655174 712155 709342 565510 401364 410280 447380
16408 447380 445664 395908 247798 233011 299697 433524 421556 358139 377985 503088 429652
16397 429652 261767 174038 155660 176497 120248 77607 61159 -76109 -106607 -31698 -34779
16386 -34779 73477 223053 257549 258045 249053 95125 12821 26559 22028 110896 248801 229861
16374B29861L297r5096j01200o5769M8465P4943J71223k1251j34614J6122o1225
16363F4756q1140k9249l2925r1202J04663J46727O5507m016o2047n554N3311R392
16351A38223R0697l9921j36634k8716N8102j9154m2600N3013J13608k1439K8348
16340A93527m1317l3520r7333j3914n5194M3314J66507J19n8096L3680k2914o9669
16328D5190p9182l691q8207l3848J68002J5423j13193j06181J8555J37389R0363
16317E0620N1553l0439r8965K9253l2565k7256P5505j7809K9830l3231R432j12642
16305a06714n6469P2721N4068J36997J21090k7629J564k03540r7505N3039M0909
16294a1469Q1656J51544K1528q3195j06624j39568k5756m0469N2705Q3980Q6788
$$ plain form
16374 229861 233158 138062 36862 -28907 19558 94501 265724 244473 109859 125981 64756
16363 64756 -16384 -45633 -78558 -169760 -65097 81630 147137 143121 81074 75520 128831 138223
16351 138223 228920 188999 52365 23649 81751 62597 19997 73010 186618 165179 193527
16340 193527 152210 118690 21357 7443 -47751 -4437 162070 162189 104093 137773 114859 45190
16328 45190 -33992 -37683 -125890 -159738 8264 23687 -89506 -195687 -177132 -39743 50620
16317 50620 102173 71734 -27231 2022 -30543 -57799 17706 -103 29727 -3504 5928 -106714
16305 -106714 -163183 -90462 -36394 100603 221693 194064 195628 -7912 -105417 -52378 -11469
16294 -11469 70187 221731 243259 160064 53440 -86128 -111884 -152353 -99648 -15668 71120
16283G1120p00j19463k1695K7591o1421N2863j4961k7587p6761k9514M3544Q651
16271a48333l9994n1486M0533M1417r532J8121J17017J06232J1752L3266r7515
16260B1478p7475k0557K5083K2692k8042K8608p8676j03022N0314L3679N9032
16249f6886M1409P0904q8506j4367L8401k7214q6357O0234j9139K357Q5626k1003
16237b4541P6283m2014P2831O0634p3993j98585m825J51758J30391k7204m4400
16226G6335l1194j00529J4335O3620k443j1144K1082N2123o3987r559j5150l0817
16214c7328l0342J0063J05610Q6724K2672q8974k27083o4968K00421P0103j3701
16203C3197m0153L5025j9574o5680j2689K2234L1367n7449j01387M8391K9786
$$ plain form
16283 71120 70420 -49043 -70738 -43147 -104568 -51705 -66666 -94253 -171014 -200528 -156984 -148333
16271 -148333 -188327 -239813 -199280 -157863 -167395 -149274 -32257 73975 85727 118993 21478
16260 21478 -55997 -76554 -51471 -28779 -56821 -28213 -106889 -209911 -159597 -125918 -66886
16249 -66886 -25477 45427 -43079 -57446 -19045 -46259 -132616 -72382 -91521 -89164 -3538 -24541
16237 -24541 51742 9728 82559 143193 69200 -129385 -134210 17548 147939 120735 76335
16226 76335 45141 -55388 -41053 22567 20124 8980 30062 82185 18198 8639 -6511 -37328
16214 -37328 -67670 -57607 48003 134727 157399 68425 -158658 -223626 -23205 46898 33197
16203 33197 -6956 28069 8495 -57185 -69874 -47640 -16273 -73722 -175109 -126718 -96932
16192i6932J01069K7089j00209M726K0988p0331k4917N9508l7125O4605O9574
16181A8045m8305J3400M6684k2393J10950L4406N2046j02939n7361J46063M7j94778
16169d135j04627R2871J47502M8535n7575L2847M8514l8273n6957N59j11136p8423
16157h0298j3775l4884J12732n479P4119l9981p7177o6492L4886R0147L5625j5317
16145A4106j8608K8017K3825p1148j37777J270J28643M0519o932J280m8245n1075
16133i6125N0098K5775K9078J8914L6494K9598k2473J5877j0388j18366j01596
16122a43114O3665l8199k8801O0594j1201M0935J50226m4214l3827j06353j04603
16111a94892l6549J03789n89r507O224R36Q862M3702j0503k180N8909q7756K8218
$$ plain form
16192 -96932 4137 31226 -68983 -64257 -43269 -113600 -138517 -79009 -116134 -51529 18045
16181 18045 -30260 -16860 29824 7431 118381 152787 204833 101894 44533 190596 190643 -4135
16169 -4135 -108762 -15891 131611 180146 122571 155418 203932 165659 108702 109261 -1875 -80298
16157 -80298 -94073 -128957 -16225 -21704 52415 12434 -64743 -131235 -96349 -6202 29423 14106
16145 14106 -4502 23515 47340 -23808 -161585 -160315 -31672 8847 1915 3195 -45050 -96125
16133 -96125 -46027 -20252 8826 27740 64234 93832 71359 87236 76848 -41518 -143114
16122 -143114 -79449 -117648 -146449 -85855 -97056 -56121 94105 49891 16064 -90289 -194892
16111 -194892 -231441 -127652 -128241 -137748 -131524 -130588 -121726 -78024 -88527 -90707 -31798 -119554 -91336
16098i1336Q8343N3717N5195N3165P3448j2878l1080o6541j48710P569Q0977k0124
16086D1745L9242N2578m9941k2196j4121j24763k6866O8182j13195n6111P9783
16075a25663Q5891J40030M0208q9066m924n324L6652M5769m802o5617L7167K5063
16063A15384O2044L6429J76519p0690o3827K0401p8016k935K1192l8493j0213
16052A67795l1341k6976r027l603p5665q0986l854P8099J5287p1215R1332K4541
16040G4387j29305q313Q4602L7941l0376O9839O3387K6054p483p3088j23211L9264
16028B3698P9614k3262j32351l6602j5004P2780m561M118J0768r1421o557J88728
16016F9948P9917j7007n8037p8653j2294M922k84J42854J11086k5634r8033j18814
$$ plain form
16098 -91336 -2993 50724 105919 159084 232532 219654 188574 122033 -26677 -19108 61869 41745
16086 41745 80987 133565 83624 61428 47307 -77456 -104322 -36140 -149335 -205446 -125663
16075 -125663 -39772 100258 140466 51400 46476 41152 77804 123573 118771 53154 90321 115384
16063 115384 177428 213857 390376 319686 255859 276260 198244 195309 216501 178008 167795
16052 167795 136454 109478 100451 96848 21183 -59803 -63657 14442 29729 -41486 49846 74387
16040 74387 -54918 -63231 21371 59312 28936 98775 162162 188216 180733 107645 -15566 23698
16028 23698 103312 80050 -52301 -88903 -103907 -31127 -35688 -31570 -20802 -112223 -118780 69948
16016 69948 149865 132858 74821 -3832 -16126 -11204 -11488 131366 242452 216818 118785 -29
16004b9N8852N7007o1193r0049K6052O9760L3360o2397J3740N4007n7048J2729
15992E4791r302K02007m3620j51858l0665J8681k5825J2219J786M1970L9173M3230
15980A52587Q3385P1320N7255Q241M621J5823J53830M5614M7401K9329J20641
15969G90047R7412O7270n3356O1588K09422P6281O2667k0827L7482M230k4300
15958A307916j9878m8100l4787p5417j10722O094J8235r7562o3940q1947j51181
15947F48711o7971m3406n2958p1217N2406l0962j03546L0011J8556l5326k6895
15936C17403J06216q065q3218K3243N2635p5359j20194j0400j17503O4106K3343
15925A72207q3969j0413N9067J7754k9179m6816J30158P7039R877l6251j10063
$$ plain form
16004 -29 58823 115830 54637 -35412 -9360 60400 93760 31363 45103 99110 42062 54791
15992 54791 45489 247496 203876 52018 21353 40034 14209 26428 28214 70184 109357 152587
15980 152587 235972 307292 364547 372788 377409 393232 547062 592676 640077 669406 790047
15969 790047 887459 954729 901373 962961 1172383 1248664 1311331 1290504 1327986 1332216 1307916
15958 1307916 1288038 1239938 1205151 1129734 1019012 1025106 1043341 945779 881839 799892 648711
15947 648711 580740 537334 484376 413159 465565 434603 331057 361068 379624 344298 317403
15936 317403 423619 415554 332336 355579 408214 332855 212661 202261 84758 148864 172207
15925 172207 88238 77825 136892 154646 125467 78651 208809 285848 295725 259474 149411
15914A49411j21372P502L4928K5308m2066Q466o1464r5785N5380P7736L3833n6011
15902A5866j02994l7884P0599K5891o1932m1152J1383J1822J890k4168r3862M0099
15890a84442p829n7570l5252J03504L2678k4771O1731M5315K9349O1688n7318
15879c2917M6307j9683j78766m9117J1903K7803r442M5032P309O6709N4914K7633
15867b315P4269o5021j29288N0656M0572N3092L1565j4922l3948n382r839j6766
15855b7327L6978K313k6982n6389p9066p259O9553J4663j40875K9782J07364J11253
15843C4008k7088j5729l985Q82N4730R1199K7612r466o3000J0674O7006K231n5543
15830A13531j24005K1225P4665L6108k1513M615N0337j4479p9151q6872J9603
$$ plain form
15914 149411 28039 35541 70469 95777 53711 62177 713 -95072 -39692 38044 71877 15866
15902 15866 -87128 -125012 -54413 -28522 -90454 -131606 -120223 -108401 -106511 -130679 -224541 -184442
15890 -184442 -192271 -249841 -285093 -181589 -148911 -173682 -111951 -66636 -37287 24401 -32917
15879 -32917 13390 -6293 -185059 -234176 -222273 -194470 -203912 -158880 -151571 -84862 -29948 -2315
15867 -2315 71954 6933 -122355 -71699 -31127 21965 53530 38608 4660 -722 -10561 -27327
15855 -27327 9651 11964 -15018 -71407 -150473 -157732 -88179 -73516 -214391 -184609 -77245 34008
15843 34008 6920 -8809 -12794 -11912 42818 134017 161629 152163 89163 99837 166843 169074 113531
15830 113531 -10474 10751 85416 121524 100011 104626 154963 140484 61333 -25539 -5936
15819e936K86347P0350p2291j16239k9800L7321j8098j21988l9496Q0622j4114
15808E6678k0036n4313n0338K9839R4468o0699l6230L2537O9882m6700j16422
15797a01334l9725l4783n969k3592N6314Q9554N6244Q3988r3427n3970p2878L4617
15785a04961j19337n6750J20964N0658L1106m4529j5351L9780N2757o0659p3625
15774a79947R4783R6137J9278l7568k6487P6818L4661m0427r6799o0752r9073
15763b19376O3663J52291k1848q8135q4009l6911J04671M6881L8276j0417M8187
15752f727N1045p582L4988j12134O2228J12427p0923q5975J10375P5650k2027
15741A41345n1030J0420P4564K5785j23647n824m9750q6079L7822k5708K6719
$$ plain form
15819 -5936 280411 350761 278470 162231 132431 169752 151654 29666 -9830 70792 56678
15808 56678 36642 -17671 -68009 -38170 56298 -4401 -40631 -8094 61788 15088 -101334
15797 -101334 -141059 -175842 -181811 -205403 -149089 -59535 -3291 80697 -12730 -66700 -139578 -104961
15785 -104961 -224298 -281048 -160084 -109426 -78320 -122849 -138200 -98420 -45663 -106322 -179947
15774 -179947 -85164 10973 30251 -7317 -33804 43014 77675 37248 -59551 -120303 -219376
15763 -219376 -155713 -3422 -25270 -113405 -197414 -234325 -129654 -82773 -44497 -54914 -6727
15752 -6727 44318 36736 71724 -40410 21818 134245 63322 -22653 87722 163372 141345
15741 141345 90315 100735 175299 201084 77437 71613 21863 -64216 -26394 -52102 -25383
15730b5383K0831J08256K191l3956M7130J03197J16376o6222k11292j03266q354
15719e0492M6833j8373l3434P9414P4984l696o388L9767n7197o8482j7941j29360
15707a44365K4054N8686r0553J10348J0242m6706L3266j5226o5866N3210O3919
15696h991k9967J6369p4043l9164R2552R6603n2197o7596q5396N6637J50124N8060
15684A12991J758J9281j29441k7271J24206J16981R0084j46747j81525N5310J8574
15673E4201K3033j36777Q314Q1287k20n1584K969M0711k8290J20035N5317j22707
15661D6289n9587J30431L0102j4962k3462j19498L5366Q5866P2926n0796k2977
15650A09698l5330j11305L4321O2278J9826k5218P9881k0275j39878p6660P5295
$$ plain form
15730 -25383 -4552 103704 105895 71939 119069 222266 338642 272420 61128 -42138 -50492
15719 -50492 -3659 -22032 -55466 23948 98932 95236 88848 128615 71418 2936 -15005 -144365
15707 -144365 -120311 -61625 -152178 -41830 -31588 -78294 -45028 -60254 -126120 -72910 -8991
15696 -8991 -38958 -22589 -96632 -135796 -43244 53359 1162 -66434 -151830 -95193 54931 112991
15684 112991 114749 134030 4589 -22682 101524 218505 308589 161842 -19683 35627 54201
15673 54201 77234 -59543 -51229 30058 29838 -21746 -18777 21934 -6356 113679 168996 46289
15661 46289 -13298 117133 147235 132273 108811 -10687 24679 110545 183471 132675 109698
15650 109698 74368 -36937 -2616 59662 79488 54270 134151 113876 -26002 -102662 -27367
15639b7367n2014q1901J5382l3886Q5345J21551M8659k3484r1176p8102j17878
15628b34871j353J22952L8392P8182N6967n2485P5507P3356n9361q121P6899j15291
15616E0773l9321J9674l8595K425k5890r3789r788N6709J10923O4648m3766N0487
15604A04490O249j54546o4087K1195j3970P6685L3169L1186J22092N1700j27211
15593H6952l3052j3650j495j47773m0329M6032n5087J0750r238o096O5065M4755
15581e3166M1925L444o017J47605N5266n199Q0250r1374j81849N4015K2264J4823
15569H1987m8895n4533N7026P5543N5734j1029l1191p1409r4842n2068P9106J08423
15557I3852l2809o9985O352o0157j2556k0352j9383K3673m037J28693R336n0793
$$ plain form
15639 -27367 -79381 -161282 -145900 -179786 -94441 27110 75769 52285 -38891 -116993 -234871
15628 -234871 -236224 -113272 -74880 3302 60269 7784 83291 156647 97286 89165 166064 50773
15616 50773 11452 31126 -7469 -5044 -30934 -124723 -134511 -77802 33121 97769 54003 104490
15604 104490 110739 -43807 -107894 -86699 -100669 -23984 9185 40371 162463 214163 86952
15593 86952 53900 40250 38755 -109018 -149347 -103315 -158402 -147652 -156890 -162986 -97921 -53166
15581 -53166 -11241 -7797 -13814 133791 189057 183858 264108 172734 -9115 44900 67164 81987
15569 81987 33092 -21441 35585 111128 166862 155833 124642 53233 -41609 -93677 -14571 93852
15557 93852 61043 -8942 -2590 -62747 -75303 -95655 -115038 -91365 -95402 33291 42627 -8166
15545h166N6370l3880P26q256j7717m6893n0580n850J3487M5287J7976l8877k5422
15532a01795k3004Q0732K47200J3486q9206K7475k9057J3093l0389k8102p4079
15521F354J0125K4939K4891m7347N419n5967O5929q731p6456M612M6631l0177
15509b9778r9024l8952K6125J50727N6163n7749J2590J00168M5696o0785l2815
15498G2366L781j02949r2548J04397Q4035r9728O7119M7882n7413l9538K9409
15487A6813Q6235j3263l9994k6542n289m6245l9745L3027R091J55j940k4420j07780
15474a59897m6341m1539R535J15441L4163J46093Q182r8961N7143J2761p4390
15463c7810l3040r830M3576r3408N0145J62269q8911M0378N4222k3603L6398J4679
$$ plain form
15545 -8166 48204 14324 15050 6794 -10923 -57816 -108396 -114246 -100759 -55472 -37496 -76373 -101795
15532 -101795 -124799 -44067 203133 216619 127413 154888 125831 138924 108535 80433 6354
15521 6354 16479 41418 66309 18962 24381 -31586 34343 25612 -50844 -46232 399 -29778
15509 -29778 -128802 -167754 -141629 9098 65261 7512 20102 120270 165966 105181 72366
15498 72366 76147 -26802 -119350 -14953 69082 -30646 36473 84355 26942 -12596 16813
15487 16813 103048 89785 49791 23249 17960 -28285 -68030 -35003 -25912 -25757 -27697 -52117 -159897
15474 -159897 -206238 -247777 -238242 -122801 -88638 57455 65637 -33324 23819 36580 -37810
15463 -37810 -70850 -80680 -37104 -130512 -80367 81902 -7009 33369 87591 63988 100386 115065
15451A15065l9600p5019J4879K01981l8488k34804l2907P9728J15891j4818p521
15440H4387N7864n2315j12876O6843r6173n8059M1981K4082N250J09536M5384
15429A15904m8264j75597M1792N4312K6395l8741J7249Q2185n682p7412q2085
15418h9944q3541O3908R7352k1232j35092p2053P6349L2922M5230J23437k9308
15407H028j8946L4282J03218O6011o8957j74344K6449J57090Q6377j25010k4985
15396F9213j55982m5955N2809L2353r38Q8627r471m7491M1407n3291k0310J0052
15384c8977K1070M4599M1353l5186P6497M0041J5651r2726k5116n4361r889N1970
15372C4926j05380L7950J13400j18364q9227M3697n914n6848j0366J31150Q5052
$$ plain form
15451 115065 75465 446 15325 217306 178818 -55986 -88893 -9165 106726 91908 84387
15440 84387 142251 89936 -22940 43903 -52270 -110329 -68348 -44266 -39016 70520 115904
15429 115904 67640 -107957 -66165 -11853 14542 -24199 -6950 75235 69553 -7859 -89944
15418 -89944 -173485 -109577 -12225 -33457 -168549 -240602 -164253 -131331 -86101 37336 8028
15407 8028 -10918 23364 126582 192593 123636 -50708 -24259 132831 219208 94198 69213
15396 69213 -86769 -132724 -79915 -47562 -48500 40127 30656 -16835 24572 -28719 -49029 -38977
15384 -38977 -17907 26692 68045 32859 109356 149397 165048 72322 47206 -7155 -17044 34926
15372 34926 -70454 -32504 80896 -37468 -126695 -82998 -88912 -145760 -156126 -24976 60076
15361F0076m5486L7230M9531q550k9004k1452N9463O353r1399j8502J18508r236
15349A07532j03394l3704P2930p686Q7115N603J4572M9715m6994j16686k2740
15338F263O2352p2548K0790o52o0583o0303j9858k7816N717N267k3108O6548k6648
15325a24579N975M300n9722o6439r0129K4747O4604J9149q083R7372j9335j7344
15313a69484L6479p237J04175j1406N7072K0322J9985J4547j11532k715N2057
15302B263j8947m9794q0489k8553J27245J04940k7068o7362j2851N2699o5563
15291f3480p86l5564k5533L7443j05066m8780J36796J52501N5481m2935p7915
15280a7838n11l056r3063q4337R5702K8307n2734j3331P3639N5871N2866N7269
$$ plain form
15361 60076 14590 51820 101351 92801 63797 42345 101808 108161 16762 -1740 116768 107532
15349 107532 4138 -29566 43364 35678 122793 128396 142968 192683 145689 29003 6263
15338 6263 68615 -3933 16857 16205 -44378 -104681 -124539 -152355 -146638 -141371 -164479 -97931 -124579
15325 -124579 -118604 -114304 -174026 -240465 -330594 -305847 -241243 -222094 -230177 -132805 -152140 -169484
15313 -169484 -133005 -140242 -36067 -47473 9599 29921 49906 64453 -47079 -49794 2263
15302 2263 -16684 -66478 -146967 -175520 -48275 56665 29597 -37765 -50616 2083 -63480
15291 -63480 -64266 -99830 -125363 -87920 -192986 -241766 -104970 47531 103012 60077 -17838
15280 -17838 -18349 -21405 -114468 -198805 -103103 -74796 -127530 -140861 -67222 -11351 41515 98784
15268I8784k3720J03357K38056N0795j43750j63567j83744J8330o4362J7136L2152
15257b0533j8102J03355L2919J8969m6683l9426L2148j9272j0494m6164j8652
15246c1935J3355K1504n5840J06360k936m2304N156P2744j25082o70L5297K7174
15234B2823l2209j8568l2376L1239O8026j9395q2937j78957n6159N2237J06768
15223a39508J37217R101p5770l7733N1990l2672P2173L7425j21321J2660M3921
15212d2517k5055L3958k5849k2007O4541J27199m3683r7513O2365O6678l8469
15201E9648N347r8587j18632l4729J39162J03992J32303m2936l9967L8197n9530
15190H4268p1562j05523j7526K9859J9629J0342N5459j9321L9687J3446L0183
$$ plain form
15268 98784 75064 178421 416477 467272 323522 159955 -23789 -5459 -69821 -52685 -20533
15257 -20533 -38635 64720 97639 116608 69925 30499 62647 43375 32881 -13283 -31935
15246 -31935 -18580 2924 -52916 53444 50508 8204 13360 86104 -38978 -39648 -4351 22823
15234 22823 -9386 -27954 -60330 -29091 38935 19540 -63397 -242354 -298513 -246276 -139508
15223 -139508 -2291 6810 -68960 -106693 -54703 -87375 -15202 22223 -99098 -86438 -42517
15212 -42517 -67572 -33614 -59463 -81470 -16929 110270 66587 -30926 31439 98117 59648
15201 59648 64995 -33592 -152224 -186953 -47791 56201 188504 145568 105601 143798 84268
15190 84268 12706 -92817 -110343 -80484 -60855 -50513 4946 -14375 25312 38758 68941
15179F8941k2515N3018O7536O4324o7195o2812r4271m9606m1554J7442R7318J878
15167C2504Q545j7178Q2317n1001o4585N70J23296l9057j04098n1766P5749l7591
15155d2295O4312q3551L8089k1965m3634P4415K3238k5752j1736K454J47259Q501
15143A29335j03566q9549P914J6440o3108j7481O5876N0909j01391O6446J27992
15132H9817j4286m0331k8623K8357N0164m7040j30150J148R7982Q3178k8719M763
15120F6260K3830n1917J08247m4862j98848k2288R1837J05146J1397o9891k9857
15109a0946P1574k4597J4466l7797l7435M9837k8487o2116p4545n6972R0271J396
15097a05351k1225j7602p5573j24577m5573L9964J04942J74476P0527J13502k1130
$$ plain form
15179 68941 46426 99444 166980 231304 164109 101297 7026 -42580 -84134 -66692 30626 32504
15167 32504 41049 23871 106188 55187 -9398 -8828 114468 75411 -28687 -80453 -4704 -42295
15155 -42295 22017 -61534 -23445 -45410 -89044 -14629 8609 -17143 -28879 -26425 120834 129335
15143 129335 25769 -63780 -55866 -39426 -102534 -120015 -54139 -3230 -104621 -38175 89817
15132 89817 75531 35200 6577 34934 85098 38058 -92092 -90944 7038 90216 61497 66260
15120 66260 90090 38173 146420 101558 -97290 -119578 -27741 77405 88802 18911 -10946
15109 -10946 60628 36031 50497 12700 -24735 25102 -3385 -65501 -140046 -197018 -106747 -105351
15097 -105351 -126576 -144178 -219751 -344328 -389901 -349937 -244995 -70519 8 113510 92380
15086I2380q8492k5299l3644p9196n7276M4947P2236L8581R5123L9290K6406j7910
15074A07146l2371K5442l0489o7274q7759l1765K7237m7137K3782N8769l880N6064
15062b235K336L7694j20108r0077N3756P0435p355r8119j7626L484r2270q1079
15050c41164O4527K9974m6074Q4714J24540L3882j8857O6823J11979j0771o4040
15039C5533Q2589r4848l3681M1026R3997L6563j17239K2342J1572l1634k0562
15028B5658P116p2317K889J19467Q3756j1257l1462L9773M7847J5173m0084j39234
15016D7325q9665r7522J37594J03924l1822j3651K1852J24049K09716K04926K92328
15005I09054L73051O57615J140420K276827K464133l52198j987807k239560j437901
$$ plain form
15086 92380 3888 -21411 -55055 -134251 -191527 -146580 -74344 -35763 59360 98650 125056 107146
15074 107146 74775 100217 69728 2454 -85305 -117070 -89833 -136970 -113188 -54419 -58299 -2235
15062 -2235 101 37795 -82313 -172390 -118634 -48199 -55554 -153673 -171299 -167815 -260085 -341164
15050 -341164 -276637 -246663 -292737 -208023 -83483 -49601 -68458 -1635 110344 99573 35533
15039 35533 118122 23274 -10407 30619 124616 161179 43940 66282 77854 46220 25658
15028 25658 32774 -39543 -36654 82813 166569 155312 123850 163623 211470 226643 186559 47325
15016 47325 -42340 -139862 -2268 101656 69834 56183 78035 202084 411800 616726 909054
15005 909054 1282105 1939720 3080140 5356967 7821100 7468902 5481095 3241535 1803634
14996A803634p18700l52402r0699N047l336k28442j20994j53314o2536j8091R5096
14985A55263M5253k9382J734p8700n1223L6145q0518P6063j05687j12651L2643
14974a11060R6428p057O570k4758n4255l8269J04758k1489L1655Q1855m0498q4370
14962f0490Q0429P9949Q6690n9454J2228k6349q6591k1978l1592M1082o8871p2932
14950a27879R1817J2491m91l9725N1560J0696M508p1882j5068J45918o6191j44837
14938a49083M2803J13261Q1254L3875M4147j2147p8079p4678j51796Q03P2719
14927g6921R3908q7999q9352J40189N1944R0016r6800k1228l3569J3853P8978
14916F3019O7246L3957j9442l2766j35538j56664J3169J0880L4604K4951R7404
$$ plain form
14996 1803634 1084934 732532 641833 646880 643544 415102 294108 140794 78258 60167 155263
14985 155263 200516 171134 172868 94168 42945 79090 -1428 74635 -31052 -143703 -111060
14974 -111060 -14632 -21689 -15119 -39877 -94132 -132401 -27643 -49132 -17477 64378 23880 -60490
14962 -60490 19939 99888 186578 127124 139352 113003 26412 4434 -27158 13924 -54947 -127879
14950 -127879 -36062 -23571 -24062 -63787 -12227 -1531 2977 -68905 -83973 61945 -4246 -149083
14938 -149083 -106280 6981 88235 122110 166257 154110 76031 1353 -150443 -149640 -76921
14927 -76921 16987 -71012 -160364 -20175 31769 121785 24985 3757 -29812 -15959 63019
14916 63019 130265 164222 144780 112014 -23524 -180188 -167019 -156139 -121535 -96584 820
14905H20m1117Q7913n5252j00326p4187q985p288j4752J96972Q1543Q6930n6062
14893I6209o3222j01772J47115L3850j23502r6143l4022M8986M4348k2339J37715
14882F7223N7207K3463K2378o5862j85402n7523L5283J94273l6751m8101Q104
14871A4292L7069J7037k4443j10640p7061N3855J04131J02271j47627M9076J13676
14860A31636K0857o9161o7438o8717n505K94p5508p4976N5224o9156J05969J18415
14848A934R2459l9341p778N1460p643l9410k757j5422o9346K3290L2375M0565
14836F0386J05958N8717K0542p6363o2052Q4179J7251r4753M5228l8626j03270
14825A7197o4194Q7238O0921o5509j6992J5605k0098p931n9234n8035P6867O3016
$$ plain form
14905 820 -40297 47616 -7636 -107962 -182149 -191134 -198422 -213174 -16202 65341 152271 96209
14893 96209 32987 -68785 78330 112180 -11322 -107465 -141487 -92501 -48153 -70492 67223
14882 67223 124430 147893 170271 104409 -80993 -138516 -103233 91040 54289 6188 14292
14871 14292 51361 68398 43955 -66685 -143746 -89891 14240 116511 -31116 17960 131636
14860 131636 152493 83332 15894 -52823 -58328 -58034 -133542 -208518 -153294 -222450 -116481 1934
14848 1934 94393 55052 47274 98734 91091 51681 48924 33502 -35844 -12554 19821 60386
14836 60386 166344 225061 245603 169240 107188 191367 208618 113865 159093 120467 17197
14825 17197 -46997 40241 101162 35653 18661 34266 14168 6237 -52997 -111032 -34165 28851
14813B8851l9075j68142O3820O9838J0696n2575P5906L0480R860L9880l4905l0918
14801C716j15211j2099J51615P9985L595r6340j70184k3333n0882P009l0399k4963
14789b77491Q2441K14862J30631P1546k31318j34493O3109j5962m958O785k5095
14778a19943N0397L0113L0958p7553q5743k6113R0607J37745J2852J6709J2498
14767G2527p244r7964l8174K5415o090K516j55144K5093n6686L735k7040L5101
14755b23955J26650J61587r8239l7927Q9788K0211l4005n5416o6699r5910R1380
14744a22535J78310M8797m3900l698m0775J4601J04382m4780k5878j883n6672
14733E969j15811j5847K6461j443N9761J8272j2083J1744J08476K2997k0276j11156
$$ plain form
14813 28851 -10224 -178366 -114546 -44708 -34012 -86587 -10681 19799 29659 69539 34634 3716
14801 3716 -111495 -123594 28021 108006 111601 15261 -154923 -178256 -229138 -222129 -252528 -277491
14789 -277491 -195050 19812 150443 221989 -9329 -143822 -80713 -96675 -101633 -94848 -119943
14778 -119943 -69546 -39433 -8475 -86028 -171771 -197884 -107277 30468 43320 60029 72527
14767 72527 65283 -32681 -70855 -45440 -51530 -49014 -204158 -179065 -235751 -232016 -259056 -223955
14755 -223955 -97305 64282 -33957 -71884 17904 38115 4110 -51306 -118005 -213915 -122535
14744 -122535 55775 104572 60672 56974 16199 30800 135182 90402 64524 62641 5969
14733 5969 -109842 -125689 -99228 -100671 -40910 -22638 -34721 -22977 85499 108496 88220 -22936
14721b2936n4945K1598K308N9634R480j36791m6632O8587n3087R522n2657L6000
14709a59919J87628R0893n6146K6235J9252n1215l1638m1883K6743k138j3710
14698e898L6100L8828m3135j29005M3012j2600L2274O2497N032l0782N3427M9131
14686I8881l4972n4939j3626J0845j2061M8942j2020l7589n3029j2235J5378J6261
14674d0164K1724q4956k9178R4986K718J2668J39986j20655j65713j4438O0249
14663a22773K1620n9549R7759J36324O3556j18889j24096M2120j2911q600K6162
14652e9277R9091K0341N4244p2271J0953M4991K3709O0953N237k2806k4892r0212
14640E0061j46983m8766j5179Q5508k1877N3406N264n5445J49976M1059k3936
$$ plain form
14721 -22936 -77881 -56283 -53975 5659 15139 -121652 -168284 -99697 -152784 -143262 -195919 -159919
14709 -159919 27709 118602 62456 88691 107943 56728 25090 -16793 9950 7812 -5898
14698 -5898 30202 69030 25895 -103110 -60098 -72698 -40424 22073 27105 -3677 49750 98881
14686 98881 63909 8970 -4656 6189 -5872 43070 31050 -6539 -59568 -71803 -56425 -40164
14674 -40164 -18440 -103396 -132574 -37588 -34870 -22202 117784 -2871 -168584 -183022 -122773
14663 -122773 -101153 -160702 -62943 73381 136937 18048 -106048 -63928 -76839 -85439 -59277
14652 -59277 39814 60155 114399 42128 53081 98072 121781 182734 187971 165165 140273 50061
14640 50061 -96922 -145688 -160867 -75359 -97236 -43830 -38566 -94011 55965 97024 73088
14629G3088o2813J557j3875p5693p677Q124o7335N290J01648N8037n2750j08971
14617a41370J7772J71509P5927o9280l4803j7223L7274m0879K6156J5214J621
14606D1918N8476p2618r049K5014p4798L9287J9667Q9088m8876o5746M6389j9557
14594B9195l4728J5098Q4029m7645q6069N5723o0307l3459J00885M2716J0947
14583G6385N8935Q4555o4586r8285j1208P139n3753m8324q9134J3140P3899K908
14571d8329o4087K4400O5662J71382P3711j8815J9351j4622m3180Q6833j39511
14560A12795j54680P3407o2285N6695O9575K3927J6762j39437j08164k4061j9087
14549a54553N102J27000J3196m152J5063j6503J00709m8104m25P9103O015j3361
$$ plain form
14629 73088 10275 11832 -2043 -77736 -85413 -77289 -144624 -139334 -37686 20351 -32399 -141370
14617 -141370 -123598 47911 123838 54558 19755 2532 39806 -1073 25083 40297 41918
14606 41918 100394 27776 18727 43741 -31057 8230 27897 116985 68109 2363 48752 29195
14594 29195 -5533 9565 93594 45949 -40120 15603 -44704 -78163 22722 65438 76385
14583 76385 135320 219875 155289 57004 45796 52935 -818 -49142 -138276 -125136 -51237 -48329
14571 -48329 -112416 -88016 -22354 149028 222739 203924 223275 208653 165473 252306 112795
14560 112795 -41885 31522 -30763 25932 95507 119434 136196 -3241 -111405 -135466 -154553
14549 -154553 -149451 -22451 -9255 -13407 1656 -14847 85862 37758 37333 116436 122451 109090
14537A09090k5394o6219q7200J25742K156j33376N8132N1105q4235L8030O0276
14526D8107K1944m5489n4252p250m1088J879m764N7198N6485r3897p898n7293
14514a26318L6948Q9419N3395J0130k175n4816p5645J252n333o767P013P7194
14502D297J95198m2233j75743Q6294O7670O0441m4425m5029J9732k3893N9925
14491A62234M8557j22158p8257o3162Q641K9135r124K5176j6748O3753n3553K4872
14479A9366P1043p6594k3113R2620K8496k0557n7946M5206N3107m200R9555K2497
14467B49480j08317l3506l8167M9767m6684r9619m5802K498p5514N3158M5391
14456d7315K5488J5533N0l342k424J00744m468J2097q9078l2053J11093J1616
$$ plain form
14537 109090 83696 17477 -69723 56019 58175 -75201 -17069 34036 -50199 -12169 48107
14526 48107 70051 24562 -29690 -36940 -78028 -76149 -80913 -23715 32770 -61127 -69025 -126318
14514 -126318 -89370 49 53444 63574 61399 6583 -69062 -67810 -73143 -79910 -72897 4297
14502 4297 199495 157262 -18481 67813 135483 195924 151499 106470 126202 102309 162234
14491 162234 210791 88633 10376 -52786 -44145 -15010 -24134 1042 -15706 48047 -5506 19366
14479 19366 90409 13815 -9298 83322 111818 91261 33315 78521 131628 127428 226983 249480
14467 249480 141163 107657 69490 119257 72573 -27046 -72848 -70350 -145864 -92706 -47315
14456 -47315 -21827 -6294 -6244 -9586 -12010 88734 84266 96363 7285 -24768 86325 97941
14444I7941o4140J5677J04628p2588M250j4607K0701J35922M9169l6394o1890
14433A78669K1022j17371L1280K370r1451p047N6709J36926M7409k39636j38395
14422a19515N291j3907N039J50165k5597j41978j733N4667R7565Q124K2747J0198
14410E1066P4962m614m4409o671N3364n4464M8212L8859j18482k2653m9308p5642
14398a09780R5215O6244m8029p3183o2456l1050J2049L4340Q9524N474j25566
14387a47218k021N4961m5265J2951O7564L4752o5602P529l4069K1458N2259P4270
14375C1569q0934p6897m48L3393L1699J06775L565k7415Q5130J8714n1833K3360
14363I6678j6034m0225p8970k6628J00949R5722n8065O7389Q7066m2567p3928
$$ plain form
14444 97941 33801 49478 154106 81518 85768 71161 91862 227784 276953 240559 178669
14433 178669 199691 82320 113600 115970 24519 17472 74181 211107 258516 18880 -119515
14422 -119515 -114224 -128131 -123092 27073 1476 -140502 -142235 -87568 9997 18121 40868 51066
14410 51066 126028 121414 77005 70334 123698 69234 117446 156305 37823 15170 -34138 -109780
14398 -109780 -14565 51679 3650 -69533 -131989 -163039 -150990 -116650 -27126 -21652 -147218
14387 -147218 -149239 -94278 -139543 -126592 -59028 -24276 -89878 -82349 -116418 -94960 -42701 31569
14375 31569 -49365 -126262 -126710 -93317 -61618 45157 48722 21307 106437 125151 73318 96678
14363 96678 80644 40419 -38551 -65179 35770 131492 73427 140816 227882 185315 111387
14352A11387L1636k8520k1846J5703j14044j8592J21168M6561p7940q4319n9427
14341g8233M2592O9661m4059l9534n9563L9486P7009J8472M7841n8262J6554K8498
14329F0462p7094p993j2557L7375O3679M5313r573J0400p3241j27186J23982J09216
14317A42783N8013m3982m3359j5425o2935j899R0512l1634j31677P3806L3938
14306F8141q9816K7004J1593k4109M9809J34976R10q9156q6110o7630j3327N6296
14294b1419R1549o452l3199J06954Q4453j44152m8638R252L186J11976r129r2042
14282E2339n9625n2604l6356Q1702M1752O7315N6827J3394m8967l332P0381L6754
14270B19580K4690K9554q6716l9382j8357q8908P3195J4021J4323l4105m2664
$$ plain form
14352 111387 143023 114503 92657 108360 -5684 -24276 96892 143453 65513 -18806 -78233
14341 -78233 -35641 34020 -10039 -49573 -109136 -69650 7359 25831 73672 15410 31964 60462
14329 60462 -16632 -24625 -37182 193 63872 109185 99612 110012 36771 -90415 33567 142783
14317 142783 200796 156814 113455 98030 35095 33196 123708 92074 -39603 34203 68141
14306 68141 -21675 5329 16922 -7187 42622 177598 178508 89352 3242 -64388 -77715 -21419
14294 -21419 70130 63678 30479 137433 221886 77734 29096 38348 41534 153510 144381 52339
14282 52339 -7286 -59890 -96246 -14544 27208 94523 151350 164744 115777 112445 182826 219580
14270 219580 244270 273824 187108 147726 129369 40461 113656 127677 142000 107895 65231
14259F5231L7846R0299o4391o9004M1392l9138k0333O9864L0855o2805L5160K1279
14247A36255R9891N8477K0395l8987j5228n5473p6942N4867J1229j15191q7466
14236h173M7458J11967Q6080l1220J0741p2356j1569k6631J83524q649J4792R3311
14224C89275J21299n8418n3818L5213M3297N7950p4749j25929q6175J23N6734
14213C04802j8565J37598J13624j1931o8516o7507Q9863o274j448j36324m1572
14202B93750n0188J04189J45322J25558J511j6649K0559L9626l5911l6817p3406
14191E17544q4904q2275O2720N3076j15829j11200q430p4171M345L8475K3209
14180B22560r803l7408L8475O5544k8945j6682j4816J95927P8057R9123J23629
$$ plain form
14259 65231 103077 193376 128985 59981 101373 62235 41902 111766 142621 79816 114976 136255
14247 136255 236146 294623 315018 276031 260803 205330 128388 183255 194484 79293 -8173
14236 -8173 39285 151252 237332 206112 216853 144497 132928 106297 289821 281172 295964 389275
14224 389275 510574 452156 398338 433551 476848 534798 460049 334120 247945 248068 304802
14213 304802 286237 423835 537459 525528 457012 389505 479368 473094 471646 335322 293750
14202 293750 243562 347751 493073 618631 620142 603493 624052 663678 627767 590950 517544
14191 517544 432640 350365 413085 466161 350332 239132 230702 156531 160876 199351 222560
14180 222560 212757 175349 213824 279368 250423 233741 218925 414852 492909 592032 715661
14169G15661j24926j61692N6892J58006J2097p9284j51147j04213l3965n6367
14159B31062p7206O1863R5512L7000q6123n9177N0706N4242J20185P5756L9760
14148E43580M5461j7865Q8529J05199N8129L7022j6159N6604q2156r0663p470
14137G20211m7266q0302l3895j05283o1908j31440N94N0986N9326j2487N4915
14126D13451R8413L5827j0349j6030O4343M3346Q6871j12552j20994r299R1047
14115E64074P4268p9816j04943k3524m3707j29416L2924Q1310l2427j24686l053
14104B11004l7787p3577o5128J05001O6476n7643L6549m8546J51581O2886J62626
14093E13442K8281n1771L8615m533j02309o7291J0313j9213o7467j08789K340
$$ plain form
14169 715661 590735 429043 485935 643941 656038 576754 425607 321394 287429 231062
14159 231062 153856 215719 311231 348231 262108 202931 253637 307879 428064 503820 543580
14148 543580 589041 571176 659705 764904 823033 860055 843896 900500 818344 727681 720211
14137 720211 672945 592643 558748 453465 391557 260117 260711 311697 371023 358536 413451
14126 413451 511864 547691 537342 521312 585655 629001 715872 603320 482326 473027 564074
14115 564074 638342 558526 453583 430059 386352 256936 289860 371170 338743 214057 211004
14104 211004 173217 99640 34512 139513 205989 148346 184895 136349 287930 350816 513442
14093 513442 541723 489952 528567 524034 421725 354434 364747 345534 278067 169278 171618
14082A71618K3672O1261J8713R7944j00090j36191l8797k8798Q1586L1801l8005
14071A44714L9181J0907O8654Q9079k7217p3564O707j96j2791L3807L3521j16292
14059A96510m622n7474n6547m661j7605M7873m4751n7267P7428P3179l7910l0235
14047H3918J053l1456q6489J5560J03243K1793j408P7493k6421n7914k5313L0286
14035A04345R6193M7778j7866m5825o5592M5460j4074m2339M6503J6644M3612
14024B14839k8597o3369J16663J04795K6863O3802L2690j02317j04735p1659m6411
14013A42564m6037K4661M930m454Q4562M7687j23662L5787N0460l5490j3138J410
14001A69280N1243R8069M6845j26891j3363j5175K7208p5796J462J01049P9702
$$ plain form
14082 171618 195290 256551 275264 373208 273118 136927 98130 69332 150918 182719 144714
14071 144714 183895 194802 263456 352535 325318 251754 258461 258265 245474 279281 312802 196510
14059 196510 191888 134414 77867 73206 55601 103474 58723 1456 78884 152063 114153 83918
14047 83918 84971 53515 -32974 -17414 85829 107622 106214 183707 157286 99372 74059 104345
14035 104345 200538 248316 230450 184625 119033 164493 150419 108080 154583 171227 214839
14024 214839 186242 122873 239536 344331 371194 434996 467686 365369 260634 188975 142564
14013 142564 96527 121188 126118 121664 206226 253913 130251 166038 216498 181008 167870 169280
14001 169280 220523 318592 365437 238546 225183 210008 237216 161420 162882 263931 343633
13990C43633k9665N3351p378m6022l8064m1138K3291J25435Q1426K3763k544q6595
13978C99493k2596m9191j76595R8994M0732O5054J09553j08708q5826q1432j00008
13967H9470L4573N949m0882k2527N7091K4913J05197J35400M1222q7189p7557
13956B65660q2387o5386R8388K4062r8760m4067P4733J22581O6696l5929j20741
13945B04850O798M1918M3585R082Q647p2036j1168N9035P4847k7963r4550J9661
13933B62706P3529p0340k298j30973j07824K479J50796J48082j35904j22346J36770
13922B04677L9240l8053K1588N3326J4646J3574J3811L883k3679n9550L0944p4126
13910B00281M8722L6879j979q3989J03832O6613m5029M61q9225Q6815R8308P1075
$$ plain form
13990 343633 313968 367319 359941 313919 275855 234717 258008 383443 464869 488632 486088 399493
13978 399493 376897 327706 151111 250105 290837 355891 465444 356736 270910 189478 89470
13967 89470 124043 129992 89110 66583 123674 148587 253784 389184 430406 343217 265660
13956 265660 183273 117887 216275 240337 141577 97510 172243 294824 361520 325591 204850
13945 204850 211648 253566 297151 306233 314880 242844 231676 290711 365558 337595 243045 262706
13933 262706 336235 265895 263597 132624 24800 27279 178075 326157 190253 67907 204677
13922 204677 243917 205864 227452 280778 295424 308998 322809 326692 303013 243463 274407 200281
13910 200281 249003 285882 283903 199914 303746 370359 325330 325791 236566 323381 421689 492764
13898D92764m8240r0958O7527n0612L1267j0028o4926P3987o5334r3312J07084
13887C49219R2354q0963j16721M3897J25664K6233M0321J8646o1070j17340q3221
13876B37019P9419R0279J07268k2309L7080J12822O8875O6723j6084j90737r4216
13865D76139n21P6464O972j8962l2761P2303K1758J19624M588j11316l3150j9210
13853E61928Q488L6490J13927R1320q9808l0330O5015J3442K4162L854O905M1359
13841H46752J26758Q478l865j06159n3399P6151Q4045j71106j24753L6805J57937
13830H77644J74544Q2871l0221R7622O6187k3895j18868j6649J15772M9047q0796
13819A193258k0395j78740p2476J36663J77220j9483o1893j36120j230J24263
$$ plain form
13898 492764 444524 353566 421093 370481 401748 391720 326794 400781 335447 242135 349219
13887 349219 441573 360610 243889 287786 413450 439683 480004 498650 437580 320240 237019
13876 237019 316438 406717 513985 491676 528756 641578 710453 777176 761092 570355 476139
13865 476139 475618 552082 559054 540092 507331 579634 601392 721016 725604 614288 581138 561928
13853 561928 570416 606906 720833 812153 722345 692015 757030 770472 794634 798488 805393 846752
13841 846752 973510 981988 978123 871964 818565 894716 978761 807655 682902 719707 877644
13830 877644 1052188 1135059 1104838 1202460 1268647 1244752 1125884 1109235 1225007 1274054 1193258
13819 1193258 1172863 994123 921647 1058310 1235530 1216047 1154154 1018034 1016804 1141067
13809A141067J7347j050Q0410Q8092J32830P7338M0281n2113J65686R5764n1817
13798A733835K7997M9317J5220J06483q6045M4159J33465K0360P2238L1369M2136
13787B190534O8649J13099J86524J81957J9643K39590L20235M40516M51139O80933
13777D892819J096171J278842J437616K016885K750395L330013L861912M061872
13769B4726525M021613L150434J916395O25458p56436k111377l244418l709687
13761B4618507l636429l231504k444387j671134j139938p07261j43402K29330
13753A1873782P23894J215223J977569K888933M042005N405512O658227P480167
13745D2265312Q143571Q210806O298142L539210J010624j895918n030334p052333
$$ plain form
13809 1141067 1158414 1157364 1237774 1325866 1458696 1536034 1576315 1524202 1689888 1785652 1733835
13798 1733835 1761832 1811149 1826369 1932852 1846807 1890966 2024431 2044791 2117029 2148398 2190534
13787 2190534 2259183 2372282 2558806 2740763 2760406 2999996 3320231 3760747 4211886 4892819
13777 4892819 5988990 7267832 8705448 10722333 13472728 16802741 20664653 24726525
13769 24726525 28748138 31898572 33814967 34440425 33683989 31572612 28328194 24618507
13761 24618507 20982078 17750574 15306187 13635053 12495115 11787854 11644452 11873782
13753 11873782 12597676 13812899 15790468 18679401 22721406 28126918 34785145 42265312
13745 42265312 50408883 58619689 64917831 68457041 69467665 67571747 62541413 55489080
13737E5489080p650498p396015o452841n269950l967544k720118j658072q37108
13729A9536934k98209K59237J019631J884369L007648M536210O387116Q641886
13721D4974822J0485978J1761723J2624497J1766252Q705921M507035K60333m338703
13713A00747858q671376j1112545j1499637j0915373r579546p634594n495977
13706C5838810l751321k325792j380964m29590O64572J783886L106109M983240
13698C8488950P465987J0457071J3315079J5235940J6679975J6746338J3123913
13691A31513253P432977K157594l871794j0447286j4719820j6083412j5532887
13684H0448625j3958257j1582995q762549o161558m274559k959489j814550r21143
$$ plain form
13737 55489080 47838582 40442567 33989726 28719776 24752232 22032114 20374042 19536934
13729 19536934 19238725 19497962 20517593 22401962 25409610 29945820 36332936 44974822
13721 44974822 55460800 67222523 79847020 91613272 100319193 104826228 105086561 100747858
13713 100747858 92076482 80963937 69464300 58548927 48969381 41334787 35838810
13706 35838810 32087489 29761697 28380733 27951143 28615715 30399601 33505710 38488950
13698 38488950 45954937 56412008 69727087 84963027 101643002 118389340 131513253
13691 131513253 138946230 141103824 137232030 126784744 112064924 95981512 80448625
13684 80448625 66490368 54907373 46144824 39983266 35708707 32749218 30934668 30013525
13676C0013525q0127J095300K570969M323816O494614Q789069J0622465J1924381
13668G5754012J2484055J0791089P124396K814378j508838n988300r952725j1934372
13660G9583695j2032498j1189877r555306p551194n572159l816934k747794k088663
13652B5029270j573770p60780m0364O82056J713160L113717M798209O330320P435553
13643D6727371Q171222Q404297O936058M061231J169893j928188n194902p536037
13635F0810945q362132q159103p500472o192141m657824l324760k327667j728968
13627A8557878j243669q95364n49745j62760M76886J212942K004783K940791L487893
13618B5829635L819287L815112L202380J730849K65730j221818k894917l835243
$$ plain form
13676 30013525 29933398 31028698 33599667 37923483 44418097 53207166 63829631 75754012
13668 75754012 88238067 99029156 106153552 108967930 107459092 101470792 91518067 79583695
13660 79583695 67551197 56361320 46806014 39254820 33682661 29865727 27117933 25029270
13652 25029270 23455500 22694720 22654356 23336412 25049572 28163289 32961498 39291818 46727371
13643 46727371 54898593 63302890 70238948 74300179 75470072 73541884 68346982 60810945
13635 60810945 52448813 44289710 36789238 30597097 25939273 22614513 20286846 18557878
13627 18557878 17314209 16418845 15869100 15706340 16183226 17396168 19400951 22341742 25829635
13618 25829635 29648922 33464034 36666414 38397263 38662993 37441175 34546258 30711015
13610C0711015m158868m010904l695448l124516k358497j658497j330479j083198
13602I290608r24944q49626p86828o13471o53505n41642l04385l20638k70551
13593D025018k23525k11375o4625j78973j88102j96781q2633K1484n3360o6931
13583B780197M8363n7456k2976m563L896K4303k691j27733j64008q8024j60458
13572B228850n6476p6750j52426j10782r210j11243l3047k2851o1858N8392j30197
13561A522402N463n7329q1952j05498m9839n4399l0386N5085K1434r5125p8894
13550A050962Q9034M4591N6185J09565k4209j00885j55909q1670j2315j4554k0895
13539I39900j16867l0186n3875o42K09340P4774o2983p6407N9856n2204m0513
$$ plain form
13610 30711015 26552147 22541243 18845795 15721279 13362782 11704285 10373806 9290608
13602 9290608 8365664 7516038 6729210 6115739 5462234 4920592 4616207 4295569 4025018
13593 4025018 3801493 3590118 3525493 3346520 3158418 2961637 2879004 2900488 2847128 2780197
13583 2780197 2828560 2771104 2748128 2743565 2747461 2771764 2769073 2641340 2477332 2389308 2228850
13572 2228850 2172374 2095624 1943198 1832416 1823206 1711963 1678916 1656065 1594207 1652599 1522402
13561 1522402 1527865 1470536 1388584 1283086 1233247 1178848 1148462 1203547 1224981 1129856 1050962
13550 1050962 1139996 1184587 1240772 1350337 1326128 1225243 1069334 987664 975349 960795 939900
13539 939900 823033 792847 738972 738330 947670 1022444 959461 883054 942910 890706 850193
13528H50193L6202R33N1653r1765n7698K8118L9313P7062L1562j56575k1058J6139
13516H04079n2794N4027M5380n2675M5490j63909j49847k4305J18800J58301n6944
13505G25603J4713N6888j01902J17414R7425l0518r2889r3208n3174o1730M2406
13494F21028J3837m425L9885K3396p6525L0908K6199K1641l3050q5399M2416l8172
13482E81739P0075L6031K263p092p0199k8007m34k4257J6581L1224k5346o1935
13470E20643l2126O0890J0721k6587M8776Q680K0502N8881R2502J34447Q4655
13459I81984q5057j7965L0502O7558N0186Q0n2987l7489q387r4746j5040m9743
13447G68896j16430m204l2413N0432J5334M1357N0585l9990m0014N0818Q4558
$$ plain form
13528 850193 886395 887328 938981 847216 789518 817636 856949 934011 965573 808998 787940 804079
13516 804079 751285 805312 850692 798017 843507 679598 529751 505446 624246 782547 725603
13505 725603 740316 797204 695302 812716 910141 879623 786734 693526 640352 578622 621028
13494 621028 634865 630440 670325 693721 617196 648104 674303 695944 662894 577495 619911 581739
13482 581739 651814 687845 690108 683016 612817 584810 584376 560119 576700 607924 582578 520643
13470 520643 488517 549407 560128 533541 582317 590997 611499 670380 762882 897329 981984
13459 981984 896927 878962 909464 977022 1027208 1027288 974301 936812 928425 833679 818639 768896
13447 768896 652466 648262 615849 666281 681615 722972 773557 733567 693553 744371 828929
13436H28929K1305N0852M3592J77990L3434M994Q343o3265p5281n5688R8653O9425
13424A143283j1358r386k0629Q6061n6234p3503l9466Q3774o9405q1826o0698
13413H90613L4250q3560j8456Q7217n9353j50985J1977P5010R466n3653n1613
13402F90913Q7123J55349M1931K7297l7663N6349N5958m8411L586J62352P3883
13391A268667m2577o052l7479L8319J63870n1008P049O0279p651j5098j811l3502
13379A343006j67601r1930r4770K8509j07515j6380M7092j652p4703L5374l1568
13368H67862L3836j7773q6025L7268Q9001N1610Q338j9679R4954L5403M5139J47091
13356A287025N2210J8135O1378l0613m4914j36433j1986P3333Q9618M9771M883
$$ plain form
13436 828929 850234 901086 944678 1122668 1156102 1161096 1169439 1106174 1030893 975205 1073858 1143283
13424 1143283 1131925 1122539 1101910 1187971 1131737 1058234 1018768 1102542 1033137 951311 890613
13413 890613 924863 841303 822847 910064 850711 699726 711703 786713 796179 742526 690913
13402 690913 778036 933385 975316 1002613 964950 1021299 1077257 1028846 1032432 1194784 1268667
13391 1268667 1226090 1220038 1182559 1220878 1384748 1333740 1340789 1401068 1393417 1378319 1376508 1343006
13379 1343006 1175405 1083475 988705 1017214 909699 893319 940411 938759 864056 899430 867862
13368 867862 901698 883925 797900 835168 924169 975779 984117 964438 1059392 1094795 1139934 1287025
13356 1287025 1339235 1357370 1418748 1388135 1343221 1206788 1194802 1268135 1357753 1407524 1412407
13345A412407p457P005m4031j39942r7996j23383k6925J9874N5264l4180p5440
13334I45196j94003r8933M9790J25034j5692J0907K248J50036K14958J43424P6158
13323A409123J1132j8397q864m0480j19387n5237j12678n3117M061J2343R684
13312A038183N498p6504j72859k0701R0416P0083k567l3833j9759K9398q7459
13301H19896j26430O6141L4660j59379P1847K06666O8859q7055j3944j15826M2365
13290H07800k7194k5654m5787J4274Q5681J0411L2264J5264n6817j08315r9245
13279F02682J08139J12276J6984q1666j26915J21053O3006L7530l2810m218L1347
13268H47408k9814K290k8231q3960o0722J09792P4941K7650Q3674K14821J61620
$$ plain form
13345 1412407 1404950 1411955 1367924 1227982 1129986 1006603 979678 999552 1054816 1020636 945196
13334 945196 751193 652260 702050 827084 811392 822299 824547 974583 1189541 1332965 1409123
13323 1409123 1420255 1401858 1392994 1352514 1233127 1177890 1065212 1012095 1016156 1028499 1038183
13312 1038183 1043681 967177 794318 773617 864033 934116 931549 897716 877957 907355 819896
13301 819896 693466 759607 794267 634888 706735 913401 982260 895205 881261 765435 807800
13290 807800 780606 754952 709165 723439 809120 819531 851795 867059 810242 701927 602682
13279 602682 710821 823097 840081 758415 631500 752553 815559 853089 820279 816061 847408
13268 847408 817594 819884 791653 707693 646971 756763 831704 859354 943028 1157849 1319469
13257A319469K0900k4720n0977o9526m5861o8583l7794m1223j3383L384n2274
13246I39412j69913j09255p7437P1872O3322R3083J20460m8706M8386O9752M0776
13235A041752k7565PP5771J57820J05186P5906J24971K4808j02028k07791j46790
13224A122047r1529j3460k1197k0593k6301Q7590N030l7274l6022p003o3610j10360
13212G87318M2851J37139J52681K200N4421J88754J15762k9310k1319j10957j54369
13201A165171o3769J4314q75o0210j27542k7213P3606P0894p578P9367O5279M1449
13189A222893j1847r4745K4116m5602J01822R4700P631L3952l2402j02703j6025
13178A181790O9558m3674O2493j32746j44567p5606j9738O6527j4139M418N3530
$$ plain form
13257 1319469 1340369 1315649 1264672 1195146 1149285 1080702 1042908 1001685 988302 991686 939412
13246 939412 769499 660244 582807 654679 718001 811084 931544 882838 931224 1000976 1041752
13235 1041752 1014187 1014194 1089965 1247785 1352971 1428877 1553848 1578656 1476628 1268837 1122047
13224 1122047 1030518 1017058 995861 975268 948967 1036557 1041587 1004313 968291 961288 897678 787318
13212 787318 830169 967308 1119989 1122189 1176610 1365364 1481126 1451816 1430497 1319540 1165171
13201 1165171 1101402 1115716 1114841 1054631 927089 899876 973482 1044376 1036798 1116165 1181444 1222893
13189 1222893 1211046 1116301 1140417 1094815 1196637 1291337 1298968 1332920 1300518 1197815 1181790
13178 1181790 1251348 1207674 1270167 1137421 992854 917248 897510 964037 949898 954316 1007846
13167A007846K5952L730O7284k5205j21971k3718K26415l7046j16003J9010J18220
13156A144514m879l2402r7133J9660Q4287j15596p6221K10217J85704Q9321j43840
13145A263632q6935m0201j4896O1526J28826r8j21371o2535J01261J7690o5649
13134A181250N395m2207r3082j15095p9160M5894J20245O7957r0488m4991j7274
13123I38444J5509J26695K2211n8057l9669K5363K175L9451M4244k4980O1387
13112A152773L4470n7349q5022p1369P9160M9407Q9702K652L7055J41556q509
13101A364526l8832l7036p7075j18660k8582k2993N2010J81398l6299j15223R4366
13090A217600N3836N2937J368K566l689m7542q2682o2562J0926Q333M0852O1868
$$ plain form
13167 1007846 1033798 1037528 1104812 1079607 957636 933918 1160333 1123287 1007284 1026294 1144514
13156 1144514 1139635 1107233 1010100 1029760 1114047 998451 922230 1132447 1318151 1407472 1263632
13145 1263632 1176697 1136496 1121600 1183126 1311952 1311854 1190483 1127948 1229209 1246899 1181250
13134 1181250 1186645 1144438 1051356 936261 857101 902995 1023240 1091197 1000709 955718 938444
13123 938444 953953 1080648 1102859 1044802 1005133 1030496 1032671 1072122 1116366 1091386 1152773
13112 1152773 1187243 1129894 1044872 973503 1052663 1102070 1191772 1194424 1231479 1373035 1364526
13101 1364526 1325694 1288658 1211583 1092923 1064341 1041348 1093358 1274756 1238457 1123234 1217600
13090 1217600 1271436 1324373 1325741 1328307 1324618 1277076 1194394 1131832 1142758 1151091 1191943 1253811
13078A253811O3093O024P3120L3665Q9788J0205o653K88J06168r943o5224O4971
13066A619313l1806n8238k1735K7421j6592R6987J86238J28365M3555m4901J9576
13055A948183j5151j8063k8244q9914K8891J71670R4411N3252N275L7145k471
13044B184984l8225m725J86798J26532J17715J88893Q2793J40336J50004N7098
13034C192203J27259J57325J86378K33062L72674M75871K49194L18767M60881
13025E773614K76453K49435L28948K76253L36932L85617O37614O40337P09324
13016I614527J022737J471668J850693K330734K814694L691522M682531O024190
13008C3503296Q371151J1369144J3773354J3876189J1919687R816340P334914
$$ plain form
13078 1253811 1316904 1322928 1396048 1429713 1519501 1529706 1523053 1523341 1629509 1619566 1554342 1619313
13066 1619313 1587507 1529269 1507534 1534955 1518363 1615350 1801588 1929953 1973508 1928607 1948183
13055 1948183 1933032 1914969 1886725 1796811 1825702 1997372 2091783 2145035 2150310 2187455 2184984
13044 2184984 2146759 2142034 2328832 2455364 2573079 2761972 2844765 2985101 3135105 3192203
13034 3192203 3319462 3476787 3663165 3896227 4268901 4744772 4993966 5312733 5773614
13025 5773614 6050067 6299502 6628450 6904703 7241635 7627252 8264866 8905203 9614527
13016 9614527 10637264 12108932 13959625 16290359 19105053 22796575 27479106 33503296
13008 33503296 41874447 53243591 67016945 80893134 92812821 102629161 109964075
13001A09964075L389697j691615n701534p646926q812958r848405j0468531r841165
12993E9342638q180868o094787m210013k347154o25048M38582J534626L084594
12985D2942570M721170O527181Q659503J1321008J3517544J4094017J2446078
12978A14229071J0498468R111733N918536J005684k535403l686603l527825k729307
12970A28284354j766778l08222J435542K009785P69060q24419j709093l219620
12962A24670609n375557p305806q160145q524436r313927r876579r187932p291566
12954E9634661n118995l298659j375194M03754K013228L529528N312710P230063
12946F8331096Q575263R242368R445986R282828Q578652O974206M850047L308146
$$ plain form
13001 109964075 113353772 111662157 105960623 98313697 89500739 79652334 69183803 59342638
12993 59342638 51161770 45066983 40856970 38509816 37884768 38323350 39857976 42942570
12985 42942570 47663740 54190921 62850424 74171432 87688976 101782993 114229071
12978 114229071 124727539 133839272 139757808 140763492 138228089 134541486 131013661 128284354
12970 128284354 126517576 126209354 127644896 129654681 130423741 129599322 127890229 124670609
12962 124670609 119295052 111989246 103829101 95304665 85990738 76114159 66926227 59634661
12954 59634661 54515666 51217007 49841813 50245567 52258795 55788323 61101033 68331096
12946 68331096 76906359 86148727 95594713 104877541 113456193 120430399 125280446 128588592
12938A28588592K377998J132595J62690L7259Q72489K051400K873845M029755
12930A42126623M662405L624526J781548p671j999749n006132q449827j0783365
12922A25948358j1485706j1419158j1211929j0419734q766312o607752m484723
12915F1553044k322930l85623J665079L951374O394323R184353J1054150J1359292
12907A02453062J0900671J0198787R958413R239804O697198M871857M040925K145060
12899A60505777p00142j547382p6241K275819M234088N004663N317127N463956
12891A80477665L031574k223737p131423j0362875j3381969j6417613j7846260
12884A16145362j6771909j3785987j0771072q280905o163306m128743k297397
$$ plain form
12938 128588592 130966590 132099185 132261875 132299134 133171623 135223023 138096868 142126623
12930 142126623 146789028 150413554 152195102 152187431 150187682 145181550 136731723 125948358
12922 125948358 114462652 103043494 91831565 81411831 72645519 66037767 61553044
12915 61553044 59230114 58844491 60509570 64460944 70855267 80039620 91093770 102453062
12907 102453062 113353733 123552520 133510933 142750737 149447935 154319792 158360717 160505777
12899 160505777 159805635 158258253 158182012 160457831 164691919 169696582 175013709 180477665
12891 180477665 183509239 181285502 174154079 163791204 150409235 133991622 116145362
12884 116145362 99373453 85587466 74816394 66535489 60372183 56243440 53946043
12877E3946043q52980P85731K908075N401130Q068805J0700810J2767568J3358806
12869A07083988J2557234J1408674R958638O899600J914537l745693q241377j1918362
12861A25917239j5507905j7496885j6701236j3556776r888199p247321n449210
12854D0069707m244356l480593l082319k758244k281867j988083j790230j517058
12846A8926957j151998j017859q24393q70031q94726q03635p92069o84106n17527
12837A1370613n04773m81006n50579l08251l42514k74389j65027j38240j72067
12828H433767j87751q5723p6362k713K8083o7165n4761j14304n8980l7129j17480
12817G659482m6766l7032R9408M0364R0675K8148j5804m743k9943p4886k9246
$$ plain form
12877 53946043 53093063 53878794 56786869 62187999 70256804 80957614 93725182 107083988
12869 107083988 119641222 131049896 141008534 147908134 149822671 146076978 137835601 125917239
12861 125917239 110409334 92912449 76211213 62654437 52766238 45518917 40069707
12854 40069707 35825351 32344758 29262439 26504195 24222328 22234245 20444015 18926957
12846 18926957 17774959 16757100 15932707 15062676 14167950 13364315 12572246 11888140 11370613
12837 11370613 10865840 10384834 9834255 9526004 9183490 8909101 8744074 8605834 8433767
12828 8433767 8246016 8160293 8083931 8081218 8109301 8042136 7987375 7873071 7814091 7776962 7659482
12817 7659482 7612716 7575684 7675092 7715456 7806131 7834279 7818475 7813732 7783789 7708903 7679657
12806G679657N8057K04404J09833K2107p3793M9542J61664J77368J15542N7198
12796H561579l6916j0520Q4629J97428K38526L20624K38841J01663j4969O3221
12786I744106P297q8156r0665l7166R8096K57333J19893K6411K16738J00741J4350
12775A0368978j1579J7376J52299K18566L51843L26909K39322J55091M7524n9313
12765A1807016m2892L211O4120R9501K00207K31073Q1324J31758L08311K03085
12755A3086714J99302K25456J31605J35800J11074K36395K69574J84714J19094
12746A4699728K42042L50151K66730L24937L24714M03374L79356N74443N24824
12737A8090299M38471L80778L25643K82597K17960K25028K74346K20471L90435
$$ plain form
12806 7679657 7737714 7942118 8051951 8074058 8000265 8049807 8211471 8388839 8504381 8561579
12796 8561579 8524663 8514143 8598772 8796200 9034726 9355350 9594191 9695854 9680885 9744106
12786 9744106 9751403 9663247 9572582 9535416 9633512 9890845 10010738 10037149 10253887 10354628 10368978
12775 10368978 10357399 10374775 10527074 10745640 11097483 11424392 11663714 11818805 11866329 11807016
12765 11807016 11764124 11767335 11831455 11930956 12131163 12362236 12443560 12575318 12883629 13086714
12755 13086714 13286016 13511472 13643077 13778877 13889951 14126346 14395920 14580634 14699728
12746 14699728 14941770 15291921 15558651 15883588 16208302 16611676 16991032 17565475 18090299
12737 18090299 18528770 18909548 19235191 19517788 19735748 19960776 20235122 20455593 20846028
12728B0846028N39438M70131M67975L55935M66677O32011M89899N21270O90260
12719B5479624P88015R14233P82013Q24313P97425O67049N23643N63418M24267
12710C1764000N31129O86141P87290P76294Q09922J012862R05363R36170R82986
12701C9192157J071701J077634J284592J281532J355641J469260J504499J349644
12693D9586660J409521J485286J563849J595977J588332J593031J833363J988389
12685F2644408K074048J944097K062603K230403K363434K479292K579222K593824
12677H0971331K653179K757429K770681L041108L093311L099607L149111L275071
12669A04810828L469485L373948L501252L453051L621648L724986L721808L623877
$$ plain form
12728 20846028 21385466 21855597 22323572 22679507 23146184 23778195 24268094 24789364 25479624
12719 25479624 26267639 27181872 27963885 28788198 29585623 30252672 30776315 31339733 31764000
12710 31764000 32295129 32981270 33768560 34544854 35354776 36367638 37273001 38209171 39192157
12701 39192157 40263858 41341492 42626084 43907616 45263257 46732517 48237016 49586660
12693 49586660 50996181 52481467 54045316 55641293 57229625 58822656 60656019 62644408
12685 62644408 64718456 66662553 68725156 70955559 73318993 75798285 78377507 80971331
12677 80971331 83624510 86381939 89152620 92193728 95287039 98386646 101535757 104810828
12669 104810828 108280313 111654261 115155513 118608564 122230212 125955198 129677006 133300883
12661A33300883L496070L415570L356457L170168K959557K908246K789492K625462
12653A58021905K453065K065960J814243J635103J276909R00658O63196K72573
12645A69103612j27852m05658o58691r60890j333275j800727k005328k272660
12637A59538531k533978k632513k834168l043771l112581l269280l307735l174950
12629A35629555l200505l325645l356955l342939l354126l316012l354814l328023
12621A09050536l323794l102676l007111k952933k917853k777080k744491k664306
12613H5560292k594228k566439k379709k377123k369737k205737k105349j963261
12605F6998709k019839j975043j905882j819996j691838j611700j640797j555589
$$ plain form
12661 133300883 136796953 140212523 143568980 146739148 149698705 152606951 155396443 158021905
12653 158021905 160474970 162540930 164355173 165990276 167267185 168167843 168831039 169103612
12645 169103612 168975760 168570102 167911411 166950521 165617246 163816519 161811191 159538531
12637 159538531 157004553 154372040 151537872 148494101 145381520 142112240 138804505 135629555
12629 135629555 132429050 129103405 125746450 122403511 119049385 115733373 112378559 109050536
12621 109050536 105726742 102624066 99616955 96664022 93746169 90969089 88224598 85560292
12613 85560292 82966064 80399625 78019916 75642793 73273056 71067319 68961970 66998709
12605 66998709 64978870 63003827 61097945 59277949 57586111 55974411 54333614 52778025
12597E2778025j601418j433768j397154j319150j319766j263907j167067j105951
12589D2169844j161622j083411r87587j012495j065280j084601p71679q28491
12581C4174678q93718p08762p92426q39858o94363o96497p13764o62836p41690
12572B7430764o72132o52689o37129m55401m41853o27675m85521n05689m23721
12563B2528954m45208m94604n01911l64893m26944l66471l22506l26561k72644
12554A9007212l85139l47176k35710k55883k05015l23966k86585l98818k38030
12545A6330890j61657k91912k14575j86468j90066j60393j41924k58008k18210
12536A4507677k29322k93407l54469k84111j97500j81980k30709k16072j17849
$$ plain form
12597 52778025 51176607 49742839 48345685 47026535 45706769 44442862 43275795 42169844
12589 42169844 41008222 39924811 38937224 37924729 36859449 35774848 35003169 34174678
12581 34174678 33280960 32572198 31779772 30939914 30245551 29549054 28835290 28172454 27430764
12572 27430764 26758632 26105943 25468814 25013413 24571560 23943885 23458364 22952675 22528954
12563 22528954 22083746 21589142 21087231 20722338 20295394 19928923 19606417 19279856 19007212
12554 19007212 18622073 18274897 18039187 17783304 17578289 17254323 16967738 16568920 16330890
12545 16330890 16169233 15877321 15662746 15476278 15286212 15125819 14983895 14725887 14507677
12536 14507677 14278355 13984948 13630479 13346368 13148868 12966888 12736179 12520107 12402258
12527A2402258j63943j52179j35552k17210k36590j75416j74833n0802j01744
12518A0993989j16992j36679j00447o5227j08057j42766o8260P244n7608j91426
12508A0013771k33644j98417k6660j82487j56898j12085q1873n0724q0634k22450
12498H667899k23249j15196m4734p2815j42105j18661j55836j97293j06002k5895
12488G466113o2353p7801k6203r0195m7412n3809j5649J3754M7866J7374l327
12477G168358j72692p7521K7546l4598m43o3825j02947p1915N5706j62727j31096
12466F433846r8880j38303q6029o5865j4590p8550o5541r6940m9055j01835j49450
12455E488808j43748o7488o2162j6198J2070J1839K673j27561L3628l8376j00314
$$ plain form
12527 12402258 12238315 12086136 11950584 11733374 11496784 11321368 11146535 11095733 10993989
12518 10993989 10876997 10740318 10639871 10574644 10466587 10323821 10255561 10262805 10205197 10013771
12508 10013771 9780127 9581710 9555050 9372563 9215665 9103580 9021707 8970983 8890349 8667899
12498 8667899 8444650 8329454 8284720 8211905 8069800 7951139 7795303 7598010 7492008 7466113
12488 7466113 7403760 7325959 7299756 7209561 7162149 7108340 7092691 7106445 7154311 7171685 7168358
12477 7168358 6995666 6918145 6945691 6911093 6910650 6846825 6743878 6671963 6727669 6564942 6433846
12466 6433846 6334966 6196663 6110634 6044769 6030179 5951629 5886088 5789148 5740093 5638258 5488808
12455 5488808 5345060 5277572 5215410 5199212 5211282 5223121 5225794 5098233 5131861 5093485 4993171
12444D993171l4694k7800P4271j6895j8271J37903N4515j17036r8730j9294k7212
12433D899928P9990M9160J60266M7410j12777j05231n1122K7079j1709k4323q9761
12422D868910j36772r4769j03458n3153J304n7459o2158P898J5295l4875m4271
12411D306492o0623l6139J14863M7494P6910J5125J21933J45694M1485K4679N1126
12400D849039L5472J7999j74964k23677j01220j08635m8820p5740J6311K2519
12390D208284K9952O3981N8827J33483K0817o9283K3197J35286K38993J69337
12380E012874Q5086J08990m7867R6201J08043K91490K22198J75836L01954K32025
12370F586830K05825K95005L69896N83787P60552J003861J269376J428530J678020
$$ plain form
12444 4993171 4958477 4930677 5004948 4988053 4969782 5107685 5162200 5045164 4946434 4927140 4899928
12433 4899928 4979918 5029078 5189344 5236754 5123977 5018746 4967624 4994703 4982994 4958671 4868910
12422 4868910 4732138 4637369 4533911 4480758 4482062 4424603 4362445 4370343 4385638 4350763 4306492
12411 4306492 4245869 4209730 4324593 4372087 4448997 4464122 4586055 4731749 4773234 4797913 4849039
12400 4849039 4884511 4902510 4727546 4503869 4402649 4294014 4245194 4169454 4185765 4208284
12390 4208284 4238236 4302217 4361044 4494527 4515344 4446061 4469258 4604544 4843537 5012874
12380 5012874 5097960 5206950 5159083 5255284 5363327 5654817 5877015 6052851 6354805 6586830
12370 6586830 6792655 7087660 7457556 8041343 8801895 9805756 11075132 12503662 14181682
12361A4181682J981712K166049K533629K738962K807164L016109L490715M685584
12353C7601606O733351R447970J3122798J7518670K2288837K5318144K4387338
12346A56418714J8588172O117018j0151091k2528363k6568104k3516531j7497541
12339H0862274j1703006p478711m438806j991271J77849K545471N385118Q448332
12331G1807250J1470445J4429708J7826189K1116281K1246222J5485036N257760
12324A78638891o780443j6714768k2661228k4113244k1585347j7029648j2535074
12317E7219139q931919o265213m473017l164528k130756j487164j085070p64891
12309B8916581l70455J64232O73854J242817J518285J872569K246709K666929
$$ plain form
12361 14181682 16163394 18329443 20863072 23602034 26409198 29425307 32916022 37601606
12353 37601606 44334957 53782927 66905725 84424395 106713232 132031376 156418714
12346 156418714 175006886 181123904 170972813 148444450 121876346 98359815 80862274
12339 80862274 69159268 61680557 57241751 55250480 55428329 57973800 63358918 71807250
12331 71807250 83277695 97707403 115533592 136649873 157896095 173381131 178638891
12324 178638891 171858448 155143680 132482452 108369208 86783861 69754213 57219139
12317 57219139 48287220 42022007 37548990 34384462 32253706 30766542 29681472 28916581
12309 28916581 28546126 28710358 29384212 30627029 32145314 34017883 36264592 38931521
12301C8931521L670218N146597P271702J0229112J3603013J7674672K2275284
12294A18802119K5448248K4376808J5615419J489537j0300681j6910991j9029895
12287A39490564j8431073j6043751j2409892q305217m540421j418376J969863
12280H0311697N945805J0486695J6147823K2884477K9848482L6294786M1347805
$$ plain form
12301 38931521 42601739 47748336 55020038 65249150 78852163 96526835 118802119
12294 118802119 144250367 168627175 184242594 185732131 175431450 158520459 139490564
12287 139490564 121059491 105015740 92605848 84300631 79760210 78341834 80311697
12280 80311697 86257502 96744197 112892020 135776497 165624979 201919765 243267570
$$ [...]
##END NTUPLES=NMR SPECTRUM
##END=
