##TITLE=Analysis number 324263
Compound Code cc 52401
Book Reference 464/78/3
Project Code adrs
Chemist Name chrisr
##JCAMPDX= 6.0         $$ Bruker NMR JCAMP-DX V2.0
##DATA TYPE= NMR SPECTRUM
##DATA CLASS= NTUPLES
##ORIGIN= Bruker BioSpin GmbH
##OWNER= nmr
$$ XWIN-NMR		Version 3.5
$$ Thu Nov 16 10:16:33 2006 GMT Standard Time (UT+0h)  MAYBRIDGE\nmr@NMR_250MHZ
##.OBSERVE FREQUENCY= 250.131544655141
##.OBSERVE NUCLEUS= ^1H
##.ACQUISITION MODE= SIMULTANEOUS (DQD)
##.ACQUISITION SCHEME= undefined
##.AVERAGES= 16
##.DIGITISER RES= 18
##SPECTROMETER/DATA SYSTEM= dpx250
##.PULSE SEQUENCE= zg30
##.SOLVENT NAME= DMSO
##.SHIFT REFERENCE= (INTERNAL, DMSO, 0, 16.522)
##AUDIT TRAIL= $$ (NUMBER, WHEN, WHO, WHERE, WHAT)
$$ ##TITLE= Audit trail, XWIN-NMR		Version 3.5
$$ ##JCAMPDX= 5.01
$$ ##ORIGIN= Bruker BioSpin GmbH
$$ ##OWNER= nmr
$$ C:\u/data/dgb/nmr/ADRS/450/pdata/1/auditp.txt
$$ ##AUDIT TRAIL=  $$ (NUMBER, WHEN, WHO, WHERE, WHAT)
(   1,<2006-11-16 10:16:04.13 +000>,<MAYBRIDGE\nmr>,<NMR_250MHZ>,
      <created by zg, POWCHK disabled, PULCHK disabled
       configuration hash MD5:
       49 4B E0 1D 92 C2 6B 37 9F E6 65 BC 52 41 86 1D
       data hash MD5: 64K
       E4 B8 9E 0C 20 6D 86 0E 53 AD 4D ED FB 77 3D 71>)
(   2,<2006-11-16 10:16:20.88 +000>,<MAYBRIDGE\nmr>,<NMR_250MHZ>,
      <Start of raw data processing
       ef LB = 0.3 FT_mod = 6 PKNL = 1 SI = 32K 
       data hash MD5: 32K
       5F E2 8A 80 27 DF 52 5E 85 2C 15 96 75 C0 2B C5>)
(   3,<2006-11-16 10:16:22.57 +000>,<MAYBRIDGE\nmr>,<NMR_250MHZ>,
      <apk 
       data hash MD5: 32K
       C5 04 12 19 E6 FF C2 CD E3 BE CF 21 7F E2 1B 8F>)
(   4,<2006-11-16 10:16:23.41 +000>,<MAYBRIDGE\nmr>,<NMR_250MHZ>,
      <abs ABSG = 5 
       data hash MD5: 32K
       D2 B0 DD DC EA DD 9E E6 77 4C D9 6C 7B FC 90 BF>)
$$ ##END=
$$ 
$$ hash MD5
$$ 1B F9 DE 22 C1 AD 04 43 F4 DF C5 12 68 1E 96 C6
##$RELAX= 
##$RELAX= 
##$RELAX= 
##$RELAX= 
##$RELAX= 
##$RELAX= 
##$RELAX= 
$$ Bruker specific parameters
$$ --------------------------
##$DU= <C:\u>
##$EXPNO= 450
##$NAME= <ADRS>
##$PROCNO= 1
##$TYPE= <nmr>
##$USER= <dgb>
##$AMP= (0..31)
100 100 100 100 100 100 100 100 100 100 100 100 100 100 100 100 100 100 
100 100 100 100 100 100 100 100 100 100 100 100 100 100 
##$AQSEQ= 0
##$AQ_mod= 3
##$AUNM= <au_zg>
##$AUTOPOS= <8 >
##$BF1= 250.13
##$BF2= 250.13
##$BF3= 250.13
##$BF4= 250.13
##$BF5= 500.13
##$BF6= 500.13
##$BF7= 500.13
##$BF8= 500.13
##$BYTORDA= 1
##$CFDGTYP= 0
##$CFRGTYP= 5
##$CHEMSTR= <none>
##$CNST= (0..31)
1 1 145 1 1 1 1 1 1 1 1 1 1 1 1 1 1 1 1 1 1 1 1 1 1 1 1 1 1 1 1 1 
##$CPDPRG= <>
##$CPDPRG1= <>
##$CPDPRG2= <>
##$CPDPRG3= <>
##$CPDPRG4= <mlev>
##$CPDPRG5= <mlev>
##$CPDPRG6= <mlev>
##$CPDPRG7= <mlev>
##$CPDPRG8= <mlev>
##$CPDPRGB= <>
##$CPDPRGT= <>
##$D= (0..31)
0 1 0 0 0 0 0 0 0 0.06 0 0 0 0 0 0 0.0002 0 0 0 0 0 0 0 0 0 0 0 0 0 0 
0 
##$DATE= 1163672162
##$DBL= (0..7)
120 120 120 120 120 120 120 120 
##$DBP= (0..7)
150 150 150 150 150 150 150 150 
##$DBP07= 0
##$DBPNAM0= <>
##$DBPNAM1= <>
$$ [...]
##$SUBNAM7= <"">
##$SUBNAM8= <"">
##$SUBNAM9= <"">
##$SW= 20.6930455092707
##$SWIBOX= (0..15)
0 0 3 0 0 0 0 0 0 0 0 0 0 0 0 0 
##$SW_h= 5175.983436853
##$TD= 65536
##$TD0= 1
##$TE= 683.16
##$TE2= 300
##$TE3= 300
##$TEG= 300
##$TL= (0..7)
0 120 120 120 120 120 120 120 
##$TP= (0..7)
150 150 150 150 150 150 150 150 
##$TP07= 0
##$TPNAME0= <>
##$TPNAME1= <>
##$TPNAME2= <>
##$TPNAME3= <>
##$TPNAME4= <>
##$TPNAME5= <>
##$TPNAME6= <>
##$TPNAME7= <>
##$TPOAL= (0..7)
0.5 0.5 0.5 0.5 0.5 0.5 0.5 0.5 
##$TPOFFS= (0..7)
0 0 0 0 0 0 0 0 
##$TUNHIN= 0
##$TUNHOUT= 0
##$TUNXOUT= 0
##$USERA1= <user>
##$USERA2= <user>
##$USERA3= <user>
##$USERA4= <user>
##$USERA5= <user>
##$V9= 5
##$VALIST= <valist>
##$VCLIST= <CCCCCCCCCCCCCCC>
##$VD= 0
##$VDLIST= <DDDDDDDDDDDDDDD>
##$VPLIST= <PPPPPPPPPPPPPPP>
##$VTLIST= <TTTTTTTTTTTTTTT>
##$WBST= 1024
##$WBSW= 4
##$XGAIN= (0..3)
0 0 0 0 
##$XL= 0
##$YL= 0
##$YMAX_a= 326791
##$YMIN_a= -326029
##$ZGOPTNS= <>
##$ZL1= 120
##$ZL2= 120
##$ZL3= 120
##$ZL4= 120
##$ABSF1= 16.522
##$ABSF2= -4.171173
##$ABSG= 5
##$ABSL= 3
##$ALPHA= 0
##$AQORDER= 0
##$ASSFAC= 0
##$ASSFACI= 0
##$ASSFACX= 0
##$ASSWID= 0
##$AUNMP= <proc_1d>
##$AZFE= 0.1
##$AZFW= 0.1
##$BCFW= 0
##$BC_mod= 0
##$BYTORDP= 0
##$COROFFS= 0
##$CY= 12.5
##$DATMOD= 1
##$DC= 0
##$DFILT= <>
##$DTYPP= 0
##$F1P= 14.0000005364418
##$F2P= -0.99999901652339
##$FCOR= 0.5
##$FTSIZE= 32768
##$FT_mod= 6
##$GAMMA= 0
##$GB= 0
##$INTBC= 1
##$INTSCL= 1
##$ISEN= 128
##$LB= 0.3
##$LEV0= 0
##$LPBIN= 0
##$MAXI= 10000
##$MC2= 0
##$MEAN= 0
##$ME_mod= 0
##$MI= 0
##$NCOEF= 0
##$NC_proc= -6
##$NLEV= 6
##$NOISF1= 0
##$NOISF2= 0
##$NSP= 0
##$NTH_PI= 0
##$NZP= 0
##$OFFSET= 16.522
##$PC= 1
##$PHC0= -52.7239
##$PHC1= 5.500786
##$PH_mod= 1
##$PKNL= yes
##$PPARMOD= 0
##$PSCAL= 4
##$PSIGN= 0
##$REVERSE= no
##$SF= 250.13
##$SI= 32768
##$SIGF1= 0
##$SIGF2= 0
##$SINO= 400
##$SIOLD= 32768
##$SREGLST= <1H.DMSO>
##$SSB= 0
##$STSI= 32768
##$STSR= 0
##$SW_p= 5175.98343685301
##$SYMM= 0
##$S_DEV= 0
##$TDeff= 65536
##$TDoff= 0
##$TI= <Analysis number 999999
Compound Code 99
Book Reference 9
Project Code 9>
##$TILT= no
##$TM1= 0
##$TM2= 0
##$TOPLEV= 0
##$USERP1= <user>
##$USERP2= <user>
##$USERP3= <user>
##$USERP4= <user>
##$USERP5= <user>
##$WDW= 1
##$XDIM= 32768
##$YMAX_p= 486918565
##$YMIN_p= -847954
$$ End of Bruker specific parameters
$$ ---------------------------------
##NTUPLES= NMR SPECTRUM
##VAR_NAME=  FREQUENCY,     SPECTRUM/REAL,   SPECTRUM/IMAG
##SYMBOL=    X,             R,               I
##VAR_TYPE=  INDEPENDENT,   DEPENDENT,       DEPENDENT
##VAR_FORM=  AFFN,          ASDF,            ASDF
##VAR_DIM=   32768,         32768,           32768
##UNITS=     HZ,            ARBITRARY UNITS, ARBITRARY UNITS
##FACTOR=    0.157963299565203, 1,           1
##FIRST=     4132.6476996994, 0,             0
##LAST=      -1043.33573715361, 0,           0
##MIN=       -1043.33573715361, -847954,     0
##MAX=       4132.6476996994, 486918565,     0
$$ Real data points
##PAGE= N=1
##DATA TABLE= (X++(R..R)), XYDATA
$$ [...]
22855C26006n2630j31030j93096o6401L3413M5889J75317J92939k16471k80769
22845a66833k4761m8196n9838j36446R1502K11138m5527J52500j64147j75569
22835c66177J69870K53638L6945l4828J60302j52236J63303j33347n6870k04003
22825a63403r4350j99248k32811P4209L61985K18568J12645j23225k80205M5505
22815b80330J96094k14311m7712p8183n417J62925N3624M9603K3236j69374L54200
22804D4355J07777q1108J58498K6457L9563q3831k63014J7223j47527j87425K1113
22793c47919K60798p5254n2956P4263k00567o5129l0768N1425J15939j16405M762
22782c81811K7518J15435N4421J81484R7465R5838k8060k02503O3607p870J35269
$$ y = [326006, 273376, 142346, -50750, -117151, -83738, -37849, 137468, 330407, 113936, -166833, -191594, -239790, -299628, -436074, -344572, -133434, -178961, -26461, -190608, -366177, -196307, 57331, 94276, 59448, 219750, 67514, 230817, 97470, 40600, -163403, -257753, -457001, -689812, -615603, -253618, -35050, 77595, -45630, -325835, -280330, -84236, -298547, -346259, -424442, -429859, -266934, -213310, -163707, -140471, -309845, 44355, 152132, 71024, 229522, 255979, 295542, 211711, -51303, -34080, -181607, -369032, -347919, -87121, -162375, -215331, -141068, -341635, -406764, -437532, -386107, -270168, -386573, -381811, -354293, -238858, -184437, -2953, 94512, 190350, 162290, -40213, 23394, 15524, 150793]
22771A50793K5386Q1840k743R9347J34153r7737r463Q5550j78027j98714j38849
22760d8464K6350K38507j27842j5996K84980n7869N793j71540j6796N1199j55886
22749A2436j2559P6540p8494k9141J0013J9728J3947m8331j03585M5729L5788
22738e7929J25351L16953Q4909N5905n4606l8087j63100l65248j41694J46952
22728i0594K37439j81724k36148j06178K02114J86361J49009J28479O8360j36920
22718B20198j22430j44977q1278P9004L4159j80259k5500J37268j92416j92617
22708d68848k46769J78787M73837J45879q2033p3502O0210j94497j53410K50049
22698a10297J4922N3391p0113K7233L4130o2827Q6076J31961j62833l01655J05364
$$ y = [150793, 176179, 258019, 255276, 354623, 488776, 391039, 381576, 467126, 289099, 90385, -48464, -22114, 216393, 88551, 72555, 357535, 299666, 305459, 133919, 117123, 168322, 12436, -123, 76417, -2077, -31218, -21205, -1477, 12470, -35861, -139446, -93717, -57929, 67422, 384375, 469284, 525189, 470583, 432496, 269396, -95852, -237546, -90594, 146845, -34879, -271027, -377205, -175091, 11270, 160279, 288758, 357118, 220198, 97768, -47209, -128487, -49483, -15324, -195583, -221083, -83815, -276231, -468848, -715617, -536830, -62993, 82886, 853, -72649, -12439, -206936, -360346, -110297, -95375, -41984, -112097, -84864, -50734, -113561, -27485, 104476, -58357, -360012, -254648]
22687b54648j3921j04689L117m351J67110J87824m9087q7778j32090J442j70941
22676d58012J10571O9857J14023M00312O8309q3214n08634k26659p0710l7017
22666f21174L76475L53078J83443k63463j61456J08693j44613n5361J08522J67070
22656E1214k88303k58693j13066L86K24794M3253J86161P0255j49087k34805O76
22645d67215K7429m4189Q3560R6335L1739j9218J17602J16457O8754K75805K06495
22634D93554r6720m03158p7098L9379K37394K53141L4034p7915j61184l29730
22624h8303N2532J43081o543K21673J87029j43812k45541j18365l9044K891J46665
22613A12263N0108J11198O4838j63197o5095K0154j38325j47160j19025n0598
$$ y = [-254648, -268569, -373258, -370141, -374492, -207382, -19558, -68645, -156423, -288513, -287071, -458012, -347441, -277584, -163561, 236751, 305060, 221846, -286788, -513447, -584157, -621174, -244699, 108379, 291822, 28359, -133097, -24404, -169017, -224378, -115856, 51214, -237089, -495782, -608848, -608462, -383668, -340415, -154254, -83999, -233086, -467891, -467215, -439786, -483975, -400415, -304080, -272341, -291559, -173957, -57500, 11254, 287059, 493554, 396834, -6324, -83422, -44043, 193351, 446492, 480526, 402611, 241427, -88303, -35771, 107310, 100767, 322440, 509469, 365657, 120116, 1751, -37293, -34402, 112263, 162371, 273569, 338407, 175210, 110115, 130269, -8056, -155216, -274241, -324839]
22603c24839K75780K79231p2001j94505k5216j55397j47401K59893L44459K5094
22593B65098k53259k54885K881L3590J90961J68997J21732q4918k2588J1485k85687
22582a06593J9689Q1547j06381j6579J8184J77247O1223q160J2664k68314l3280
22571a68753N6328l7607R2911K9142m7983j36889l1247Q9683K6423k04688J04600
22560b28080K27507j84529O2208K2810n5595k7808m070J28750J5845j36686K7651
22549a51997k85712J8943M72703Q4375j14974J8995j28455k39995j61913p3061
22539e61091J14939J11478R0044L8623k8932j73874l9807L9598J00126J18329
22529a90567K7745j07674K16084j32629m9456n5220m4661J50627N3636M790N4954
$$ y = [-324839, -49059, 230172, 158171, -36334, -61550, -216947, -364348, -104455, 240004, 265098, 11839, -243046, -240165, -206575, -15614, 153383, 275115, 190197, 167609, 179094, -106593, -86904, -5357, -111738, -128317, -110133, 67114, 128337, 120177, 132841, -135473, -168753, -112425, -150032, -57121, -27979, -75962, -212851, -244098, -154415, -127992, -332680, -228080, -573, -185102, -122894, -100084, -155679, -183487, -187557, -58807, -42962, -179648, -151997, -437709, -418766, 53937, 138312, 23338, 42333, -86122, -326117, -488030, -561091, -446152, -334674, -244630, -206007, -234939, -408813, -448620, -409022, -308896, -190567, -162822, -270496, -54412, -187041, -236497, -291717, -336378, -185751, -132115, -127325, -72371]
22518g2371O750J4915k14127p0761J39148R9437L4197j55705j893j4816J01361
22507a33865j1067n3178J31058N3855j70687l45788j47846l7128J63853K59107
22497b91686K0833J73486K53903J12201j84552j53983J41207K1701k8487q9929
22487b5306j96832j42635j36168J24945L13520L4763j13904j1289Q674o7821R8976
22476a13077K42233l2978J17658L1916j16998j08913j65107J1009K1850j1845
22466a24252m0086j00674N3395o2992M6899J14803Q0909p5690r2209j12179j04249
22455d16325L2354m530j53559J6084K06015K30405K1297R7862n5855K971n2472
22444g5753j16875O9533q1948J86708o7762j93371j62426k18653K46090J27231
$$ y = [-72371, -65621, -50706, -264833, -335594, -196446, -97009, -62812, -218517, -220410, -235226, -133865, -144932, -198110, -67052, -13197, -183884, -529672, -677518, -714646, -550793, -291686, -270853, -97367, 156536, 268737, 84185, -69798, 71409, 93110, 64623, -25306, -222138, -364773, -500941, -375996, -62476, -27713, -141617, -152906, -144232, -212053, -113077, 129156, 96178, 213836, 245752, 128754, 19841, -145266, -134257, -112407, -124252, -164338, -265012, -211617, -274609, -227710, -112907, -31998, -107688, -199897, -312076, -416325, -383971, -388501, -542060, -525976, -319961, -89556, -68259, 29603, -26252, -23281, -75753, -192628, -123095, -205043, -18335, -86097, -279468, -441894, -660547, -414457, -287226]
22434b87226k15737J14876R8016J25743k1062J07565R9679L695l3860O1584O3656
22423A16929j6613q3146Q0288j89684r6314j33499J09014K16936m7165j22462
22413a65716K68532J18145K7380k06255j646j0009k75198J24807K43439M194q823
22402A18850n8681j9251o419K7305l4499O6114M9220r6111J16058j61466p6608
22391g5488R4010J5626j79103L3629O4409R6799J41073J13790j24805j68364k15723
22380b04147J51388J48436N7874j67138j01440P0486J10012J56703O4480j9244
22370B67410J43071K17707l0943j50928j37027m7123j60300J07388L00317J04187
22360F13759k72849R0729j11021k77168J31365P075r4067j2911R875J8702j27954
$$ y = [-287226, -502963, -388087, -290071, -164328, -185390, -77825, 21854, 25549, -8311, 53273, 116929, 100316, 17170, 97458, -92226, -188540, -322039, -213025, 3911, -43254, -165716, 102816, 220961, 248341, 42086, 40440, 30431, -244767, -119960, 123479, 127673, 118850, 60169, 40918, 34499, 61804, 27305, 93419, 142639, 46528, 162586, 1120, -75488, 18522, 34148, -144955, -111326, -46917, 49882, 190955, 304745, 179940, 11576, -204147, -52759, 95677, 153551, -13587, -115027, -44541, 65471, 222174, 286654, 267410, 410481, 628188, 597245, 446317, 309290, 262167, 101867, 209255, 509572, 613759, 340910, 431639, 320618, 43450, 174815, 181890, 87823, 74912, 84787, 103489, -24465]
22349b4465k46341J36572J00830j80344o8574J10039m7152r8808K20403J16272
22339A8432M2514j4367L2520m6884j47891j21621K40287M5463P0009J05315l11183
22328h7406j79402N544L68313l2073L1571L3592o9000k99968j0164O4879j07788
22317b81902R7454K24920q4211j02622J64709M5387J42250j16801j39501j03271
22307a53588n2335N1133q794J32388n0127k89374j56092J00208q0246K76483J30777
22296i9567j50992L30242L55332j5098j84846r4369r8633J18567k3053p0144R8970
22285A66409K630k56397J41797j40411l9983j59369j51785K61881P8966j29821
22275b26083L9485P8131J65043J25833K20183j94623k30521j16377j29553L5554
$$ y = [-24465, -270806, -134234, -33404, -213748, -282322, -172283, -219435, -318243, -97840, 18432, 60946, 46579, 79099, 32215, -115676, -237297, 2990, 48453, 118462, 223777, -87406, -266808, -261264, 107049, 74976, 106547, 140139, 71139, -228829, -238993, -174114, -281902, -184448, 40472, -43739, -146361, 18348, 63735, 205985, 89184, -50317, -153588, -205923, -154790, -163584, -31196, -81323, -370697, -526789, -426581, -506827, -230344, -99567, -250559, 79683, 435015, 419917, 235071, 140702, 42069, 160636, 137583, 67439, 166409, 169039, -87358, 54439, -85972, -125955, -285324, -437109, -175228, -96262, -226083, -186598, -108467, 56576, 182409, 402592, 207969, -22552, -138929, -268482, -232928]
22265b32928J09861j3018J68535K8168j07541l3108q3918J18806J26799j85717
22255a04061M0547n9216j54424J06311p6915j817K27998M7788L1142M6611J12638
22244B16602J49324k93656j09179k23120n0723K5481J09114K23017J31900l2242
22234A46518j49724o2928r4821l1149l123m9242O8963L0084p1491L5251O0866
22223a20796L8085J88385j3814J09510P8340j32649k60734O216j0229r422J51626
22212B4518J64358P3092j80969j31294Q2812Q4545m0255p9223k73714K37447M93093
22201D54410j03299k67035P3021O633J92053r0375l59652J23683k895O1363m5098
22190D2809J14231k93760m7116N3002p9535J89778L21796l0461l82867O4041J81688
$$ y = [-232928, -123067, -136085, 32450, 60618, -46923, -80031, -163949, -45143, 81656, -104061, -63514, -122730, -277154, -170843, -247758, -249575, -21577, 26211, 57353, 103964, 216602, 365926, 72270, -36909, -260029, -310752, -285271, -176157, 46860, 178760, 146518, -3206, -66134, -160955, -192104, -195227, -244469, -175506, -145422, -216913, -181662, -120796, -82711, 105674, 91860, 201370, 279710, 147061, -113673, -107457, -117686, -127108, 24518, 188876, 261968, 80999, -50295, 32517, 117062, 76807, -2416, -276130, -38683, 454410, 351111, 84076, 157097, 163730, 355783, 265408, -94244, 29439, 26544, 87907, 42809, 157040, -136720, -183836, -130834, -210369, -20591, 301205, 270744, -112123, -48082, 133606]
22179A33606O343j61068m10718j74132k4663j13739l3772K18308L24160Q3750
22169a51925l5157P6388k30863l4349J03809L16934P3686k60360k08236J38439
22159b11634j0174l2586J28962M3657q115K93701K05076k26062n4880J21341J14240
22148C63526m1504j08148P6126j12513k40844k00660l0830j29769o5935K83980
22138b06571M12936J48180j6665j4085j40280k57720k54139K3637J81049J45833
22128B2175q9822n3793l3789K27564J86072m1331j48689j09789R3256l7378o4195
22117d9719l1286J72598R6784j05542q2206k58201j41986m9424Q1829O7272M32486
22106A32605n8895m7294J6391k15783j15571K49182k4878j35369m6991n0285J20148
$$ y = [133606, 139949, -21119, -431837, -605969, -630632, -744371, -778143, -559835, -235675, -151925, -187082, -110694, -341557, -375906, -272097, 44837, 118523, -141837, -350073, -211634, -221808, -254394, -125432, -81775, -89890, 203811, 408887, 182825, 127945, 249286, 363526, 322022, 213874, 290000, 177487, -63357, -264017, -294847, -424616, -490551, -206571, 206365, 354545, 337880, 323795, 183515, -74205, -328344, -304707, -123658, 22175, -67647, -121440, -155229, 72335, 258407, 217076, 68387, -41402, 51854, 14476, -49719, -81005, 91593, 188377, 82835, 629, -257572, -399558, -448982, -367153, -299881, 132605, 73710, 26416, 42807, -172976, -288547, -39365, -64243, -199612, -246603, -296888, -176740]
22095a76740n2733J03698Q2217J19658j27738j38249q42J41566m631k7090J75209
22084I4325J45855L1714j77892R6869j30768k12360j74749j17900K33173J47204
22074f4529j01990j07251m4605J58600m3292O5336J3355j12519K16040L3969J22775
22063A35889N2721l3315J6046O4093J53793k09407j14387p7152k08527J066K07032
22052a2148m177k3544K36648q8377k09938j67121q7374N5849K2474N1587k0794
22041b46915J41184j15943j55622O5950M41911j7080k28295K6753j88726J52725
22031a24058J27861N8014j27995j52101j23812m1707P0740L66074Q4872N0556
22021A88444j31174k76859p8476l3557J44238J72629K48491P9561L729p7730K34292
$$ y = [-176740, -229473, -125775, -43558, 76100, -51638, -189887, -190729, -49163, -53794, -80884, 94325, 240180, 271894, 94002, 190871, 60103, -152257, -327006, -444906, -211733, -64529, -166519, -273770, -318375, -159775, -203067, -137731, -124376, -236895, -20855, 13114, 135889, 188610, 155295, 171341, 235434, 389227, 179820, 65433, -11719, -220246, -219180, -12148, -16325, -39869, 196779, 108402, -101536, -268657, -356031, -300182, -277708, -226121, -246915, -105731, -221674, -377296, -311346, 130565, 113485, -114810, -88057, -276783, -124058, 3803, 61817, -66178, -218279, -342091, -383798, -313058, 53016, 137888, 188444, 57270, -219589, -298065, -331622, -187384, -14755, 233736, 313297, 317026, 239296, 473588]
22010D73588j99259k35518J52262P074l47892j81210P2983K16081P7198K10693
22000B46000R6780k22285j49967J20030K94509k50472k30822j43234j5026O8396
21990a86091O3942P7796n0898j26385l0349J80491l5926N4708K8767J85750N9785
21979B21590k75037l189L77586K44409r1288j77089j54935j06615k15593N126
21969a75035J65318J85893n7681K28681O530p4219j47010k69605R7852N6632j44279
21958a26923j93960J52451n4714Q5040L17725L55673j47844k28627K8888M2641
21948B30350j81611L709J63907L6289j25628N0149O2536o6593J7232M2392N6375
21937B89107j22006n0749J05790j14432q9954L5739j68307o7389J9879k1851L1992
$$ y = [473588, 274329, 38811, 191073, 198147, -149745, -330955, -257972, -41891, 35307, 246000, 342780, 120495, -29472, 90558, 385067, 134595, -96227, -239461, -254487, -186091, -122149, -44353, -95251, -221636, -251985, -71494, -107420, -52712, -23945, 161805, 221590, -53447, -56636, 320950, 565359, 474071, 296982, 142047, 35432, -180161, -175035, -9717, 176176, 118495, 347176, 353706, 279487, 132477, -137128, -39276, 17356, -126923, -320883, -168432, -223146, -138106, 179619, 535292, 387448, 158821, 187709, 230350, 48739, 52448, 216355, 252644, 127016, 177165, 239701, 173108, 190340, 232732, 289107, 167101, 116352, 222142, 107710, 17756, 53495, -114812, -182201, -162322, -184173, -152181]
21926a52181j17255j4008K02081o4932j65590J12251R9972J89J95166j1444q5778
21915a529K3356O9503k33729J01290J68396k5138n4048O0299M7852L2017p7667
21904A10602k5264J34347J12753N886j03018m5006m5389q2923j35787j99153J31133
21893a41819P1284J62457J42618k85802j40091J56696O9688J28141K87623R4855
21883E45650k13727k42816m7430J30504j33527j65405o8264k2693j19681o7990
21873d05379K25714K62415K4391j61291j48444r6584P2445J49912M8934j79992
21863b07879j19081J09592q1822q3076J35257J19007O1323K45011j47926l82858
21853c52452n2406Q304K30999P178l23246j01735K76914K63571K56032O2033j77282
$$ y = [-152181, -269436, -283444, -81363, -146295, -311885, -199634, -99662, -99473, 95693, 84249, -1529, 21827, 91330, -142399, -41109, 127287, 102149, 48101, 108400, 156252, 188269, 110602, 85338, 219685, 332438, 338324, 235306, 190300, 144911, 61988, -73799, -272952, -141819, -70535, 91922, 234540, -51262, -191353, -34657, 35031, 163172, 450795, 545650, 331923, 89107, 41677, 172181, 38654, -126751, -195015, -217708, -337389, -405379, -179665, 82750, 107141, -54150, -202594, -299178, -226733, -76821, -27887, -207879, -326960, -217368, -299190, -382266, -247009, -128002, -66679, 178332, 30406, -352452, -404858, -396554, -165555, -158377, -481623, -583358, -306444, -42873, 213159, 275192, 97910]
21842I7910l26307R8436K00695J6521R4627J23178J00552O8242J25935k90885
21832C08904p2891o9402l42919k81237Q425M4771L30023K72995N6045j20189k19535
21821h5010k2099p7113k9629j39695J16494M8230N9260n1844K88984P3290K06469
21810C87337l0781k14980N3702L03072K7900k26852l13176j17888k15128n2159
21800c98953J34667L01317J68325N6842q4046p7092P5860R9576j80134j41422
21790d5060P8849q6875k1727R9613J42443L7684j25112J16388R1508j14968j794
21779A70949J07865J96224j52217k06073k1541J49953Q9455j95177l52418o6380
21769b79360Q5239K49936J56452J22305l30897j17198K50810N6214O670j13975
$$ y = [97910, -228397, -129961, 70734, 87255, 181882, 305060, 405612, 473854, 599789, 308904, 236013, 166611, -176308, -457545, -449120, -404349, -74326, 198669, 254714, 134525, -85010, -107109, -184222, -213851, -353546, -237052, -188822, -129562, -181406, 107578, 180868, 387337, 356556, 141576, 195278, 498350, 526250, 299398, -13778, -131666, -346794, -398953, -264286, 37031, 205356, 262198, 178152, 101060, 176920, 276496, 96362, -45060, 33789, -53086, -74813, 24800, 167243, 204927, 79815, 196203, 287711, 172743, 170949, 278814, 475038, 322821, 116748, 95207, 245160, 334615, 139438, -212980, -279360, -194121, 55815, 212267, 334572, 3675, -113523, 137287, 193501, 200171, 86196]
21759H6196l6757L8565L8359l26962j08037j44947n2353K02200L41287J79382
21749B16933k1366o4036j35704p5096J3746J47995R198j20583l3033L14788p327
21738B45515K30284k97062j51014K20570l4816j58416j57789k54343J2873L683
21728c40515p8878K41169R1911j39050j9492J59017l0668j55632L9261k4516P0204
21717a87189M8802j44453j27717M1597n6456J02253j22632K69369j03148l9809
21707c19383Q8189q3153K87935Q1557j08671j27518j08892J65719r5739O122J67719
21696d6115K23026j4759j77992q0517o0061O4442J51260j76406n2714J15800j05754
21685a59790J62037J47890J28504J37928j09261j90297j3914K3957j411r1537
$$ y = [86196, 49439, 88004, 126363, -200599, -308636, -453583, -505936, -303736, 37551, 216933, 195567, 131531, -4173, -79269, -65523, 82472, 91670, -28913, -61946, 252842, 245515, 475799, 178737, 27723, 248293, 213477, 55061, -102728, -357071, -344198, -340515, -419393, -178224, -86313, -225363, -244855, -85838, -116506, -272138, -232877, -257393, -187189, -138387, -282840, -410557, -368960, -425416, -323163, -445795, -176426, -279574, -319383, -231194, -314347, -26412, 55145, -53526, -181044, -289936, -124217, -219956, -213834, -46115, 176911, 162152, -15840, -96357, -156418, -91976, 59284, -117122, -169836, -54036, -159790, 2247, 150137, 278641, 416569, 307308, 117011, 103097, 127054, 125643, 34106]
21675C4106l8260o1996l7688n9373M7779J12825k20275R0515k5487j54328j41803
21664d53985O848J19311J17882J18841J32049j77865n4290J76803m5613m8622
21654a08641l0216P0035K70175r2088k56288J17905K07699j29050L3656m4417
21644C8770Q7822j12363n6061j61864k65051K21581R5479q9147O3431j21780q2807
21633c81990L2791o507J97278J46766r8828j28026p8089Q3052n2258l7957L1022
21622b92746j16496l8179L03587L2405j10335J01554N1580J26787j23687j65280
21612b30810Q5054j46471k5366J52719l8634R1471J60862o4056K4914j56155P679
21601a38793L11452J72256j27692m35622l75802J90164K63593J74939k0858K9809
$$ y = [34106, -4154, -66150, -103838, -163211, -115432, -2607, -222882, -132367, -157854, -312182, -453985, -447137, -327826, -209944, -91103, 40946, -136919, -191209, -14406, -60019, -108641, -138857, -68822, 201353, 109265, -147023, -29118, 178581, 49531, 83187, 38770, 126592, 14229, -41832, -203696, -468747, -247166, -151687, -240834, -177403, -299183, -381990, -349199, -355706, -158428, -11662, -110490, -238516, -316605, -233553, -285811, -323768, -292746, -409242, -447421, -143834, -111429, -221764, -120210, -68630, 58157, -65530, -230810, -145756, -292227, -317593, -164874, -203508, -112037, 48825, -15231, 9683, -146472, -138793, 172659, 344915, 217223, -218399, -594201, -404037, -140444, 34495, 13637, 43446]
21591D3446j4348P3010j1375K1425k8223k8683m5809k06102k09300M798N4170
21580c46991J9842P1630j36682l6876J18406n1834K5789j51499j42090o612K0352
21569f16565N5702J8373j8073J57194K93875K74052j1884r7499j73850K0785J63520
21558F5630j34010J14149l653K0847k5081j03321k03939q646O1771L9055K09594
21547C2396m0191o9627j12080m4003J41228J04244k37814k55511Q9373J80015
21537b11970j65860R383K87588J18636j88600r5073l7661K61548L63382N0228
21527C91601k06584O3613J29423P9123n1220k97661l72782j79211o9637O2924
21517d50411J50267J34086R7542J16202j61030Q3882J28721N9270M2442j06500
$$ y = [43446, 29098, 102108, 90733, 112158, 83935, 55252, 9443, -196659, -405959, -401161, -346991, -327149, -255519, -392201, -429077, -310671, -362505, -336716, -488215, -630305, -636917, -616565, -560863, -542490, -560563, -403369, -109494, 164558, 152674, 55175, -118675, -97890, 65630, -68380, 45769, 42116, 62963, 37882, -65439, -269378, -278024, -216253, -177198, 32396, -7795, -77422, -189502, -233505, -92277, 11967, -225847, -481358, -391985, -211970, -377830, -368447, -80859, 37777, -150823, -245896, -283557, -22009, 341373, 391601, 185017, 248630, 378053, 457176, 405956, 108295, -264487, -443698, -513335, -450411, -300144, -166058, -68516, 47686, -113344, -29462, 99259, 158529, 200971, 94471]
21507I4471q8138N3252K616j17498K8823J21045j96666j30280R2399J76640j21076
21496h4412j3029k19864l02791J91347L04654J00141J6659l8001j00888R7380
21486d8804o7547j29309N1976q1655P2247K8301P4836n2893j08307o8066L8065
21475b91156l0988M3914l7759m9964K16851P7116m1293J59192J70607n2546k34886
21464g0912M3250P5047j58467P6899j56777k8882M1135P2273K51610J82545j0221
21453C17500j47462J5250J77518l45956k40279m8668j16574J74787P88J54802
21443e8294L14301j74573l24039q8872N3755P6275j03948m5569K8419J2329P9725
21432b30491n3376k60533k2883K70638K00931j32720j76624K0423j23788l3134
$$ y = [94471, 6333, 59585, 62201, -55297, -26474, 94571, -102095, -232375, -139976, 36664, -84412, -97441, -317305, -620096, -428749, -124095, -23954, -7295, -45296, -146184, -48804, -116351, -245660, -193684, -275339, -203092, -174791, -99955, -152848, -261155, -329221, -291156, -322144, -278230, -315989, -365953, -149102, -71986, -113279, 45913, 216520, 163974, -70912, -27662, 47385, -111082, -34183, -190960, -219842, -178707, -106434, 145176, 327721, 317500, 170038, 185288, 362806, 16850, -223429, -272097, -388671, -213884, -213096, -58294, 256007, 81434, -242605, -331477, -277722, -201447, -305395, -350964, -322545, -310216, -230491, -283867, -544400, -567283, -296645, -95714, -228434, -405058, -384635, -508423, -541557]
21422e41557J68351K85579j0580J70143J15931p7302p9904l6994p204k64886k10508
21411d88931J84175K15770j52791k0978p1046j67957L76253L91977P1353j09466
21401B28359q7670j81658k47147q8891L8767J65668j792N0618J57480R0200j63130
21390c9196J33109r2834k11305k7926O2869j44305o5670O5800J93542L40117J99533
21379D13734l54836l12012k09403N8014K94678o270o9050K96487N9259j34889
21369C5712j16114k41995r1422J03843J58345J07636k17860l1454L11167n1520
21359c3662o3710j28938n7815K7552P8674M2499N7571O1496l775r1167q6850M8048
21347a50077r7409J2134J81621O5202l48884m5369J13613J87132K2735j48008
$$ y = [-541557, -373206, -87627, -98207, 71936, 187867, 110565, 30661, -6333, -13537, -278423, -488931, -304756, -88986, -241777, -262755, -333801, -501758, -125505, 266472, 337825, 228359, 140689, -40969, -288116, -377007, -338240, -172572, -174364, -123746, 33734, 123934, -39196, 93913, 1079, -210226, -238152, -175283, -319588, -385258, -319458, -125916, 214201, 413734, 58898, -253114, -462517, -404503, -109825, -116095, -185145, 111342, 170601, 35712, -80402, -322397, -413819, -309976, -151631, -43995, -261855, -293309, 17858, -33662, -97372, -226310, -284125, -256573, -177899, -135400, -77829, -16333, -20108, -111275, -198125, -150077, -247486, -235352, -53731, 11471, -337413, -382782, -269169, -82037, -59302, -207310]
21337b07310J51822K46248j29364l44985j36167J26518J98153j30972j93967j24375
21327e44399K911J37867J77811K33620Q5304m30795o1254K24701J962l8311J74115
21316c6468N1802J20952K24826R3528j03690j26110j92633k25943K5099Q0467
21306h8170J56384K3713O1804q2234J9898J12479k33197k55224j50367J33207
21296c01707l5633k8873R6481L91844Q1l71973J804j8295o1513q7320j89932J86960
21284d18076J20298N0773l7875j69402k4363M12315P2903J08387J05841l25039
21274a04238K2799J27966j64804J3193k3705R366J34062R2495J01594j07401q6204
21263A5123L6470j25556r2338n0097O8024Q1945J85295J8108n1574q7795q4309
$$ y = [-207310, -55488, 190760, 61396, -283589, -419756, -293238, -95085, -226057, -420024, -544399, -541488, -403621, -225810, 7810, 93114, -337681, -398935, -174234, -172272, -210583, -36468, 15334, 136286, 361112, 454640, 350950, 224840, 32207, -193736, -168637, -88170, 68214, 91927, 153731, 71497, 91395, 203874, -29323, -284547, -434914, -301707, -337340, -366213, -269732, 122112, 122193, -249780, -247976, -266271, -327784, -415104, -605036, -418076, -297778, -247005, -284880, -454282, -478645, -66330, 6573, 114960, 220801, -104238, -81439, 46527, -118277, -105084, -128789, -119423, 14639, 107134, 208728, 101327, 15123, 51593, -73963, -166301, -216398, -148374, -66429, 118866, 136974, 85400, -2395, -86704]
21252h6704R3985k061J61900J9728P870j9299N474k2153r8505n3008m5967J5584
21240b3156j30531j39380k25541j78928o7505O5982K79917K71346L14804J14109
21230B81117J9631k06293k00407o6489L0140R9160k9296r1559j3855k44307n3323
21219d75481r9698j9462L07016K68633j49550p0152J13538j16716J08773q2449
21209b15548q0608L33905J43370k08568o587K60309J22897j00033q6098j68174
21199e135K3654o0618j31378M3909R8037J57968r2791p2960Q521R0934k71237
21188b11096j87581K22049j62032J65832L42867J18401M5479J0638J3346l31038
21178B6865m01128K6535L22713j02284j26384J932j00910N687P0934k9235Q0738
$$ y = [-86704, 7281, 5220, 167120, 186848, 194718, 175419, 180893, 158740, 60235, 7227, -38740, -23156, -153687, -293067, -518608, -697536, -765041, -699059, -419142, -147796, 167008, 281117, 300748, 94455, -105952, -172441, -142301, -43141, -72437, -163996, -177851, -422158, -475481, -575179, -594641, -287625, -18992, -168542, -238694, -125156, -241872, -133099, -215548, -296156, 37749, 181119, -27449, -34036, 226273, 349170, 249137, 163039, -5135, 18519, -42099, -173477, -129568, -31531, 126437, 33646, -39314, -30793, 60141, -211096, -398677, -176628, -338660, -172828, 170039, 288440, 333919, 344557, 357903, 26865, -374263, -347728, -25015, -127299, -253683, -251751, -352661, -346974, -276040, -305275, -224537]
21167b24537k42558M6041J06221K40410K55271J52268j26087l29716j91822J35748
21157a78761m9693j16292j2717K20040K5758J85307l4523J80013L8226K5492q5583
21146A97267o0524L2650j22032j23137Q7930j45516j85474K52341R9462J67265
21136B00232J76379j84695l74357J4893K21859M6466J20865m5517J5035J76537
21126C67697J06384o3882n42794o2330J40796o3672n645K06715L0304j11210j17759
21115a15396m6731j14094J92724N6097k80966N2052K75618R0127j10200k210O1474
21104E8495j04961j8382K9064j0149J71124L9147l66625j13302J0716J91034J8276
21093i5563n3122j6734N1661J5694M0845l6153k20536p0837K4887J69673M1883
$$ y = [-224537, -467095, -421054, -314833, -74423, 180848, 333116, 207029, -122687, -314509, -178761, -228454, -344746, -357463, -137423, -111665, 73642, 39119, 219132, 257358, 282850, 197267, 136743, 169393, 47361, -75776, 12154, -133362, -318836, -66495, 32967, 200232, 376611, 191916, -182441, -167548, 54311, 100777, 221642, 176125, 191160, 367697, 474081, 410199, -132595, -194925, -54129, -117801, -123446, 83269, 113573, 2363, -115396, -162127, -276221, -83497, -27400, -308366, -256314, 19304, 109431, -769, -2979, 58495, -46466, -64848, -35784, -45933, 125191, 164338, -202287, -315589, -304873, -113839, -95563, -148685, -165419, -113758, -98064, -57219, -93372, -313908, -384745, -359858, -190185, -148302]
21082a48302l2537j2114J22064J83277K00179j85743j99011j7185O054J45994
21072F2676o5654j56750p2819M241n0884P6572J84123j48667K0944J04606j37700
21061a79312j16973l597K23646K41033k01654j76938k4258P6819j8434j46254
21051c25922j56916n0298J2333K90158P5079m3653J01470L4572N1907J35390p5604
21040D8516J90230K08646j99810q7287n9123J4220n6185P9966q3842n4222O5274
21029F6383j76602J78628k0395o4141J0720J29902N4598k47245k65758K14803
21019a19107J40639n953l4197j17129j29946J73138l0136P0493P3197N7396J22392
21008B00787j92344k76016q0055J42940j21603l60486J34522L59473K44306p5154
$$ y = [-148302, -180839, -192953, -70889, 112388, 312567, 126824, -72187, -89372, -83318, 62676, -2978, -159728, -232547, -228306, -279190, -202618, -18495, -167162, -146218, -41612, -179312, -296285, -299882, -76236, 164797, -36857, -213795, -238053, -161234, -179668, -325922, -482838, -533136, -520803, -230645, -155566, -199219, -97749, -63177, -11270, 124120, 48516, 238746, 447392, 247582, 160295, 101172, 115392, 59207, 139173, 55331, 1109, 66383, -110219, 68409, 48014, -16127, -5407, 124495, 179093, -68152, -333910, -119107, 21532, 15579, -18618, -135747, -265693, -92555, -122691, -52198, 20999, 78395, 200787, 8443, -267573, -347628, -204688, -326291, -686777, -552255, -192782, 51524, -23630]
20998b3630k54248l4801K43218K32945K3962k52018j45742k87063j50015K55065
20988c92327K09334K46828P9153K58269j65474k72638l33721q3345J92097J41595
20978a20229J12041j7977K0118J44616O2108K8550j64665k43305k46406J90269
20968b34880L03881L6314j25876j58485k28121M9994K85832L16984P1092L6838
20958C53573m5237j56558q5712q8652l4083l872j39673l6520M7199k72382M8145
20947d13772J05584K6098p4426j301j01821r5032J29710J62797J99358o4427n3789
20936a81021o7788j24467J92209n1760n1706J72537J0064k3099J73314l2698j40995
20925a25410M7007K11596j48335j50635K15230K8561M501L5391m20200K8347J15398
$$ y = [-23630, -277878, -312679, -69461, 163484, 187446, -64572, -210314, -497377, -647392, -392327, -182993, 63835, 142988, 401257, 235783, -36855, -370576, -453921, -261824, -120229, -8188, -26165, -6047, 138569, 200677, 229227, 64562, -178743, -425149, -234880, 69001, 105315, -20561, -179046, -407167, -357173, -71341, 245643, 316735, 353573, 308336, 151778, 66066, -22586, -56669, -60541, -200214, -236734, -189535, -461917, -413772, -308188, -282090, -356516, -357817, -459638, -554670, -424960, -262163, -62805, -127232, -181021, -248809, -373276, -181067, -232827, -284533, -111996, -101932, -125031, 48283, 15585, -125410, -78403, 133193, -15142, -165777, 49453, 78014, 82515, 117906, -302294, -273947, -158549]
20914a58549N0818R6341k44890p222L92472j15483p6129q7717n8258m0883M3568
20903b05932J00208j00709j24329q2947L02133K02687n4102k39824j66474J51856
20893b17433L06497R9568K32810j21897k01677n9892j57247N264j71359R8381
20883a86985K47403m9840q5405K41171j81073Q1766L9130o8211K17896j4884l02243
20872f1275n541J20100k20111l32728P1034n4834O5495N246Q4723J28088K71927
20861G2124L23455o967j77806j35622K15712L6252r3992j10250k53197j41267
20851b71558L835J68445n7984q1035L07981P5008l48594k55389K11803J32647
20841a14841K15416j95408o9688J91629J46357l10170j30047J23887n0923n2120
$$ y = [-158549, -107731, -11390, -256280, -263502, 128970, 13487, -62642, -150359, -208617, -249500, -205932, -105724, -206433, -330762, -413709, -111576, 91111, 37009, -202815, -369289, -217433, 89064, 188632, 421442, 299545, 97868, 37976, -119271, -114007, -285366, -186985, 60418, 10578, -74827, 166344, -14729, 67037, 106167, 37956, 255852, 240968, -61275, -66816, 53284, -166827, -499555, -428521, -483355, -417860, -412614, -327891, -199803, 72124, 395579, 388612, 210806, 75184, 290896, 327148, 233156, 122906, -130291, -271558, -267723, -99278, -157262, -238297, 69684, 144692, -203902, -459291, -247488, -114841, 100575, -94833, -164521, 27108, 173465, -136705, -266752, -142865, -193788, -245908]
20831b45908Q3539J68195K66410j6240r4378k51003k14977l2397M2348j71372
20821d65783Q5156J32665Q5167K6040P9112J29957j24546j74483J00117O6418
20811f0180j53566J00717m7332K6933j51685p8387L34620o6566N0211J82439N197
20800A42401k45115j3219o3762J33877N7632J78145K6288l89977j80824p8275
20790d32829N9891L60817M8374J1113J73349q5731k14230Q5614o3198M1807m9291
20779f4314q010o8341l5233K94814o2465k46383J7284P4124Q3057M6031M1002
20768G1566r7489j07015J94668N9134N2808J11025L1349j29311m6452l44585p4243
20757b78545j24982P5311J41505j63416J16613O7577j56615o2581J75385J21883
$$ y = [-245908, -162369, 5826, 272236, 255996, 161618, -89385, -304362, -336759, -294411, -465783, -380627, -247962, -162795, -136755, -57643, 72314, -52232, -226715, -126598, -60180, -213746, -113029, -160361, -133428, -285113, -363500, -28880, -95446, -45235, 137204, 142401, -102714, -115933, -179695, -45818, 11814, 189959, 216247, -173730, -354554, -432829, -372938, -12121, 36253, 47366, 220715, 134984, -79246, 6368, -56830, -15023, -64314, -72324, -140665, -175898, 118916, 56451, -189932, -172648, -98524, -15467, 30564, 71566, -25923, -132938, 61730, 120864, 173672, 284697, 316046, 186735, 140283, -204302, -278545, -403527, -328216, -186711, -350127, -233514, -165937, -322552, -385133, -209748, -87865]
20747h7865J44838r225K9716J59048j93661k48701Q7423O6769q1899Q2275q3616
20736a34898j70583k08528j91323J86726K00434P1194Q6779r7696O8984N2674
20726a36237j3777p7081m0719J17534J33866j65416j7000K26779J40244L002j12798
20715E8397r7959m215K5130k5544n1523N1328j71126Q4777K75700p2o1772L18112
20703D01233Q1341L6817k42155k14315K00000J14094n8549j69022j95531m1762
20693h7849n5617R0954K42439K43671j01903j63268r4321j9904k60470m5104m4989
20682b96361j57057M2053J05318K72953J79479k42786j08179J9932j31664M4087
20672b72225Q4957j8868N3765J05702o4492K0K9103O5101N6370K21607O6484j19557
$$ y = [-87865, 56973, 47748, 77464, 236512, 42851, -205850, -118427, -51658, -133557, -51282, -134898, -305481, -514009, -705332, -518606, -318172, -246978, -160199, -257895, -188911, -136237, -150014, -227095, -267814, -150280, -16414, -181830, -198830, 27949, 168193, 171195, 58397, -39562, -43777, -18647, -44191, -95714, -44386, -215512, -130735, 144965, 144893, 83121, 401233, 482574, 519391, 277236, 62921, 262921, 377015, 318466, 149444, -46087, -87849, -143466, -52512, 189927, 433598, 331695, 168427, 74106, 54202, -206268, -251372, -296361, -453418, -411365, -306047, -33094, 146385, -96401, -204580, -184648, -316312, -272225, -187268, -206136, -152371, -46669, -111161, -111141, -82038, -16937, 39433, 261040, 327524, 207967]
20660B07967K07721K6449j07816p3253j07490k34681k14422j01230J25560R1942
20650a79253K74687J59819q0748j1912j70598k35180r1438J54460J38808l8160
20640g9515m4933j10958j24283l1965L3767K8680k0752J77884L5477j91278p8229
20629d06105K80193J9055J22605K59570r2390q6902k11607j6532r8798r3587j05722
20618d30220K01884P3581J20343M9376m3943k69269j12190J88136K41550l3788
20608a4540m0782k3260m2708j34427j60709K1508m7927k22797K28765K35203O477
20597a95197J40136K44108j39939l38621J96107L6278m6599j24182P8882J19190
20587b9837j68581L33l4739N7138k10827N144J90690J53097l7501j2426n3059
$$ y = [207967, 415688, 442137, 334321, 261068, 153578, -81103, -295525, -396755, -271195, -179253, 95434, 255253, 174505, 162593, -8005, -243185, -334623, -180163, -41355, -79515, -124448, -235406, -359689, -391654, -357887, -329207, -349959, -172075, -136598, -327876, -406105, -125912, -106857, 15748, 275318, 182928, 96026, -115581, -132113, -230911, -324498, -430220, -228336, -154755, -34412, 14964, -28979, -298248, -410438, -222302, 19248, -14540, -55322, -78582, -121290, -255717, -416426, -394918, -442845, -665642, -436877, -201674, -195197, -55061, 189047, 49108, -289513, -93406, -57128, -103727, -227909, -149027, -29837, -198418, -198085, -232824, -175686, -386513, -381369, -190679, -37582, -75083, -87509, -140568]
20576a40568R3771k63628j08145K03712J45594J04917P4368j59166l2460R0095
20566H490k4862r8064J9569j4409L22429L8691M2888J17109j12481m8338p8943
20555A72079k13246j88020L9516J4126J17464m4287P0401j24132K4641k41594
20545c73052p0292j3882J94132J43586J14973J9759j00876n3915j62394j61732
20535d63693m1173l0872J08810L42859j58848J55696J45104k40238J1281K27827
20525E6753J80226k67514j70730N2343j9513p904N8353n9957j8409o8337o2502
20514c27191l620J90913J10636o5755o0992r44j9249j68406K4200R4077R3319
20503a33012m546J81094J05911j08305O3353p2061j14850j78483n1517o3981K0244
$$ y = [-140568, -46797, -310425, -418570, -214858, -69264, 35653, 110021, -49145, -81605, 8490, -16372, -114436, -94867, -109276, 213153, 251844, 294732, 411841, 299360, 251022, 172079, -41167, -229187, -189671, -175545, -58081, -102368, -31967, -156099, -131458, -373052, -443344, -457226, -263094, -119508, -4535, 15224, -85652, -139567, -301961, -463693, -504866, -535738, -426928, -84069, -242917, -87221, 57883, -182355, -171074, 56753, 236979, -30535, -201265, -148922, -168435, -176339, -117986, -177943, -196352, -264689, -327191, -330811, -139898, -29262, -95017, -156009, -156953, -176202, -344608, -320408, -226331, -133012, -137558, 43536, 149447, 41142, 104495, 32434, -82416, -260899, -312416, -376397, -356153]
20492c56153J8942N0178J35656K2662L20674k2555p9190k07643p5284R1596J36110
20481C4993o8604l46955l27107R548L22010K10163M6874M2416j24576J231O336
20470a93671N6610J77322O2998K0226K23771J05173L1099o472l31471j62351J56220
20459A39454j37343r673q7472r7850n967R2311j7743J55738o37o9448o8289p0303
20447a77222K7971P2723Q2833j13127j1592k23721Q8380L2409j63150J73905L79403
20436A68812k207k67998j18593r7638j17995o9422J33866O2111l688j94505J00758
20425d06499J82865l870Q0285j1628j78033j91242J52837M19530J24630j05978
20415F2897m8105r8956O4875n8432J74117j30394J8858K17333k5362N3682r5928
$$ y = [-356153, -337211, -287033, -151377, -128715, 191959, 169404, 90214, -117429, -192713, -101117, 34993, -33611, -380566, -707673, -698125, -376115, -165952, -119078, -76662, -201238, -200007, -193671, -137061, 40261, 103259, 123485, 347256, 452429, 483528, 477056, 145585, -16766, 139454, 2111, -7562, -95034, -192884, -198851, -106540, -124283, 31455, 30818, -38630, -106919, -177222, -149251, -76528, 6305, -106822, -118414, -342135, -253755, -221346, -384496, -210591, 168812, 166605, -101393, -219986, -317624, -435619, -505041, -371175, -309064, -312752, -507257, -406499, -223634, -227504, -147219, -158847, -336880, -528122, -375285, 44245, 168875, 62897, 14792, -84164, -19289, -77721, 96396, -33998, -15140, 202193, 176831, 230513, 134585]
20404A34585l12276o1767K26663J96819q4471o8188j9988j60000r8694l500l9615
20393b90432L22348J73623k05963j76370N1623j65329k10081J76073J8117j09168
20383d15559j55281k4647L6545L09942l9046q6875K8739J89706K2241K13294q4014
20372d955q5260k56688R5280l6732j04104m4036p3844K33842J87748j46398j8641
20361b53788J15900O2482j2402J42789J84076M1318k47281L5146q1054Q5075K53408
20350C25669j85658j86063J87451J09088j23200j12809j25817L5482K77682j05587
20340I6238l13531j08010j8596M1666Q1779J83896M5200k70706j33169O4399O2169
20329b68665O1000m9432j07175r6583l8774J4607q810K15304r1211M7006K5268
$$ y = [134585, -177691, -239458, -12795, 184024, 99553, 31365, 11377, -148623, -247317, -250817, -290432, 31916, 205539, -424, -176794, -125171, -290500, -500581, -324508, -306391, -415559, -570840, -595487, -558942, -249000, -288046, -374921, -346182, -156476, -134235, 79059, -4955, -90215, -346903, -251623, -288355, -392459, -436495, -510339, -276497, -88749, -235147, -253788, -137888, -75406, -87808, 54981, 239057, 280375, 33094, 68240, -12814, 72261, 325669, 140011, -46052, 141399, 250487, 127287, 14478, -111339, -75857, 201825, 96238, -217293, -325303, -343899, -302233, -220454, -36558, 8642, -262064, -395233, -330834, -268665, -207665, -257097, -364272, -460855, -499629, -485022, -493832, -278528, -369739, -322733, -297465]
20318b97465k87003k26075Q7599L40105J17176m7974k8153L2490l9595k8271K18146
20307a59020J87694Q3801j47654k8764k20288J71865K48237p8411j74990L7507
20297h0023J60220N0527M3511J04186j72169j51132j83423j65733O0015K03796
20287a30225j1743j09608j22180J52425M15232k45368k1803k6880O7081J19706
20277H6637J46186k15351k84092j38703k0455j13093J61629J85115J75930m9337
20267f5534J52154M1119L4726j25039q2776Q5852j73801j87477N4253J94254j88903
20256b61172j72262K27883J77572j00286j19137K09988K03338j75164j97123q342
20246b14705m1341J16980Q4690j25570j60223j99251m1619J33311L73429K53326
$$ y = [-297465, -584468, -810543, -722944, -382839, -265663, -313637, -341790, -309300, -348895, -377166, -159020, 28674, 112475, -35179, -63943, -284231, -112366, 135871, 57460, -117530, -80023, 80197, 130724, 174235, 278421, 106252, -44880, -228303, -394036, -334021, -130225, -141968, -251576, -373756, -221331, 193901, -51467, -73270, -100150, -33069, 86637, 232823, 17472, -266620, -405323, -425778, -538871, -377242, -192127, -16197, -65534, 86620, 127739, 162465, 37426, -45350, 40502, -133299, -320776, -266523, -72269, -261172, -433434, -205551, -27979, -128265, -247402, -37414, 165924, -9240, -206363, -214705, -256046, -139066, -54376, -179946, -340169, -539420, -581039, -447728, -74299, 179027]
20236A79027j29179N34J24535J73534j51299r0846M1426o6317j81676p7544N2207
20225a25598o3435q4394q0993Q1562l8287J9273Q8923J85871J37596k5823j11706
20214a7011n1787j24620J67946K27642J47599j12391j26728p7441N4406J24131
20204B11746r3020J91254n2668k63057k94607j33584L42382K0779k69396L6167
20194c04004N6135j9482K3271O2647m6136o5998O1289K87331P9329J52188m1164
20183B45406k34916k00054j06980q6538q6365o911J60106J20015M4823j40693
20173b92107J65333K73732j6739o6000j56153k367K30666N334r9181j80386j66772
20162c04640o5167k0828J40941l2031O6979K85630m3409l27293k9164j5837K03302
$$ y = [179027, 49848, 50382, 174917, 348451, 197152, 106306, 147732, 81415, -100261, -177805, -125598, -189033, -273427, -354420, -272858, -311145, -291872, -202949, -17078, 120518, 94695, -17011, -68798, -193418, -25472, 202170, 349769, 237378, 110650, 33209, 87615, 211746, 118726, 309980, 257312, -5745, -300352, -433936, -91554, -70775, -340171, -304004, -247869, -267351, -244080, -181433, -227569, -293567, -232278, 55053, 134382, 286570, 245406, 10490, -189564, -296544, -383082, -469447, -476358, -316252, -196237, -151414, -292107, -126774, 146958, 130219, 64219, -91934, -94301, 136365, 141699, 42518, -137868, -304640, -369807, -390635, -249694, -281725, -214746, 70884, 27475, -299818, -328982, -344819, -141517]
20151a41517J21932n0305k8704K0303P6613o1421J8212j11883j57903J18728N7563
20140a38382N5146J41993J36260J80599J96075k08137j70264J22271K4327J20765
20130D60653k2249R4891J63840O2903k56044j33607p3378q5467J3256j29128q6699
20119H971L1849J65661j40418j52062K85495m1071M5924j26517k12784j26930
20109b61882q3024J28213K20787J03891J08591j3704l8429N9399j73705j23299
20099g3162k40205r285K4147J44099R0865m8705k69991j23527J85277m5459M48346
20088H2400K71057j49521k74644r8471o8491j63589r1434J01876K4186K27897
20078a38734O8548M5300j0757p2315j65627l0138Q0288l1748M6863M6095J51452
$$ y = [-141517, -19585, -69890, -98594, -78291, -1678, -63099, -44887, -156770, -314673, -195945, -138382, -83236, 58757, 195017, 375616, 571691, 363554, 193290, 315561, 339888, 460653, 438404, 533295, 697135, 760038, 503994, 370387, 297009, 211542, 224798, 95670, 8971, 40820, 206481, 66063, -85999, 199496, 158425, 204349, 77832, -134952, -261882, -344906, -216693, 4094, 107985, 216576, 202872, 164443, 223842, 50137, -73162, -313367, -322652, -298505, -154406, -63541, -112246, -382237, -505764, -320487, -365946, 82400, 353457, 203936, -70708, -169179, -237670, -401259, -492693, -390817, -366631, -138734, -70186, -24886, -35643, -107958, -273585, -303723, -223435, -255183, -208320, -162225, -10773]
20067a0773j65504k22967l7135P5655J30564L9399k65846l6183M99100L09986
20057C16296J99032j09738j8206n9180k38409n5936r4308p2101r652M9601K21225
20046A28624j10943J2920j79232j16809J05164J09983M8280j19437J30961K65944
20036B75455j53883n9416Q8K1355q7079k45262p452P3954j4678j00577k39394
20025e36889j99004J38044L25207O8324j7934j50173j56374Q7983J10035O9049
20015b61732J3934n2450M308Q0779J51415L34478k2448j95513K6330j43056k03116
20004b67071J29301N6677K0382m4140j71990p8512J54019J61764O7116N6810q2976
19993A380j31750k28256M0973J67386K94754j49837l0401j97970k44992K511Q9375
$$ y = [-10773, -176277, -399244, -436379, -360724, -230160, -190761, -456607, -492790, 6310, 316296, 515328, 405590, 387384, 328204, 89795, 33859, -60449, -132550, -142202, -92601, 128624, 17681, 30601, -148631, -265440, -160276, -50293, -2013, -121450, 9511, 275455, 121572, 62156, 62244, 83599, -3480, -248742, -256194, -182240, -196918, -297495, -536889, -735893, -597849, -272642, -204318, -222252, -372425, -528799, -440816, -330781, -261732, -247798, -300248, -295940, -215161, -63746, 270732, 248284, 52771, 79101, -63955, -267071, -137770, -81093, -60711, -104851, -276841, -355353, -201334, -39570, 27546, 84356, 1380, -130370, -358626, -317653, -150267, 144487, -5350, -35751, -233721, -478713, -476202, -386827]
19982c86827P5736o2953R9760j16050j09638j21720K06319j7938J93867L24063
19972H4619J85751j91029j83155J4928J43008j14797l57041N8953K67720k17290
19962c08333q4820J19779J01107K52712m9440l7968q7828o6252L6186Q2636L0376
19951a1845j53050R027r9869J08540J84623m7190J94164O1344k74076r2832q3938
19940b05102L6043O2441m1376R7183M0983Q9427l0698R4825M7170n1156R3043
19929B32783O6347k03252j6287k06948N3001K33302l0983k30898M2080L24j52888
19918b13419j79736J40887Q1578P7744j89113J74115J05445r5286J95583J56171
19908B53969j74831j24615J25847o0357n4514j17116P8050Q140j38381n7748K11636
$$ y = [-386827, -311091, -374044, -274284, -390334, -499972, -621692, -415373, -433311, -239444, 84619, 270370, 79341, -103814, -88886, 54122, -60675, -417716, -358763, -91043, -308333, -393153, -273374, -172267, 80445, 31005, -6963, -94791, -161043, -124857, -42221, -11845, -164895, -155868, -255737, -147197, 37426, -9764, 184400, 245744, -28332, -121164, -205102, -169059, -106618, -147994, -50811, -9828, 79599, 48901, 143726, 190896, 139740, 232783, 299130, 95878, 79591, -127357, -74356, 158946, 127963, -102935, -60855, -60531, -213419, -393155, -252268, -170690, -92946, -282059, -107944, -2499, -97785, 97798, 253969, 79138, -45477, 80370, 20013, -34501, -151617, -73567, -65427, -203808, -261556, -49920]
19897d9920O8213n400L3725j13376l59422j75717L28242j67263O5682L43580J74646
19886A42990k79932l6166k2687j45458J50446k6716J7233N4480J35105R7757o5544
19875B1508j07218j34479l4291Q6862J79153J9720q9021l8729k45993k30075R4976
19864d77587J62400k6822j07834R6099J31632M8516N3402J26385P2377l3265L6715
19853H2018L4137l1588q032J53034j70675j40132q1001j24189Q2907r7940R5478
19842b05983N7165m2525R5436L7130o2068J1451O146j49864J03037K6635J57257
19831C3817Q5056r5725j28908r6098m52398j29545K01028R9835K73437M37046
19821B27545j28222j38446j43690k21138J4408J65887K89319J44261k8932O7441
$$ y = [-49920, 18293, 12893, 46618, -66758, -426180, -601897, -273655, -440918, -375236, -31656, 142990, -136942, -173108, -195795, -341253, -190807, -217523, -200290, -145810, -10705, 87052, 21508, -85710, -220189, -254480, -167618, 11535, 31255, -57766, -96495, -342488, -572563, -477587, -315187, -342009, -449843, -353744, -222112, -173596, -120194, 6191, 78568, 45303, 82018, 116155, 84567, 76535, 229569, 58894, -81238, -162239, -286428, -203521, -301461, -205983, -148818, -191343, -95907, -58777, -120845, -109394, -103248, -253112, -150075, -123440, 33817, 118873, 23148, -105760, -201858, -654256, -783801, -582773, -482938, -209501, 227545, 99323, -39123, -182813, -403951, -389543, -223656, 65663, 209924, 180992, 248433]
19811B48433k03970N4970J29912p6820N5992o8006n3755O019J04115n4110j0497
19800A32283j29064j22445R518J04351j98522Q335j05121K15337L3883O4288M54381
19789D67224p2858k41766j10340J58277K7267Q0775L8237k43024j51683j50110
19779a98001j68650L6210J60279q605R9914m783Q4073M0354M714m5459J41615
19768A41661q7301j9433p610p6855j56294L8111J50897J03577P5630J24121r7761
19757A88743j29519L3555K06929j00242k13959j10162Q9154K1420J46232P8424
19747B10575k16075r9590J50521K07308M201N4146j65761L0814J93025L6831j23648
19736B82347j70081N6263m4429j91936n995o8733p7672k85J62358P8417n6M4762
$$ y = [248433, 44463, 99433, 229345, 152525, 208517, 140511, 86756, 92775, 196890, 142780, 132283, 3219, -119226, -109708, -5357, -203879, -195544, -300665, -85328, -51445, 12843, 467224, 394366, 152600, 42260, 200537, 227804, 308579, 346816, 103792, -47891, -198001, -366651, -330441, -170162, -178767, -78853, -83636, 437, 40791, 45505, 46, 141661, 54360, 34927, 27317, -49538, -205832, -167721, -16824, 86753, 162383, 286504, 188743, 59224, 92779, 299708, 199466, -14493, -124655, -35501, -14081, 132151, 210575, -5500, -105090, 45431, 252739, 256940, 311086, 145325, 176139, 369164, 405995, 282347, 112266, 168529, 124100, -67836, -73831, -142564, -220236, -220521, -58163, 20254, 20198, 64960]
19724F4960L08554K5212k83270l52268O5679J94542J06383n2322l3363R3056J03815
19713B40978k25639m00450o2035J26983J85453J4041N2162J15055j57150j81346
19703b91948Q8767K15369J93434j24082j75254o57L33q1547j5012K15242M7506
19692G2151k23091k10975J91141k17928J58677K25818K22895O5079k47310j11358
19682g4901J20724J44533J83047j92708k00260J10716L67529J32504j77964q6313
19672C26907k93834j56747J77260j3569j62612l0700j82901o4576J58448J92567
19662d9757L24918j36910J3429P2236j21688k01060L1602K91353J05025k19859
19652A09289n2985n8321J74124J20792J7503N5009J70870K41001J16938j99717
$$ y = [64960, 373514, 398726, 115456, -236812, -171133, 23409, 129792, 77470, 44107, 137163, 240978, 15339, -385111, -447146, -320163, -134710, -120669, -68507, 46548, -110602, -291948, -203181, 12188, 205622, 81540, -93714, -94371, -94038, -175585, -190597, 24645, 72151, -150940, -361915, -170774, -388702, -230025, -4207, 218688, 283767, 36457, -74901, 45823, 190356, 373403, 180695, -19565, 91151, 458680, 591184, 413220, 326907, 33073, -123674, 53586, 40017, -122595, -153295, -336196, -400772, -242324, -49757, 275161, 138251, 151680, 223916, 102228, -98832, -67230, 224123, 329148, 109289, 56304, -2017, 172107, 292899, 310402, 365411, 536281, 777282, 894220, 694503]
19642F94503m5644K77372J0421j40745j20981J4149M1821K63182J77662q2478
19632A089262r8125m8913N253K53417k68328R9216p2165K28700K61987K03079
19622A653383R4685m61311l00651Q932L1646J43203j21414j18768j32651J33208
19612I30262q4436m23684k72092j3785M2179J7736j0465P0356j47365j73320r0543
19601a55157p9765J30950K95388J48789J17509k21017m4274R2673J09531O2470
19591D57097q2086j43508J45025R547J07035n8460N6342O8503K27469J54613m0556
19580I01021l9362m5838l2157J08802Q8064j05741P1841L08874O7166l20245J96560
19569A198985P7376J7507j43020r0536J54497l8899j56377k51268k17000j46p1246
$$ y = [694503, 648859, 926231, 936652, 795907, 674926, 689075, 730896, 994078, 1171740, 1089262, 991137, 942224, 947477, 1200894, 932566, 1031782, 959617, 1188317, 1450304, 1653383, 1748068, 1286757, 986106, 995038, 1026684, 1169887, 1048473, 929705, 797054, 930262, 845826, 422142, 150050, 136265, 178444, 196180, 185715, 256071, 108706, -64614, -155157, -234922, -103972, 191416, 340205, 457714, 236697, 192423, 285096, 394627, 457097, 375011, 231503, 376528, 386075, 493110, 434650, 490992, 559495, 786964, 941577, 901021, 861659, 815821, 783664, 892466, 980530, 874789, 946630, 1255504, 1322670, 1002425, 1198985, 1276361, 1293868, 1150848, 1060312, 1214809, 1175910, 1019533, 768265, 551265, 551119, 479873]
19558D79873k30368J00207J13844J4467j04826m5987Q9631r4983k45065p3647
19548C146N8113K42282k4084j63611j98780l71056j90659K38800K05650P2631
19538a27568J52756J35727R145J7673j02771J89312j9901P7471M7846P8810j68704
19527B89796J096j22301p3888j808K04649o7081r1063j89242Q3144O2848o6107
19516C0043R2934j05158j61280O8512j32776M1895K92467K65433m43099k70472
19506c21501j2289k4736K8715J0804J75839J67650k5859J3215q4776K34040m1844
19495A19258l5879R1489j00431q5539N593o2346J405K15717K0321j49650J0106
19484C0044K65660R5701q6855j20892k88648l94341K14186K83126J01415j4753
$$ y = [479873, 249505, 349712, 463556, 478023, 373197, 327210, 416841, 321858, 76793, 3146, 61259, 303541, 279457, 115846, -82934, -453990, -644649, -405849, -200199, -127568, 25188, 160915, 170060, 187733, 84962, 274274, 254373, 331844, 379690, 458500, 289796, 290892, 168591, 94703, 92895, 297544, 230463, 139400, -49842, 33302, 96150, 30043, 122977, 17819, -143461, -74949, -207725, -165830, 126637, 392070, -51029, -321501, -333790, -358526, -329811, -319007, -143168, 24482, -1377, 11838, -72938, 161102, 119258, 83379, 174868, 74437, -11102, -5509, -67855, -66450, 149267, 169588, 19938, 30044, 295704, 391405, 304550, 183658, -104990, -499331, -285145, -2019, 99396, 84643]
19474H4643J46205l5539K5293k01730K12000K09641j88855P4191k3297k79962
19464B2590l3858N9612k3341K6790j19340O2177K17886q8140N0028k3933n7646
19453I2825N7018k47122j61973L09758R4702m4915N9267K3840J4519k14034q8493
19442a04608j04225J42708K00391j52203L9188L02753J09610m5884k77142q7283
19432B3305l2544j5401K04809J55440k06012j36369k0968J65800l7952r1273j19453
19421a10618L1525k36872k06689K26051J03709K9797L72412M5231m08672k11501
19411c65627l2065J48989K63421L44524k9831J34039j86504r6932J49467j92050
19401A37431l6553Q9403M3679J31384L4392k58183j53223m6026o0064r1852J22773
$$ y = [84643, 230848, 195309, 220602, 18872, 230872, 440513, 251658, 325849, 302552, 22590, -11268, 48344, 25003, 51793, -67547, -5370, 212516, 124376, 174404, 150471, 92825, 149843, -97279, -259252, 50506, 145208, 100293, 159560, 183400, 197919, -16115, -104608, -208833, -66125, 134266, -17937, 21251, 324004, 433614, 387730, 110588, 23305, -9239, -24640, 180169, 335609, 129597, -6772, -27740, 138060, 100108, 8835, -110618, -79093, -315965, -522654, -296603, -192894, -163097, 209315, 254546, -154126, -365627, -397692, -248703, 14718, 359242, 329411, 463450, 276946, 180014, 329481, 137431, 100878, 190281, 233960, 365344, 399736, 141553, -11670, -57696, -117760, -209612, -86839]
19390h6839K90143L0137j12308j42191J75280o3155j22273L5510o8165J3798m3123
19379i3186K4659K19971K83724L4366j06055J35372j09246Q9123J20941J63381
19369G63050R3909j01837P601l7147J81195j02179m54623n8663N1595M20630p6648
19358F86883m22458j52960N8796o9267j27738k9758M7749J17698M125j3752K50322
19347C49640K15054j5359N2371j86842L6430q6063j80329Q4749r7006j04534n4497
19336A3614P9985K91482k9590r4812J16907k53503j64005j3702J07993L39469
19326C93838J63512K513j02038l8469j51516P0635J26784J19473k38607J92917
19316E39042K52941q4519q7031Q0686o1667j9573o5119k23272k97750J09394j19361
$$ y = [-86839, 203304, 233441, 121133, -21058, 154222, 91067, -31206, 4304, -63861, -50063, -93186, -68527, 151444, 435168, 469534, 363479, 498851, 389605, 478728, 599669, 763050, 856959, 755122, 762723, 725576, 906771, 804592, 349969, 291306, 342901, 763531, 686883, 264425, 111465, 170261, 100994, -26744, -56502, -8753, 108945, 113070, 99318, 349640, 564694, 549335, 601706, 414864, 451294, 365231, 184902, 269651, 172645, 68111, 13614, 93599, 385081, 355491, 260679, 377586, 124083, -39922, -53624, 54369, 393838, 557350, 559863, 457825, 419356, 267840, 338475, 465259, 584732, 346125, 539042, 791983, 707464, 620433, 701119, 639452, 619879, 554760, 331488, 33738, 143132, 23771]
19305B3771k68146j52613O6725N9299K53305K05493k56139n4846J54985J75225
19295B07059L2748k93336k90653j96422L5419J28093J90921K13302j26481O4793
19285c4557J23145J45658J1375k91498j85433K36711M46932J63400l90776k39582
19275a4625N3636J25275K44966J62426K86021J44978P5452k93985j01794k72846
19265D09504j03285P2969R6584k790k97815j82587K03202J19659n4235J03788
19255C64994N0828M4253P6337J3570J60207n9263j28076k44633M3383K7674P2809
19244D22083P2761O309k42786j30611q772j16537j64710R0172R2873P2943O0803
19233A54528m5521l5228q7226J6896J58829P5513j12056l0894Q3468K62873k18303
$$ y = [23771, -244375, -396988, -330263, -270964, -17659, 187834, -68305, -123151, 31834, 207059, 239807, -53529, -344182, -540604, -505185, -377092, -186171, 27131, -99350, -34557, 88588, 234246, 245621, -45877, -231310, 5401, 452333, 615733, 224957, -14625, 39011, 164286, 409252, 571678, 857699, 1002677, 1078129, 784144, 682350, 409504, 306219, 379188, 475772, 472982, 175167, -7420, 195782, 315441, 261206, 364994, 415822, 460075, 536412, 549982, 710189, 650926, 522850, 278217, 321600, 349274, 422083, 494844, 501153, 258367, 127756, 118984, 2447, -162263, -72091, 20782, 93725, 154528, 109007, 73779, -13447, 3449, 162278, 237791, 125735, 94841, 178309, 441182, 222879]
19222B22879j6424K42339j96989J8738K11238O2993l00863j48494K9310J48384
19212B73111J84300j04131k09595J49599L41672M4524N2559j9969o1696R7194
19202G47568K77591m3182j49838J06036J63213J52673L28156n9786J7798K22479
19192A762708j52415k05245k7551j48124J6628J56784J30261K2971m899R7804
19182A648922j17572k62379q0954J29207l8399O2170K23100J04436K19864K51108
19172B139503K8649J1908K54343J88201J32458l9907j85379Q1621K95926j9804
19162B887519J26103J90558K52720K16088K90973J44276N75190O45903L63304
19153E692634P25883Q01474R67927P56362R11960R98531J131232R02001J349809
$$ y = [222879, 206455, 448794, 251805, 270543, 481781, 544774, 243911, 95417, 124727, 273111, 457411, 353280, 143685, 293284, 634956, 679480, 732039, 712070, 650374, 747568, 1025159, 981977, 832139, 938175, 1101388, 1254061, 1582217, 1522431, 1540229, 1762708, 1610293, 1405048, 1377497, 1229373, 1246001, 1402785, 1533046, 1556017, 1551118, 1648922, 1531350, 1268971, 1188017, 1317224, 1278825, 1340995, 1564095, 1668531, 1888395, 2139503, 2168152, 2180060, 2434403, 2622604, 2755062, 2715155, 2529776, 2611397, 2907323, 2887519, 3013622, 3204180, 3456900, 3672988, 3963961, 4108237, 4683427, 5329330, 5692634, 6418517, 7219991, 8187918, 8944280, 9856240, 10854771, 11986003, 12888004, 14237813]
19144A4237813J719448K419290L598922M958954N714910N130157M372367L491558
19136D5643419L049488J668630q77722k012902j289907N18017K614429N084646
19128E4398098Q100695J2740347J9621099K9415979M2375404N6012451O2944913
19121B85608986N6314224M4357708L8131880K9519526k339856m6206705o3856501
19114C41529262n7980883m9124483l9105687k5258801j2661178m391195o01184
19107A52405851l32523j420128l070190p174682j3401645j7707510j8100952j5399946
19099G5798275j1640477q708538n997839l726839k608446j792401j181232o83526
19091C9458977J90118J82717l590j86802M64690J285009J866808L291873N392768
$$ y = [14237813, 15957261, 18376551, 21975473, 26934427, 32649337, 37779494, 42151861, 45643419, 48692907, 50361537, 49483815, 47470913, 46181006, 46699023, 49313452, 54398098, 62498793, 75239140, 94860239, 124276218, 166651622, 222664073, 285608986, 341923210, 386280918, 424412798, 453932324, 451592468, 405385763, 341529262, 283548379, 234423896, 195318209, 170059408, 157398230, 153007035, 152405851, 152073328, 150653200, 147583010, 140408328, 127006683, 109299173, 91198221, 75798275, 64157798, 55449260, 49451421, 45724582, 43116136, 41323735, 40142503, 39458977, 39649095, 39831812, 39828222, 39641420, 40106110, 41391119, 43257927, 46549800, 51942568]
19082E1942568P847260J1156298J4013628J5982399J5760163J3811529J2029085
19075A42542930R784439O072184J035620j118743L441018J3482264K6544073L9709124
19067B41492909N1321980O0506578O2392566M7940867K1161818K101847r236844
19060D77681721l8077723p9891529r0316161p0402108m7561968l0947729k0035437
19053A00449066j2626269p070668l643128j229795Q17173J683859J524290J46471
19045H0050999j831072l212563m227958o402789q730215q606140o677878m822216
19037C5540168l367689k147328j704164j238789j256246j352871j397218j658481
19029B1417382j617762j499345j403439r40703q58685p54705q48001o80774n39233
$$ y = [51942568, 59789828, 70946126, 84959754, 100942153, 116702316, 130513845, 142542930, 152327369, 158399553, 159435173, 158316430, 161757448, 175239712, 201783785, 241492909, 292814889, 353321467, 415714033, 463654900, 484816718, 486918565, 477681721, 439603998, 359712469, 269396308, 198994200, 151432232, 120484503, 100449066, 87822797, 80752129, 77109001, 75879206, 76696379, 78380238, 79904528, 80050999, 78219927, 75007364, 70779406, 64376617, 55646402, 47040262, 40362384, 35540168, 32172479, 30025151, 28320987, 27082198, 25825952, 24473081, 23075863, 21417382, 19799620, 18300275, 16896836, 15956133, 15097448, 14342743, 13494742, 12813968, 12274735]
19020A2274735n10766n52327m50375m13923l40796j91224j91749l01417o7553
19011I254605k74526l06562J55812N7616k8821J77940o2678j429K5067J0543j48993
19000H858574l48603J48992M84890O53101R75448Q72285P66800Q65878N67987
18991A3845352j13072m06982o89953j388029j840935j514707j097119p64482m23168
18982E606905n58453p05094m19727J1203K65237k65478j68126L51405o032k72845
18972C838995j92116q1482J53811m57404m22442p8723J19423o7575j60264k47340
18962B404883N1232j66449j20172J16667N6524m37687r8272K33716Q6557j5509
18952B111490k2221K38396K16914j43567j26497q6211m98147j18882N42995K45405
$$ y = [12274735, 11763969, 11211642, 10761267, 10347344, 10006548, 9815324, 9623575, 9322158, 9254605, 8980079, 8673517, 8829329, 8886945, 8858124, 9036064, 8973386, 8971957, 8997024, 9007567, 8858574, 8509971, 8658963, 9143853, 9796954, 10772402, 11644687, 12411487, 13277365, 13845352, 13732280, 13325298, 12635345, 11247316, 9406381, 7891674, 6794555, 6030073, 5606905, 5048452, 4343358, 3923631, 3934834, 4200071, 3934593, 3766467, 4117872, 4111840, 3838995, 3646879, 3565397, 3719208, 3261804, 2839362, 2760639, 2880062, 2812487, 2652223, 2404883, 2456115, 2289666, 2169494, 2286161, 2342685, 1904998, 1806726, 2040442, 2126999, 2111490, 2089269, 2327665, 2544579, 2401012, 2274515, 2188304, 1690157, 1571275, 2114270, 2359675]
18942B359675k92031K5505J11474j4373o810K96502q410m3245o4781J19216J14822
18931B597544k23507m29281l20316l06223j9145J9698P1954P6597N0252m34216
18921A083357k50342J04058J53088J75495j67252k70628q0439J89588p5187m8631
18911H13107M1973J9808q5351j9277K9033j5675k9970j57568q8538J64613M5640
18900G17795k80831k32436K6191J01878Q7638R1552J28015J61377L01205m8000
18890A054384p9921j93912k71304R1204O7614J00954J03439J5276O110J52315
18880A046159K0461J43379J4502q2211j48403J8183O4791k50310l92574j14947
18870C19030m0739k3937O4195L43162p3557j81477k66341O453N4655K0383p6440
$$ y = [2359675, 2067644, 2093149, 2204623, 2190250, 2183440, 2479942, 2471532, 2428287, 2363506, 2482722, 2597544, 2374037, 1944756, 1624440, 1318217, 1299072, 1318770, 1390724, 1467321, 1517573, 1083357, 833015, 937073, 1090161, 1265656, 1098404, 827776, 747337, 936925, 861738, 813107, 855080, 874888, 789537, 770260, 799293, 783618, 753648, 596080, 507542, 672155, 717795, 436964, 204528, 230719, 332597, 420235, 511787, 639802, 801179, 1102384, 1054384, 974463, 780551, 509247, 600451, 668065, 769019, 872458, 887734, 893844, 1046159, 1066620, 1209999, 1224501, 1142290, 993887, 1012070, 1076861, 826551, 433977, 319030, 278291, 254354, 318549, 661711, 588154, 406677, 140336, 146789, 201444, 221827, 145387]
18859A45387j21290L4010j35522K79617P2326m4662j61626J3422L21656N5375
18849D58693q1331k14563j92637L58092R2893Q7065n4405j02918J15782o3913
18839D02758j74541J80486J32976J43700O8820k87017m5964k46562j26212J57269
18829B05713J22693J29628L2631j60265k16164j45827M553O8470J12553O2159
18819B16144J10028j7162l1268j43917R8619J65891J78880q8426k69021k88478
18809f8710R4417J46840N0798K33628j4665q0331n2860o9265o1602J03394o3961
18798B17683j91412m9374J50922q9273n1220J8131O6152L3051j22101q6474K72005
18787A68090n8337q4589k4081j32926P7545O0885J92380R9973k38811J54027K83731
$$ y = [145387, 24097, 58107, -77415, 202202, 274528, 229866, 68240, 81662, 403318, 458693, 377362, 162799, -29838, 328254, 421147, 508212, 453807, 350889, 466671, 402758, 228217, 408703, 541679, 685379, 754199, 467182, 421218, 174656, 48444, 205713, 328406, 458034, 490665, 330400, 114236, -31591, -27038, 41432, 153985, 216144, 326172, 309010, 277742, 133825, 232444, 398335, 577215, 488789, 219768, -68710, 25707, 172547, 223345, 456973, 442308, 361977, 309117, 239852, 178250, 281644, 217683, 26271, -23103, 127819, 38546, -12674, 5457, 71609, 104660, -17441, -103915, 168090, 109753, 25164, 1083, -131843, -54298, 6587, 198967, 298940, 60129, 214156, 497887]
18776D97887j26143k786q8708Q0784m8705Q2948Q1416r7837j4351j34301L6570
18765B66774O1281j66132J9797k82050M5488p482r7397J55495J52074O3437j29832
18754H1453l12085L676L52292K4275m3867r87L6727L9915j70115m1184K3693l13963
18742c20170p7167K02100K17834N410J57857J79314o2374j04994L4567j35286
18732I7091L64888K12230k6780k69378k06001j69084j94886R9755J61537Q1283
18722A50655J95895J43489j52491k06970K8264j49213r4878P3481J87882p4128
18712A01986m482J65661J63067O7092q8193k73728j03079Q577j98559M9301K50988
18701A38631J37677N3279j48622k13061p4660k0969K2892N1629K45468Q8841l18499
$$ y = [497887, 371744, 368958, 280250, 361034, 312329, 395277, 476693, 378856, 364505, 230204, 266774, 328055, 161923, 181720, -100330, -54842, -62324, -159721, -4226, 147848, 211285, 81453, -230632, -226956, 125336, 149611, 105744, 104757, 141484, 181399, 11284, -29900, -6207, -320170, -397337, -195237, 22597, 28007, 185864, 365178, 302804, 197810, 232377, 97091, 461979, 674209, 647429, 378051, 172050, 2966, -191920, -92165, 69372, 150655, 346550, 490039, 337548, 130578, 158842, 9629, -85249, -11768, 176114, 101986, 97504, 263165, 426232, 493324, 405131, 131403, 28324, 36901, -161658, -112357, 138631, 276308, 329587, 180965, -32096, -106756, -127725, -104833, -53204, 192264, 281105, -37394]
18690c7394r6268K06350q5151j08176J8716J2248R5535J76698j28076K76315R6546
18679D27343j64282l96485l54907J06098J95950J18667K31329m7824j68419j61618
18669b14148O4177K64622M9140j69844j19867L9936K31028L48920J66545k01301
18659D59208p4860k46949j941J56777K0985j70786K56697J02578k77767j99965
18649B3977K06389N7613k39083p7655o4617k47703L7702R1819L01431J30568J55201
18638C75642o9447o7616n2221r9444j58914J20984J57308J05381J03956Q4771
18628E00400J70146O846k95485k67074k181M45M9709L90656L41812q0168j85836
18617F29270k20158j80646K52492J74902K02270K76034J91008Q023K147K45608
$$ y = [-37394, -133662, 72688, -12463, -120639, -101923, -89675, 5860, 182558, 54482, 330797, 427343, 263061, -133424, -488331, -382233, -186283, -67616, 163713, 115889, -52530, -214148, -149971, 114651, 163791, -6053, -125920, -85984, 145044, 493964, 660509, 459208, 384348, 137399, 135458, 292235, 313220, 142434, 399131, 501709, 223942, 23977, 230366, 287979, 48896, -28759, -93376, -341079, -303377, -211558, 89873, 220441, 375642, 306195, 238579, 186358, 86914, -72000, 48984, 206292, 311673, 415629, 500400, 670546, 677392, 381907, 114833, 112652, 113097, 162806, 553462, 895274, 815106, 629270, 409112, 228466, 480958, 655860, 858130, 1134164, 1325172, 1333195, 1335342, 1580950]
18607A580950n8430j35992j71488L7397J67731k7859j48625l9250M6120K11849
18597A462403m7178j14386M4992Q2337j68144j52282k28873k06658j39315K3094
18587E55990m2698K44081j55864l09810p2382R5967J7473K12805j09266j17620
18577C18676P0144p2184m8666J82370J78370j59650p7659K34629j39339o5600
18567D21091P9327J35288J239J08310m3380K36132K78564J05655j94133j0387
18557A117706J81044N1714K6209N9997L38997N0661L1253m2202k48668j26679
18547A440032j68353m26604k72639L23548M97930P1644k4267J79238K85150m3450
18537A862229m28494j09077J75108k3327p2873k25286m7256p2457k93036j68104
$$ y = [1580950, 1522520, 1386528, 1215040, 1252437, 1420168, 1392309, 1243684, 1204434, 1250554, 1462403, 1415225, 1300839, 1345831, 1428168, 1260024, 1107742, 878869, 672211, 532896, 555990, 513292, 757373, 601509, 291699, 219317, 315284, 332757, 545562, 436296, 318676, 388820, 316636, 267970, 450340, 628710, 469060, 391401, 626030, 486691, 421091, 500418, 635706, 636945, 745255, 701875, 938007, 1216571, 1322226, 1128093, 1117706, 1298750, 1350464, 1376673, 1436670, 1775667, 1826328, 1857581, 1815379, 1566711, 1440032, 1271679, 845075, 572436, 895984, 1393914, 1465558, 1441291, 1620529, 1905679, 1862229, 1433735, 1324658, 1499766, 1476439, 1403566, 1178280, 1131024, 1058567, 765531, 597427]
18527E97427J43126k8224j89257j10671q5910j70333J74361J18245j42932J22622
18517D28454K024j2007L1311l33117j1861K87801K30489J60714L1749r6578j58560
18506E60419k23340J70613Q9191n1068k38938K4715K29776M9677J08114K24931
18496I44090k0448l0043m06388j26054k2965j65958K3300J94457l55060j49290
18486a14359L67393J98538K86783j38825k85019J14829p6683k36117M2879P1706
18476B31125j48501j67549j88752J7282K07815l6029r6549N0523J6874J65673
18466E1912J24817R3105o8839q9658J13485J29845j82632l22741Q4791J14453
18456D8538R9551J50155J87065K864j55996J65239j89411k12448j07543j50082
$$ y = [597427, 740553, 712329, 523072, 412401, 326491, 156158, 330519, 448764, 305832, 428454, 430478, 418471, 449782, 116665, 104804, 392605, 623094, 783808, 815557, 718979, 560419, 337079, 507692, 596883, 545815, 306877, 331592, 561368, 611045, 719159, 944090, 923642, 893599, 487211, 361157, 338192, 172234, 195534, 389991, 34931, -114359, 253034, 451572, 738355, 599530, 314511, 429340, 352657, 116540, 159419, 231125, 82624, -84925, -273677, -256395, -48580, -84609, -181158, -130635, -113761, 51912, 176729, 269834, 200995, 111337, 224822, 354667, 172035, -150706, -65915, 48538, 148089, 298244, 485309, 488173, 332177, 497416, 308005, 95557, -11986, -162068]
18446a62068R0744J2222q4345K23090J96029L3713J11295j44931j35107j094r2749
18435D6799j11305J55552J41177k55559J2512J66180o9999k8713K871j51119J53074
18424F1470J76231K94454J05893o5153k20393J22532l613n18686j25779P9801
18414i3243j0642K8135L39898O970j36266L4980L8929k717M97N7509J02552J10533
18402D77135o0726r6129L2473J46062n5893l9440o057q3321P5616l7052J71195
18391E23863j2850j59003j52472J99940J53290k36016k83202J41021O5982J55316
18381C95869n5149l8485N2238J62898M9466r5320j92023k25255j64263J50646
18371D0622L68533J02236k2047j49824K3180J35019J34600Q7620n7837j04793
$$ y = [-162068, -71324, -59102, -143447, 79643, 275672, 309385, 420680, 275749, 140642, 139548, 46799, -64506, 91046, 232223, -23336, -10824, 155356, 85357, 56644, 59515, -91604, 61470, 237701, 532155, 638048, 572895, 352502, 475034, 471421, -47265, -173044, -93243, -103885, -75750, 264148, 271118, 134852, 169832, 208761, 206044, 206541, 264050, 366602, 477135, 416409, 320280, 352753, 498815, 442922, 403482, 397425, 314104, 389720, 352668, 523863, 511013, 352010, 199538, 399478, 552768, 316752, 33550, 174571, 240553, 395869, 340720, 302235, 354473, 517371, 566837, 471517, 279494, 54239, -110024, 40622, 409155, 511391, 489344, 339520, 362700, 497719, 632319, 719939, 662102, 557309]
18361E57309O8163j45629o9814j21381k30536J43508N32290J66196j91962N1548
18351G59692J4904P5030L58380J82647R8499k68334k28773J56502J69347o8409
18341A249485k11512j04714P6629P1052j08207L14720K82374m1319r6422Q3371
18331A515457J01728j10305j37858l71050l9894J05829O1588l9717J657R2788
18321A180223n5390j86122j11725j83130N1457p752K13955J23631j68657m6106
18311H10384J9764o86j42608n4814J33598l8067p603N5173o6033Q7375J5973j80161
18299F32295q7992K95460K17829j71856k01803J64349P2347k4950L3254J25481
18289A054414Q1378j41037J73116N4078j96986L150Q6656p9473k51455M5764K08633
$$ y = [557309, 625472, 479843, 410029, 288648, 58112, 201620, 733910, 900106, 708144, 759692, 774596, 849626, 1208006, 1390653, 1489152, 1220818, 992045, 1148547, 1317894, 1249485, 1037973, 933259, 1009888, 1080940, 972733, 1287453, 1569827, 1528508, 1432086, 1515457, 1617185, 1506880, 1369022, 997972, 958078, 1063907, 1125495, 1085778, 1087435, 1180223, 1124833, 938711, 826986, 643856, 695313, 687561, 901516, 1025147, 856490, 810384, 830148, 829462, 686854, 632040, 765638, 727571, 719968, 775141, 709108, 796483, 812456, 632295, 544303, 839763, 1057592, 885736, 683933, 848282, 920629, 895679, 928933, 1054414, 1135792, 994755, 1167871, 1221949, 1024963, 1028113, 1114769, 1035296, 783841, 829605, 1038238]
18278A038238J19720j06782k04373j29735M7321J70421J65716p7049k7551k43718
18268G52208l9680O5654K28901j07699l16092r601J00003J42984K2191l39683
18258D99186j16421p1397j51826m7602K5238O4432k36784q7618J83703J30003
18248A90914L88709K44318m07026p6643N5036j67268j54295K7187R0577J02192
18238B93701J31134k26451o5010k9734j34984n5749k21711L6851m3325l9375J83581
18227a71072l1864K26296O8715Q196J31948q5355k02571K5458J2217l5253J72075
18216A18790J28889L566L2518M996O4610L9231j9954j59383j84948j07890l0988
18205a10563k7417q6377Q3303J3288Q9369R7334p762o1834l2064K2539J01342
$$ y = [1038238, 1157958, 1051176, 846803, 717068, 764389, 934810, 1100526, 1023477, 995926, 752208, 712528, 778182, 1007083, 899384, 583292, 573691, 673694, 816678, 838869, 499186, 382765, 311368, 159542, 111940, 137178, 201610, -35174, -122792, 60911, 190914, 579623, 823941, 416915, 340272, 395308, 228040, 73745, 100932, 191509, 293701, 424835, 198384, 133374, 103640, -31344, -87093, -308804, -271953, -315278, -354653, -171072, -202936, 23360, 92075, 100271, 232219, 146864, -55707, -30249, -18032, -53285, 118790, 247679, 251245, 283763, 288759, 353369, 392600, 372646, 213263, 28315, -79575, -110563, -137980, -224357, -141054, -127766, -38397, 58937, 51175, -10659, -42723, -20184, 81158]
18194H1158J02720K69438k5902k87043q2992K2775K56526r6097J16768n5517J22541
18183D24375k33312j20014r4364J6123K19695O1239j28767K71239L0502j53208
18173B93508j4565o5852j50821j0240j06453j8833L2263J19768K33823J01343
18163D13941Q1853j84744j62834N0144L18355J26065q6513P2798J63485n5355
18153G37195n38104j23909l1105J3733L0913Q6287j06413J45626J68693j15344
18143B67572j42575K60410K45983J44437K1118L988j40492j62444j40940O2166
18133D19223l8357K2800O417k1851L9407j41681m9654j25815j50645j96991K16565
18122b0582R7130m2189J83626j34640l1853K23346R7018J45610J06035j55001
$$ y = [81158, 183878, 453316, 427414, 140371, 57379, 80154, 336680, 240583, 357351, 301834, 424375, 191063, 71049, -23315, -7192, 212503, 273742, 144975, 416214, 446716, 293508, 278943, 213091, 62270, 52030, -54423, -73256, -40993, 78775, 312598, 413941, 495794, 311050, 148216, 198360, 516715, 642780, 556267, 629065, 792550, 737195, 199091, 75182, 44077, 57810, 88723, 175010, 68597, 214223, 382916, 267572, 124997, 385407, 631390, 775827, 796945, 800933, 660441, 497997, 357057, 419223, 380866, 403666, 410083, 388232, 427639, 285958, 236304, 110489, -40156, -237147, -20582, 76548, 34359, 217985, 83345, 51492, 274838, 371856, 517466, 623501, 468500]
18112D68500J38940L6336j81465J46024N7012O4751K13351J81642N180l18812
18102H11459j99548P2370p4854o4363m1319K80676J12699k89697l03106j70787
18092A33530K03183J70484J57203M0329K60805K36287P2781r3998Q4429J27643
18082A392676N6822j47074J09728M678m6228q8183o525L2869Q1096k58253l77568
18071G54038Q2628K16524m3271J98175J11558j94579j87473j48633P5350L61369
18061A225686J5078k45714J70967J87357k2473Q4445R0014K22127k04911j55474
18051A367102L5552j20521q0729n5064j50228r2325L18968K57488K001j95631
18041A286613j96113j61712j1328J52769K12412n7221J82731R6959K18463K59411
$$ y = [468500, 607440, 643776, 462311, 608335, 665347, 730098, 943449, 1125091, 1130271, 811459, 611911, 684281, 609427, 545064, 503745, 784421, 897120, 607423, 304317, 133530, 336713, 507197, 664400, 704729, 965534, 1201821, 1274602, 1180604, 1265033, 1392676, 1449498, 1302424, 1412152, 1416830, 1370602, 1282419, 1275894, 1308763, 1389859, 1131606, 754038, 836666, 1053190, 1009919, 1208094, 1319652, 1125073, 937600, 788967, 864317, 1225686, 1240764, 995050, 1166017, 1353374, 1330901, 1415346, 1505360, 1727487, 1522576, 1367102, 1402654, 1282133, 1201404, 1146340, 996112, 903787, 1222755, 1480243, 1482244, 1286613, 1090500, 928788, 917460, 1070229, 1282641, 1225420, 1408151, 1505110, 1723573, 1982984]
18031A982984K69869j45067K18710L12474L13566k44669q3803o0013J99578J32550
18021B896179m7268q8246j36000l52665j24044p3935l5318N3860J79853o9659
18011B202757k18868P8404J10034p3001J48069k7714M8789J90036L4564l92373
18001B100697L99K6178j10850O3565J84965k325l1454l24055l38556K62826P7952
17990A909342K18692J11434j43393j68215j15991j20275Q7997p5037K5936K68806
17980A999296m5313k57060j70674J2379J39354K2410m9667o3599k5155k19547
17970A342424J39385N6914j50173k15019q0428Q4661Q2935o0071j01143K7692
17960A127177o8199k7513j58108M0906J31658q7986J0620m1275n9027k56052o4279
$$ y = [1982984, 2252853, 2107786, 2326496, 2638970, 2952536, 2707867, 2624064, 2564051, 2763629, 2896179, 2848911, 2760665, 2624665, 2272000, 2147956, 2074021, 2038703, 2092563, 2272416, 2202757, 1983889, 2062293, 2172327, 2099326, 2247395, 2219681, 2268470, 2458506, 2493070, 2100697, 2101096, 2127274, 2016424, 2079989, 2264954, 2262629, 2231175, 1907120, 1568564, 1831390, 1909342, 2128034, 2239468, 2096075, 1927860, 1811869, 1691594, 1779591, 1704554, 1730490, 1999296, 1953983, 1696923, 1526249, 1538628, 1677982, 1700392, 1650725, 1587126, 1561971, 1342424, 1481809, 1538723, 1388550, 1173531, 1093103, 1177764, 1260699, 1200628, 1099485, 1127177, 1058978, 1031465, 873357, 914263, 1045921, 957935, 968555, 927280, 868253, 612201, 547922]
17949E47922j87742j9073J98533j29775P1584J69680j58112P2267q6968J3683
17939D91999K41924J79383k77450J4271K32639J08055p6376p9116l9984K41103
17929A036448R3396j20135p9781r783Q9053J9362J71129p0173l0039j67359o3093
17918H69025J32392k31440N474O4779K7133R171R6020J4538j56506l6899K13166
17907A006853K86321J68909K27642L50059J45499k07098k26594m2820K05127J4454
17897A928352n5913l9853M8593O2275n0396j08531J56895K00055N2972N0014k09639
17886B034824M14784J45670j97746M00849J38288k28528r6395J88509p9304k0331
17876B700620J83134J12881K32073K41963R1691O03256L12156J56561K54721J27109
$$ y = [547922, 360180, 341107, 539640, 409865, 481449, 651129, 493017, 565284, 478316, 491999, 733923, 913306, 635856, 650127, 882766, 990821, 914445, 835329, 795345, 1036448, 1129844, 1009709, 929928, 920145, 1009198, 1028560, 1199689, 1129516, 1099477, 932118, 869025, 1001417, 769977, 775451, 840230, 867363, 876534, 972554, 987092, 830586, 793687, 1006853, 1293174, 1462083, 1689725, 2039784, 2185283, 1978185, 1751591, 1708771, 1913898, 1928352, 1872439, 1832586, 1881179, 1943454, 1893058, 1784527, 1941422, 2141477, 2194449, 2244463, 2034824, 2449608, 2595278, 2397532, 2798381, 2936669, 2708141, 2611746, 2800255, 2720951, 2700620, 2883754, 2996635, 3228708, 3470671, 3562362, 4165618, 4477774, 4634335, 4889056, 5016165]
17866E016165L27802N37684K36509J04888L63558N14359P20182P31198P45592
17857I297937J177790J587450K158061K662453K959872L675016M690598N756265
17849C3965442N580199M947249M242269L548991K778698J069355o19090j910726
17841E3602387j040950J220037L858125O893368J1043473J6359790K4228758L5150287
17833A51315275M8116092N9062398O1548663N4992896M6133903L7457456J9149681
17826D77776364j4496143m6219748o0856243n9129172m9796896l7618874k5576121
17819A84083167j4874707p337613l080430k027209k663227m823266q221246j3157938
17811A27897531j6806572j7232088j5000797j1734458q686364n952118m360946
$$ y = [5016165, 5343967, 5881651, 6118160, 6223048, 6586606, 7100965, 7821147, 8552345, 9297937, 10475727, 12063177, 14221238, 16883691, 19843563, 23518579, 28209177, 33965442, 39545641, 44492890, 48735159, 52284150, 55062848, 56132203, 55513113, 53602387, 52561437, 53781474, 57639599, 64532967, 75576440, 91936230, 116164988, 151315275, 199431367, 258493765, 320042428, 375035324, 421169227, 458626683, 477776364, 463280221, 417060473, 356204230, 297075058, 247278162, 209659288, 184083167, 169208460, 161870847, 158790417, 156763208, 154099981, 149276715, 141055469, 127897531, 111090959, 93858871, 78858074, 67123616, 58437252, 52485134, 48124188]
17804D8124188l505805k360481k063210j926785j301607n57394M3260Q51901J062032
17795C8366099J955236K886692L967007N205729P483814R959558J2080089J3636030
17787I5540254J3755526J2494689J0924735Q779141N985249L093478K450758O056921
17779A59080751J3201795K2701137L3143132M2615156M9034592M8232302L8374852
17772D06383717K2409919M641252j2617957l2361318n5499213o9215791o3262378
17765B00478231m6406435l0883751k0230941j3379212r046470n948338l808534
17758G0774550k245608j620931r73063r24456q65556j591485k442153l907542
17750E6203756n124961o237258n794462m676279l631140l067101k542338k354536
$$ y = [48124188, 44618383, 42257902, 40194692, 38267907, 36966300, 36408906, 36452166, 37304067, 38366099, 40321335, 43208027, 47175034, 52380763, 59864577, 69824135, 81904224, 95540254, 109295780, 121790469, 132715204, 141494345, 147479594, 150573072, 153023830, 159080751, 172282546, 194983683, 228126815, 270741971, 319776563, 368008865, 406383717, 428793636, 433434888, 420816931, 388455613, 332956400, 263740609, 200478231, 154071796, 123188045, 102957104, 89577892, 80531422, 74583084, 70774550, 68528942, 66908011, 65934948, 65010492, 64144936, 62553451, 60111298, 56203756, 51078795, 44841537, 39047075, 34370796, 30739656, 27672555, 25130217, 22775681]
17742B2775681k309232j492513j374837r24503q92837j016573p44233p28908m84401
17733A2807644l68079k53789n69069n64349n24342l29385l73050k94128k72590
17724I258863l57259k83627j29364j26560L19001J05335Q2332M20119N958k48007
17714I046791k73426j61843J30880R6807O7265L72360R77502Q30876O25407M03901
17704A2116520K61774L36770J0121p46719r91144j280675j594143j082789q87050
17695F142665o41953l73431p1904j50086k43603l0344l1242k87779N5157K60762
17685D628242j86314l65486r7365k1114k79377k20322j21469r0970k35583j17171
17675B893071o5978k63310l68417r7527Q9202J24392J12876N8471k36369j68406
$$ y = [22775681, 20466449, 18973936, 17599099, 16674596, 15781759, 14765186, 14020953, 13292045, 12807644, 12439565, 12185776, 11616707, 11052358, 10528016, 10198631, 9825581, 9531453, 9258863, 8901604, 8617977, 8488613, 8362053, 8681054, 8786389, 8868721, 9288840, 9294798, 9046791, 8773365, 8611522, 8742402, 8839209, 8906474, 9278834, 10256336, 11087212, 11712619, 12116520, 12378294, 12715064, 12725185, 11978466, 10987322, 9706647, 8112504, 7029715, 6142665, 5500712, 5127281, 5055377, 4905291, 4661688, 4631344, 4600102, 4312323, 4367480, 4628242, 4441928, 4076442, 3979077, 3957963, 3678586, 3458264, 3336795, 3245825, 3010242, 2893071, 2827093, 2563783, 2195366, 2097839, 2187041, 2311433, 2424309, 2482780, 2246411, 2078005]
17665B078005R8017r4109o3867K39398J81634j08971j03949L1580L0078M7976
17655B335792q8932j03726j71538J47954L9547J5879L69641J15835l3528R3206
17645B720130O1472j36404j9768J404l30503m50895o17428j54386P1925J3150
17635A158697O5766j33242N2283j49824N5736K8089q2735k10218r4476R5073O1108
17624H46257q5881j08022j26923M671R4697J05095J67102j25478j42606k3440
17614F05472R3257o1321k14069P2291J74622l8790J59183L29270l16345m61690
17604C41880O6024R7376K01136J82796R6611L7542j3345o5292q6918K14461J59952
17593A232223K9418J56526Q8917k05087k17671j42564k93524l8701L8038O6372
$$ y = [2078005, 2176022, 2081913, 2018046, 2257444, 2439078, 2330107, 2226158, 2257738, 2287816, 2335792, 2246860, 2143134, 1971596, 2119550, 2159097, 2174976, 2544617, 2660452, 2626924, 2720130, 2781602, 2645198, 2625430, 2626834, 2296331, 1845436, 1228008, 1073622, 1145547, 1158697, 1224463, 1091221, 1143504, 993680, 1049416, 1077505, 994770, 784552, 690076, 785149, 846257, 760376, 652354, 525431, 530102, 624799, 729894, 896996, 771518, 628912, 605472, 698729, 637408, 423339, 495630, 670252, 631462, 790645, 1119915, 803570, 341880, 407904, 505280, 706416, 889212, 985823, 1023365, 1010020, 944728, 857810, 1072271, 1232223, 1261641, 1418167, 1507084, 1301997, 1084326, 941762, 648238, 609537, 647575, 713947]
17583G13947j35823N4183J7459k6425K3767q0639Q4469P7384j49931q3405j28910
17572C66076R785J32990K7436m7837L8954M9182j05760K08892M9436j30791r4681
17561E03682J47902j56064m6867r0475k91632k52850o1579K57259J43131J36097
17551B88604K03117J83451n9308j24904p4628L2585k9562J29373r4019q8059L2202
17540C98852j01021j8504j51372r9160J93O1943o399j06113Q3340J85968L2135
17529B79862J9936j73510r4814l8357j78775j1224k02434k32323j31569K91262
17519d71946N75156J20986j80508J7880K04523J95435N5437j04410j90990P051
17509B28614J90009M2392r6684k24881n7519O2416J20395J8674P6891l4181o5397
$$ y = [713947, 578124, 632307, 649766, 623341, 647108, 566469, 650938, 728322, 578391, 494986, 366076, 375861, 508851, 536287, 488450, 527404, 576586, 470826, 679718, 729154, 598363, 503682, 651584, 495520, 448653, 358178, 66546, -186304, -247883, 9376, 152507, 288604, 491721, 675172, 615864, 490960, 416332, 448917, 419355, 548728, 454709, 366650, 398852, 297831, 279327, 127955, 28795, 28988, 90931, 84532, -21581, 61759, 247727, 279862, 299798, 126288, 31474, -6883, -185658, -196882, -399316, -631639, -763208, -471946, 103210, 224196, 43688, 61568, 266091, 461526, 516963, 412553, 221563, 228614, 418623, 461015, 364331, 139450, 81931, 144347, 264742, 283416, 360307, 326126, 260729]
17498B60729M4582k5545l1874j30094k44740J29610J6436P4814j43198R4049J65422
17487B10191k41385j40773R5340R9474J53398K32088j2971k71963o3440k51092
17477a91133j15999J23342K23844K23278N0583j99199L0567K5318J07837K64093
17467E42531r8146k30338j74634k1029j43267k36239J24313M16075K57891R1117
17457E28274O2978m0076j22013k52993q4782J75629j73880l15625N0620K49553
17447G7685J4386O4569j90025k4600L2395k1383R6874m2909K39832J65058J02546
17436E14428n6069q1256m0832m0866j0228j69326j80005O0465L2724k57621J49501
17425g9085O3422O5321J0574o9146J54559O1204n5297K664m2205J33529J71475
$$ y = [260729, 305311, 279766, 247892, 117798, -126942, 2668, 19104, 93918, -49280, 44769, 210191, -31194, -171967, -76627, 22847, 176245, 408333, 395362, 123399, 59959, -191133, -307132, -183790, 40054, 263332, 313915, 114716, 145283, 170601, 278438, 542531, 444385, 214047, 39413, 18384, -124883, -361122, -236809, 179266, 437157, 528274, 591252, 551176, 429163, 176170, 91388, 267017, 93137, -222488, -171868, 77685, 92071, 156640, -33385, -57985, -25590, -46973, 49901, 6992, 246824, 411882, 514428, 458359, 377103, 336271, 295405, 285177, 115851, -64154, -3689, 29035, -228586, -79085, -15663, 49658, 60232, -8914, 145645, 206849, 151552, 154216, 112011, 245540, 417015]
17414D17015j2966j33114k12892J7700j991l1239p7225K15198k5959j46902L1188
17403C8813L0524l0708R8155m0404K05180J59602N1076k54224j91290n8510Q2014
17392I0228J12044J26144R5289l9416n976k45222k438J42451P0372o8948J39603
17381D14131m4270j83515j7831J24003n8505k44915m7685J01544j31819K30249
17371A41387J64292J39432l3213j08168k59016l53613r0075J1137N4286J898J18103
17360b13550M7772k3471j4097k98428j76269J1656L02539J72449N1950J9029K21478
17349A01058j11073j86477L2074J51359R963k1269j61087k14625K15620M4355
17339a40102N3501N3285J10261J87959l0727j6236p5713O9078j09990K29735J902
$$ y = [417015, 404049, 270935, 58043, 75743, 73752, 42513, -34712, 180486, 154527, 7625, 38813, 69337, 38629, 136784, 96380, 301560, 461162, 512238, 258014, 66724, 8214, 90228, 202272, 328416, 423705, 384289, 378313, 133091, 130653, 273104, 343476, 274528, 414131, 369861, 186346, 168515, 292518, 234013, -10902, -58587, 42957, -88862, 141387, 305679, 445111, 411898, 303730, 44714, -308899, -398974, -387837, -333551, -331653, -213550, -165778, -189249, -203346, -501774, -678043, -666387, -363848, -191399, -139449, -120420, 101058, -10015, -196492, -164418, -13059, -3096, -24365, -185452, -400077, -184457, -140102, -86601, -33316, 76945, 264904, 234177, 217941, 142228, 211306, 101316, 331051, 332953]
17328C32953L4549J03396R6522m4653J92657J30542O4469K61147J90332l1563
17318A330351l7247K13600q5595j5698J78142m5074l13009l24636K4270K60815
17308A185919J75100M3712K42026j29976m11497r2872q4116k52305j61651p9362
17298D34978j95928K61827J57717J61408J31997o0420k85545O1556K53694K10662
17288A131946k33409j37105j62039M1780J42226j11006j61905j00169P130Q0186
17278D97635Q7187J02962l5016J67231L24129L1351K35773N4873J36115j94420
17268A407820j17516L69939N9953j86860m7633q3533o1943j22337k45720Q6538
17258A058708j53477k27310R804o4197O6146J4920J76351K58762J15354n8471
$$ y = [332953, 367502, 470898, 567420, 522767, 715424, 845966, 910435, 1171582, 1361914, 1330351, 1293104, 1506704, 1421109, 1405411, 1583553, 1538479, 1225470, 900834, 925104, 1185919, 1361019, 1404731, 1646757, 1516781, 1105284, 1012412, 928296, 675991, 514340, 434978, 239050, 500877, 658594, 820002, 951999, 891579, 606034, 667590, 921284, 1131946, 898537, 761432, 599393, 641173, 783399, 672393, 510488, 410319, 417449, 497635, 584822, 687784, 652768, 819999, 1144128, 1175479, 1411252, 1466125, 1602240, 1407820, 1290304, 1660243, 1720196, 1533336, 1485703, 1402170, 1340227, 1217890, 972170, 1058708, 905231, 677921, 687725, 623528, 689674, 704594, 880945, 1139707, 1255061, 1196590]
17248A196590q4666K4099n6629L8068n4383P483k16328j74545l623o9088m1953
17237E65025j97751k03845K00508j10907J30623j5259k5982j20581q2060o6869
17227G2902K1728Q4255O0343k35419j65926p7810M8017K44112J87808j31341j79631
17216g0962J24095J57438J38604r9623j37877l65677q2969L26100j57648p3998
17206b42517J55870N4698L73891M7698k59929o8308J4789j47381j4396J60563
17196G4978j64481Q5228K72757J29543k39317l01688N0240N7553m4926r3349J51950
17185b1512K2402m2452Q8392J41136j62161j09933J39087J23187p1093n0623l653
17174E2777N6982l24744m1529J71650M0052j17499K84097K10570j6360k6775J3321
$$ y = [1196590, 1111924, 1136023, 1079394, 1117462, 1063079, 1070562, 854234, 679689, 676066, 606978, 565025, 367274, 163429, 363937, 253030, 383653, 368394, 342412, 221831, 139771, 72902, 94630, 178885, 239228, 3809, -162117, -239927, -191910, 52202, 240010, 108669, -70962, 53133, 210571, 349175, 249552, 111675, -254002, -336971, -10871, -168519, -242517, -86647, -31949, 341942, 389640, 129711, 61403, 76192, -71189, -85585, 74978, -89503, -4275, 268482, 398025, 158708, -142980, -92740, -35187, -80113, -173462, -21512, 890, -41562, 46830, 187966, 25805, -84128, 54959, 178146, 107053, 56430, 52777, 109759, -214985, -256514, -84864, -44812, -162311, 121786, 332356, 315996, 289221, 302542]
17163C02542j24781k7776r2583j77309J11178J06944j18865m522r5744J09464
17153a1452K28668j80797j76825P8895K9259j19251J27633J23206k450k04029
17143a07143r3333R7198J99342J63597J3369n4634k72934k66797J37389L46271
17133A62325O2426J90487k27557q7315J27184l8243K223k56009j07860K28696
17123E6357L73700l58720k08271J79710K17797j59380p0286k9303k24098J48416
17113g4078J28512J17766j09048r9562N8412j87862j71018Q9563L51527J26457
17103B30669l6713k42635N961M8934k63114k70136L6048K52691o1086k1521J1057
17092c09845K04471r0382r4666J48056J97214J19915j83250K4068O5749K26667
$$ y = [302542, 177761, 149985, 57402, -119907, -8729, 98215, -20650, -25172, -120916, -11452, 217216, 36419, -140406, -61511, -32252, -151503, -23870, 99336, 96886, -107143, -200476, -103278, 96064, 259661, 273030, 218396, -54538, -321335, -183946, 162325, 224751, 415238, 187681, 100366, 227550, 189307, 191530, -64479, -172339, 56357, 430057, 71337, -136934, 42776, 260573, 101193, 30907, 1604, -222494, -74078, 54434, 172200, 63152, -36410, 22002, -165860, -336878, -247315, 104212, 230669, 193956, -48679, -42718, 6216, -256898, -527034, -490986, -238295, -299381, -320902, -309845, -105374, -195756, -290422, -142366, 54848, 174763, -8487, 15581, 81330, 307997]
17082C07997K4375j76760J20220J237k61118j80346N3607r8227j53546J31297
17072b31264j24910n6443R1144J54252J71510J21253O9218k42215j97805o8617
17062c13877j11457o4210Q8526K39493j13774j24632J00898J39524M12213l3336
17052B19368k42599j13946Q0754k9617N5668r5852o0678M1754N0039p4879j77157
17041c47145K66539M32416q9872m18843k72637j6769J17476J70624q3074j62831
17031d04116p4220k7246K48587J17469L1401k6884R864M6283J0063J26866J3495
17020G1562k62901k1107L1295q4329J05095J62435Q5966J19366k4320o8963N7637
17009A71736N6820j16140p8959m0468k901k15696j98306K69157Q6084J05494N4024
$$ y = [307997, 332372, 155612, 275832, 277069, 15951, -164395, -110788, -209015, -362561, -231264, -356174, -412617, -321473, -167221, 4289, 125542, 194760, -47455, -245260, -313877, -425334, -489544, -401018, -161525, -275299, -399931, -299033, -159509, 252704, 219368, -23231, -137177, -56423, -86040, -30372, -126224, -186902, -145148, -95109, -169988, -347145, -80606, 351810, 261938, -156905, -429542, -446311, -328835, -158211, -241285, -404116, -478336, -505582, -256995, -139526, -108125, -135009, -125145, -78862, -68799, 58067, 71562, -191339, -212446, -181151, -265480, -160385, 2050, 88016, 207382, 183062, 114099, 171736, 228556, 112416, 33457, -7011, -9912, -225608, -423914, -154757, -68673, 36821, 90845]
16998I0845K36407N1949j03978k58712r6751L1916J28702N9625k50042l9001Q4001
16987f5039J49900N5667p9222j89261J07683P197J83373Q0328j86701k2331R1792
16976A33386j19493M5311N4730l5978J9788J12125j17864r4849J88579K1206l64960
16965a58019r4497J52654o6075q5906K57472L86495j24944m57688o4996j58494
16955d13998r1725K65533L82119j10440O9477j6799p5756l2723m8497p743Q5403
16944D851J19639J45437q7919N4586n4014j40939k8127J00113J38082p0881j88587
16933g759j437M814l0962k54148P3075K23195J54254M4139k49733p4008j05554
16922b24124j55017n8443J2090m7002l2680J22174J0633O4556J5162j886J10125
$$ y = [90845, 327252, 379201, 275223, 16511, -80240, -48324, 80378, 140003, -110039, -149040, -65039, 84861, 140528, 61306, -127955, -20272, -13075, 170298, 250626, 63925, 41594, 133386, 13893, 59204, 113934, 77956, 97744, 209869, 92005, -2844, 185735, 206941, -158019, -252516, -99862, -165937, -251843, 5629, 392124, 267180, -190508, -255504, -413998, -505723, -240190, 141929, 31489, 100966, 84167, 8411, -24312, -72809, -80552, 4851, 124490, 269927, 182008, 236594, 182580, 41641, 13514, 113627, 251709, 180828, -7759, -9196, -4382, -35344, -289492, -216417, 6778, 161032, 205171, -44562, -118570, -224124, -379141, -437584, -425494, -472496, -505176, -383002, -372369, -307813, -292651, -294537, -184412]
16911a84412k11708J05816L7228J85768J605k6105q2410r4370J04513k742L6679
16900a30138J17402j58148j78190P321L45261j10441j04121K29583o9878j05583
16890a56932R7588r3700K4046O6573Q6568j63771j9502l1261k37631k8281l1453
16879d87756k5754K82717J02371j5572R2584r9276J33327k458J20586K6068P9128
16868B05965k24019j20648J21304Q5751K92205j84717J3502k3386J00696j3586
16858B53067j77132j32227P2109P190k59452l64031q8745K85979K83131K88571
16848A68460J9464n3896P2316q320K5335l7324k58434j54700N8151L6169J19864
16837a2915o0822j29211k9892R9343O327J20427k20677j22668J43170J18155m8277
$$ y = [-184412, -396120, -290304, -253076, -67308, -65703, -91808, -174218, -268588, -164075, -166817, -130138, -12736, -170884, -349074, -341753, 3508, -106933, -211054, 18529, -51349, -156932, -59344, -153044, -128998, -62425, 24143, -139628, -159130, -190391, -428022, -456303, -487756, -513510, -230793, -128422, -143994, -51410, -150686, -17359, -19817, 100769, 126837, 205965, -18054, -138702, -17398, 68353, 360558, 175841, 189343, 165957, 266653, 253067, 75935, -56292, 15817, 23007, -236445, -600476, -689221, -403242, -120111, 168460, 187924, 134028, 206344, 198024, 223359, 186035, -72399, -227099, -168948, -132779, -12915, -73737, -202948, -232840, -133497, -127170, -6743, -227420, -350088, -206918, -88763, -137040]
16826a37040k31104j50120J94894J91137j67297J02745J16804K12882k13569r5051
16816a75719Q4537K9171J18520N3123R7843n7198p6156j06752p390p0177o4594
16805a74792o1069k49950o5871K7281J68788J09615l6984Q8007q8473Q4775Q4609
16794a14064O9175m69j51151p1840m3459L7049K24039j14530j51337j28209p5424
16783e20220J03487J43967J05546L0995J56737K20514n0068k11312Q76l7860j10801
16772a68139J08919J13070J90552k27345L2323N2259j215j50820K05322j0285
16762A44641r4109J04552q7530L0395J90660l49378k42573J5070K31719J92444
16752A35891k40672j95536k18331m8933J19203r9367m1917J14456K50957J80848
$$ y = [-137040, -368144, -518264, -323370, -132233, -299530, -196785, -79981, 132901, -80668, -175719, -91182, -62011, 56509, 109632, 207475, 150277, 74121, -32631, -40021, -110198, -174792, -235861, -485811, -551682, -524401, -355613, -245998, -282982, -194975, -283448, -198673, -114064, -44889, -45358, -196509, -268349, -311808, -274759, -50720, -165250, -316587, -444796, -520220, -416733, -272766, -167220, -136225, 20512, 241026, 190958, -20354, -19478, -57338, -168139, -59220, 53850, 244402, 17057, 49380, 101639, 100424, -50396, 154926, 144641, 50532, 155084, 67554, 97949, 288609, -60769, -303342, -288272, -56553, 135891, -104781, -300317, -518648, -567581, -448378, -547745, -589662, -475206, -224249, -43401]
16742d3401N0061k18059k69053J23823L80911N4144j38087k25227j14617K01397
16732a98108J58323Q3241J54781O6915l79017q4845J63538L8254K48595M5572
16722B97249j64260j03005l69848P2848q2626K35174J25014R1968k1018q3955
16712b459j11952N9639j96647R134O3863p8868j8413o764J16102Q7608R4539K53275
16700B69057J22441j91659j40762J13259K3316L8836p9953j9387o770M0988J21145
16689B90511M7562L8218j21987j37642j37795k069l2942k44978R9865J71418n0811
16678h0650O9774J63349j38289j12327k37567j18260L4253M1605J61709L0594
16668a85809j33187K9033J43555o8005J16612j66351J00074J29317j28186n5316
$$ y = [-43401, 6660, -211399, -480452, -356629, 24282, 78426, -59661, -284888, -399505, -198108, -39785, 43456, 198237, 265152, -113865, -198710, -35172, 3082, 251677, 297249, 132989, 29984, -339864, -267016, -349642, -114468, 10546, 102514, 81496, -2459, -114411, -54772, -251419, -242285, -178422, -257290, -275703, -282467, -166365, -78757, 15782, 269057, 391498, 199839, 59077, 172336, 195652, 234488, 154535, 135148, 128378, 169366, 290511, 338073, 376291, 254304, 116662, -21133, -23202, -56144, -301122, -201257, -29839, -80650, -10876, 152473, 14184, -98143, -335710, -453970, -419717, -378112, -216403, -185809, -318996, -289963, -146408, -214413, -97801, -264152, -164078, -34761, -162947, -218263]
16658b18263J33682p8564M9900k35645j49523J67033J35637L01974p5078j99680
16648a68527O2941J4544l0572j6600r759K64540O08732j73428k72467j10731o546
16637A62127o8379m2590N867p0576K64429j75681J1155N818Q1375j07348j55534
16626h9337K12803L740N3114m3094j84729j13490J40918J88910l71406k00887
16616d03458o3565M992J0986K15170J29168M3154l9728n7433N9037J1398J55657
16605F5378j08781n2135P6109K1632m34117J06012L45284Q9115J07559L05779
16595E21835j09839m35573j35040j38509R2802K67884j41484q3953K9099l9514
16585a72292r8977R9714p3778j72249Q798K00989P4982K6415L5701L8264j43104
$$ y = [-218263, -84581, -163145, -113245, -348890, -498413, -331380, -195743, 106231, 31153, -168527, -105586, -91042, -121614, -138214, -147973, 116567, 725299, 551871, 279404, 168673, 162127, 93748, 51158, 57025, -13551, 250878, 75197, 86352, 92170, 173545, 66197, -89337, 123466, 127206, 180320, 137226, -47503, -160993, -20075, 168835, -202571, -403458, -467023, -462031, -451045, -235875, -106707, -63553, -103281, -160714, -101677, -90279, 65378, -43403, -95538, -19429, 2203, -431914, -325902, 19382, 108497, 216056, 521835, 411996, -23577, -158617, -297126, -204324, 63560, -77924, -161877, -132778, -172292, -271269, -171555, -245333, -417582, -408784, -207795, -132813, -106398, -70697, -32433, -175537]
16574a75537P5442J39973J13441r1827J34836q2130k18430j09312k22107l6539
16564d72190J88231K1471j13774M2195J49843J16423J13506j22349k15963j11766
16554d04373p9861K73006J92895o9567j04752j7934p2677J80543o0671q5761l4079
16543b83231K01423K15623o425l02640P6163K65352M7412k94275l61273j02499
16533e44370k7066Q9655J76149j81178j65473J80036J21847J73022j29934j45764
16523d53076O6738M1746M7904k38887k25485J68835L13688n4072J0674r0597O0957
16512c51575j06366N5452J6449K32735p0804j78988M0955o68j14079J37633K58254
16501h1002J00422m1346n6083k16067k1776J88591r4054k31627l3083Q4595Q8923
$$ y = [-175537, -100095, 39878, 153319, 61492, 196328, 114198, -104232, -213544, -435651, -472190, -283959, -262488, -376262, -334067, -184224, -67801, 45705, -76644, -292607, -404373, -484234, -211228, -18333, -87900, -192652, -210586, -283263, -102720, -163391, -249152, -283231, -81808, 133815, 127390, -175250, -99087, 166265, 213677, -80598, -441871, -544370, -571436, -481781, -305632, -486810, -652283, -472247, -350400, -177378, -307312, -453076, -386338, -344592, -296688, -535575, -761060, -592225, -278537, -332609, -321935, -412532, -351575, -457941, -402489, -386040, -153305, -224109, -403097, -362142, -362810, -476889, -339256, -81002, 19420, -21926, -78009, -294076, -315852, -127261, -221315, -452942, -486025, -401430, -312507]
16490c12507K11493o6594j0010j71715m1715K14929J15501k41452K6634K55969
16480a9467r8893j14353m8337q2414J19871K62323K7585R0429j00344M387k66945
16469b26158j74157K70114K1968K4794O3972O1386j8937J59079M9645J3510j00579
16458A44637p7850J37743m24157k15442P1701J15581m1903n0427R6722O3585P0928
16447a08882K28886j4072l8689J15004l3145k5561j1529j28324k27809r3678J4353
16436c23446Q3662P7555J87978j969n4850o1978L7654M6471k09063p2952K98129
16425G191o3021k45216l7707n6709j44976O8574j31472J18004J78232J20885n2553
16414b38768k78635J33712K89104J38573m4066j06530r4928k23835l6638N8734
$$ y = [-312507, -101014, -167608, -177618, -349333, -391048, -176119, -60618, -302070, -275436, -19467, -118360, -232713, -281050, -363464, -243593, 18730, 46315, 136744, 36400, 40787, -226158, -400315, -130201, -108233, -83439, -19467, 41919, 22982, 182061, 231706, 245216, 144637, 66787, 204530, -219627, -435069, -363368, -247787, -289690, -340117, -243395, -179810, -108882, 120004, 105932, 67243, 182247, 149102, 123541, 112012, -16312, -244121, -337799, -323446, -239784, -162229, 25749, 23780, -31070, -93048, -55394, -8923, -217986, -290938, 7191, -55830, -301046, -338753, -395462, -540438, -471864, -603336, -485332, -307100, -186215, -238768, -517403, -383691, -94587, 43986, -80, -106610, -201538, -425373, -462011, -403277]
16404d03277J53349J14794N0620r1496J4652J38314k21018P6588m4823o4037J93622
16393h2712L4722p6402j88458k2577K08039M0837J18798K24984p8293k68932R9902
16382I908J08996J32740J80858J1929k86892o8965k7702k5820j61651J11283k8645
16371d3961j34874N7593r4617l16478p7486J57509J49331j37918l3109j32615
16361f06625J5222J10554J6092M2059J58823K42899L24490j10279j53482M9895
16351H9648q5181K08078J61142j98044j00759j87849j66312Q7229L0442j8881
16341a80487o2339o0857J9118j47661R7J73468J63796N0216k2893o5023O5423
16330f7142J19460k644o3199j6815J50028J42946m9501p3230k13647M6104J27290
$$ y = [-403277, -249928, -135134, -84514, -176010, -161358, -23044, -244062, -167474, -212297, -276334, -82712, -47990, -124392, -312850, -335427, -127388, -86551, 32247, 257231, 178938, -89994, 9908, 118904, 251644, 432502, 444431, 157539, 88574, 60872, 35052, -126599, -15316, -43961, -178835, -121242, -215859, -532337, -609823, -452314, -302983, -440901, -474010, -606625, -591403, -480849, -464757, -422698, -263875, -20976, 303514, 193235, 39753, 89648, 4467, 212545, 373687, 175643, 74884, -112965, -279277, -192048, -161606, -180487, -242826, -303683, -284565, -432226, -432129, -258661, -94865, -44649, -67542, -132565, -67142, 52318, 49674, -13525, -30340, 119688, 262634, 213133, 139903, -73744, -27640, 99650]
16319I9650J38107l81791l11159n2195l5098Q2834R6929K26192r3285r4758R8604
16308b25970J13654j25018q3969J75215J94468K43013o449k47169k14197J33855
16298d2567K08316J3231j62803J44811Q9006j10488m6393K54809n1446m5367M4580
16287B95689j01339L4026J36545j41874j03284l3654m9757o0679RL3574k30392
16276b21136j3569L60234J68607Q0553q3787K9698L8788k76781k33192J67772
16266A7187o6064l5575O6514R3672j02199K13657Q3389J45889r915k14873r0728
16255A00954j2844r1946p5347K25271o8544j38923k2728K65159J37729j0004j22177
16244A86600j70187J06279k0145j41743q3856k21354j6794R3521J52571l1481
$$ y = [99650, 237757, -144034, -455193, -507388, -542486, -459652, -362723, -136531, -229816, -324574, -225970, -112316, -237334, -321303, -146088, 48380, 291393, 284944, 37775, -176422, -42567, 165749, 178980, 16177, 160988, 249994, 139506, 93113, 347922, 296476, 251109, 295689, 194350, 228376, 364921, 223047, 119763, 86109, 36352, -24327, -24318, 9256, -221136, -234705, 125529, 294136, 374689, 290902, 320600, 359388, 82607, -150585, 17187, -48877, -84452, -17938, 75734, -26465, 187192, 270581, 416470, 406555, 191682, 100954, 88110, -3836, -79183, 146088, 77544, -61379, -84107, 181052, 318781, 308777, 186600, 16413, 122692, 102547, -39196, -123052, -344406, -361200, -267679, -115108, -146589]
16234a46589J12097l0963j14137K3227j8622n8198j16261N903J93004J39328J65416
16223A54205j14371k33993L7997k1848k37465O5110J56164j24965Q7063L0240
16213b01863Q7712J72022L30846m1983j06442j69844j61270k0424j90415k33742
16203e35403K01689L5479J13510j56101P1807K44930Q128j77228q4956O717P7965
16192a93463L02432k6617q3332k4148j7002o6750j12836K0698o3650k7600Q7308
16181b04960j1575j88263j16699P3001K54650j83511j7126K07218K7684j60044
16171c19625Q0271O0356N1819l5268O460l4544o1537p4274j38317k8171K09914
16160b82916J86176q0775O4339K41995m5052o6053m482P874Q7123j38521k61850
$$ y = [-146589, -34492, -65455, -179592, -156365, -174987, -233185, -349446, -343543, -150539, -11211, 154205, 39834, -194159, -156162, -178010, -415475, -350365, -194201, -319166, -232103, -201863, -114151, 57871, 388717, 346734, 240292, 70448, -90822, -111246, -301661, -535403, -333714, -298235, -184725, -340826, -269019, -24089, -15961, -193189, -278145, -271428, -193463, 108969, 82352, -980, -25128, -42130, -108880, -221716, -201018, -264668, -292268, -204960, -216535, -404798, -521497, -448496, -193846, -377357, -394483, -187265, -159581, -319625, -239354, -178998, -127179, -162447, -155987, -190531, -252068, -326342, -464659, -492830, -282916, -96740, -177515, -113176, 128819, 83767, 17714, 13232, 21106, 108229, -30292, -292142]
16149b92142j49407L2947P4337J95045O0982o9368j00962J08849K11731K7814
16139I9826q0662n0569j08810n6493K68161J8540J29716K59397J1377m60221j44114
16128a13852K03349J776j79498O8281j08997K7266J86179J10221P2374j58482
16118A08617j48516l046J04213j16445j55159L0364J56511L18474j4533k38485
16108D1995J08691r4104k18132j98282K53258k5872o2958N2456k36780K00487
16098a79241J1961N3080r1634J47142J56765l2845j8072j67876K533P8646O0181
16087B0640k5564J2579j06580n8690n5291J03760J23282L3616j41261Q2885J55234
16076A44610j39487n0763K30685L7367J29943r4616k91240O8240L3509o4782j57919
$$ y = [-292142, -441549, -408602, -334265, -139220, -78238, -147606, -248568, -139719, 72012, 99826, 19164, -31405, -140215, -196708, 71453, 89993, 219709, 479106, 490483, 30262, -113852, 89497, 91273, -88225, -19944, -128941, -101675, 84504, 194725, 267099, 108617, -39899, -42945, 61268, -55177, -210336, -179972, -23461, 295013, 280480, 41995, 150686, 56582, -161550, -359832, -106574, -132446, -195404, -142948, -379728, -179241, -167280, -114200, -205834, -58692, 98073, 65228, 47156, -120720, -118187, -39541, 20640, -4924, 7655, -98925, -157615, -212906, -109146, 14136, 47752, -93509, -10624, 144610, 5123, -45640, 185045, 222412, 352355, 257739, -33501, 34739, 68248, 3466, -154453]
16065a54453p9177j74466J08336l981R816K93376k224O0969j9677J20536O7759
16054B26814m8210l3261R1283j99456k06201Q5034K06331J48343p8701P7866m50427
16043a80585j17756J25947p4938j99671J26270l1946o1161k5531k4972j63198
16033f27541j41136J88443j30790N4318R4006k4633J35256L49809J5860l37690
16023d24098j00784L5076K68860O9581k4505j94831j03032L2426O3770K41583
16013a35954N4332M33j49253N3078K75506k920q1639l6944Q0535L4225k8740m8805
16001A3854R353m5957q2762O5660M7089k8498p9710J03021K01343L2870j23835
15990A12428j06731P205k54907j25964Q8484K60153P802N7063L7389o6043J06254
$$ y = [-154453, -233630, -408096, -299760, -303741, -293925, -549, -2773, 58196, 38519, 159055, 226814, 178604, 145343, 236626, 37170, -169031, -83997, 122334, 270677, 191976, 269842, -180585, -298341, -172394, -247332, -447003, -320733, -352679, -413840, -439371, -464343, -627541, -768677, -580234, -711024, -656706, -562700, -587333, -452077, -102268, -86408, -424098, -524882, -489806, -220946, -151365, -175870, -370701, -473733, -441307, -377537, -135954, -81622, -81189, -230442, -177364, 98142, 95222, 13583, -23361, 57174, 91399, 62659, 13854, 23207, -22750, -105512, -39852, 7237, -21261, -100971, 2050, 203393, 236263, 112428, 5697, 12902, -242005, -367969, -279485, -19332, -11530, 45533, 82922, 16879, 123133]
15979A23133L2086J3589o644j93266p7174J62150M0106j14554J39359p237j87688
15968g6140n7258Q1553J59417p0861K01235J43570M2476k73494j46574m9540q756
15957e4372q5032l35268L41313O8221R2703j86565j27109r245K91799J47121p7916
15946F5650L8706p9613l1260j64814p1833Q9442O8252k0022q296j51551J43991
15935a21348K04018M51463j6421j32275k96430k07556l7766K0811r3799K32510
15925C207O5872k99055j48018j29157Q2783Q6885k8737k0145k3983o9801J77846
15914c02303K15365j1272l9566j08909M04356R810r5583M7507K561o4500O5907
15903A23373k42493M9922j14401o4721k16354O4807K39188R4921j03405o5774
$$ y = [123133, 155219, 168808, 162164, -31102, -108276, 53874, 93980, -20574, 118785, 111548, -76140, -133398, -51845, 107572, 36711, 237946, 381516, 423992, 150498, 3924, -45616, -54372, -139404, -474672, -133359, -65138, 27565, -159000, -286109, -295354, -3555, 143566, 65650, 104356, 24743, -6517, -171331, -243164, -153722, -85470, -105492, -113788, -265339, -121348, 82670, 534133, 517712, 385437, 89007, -118549, -156315, -135504, -229303, 3207, 69079, -229976, -377994, -507151, -424368, -337483, -366220, -386365, -410348, -480149, -302303, -86938, -98210, -137776, -246685, 157671, 167481, 71898, 119405, 121966, 57466, 123373, -119120, -69198, -183599, -248320, -464674, -399867, -160679, -65758, -169163, -234937]
15893b34937J65198j9267o5900J7405k920q1226Q8716J06747J22610J04346j79132
15882B1640k43830K63909J45569j94598k34188J66673K39962k5286m03423k24897
15872d88469J34975L22968L48957q7106k60977q5585L8333m0444j41912q7628
15862c46888J07289P1474J68545N3331j71636j65151O7805j53846J65366K58467
15852E4756O6189K50702r5164l6457m7754j16164R3962j41429r0152j10799m6445
15841b18755J46779k6015o8491j42443K29386j56495J24208Q1055j85224l48138
15831e64133o1302m8214J5628K6311J56519Q5338j22528q2121J34616Q6889K5017
15820c47980J85937O4822p178J05527P9273j44025k60975M4763Q4624m2963J55351
$$ y = [-234937, -69739, -89006, -154906, -137501, -140421, -221647, -132931, -26184, 96426, 200772, 21640, -222190, 41719, 187288, -7310, -241498, -74825, 165137, 139851, -263572, -488469, -353494, -30526, 318431, 231325, -29652, -115237, -76904, -117348, -259260, -346888, -239599, -168125, 420, 53751, -117885, -283036, -215231, -369077, -203711, 54756, 120945, 371647, 276483, 240026, 192272, 76108, 170070, 28641, -61511, -172310, -218755, -71976, -97991, -166482, -308925, -79539, -236034, -111826, -30771, -215995, -564133, -625435, -673649, -658021, -631710, -475191, -389853, -512381, -594502, -459886, -372997, -347980, -162043, -97221, -104399, 1128, 80401, -63624, -324599, -279836, -195212, -238175, -82824]
15809h2824J98910P7522K3535j3158q9076m0237l1975K19172L30333p5162j09841
15798D07199k92016j62872J65949p8832l13036P3026j56412j97892M7925Q5022
15788d21939K40766J14214k64247o5307j78104J82691K33504K22202k5810o7220
15778b9250n8358j18692J1078K236L75483j51628l18866J05370J69892j85939
15768a98674M5469J47168r1261k01361j26379n0354l06339J0608J48775p7876
15758g00224K02195K70403J82196P500j38272K9704m7111j42369K36137K12594
15748A12753p5855N3374l2720k19212k56014o4955L9016L00514K99735l14622
15738a57986j03726K12584K13971j62687j20181r7808L9741j00825k46496J17411
$$ y = [-82824, 116086, 193608, 217143, 203985, 114909, 74672, 42697, 261869, 592202, 517040, 407199, 115183, -47689, 118260, 39428, -273608, -200582, -356994, -554886, -506961, -421939, -181173, -66959, -331206, -396513, -574617, -391926, -158422, 63780, 37970, -29250, -87608, -206300, -195222, -192986, 182497, 30869, -287997, -182627, -12735, -198674, -153205, -6037, -97298, -298659, -425038, -475392, -781731, -771123, -622348, -700224, -498029, -227626, -45430, -37930, -176202, -146498, -193609, -335978, -99841, 112753, 36898, 90272, 57552, -161660, -417674, -482629, -443613, -143099, 156636, -157986, -261712, -49128, 164843, 2156, -118025, -215833, -176092, -276917, -523413, -406002]
15728d06002J18860j89528J9021K45077P1139j49501l4353K90508R2605M9402
15718A07228n4868j00606N5429j94820k22709l6843J71253K10676J35769j487
15708F9022K19347j51033j51793p7818j72674J86749l5847q1640k5509J33600
15698h7596J72860p2091k09933L5750O9968J03582P7474J32879j18983j47254
15688d3344l5856J45575L2125Q7615L01019p9351k97903k00485P927j90312k78934
15677e51924j741J08216J10945J67794M1378j41852l05396j49152O8413M23338
15667b29981J6584j32907l588J05850m0927k9333Q1386r0068K5742M91491J58115
15656C52364j93573l83786l20119N5140J16074o5567j15946O4817K06612K17340
$$ y = [-406002, -287142, -476670, -457649, -212572, -141433, -290934, -325287, -34779, 57826, 107228, 52360, -48246, 7183, -187637, -410346, -447189, -275936, -65260, 70509, 69022, 288369, 137336, -14457, -92275, -264949, -78200, -114047, -195687, -221196, -87596, 85264, 13173, -196760, -161010, -91042, 12540, 90014, 222893, 103910, -43344, -79200, 66375, 98500, 186115, 487134, 407783, 109880, -90605, -82678, -272990, -551924, -553665, -445449, -334504, -166710, -125332, -267184, -572580, -721732, -653319, -229981, -213397, -346304, -349892, -244042, -284969, -314302, -232916, -322984, -297242, 194249, 352364, 158791, -224995, -545114, -489974, -373900, -439467, -555413, -490596, -283984, -66644]
15646f6644j69163l56629O497Q4497m190L73841Q8286J15113J81881J27278j66654
15635B14113L95j4325j02237k32706m2088J40993L4878p3012l419j47590J7500
15624b07498R003N8156K28645n2299L4041r4618k83594J55047L9346j12422J29652
15613i6541J66468j86515j96023n7248J04544K93379J98495J20199M8130L1048
15603D25936j86761k5602k75666j21852P6661K03381p4990p0947n4038L5159j46291
15592b15010J8251j99245k26839J12802M3949K28752k5983j75434J79582K21695
15582c7480P2360m3814j21004J50730J29434k43671l05325j39125K14480K21545
15572a01870K82267m1243K8497N17j71326k35446k000k4648N4721j10580N1948
$$ y = [-66644, -235807, -592436, -585939, -501442, -505632, -131791, -43505, 71608, 253489, 380767, 214113, 214508, 200183, 97946, -134760, -176848, -35855, -977, -73989, -77408, -224998, -207498, -198495, -140339, 88306, 36007, 70048, -24570, -308164, -153117, -113771, -226193, -96541, 69927, -116588, -312611, -369859, -265315, 28064, 226559, 346758, 394888, 425936, 239175, 213573, -62093, -183945, -107284, 96097, 21107, -49840, -103878, -68719, -215010, -196759, -396004, -622843, -510041, -466092, -237340, -263323, -438757, -259175, -37480, 34880, -8934, -129938, 20792, 150226, -93445, -398770, -537895, -323415, -101870, 180397, 139154, 167651, 168168, -3158, -238604, -240604, -265252, -210531, -321111, -269163]
15561b69163K17683l4100K27178J58896j30865j53559k36433P9600R4436j42766
15551a89093N5886q449k14937o3276n9706j14289O6601N6081J23485R0774K45042
15540a1881J6830j76110M5227q1315k0277K8343k61102M7367K00441K22066K01524
15529B11113r0938m20791j17143q2144K45531K16699m3365m1557J15681J01326
15519I4412J9105r1330k52496J00997j24833j2075l490j13833m1012m3314K9568
15508d38301J91075K78257J00067k10063N3452J64309l50406k60952O3098J16977
15498b92487J12043K0605R2872k28313l3161J79229K14683j38471j38721K87012
15488G5291K18848J23006j70659j76658J4647k71709j26311q8074o2289j68J76440
$$ y = [-269163, -51480, -85580, 141598, 300494, 169629, 16070, -220363, -140763, -46327, -189093, -133207, -141656, -356593, -419869, -479575, -593864, -527263, -471182, -347697, -256923, -11881, 4949, -171161, -125934, -207249, -227526, -199183, -460285, -412918, -212477, 9589, 211113, 120175, -300616, -417759, -499903, -254372, -37673, -81038, -122595, -6914, 94412, 113517, 22187, -230309, -129312, -254145, -266220, -269710, -383543, -424555, -467869, -438301, -247226, 31031, 131098, -78965, -25513, 138796, -211610, -472562, -409464, -292487, -180444, -159839, -66967, -295280, -328441, -149212, 65471, -73000, -211721, 75291, 294139, 417145, 246486, 69828, 84475, -187234, -313545, -401619, -463908, -464076, -287636]
15477b87636J28103J18534P5448m0126j30912o1156K49912K22174j06502r068
15467A58771k63032k13634R5751N8702Q3888j25510Q93K61472R8700j08471j96590
15456a49060r7548J68009K4336j91368K92610K97890k75486k90227P5332J24536
15446b0976q6251j64111J69400j28996j94723J97678K59864n9278k20020J0174
15436b37239k60486j3759J65247L24260O3909N1988j07649j36301J21418r740
15426c8352k1k8888j66529l1444L7742J54175q2173r2551N7252m6726k31688k00749
15414f69952Q9532J62902L25392J24059Q3037K93561p9546k27861j39213j01694
15404a39783m197J0058J41497j42993Q2806K4675O3467j20319k53331K29898K43528
$$ y = [-287636, -159533, -40999, 34449, -5677, -136589, -197745, 52167, 274341, 167839, 158771, -104261, -317895, -222144, -163442, -79554, -205064, -204171, 57301, 156001, 47530, -149060, -246608, -78599, -54263, -245631, 46979, 344869, 69383, -220844, -145512, -20976, -107227, -271338, -101938, -230934, -425657, -227979, 31885, -27393, -247413, -237239, -497725, -511484, -346237, -21977, 41932, 93920, -13729, -150030, -28612, -38352, -38373, -67261, -233790, -265234, -227492, -73317, -155490, -248041, -190789, -237515, -469203, -669952, -580420, -417518, -92126, 31933, 114970, 408531, 328985, 101124, -38089, -139783, -143980, -133922, 7575, -135418, -52612, -27937, 35530, -84789, -338120, -108222, 135306]
15393A35306m9823j98372j18094j17449J61499J47278j19708j4216p8064K1875
15383b29768j1673j80799L2880K15664P1902R2884l98729k61032J28113K02353
15373c38205J56110L7176r0865J34356Q7600m9383q9172k30646j58623q9821K1931
15362f09542L14275Q0409q4049q6089K4021J2007K6015r0165P8845K18039K11098
15351I4864j4722j37699j35472r5902l77818K30501K89738P186l3158N0491j01260
15340b23251j3228J39159J26553M7600k00348p734K68107J2614k28478J79354
15330A00348m9984j62060J19489j2060k5438j36157k90399n4320k1580K88281
15320b43880N9813J04896j1692J341L0404k5037K29262j85773k87993O7296o4361
$$ y = [135306, 85483, -112889, -230983, -348432, -186933, -39655, -159363, -173579, -251643, -229768, -241441, -422240, -389360, -173696, -101794, -8910, -407639, -668671, -540558, -338205, -182095, -144919, -235784, -101428, -13828, -63211, -152383, -383029, -541652, -631473, -609542, -295267, -214858, -298907, -384996, -360975, -348968, -322953, -413118, -334273, -116234, 94864, 80142, -57557, -193029, -288931, -666749, -436248, -146510, -139324, -172482, -121991, -223251, -236479, -97320, 29233, 76833, -123515, -131249, 136858, 149472, -79006, 100348, 50364, -111696, 7793, -4267, -29705, -165862, -456261, -510581, -532161, -243880, -184067, -79171, -90863, -89522, -59118, -84155, 145107, -40666, -328659, -261363, -325724]
15309c25724P6417J06971k52379n738M5330P2693L22624N9387l62651j25963j38326
15298e27359R9183L28619P1724k11695j59433p413J0753M5764L8642J43782K1919
15287a45514N4059L4994m7656j68507l1976J05026k8538j99140J50807N9496J29482
15276h7467j3149n3438L7918L2542M4718M8297j0194p9244k49057M6018L49J17975
15264a64732K90985j11586O2804O9603j08081p1628j06645P4407m2477o7416p2347
15253b47113j87770K9065L0954J41342p0536j8455l0716j3534J63195K69503K53529
15242C19464L0721n6941J5927M6034l44565k81879J28483J85181j11870j46579
15232b16024l8095M2505l7336J28356J49392J59261l02388m0266J09454P4263
$$ y = [-325724, -249307, -142336, -394715, -400453, -355123, -282430, 40194, 99581, -263070, -389033, -527359, -428176, -99557, -27833, -239528, -398961, -406374, -395621, -349857, -311215, -167433, -145514, -91455, -56461, -104117, -272624, -304600, -199574, -228112, -427252, -276445, -216949, -87467, -100616, -154054, -116136, -83594, -38876, 9421, -773, -80017, -329074, -283056, -282707, -164732, 126253, 14667, 77471, 147074, 38993, -32635, -139280, -64873, -107350, -174766, -247113, -434883, -405818, -374864, -233522, -304058, -322513, -353229, -366763, -203568, 65935, 319464, 350185, 293244, 309171, 355205, 10640, -271239, -142756, 42425, -69445, -216024, -254119, -211614, -248950, -120594, 28798, 188059, -114329, -154595, -45141, 29122]
15222B9122o9289o3392p3024m6348j08521K679K0004p1920q4741L6499K00361
15211b28570J13491p8202k04729j83490J08852Q9003K94620K27036l6488j09276
15201g753J8039K2263n5125Q2005j96964k2561j32666j52084L6322J99862J95591
15190a3071j65536k90935j438J20862J43961l0327J10075J96597m292J2288j04020
15179b5836q6163R3813j91784j37036j60610L1295K98261J54479q0964j39035
15169b43580j46203j08384J82925K40343J49030J50545J03197j18508j04491j26282
15159b1408J1286j20474J32887K66989k17536n1376m8854j84559k0567L0454J90411
15148c2747J27789K00534K67385k72527j75601Q1861n5791j34593j81906k02400
$$ y = [29122, -40167, -103559, -176583, -222931, -331452, -328773, -308769, -380689, -465430, -428931, -228570, -115079, -193281, -398010, -581500, -472648, -383645, -89025, 138011, 101523, -7753, 10286, 32549, -22576, 59429, -137535, -160096, -292762, -444846, -408524, -208662, -13071, -178607, -469542, -470980, -350118, -206157, -236484, -126409, 70188, 65896, 78184, -25836, -111999, -18186, -209970, -347006, -507616, -476321, -178060, -23581, -104545, -243580, -389783, -498167, -315242, -74899, 74131, 224676, 327873, 209365, 104874, -21408, -10122, -130596, 2291, 269280, 51744, 368, -48486, -233045, -253612, -223158, -32747, 95042, 295576, 562961, 290434, 114833, 196694, 140903, 6310, -175596, -377996]
15138c77996R6626j23723N6046J81247J54319j18668J7136j17810q9272O8977
15128b53118k19852M0741Q5364L99816j44109p1427M04497n411k96535L5420J60595
15117A35981N8760j06457o8763n7929j09830J2848k4986R1313m2035J8581J12643
15106B0126J18362j92730k61367o3446k2877J42568k1941J26470J00905K87671
15096B33741j9167m43137j91036j41627J81855j1421K40428K79526j5002k52735
15086a38575k58939Q9459J15110j31944j15856M17550j0830k86966R7156O3876
15076a59959J67140K014k7320J33063j05442J12429n6886K8690j54980L3245R2250
15065F4244L6093k19759p35N4685j75786J12335J03237j22680n5507P4909m9742
$$ y = [-377996, -281370, -405093, -349047, -167800, -13481, -132149, -115013, -232823, -322095, -253118, -472970, -432229, -346865, 52951, -91158, -162585, 241912, 236501, -60034, -24614, 135981, 194741, 88284, 19521, -38408, -148238, -135390, -160376, -69063, -111098, -92517, 20126, 138488, -54242, -315609, -379055, -401932, -259364, -281305, -154835, -53930, 233741, 214574, -228563, -419599, -561226, -379371, -390792, -150364, 129162, 114160, -138575, -397514, -308055, -192945, -324889, -440745, -23195, -34025, -320991, -223835, -159959, 7181, 9195, -18125, 114938, 9496, 121925, 65039, 93729, -61251, -28006, 64244, 100337, -119422, -120157, -65472, -241258, -128923, -25686, -148366, -203873, -128964, -178706]
15054a78706J96977P4454j33182l97360p9954J19342K37567K58032N0526J83472
15044C31168l6074j17491J24278Q7452K8441n4624m6469k08824k27122j60674
15034b79939k53172J3914M22935K18533j49381j95376l9712O7982P0005J20591
15024c620l18073j16163J02805J29843O1557J4224P9376J34808j13481l2436K66879
15013B05719j50939j47620J17976M5059j6535j99799J30280j27023R954J44777
15003A1849M8552Q1211p6046r7600p1829j26760j06830L64380J9989N7240K12614
14992C16770o0887k34869j88749p7115J6170j75199N7183R1249n5494J18672L39126
14981A46857m0480k14274j28647J58129L45351R9972l08937j11853J7526m9612
$$ y = [-178706, 18271, 92725, -40457, -437817, -517771, -398429, -160862, 97170, 147696, 331168, 295094, 177603, 301881, 389333, 417774, 363150, 316681, 107857, -119265, -279939, -533111, -519197, -96262, 122271, -27110, -222486, -262198, -194216, -124211, -3620, -321693, -437856, -335051, -205208, -143651, -129427, -50051, 84757, -28724, -61160, 205719, 54780, -92840, 25136, 70195, 53660, -146139, -15859, -142882, -132928, 11849, 60401, 141612, 65566, -32034, -103863, -230623, -337453, 26927, 46916, 104156, 316770, 255883, 21014, -167735, -244850, -228680, -403879, -346696, -255447, -310941, -192269, 146857, 106377, -107897, -236544, -78415, 266936, 366908, 57971, -53882, -36356, -85968]
14971h5968p4210j90767p1700P4847J09024J82418o29r604R7651j49729P4794
14960d3873P2354J86765J01122j69401j67849j3480K03002r3605l05340q8443
14950c18748j48128j73538J63235M21910K17452m5473k6469J98542J70983k58288
14940B01478j96790o9689l3115M7676q7734M4923J46264m5175R2922L27808j7820
14929D10748k60750o6271j12672m8369j83931k18810k60489j07410L07189J36211
14919d04554P356n6799r425P5792J34892l8810k3326J42139K44139K88712N298
14908C65414k3942k05708j23913p5230j32785J07630J35168R0246k32313k40681
14898c36114J74606K04234m1953K5815j61069k92358N5626L41552K5472j38286
$$ y = [-85968, -160178, -350945, -422645, -347798, -238774, -56356, -56985, -66589, 31062, -118667, -43873, 28481, 215246, 316368, 146967, -20882, -34362, 168640, 75035, -230305, -318748, -466876, -640414, -477179, -55269, 162183, 116710, 90241, 288783, 459766, 201478, 4688, -65001, -98116, -50440, -138174, -93251, 53013, 7838, 100760, 428568, 410748, 149998, 83727, -28945, -77314, -261245, -480055, -740544, -847954, -540765, -404554, -397198, -453997, -463422, -387630, -252738, -291548, -314874, -172735, 71404, 360116, 365414, 341472, 135764, 11851, -63379, -196164, -88534, 46634, 136880, -95433, -336114, -161508, 42726, 773, 26588, -134481, -426839, -371213, -29661, -4189, -142475]
14888a42475K73791L1217k27844l0825K65363K46969p420r9067k92384o2136j7540
14877f2351p5836j25766j80215m9234K69627M4098J97491K32566l6722j1895k41267
14866c9504J02189Q9535J76187k8678j84138j26386k9744L1847j24148n9986j61925
14855c54751N4201K40371K6558k09263N9407M5245j70932k41656j94238L28675
14845d16383J84593j20091j71797K08464M2147J8909J93251q0947j94830K24731
14835a11953J49453Q0107l0866r8729j86271m7023k0858M4291J06304J38624p1228
14824d8149n6005j70868p984j03833O8729j56183j19171K88812K03578k8448l9637
14813a69159m5653j87073J06345L11650K16090K18772M6306o1931k23124l13799
$$ y = [-142475, 131316, 162533, -65311, -96136, 169227, 416196, 408776, 309709, 17325, -44811, -62351, -138187, -263953, -444168, -493402, -223775, -179677, 17814, 250380, 213658, 201763, -39504, 62685, 152220, 328407, 299729, 115591, -10795, -40539, -8692, -132840, -192826, -354751, -300550, -60179, -33621, -242884, -183477, -138232, -309164, -550820, -745058, -416383, -231790, -351881, -523678, -315214, -273067, -254158, -60907, -141854, -336684, -111953, 37500, 117607, 86741, -11988, -198259, -245282, -266140, -221849, -115545, 23079, -48149, -104154, -275022, -283006, -386839, -318110, -474293, -593464, -304652, -101074, -129522, -169159, -214812, -401885, -295540, 16110, 232200, 450972, 497278, 435347, 212223, -101576]
14803a01576j19187N2776j74448j20898l3577J24108J90149j8315k92039j9460
14793e12467L14651k25594k64127P3226K82596R1249k28618j81880K52611J56835
14783b41518L7545j64798R2900R9744K41104K47896L4185j47706j93125k882J30199
14772A33544j12759j02423J25111j375j67370J936j72963m5518J60305J83585
14762B073J09307r3417j15226R7510Q8771j31206k95365K16125J61696q3487j58086
14751b01305l4880o1091j20071l5480k3318L09933J24887J37630k05363m80191
14741e89249K8015M71506K01781O7243n5992j06877J61926o6868l0466J17495
14731A98514m3855j42619J46007P684r8486N9165m6905j1096r7268K00480N6682
$$ y = [-101576, -220763, -167987, -342435, -463333, -496910, -372802, -182653, -200968, -493007, -512467, -197816, -423410, -687537, -614311, -331715, -240466, -469084, -650964, -398353, -241518, -203973, -368771, -275871, -176127, 64977, 312873, 347058, 199352, 6227, 3345, 133544, 20785, -81638, 43473, 42098, -125272, -123336, -296299, -341817, -181512, 2073, 111380, 17963, -97263, 247, 89018, -42188, -337553, -121428, 40268, -43219, -201305, -236185, -297276, -417347, -452827, -476145, -166212, -41325, 96305, -109058, -589249, -561234, -89728, 112053, 179296, 123304, 16427, 178353, 111485, 81019, 198514, 154659, 12040, 158047, 165731, 67245, 126410, 79505, 68409, -28859, 171621, 228303]
14720B28303K0996j70805j27355J17224k49944N1675K16332l3805j33840J02630
14710B1411j10835J70398q7032j01409P7707k8300j51903P9915L0246J19766J8497
14699C8461j44992j27854K28950L62244J42467k23468k59387O7229n0940q0980
14689d8270K1396k38642R2377q3219m0883J35737j01531N5655q043j24906o9245
14678d09574J14822J21294k16790j10088K6099K20170q6239K5736j6003l47548
14668f78121k2232J41146j6253o8215K58747L12847K750k83870j11175J37622
14658c26754M7568M8438N8521K12118K45426j36215Q0255j9452l35353n8305J91784
14647H031M8874k1781L80883k54741k47976l07059P3517m9621j968J92593N2495
$$ y = [228303, 249299, 78494, -48861, 68363, -181581, -129906, 86426, 52621, -81219, 21411, -89424, 80974, -6058, -107467, -29760, -58060, -209963, -130048, -99802, 19964, 38461, -106531, -234385, -5435, 356809, 499276, 275808, 16421, 83650, 32710, -48270, -26874, -265516, -173139, -256358, -297241, -161504, -263035, -207380, -215423, -340329, -409574, -294752, -173458, -390248, -500336, -474237, -254067, -340306, -314570, -330573, -678121, -700353, -559207, -575460, -643675, -384928, -72081, -69331, -353201, -464376, -326754, -279186, -230748, -172227, 39891, 285317, 149102, 229357, 209905, -125448, -183753, 8031, 56905, 35124, 416007, 161266, -86710, -393769, -320252, -369873, -371841, -179248, -126753]
14636a26753J51065Q9499N6404p1889J47478j786l25418J19716o9095j45159P556
14625a68382J17257r017L5690M3248P5518k85350j46722J1935L12792K25134M6552
14614B58655q398r630J14158k6354j00040j44066j17587k23495J28072L19704
14604A91019r6082k23149J29418K51885l2810m3846q4096l4150j69069Q8713K56333
14593B34166N1658j80753K1237M5586j61464k09501R1036R1459J8147n2986m196
14582e5611j11763J51274P5723K08522m7287m5775R134k74429l0242k07603K7700
14571c00357j18400L2303N16697L21390K48717k77395j00700P9606j8829j10181
14561B72851j29132j0747k00514k72598J72544J93904J38099J73120j70326M4958
$$ y = [-126753, 24312, 113811, 170215, 98326, 245804, 244018, -81400, 38316, -30779, -175938, -168382, -51125, -60142, -24452, 18796, 94314, -191036, -337758, -325823, -13031, 212103, 258655, 250257, 240627, 354785, 328431, 228391, 84325, -33262, -256757, -128685, 191019, 94937, -128212, 1206, 253091, 220281, 176435, 92339, 58189, -110880, -22167, 234166, 285824, 105071, 126308, 171894, 10430, -199071, -108035, -16576, 1571, -51415, -55611, -167374, -16100, 59623, 268145, 220858, 175083, 184217, -90212, -120454, -328057, -300357, -418757, -386454, 130243, 451633, 700350, 422955, 322255, 401861, 383032, 272851, 143719, 132972, -67542, -340140, -167596, 26308, 164407, 337527, 167201, 212159]
14551B12159L1392j96481m54657k91803K96514K65109M4175M1797J89277Q2549
14541B20031J70986J47638N438k44964j41741Q0654K3518j57017r7241p1956R6726
14530C2072l3438j69407l4036M0498J58868K5741M8348k11586L4608N4184O1242
14519G094K43479j8492K04100N1521q8385j60059L9032N4608j0020J17132N2520
14508D92530N2283j68823k09213n267J34079J99907m914j85874k26388J58409
14498B36729O8133M4437k7124j63159j41802n2912K51536J49922r0079j5057j34841
14487A25783Q1071r7295j72465K50268n0617r0699O8510j4988m8600M2256j75243
14476h2019p6401J27975J30206P5798j21113P331j63315l59895k01143L00158
$$ y = [212159, 243551, 47070, -407587, -699390, -402876, -137767, -93592, -51795, 137482, 220031, 391017, 538655, 544093, 299129, 157388, 238042, 261560, 104543, 7302, -64654, 32072, -1366, -170773, -204809, -164311, -5443, 20298, 68646, -142940, -108332, -54148, 7094, 250573, 232081, 436181, 487702, 399317, 239258, 278290, 332898, 322878, 440010, 492530, 544813, 375990, 166777, 161510, 295589, 495496, 490582, 304708, 78320, 236729, 304862, 349299, 322175, 159016, 17214, -35698, 215838, 365760, 275681, 260624, 125783, 206854, 109559, -62906, 187362, 136745, 46046, 114556, 99568, 50968, 93224, -82019, -158420, -30445, 99761, 175559, 54446, 61777, -101538, -461433, -662576, -362418]
14466c62418K80902N25484K4460j73937n6897p1982J33942J47895M2310l19050
14456A70709k00793l0279L30154J20736O200K2727r9066k59854k06188n3723M05281
14445B05904K9892p6245P0665n5032j04773J8278q4812k1931o3342K1091J9570
14434d0735R9522r8616j39939l3410O3864J29587J57007r4541J58438o9991J13535
14423B44721R6507k87037j79346j54186M1184K9993N5463L64847k00614p1649
14413f0117k55o0929K18519m8613o5616L5923p9569J42781J32584L9139K13353
14402D67200r3659j97051j69352n1573N3186Q9207L30554l2655k12606j06587
14392G6664P0275m5836j06349k05177Q2149K55443O6851o1452Q163j9335j99215
$$ y = [-362418, -81516, 443968, 468428, 294491, 237594, 165612, 299554, 447449, 489759, 170709, -30084, -60363, 269791, 390527, 396727, 419454, 320388, 60534, -145654, -199377, 205904, 235796, 159551, 230216, 175184, 70411, 88689, 3877, -18054, -81396, -60305, -40735, 58787, -39829, -179768, -213178, -149314, -19727, 137280, 42739, 201177, 131186, 244721, 341228, 54191, -125155, -279341, -238157, -208164, -152701, 212146, 11532, -60117, -60372, -121301, 97218, 48605, -17011, 18912, -60657, 82124, 214708, 253847, 467200, 373541, 176490, 7138, -44435, 8751, 97958, 428512, 395857, 183251, 76664, 146939, 101103, -5246, -210423, -128274, 127169, 194020, 132568, 140731, 121396, -77819]
14381g7819j32077m2283j09077M4303J19494K02380L28215q3966j11789j99634
14371f2253J08458j15501j71909J34269Q0266j72084J51370J46516q3055K11538
14361B27615P5728j84243j39158K7496K1492o5542M0906k8602j41530J793K65901
14350A01856M5953j1041K2053K28590m16866j98496J98487J3830j28306J61275
14340A7335J40759O1665p7938M8533L16591R1287j22685Q2669k6950r3866K148
14329D39548k17487j38105m3217K54189l1702l01906K14833J74578j37219j21424
14319I2088r996L9961J85476l37493p4961N5563J85161J78824M0747J4449k87320
14308H2499j72365J87497K30845K47493k35547j74304J00205J4379k6886K11363
$$ y = [-77819, -209896, -252179, -361256, -316953, -197459, 4921, 333136, 249170, 137381, -62253, 46205, -69296, -241205, -106936, -26670, -198754, -47384, 99132, 16077, 227615, 303343, 119100, -20058, 7438, 28930, -36612, 4294, -24308, -165838, -164045, 101856, 147809, 136768, 158821, 387411, -29455, -227951, -29464, -15634, -143940, 17335, 158094, 219759, 141821, 190354, 506945, 598232, 475547, 558216, 531266, 437400, 439548, 222061, 83956, 40739, 294928, 263226, -38680, 176153, 350731, 213512, 92088, 82092, 122053, 307529, -29964, -104925, -49362, 135799, 314623, 355370, 369819, 82499, -89866, 97631, 328476, 575969, 340422, 166118, 266323, 280702, 253816, 465179]
14298D65179J23036n0784m24634l86536o8758L0766M34160K06282j56492k14675
14288d2456M3212P5385L1986m3674J56771K9963j82459P6589N26P7312J73567
14277C96722q5888N864m5006j20435j16971r5203l2062l1814k5560J1257K80840
14266A41744J39935k31759j42932j19361R3224J15319L5541L9402J36836J35883
14256C43832l03766r85J18210J3884O1162p9311m5702Q8209O5276j98020j41896
14245g9107j24547J78193k50013q3730R1404J20252n4743J3683R6852K288J89501
14234A00033p497k76791n0723K00113J47585J02413m5143L0933j72821j40609
14224a12507j49835K04618J77499J83136j08546l37051k44866N9919J68542K99168
$$ y = [465179, 588215, 537431, 112797, -273739, -342497, -311731, 122429, 328711, 172219, -42456, 756, 76141, 108127, 64453, 221224, 251187, 68728, 145317, 145843, 223155, 396722, 310834, 316698, 271692, 151257, 34286, -60917, -92979, -124793, -150353, -139096, 141744, 281679, 49920, -93012, -212373, -119149, -3830, 31711, 71113, 207949, 343832, 40066, 39081, 157291, 171175, 232337, 153026, 107324, 195533, 260809, 62789, -79107, -203654, -25461, -275474, -359204, -267800, -147548, -202291, -188608, -91756, -89468, 100033, 92536, -184255, -234978, -34865, 112720, 215133, 169990, 200923, 28102, -112507, -262342, -57724, 119775, 302911, 194365, -142686, -387552, -327633, -159091, 140077]
14214A40077J19662r3250O9288r5193j50433K89929o1432J69301J07405l22642
14204A72712j69423J58344K11614P9577l14257k45007J26364J46696J98589m6369
14194C18840j14879k9253M6395L09486M62010N2055j11543k31614j23692k5093
14184E52712Q3596Q5394J01450j44916o4911n160n486K1435k61896r4433Q5470
14173C53255M37694J11346k48593R7969n854J61968K78886Q0959k8033J04434
14163A344031K12092k45296j49144L1397K91509m7284R3247K03694j13369J19357
14153A740234K87734K91217M23627M46476O2155L98291M33750O60238P10989Q99548
14143F354259J180485J269348J561707J804026K162753K254257K364544K152425
$$ y = [140077, 259739, 166489, 235777, 140584, -9849, 280080, 218648, 387949, 495354, 172712, 3289, 161633, 373247, 452824, 138567, -106440, 19924, 166620, 365209, 318840, 203961, 174708, 221103, 530589, 992599, 1044654, 933111, 701497, 577805, 552712, 636308, 721702, 823152, 678236, 613325, 608165, 602679, 624114, 362218, 267785, 353255, 790949, 902295, 653702, 751671, 745817, 907785, 1186671, 1267630, 1239597, 1344031, 1556123, 1310827, 1161683, 1193080, 1484589, 1437305, 1530552, 1734246, 1620877, 1740234, 2027968, 2319185, 2742812, 3189288, 3251443, 3649734, 4083484, 4743722, 5454711, 6354259, 7534744, 8804092, 10365799, 12169825, 14332578, 16586835, 18951379, 21103804]
14135B1103804J851831J429149Q48864J65287m01393q19498j383617j605817j577610
14126A9611000j262536j167379j039371q30203k70891K61693N35145Q56575J440372
14117A8134405J809129K417493K919332L591663M088602M400928M538784M288783
14109D6189119L422658K374786J476090j52313j565818k795424l913299m044344
14101D0991455m262249l783482l157247k673150k102070j484036q19714k56208
14093B2453299K94838Q67721J566371J901084K636068L581460M128962N006014
14085D2435817N337706N713787N879739N910678M970625L977952K672704J076924
14077G7975932o54039k559877l906326m964853n483031n529688n013151m796652
$$ y = [21103804, 22955635, 24384784, 25233648, 25398935, 24997542, 24178044, 22794427, 21188610, 19611000, 18348464, 17181085, 16141714, 15311511, 15040620, 15302313, 15837458, 16694033, 18134405, 19943534, 22361027, 25280359, 28872022, 32960624, 37361552, 41900336, 46189119, 49611777, 51986563, 53462653, 53310340, 51744522, 48949098, 45035799, 40991455, 36729206, 32945724, 29788477, 27115327, 25013257, 23529221, 22709507, 22453299, 22748137, 23615858, 25182229, 27083313, 29719381, 33300841, 37429803, 42435817, 47773523, 53487310, 59367049, 65277727, 70248352, 74226304, 76899008, 77975932, 77321893, 74762016, 70855690, 65890837, 60407806, 54878118, 49864967, 45068315]
14069D5068315m033988k970410j734220j030646r5613P75293J513196K675802
14061D0167729L994007N090685O080951P586441Q320372R134803R250530Q622263
14053I8247781O510349M134353J518297j613052m556863o924028q487036q989560
14045G9840241r128355q677776p076568n770595m513792l499795k420235j085335
14037C7667790m59251L89241J118552K025946L189804L925449M547799N612566
14029E8017896N824199N499153N064090L883698K551878P44786q34049k382662
14021G8368989m245375n224413n849358o075523o047238n665904n003409m013953
14013C6243816l370225k550998j848141j325381m85502j98716M16462R20602J464061
$$ y = [45068315, 41034327, 38063917, 36329697, 35299051, 35203438, 35978731, 37491927, 40167729, 44161736, 49252421, 55333372, 62919813, 71240185, 80374988, 89625518, 98247781, 104758130, 108892483, 110410780, 108797728, 104240865, 97316837, 88829801, 79840241, 70711886, 62034110, 54957542, 49186947, 44673155, 41173360, 38753125, 37667790, 37208539, 37597780, 38716332, 40742278, 43932082, 47857531, 52405330, 58017896, 63842095, 69341248, 74405338, 78289036, 80840914, 81585700, 80751651, 78368989, 74123614, 68899201, 63049843, 56974320, 50927082, 45261178, 40257769, 36243816, 32873591, 30322593, 28474452, 27149071, 26663569, 26464853, 26881315, 27801917, 29265978]
14004B9265978K266542K796958L739666M146535M280296M316890L681147L003609
13996E7497621J687073J59420j233163k842279l988436m645462m916692m622485
13988C7095597m246558l810253k906450k206486j766645j398724p17028m79832
13980A9563621J29462M54229O39671J036981R27357J291259J887929J442174J099814
13971B8472497P64209K59594m31780j135092j576275j945279k165594k567603
13963A9674677k423233k023982j576038j402179j338368j159537r69393o62417
13955H119530o32586l55209k60255m01804m64391l39945l53772o45919m68515
13946D197134j67175k28119l20440K6349J74671p8422l2376j22812k52903l31727
$$ y = [29265978, 31532520, 34329478, 38069144, 42215679, 46495975, 50812865, 54494012, 57497621, 59184694, 59344114, 58110951, 55268672, 51280236, 46634774, 41718082, 37095597, 32849039, 29038786, 26132336, 23925850, 22159205, 20760481, 20043453, 19563621, 19693083, 20147312, 20786983, 21823964, 22751321, 24042580, 25930509, 27372683, 28472497, 29236706, 29496300, 29064520, 27929428, 26353153, 24407874, 22242280, 19674677, 17251444, 15227462, 13651424, 12249245, 10910877, 9751340, 8781947, 8119530, 7486944, 7131735, 6871480, 6469676, 6005285, 5665340, 5311568, 4665649, 4197134, 4029959, 3801840, 3481400, 3507749, 3682420, 3603998, 3571622, 3448810, 3195907, 2864180]
13936B864180q7512q4420j2670j24783k5249R738N6282J08659j10925k15195j15536
13925B262569j60850J66077j0389j56346k07816j68754m4332j09120k58078j50835
13915A162126J20264J15233J02173j55453l97452j16020J47420J80918j14261
13906A044948k6926N0137J56683j73202k37804j71972R635J32551l3948J14084
13896H64186M892l5226j51931k27272p5375r1685Q9620L29044J42515J7855N5510
13885I22133Q3770j29377k00833L255j26729j40499K71683K43158k04880O2926
13875G84607q1312K10749N8757j85819j33621j89171j20412J56868o572J721J8210
13864E14005K83475K6230k740k47481l6367j0658j71063m821O4567Q6695l53648
$$ y = [2864180, 2776668, 2692248, 2679578, 2554795, 2529546, 2539284, 2595566, 2704225, 2593300, 2378105, 2262569, 2101719, 2267796, 2257407, 2101061, 1893245, 1724491, 1680159, 1571039, 1312961, 1162126, 1282390, 1397623, 1499796, 1344343, 946891, 830871, 978291, 1159209, 1044948, 1018022, 1068159, 1224842, 1051640, 813836, 641864, 651499, 784050, 750102, 864186, 869078, 833852, 681921, 454649, 379274, 287589, 377209, 706253, 848768, 866623, 922133, 1005903, 876526, 675693, 678948, 552219, 411720, 683403, 926561, 721681, 784607, 703295, 914044, 972801, 786982, 653361, 464190, 343778, 500646, 494074, 495795, 514005, 797480, 823710, 820970, 573489, 537122, 526464, 355401, 350580, 415147, 501842, 148194]
13853A48194j39466J17452k1761J50316j30302o2548r4778M3190J14922K87074
13843D12293L18784j02929N96k2720Q9339J41392L2096l35621k87123O598J40184
13832C92889j8914J977K56381m3453m3329j29806p4778m283r8781j57579J77804
13821B58128r4570O5460J63594m1024J31580k50268l47563l3767L55393J60724
13811C67687n7741k22119M5347M1320m0402M4860J54547j89546j53815J62106
13801A52244n2274j4499J9536j50296L4707J19170n5600l4806K57638O87j99849
13790G6658j30458l9026o7498j2582o7753o0451q2064m2448k7383J64859K96398
13779H252J71039j29314k836k6523P8694l966n1425J1318J43311J61301q3904
$$ y = [148194, 8728, 126180, 104419, 254735, 124433, 61885, -32893, 10297, 125219, 412293, 731077, 628148, 628744, 606024, 695363, 836755, 868851, 533230, 246107, 252705, 392889, 373975, 375952, 632333, 588880, 545551, 415745, 340967, 336684, 237903, 80324, 258128, 163558, 229018, 392612, 351588, 483168, 232900, -114663, -148430, 206963, 367687, 309946, 87827, 133174, 174494, 134092, 178952, 333499, 143953, -9862, 152244, 99970, 85471, 105007, -45289, -10582, 108588, 52988, 18182, 275820, 276507, 76658, -53800, -92826, -160324, -172906, -240659, -301110, -383174, -425622, -453005, -288146, 8252, 179291, 49977, 47141, 20618, 99312, 95346, 43921, 55239, 198550, 359851, 275947]
13768B75947j76087M090j85342r8584J23509J03877J48517R230n2659L8271j58910
13757C1859M4737q369j19692j82001m7059J85927M0517n2030j52334J53856K41731
13746A37142k82130j03316J88346j69440N209J11465K19337j67547n9470J54684
13736C4280Q8997o2223j11048O5360O1360J57799j93695j28388j31017K3382L4524
13725a60669J36173J17572r4033j88692K13419M3064l6336J25134K1489j98141
13715b1020M450o0460m7938q4776j46802j1056K46434K98833k34901r2316M6719
13704a02833P063k08430j28964R0758K11992l3420J85717N5707J98948J4526O479
13693B97543j81826o0832J84360J69259j64461j20868m0970j78985m6166N5037
$$ y = [275947, 99860, 103950, -81392, -179976, -56467, 47410, 195927, 205157, 152498, 190769, 31859, 76596, 68227, -51465, -233466, -280525, -94598, -54081, -106111, -258445, -104589, 137142, -144988, -248304, -59958, -229398, -224189, -112724, 106613, -60934, -120404, 34280, 123277, 61054, -49994, 15366, 76726, 234525, 40830, -87558, -218575, -195193, -160669, -24496, 93076, -957, -189649, 23770, 66834, 30498, 155632, 177121, -21020, -16570, -77030, -124968, -209744, -356546, -367602, -121168, 177665, -57236, -149552, -102833, -95770, -304200, -433164, -342406, -130414, -163834, 21883, 77590, 276538, 291064, 297543, 115717, 54885, 239245, 408504, 244043, 123175, 82205, -96780, -142946, -87909]
13683h7909m0767q7228J79336P5431q0241r638N2769K20701j00260k34801K2610
13672h9997m6668j34520K9413K31651P8125J33589M026N9911n6249l32162j17665
13661b40546J95472L10363j23863k28901r7946N10004J01649m77564j45242K77030
13651H0456R5135r8250O9892J07116P1896K6273j69460p0873p7891l2215J53339
13640A55418J35741J9685j22711q7648o1416K55578P957q9039o4394Q1411q5519
13629A45063R5538j05953M2953K7117j39175J3998R2275Q1360K62827k2463k95511
13618A98029j66193M39796J96834k31708N2489L7321n3249k65279j67598M5254
13608H5696L8074J92137L6886j0018J2508j52594j00424l0528J27508P0456J16151
$$ y = [-87909, -128676, -215904, -36568, 38863, -41378, -51016, 1753, 222454, 122194, -112607, -89997, -136665, -271185, -241772, -10121, 68004, 201593, 205619, 265530, 209281, -122881, -240546, -45074, 265289, 141426, -87475, -185421, 324583, 426232, -51332, -196574, 80456, 175591, 77341, 147233, 254349, 326245, 352518, 183058, 112185, 34294, 2079, 155418, 291159, 310844, 188133, 100485, 39069, 294647, 302604, 213565, 149171, 230582, 145063, 240601, 134648, 177601, 204718, 65543, 79541, 171816, 253176, 516003, 493540, 198029, 31836, 471632, 668466, 436758, 489247, 526568, 473319, 208040, 40442, 85696, 123770, 315907, 352793, 342775, 355283, 202689, 102265, 71737, 199245, 269701, 385852]
13597C85852j69796O7010K7175l05653r2864L21269K61148J33231q1190j95576
13587C50606l0740L24872L5383J6172J80556j28929j11601j92178j24045n9717
13577B60379k21794j59788k1295K17870r2921j38206J30373J91524R5780j10162
13567A51760j47514J75704j27122k8005J85187K87889n1984p4192j72813p2187
13557A26723j40054J02929J83386N5578M2092J8281j73864k0265P332M3121j55120
13546I0139j02965q8780R8315L7956K22778J04733p9168J49606o5734k05243K53577
13535D15214J58277k7122j88245k26500K82164j76354k11320K02731K62359J22242
13525F13446j10052j00696j31124j00713l049j61649l9459Q6390l3102L8184l0830
$$ y = [385852, 216056, 283066, 310241, 4588, -88276, 232993, 494141, 627372, 546182, 350606, 319866, 644738, 680121, 696293, 876849, 747920, 636319, 444141, 320096, 260379, 38585, -121203, -142498, 75372, -17549, -155755, -25382, 166142, 261922, 151760, 4246, 179950, 52828, 24823, 210010, 497899, 445915, 371723, 198910, 126723, -13331, 89598, 272984, 328562, 370654, 388935, 215071, 194806, 202138, 245259, 90139, -12826, -101606, -3291, 34665, 257443, 362176, 283008, 432614, 366880, 161637, 415214, 573491, 546369, 358124, 131624, 413788, 237434, 26114, 228845, 491204, 613446, 503394, 402698, 271574, 170861, 167812, 6163, -33296, 53094, 19992, 58176, 27346]
13514B7346l4154p0046m4491J84708J0895l4235K85790L44356j44800k29518q0890
13503B14961l0981q3769k3272m7517j11162j61522J74084K99393J24189k25004
13493A29400k13353L8979P6329l7763r6580k16362j5258J57104J36997j24614
13483a65121n0265q291K65352j88310K00313J36423K17052k8508k75707k66879
13473a63941j40610Q7730K7234J47791J98427N83K19375m0255k20608L9697l5041
13462A20382j92470M2055K83594m972r2716R9218J3569n3854Q0575J48512j27867
13451C16026q6090K53739k64766l72020Q0498N5607q9566R3329J91196L7669k24883
13440i261q1924J94262o9497l51581q4387J47155Q339k8649J13368L51018J31983
$$ y = [27346, -6808, -76854, -121345, 63363, 74258, 40023, 325813, 670169, 525369, 295851, 214961, 183980, 100211, 76939, 29422, -81740, -243262, -69178, 230215, 354404, 129400, -83953, -44974, 31355, -6408, -102988, -319350, -334608, -177504, -40507, -165121, -215386, -223677, 41675, -146635, 53678, 190101, 407153, 378645, 102938, -163941, -304551, -216821, -189587, -41796, 156631, 157214, 376589, 336334, 115726, 155423, 120382, -72088, -30033, 253561, 248589, 155873, 255091, 268660, 214806, 295381, 443893, 316026, 229936, 483675, 218909, -153111, -72613, -17006, -106572, -13243, 177953, 215622, -9261, -91185, 103077, 33580, -318001, -402388, -255233, -246894, -275543, -162175, 188843, 320826]
13429C20826k41611r1235J71111J0862P1028j32452J28203l00019j12375k9574
13419b05236j66303R9010K00438o7164k3204N1746j00818r7744K53699M81919
13409D26343J67240p7544J3589k28108l79646k75760J41819J99570J92899J01327
13399B81729q7618l965l2296j82533k20008q0931J43196J31295j79864K09785
13389b1210J57167J89976j35720j1731q2338K4678J07376j34849j59124j59565
13379b25340N7792p8632j45000J83515j05297l5512K34466m9948m461J42706m5293
13368g1004m348L1812j96346l43556J08535K55007K3460L384J53857J36231m3550
13357E3482j11728j6038N1549J07772o9873J72845k57506J52103K05525k07663
$$ y = [320826, 79215, -12020, 159091, 169953, 240981, 108529, 236732, -63287, -175662, -205236, -371539, -272529, -72091, -139255, -162459, -110713, -211531, -309275, -55576, 426343, 593583, 516039, 529628, 301520, -78126, -353886, -212067, -12497, 180402, 281729, 194111, 190146, 157850, -24683, -244691, -325622, -182426, -51131, -230995, -21210, 135957, 325933, 190213, 178482, 96144, 120822, 228198, 93349, -65775, -225340, -167548, -246180, -391180, -207665, -312962, -348474, -114008, -163956, -168417, -25711, -71004, -75352, -43540, -239886, -583442, -474907, -219900, -196440, -193056, -39199, 97032, 53482, -58246, -74284, -22735, 85037, 15164, 188009, -69497, 82606, 288131, 80468]
13347H0468k50667Q959j04999L29749K90244O4718l1568l0238k61197N6316N2426
13336B04211J36442Q3358J21283j56942J17937J01812p9025m55657j50589n0523
13326a27693R5690K30636M1622O2315O2715j36763k22821J45930j51959k08744
13316b09072N1835q6649J49518P9843K50875M5656j27348M1239K3756m7737j53588
13305A8328j04564K82172L27710l6789j33546j48824r9940j17218J8338J55484
13295A61151K10184k18945k8607J67568O2187j25965J55358j85036q3817k60138
13285a46060N5960K05133p1202M1752p3310q2428n760p9993K0615J81026n0293
13274d560r18J18461M6138l3973j75487L3283J27357L00553N4794j28751k62713
$$ y = [80468, -170199, -161240, -266239, 63510, 353754, 418472, 386904, 356666, 95469, 151785, 204211, 340653, 424011, 545294, 388352, 506289, 608101, 529076, 73419, -77170, -127693, -32003, 198633, 240255, 302570, 365285, 228522, 5701, 151631, -328, -209072, -157237, -243886, -94368, -14525, 236350, 282006, 154658, 195897, 219653, 171916, 18328, -86236, 195936, 523646, 486857, 353311, 204487, 104547, -12671, 5667, 161151, 371335, 152390, 123783, 291351, 353538, 227573, 382931, 197895, 114078, -146060, -90100, 115033, 43831, 85583, 12273, -70155, -75915, -155908, -135293, 45733, -4560, -5478, 112983, 159121, 125148, -50339, -17056, 110301, 410854, 465648, 336897, 74184]
13263G4184j23821J22484K02341q0224M668N6095J88108J39689N9047K9104n2391
13252F19284k16910L5544J71133J51284J26139M870q9045k35224k16456k51683
13242I8936l6869M65358K14142j2228k43904L9850J21466q4744J58520K53667
13232I74194l7784j90323j70588j55323j6417J91092L89921J84275n3894j6554
13222A098599J35996J54159O487k96214k04780j13689J53162J11672m3578j08000
13212H93814M9280l96516j83612J87016K70004r5584K4568J43161m25423l3571
13202D33137J10259p6694J13087Q797n1724J37516L45631j12791k28944J83343
13192H61617J74414j29997k09879K03020J65317j10596j72738j07099j91213J76419
$$ y = [74184, -49637, 72847, 275188, 194964, 199632, 255727, 443835, 583524, 642571, 671675, 619284, 402374, 437918, 609051, 760335, 886474, 891344, 802299, 567075, 350619, 98936, 62067, 527425, 741567, 729339, 485435, 525285, 646751, 562007, 720527, 974194, 936410, 746087, 575499, 420176, 403759, 594851, 984772, 1169047, 1115153, 1098599, 1234595, 1388754, 1395241, 1099027, 894247, 780558, 933720, 1045392, 1001814, 893814, 943094, 546578, 362966, 549982, 819986, 724402, 748970, 892131, 466708, 433137, 543396, 466702, 579789, 588586, 536862, 674378, 1020009, 907218, 678274, 861617, 1036031, 906034, 696155, 899175, 1064492, 953896, 781158, 674059, 482846, 659265]
13182F59265K05376M1050m0985K1110P9392j96898j47687K80J17433J31412l02621
13171E67127J04641O3762P1194j6526P0986J22343j87335k6209l8364n9422l6958
13160F35239J89570J05946J21547j2201k6774R4577J10870N3808p5409J06532
13150A303705J07629J5777l02351l13860j36877R4376O2654R3733O3982j96474
13140G92294L8646O8249k9500j68000K8734J99496p1637n8928k34024K0642j99517
13129C86455K7729L13499R8583j93988o0296J75690J22392j37129R7508J34373
13119I64816n5176l6638r4675J23790o8980k18431J32579P1868k84060n603j13780
13108D15710K00611J08443p3394l16723j40988J74547M2485l9585r1419P0002
$$ y = [659265, 864641, 905691, 864706, 885816, 965208, 768310, 620623, 620903, 738336, 869748, 567127, 671768, 735530, 806724, 790198, 861184, 983527, 796192, 769983, 731619, 672197, 635239, 824809, 930755, 1052302, 1040101, 1013327, 1107904, 1218774, 1272582, 1197173, 1303705, 1411334, 1427111, 1124760, 810900, 674023, 768399, 831053, 924786, 988768, 792294, 830940, 899189, 869689, 701689, 730423, 929919, 858282, 799354, 565330, 585972, 386455, 414184, 727683, 826266, 632278, 571982, 747672, 870064, 732935, 830443, 964816, 909640, 873002, 778327, 902117, 833137, 614706, 747285, 819153, 535093, 529490, 415710, 616321, 724764, 651370, 334647, 193659, 368206, 410691, 371106, 279687, 349689]
13098C49689Q3345o8227K10711P0665Q436J39697j80306j28961r8905N525j54697
13087B36972o7234J25822K8561J72284k22083K15809K49328q2866k00633o2622
13077C93338J57358K12151O0918j59833j9657J09902j6957k0703k50457k89737
13067A76323n8880l2318J39779m3559l9496j60908M9890K02161K86898R798j72301
13056C57387R0457j96636M1770K03884j8116p4725k8474J74008J20538P7953L5281
13045G83327r9758N9762J048q835m2062r634P9389M8338k10174j44856j18227
13034C38318L15237L09983M05729K27655K00203N7103l0662N7753p3412l51873
13024A456034k15173J6627Q4237J06822k07777o2554k18516n7457l0784L6961
$$ y = [349689, 433034, 364807, 575518, 646183, 654619, 794316, 614010, 485049, 386144, 391669, 236972, 169738, 295560, 324121, 496405, 274322, 490131, 739459, 656593, 455960, 393338, 550696, 762847, 823765, 663932, 644275, 754177, 737220, 716517, 466060, 176323, 117443, 85125, 224904, 181345, 141849, -19059, 30831, 232992, 519890, 529688, 357387, 447844, 251208, 292978, 496862, 478746, 404021, 375547, 549555, 670093, 748046, 783327, 683569, 743331, 744379, 735544, 693482, 683848, 763237, 811575, 601401, 456545, 338318, 653555, 963538, 1369267, 1596922, 1797125, 1854228, 1823566, 1881319, 1807907, 1456034, 1240861, 1257488, 1341725, 1448547, 1240770, 1178216, 959700, 902243, 871459, 908420]
13014I08420J74619j09085l2543L282N9058o4824m2478j91302k29724K3047N6782
13003E55252J88421R0824k40504k09263J11544J69574R2084k25278k0897K52793
12993G64550L8164J46k6938P0537J15659l4168J98634L18360J52463r7515Q2914
12982A582806K23275J16965l40619m47515l06908L8050K27867j6475j07154J03905
12972A074197m9957j31081m509j41863j87243N0158Q1096J41942J0100K0553j62611
12961G00782l52959j16248K55009J07384j95406M5491K45983Q2686J49381J9048
12951I41151p3976k06540k9323k5589l6767j09549J77675K98426k47319j00141
12941E88048J08445K12382N27856J30623k56123k16409j53580k84611q4817j80523
$$ y = [908420, 1083039, 973954, 941411, 944693, 1003751, 938927, 896449, 705147, 475423, 498470, 555252, 743673, 834497, 593993, 384730, 496274, 665848, 757932, 532654, 511757, 764550, 802714, 802860, 775922, 846459, 962118, 927950, 1126584, 1444944, 1597407, 1499892, 1582806, 1806081, 1923046, 1582427, 1134912, 828004, 866054, 1093921, 1077446, 970292, 1074197, 1024240, 893159, 888650, 746787, 559544, 609702, 690798, 832740, 842840, 863393, 700782, 347823, 231575, 486584, 593968, 398562, 444053, 690036, 772722, 922103, 941151, 867175, 660635, 631312, 605723, 568956, 459407, 637082, 935508, 688189, 588048, 696493, 908875, 1436731, 1567354, 1311231, 1094822, 941242, 656631, 571814, 391291]
12931C91291j48195M4552J62976J43655k8138k12235J62471J31485k4759p3189
12921E49914m5943N9788K88149J83324P7870K37366j13823k17616k38998k92192
12911D87839J37293M87177J96998k85806j71407r4063l25264J14143J38685J97132
12901H82727J35307k0913j34332j62868Q8894p670J4213M5378J12721K39052J2350
12890A204859K4661J58716l79822j40686j4120l28504k14803J25973L83123J14718
12880I34115N9760r0783k87429J3706j057L4828K2556M5571r4687Q721m7395O8231
12868F66137j07487K56544J9872Q9445Q3619o8563o967o6446K45076j3805J14615
12857A212040K61380J09713M2506M624j24923k41853l1020m2936J5661J75376
$$ y = [391291, 243096, 287648, 450624, 594279, 566141, 353906, 516377, 647862, 623103, 549914, 503971, 563759, 851908, 1035232, 1113102, 1350468, 1236645, 1019029, 780031, 487839, 625132, 1112309, 1309307, 1023501, 852094, 758031, 432767, 546910, 685595, 882727, 1018034, 997121, 862789, 699921, 788815, 781145, 795358, 840736, 953457, 1192509, 1204859, 1229520, 1388236, 1008414, 867728, 853608, 525104, 310301, 436274, 819397, 934115, 993875, 903092, 615663, 629369, 628312, 663140, 685696, 731267, 636580, 645301, 597906, 666137, 558650, 815194, 835066, 924511, 1008130, 939567, 932600, 866154, 1111230, 1097425, 1212040, 1473420, 1583133, 1625639, 1630263, 1505340, 1263487, 1232467, 1189531, 1205192, 1380568]
12847A380568J02599J19053l05602j0120J39288o574N420O955K28974J70927p4070
12836A757418N9994L30245J21975N1388K77818o1670j40047R9528L69120K49502
12826C115271M57630J97931M8495K54324P8227J34767K96449M06809L51319L43469
$$ y = [1380568, 1483167, 1602220, 1296618, 1286498, 1425786, 1419212, 1424632, 1431587, 1660561, 1831488, 1757418, 1817412, 2147657, 2269632, 2321020, 2598838, 2537168, 2397121, 2496649, 2865769, 3115271, 3572901, 3770832, 3819327, 4073651, 4151878, 4286645, 4583094, 4989903, 5341222, 5684691]
$$ [...]
##END NTUPLES=NMR SPECTRUM
##END=
