##TITLE=Analysis number 321101
Compound Code cc 55704
Book Reference 467/58
Project Code adrs
Chemist Name benw
##JCAMPDX= 6.0         $$ Bruker NMR JCAMP-DX V2.0
##DATA TYPE= NMR SPECTRUM
##DATA CLASS= NTUPLES
##ORIGIN= Bruker BioSpin GmbH
##OWNER= nmr
$$ XWIN-NMR		Version 3.5
$$ Mon Jul 24 21:30:00 2006 GMT Daylight Time (UT+1h)  MAYBRIDGE\nmr@NMR_250MHZ
##.OBSERVE FREQUENCY= 250.131544655141
##.OBSERVE NUCLEUS= ^1H
##.ACQUISITION MODE= SIMULTANEOUS (DQD)
##.ACQUISITION SCHEME= undefined
##.AVERAGES= 16
##.DIGITISER RES= 18
##SPECTROMETER/DATA SYSTEM= dpx250
##.PULSE SEQUENCE= zg30
##.SOLVENT NAME= CDCl3
##.SHIFT REFERENCE= (INTERNAL, CDCl3, 0, 16.522)
##AUDIT TRAIL= $$ (NUMBER, WHEN, WHO, WHERE, WHAT)
$$ ##TITLE= Audit trail, XWIN-NMR		Version 3.5
$$ ##JCAMPDX= 5.01
$$ ##ORIGIN= Bruker BioSpin GmbH
$$ ##OWNER= nmr
$$ C:\u/data/dgb/nmr/ADRS/3300/pdata/1/auditp.txt
$$ ##AUDIT TRAIL=  $$ (NUMBER, WHEN, WHO, WHERE, WHAT)
(   1,<2006-07-24 21:29:25.48 +100>,<MAYBRIDGE\nmr>,<NMR_250MHZ>,
      <created by zg, POWCHK disabled, PULCHK disabled
       configuration hash MD5:
       E2 DF 36 D8 04 B2 41 60 5A D7 A3 38 5A 4B D0 FE
       data hash MD5: 64K
       7C B1 ED 20 EA 0B DC 31 AE E4 D2 CA 65 B4 2F 71>)
(   2,<2006-07-24 21:29:48.04 +100>,<MAYBRIDGE\nmr>,<NMR_250MHZ>,
      <Start of raw data processing
       ef LB = 0.3 FT_mod = 6 PKNL = 1 SI = 32K 
       data hash MD5: 32K
       2F 75 75 C6 9E C2 DC 60 7B 73 59 C9 D7 CF C0 FF>)
(   3,<2006-07-24 21:29:50.01 +100>,<MAYBRIDGE\nmr>,<NMR_250MHZ>,
      <apk 
       data hash MD5: 32K
       E2 2B 4D E4 58 92 F4 80 BE B2 74 E0 9E AC 96 29>)
(   4,<2006-07-24 21:29:51.04 +100>,<MAYBRIDGE\nmr>,<NMR_250MHZ>,
      <abs ABSG = 5 
       data hash MD5: 32K
       F6 79 C2 52 BC 39 37 26 E1 63 7F 98 9E 4E 51 03>)
$$ ##END=
$$ 
$$ hash MD5
$$ D3 E5 72 10 7B B5 D1 B1 A3 85 09 A5 56 FC 81 49
##$RELAX= 
##$RELAX= 
##$RELAX= 
##$RELAX= 
##$RELAX= 
##$RELAX= 
##$RELAX= 
$$ Bruker specific parameters
$$ --------------------------
##$DU= <C:\u>
##$EXPNO= 3300
##$NAME= <ADRS>
##$PROCNO= 1
##$TYPE= <nmr>
##$USER= <dgb>
##$AMP= (0..31)
100 100 100 100 100 100 100 100 100 100 100 100 100 100 100 100 100 100 
100 100 100 100 100 100 100 100 100 100 100 100 100 100 
##$AQSEQ= 0
##$AQ_mod= 3
##$AUNM= <au_zg>
##$AUTOPOS= <57 >
##$BF1= 250.13
##$BF2= 250.13
##$BF3= 250.13
##$BF4= 250.13
##$BF5= 500.13
##$BF6= 500.13
##$BF7= 500.13
##$BF8= 500.13
##$BYTORDA= 1
##$CFDGTYP= 0
##$CFRGTYP= 5
##$CHEMSTR= <none>
##$CNST= (0..31)
1 1 145 1 1 1 1 1 1 1 1 1 1 1 1 1 1 1 1 1 1 1 1 1 1 1 1 1 1 1 1 1 
##$CPDPRG= <>
##$CPDPRG1= <>
##$CPDPRG2= <>
##$CPDPRG3= <>
##$CPDPRG4= <mlev>
##$CPDPRG5= <mlev>
##$CPDPRG6= <mlev>
##$CPDPRG7= <mlev>
##$CPDPRG8= <mlev>
##$CPDPRGB= <>
##$CPDPRGT= <>
##$D= (0..31)
0 1 0 0 0 0 0 0 0 0.06 0 0 0 0 0 0 0.0002 0 0 0 0 0 0 0 0 0 0 0 0 0 0 
0 
##$DATE= 1153772963
##$DBL= (0..7)
120 120 120 120 120 120 120 120 
##$DBP= (0..7)
150 150 150 150 150 150 150 150 
##$DBP07= 0
##$DBPNAM0= <>
##$DBPNAM1= <>
$$ [...]
##$SUBNAM7= <"">
##$SUBNAM8= <"">
##$SUBNAM9= <"">
##$SW= 20.6930455092707
##$SWIBOX= (0..15)
0 0 3 0 0 0 0 0 0 0 0 0 0 0 0 0 
##$SW_h= 5175.983436853
##$TD= 65536
##$TD0= 1
##$TE= 295.16
##$TE2= 300
##$TE3= 300
##$TEG= 300
##$TL= (0..7)
0 120 120 120 120 120 120 120 
##$TP= (0..7)
150 150 150 150 150 150 150 150 
##$TP07= 0
##$TPNAME0= <>
##$TPNAME1= <>
##$TPNAME2= <>
##$TPNAME3= <>
##$TPNAME4= <>
##$TPNAME5= <>
##$TPNAME6= <>
##$TPNAME7= <>
##$TPOAL= (0..7)
0.5 0.5 0.5 0.5 0.5 0.5 0.5 0.5 
##$TPOFFS= (0..7)
0 0 0 0 0 0 0 0 
##$TUNHIN= 0
##$TUNHOUT= 0
##$TUNXOUT= 0
##$USERA1= <user>
##$USERA2= <user>
##$USERA3= <user>
##$USERA4= <user>
##$USERA5= <user>
##$V9= 5
##$VALIST= <valist>
##$VCLIST= <CCCCCCCCCCCCCCC>
##$VD= 0
##$VDLIST= <DDDDDDDDDDDDDDD>
##$VPLIST= <PPPPPPPPPPPPPPP>
##$VTLIST= <TTTTTTTTTTTTTTT>
##$WBST= 1024
##$WBSW= 4
##$XGAIN= (0..3)
0 0 0 0 
##$XL= 0
##$YL= 0
##$YMAX_a= 299811
##$YMIN_a= -434937
##$ZGOPTNS= <>
##$ZL1= 120
##$ZL2= 120
##$ZL3= 120
##$ZL4= 120
##$ABSF1= 16.522
##$ABSF2= -4.171173
##$ABSG= 5
##$ABSL= 3
##$ALPHA= 0
##$AQORDER= 0
##$ASSFAC= 0
##$ASSFACI= 0
##$ASSFACX= 0
##$ASSWID= 0
##$AUNMP= <proc_1d>
##$AZFE= 0.1
##$AZFW= 0.1
##$BCFW= 0
##$BC_mod= 0
##$BYTORDP= 0
##$COROFFS= 0
##$CY= 12.5
##$DATMOD= 1
##$DC= 0
##$DFILT= <>
##$DTYPP= 0
##$F1P= 14.0000005364418
##$F2P= -0.99999901652339
##$FCOR= 0.5
##$FTSIZE= 32768
##$FT_mod= 6
##$GAMMA= 0
##$GB= 0
##$INTBC= 1
##$INTSCL= 1
##$ISEN= 128
##$LB= 0.3
##$LEV0= 0
##$LPBIN= 0
##$MAXI= 10000
##$MC2= 0
##$MEAN= 0
##$ME_mod= 0
##$MI= 0
##$NCOEF= 0
##$NC_proc= -5
##$NLEV= 6
##$NOISF1= 0
##$NOISF2= 0
##$NSP= 0
##$NTH_PI= 0
##$NZP= 0
##$OFFSET= 16.522
##$PC= 1
##$PHC0= 164.3346
##$PHC1= 4.761561
##$PH_mod= 1
##$PKNL= yes
##$PPARMOD= 0
##$PSCAL= 4
##$PSIGN= 0
##$REVERSE= no
##$SF= 250.13
##$SI= 32768
##$SIGF1= 0
##$SIGF2= 0
##$SINO= 400
##$SIOLD= 32768
##$SREGLST= <1H.CDCl3>
##$SSB= 0
##$STSI= 32768
##$STSR= 0
##$SW_p= 5175.98343685301
##$SYMM= 0
##$S_DEV= 0
##$TDeff= 65536
##$TDoff= 0
##$TI= <Analysis number 999999
Compound Code 99
Book Reference 9
Project Code 9>
##$TILT= no
##$TM1= 0
##$TM2= 0
##$TOPLEV= 0
##$USERP1= <user>
##$USERP2= <user>
##$USERP3= <user>
##$USERP4= <user>
##$USERP5= <user>
##$WDW= 1
##$XDIM= 32768
##$YMAX_p= 439632089
##$YMIN_p= -227316
$$ End of Bruker specific parameters
$$ ---------------------------------
##NTUPLES= NMR SPECTRUM
##VAR_NAME=  FREQUENCY,     SPECTRUM/REAL,   SPECTRUM/IMAG
##SYMBOL=    X,             R,               I
##VAR_TYPE=  INDEPENDENT,   DEPENDENT,       DEPENDENT
##VAR_FORM=  AFFN,          ASDF,            ASDF
##VAR_DIM=   32768,         32768,           32768
##UNITS=     HZ,            ARBITRARY UNITS, ARBITRARY UNITS
##FACTOR=    0.157963299565203, 1,           1
##FIRST=     4132.6476996994, 0,             0
##LAST=      -1043.33573715361, 0,           0
##MIN=       -1043.33573715361, -227316,     0
##MAX=       4132.6476996994, 439632089,     0
$$ Real data points
##PAGE= N=1
##DATA TABLE= (X++(R..R)), XYDATA
$$ [...]
18150E18923Q9960K9162n812j3454L6769N4101R34R3689L7762L7280J17637Q6497
18138A083448J6605M8970K5920M583P2842N6839M2969O9952N2258L9461J04713
18127A618560J11988R4334J72042K56865K66832L41512M70162N98224Q24724J187019
18117E942262J853830L100805N301434Q485804J0568037Q159788L130480l20624
18109D6221816p90156J548306K28652j0190507j2666374p703479m182143k460989
18101A0005126j628264j073516p47355n36635n25350m91816l27111k02925j96690
18092D275464k04613j60863j13691j08666j36380j08280j59408j49140j83699
18083B950724r3361j09772j10398j37076q8640n6975q9491l8729q5478l8630l729
$$ y = [518923, 608883, 638045, 632233, 618779, 655548, 709649, 710583, 804272, 842034, 879314, 996951, 1083448, 1100053, 1149023, 1174943, 1179526, 1252368, 1309207, 1352176, 1422128, 1474386, 1513847, 1618560, 1730548, 1824882, 1996924, 2253789, 2520621, 2862133, 3332295, 3930519, 4755243, 5942262, 7796092, 10896897, 16198331, 24684135, 35252172, 43411960, 46542440, 46221816, 45431660, 46979966, 47208618, 37018111, 24351737, 16648258, 12466115, 10005126, 8376862, 7303346, 6555991, 6019356, 5494006, 5002190, 4675079, 4472154, 4275464, 4070851, 3909988, 3796297, 3687631, 3551251, 3442971, 3283563, 3134423, 2950724, 2857363, 2747591, 2637193, 2500117, 2411477, 2354502, 2265011, 2226282, 2140804, 2102174, 2098445]
18072B098445n5359o2903o7326k9422j6338L3239m4833k6826L1415j4845n2713
18061A792534l551J733j9746q2856o9796q505m4402M3785L4289p4790n9537N1763
18049A560921O2548l2588q6195P222J336R06K4344O412p4565o4094j4119L7013
18037A429141n8313n4622o8484m2688n3179j01290n2771p0268l8166m8925n8837
18026G81598j4705N2j5411m8562j1698p2919o0654m558L3508k6997J8344R472
18014E87470K209j2034M660M836j64l3628K2015M2887J3597o6683j8350j7271
18002E29544k2552l1751o3909n5305K3538J2917k7939o899l8531J4531J3428m4594
17990C02478K3841M0635N1015R665P000o298O242L1607J2090M5995M7624j4182
$$ y = [2098445, 2043086, 1980183, 1912857, 1883435, 1867097, 1900336, 1855503, 1828677, 1860092, 1845247, 1792534, 1788983, 1790716, 1770970, 1688114, 1618318, 1609813, 1565411, 1609196, 1643485, 1568695, 1509158, 1560921, 1623469, 1590881, 1504686, 1511908, 1513244, 1514150, 1538494, 1544906, 1470341, 1406247, 1392128, 1429141, 1370828, 1316206, 1247722, 1205034, 1151855, 1050565, 997794, 927526, 889360, 840435, 781598, 766893, 766945, 751534, 702972, 691274, 618355, 557701, 553143, 586651, 559654, 577998, 587470, 589679, 577645, 582305, 587141, 586977, 553349, 575364, 618251, 631848, 565165, 546815, 529544, 506992, 475241, 411332, 356027, 379565, 392482, 364543, 357644, 319113, 333644, 347072, 302478, 326319, 366954, 417969, 427634, 434634, 428336, 434578, 466185, 478275, 524270, 571894, 557712]
17978E57712j3745j2675o1298m4420o4042l7368n0320o7058P659N073K3422O744
17966B49684K3690L5477k4423r0809L7610j6354n8522k2336L6510N83Q004N902
17954A85016m9513n551O716K6792Q4242J7472k0525o2427J4945M8938R297j2193
17942B43209m2326n796N2682J6654R6013O5546M6910O2422P7054J30126K3097
17931G65591l2846M0847n836l3998o7295o3488r0974p5092p3056J2462j3198p1702
17919B91415j13466m9414K1998J073j1692M833k725k8463n4692M8827L7583r511
17907A35766J2813J8812L0383J1761O140j6523j2306q233j7657o3113o718M7846
17895A38971P4000j5681j1237K3250O4153l7918q0267J3098L3711J6164P0318
$$ y = [557712, 543967, 531292, 469994, 425574, 361532, 324164, 273844, 206786, 214445, 219518, 242940, 249684, 273374, 308851, 284428, 193619, 231229, 214875, 156353, 134017, 170527, 171110, 179114, 185016, 135503, 129952, 136668, 163460, 247702, 265174, 244649, 182222, 197167, 246105, 255402, 243209, 200883, 195087, 247769, 264423, 360436, 425982, 472892, 535314, 612368, 742494, 765591, 732745, 773592, 767756, 733758, 666463, 602975, 512001, 436909, 363853, 376315, 363117, 291415, 177949, 128535, 150533, 151606, 139914, 144747, 142022, 113559, 58867, 107694, 145277, 135766, 148579, 167391, 197774, 209535, 215675, 199152, 186846, 178613, 160956, 97843, 91125, 138971, 212971, 197290, 186053, 209303, 273456, 235538, 155271, 168369, 202080, 218244, 288562]
17884B88562L3978L1301j7859k4973j8762k4185k368J8314l0615p0199o0990l5751
17872H6453O312j055r754K0526j4320k0919K2650j1623l1211j0691M0706M286
17860H1360n560q327l596J3754j651l0616o930J4538J3736R215l1140M3222J1710
17847I9715m9372j6365M4944L4806J5973l315l9928m7754K3380J6555k8906j213
17835D8520p3857j3707M6195K6885j2163l3764J0043N154J3461N5808K2298k5997
17823F8876j5584j0511m1824K9886P434m049K8649K672k1216j5565R026K0214
17811E8008K5402l5680J2015L652l3265L4444K1206O449K4978r053p0708p784
17799B9664M0454Q424k8748m7231n707P1087k0091m1734L7924k3235n1616N328
$$ y = [288562, 322540, 353841, 335982, 311009, 292247, 268062, 265694, 284008, 253393, 183194, 122204, 86453, 92765, 91710, 81956, 102482, 88162, 67243, 89893, 78270, 47059, 36368, 77074, 81360, 75800, 67473, 63877, 77631, 75980, 45364, 38434, 52972, 66708, 75923, 44783, 88005, 99715, 50343, 33978, 78922, 113728, 129701, 126386, 86458, 38704, 62084, 78639, 49733, 48520, -25337, -39044, 7151, 34036, 21873, -11891, -1848, 3306, 16767, 72575, 94873, 68876, 53292, 42781, 957, 30843, 38277, 34228, 62877, 65549, 44333, 28768, 37794, 58008, 83410, 47730, 59745, 63397, 30132, 64576, 85782, 92231, 117209, 108156, 37448, 29664, 70118, 78542, 49794, 2563, -3144, 67943, 47852, 6118, 44042, 20807, -30809, -25481]
17787b5481L8953L0881M8562l4983m2545j8071K8490q917L9253k6895l4351Q866
17775C762n2824j0973K4378r580J5512P7115P9878n5296J8582K5223k4353q5382
17763F042j0243J5784N579J5449Q609K5577m68q445k6950j3776K8788l1871l0272
17750a6197M6197k8582J343O7172J7863N381J4203j0799q3788j0933J8803l3812
17738a3149j8765L4725q125L9122l9254l7528k247m729M7843J2532q349L2925
17726C5001K0740j4635j0533J2556Q416j0285J2046o553o1968k9858k7936P732
17714f5277J7724K2073k626M759K05n944J8068k625N3788L2215n7480m396J7746
17701B8230N1435k8811k2506R887m0731J9449L1840q838k1142o698m8044j3763
$$ y = [-25481, 13472, 44353, 92915, 57932, 15387, -2684, 25806, 16889, 56142, 29247, -5104, 3762, -49062, -60035, -35657, -45237, -29725, 47390, 127268, 71972, 90554, 115777, 91424, 6042, -4201, 11583, 17162, 32611, 41220, 66797, 66329, 57884, 30934, 17158, 45946, 14075, -16197, 30000, 1418, 2761, 69933, 87796, 93177, 107380, 96581, 12793, 1860, 20663, -13149, -31914, 2811, -5314, 33808, -5446, -42974, -45221, -49950, -2107, 10425, 2076, 35001, 55741, 41106, 30573, 43129, 51545, 41260, 53306, 46753, -15215, -45073, -73009, -65277, -47553, -25480, -28106, -23347, -23142, -29086, -11018, -13643, 40145, 72360, 14880, 10484, 28230, 79665, 50854, 28348, 38235, -2496, 16953, 48793, 39955, 18813, 12115, -35929, -49692]
17689d9692K9704K8263J0022L1929K0785K1315m6942j04772j9336L0807M4054
17678c863o266j1642K1496P8458N609l342L1822P345k3225m2855J6075M0996q182
17665A02426k7475K4179m759q093n3199o2638l9717j1524M3471J3692j7136K4992
17653a5781M8900L9509j1247n786k1244j4755K8212M2281n9933m3644L3369J0587
17641C0468p263J9653r38M4203j1757n8997K4243L8920Q1701R36R359o3766m4215
17628F2547j8528J4309j5906l3183n663m5300n7000n5980M0802O1161J4625M195
17616c3921m4583J5367K6136j4319n109O2062M8141k3687K5825l4093L0926M3868
17604I6613l4793R086k9566l2263j5502j1978L607J5180L2929N989n3262N8165
$$ y = [-49692, -19988, 8275, 18297, 50226, 71011, 92326, 45384, -59388, -78724, -47917, -3863, -10129, -21771, -275, 78183, 83792, 80450, 112272, 119617, 96392, 53537, 69612, 110608, 102426, 74951, 99130, 94371, 86278, 33079, -29559, -69276, -80800, -37329, -23637, -40773, -15781, 33119, 72628, 61381, 55595, 34351, 19596, 47808, 90089, 30156, -13488, 19881, 30468, 23205, 42858, 41920, 86123, 74366, 15369, 39612, 78532, 160233, 161169, 170528, 106762, 62547, 44019, 58328, 42422, 9239, 3576, -41724, -98724, -154704, -113902, -52741, -38116, -33921, -78504, -63137, -37001, -51320, -56429, 5633, 53774, 30087, 55912, 21819, 52745, 96613, 61820, 70906, 41340, 9077, -6425, -18403, -14796, 384, 33313, 39302, -13960, 44205]
17592D4205o312m0038J0488j1919K2028J8214l4388J1270P159j2287k7994j3030
17580c2604J8363K4941L6243K7698j01981n4129n640O1489M1477r2197o759M9588
17568c3511K5057M777K1122j3046q073o3219K4996O1378j5510p259j6041m3327
17556f2656k2522J2111P644l5001J5505Q114L3364P5406L439p3000l4633N7435
17544a4794K7078m045k029K8641j848o440l3399l0714k2485J7962M0075m1110
17532d3108j7667O756K8803K9978n1398k355N1433n338p0049l1334M1904L1481
17520c0894J6669P0183Q1100m4190j21250p3654K3234K0773M9814L5153M6570
17509G3508L8332p1686l2351p658j0669M7977L4127n996K4186K4507l271r550
$$ y = [44205, 37893, -2145, 8343, -3576, 18452, 36666, 2278, 13548, 20707, 8420, -19574, -32604, -14241, 10700, 46943, 74641, -27340, -81469, -87109, -25620, 15857, -76340, -83099, -33511, -8454, -3677, 17445, 4399, -3674, -66893, -41897, 19481, 3971, -3288, -19329, -62656, -85178, -73067, -65423, -100424, -84919, -76805, -43441, 31965, 35404, -37596, -72229, -14794, 12284, 8239, 6210, 34851, 33003, 26563, -6836, -37550, -60035, -42073, -1998, -43108, -60775, -54019, -25216, 4762, -46636, -48991, 2442, -2896, -72945, -104279, -62375, -30894, -14225, 55958, 137058, 92868, -28382, -102036, -78802, -58029, -8215, 26938, 73508, 111840, 40154, 7803, 145, -10524, 37453, 71580, 65584, 89770, 114277, 111006, 101456]
17497A01456k4641q0684R996J3252k6994r13o528P775L9625J486n8843l0768N0887
17484d894Q1172J1225R936J2705R903m7509k7516K5715j3392L6715K1549K3311
17472A38920o210q5070m5567J325K9656O0597j4382j9738l7938m7758J2428m4876
17460e8613l7438M593M9614J0411K0413R586P678J1750M5319M5224K1985K2738
17448A53260N9197M1120N842k1200M647k384K4514R452j0268o3608j1775l7641
17436A51156k7485n950j6493j8013l4940L6887K300p8796j9554J2315L1681N5449
17424H8557n0743o301q893l2274J9512k7461M2062L4954J1029J4217j5781n8899
17412I979M0229l5828j7973N4545L4211R867J5851J2737n8958m4106k5808j4624
$$ y = [101456, 76815, -3869, 6127, 19379, -7615, -8528, -15056, -7281, 32344, 33830, -25013, -55781, -4894, 76278, 87503, 97439, 110144, 120047, 72538, 45022, 70737, 57345, 94060, 115609, 138920, 132710, 47640, 2073, 3398, 33054, 93651, 79269, 59531, 21593, -26165, -13737, -58613, -96051, -91458, -41844, -31433, -11020, -1434, 6244, 17994, 63313, 108537, 130522, 153260, 212457, 253577, 259419, 238219, 242866, 240482, 264996, 274448, 264180, 200572, 188797, 151156, 123671, 117721, 101228, 83215, 48275, 85162, 87462, 8666, -10888, 1427, 33108, 88557, 37814, 31513, 22620, -9654, 9858, -17603, 24459, 59413, 70442, 84659, 68878, 9979, 50208, 14380, -3593, 50952, 85163, 95030, 110881, 123618, 64660, 20554, -5254, -19878]
17400a9878J818k2413k3894k0046N2141M6549J620j187l6419k3681j5852L3555
17388b7687l2962K3541N0400l533K0297N378j1187j8576J1954k078J6269l0574
17376A242Q720J986j5032m7349O5402L3538j2500J4032J1472k5420l1375j0262
17364e546J0645K3742j5037p9578m8929j4412M8717O6131j3207J0186N4643J0506
17352D7861n5722m8392M2040K8462O0252j1948j830q175j1709K5322L5549j3320
17340H8390m0921n2237K0725M9421J442m6413K7661k0842l3756M5913m526P170
17328D2027m07j5426n546k9501K390L6186P761L202n305k4543k2625K6254J1101
17315B5568l3252K631l0481j3182p131J7962L3887J0071L8199J4072k4187p511
$$ y = [-19878, -18060, -40473, -64367, -84413, -32272, 14277, 15897, 14710, -21709, -45390, -61242, -27687, -60649, -37108, 13292, 9759, 30056, 35434, 24247, 5671, 17625, 15547, 31816, 1242, 9962, 11948, -3084, -50433, 14969, 48507, 36007, 50039, 61511, 36091, 4716, -5546, 5099, 28841, 13804, -65774, -114703, -129115, -80398, -14267, -27474, -17288, 37355, 47861, -7861, -56253, -14213, 14249, 74501, 62553, 60723, 52548, 40839, 66161, 101710, 88390, 47469, -4768, 15957, 65378, 66820, 20407, 48068, 27226, -6530, 39383, 34857, 42027, 41620, 26194, 20648, -8853, -6463, 29723, 37484, 40686, 35381, 10838, -11787, 14467, 25568, -7684, -5053, -35534, -48716, -55847, -37885, -3998, 6073, 44272, 58344, 34157, 26646]
17303B6646l0793K4284j1614m0377L1554N3762j2772l11n0k1704l2284L9258N6011
17290H1610J0775J3044L459m8191k0675J895k0275l0614l2108m7215J5663N0374
17278b2258K968J2454L5392j4503k3767r206j0824J8190O4849K2204p3546K0349
17266B2302J5016J3842j8993m4388L519p058L8568N8621l1931p2284m3169k2339
17254h8294O5176L0905M498r802j9061l135K8958K2315k2272j9545l5109N0734
17242E368j5518l1926j4510J7286j4029J5927Q23j7461O8904P303l2697J4658
17230D128L5612J0817K7491l6201p094P53k1307R957J230R768L7216j0144K1101
17217H3327M8302J59o6796j1597M5643M0736m9224j3184Q8951L0713q0329J2418
$$ y = [26646, -4147, 20137, 8523, -31854, -300, 53462, 40690, 40379, 40329, 18625, -13659, 25599, 81610, 92385, 105429, 108888, 60697, 40022, 41917, 21642, -8972, -41080, -88295, -72632, -22258, -19290, -6836, 28556, 14053, -9714, -18920, -29744, -11554, 53295, 75499, 1953, 22302, 37318, 51160, 32167, -12221, -8702, -15760, 22808, 81429, 49498, -22786, -65955, -88294, -23118, 7787, 12285, 2483, -16578, -19713, 9245, 31560, 9288, -10257, -45366, 5368, -10150, -42076, -56586, -39300, -53329, -37402, -36579, -54040, 14864, 22167, -10530, 4128, 39740, 50557, 78048, 41847, 34753, 35506, 14199, 24156, 25386, 35154, 72370, 62226, 83327, 131629, 131788, 64992, 53395, 99038, 139774, 90550, 77366, 166317, 197030, 116701, 129119]
17205A29119R1k4632k444j3227q693J7848l8998J350K0099o967p7461p6015J9956
17192e9974K9497m3391J10887K2111p2956l9221L8100r646K9788M5366M3431k6164
17180F7828r035N1417j2573n0579l2182j0240r699Q6667M8959J2061n2724l1171
17168E8729n8409n7264n247p42O7030L2094l3060q3235l2221K1994J12354K7748
17156D9771N0188k2619n8623j0971K8152P56r266n698j5036o566N956j0562k3560
17143b8078R877n8142k6077k978N3485N9137O567j3724J4412j3914K132K0931
17131B3628J6226o4959k5229O8961j7168k4619r209J2178J622j5777K7603j8833
17119b5576j9457j2046K1847p83R896L1035J2037L703L6338J5272k2671j5713
$$ y = [129119, 129210, 104578, 102134, 88907, 80214, 98062, 59064, 60414, 80513, 73546, -3915, -79930, -59974, -30477, -73868, 37019, 59130, -13826, -53047, -14947, -24593, 5195, 50561, 93992, 67828, 58793, 110210, 97637, 47058, 14876, 4636, -5063, 81604, 130563, 142624, 89900, 58729, 320, -56944, -62191, -62933, 4097, 36191, 3131, -80104, -112325, -90331, 22023, 49771, 99959, 77340, 18717, 7746, 35898, 36654, 27388, 21690, 6654, 88, 6044, -4518, -28078, -18201, -76343, -102420, -105398, -51913, 7224, 13791, 67, 14479, 565, 2697, 23628, 39854, -25105, -50334, 18627, 1459, -23160, -32369, -20191, -18569, -34346, -6743, -25576, -45033, -57079, -35232, -36015, -26119, 4916, 16953, 20656, 56994, 72266, 49595, 33882]
17107C3882Q695K9744k6242M990j2070L2053R627l0575q385m076L2884m3800m8956
17094b2229K5016J1982j018K2761M2616o236k5149n6108j0891j2738l0831N550
17082e7275J9090O0727p062K6542K207j0111r6262k2963m510M0815O8494M8286
17070F7978R679k5452Q511r471n3063q7549K1265K8425K6020Q086N8456J1779
17058F4664o9196k8575J4933J1266p373L7226N5343k0105k0096k2480J6352J1721
17046D3680k2024l084j88m3432k4318K012K6733N439k92K9552k5047K1994j4206
17033c181J541q567p0105j8423K9078N4417o7784J7872L4257k7142j0719O2288
17021f468m9594j3220J6432j4238J6688Q32k3805L9385O7326j6314n0543m4369
$$ y = [33882, 42577, 72321, 46079, 51069, 38999, 71052, 80679, 50104, 41719, 37643, 70527, 26727, -22229, 2787, 14769, 13751, 36512, 79128, 72892, 47743, -8365, -19256, -31994, -62825, -57275, -38185, 22542, 15480, 42022, 44229, 34118, -62144, -85107, -89617, -48802, 19692, 67978, 77657, 52205, 60716, 51245, -1818, -89367, -68102, -39677, -13657, -5571, 52885, 64664, -4532, -33107, -18174, -6908, -14281, 22945, 78288, 58183, 38087, 15607, 31959, 43680, 21656, 18572, 18384, -25048, -49366, -47354, -20621, -15182, -15474, 14078, -10969, 11025, -3181, -1640, -10207, -80312, -98735, -69657, -15240, -83024, -65152, -30895, -58037, -68756, -6468, -56062, -69282, -52850, -67088, -50400, -49568, -73373, -33988, 33338, 17024, -33519, -77888]
17009g7888K8855J8320O929q820K338j7512k3621L0555k6531K6419P180L7052
16997C276m4803J9874K0274O435l3453q292K734O5019K4403m3535M725j0275n5236
16984d8854k8264L424K1737P6510L1235j7032l7169M198k4959k6961J8747M5900
16972A8512J6571K4885N0245j6069o4357m507k1733k189j3313q129n950J1751
16960a4283N4228J5232l3704o7756l305k5286j8023N1888J0768l075J9938j6531
16948b9909k2025N0500M6268p2623m2849J1986N762K1061L7594K9813k2679l3488
16936b0589L571r437j3375J3130m9081Q382O3148k0139j5015l3143R703P2487
16924I642J1896l0250k8831j6751n1488j2032K5327m057l5050L4850L1325K3524
$$ y = [-77888, -49033, -30713, -23784, -32604, -30266, -47778, -71399, -40844, -67375, -40956, -33776, 3276, -41527, -21653, -1379, 5056, -28397, -36689, -33955, 31064, 55467, 11932, 16657, 6382, -48854, -77118, -73694, -51957, 24553, 55788, 38756, 1587, 5785, -19174, -46135, -27388, 18512, 35083, 59968, 110213, 94144, 29787, 25280, 3547, 1358, -11955, -20084, -26034, -14283, 39945, 55177, 21473, -46283, -49588, -74874, -92897, -41009, -30241, -33316, -13378, -29909, -51934, -1434, 44834, -27789, -70638, -58652, -52890, -31829, 5765, 35578, 12899, -20589, -17018, -26455, -39830, -26700, -75781, -67399, -4251, -24390, -39405, -72548, -62845, 9642, 21538, -8712, -37543, -54294, -105782, -117814, -92487, -96544, -131594, -96744, -65419, -41895]
16912d1895J7893L9130n2471q0496r372J8306N0379K9403j8503M4683j8816Q838
16900a2921l8459j4536j9372L5613N4760R713K2400k5501j8144N9309M082K7450
16888H4394k5684k886l6695K6186q659j2579j6094r922p703K0496l5646n8308
16876h3100M014j7944j9372L6641O1793N7192M7919j0865n0529m4967k6542m329
16864e0089p058j9645j1895K5557O2285P605l9250k354J7791J2795j8310o790
16852b9358L769K3678L7892n3400j2295O814J6094q8497L759O5983J4086L9586
16840B8111L7533n2666m7949l6795k6217j5433J9692N3903Q3110j7031k7095j7111
16828a7948q323L195L8937J8177K2914K07k4357K4541j1380r245j7664m0416n3460
$$ y = [-41895, -24002, 15128, -37343, -117839, -127211, -108905, -58526, -29123, -47626, -2943, -21759, -12921, -51380, -65916, -85288, -49675, 5085, 14798, 37198, 11697, -6447, 52862, 56944, 84394, 58710, 55824, 19129, 45315, 36656, 24077, 7983, -1939, -9642, 10854, -24792, -83100, -79086, -97030, -116402, -79761, -17968, 39224, 87143, 76278, 25749, -19218, -45760, -50089, -57147, -76792, -88687, -63130, -845, 6760, -32490, -34844, -17053, -4258, -22568, -29358, -25589, -1911, 35981, -17419, -29714, -22900, -6806, -95303, -91544, -25561, -11475, 28111, 65644, 12978, -34971, -71766, -97983, -113416, -93724, -39821, 43289, 26258, -837, -17948, -26271, -23076, 15861, 34038, 56952, 57159, 32802, 57343, 45963, 36718, 19054, -21362, -74822]
16815g4822k3123J929J4153N0279p700k1683m1573p799K7217J9695L9831K6597
16803C001k6459J1835J9887l915m9943j2788J615k2111L4350L3716K6577j5032
16791G33j4115K8296L6959k9932o1216j6848J4572O9308K0791j9572k6895n2217
16779e0136k0062O6368m0631j6849M5830J9118n8890k605K4762J0197N6068J5313
16767D8483K3396K79l0497r2604O412N6814l1162o6266J1519J9477k565m727J5047
16754d6394K4012o3302m4730j8914J3717J1711N0723o396j1475p09l2941O434
16742a18264N0475O838L4859L9474k429k6702m5293j1739J3860K9632k0750J6673
16730c3366J1082M289k1014m2072L9345K7414m2281j6213l8410J9368K3291j0332
$$ y = [-74822, -97945, -96016, -81863, -31584, -39284, -60967, -102540, -110339, -83122, -63427, -23596, 3001, -23458, -11623, 8264, 4349, -45594, -58382, -56767, -78878, -44528, -10812, 15765, 733, -13382, 14914, 51873, 21941, -39275, -56123, -41551, 27757, 48548, 28976, 2081, -50136, -70198, -3830, -44461, -61310, -15480, 3638, -55252, -57857, -33095, -22898, 33170, 48483, 71879, 72158, 41661, -50943, -44531, 12283, -18879, -85145, -73626, -54149, -56714, -61441, -46394, -22382, -85684, -130414, -149328, -135611, -123900, -73177, -79573, -91048, -91757, -124698, -118264, -67789, -60951, -26092, 13382, 10953, -15749, -61042, -72781, -58921, -29289, -50039, -33366, -22284, -17995, -39009, -81081, -41736, -14322, -56603, -72816, -111226, -91858, -68567, -78899]
16718g8899k6734O2542L3702k8135L3714K1616J8908n1939r403k759N281j0392
16706c2498l1509j2648L6500P5533M0340K3821m8474m5077k766J295R600N0505
16694F4622K0916l3775L711k5624k4539J1179m557O961K4443j0785N109R089J9507
16681F6257n0561q7688J8473L5800L1738n5798p611k9484N609M0912j2302m5123
16669h9778O6405M6774o7053l2764L2526L894j714M3746l8722k6924p56N599j562
16656f0329L2237J3102j8020l9142n9293j4463K9729J9365j2080P772M1448L5339
16644b4335k5058p704L7872k9720L9111L4042l7497n3874K4079J3563J6344M6859
16632C3682N113m8096l2672k0715n808P126m843L2851R372m3775J753N0651M2928
$$ y = [-78899, -105633, -43091, -9389, -37524, -3810, 17806, 36714, -15225, -24628, -27387, -22106, -32498, -64007, -76655, -40155, 35378, 75718, 99539, 51065, 5988, 3222, 4517, 14117, 64622, 85538, 51763, 55474, 29850, 5311, 16490, 11933, 18894, 43337, 32552, 37661, 46750, 66257, 15696, -71992, -53519, -17719, 14019, -41779, -49390, -78874, -73265, -32353, -44655, -89778, -23373, 23401, -43652, -76416, -43890, -39996, -41710, 2036, -36686, -63610, -64366, -58767, -60329, -28092, -14990, -33010, -72152, -131445, -145908, -116179, -96814, -108894, -101122, -59674, -24335, -49393, -57097, -19225, -48945, -9834, 24208, -13289, -67163, -43084, -29521, -13177, 33682, 38795, -9301, -41973, -62688, -68496, -61370, -66213, -33362, -23990, -67765, -66012, -15361, 27567]
16619B7567j3360l183J6469N8426q4472j1152J441k5067J8224L5335Q968J9850
16607D9046K4478m2715N642J4511l6252j3997K1384p670o3425k2312n608J6148
16595f0770O9389M2394J3288L6558q969k5556l1061k2786J3163j1602m3165M2192
16583A3075L4100J3380n7780K3808j6669l4339K7944k6373k3793O004j7303L7496
16571b0450M6815L2028M041m4801l3744m887l7487O0066r368o3908j0707K8974
16559e3428J1419J1833k9182L9506n994O700m530m141J0453J2683j0291M285P895
16546b792j7512O812J0350m6493j7041P0407R0570J1657n4934l2745j7455j5319
16534a4495j1598n657O985O957p246n6382Q967K9260J374l1833j753l751L6018
$$ y = [27567, 14207, 11024, 27493, 85919, 1447, -9705, -8264, -33331, -15107, 20228, 29196, 49046, 73524, 30809, 36451, 50962, 14710, 713, 22097, 14427, -48998, -71310, -76918, -60770, 8619, 51013, 64301, 100859, 91890, 66334, 35273, 12487, 25650, 14048, -29117, 13075, 47175, 60555, 2775, 26583, 9914, -24425, 3519, -22854, -46647, -40643, -57946, -20450, 26365, 58393, 62434, 17633, -16111, -20998, -58485, 1581, -7787, -71695, -82402, -53428, -42009, -30176, -59358, -19852, -25846, -19146, -23676, -27817, -17364, -4681, -14972, -10687, -2792, -20304, -13492, -3142, -49635, -66676, 3731, 94301, 105958, 51024, 18279, 824, -14495, -26093, -31750, -24765, -17808, -25054, -81436, -72469, -43209, -41835, -73668, -75421, -79172, -43154]
16521d3154N7710L6781m7391p4810M0023P2212K167m2268m2619k8894r2p3205
16509a43540K6748L5132L8419l055J2748J8444L972m6507r6668K2074M5285l1249
16497a18197P1750J5765R610k4300m4555K7274N0126J06546P836k5681q4963q935
16485a7724k0640M03M9331N3976K6797j4573l1489j615p7560p1958o000J2641
16473i8411O4461J3592k3159L3642P0446J0515K9434K725j6275m1731J649L03
16461D7191q969N414k8794N6386L1864j7759l2227k6363M852J2142J0805J0779
16449F5321l2155K452N6698L1211J6198k9471k3955m6442n434O5149l1244m2581
16437B5747o8985m6887k2427N392P920K7715Q6585P7937J6503l8917n9410l4275
$$ y = [-43154, 14556, 51337, 3946, -70864, -30841, 41371, 43538, 1270, -41349, -70243, -70335, -143540, -116792, -81660, -43241, -46296, -33548, -15104, -11132, -57639, -154307, -132233, -86948, -118197, -46447, -30682, -21072, -45372, -89927, -62653, -12527, 94019, 101855, 76174, -8789, -17724, -38364, -37961, 11370, 65346, 92143, 77570, 46081, 44466, -33094, -105052, -111052, -98411, -33950, -20358, -43517, -9875, 60571, 71086, 100520, 103245, 86970, 45239, 46888, 47191, 38222, 43636, 14842, 71228, 103092, 85333, 53106, 26743, 31595, 43737, 54542, 65321, 33166, 35618, 92316, 123527, 139725, 110254, 86299, 39857, 34423, 99572, 68328, 25747, -43238, -90125, -112552, -107160, -99240, -71525, 15060, 92997, 109500, 70583, 11173, -23102]
16425b3102j3919m9237R637O0931P535k9526L648j9011L0544R8566j9055o1255
16413d244k8096M587k6406j6385K9153P9686p724l4422k7410l6376N8363J5625
16401F351K8052L8256l6456m1119m45R609m6811L1633j2360k9175k9306L0437
16389e1334O0975K373j0201j141m7687J6445K725R355j3058N5196O2793l9768
16377D6673l5549p9731l8791l6370K7585M2125j4346j0379J6087O3691l3600m7721
16365a00326K6396R6391L1906r762J277p867n1657k3736l2705M5878M2685K0230
16353C8710j4222k3844k3819l1534J2134J930K8895K9505k6971m0733J0091m4209
16341h4067l111P1042q830L2736J8067r138k2751m0080M8206Q0947K95k9676J459
$$ y = [-23102, -37021, -86258, -76621, -15690, -8155, -37681, -34033, -53044, -22500, 76066, 57011, -4244, -32340, -27753, -54159, -70544, -41391, 38295, 30571, -3851, -31261, -67637, -9274, 6351, 34403, 72659, 36203, -4916, -5361, 4248, -42563, -10930, -23290, -52465, -81771, -51334, 9641, 12014, 1813, 672, -47015, -30570, -27845, -18490, -31548, 23648, 86441, 46673, 11124, -68607, -107398, -143768, -116183, -74058, -88404, -98783, -82696, -19005, -52605, -100326, -73930, 22461, 54367, 44605, 45882, 38015, -13642, -37378, -70083, -24205, 18480, 38710, 24488, 644, -23175, -54709, -42575, -40645, -11750, 17755, -9216, -49949, -39858, -84067, -87178, -16136, -24966, 7770, 25837, 16699, -6052, -46132, 2074, 83021, 83316, 53640, 55099]
16328E5099l8349K9j2907o7007J2717L3563M5675j1730n8150o5012o6890L5824
16316a37138J34388M9161k1742l8886K825m548m2977l1357m8124N238L3070M0181
16304e9909L3116l6710p343j2584J8324O1662M3703M1747J4798o2296n1638o940
16292b4070K1066J5691m6729l9901r758l2958L0952K2831l14M7848q026k0907
16280d4275n2642j3293J5928L111K3412J1360J1086l4780m2864Q2196r787j4225
16268f4773k2498N1052M4747j5990p907L827n939n8369j7509M3499P5123L0608
16256E5871n4288k4790L9677o203L9401j0324K1355k0728k3812m6765P978M3218
16244B0590l3954p525L5647M1929k2095m1979J801P025j5056K5157M113n5560
$$ y = [55099, 16750, 16779, 3872, -63135, -50418, -16855, 28820, 17090, -41060, -106072, -172962, -137138, -2750, 46411, 24669, -14217, -11392, -15940, -58917, -90274, -138398, -133160, -100090, -59909, -26793, -63503, -70846, -83430, -65106, -3444, 40259, 82006, 96804, 34508, -17130, -24070, -3004, 12687, -34042, -73943, -83701, -116659, -85707, -62876, -63190, -15342, -23368, -44275, -96917, -110210, -94282, -91171, -67759, -56399, -45313, -80093, -122957, -40761, -50548, -64773, -87271, -36219, 8528, -7462, -15369, -11542, -17481, -75850, -93359, -49860, 25263, 55871, 1583, -23207, 16470, 10267, 49668, 39344, 60699, 39971, 16159, -30606, -22628, 20590, -13364, -20889, 14758, 56687, 34592, -7387, -5586, 1439, -13617, 11540, 15653, -39907]
16232c9907J2591m820L5380Q487l3737m8484M5490M8541j9942p3666n4908L4537
16220i0438M3751o7949O2748P6672j204n1192n6498K954L5160n2513M3010N7222
16208A723J8580o9269Q22K3568K7663L8720n954l849L1752J4862l7984q931k1838
16195I865j3762J2776j8659l2757R6l149p570j5451j5926L3860M9701J2458L4005
16182D5487n473q6096m2068N0743M6580R638j6303Q621j4679m6469J0418K9335
16170a0266L0180K6522j4410o2980p986K0641l5570n8570M4049J03921k2451k2383
16158i303p2310j2692K1218L3591J8225j2518Q478M7096n7919l1414J2302J4109
16146d1137L093N969J0080N449k677j858K6052o355N877j2569K175n130m787J3965
$$ y = [-39907, -27316, -32136, 3244, 11731, -22006, -70490, -25000, 23541, 3599, -70067, -124975, -90438, -46687, -114636, -51888, 24784, 23580, -27612, -84110, -81156, -45996, -98509, -55499, 1723, 20303, -48966, -48144, -24576, 3087, 41807, 35853, 32004, 63756, 78618, 40634, 31703, 9865, -3897, 8879, -9780, -42537, -42441, -45590, -53160, -68611, -84537, -50677, -976, 11482, 45487, 40014, -46082, -88150, -37407, 9173, 18811, 2508, 11129, -3550, -50019, -39601, -10266, 19914, 46436, 32026, -30954, -38940, -18299, -53869, -112439, -68390, 35531, 13080, -9303, -81613, -94305, -73087, -39496, -21271, -33789, -25311, 21785, -36134, -67548, -55246, -41137, -38044, -32075, -21995, -16546, -19223, -21081, 4971, -1384, 4493, -8076, -5901, -11031, -15818, -1853]
16132a853J3169r907o59O3165n8359n7612r390N4007K9735L2145j762j3394l2681
16119F604l9382o1448j1663N7708N4012l2535l5963J0187l523K9151J3614M217
16107i021o708k3623p276L6695O1954K1519n3831l6536m3760J1587L2100J0101
16095f799k8461j0888O4103M7101N388K7699J5170q1027n9021Q504Q024J3242
16083C035O695Q818K4454m5970k4897k0788j1121K6303M3123M2138J435j8245
16071C4980o1434m7820k3587q872K8370M0762J3817L985j2968k390j9378J1779
16059d2756j779r363K3954K9252J9304l1559J0477k5985o0317k9126o792J6966
16047a07724O5146L9995J3088P1146M4904K3778J681k3593l9516o5032K3596J7159
$$ y = [-1853, 11316, 1409, 750, 63915, 5556, -52056, -61446, -7439, 22296, 54441, 52679, 39285, 6604, -32778, -94226, -105889, -48181, 5831, -26704, -62667, -52480, -56003, -26852, -13238, -9021, -15729, -39352, -46628, -9933, 52021, 73540, 19709, -16827, -60587, -49000, -16900, -6799, -35260, -46148, 17955, 65056, 70444, 98143, 113313, 32286, -26735, -18231, -10207, 3035, 9730, 18548, 43002, -2968, -27865, -48653, -59774, -33471, 9652, 51790, 53225, 34980, -26454, -74274, -97861, -106733, -78363, -37601, -23784, -19799, -32767, -35157, -54535, -42756, -44535, -53898, -29944, -692, 18612, -12947, -2470, -28455, -88772, -117898, -124690, -107724, -42578, -2583, 10505, 81651, 126555, 150333, 152014, 128421, 88905, 23873, 47469, 64628]
16035F4628k1063L141l5405N272N970k8512j5852N2695K6155l2738p364j5119
16023A808j9457N0637J377m3236m2936M285l8502M2444N7142J2518N4873J3053
16011I4006m1553o6778n1102J5602J9357J4606k4425M2123j1248l3234K6055K0944
15999D353n9087K7544M4308N0702p8597o649k1865m250M2441O0635P247o2688
15987D094o7535j2272R693N5519l6201J0322K3514k6703k3922P358M7967M8268
15975D0102K1604l8496O339J5077k5025n5951j5965J2210M7351L8577k1959j622
15963B2242j0819K8498R129k7340p8812m3365o129R150O5917N9711r2850l8530
15951a03198J3641L7702K9837j5316J6061L2464K2409j4981j273l2888k469N151
$$ y = [64628, 43565, 46706, 11301, 16573, 22543, -5969, -21821, 30874, 57029, 24291, 16927, 1808, -17649, 32988, 34365, -8871, -51807, -47522, -86024, -43580, 13562, 26080, 80953, 94006, 52453, -14325, -65427, -49825, -30468, -15862, -40287, 1836, -9412, -42646, -16591, 4353, -54734, -27190, 17118, 67820, -10777, -17426, -39291, -43541, -1100, 59535, 66782, 4094, -63441, -75713, -66020, -10501, -46702, -36380, -12866, -39569, -63491, -56133, -8166, 40102, 61706, 23210, 29549, 44626, 19601, -36350, -52315, -40105, 7246, 45823, 23864, 22242, 11423, 39921, 49050, 21710, -57102, -100467, -106596, -97446, -31529, 28182, -64668, -103198, -89557, -51855, -22018, -37334, -21273, 11191, 33600, 18619, 17346, -15542, -18011, -12860]
15939a2860J3973R339R515j3640Q930J0473n1995j8442j7140r52l1664K3959l5963
15926a06467k4183J9767L0103l8135L8760O883l7487J8532J5958P8867J0349k3062
15914a0115J8112M1569n031m9066l8825o988N2280j1281l6855m4140J3003k5291
15902a02628J2145N067j2959j8878K7103L8671l2515j0622L105J07300J1991l6707
15890h927m0649L079P2057J4346p0671J7217K0612L9937m566J243k4098n3320
15878c3740J7670o738m528m940K3647N484j0310j7216n041P5756J3422k2118L0178
15865F1526N28j05375j7717K3096j5094r107J554k604M5399m224L732p0663p8808
15852a67757J7974K3873j9391J5341L7966K1531N523K2704K6500K3627k6338k8856
$$ y = [-12860, 1113, 10452, 19967, 6327, 15257, 25730, -26265, -44707, -61847, -62799, -94463, -70504, -106467, -130650, -110883, -80780, -118915, -80155, -73272, -110759, -92227, -76269, 2598, 12947, -10115, 7997, 49566, 44535, -4531, -43356, -50344, 1936, -9345, -46200, -90340, -77337, -102628, -90483, -85416, -98375, -117253, -90150, -51479, -83994, -94616, -91511, 15789, 27780, -8927, -49576, -46497, 25560, 39906, -30765, -13548, 7064, 47001, 42435, 43678, 19580, -33740, -16070, -22808, -27336, -32276, -8629, -3145, -13455, -30671, -35712, 40044, 53466, 31348, 61526, 62054, -43321, -61038, -37942, -53036, -62143, -60589, -63193, -17794, -22018, -18286, -88949, -167757, -149783, -125910, -145301, -129960, -91994, -70463, -64940, -42236, -15736, 7891, -18447, -47303]
15840d7303L6139J9680n7372p6959K9399J5744N2389Q1854J9400k2717J8355J0916
15828G9525l8105k5942m758j9064k6109j8805J7834M2626p50k6538l4508K5630
15816b8964O6935k4546m3486K9746J6609j8789L463L2057K5686O782q2702n4431
15804g1640J1373M211J5206K1686l5582M804M5515J863K829m1758k9683L5514
15792c5662L4355n096j5583O628j1492p553j6903K3268J9753l3613K672l4762
15780g3988j4892K2985j0775j0750N9538M4927K21o5960j5899k4445k1538L7711
15768g2865M0438L7452O139P254J4378K369k0691k4094m4725k3325l0328l5041
15756a43039K0875O6130N5877J1844J688p874k6949K7515L0880L155j9813n227
$$ y = [-47303, -11164, 8516, -48856, -125815, -96416, -80672, -28283, 53571, 72971, 50254, 68609, 79525, 41420, 15478, 10720, -8344, -34453, -53258, -35424, 7202, 6452, -20086, -54594, -28964, 37971, 13425, -30061, -315, 16294, -2495, 968, 33025, 58711, 65493, -17209, -71640, -60267, -56056, -40850, -19164, -54746, -49942, -4427, -2564, 265, -41493, -71176, -35662, -1307, -6403, -21986, -15358, -26850, -34403, -51306, -28038, -8285, -41898, -39226, -73988, -88880, -65895, -76670, -87420, -27882, 17045, 17266, -48694, -64593, -89038, -110576, -72865, -32427, 5025, 11164, 18418, 32796, 35165, 14474, -9620, -54345, -77670, -107998, -143039, -122164, -56034, -157, 11687, 13375, 5501, -21448, 6067, 36947, 40102, 20289, 15062]
15744A5062k008p4043n4171j8734R671J8090O8143N8673L1153K4108m9991l650
15732B2303l856m676m5749m3577k0588K0605J4739M7317l0064M6732M1529j0146
15720C4569k5998q437L1768m3612p5131K18m622r427L4862O4455N242l6177j3034
15707d5324j1317k9353j6799N8208O662L0000M0156l1430j7416J0023j863n0824
15695e9277J5161J2770m1733j6850O4420O4915k9051p3707J616q583L0083N1386
15683A1150L6498K1669n9108m5468J7086K2515m6878l837p110j7012K142L0847
15671c7506K0543l2046o1775k4100K911J1446J1738j4459J5935N3036K0920l2799
15659f6156M300K9179l5739j8709L5292l688J9576R26k6093o4232O413O4142K1332
$$ y = [15062, 13054, -60989, -115160, -133894, -124223, -106133, -37990, 20683, 51836, 75944, 25953, 22303, 18447, 13771, -31978, -75555, -96143, -75538, -60799, -13482, -43546, 3186, 44715, 34569, 8571, 134, 31902, -11710, -86841, -86623, -91245, -100672, -65810, -1355, 3887, -32290, -45324, -56641, -85994, -102793, -44585, -37923, -7923, 32233, 803, -16613, -6590, -8453, -59277, -44116, -31346, -73079, -89929, -25509, 39406, 10355, -63352, -61736, -70319, -40236, 11150, 47648, 69317, 10209, -35259, -18173, 4342, -42536, -46373, -53483, -70495, -68353, -37506, -16963, -49009, -110784, -134884, -131973, -120527, -108789, -123248, -107313, -54277, -33357, -66156, -61856, -32677, -68416, -87125, -51833, -55521, -35945, -35019, -61112, -125344, -118931, -54789, -33457]
15646c3457Q418j588K2212n0888K2402l6241l5011R609K8288J6414j879l5132
15634h6853j8031k22M072O3096K6074j8247j0912k8631J4370L8303L2487j4782
15622G24l0920n3192J2883N7336M199k0638m3828k0806J7339o839L5630K6936
15610b1176K0842L7638n7330O691P938k0533J5420J2015l8266J7603Q864K5841
15598A5547k2461k4553M5389J4924m2776m942j5469J3077O1868L1459m5341j7283
15586I439K1098J0255k915m9419m3557m7002r979m330k2290Q532K5156J5954Q154
15573h0904J7166K2661r567L7682K1284k7612r699j9231Q523Q18j0147o992J9680
15560c6338K7590O1984O397k4739p403J4235k7211n8510m3487K5904L7258Q97
$$ y = [-33457, -25039, -26627, -4415, -55303, -32901, -69142, -104153, -94544, -66256, -49842, -51721, -86853, -104884, -105106, -101034, -37938, -11864, -30111, -41023, -69654, -55284, -16981, 15506, 724, -30196, -83388, -70505, -13169, -8970, -29608, -73436, -94242, -76903, -83742, -48112, -21176, -334, 37304, -20026, -13335, -5397, -25930, -10510, 1505, -36761, -19158, -10294, 15547, -6914, -31467, 13922, 28846, -13930, -18872, -34341, -21264, 40604, 72063, 26722, 9439, 30537, 40792, 37877, -11542, -55099, -102101, -112080, -116410, -138700, -130168, -105012, -89058, -80904, -63738, -41077, -50644, -12962, 8322, -19290, -28989, -48220, -39697, -38879, -49026, -56018, -36338, -8748, 53236, 59633, 34894, 27491, 41726, 14515, -43995, -87482, -61578, -24320, -23423]
15548b3423J4776P586J6378J0285Q214L433n6125m072o628l1721j3913j7186J2606
15535g9790K4176J5074k6081m9703Q132L288K2954K4743m154l0716J4994L2054
15523d5029K2517M278o1972j2056K1046M647r843j8699L7126J6760j7634J0416
15511d8443j1313L8330j341l0210k3580J9892K5754M4522j6750k7722J3767J3385
15499c709m8687m8060P6751j0651k5049L7320r888j5979J2932N8409j5426j4507
15487f544M7183j2127j7571J1136J4851R816j5666j6702K1209K7726o3247m459
15475d395J2915k9673k1219J4579l4288k4428l0113j9836m608L3521N2199J6978
15463c8368M335L5472l6288J3140O842J7973J8982k6739K9683j4056N0043j4688
$$ y = [-23423, -8647, -1061, 15317, 25602, 33816, 37249, -18876, -22948, -29576, -61297, -75210, -92396, -79790, -55614, -40540, -66621, -116324, -108192, -104904, -81950, -57207, -61361, -92077, -77083, -45029, -22512, -18234, -80206, -92262, -71216, -66569, -76412, -95111, -57985, -41225, -58859, -48443, -59756, -21426, -22767, -52977, -76557, -56665, -30911, 13611, -3139, -30861, -17094, -3709, -52396, -100456, -23705, -34356, -59405, -22085, -31973, -47952, -35020, 23389, 7963, -6544, 40639, 28512, 10941, 22077, 36928, 46744, 31078, 14376, 35585, 63311, 64, -4395, 8520, -21153, -42372, -27793, -62081, -86509, -116622, -136458, -141066, -107545, -55346, -38368, -34033, 1439, -34849, -21709, -14867, 3106, 22088, -4651, 25032, 10976, 61019, 46331]
15451D6331J3456l8331p6655k9999M7993N2804l609J7063j0738n1426m1463J0596
15439f3978J2640J4870j2410K892L3357K6054O8806l6512k4820n1815n4638J2875
15427g2679K4770J902k8998j4115L1242p786O874J962J6512L049q410k2086J0985
15414e6778O8378K3557j38o1442k6616K7081j6699m2973O214o066O55L8248N759
15401d0820K8211O7057J3831l0123k2539l420J5333j4209m1744M0006K6480j8886
15389A9177j1204L006n8759R826N009L8688k5223l8898k0421o167k8499N7873
15377e5592J692R785J8459K9622p100k9442k5695p033j7361K1605j7901l2947
15365a11908K8714K4423J9056M6819K990Q628o896o1567o5924q500L8837J3279
$$ y = [46331, 59787, 21456, -55199, -85198, -37205, 15599, 11990, 29053, 18315, -33111, -74574, -63978, -51338, -36468, -48878, -45986, -12629, 13425, 82231, 45719, 20899, -30916, -85554, -72679, -47909, -46007, -75005, -89120, -57878, -65664, -58790, -56828, -40316, -37267, -45677, -67763, -56778, 11600, 35157, 35019, -26423, -53039, -25958, -42657, -85630, -79416, -85482, -84827, -46579, -40820, -12609, 54448, 68279, 38156, 15617, 12197, 27530, 13321, -28423, 11583, 38063, 19177, 7973, 10979, -47780, -37954, -32945, 5743, -19480, -58378, -78799, -84966, -113465, -55592, -53900, -44115, -25656, 3966, -3134, -32576, -58271, -65304, -82665, -61060, -78961, -111908, -83194, -58771, -39715, 7104, 10094, 18722, 11826, -49741, -115665, -124165, -85328, -72049]
15353g2049K6754O1573j0356K6045j6120N052K3118K0453l174l7247l8699k8372
15341d3022j8892j3343L4287p401q311J0429K9295J1425Q860l5877j3034j2541
15329e8125K5615Q0671O1196q0286o8831k1676N5196o1602m5499L8604L2332K1809
15317b0596M9995L9302o8048k7408L8185N122r9403l0677K3537K525j7221L0241
15305g4446J1832J0724P145k295K7000J7308j9791k9606M317r14j3593K0426K1024
15292b0869K4755K5218K8258n1605l5843j0307n1802l04K8900O5194J7762j3033
15280F324K08M9947J0103k6564j3211L197p2006o4871K7303K5789K3242L6090
15268E551j3502r524j4216j4151Q742L95l9203l0819j771M5618M326J1768m014
$$ y = [-72049, -45295, 16278, 5922, 31967, 15847, 20899, 44017, 64470, 61296, 24049, -14650, -43022, -61914, -75257, -40970, -48371, -56682, -46253, -16958, -5533, 3327, -32550, -45584, -58125, -32510, 48161, 109357, 29071, -39760, -61436, -6240, -67842, -113341, -74737, -42405, -20596, 29399, 68701, 653, -26755, 11430, 16552, -82851, -113528, -89991, -87466, -104687, -74446, -62614, -51890, -44745, -47040, -20040, -2732, -22523, -52129, -47812, -48726, -62319, -41893, -20869, 3886, 29104, 57362, 5757, -30086, -40393, -92195, -92499, -63599, 1595, 19357, 6324, 6532, 56479, 66582, 40018, 26807, 30004, -42002, -106873, -79570, -53781, -30539, 5551, -7951, -17475, -31691, -45842, -37100, -36705, -75908, -106727, -108498, -62880, -58554, -46786, -50800]
15255e0800j8095J6620L7157j4161o2931K3088j6423l580k4808N9385O1441n712
15243A181j7411j2244M877k1324l2993j8417p259J1816J9656K9388J9514K4947
15231A731n1158k9512L0456K9935j7477M970J7938N2985k0060m962j00873O931
15219g9096O3217N1752j6324K8989J9043P981m079l1053o5757m5843M2437K2983
15207e750l1829J6705m0287N969L4369m708j7108M8040k3470n3183j9710M4730
15195d6232J0566m3239l5507k2984M0741J568J3153K2051L381K749M3573J4185
15183D005O0556J7402n1324j16116J2375P616j348j7853J7970M7718L7569j3274
15171E296l327J0476j7319j1875m6270o0108l216L7370M9834N3601N763J1583
$$ y = [-50800, -68895, -52275, -15118, -29279, -92210, -69122, -85545, -89125, -113933, -54548, 6893, 1181, -16230, -28474, -23597, -44921, -77914, -96331, -103590, -91774, -72118, -42730, -23216, 1731, -49427, -78939, -48483, -18548, -36025, -31055, -13117, 39868, 19808, 14846, -86027, -79096, -15879, 35873, 19549, 48538, 67581, 75562, 71483, 40430, -25327, -71170, -28733, -5750, -37579, -20874, -61161, -55192, -20823, -25531, -42639, 5401, -18069, -71252, -90962, -46232, -35666, -78905, -114412, -137396, -96655, -95087, -81934, -59883, -56502, -53753, -10180, 4005, 64561, 81963, 30639, -85477, -73102, -65486, -66834, -84687, -66717, -18999, 18570, 5296, 1969, 12445, -4874, -16749, -63019, -123127, -126343, -88973, -39139, 14462, 20225, 31808]
15159C1808J4027K5183j3405l6510n3061j5593j0844k9368o4314K796R6208K5789
15147b7284j3732J4841L0121R1546j0641o6383k9745j163P889M3049l3050j4067
15135h619O9852K2407p0917k9337m0633K2446M2590m6512k8646L390l5909r730
15123a09618P595M5478J5882L1424N3691O296k9209j4600m6857j8728r1815q71
15111a51332N7442M0423O1318k5086n5869l0727N2485L4707l1483R160M616L4206
15099a40J695m2646l9524j5821j7022K4266q333j230N4076N5564j9179j3649K2976
15086A033n5465k8188O0396K1671j30233l1936J18559L1070k1478k4382k9207
15075h8160k9621K0728l809j331k7600K7501Q1257O970l0753o919k4515M7719
$$ y = [31808, 45835, 71018, 57613, 21103, -31958, -47551, -58395, -87763, -152077, -149281, -53073, -27284, -41016, -26175, 3946, 95492, 84851, 18468, -11277, -12440, -4551, 38498, 5448, -8619, 61233, 83640, 12723, -16614, -57247, -34801, 7789, -38723, -67369, -63979, -99888, -109618, -102023, -56545, -40663, -9239, 44452, 50748, 21539, 6939, -39918, -58646, -150461, -151332, -93890, -53467, 7851, -17235, -73104, -103831, -51346, -16639, -48122, -38962, -34346, -140, 1555, -41091, -80615, -96436, -113458, -89192, -97525, -98755, -44679, 10885, -8294, -21943, 1033, -54432, -82620, -22224, -553, -130786, -162722, -44163, -13093, -34571, -58953, -88160, -117781, -97053, -100862, -102193, -129793, -102292, -21035, -14065, -44818, -51737, -76252, -28533]
15063b8533R1020r4622l0066M0412J2345K8880Q343k6463K2391L5782O638j182
15051F4945J7536m1829p7856k151r665j8833L6802L0449j55R6662N8710Q025o1827
15038A00813l9887o5959l9352Q862N3360J0672j4288j0978r348Q868l5463m358
15026c7058m8390N7503J1862p0780j0943K2065K6190M4753J4144L8812o510o9483
15014b7835q897K0826M2977m8639l3463k4485L6300L3608M7025l7022l9580j9139
15002e8324j2883K5197O2665J3494K9500r414j8310O6692K7746J3693n9305p2927
14990G824j5127K9067k95p918R010j3180o3017J2409p228m8822L971Q0018J7065
14977C777L4414O1675n417j0786j2528K8337L9495q530J2676K256o380K5393N3255
$$ y = [-28533, 62487, -32135, -62201, -21789, -9444, 19436, 27779, 1316, 23707, 59489, 66127, 64945, 82481, 40652, -37204, -39355, -49020, -67853, -31051, -602, -757, 95905, 154615, 162640, 100813, 60926, -5033, -44385, -35523, 17837, 28509, 14221, 3243, -6105, 2763, -32700, -37058, -85448, -27945, -16083, -86863, -97806, -75741, -49551, -4798, 9346, 48158, 41648, -27835, -36732, -15906, 27071, -21568, -55031, -79516, -43216, -9608, 37417, 395, -39185, -58324, -71207, -46010, 16655, 30149, 59649, 50235, 31925, 98617, 126363, 140056, 80751, 7824, -7303, 21764, 21469, 13551, 22561, 9381, -53636, -41227, -48455, -97277, -93306, -13288, 3777, 38191, 99866, 94449, 83663, 71135, 99472, 138967, 130437, 143113, 145369, 138989, 164382, 217637]
14964B17637N8358N8613M5380M7331J57322J07529N4448L7018N3906J7137K091
14953H56770k5221o4602j26588j00281q3712k7914J2219j6612r1605o4905l6467
14942B31082k837j2925j7231j9480p8742j9880M667J4309O49J3149j5386k094
14930I5281r796o465j0306M9740P1564o3083n0108J0197L4147J7215N736J651
14918A45773o112l9470k425o4585k4934M774m7024j609K1129q658j2297J6962
14906a8476j3925L2936j6246L6343Q046l5739m2311k1217J2335O0695O522o8848
14894e9885l0289r988L6980M0394L5723O5618o7239m7258M9875l5666J2658Q309
14882g68N407K093J7494q745O932R968J7382N060P6109l8891p0485k6432J4676
$$ y = [217637, 275995, 334608, 379988, 427319, 584641, 692170, 746618, 783636, 837542, 854679, 856770, 831549, 766947, 640359, 540078, 456366, 428452, 440671, 424059, 332454, 267549, 231082, 228245, 215320, 198089, 178609, 99867, 79987, 84654, 98963, 99612, 112761, 97375, 95281, 85485, 79020, 68714, 118454, 190018, 126935, 76827, 87024, 121171, 138386, 144122, 145773, 139661, 100191, 97766, 33181, 8247, 13021, -34003, -35612, -14483, -23141, -35438, -18476, -32401, 535, -15711, 20632, 28678, -7061, -49372, -70589, -58254, 2441, 8963, -59885, -90174, -100162, -63182, -22788, 12935, 78553, 11314, -35944, 13931, -21735, -9077, -768, 4639, 6732, 24226, 15481, 22413, 32381, 49763, 54823, 130932, 92041, 21556, -4876, 9800]
14869I800K5338J1167j5919L1054m7792m2997k8428J6951P538M580l1642j8972
14857g9322p743M6416K1066l7076j330K3910m997p55o723M8467K6346J157m028
14844B5388L5024K3931m9048j3687J0948k1689K107m7097m5063K0064J9442k8257
14832f7937L4492R637l559J3795m2077J4578N410o0881L966J3512J2136L3722
14820c3206J7661j1197l5225n116K3896l148J3519K9029J3485R810M7900p182
14808F0226m0867k9990p1812J0651O2615K8811l8009k6380n1081J1563P8013M6971
14796D0711l8264l9240l0495M3755N5798K0639n392L460O415n711l68p1698J2253
14783h137N754n3590j0560K1506O1213k8086k984L1972K9538p392r726j9282O6743
$$ y = [9800, 35138, 46305, 30386, 61440, 13648, -29349, -57777, -40826, -33288, -28708, -60350, -79322, -87065, -40649, -19583, -56659, -57989, -34079, -39076, -39831, -46554, 1913, 28259, 29416, 25388, 60412, 84343, 35295, 21608, 32556, 10867, 12974, -34123, -79186, -59122, -39680, -67937, -33445, -23808, -27367, -13572, -55649, -41071, -35661, -96542, -92576, -79064, -66928, -33206, -15545, -26742, -61967, -67083, -43187, -46335, -32816, -3787, 9698, 19508, 67408, 60226, 19359, -10631, -82443, -71792, -9177, 19634, -18375, -44755, -95836, -84273, -6260, 40711, 2447, -36793, -67288, -23533, 32265, 52904, 47512, 50972, 57387, 51676, 51308, -20390, -8137, -2383, -55973, -66533, -45027, 16186, -11900, -14884, 17088, 46626, 39234, 29508, 10226, 76969]
14770G6969O0212j4246J1487k8944L5562q50K4487K0126j5961m6063o297q552
14758A07930j6262P44K2754l5696J5163P520J8162o773p1568j7175o331l2003
14746a3535L2228L1210O382n030l7207L2001M7719j6361m3375k0858m3032k7180
14734e7038k6728q724M2254J2054o365k0174J9664L0275L393J21m6220o4752O1855
14721f0385P3350N807M0018J1009l2263O590K2722j3882J9979m3132K063L549
14709C5425q510l9890j13714m1838j5135N0488O4444L3549M0084L0897n8879k4225
14697d7304r025k1951o767M2573R715M2142J1562q7066k1642L3272J4683L2167
14685g641N6594K050q4390j9387k6119K8189n7022n4414O4284o311J0693M5575
$$ y = [76969, 137181, 122935, 134422, 105478, 141040, 140190, 164677, 184803, 168842, 122779, 116482, 107930, 91668, 92412, 115166, 79470, 94633, 102153, 120315, 113542, 41974, 24799, 18468, -13535, 18693, 49903, 56285, 51255, 14048, 46049, 93768, 77407, 34032, 13174, -29858, -57038, -83766, -92490, -50236, -38182, -44547, -64721, -45057, -14782, -11389, -11268, -57488, -122240, -60385, 12965, 18772, 58790, 69799, 37536, 44126, 66848, 52966, 72945, 29813, 31876, 35425, 26915, -12975, -126689, -168527, -183662, -133174, -68730, -35181, 4903, 35800, -23079, -47304, -56329, -78280, -85047, -42474, -32759, 9383, 20945, -66121, -87763, -54491, -39808, -7641, 48953, 51003, -33387, -52774, -78893, -50704, -107726, -162140, -97856, -104167, -93474, -47899]
14673d7899M605J3105j4466K1849L0836k1886J2238K5841m6649p7643o524M1036
14661f5557N2698J0573K5481J3127n4766M9792P101N8749M8015p8182m9664n4368
14649c7001J6276O1297M7414l5788j4978l8343m5470Q4N8082j7464n3337q353
14637f7581L6869M3308L6289K8091L3444m0844l9703o575j3361o9263k3037L5242
14625d7121K8982m5746k7805j1546O7633l2716J6409N211j4480O9207N4541K7002
14613H9571J938J1778k1021n6401k7452l3874q258j0815r012p837J4915R302j6630
14600f3796J7351L9582L2328L2331L5296m1775p3416l7652p036k2332j0112K1654
14588g7577L9052M1352j4399r333k8261m7092j8772N0515P1807K359l6030O12
$$ y = [-47899, -43294, -30189, -44655, -22806, 8030, -13856, -1618, 24223, -22426, -100069, -106593, -65557, -12859, -2286, 23195, 36322, -18444, 31348, 38449, 97198, 145213, 67031, 17367, -37001, -20725, 40572, 87986, 52198, 37220, -1123, -46593, -46509, 11573, -5891, -59228, -67581, -30712, 12596, 48885, 76976, 110420, 69576, 29873, 23298, 9937, -59326, -82363, -47121, -18139, -63885, -91690, -103236, -35603, -68319, -51910, -46699, -61179, 8028, 62569, 89571, 91509, 103287, 82266, 25865, -1587, -35461, -43719, -54534, -63546, -71383, -56468, -47166, -63796, -46445, -6863, 25465, 57796, 93092, 51317, -22099, -59751, -66787, -89119, -99231, -77577, -38525, 2827, -11572, -20905, -49166, -96258, -115030, -64515, 7292, 9651, -26379, -25767]
14576b5767M4481O3021j3048j29581l257J9743R671m4004j158Q216K4605K7499
14564a9579l1197n0077j6454P2019O0474l4010r363o7492M671M9522M3797O6856
14552F9167J7617J4219K9799k7007m214J6123m3725j11490k8883M435N5482L5962
14540B7485l4414M8131N4186l5662m7137k0145O989m2319J195j2676j999L094
14528e3272N532j3660J6705J8032o898O282K5693J0060K4129j5l0071o1834j4990
14515g4307J5057k9284k324J2881L3028M7401N160n6663o3345n1664m167L2650
14503a35577P2185Q397L9515O0074n165j396l1919m8251l1386p59N1353l8040
14491f0969j3035J6748L3014O7917K4790m6614l8479l4329J1701m1626L8411L9688
$$ y = [-25767, 18714, 81735, 68687, -60894, -64151, -44408, -34737, -78741, -79899, -71683, -47078, -19579, -50776, -100853, -117307, -45288, 15186, -18824, -28187, -95679, -91008, -41486, 2311, 69167, 86784, 101003, 130802, 103795, 99581, 115704, 71979, -39511, -68394, -63959, -8477, 27485, -6929, 41202, 95388, 59726, 12589, -7556, -567, -42886, -41691, -54367, -56366, -53272, -47740, -61400, -44695, -26663, -33561, -27279, -1586, 8474, 32603, 32588, 2517, -59317, -74307, -59250, -88534, -90858, -77977, -44949, 2452, 7612, -49051, -112396, -164060, -168227, -135577, -63392, -54995, -15480, 44594, 39429, 38033, 6114, -42137, -73523, -74282, -22929, -60969, -74004, -57256, -24242, 43675, 68465, 21851, -16628, -50957, -39256, -80882, -42471, -2783]
14479b783l4028n9715K7238M1424m775L676n1954l0312l2032N3537L2055J7633
14467d0036l2334m30N5978m383j9908J7348j918L7118j2252j3781Q963p423L2541
14454A9483N0907m3467o2883N4616k2936K69o673m2477l6749J857K0527K4916
14442d2610k5335K254k8872J931L6397J4220q4763n3629J3124P2889K412K5932
14430f6050K8675N32K164L6266m765L9493k538K523n471n591o1397k1181M8409
14417h931J4240l326k1861J4587J1023m0514n441P0093L1214k5346k9547O701
14405A2892j0845m5784p685J7742m8788J1608m310J0837J5630l0399J9257O2244
14393B399M6883k5149q9169l3329M6205M2911P732j1005M1275L1180r511j6556
$$ y = [-2783, -36811, -96526, -69288, -27864, -32639, -28963, -80917, -111229, -143261, -89724, -57669, -40036, -72370, -72800, -16822, -21205, -41113, -23765, -25683, 11435, -817, -14598, -5635, -13058, 19483, 70390, 26923, -35960, 18656, -4280, -4011, -10684, -53161, -89910, -88053, -67526, -42610, -67945, -65691, -94563, -92632, -56235, -42015, -126778, -180407, -167283, -94394, -91982, -66050, -37375, -36843, -34679, 1587, -3178, 36315, 33777, 36300, 30829, 25238, -36159, -57340, -8931, 5309, 1983, -19878, -5291, 5732, -34782, -40223, 29870, 61084, 35738, 6191, 12892, 2047, -43737, -51422, -33680, -82468, -70860, -75170, -64333, -48703, -79102, -59845, 2399, 49282, 24133, -65036, -98365, -52160, -9249, -1517, -12522, 28753, 59933, 50422, 33866]
14381C3866k4349Q559l4737J4278q776Q434l5504l2593M2817K6410K7900j5877
14369A0428k1513l4370o0424k9069K3311Q0171L5719J7265L7847m3015q6340j8981
14357h8971M3773J0818P612K6478L846K9310n136k2434J5675o5888O942K2594
14345a5381Q002j8251l8249K1917J6445L2923l7974l3088J7075J8464J3193k5201
14333d0125k3734J4300K4198l8042l1975J19933K5126K6292k2178p1232k9730
14322d7167K1854k589P3697q609n8807m6932J7951j4214o0441L5114M5201k5894
14310g0836r657L6940M8564O059k1202n5907K2957K2730J0007K1276l0910p1080
14298i1059l1570J2269M536J0085l1284M4351O8575N6618k5247m2466N7473L7472
$$ y = [33866, 9517, 18076, -16661, -2383, -11159, -2725, -38229, -70822, -28005, -1595, 26305, 10428, -11085, -45455, -105879, -134948, -111637, -31466, 4253, 21518, 59365, 16350, -69990, -88971, -45198, -34380, -26768, -290, 3556, 32866, 27730, 5296, 20971, -44917, -37975, -15381, -7379, -25630, -63879, -41962, -25517, 7406, -30568, -63656, -46581, -28117, -14924, -40125, -63859, -49559, -25361, -63403, -95378, 24555, 49681, 75973, 53795, -17437, -47167, -25313, -27902, 45795, 37186, -21621, -68553, -50602, -64816, -125257, -90143, -44942, -70836, -80493, -43553, 5011, 11070, -10132, -66039, -43082, -20352, -10345, 10931, -19979, -91059, -122629, -110360, -105824, -95739, -127023, -82672, -14097, 42521, 17274, -25192, 32281, 69753]
14286F9753k1550L031N765K6322p2807m2686n6233J631K3489L4150j4020j8200
14274f1355k9387k8052J9456J8574L9508K9697l1028l4118k869M6215J7105k5347
14262d1601j5068K5821J4045m0699k0249O6259J9888k4159Q3901L3843k214m4332
14250E5435o7670k7447j1051N5864K3753l8009j0816m090j8604M0458J5888l8291
14238b4580J0695O930j6533l3225n520R29L7405L3389l3590m4615l7040J5888
14226h9867L9620J4264J9984j5969R947j6439L0127O2680k0688k5208r023j7898
14214a8470r753l4954J2239N6942K3658o767k463J3453k9405o4782p5294J3901
14202a21695L2316M773J1099L0595L2791O4388J4721n942m6057l0826q054P943
$$ y = [69753, 48203, 51234, 56999, 83321, 10514, -32172, -88405, -86774, -63285, -29135, -43155, -61355, -90742, -118794, -99338, -80764, -41256, -11559, -42587, -76705, -79574, -33359, -16254, -41601, -56669, -30848, -16803, -57502, -77751, -11492, 8396, -15763, 68138, 101981, 99767, 55435, -12235, -39682, -50733, 5131, 28884, -9125, -19941, -24031, -42635, -2177, 13711, -24580, -13885, -6955, -23488, -56713, -62233, -61304, -23899, 9490, -24100, -68715, -105755, -89867, -50247, -35983, -15999, -31968, -22021, -38460, -8333, 54347, 33659, 8451, -572, -18470, -28223, -63177, -50938, 6004, 29662, 22895, 20432, 33885, 4480, -60302, -135596, -121695, -89379, -84606, -73507, -42912, -10121, 54267, 68988, 63046, 16989, -13837, -21891, -13948]
14190a3948o3818j8233J7310J5360J743J3665l0536K0438j1300j2509L3364K4365
14178b4099K4448l3881n6576N4166q401l659o440m6890J324N3098P182J0139p312
14165c6901M2349J7366J993L0263N575q924k5711k6960J370K202J1633n4464P787
14152c2422M259j1306N624n309N2869N3718J9513l2207k7554p7583L304O223l5300
14139g6171N3470j180l1906l084L0021j0929J6331M7892j8824p567o2694J061
14127f3580R365J8388L1821J5025J514l6264o211R832k6484L9145J9548K9233
14115D1332L7746L3340j0624m7886k4903j9863l4455m0547M2708K3829m600r637
14103a3560j4946j8951m1281k8679Q031M9948j951l3598j9515L4510M8724O9364
$$ y = [-13948, -77766, -95999, -78689, -63329, -61586, -47921, -78457, -58019, -69319, -81828, -48464, -24099, 349, -33532, -90108, -35942, -44343, -48002, -54442, -101332, -100008, -46910, -39728, -29589, -36901, 5448, 22814, 24807, 55070, 60645, 51721, 26010, -950, 420, 2622, 14255, -40209, -32422, -28163, -39469, -33845, -39154, 13715, 67433, 86946, 54739, 27185, -50398, -47094, -40871, -76171, -22701, -23881, -55787, -58871, -28850, -39779, -23448, 24444, 5620, -1947, -64641, -63580, -54215, -35827, -4006, 11019, 12533, -23731, -29942, -20110, -46594, -7449, 12099, 41332, 79078, 112418, 101794, 53908, 29005, 9142, -25313, -65860, -23152, 677, -3923, -13560, -28506, -47457, -88738, -117417, -109386, -59438, -61389, -94987, -114502, -79992, -31268, 38096]
14091C8096J0146l8300j8457M1460M5018K648K768k2269m3848m0296j7858m3183
14079h4075j4203L9376k0937M2853N0541L4984K8992o3606K355k0662k812K4677
14067A7483r391j5103j2350j86k6370o0075M0439O5508j2040JK609j3049L9301
14054A6777j5144o5275j2975j3154L2167k8275M4303P8840R028m4258l4046j8560
14042e0572k4704N3472O1357K6839p256n1511m2875J5921j9601J0062n4223l3212
14030a16303L470N7659J9393o142J2412j6231j8555J1733L0254j7467j5402k2999
14018g8178m26O6470O5599K4668m371J5720J3615L552K2172k8278J5831o5502
14006E0872j2488k983l6096k8183Q748M4058k4929k0396j6358Q800K0249N919
$$ y = [38096, 48242, 9942, -8515, 32945, 77963, 80611, 83379, 61110, 17262, -23034, -40892, -84075, -98278, -58902, -79839, -36986, 13555, 48539, 77531, 13925, 16280, -4382, -7194, 17483, 8092, -7011, -19361, -19547, -45917, -105992, -65553, -45, -12085, -12084, -9475, -22524, 16777, 1633, -63642, -76617, -89771, -57604, -85879, -41576, 37264, 46292, 2034, -32012, -50572, -75276, -21804, 39553, 66392, 59136, 7625, -35250, -19329, -38930, -28868, -83091, -116303, -112833, -55174, -35781, -41923, -29511, -45742, -64297, -52564, -22310, -39777, -55179, -78178, -78604, -12134, 53465, 78133, 73762, 89482, 103097, 106649, 128821, 100543, 116374, 50872, 38384, 35401, -695, -28878, -20130, 23928, -1001, -21397, -37755, -28955, -8706, -2787]
13994b787J3729K6744m6201R713M1810j9042J8506M2774J3991O1647j3348n0376
13982I7160n2091J7689Q7193J34919P4867Q9913L6630J39404J54742J29193K9955
13971I39574J096j1415l3042K4363l5295q4711j43408j51540j09115j29218j01659
13960A65630q2409J9996L1253K5888k5913l3188n090l979j8371k9356J3767P835
13948F6063R103J9557Q955M8768o236k7043m2462r850J8583M6022j9342n4440
13936E7678M8880N544K9704m3508p8777k4845K5431J2373L3817J7716l083M983
13924H5913l4879m058l7100j7800N149M269K9684J6013r757M648N564M1608K0004
13911A09258j7317k6756Q83O014K3892l617J1434o2212k5105N6544P0861m330
$$ y = [-2787, 10942, 37686, -8515, 1198, 43008, 23966, 42472, 85246, 99237, 160884, 147536, 97160, 45069, 62758, 149951, 284870, 359737, 449650, 486280, 625684, 780426, 909619, 939574, 940670, 929255, 896213, 920576, 885281, 800570, 657162, 505622, 396507, 267289, 165630, 83221, 103217, 134470, 160358, 134445, 101257, 96167, 92188, 73817, 44461, 58228, 66063, 75166, 94723, 103678, 152446, 146210, 119167, 76705, 66855, 85438, 131460, 112118, 57678, 106558, 112102, 141806, 98298, 19521, -5324, 20107, 32480, 66297, 84013, 80930, 85913, 51034, 46976, 9876, -7924, -2775, 1494, 31178, 47191, 37434, 42082, 47646, 89254, 109258, 91941, 65185, 66068, 72082, 95974, 92357, 103791, 41579, 16474, 73018, 143879, 139549]
13899A39549j4272J4931p1225p7984J6235k2639n1091P1612K9868L6358j6243
13888E5099k5389L515k1479l7180j2322J2915J2635q941N792P50J4552O8526O020
13875G4493m9321L2216j515l8607k913R185k7989j908m559L6689K2678k9444k4886
13862e881l1799j2275k3265k4802R348N5007P7300j7148k1696K9544j2132L003
13850B5204J6097j7861L640J9365l500l2483n3490K0110J8332O694R721k4068
13838a2239J2838k3729M465J2799N164j4828j8250J0569q215l7773r45M3718j8898
13825d5324k4738J0796m0169N399J345n8856M2772L690Q0281M6418L0866m9063
13813C417q2197K2918K7365k756j6801L4502N8827J1805n8455o1170j5807M0828
$$ y = [139549, 125277, 140208, 68983, -9001, 7234, -15405, -66496, 5116, 34984, 71342, 55099, 29710, 33225, 11746, -25434, -37756, -24841, -12206, -21147, -15355, -14605, -53, 68473, 74493, 25172, 57388, 55873, 17266, 14353, 23538, -4451, -6359, -10918, 25771, 48449, 19005, -5881, -37680, -49955, -73220, -98022, -88674, -33667, 43633, 26485, 4789, 34333, 22201, 25204, 41301, 23440, 27080, 46445, 42945, 10462, -43028, -22918, -4586, 2108, 11829, -12239, 599, -23130, -18665, -5866, -702, -15530, -33780, -23211, -31426, -69199, -70144, -26426, -45324, -70062, -59266, -99435, -94036, -92691, -151547, -108775, -105085, -24804, 21614, 52480, 3417, -78780, -55862, -28497, -31253, -48054, -13552, 45275, 57080, -1375, -62545, -78352, -37524]
13801c7524M1173O7729j871o5924L868M879k4223l7630k907K7675K5403l610p518
13788a0480l9227l6669K9324K8316O4015J9129j19236o6745Q051J2896O1670M4378
13776d578L0148L038k716j1491J001j7628k4791O20J5471k1383O110N2712O1344
13763H7857j6559n029n4182L561N3948J115n0621m0057m461M487K6994J7101j6016
13750H138j5858j2601P452o288j7013L5110M5675m1746j6621k919K9708l0981
13738a7944n431M5583K5534m0875R202K8982l7059L4422N5266o2072k5917M2067
13726E1758l1901o893J9579j683k0438K9944K1311j4284j0290p4224l654J3565
13714b7210M211M765N480r055L0749j8678m2957j7541m1137m0622K695N1522N5021
$$ y = [-37524, 3649, 71378, 69507, 3583, 7451, 12330, -11893, -49523, -52430, -24755, 648, -2962, -10480, -49707, -86376, -57052, -28736, 35279, 54408, -64828, -131573, -123522, -110626, -48956, -4578, 25570, 28608, 25892, 14401, 15402, -2226, -27017, -26397, -10926, -32309, -26199, 26513, 87857, 71298, 66269, 12087, 15648, 69596, 70711, 20090, -19967, -24428, -19941, 7053, 24154, 8138, -7720, -20321, -12869, -19157, -36170, -1060, 44615, 2869, -13752, -16671, 13037, -17944, -23375, 22208, 47742, 6867, 16069, 45051, 7992, 42414, 97680, 35608, 9691, 51758, 19857, 12964, 32543, 30860, 10422, 40366, 61677, 47393, 37103, -37121, -40775, -27210, -22999, -18234, -12754, -21809, 8940, -9738, -52695, -70236, -111373, -151995, -149300, -97778, -42757]
13701d2757K525k9606j4995L8703L4729N4651r754l3012K0110l1116q334k0703
13689c9559l6619m0105J7342L0088O5257j8465m1975K60k2796K8960j199K5325
13677c3486k520n8151j8784N1587m883j211P6590m5159o148K1447M6276J0696
13665C6254J0814m8574m9641K4786L3735n3139q554O2978K0183k6665j1349j8951
13653b8123M4550m0104m8863P1497L1147k4376K394k6663Q12l4361k3312k9730
13641a05132K4340j909J2511l051L180P21j6503M1957l6759K7921K8079J3511
13629a1134N1019j7363j5593J7015m8774k2300q717L680J01512M6535k2532l7513
13617C5835m1108l1845J0465Q413J1750m754J7616K151J4350j0796n0929P065
$$ y = [-42757, -40232, -69838, -84833, -46130, -11401, 43250, 33496, 484, 20594, -10522, -18856, -39559, -76178, -116283, -98941, -68853, -3596, -22061, -64036, -63776, -86572, -57612, -58811, -33486, -36006, -94157, -112941, -61354, -66237, -67448, 9142, -36017, -42165, -20718, 25558, 36254, 47068, -1506, -51147, -26361, 7374, -45765, -54319, 8659, 28842, 2177, -9172, -28123, 16427, -23677, -72540, -1043, 30104, 5728, 8122, -18541, -17729, -52090, -75402, -105132, -80792, -82701, -70190, -73241, -70061, -69340, -85843, -43886, -80645, -52724, -24645, -11134, 39885, 22522, 6929, 23944, -24830, -47130, -55847, -52167, 49345, 95880, 73348, 35835, -5273, -37118, -26653, -18240, -6490, -11244, 6372, 8523, 22873, 12077, -38852, -31787]
13605c1787l5177K1730N0906J8185j9216J6296K9976j9869K0555p344l3608K6843
13593C7490N7347m673J8631m6075l4264J0261o532k2495k710K3261k435K289K3863
13580E3958J5921J6288l971j3498k3223M88m120l341k1074R01l7383l486N0492
13567B7952j0641p020k599J2022j7501K1839m516k8920k4421L984r59J7670M5806
13554C2696J0998k024l1540J1792R715J4657j1036l5184p966O5417n5496n1296
13542d9267j2755N039L7074P7069l0887p1491n0886j3015O1909K8300K1861J0124
13530A3075m1309p9246j3937N8391N6484J3933L16M6392N5272p5526r7640M4610
13518a9185Q947P671r1899o0524L9403J1280O856l362r103K3778J1378O7822k911
$$ y = [-31787, -66964, -45234, 5672, 23857, 4641, 20937, 50913, 31044, 51599, 44255, 10647, 37490, 94837, 90164, 108795, 62720, 28456, 38717, 32185, 9690, 6980, 30241, 27806, 30095, 53958, 69879, 86167, 82196, 68698, 45475, 45963, 41843, 38502, 17428, 18329, -19054, -22540, 27952, 17311, 10291, 7692, 19714, 2213, 24052, 19536, -9384, -33805, -29821, -30780, -13110, 32696, 43694, 41670, 10130, 21922, 31637, 46294, 35258, 74, -7892, 57525, 2029, -49267, -62022, -56983, -19909, 57160, 26273, -45218, -96104, -109119, -47210, -18910, 2951, 13075, -28234, -107480, -121417, -63026, -6542, 7391, 7707, 54099, 109371, 33845, -63795, -19185, -10238, -2567, -94466, -154990, -115587, -104307, -97451, -100813, -109916, -86138, -74760, -6938, -9849]
13505i849o7311n2620o305K7298Q2302L9346o3781m1990J07196N3526o0379m9582
13493d2149l7081K5095P478l7707k5615J8479q837J1182Q7655k6349p8613n6286
13481a62748J5415N0571P198j2604m4941L5321P3379M9718N0727l786n1720m3745
13469c7215J8051m971j3536K6605K6604k2114M1488l6640n1545j7685M2775n3699
13457h1882m9665l0112m583N6177N5812N6124L1611K478M563l2253l8918Q871
13445b1777Q068j5038n5845l1325L8424r686q877J375l7343M0603P9623N9878
13433D8080m139k1089l5226l3312L35l6391P852J0261M2681n846m4149l94N6020
13420a5317M826J9969K4798m8086j2146l1246m964P469J728P066M4752J6642K3494
$$ y = [-9849, -77160, -129780, -136085, -108787, -26485, 12861, -50920, -92910, 14286, 67812, 7433, -42149, -79230, -54135, -46657, -84364, -109979, -91500, -100337, -89155, -1500, -27849, -106462, -162748, -147333, -96762, -89564, -102168, -147109, -111788, -38409, 11309, 62036, 58250, 6530, -37215, -19164, -24135, -37671, -11066, 15538, -6576, 34912, -1728, -53273, -70958, -28183, -81882, -131547, -161659, -166242, -110065, -54253, 1871, 33482, 35960, 40523, 8270, -30648, -21777, -13709, -28747, -84592, -115917, -77493, -87179, -96056, -94681, -132024, -91421, -11798, 48080, 43941, 22852, -12374, -45686, -45351, -81742, -73890, -63629, -20948, -26794, -70943, -71337, -15317, -10491, 9478, 34276, -13810, -25956, -57202, -62166, -54697, -52969, -45903, -1151, 15491, 38985]
13407C8985n3654O38J3404J0833m2465k2296O3961L3816j3144n4713l0107l0031
13395h4773j3385L8934J657M0520P8640L0574l2709j6264R86k8389j9205L7189
13383C3775K2843Q451P131l4164N4782q187j661J6455m7829p711k4916J0080m1287
13370a2238j0448L3988M9912K6849k7013K6004J6674q479K0941l3247o0707k0658
13358A578j4080r400O6510M003j4786L7546Q426l7939l4763n521J6329n687O662
13345A8878j4520q678m2424P0846K9261j8524l1227K7845L0197N2405K1247k0704
13333A14602j841N0189j3624k5691n1367o4386L1746l423J5792J222J63M6638
13321A00020N2384K2687k4071o5145o123m0095l4135K2423K4072L6637o293k0127
$$ y = [38985, -14669, -14031, -627, 10206, -32259, -54555, 9406, 43222, 30078, -24635, -54742, -84773, -98158, -59224, -57567, -17047, 61593, 92167, 59458, 43194, 44180, 15791, -3414, 33775, 56618, 65069, 72200, 38036, 92818, 84631, 82970, 99425, 51596, 43885, 18969, 29049, -12238, -22686, 11302, 61214, 88063, 61050, 87054, 103728, 95249, 116190, 82943, 22236, 1578, -12502, -21902, 44608, 48611, 33825, 71371, 79797, 41858, 7095, 1574, 17903, 12216, 18878, 4358, -4320, -46744, 24102, 53363, 34839, 3612, 31457, 61654, 114059, 135306, 114602, 112761, 162950, 149326, 123635, 72268, 7882, 39628, 36205, 51997, 53219, 53382, 100020, 152404, 175091, 151020, 85875, 79752, 39657, 5522, 27945, 52017, 88654, 82361, 62234]
13309F2234J669J7232o294n4222N1989N0728P716L2168J304n3470o1739l2510
13297A6805J695O87j5393j5291K3527N2050Q5920J7261j7086K4829p5679j2890
13285H6435R870q485q322O0496o3179q8203m5722L5748N0148K9694K3418N9266
13273A41164l7043k7550J537K0702J2429n0556m4018J8780l5131k7616p55j5351
13261d3408P5851R2870l2980m7490k2475M8712J3460j330k9011o1193O7336K4958
13249H5300m3001j4749J8680j1663K4727N665m4512m135J4691L961j094m0968
13237g098K8328R98P517k4667n0759n991J1203l687r293M984Q5301O6489O1315
13224A64640o0555p1270L9197M8443m9027m6815j3258P1401N7081Q146j2096n7814
$$ y = [62234, 63903, 81135, 74841, 20619, 72608, 123336, 131052, 163220, 164524, 111054, 49315, 16805, 18500, 19187, 3794, -11497, 12030, 64080, 150000, 167261, 150175, 175004, 99325, 86435, 96305, 87820, 79498, 139994, 76815, -11388, -57110, -21362, 28786, 58480, 81898, 141164, 104121, 76571, 78108, 98810, 111239, 60683, 16665, 35445, 314, -27302, -28057, -43408, 32443, 125313, 92333, 44843, 22368, 71080, 84540, 83210, 54199, -6994, 60342, 85300, 42299, 27550, 46230, 34567, 59294, 64959, 20447, 16312, 31003, 34964, 33870, -7098, 21230, 22228, 29745, 5078, -45681, -51672, -40469, -44156, -53449, -48465, 36836, 103325, 164640, 104085, 32815, 72012, 120455, 71428, 24613, 11355, 82756, 139837, 147983, 135887, 78073]
13212G8073p7904m2174J0514j1319l8385K56K9689k4350k3069K8158O3869K8699
13200B2057j2543n3729l2582K6404K0942k7460l6355L7946P394J8308J7830K6510
13188A4722K4455l0389N3863M5097l8288l6347k0109j0861k370l1348J9028N4545
13176D1998K3107K1813o3328o2751K7628N7098N9897l0045j3863r367l3199l4882
13164a5894L5124j1224J378J6185l095m3008n0084q053R3603k0320j0720L1883
13152A5775J6540r265N457N7250O177m8435o0036k5974l9585J9005L8352M9117
13140B4378j1606m7469P244L5181m2980l9745k2664L9170M2697l00J5841L0115
13128B9862j7795J4497O569L4468m0184l0540K9146k6328r7338J7366N8427K8537
$$ y = [78073, 169, -42005, -31491, -42810, -81195, -80939, -51250, -75600, -98669, -70511, -6642, 22057, 9514, -44215, -76797, -50393, -29451, -56911, -93266, -55320, -47926, -29618, -11788, 14722, 39177, 8788, 62651, 107748, 69460, 33113, 13004, 2143, -227, -31575, -12547, 41998, 65105, 86918, 23590, -39161, -11533, 45565, 105462, 75417, 61554, 52187, 18988, -15894, 19230, 8006, 9384, 25569, 22474, -20534, -70618, -78671, 14932, -5388, -16108, 15775, 32315, 23050, 28507, 85757, 91934, 43499, -16537, -42511, -82096, -63091, -24739, 24378, 12772, -34697, -27453, 7728, -35252, -74997, -97661, -58491, -15794, -16094, -253, 29862, 12067, 26564, 33133, 67601, 27417, -3123, 26023, -305, -97643, -80277, -21850, 6687]
13116F687m4242J7623K20j9730M4227M4811k6265n351j7228j7649l2376j6733
13104f6006o84N66M6314N0057J4422l5567k7808L1436l320n323p501J5260k5503
13091a3657l2664j0357K9292o006j6503k6436J9439L6952l2793J3376P9497L4650
13079G4790l9689l777j769k7632k8840p611j4580M959K2065p548L472N0932J8117
13066D2889l4970l2154L9212J9094l5691J351k9922l6889L1483J0118m1153J7840
13054d8792N8245Q4079J115k4144K7433P404n074o2684m4616o90K6792L6656k1889
13041C3835j1813J934J8926k3828o972L9436j9800m2952m6224l0683L3202l242
13029e8181N6474k0834k4553K1478Q6625M112l1961k229p890j6700o2904m5386
$$ y = [6687, -37555, -19932, -19712, -39442, 4785, 49596, 23331, 17980, 752, -16897, -49273, -66006, -66690, -66124, -19810, 30247, 44669, 9102, -18706, 12730, 9410, 4087, -3414, 11846, -13657, -46321, -56678, -27386, -33392, -49895, -76331, -56892, -19940, -52733, -39357, 40140, 74790, 35101, 31324, 29555, 1923, -26917, -34528, -49108, -44149, -22084, -29632, -26160, 24772, 42889, 7919, -24235, 14977, 34071, -1620, -269, -30191, -67080, -35597, -25479, -66632, -48792, 9453, 93532, 94647, 70503, 97936, 105340, 100266, 37582, -7034, -7724, 19068, 55724, 33835, 22022, 23956, 42882, 19054, 12082, 51518, 31718, -11234, -57458, -88141, -54939, -58181, -1707, -22541, -47094, -25616, 61009, 65121, 33160, 30931, 23041, 6341, -56563, -101949]
13017a01949M9615K155K0007j1465M6146N1535j5143k8800L875J2443j8583j4554
13005d718j0166k1586j4290Q1J3756J535m0022k3923k516l087M0839p939M9708
12992b2328L3063O911j0965n1574l5753k7313N3275K743L196O2294n856k1231
12980a3538M2456k142n7032K0942O4912j1341J3149J0938j4118K0837O0003J0505
12968A45571k9186p7136q1943J661m4372j3323K619K1917L2607k7036j0989M4605
12956c5005K6223M0710L0015N682L2995J6634p930j9890l1380p9204M4093L7790
12944F0733Q557l403k7945m8087J0067P057J3038M2968R740l3890k3751M0591
12932E5675K3097l2890n6143Q940J7821K4485K5978q072l9540L6959k7374k8411
$$ y = [-101949, -52334, -50179, -30172, -41637, 4509, 56044, 40901, 12101, 15976, 28419, 9836, -4718, -14884, -36470, -50760, -50679, -36923, -35388, -75410, -99333, -101849, -104936, -64097, -72036, -22328, 10735, 17646, 6681, -44893, -80646, -107959, -54684, -51941, -48745, 13549, 7693, -13538, 28918, 26776, -30256, -9314, 55598, 44257, 57406, 68344, 54226, 75063, 135066, 145571, 116385, 39249, -42694, -41033, -85405, -98728, -96109, -74192, -41585, -68621, -79610, -35005, -8782, 31928, 61943, 67625, 100620, 117254, 109324, 89434, 58054, -21150, 22943, 60733, 69290, 65887, 37942, -10145, -78, 6979, 20017, 62985, 72725, 38835, 15084, 55675, 78772, 45882, -10261, -1321, 16500, 40985, 66963, 58891, 19351, 56310, 28936, 525]
12920E25P890L7055j0050o808k3163P9894L6527k4837J9923J7258m9026m8148
12908C7040k7667m6927o34K5051K6374k8768M2450J3427Q319l272m7662n6598
12896e8867M6950K8133J9456K555k8842J5782J3427k7879J8195J6640l5317L4233
12884D4466J4491k3145M5474R169J2202o802j6898Q851q826l693R390J6327M6109
12871A47115P5572P9663K3168L1775J07294J14340O1551Q5959K12413K57713K38989
12860A435552K58555K98758K47396P8237P0548M9985k5400p7470j38077k34563
12850A963521k17729k39784k73491k46912j69305j28469r6914r8945j05891Q061
12840C94142J86J7834l496l6744L202n2423k0027o269l6225n6797l9714J7868
$$ y = [525, 8415, 45470, 35420, 28612, 5449, 85343, 121870, 97033, 116956, 134214, 85188, 37040, 9373, -37554, -38188, -13137, 13237, -15531, 26919, 40346, 48665, 45393, -2269, -58867, -11917, 16216, 35672, 38227, 9385, 25167, 38594, 10715, 28910, 45550, 10233, 44466, 58957, 35812, 81286, 90455, 102657, 95855, 78957, 87808, 78982, 75289, 84679, 101006, 147115, 222687, 302350, 325518, 357293, 464587, 578927, 640478, 726437, 938850, 1196563, 1435552, 1694107, 1992865, 2240261, 2318498, 2389046, 2439031, 2413631, 2336161, 2198084, 1963521, 1745792, 1506008, 1232517, 985605, 816300, 687831, 590917, 491972, 386081, 394142, 394328, 412162, 408666, 371922, 375124, 322701, 302674, 296405, 260180, 203383, 163669, 181537]
12828A81537K6033J2836j8129j2683j4793N6664J468j4202K2517o049m6827M2949
12816B31321k0392L8951j9480m5727l08K2363P0841J8914j37014m7182L5765K1230
12804A69282j9101K0097p0954m6807j0882L9662j0271L3687N7728j8947j2689
12793A30805K1310k1899l8212j3596Q685j5587n3950R499N0208J0727k1790L2315
12781I8515R8511j7952j09555L8499M0022M7191n8531o7122K4118K4849K6845
12770A45390k5984l2154l8468r68M9843J4149j3501N9746L655p545K6668p1409
12758A09422k2351N4319L7264L8292j6477p2090o0663k1745k9186l5400j8314
12747c6929O5705R7025j2201M1059K0812o8125k1716L564k2785p4418j8062L1425
$$ y = [181537, 207570, 220406, 202277, 189594, 174801, 231465, 232933, 218731, 241248, 235199, 188372, 231321, 210929, 249880, 230400, 184673, 184365, 206728, 277569, 296483, 159469, 112287, 148052, 169282, 150181, 170278, 99324, 52517, 41635, 81297, 71026, 104713, 162441, 143494, 130805, 152115, 130216, 92004, 78408, 87093, 71506, 17556, 27055, 77263, 87990, 66200, 98515, 197026, 179074, 69519, 108018, 148040, 195231, 136700, 69578, 93696, 118545, 145390, 119406, 87252, 48784, 47816, 97659, 111808, 98307, 158053, 161708, 154163, 180831, 109422, 87071, 141390, 178654, 216946, 200469, 128379, 67716, 45971, 16785, -18615, -36929, 28776, 125801, 113600, 154659, 175471, 107346, 85630, 89194, 66409, -8009, -26071, 5354]
12735E354k4626K3476k269O7164N4764J5385l7126o4416p3779K8376r2L7575J7452
12722D7238j1977M3975P7337k194o3332m0090j8571P5435M870n6011O633O9710
12710A33023N6173l7925m4992M4726J2325k2641j4610M8465k061j0495M8963L6114
12698B47065Q9512J11400P4974l8139l2166K0744L6054l4171p0772m6691O280
12687C64090m7817m6830m905N364k4579k0661J3730m5232q593J0069M912l5467
12675A64081l510j0500k5311j6984m0325j2217O8226K7632K6321M692l004m0038
12663A39063j7160L7630L0232L287L4194N3159K96m8964l9706m4951l2424K5200
12651A39856N7475L6064q3930j6034j2935O3545L2130J694l0967J9119m172K0802
$$ y = [5354, -19272, 4204, 1935, 69099, 123863, 139248, 102122, 37706, -36073, -7697, -7789, 29786, 47238, 35261, 79236, 156573, 154379, 91047, 50957, 32386, 107821, 112691, 56680, 63313, 133023, 189196, 151271, 106279, 151005, 163330, 140689, 126079, 174544, 172483, 161988, 210951, 247065, 336577, 447977, 522951, 484812, 452646, 473390, 509444, 475273, 404501, 357810, 364090, 316273, 269443, 264538, 269902, 245323, 224662, 238392, 193160, 184567, 194636, 199548, 164081, 160571, 150071, 124760, 107776, 67451, 55234, 123460, 151092, 177413, 182105, 179101, 139063, 121903, 159533, 189765, 193052, 227246, 280405, 280701, 231737, 192031, 147080, 114656, 139856, 197331, 233395, 149465, 133431, 120496, 184041, 216171, 217865, 186898, 206017, 201845, 222647]
12639B22647j1268L5983P2389K5377L00l4153q9435m5556L4200j4500j061m1268
12627A53655K9598J8656L7771J4071K064L2044J315L512J1226L1368J8101j4411
12615C38970O751n5689n3241j0620L9521m89k2387k6859j8185l1165l5298L390
12603A34699O3481K6135M1867K7698M0242J2946N5029N5060j5018J2036K1136
12592D75311L3277j486m2522o857L3558j5348m4663J4242J5173M379j2645k8093
12580D24326k9534L5117Q4573J02818J3379q971N8787N9139J11686R4751Q1273
12569A027344M0984K5807Q6471j0626N2491J6612J4396R246o6785r7563l9746
12558A058631n1245k8233k457J0228j1789N6143K2248l092J0460K6511j1033k1319
$$ y = [222647, 211379, 247362, 319751, 345128, 345428, 311275, 221840, 176284, 210484, 195984, 194923, 153655, 183253, 201909, 239680, 253751, 255815, 287859, 289174, 292686, 303912, 335280, 353381, 338970, 345721, 290032, 236791, 226171, 265692, 265203, 242816, 215957, 197772, 166607, 131309, 134699, 198180, 224315, 266182, 293880, 334122, 347068, 402097, 457157, 442139, 454175, 475311, 508588, 507102, 464580, 457723, 491281, 475933, 431270, 445512, 460685, 465064, 452419, 424326, 394792, 429909, 514482, 617300, 630679, 621708, 680495, 739634, 851320, 946071, 1027344, 1068328, 1094135, 1180606, 1169980, 1222471, 1239083, 1253479, 1262725, 1195940, 1098377, 1058631, 1007386, 979153, 976696, 986924, 975135, 1031278, 1053526, 1050434, 1060894, 1087405, 1076372, 1055053]
12546A055053o432N5827m2759j00407p0717M6433M1000k9240m0886O163j2645
12535I01390l7114m6957P197Q01Q586K2495J2033L4297J788j2616j086Q1500L2312
12522A004626K3216j5062k0075j6804P06O878n1313p8890J570J10043R7987J9792
12510A082674N4538R4476L7033K745K5566L5795N7286J14598Q1871L939m1296
12499A549225N770J0026K936R3440L9224M0829l4095J1528l5600O6980J45858
12488A896121J7359L5934R8708J05497Q4801J08219P4833Q6274R3706J44353K10041
12477B955846K17150K33597K22365K44000L13299L11791M13625M69263N30977
12468E911913O21718O27449O92592Q41542R97294J296212J579838J895294K193017
$$ y = [1055053, 1048621, 1104448, 1061689, 961282, 890565, 936998, 977998, 948758, 907872, 914035, 901390, 864276, 817319, 824516, 825317, 833903, 856398, 868431, 902728, 904516, 891900, 890814, 972314, 1004626, 1027842, 1012780, 992705, 975901, 976607, 983485, 932172, 853282, 854852, 964895, 1062882, 1082674, 1137212, 1231688, 1268721, 1271466, 1297032, 1332827, 1390113, 1504711, 1586582, 1590521, 1549225, 1554995, 1565021, 1567957, 1661397, 1700621, 1741450, 1707355, 1718883, 1683283, 1750263, 1896121, 1913480, 1949414, 2048122, 2153619, 2238420, 2346639, 2421472, 2507746, 2601452, 2745805, 2955846, 3172996, 3406593, 3628958, 3872958, 4186257, 4498048, 4911673, 5380936, 5911913, 6533631, 7161080, 7853672, 8695214, 9692508, 10988720, 12568558, 14463852, 16656869]
12459A6656869K491155K863286L281446L778447M254385N010730O141026P924337
12451E2401681J0856446J5186904K0736732K7056044L3543089L9730919M4799236
12444B44311051M7546231M6441616M0799258L2226173K1084046P223714p812833
12437D31819256k1109770l1612660l9579072m4151300m4630430m1026207l5358254
12430A74351563k9361457k3449953j7324683j2199892q734221o622723n412438
12423G1246196m709944m275627m006529l796769l575419l280348k993254k773855
12415D1834451k531036k193937j908040j675809j447983j269970j181405j056508
12407B8569763j022196r31520q48118p95405p57923p99050q06358q05471q35403
$$ y = [16656869, 19148024, 22011310, 25292756, 29071203, 33325588, 38336318, 44477344, 52401681, 63258127, 78445031, 99181763, 126237807, 159780896, 199511815, 244311051, 291857282, 338298898, 379098156, 411324329, 432408375, 439632089, 431819256, 410709486, 379096826, 339517754, 295366454, 250736024, 209709817, 174351563, 144990106, 121540153, 104215470, 92015578, 83281357, 76658634, 71246196, 66536252, 62260625, 58254096, 54457327, 50881908, 47601560, 44608306, 41834451, 39303415, 37109478, 35201438, 33525629, 32077646, 30807676, 29626271, 28569763, 27547567, 26616047, 25767929, 24972524, 24214601, 23415551, 22609193, 21803722, 20968319]
12398B0968319p16440o86056p04741o78484o56116o26946n65219o28810n96640
12389A5108867n83336n10512n22864n77789n03798l54125l64198l92745l62718
12380A0936782l26149l79890l35087k81408k78119k39400k53806k70684k30369
12371H341870k09566k43506j62987k24589j73881j80117j48425j68341j27081
12362F703377j40396j80995k04770j24017j33432j82832j25576j06802o6297j01216
12352E337044j49223j12154j07269n3111m1385n7401j47648j93588j31869j07768
12342D235628j37952j55977j52560j41137r7243j08329l9727K515q0699n2992
12332C271527n7129j17450j19707p1740l4865p4310l9619l2401o3216j41408J0984
$$ y = [20968319, 20251879, 19565823, 18861082, 18182598, 17526482, 16899536, 16334317, 15705507, 15108867, 14525531, 14015019, 13492155, 12914366, 12410568, 12056443, 11692245, 11299500, 10936782, 10610633, 10230743, 9895656, 9614248, 9336129, 9096729, 8842923, 8572239, 8341870, 8132304, 7888798, 7725811, 7501222, 7327341, 7147224, 6998799, 6830458, 6703377, 6562981, 6381986, 6177216, 6053199, 5919767, 5736935, 5611359, 5504557, 5438260, 5337044, 5187821, 5075667, 4968398, 4915287, 4873902, 4816501, 4668853, 4475265, 4343396, 4235628, 4097676, 3941699, 3789139, 3648002, 3550759, 3442430, 3402703, 3405218, 3324519, 3271527, 3214398, 3096948, 2977241, 2905501, 2870636, 2796326, 2756707, 2724306, 2661090, 2519682, 2530666]
12321B530666n682o7597j81212p1211j4381J7613L2460L8810J63775K01352J77241
12310B821834J71869K65920K36518J14036n9400r4358j92834k13936k50740k65468
12300B533441k86126k86443k54789j90937j28635n1514n6925j33515j26511j23175
12290H94871l9370q410P589J2601o5054j0827m4308j8209l1680K87K9431M1559
12278G68480j675n767K1582N3317L8065m5704j4548J7624k5765m550m6695j59
12266G54205J4781j0405j0758k8863m4454l2083n1368N227n2912k5291l4131n893
12254D78055J2467j621J0678k440k0272n4643J0613p128j5892J5868k4448J27
12242D01364r989k9146l9911J6523Q5200Q8125k3178k8054p4987j5641K5206L7465
$$ y = [2530666, 2524984, 2457387, 2276175, 2204964, 2190583, 2208196, 2240656, 2279466, 2443241, 2644593, 2821834, 2993703, 3259623, 3496141, 3610177, 3550777, 3456419, 3263585, 3049649, 2798909, 2533441, 2247315, 1960872, 1706083, 1515146, 1386511, 1334997, 1278072, 1144557, 1018046, 894871, 855501, 847091, 854680, 867281, 802227, 791400, 747092, 728883, 697203, 697490, 726921, 768480, 766805, 761038, 782620, 835937, 874002, 828298, 813750, 831374, 805609, 801059, 754364, 754205, 768986, 758581, 747823, 718960, 674506, 642423, 591055, 596282, 543370, 518079, 483948, 478055, 490522, 488901, 499579, 497139, 476867, 422224, 432837, 425709, 409817, 425685, 401237, 401364, 391375, 362229, 322318, 338841, 424041, 512166, 488988, 460934, 385947, 370306, 395512, 432977]
12230D32977k3464K4988N79o120j2780m3714p291R687J1399J1305J8282N9065
12218D74913N0058k5948n8876j7180Q180k8532j5509L3559l7792q789k8996K1613
12206C66701O5824P648n546l4259m8260J0762j6857L9672K7168J7264l3083l3998
12194C63036k0550n2425J4087j3600r348K5484j7692J1629M6916l706m2485l4686
12182B66660L8475L5842N071M1868J3658O980l1383k3047L7656O297P050K9594
12170D34721j764n8532k7153R836k9783o2985l0151K5501j465j9150N10N9962
12158B99547K6028J9462n9200O220j3073k2779J4875J4996L86j7469k9160R135
12146B48968J9005k3698O6955P5097k1795l3198L066L8644M9654P1555N5796M7551
$$ y = [432977, 409513, 434501, 435080, 428960, 416180, 372466, 365175, 374862, 386261, 397566, 415848, 474913, 524971, 499023, 440147, 422967, 431147, 402615, 387106, 420665, 382873, 374084, 345088, 366701, 432525, 440173, 434627, 400368, 352108, 362870, 346013, 385685, 412853, 430117, 397034, 363036, 342486, 290061, 304148, 290548, 281200, 306684, 288992, 300621, 347537, 343831, 301346, 266660, 305135, 340977, 346048, 387916, 401574, 408554, 377171, 354124, 391780, 398077, 405127, 434721, 432957, 374425, 347272, 357108, 327325, 264340, 234189, 259690, 258225, 239075, 239585, 299547, 325575, 345037, 285837, 292057, 278984, 256205, 271080, 286076, 286462, 268993, 239833, 248968, 267973, 244275, 311230, 386327, 364532, 331334, 334400, 373044, 422698, 494253, 550049, 597600]
12134E97600L6486J2158K4098j9180J0973m8342j4984L3337m933n5879j02531
12123D68803j26076m4353j6565L1153N023m1956M0747M259N0299K9901n0328p825
12111C43082J059j989k8707P948p673l227n8449r643K0810j3304N2972k2539q236
12098B72104M8876L6320m0179L8856O06n35j3787n50j3326k4316K4390j1157j5002
12085C02300j925l6607k1633j6062k9789K3102p736j1825M2981N446p629N1088
12073B91711n4095J7325k5453N8805J148P702k8966j9637n4028k5938N9661K8368
12061B56603O964M8482L3095r069j0559r4036n3197L4511L1559N623l3313J091
12049B17754j6487M7039L4063j1017n2583k0631N7234K6610O7255L3315m784J974
$$ y = [597600, 634086, 646244, 670342, 651162, 662135, 613793, 598809, 632146, 627213, 571334, 468803, 342727, 298374, 281809, 312962, 317985, 276029, 316776, 321035, 371334, 401235, 350907, 343082, 344141, 342152, 313445, 321393, 313720, 310493, 252044, 242401, 263211, 249907, 302879, 280340, 272104, 320980, 357300, 317121, 355977, 356583, 356048, 342261, 341711, 328385, 304069, 328459, 317302, 302300, 300375, 263768, 242135, 226073, 196284, 219386, 211650, 199825, 242806, 248252, 240623, 291711, 237616, 254941, 229488, 288293, 289441, 297143, 268177, 248540, 194512, 168574, 228235, 256603, 263567, 312049, 345144, 336075, 325516, 231480, 178283, 212794, 244353, 249976, 216663, 217754, 201267, 248306, 282369, 271352, 218769, 198138, 255372, 281982, 349237, 382552, 377768, 379742]
12037C79742O1240L2695M8773M6259J9193M7243M4656L8721R8673J09497J46636
12026A073328R0701J09711J62547K34829K52895K72056K07981J74361R5976M7435
12016B721820r577j07157j22816k39971k59853k80967k17606k13044j99874j24669
12006I46286q1409p1144l5255m177K6359k5769r0117j1320k7150m465l4787o0142
11994E26910j26193l4300J6273N0565L0736n1589k9018L1757J0121n2678j0473
11983C62111J9034L3498N9938j3934l1210o728J8333p478O642q50n6190l5074
11971C48092l3172L7950J8583l0379p828k7425o3909n39l1898k8049j7031k3317
11959A41078J0119k2820M0172L33l5749R99p245K0255J9298k7582l4740R01L2614
$$ y = [379742, 440982, 473677, 522450, 568709, 587902, 635145, 679801, 718522, 817195, 926692, 1073328, 1164029, 1273740, 1436287, 1671116, 1924011, 2196067, 2404048, 2578409, 2674385, 2721820, 2712243, 2605086, 2482270, 2242299, 1982446, 1701479, 1483873, 1270829, 1070955, 946286, 864877, 793733, 758478, 754301, 780660, 754891, 664774, 653454, 626304, 621839, 587052, 526910, 400717, 366417, 382690, 433255, 463991, 412402, 383384, 415141, 425262, 372584, 362111, 381145, 414643, 474581, 460647, 429437, 422709, 441042, 433564, 440206, 439356, 383166, 348092, 314920, 352870, 371453, 341074, 333246, 305821, 241912, 241373, 209475, 181426, 164395, 141078, 151197, 128377, 168549, 168882, 133133, 134132, 126887, 147142, 166440, 138858, 104118, 105019, 137633]
11946A37633P8276n7547j4271j7204J4416J0166L7522o4976K2088j9913m0821
11935H5369k9649L1217K4703k6480n2991j6976J6650j1490l8334N8399L2687J9624
11923I2729K7098l26n521J8017K4815n7329l8059J4285r582K9705K5632k730k4182
11910I4552l2614o9560J3606O5089J9451J5611J6664j05745k4181k161Q3579J01241
11898A75532J7409o1179p2833k1699L9212N863P300J6870K2285R327l9697m3945
11886E4445J1908P4300K498j7503n2463n8773j0957L9428K0589m441m893K5361
11874G9499p386j0249p527j6416l1144j5965M5747k8089n3399R362O2803P6443
11862A03679n2658n9669K7384O5485j1654n3040o8471q536P0871L5286k5007m4006
$$ y = [137633, 215909, 158362, 144091, 126887, 141303, 151469, 188991, 124015, 146103, 126190, 85369, 55720, 86937, 111640, 85160, 32169, 15193, 31843, 20353, -17981, 40418, 73105, 92729, 119827, 119501, 113980, 131997, 156812, 99483, 61424, 75709, 66127, 95832, 121464, 118734, 94552, 61938, -7622, 5984, 71073, 90524, 106135, 122799, 17054, -7127, -9288, 74291, 175532, 192941, 131762, 58929, 37230, 76442, 82305, 89605, 106475, 128760, 138087, 98390, 54445, 66353, 140653, 143151, 125648, 73185, 14412, 3455, 42883, 63472, 59031, 54138, 79499, 72113, 61864, 54337, 37921, 6777, -9188, 36559, 8470, -44929, -35567, 27236, 103679, 51021, -8648, 18736, 84221, 72567, 19527, -48944, -57480, 13391, 48677, 23670, -20336]
11850b0336k4707L8914N052k039K6065M2860M0726N4121k7900n7494j5668J1465
11838G1059n0960j267K7052j6033j1195Q01j3422j7776l9425q118K1083M4727
11826F526M3363o7574o1231j0886J9339L3358K4069l700p413k3861J7774K6137
11814d099M2632K6641j06964n8760L8905K0790O624J1720L2192M0824k9142m2138
11802b0775M6624J1461p842K08m2807l1681k9117P1583J6832j0635L8409J6333
11790E8593o729n2593K888J7199o598j6063k0648L653L2445M7410J4891j6570
11778E7878j8210P137o5578N4143K1897K6024K4499k7161m3532J2509K7450l8211
11766C8845j8466L7450o3241j1047N4371m227j0316m131m5413M567N3859j0435
$$ y = [-20336, -45043, -6129, -1077, -3116, 22949, 65809, 106535, 160656, 132756, 75262, 59594, 71059, 20099, 18832, 45884, 29851, 18656, 19457, 6035, -11741, -51166, -59284, -38201, 6526, 49889, -17685, -78916, -89802, -70463, -37105, -13036, -16736, -24149, -48010, -30236, -4099, 38533, 65174, -41790, -100550, -61645, -40855, -34231, -22511, 9681, 50505, 21363, -20775, 25849, 37310, 29468, 29676, -13131, -44812, -73929, -2346, 14486, 3851, 42260, 58593, 51864, -729, 2159, 19358, 12760, -3303, -23951, -20298, 12147, 59557, 74448, 57878, 39668, 46805, -18773, 35370, 57267, 83291, 107790, 80629, 37097, 49606, 77056, 38845, 20379, 57829, -5412, -16459, 37912, 33685, 23369, 19238, -26175, -21608, 32251, 21816]
11754B1816l2999p4370L8373J0116M6801J6113m6090N1101k4697n4045r996K470
11742e5407M4010L6779j06159K4880Q2162j4218n8364j9385M3861L0578j4585
11731e848k2815P0956O9464j3185q3915l7167N7119M0284M1343M6480m5977r1233
11719B5506Q150Q0261k7337k5903n3037n72M3773J3947L1952K7555k4319m259
11707I5717j6677j3258P867J7832R123J51j2074o2228l4047M703K3140k0954K7448
11694B6743K2832j4261k4604j4658J4785n0049n4486J0378R4297J8379l6305J8857
11682A1908M1499L486J5305l5623m833L085J9279k691l627o5781L0768L6140m6765
11669B150k6080K1486R3796N4052K1027n4488l260J4762l1749m2089j3758L2461
$$ y = [21816, -11183, -85553, -47180, -37064, 9737, 25850, -20240, 30861, 6164, -47881, -57877, -55407, -11397, 25382, -80777, -55897, 26265, 12047, -46317, -65702, -21841, 8737, -5848, -28663, 42293, 111757, 98572, 14657, -22510, 34609, 74893, 116236, 162716, 116739, 25506, 33656, 113917, 86580, 60677, 7640, 7068, 50841, 64788, 96740, 124295, 99976, 95717, 79040, 65782, 73649, 91481, 100604, 100755, 88681, 26453, -7594, -2891, 20249, -705, 26743, 49575, 35314, 10710, -3948, 10837, -39212, -93698, -83320, 10977, 29356, -6949, 11908, 53407, 56893, 72198, 36575, 31742, 34827, 54106, 51415, 47788, -17993, 12775, 48915, 2150, -23930, -2444, 91352, 145404, 166431, 111943, 108683, 123445, 91696, 49607, 35849, 68310]
11657F8310k2979n1619k0245K7852M2140K330M488Q991M0046J0686k0492j3256
11645G6252j8617j6846k7741q388j7781j817r757l1736Q5502K2571N6695K3413
11633A31750n9343o9553J2572j3105L2622R5891j2554k8560J317k7048o1921j8864
11621a6796Q5286K1389k886j1401j7284n6998l594O442N1830J8877N675M1409
11609A21949K6913l2558L8753J5923j06017l6424m1250P097J0779o584l0508M0776
11597H849R298L0861n88j2569J0174o56m5634k9925N1775L5458M1168n323l5965
11584E6923p754L9809L6074m3278k0723K6N805j7196J7206l5662l3693J2525N0153
11571F0215q427O06j4473l5047L0433l8656M2754P5580J1960l6770Q53n2128j3018
$$ y = [68310, 45331, -6288, -26533, 1319, 43459, 45789, 50277, 59268, 99314, 110000, 89508, 76252, 57635, 40789, 13048, 4660, -13121, -14938, -24695, -56431, 29071, 51642, 108337, 131750, 72407, 2854, 15426, 2321, 34943, 130834, 118280, 89720, 91037, 63989, 2068, -16796, 68490, 89879, 86993, 75592, 58308, 1310, -2284, 4158, 55988, 74865, 80540, 121949, 148862, 116304, 155057, 170980, 64963, 28539, -12711, -5614, 5165, -1419, -31927, 8849, 18147, 49008, 48420, 35851, 46025, 45369, -265, -30190, 21585, 57043, 98211, 92888, 56923, 49169, 88978, 125052, 81774, 61051, 61077, 66882, 49686, 66892, 31230, -2463, 10062, 60215, 51788, 52394, 37921, 2874, 33307, -5349, 37405, 112985, 124945, 88175, 89028, 36900, 23882]
11558B3882J3828O473q315k9588M824j8041j6156J3790K5814j0084L6142N615
11546D8184j4247o0444j6327K772P5132K2749k7841p1989k859N2699Q884k7143
11534a0430J2297P0945K7635J1253q210j1451k3515r538k615N144p681l4335l7612
11521a8113K3515k1217L6541m7322J7911l7073J8035N1092K7259m212K3884K8522
11509I8822J5862K7055m1710q881q17N6179j5188j8041j7207k2796L7620j6913
11497I3985K2270J9785n8578j5929k7068L0666N0422K546K2174J2317j0577p1337
11485G0676K02J5601k4302o8920j2704R55P2470l769l1860O498M085M5769j9943
11472E4758r1061k1354K0748J8360O8317Q641k9583j9581j4128K1832K9784N7363
$$ y = [23882, 37710, 44183, 35868, 6280, 11104, -6937, -23093, -9303, 16511, 6427, 42569, 48184, 33937, -26507, -42834, -40062, 35070, 57819, 29978, -42011, -44870, 7829, 16713, -10430, 1867, 72812, 100447, 111700, 103490, 92039, 68524, 58986, 56371, 61515, 53834, 19499, -18113, 5402, -15815, 20726, -26596, -8685, -45758, -27723, 23369, 50628, 46416, 70300, 98822, 114684, 141739, 100029, 91148, 90331, 146510, 131322, 113281, 96074, 73278, 110898, 93985, 116255, 136040, 77462, 61533, 34465, 65131, 115553, 118099, 140273, 152590, 142013, 70676, 70878, 86479, 62177, -6743, -19447, -18492, 53978, 50209, 18349, 24847, 28932, 74701, 54758, -36303, -57657, -36909, -18549, 49768, 58409, 28826, 9245, -4883, 16949, 46733, 104096]
11460A04096m2326j2035N552J9634J2842P8139N1232m4626r2554k7739M4273J3132
11448A09620l4494j1584J3207k3528M1777P128m2260r251L8952J932K2877j1984
11436A02392n6392k9425k6389m1786L3414N7907m6482J3471J1092P3289P6181
11425A67272l1503l2502n6483n7436j6844P101K7564M7172M7957J2942o8215j9354
11413B7671K823J1211J3970L8866K2311r116j1974L1660l0641l2520p047k8901
11401B8313n3708M511K7746K3481N1389J3194k0617l7818J455L159J1466J1057
11389F3628M5078K8581j3319k5138m0023K17J5120L2668M2243k9494j2763m8572
11377E8226N585R479o4251p12q448M3578J3985M099K5O111m6556J3823J1837q242
$$ y = [104096, 61770, 49735, 55287, 74921, 87763, 165902, 217134, 172508, 79954, 52215, 96488, 109620, 75126, 63542, 76749, 53221, 94998, 102126, 59866, 50615, 89567, 91499, 114376, 102392, 46000, 16575, -9814, -51600, -18186, 39721, -6761, 6710, 17802, 91091, 167272, 135769, 103267, 46784, -10652, -27496, -20395, 7169, 54341, 102298, 115240, 47025, 27671, 30494, 41705, 55675, 94541, 116852, 107736, 95762, 127422, 96781, 64261, 57214, 28313, -25395, -20884, 6862, 30343, 81732, 94926, 74309, 36491, 37946, 41105, 52571, 63628, 108706, 137287, 123968, 98830, 58807, 59024, 74144, 106812, 149055, 119561, 106798, 58226, 63811, 73290, 9039, 8327, -121, 43457, 57442, 61541, 61566, 67677, 21121, 34944, 46781, 38539]
11363C8539M3277O742m4536j2194J8281p013J6449K5623k6066r091M305j3084
11351D1232M187k1771J7505M1881p388J7411m0430Q115O3145Q979P69j0122o2916
11338F0597j8000O1229J9303n153l178L0903J6063k260r758m896R510l303l9607
11325A11450j4204k0588K3205R017n7519o1505j1160K8306N3730o959m0099q846
11313D828j3834P3112K7339j1693l1091n3374k0932L9375M9281J0252l1432N1575
11301I3406J6647k4723m498L5092j2243k1191J2085P9718N0689m331o3765l6074
11289A20812N1l5403k1252l354J5155K8192j448j8125K0476M9461N2399n3289
11277A53675J3008K1964m8629q784R724L237j3601p611L3647l4656n9589l3805
$$ y = [38539, 81816, 88558, 44022, 31828, 50109, 43096, 59545, 85168, 59102, 50011, 54316, 41232, 45419, 23648, 41153, 83034, 75646, 93057, 52627, 60742, 123887, 132866, 133635, 123513, 60597, 42597, 103826, 123129, 117976, 114798, 145701, 161764, 159504, 149746, 144850, 154360, 151057, 111450, 97246, 76658, 99863, 108880, 51361, -10144, -21304, 7002, 60732, 53773, 13674, 4828, -9006, 64106, 91445, 79752, 48661, -4713, -25645, 13730, 63011, 73263, 41831, 93406, 110053, 85330, 80832, 115924, 103681, 82490, 94575, 174293, 224982, 220651, 156886, 120812, 120863, 85460, 64208, 60854, 76009, 104201, 102753, 84628, 105104, 154565, 206964, 153675, 166683, 188647, 140018, 131234, 140958, 144195, 130594, 122983, 156630, 121974, 62385, 28580]
11265B8580l3074n327J3023J0394j1168M089J8400J2566J0493O1255N1095m4347
11253A15979J8877j3529n2335r926l752m7144j8985J7782K6504K1543j69O7650
11241A22495k2138N540j5540l3164P954k1004j9960m5100j364k317j724O5235
11229C8913P621m0941M2364L7547N2765j7834m7600k1793J2610J7937J0335j2549
11217G9375M943l7106L0901Q2061J0186k3719J3855P639k6586Q055j6270r03l2248
11204A00183j238J8313k084n3383r461N5157K3308J165n2329L0442L9060k8462
11192A20671j8062o7262k6944l5323O3072P0117k4130r769K2211N3063P142m515
11180A50271r742m4380m8044r555K949L2808K8018L9056j2414n2403J6175L8553
$$ y = [28580, -4494, -9821, 3202, 13596, 2428, 6517, 24917, 37483, 47976, 109231, 160326, 115979, 134856, 121327, 68992, 59066, 55314, 8170, -10815, 6967, 33471, 55014, 54845, 122495, 100357, 105897, 90357, 57193, 65147, 44143, 24183, -20917, -22281, -24598, -26322, 38913, 46534, 5593, 47957, 85504, 138269, 120435, 72835, 51042, 63652, 81589, 91924, 79375, 84318, 47212, 78113, 160174, 170360, 146641, 160496, 168135, 141549, 149604, 133334, 132431, 100183, 98945, 117258, 115174, 61791, 52330, 107487, 130795, 131960, 79631, 110073, 149133, 120671, 102609, 35347, 8403, -26920, 36152, 106269, 82139, 72370, 94581, 147644, 154786, 150271, 140529, 96149, 48105, 38550, 41499, 74307, 102325, 141381, 128967, 76564, 92739, 131292]
11168A31292J7318n0711J914R6901L3840M5548L8375m8259r8750R13l6957J7159
11156A48583J5381J7203M6281M3944n7043l1216L1673n79J0357o2586q4068P766
11144H5696O250L8184N555j2985k8216J2483r810M7451L6698n742j3311L772K3821
11131A89846k8969J278K9739L6963k1679m3883r638K1983K6754L7249J1839q520
11119B42962l0363l8731J766n29J9372K6586p677l1752K142J9136M208L7927m439
11106B40608m0015k1435M7379j3892r2113k2648M1554L7464J2238l6847n0427
11095A01866k55J08606J0756q5895n8196J4141J7073M5724L1615M086K2180k689
11083B09012J5057K0001M6180l1149n4441j1647k8742j3607J641k072K1754M4263
$$ y = [131292, 148610, 97899, 99813, 196714, 230554, 276102, 314477, 266218, 167468, 168381, 131424, 148583, 163964, 181167, 227448, 271392, 214349, 183133, 214806, 214227, 224584, 161998, 77930, 85696, 91946, 130130, 135685, 122700, 94484, 106967, 97157, 144608, 181306, 175564, 162253, 166025, 189846, 160877, 162155, 191894, 228857, 207178, 163295, 153657, 175640, 202394, 239643, 251482, 242962, 212599, 173868, 175634, 175105, 194477, 221063, 213386, 181634, 183776, 202912, 207120, 245047, 240608, 200593, 179158, 226537, 212645, 120532, 97884, 139438, 176902, 189140, 152293, 101866, 101611, 210217, 220973, 135078, 76882, 91023, 108096, 153820, 185435, 189521, 211701, 209012, 224069, 244070, 290250, 259101, 204660, 193013, 164271, 150664, 152305, 150233, 171987, 216250]
11071B16250o997o124J0907j6177J7598L7208J0856K1324P7394R2449P7042N0367
11059E82097P1530j7831k7677N4167K5488K0126J583k7182J1136P804P081j356
11047G06966K3267n5339l2102K4236m5866L386J0641R723j0423p453M7581L6759
11035G11376J4037L6765L1025K0611J3303k6445m8187J0692j1262J8732K9205
11024G99852O5466Q2159N7381Q2837R2149J09137J27491J37362J14862L6467j9917
11013A685246q9716n9819j6287j26093j19179q9943o9779j2190k8530q302k9479
11002A035929j5759K3050J1376J8304J2245k9266j8897k1098J1232k7625l6944
10991I62547k3604p0145l7126o2477j678m9583l630O221L4624J1029O6002K4956
$$ y = [216250, 209253, 203129, 214036, 197859, 215457, 252665, 263521, 284845, 362239, 454688, 531730, 582097, 653627, 635796, 608119, 662286, 687774, 707900, 709483, 682301, 693437, 701241, 708322, 706966, 730233, 674894, 642792, 667028, 621162, 624548, 635189, 644912, 634489, 627036, 674617, 711376, 725413, 762178, 793203, 813814, 827117, 800672, 752485, 763177, 751915, 770647, 799852, 865318, 947477, 1004858, 1087695, 1179844, 1288981, 1416472, 1553834, 1668696, 1705163, 1685246, 1595530, 1535711, 1519424, 1393331, 1274152, 1184209, 1114430, 1102240, 1073710, 1065408, 1035929, 1020170, 1043220, 1054596, 1072900, 1085145, 1055879, 1036982, 1015884, 1027116, 999491, 962547, 938943, 868798, 831672, 769195, 767517, 717934, 714304, 720525, 755149, 766178, 832180, 857136]
10979H57136L5313M7852K2164k9083J817j9393j7011n8109M674K88l4340j07583
10967G03725r9112k0588p928n813n7790l564j247n4203N997l2732P607L8922K9211
10954E02485o0998n8680l1274j4074J4773K5482Q269J4219j7419l0611m5711n3737
10942B52724M9584Q1823k9292l5521l2924L0639L6724L171K6720j7593k1916l1654
10930C12485m8210k3710l0647J5014M5499P0795j1805j5716L0792R351M0143m3817
10918C50174n9621j2968n0574M3611L357L4834N7327k48l8184P343M9044J7310
10906D01405m3233m9805n97m0671J6686r81J9331j5141P862K2824m8466l64N4001
10893C22851l673P912n4038M0279P7052M0533j5639j9064l2901n7082l6608J6602
$$ y = [857136, 892449, 940301, 962465, 933382, 935199, 915806, 898795, 840686, 845360, 845648, 811308, 703725, 604613, 584025, 576097, 570284, 512494, 508930, 507683, 453480, 459477, 426745, 434352, 473274, 502485, 441487, 382807, 351533, 337459, 352232, 377714, 385983, 400202, 382783, 352172, 306461, 252724, 302308, 384131, 354839, 319318, 286394, 317033, 353757, 356928, 383648, 366055, 344139, 312485, 264275, 240565, 209918, 224932, 270431, 341226, 329421, 313705, 344497, 353848, 393991, 350174, 290553, 277585, 227011, 270622, 273979, 308813, 366140, 365892, 327708, 335051, 384095, 401405, 358172, 308367, 307770, 267099, 283785, 282804, 302135, 286994, 294856, 317680, 269214, 268850, 322851, 319178, 327090, 273052, 313331, 390383, 430916, 415277, 396213, 363312, 306230, 269622, 286224]
10881B86224J2415M9625k3924n700J8665l0802J9211L4925L994k1251n100l8924
10869B99358n50L7737K8669k0644L1144N0818L3221k5147m3737k1730Q339n618
10857C71860K1884j6256m9528j6118M4126M9734k1357J508M8636N4035M6183K90
10845E34997k2708k112j3990K9850L7437j5090j8795q758l8168K4403K3044p047
10833E23063P195J3046j3443k5482j4548j0143j1172J6787n613J1011J2969M9158
10821E52828L054m7856M6544P4501M15o1052q0655n440P5820J8452k6542j782
10809E48287k7056j9290l6483m8829L9829M3641j279K7992K9845o4800p5661o8107
10797C48089L9083K1781J4623k3972J0898L4504k0704M4487Q5884M7325j973m7917
$$ y = [286224, 298639, 348264, 324340, 318640, 337305, 306503, 325714, 360639, 364633, 343382, 338282, 299358, 298808, 336545, 365214, 344570, 375714, 426532, 459753, 434606, 390869, 369139, 377478, 371860, 393744, 377488, 327960, 311842, 355968, 405702, 384345, 385853, 434489, 488524, 534707, 534997, 512289, 510177, 496187, 526037, 563474, 548384, 529589, 520831, 482663, 507066, 530110, 523063, 530258, 543304, 529861, 504379, 489831, 479688, 468516, 485303, 479690, 490701, 503670, 552828, 555882, 508026, 554570, 629071, 629486, 568434, 487779, 482339, 558159, 576611, 550069, 548287, 521231, 501941, 465458, 416629, 456458, 500099, 498820, 526812, 556657, 491857, 416196, 348089, 387172, 408953, 423576, 399604, 410502, 445006, 424302, 468789, 554673, 601998, 600025, 552108]
10785E52108k0750K0947J1876k0262J1542J1494J6263K7002K8425J4297l5237
10774F17705o8191j0632L3751L3314Q9494n841p2325n9167J1358N1291K9302j1434
10762F38625n539L5441M3487J4046M9825J4478J2141j3446j9118M7213L0692m7355
10750H00490O3454J05070l8214k1562j0021L4777M0606K8765K9295P218J4842
10739A054720O2586k7149J01353N6207N670J4205L5187Q7710J26557K7118j2437
10728A531727p688M4808O8570J04780Q1051J03501J59110J51989J51396J38524
10718B527768J56809J36395J45711O5226M3824q049l9642j49752j9156K5976l3897
10707B851213M7039J9005N3266N3017O0169M5508N9434O6638J12954M8225N1057
$$ y = [552108, 531358, 552305, 564181, 543919, 555461, 566955, 583218, 610220, 638645, 652942, 617705, 549514, 538882, 572633, 605947, 695441, 689600, 617275, 558108, 569466, 620757, 650059, 638625, 633086, 668527, 712014, 726060, 775885, 790363, 802504, 789058, 769940, 817153, 847845, 800490, 863944, 969014, 930800, 909238, 899217, 933994, 974600, 1003365, 1032660, 1039878, 1054720, 1117306, 1090157, 1191510, 1247717, 1253387, 1267592, 1302779, 1390489, 1517046, 1544164, 1531727, 1524039, 1568847, 1637417, 1742197, 1823248, 1926749, 2085859, 2237848, 2389244, 2527768, 2684577, 2820972, 2966683, 3031909, 3075733, 3067684, 3028042, 2878290, 2859134, 2885110, 2851213, 2898252, 2917257, 2970523, 3023540, 3083709, 3129217, 3188651, 3255289, 3368243, 3416468, 3467525]
10696C467525Q8815N3792M9750K1498m9005j3272j2288j9393j9690J6096M9654
10685C633482L9298R5185J47674J94663K06863K77866L16467L48324K93534K73948
10675E827304L23325L17777L01603K58392K76770K71551K10068L33298M69035
10666H589123O14700P66285Q33438R15411R19787R49831R30368R08619P52588
10657A6180150M94536M29782N00710N33952L64118J63129O149j38424j00359l6466
10647A8397277k0218k9011J57706N90110J110974J736667K463070L462152N066586
10638C2935313P118866R232536J0622865J0634999R149343P038558N403272M338726
10630I6474478K709009M78300j071372j262303l55856Q24199J560643J728470
$$ y = [3467525, 3556340, 3610132, 3659882, 3681380, 3632375, 3619103, 3606815, 3587422, 3567732, 3583828, 3633482, 3672780, 3767965, 3915639, 4110302, 4317165, 4595031, 4911498, 5259822, 5553356, 5827304, 6150629, 6468406, 6770009, 7028401, 7305171, 7576722, 7786790, 8120088, 8589123, 9203823, 9970108, 10803546, 11718957, 12638744, 13588575, 14518943, 15427562, 16180150, 16674686, 17104468, 17605178, 18139130, 18503248, 18666377, 18672526, 18534102, 18433743, 18397277, 18377059, 18348048, 18505754, 19095864, 20206838, 21943505, 24406575, 27868727, 32935313, 40054179, 49286715, 59909580, 70544579, 79693922, 86732480, 92135752, 96474478, 99183487, 99661787, 98590415, 97328112, 96972256, 97796455, 99357098, 101085568]
10622A01085568J727849J445120J122739N25288m43601p31377R4306J488691K664884
10613A08979467L026087L175681L833363M780715N156784M665274L905534L366151
10605A40889056L067357K574236J943602J872732K623390L731523M755827N625107
10597A67082830O636002Q402746J1096848J3715510J5072742J4308005J1398885
10590B47713568P288024L459848Q87455j636521o822987j2703999j3882953j0859577
10582B13442858p388632n263005m198918l183240j988227j336252j793932l066577
10574A85224075l963000l968944l880743m637452o075155o619845n780106m367662
10566A45931168l142974k690692k616108k181481r55495K88605P80590L95807
$$ y = [101085568, 102813417, 104258537, 105381276, 105906564, 105462963, 104731586, 104825892, 106314583, 108979467, 112005554, 115181235, 119014598, 123795313, 128952097, 133617371, 137522905, 140889056, 143956413, 146530649, 148474251, 150346983, 152970373, 156701896, 161457723, 167082830, 173718832, 182121578, 193218426, 206933936, 222006678, 236314683, 247713568, 255001592, 258461440, 259348895, 257712374, 250889387, 238185388, 224302435, 213442858, 206054226, 200791221, 196592303, 193409063, 191420836, 190084584, 188290652, 185224075, 181261075, 177292131, 173411388, 168773936, 162698781, 156078936, 150298830, 145931168, 142788194, 140097502, 137481394, 135299913, 134344418, 134633023, 135413613, 135809420]
10558A35809420m5867k9739J22329K2629k19064n3426Q58345J947485K423953
10549A40836065J828925j36179k632666m326749n239963p196911j1067261j4133093
10541I7932168j3779069j1085397q043718n727439m083596l024754k253825j660074
10533D8274296j173935p65096n69506m56722k41915j48761l32715m48521o50266
10524D3486859p78134q98618j001421j067927j149413j380192j537111j517657
10516C4156386j416740j380728j438438j446101j383850j149903j002167q87235
10508B4051224q34143p90898q25888q00448p88836p71171p57258p78382p39904
10499A6964296o76656o66869o27268n39911n04601m06860l97441l45579l32757
$$ y = [135809420, 135763553, 135733814, 135856143, 135878772, 135659708, 135606282, 136464627, 138412112, 140836065, 142664990, 142528811, 139896145, 135569396, 130329433, 123132522, 112065261, 97932168, 84153099, 73067702, 65023984, 59296545, 55212949, 52188195, 49934370, 48274296, 47100361, 46335265, 45765759, 45309037, 45067122, 44918361, 44585646, 44137125, 43486859, 42708725, 41810107, 40808686, 39740759, 38591346, 37211154, 35674043, 34156386, 32739646, 31358918, 29920480, 28474379, 27090529, 25940626, 24938459, 24051224, 23217081, 22426183, 21600295, 20799847, 20011011, 19239840, 18482582, 17704200, 16964296, 16287640, 15620771, 14993503, 14453592, 13948991, 13542131, 13144690, 12799111, 12466354]
10490A2466354k85078k25148k38157j78172j84389k23518k18622k33569k32712
10481A0446989k45462j96798k34636k43116k49016k11492k40934j75355j34544
10472H515636j16523j63153j03457j67457j39179q3039l2497l6164q8197j32646
10462G453324k78301l46059l26775k94447k87352l66905l09906k11323k33355
10453D798901j93758j64239j53863j03509j29371j13476j10454j00812r7609j35403
10443C496407n7280j07867j02231j18782j35967q7404o0041j11379j01380p9822
10433B534254j02354o6895n3997K8348k0330j36353k8217l9269m4559k056j07857
10422A960715o0891m4497k7027n7412m447m2638k9187p6041J1232j7195n2757
$$ y = [12466354, 12181276, 11956128, 11717971, 11539799, 11355410, 11131892, 10913270, 10679701, 10446989, 10201527, 10004729, 9770093, 9526977, 9277961, 9066469, 8825535, 8650180, 8515636, 8399113, 8235960, 8132503, 7965046, 7825867, 7742828, 7710331, 7674167, 7585970, 7453324, 7175023, 6828964, 6502189, 6207742, 5920390, 5553485, 5243579, 5032256, 4798901, 4605143, 4440904, 4287041, 4183532, 4054161, 3940685, 3830231, 3729419, 3631810, 3496407, 3439127, 3331260, 3229029, 3110247, 2974280, 2886876, 2826835, 2715456, 2614076, 2534254, 2431900, 2365005, 2311008, 2339356, 2319026, 2182673, 2154456, 2115187, 2070628, 2068572, 1960715, 1899824, 1855327, 1828300, 1770888, 1766441, 1723803, 1694616, 1618575, 1629807, 1612612, 1559855]
10411A559855o0801o938m2318n8564l2928Q115l5769o4855l8523O4790j239J8061
10399A308886O601p4707J2976k2936j6825j1381p0597n3166k7690K2931j7698
10388A056394m9674l7689J5619R16n2892l7633L0270J9711j17J2042K6152N2478
10376A035577J593l0767k0719m4185o5072l2962m264j8978L3012M0128L3577n7574
10364H69366l9641k0713m7160l8146M5171R169k1076j3073k9155k0291o8622N736
10352F31565K1158k3351m7582L9152j3364O456K8152k7479N4735j9796q67M6400
10340F95179j3001M444l6123j6887j320j5954j2939l2025m3223M1024M0020N022
10328F14217k42l9794m9088k5908J5259O8170r395p9315j0120q70P2672m3619
$$ y = [1559855, 1499054, 1492116, 1449798, 1391234, 1358306, 1366421, 1330652, 1265797, 1227274, 1292064, 1290825, 1308886, 1315487, 1240780, 1253756, 1230820, 1213995, 1202614, 1132017, 1078851, 1051161, 1074092, 1056394, 1006720, 969031, 984650, 985566, 932674, 895041, 925311, 945022, 944905, 956947, 983099, 1035577, 1037170, 1006403, 985684, 941499, 876427, 843465, 839201, 820223, 853235, 893363, 926940, 869366, 829725, 809012, 761852, 723706, 768877, 778046, 756970, 743897, 714742, 694451, 625829, 631565, 652723, 629372, 581790, 620942, 607578, 614034, 642186, 614707, 669442, 649646, 648779, 695179, 682178, 686622, 650499, 633612, 632292, 616338, 603399, 571374, 528151, 569175, 609195, 614217, 613975, 574181, 525093, 499185, 514444, 582614, 573219, 493904, 483784, 482914, 555586, 511967]
10316E11967l9235K737k2900l4796o9625n8983M1277N8746K2218k0163n2812n8302
10304B80129M8303L4881O7082L7428J2493q963k7251n409P2098o4690j44323m0759
10292B61019P8615O260j2788K9035j0726J2786l8711l6685L4998N6120m418r4867
10280B80638p8046j6686Q559P4666M3221j3297K6673j39m8902J2718j0926J6865
10268B95344N5781j091k1185J3246j5355m6231k8090j0897l2769j1698N8711K2883
10256B78649o173K6014l923j9849n4315M303o924p146j3825J8274J1293l3453
10244A92925j1975M2542l1054N0372L9677k0936N209J8827J3853N7082m029o1929
10232B90564k0076J4151l533j1980M0888k243q498L5515n0909K594o4670l805
$$ y = [511967, 472732, 475469, 452569, 417773, 348148, 289165, 330442, 389188, 411406, 391243, 338431, 280129, 328432, 363313, 430395, 467823, 480316, 471353, 444102, 438693, 510791, 446101, 301778, 261019, 339634, 345894, 333106, 362141, 351415, 364201, 325490, 288805, 323803, 379923, 375505, 280638, 202592, 185906, 194465, 269131, 312352, 299055, 325728, 325589, 276687, 289405, 278479, 295344, 351125, 350034, 328849, 342095, 326740, 280509, 252419, 241522, 208753, 197055, 255766, 278649, 272476, 298490, 294567, 274718, 220403, 224706, 217782, 210636, 196811, 215085, 226378, 192925, 180950, 223492, 192438, 242810, 282487, 261551, 266760, 285587, 299440, 356522, 352493, 290564, 270488, 284639, 281106, 269126, 310014, 307771, 299273, 334788, 283879, 286473, 221803, 217998]
10220B17998N049J4140J8294J3208M8750m9344l0504j8888m1905O062P4332O6436
10208C23628K9383r169K4588N5339N8468L6399N2579M8586J35157L4433K9351
10197H18742j1243n4663N62K6327n4464L890Q756l5214j3116j8491J4954j5943
10185F70097l8586j7444J9934K5224K9451K9455K3044K0011J8434m830R2748J05460
10173I72998N8376K2812l5760r087n526J3842L582n461N806O6190K3312O0022
10161A171106Q3052J26947J31887L4994P301M6158J0314n8892l1207l1110n5191
10150A435359r1319q5344j36367q5748m1773l0167m4070P753M2601J8547K9502
10139A018974r080m4672l8818l7543J6747J7626M7992J2127k6400k5339n7727
$$ y = [217998, 223047, 237187, 255481, 268689, 317439, 268095, 237591, 218703, 176798, 182860, 257192, 323628, 353011, 343842, 368430, 423769, 482237, 518636, 571215, 619801, 754958, 789391, 818742, 807499, 752836, 753398, 779725, 725261, 729151, 737907, 702693, 689577, 671086, 686040, 670097, 631511, 614067, 634001, 659225, 688676, 718131, 741175, 761186, 779620, 774790, 867538, 972998, 1031374, 1054186, 1018426, 1009339, 1003813, 1017655, 1021237, 1015776, 1021582, 1087772, 1111084, 1171106, 1254158, 1381105, 1512992, 1547986, 1555287, 1601445, 1611759, 1552867, 1521660, 1490550, 1435359, 1344040, 1258696, 1122329, 1036581, 994808, 964641, 920571, 928324, 970925, 989472, 1018974, 1009894, 965222, 926404, 888861, 905608, 923234, 971226, 983353, 956953, 931614, 873887]
10128H73887j20k7304Q74P848J2450m0528n0343O8550J04718O865K2453j0013
10116I69337J7218r995L0514k9623n8064j056l6770m7930m4575n5236j08613n5009
10104E70198m0225j2914r680o1931N3859N1633N412M133K9164l7111n061M8432
10092E95909L729m7418j05694n0549N5956J3450O5560K6884m8126j6750P304M1791
10080E42046J099k3312K3906N9364k5142j22977q5235O8786R8100Q3601K3662
10069F43898m2811r3491o8975J890L9086N9434L1311k90K2711j7434j9454m283
10057E51592j9983N3607L6029k7932m336m3399l4855P9473J10138R1666N189K2379
10045H19568J00077J86451L91365N80407R20883R04273M86069O627j49578J4092
$$ y = [873887, 873767, 846463, 847337, 855185, 867635, 827107, 776764, 845314, 950032, 956897, 979350, 969337, 986555, 976560, 1007074, 977451, 919387, 918331, 881561, 833631, 789056, 733820, 625207, 570198, 529973, 517059, 507379, 445448, 499307, 550940, 556352, 560485, 589649, 552538, 547477, 595909, 599638, 552220, 446526, 395977, 451933, 465383, 530943, 557827, 509701, 492951, 500255, 542046, 543145, 519833, 543739, 603103, 577961, 454984, 369749, 438535, 536635, 620236, 643898, 601087, 507596, 438621, 440511, 479597, 539031, 570342, 570052, 592763, 575329, 555875, 551592, 531609, 585216, 621245, 593313, 588977, 545578, 510723, 590196, 700334, 792000, 797189, 819568, 919645, 1106096, 1497461, 2077868, 2998751, 3903024, 4389093, 4395720, 4246142, 4260234]
10035D260234K41348l16595j239982r31543n40691k43377j63451j10664j9919
10026I35360l6313j0297l9053n4123p9343k2993k9831l4343K7315K3066M3841
10015G23286k5898n4342l2331q4401j4721m3431n1125J6342L3295n4415j5070
10004C97189J9823L2060K8955j41P959R016l6792p240j0884k8262j1057k9813
9992C70813n036r400N290m118L9428J2281Q444J7184k6485j16092n0001L6381
9980B78689M061j6847L7999m314L4937K7721N9910k4676n2824L828J6977m0271
9968C25190l5801N6441j5382k2475P4154M8358l5771K88L4898N1299M7003L7339
9956E65541m931M167n392k5708J7782n2081m6217m1976l412m8626l2071k741L4952
$$ y = [4260234, 4501582, 4184987, 2945005, 2013462, 1472771, 1229394, 1065943, 955279, 935360, 899047, 888750, 849697, 795574, 716231, 693238, 663407, 629064, 656379, 679445, 723286, 697388, 643046, 610715, 526314, 511593, 468162, 417037, 433379, 466674, 412259, 397189, 417012, 449072, 478027, 477886, 485845, 494861, 458069, 450829, 439945, 411683, 400626, 370813, 365777, 356377, 361667, 357549, 396977, 409258, 417702, 434886, 408401, 292309, 242308, 278689, 282750, 265903, 303902, 299588, 334525, 362246, 422156, 397480, 344656, 348484, 365461, 325190, 289389, 345830, 330448, 307973, 382127, 430485, 394714, 395002, 429900, 481199, 528202, 565541, 560610, 564777, 559385, 533677, 551459, 499378, 453161, 411185, 407773, 359147, 327076, 324335, 359287]
9943C59287k873m4410l0946m1764L0456r116K7510J3182r362k1979m195k750M0163
9930C03203M3183J3920J6344l6592j7247O824N9709N1507M3754R3310M3791K9977
9918F51683P5662N4755M5218n134O423k258M4841M3470P537N9491L1201J9564
9906A032453o4500p5369r2024j4634R105o3658o5902m8721j6352m6129q5656J8513
9894D87126J3192j093L8998M5323J0182J4040l3794q285l979L541M8029l6316
9882E76964K9982Q168k0509k238P1692R1292N9929L7123Q0007J18423N1824l1834
9870A070823p217m6327J2852O0681J7299J3040K7322K8818J5421P5564P0106j4829
9858A323553j3843j6173j07008l6036m9818o7536l7979P4140k0725L437m343K6251
$$ y = [359287, 356414, 312004, 281058, 239294, 269750, 260634, 288144, 301326, 291964, 269985, 265790, 263040, 303203, 346386, 360306, 376650, 340058, 322811, 329635, 389344, 440851, 484605, 577915, 621706, 651683, 727345, 782100, 827318, 822184, 828607, 826349, 871190, 914660, 922197, 981688, 1012889, 1032453, 967953, 892584, 800560, 785926, 795031, 731373, 665471, 616750, 600398, 554269, 468613, 487126, 500318, 499225, 538223, 583546, 593728, 607768, 573974, 565689, 561710, 565251, 613280, 576964, 606946, 615114, 594605, 592367, 664059, 755351, 815280, 852403, 932410, 1050833, 1102657, 1070823, 1063606, 1017279, 1030131, 1090812, 1108111, 1121151, 1148473, 1177291, 1192712, 1268276, 1338382, 1323553, 1309710, 1293537, 1186529, 1150493, 1100675, 1033139, 995160, 1069300, 1048575, 1052012, 1047669, 1073920]
9846A073920R3360k0600l7729j9624K4793P578j986n1840q0334l0037p0756p6276
9834H10469j0150M4540k151r889O2953M6205m0495J754J0204J625M0275L01l7904
9821I17737K8183K5245J6776Q9614R1646R8475J33086J55887J10467L4038j93
9810A700961o6893n1814k82q7053j25745p9188r3422q0758L456l2713l4275K0607
9798A072881N8611K053k9663k3309P504l7363k2013R223J9008n9098N665L8496
9786A041995m2075l086K3144J5415J2799P5306O0347j17j203o047J3468M4110
9774A234056N2662N1400M7253O6443J13624J24499K4438M0643Q236l20K6481k1858
9762A767557l7252o826O3429P9643K8041M4700Q6782J15783M8230N0899P3902
$$ y = [1073920, 1167280, 1146680, 1108951, 1089327, 1114120, 1121698, 1119712, 1067872, 987538, 957501, 886745, 810469, 800319, 844859, 842708, 832819, 895772, 941977, 901482, 903236, 913440, 915065, 955340, 955641, 917737, 945920, 971165, 987941, 1077555, 1169201, 1267676, 1400762, 1556649, 1667116, 1701154, 1700961, 1634068, 1582254, 1581972, 1494919, 1369174, 1289986, 1196564, 1115806, 1119262, 1086549, 1052274, 1072881, 1131492, 1133545, 1103882, 1080573, 1088077, 1050714, 1028701, 1037924, 1056932, 997834, 1003499, 1041995, 999920, 996834, 1019978, 1035393, 1048192, 1123498, 1183845, 1183728, 1182525, 1176478, 1189946, 1234056, 1286718, 1338118, 1385371, 1451814, 1565438, 1689937, 1714375, 1755018, 1763254, 1762934, 1789415, 1767557, 1730305, 1723479, 1786908, 1866551, 1894592, 1939292, 2026074, 2141857, 2190087, 2240986, 2314888]
9751B314888N6194P2155J37943J62349J81986J73958J61734J41178J51583K21935
9741C775903K74397K36884K72675K80395K70847L68007L92158M63798N38312O01747
9731G475123O00075O09757P49915R25195J075180J230667J347389J588537J820578
9722A7422416J998875K207943K485908K652649K685063K676729K513613K194632
9714C6837828J699764J158344N15498k03227r30473j514116j959372k272389k379800
9705C0952057k435998k322045k108236j994914j796942j594113j285957j198468
9697A6215384j124788j052262q76420p87433p30451o33569o38326n63099m89788
9688I319248l40571m14878l18333k72758k99164k90672l04204k67832j74002j98512
$$ y = [2314888, 2371082, 2443237, 2581180, 2743529, 2925515, 3099473, 3261207, 3402385, 3553968, 3775903, 4050300, 4287184, 4559859, 4840254, 5111101, 5479108, 5871266, 6335064, 6873376, 7475123, 8075198, 8684955, 9434870, 10360065, 11435245, 12665912, 14013301, 15601838, 17422416, 19421291, 21629234, 24115142, 26767791, 29452854, 32129583, 34643196, 36837828, 38537592, 39695936, 40211434, 40008207, 39077734, 37563618, 35604246, 33331857, 30952057, 28516059, 26194014, 24085778, 22090864, 20293922, 18699809, 17413852, 16215384, 15090596, 14038334, 13161914, 12374481, 11644030, 11010461, 10372135, 9809036, 9319248, 8978677, 8563799, 8245466, 7972708, 7673544, 7382872, 7078668, 6810836, 6636834, 6438322]
9678F438322k43228k44048j55037k01097k22285j81784j57128j15547j38308r2160
9668D687700j06390r4341j23936j65840j67265q8493o8127r8279j27219j45130
9658C502680o6967N488R852q6450j11913p0841n1903m3950n912R785N582k4521
9646C070930L2777l760k3323J6736l5230j30557o3459p229n8028j12202r8913
9635B587742p3116n4425l6586l0493j7833O303k2663L8349Q583j7176N727K3774
9623B418186J5122l8833L7624R296m4793r4131q9013q2695j586K3799l5290m5574
9611B072112j328N5906M7297k4492Q826L9234N8543M5156J3947l0285M1112J4474
9599B340502k2887J0586M0761L0051k5469o2098J7213l2877j792N131p5302n3619
$$ y = [6438322, 6195094, 5951046, 5796009, 5594912, 5372627, 5190843, 5033715, 4918168, 4779860, 4687700, 4581310, 4486969, 4363033, 4197193, 4029928, 3941435, 3873308, 3775029, 3647810, 3502680, 3435713, 3441201, 3451053, 3364603, 3252690, 3181849, 3129946, 3085996, 3080084, 3089869, 3095451, 3070930, 3103707, 3099947, 3076624, 3093360, 3058130, 2927573, 2864114, 2856885, 2798857, 2686655, 2587742, 2514626, 2460201, 2423615, 2393122, 2375289, 2381592, 2358929, 2397278, 2405861, 2388685, 2394412, 2418186, 2433308, 2394475, 2432099, 2441395, 2396602, 2302471, 2213458, 2130763, 2129177, 2152976, 2117686, 2072112, 2070784, 2126690, 2173987, 2149495, 2158321, 2197555, 2256098, 2301254, 2315201, 2284916, 2326028, 2340502, 2317615, 2328201, 2368962, 2399013, 2373544, 2311446, 2328659, 2295782, 2293990, 2299121, 2223819, 2170200]
9587B170200n356J0574L6589P3483J24671J45196J08905P2443J71891J23910J87170
9576C219676J87694J51001J52555J59537J77906K09092K60373K67698K72190K74975
9566E332697K41148J64073J06617M2267m3532Q657j32864k93162k79400j93428
9556D953073j35888j22833m0942q6179l696L8123J16296J31135J32576K38142
9546E219807L61443M94718P57263J035606J055163J034944J062422R15236Q06310
9537A2742912M67679J25990j74524l80508m78233n61316o86417o43829m94971
9528I916783m11532l52526k99512k69145j38137M8391J19066J88859L72680N15843
9518I690770N43536O35198Q53313J158840J364882J515076J375070J190065R05470
$$ y = [2170200, 2164844, 2175418, 2212007, 2285490, 2410161, 2555357, 2664262, 2736705, 2908596, 3032506, 3219676, 3407370, 3558371, 3710926, 3870463, 4048369, 4257461, 4517834, 4785532, 5057722, 5332697, 5573845, 5737918, 5844535, 5886802, 5843270, 5851927, 5719063, 5425901, 5146501, 4953073, 4817185, 4694352, 4653410, 4567231, 4563535, 4601658, 4717954, 4849089, 4981665, 5219807, 5581250, 6075968, 6833231, 7868837, 8924000, 9958944, 11021366, 11936602, 12742912, 13210591, 13336581, 13162057, 12781549, 12303316, 11742000, 11055583, 10411754, 9916783, 9505251, 9152725, 8853213, 8584068, 8445931, 8494322, 8613388, 8802247, 9174927, 9690770, 10234306, 10869504, 11722817, 12881657, 14246539, 15761615, 17136685, 18326750, 19232220]
9509A9232220O48894M06371J75710k45556n22573m83445l22203R0561O17109J251262
9499B0848350J883625K757110L865253N247193P035389R042667J1044377J2249715
9491G3973679J1583376R191231O179591L923019K355213O4859l371367n736149
9483I8163452n129449k762747o11190Q22499J976647L397624M877455N940941
9475A06675232O325709O795819P844929Q534508P855949O113388M603189L564956
9467A58313679K265534l35980l355832m983630m589598l402656k317976j374949
9459A40218592k29074R91395K459895M041587O008184Q157489J0258946J2938433
9451A84845447J6841815K1446969K4633213K3249612J6567772Q406671K373386
$$ y = [19232220, 19881114, 20287485, 20463195, 20217639, 19695066, 19211621, 18889418, 18979979, 19597088, 20848350, 22731975, 25489085, 29354338, 34601531, 41636920, 50679587, 61723964, 73973679, 85557055, 94748286, 100927877, 104850896, 107206109, 107270968, 103899601, 98163452, 93034003, 90271256, 89660066, 90482565, 92459212, 95856836, 100734291, 106675232, 113000941, 119796760, 127641689, 136176197, 144032146, 150145534, 154748723, 158313679, 160579213, 160243233, 156887401, 151903771, 147314173, 143911517, 141593541, 140218592, 139989518, 140980913, 143440808, 147482395, 153490579, 161648068, 171907014, 184845447, 201687262, 223134231, 247767444, 271017056, 287584828, 295991499, 298364885]
9444B98364885k225427q962062j8818652k5777563k5252065k0506449j5565954
9437A81256713j1459117q099077n311986l111455j485881n14698l20771L20398
9429A51274126J935778L976173N827678O475781N466946L067709K60815k233053
9421A76051953m413979o385089q405445r628436r319225q309091p162048n949302
9413A16479338m552215k946148j579794n18447K90450J612315L206043M322115
9405A16313657L755262J495395j032679k975667m517603o762239r709627j1579918
9397H4986581j1020589r049417o998629n263137m018364l019727k300648j759337
9389D1556733j210884q06743n54102l44985k87026m11384o48099p88856j034695
$$ y = [298364885, 296139458, 287177396, 268358744, 242581181, 217329116, 196822667, 181256713, 169797596, 161698519, 156386533, 153275078, 151789197, 151274499, 150953728, 151274126, 153209904, 157186077, 163013755, 169489536, 174956482, 178024191, 178285006, 176051953, 171637974, 165252885, 156847440, 147219004, 137899779, 129590688, 122428640, 116479338, 111927123, 108980975, 107401181, 106882734, 107173184, 108785499, 111991542, 116313657, 120068919, 121564314, 120531635, 117555968, 113038365, 106276126, 96566499, 84986581, 73965992, 64916575, 57917946, 52654809, 48636445, 45616718, 43316070, 41556733, 40345849, 39539106, 38985004, 38640019, 38352993, 37941609, 37293510, 36504654, 35469959]
9380C5469959j258865j411570j558767j596040j559033j396904j214397r44364
9372B4530019q23714q27528p44730o89380n77767n04764m27771k97291k53959
9363A9383115k31757j49510n0890J18296K73171K22469J37707q9707k22950l74850
9353A9015094n56009p87571r53641j118761j140328j057346r50374o94743n49150
9344A1207171m47986l99792l62429k86388k54554k83387k17442j74372j94585
9335H586236j84820j06562k3274l5273n0014N0008M8894k7402r2511j06801j61332
9324G897149k81066l77845l40804l29747l25131k70632k43392k29927j85972j76590
9314E136043j32486j89976k30267k07648k28460k01709j21459j28588j50385j59083
$$ y = [35469959, 34211094, 32799524, 31240757, 29644717, 28085684, 26688780, 25474383, 24530019, 23706305, 22878777, 22134047, 21444667, 20866900, 20362136, 19934365, 19637074, 19383115, 19151358, 19001848, 18950958, 19069254, 19342425, 19564894, 19702601, 19612894, 19389944, 19015094, 18459085, 17671514, 16717873, 15599112, 14458784, 13401438, 12451064, 11756321, 11207171, 10759185, 10359393, 9996964, 9710576, 9456022, 9172635, 8955193, 8780821, 8586236, 8401416, 8294854, 8271580, 8236307, 8186293, 8236301, 8285195, 8257793, 8165282, 8058481, 7897149, 7616083, 7238238, 6897434, 6567687, 6242556, 5971924, 5728532, 5498605, 5312633, 5136043, 5003557, 4813581, 4583314, 4375666, 4147206, 3945497, 3824038, 3695450, 3545065, 3385982]
9304C385982j00867j02438q6046q0904j30816j34519q2401r4992l0115q0429j14942
9293B347513k4128j8678k4516o8814j23609l2052m7072m3525m0824k2351p079
9282A894865l4130L186k3428o7273o7160p5945n186r521j01110o016p09l8721
9270A468852j0297q0948p7877P835J8471k7821n9212j9910K2027K6216l6996o7175
9258A163165j0173J45N9330L5208q5792o2725r0030j4835L0474o804j9226k1562
9246I77175k6018N7143j6230l6456l0599n6374l1039m0744N5230O3118K9267J6385
9234I60858nm2578m0778k8328K1210L9197o2020J1705j7585p2367m4759j341m1997
9221F81212J0886L8454n229n2286j751L6301m3079k6263k8196k0572K214M3444
$$ y = [3385982, 3285115, 3182677, 3096631, 3015727, 2884911, 2750392, 2667991, 2572999, 2542884, 2462455, 2347513, 2323385, 2304707, 2280191, 2211377, 2087768, 2055716, 2008644, 1965119, 1924295, 1901944, 1894865, 1860735, 1863921, 1840493, 1773220, 1706060, 1630115, 1624929, 1615408, 1514298, 1508282, 1507573, 1468852, 1458555, 1377607, 1299730, 1307565, 1326036, 1298215, 1239003, 1219093, 1241120, 1267336, 1230340, 1163165, 1152992, 1153137, 1212467, 1247675, 1161883, 1099158, 1009128, 994293, 1024767, 1017963, 998737, 977175, 951157, 1008300, 992070, 955614, 925015, 868641, 837602, 796858, 852088, 915206, 944473, 960858, 960853, 918275, 877497, 849169, 870379, 909576, 847556, 859261, 841676, 769309, 724550, 723209, 681212, 692098, 730552, 725323, 673037, 671286, 707587, 664508, 638245, 610049, 589477, 591691, 635135]
9209F35135L6254l4401o3442j1825m8781O148L1246k8365l3188P465K7921K9935
9197E54102k5958j4386L5738j0444J8968m6987n1304k0567p976p748n042L0716
9185D49112N8471j265n3361m6778l37q315m8214M515l2294j0649k8051m0689J9073
9172B61218L7462L2972K8641l9634k9006k6662L49k1618q050P3830K1207L8016
9160C68725l3420o6260m3552j7378Q322J4087j960J2375O0772K7120k5440l4181
9148B69210N5728M2496o6851l5949m1932l8697m6466k1311N009l025L3889K7071
9136A79172l4295l1821L9423L2015K93K5094k6882J479M3915P1280L0179k4057
9124C05795M7830O2606N3986L3865j0306R1686l534n9713j918R703l7674m1541
$$ y = [635135, 671389, 636988, 573546, 561721, 512940, 519088, 550334, 521969, 488781, 496246, 524167, 554102, 528144, 513758, 549496, 539052, 558020, 511033, 459729, 439162, 431186, 423438, 418396, 449112, 507583, 506318, 452957, 406179, 405842, 397527, 349313, 353828, 321534, 310885, 282834, 242145, 261218, 298680, 331652, 360293, 320659, 291653, 264991, 265340, 243722, 235672, 309502, 330709, 368725, 335305, 269045, 225493, 208115, 216437, 230524, 228564, 240939, 301711, 328831, 303391, 269210, 324938, 367434, 300583, 264634, 222702, 184005, 137539, 116228, 121237, 118212, 152101, 179172, 144877, 113056, 152479, 184494, 184787, 209881, 182999, 184478, 228393, 299673, 329852, 305795, 353625, 416231, 470217, 504082, 493776, 585462, 581928, 522215, 520297, 530000, 492326, 450785]
9112D50785m6962o6477p7340k8225j8873K2769M5586J9813M6536m1193n2974K1422
9100B74867k9728j0719L0546j1671M2829P0868l4240L7614M8302K5780n1822n7809
9088C34817j8286O0761K4619K2980l666K0574K5405M7278Q7877J07065J04986
9077H14410R1312N9714M9012N5785j7247l337j0019p8525r9827p4885o6818M424
9065G23999n956l9636k3875K9484K1584o048j0126k9181o0206o3000M2601j342
9053E78298o7324m2497N7200J0342r197K4888k2712r530n620K8069K0098K4188
9041E86203K6462J7326k4996k0291O732M2641O0011O4266N433N5445l8110m2115
9029G39007M1948Q1040M5957J3867K0928l269j2806l1210L2075P4260K5189M1344
$$ y = [450785, 403823, 337346, 260006, 231781, 212908, 235677, 281263, 301076, 347612, 306419, 253445, 274867, 245139, 234420, 264966, 253295, 296124, 366992, 332752, 370366, 418668, 444448, 392626, 334817, 316531, 377292, 401911, 424891, 421225, 441799, 467204, 514482, 602359, 709424, 814410, 905722, 965436, 1014448, 1070233, 1052986, 1049649, 1039630, 961105, 861278, 786393, 719575, 723999, 718043, 678407, 654532, 684016, 705600, 699552, 689426, 660245, 600039, 537039, 579640, 578298, 510974, 468477, 525677, 536019, 526822, 551710, 528998, 519468, 513848, 541917, 562015, 586203, 612665, 629991, 604995, 584704, 591436, 634077, 694088, 758354, 763787, 819232, 781122, 739007, 780955, 861995, 907952, 921819, 942747, 939478, 926672, 895462, 927537, 1001797, 1026986, 1068330]
9017A068330J8386k7894m3170m4289o8728k0958n9791l8648q8482l7949m838j3653
9005F38316K2m474l8152p3117p475L5157N0k6332L238p992n739r2756j9811J5514
8991D16449k843k062j2415k1349j8520L6210O0723L4569j899M1345M5092K5304
8979F00604N416K1740P8390N7413j0398j7395K8624k9244q896J1329j6879l2965
8967F87739m2578n4228o8106o9207m2402q3979o695l0293J1444k2262l8009k8780
8955B12644L3385j1328J6646l2665k7761m1657M1590K9622k2145m4831j2562k567
8943A38371O9932l8637q4080K8369P1963j2415J7598P1713N4095j1550k3645P568
8931B89282N359O465J8990n2735p6801L2473K8613k1642m6312L60k4723n3643
$$ y = [1068330, 1086716, 1058822, 1015652, 971363, 902635, 881677, 821886, 783238, 694756, 656807, 651969, 638316, 638338, 633864, 595712, 522595, 515120, 550277, 550327, 523995, 527233, 519241, 513502, 420746, 400935, 416449, 413606, 411544, 399129, 377780, 359260, 395470, 456193, 490762, 488863, 530208, 575300, 600604, 606020, 627760, 706150, 763563, 753165, 735770, 764394, 735150, 726254, 737583, 720704, 687739, 645161, 590933, 522827, 453620, 411218, 327239, 320544, 290251, 301695, 279433, 241424, 212644, 246029, 234701, 251347, 218682, 190921, 149264, 190854, 220476, 198331, 153500, 140938, 138371, 208303, 169666, 85586, 113955, 185918, 173503, 191101, 262814, 316909, 305359, 281714, 289282, 294641, 301106, 320096, 267361, 190560, 223033, 251646, 230004, 183692, 184052, 159329, 105686]
8919A05686J6109R176j03231p2963r879J2008L5896P5618O3378M6352J5250P954
8907B01354J9681L329o974j5577m4361n2763k0246L781Q1269K9716m7905j2903
8895A38401l2701n988L9966j2242p2619r06m0258M5622O1424R471l8094l9122
8883E2954m3212m67k9743L128J291l649K9905N669N3463M1456K4740r710M0535
8870A66360P1499J20028J87856J96302J14552j204L8557N5693j7072p6832j63680
8859F92059j66123j20859j03356N4000k5147l1080m1550j0003m0941o0189p4037
8848G2774n8953O3103N727l0567n4469K4843K3024L6819O1837l5510k8325K5692
8836A05995K9265m5980j9742o1506K4260K2308O1044O3551j3711j3439k2641n802
$$ y = [105686, 121795, 130971, 27740, -45223, -55102, -43094, -7198, 68420, 131798, 178150, 193400, 201354, 221035, 224364, 217390, 201813, 157452, 104689, 84443, 88224, 169493, 199209, 151304, 138401, 105700, 99712, 139678, 127436, 54817, 53911, 13653, 59275, 120699, 130170, 92076, 52954, 9742, 9275, -20468, -17340, -16049, -19698, 10207, 15876, 69339, 110795, 135535, 125825, 166360, 237859, 357887, 545743, 742045, 856597, 855393, 893950, 949643, 932571, 855739, 692059, 525936, 405077, 301721, 355721, 330574, 299494, 257944, 247941, 207000, 146811, 72774, 13821, 76924, 82651, 52084, -2385, 22458, 45482, 82301, 144138, 108628, 80303, 105995, 135260, 89280, 69538, 8032, 32292, 54600, 115644, 179195, 165484, 152045, 129404, 123602]
8824A23602k7846j0950l7467p324O281n0422l5265Q636J6698M1174M7363P923
8812H2403r711K2416j086o1334K8305q741K5656J5851n788K4195N966N716k3794
8799A00054J6695p663m5266M738Q6125n9839r3377j8856N4315Q8386K1670k2372
8787A24610k0326k6916L421m4956k6775J7310R730j3885n3559p0061N5268K5945
8775b0194L3008L6484j5250k8104j3035k6995L6814m336j2011N2749r206O6420
8763I6344Q3804k1473m1671L58n066K469J0460j7697n2672L6427P0102r9027q2959
8750b0601J1933M8984O421L0332K9608L030J3015n6813j7271L5972K4639k8394
8738H0855L5094k5443k8499J8095L8435P734p875l1024n8543o6083M2722M2846
$$ y = [123602, 95756, 84806, 47339, 40015, 46296, -4126, -39391, -30755, -14057, 27117, 74480, 82403, 72692, 95108, 94022, 32688, 60993, 52252, 77908, 93759, 87971, 112166, 118132, 123848, 100054, 116749, 109086, 63820, 68558, 154683, 94844, 1467, -17389, 36926, 125312, 146982, 124610, 104284, 77368, 80789, 35833, 9058, 26368, 36098, 22213, -31346, -101407, -46139, -20194, 12814, 49298, 34048, 5944, -7091, -34086, 2728, -1608, -13619, 39130, 29924, 96344, 180148, 158675, 117004, 117362, 112296, 114765, 125225, 107528, 54856, 91283, 161385, 62358, -20601, -8668, 40316, 46737, 77069, 106677, 109707, 122722, 65909, 48638, 84610, 109249, 80855, 115949, 90506, 62007, 80102, 118537, 126271, 118396, 87372, 28829, -37254, 5468, 48314]
8726D8314P123J2965J3104J1722K7547K5010n056M477k495n0113l369L046L0786
8713A23061l5043M3397k2756k8857L7335L4653j0210K7995J4434L7249K6016m6148
8701B01126j3522J0275M092M6567l2956l5959m661K389R112k5878j0237j017N571
8688A54902k8373k9786P9551M6959l7834r4401k0339Q8616j2148m3458l0330j6310
8676E7049J2131J8736J7608j9103k0996j3387O5519M9355M4628m689K1440m1074
8664A87217m8665m4147j3207Q00P1081J2887k5138j4511p077l2309K982m2854
8652D7059L4637M8065M8694r509m3973j3458n3281m618J2803O3832O468k1874
8640A14845M0986k993J6552j7166k5053M782j9282j0459P0885K399k6707L1535
$$ y = [48314, 55437, 68402, 81506, 93228, 120775, 145785, 140729, 145206, 142711, 92598, 89229, 92275, 123061, 88018, 131415, 108659, 79802, 117137, 151790, 141580, 169575, 184009, 221258, 247274, 201126, 187604, 197879, 201971, 248538, 215582, 179623, 174962, 177351, 186463, 160585, 150348, 149331, 154902, 126529, 96743, 176294, 223253, 185419, 91018, 70679, 159295, 147147, 103689, 73359, 57049, 69180, 87916, 105524, 86421, 65425, 52038, 117557, 166912, 211540, 206851, 228291, 187217, 138552, 94405, 81198, 81998, 153079, 165966, 140828, 126317, 119240, 86931, 89913, 47059, 81696, 129761, 178455, 168946, 124973, 111515, 58234, 53616, 66419, 130251, 136719, 114845, 155831, 152838, 169390, 152224, 127171, 131953, 112671, 102212, 173097, 175496, 148789, 180324]
8628A80324L4658m7331k8701K9650K9503r189p180j5924J9215K572L2554k797
8616B17354o7734J8054K4181k4457K7197R869p8645p762j1782p741O9364R6648
8604B64546K1013r1971n5266L1230Q335M2510O9999N686l3212r732j4005j9865
8592B19268j9111R3866R3274M1355J5796k1244Q011r509k5055P1444M5770l0148
8580D83717r6100q4847j9194K871l9339j01094k2083J0061M268J5711l4391m1047
8568G8533P942k346q089Q119J6250j469j4715O286L7360K9021M556J7010L7891
8555B16349j0341m1874k2554N589m8519k6937K8072J2676K289l2060o2135K4023
8543D4578r593j4393N0405M8685N8888m5106k7639L9713M1523K8049m1306l1176
$$ y = [180324, 214982, 167651, 138950, 168600, 198103, 188914, 181734, 165810, 185025, 187597, 220151, 217354, 149620, 167674, 191855, 167398, 194595, 204464, 125819, 118057, 106275, 98534, 167898, 264546, 285559, 193588, 138322, 169552, 177887, 220397, 290396, 296082, 262870, 253138, 239133, 219268, 200157, 294023, 387297, 428652, 444448, 423204, 431215, 421706, 396651, 468095, 513865, 483717, 387617, 302770, 283576, 286447, 247108, 146014, 123931, 133992, 138260, 153971, 119580, 78533, 86475, 84129, 76040, 84159, 100409, 98940, 84225, 90511, 127871, 156892, 161448, 178458, 216349, 206008, 164134, 141580, 147169, 98650, 71713, 99785, 112461, 114750, 82690, 20555, 44578, 34985, 20592, 70997, 119682, 178570, 133464, 105825, 145538, 187061, 215110, 173804, 142628]
8531A42628K8996J5396n1015K8605k065n7163k8153j5137n1620N5843N9966k7893
8519I8388p3030K5687K6593m2879j1095L3697K9268L7469K5433K3072M9573n765
8507B16411j0204m340l0099p3073l4859m1571l0681L9877Q0198O1010L875j05079
8495G1465m9006L962l9656k6138M6348l33M4984M5961l1668j4251J2183K3253
8483H7104l1039K8875k577p0963j2540P859j3173L0374l154L237M2352j6786O06
8470E0175K0735P136k0585k2360M7151o059k1856n405r135J4350o159l0187j0433
8457G368O49J3005K0107J441l1230M7929M1650j2960K1137l6380q1548k1135l7559
8444f7526M971K7825j1347K3003K1778q912M5155L7126k1350p1052J0414J1122
$$ y = [142628, 171624, 187020, 136005, 164610, 162545, 105382, 77229, 62092, 10472, 66315, 126281, 98388, 25358, 51045, 77638, 34759, 23664, 57361, 86629, 124098, 149531, 172603, 222176, 216411, 206207, 201867, 171768, 98695, 63836, 22265, -8416, 31461, 111659, 172669, 176544, 71465, 22459, 26421, -13235, -39373, 6975, 6642, 51626, 97587, 65919, 51668, 63851, 87104, 56065, 84940, 82363, 11400, -1140, 6719, -6454, 23920, 20766, 24003, 66355, 49569, 50175, 70910, 78046, 57461, 35101, 82252, 76193, 54337, 48932, 39797, 54147, 47988, 17801, 7368, 8017, 21022, 41129, 42570, 11340, 59269, 100919, 87959, 109096, 72716, -8832, -29967, -67526, -62555, -34730, -46077, -23074, -1296, -10208, 34947, 72073, 50723, -20329, -9915, 1207]
8432A207J1582m625m6368J2582M8478O2720J6275k0318l4365k6401k2898k2673
8420b4804J0826k959J2795o858j3024N5118M9416m6558q2685k153K4384l386j2086
8407d1974L3047K8641J7722Q396K1598n1189n4369O3388O5175K6434p253p2580
8395C7036l9045M894P1148j8950m2924L888O6836k4383o4137j8558M324K4010
8383D139j1040j1037K386J360M6717j2842k1294M4692J3574l8652o7425O4271
8371A4849J136N202n574j2319k450L783K3835J265k5504l4432n7464o0373k9226
8358a77272Q100R0575J04911R9054j9558o7195k526k0032K200M8543J0786K0860
8346I8446k8289l5948L8215j3800N1400Q807k1278k2621j9652K2131p013l3383
$$ y = [1207, 12789, 8164, -38204, -25622, 22856, 85576, 101851, 81533, 47168, 20767, -2131, -24804, -13978, -16937, -4142, -11000, -24024, 31094, 80510, 33952, -48733, -50886, -26502, -29888, -41974, -8927, 19714, 37436, 45832, 67430, 16241, -38128, 25260, 90435, 116869, 109616, 37036, -2009, 2885, 74033, 55083, 12159, 16047, 82883, 58500, -5637, -24195, -19871, 4139, -6901, -17938, -15552, -14192, 32525, 19683, -1611, 43081, 56655, 18003, -49422, 14849, 15985, 21187, 15613, 3294, 844, 4627, 28462, 29727, 4223, -30209, -87673, -148046, -177272, -169172, -78597, 26314, 125368, 105810, 38615, 36089, 16057, 18257, 66800, 77586, 98446, 70157, 34209, 72424, 58624, 110024, 118831, 97553, 74932, 55280, 77411, 70398, 37015]
8334C7015l2962L6552J9473m6723j4743J2405N9700M7556R951j5703k6991o9305
8322A6225n2433j3587k7374L6306M6109N9209j7730r0699J2229P1769M297n535
8310C8786K6407J7211M864O9933J4617m6742j0969j6561k3704p1179m5737J9307
8298b3767N211K4118Q0413J8236l4616r070k1502N5320M1672J4060n66l5199k4595
8285H9715j4314K1311M4389m0355L1336P193L7141k7338j7379k0236q50o7957
8273D2656n0149n677J5995M5783M8897K1607p9530l0318P756m5348j3212K5059
8261a6481J9513P187K3510k8235r1890L438Q2742N3083M7093j7425o3264k658
8249A6613O8205J0900m1043r669p130k0011j0195J521L6816O1730j0111q3769
$$ y = [37015, 4053, 40605, 60078, 13355, -1388, 11017, 70717, 118273, 128224, 112521, 85530, 16225, -36208, -49795, -77169, -40863, 5246, 64455, 46725, -43974, -31745, 40024, 44321, 38786, 65193, 82404, 87268, 157201, 171818, 125076, 114107, 97546, 73842, 2663, -43074, -23767, -18556, 5562, 85975, 104211, 69595, 60525, 39023, 94343, 136015, 150075, 149509, 114310, 89715, 75401, 96712, 141101, 100746, 132082, 139275, 176416, 149078, 131699, 111463, 110613, 42656, -7493, -13170, 2825, 48608, 97505, 119112, 39582, 9264, 17020, -28328, -41540, -16481, 3032, 10219, 33729, 5494, -86396, -82958, -216, 52867, 99960, 82535, 19271, 16613, 84818, 95718, 54675, 45006, 37876, 17865, 7670, 9191, 46007, 107737, 97626, 13857]
8237A3857k19M0259O9991j7796q2654J5224k2744l5098K6020L1533k198j6866
8225A9309L4510l6695l5914l590N8946J3169J4574j7107M2193J928j02623m8735
8213f0035K3649L3193l8321o0636J5585O8373J2106J9958j008M1666J9410j5103
8201E8837j8380K2693K3055l439o3087r137O5520R6482N661r8735n5592l879M203
8188B4202l6140K194J9325p465k3075J352k4085P6982n577m1529L6437M5987k3612
8175D4996m6052K1322M3563l8485l759l6227O916m093j4126L8124N763j6033j7036
8162a5127P3981Q67K1075K3615l8612n0440j7862O0837M8726m1592q324J6708
8150G3852Q277K5053L4693K1205l6935p9086p5395K3678N0280L6085l2118n5857
$$ y = [13857, 13638, 53897, 123888, 106092, 23438, 38662, 15918, -19180, 6840, 38373, 36175, 19309, 53819, 17124, -18790, -22380, 36566, 49735, 64309, 47202, 89395, 91323, -11300, -60035, -36386, -3193, -41514, -102150, -86565, -18192, -6086, 13872, 12864, 54530, 73940, 58837, 40457, 63150, 86205, 82766, 19679, 10542, 76062, 172544, 178205, 79470, 23878, 19999, 24202, -11938, -9744, 9581, 2116, -20959, -19607, -43692, 33290, 27713, -13816, 22621, 68608, 44996, -1056, 20266, 63829, 25344, 21585, -14642, -7726, -11819, -25945, 12179, 17942, 1909, -15127, 58854, 59721, 80796, 104411, 65799, 15359, -2503, 58334, 107060, 65468, 57144, 73852, 82129, 107182, 141875, 163080, 126145, 47059, -28336, -4658, 45622, 81707, 49589, -6268]
8138f268J2730L4368l535l4369j2766J8309J3051J5206J0278K3141Q616j138J4435
8125I2058k545J1559L174o7455l0126K0668o0404l3332p094j1026J8467O345K1401
8112c8310N2838K0910j0217j7421j0165L1858M7233J3756J6479j0904J001k2400
8100G4658j2726k3827M6913m205m8134k5081L0619k8449M5967j2019j16590k0773
8088i3647J758M2374J7451N044O3877M0284k2475J6025K3126m7940m9722o99k60
8075d804M0426N2364l4454q636K2409n506m7345J2941j295K5780J0229o411l0486
8062B5212O3278P9698k4747k3999M4154K7782k701k0134L0116M3136k7432m542
8050B09821l5736p7759m5329K1541M8600J6623O374j231m6878j0391j3989J8940
$$ y = [-6268, 6462, 40830, 37295, 2926, -9840, 8469, 21520, 36726, 47004, 70145, 78761, 77623, 92058, 89513, 101072, 104246, 36791, 6665, 27333, -33071, -66403, -73497, -84523, -66056, -59711, -38310, 14528, 35438, 25221, 7800, -2365, 29493, 76726, 90482, 106961, 96057, 97058, 74658, 61932, 38105, 85018, 80813, 32679, 7598, 38217, 9768, 55735, 43716, -72874, -93647, -91889, -49515, -32064, -27020, 36857, 77141, 54666, 70691, 93817, 45877, -3845, -4544, -4804, 35622, 87986, 53532, 44896, 67305, 61799, 14454, 27395, 26100, 51880, 62109, 55698, 25212, 88490, 168188, 143441, 119442, 163596, 191378, 188677, 168543, 198659, 241795, 214363, 209821, 174085, 96326, 50997, 72538, 121138, 137761, 144135, 142904, 96026, 85635, 71646, 90586]
8038I0586j3597k1968J239m7208L2184J0414P1732J0517j1553j9132r62J9920
8026A22172K4651j7532k6301q61n1757Q924M8022N7213k219J795k4244L7611K3127
8013B00601n3967j8246K3308K3277J4311Q098l0357k4295J7879j982k7945l0259
8001A00423n651L5317j6992j591n454N8263J8364k5802J7710m2494k8156l2728
7989G1209p935J5183N496n2463L9481K9379O2613N2827l2229r452M6178o3715
7977A56572p3134k2058L3750N9867k9165p11m5266Q22R596L2140K4217J0111k6340
7964A30401J7302m304l817P114m5805Q352k536P87O0608J6465n4366Q715J5104
7951A54020J8294J1396j8309M4500L7347k7851n4053j6692K8852J3872N3199J2133
$$ y = [90586, 76989, 55021, 56260, 9052, 41236, 51650, 123382, 133899, 122346, 103214, 102252, 122172, 146823, 129291, 102990, 102129, 50372, 59296, 107318, 164531, 162312, 164107, 139863, 177474, 200601, 146634, 128388, 151696, 174973, 189284, 197382, 167025, 142730, 160609, 158627, 130682, 100423, 94772, 130089, 113097, 111506, 106052, 164315, 182679, 156877, 174587, 132093, 103937, 71209, 63274, 78457, 83953, 31490, 70971, 100350, 162963, 215790, 183561, 174109, 220287, 156572, 83438, 61380, 95130, 154997, 125832, 125121, 79855, 80677, 90273, 122413, 146630, 156741, 130401, 147703, 143399, 139582, 146696, 100891, 109243, 106707, 107494, 168102, 184567, 130201, 138916, 154020, 172314, 183710, 165401, 209901, 247248, 219397, 165344, 148652, 177504, 191376, 244575, 256708]
7939B56708Q506j5760K009j3236q37K4043l4580L2305k3051k1497J8286l8514
7927A94382k6996K9536O7845m3546j7104l9775J6434k3648m2965K2810P7270L9293
7915B53536j5825n0267R878Q8390J8061j1820o2359O177k9031m1849L6353L2403
7903B33647L6226J5246k7476k6251R96j3599l7079o808l3163n2761M029K8272
7891A21279M2874M8457k8626q8178m718L1561L6897M2034j8227p7080k4984N1718
7879A33007p450L672K114l9744L7914L7354j822k9278l4779k4516M4059L4529
7867A55060o2954n1134P900P0242K5895j2378l8207m4568K01k7868k4881O6626
7855F3934L1567k863j3316K5662M5904J3154l7756j0519j8080J734p146K1359
$$ y = [256708, 265214, 249454, 251463, 238227, 237390, 261433, 226853, 259158, 236107, 214610, 232896, 194382, 167386, 196922, 264767, 221221, 204117, 164342, 180776, 157128, 114163, 136973, 214243, 253536, 237711, 187444, 197322, 285712, 303773, 291953, 229594, 235771, 206740, 164891, 201244, 233647, 269873, 285119, 257643, 231392, 232388, 218789, 181710, 174902, 141739, 88978, 93007, 121279, 164153, 212610, 183984, 95806, 91088, 122649, 159546, 201580, 183353, 106273, 81289, 133007, 125557, 129229, 131343, 91599, 129513, 166867, 165045, 135767, 100988, 76472, 120531, 155060, 92106, 40972, 48872, 119114, 145009, 132631, 94424, 49856, 50057, 22189, -2692, 63934, 95501, 92638, 79322, 104984, 150888, 164042, 126286, 115767, 97687, 99421, 92275, 113634]
7843A13634j2133l9082j1664J9856n4Q054N8106J1403l7262Q779J1493l8918m2516
7830D9696m0354L2192k3325k2566k6768K0238J4667L8203m666l802q028R027k1478
7817A3036j4333M499J6632k49K9370K0643l1736j0103l1623j2928M7567M0549
7805G1324r464j8310k2736K879J4624k6428o5054o2384j7906L7777K4780L0408
7793d0490M4363L1245j5424j164k511p819M4500R533m1194k6844J2552L3300J1403
7780E1450J2387K2373L5129j2989j7976j9494p9533j3317n992M733M8901O737
7768C2409q5339j6659J8132N2770M4420l3191j2813p1948R511L464j6900L0842
7756d5302K2780K710M4458K6367K8350M825m0018j5800k2815p3940k5941N4824
$$ y = [113634, 101501, 62419, 50755, 70611, 70557, 78611, 136717, 148120, 110858, 119637, 131130, 92212, 49696, 9342, 41534, 18209, -4357, -31125, -10887, 3780, 41983, 37317, 33515, 25487, 34514, 13036, -1297, 3202, 19834, 19585, 48955, 69598, 37862, 27759, -3864, -16792, 30775, 71324, 61860, 43550, 20814, 23693, 38317, 11889, -53165, -115549, -133455, -95678, -70898, -40490, 3873, 35118, 19694, 18530, 16019, 8200, 52700, 62233, 21039, -5805, 6747, 40047, 51450, 63837, 86210, 121339, 108350, 90374, 70880, -8653, -21970, -27962, -23229, 25672, 32409, -52930, -69589, -51457, 1313, 45733, 12542, -271, -72219, -62708, -59244, -76144, -45302, -22522, -19812, 24646, 51013, 79363, 84188, 44170, 28370, 5555, -68385, -94326, -39502]
7744c9502N1138K8695n1908j6021R126n5950m7294N8202K0829l77n3606K1201
7732g5467N7852O621o4988J5161K1699j3710R3247J0947n2484m6235K846M211
7720d0300q980l3273K198K7700N5433m7484m7874l840l66L3823n5802N7382N7715
7707c668J4576J944l2711o7710o206k7203L2148L7422k735l0680l4528M6293O6328
7694f730K8938j5158n2641q039n200j8453j2314j7742K5941O5206M0852m1892
7682a7232j6196j2404o381m7907j5478M9092N9333K9592m0847n081J5338L2828
7670B4657j8576R509L268l2245J9257J894m8584k5133k2937j4635L5670n6936
7658a24791j2703L9910N8157k1701J6125M4509M3632l9223m0054O5275j2718l7201
$$ y = [-39502, 11636, 40331, -11577, -27598, -18472, -74422, -121716, -63514, -42685, -43062, -96668, -75467, -17615, -10994, -75982, -60821, -39122, -52832, 40415, 51362, -1122, -47357, -44511, -40300, -49280, -82553, -80355, -52655, 2778, -44706, -92580, -96420, -96786, -62963, -118765, -61383, -3668, 10908, 12852, -19859, -87569, -93775, -120978, -88830, -51408, -54143, -84823, -119351, -73058, -6730, 22208, 7050, -45591, -53630, -58830, -77283, -89597, -107339, -81398, -16192, 24660, -17232, -33428, -45832, -52213, -100120, -115598, -66506, -7173, 22419, -18428, -23509, -8171, 24657, 6081, 15590, 18858, -13387, 5870, 7764, -40820, -65953, -88890, -103525, -67855, -124791, -137494, -97584, -39427, -61128, -45003, -494, 43138, 3915, -36139, 29136, 16418, -20783]
7646b0783N814K4978L8308m2815r854J2856l2678N3637J4769m347p914j4538M678
7633B2111p974J401Q592L2695r390o0681j7305J4425j205M4475P7056p305j7079
7620G9816n4399o288O511q885q468m0288l1717K8118L5594L3664q041J9234l5640
7607I211k4080O1318M4161j4028j2293n1007p7951k6739N4482Q383k7667j1342
7595f7552J6119K8627N95k3334M5915J7531n2997q870J1787J6867L5845N7857
7583G8390J4526k8765k4422j3524p4068l0693M1866Q8922k239J7038m1818R977
7571C5190J5105j3086l8656L3077K4369m1448l3739N3598r038J8175J2356k8260
7559B7643P241J7465j227k0928j0346L3427K1867j4207l4043m3745j7587L966
$$ y = [-20783, -14969, 10009, 48317, 5502, -4352, 8504, -24174, 29463, 44232, 39885, 31971, 17433, 22111, 14137, 15538, 24130, 56825, 47435, -13246, -30551, -16126, -17331, 27144, 104200, 96895, 79816, 25417, 19129, 25640, 16755, 8287, -32001, -63718, -35600, -6, 33658, 25617, 44851, 9211, -14869, 46449, 90610, 76582, 64289, 13282, -64669, -91408, -36926, -28543, -56210, -67552, -51433, -22806, -22211, -45545, 370, 17901, -35096, -43966, -32179, -15312, 20533, 78390, 92916, 64151, 39729, 26205, -47863, -78556, -36690, 52232, 49993, 67031, 25213, 35190, 50295, 37209, -1447, 31630, 55999, 14551, -19188, 34410, 25372, 43547, 55903, 27643, 34884, 52349, 51122, 30194, 19848, 53275, 75142, 60935, 26892, -16853, -34440, -30474]
7547c0474K1722J7688K9422k5140J0331j497J4602K3234m156m9116L2875K184
7535D1675j1754j7132J3195M652M483m0743M444P015n8419n322m1712j5401L440
7522a11579k8720k1275M3077N0402J5115N6378l585k0326L7656k2819k0770l9528
7510f5974n387L560K5902K11O7945J4510j559m8161p2012N1411O9288p645j5013
7497A7076n6314l1970N794M0517l5982n191M8818J4591l2252l7057J1820J6803
7485d3347k8199J3156k3845K3430P6815P991j4064m5778j7003k6369K8266L4231
7473a4716l06k5370r454k892k7562L3496j9634j9457l047Q3913K6655l3737K0549
7460H438L520l9374j4424J402j3453l34N6481M513o2804k3585J8330K043j89j2049
$$ y = [-30474, -8752, 8936, 38358, 13218, 23549, 22052, 36654, 59888, 55732, 6616, 39491, 41675, 29921, 12789, 25984, 30636, 35119, -5624, -1180, 5835, -52584, -57906, -99618, -115019, -111579, -140299, -161574, -118497, -68095, -52980, 3398, -187, -20513, 17143, -5676, -26446, -65974, -71361, -67801, -41899, -41688, 26257, 40767, 39208, -8953, -80965, -29554, 39734, 32089, 17076, -39238, -71208, -65414, -24897, -60879, -66070, -17252, -2661, -34913, -71970, -60150, -43347, -71546, -58390, -82235, -58805, 18010, 26001, 11937, -33841, -50844, -77213, -48947, -14716, -15022, -40392, -49846, -52738, -80300, -46804, -66438, -85895, -88942, -5029, 21626, -12111, 8438, 11958, -27416, -41840, -40438, -53891, -54225, 2256, 6769, -56035, -79620, -61290, -59247, -59436, -71485]
7446g1485K4568K4401K9464j6093l2227l3398k3348Q7P1259j0411J5460N9306
7434C7583J5185m7427j9751Q380N9825L40N748k8598k6032p4618j6424k023J728
7421h6084P0075L8950K2778Q774m3186n6078N3835O9260j4467o2829k6893K4955
7409i10L1837J7030J3757p0579l0138L4339L3466l1854K2016K6009n9496k1570
7397c6093r314l4080M0582Q923N361J8500J2751n503N4273K4088p1430k7960N9097
7384C9195J0641O067O9381k2805l1414j2140R956J3371m4278j6114O835k3039
7372E656k7328l683l278k2950k808m353l204L737l964k3498K249J6443P0914k3909
7358a9976L4866O2447j8138k0568l4673j9246j260J0204k5101j724o0738o8617
$$ y = [-71485, -46917, -22516, 6948, -9145, -41372, -74770, -98118, -98031, -26772, -37183, -21723, 37583, 52768, 5341, -14410, -6030, 53795, 54135, 59883, 31285, 5253, -69365, -85789, -87812, -86084, -16009, 22941, 45719, 54493, 11307, -44771, 9064, 78324, 63857, 1028, -25865, -910, 30927, 47957, 61714, -8865, -39003, -4664, 28802, -3052, 18964, 44973, -14523, -36093, -45407, -79487, -38905, -29982, -24621, -6121, 6630, 1127, 55400, 79488, 8058, -19902, 39195, 49836, 55903, 125284, 102479, 71065, 58925, 68881, 82252, 37974, 21860, 28695, 5656, -21672, -25355, -28633, -51583, -54391, -58744, -61948, -58211, -62175, -85673, -83424, -66981, 3933, -19976, 14890, 77337, 59199, 38631, 3958, -15288, -16548, -6344, -31445, -33169, -93907, -162524]
7346a62524m027N3418R9575K8954k6421j6500j6374M5746p273r192L6372J4500
7334C6254k4339l0919n4877J0633j7649K2090M7580m5485m3590p972N366L4649
7322f8259P6641O0080J1972R084m6735j24198j1322J5311j3820J5625j0878J7749
7310f8750L9844k2211j6834J388q238l345l1200L2166K5002K4903M5757N9662
7298G8144L8372p2370o0867l4213j3220j558p235j9189O0258N7500K179m7481
7286a9680l8714J0529j1329L0209n068k9913N6724P6797L6150j7405p4850m7803
7274c4353j0309l5707l0543j9309K0548N2119Q0995K1926J4109l1368K8207p153
7262D9162O015l861l2394j3018L1941N203K758j218k2680n7422P735K2163J3110
$$ y = [-162524, -166551, -113133, -13558, 15396, -11025, -27525, -43899, 1847, -5426, -14618, 21754, 36254, 11915, -19004, -73881, -63248, -80897, -58807, -11227, -56712, -100302, -108274, -102908, -68259, 8382, 68462, 80434, 89518, 42783, -81415, -92737, -77426, -91246, -75621, -86499, -68750, -28906, -51117, -67951, -66563, -74801, -78146, -109346, -77180, -52178, -27275, 18482, 78144, 116516, 44146, -16721, -50934, -64154, -65712, -72947, -92136, -31878, 25622, 27801, -19680, -58394, -47865, -59194, -28985, -34053, -63966, -7242, 69555, 105705, 88300, 13450, -34353, -44662, -80369, -110912, -130221, -109673, -57554, 23441, 45367, 59476, 28108, 56315, 49162, 55177, 51316, 18922, 5904, 37845, 43048, 45806, 44588, 21908, -35514, -27779, -5616, 7494]
7249G494J4530K7794l3339q6994L482j7677J1655K8771M6588q71o0307O994k4699
7236g6579j7234k0086M2391N8573N5894l2990O926J0146m0184k792M427n6129
7224f7637m2603k5823k4892L544N1648J5306N762J8131N824M640j2204J1996J4720
7211d1588j4434q9939j7584M5548L7726O7415M6359L0160K7913K0707n3796r5232
7199c6745m0904K8176O9027J8954k8160l8970p9171N5614N2372M138J7261K3212
7187D4804l3632k9950k3874k6334j0863l481K5233L8576j5907l1099J5397k4704
7175g5834o638Q8966Q6448n897r1671l0988M0937m688j5950j8012N4846N5113
7163G6632N2464J2502o2858P353j5676m0808O4500O7661k7151q6274n2191o5803
$$ y = [7494, 22024, 49818, 16479, -70515, -67033, -84710, -73055, -44284, 2304, 1433, -58874, -51880, -76579, -93813, -113899, -71508, -12935, 42959, 9969, 16895, 27041, -13143, -15935, -11508, -67637, -110240, -136063, -160955, -157411, -105763, -90457, -84695, -66564, -60740, -56100, -68304, -56308, -41588, -56022, -145961, -163545, -117997, -80271, -12856, 33503, 63663, 91576, 112283, 58487, -36745, -77649, -49473, 19554, 38508, 10348, -28622, -107793, -52179, 193, 4331, 21592, 44804, 11172, -18778, -42652, -68986, -79849, -83330, -58097, -19521, -35428, -66527, -51130, -75834, -82472, 6494, 92942, 87045, -4626, -35614, 5323, 635, -15315, -33327, 21519, 76632, 129096, 141598, 78740, 86093, 70417, 29609, 94109, 161770, 134619, 48345, -3846, -69649]
7151f9649n7536m5552p675N7629J3520J7646k2463l8473K0983M6516L4042L244
7139d7768O1424J887K5744l7321l2885k7892L8983M3249m7578K4785L1441k4863
7127I206J9943q693K0898m1707n0934n5994K1376J4164l9777O3316O2908J4532
7115B9238k457n2437k403N4538L403Q978m7456J1269j9795M2798M5626L5586m4894
7102F1994p2773m0924n3886k2664J5832l519o108L5338O5862K543j132q877l201
7089c1515l007K3944Q5899p132n9696n3276M7486L5480k6847l3372K6336K5013
7077B9313p0556k5270L7127l544j6601O513k3475j2850m1418M4281O8089R366
7065I75k7167k1876J7774l8165r03p393M4207l087j2855M0373J4871l981L264
$$ y = [-69649, -127185, -172737, -180412, -122783, -109263, -91617, -114080, -152553, -131570, -85054, -51012, -47768, 13656, 15543, 41287, 3966, -28919, -56811, -17828, 25421, -22157, 2628, 34069, 9206, 29149, 20456, 41354, -353, -51287, -107281, -85905, -71741, -111518, -48202, 14706, 29238, 26781, -25656, -28059, 26479, 29882, 38860, -8596, 2673, -17122, 25676, 71302, 106888, 61994, -10779, -51703, -105589, -128253, -112421, -115940, -122048, -86710, -20848, -18305, -19437, -28314, -31515, -34522, -10578, 75321, 68189, 8493, -44783, 2703, 38183, 11336, -22036, 4300, 29313, -41243, -66513, -29386, -32930, -49531, -43018, -66493, -79343, -120761, -76480, -8391, 975, -26192, -48068, -30294, -68459, -69362, -76755, -32548, -35635, -48490, -8117, 6754, 2773, 6037]
7052F037n2687l0243q46n084O3572J1417Q360J7023l0023l9678J8740j2842l9353
7039h5607n0859l8595j5034M8374N9031L7012K4560p671K1510K0756m5597k0651
7027e2771L6817M7428k4895j2895k1744L564o967P916l59q163m5937k50p194J4326
7013g1124L5056j6084J1647J2156j5916L6420K5288p0088m6439N3736J7413L1471
7001C536K509l1436O4529K8530o7142k1524M8051K8761m3170J4007J1526n0935
6989a2758k3989j4653l4984m031L7073J82l0620K5632M5698P716n2938L1432K9033
6976B793K1640m7133L584K1616n5994k0623n4671L0274m106K3518O0127L8711
6964A9736k2383l6006J8761J4512K4150J6404m1877n7555K6133L4423O5641j7263
$$ y = [6037, -46650, -76893, -77739, -82823, -19251, -7834, 526, 17549, -12474, -52152, -33412, -46254, -85607, -136466, -175061, -190095, -141721, -82690, -45678, -21118, -28789, -7279, 13477, -32120, -52771, -15954, 31474, 6579, -6316, -28060, -24496, -31463, -23547, -23906, -32069, -78006, -78256, -85450, -71124, -36068, -52152, -40505, -28349, -44265, -7845, 17443, -52645, -99084, -45348, -27935, 3536, 6045, -25391, 39138, 67668, 526, -20998, 27053, 55814, 12644, 26651, 38177, -12758, -36747, -51400, -86384, -90415, -53342, -53160, -83780, -58148, -12450, -4734, -57672, -26240, 2793, 24433, -22700, -19116, 2500, -53494, -74117, -128788, -98514, -102620, -79102, -18975, 19736, -2647, -38653, -19892, -5380, 18770, 35174, -6703, -64258, -38125, -3702, 61939, 44676]
$$ [...]
##END NTUPLES=NMR SPECTRUM
##END=
