##TITLE=Analysis number 321064
Compound Code cc 60304
Book Reference 470/63
Project Code adrs
Chemist Name mikem
##JCAMPDX= 6.0         $$ Bruker NMR JCAMP-DX V2.0
##DATA TYPE= NMR SPECTRUM
##DATA CLASS= NTUPLES
##ORIGIN= Bruker BioSpin GmbH
##OWNER= nmr
$$ XWIN-NMR		Version 3.5
$$ Fri Jul 21 13:16:29 2006 GMT Daylight Time (UT+1h)  MAYBRIDGE\nmr@NMR_250MHZ
##.OBSERVE FREQUENCY= 250.131544655141
##.OBSERVE NUCLEUS= ^1H
##.ACQUISITION MODE= SIMULTANEOUS (DQD)
##.ACQUISITION SCHEME= undefined
##.AVERAGES= 16
##.DIGITISER RES= 18
##SPECTROMETER/DATA SYSTEM= dpx250
##.PULSE SEQUENCE= zg30
##.SOLVENT NAME= CDCl3
##.SHIFT REFERENCE= (INTERNAL, CDCl3, 0, 16.522)
##AUDIT TRAIL= $$ (NUMBER, WHEN, WHO, WHERE, WHAT)
$$ ##TITLE= Audit trail, XWIN-NMR		Version 3.5
$$ ##JCAMPDX= 5.01
$$ ##ORIGIN= Bruker BioSpin GmbH
$$ ##OWNER= nmr
$$ C:\u/data/dgb/nmr/ADRS/3240/pdata/1/auditp.txt
$$ ##AUDIT TRAIL=  $$ (NUMBER, WHEN, WHO, WHERE, WHAT)
(   1,<2006-07-21 13:16:06.19 +100>,<MAYBRIDGE\nmr>,<NMR_250MHZ>,
      <created by zg, POWCHK disabled, PULCHK disabled
       configuration hash MD5:
       E2 DF 36 D8 04 B2 41 60 5A D7 A3 38 5A 4B D0 FE
       data hash MD5: 64K
       84 7C C0 19 89 40 89 7E 97 6B 07 4B B7 5D 78 DD>)
(   2,<2006-07-21 13:16:20.80 +100>,<MAYBRIDGE\nmr>,<NMR_250MHZ>,
      <Start of raw data processing
       ef LB = 0.3 FT_mod = 6 PKNL = 1 SI = 32K 
       data hash MD5: 32K
       23 A2 31 F3 4D C0 7D A2 7A CB ED A0 88 CA 9C 23>)
(   3,<2006-07-21 13:16:22.30 +100>,<MAYBRIDGE\nmr>,<NMR_250MHZ>,
      <apk 
       data hash MD5: 32K
       72 77 8D 79 28 D3 4D 3C 5A B7 DD FB 41 B2 DB DF>)
(   4,<2006-07-21 13:16:23.06 +100>,<MAYBRIDGE\nmr>,<NMR_250MHZ>,
      <abs ABSG = 5 
       data hash MD5: 32K
       D6 18 4C DF E4 52 00 FF EE 76 B1 33 5D 4A 73 F9>)
$$ ##END=
$$ 
$$ hash MD5
$$ 75 B7 C1 C9 85 FD A6 1F 3C B7 78 1C 3E 6E 7D E5
##$RELAX= 
##$RELAX= 
##$RELAX= 
##$RELAX= 
##$RELAX= 
##$RELAX= 
##$RELAX= 
$$ Bruker specific parameters
$$ --------------------------
##$DU= <C:\u>
##$EXPNO= 3240
##$NAME= <ADRS>
##$PROCNO= 1
##$TYPE= <nmr>
##$USER= <dgb>
##$AMP= (0..31)
100 100 100 100 100 100 100 100 100 100 100 100 100 100 100 100 100 100 
100 100 100 100 100 100 100 100 100 100 100 100 100 100 
##$AQSEQ= 0
##$AQ_mod= 3
##$AUNM= <au_zg>
##$AUTOPOS= <21 >
##$BF1= 250.13
##$BF2= 250.13
##$BF3= 250.13
##$BF4= 250.13
##$BF5= 500.13
##$BF6= 500.13
##$BF7= 500.13
##$BF8= 500.13
##$BYTORDA= 1
##$CFDGTYP= 0
##$CFRGTYP= 5
##$CHEMSTR= <none>
##$CNST= (0..31)
1 1 145 1 1 1 1 1 1 1 1 1 1 1 1 1 1 1 1 1 1 1 1 1 1 1 1 1 1 1 1 1 
##$CPDPRG= <>
##$CPDPRG1= <>
##$CPDPRG2= <>
##$CPDPRG3= <>
##$CPDPRG4= <mlev>
##$CPDPRG5= <mlev>
##$CPDPRG6= <mlev>
##$CPDPRG7= <mlev>
##$CPDPRG8= <mlev>
##$CPDPRGB= <>
##$CPDPRGT= <>
##$D= (0..31)
0 1 0 0 0 0 0 0 0 0.06 0 0 0 0 0 0 0.0002 0 0 0 0 0 0 0 0 0 0 0 0 0 0 
0 
##$DATE= 1153484165
##$DBL= (0..7)
120 120 120 120 120 120 120 120 
##$DBP= (0..7)
150 150 150 150 150 150 150 150 
##$DBP07= 0
##$DBPNAM0= <>
##$DBPNAM1= <>
$$ [...]
##$SUBNAM7= <"">
##$SUBNAM8= <"">
##$SUBNAM9= <"">
##$SW= 20.6930455092707
##$SWIBOX= (0..15)
0 0 3 0 0 0 0 0 0 0 0 0 0 0 0 0 
##$SW_h= 5175.983436853
##$TD= 65536
##$TD0= 1
##$TE= 295.16
##$TE2= 300
##$TE3= 300
##$TEG= 300
##$TL= (0..7)
0 120 120 120 120 120 120 120 
##$TP= (0..7)
150 150 150 150 150 150 150 150 
##$TP07= 0
##$TPNAME0= <>
##$TPNAME1= <>
##$TPNAME2= <>
##$TPNAME3= <>
##$TPNAME4= <>
##$TPNAME5= <>
##$TPNAME6= <>
##$TPNAME7= <>
##$TPOAL= (0..7)
0.5 0.5 0.5 0.5 0.5 0.5 0.5 0.5 
##$TPOFFS= (0..7)
0 0 0 0 0 0 0 0 
##$TUNHIN= 0
##$TUNHOUT= 0
##$TUNXOUT= 0
##$USERA1= <user>
##$USERA2= <user>
##$USERA3= <user>
##$USERA4= <user>
##$USERA5= <user>
##$V9= 5
##$VALIST= <valist>
##$VCLIST= <CCCCCCCCCCCCCCC>
##$VD= 0
##$VDLIST= <DDDDDDDDDDDDDDD>
##$VPLIST= <PPPPPPPPPPPPPPP>
##$VTLIST= <TTTTTTTTTTTTTTT>
##$WBST= 1024
##$WBSW= 4
##$XGAIN= (0..3)
0 0 0 0 
##$XL= 0
##$YL= 0
##$YMAX_a= 336160
##$YMIN_a= -576144
##$ZGOPTNS= <>
##$ZL1= 120
##$ZL2= 120
##$ZL3= 120
##$ZL4= 120
##$ABSF1= 16.522
##$ABSF2= -4.171173
##$ABSG= 5
##$ABSL= 3
##$ALPHA= 0
##$AQORDER= 0
##$ASSFAC= 0
##$ASSFACI= 0
##$ASSFACX= 0
##$ASSWID= 0
##$AUNMP= <proc_1d>
##$AZFE= 0.1
##$AZFW= 0.1
##$BCFW= 0
##$BC_mod= 0
##$BYTORDP= 0
##$COROFFS= 0
##$CY= 12.5
##$DATMOD= 1
##$DC= 0
##$DFILT= <>
##$DTYPP= 0
##$F1P= 14.0000005364418
##$F2P= -0.99999901652339
##$FCOR= 0.5
##$FTSIZE= 32768
##$FT_mod= 6
##$GAMMA= 0
##$GB= 0
##$INTBC= 1
##$INTSCL= 1
##$ISEN= 128
##$LB= 0.3
##$LEV0= 0
##$LPBIN= 0
##$MAXI= 10000
##$MC2= 0
##$MEAN= 0
##$ME_mod= 0
##$MI= 0
##$NCOEF= 0
##$NC_proc= -4
##$NLEV= 6
##$NOISF1= 0
##$NOISF2= 0
##$NSP= 0
##$NTH_PI= 0
##$NZP= 0
##$OFFSET= 16.522
##$PC= 1
##$PHC0= 164.1962
##$PHC1= 4.505126
##$PH_mod= 1
##$PKNL= yes
##$PPARMOD= 0
##$PSCAL= 4
##$PSIGN= 0
##$REVERSE= no
##$SF= 250.13
##$SI= 32768
##$SIGF1= 0
##$SIGF2= 0
##$SINO= 400
##$SIOLD= 32768
##$SREGLST= <1H.CDCl3>
##$SSB= 0
##$STSI= 32768
##$STSR= 0
##$SW_p= 5175.98343685301
##$SYMM= 0
##$S_DEV= 0
##$TDeff= 65536
##$TDoff= 0
##$TI= <Analysis number 999999
Compound Code 99
Book Reference 9
Project Code 9>
##$TILT= no
##$TM1= 0
##$TM2= 0
##$TOPLEV= 0
##$USERP1= <user>
##$USERP2= <user>
##$USERP3= <user>
##$USERP4= <user>
##$USERP5= <user>
##$WDW= 1
##$XDIM= 32768
##$YMAX_p= 415536884
##$YMIN_p= -213566
$$ End of Bruker specific parameters
$$ ---------------------------------
##NTUPLES= NMR SPECTRUM
##VAR_NAME=  FREQUENCY,     SPECTRUM/REAL,   SPECTRUM/IMAG
##SYMBOL=    X,             R,               I
##VAR_TYPE=  INDEPENDENT,   DEPENDENT,       DEPENDENT
##VAR_FORM=  AFFN,          ASDF,            ASDF
##VAR_DIM=   32768,         32768,           32768
##UNITS=     HZ,            ARBITRARY UNITS, ARBITRARY UNITS
##FACTOR=    0.157963299565203, 1,           1
##FIRST=     4132.6476996994, 0,             0
##LAST=      -1043.33573715361, 0,           0
##MIN=       -1043.33573715361, -213566,     0
##MAX=       4132.6476996994, 415536884,     0
$$ Real data points
##PAGE= N=1
##DATA TABLE= (X++(R..R)), XYDATA
$$ [...]
$$ plain form
15835 -28805 -31644 -31953 -12006 58962 89847 33376 5171 -42656 -34094 38726 41501 42 641
15822 641 3124 35536 19099 -20717 -35027 -45415 -4288 33120 9096 -29059 -42247 -72759
15810 -72759 -82156 -52683 18653 54313 -3233 -42140 -57619 -24265 43397 39418 22094 2459
15798 2459 19927 -18783 -31178 872 16744 2311 -9757 -1252 -56916 -77124 -13244 74543
15786 74543 86176 45474 84693 82511 17768 41628 31896 -25630 -50336 28983 65677 8441
15774 8441 -29716 -39985 -48253 -44136 -3209 -6855 -60640 -19900 50312 10386 -61205 -92737
15762 -92737 -29796 -25523 -33424 -44626 -84396 -79312 -72872 -1111 -2302 -31053 -9662 -62024 -61509
15749 -61509 -55719 -29705 21895 46468 49534 35645 -12120 -17168 -17923 -11424 4914 -44824 -39033
$$ packed form
15835b8805k839l09J9947P0968L0885n6471k8205m7827Q562P2820K775m1459N99
15822F41K483L2412j6437l9816j4310j0388M1127L7408k4024l8155j3188l0512
15810g2759r397K9473P1336L5660n7546l8907j5479L3354O7662l979j7324j9635
15798B459J7468l8710j2395L2050J5872j4433j2068Q505n5664k0208O3880Q7787
15786G4543J1633m0702L9219k182o4743K3860r732n7526k4706P9319L6694n7236
15774H441l8157j0269q268M117M0927l646n3785M0740P0212l9926p1591l1532
15762i2737O2941M273p901j1202l9770N084O440P1761j191k8751K1391n2362N15
15749f1509N790K6014N1600K4573L066j3889m7765n048p55O499J6338m9738N791
$$ plain form
15736 -39033 -18872 8752 2736 5587 -17606 -12718 -1451 16049 5728 -10077 -23155 16582
15724 16582 73159 58214 45714 50239 49216 15597 -37547 -71268 -55142 -92865 -28103 60478
15712 60478 71332 39984 59831 109908 80917 101439 116171 63412 35190 61279 25928 8584
15700 8584 57385 51755 55601 65758 61385 40643 11268 -16888 -27289 32153 1480 -42191
15688 -42191 -41638 -53800 -10579 17780 1563 -19475 -52958 -51847 -31255 -6109 -9832 26874
15676 26874 14240 15651 36168 32376 53872 35911 2970 18799 23007 14157 -14050 -48593
15664 -48593 -40002 -51380 -18555 26045 28 -31126 -22975 -60978 -75530 -49412 -22205 -18594
15652 -18594 -37840 -21036 -4767 -63671 -86934 -34164 8111 -44149 -71040 -83198 -58331 -69587
$$ packed form
15736c9033K0161K7624o016K851k3193M888J1267J7500j0321j5805j3078L9737
15724A6582N6577j4945j2500M525j023l3619n3144l3721J6126l7723O4762Q8581
15712F0478J0854l1348J9847N0077k8991K0522J4732n2759k8222K6089l5351j7344
15700H584M8801n630L846J0157m373k0742k9375k8156j0401N9442l0673m3671
15688d2191N53j2162M3221K8359j6217k1038l3483J111K0592K5146l723L6706
15676B6874j2634J411K0517l792K1496j7961l2941J5829M208q850k8207l4543
15664d8593Q591j1378L2825M4600k6017l1154Q151l8003j4552K6118K7207L611
15652a8594j9246J6804J6269n8904k3263N2770M2275n2260k6891j2158K4867j1256
$$ plain form
15640 -69587 -88953 -65728 -92751 -21088 34261 228 -67726 -89559 -85179 -57767 -67820 -68488
15628 -68488 -53232 -30275 -20359 -81597 -94422 -34544 -14833 -52866 -33241 -32672 7074 9115
15616 9115 -32351 -63211 -45637 -32661 -53766 -72234 -77073 -54651 -42315 -1394 57642 86796
15604 86796 75093 50051 50204 1269 -98221 -115946 -85318 -63274 -56386 4862 26588 12400
15592 12400 38603 45464 19486 21738 42869 33247 3272 22869 3762 -525 -4952 -58202 -70705
15579 -70705 -76839 -93904 -94525 -587 27753 89430 78975 24719 5009 12230 24649 -17560
15567 -17560 26747 4449 -21822 -26050 17426 92452 97001 76725 64528 55442 -18027 -109169
15555 -109169 -65953 -57045 -78380 -51348 -16817 -26664 -65314 -34445 -15270 -21972 -42446 -22803
$$ packed form
15640f9587j9366K3225k7023P1663N5349l4033o7954k1833M380K7412j0053o68
15628f8488J5256K2957R916o1238j2825N9878J9711l8033J9625N69L9746K041
15616I115m1466l0860J7574J2976k1105j8468m839K2422J2336M0921N9036K9154
15604H6796j1703k5042J53m8935r9490j7725L0628K2044O888O1248K1726j4188
15592A2400K6203O861k5978K252K1131r622k9975J9597j9107m287m427n3250j2503
15579g0705o134j7065o21R3938K8340O1677j0455n4256j9710P221J2419m2209
15567a7560M4307k2298k6271m228M3476P5026M549k0276j2197r086p3469r1142
15555a09169M3216Q908k1335K7032L4531r847l8650L0869J9175o702k0474J9643
$$ plain form
15543 -22803 -4846 14588 -20331 -6099 -28933 -32150 -43383 -65501 -50497 -84570 -53472 -63756
15531 -63756 -48572 -17328 -49845 -5218 7358 510 -30552 -43086 -29583 -5859 -21345 -26091
15519 -26091 -11935 -53726 -103516 -105893 -60315 -32107 -56542 -85021 -93302 -81031 -54347 -21621
15507 -21621 -18 4983 -44369 -42331 -1256 51214 96307 84486 36908 50955 34138 -15623
15495 -15623 13850 77368 78777 65298 27327 39182 41020 70134 -2240 -33739 -20262 -70116
15483 -70116 -54913 -36776 -32021 -38806 -12989 285 -34791 -45637 -58164 -7157 50934 88884
15471 88884 54485 21749 -28195 -49434 -63217 -33136 -43584 -103303 -48276 -8657 -1732 -75082
15459 -75082 -94485 -82122 -48821 65880 80036 74575 50358 6869 -10024 11461 27575 -655
$$ packed form
15543b2803J7957J9434l4919J4232k2834l217j1233k2118J5004l4073L1098j0284
15531f3756J5184L1244l2517M4627J2576o848l1062j2534J3503K3724j5486m746
15519b6091J4156m1791m9790k377M5578K8208k4435k8479q281J2271K6684L2726
15507b1621K1603N001m9352K038M1075N2470M5093j1821m7578J4047j6817m9761
15495a5623K9473O3518J409j3479l7971J1855J838K9114p2374l1499J3477m9854
15483g0116J5203J8137M755o785K5817J3274l5076j0846j2527N1007N8091L7950
15471H8884l4399l2736m9944k1239j3783L0081j0448n9719N5027L9619O925p3350
15459g5082j9403J2363L3301J14701J4156n461k4217m3489j6893K1485J6114k8230
$$ plain form
15447 -655 -43141 -41311 -19267 44027 89014 92643 65117 51187 34241 14993 40612 46622 86819
15434 86819 47118 18765 -42916 -95250 -95510 -93550 -89206 -110489 -99334 -23882 52347 17005
15422 17005 5758 50394 50633 51265 16037 1492 35286 55198 51991 70975 14034 -43854 -75454
15409 -75454 -64507 15098 57866 87294 51064 -3440 -33347 -49945 -28558 -11117 35425 53686
15397 53686 63795 56685 7697 -58094 -56580 -64844 -27411 -13265 -565 26280 32009 47777
15385 47777 87291 91217 26859 -9233 -21424 -15481 -10722 -57676 -35312 -15407 -9067 -75196
15373 -75196 -54798 -28895 -54424 -56901 -67436 -44170 -8772 -10473 -43121 -24247 -29637 -29069 15028
15360 15028 30428 12188 1234 -2668 -17739 -1415 16120 -14915 -26997 -18183 -8414 2659
$$ packed form
15447f55m2486J830K2044O3294M4987L629k7526j3930j6946j9248K5619O010M0197
15434H6819l9701k8353o1681n2334k60J960M344k1283J1155P5452P6229l5342
15422A7005j1247M4636K39O32l5228j4545L3794J9912l207J8984n6941n7888l1600
15409g5454J0947P9605M2768K9428l6230n4504k9907j6598K1387J7441M6542J8261
15397E3686J0109p110m8988o5791J514q264L7433J4146J2700K6845N729J5768
15385D7777L9514L926o4358l6092j2191N943M759m6954K2364J9905O340o6129
15373g5196K0398K5903k5529k477j0535K3266L5398j701l2648J8874n390N68M4097
15360A5028J5400j8240j0954l902j5071J6324J7535l1035j2082Q814R769J1073
$$ plain form
15348 2659 -3238 15394 44291 15282 4214 61530 81654 45543 -10832 -30818 -23592 -29992
15336 -29992 718 15931 24495 13408 16602 73565 78151 101263 100082 72626 80632 44356 -25304
15323 -25304 -19134 28403 19257 37532 65314 81100 70052 18562 2071 -17029 -30763 8572
15311 8572 44922 -5203 -19073 4933 16776 17771 -66364 -131805 -137046 -139288 -77904 -19922 57906
15298 57906 24164 26546 85694 93107 56933 11564 -12858 16244 -25284 -67359 -13780 -5474
15286 -5474 -12575 -1368 -7368 -74972 -66659 -51212 -53796 -34125 -15998 -72145 -10268 -12182 -33362
15273 -33362 -22862 -31815 -105429 -138393 -88583 -90298 -106309 -66188 -63373 -46524 -71426 -67797
15261 -67797 -21970 19297 48335 54596 31429 -4544 -15817 -34219 -61804 -53061 -45594 -25473
$$ packed form
15348B659n897J8632K8897k9009j1068N7316K0124l6111n6375j9986P226o400
15336b9992L0710J5213Q564j1087L194N6963M586K3112j181k7456Q006l6276o9660
15323b5304O170M7537r146J8275K7782J5786j1048n1490j6491j9100j3734L9335
15311H572L6350n0125j3870K4006J1843R95q4135o5441n241k242O1384N7982P7828
15298E7906l3742K382N9148P413l6174m5369k4422K9102m1528m2075N3579Q306
15286e474p101J1207o000o7604Q313J5447k584J9671J8127n6147O1877j914k1180
15273c3362J0500q953p3614l2964M9810j715j6011M0121K815J6849k4902L629
15261f7797M5827M1267K9038O261k3167l5973j1273j8402k7585Q743P467K0121
$$ plain form
15249 -25473 -55429 -40622 -68830 -50987 24859 59612 36503 5161 -1064 17093 11211 31150
15237 31150 78210 61906 51381 33469 -32854 -65142 -68225 -89726 -15191 24625 63206 56958
15225 56958 -3628 -10479 7891 16784 14079 21301 12552 13415 22087 16417 -13644 -7755 -2569 -2410
15211 -2410 12102 30153 43802 46646 70821 108629 88294 72528 36428 47541 37964 28744
15199 28744 47426 35194 -29520 -91116 -161281 -169568 -59507 -21939 -51398 -44585 -100112 -76591
15187 -76591 -66557 -109770 -116764 -90333 -101402 -91949 -56330 -63586 -52029 -54876 -26787 12277
15175 12277 23702 3458 30013 71418 54041 8835 -37118 -50752 -39189 -46793 8206 74676
15163 74676 120173 86832 38914 46412 45721 23683 62827 68437 51482 22743 -55861 -49921 -52506
$$ packed form
15249b5473k9956J4807k8208J7843P5846L4753k3109l1342o225J8157n882J9939
15237C1150M7060j6304j0525j7912o6323l2288l083k1501P4535L9816L8581o248
15225E6958o0586o851J8370Q893k705P222q749Q63Q672n670l0061N889N186J59
15211b410J4512J8051J3649K844K4175L7808k0335j5766l6100J1113r577r220
15199B8744J8682j2232o4714o1596p0165q287J10061L7568k9459O813n5527K3521
15187g6591J0034m3213o994K6431j1069R453L5619p256J1557k847K8089L9064
15175A2277J1425k0244K6555M1405j7377m5206m5953j3634J1563p604N4999O6470
15163G4676M5497l3341m7918P498o91k2038L9144N610j6955k8739p8604N940k585
$$ plain form
15150 -52506 -37932 -14254 11703 36587 -29801 -59783 -72787 -83954 -54879 -27237 -22204 -19903
15138 -19903 5124 36175 27963 2954 -29473 -55219 -7921 -16769 -62255 -7984 34263 58309
15126 58309 42035 22206 -14898 -33101 -68419 -59845 25518 61871 30155 64708 74047 51172
15114 51172 -3763 -21569 -2831 -52842 -75475 -37882 -53494 -102922 -107160 -127486 -120440 -61072
15102 -61072 -55661 -37073 -43874 -91081 -61614 -65266 -32745 -30371 8631 18151 -15432 -28126 -20530
15089 -20530 -48640 3385 23596 53736 89884 84183 40580 25434 -2542 -49958 -68259 -72121
15077 -72121 -38611 -51679 -40821 -38360 9470 66821 56441 64695 45069 26434 -9686 -51778
15065 -51778 -31128 -2751 -17250 -34144 -41662 -89905 -126102 -131005 -89246 -62209 -61187 -97115
$$ packed form
15150e2506J4574K3678K5957K4884o6388k9982j3004j1167K9075K7642N033K301
15138a9903K5027L1051q212k5009l2427k5746M7298q848m5486N4271M2247K4046
15126E8309j6274j9829l7104j8203l5318Q574Q5363L6353l1716L4553R339k2875
15114E1172n4935j7806J8738n0011k2633L7593j5612m9428m238k0326P046N9368
15102f1072N411J8588o801m7207K9467l652L2521K374L9002R520l3583j2694P596
15089b0530k8110N2025K0211L0140L6148n701m3603j5146k7976m7416j8301l862
15077g2121L3510j3068J0858K461M7830N7351j0380Q254j9626j8635l6120m2092
15065e1778K0650K8377j4499j6894p518m8243l6197m903M1759K7037J022l5928
$$ plain form
15053 -97115 -87574 -20221 5024 -29509 -84937 -59555 -49399 -64047 -65697 -16695 11953 31483
15041 31483 1916 -17851 -42606 -36116 -19598 -15095 -4419 67347 92457 20273 -19767 -33387
15029 -33387 -29540 -34210 -68466 -48085 14105 50531 13082 22351 22540 8643 -15432 -44262 -40597
15016 -40597 7015 35 -16445 -11438 32949 77561 29443 -3057 -22051 -28304 -1099 28936
15004 28936 -16868 -25056 24850 34332 32726 28202 1339 -42021 -30982 2340 1944 7351 48104
14991 48104 -3715 -28984 -66942 -25192 5785 4029 -11774 -60041 -59781 -91648 -114332 -73404
14979 -73404 -37004 -44769 -38757 -13172 -65113 -80996 -88419 -89438 -73819 -83714 -94022 -89961 -54477
14966 -54477 -80507 -49807 -2479 1566 -16068 -50603 -58160 -41281 -51371 -94036 -121184 -55654
$$ packed form
15053i7115R541O7353K5245l4533n5428K5382J0156j4648j650M9002K8648J9530
15041C1483k9567j9767k4755O490J6518M503J0676P1766K5110p2184m0040j3620
15029c3387L847m670l4256K0381O2190L6426l7449R269J89j3897k4075k8830L665
15016d0597M7612o980j6480N007M4387M4612m8118l2500j8994o253K7205L0035
15004B8936m5804q188M9906R482j606m524k6863m3360J1039L3322l96N407M0753
14991D8104n1819k5269l7958M1750L0977j756j5803m8267K60l1867k2684M0928
14979g3404L6400p765O012K5585n1941j5883p423j019J5619r895j0308M061L5484
14966e4477k6030L0700M7328M045j7634l4535p557J6879j0090m2665k7148O5530
$$ plain form
14954 -55654 15892 27955 172 3192 -8662 -16767 18344 4353 -2109 -8466 22281 36156
14942 36156 42279 -7416 -32925 4533 59980 64178 -5103 -17704 -675 -18261 -47824 -63650
14930 -63650 6507 31214 72651 98479 87209 -11776 -34769 5194 -28764 -21577 -13043 -37150
14918 -37150 -26866 -61880 -69106 -71391 -55725 -43140 -24612 18711 41920 -22862 876 18690
14906 18690 -16522 -39177 22015 33091 -2093 8889 7506 26455 37120 98874 104653 48070
14894 48070 1166 -29440 -71176 -79779 -67259 -24069 -9410 35977 24112 -25184 -107047 -115292
14882 -115292 -46122 -23474 -11040 3398 51487 50227 56482 4337 -40647 -12692 13873 25994
14870 25994 -8156 -15080 -10707 -5599 -27558 -25598 1973 -19661 -6264 24387 41333 -1652
$$ packed form
14954e5654P1546J2063k7783L020j1854q105L5111j3991o462o357L0747J3875
14942C6156O123m9695k5509L7458N5447M198o9281j2601J7029j7586k9563j5826
14930f3650P0157K4707M1437K5828j1270r8985k2993L9963l3958P187Q534k4107
14918c7150J0284l5014p226k285J5666J2585J8528M3323K3209o4782K3738J7814
14906A8690l5212k2655O1192J1076l5184J0982j383J8949J0665O1754N779n6583
14894D8070m6904l0606m1736q603J2520M3190J4659M5387j1865m9296q1863q245
14882a15292O9170K2648J2434J4438M8089j260O255n2145m4984K7955K6565J2121
14870B5994l4150o924M373N108k1959J960K7571k1634J3397L0651J6946m2985
$$ plain form
14858 -1652 -51327 -97208 -107039 -57736 -63174 -51181 21054 38299 20795 63248 86277 115659
14846 115659 102558 49269 24136 20960 62747 38556 32020 -15456 -22273 59277 118356 98829
14834 98829 19281 8430 53043 73907 32099 -1686 -5573 17318 49291 4517 -14557 -29157
14822 -29157 9433 9660 -27987 -51042 2251 25256 -9156 -15353 -1321 42654 14472 47183
14810 47183 52641 34864 28077 45918 46153 47225 19079 -40348 -52915 17511 53904 20714 19501
14797 19501 38263 57162 10031 -28785 3171 15788 -51855 -94687 -78367 -69875 -12706 18766
14785 18766 13771 -3696 -15438 28001 19988 13037 -16276 78504 97306 52568 8733 -402
14773 -402 -51030 -89621 -40071 -2854 33773 888 -20758 -13270 -8220 4952 10287 -20296 -13500
$$ packed form
14858a652m9675m5881r831M9303n438J1993P2235J7245j7504M2453K3029K9382
14846A15659j3101n3289k5133l176M1787k4191o536m7476o817Q1550N9079j9527
14834I8829p9548j0851M4613K0864m1808l3785l887K2891L1973m4774j9074j4600
14822b9157L8590K27l7647k3055N3293K3005l4412o197J4032M3975k8182L2711
14810D7183N458j7777o787J7841K35J072k8146n9427j2567P0426L6393l3190j213
14797A9501J8762J8899m7131l8816L1956J2617o7643m2832J6320Q492N7169L1472
14785A8766m995j7467j1742M3439q013o951k9313R4780J8802m4738m3835r135
14773d02n0628l8591M9550L7217L6627l2885k1646P488N050J3172N335l0583O796
$$ plain form
14760 -13500 6496 252 -5107 -31120 1572 3301 21496 25211 15030 48487 52287 57058 57447
14747 57447 47470 34156 31184 22970 -30526 -87218 -76203 -14991 13328 16938 92245 40781
14735 40781 -42213 -9224 -4241 3753 -35890 -46427 -54666 -49273 -84749 -116513 -108908 -57030 -34695
14722 -34695 3584 -61292 -98440 -37381 5063 -31644 -46970 -51640 -67025 -54164 -22850 24670
14710 24670 24428 4064 -19434 -27839 -12029 -9476 -26678 -17800 -32748 -97275 -81332 -65712 -26777
14697 -26777 -3150 -5923 35265 74081 147512 125268 32854 54653 118447 105822 108869 63727
14685 63727 -2825 -29145 -27171 -11777 1595 15184 6883 -32647 -54264 -74272 -101970 -33901
14673 -33901 29991 68856 86121 78782 82352 65909 76551 98004 84746 32630 21677 81545
$$ packed form
14760a3500J9996o244n359k6013L2692J729J8195L715j0181L3457L800M771L89
14747E7447r977j3314k972q214n3496n6692J1015O1212K8319L610P5307n1464
14735D0781q2994L2989M983P994l9643j0537q239N393l5476l1764P605N1878K2335
14722c4695L8279o4876l7148O1059M2444l6707j5326m670j5385J2861L1314M7520
14710B4670k42k0364k3498q405J5810K553j7202Q878j4948o4527J5943J5620L8935
14697b6777K3627k773M1188L8816P3431k2244r2414K1799O3794j2625L047m5142
14685F3727o6552k6320J974J5394J3372J3589q301l9530k1617k0008k7698O8069
14673c3901O3892L8865J7265p339L570j6443J0642K1453j3258n2116j0953N9868
$$ plain form
14661 81545 73051 61480 23824 34576 69300 26997 -18718 -3906 -8658 -103499 -97830 -100611
14649 -100611 -135512 -136450 -125269 -12916 26715 -27891 -124307 -97933 -85244 -71409 -17473 38452
14637 38452 38268 -41859 -41889 65926 37394 9859 80778 92489 19372 34101 19636 56586
14625 56586 83746 83301 30940 -15094 4949 43758 23358 11836 5091 50478 67785 48764
14613 48764 43917 49370 34814 -16204 -61207 -29342 3974 7001 4542 -23967 -36347 -83734
14601 -83734 -106488 -45532 70859 88017 60385 61582 73779 9757 -47971 -4646 2767 24601
14589 24601 81972 60743 56645 52958 70772 33576 68837 92701 32375 -45747 -6264 51900
14577 51900 77597 107274 108312 102405 85816 7860 -66199 -32991 68391 58000 21412 18520
$$ packed form
14661H1545q494j1571l7656J0752L4724m2303m5715J4812m752r4841N669k781
14649a00611l4901r38J1181J12353L9631n4606r6416K6374J2689J3835N3936N5925
14637C8452j84q0127l0J07815k8532k7535P0919J1711p3117J4729j4465L6950
14625E6586K7160m45n2361m6034K0043L8809k0400j1522o745M5387J7307j9021
14613D8764m847N453j4556n1018m5003L1865L3316L027k459k8509j2380m7387
14601h3734k2754O0956J16391J7158k7632J197J2197o4022n7728M3325P413K1834
14589B4601N7371k1229m098l687J7814l7196L5261K3864o0326p8122L9483N8164
14577E1900K5697K9677J038n907j6589p7956p4059L3208J01382j0391l6588k892
$$ plain form
14565 18520 51249 13638 3575 8422 -5365 -2101 48172 29243 -31917 -49232 -44200 -10437
14553 -10437 -4096 13586 17858 22721 43 -16528 12960 28844 4313 -23748 -4089 87995
14541 87995 80957 61680 52203 25520 30724 52030 -9093 -60909 -110374 -52505 -22710 -1076
14529 -1076 9889 -50209 -56801 -27909 -60611 -38598 -29491 -13157 44587 84463 77559 30827
14517 30827 4795 39254 46569 39111 6207 -25780 -26761 -38083 25453 24131 -24191 32565 102536
14504 102536 145930 172985 150965 110737 72050 94970 88573 66084 66018 112140 78828 61244
14492 61244 59893 55302 13613 -36401 -48092 -56462 -10060 20617 7889 -22553 -16353 63982
14480 63982 70903 75441 58301 88084 81632 9560 -19840 -30620 -4246 23675 4772 -1239
$$ packed form
14565A8520L2729l7611j0063M847j3787L264N0273j8929o1160j7315N032L3763
14553a0437O341J7682M272M863k2678j6571K9488J5884k4531k8061J9659R2084
14541H7995p038j9277r477k6683N204K1306o1123n1816m9465N7869K9795K1634
14529a076J0965o0098o592K8892l2702K2013R107J6334N7744L9876o904m6732
14517C0827k6032L4459P315p458l2904l1987r81j1322O3536j322m8322N6756O9971
14504A02536M3394K7055k2020m0228l8687K2920o397k2489o6M6122l3312j7584
14492F1244j351m591m1689n0014j1691q370M6402L0677j2728l0442O200Q0335
14480F3982O921M538j7140K9783o452p2072k9400j0780K6374K7921j8903o011
$$ plain form
14468 -1239 20932 -10891 -7599 22260 31131 -16096 -22950 -38255 -8916 8764 3502 -11499 58472
14455 58472 17736 -26154 -85400 -158253 -145398 -108525 -118687 -131271 -84597 -2559 25210 24366
14443 24366 31094 -49769 -22563 19034 49645 68345 93341 54994 31407 48335 7267 -2804
14431 -2804 -13672 -61134 -57182 -82772 -109658 -29434 16686 53850 77421 69162 -48179 -84267
14419 -84267 -51349 -24410 -37795 -30219 41508 41746 -27406 -583 5 24366 47355 22932 9251
14406 9251 27171 7269 -6325 13231 -5487 21120 19166 22971 40236 69321 65484 110966
14394 110966 123809 88263 28660 38365 44340 -376 39599 27976 9159 21154 12607 -6921
14382 -6921 -5404 -21072 -43981 4333 -7556 -26016 -15533 -20784 24798 40006 7394 -16688
$$ packed form
14468a239K2171l1823L292K9859Q871m7227o854j5305K9339J7680n262j5001O9971
14455E8472m0736m3890n9246p2853J2855L6873j0162j2584M6674Q2038K7769q44
14443B4366O728q0863K7206M1597L0611J8700K4996l8347k3587J6928m1068j0071
14431b804j0868m7462L952k5590k6886Q0224M6120L7164K3571q259j17341l6088
14419h4267L2918K6939j3385P576P1727K38o9152K6823N88K4361K2989k4423j3681
14406I251J7920j9902j3594J9556j8718K6607j954L805J7265K9085l837M5482
14394A10966J2843l5546n9603R705N975m4716L9975j1623j8817J1995q547j9528
14382f921J517j5668k2909M8314j1889j8460J0483n251M5582J5208l2612k4082
$$ plain form
14370 -16688 12131 19224 -36000 -69967 -92655 -36098 21411 40100 45821 36592 -553 8431
14358 8431 38919 -12310 205 38428 -12429 -57783 -5637 49946 45628 92350 100368 61386
14346 61386 55349 50206 65089 36730 13534 -14126 -4504 -12841 -35889 -54450 2431 27858
14334 27858 73209 80747 58314 26991 46914 13657 16248 -1827 -13287 -33666 -19568 -62521
14322 -62521 -59743 -59482 -45403 -28425 -40855 -14997 -21630 -44891 2983 -23475 -28654 -32978 -27720
14309 -27720 -49214 -19958 -59624 -84249 -26352 -2616 -33006 -17028 979 -6224 30092 119190
14297 119190 113801 75545 8285 14763 -1288 -30040 9875 1098 -11737 9390 35503 59452
14285 59452 65835 55637 35925 22549 38276 62443 52374 31655 5379 8296 -24433 -88931
$$ packed form
14370a6688K8819P093n5224l3967k2688N6557N7509J8689N721r229l7145Q984
14358H431L0488n1229J2515L8223n0857m5354N2146N5583m318M6722Q018l8982
14346F1386o037n143J4883k8359k3196k7660R622q337k3048j8561N6881K5427
14334B7858M5351P538k2433l1323J9923l3257K591j8075j1460k0379J4098m2953
14322f2521K778K61J4079J6978j2430K5858o633k3261M7874k6458n179m324N258
14309b7720k1494K9256l9666k4625N7897K3736l0390J5978J8007p203L6316Q9098
14297A19190n389l8256o7260O478j6051k8752L9915q777j2835K1127K6113K3949
14285E9452O383j0198j9712j3376J5727K4167j0069k0719k6276K917l2729o4498
$$ plain form
14273 -88931 -170715 -91443 -26599 11385 -28171 -19394 61343 98902 45924 50876 81599 67714
14261 67714 45695 34022 -7419 19841 33630 49976 40997 -9995 -43280 -63606 4392 37889
14249 37889 60858 56348 -11598 3238 23297 34284 24715 23947 54498 58903 39251 36326 49349
14236 49349 10511 27126 70582 95762 68712 41583 32206 38768 68327 75919 47285 64255
14224 64255 43847 -16128 -89665 -58439 98057 164809 137601 62316 -9251 -39186 -29211 -43109
14212 -43109 1498 30368 -3407 -58345 -52090 -419 42421 35803 57705 62262 57415 76891
14200 76891 137372 135465 104308 95169 80061 38787 31113 1043 -45187 -38295 1491 45850
14188 45850 41215 24418 21384 53761 111034 64154 -15549 -14070 12438 7767 6935 20096 -6605
$$ packed form
14273h8931q1784P9272O4844L7984l9556Q777Q0737L7559n2978M952L0723j3885
14261F7714k2019j1673m1441K7260J3789J6346q979n0992l3285k0326O7998L3497
14249C7889K2969m510o7946J4836K0059J0987r569p68L0551M405j9652k925J3023
14236D9349l8838J6615M3456K5180k7050k7129r377O562K9559P592k8634J6970
14224F4255k0408n9975p3537L1226J56496O6752k7208p5285p1567k9935R975j3898
14212d3109M4607K8870l3775n4938O255N1671M2840o618K1902M557m847J9476
14200G6891O0481j907l1157r139j5108m1274p674l0070m6230O892L9786M4359
14188D5850m635j6797l034L2377N7273m6880p9703J479K6508m671q32J3161k6701
$$ plain form
14175 -6605 -42851 -37976 -38908 -5361 -20237 -13009 40168 27206 7426 5452 8358 28042 57625
14162 57625 14846 -29985 -26156 -31697 -5469 52870 3263 4658 33693 54055 30622 29836 14258
14149 14258 -39978 -16335 42396 56029 37789 64222 58670 55316 70736 69343 90519 80854
14137 80854 43642 53844 37435 30527 28766 57179 65408 12962 -78303 -100314 -68449 -16778
14125 -16778 50941 40884 -3943 6619 6221 63214 54235 25991 36014 -12534 13306 24091
14113 24091 5141 41884 33900 -45851 -113297 -112531 -28805 20783 -37278 -33364 -56188 -30431
14101 -30431 -5052 10404 37906 20542 -45061 -36755 8800 70689 32276 -2233 -40637 -57381
14089 -57381 -19014 47994 82355 39396 11654 -18802 -20949 58862 89418 51494 43136 32669
$$ packed form
14175f605l6246M875r32L3547j4876P228N3177j2962j9780j974K906J9684K9583
14162E7625m2779m4831L829n541K6228N8339m9607J395K9035K0362k3433p86j5578
14149A4258n4236K3643N8731J3633j8240K6433n552l354J5420j393K1176r665
14137H0854l7212J0202j6409o908j761K8413Q229n2446r1265k2011L1865N1671
14125a6778O7719j0057m4827J0562l98N6993q979k8244J0023m8548K5840J0785
14113B4091j8950L6743p984p9751o7446P66Q3726M9588n8061L914k2824K5757
14101c0431K5379J5456K7502j7364o5603Q306M5555O1889l8413l4509l8404j6744
14089e7381L8367O7008L4361m2959k7742l0456k147P9811L0556l7924q358j0467
$$ plain form
14077 32669 53779 67870 37269 23439 27083 36747 85331 78157 64689 67653 39351 32905 33296
14064 33296 2720 -23284 -1653 -19686 6262 34702 14314 11338 -14934 13106 31367 -38347
14052 -38347 -26399 33346 47198 88020 93540 86348 85662 16116 14423 -16229 -60119 -52214 -36712
14039 -36712 -11959 11150 16758 6188 30424 33538 10344 12008 2712 -45451 -80652 -72463 -40022
14026 -40022 -9443 -49762 -23013 36020 -35434 -63601 -28594 10636 36939 -1880 -68397 -59959
14014 -59959 -43130 -61574 -90598 -32790 -2961 -56239 -31972 -28324 -15289 19969 74190 95460
14002 95460 82570 70188 4359 -19182 -36272 -22078 -9195 7314 11014 86174 69792 55680
13990 55680 50884 49102 18651 -22168 -48182 -54122 51149 140362 120395 55871 17143 17874
$$ packed form
14077C2669K1110J4091l0601j3830L644R664M8584p174j3468K964k8302o446L91
14064C3296l0576k6004K1631j8033K5948K8440k0388k976k6272K8040J8261o9714
14052c8347J1948N9745J3852M0822N520p192o86o9546j693l0652m3890P905J5502
14039c6712K4753K3109N608j0570K4236L114k3194J664r296m8163l5201Q189L2441
14026d0022L0579m0319K6749N9033p1454k8167L5007L9230K6303l8819o6517Q438
14014e9959J6829j8444k9024N7808K9829n3278K4267L648J3035L5258N4221K1270
14002I5460j2890j2382o5829k3541j7090J4194J2883J6509L700P5160j6382j4112
13990E5680m796j782l0451m0819k6014n940J05271Q9213j9967o4524l8728P31
$$ plain form
13978 17874 52819 128385 78712 40747 68238 86062 55605 25406 30037 -243 -8475 -11382
13966 -11382 12060 -994 -20462 -53120 -4845 39286 26438 -34567 -23859 -29609 -21515 37371
13954 37371 38199 23057 35026 28579 26603 5412 1756 25924 4574 861 32624 -6037 -71933
13941 -71933 -52914 -19379 -24157 -53902 -82101 -135731 -93472 -15133 5623 14707 76344 74073
13929 74073 30202 29617 26991 8905 3387 53589 76029 28133 38908 47757 42007 116800 123786
13916 123786 133425 165605 204400 132681 30513 31070 61816 10811 61472 111810 111252 103958
13904 103958 69313 20616 -42753 -41378 -28507 -11440 -22658 -59388 -83807 -92370 -129615 -152130
13892 -152130 -74433 -53711 -18080 -13137 59743 74058 38579 7483 -68634 -114374 -122162 -63541
$$ packed form
13978A7874L4945P5566m9673l7965K7491J7824l0457l0199M631l0280q232k907
13966a1382K3442j3054j9468l2658M8275M4131j2848o1005J0708n750Q094N8886
13954C7371Q28j5142J1969o447j976k1191l656K4168k1350l713L1763l8661o5896
13941g1933J9019L3535m778k9745k8199n3630M2259P8339K0756R084O1637k271
13929G4073m3871n85k626j8086n518N0202K2440m7896J0775Q849n750P4793O986
13916A23786R639L2180L8795p1719j02168N57L0746n1005N0661N0338n58p294
13904A03958l4645m8697o3369J375J2871J7067j1218l6730k4419q563l7245k2515
13892a52130P7697K0722L5631M943P2880J4315l5479l1096p6117m5740p788N8621
$$ plain form
13880 -63541 42508 62254 31883 21745 -39180 -49522 2089 26395 -63906 -80022 -27828
13869 -27828 12938 -57367 -55390 -11973 72865 96550 78969 51908 29202 -30913 -32034 19192
13857 19192 69118 71285 21007 -28173 -16623 -5722 -71700 -62198 67807 135024 88678 28408
13845 28408 27555 23525 49414 29974 26613 39012 20137 14405 64793 121834 150638 126206 105416
13832 105416 28163 -34811 -59600 -25871 55286 62830 3233 -46789 -95664 -81625 -13330 48738
13820 48738 45812 41117 64485 89738 103310 72752 28253 43700 87282 87920 104267 113763 62514
13807 62514 7169 20121 49414 54672 32598 -4273 -32371 -34623 -33567 -63716 -38596 -24434
13795 -24434 8857 58417 66901 70949 38571 3174 17617 737 13685 15632 -21018 10724
$$ packed form
13880f3541J06049J9746l0371j0138o0925j0342N1611K4306r0301j6116N2194
13869b7828M0766p0305J977M3417Q4838K3685j7581k7061k2706o0115j121N1226
13857A9192M9926K167n0278m9180J1550J0901o5978R502J30005O7217m6346o0270
13845B8408q53m030K5889j9440l361J2399j8875n732N0388N7041K8804k4432k0790
13832A05416p7253o2974k4789L3729Q1157P544n9597n0022m8875J4039O8295O2068
13820D8738k926m695K3368K5253J3572l0558m4499J5447M3582O38J6347R496n1249
13807F2514n5345J2952K9293N258k2074l6871k8098k252J056l0149K5120J4162
13795b4434L3291M9560Q484M048l2378l5397J4443j6880J2948J947l6650L1742
$$ plain form
13783 10724 5673 25019 11092 -16855 -22666 -38440 -66267 -58297 -86273 -97573 -66719 11507
13771 11507 34579 27063 814 10709 56279 24970 11020 17971 57380 88893 54766 13463
13759 13463 -14269 -31381 18690 46705 8947 -25491 -7927 13555 54300 58407 64570 122472
13747 122472 138517 48070 -40193 -10545 38842 83168 97983 77618 74441 18288 7162 -6486
13735 -6486 -30551 -26931 127 85775 96000 51290 29232 -17453 -23813 -17002 43327 87359
13723 87359 109097 70214 68164 88646 75140 56249 62555 40602 34464 17991 37369 34217
13711 34217 8806 2770 7196 13204 32686 55829 47126 49144 7148 -72056 -90291 -77200 -81172
13698 -81172 -91789 10901 42939 40326 13745 -28039 5780 -31692 -10369 18560 32809 9949
$$ packed form
13783A0724n051J9346j3927k7947n811j5774k7827P970k7976j1300L0854P8226
13771A1507K3072p516k6249R895M5570l1309j3950O951L9409L1513l4127m1303
13759A3463k7732j7112N0071K8015l7758l4438J7564K1482M0745M107O163N7902
13747A22472J6045r0447q8263K9648M9387M4326J4815k0365l177n6153j1126j3648
13735f486k4065L620K7058Q5648J0225m4710k2058m6685o360O811O0329M4032
13723H7359K1738l8883k050K0482j3506j8891O306k1953o138j6473J9378l152
13711C4217k5411o036M426O008J9482K3143q703K018m1996p9204j8235J3091l972
13698h1172j0617J02690L2038k613k6581m1784L3819l7472K1323K8929J4249k2860
$$ plain form
13686 9949 -1013 -24300 -79596 -139911 -45749 23770 21537 37855 81657 70361 34822 46671
13674 46671 -3682 36534 47018 52764 59527 75803 67100 -6839 13044 66827 69146 59407 86338
13661 86338 8429 -72360 -67508 -12775 12737 30269 65836 87284 108805 99344 100781 99718
13649 99718 103371 118135 87581 51386 24628 40316 92499 56478 -2631 -55541 -48704 -67551
13637 -67551 -3792 32765 -4116 -44496 -40459 -20427 -35937 -63174 -87839 -83732 -56000 8682
13625 8682 54626 86502 68384 34833 23582 33762 20019 36192 74668 95201 59427 64321
13613 64321 39140 5129 34668 40276 -4211 -19306 3285 -15737 -65167 -85055 -13898 62015
13601 62015 22123 -6693 -14903 -56814 -23431 23374 28936 27828 7950 -22373 -70665 -79087
$$ packed form
13686I949j0962k3287n5296o0315R4162O9519k233J6318M3802j1296l5539J1849
13674D6671n0353M0216J0484N746O763J6276q703p3939J9883N3783K319r739K6931
13661H6338p7909q0789M852N4733K5512J7532L5567K1448K1521r461J437j063
13649I9718L653J4764l0554l6195k6758J5688N2183l6021n9109n2910O837j8847
13637f7551O3759L6557l6881m0380M037K0032j5510k7237k4665M107K7732O4682
13625H682M5944L1876j8118l3551j1251J0180j3743J6173L8476K0533l5774M894
13613F4321k5181l4011K9539N608m4487j5095K2591j9022m9430j9888P1157P5913
13601F2015l9892k8816q210m1911L3383M6805N562j108j9878l0323m8292q422
$$ plain form
13589 -79087 -15185 -10894 30047 58543 92444 71001 65313 38716 32573 33884 -12 4822 -46734
13576 -46734 -77849 -19664 -884 -144 12552 -42086 -101621 -94562 -80686 -89462 17103 55349
13564 55349 6857 7870 19368 -2461 561 5471 22969 -26799 -64668 -60260 -47967 -1618
13552 -1618 52112 46545 -8434 -41622 -1775 41912 58363 48137 -36339 -65183 11311 22678
13540 22678 24418 62050 61096 73903 78640 95487 81489 59822 41527 67553 113284 139627
13528 139627 72954 -4724 -21351 -1259 -4168 -37570 -23743 30265 7710 -676 -5330 26521
13516 26521 41473 50172 13751 6413 -915 25101 62317 85230 -1016 -29989 -58717 -69021
13504 -69021 -47540 -2692 34207 11545 -15306 -20973 -59334 -51531 -4759 16961 58970 43174
$$ packed form
13589g9087O3902M291M0941K8496L3901k1443n688k6597o143J311l3896M834n1556
13576d6734l1115N8185J8780P40J2696n4638n9535P059J3876q776J06565L8246
13564E5349m8492J013J1498k1829L022M910J7498m9768l7869M408J2293M6349
13552a618N3730n567n4979l3188L9847M3687J6451j0226q4476k8844P6494J1367
13540B2678J740L7632r54J2807M737J6847j3998k1667j8295K6026M5731K6343
13528A39627o6673p7678j6627K0092k909l3402J3827N4008k2555q386m654L1851
13516B6521J4952Q699l6421p338p328K6016L7216K2913q6246k8973k8728j0304
13504f9021K1481M4848L6899k2662k6851n667l8361P803M6772K1720M2009j5796
$$ plain form
13492 43174 45744 47065 51125 58822 36428 17265 27277 34529 59382 97216 12675 26682 60401
13479 60401 66629 54651 20190 6626 39451 46586 -5323 2085 5753 18983 25090 21804 3667
13466 3667 -4162 26542 50337 23139 8204 -8208 791 24296 -11172 8722 -369 -2715 23338
13453 23338 28157 -26852 -23642 -11898 7159 9567 -5130 -23035 -24082 -29074 60883 106631 75157
13440 75157 80470 51216 24088 18244 31505 36129 34183 26347 23267 66807 34306 26381 977
13427 977 44931 72059 9096 -48524 -22787 48554 52881 66158 107256 118815 148571 114595
13415 114595 40613 21992 51323 91908 33118 523 37904 85336 85699 105110 135452 105000
13403 105000 70313 104378 104681 37489 -2164 38715 46328 18162 -34032 -13332 -29452 -50323
$$ packed form
13492D3174K570J321M060P697k2394j9163J0012P252K4853L7834q4541J4007L3719
13479F0401O228j1978l4461j3564L2825P135n1909P408L668J3230O107l286j8137
13466C667p829L0704K3795k7198j4935j6412Q999K3505l5468J9894r091k346K6053
13453B3338M819n5009L210J1744J9057K408j4697j7905j047m992Q9957M5748l1474
13440G5157N313k9254k7128n844J3261M624j946p836l080M3540l2501p925k5404
13427I77M3954K7128o2963n7620K5737P1341M327J3277M1098J1559K9756l3976
13415A14595p3982j8621K9331M0585n8790l2595L7381M7432L63J9411L0342l0452
13403A05000l4687L4065L03o7192l9653M0879P613k8166n2194K0700j6120k0871
$$ plain form
13391 -50323 -59070 -17033 13590 33897 90976 137526 157361 141435 92397 85415 78786 46881
13379 46881 -3584 11398 24822 21124 35242 107639 180485 198622 150451 131121 94511 62841
13367 62841 78107 52528 44091 62963 43686 53148 45537 48667 89835 102630 115277 121263 31765
13354 31765 -53862 491 70758 129421 56884 19593 32809 69152 28071 -48324 -77358 -26005
13342 -26005 44171 73456 61472 60444 34581 36437 1596 -32144 -49742 -18621 53993 63008
13330 63008 -1970 17889 47331 74256 36404 -9520 -12820 -1930 1059 -28604 -59111 -128093
13318 -128093 -109053 7090 92666 62737 20669 30679 27774 85321 61044 62043 92365 68099
13306 68099 14771 12288 -14598 -22342 -21711 -10172 23387 34000 65275 49549 35912 49480
$$ packed form
13391e0323q747M2037L0623K0307N7079M6550J9835j5926m9038o982o629l1905
13379D6881n0465J4982J3424l698J4118P2397P2846J8137m8171j9330l6610l1670
13367F2841J5266k5579q437J8872j9277R462p611L130M1168J2795J2647N986q9498
13354C1765q5627N4353P0267N8663p2537l7291J3216L6343m1081p6395k9034N1353
13342b6005P0176K9285j1984j028k5863J856l4841l3740j7598L1121P2614R015
13330F3008o4978J9859K9442K6925l7852m5924l300J0890K989k9663l0507o8982
13318a28093J9040J16143Q5576k9929m2068J0010k905N7547k4277R99L0322k4266
13306F8099n3328k483k6886p744O31J1539L3559J0613L1275j5726j3637J3568
$$ plain form
13294 49480 54592 61839 51996 47726 23521 27087 46394 86545 114446 95905 77451 100811 89490
13281 89490 61942 48875 39620 45152 35639 46797 24152 22065 37170 -10790 -38426 823
13269 823 29783 88321 87643 70633 83462 76251 39484 20998 36913 34798 30665 84407 116826
13256 116826 74244 84070 124590 97873 -14497 -59873 -38117 -12195 19092 -11828 -16016 55200
13244 55200 88068 53720 5392 7509 20833 61374 66762 55961 53151 18132 -17785 -81315
13232 -81315 -66977 -13090 -4923 -22040 -20125 -4556 16681 51070 45128 41033 50533 60304 143046
13219 143046 164982 116207 88621 109743 143996 122044 45287 -7670 -1873 -1016 -18448 34821
13207 34821 15865 651 43613 144946 157391 140290 114567 109361 83602 122890 155717 134478
$$ packed form
13294D9480N112P247r843m270k4205L566J9307M0151K7901j8541j8454K3360j1321
13281H9490k7548j3067r255N532r513J1158k2645k087J5105m7960k7636L9249
13269H23K8960N8538o78j7010J2829p211l6767j8486J5915k115m133N3742L2419
13256A16826m2582R826M0520k6717j12370m5376K1756K5922L1287l0920m188P1216
13244E5200L2868l4348m8328K117J3324M0541N388j0801k810l5019l5917o3530
13232h1315J4338N3887Q167j7117J915J5569K1237L4389n942m095R500R771Q2742
13219A43046K1936m8775k7586K1122L4253k1952p6757n2957N797Q57j7432N3269
13207C4821j8956j5214M2962J01333J2445j7101k5723n206k5759L9288L2827k1239
$$ plain form
13195 134478 81546 34701 67926 67541 69617 89862 101829 78472 72549 100496 110099 67554
13183 67554 36920 17815 23925 33054 63475 52618 59921 6398 615 -18739 -23107 -10053 -11288
13170 -11288 -10950 11382 41091 34349 84711 61167 37647 36266 21452 84258 100974 90394
13158 90394 100009 110120 110234 117760 121995 139033 98082 91748 78846 96440 101569 103572 168201
13145 168201 168043 124614 176184 162798 68038 18919 66721 64765 50243 27999 -6028 -5293
13133 -5293 -3501 18396 79388 115705 153009 131984 99933 111997 68324 44763 79718 60163
13121 60163 50820 89801 65617 68999 59738 85037 68164 75937 66424 67189 141466 197710 170230
13108 170230 120957 132565 144736 128637 151599 232596 231160 207996 193066 176886 161195 130383
$$ packed form
13195A34478n2932m6845L3225l85K076K0245J1967k3357n923K7947R603m2545
13183F7554l0634j9105O110R129L0421j0857P303n3523n783j9354m368J3054j235
13170a1288L38K2332K9709o742N0362k3544k3520j381j4814O2806J6716j0580
13158I0394R615J0111J14P526M235J7038m0951o334j2902J7594N129K003O4629
13145A68201j58m3429N1570j3386r4760m9119M7802j956j4522k2244l4027P35
13133e293J792K1897O0992L6317L7304k1025l2051J2064m3673k3561L4955j9555
13121F0163r343L8981k4184L382r261K5299j6873P773r513P65P4277N6244k7480
13108A70230m9273J1608J2171j6099K2962Q0997j436k3164j4930j6180j5691l0812
$$ plain form
13096 130383 98427 77253 60263 34620 23619 10100 41600 90443 117378 99559 49891
13085 49891 18036 22544 -8269 10203 54115 84854 91284 92109 94608 109779 112212 97752 46418
13072 46418 23015 72814 175664 159038 107272 102090 95101 141178 111991 83712 119054 148820
13060 148820 110472 119108 181752 260367 244689 155296 115891 106885 80964 80601 48276 61523
13048 61523 139093 131856 130318 124875 123613 79708 105112 144991 118205 57677 46872 45182 68669
13035 68669 40632 12683 54612 94773 125231 108837 96904 76354 88510 99335 85311 78839
13023 78839 74637 82409 83506 84501 92853 63882 74981 85032 113654 107705 96392 70141 87340
13010 87340 137528 191304 158586 94575 44407 30847 69391 86151 99291 87359 63010 29369
$$ packed form
13096A30383l1956k1174j6990k5643j1001j3519L1500M8843K6935j7819m9668
13085D9891l1855M508l0813J8472M3912L0739O430Q25K499J5171K433j4460n1334
13072D6418k3403M9799J02850j6626n1766n182o989M6077k9187k8279L5342K9766
13060A48820l8348Q636O2644P8615j5678q9393l9405r006k5921l63l2325J3247
13048F1523P7570p237j538n443j262m3905K5404L9879k6786o0528j0805j690K3487
13035F8669k8037k7949M1929M0161L0458j6394j1933k0550J2156J0825j4024o472
13023G8839m202P772J097R95Q352k8971J1099J0051K8622n949j1313k6251J7199
13010H7340N0188N3776l2718o4011n0168j3560L8544J6760J3140j1932k4349l3641
$$ plain form
12998 29369 -37128 18458 54881 25288 54231 101308 119344 119365 138212 129932 155917 148750 46702
12985 46702 -4019 44935 92480 85619 103698 186912 250806 253667 245076 180733 140840 198269
12973 198269 238238 219619 226567 179358 100772 86517 91036 146502 142639 134280 125176 80976
12961 80976 89353 102214 128553 138200 120063 150866 194942 120605 29010 41554 119534 121488
12949 121488 75232 48853 112890 171568 101715 83458 68700 66591 48390 23834 75105 46767
12937 46767 19398 61070 69650 79112 85649 98395 66458 46801 90071 89597 122206 196112 181991
12924 181991 137210 99817 137054 194863 183320 200838 172997 132975 164317 180335 129317
12913 129317 105211 87082 101384 152228 201963 238638 171481 126035 97629 93240 129708 142577
$$ packed form
12998B9369o6497N5586L6423k9593K8943M7077J8036K1J8847q280K5985p167j02048
12985D6702n0721M8954M7545o861J8079Q3214O3894K861q591o4343l9893N7429
12973A98269L9969j8619O948m7209p8586j4255M519N5466l863q359r104m4200
12961H0976Q377J2861K6339R647j8137L0803M4076p4337r1595J2544P7980J954
12949A21488m6256k6379O4037N8678o9853j8257j4758k109j8201k4556N1271k8338
12937D6767k7369M1672Q580R462O537J2746l1937j9657M3270m74L2609P3906j4121
12924A81991m4781l7393L7237N7809j1543J7518k7841m0022L1342J6018n1018
12913A29317k4106j8129J4302N0844M9735L6675o7157m5446k8406m389L6468J2869
$$ plain form
12901 142577 130453 130012 84529 52231 33335 32706 114229 70861 70142 82022 53425 87567 113456
12888 113456 124385 115331 116461 61216 40586 99059 62827 36190 134556 211845 120385 45717
12876 45717 99563 129858 115427 108896 104256 135467 99664 79502 111274 109735 120357 135745
12864 135745 162167 123886 145057 168112 157673 216934 193024 157723 170531 210999 219095 274041
12852 274041 292914 266584 233765 183078 212624 299349 391673 435479 439840 471751 461060 452133
12840 452133 445887 414447 405756 380339 358066 360904 315442 314796 293193 284375 300823 214593 206212
12827 206212 226323 282141 357505 416315 405541 405457 412300 465782 447316 433571 426913 449210
12815 449210 509467 566153 605781 535607 481082 452411 440667 465857 462970 433957 349437 318705
$$ packed form
12901A42577j2124m41m5483l2298j8896o29Q1523m3368p19J1880k8597L4142K5889
12888A13456J0929r054J130n5245k0630N8473l6232k6637R8366P7289r1460p4668
12876D5717N3846L0295j4431o531m640L1211l5803k0162L1772j539J0622J5388
12864A35745K6422l8281K1171K3055j0439N9261k3910l5301J2808M0468Q096N4946
12852B74041J8873k6330l2819n0687K9546Q6725R2324M3806M361L1911j0691q927
12840D52133o246l1440q691k5417k2273K838m5462o46k1603q818J6448q6230q381
12827B06212K0111N5818P5364N8810j0774q4O843N3482j8466j3745o658K2297
12815D49210O0257N6686L9628p0174n4525k8671j1744K5190k887k9013q4520l0732
$$ plain form
12803 318705 342027 422004 456034 418735 336834 308103 310885 366548 355047 362329 343708 330903
12791 330903 329132 325985 344691 349933 326984 368574 364499 411616 454886 523184 600158 571917
12779 571917 530550 569873 568858 490653 407927 377889 381126 329186 300438 327486 320152 230508
12767 230508 182613 194190 207356 190478 259116 273134 232046 248197 254841 283083 287967 276847
12755 276847 278533 261929 252830 233228 253914 305226 325173 346286 358966 328291 311634 360443
12743 360443 413401 481397 466167 443116 518714 593172 603986 510005 487824 516177 506222 456081
12731 456081 374872 383717 398026 398750 411064 419849 409107 355042 335243 263398 278572 261599
12719 261599 310981 319235 303351 259144 295119 285938 274927 278610 303378 272406 293338 338462
$$ packed form
12803C18705K3322P9977L4030l7299q1901k8731K782N5663j1501P282j8621j2805
12791C30903j771l147J8706N242k2949M1590m075M7117M3270O8298P6974k8241
12779E71917m1367L9323j015p8205q2726l0038L237n1940k8748K7048p334q9644
12767B30508m7895J1577J3166j6878O8638J4018m1088J6151O644K8242M884j1120
12755B76847J686j6604r099j9602K0686N1312J9947K1113J2680l0675j6657M8809
12743C60443N2958O7996j5230k3051P5598P4458J0814r3981k2181K8353r955n0141
12731D56081q1209Q845J4309P24J2314Q785j0742n4065j9799p1845J5174j6973
12719B61599M9382Q254j5884m4207L5975r181j1011L683K4768l0972K0932M5124
$$ plain form
12707 338462 343325 390272 406456 447027 504253 568988 632214 700863 727840 802183 847123 845508
12695 845508 813355 771387 767068 743232 641881 588120 557791 510025 477211 405244 406135 405352
12683 405352 433640 433247 409271 350680 389265 378026 410863 399929 366669 396531 391584 409089
12671 409089 358002 323640 302999 327292 340286 425833 516116 491487 526793 557662 564689 568020
12659 568020 597565 653260 689005 665666 640252 626699 637992 607402 525639 417725 372216
12648 372216 329423 351538 349505 328388 297419 254960 295702 342643 395881 414269 431928 418373
12636 418373 423088 398556 408693 430974 386835 380174 366056 343267 351701 327801 380585 432016
12624 432016 448465 457592 467070 415482 454935 451026 395925 422022 444989 434263 418440 423172
$$ packed form
12707C38462M863M6947J6184M0571N7226O4735O3226O8649K6977P4343M4940j615
12695H45508l2153m1968m319k3836j01351n3761l0329m7766l2814p1967Q91p83
12683D05352K8288l93k3976n8591L8585j1239L2837j0934l3260K9862m947J7505
12671D09089n1087l4362k0641K4293J2994Q5547R0283k4629L5306L0869P027L331
12659E68020K9545N5695L5745k3339k5414j3553J1293l0590q1763j07914m5509
12648C72216m2793K2115k033k1117l0969m2459M0742M6941N3238J8388J7659j3555
12636D18373M715k4532J0137K2281m4139o661j4118k2789Q434k3900N2784N1431
12624D32016J6449R127R478n1588L9453l909n5101K6097K2967j0726j5823M732
$$ plain form
12612 423172 472550 477541 490556 503247 549486 527629 458782 465878 465993 410267 383343 367328
12600 367328 362812 383306 393975 401749 456676 536882 518398 507809 537880 543162 600379 623974
12588 623974 609444 573653 572373 556290 520354 561776 573934 564806 566178 542087 494019 504515
12576 504515 534870 527487 565084 552051 519670 594843 639384 598290 563972 583724 633565 639550
12564 639550 648333 645684 702712 703104 749751 735452 713051 662771 605664 585595 582887 595516
12552 595516 527545 507327 499671 465778 461301 438545 460225 522401 547334 543531 564424 576778
12540 576778 623346 712247 676470 633233 661127 681698 679410 720731 702646 640610 628830 638185
12528 638185 733203 769159 735161 724991 710368 687729 725873 723180 696554 698354 696266 722297
$$ packed form
12612D23172M9378M991J3015J2691M6239k1857o8847P096J15n5726k6924j6015
12600C67328m516K0494J0669P774N4927Q0206j8484j0589L0071N282N7217K3595
12588F23974j4530l5791j280j6083l5936M1422J2158r128J372k4091m8068J0496
12576E04515L0355p383L7597j3033l2381P5173M4541m1094l4318J9752M9841N985
12564F39550Q783k649N7028L92M6647j4299k2401n0280n7107k0069k708J2629
12552E95516o7971k0218p656l3893m477k2756K1680O2176K4933l803K0893J2354
12540E76778M6568Q8901l5777m3237K7894K0571k288M1321j8085o2036j1780R355
12528F38185R5018L5956l3998j0170j4623k2639L8144k693k6626J800k088K6031
$$ plain form
12516 722297 713388 733897 714763 718269 740588 739930 767976 772541 769269 814392 777731 783774 816324
12503 816324 770093 743021 730852 707424 748873 799610 820808 895083 948739 960271 1035723
12492 1035723 1035244 989810 947705 966107 982584 950397 983279 987310 981855 968860 1048143 1094902
12480 1094902 1060329 1104478 1139803 1137275 1135710 1152043 1200168 1223108 1215692 1210538 1220674 1232191
12468 1232191 1266442 1267521 1233252 1207383 1204533 1190229 1219611 1274866 1299707 1271220 1335157 1399259
12456 1399259 1445957 1513080 1583452 1641908 1696413 1703991 1716591 1697732 1737277 1823245 1863644
12445 1863644 1875762 1978069 2000124 2048301 2130011 2242697 2373934 2561420 2765707 3013161
12435 3013161 3281741 3556339 3926663 4474361 5057052 5770993 6618730 7530308 8647490
$$ packed form
12516G22297q909K0509j9134L506K2319o58K8046M565l272M5123l6661O043L2550
12503H16324m6231k7072j2169k3428M1449N0737K1198P4275N3656J1532P5452
12492A035723m79m5434m2105J8402J6477l2187L2882M031n455j2995P9283M6759
12480A094902l4573M4149L5325k528j565J6333M8125K2940p416n154J0136J1517
12468A232191L4251J079l4269k5869k850j4304K9382N5255K4841k8487O3937O4102
12456A399259M6698O7123P0372N8456N4505P578J2600j8859L9545Q5968M0399
12445A863644J2118J02307K2055M8177Q1710J12686J31237J87486K04287K47454
12435C013161K68580K74598L70324N47698N82691P13941Q47737R11578J117182
$$ plain form
12426 8647490 10117897 12037445 14606035 18013947 22326558 27471944 33287483 39407426
12418 39407426 45453300 51003833 55474946 58290918 58678891 56331605 51902902 46385046
12410 46385046 41022169 36458622 32805071 29854937 27533395 25742541 24422278 23752049
12402 23752049 23833816 24541513 25905673 27796461 30090109 32711374 35561355 38425972
12394 38425972 41171810 43530999 45504970 47268412 49105290 51404347 54086385 56820670
12386 56820670 59270674 60913572 61386380 60602668 58679419 56035251 53006030 50016725
12378 50016725 47462553 45470755 44019091 43015882 42235931 41182814 39577664 37384294
12370 37384294 34797210 32216753 30134634 28824365 28260496 28481593 29457460 31125437
$$ packed form
12426H647490J470407J919548K568590L407912M312611N145386N815539O119943
12418C9407426O045874N550533M471113K815972L87973k347286m428703n517856
12410D6385046n362877m563547l653551k950134k321542j790854j320263o70229
12402B3752049Q1767P07697J364160J890788K293648K621265K849981K864617
12394C8425972K745838K359189J973971J763442J836878K299057K682038K734285
12386E6820670K450004J642898M72808p83712j923249k644168l029221k989305
12378E0016725k554172j991798j451664j003209p79951j053117j605150k193370
12370C7384294k587084k580457k082119j310269n63869K21097R75867J667977
$$ plain form
12362 31125437 33518861 36702567 40694600 45520680 50758246 55995824 60845714 64935418
12354 64935418 67959697 69417120 68554514 64794214 58427669 50679357 42956408 36253618
12346 36253618 30882833 26817539 23829827 21624901 19920111 18469570 17175778 16036656
12338 16036656 15086720 14301198 13605870 12984288 12406228 11939201 11556928 11283325 11030513
12329 11030513 10811828 10646080 10502571 10465001 10532193 10645873 10889653 11263330 11732003 12375748
12319 12375748 13223877 14362570 16004539 18222701 21275429 25314636 30359135 36208763
12311 36208763 42303753 48264793 53705816 58056987 60581389 60275617 56572561 50180907
12303 50180907 42638507 35520769 29595607 25115056 21900838 19623104 17999077 16821430
$$ packed form
12362C1125437K393424L183706L992033M826080N237566N237578M849890M089704
12354F4935418L024279J457423q62606l760300o366545p748312p722949o702790
12346C6253618n370785m065294k987712k204926j704790j450541j293792j139122
12338A6036656r49936p85522o95328o21582n78060m67027l82273k73603k52812
12329A1030513k18685j65748j43509l7570O7192J13680K43780L73677M68673O43745
12319A2375748Q48129J138693J641969K218162L052728M039207N044499N849628
12311C6208763O094990N961040N441023M351171K524402l05772l703056o391654
12303E0180907p542400p117738n925162m480551l214218k277734j624027j177647
$$ plain form
12295 16821430 15918775 15207242 14734537 14425852 14278073 14157615 14082272 14201335 14507321
12286 14507321 14970563 15560899 16372928 17389066 18638412 20115742 21854167 23975934
12278 23975934 26684885 30236093 34872830 40833301 48327152 57278581 67243856 77560491
12270 77560491 87485249 96154926 102418134 105116676 103241740 96735799 86736455 75308658
12262 75308658 64126829 54395941 46563600 40453948 35851689 32453046 29911173 27846073
12254 27846073 26032521 24312792 22734204 21382360 20235225 19186283 18304771 17625890
12246 17625890 17109919 16766711 16517993 16366843 16377123 16585102 17015787 17648156 18650927
12237 18650927 20188877 22465093 25703807 29995647 35322032 41372646 47660418 53734868
$$ packed form
12295A6821430r02655p11533m72705l08685j47779j20458p5343J19063L05986
12286A4507321M63242N90336Q12029J016138J249346J477330J738425K121767
12278B3975934K708951L551208M636737N960471P493851Q951429R965275J0316635
12270G7560491R924758Q669677O263208K698542j874936o505941r999344j1427797
12262G5308658j1181829r730888p832341o109652m602259l398643k541873k065100
12254B7846073j813552j719729j578588j351844j147135j048942q81512o78881
12246A7625890n15971l43208k48718j51150J0280K07979M30685O32369J002771
12237A8650927J537950K276216L238714M291840N326385O050614O287772O074450
$$ plain form
12229 53734868 59126278 63345666 65562868 64559479 59911409 52433833 43932501 36067161
12221 36067161 29693558 24911301 21517675 19026584 17119072 15592991 14410629 13387321
12213 13387321 12511729 11738972 11127481 10655867 10155994 9704809 9378405 8986464 8555110
12204 8555110 8181684 7829385 7507010 7177341 6821341 6501146 6211038 6025629 5799462
12195 5799462 5532267 5272854 5127226 5009103 4894637 4747261 4623842 4456899 4318932
12186 4318932 4162944 4018309 3951424 3848858 3711787 3592440 3533201 3511346 3390908 3274176
12176 3274176 3213642 3094050 2985955 2890732 2778089 2709864 2663388 2585676 2599323 2532201 2422513
12165 2422513 2362109 2264312 2140534 2064053 2005487 1973344 1908404 1867282 1831598 1778754 1796042
$$ packed form
12229E3734868N391410M219388K217202j003389m648070p477576q501332p865340
12221C6067161o373603m782257l393626k491091j907512j526081j182362j023308
12213A3387321q75592p72757o11491m71614m99873m51185l26404l91941m31354
12204H555110l73426l52299l22375l29669l56000l20195k90108j85409k26167
12195E799462k67195k59413j45628j18123j14466j47376j23419j66943j37967
12186D318932j55988j44635o6885j02566j37071j19347n9239k1855j20438j16732
12176C274176o0534j19592j08095r5223j12643o8225m6476p7712J3647o7122j09688
12165B422513o0404r7797j23778p6481n8566l2143o4940m1122l5684n2844J7288
$$ plain form
12154 1796042 1750976 1700751 1642743 1540474 1497002 1482341 1425147 1400033 1360927 1370784 1383975
12143 1383975 1439869 1435617 1401136 1414271 1383759 1335717 1289106 1319962 1338553 1324256 1232850
12132 1232850 1196679 1177993 1155369 1107594 1061322 1056988 1031155 1036641 947555 913004 869615 804201
12120 804201 757315 735028 691081 669620 682323 707987 688957 649516 608050 618637 651674
12109 651674 636648 606975 620580 603365 597012 643007 617261 597810 571623 581250 557891 583074
12097 583074 615811 566388 530404 539098 571701 542969 533679 501570 498002 483199 426385 396062
12085 396062 406634 426471 423742 406632 390049 371340 401729 365639 364878 414925 398155 404304
12073 404304 395229 352091 323020 350767 388820 394424 350002 296324 274619 274423 318937 345581
$$ packed form
12154A796042m5066n0225n8008j02269m3472j4661n7194k5114l9106R857J3191
12143A383975N5894m252l4481J3135l0512m8042m6611L0856J8591j4297r1406
12132A232850l6171j8686k2624m7775m6272m334k5833N486q9086l4551m3389o5414
12120H04201m6886k2287m3947k1461J2703K5664j9030l9441m1466J0587L3037
12109F51674j5026k9673J3605j7215o353M5995k5746j9451k6187R627k3359K5183
12097E83074L2737m9423l5984Q694L2603k8732r290l2109l568j4803n6814l0323
12085C96062J0572J9837k729j7110j6583j8709L0389l6090p61N0047j6770O149
12073D04304r075m3138k9071K7747L8053N604m4422n3678k1705j96M4514K6644
$$ plain form
12061 345581 325997 325930 391716 393959 419180 419985 350528 363224 348956 363442 319815 291415 288851
12048 288851 307349 321706 309894 225336 215452 238231 231402 209196 238142 320465 294193 292691
12036 292691 305427 243727 231752 251223 267230 259126 281873 320346 370580 362762 336268 288032
12024 288032 244064 242111 302972 311860 273617 237256 241679 233926 185751 221380 241415 191868
12012 191868 176453 197550 235732 274737 299340 293380 280041 234360 222526 274235 287946 337548
12000 337548 330818 299087 253961 261138 317648 325742 312425 266643 273442 326455 330558 323745 327453
11987 327453 334095 400164 426427 473280 459688 460769 435448 390823 347986 331975 377971 352922
11975 352922 297410 294613 283684 265622 304836 397936 417309 371039 354791 348482 354731 358900
$$ packed form
12061C45581j9584o7O5786K243K5221Q05o9457J2696j4268J4486m3627k8400k564
12048B88851J8498J4357j1812q4558r884K2779o829k2206K8946Q2323k6272j502
12036B92691J2736o1700j1975J9471J6007q104K2747L8473N0234p818k6494m8236
12024B88032m3968j953O0861Q888l8243l6361M423p753m8175L5629K0035m9547
12012A91868j5415K1097L8182L9005K4603n960j3339m5681j1834N1709J3711M9602
12000C37548o730l1731m5126P177N6510Q094j3317m5782O799N3013M103o813L708
11987C27453O642O6069K6263M6853j3592J081k5321m4625m2837j6011M5996k5049
11975C52922n5512k797j0929j8062L9214R3100J9373m6270j6248o309O249M169
$$ plain form
11963 358900 392282 391322 413027 411571 447967 462360 489056 491308 504545 540560 555883 546963
11951 546963 494262 447815 440962 425726 389043 387291 345398 280839 269931 246407 246676 287856
11939 287856 322762 355587 317115 306899 346297 333771 289691 316590 304410 288236 288649 342827
11927 342827 359141 352432 325849 323904 365268 426022 447080 461481 493514 475464 412228 355510
11915 355510 353110 385560 369421 286308 221227 232718 265659 199188 164445 186931 220006 260003
11903 260003 237713 225974 255036 278544 297689 231513 183155 175961 205749 228749 252479 199150
11891 199150 146667 164630 226568 227708 240486 313785 308844 227854 194937 175964 254681 292723
11879 292723 286396 293917 304433 338472 350755 360849 407461 371178 407362 464538 479271 451123
$$ packed form
11963C58900L3382r60K1705j456L6396J4393K6696K252J3237L6015J5323q920
11951E46963n2701m6447o853j5236l6683j752m1893o4559j0908k3524K69M1180
11939B87856L4906L2825l8472j0216L9398j2526m4080K6899j2180j6174M13N4178
11927C42827J6314o709k6583j945M1364O0754K1058J4401L2033j8050o3236n6718
11915C55510k400L2450j6139q3113o5081J1491L2941o6471l4743K2486L3075L9997
11903B60003k2290j1739K9062K3508J9145o6176m8358p194K9788K3000K3730n3329
11891A99150n2483J7963O1938J140J2778P3299m941q0990l2917j8973P8717L8042
11879B92723o327P521J0516L4039J2283J0094M6612l6283L6184N7176J4733k8148
$$ plain form
11867 451123 400645 330431 237437 241736 290574 276197 225895 243012 180783 173023 170663 122340
11855 122340 142092 189969 174905 159480 163380 171585 191308 250958 219791 149152 113182 138749
11843 138749 190500 240866 265713 245306 341521 386851 438210 431033 467147 541423 609183 623500
11831 623500 614170 603012 562467 533328 466917 435960 357502 322229 372114 416673 352904 279572
11819 279572 321084 282624 266417 270085 221931 197338 231424 208746 184994 164615 168420 194694
11807 194694 231598 187344 162642 180955 187078 206398 195875 224874 255765 269640 286488 280503
11795 280503 288545 364943 439450 471095 458287 428590 376016 333663 310671 310511 268076 172215
11783 172215 99061 121268 169939 218327 226077 179368 151626 165780 161222 96049 86846 106865
$$ packed form
11867D51123n0478p0214r2994M299M8838j4377n0302J7117o2229p760k360m8323
11855A22340J9752M7877j5064j5425L900Q205J9723N9650l1167p0639l5970K5567
11843A38749N1751N0366K4847k0407R6215M5330N1359p177L6114P4276O7760J4317
11831F23500r330j1158m0545k9139o6411l0957p8458l5273M9885M4559o3769p3332
11819B79572M1512l8460j6207L668m8154k4593L4086k2678k3752k0379L805K6274
11807A94694L6904m4254k4702J8313O123J9320j0523K8999L0891J3875J6848n985
11795B80503Q042P6398P4507L1645j2808k9697n2574m2353k2992j60m2435r5861
11783A72215p3154K2207M8671M8388P750m6709k7742J4154m558o5173r203K0019
$$ plain form
11771 106865 73814 47858 89377 139834 184214 155487 96008 117394 123324 135786 145208 176928
11759 176928 202019 243169 226921 124721 76977 136606 145228 20775 6610 37644 61214
11748 61214 103527 149457 122138 129119 148854 127855 137569 128903 159687 124419 157560 216145
11736 216145 150246 81900 89050 88417 90957 83910 116504 133026 96915 108616 105543 154898 170556
11723 170556 148104 134767 166200 201238 164101 197042 124827 71295 55861 50472 45409 77745
11711 77745 51974 88526 70210 62567 94419 193492 193028 109268 90204 74311 70879 81459
11699 81459 94097 37219 45944 100143 136864 131398 157857 156624 116367 113274 108608 81487 129044
11686 129044 179664 171641 128983 138463 149748 138141 151931 157494 123914 101751 82137 101733
$$ packed form
11771A06865l3051k5956M1519N0457M4380k8727n9479K1386N930J2462R422L1720
11759A76928K5091M1150j6248j02200m7744N9629Q622j24453j4165L1034K3570
11748F1214M2313M5930k7319O981J9735k0999R714q666L0784l5268L3141N8585
11736B16145o5899o8346P150o33K540p047L2594J6522l6111J1701l073M9355J5658
11723A70556k2452j3337L1433L5038l7137L2941p2215n3532j5434n389n063L2336
11711G7745k5771L6552j8316p643L1852R9073m64q3760j9064j5893l432J0580
11699H1459J2638n6878Q725N4199L6721n466K6459j233m0257l093m666k7121M7557
11686A29044N0620q023m2658R480J1285j1607J3790N563l3580k2163j9614J9596
$$ plain form
11674 101733 114626 72812 68129 50283 23014 26783 39014 80630 100147 140035 141103 167362
11662 167362 171570 176454 173337 131534 133652 122011 87541 74504 68630 94613 90664 55264 39426
11649 39426 53628 98104 154111 183501 175430 191999 174231 155197 148110 182103 207805 183328
11637 183328 138920 110121 98475 116306 158923 134280 96150 53424 65970 71361 94891 103501
11625 103501 114237 133423 118116 114751 118282 107922 42368 19131 -6533 14777 98129 140815
11613 140815 171231 182140 162392 135722 123586 126869 154556 166287 156786 113244 95710 173468
11601 173468 192871 187587 186398 190139 201419 247586 210625 162069 105602 92254 106443 103384
11589 103384 87854 60501 61630 64198 82674 91713 77470 64512 68489 154696 158236 161740 135975
$$ packed form
11674A01733J2893m1814m683j7846k7269L769J2231M1616J9517L9888J068K6259
11662A67362M208M884l117m1803K118j1641l4470j3037n874K5983l949l5400j5838
11649C9426J4202M4476N6007K9390q071J6569j7768j9034p087L3993K5702k4477
11637A83328m4408k8799j1646J7831M2617k4643l8130m2726J2546N391K3530Q610
11625A03501J0736J9186j5307l365L531j0360o5554k3237k5664K1310Q3352M2686
11613A40815L0416J0909j9748k6670j2136L283K7687J1731r501m3542j7534P7758
11601A73468J9403n284j189L741J1280M6167l6961m8556n6467j3348J4189l059
11589A03384j5530k7353J129K568J8476R039j4243j2958L977Q6207L540L504k5765
$$ plain form
11576 135975 127420 92097 116738 105195 110354 146665 142334 94302 48184 110286 153276 126972
11564 126972 156744 118317 107793 89225 132809 178094 194086 149013 112223 102658 144980 194399
11552 194399 192088 225495 173126 129990 121485 132525 172002 157410 125298 166197 180720 130942
11540 130942 116474 184383 174857 132879 142783 166500 195825 152834 91863 141532 190220 130902
11528 130902 93663 136793 139126 142343 199527 189216 195980 199031 175768 168593 199431 197277 180655
11515 180655 177829 245686 266270 227979 187948 211890 196673 204845 243518 231936 199059 220387
11503 220387 280679 278131 239487 223156 222091 235349 246968 265147 258722 288363 302896 282657
11491 282657 257931 304834 342671 304678 299489 267735 255634 254731 295691 338174 351646 293899
$$ packed form
11576A35975q555l5323K4641j1543N159L6311m331m8032m6118O2102M2990k6304
11564A26972K9772l8427j0524j8568M3584M5285J5992m5073l6790r565M2322M9419
11552A94399k311L3407n2369m3136q505J1040L9477j4592l2112M0899J4523m9778
11540A30942j4468O7909r526m1978R904K3717K9325m2991o0971M9669M8688n9318
11528A30902l7239M3130K333L217N7184j0311O764L051k3263p175L0838k154j6622
11515A80655k826O7857K0584l8291m0031K3942j5217Q172L8673j1582l2877K1328
11503B20387O0292k548l8644j6331j065J3258J1619J8179o425K9641J4533k0239
11491B82657k4726M6903L7837l7993n189l1754j2101r03M0960M2483J3472n7747
$$ plain form
11479 293899 264559 251016 271290 342707 376336 420844 383160 342098 356259 404658 428843
11468 428843 483938 569142 600822 627032 609552 635220 691278 709591 782810 815183 778050
11457 778050 763612 777247 770735 732422 664102 591722 520896 432050 444943 483241 434993 455908
11445 455908 448666 448130 434718 405278 407428 449005 462839 407020 345717 291836 313994 408817
11433 408817 442832 470976 521737 526080 491797 454834 436791 387874 358263 359942 367639 377716
11421 377716 422966 388293 344600 328110 307688 286255 235486 220995 265233 343885 337320 297935
11409 297935 306020 347432 320048 286423 296795 255189 221709 200918 200011 170993 205708 223587
11397 223587 235556 228660 263313 370211 370391 354790 294850 225826 264847 293791 295664 234727
$$ packed form
11479B93899k9340j3543K0274P1417L3629M4508l7684m1062J4161M8399K4185
11468D28843N5095Q5204L1680K6210j7480K5668N6058J8313P3219L2373l7133
11457G78050j4438J3635o512l8313o8320p2380p0826q8846J2893L8298m8248K0915
11445D55908p242n36j3412k9440K150M1577J3834n5819o1303n3881K2158R4823
11433D08817L4015K8144N0761M343l4283l6963j8043m8917k9611J679P697J0077
11421C77716M5250l4673m3693j6490k0422k1433n0769j4491M4238P8652o565l9385
11409B97935Q085M1412k7384l3625J0372m1606l3480k0791r07k9018L4715J7879
11397B23587J1969o896L4653J06898J80j5601n9940o9024L9021K8944J873o0937
$$ plain form
11385 234727 225636 269859 274139 254096 251801 255092 196379 176455 160618 171193 233058 269373
11373 269373 267053 254022 253576 299716 336873 336030 306991 306553 265529 273248 326909 330375 291009
11360 291009 324134 413605 385120 410454 467978 457734 457650 512553 558669 570724 538936 479197
11348 479197 419129 366844 405006 476149 456352 386752 374095 376514 402091 402100 440371 489611
11336 489611 498370 456757 377447 374298 478849 475695 466163 490920 395224 372382 396299 468768
11324 468768 492638 502052 508792 530515 495967 421582 445421 483505 480163 437797 473885 521255
11312 521255 545928 509763 435652 429586 395621 389576 408868 446321 428329 413870 394318 332731
11300 332731 305530 353599 403150 458135 528204 558986 610587 615389 619562 614872 656419 621801
$$ packed form
11385B34727r091M4223M280k0043k295L291n8713j9924j5837J0575O1865L6315
11373B69373k320j3031m46M6140L7157q43k9039m38m1024P719N3661L466l9366
11360B91009L3125Q9471k8485K5334N7524j0244q4N4903M6116J2055l1788n9739
11348D79197o0068n2285L8162P1143j9797o9600j2657K419K5577RL8271M9240
11336D89611Q759m1613p9310l149J04551l154r532K4757r5696k2842K3917P2469
11324D68768K3870R414O740K1723l4548p4385K3839L8084l342m2366L6088M7370
11312E21255K4673l6165p4111o066l3965o045J9292L7453j7992j4459j9552o1587
11300C32731k7201M8069M9551N4985P0069L0782N1601M802M173m690M1547l4618
$$ plain form
11288 621801 593275 558205 517146 495632 463412 427397 394123 324983 295215 280175 308805
11277 308805 320765 332392 362549 326217 327279 295305 324289 365120 334330 306359 274282 241978
11265 241978 242775 285889 265183 294328 347864 376321 342721 290874 269066 277082 323401 392188
11253 392188 402699 414236 409178 373688 319662 296682 234608 203978 270643 345012 381684 365879
11241 365879 323763 257190 236855 244174 253257 269968 248281 247871 223123 207574 221784 253066
11229 253066 246757 262263 284471 299881 313899 293580 288880 260907 289946 327009 314948 280722
11217 280722 261556 287551 313214 316136 284268 283482 312873 298955 307464 384935 408675 370230
11205 370230 336488 286040 286252 279418 285397 313452 371791 408442 431723 375487 398213 422923
$$ packed form
11288F21801k8526l5070m1059k1514l2220l6015l3274o9140k9768j5040K8630
11277C08805J1960J1627L0157l6332J062l1974K8984M0831l0790k7971l2077l2304
11265B41978P97M3114k0706K9145N3536K8457l3600n1847k1808Q016M6319O8787
11253C92188J0511J1537n058l5490n4026k2980o2074l0630O6665P4369L6672j5805
11241C65879m2116o6573k0335P319R083J6711k1687m10k4748j5549J4210L1282
11229B53066o309J5506K2208J5410J4018k0319m700k7973K9039L7063j2061l4226
11217B80722j9166K5995K5663K922l1868p86K9391j3918Q509P7471K3740l8445
11205C70230l3742n0448K12o834N979K8055N8339L6651K3281n6236K2726K4710
$$ plain form
11193 422923 423590 346322 326624 377234 411338 460022 482966 462284 436854 489376 605630 711903
11181 711903 764679 810000 896223 941260 995992 1038672 1121377 1176024 1132838 1112807 1028313
11170 1028313 913275 775711 642125 568015 533467 463060 433103 450311 469726 447369 419821
11159 419821 386890 375159 439524 395539 407026 393019 399841 457444 486437 508165 485695 460331
11147 460331 448117 421850 453567 420183 356898 336443 351900 390299 395811 352325 351031 407820
11135 407820 437526 399394 370162 375475 375416 419906 404407 388344 408821 453832 458720 435913
11123 435913 443421 436104 461335 453931 462756 443101 402437 374711 394291 405497 429885 463243
11111 463243 527458 538887 558436 554464 535596 552816 628845 725915 734584 700812 698019 759500
$$ packed form
11193D22923O67p7268j9698N0610L4104M8684K2944k0682k5430N2522J16254J06273
11181G11903N2776M5321Q6223M5037N4732M2680Q2705N4647m3186k0031q4494
11170A028313j15038j37564j33586p4110l4548p0407k9957J7208J9415k2357k7548
11159D19821l2931j1731O4365m3985J1487j4007O822N7603K8993K1728k2470k5364
11147D60331j2214k6267L1717l3384o3285k0455J5457L8399N512m3486j294N6789
11135D07820K9706l8132k9232N313n9M4490j5499j6063K0477M5011M888k2807
11123D35913P508p317K5231p404Q825j9655m0664k7726J9580J1206K4388L3358
11111D63243O4215J1429J9549l972j8868J7220P6029R7070Q669l3772k793O1481
$$ plain form
11099 759500 754207 706029 676004 686940 686736 671026 690584 674038 687885 720329 725552 758507
11087 758507 810512 860897 835449 827750 861334 868956 852236 844047 783864 741741 702727 702648 712532
11074 712532 656759 684315 678595 724216 802766 850435 811072 781827 811224 808282 779911 773593
11062 773593 754736 780826 801389 735613 742472 751577 763820 753334 751546 758052 762856 786898
11050 786898 752966 799592 824251 780525 733968 717752 747497 781641 797661 780226 815561
11039 815561 805965 792820 812530 882434 946605 994288 1063087 1136105 1160269 1152226 1062494 1010565
11027 1010565 970325 876325 837265 819506 820315 839006 849724 900811 928239 913807 922679 897620
11015 897620 852963 863831 875398 831207 809752 789611 758225 860117 978629 998829 1036832
$$ packed form
11099G59500n293m8178l0025J0936k04j5710J9558j6546J3847L2444N223L2955
11087G58507N2005N0385k5448p699L3584P622j6720q189o0183m2123l9014p9R884
11074G12532n5773K7556n720M5621P8550M7669l9363k9245K9397k942k8371o318
11062G73593j8857K6090K0563o5776O859R105J2243j0486j788O506M804K4042
11050G86898l3932M6626K4659m3726m6557j6216K9745L4144J6020j7435L5335
11039H15561r596j3145J9710O9904O4171M7683O8799P3018K4164q043q9732n1929
11027A010565m0240r4000l9060j7759Q09J8691J0718N1087K7428j4432Q872k5059
11015H97620m4657J0868J1567m4191k1455k0141l1386J01892J18512K0200L8003
$$ plain form
11004 1036832 1066837 1115460 1169386 1119196 1034884 1061040 1130505 1179767 1196527 1196769 1222491 1181203
10992 1181203 1203435 1226278 1228838 1224056 1237824 1228850 1272550 1316900 1342744 1305326 1246392 1261875
10980 1261875 1349728 1378025 1398189 1403809 1447128 1507516 1558970 1621034 1648985 1677562 1752047
10969 1752047 1838037 1952577 2039419 2118906 2145682 2244422 2360295 2495269 2637638 2784877
10959 2784877 2953039 3177408 3432254 3763670 4129500 4542656 4985401 5554682 6313216
10950 6313216 7256363 8479470 9976090 11876940 14414729 17624692 21713153 26656671
10942 26656671 32356660 38443212 44688988 50719765 56083912 60079849 61960605 61462649
10934 61462649 58734270 54334022 49038197 43682610 38911777 34776376 31351267 28688477
$$ packed form
11004A036832L0005M8623N3926n0190q4312K6156O9465M9262J6760K42K5722m1288
10992A181203K2232K2843K560m782J3768q974M3700M4350K5844l7418n8934J5483
10980A261875Q7853K8297K0164N620M3319O0388N1454O2064K7951K8577P4485
10969A752047Q5990J14540Q6842P9487K6776R8740J15873J34974J42369J47239
10959B784877J68162K24369K54846L31416L65830M13156M42745N69281P58534
10950F313216R43147J223107J496620J900850K537789L209963M088461M943518
10942B6656671N699989O086552O245776O030777N364147L995937J880756m97956
10934F1462649k728379m400248n295825n355587m770833m135401l425109k662790
$$ plain form
10926 28688477 26731332 25584135 25291650 25852968 27162087 28989105 31121670 33437562
10918 33437562 35890484 38174823 39896985 41060942 41865509 42741155 43963260 45960523
10910 45960523 48865278 52382702 56109111 59572269 62133644 63346721 62913710 60859107
10902 60859107 57651976 54050207 50588821 47720863 45677459 44334828 43257335 42143528
10894 42143528 40761971 38881640 36381193 33461690 30706505 28714758 27639320 27411487
10886 27411487 27955029 29274693 31304478 33957512 37257548 41092658 45326682 49700630
10878 49700630 53778917 57337128 60208374 61878501 61833496 59777577 55815881 50326337
10870 50326337 43949962 37576386 31988966 27527375 24069439 21439894 19346797 17654307
$$ packed form
10926B8688477j957145j147197k92485N61318J309119J827018K132565K315892
10918C3437562K452922K284339J722162J163957Q04567Q75646J222105J997263
10910D5960523K904755L517424L726409L463158K561375J213077m33011k054603
10902F0859107l207131l601769l461386k867958k043404j342631j077493j113807
10894D2143528j381557j880331k500447k919503k755185j991747j075438k27833
10886B7411487N43542J319664K029785K653034L300036L835110M234024M373948
10878D9700630M078287L558211K871246J670127m5005k055919l961696n489544
10870E0326337o376375o373576n587420m461591l457936k629545k093097j692490
$$ plain form
10862 17654307 16289814 15214899 14319089 13490047 12754647 12139281 11589516 11079656 10590547
10853 10590547 10186698 9807799 9452178 9080224 8698249 8353845 8027765 7708241 7471578
10844 7471578 7197801 7041371 6855403 6668176 6417258 6214597 6067355 5919387 5791979
10835 5791979 5719460 5567585 5395994 5254048 5184555 5017699 4811494 4656746 4538084 4451808
10825 4451808 4331134 4161689 4040853 3980357 3956900 3853634 3758560 3642754 3557807 3555417
10815 3555417 3591090 3551179 3489072 3494106 3463147 3369188 3271801 3199261 3118879 3145103 3215704
10804 3215704 3177937 3190991 3240132 3323470 3418869 3542717 3741080 4020397 4256256 4454581
10794 4454581 4572367 4644100 4607191 4340279 3920323 3558747 3326059 3163807 3051091 2989938
$$ packed form
10862A7654307j364493j074915q95810q29042p35400o15366n49765n09860m89109
10853A0590547m03849l78899l55621l71954l81975l44404l26080l19524k36663
10844G471578k73777j56430j85968j87227k50918k02661j47242j47968j27408
10835E791979p2519j51875j71591j41946o9493j66856k06205j54748j18662q6276
10825D451808j20674j69445j20836o0496k3457j03266r5074j15806q4947k390
10815C555417L5673l9911o2107N034l0959r3959r7387p2540q0382K6224P0601
10804C215704l7767J3054M9141Q3338R5399J23848J98363K79317K35859J98325
10794D454581J17786P1733l6909k66912m19956l61576k32688j62252j12716o1153
$$ plain form
10784 2989938 2883951 2762613 2708588 2663004 2736266 2804288 2798239 2824366 2896025 2965967 2997921
10773 2997921 3028128 3058583 3161204 3245656 3307322 3388995 3442897 3536068 3590103 3639981 3826004
10762 3826004 4182137 4593570 5026210 5494518 6057518 6725158 7650177 8853424 10332914
10753 10332914 11952411 13985548 16914102 21556193 28734757 40278572 59349408 87777094
10745 87777094 117073349 131635415 140887994 162501580 197840355 217140878 168838509
10738 168838509 107897793 72229930 52678429 41172691 34069269 29090297 26083469
10731 26083469 23652770 21902240 20442919 19122842 17939121 16983686 16314841 15673319
10723 15673319 15032374 14376799 13840829 13460382 13061458 12667531 12226610 11781400 11382759
$$ packed form
10784B989938j05987j21338n4025m5584P3262O8022o049K6127P1659O9942L1954
10773B997921L0207L0455J02621Q4452O1666Q1673N3902R3171N4035M9878J86023
10762C826004L56133M11433M32640M68308N63000O67640R25019J203247J479490
10753A0332914J619497K033137K928554M642091P178564J1543815J9070836K8427686
10745H7777094K9296255J4562066R252579K1613586L5338775J9300523m8302369
10738A68838509o0940716l5667863j9551501j1505738p103422m978972l006828
10731B6083469k430699j750530j459321j320077j183721r55435o68845o41522
10723A5673319o40945o55575n35970l80447l98924l93927m40921m45210l98641
$$ plain form
10714 11382759 11000750 10693975 10517002 10290817 10003042 9858096 9811734 9767857 9812945 9894133
10704 9894133 10040706 10211143 10431388 10777854 11297704 12035270 13041356 14482582 16427843
10695 16427843 18966696 22250424 26315789 31064932 36168791 41378895 46498823 50943574
10687 50943574 53900124 54811014 53648880 50781089 46582514 41724442 36978839 33046281
10679 33046281 30173660 28196442 26965630 26222070 25654534 25240947 24927812 24696113 24720838
10670 24720838 25210353 26251522 27762081 29686230 31873535 34203214 36470209 38431895
10662 38431895 39936876 41227351 42411557 43733506 45543527 47964637 50894454 54064214
10654 54064214 56943621 59126996 60076023 59581919 57629865 54458615 50656852 46899462
$$ packed form
10714A1382759l82009l06775j76973k26185k87775j44946m6362m3877M5088Q1188
10704I894133J46573J70437K20245L46466N19850P37566J006086J441226J945261
10695A6427843K538853L283728M065365M749143N103859N210104N119928M444751
10687E0943574K956550R10890j162134k867791m198575m858072m745603l932558
10679C3046281k872621j977218j230812p43560n67536m13587l13135k31699K4725
10670B4720838M89515J041169J510559J924149K187305K329679K266995J961686
10662C8431895J504981J290475J184206J321949J810021K421110K929817L169760
10654E4064214K879407K183375R49027m94104j952054l171250l801763l757390
$$ plain form
10646 46899462 43541184 40980786 39425347 38758052 38659520 38821118 38866318 38505664 37563946
10637 37563946 36100435 34265936 32169253 30174288 28578174 27698397 27578596 27943936
10629 27943936 28795468 30005014 31479611 33247834 35453339 38209083 41617960 45711411
10621 45711411 50435129 55358804 60126949 64175254 66683176 66947413 64678007 59962394
10613 59962394 53341961 45927319 38807430 32692295 27858239 24217739 21503362 19386330
10605 19386330 17674342 16240051 15094333 14142131 13283151 12578789 11988666 11471570 10977522
10596 10977522 10513362 10053367 9584595 9203079 8834247 8436230 8094370 7746348 7400625
10587 7400625 7068717 6779418 6485378 6198871 5983243 5733784 5506706 5362104 5255741
$$ packed form
10646D6899462l358278k560398j555439o67295r8532J61598M5200l60654r41718
10637C7563946j463511j834499k096683j994965j596114q79777j19801L65340
10629B7943936Q51532J209546J474597J768223K205505K755744L408877M093451
10621D5711411M723718M923675M768145M048305K507922K64237k269406m715613
10613E9962394o620433p414642p119889o115135m834056l640500k714377k117032
10605A9386330j711988j434291j145718r52202q58980p04362n90123n17096m94048
10596A0977522m64160m59995m68772l81516l68832l98017l41860l48022l45723
10587G400625l31908k89299k94040k86507k15628k49459k27078j44602j06363
$$ plain form
10578 5255741 5113385 4967593 4816590 4682589 4569192 4395595 4273348 4167091 4022839
10569 4022839 3827648 3717596 3681493 3581939 3487758 3434267 3359543 3245562 3151505 3086390 2998788
10558 2998788 2975260 2980596 2871667 2700637 2543862 2528059 2491915 2399805 2364698 2311255 2263116
10547 2263116 2143674 2103445 2064904 1980886 1944985 1924774 1864754 1866741 1862245 1856708 1816143 1753200
10535 1753200 1734717 1681229 1624252 1637911 1664737 1582127 1524419 1468890 1427795 1426638 1453384
10524 1453384 1489162 1519179 1541434 1525369 1577144 1593788 1562295 1577668 1661952 1689893 1653763
10513 1653763 1559179 1539544 1477341 1367509 1343185 1373155 1332553 1342025 1317120 1299961 1381746
10502 1381746 1488502 1590883 1696603 1738014 1784070 1786262 1755392 1758497 1806527 1813869 1743730
$$ packed form
10578E255741j42356j45792j51003j34001j13397j73597j22247j06257j44252
10569D022839j95191j10052l6103r9554r4181n3491p4724j13981r4057o5115q7602
10558B998788k3528N336j08929j71030j56775j5803l6144r2110l5107n3443m8139
10547B263116j19442m0229l8541q4018l5901k0211o0020J987m496n537m0565o2943
10535A753200j8483n3488n6977J3659K6826q2610n7708n5529m1095j157K6746
10524A453384L5778L0017K2255j6065N1775J6644l1493J5373Q4284K7941l6130
10513A653763r4584j9635o2203j09832k4324K9970m0602R472k4905j7159Q1785
10502A381746J06756J02381J05720M1411M6056K192l0870L105M8030P342p0139
$$ plain form
10491 1743730 1691107 1685641 1679654 1651217 1648209 1660339 1766170 1799779 1802272 1826474 1806783 1808301
10479 1808301 1832981 1829827 1840292 1895478 1958923 2010729 2028189 1995284 1844148 1809400 1800895
10468 1800895 1804567 1721478 1643103 1595242 1621028 1632100 1663279 1711484 1735468 1749868 1720972
10457 1720972 1745204 1806932 1860718 1922772 1932734 1877105 1888125 1907226 1915574 1873656 1885972 1837724
10445 1837724 1769051 1777100 1787109 1776811 1824525 1878978 1844154 1860396 1920376 2006914 2103589
10434 2103589 2231087 2376988 2490404 2515562 2617339 2645298 2691256 2698927 2667926 2690679 2685508
10423 2685508 2724537 2719251 2746148 2835770 2962094 3066077 3135576 3212989 3299875 3463804 3631576
10412 3631576 3803527 3983211 4214912 4471607 4802458 5121872 5415101 5685027 5995668
$$ packed form
10491A743730n2623n466n987k8437l008J2130J05831L3609K493K4202j9691J518
10479A808301K4680l154J0465N5186O3445N1806J7460l2905j51136l4748q505
10468A800895L672q3089p8375m7861K5786J1072L1179M8205K3984J4400k8896
10457A720972K4232O1728N3786O2054R962n5629J1020J9101Q348m1918J2316m8248
10445A837724o8673Q049J0009j0298M7714N4453l4824J6242N9980Q6538R6675
10434B103589J27498J45901J13416K5158J01777K7959M5958P671l1001K2753n171
10423B685508L9029n286K6897Q9622J26324J03983O9499P7413Q6886J63929J67772
10412C631576J71951J79684K31701K56695L30851L19414K93229K69926L10641
$$ plain form
10403 5995668 6236281 6539240 6976618 7508946 8129713 8826697 9798099 11032392 12392553
10394 12392553 13866614 15516033 17472823 19724205 22238462 25050070 28348326 32641128
10386 32641128 38420894 46467473 58021338 74755452 99011069 133653527 179724822
10379 179724822 231643058 277271760 312594172 347909915 388562069 415536884 392786428
10372 392786428 319022175 238474174 177756044 136902125 109773275 91248621 78306384
10365 78306384 69053451 62174262 57007098 52830253 49398314 46584223 44288317 42406161
10357 42406161 40609754 38576131 36318120 34219749 32396866 30727845 29200747 27721768
10349 27721768 26223642 24857200 23646956 22536709 21492245 20514084 19647713 18762109
$$ packed form
10403E995668K40613L02959M37378N32328O20767O96984R71402J234293J360161
10394A2392553J474061J649419J956790K251382K514257K811608L298256M292802
10386C2641128N779766Q046579J1553865J6734114K4255617L4642458M6071295
10379A79724822N1918236M5628702L5322412L5315743M0652154K6974815k2750456
10372C92786428p3764253q0548001o0718130m0853919k7128850j8524654j2942237
10365G8306384r252933o879189n167164m176845l431939k814091k295906j882156
10357D2406161j796407k033623k258011k098371j822883j669021j527098j478979
10349B7721768j498126j366442j210244j110247j044464r78161q66371q85604
$$ plain form
10341 18762109 17911964 17219892 16642197 16090454 15560997 15014842 14484025 13973886 13526943
10332 13526943 13092215 12622909 12159486 11763694 11356119 10930955 10536930 10116701 9732760
10323 9732760 9384860 9109453 8793019 8438480 8179600 8042527 7857804 7593220 7382774
10314 7382774 7200037 7046400 6887702 6732776 6574183 6457753 6346003 6228470 6125942
10305 6125942 6061129 5991106 5886752 5698765 5505720 5384740 5168112 4909365 4796241 4608145
10295 4608145 4390776 4231439 4116309 4015314 3857038 3762216 3650146 3457352 3334449 3309887
10285 3309887 3241413 3139290 3035143 2965280 2854048 2709654 2606812 2553664 2501577 2462056
10275 2462056 2407603 2393981 2353031 2308466 2266978 2211918 2192463 2139220 2105318 2089670 2033423
$$ packed form
10341A8762109q50145o92072n77695n51743n29457n46155n30817n10139m46943
10332A3526943m34728m69306m63423l95792m07575m25164l94025m20229l83941
10323I732760l47900k75407l16434l54539k58880j37073j84723k64584k10446
10314G382774j82737j53637j58698j54926j58593j16430j11750j17533j02528
10305F125942o4813p0023j04354j87987j93045j20980k16628k58747j13124j88096
10295D608145k17369j59337j15130j00995j58276r4822j12070j92794j22903k4562
10285C309887o8474j02123j04147o9863j11232j44394j02842n3148n2087l9521
10275B462056n4453j3622m0950m4565m1488n5060j9455n3243l3902j5648n6247
$$ plain form
10264 2033423 1968111 1922303 1855779 1769902 1652155 1604707 1582711 1594962 1566710 1572233 1544592
10253 1544592 1514365 1569537 1640281 1678950 1696105 1794128 1878515 1910856 1906604 1893551 1864563
10242 1864563 1764141 1654274 1556551 1491773 1442071 1369466 1319887 1293967 1276038 1228461 1155880
10231 1155880 1141491 1149436 1162748 1152354 1098093 1055243 1016907 1017051 1031637 1048376 1050596 980663
10219 980663 996782 1054408 1015553 966816 974097 951947 953156 963908 940553 913270 937131 973688
10207 973688 965311 903631 919411 944503 912043 873873 881638 873461 851467 835745 828065 879014
10195 879014 881942 872415 832736 755312 750941 728191 685390 654307 629528 574467 544623 528126
10183 528126 541951 547541 551843 576895 633593 560604 498038 477526 492854 526179 594952 577484
$$ packed form
10264B033423o5312m5808o6524q5877j17747m7448k1996J2251k8252N523k7641
10253A544592l0227N5172P0744L8669J7155R8023Q4387L2341m252j3053k8988
10242A864563j00422j09867r7723o4778m9702p2605m9579k5920j7929m7577p2581
10231A155880j4389P945J3312j0394n4261m2850l8336J44J4586J6739K220o9933
10219I80663J6119N7626l8855m8737P281k2150J209J0752k3355k7283K3861L6557
10207I73688q377o1680J5780K5092l2460l8170P765q177k1994j5722p680N0949
10195H79014K928r527l9679p7424m371k2750m2801l1083k4779n5061k9844j6497
10183E28126J3825N590M302K5052N6698p2989o2566k0512J5328L3325O8773j7468
$$ plain form
10171 577484 579361 564040 502308 492206 503080 556816 600930 637566 600631 548210 534575 529868
10159 529868 486234 454556 426688 426477 464779 489054 496794 486743 486368 491427 400290 360501 391873
10146 391873 403648 386872 380350 358439 381414 436398 502121 509968 440458 405269 388077 369820
10134 369820 292759 236764 271866 287247 277237 257458 260287 250919 228097 249589 242271 235808
10122 235808 262927 221314 197596 200061 210373 208290 213669 219505 220763 259897 288531 298443 315246
10109 315246 308474 318955 377468 380753 376691 352497 313620 305587 330191 336451 357176 339172
10097 339172 333493 331190 319341 323563 321661 279323 290179 336638 359327 298381 192401 224345
10085 224345 235342 201182 205667 201957 184538 224152 215903 146529 137182 140945 164811 154042
$$ packed form
10171E77484J877j5321o1732j0102J0874N3736M4114L6636l6935n2421j3635m707
10159E29868m3634l1678k7868k11L8302K4275P740j0051l75N059r1137l9789L1372
10146C91873J1775j6776o522k1911K2975N4984O5723P847o9510l5189j7192j8257
10134C69820p7061n5995L5102J5381j0010j9779K829r368k2822K1492p318o463
10122B35808K7119m1613k3718K465J0312k083N379N836J258L9134K8634R912J6803
10109C15246o772J0481N8513L285m062k4194l8877q033K4604O260K0725j8004
10097C39172n679k303j1849M222j902m2338J0856M6459K2689o0946j05980L1944
10085B24345J0997l4160M485l710j7419L9614q249o9374r347L763K3866j0769
$$ plain form
10073 154042 127067 116571 110743 112857 100313 142404 139491 146706 171349 207277 195425 178396
10061 178396 198201 208060 236702 243192 227786 244604 296165 253951 216647 245689 264589 296950
10049 296950 295553 311127 305401 346512 335501 356493 352001 332084 315604 343510 322362 330319
10037 330319 411189 413656 372297 362390 330301 323019 314956 286449 302927 317965 307743 329549
10025 329549 334623 293649 254915 234115 217737 217587 211336 204215 205894 247724 278081 270711 287479
10012 287479 347043 384001 356994 330309 343378 335670 315888 322953 321451 260397 268689 277492
10000 277492 241078 300508 392196 424931 432857 481897 424496 385936 420539 482231 484051 472077
9988 472077 495331 462599 389565 291053 286778 286506 322773 311153 341183 374733 370361 361585 351822
$$ packed form
10073A54042k6975j0496n828K114j2544M2091k913P215K4643L5928j1852j7029
10061A78396J9805R859K8642O490j5406J6818N1561m2214l7304K9042J8900L2361
10049B96950j397J5574n726M1111j1011K0992m492j9917j6480K7906k1148P957
10037C30319Q0870K467m1359r907l2089p282q063k8507J6478J5038j0222K1806
10025C29549N074m0974l8734k0800j6378j50o251p121J679M1830L0357p370J6768
10012B87479N9564L6958k7007k6685J3069p708j9782P065j502o1054Q292Q803
10000B77492l6414N9430R1688L2735P926M9040n7401l8560L4603O1692J820j1974
9988D72077K3254l2732p3034r8512m275k72L6267j1620L0030L3550m372q776r763
$$ plain form
9975 351822 372275 372833 391279 400630 407376 450456 479890 526449 558107 559387 543101 617594 673807
9962 673807 724084 733247 723383 760977 900594 1037339 1216396 1396743 1652138 1928154 2178302
9951 2178302 2316334 2483283 2574415 2474094 2157943 1876525 1573982 1379396 1245507 1110865
9941 1110865 1044296 961410 955067 979802 990095 919018 869659 865666 829671 810421 848931 904156
9929 904156 915799 956229 934573 941564 891267 866325 892683 899784 901404 894398 899138 970968 995669
9916 995669 997530 1005821 1027708 1080953 1126587 1232941 1328308 1372604 1510216 1644221 1829959
9905 1829959 2047858 2239165 2452941 2759949 3157655 3669497 4334560 5112186 6219529
9896 6219529 7634506 9305966 11103977 12863566 14523334 15914756 17051908 17499211
$$ packed form
9975C51822K0453N58J8446R351O746M3080K9434M6559L1658J280j6286P4493N6213
9962F73807N0277R163r864L7594J39617J36745J79057J80347K55395K76016K50148
9951B178302J38032J66949R1132j00321l16151k81418l02543j94586j33889j34642
9941A110865o6569q2886o343K4735J0293p1077m9359l993l5995j9250L8510N5225
9929I04156J1643M0430k1656O991n0297k4942K6358P101J620p006M740P1830K4701
9916I95669J861Q291K1887N3245M5634J06354R5367M4296J37612J34005J85738
9905A829959K17899J91307K13776L07008L97706N11842O65063P77626J107343
9896F219529J414977J671460J798011J759589J659768J391422J137152M47303
$$ plain form
9888 17499211 16937159 15449719 13461826 11601232 10266563 9464991 8949794 8698028 8560939
9879 8560939 8492230 8518659 8443330 8274443 8115340 8097099 8262405 8677279 9276883 9944953
9869 9944953 10639614 11514993 12510104 13438929 13979684 14417525 15027641 16029599 17500436
9860 17500436 19239513 21277368 23612343 26255831 29076642 31986523 34875359 37316215
9852 37316215 38868197 39405500 39361633 38954123 37992915 36496650 34571427 32402247 30436163
9843 30436163 28805423 27376784 26143059 25135417 24318849 23515440 22743653 22123744 21824352
9834 21824352 21965629 22529772 23335554 24145251 24891997 25758166 26765496 27694826 28393664
9825 28393664 29103690 30299041 31929625 34056757 36626664 39440932 41972559 43753618
$$ packed form
9888A7499211n62052j487440j987893j860594j334669q01572n15197k51766j37089
9879H560939o8709K6429p5329j68887j59103j8241J65306M14874N99604O68070
9869I944953O94661Q75379R95111R28825N40755M37841O10116J001958J470837
9860A7500436J739077K037855K334975K643488K820811K909881K888836K440856
9852C7316215J551982N37303m3867m07510r61208j496265j925223k169180j966084
9843C0436163j630740j428639j233725j007642q16568q03409p71787o19909k99392
9834B1824352J41277N64143Q05782Q09697P46746Q66169J007330R29330O98838
9825B8393664P10026J195351J630584K127132K569907K814268K531627J781059
$$ plain form
9817 43753618 44953613 45900166 46539439 46819232 46798592 46459621 45764180 44671133 42965808
9808 42965808 40441509 37432752 34505552 32193425 30708565 29778610 28779120 27372755
9800 27372755 25829039 24563176 23633885 23058216 22730522 22680589 22896153 23347534 24141839
9791 24141839 25035321 25974514 26731492 27454950 28258104 29222805 30342996 31617009 32846327
9782 32846327 33865868 34712830 35548778 36155531 36342675 35946291 34974569 33444601 31227983
9773 31227983 28812746 26673593 24803830 23132818 21712586 20538301 19447326 18406123
9765 18406123 17487043 16671715 15942244 15074289 14045062 13011762 12190267 11585985 11197006
9756 11197006 10975771 10866557 10862296 10857721 10787865 10735881 10717128 10739270 10928540 11385467 12127353
$$ packed form
9817D3753618J199995R46553O39273K79793k0640l38971o95441j093047j705325
9808D2965808k524299l008757k927200k312127j484860r29955r99490j406365
9800B7372755j543716j265863r29291n75669l27694m9933K15564M51381P94305
9791B4141839Q93482R39193P56978P23458Q03154R64701J120191J274013J229318
9782C2846327J019541Q46962Q35948O06753J87144l96384r71722j529968k216618
9773C1227983k415237k139153j869763j671012j420232j174285j090975j041203
9765A8406123r19080q15328p29471q67955j029227j033300q21495o04282l88979
9756A1197006k21235j09214m261m575o9856n1984j8753K2142J89270M56927P41886
$$ plain form
9745 12127353 13064013 14093955 15087875 15922563 16636927 16994083 16781817 15851863 14152690
9736 14152690 12168690 10353737 8936895 7876106 7140714 6588208 6114793 5709102 5420323
9727 5420323 5195617 4973003 4735486 4519466 4270114 4107942 4033164 3866478 3698946 3578232
9717 3578232 3435400 3334654 3263039 3210844 3158894 3096745 3086708 2990774 2864554 2777558 2713649
9706 2713649 2681996 2630338 2562597 2456347 2410975 2428533 2351605 2314090 2276563 2268285 2224944
9695 2224944 2183433 2205636 2183340 2128690 2079944 2003185 2018139 2036970 2028903 2016851 2014309 1953278
9683 1953278 1929195 1951303 1990801 1981495 1980693 1959375 1959423 1929771 1926764 1899284 1861263 1805147 1813784
9670 1813784 1871361 1879291 1885824 1905854 1852340 1831193 1871345 1917527 1954402 1940428 1926048 1970287
$$ packed form
9745A2127353R36660J029942R93920Q34688P14364L57156k12266r29954j699173
9736A4152690j984000j814953j416842j060789p35392n52506m73415m05691k88779
9727E420323k24706k22614k37517k16020k49352j62172p4778j66686j67532j20714
9717C578232j42832j00746p1615n2195n1950o2149j0037r5934j26220q6996o3909
9706B713649l1653n1658o7741j06250m5372J7558p6928l7515l7527q278m3341
9695B224944m1511K2203k2296n4650m8746p6759J4954J8831q067j2052k542o1031
9683A953278k4083K2108L9498r306q02k1318M8k9652l007k7480l8021n6116Q637
9670A813784N7577P930O533K0030n3514k1147M0152M6182L6875j3974j4380M4239
$$ plain form
9658 1970287 2019708 2011582 2038731 2078650 2104086 2097361 2162880 2269663 2292828 2310133 2372201 2465202
9646 2465202 2542796 2530077 2610186 2776361 2888809 2928819 3010399 3048584 3113558 3314370 3442232
9635 3442232 3587579 3754871 3918070 4022407 4121847 4236672 4456141 4705944 4990403 5207709
9625 5207709 5470049 5818480 6149816 6538085 6951484 7339622 7711240 8178373 8699468 9306589
9615 9306589 9999564 10675538 11407508 12250337 13153936 14098115 15046059 16025709 17025997
9606 17025997 18019027 19092302 20198975 21221718 22140058 22961375 23653374 24194969 24549952
9597 24549952 24701873 24638900 24389458 23974326 23397708 22712973 21908201 21001371 20084830 19140478
9587 19140478 18145123 17213888 16348616 15550588 14755360 14034781 13309791 12582770 11948999
$$ packed form
9658A970287M9421q126K7149L9919K5436o725O5519J06783K3165J7305O2068R3001
9646B465202P7594j2719Q0109J66175J12448M0010Q1580L8185O4974K00812J27862
9635C442232J45347J67292J63199J04337R9440J14825K19469K49803K84459K17306
9625E207709K62340L48431L31336L88269M13399L88138L71618M67133N21095O07121
9615I306589O92975O75974P31970Q42829R03599R44179R47944R79650J000288
9606A7025997R93030J073275J106673J022743R18340Q21317O91999N41595L54983
9597B4549952J51921o2973k49442m15132n76618o84735q04772r06830r16541r44352
9587A9140478r95355r31235q65272p98028p95228p20579p24990p27021o33771
$$ plain form
9578 11948999 11366468 10828621 10322058 9890778 9447586 9018714 8631222 8222016 7837032
9569 7837032 7454274 7155883 6876520 6630431 6398948 6149644 5929680 5722193 5504311 5326514
9559 5326514 5140339 5017540 4846887 4656159 4475774 4373148 4246601 4126759 3988172 3834082
9549 3834082 3679250 3582503 3522667 3439390 3311663 3188053 3074296 2956575 2848196 2862976
9539 2862976 2819655 2797797 2713312 2612438 2567244 2479692 2389566 2324757 2324124 2277342 2155309
9528 2155309 2091914 2064298 2016010 1918304 1892486 1833308 1816938 1759252 1663193 1661444 1610532 1539774
9516 1539774 1516001 1462597 1408668 1380627 1414533 1457657 1421808 1407796 1387026 1303020 1299258 1325569
9504 1325569 1267032 1212382 1173004 1147902 1121966 1102927 1099260 1071660 1012371 980052 981995 975187
$$ packed form
9578A1948999n82531n37847n06563m31280m43192m28872l87492m09206l84984
9569G837032l82758k98391k79363k46089k31483k49304k19964k07487k17882j77797
9559E326514j86175j22799j70653j90728j80385j02626j26547j19842j38587j54090
9549C834082j54832r6747n9836q3277j27727j23610j13757j17721j08379J4780
9539B862976m3321k1858q4485j00874m5194q7552r0126o4809o33m6782j22033
9528B155309o3395k7616m8288r7706k5818n9178j6370n7686r6059j749n0912p0758
9516A539774k3773n3404n3929k8041L3906M3124l5849j4012k0770q4006l762K6311
9504A325569n8537n4650l9378k5102k5936j9039l667k7600n9289l2319J943o808
$$ plain form
9492 975187 921364 896922 848757 845240 857818 863655 857517 845695 801245 764732 757092 815572
9480 815572 832762 771833 750165 700573 695278 670963 664898 715724 707747 653551 593264 591005
9468 591005 631875 597296 535749 517159 537752 525477 562153 592267 579683 621512 673266 680319
9456 680319 669166 598711 575595 580383 587118 602111 634103 584863 549286 524683 539682 575576
9444 575576 536254 557385 546143 572440 493576 462558 455255 527994 504221 422862 331242 292855
9432 292855 304654 328995 359876 351063 370974 404147 400855 417867 415076 390010 391286 383575 364996
9419 364996 399688 429931 511168 525004 490097 480389 510446 507503 468170 497866 523877 511757
9407 511757 440671 401842 380795 335260 334073 329145 363206 357596 375824 391152 319044 235204
$$ packed form
9492I75187n3823k4442m8165l517J2578N837o138j1822m4450l6513p640N8480
9480H15572J7190o0929k1668m9592n295k4315o065N0826p977n4196o0287k259
9468E91005M0870l4579o1547j8590K0593j2275L6676L0114j2584M1829N1754P053
9456F80319j1153p0455k3116M788O735J4993L1992m9240l5577k4603J4999L5894
9444E75576l9322K1131j1242K6297p8864l1018p303P2739k3773q1359r1620l8387
9432B92855J1799K4341L0881q813J9911L3173l292J7012k791k5066J276p711j8579
9419C64996L4692L0243Q1237J3836l4907r708L0057k943l9333K9696K6011j2120
9407E11757p1086l8829k1047m5535j187m928L4061n610J8228J5328p2108q3840
$$ plain form
9395 235204 204376 207041 203152 206902 240091 236015 268765 333488 338979 347390 332034 424469 430095
9382 430095 368786 319280 271780 268449 296206 323914 339493 334642 294969 330712 375595 395509
9370 395509 434279 432730 318289 250171 266685 317937 382093 348406 281706 253438 205567 149144
9358 149144 169453 177895 207905 229568 252467 245911 198954 150592 133363 163216 199433 163127
9346 163127 130168 125021 96107 52680 115897 125794 120037 82462 86831 155740 146722 88526 53296
9333 53296 100544 157683 167042 127933 77929 83796 114141 136198 107285 66685 85973 129621
9321 129621 152365 176255 115976 96534 128787 118495 152404 155850 57478 31401 13362 -4208
9309 -4208 -8327 30186 50918 60936 42785 59177 74905 83549 87305 101323 88701 89521 82705
$$ packed form
9395B35204l0828K665l889L750L3189m076L2750O4723N491Q411j5356R2435N626
9382D30095o1309m9506m7500l331K7757K7708J5579m851l9673L5743M4883J9914
9370C95509L8770j549j14441o8118J6514N1252O4156l3687o6700k8268m7871n6423
9358A49144K0309Q442L0010K1663K2899o556m6957m8362j7229K9853L6217l6306
9346A63127l2959n147k8914m3427O3217R897n757l7575M369O8909r018n8196l5230
9333E3296M7248N7139R359l9109n0004N867L0345K2057k8913m0600J9288M3648
9321A29621K2744K3890o0279j9442L2253j0292L3909L446r8372k6077j8039j7570
9309d208m119L8513K0732J0018j8151J6392J5728Q644L756J4018j2622Q20o816
$$ plain form
9296 82705 4763 30137 85961 48967 34210 97883 154041 192015 185667 188060 167199 148831
9284 148831 149248 135478 123809 102148 94373 91525 59015 35837 26211 57412 31867 16473 -29631
9271 -29631 39238 59942 22677 21920 48351 37243 63052 42712 83757 77435 50308 4645
9259 4645 -2733 11282 53279 66290 66578 64711 25436 17003 50811 561 7791 77 -20470
9246 -20470 20353 13194 5493 26280 61266 117537 115453 77232 15804 42596 28307 -17584
9234 -17584 -19845 3872 18959 36706 58412 45135 23751 -25022 1893 50442 76650 60969
9222 60969 91984 84922 63013 45238 61463 58576 -30609 -33180 86986 104346 38670 -9927
9210 -9927 -47847 -33357 -70102 -103668 -81439 -11687 14168 25366 80141 82896 49789 9284
$$ packed form
9296H2705p7942K5374N5824l6994j4757O3673N6158L7974o348K393k0861j8368
9284A48831M17j3770j1669k1661p775k848l2510k3178r626L1201k5545j5394m6104
9271b9631O8869K0704l7265p57K6431j1108K5809k0340M1045o322k7127m5663
9259D645p378J4015M1997J3011K88j867l9275q433L3808n0250P230p714k0547
9246b0470M0823p159p701K0787L4986N6271k084l8221o1428K6792j4289m5891
9234a7584k261K3717J5087J7747K1706j3277k1384m8773K6915M8549K6208j5681
9222F0969L1015p062k1909j7775J6225k887q9185k571J20166J7360o5676m8597
9210i927l7920J4490l6745l3566K2229O9752K5855J1198N4775K755l3107m0505
$$ plain form
9198 9284 41315 73160 55585 30609 17757 -41412 -65658 -48869 -37699 24403 30664 53865
9186 53865 72794 83739 30455 20682 18945 -3465 16822 13585 -20258 -22471 2981 -9809 -2844
9173 -2844 23480 6755 -2191 5613 -7111 -22215 -36940 -36290 -21403 -37077 -67165 -30456 -13199
9160 -13199 -77935 -52755 10358 12811 6464 32865 22949 8082 11197 53530 -15866 -4586 -12091
9147 -12091 -49925 5440 74458 134284 139923 114639 20503 -42262 -101810 -99384 -80915 -75229
9135 -75229 -12944 43856 62871 61591 51047 5720 -42687 -42297 -26647 -39869 -18819 18052
9123 18052 19460 15147 43199 129095 187067 126350 50933 -20 -54372 -61569 -37792 27535
9111 27535 74190 80978 32403 21296 -1863 -6331 13032 17520 47256 31289 52833 31388
$$ packed form
9198I284L2031L1845j7575k4976j2852n9169k4246J6789J1170O2102O261K3201
9186E3865J8929J0945n3284r773j737k2410K0287l237l3843k213K5452j2790O965
9173b844K6324j6725q946P804j2724j5104j4725O50J4887j5674l0088L6709J7257
9160a3199o4736K5180O3113K453o347K6401r916j4867L115M2333o9396J1280p505
9147a2091l7834N5365O9018N9826N639k5284r4136o2765n9548K426J8469N686
9135g5229O2285N6800J9015j280j0544m5327m8407L90J5650j3222K1050L6871
9123A8052J408m313K8052Q5896N7972o0717p5417n0953n4352p197K3777O5327
9111B7535M6655O788m8575j1107k3159m468J9363M488K9736j5967K1544k1445
$$ plain form
9099 31388 24021 4132 27109 45079 29897 18179 -12931 -29159 -81757 -81407 -41882 -8790
9087 -8790 15773 31127 -21347 -38710 17085 58460 99762 86152 83611 73652 60659 45254
9075 45254 38011 32207 -22931 20044 9604 4554 22019 42437 56481 58143 44442 29383 22765
9062 22765 45642 75476 87478 70128 64600 54256 77439 -6561 -88674 -131574 -84382 -62069
9050 -62069 -35865 -26501 -43047 -44999 -21792 -7926 83559 118125 100234 94570 125191 147455
9038 147455 146038 127307 96021 73552 31429 -19657 -38965 -13009 2299 82687 94837 82398
9026 82398 84114 135791 139980 81747 26971 -16551 -48116 -28370 5995 -6754 11151 9388
9014 9388 -3977 268 31549 27173 65016 104286 122582 99062 41552 -10458 38948 41462 27715
$$ packed form
9099C1388p367j9889K2977J7970j5182j1718l1110j6228n2598L50L9525L3092
9087h790K4563J5354n2474j7363N5795M1375M1302j3610k541r959j2993j5405
9075D5254p243n804n5138M2975j0440n050J7465K0418J4044J662j3701j5059o618
9062B2765K2877K9834J2002j7350n528j0344K3183q4000q2113m2900M7192K2313
9050f2069K6204R364j6546j952K3207J3866R1485L4566j7891n664L0621K2264
9038A47455j417j8731l1286k2469m2123n1086j9308K5956J5308Q0388J2150j2439
9026H2398J716N1677M189n8233n4776m3522l1565J9746L4365j2749J7905j763
9014I388j3365M245L1281m376L7843L9270J8296k3520n7510n2010M9406K514j3747
$$ plain form
9001 27715 51327 76241 85683 79600 93823 69629 52673 37679 71265 133037 149170 117613
8989 117613 112434 110412 136028 62197 -5080 -27339 -50875 -81696 -39476 9168 17813 4840
8977 4840 -30811 -90738 -64697 -48871 -37431 -40065 -29710 29039 67018 18746 35952 32373
8965 32373 33178 9893 40894 99074 50020 28363 15183 -31714 -7035 -32776 -32778 -68657 -71477
8952 -71477 -19377 -12351 57263 63607 52643 -36528 -79512 -109860 -98390 -51470 -9032 -1056
8940 -1056 -9692 29084 43096 47739 -13006 -82456 -72279 -40466 -51470 -71586 -90228 -50459
8928 -50459 -33141 30379 15334 15387 19251 24917 15004 -9708 -13581 -32495 -72649 -82358 -86364 -75417
8914 -75417 -68862 6445 42883 -3125 -72310 -64453 -49603 -15010 -25681 -49829 -3275 33227
$$ packed form
9001B7715K3612K4914R442o083J4223k4194j6956j4994L3586O1772J6133l1557
8989A17613n179k022K5616p3831o7277k2259k3536l0821M2220M8644Q645j2973
8977D840l5651n9927K6041J5826J1440k634J0355N8749L7979m8272J7206l579
8965C2373Q05k3285L1001N8180m9054k1657j3180m6897K4679k5741kl5879k820
8952g1477N2100P026O9614O344j0964q9171m2984l0348J1470M6920M2438P976
8940a056q636L8776J4012M643o0745o9450J0177L1813j1004k0116j8642L9769
8928e0459J7318O3520j5045N3L864N666r913k4712l873j8914m0154r709m006J0947
8914g5417O555P5307L6438m6008o9185P857J4850L4593j0671k4148M6554L6502
$$ plain form
8902 33227 37893 74718 77389 29642 7328 -19482 11789 11418 29801 66268 87701 88775 72639
8889 72639 104671 62285 50491 48593 39511 7083 30618 68680 14393 -8993 -8992 -92807 -109199
8876 -109199 -69949 -14182 27227 26077 65327 88870 94281 90652 80896 90859 139276 133888 132539
8863 132539 181998 206215 213472 244377 334449 406889 488454 535757 580917 705133 834275
8852 834275 770797 588216 424701 234868 116300 133422 121903 155768 154136 152719 81584
8841 81584 47012 71513 98748 107255 118496 86641 51916 69744 88173 49147 417 -47731
8829 -47731 -67500 -43753 1585 39417 44322 -3501 -25324 -38762 -72709 -92235 -11725 27829
8817 27829 69484 78005 117081 55388 48965 53740 71088 38233 33204 -620 -78795 -58298 -20483
$$ packed form
8902C3227M666L6825K671m7747k2314k6810L1271l71J8383L6467K1433J074j6136
8889G2639L2032m2386j1794j898r082l2428K3535L8062n4287k3386Jq3815j6392
8876a09199L9250N5767M1409j150L9250K3543N411l629r756R963M8417n388j349
8863A32539M9459K4217P257L0905R0072P2440Q1565M7303M5160J24216J29142
8852H34275o3478j82581j63515j89833j18568J7122j1519L3865j632j417p1135
8841H1584l4572K4501K7235Q507J1241l1855l4725J7828J8429l9026m8730m8148
8829d7731j9769K3747M5338L7832M905m7823k1823j3438l3947j9526Q0510L9554
8817B7829M1655Q521L9076o1693o423M775J7348l2855n029l3824p8175K0497L7815
$$ plain form
8804 -20483 -26569 4105 5147 -8236 -14385 6155 54899 37767 13198 28462 15846 18406 19642
8791 19642 -38147 16556 19832 3501 -48643 -137251 -133843 -78302 -45847 -3230 57368 83226
8779 83226 53273 10046 46751 81573 84290 96660 49873 -17049 -11427 29077 49422 67637
8767 67637 89819 110110 101368 83825 83857 96340 43515 1967 40251 79041 67146 110200 106892
8754 106892 78355 34962 15713 56937 60844 87499 74921 48180 60861 55157 52329 61602
8742 61602 34864 25642 42966 34858 69840 84400 74538 81655 51421 75795 129691 122405 86124
8729 86124 104992 153226 107887 150100 219463 224435 183719 174535 164478 161857 155253 177739 208651
8716 208651 173176 193915 228588 220472 292713 256336 202347 131019 129865 142252 149899 145790
$$ packed form
8804b0483o086L0674J042j3383o149K0540M8744j7132k4569J5264j2616K560J236
8791A9642n7789N4703L276j6331n2144q8608L408N5541L2455M2617O0598K5858
8779H3226k9953m3227L6705L4822K717J2370m6787o6922N622M0504K0345J8215
8767F7637K2182K0291q742j7543L2J2483n2825m1548L8284L8790j1895M3054l308
8754A06892k8537m3393j9249M1224L907K6655j2578k6741J2681n704k828R273
8742F1602k6738r222J7324q108L4982J4560r862P117l0234K4374N3896p286l6281
8729H6124J8868M8234m5339M2213O9363M972m0716r184j0057k621o604K2486L0912
8716B08651l5475K0739L4673q116P2241l6377n3989p1328j154J2387P647m109
$$ plain form
8704 145790 135261 74405 111359 181593 205640 140546 101581 114225 152311 161687 149142 171570
8692 171570 189750 174190 217688 251510 253582 303742 321751 331773 336192 315771 314018 329908
8680 329908 316012 257730 239512 254075 325133 410925 403378 340175 357432 344065 325102 338638
8668 338638 405031 402073 409895 433575 386369 341572 357677 341329 317048 326936 356418 347857
8656 347857 334526 326587 359611 380751 372186 370999 409434 394100 420429 469689 502169 511756
8644 511756 560959 618721 692729 751324 743968 726914 682759 705427 828913 788201 752561 740514
8632 740514 722005 682970 693502 721109 747505 751384 797343 800120 853744 895013 979597 1053913
8620 1053913 1108560 1134078 1202496 1235652 1294616 1408226 1480944 1513430 1617828 1700435 1747967
$$ packed form
8704A45790j0529o0856L6954P0234K4047o5094l8965J2644L8086R376j2545K2428
8692A71570J8180j5560M3498L3822K072N0160J8009J0022M419k0421j753J5890
8680C29908j3896n8282j8218J4563P1058Q5792p547o3203J7257j3367j8963J3536
8668C38638O6393k958P822K3680m7206m4797J6105j6348k4281R888K9482q561
8656C47857j3331p939L3024K1140q565j187L8435j5334K6329M9260L2480R587
8644E11756M9203N7762P4008N8595p356j7054m4155K2668J23486m0712l5640j2047
8632G40514j8509l9035J0532K7607K6396L879M5959K777N3624M1269Q4584P4316
8620A053913N4647K5518O8418L3156N8964J13610P2718L2486J04398Q2607M7532
$$ plain form
8609 1747967 1806866 1835730 1912232 1938737 1984316 1979232 1929949 1896243 1915008 1925024 1949164 1909950
8597 1909950 1867091 1806483 1769497 1742808 1712752 1749503 1796456 1772227 1692620 1677914 1656025
8586 1656025 1621295 1539101 1450983 1364781 1387863 1322086 1293836 1192191 1085861 1040920 1003845
8575 1003845 993165 875465 794451 767409 760866 742017 668749 639018 664016 668409 632004 580680
8563 580680 545040 509775 476998 472029 446210 471021 462576 437924 383908 341451 351640 397064
8551 397064 445737 455097 405973 377924 383889 421976 403220 386344 380362 373246 339041 328117
8539 328117 293148 218633 209923 236231 259211 252742 220632 189215 160598 200652 257096 268534
8527 268534 254860 223192 185291 152882 188363 219052 230233 169854 167458 223019 226372 192010
$$ packed form
8609A747967N8899K8864P6502K6505M5579n084m9283l3706J8765J0016K4140l9214
8597A909950m2859o0608l6986k6689l0056L6751M6953k4229p9607j4706k1889
8586A656025l4730q2194q8118q6202K3082o5777k8250j01645j06330m4941l7075
8575A003845j0680j17700q1014k7042o543j8849p3268k9731K4998M393l6405n1324
8563E80680l5640l5265l2777m969k5819K4811q445k4652n4016m2457J0189M5424
8551C97064M8673R360m9124k8049N965L8087j8756j6876n982p116l4205j0924
8539C28117l4969p4515q710K6308K2980o469l2110l1417k8617M0054N6444J1438
8527B68534j3674l1668l7901l2409L5481L0689J1181o0379k396N5561L353l4362
$$ plain form
8515 192010 167154 183187 154740 129088 143950 126182 90356 73107 83439 108087 119935 107231
8503 107231 112856 86864 71393 102833 118081 69197 54777 24782 17994 32480 64757 80843
8491 80843 110112 108954 112262 151846 128989 69429 98910 136681 117551 97379 97613 116952 71962
8478 71962 103269 120170 59515 46505 75786 60409 79698 98869 101512 116263 102597 113511
8466 113511 180621 192550 156724 100391 75511 127880 130776 131296 97290 58994 8094 15204
8454 15204 72568 93566 142214 124847 135068 157914 166371 204269 229711 204977 222897 175258
8442 175258 143184 143353 148027 99543 46739 11944 -39636 -38607 -13516 1121 82 25864 114074
8429 114074 142831 122641 79302 66697 65414 107347 108402 100537 46699 103005 139082 81516
$$ packed form
8515A92010k4856J6033k8447k5652J4862j7768l5826j7249J0332K4648J1848j2704
8503A07231N625k5992j5471L1440J5248m8884j4420k9995o788J4486L2277J6086
8491H0843K9269j158L308L9584k2857n9560K9481L7771j9130k0172K34J9339m4990
8478G1962L1307J6901o0655j3010K9281j5377J9289J9171K643J4751j3666J0914
8466A13511O7110J1929l5826n6333k4880N2369K896N20l4006l8296n0900P110
8454A5204N7364K0998M8648j7367J0221K2846Q457L7898K5442k4734J7920m7639
8442A75258l2074J69M674m8484n2804l4795n1580J029K5091J4637j039K5782Q8210
8429A14074K8757k0190m3339j2605j283M1933J055p865n3838N6306L6077n7566
$$ plain form
8417 81516 45024 19295 20120 80358 89929 87547 114998 97199 113877 82164 60943 91268 87196
8404 87196 95851 108698 139548 180688 177612 160568 161126 117240 58376 88414 62097 62929 111723
8391 111723 108572 69431 63067 34156 56659 105118 120657 80311 72907 144392 171118 155626
8379 155626 119254 153269 175203 195541 165329 139568 125343 110865 172760 235718 232658 233883
8367 233883 229397 179323 128098 145735 103161 43712 52327 82550 100437 151273 174994 119004
8355 119004 121934 154705 175434 150089 143905 69775 17062 42157 122663 142191 144465 94876
8343 94876 104724 98764 92872 69607 94846 95782 113702 154468 222117 183609 112776 139568 166319
8330 166319 176421 182491 165541 210747 191875 187979 162288 112956 104735 118752 115642 69344
$$ packed form
8417H1516l6492k5729Q25O0238R571k382K7451j7799J6678l1713k1221L0325m072
8404H7196Q655J2847L0850M1140l076j7044N58m3886n8864L0038k6317Q32M8794
8391A11723l151l9141o364k8911K2503M8459J5539m0346p404P1485K6726j5492
8379A55626l6372L4015K1934K0338l0212k5761j4225j4478O1895O2958l060J225
8367B33883m486n0074n1225J7637m2574n9449Q615L0223J7887N0836K3721n5990
8355A19004K930L2771K0729k5345o184p4130n2713K5095Q0506J9528K274m9589
8343I4876R848n960n892k3265K5239R36J7920M0766O7649l8508p0833K6792K6751
8330A66319J0102O070j6950M5206j8872l896k5691m9332q221J4017l110m6298
$$ plain form
8318 69344 21351 46951 18019 -3466 44392 -3490 -40911 2931 60515 -7175 -13217 -4457
8306 -4457 38809 54781 60407 59563 42259 1061 25263 22517 -932 -30161 -35610 -9596 16027
8293 16027 29472 32728 30358 61451 37365 81055 84247 62632 74245 54206 60829 81006 119885
8280 119885 90273 38930 17982 -19090 6275 -3337 44694 10760 -64986 -100041 -80306 -37277
8268 -37277 -37432 -14703 29243 65986 65017 48472 -22844 -26439 32709 133523 150267 70788 58546
8255 58546 69775 104466 82259 51864 -8107 -9020 41700 100458 85563 59138 86390 78221
8243 78221 63768 21101 9302 14935 6902 -1979 -20970 -4133 -924 -4343 -36533 -25684 -25745
8230 -25745 -15419 82736 132319 107423 97582 56960 28905 -16666 -4661 8579 -4540 -28765
$$ packed form
8318F9344m7993K5600k8932k1485M7858m7882l7421M3842N7584o7690o042Q760
8306d457M3266J5972N626q44j7304m1198K4202k746k3449k9229n449K6014K5623
8293A6027J3445L256k370L1093k4086M3690L192k1615J1613k0039O623K0177L8879
8280A19885k9612n1343k0948l7072K5365r612M8031l3934p5746l5055J9735M3029
8268c7277j55K2729M3946L6743r69j6545p1316l595N9148J00814J6744p9479j2242
8255E8546J1229L4691k2207l0395n9971r13N0720N8758j4895k6425K7252q169
8243G8221j4453m2667j1799N633q033q881j8991J6837L209l419l2190J0849o1
8230b5745J0326R8155M9583k4896r841m0622k8055m5571J2005J3240j3119k4225
$$ plain form
8218 -28765 -34798 -16938 9131 66081 81437 49765 47987 49605 60532 36975 4509 -10087
8206 -10087 17152 26760 28779 59025 63798 68644 38581 567 -44574 -32159 -3462 8411 57836
8193 57836 80400 140133 181400 202459 110368 49056 50855 16354 -18800 38711 54613 248
8181 248 -29668 -45271 -73938 -95061 -86728 -61405 -5766 -11150 -3806 -2048 -68806 -89985 -96688
8168 -96688 -114022 -90447 -55242 59428 82059 29922 -52582 -96955 -44874 -10555 65108 148231
8156 148231 143860 87186 52480 86630 85817 95618 197240 289708 296484 294336 339611 340226 291865
8143 291865 194697 149986 167394 159483 125217 62776 82444 108031 129594 143129 128414 90653
8131 90653 54997 22652 2382 35992 67595 56421 22406 4937 10130 -13353 -15749 41974
$$ packed form
8218b8765o033J7860K6069N6950J5356l1672j778J618J0927k3557l2466j4596
8206a0087K7239R608K019L0246M773M846l0063l8014m5141J2415K8697J1873M9425
8193E7836K2564N9733M1267K1059r2091o1312J799l4501l5154N7511J5902n4365
8181B48k9916j5603k8667k1123Q333K5323N5639n384P344J758o6758k1179o703
8168i6688j7334K3575L5205J14670K2631n2137q2504m4373N2081L4319P5663Q3123
8156A48231m371n6674l4706L4150q13R801J01622R2468O776k148M5275O15m8361
8143B91865r7168m4711J7408p911l4266o2441J9668K5587K1563J3535j4715l7761
8131I0653l5656l2345k0270L3610L1603j1174l4015j7469N193k3483k396N7723
$$ plain form
8119 41974 102323 58225 33169 65295 26146 13814 88165 115873 132063 167845 229560 234451
8107 234451 274945 308476 374946 409449 333352 232143 201590 206865 212771 195238 109951 69431
8095 69431 60889 122256 96085 -13894 -43855 -2154 39949 24436 28764 60700 31223 39650
8083 39650 51131 27128 21434 -7101 38960 50622 65687 42133 10238 -10699 -11814 -12874
8071 -12874 32071 62055 54260 68574 31916 -25525 10854 67772 86206 117733 111964 129521
8059 129521 141553 142605 97211 75199 65039 114220 147770 80866 74605 150601 204956 272664
8047 272664 324652 347156 374012 386281 455405 489807 565826 601342 679189 709316 731674 783583
8035 783583 824196 804699 776246 805579 810460 817147 812134 803432 793485 794307 797992 850457 813242
$$ packed form
8119D1974O0349m4098k5056L2126l9149j2332P4351K7708J6190L5782O1715M891
8107B34451M0494L3531O6470L4503p6097j01209l0553N275N906j7533q5287m0520
8095F9431q542O1367k6171j09979k9961M1701M2103j5513M328L1936k9477Q427
8083C9650J1481k4003n694k8535M6061J1662J5065k3554l1895k0937j115j060
8071a2874M4945K9984p795J4314l6658n7441L6379N6918J8434L1527n769J7557
8059A29521J2032J052m5394k2012j0160M9181L3550o6904o261P5996N4355O7708
8047B72664N1988K2504K6856J2269O9124L4402P6019L5516P7847L0127K2358N1909
8035G83583M0613j9497k8453K9333M881O687n013q702r947Q22L685N2465l7215
$$ plain form
8022 813242 758292 765721 719049 650199 659698 617969 643502 671200 627707 637706 646149 656698
8010 656698 661821 665819 748750 779838 809350 900080 954752 1014921 1156068 1353417 1618743
7999 1618743 1864297 2087017 2227758 2424162 2635002 2736062 2550894 2229813 1950808 1768308
7989 1768308 1660708 1676014 1772598 1854734 1869446 1924915 2006232 2105602 2016408 1676620 1346666
7978 1346666 1120122 1038411 943998 873674 804913 750479 713804 718219 711165 685258 686310 677691
7966 677691 717566 774039 786675 837148 900056 962565 960727 966993 1055436 1223790 1377669 1536064
7954 1536064 1725672 1860353 2007482 2106786 2117456 2102330 2021591 1894955 1810837 1805778 1786123
7943 1786123 1765252 1823764 1883138 1871767 1777421 1537582 1288313 1119363 983866 874689
$$ packed form
8022H13242n4950P429m6672o8850R499m1729K5533K7698m3493R999Q443J0549
8010F56698N123L998Q2931L1088K9512R0730N4672O0169J41147J97349K65326
7999A618743K45554K22720J40741J96404K10840J01060j85168l21081k79005j82500
7989A768308j07600J5306R6584Q2136J4712N5469Q1317R9370q9194l39788l29954
7978A346666k26544q1711r4413p0324o8761n4434l6675M415p054k5907J052q619
7966F77691L9875N6473J2636N0473O2908O2509j838O266Q8443J68354J53879J58395
7954A536064J89608J34681J47129R9304J0670j5126q0739j26636q4118n059j9655
7943A786123k0871N8512N9374j1371r4346k39839k49269j68950j35497j09177
$$ plain form
7933 874689 763444 742067 763239 697370 606424 577961 542063 508048 502279 483511 443315 430687
7921 430687 467274 465248 503412 534009 519005 576658 628936 651191 728777 732933 750215 818717
7909 818717 860506 852111 807253 702265 642475 611260 580225 571598 553955 515726 461432 446037
7897 446037 443716 372967 362177 335444 271598 251905 191033 157476 137392 174252 240391 228707
7885 228707 185289 227899 280849 261309 194363 120736 127063 158023 136312 197285 196974 176222
7873 176222 129164 85278 46394 20031 3627 3092 -1890 -13985 2772 4743 58120 4645
7861 4645 -30525 -17650 -40805 -49820 -6810 -6006 -10540 -10323 -24709 -11108 54782 47837 57168 34492
7847 34492 -32589 9451 51225 31216 -15560 -1689 -13513 13964 15903 -58534 -90449 -42066
$$ packed form
7933H74689j11245k1377K1172o5869r0946k8463l5898l4015n769j8768m0196j2628
7921D30687L6587k026L8164L0597j5004N7653N2278K2255P7586M156J7282O8502
7909H18717M1789q395m4858j04988n9790l1215l1035q627j7643l8229n4294j5395
7897D46037k321p0749j0790k6733o3846j9693o0872l3557k0084L6860O6139j1684
7885B28707m3418M2610N2950j9540o6946p3627O327L0960k1711O0973l11k0752
7873A76222m7058m3886l8884k6363j6404n35m982j2095J6757J971N3377n3475
7861D645l5170J2875k3155r015M3010Q04m534K17j4386J3601O5890o945R331k2676
7847C4492o7081M2040M1774k0009m6776J3871j1824K7477J939p4437l1915M8383
$$ plain form
7835 -42066 -17476 -43711 -8945 -6481 45908 89626 51926 18333 -39408 -47496 -45594 4879
7823 4879 46790 46029 46340 10474 -36930 -85454 -100387 -71517 -81451 -66824 -36551 -25710 -43313
7810 -43313 -71436 -80267 -53718 -12606 20917 52118 8822 -6272 -736 -11117 -27667 -89709
7798 -89709 -115020 -83869 -57702 -42717 -48291 -61264 -94698 -88461 -65672 -101684 -120510 -111668
7786 -111668 -111680 -24561 48208 62911 68393 45471 -1099 -9078 -27251 13453 51840 72382 23982
7773 23982 -37331 -32740 -3567 26010 54803 21226 12207 3698 59158 10967 -64235 -516
7761 -516 14668 -55356 -68655 -75309 -100996 -45319 8045 15199 27433 8435 5710 -9269 -14554
7748 -14554 8611 2289 -22089 -5735 -17423 -2043 12297 -18816 -6487 -30783 -43541 -9640
$$ packed form
7835d2066K4590k6235L4766K464N2389M3718l7700l3593n7741q088J902N0473
7823D879M1911p61L11l5866m7404m8524j4933K8870r934J4627L0273J0841j7603
7810d3313k8123q831K6549M1112L3523L1201m3296j5094N536j0381j6550o2042
7798h9709k5311L1151K6167J4985n574j2973l3434O237K2789l6012j8826Q842
7786a11668j2Q7119P2769J4703N482k2922m6570p979j8173M0704L8387K0542m8400
7773B3982o1313M591K9173K9577K8793l3577r019q509N5460m8191p5202O3719
7761e16J5184p0024j3299o654k5687N5677N3364P154J2234j8998k725j4979n285
7748a4554K3165o322k4378J6354j1688J5380J4340l1113J2329k4296j2758L3901
$$ plain form
7736 -9640 1585 -14125 8249 -4450 14526 32131 -15402 6585 -33178 -30967 9568 20755
7724 20755 -4697 -39964 -91214 -27282 21415 -14894 -32017 3214 -14951 -18617 20331 3746
7712 3746 -2777 -13852 -1597 3982 60194 93567 66903 83724 48295 75533 30929 -29644
7700 -29644 -81355 -88345 -57890 -51399 -48177 -14648 -12960 -24611 -60484 -36347 -7305 14902 -12699
7687 -12699 -75569 -111426 -43220 21938 8049 -3326 -21220 -74623 -83747 -75091 -67801 -39915
7675 -39915 -18751 -33635 -48078 22596 20715 -19035 -34617 -83549 -92589 -68938 1694 31999
7663 31999 -59065 -65017 -94944 -55430 -20282 -15873 -4298 -27394 -1215 -12755 -2526 19249
7651 19249 -11681 -49438 -42655 -71148 -84943 -62373 -62481 -37338 38996 90655 57929 -1450
$$ packed form
7736i640J1225j5710K2374j2699J8976J7605m7533K1987l9763K211M0535J1187
7724B0755k5452l5267n1250O3932M8697l6309j7123L5231j8165l666L8948j6585
7712C746o523j1075J2255N579N6212L3373k6664J6821l5429K7238m4604o0573
7700b9644n1711o990L0455O491L222L3529J688j1651l5873K4137K9042K2207k7601
7687a2699o2870l5857O8206O5158j3889j1375j7894n3403r124Q656P290K7886
7675c9915K1164j4884j4443P0674j881l9750j5582m8932r040K3651P0632L0305
7663C1999r1064n952k9927L9514L5148M409J1575k3096K6179j1540J0229K1775
7651A9249l0930l7757O783k8493j3795K2570j08K5143P6334N1659l2726n9379
$$ plain form
7639 -1450 -27126 -8313 11167 -47250 -114330 -94529 -3184 53005 44845 -239 3098 -7606
7627 -7606 -37619 -13669 7139 16042 34317 -5557 -23844 41195 69789 25350 -5438 -66943
7615 -66943 -65269 -63064 -81686 -52281 -43281 -35216 -8361 -19422 -6563 20696 28661 7540 -45448
7602 -45448 -50246 -87092 -97083 -92867 -83682 -57905 -72508 -81723 -48143 -2260 18480 21432 7908
7589 7908 47709 13028 -352 31757 9699 12304 -4173 -84003 -142400 -86655 -59299 -43293
7577 -43293 -52113 -88355 -129390 -56785 6850 42059 51975 33636 8608 -7625 30858 12567
7565 12567 1269 4250 65089 54923 3609 -13709 -312 66864 84251 66981 42283 16899
7553 16899 1954 4781 28173 -24575 -58630 -80373 -64174 -59709 -77686 -127567 -110876 -56401
$$ packed form
7639a450k5676J8813J9480n8417o7080J9801R1345N6189q160m5084L337j0704
7627g606l0013K3950K0808Q903J8275l9874j8287O5039K8594m4439l0788o1505
7615f6943J674K205j8622K9405R000Q065K6855j1061J2859K7259P965k1121n2988
7602d5448m798l6846r991M216R185K5777j4603r215L3580M5883K0740K952j3524
7589G908L9801l4681j3380L2109k2058K605j6477p9830n8397N5745K7356J6006
7577d3293q820l6242m1035P2605O3635L5209R916j8339k5028j6233L8483j8291
7565A2567j1298K981O0839j0166n1314j7318J3397O7176J7387j7270k4698k5384
7553A6899j4945K827K3392n2748l4055k1743J6199M465j7977m9881J6691N4475
$$ plain form
7541 -56401 8293 33912 61045 51848 3995 -7216 32659 60252 7189 -25536 21335 25301
7529 25301 -1733 9992 654 -14796 -50345 -74485 -77135 -48475 -72560 -45584 4970 2278
7517 2278 -25250 -38840 15660 6769 -4859 -34535 -32633 -47260 -92985 -87039 -28364 1518 6595
7504 6595 7457 -4376 14445 42009 12353 -45901 -40828 -25847 -22164 -47325 -77683 -49882 -38991
7491 -38991 -35454 4165 39192 41731 543 7789 -34452 11986 -9106 -20419 16615 12758 -5244
7478 -5244 -4333 15598 18120 10024 -55417 -98164 -97114 -55452 6459 36141 44023 -552 -10145
7465 -10145 -34857 -65941 -109053 -87773 -58591 -26625 -6166 -48921 -68395 -31314 -65922 -58488
7453 -58488 14047 51797 67982 12543 -5245 -41253 -24090 33972 48677 36153 58587 21770
$$ packed form
7541e6401O4694K5619K7133r197m7853j1211L9875K7593n3063l2725M6871L966
7529B5301k7034J1725r338j5450l5549k4140k650K8660k4085K6976N0554k692
7517B278k7528j3590N4500q891j1628k9676J902j4627m5725N946N8675K9882N077
7504F595Q62j1833J8821K7564k9656n8254N073J4981L683k5161l0358K7801J0891
7491c8991L537L9619L5027K539m1188P246m2241M6438k1092j1313L7034l857j8002
7478e244R11J9931K522q096o5441m2747J050M1662O1911K9682P882m4575r593
7465a0145k4712l1084m3112K1280K9182L1966K0459m2755j9474L7081l4608P434
7453e8488P2535L7750J6185n5439j7788l6008J7163N8062J4705j2524K2434l6817
$$ plain form
7441 21770 -14962 -28201 -26556 -40332 -41031 -127274 -179864 -134689 -79976 -28152 174 28547
7429 28547 -8487 10139 11284 11072 17358 13333 9937 -7988 -5560 14300 -5095 -45499 -71826
7416 -71826 -53174 -48033 -37230 -23339 18882 78053 62013 8398 38160 34133 12999 20482
7404 20482 -45680 -76912 -71112 -55738 -19615 -11424 -50218 -72575 -63566 -28324 -7478 -18726
7392 -18726 -52433 -3168 19155 -24640 -59150 -60644 -105710 -147926 -124449 -121306 -130721 -120321
7380 -120321 -102407 -63400 -5479 41294 1292 -33238 -82250 -76683 -69312 -44260 -46427 -29552
7368 -29552 -62077 -100575 -72526 -108973 -127770 -89341 -81540 -85416 -91670 -95334 -105801 -69589 -29002
7355 -29002 -47249 -35344 -37372 -59894 -88811 -101940 -104356 -64790 -30009 22946 -13252 -43985
$$ packed form
7441B1770l6732j3239J645j3776o99q6243n2590M5175N4713N1824K8326K8373
7429B8547l7034J8626J145k12O286m025l396j7925K428J9860j9395m0404k6327
7416g1826J8652N141J0803J3891M2221N9171j6040n3615K9762m027k1134P483
7404B0482o6162l1232N800J5374L6123Q191l8794k2357R009L5242K0846j1248
7392a8726l3707M9265K2323m3795l4510j494m5066m2216K3477L143r415J0400
7380a20321J7914L9007N7921M6773m0002l4530m9012N567P371K5052k167J6875
7368b9552l2525l8498K8049l6447j8797L8429P801l876o254l664j0467L6212M0587
7355b9002j8247J1905k028k2522k8917j3129k416L9566L4781N2955l6198l0733
$$ plain form
7343 -43985 -31014 -4597 -11555 -70224 -55685 -56234 -108435 -78529 1828 4292 -6512 -84948 -108990
7330 -108990 -50835 -47136 -58009 -30992 -12886 -737 -49385 -43479 -84840 -78263 -38993 -15045
7318 -15045 -67148 -94092 -92696 -25697 -30870 -37462 -41025 -39526 -772 55400 62786 43332 8921
7305 8921 17292 -3456 3625 34881 35309 10150 61487 42601 -9699 -18057 52682 48467 -34948
7292 -34948 -121962 -133103 -106868 -85384 -75818 -33631 -99934 -120522 -69067 -25463 -12702 1046
7280 1046 44977 -10738 -91462 -72649 31161 -3667 -5256 -39221 -37655 -32817 -38603 -22584 -21368
7267 -21368 -92187 -94113 -67024 -45179 -29919 1269 32048 -2862 -37610 -55060 -20433 27086
7255 27086 54417 32160 -7333 -55589 -31638 15085 16638 4050 -53409 -50112 -62106 -40752
$$ packed form
7343d3985J2971K6417o958n8669J4539n49n2201K9906Q0357K464j0804p8436k4042
7330a08990N8155L699j0873K7017J8106J2149m8648N906m1361O577L9270K3948
7318a5045n2103k6944J396O6999n173o592l563J499L8754N6172P386j9454l4411
7305H921Q371k0748P081L1256M28k5159N1337j8886n2300q358P0739m215q3415
7292c4948q7014j1141K6235K1484R566M2187o6303k0588N1455M3604J2761J3748
7280A046M3931n5715q0724J8813J03810l4828j589l3965J566M838n786J6019J216
7267b1368p0819j926K7089K1845J5260L1188L0779l4910l4748j7450L4627M7519
7255B7086K7331k2257l9493m8256K3951M6723J553j2588n7459L297j1994K1354
$$ plain form
7243 -40752 -47200 -83749 16994 13857 -14785 -10401 -44402 -77243 -87741 -65169 -45564 -75894
7231 -75894 -70650 -101375 -101768 -74003 -38913 -68363 -113142 -63429 -11617 14202 33676 47898
7219 47898 3773 1745 -30409 -67841 -86809 -37710 -4377 -18238 -2262 -7082 -7711 44101 72115
7206 72115 75822 44012 2550 -39653 -88010 -90969 -84330 -73782 -56690 8560 -409 -19704 -24024
7193 -24024 -77696 -82307 -42758 -37817 -27731 -10910 -26853 -1279 -571 -34420 -63791 -28579 -4092
7180 -4092 -4598 -9656 -37509 -35054 -75262 -57593 -80850 -88250 -86805 -92610 -124546 -62728 -17707
7167 -17707 -27377 -16084 8114 -5795 23561 8980 -21912 35120 68173 14873 -68702 -78787
7155 -78787 -65540 -84063 -61029 -11145 -33046 -42049 -18657 -21386 -43873 49272 113359 61509
$$ packed form
7243d0752o448l6549J00743l137k8642M384l4001l2841j0498K2572J9605l0330
7231g5894N244l0725l93K7765L5090k9450m4779M9713N1812K5819J9474J4222
7219D7898m4125k028l2154l7432j8968M9099L3333j3861J5976m820o29N1812K8014
7206G2115L707l1810m1462m2203m8357k959O639J0548J7092O5250q969j9295m320
7193b4024n3672m611L9549M941J0086J6821j5943K5574P08l3849k9371L5212K4487
7180d092n06n058k7853K455m0208J7669k3257p400J445n805l1936O1818M5021
7167a7707r670J1293K4198j3909K9356j4581l0892N7032L3053n3300q3575j0085
7155g8787J3247j8523K3034M9884k1901r003K3392k729k2487R3145O4087n1850
$$ plain form
7143 61509 -2208 -21267 -47391 -30465 11731 6811 29291 18757 -26457 -53325 -50023 -27603
7131 -27603 24009 29389 -22738 -112012 -109018 -62747 -16042 -18211 16619 16235 -19586 -12109 -31343
7118 -31343 4738 -2736 19710 10525 -41644 -37865 -9216 -11838 -9173 -6905 -28398 -33560 4766
7105 4766 5658 24033 -9606 -49290 -82663 -54538 -4509 -18502 -21878 -42949 -67551 -78696 -61895
7092 -61895 -69796 -87111 -56398 -24556 38440 39196 -6494 -48333 -16030 -25360 -17179 -6677 3091
7079 3091 -26958 -38240 -16810 -19422 16053 19427 1751 -24318 -6794 22283 -7796 -95620
7067 -95620 -90894 -71525 -110801 -79881 -54182 -33167 -49516 -101449 -119875 -106056 -73062 -66588
7055 -66588 -73903 -98652 -97467 -81985 -146065 -188602 -138794 -124317 -66624 5565 44960 -8617
$$ packed form
7143F1509o3717j9059k6124J6926M2196m920K2480j0534m5214k6868L302K2420
7131b7603N1612N380n2127q9274K994M6271M6705k169L4830l84l5821P477j9234
7118c1343L6081p474K2446r185n2169L779K8649k622K665K268k1493n162L8326
7105D766Q92J8375l3639l9684l3373K8125N0029j3993l376k1071k4602j1145J6801
7092f1895p901j7315L0713L1842O2996P56m5690m1839L2303r330Q181J0502R768
7079C091l0049j1282K1430k612L5475L374j7676k6069J7524K9077l0079q7824
7067i5620M726J9369l9276L0920K5699K1015j6349n1933j8426J3819L2994O474
7055f6588p315k4749J185J5482o4080m2537M9808J4477N7693P2189L9395n3577
$$ plain form
7043 -8617 -85552 -98147 -105837 -86255 -72965 -30106 -31017 -50830 -55378 -43952 4339 14101 1410
7030 1410 22414 45945 588 -40001 -734 25982 49410 118317 70595 68922 85511 83909
7018 83909 84772 41754 -15766 -47472 -65577 -28732 16164 -25299 -57847 -20668 23312 28163
7006 28163 6865 13237 47610 16605 -38528 -65075 -77398 -62913 -49966 -101480 -105258 -42595
6994 -42595 -31917 -20492 -56360 -60733 -50762 -71281 -95865 -73146 -57698 -6039 27031 25427
6982 25427 -2365 -43400 -68315 -68355 349 -8715 -52732 -54985 -70547 -84169 -61090 -70883 -104338
6969 -104338 -86797 -67979 -73207 -33093 -25712 -53540 -50276 -73653 -30722 47050 26865 -9640
6957 -9640 40197 64242 48696 21212 10632 -21058 6364 10893 -14874 -54597 -47132 -27749
$$ packed form
7043h617p6935j2595p690J9582J3290M2859r11j9813m548J1426M8291R762j2691
7030A410K1004K3531m5357m0589L9267K6716K3428O8907m7722j673J6589j602
7018H3909Q63m3018n7520l1706j8105L6845M4896m1463l2548L7179M3980M851
7006B8163k1298O372L4373l1005n5133k6547j2323J4485J2947n1514l778O2663
6994d2595J0678J1425l5868m373R971k0519k4584K2719J5448N1659L3070j604
6982B5427k7792m1035k4915m0O8704r064m4017k253j5562j3622K3079r793l3455
6969a04338J7541J8818n228M0114P381k7828L264k3377M2931P7772k0185l6505
6957i640M9837K4045j5546k7484j0580l1690K7422M529k5767l9723P465J9383
$$ plain form
6945 -27749 17439 -3089 -31603 -9528 -35442 -44412 -15291 -8085 55133 35296 -9942 -10776 7149
6932 7149 38869 71973 51291 28326 18164 31656 27190 -38252 -17815 -15323 -8995 -46845 -59206
6919 -59206 -34689 -39346 -97378 -134361 -123544 -89361 -110703 -103963 -98840 -168302 -196775 -138131
6907 -138131 -46800 -57212 -88890 -57585 -17934 -15302 13145 35206 -3203 -384 25213 40504
6895 40504 71426 77813 87155 92594 78139 85380 68616 76665 35792 -21184 -48162 -98600 -81762
6882 -81762 -104731 -118765 -99232 -39466 46311 29012 -46079 -110101 -103061 -54235 -77187 -77296
6870 -77296 -40474 -80256 -73199 -66612 -70696 -43419 -34035 -55764 -19904 29053 25522 267 4668
6857 4668 -9374 -83831 -89817 -47577 -52587 -27893 -3885 18720 32120 22217 -11246 -49036 -26769
$$ packed form
6945b7749M5188k0528k8514K2075k5914q970K9121P206O3218j9837m5238q34J7925
6932G149L1720L3104k0682k2965j0162J3492m466o5442K0437K492O328l7850j2361
6919e9206K4517m657n8032l6983J0817L4183k1342O740N123o9462k8473N8644
6907a38131R1331j0412l1678L1305L9651K632K8447K2061l8409K819K5597J5291
6895D0504L0922O387R342N439j4455P241j6764Q049m0873n6976k6978n0438J6838
6882h1762k2969j4034J9533N9766Q5777j7299p5091o4022P040M8826k2952j09
6870g7296L6822l9782P057O587m084K7277R384k1729L5860M8957l531k5255M401
6857D668j4042p4457n986M2240n010K4694K4008K2605J3400r903l3463l7790K2267
$$ plain form
6844 -26769 -15663 8223 15370 11930 47259 -13516 -35883 -12504 15577 33069 36 20410
6832 20410 54007 49415 104084 77590 11683 34093 23042 -13918 -11191 13887 51934 21185
6820 21185 12563 91553 56338 31324 -999 -60136 -55747 -50411 -73231 -44333 -33758 -14528
6808 -14528 37291 33889 -8822 -29548 -41190 28309 26157 608 -43973 -73079 -51000 -55650
6796 -55650 -77789 -67689 -60337 -48089 -78550 -48947 -57387 -34594 -20792 6105 9231 23474
6784 23474 68181 53304 37656 50340 65206 56270 32330 -504 -8311 -61058 -27610 -6140
6772 -6140 -23048 -55561 -93331 -109100 -104332 -41590 17118 64620 73322 55996 60241 55246 43732
6759 43732 13024 -11088 -63452 -24879 -31802 -40736 -21053 830 38185 14430 -28326 -66103
$$ packed form
6844b6769J1106K3886P147l440L5329o0775k2367K3379K8081J7492l3033K0374
6832B0410L3597m592N4669k6494o5907K2410j1051l6960K727K5078L8047l0749
6820B1185q622P8990l5215k5014l2323n9137M389N336k2820K8898J0575J9230
6808a4528N1819l402m2711k0726j1642O9499k152k5549m4581k9106K2079m650
6796e5650k2139J0100P352J2248l0461K9603q440K2793J3802K6897L126J4243
6784B3474M4707j4877j5648J2684J4866q936k3940l2834p807n2747L3448K1470
6772f140j6908l2513l7770j5769M768O2742N8708M7502Q702j7326M245m995j1514
6759D3732l0708k4112n2364L8573o923q934J9683K1883L7355k3755m2756l7777
$$ plain form
6747 -66103 -20206 -10174 -19176 -55572 -74074 -70342 -24187 -32675 -65393 -88749 -74908 -35788
6735 -35788 -37547 10169 61734 53168 36467 18024 31756 66816 29991 -22504 -42681 61062
6723 61062 39769 18851 -7905 -3559 241 14070 33111 55841 44662 17748 33432 41148
6711 41148 36328 -17576 -9309 226 -32605 -14702 24938 7669 4437 -15308 -58140 -43596 -17900
6698 -17900 33561 113810 79735 -3573 -32699 -18911 3139 1315 18001 15901 6846 -25715
6686 -25715 -26410 -1678 24685 77151 84106 71637 40468 8113 1979 -19255 -45631 -36573 -7185
6673 -7185 38574 51043 -26370 -21998 28243 52310 20699 -10150 -48052 -30262 -51777 -77906
6661 -77906 -93725 -81406 -27711 -1047 -50188 -52244 23227 59073 -14516 -34595 -52739 -45950
$$ packed form
6747f6103M5897J0032r002l6396j8502L732M6155q488l2718k3356J3841L9120
6735c5788j759M7716N1565q566j6701j8443J3732L5060l6825n2495k0177J03743
6723F1062k1293k0918k6756M346L800J3829J9041K2730j1179k6914J5684P716
6711D1148m820n3904Q267R535l2831J7903L9640j7269l232j9745m2832J4544K5696
6698a7900N1461Q0249l4075q3308k9126J3788K2050j824J6686k100r055l2561
6686b5715o95K4732K6363N2466O955j2469l1169l2355o134k1234k6376R058K9388
6673g185M5759J2469p7413M372N0241K4067l1611l0849l7902J7790k1515k6129
6661g7906j5819J2319N3695K6664m9141k056P5471L5846p3589k0079j8144O789
$$ plain form
6649 -45950 -14882 -27583 15090 -5593 -71567 -74197 -66550 -49566 23910 124948 134333 46938
6637 46938 6684 9422 -7753 -19688 18871 53385 38888 47056 48360 8382 -52409 -78506
6625 -78506 -65122 -54452 -7759 10908 1842 899 31586 16199 -35667 -57606 -30684 -68301
6613 -68301 -125358 -122215 -89909 -16300 -5221 15731 32208 23693 29306 -10634 -37159 37387
6601 37387 59920 57964 41595 12149 -13780 -78696 -88192 -52941 -18010 -11709 2123 1694 24034
6588 24034 52170 53953 12802 -6594 17256 -8615 8016 -16428 -17653 -15992 -8170 4511 -6027
6575 -6027 104 -6046 -1242 -20435 -13933 -21347 -20193 2370 47594 35857 -28109 -94397 -76404
6562 -76404 -35679 -20046 -18077 -1909 -12877 -28969 -21982 -17187 13367 1992 13105 -29180
$$ packed form
6649d5950L1068j2701M2673k0683o5974k630P647J6984P3476J01038R385q7395
6637D6938m0254K738j7175j1935L8559L4514j4497Q168J304l9978o0791k6097
6625g8506J3384J0670M6693J8667r066r43L0687j5387n1866k1939K6922l7617
6613f8301n7057L143L2306P3609J1079K0952J6477q515N613l9940k6525P4546
6601C7387K2533j956j6369k9446k5929o4916r496L5251L4931O301J3832m29K2340
6588B4034K8136J783m1151j9396K3850k5871J6631k4444j225J661P822J2681j0538
6575f027O131o150M804j9193O502p414J154K2563M5224j1737o3966o6288J7993
6562g6404M0725J5633J969J6168j0968j6092O987M795L0554j1375J1113m2285
$$ plain form
6550 -29180 -25561 -28352 -46876 -61415 -42956 4902 -8062 -37229 -23356 -80513 -72181 -54401
6538 -54401 -39333 -80593 -76843 -59724 -8226 -1372 -25121 -41962 -39614 -61254 -42964 -53119
6526 -53119 -79623 -79269 -40454 -39766 -30615 -60779 -60902 -120937 -88825 -96762 -90239 -59515 -25890 -29693
6512 -29693 -53037 -8009 -16542 264 -52182 -114567 -149626 -130776 -81215 -67401 -59285 -75797
6500 -75797 -40782 -22661 -67282 -74212 -35363 -35155 -50892 -55218 1762 55970 70606 63415 26310
6487 26310 -3329 25141 12605 -4826 -30916 -38628 -46324 -78207 -98394 -114578 -96510 -28153
6475 -28153 -48004 -58623 -54366 -48916 -14845 -14252 -29572 -30651 -37412 -1209 20236 30607 13973
6462 13973 -24178 -58958 -54843 -944 54201 14457 -2321 66689 95486 121118 121815 92321
$$ packed form
6550b9180L619k791j8524j4539J8459M7858j2964k9167J3873n7157Q332J7780
6538e4401J5068m1260L750J7119N1498O854k3749j6841K348k1640J8290j0155
6526e3119k6504L54L8815O88R151l0164j23o0035L2112p937O523L0724L3625l803
6512b9693k3344M5028q533J6806n2446o2385l5059J8850M9561J3814Q116j6512
6500g5797L5015J8121m4621o930L8849K08j5737m326N6980N4208J4636p191l7105
6487B6310k9639K8470j2536j7431k6090p712p696l1883k0187j6184J8068O8357
6475b8153j9851j0619M257N450L4071N93j5320j079o761L6203K1445J0371j6634
6462A3973l8151l4780M115N3899N5145l9744j6778O9010K8797K5632O97k9494
$$ plain form
6450 92321 59505 635 2896 -23121 -32848 7271 -21314 -60227 -27457 8386 -18068 -50258
6438 -50258 -21335 -38405 -76505 -94818 -84992 -49578 -55837 -99078 -94585 -91828 -20705 38008 4066
6425 4066 -8301 -22166 -56153 -84507 -131310 -133441 -53014 -79488 -59065 -35971 -22047 -14682
6413 -14682 20737 16428 9801 13070 -33257 -49462 -11627 39044 39453 -3825 -28911 -56205 -87396
6400 -87396 -42979 -22556 -28282 -6948 73673 96633 123462 110267 106028 81027 45495 32750
6388 32750 32116 16146 37244 112622 75699 31919 20823 -7177 -10699 -9864 -29766 -20663 2895
6375 2895 -7931 -26413 -58759 -35054 -4607 -16050 -18810 -4636 -434 3376 -21899 -8322 -18175
6362 -18175 -32795 -14095 -1644 30735 39072 33203 11570 -43746 -29150 -11497 -49695 -87433
$$ packed form
6450I2321l2816n8870K261k6017r727M0119k8585l8913L2770L5843k6454l2190
6438e0258K8923j7070l8100j8313R826L5414o259m3241M493K757P1123N8713l3942
6425D066j2367j3865l3987k8354m6803k131Q0427k6474K0423K3094J3924P365
6413a4682L5419m309o627L269m6327j6205L7835N0671M09m3278k5086k7294l1191
6400h7396M4417K0423n726K1334Q0621K2960K6829j3195m239k5001l5532j2745
6388C2750o34j5970K1098P5378l6923m3780j1096k8000l522Q35j9902R103K3558
6375B895j0826j8482l2346K3705L0447j1443k760J4174M202L810k5275J3577r853
6362a8175j4620J8700J2451L2379Q337n869k1633n5316J4596J7653l8198l7738
$$ plain form
6350 -87433 -71652 -28116 46089 41197 -20388 -27263 -33002 -476 -44761 -72853 -88932 -64911
6338 -64911 -10688 22638 50950 59498 70557 52653 -4159 -3199 -23784 7371 2202 -22353 11729
6325 11729 21140 41948 20560 8071 2699 30793 87855 44213 35730 69177 42204 32028
6313 32028 -22765 -42004 -51183 -55009 -49983 -47948 -5235 4472 2407 20568 16510 33967 -2141
6300 -2141 -54093 -77376 -53692 -8922 -19952 14464 19371 -3135 -29923 -15768 592 -11350
6288 -11350 -20131 -21442 -67674 -96437 -107819 -54711 -53519 -76785 -111850 -84875 13387 44696
6276 44696 58125 -5731 11957 -14452 -42209 -23315 -1531 11716 -33037 -56678 -60182 -21911
6264 -21911 29473 38307 33926 60252 45284 10558 -5799 4091 1550 -13491 -38499 -79243 -154076
$$ packed form
6350h7433J5781M3536P4205m892o1585o875n739L2526m4285k8092j6079K4021
6338f4911N4223L3326K8312Q548J1059j7904n6812R60k0585L1155n169k4555L4082
6325A1729R411K0808k1388j2489n372K8094N7062m3642q483L3447k6973j0176
6313C2028n4793j9239r179l826N026K035M2713R707k065J8161m058J7457l6108
6300b141n1952k3283K3684M4770j1030L4416M907k2506k6788J4155J6360j1942
6288a1350q781j311m6232k8763j1382N3108J192k3266l5065K6975R8262L1309
6276D4696J3429o3856J7688k6409k7757J8894K1784J3247m4753k3641l504L8271
6264b1911N1384Q834m381K6326j4968l4726j6357R890k541j5041k5008m0744p4833
$$ plain form
6251 -154076 -92565 -7297 6982 -7210 -38255 -16673 45546 44605 58291 55994 57788 65898 82954
6238 82954 17398 -28053 -21325 33257 66607 16804 33466 90926 86475 34781 -20141 3955
6226 3955 29756 40626 77671 61689 63388 91478 70686 44899 13464 -4055 -28950 -65481
6214 -65481 -22880 17858 44169 -58434 -116700 -112246 -97791 -94362 -99438 -115364 -56674 -59314
6202 -59314 -74371 -23470 -26450 -19833 48271 102509 66454 -2602 -52184 -40099 -1960 -32287
6190 -32287 -47832 -18182 61270 57706 54021 48364 59010 30545 19395 30631 61290 42925
6178 42925 8520 -2874 -16556 -20438 -29093 -60436 -59059 -69932 -94621 -94498 -64032 -64150 -73095
6165 -73095 -39431 -40332 -48455 -54125 -43282 -47808 -47370 -25901 -33798 -36432 -77212 -79973 -73945 -81757
$$ packed form
6251a54076O1511Q5268J4279j4192l1045K1582O2219r41J3686k297J794Q110J7056
6238H2954o5556m5451O728N4582L3350m9803J6662N7460m451n1694n4922K4096
6226C955K5801J0870L7045j5982J699K8090k0792k5787l1435j7519k4895l6531
6214f5481M2601M0738K6311j02603n8266M454J4455L429n076j5926N8690k640
6202e9314j5057N0901k980O617O8104N4238l6055o9056m9582J2085L8139l0327
6190c2287j5545K9650P9452l564l685n657J0646k8465j1150J1236L0659j8365
6178D2925l4405j1394j3682l882q655l1343J377j0873k4689J23L0466j18q945
6165g3095L3664r01q123n670J0843m526M38K1469p897k634m0780k761O028p812
$$ plain form
6151 -81757 -108200 -116736 -51487 8891 -35889 -79879 -87827 -63291 -55128 -55557 -55570 -41645 -11472
6138 -11472 57648 121983 117317 71472 29392 2213 36735 27850 93721 56039 -34454 -64419
6126 -64419 -46068 -83255 -60618 -76835 -59753 -361 42560 22916 -3505 -26393 448 40578
6114 40578 93226 84695 54472 63731 42506 16744 -4483 -15995 -10972 25625 41997 39589 42125
6101 42125 51061 49090 -9161 11474 37002 25591 32810 33047 76840 86365 61294 103639 50934
6088 50934 34657 49781 11672 -26595 14059 49250 58452 46163 40284 -7747 1106 -39887
6076 -39887 -73509 -98178 -108591 -74730 -44310 -591 27985 35195 7806 37614 53066 63260
6064 63260 -2415 -26356 -28663 -45076 -62811 -63557 326 35384 33591 -9933 -4408 27817 813
$$ packed form
6151h1757k6443q536O5249O0378m4780m3990p948K4536Q163m29j3J3925L0173
6138a1472O9120O4335m666m5845m2080k7179L4522q885O5871l7682r0493k9965
6126f4419J8351l7187K2637j6217J7082N9392M2921j9644k6421k2888K6841M0130
6114D0578N2648q531l0223R259k1225k5762k1227j1512N023L6597J6372k408K536
6101D2125Q936j971n8251K0635K5528j1411P219K37M3793R525k5071M2345n2705
6088E0934j6277J5124l8109l8267M0654L5191R202j2289n879m8031Q853m0993
6076c9887l3622k4669j0413L3861L0420M3719K8576P210k7389K9808J5452J0194
6064F3260o5675k3941k307j6413j7735p46O3883L5058j793m3524N525L2225k7004
$$ plain form
6051 813 -67726 -110199 -61536 -45185 -29794 -24597 -52336 -63960 -22680 35466 33287 27400 76930
6038 76930 89585 49430 16700 39012 21210 9164 7253 -37720 -41054 -34732 -47459 -31413
6026 -31413 34735 -30902 -56702 -23724 -30836 -55739 -27096 -31921 -6771 -3961 -22894 -1503
6014 -1503 23038 34079 75507 40431 28582 65046 -16549 -66387 3968 61368 31658 -14345
6002 -14345 -16812 -35202 -5301 -5623 -211 23845 44909 29445 2082 -36684 -41429 -25432 39318
5989 39318 18576 -6175 -75332 -116842 -53710 12719 74105 104178 36726 12691 47521 33050
5977 33050 28278 -21076 -24234 19349 73894 95472 82949 83485 67240 35772 60391 59090 56069
5964 56069 70926 56434 72727 23832 20433 75283 45647 55318 65305 52044 6610 -76736
$$ packed form
6051H13o8539m2473M8663J6351J5391N197k7739j1624M1280N8146k179n887M9530
6038G6930J2655m0155l2730K2312j7802j2046j911m4973l334O322j2727J6046
6026c1413O6148o5637k5800L2978p112k4903K8643m825K5150K810j8933K1391
6014a503K4541J1041M1428l5076j1849L6464q1595m9838P0355N7400k9710m6003
6002a4345k467j8390K9901l22N412K4056K1064j5464k7363l8766m745J5997O4750
5989C9318k0742k4751o9157m1510O3132O6429O1386L0073o7452k4035L4830j4471
5977C3050m772m9354l158M3583N4545K1578j2523N36j6245l1468K4619j301l021
5964E6069J4857j4492J6293m8895l399N4850k9636R671R987j3261m5434q3346
$$ plain form
5952 -76736 -88964 -80740 -57631 -56769 -171528 -180183 -152719 -99653 -16186 25815 18089 9875 20212
5939 20212 68625 39960 23405 -17973 -16537 -33558 -19578 3621 5912 15228 31695 36323 22725
5926 22725 -12404 -21309 30370 21296 28675 28256 -6443 -33841 19141 63724 9700 -15880 -36499
5913 -36499 -48264 -77643 -82144 -31990 41216 72919 60598 35060 4631 9145 33656 26289
5901 26289 30227 9562 62 -30823 -34184 -12177 42670 24771 -35899 -20214 53932 59966 40024
5888 40024 -24410 -19493 9639 30144 37351 38002 37299 62517 27195 -27015 -21649 20048 5872
5875 5872 -22837 -32767 -13536 -179 31053 107395 91593 26794 10187 8968 -50421 -29314
5863 -29314 87374 118382 74840 14415 -6190 -20051 1018 7343 -55 -32469 -52046 -42731
$$ packed form
5952g6736j2228Q224K3109Q62j14759q655K7464N3066Q3467M2001p726q214J0337
5939B0212M8413k8665j6555m1378J436j7021J3980K3199K291R316J6467M628j3598
5926B2725l5129q905N1679r074P379m19l4699k7398N2982M4583n4024k5580k0619
5913c6499j1765k9379m501N0154P3206L1703j2321k5538l0429M514K4511p367
5901B6289L938k0665r500l0885l361K2007N4847j7899o0670J5685P4146O034j9942
5888D0024o4434M917K9132K0505P207O51p03K5218l5322n4210N366M1697j4176
5875E872k8709r930J9231J3357L1232P6342j5802o4799j6607j219n9389K1107
5863b9314J16688L1008m3542o0425k0605j3861K1069O325p398l2414j9577R315
$$ plain form
5851 -42731 -38440 5226 35683 9176 19008 -50581 -13640 -2441 -10320 38664 -9717 -29475
5839 -29475 -36922 -61812 -38028 -72875 -75010 -1125 17533 60649 82064 2473 -38115 -45542
5827 -45542 -46815 -42983 -44566 -6832 2999 -4935 -14742 764 -4189 5711 20245 29904 6707 -7691
5813 -7691 -35694 -63221 -95773 -76283 -67569 -64929 -56046 -77306 -77572 -10293 6136 5697 1200 -44241
5799 -44241 -67113 -78802 -89852 -89455 -79193 -21028 -8614 -46273 -55961 -32989 -47790 -41676 -80805
5786 -80805 -102999 -48836 -21318 56693 85920 31208 15062 -7509 -44658 -84888 -79055 -31225
5774 -31225 -51077 -25514 20401 471 -47056 -74878 -376 -17342 -34966 -38304 -15475 16814
5762 16814 8337 39349 46675 77748 85547 44303 37825 73111 83998 76330 59484 57115 57594
$$ packed form
5851d2731M291M3666L0457k6507R832o9589L6941J1199p879M8984m8381j9758
5839b9475p447k4890K3784l4847k135P3885J8658M3116K1415p9591m0588p427
5827d5542j273L832j583L7734R831p934r807J5506m953R900J4534R659k3197j4398
5813g691k8003k7527l2552J9490Q714K640Q883k1260k66O7279J6429m39m497m5441
5799d4241k2872j1689j1050L97J0262N8165J2414l7659r688K2972j4801O114l9129
5786h0805k2194N4163K7518P8011K9227n4712j6146k2571l7149m0230N833M7830
5774c1225j9852K5563M5915j9930m7527k7822P4502j6966j7624l338K2829L2289
5762A6814q477L1012P326L1073P799m1244o478L5286J0887p668j6846k369M79
$$ plain form
5749 57594 39367 39356 24149 16459 64343 92968 95144 100909 41248 13930 -13902 -78215 -81227
5736 -81227 -64819 -68443 -41816 -27779 -216 33741 36927 99044 89830 81924 88337 76792 -7983
5723 -7983 -52278 -67416 -62802 -29040 -8679 -5056 1241 11358 41493 79401 91832 65869 59047
5710 59047 -8248 -36374 21668 36473 -35363 -2726 828 5881 43082 29947 41326 -5351
5698 -5351 -19499 -9006 39960 55088 49632 72351 16462 -31346 6025 31072 40304 57035
5686 57035 -9997 -27658 24713 6837 25523 58685 67805 72997 77490 70326 79468 28088 21806
5673 21806 30540 69447 56225 9651 -13781 -48487 -46309 -53339 -27136 8189 -4563 -16355
5661 -16355 -20137 12023 26294 44682 20679 22961 2378 36840 42533 -874 -7069 23524 60996
$$ packed form
5749E7594j8227j1j5207p690M7884K8625K176N765n9661k7318k7832o4313l012
5736h1227J6408l624K6627J4037K7563L3957L186O2117r214p906O413j1545q4775
5723g983m4295j5138M614L3762K0361L623O297J0117L0135L7908J2431k5963o822
5710E9047o7295k8126N8042J4805p1836L2637L554N053L7201j3135J1379m6677
5698e351j4148J0493M8966J5128n456K2719n5889m7808L7371K5047R232J6731
5686E7035o7032j7661N2371j7876J8686L3162R120N192M493p164R142n1380o282
5673B1806Q734L8907j3222m6574k3432l4706K178p030K6203L5325j2752j1792
5661a6355l782L2160J4271J8388k4003K282k0583L4462N693m3407o195L0593L7472
$$ plain form
5648 60996 56052 14673 -31603 -32591 -33257 -55476 -104939 -151972 -77412 -9552 66180 69248 47594
5635 47594 37494 31264 27058 15913 -38923 -40321 -9860 -28246 -107862 -68569 -16093 -48074
5623 -48074 -5615 -693 -15183 -54193 -115364 -119054 -94722 -39630 -16725 -24132 -71468 -79128 -62868
5610 -62868 -20393 -9041 -21625 -24117 -5078 40215 88761 38531 -6762 -22544 16928 23410
5598 23410 6751 21714 -23280 -2698 22351 25898 -54490 -110441 -160295 -124520 -121671 -147192
5586 -147192 -142243 -101998 -67524 -61617 -11628 -38142 1683 48366 55113 45202 72958 121439
5574 121439 135020 123809 91165 19029 -1411 8054 35738 -17322 -63500 -149160 -162956 -128993
5562 -128993 -46948 -26373 -38733 -58207 -41853 -41165 -46810 -32450 -43956 -44470 -76708 -113765 -95251
$$ packed form
5648F0996m944m1379m6276r88o66k2219m9463m7033P4560O7860P5732L068k1654
5635D7594j0100o230m206j1145n4836j398L0461j8386p9616L9293N2476l1981
5623d8074M2459M922j4490l9010o1171l690K4332N5092K2905p407m7336p660J6260
5610f2868M2475J1352j2584k492J9039M5293M8546n0230m5293j5782L9472O482
5598B3410j6659J4963m4994K0582K5049L547q0388n5951m9854L5775K849k5521
5586a47192M949M0245L4474N907M9989k6514L9825M6683O747r911K7756M8481
5574A21439J3581j1211l2644p2136k0440R465K7684n3060m6178q5660j3796L3963
5562a28993Q2045K0575j2360j9474J6354O88n645J4360j1506n14l2238l7057J8514
$$ plain form
5549 -95251 -11222 -17093 -9714 1194 -12473 -37189 -76113 -63556 -88529 -67563 -35559 -15442
5537 -15442 14744 8932 -24862 -12354 -16787 -46166 13328 55598 62132 22368 -24102 6129
5525 6129 81977 89148 14617 -13194 -17689 -14649 7361 19118 28383 -31186 -122138 -117096 -91795
5512 -91795 -89784 -46272 -3986 33984 10871 32451 6810 12120 51892 35963 -27372 -69529
5500 -69529 -40180 38909 11255 -25550 -38361 -21682 -18194 -10418 -24352 -23075 31923 1175
5488 1175 -33464 -79321 -88694 -83145 -71311 -59155 -77133 -29329 27462 -22260 -39649 -33606 2530
5475 2530 11343 -15627 -23247 12025 23845 5302 -4309 28478 58553 53348 60572 15836 -31479
5462 -31479 -42758 -59807 -32026 -3046 -2364 -27910 -64050 -33531 8672 -14733 -24491 29274
$$ packed form
5549i5251Q4029n871P379J0908j3667k4716l8924J2557k4973K0966L2004K0117
5537a5442L0186n812l3794J2508m433k9379N9494M2270O534l9764m6470L0231
5525F129P5848P171p4531k7811m495L040K2010J1757R265n9569r0952N042K5301
5512i1795K011M3512M2286L7970k3113K1580k5641N310L9772j5929o3335m2157
5500f9529K9349P9089k7654l6805j2811J6679L488P776j3934J277N4998l0748
5488A175l4639m5857r373N549J1834J2156j7978M7804N6791m9722j7389O043L6136
5475B530Q813k6970p620L5272J1820j8543r611L2787L0075n205P224m4736m7315
5462c1479j1279j7049K7781K8980O82k5546l6140L0519M2203k3405r758N3765
$$ plain form
5450 29274 86280 39192 -12982 -58014 -47906 36475 42678 -12088 -23700 -9588 -12210 -18810
5438 -18810 -40343 -66632 -81194 -114251 -134160 -141663 -150507 -75973 -69460 -89731 -56701 -22599
5426 -22599 -36267 -20231 -52856 -81913 -54102 -8062 8336 10810 3618 -9667 -29518 -7657
5414 -7657 -13929 -24678 6888 18976 12016 -36501 -15025 42028 25860 775 -24354 -35301
5402 -35301 -63251 -19515 -27203 -62652 -50528 -23344 -11040 36484 51900 12307 -3687 -39438
5390 -39438 -96581 -52889 -12689 -16106 -13729 3202 -41865 -45313 -25685 -30049 -47188 -57007 16681
5377 16681 24829 36729 18299 -13032 -10863 -13482 -20925 -45291 -55940 -54806 -58772 -50390 -43966
5364 -43966 -71238 -63945 1451 18221 5416 -4226 64154 116837 97005 73084 100152 81560
$$ packed form
5450B9274N7006m7088n2174m5032J0108Q4381O203n4766j1612J4112k622o600
5438a8810k1533k6289j4562l3057j9909p503q844P4534O513k0271L3030L4102
5426b2599j3668J6036l2625k9057K7811M6040J6398K474p192j3285j9851K1861
5414g657o272j0749L1566J2088o960m8517K1476N7053j6168k5085k5129j0947
5402c5301k7950M3736p688l5449J2124K7184J2304M7524J5416l9593j5994l5751
5390c9438n7143M3692M0200l417K377J6931m5067l448J9628m364j7139r819P3688
5377A6681Q148J1900j8430l1331K169k619p443k4366j0649J134l966Q382O424
5364d3966k7272P293O5396J6770j2805r642O8380N2683j9832k3921K7068j8592
$$ plain form
5352 81560 25844 -30627 -9950 -22014 -30017 -15808 -21251 5455 32533 -1046 -18488 -18321 -4859
5339 -4859 9822 29040 50424 42342 -36640 -94423 -15282 109172 172047 86723 -2707 -17783
5327 -17783 24122 -1136 2250 4430 -18993 -104943 -111247 -54895 -14319 23948 35918 2570
5315 2570 -37970 -70320 -53009 -77340 -61696 -36487 15070 19494 46431 48215 75749 49885
5303 49885 -7529 -19088 30378 22713 20056 32217 32946 39594 55860 6221 -28732 -39041 -44667
5290 -44667 -31456 -4048 -3337 18571 -2899 -25458 6445 2758 -23482 -10586 -19602 3773 -37332
5277 -37332 -62244 -87958 -93650 -65224 -31623 -1562 10311 -3576 -33264 -31594 -56670 -23992
5265 -23992 38278 1946 -38936 -34544 -16571 -20577 -6403 1052 -15540 -34267 -18870 -44606
$$ packed form
5352H1560n5716n6471K0677j2064q003J4209n443K6706K7078l3579j7442J67J3462
5339d859J4681J9218K1384q082p8982n7783P9141J24454O2875q5324q9430j5076
5327a7783M1905k5258L386K180k3423q5950o304N6352M0576L8267J1970l3348
5315B570m0540l2350J7311k4331J5644K5209N1557M424K6937J784K7534k5864
5303D9885n7414j1559M9466p665k657J2161P29O648J6266m9639l4953j0309n626
5290d4667J3211K7408P11K1908k1470k2559L1903l687k6240J2896r016K3375m1105
5277c7332k4912k5714n692K8426L3601L0061J1873j3887k9688J670k5076L2678
5265b3992O2270l6332m0882M392J7973m006J4174P455j6592j8727J5397k5736
$$ plain form
5253 -44606 -80895 -29393 -25241 -58829 -74502 -68973 -86748 -115534 -68326 -21826 -29229 -65960
5241 -65960 -88577 -131887 -43544 -1804 -9929 -57131 -69108 -78521 -45622 -37351 -59413 -60084 -26816
5228 -26816 -41455 -51158 -51078 -33571 -15502 -36691 -71672 -96528 -61807 2876 18515 36420 65808
5215 65808 71886 111816 102381 62294 39922 40347 3826 -53821 -55494 1784 56190 63009 7135
5202 7135 -48783 -34663 50122 98966 93867 66384 58052 29328 28560 28972 -7153 35991 69065
5189 69065 36985 -20125 -97795 -88037 -23722 23700 6799 9462 -15665 2354 50993 79659
5177 79659 67977 76813 45515 58785 -13257 -40362 -15575 15449 19837 -6729 -5786 -32192 -16998
5164 -16998 -28188 34428 54766 20623 -45278 -61392 -75448 -117712 -90990 -118580 -119644 -5426
$$ packed form
5253d4606l6289N1502M152l3588j5673N529j7775k8786M7208M6500p403l6731
5241f5960k2617m3310Q8343M1740q125m7202j1977r413L2899Q271k2062o71L3268
5228b6816j4639r703Q0J7507J8069k1189l4981k4856L4721O4683J5639J7905K9388
5215F5808O078L9930r435m0087k2372M25l6521n7647j673N7278N4406O819n5874
5202G135n5918J4120Q4785M8844n099k7483q332k8724p68M12l6125M3144L3074
5189F9065l2080n7110p7670R758O4315M7422j6901K663k5127J8019M8639K8666
5177G9659j1682Q836l1298J3270p2042k7105K4787L1024M388k6566R43k6406J5194
5164a6998j1190O2616K0338l4143o5901j6114j4056m2264K6722k7590j064J14218
$$ plain form
5152 -5426 54972 55941 57591 45196 21134 30924 58382 36744 47004 42257 -37556 -14230 -3254
5139 -3254 -57419 -84637 -56287 -45730 -21539 28323 12523 4952 -17847 -52465 -37532 -12187
5127 -12187 32929 24298 -25653 6518 8649 -54547 -87678 -46200 -22937 4419 -40096 -97169
5115 -97169 -58923 25683 101655 85336 46248 52600 65892 52964 76889 78542 45969 101771
5103 101771 92716 -2052 -59378 -28636 -53645 -46204 -77451 -95859 -112314 -111393 -88630 -34164
5091 -34164 22190 40468 44100 38407 38295 63107 16892 -63564 -74864 -45883 4679 39489 81396
5078 81396 98006 113272 67118 43545 49380 64901 48354 5386 -41948 -69358 -42954 -4878
5066 -4878 19278 26091 60090 81325 61913 59399 56875 53405 39374 -1899 -23392 10254 35145
$$ packed form
5152e426O0398R69J650j2395k4062R790K7458k1638J0260m747p9813K3326J0976
5139c254n4165k7218K8350J0557K4191M9862j5800p571k2799l4618J4933K5345
5127a2187M5116q631m9951L2171K131o3196l3131M1478K3263K7356m4515n7073
5115i7169L8246Q4606P5972j6319l9088O352J3292j2928K3925J653l2573N5802
5103A01771r055r4768n7326L0742k5009P441l1247j8408j6455R21K2763N4466
5091c4164N6354J8278L632n693j12K4812m6215q0456j1300K8981N0562L4810M1907
5078H1396J6610J5266m6154k3573N835J5521j6547m2968m7334k7410K6404L8076
5066d878K4156O813L3999K1235j9412k514k524l470j4031m1273k1493L3646K4891
$$ plain form
5053 35145 33197 -13639 -5503 7116 -5896 -19668 27430 62429 28013 14277 3728 21026
5041 21026 1753 -10600 -22181 -10158 -47927 -48912 -29435 -29876 -55567 -98755 -69007 -14588 11011
5028 11011 47814 26554 35632 46140 43049 30984 25947 40038 41051 60636 46928 59748 57849
5015 57849 48799 9558 1807 6129 5530 -12189 -22596 -3196 55903 54518 90793 106637 86491
5002 86491 54880 21454 -6749 -12818 17032 26133 -30373 -25406 17237 846 -30131 -65344
4990 -65344 -88810 -94421 -32890 25147 10181 -42018 -100212 -143045 -129143 -102733 -62255 -16481
4978 -16481 -8917 -66441 -112835 -106429 -86196 -96345 -88038 -83733 -67066 -38235 15793 35607 -9479
4965 -9479 -34058 -45018 -18061 25351 6874 555 15332 75025 -19443 -1734 20019 43098
$$ packed form
5053C5145j948m6836Q136J2619j3012j3772M7098L4999l4416j3736j0549J7298
5041B1026j9273j2353j1581J2023l7769r85J9477m41k5691m3188K9748N4419K5599
5028A1011L6803k1260R078J0508l091j2065n037J4091J013J9585j3708J2820j899
5015E7849r050l9241p751M322n99j7719j0407J9400N9099j385L6275J5844k0146
5002H6491l1611l3426k8203o069K9850R101n6506M967M2643j6391l0977l5213
4990f5344k3466n611O1531N8037j4966n2199n8194m2833J3902K6410M0478M5774
4978a6481P564n7524m6394O406K0233j0149Q307M305J6667K8831N4028J9814m5086
4965i479k4579j0960K6957M3412j8477o319J4777N9693r4468J7709K1753K3079
$$ plain form
4953 43098 24369 -9236 -25591 -1728 -35987 -79700 -145900 -180155 -174286 -108159 -61009 -30298
4941 -30298 -28167 -16343 -72230 -110061 -102017 -63004 22604 -42469 -103435 -91279 -45119 16825
4929 16825 15639 -6844 -5084 -16710 -47519 -106506 -76557 -6102 3799 8791 41517 68816 66143
4916 66143 68129 33559 830 69434 73894 32401 18580 -5388 15288 28087 5737 -13658
4904 -13658 -19215 -14335 2185 -56424 -80138 -23804 -17394 -33577 -54970 -47079 26102 86255 42812
4891 42812 27022 27493 14160 -9859 24186 18936 -15078 -7649 441 -38730 -56067 5293 57603
4878 57603 -2405 -31540 14807 27899 6603 -62843 -48708 -49956 -32197 13814 -9079 -16009
4866 -16009 12614 59929 83997 24632 -33529 -22497 9181 -13821 -94111 -98903 -63712 -2057
$$ packed form
4953D3098j8729l3605j6355K3863l4259m3713o6200l4255N869O6127M7150L0711
4941c0298K131J1824n5887l7831Q044L9013Q5608o5073o0966J2156M6160O1944
4929A6825j186k2483J760j1626l0809n8987K9949P0455R901M992L2726K7299k673
4916F6143J986l4570l2729O8604M460m1493j3821k3968K0676J2799k2350j9395
4904a3658n557M880J6520n8609k3714N6334O410j6183k1393P891P3181O0153m3443
4891D2812j5790M71j3333k4019L4045n250l4014P429Q090l9171j7337O1360N2310
4878E7603o0008k9135M6347J3092k1296o9446J4135j248J7759M6011k2893o930
4866a6009K8623M7315K4068n9365n8161J1032L1678k3002q0290m792L5191O1655
$$ plain form
4854 -2057 61431 60072 49331 28238 31160 65732 67931 69579 52695 -12626 -34317 -59299 -33777
4841 -33777 -13404 39513 47305 27583 10126 23565 22472 -13684 1167 13183 19475 19243 42309
4828 42309 56996 25393 14372 29838 81649 55057 6013 -34874 -1012 13269 3503 47709
4816 47709 37934 -20271 -77909 -79547 -24355 -16947 33828 2697 -10945 12183 -13347 -41300
4804 -41300 -26302 -34302 -69512 -89667 -39859 -34752 17314 1482 -57313 -43244 -51471 -17974
4792 -17974 -10576 -21560 -19778 -90051 -105932 -88307 -56273 -19819 59310 47985 -730 -18444
4780 -18444 14792 -34385 -29469 -66523 -50252 42624 43965 66026 59460 21411 16978 17856 6483
4767 6483 26835 -12394 -61115 -33238 13410 14869 24038 -26191 -35233 -26977 20720 30915 24268
$$ packed form
4854b057O3488j359j0741k1093K922L4572K199J648j6884o5321k1691k4982K5522
4841c3777K0373N2917P792j9722j7457J3439j093l6156J4851J2016O292k32K3066
4828D2309J4687l1603j1021J5466N1811k6592m9044m0887L3862J4281r766M4206
4816D7709r775n8205n7638j638N5192P408N0775l1131j3642K3128k5530k7953
4804d1300J4998q000l5210k0155M9808N107N2066j5832n8795J4069q227L3497
4792a7974P398j0984J782p0273j5881J7625L2034L6454P9129j1325m8715j7714
4780a8444L3236m9177M916l7054J6271R2876J341K2061o566l8049m433Q78j1373
4767F483K0352l9229m8721K7877M6648J459R169n0229r042Q256M7697J0195o647
$$ plain form
4754 24268 -11523 -4884 -7903 419 -1997 -38932 -80018 -70680 -62499 -45573 8680 50630 21153
4741 21153 21702 -23598 -84368 -98607 -80683 -26476 271 3063 -22505 -35396 -18612 -46469
4729 -46469 5086 18681 -7012 50495 51205 12711 -29835 -23490 -18549 22184 6908 -8815 -7833
4716 -7833 48593 70309 11443 20209 14114 39490 18624 45661 81971 69976 29349 8394
4704 8394 4813 -33737 -27074 1499 -5530 -4731 -24937 -39449 -33438 -2422 -35166 -85984 -92856
4691 -92856 -122629 -147610 -83785 -47588 -65986 -59356 -16408 -13136 -53468 -38847 -16843 13543
4679 13543 -76193 -101019 -33495 -36052 -2349 13062 4183 -29479 -41754 -20647 27799 61601
4667 61601 39833 26112 38760 34850 65496 36012 -9148 -11835 3724 63381 62485 8524 -38169
$$ packed form
4754B4268l5791O639l019Q322k416l6935m1086R338Q181J6926N4253M1950k9477
4741B1153N49m5300o0770j4239J7924N4207K6747K792k5568j2891J6784k7857
4729d6469N1555J3595k5693N7507P10l8494m2546O345M941M0733j5276j5723R82
4716g833N6426K1716n8866Q766o095K5376k0866K7037L6310j1995m0627k0955
4704H394l581l8550O663K8573p029P99k0206j4512O011L1016l2744n0818o872
4691i2856k9773k4981O3825L6197j8398O630M2948L272m0332J4621K2004L0386
4679A3543q9736k4826O7524k557L3703J5411q879l3662j2275K1107M8446L3802
4667F1601k1768j3721J2648l910L0646k9484m5160k687J5559N9657q96n3961m6693
$$ plain form
4654 -38169 -63823 -64218 17857 141309 110302 64220 101922 110329 72676 36258 32971 4835
4642 4835 -20223 -63923 -76946 -51866 -46682 -56723 -25482 18105 76522 115053 93638 16062
$$ packed form
4654c8169k5654l95Q2075J23452l1007m6082L7702Q407l7653l6418l287k8136
4642D835k5058m3700j3023K5080N184j0041L1241M3587N8417L8531k1415p7576
$$ [...]
##END NTUPLES=NMR SPECTRUM
##END=
