##TITLE=Analysis number 321086
Compound Code cc 60313
Book Reference 470/67
Project Code adrs
Chemist Name mikem
##JCAMPDX= 6.0         $$ Bruker NMR JCAMP-DX V2.0
##DATA TYPE= NMR SPECTRUM
##DATA CLASS= NTUPLES
##ORIGIN= Bruker BioSpin GmbH
##OWNER= nmr
$$ XWIN-NMR		Version 3.5
$$ Mon Jul 24 13:27:35 2006 GMT Daylight Time (UT+1h)  MAYBRIDGE\nmr@NMR_250MHZ
##.OBSERVE FREQUENCY= 250.131544655141
##.OBSERVE NUCLEUS= ^1H
##.ACQUISITION MODE= SIMULTANEOUS (DQD)
##.ACQUISITION SCHEME= undefined
##.AVERAGES= 16
##.DIGITISER RES= 18
##SPECTROMETER/DATA SYSTEM= dpx250
##.PULSE SEQUENCE= zg30
##.SOLVENT NAME= CDCl3
##.SHIFT REFERENCE= (INTERNAL, CDCl3, 0, 16.522)
##AUDIT TRAIL= $$ (NUMBER, WHEN, WHO, WHERE, WHAT)
$$ ##TITLE= Audit trail, XWIN-NMR		Version 3.5
$$ ##JCAMPDX= 5.01
$$ ##ORIGIN= Bruker BioSpin GmbH
$$ ##OWNER= nmr
$$ C:\u/data/dgb/nmr/ADRS/3320/pdata/1/auditp.txt
$$ ##AUDIT TRAIL=  $$ (NUMBER, WHEN, WHO, WHERE, WHAT)
(   1,<2006-07-24 13:26:59.98 +100>,<MAYBRIDGE\nmr>,<NMR_250MHZ>,
      <created by zg, POWCHK disabled, PULCHK disabled
       configuration hash MD5:
       E2 DF 36 D8 04 B2 41 60 5A D7 A3 38 5A 4B D0 FE
       data hash MD5: 64K
       0C BC 84 65 8C 56 B4 17 6E DB D8 7F 5C 52 53 AF>)
(   2,<2006-07-24 13:27:20.54 +100>,<MAYBRIDGE\nmr>,<NMR_250MHZ>,
      <Start of raw data processing
       ef LB = 0.3 FT_mod = 6 PKNL = 1 SI = 32K 
       data hash MD5: 32K
       F2 0C 79 CC D6 FD F5 22 46 9A 4B E9 27 5C 8F 5B>)
(   3,<2006-07-24 13:27:22.41 +100>,<MAYBRIDGE\nmr>,<NMR_250MHZ>,
      <apk 
       data hash MD5: 32K
       06 87 92 D9 8A 63 49 17 2F 3D 24 B2 E7 38 30 43>)
(   4,<2006-07-24 13:27:23.18 +100>,<MAYBRIDGE\nmr>,<NMR_250MHZ>,
      <abs ABSG = 5 
       data hash MD5: 32K
       8F C1 93 88 E3 0C E1 D4 0D D8 1D 4A 7C BF FD D4>)
$$ ##END=
$$ 
$$ hash MD5
$$ F8 3C 30 C5 4C 05 91 8C 95 6B 3C 46 18 E1 FC 67
##$RELAX= 
##$RELAX= 
##$RELAX= 
##$RELAX= 
##$RELAX= 
##$RELAX= 
##$RELAX= 
$$ Bruker specific parameters
$$ --------------------------
##$DU= <C:\u>
##$EXPNO= 3320
##$NAME= <ADRS>
##$PROCNO= 1
##$TYPE= <nmr>
##$USER= <dgb>
##$AMP= (0..31)
100 100 100 100 100 100 100 100 100 100 100 100 100 100 100 100 100 100 
100 100 100 100 100 100 100 100 100 100 100 100 100 100 
##$AQSEQ= 0
##$AQ_mod= 3
##$AUNM= <au_zg>
##$AUTOPOS= <32 >
##$BF1= 250.13
##$BF2= 250.13
##$BF3= 250.13
##$BF4= 250.13
##$BF5= 500.13
##$BF6= 500.13
##$BF7= 500.13
##$BF8= 500.13
##$BYTORDA= 1
##$CFDGTYP= 0
##$CFRGTYP= 5
##$CHEMSTR= <none>
##$CNST= (0..31)
1 1 145 1 1 1 1 1 1 1 1 1 1 1 1 1 1 1 1 1 1 1 1 1 1 1 1 1 1 1 1 1 
##$CPDPRG= <>
##$CPDPRG1= <>
##$CPDPRG2= <>
##$CPDPRG3= <>
##$CPDPRG4= <mlev>
##$CPDPRG5= <mlev>
##$CPDPRG6= <mlev>
##$CPDPRG7= <mlev>
##$CPDPRG8= <mlev>
##$CPDPRGB= <>
##$CPDPRGT= <>
##$D= (0..31)
0 1 0 0 0 0 0 0 0 0.06 0 0 0 0 0 0 0.0002 0 0 0 0 0 0 0 0 0 0 0 0 0 0 
0 
##$DATE= 1153744018
##$DBL= (0..7)
120 120 120 120 120 120 120 120 
##$DBP= (0..7)
150 150 150 150 150 150 150 150 
##$DBP07= 0
##$DBPNAM0= <>
##$DBPNAM1= <>
$$ [...]
##$SUBNAM6= <"">
##$SUBNAM7= <"">
##$SUBNAM8= <"">
##$SUBNAM9= <"">
##$SW= 20.6930455092707
##$SWIBOX= (0..15)
0 0 3 0 0 0 0 0 0 0 0 0 0 0 0 0 
##$SW_h= 5175.983436853
##$TD= 65536
##$TD0= 1
##$TE= 295.16
##$TE2= 300
##$TE3= 300
##$TEG= 300
##$TL= (0..7)
0 120 120 120 120 120 120 120 
##$TP= (0..7)
150 150 150 150 150 150 150 150 
##$TP07= 0
##$TPNAME0= <>
##$TPNAME1= <>
##$TPNAME2= <>
##$TPNAME3= <>
##$TPNAME4= <>
##$TPNAME5= <>
##$TPNAME6= <>
##$TPNAME7= <>
##$TPOAL= (0..7)
0.5 0.5 0.5 0.5 0.5 0.5 0.5 0.5 
##$TPOFFS= (0..7)
0 0 0 0 0 0 0 0 
##$TUNHIN= 0
##$TUNHOUT= 0
##$TUNXOUT= 0
##$USERA1= <user>
##$USERA2= <user>
##$USERA3= <user>
##$USERA4= <user>
##$USERA5= <user>
##$V9= 5
##$VALIST= <valist>
##$VCLIST= <CCCCCCCCCCCCCCC>
##$VD= 0
##$VDLIST= <DDDDDDDDDDDDDDD>
##$VPLIST= <PPPPPPPPPPPPPPP>
##$VTLIST= <TTTTTTTTTTTTTTT>
##$WBST= 1024
##$WBSW= 4
##$XGAIN= (0..3)
0 0 0 0 
##$XL= 0
##$YL= 0
##$YMAX_a= 597126
##$YMIN_a= -360006
##$ZGOPTNS= <>
##$ZL1= 120
##$ZL2= 120
##$ZL3= 120
##$ZL4= 120
##$ABSF1= 16.522
##$ABSF2= -4.171173
##$ABSG= 5
##$ABSL= 3
##$ALPHA= 0
##$AQORDER= 0
##$ASSFAC= 0
##$ASSFACI= 0
##$ASSFACX= 0
##$ASSWID= 0
##$AUNMP= <proc_1d>
##$AZFE= 0.1
##$AZFW= 0.1
##$BCFW= 0
##$BC_mod= 0
##$BYTORDP= 0
##$COROFFS= 0
##$CY= 12.5
##$DATMOD= 1
##$DC= 0
##$DFILT= <>
##$DTYPP= 0
##$F1P= 14.0000005364418
##$F2P= -0.99999901652339
##$FCOR= 0.5
##$FTSIZE= 32768
##$FT_mod= 6
##$GAMMA= 0
##$GB= 0
##$INTBC= 1
##$INTSCL= 1
##$ISEN= 128
##$LB= 0.3
##$LEV0= 0
##$LPBIN= 0
##$MAXI= 10000
##$MC2= 0
##$MEAN= 0
##$ME_mod= 0
##$MI= 0
##$NCOEF= 0
##$NC_proc= -4
##$NLEV= 6
##$NOISF1= 0
##$NOISF2= 0
##$NSP= 0
##$NTH_PI= 0
##$NZP= 0
##$OFFSET= 16.522
##$PC= 1
##$PHC0= 12.58159
##$PHC1= 4.51209
##$PH_mod= 1
##$PKNL= yes
##$PPARMOD= 0
##$PSCAL= 4
##$PSIGN= 0
##$REVERSE= no
##$SF= 250.13
##$SI= 32768
##$SIGF1= 0
##$SIGF2= 0
##$SINO= 400
##$SIOLD= 32768
##$SREGLST= <1H.CDCl3>
##$SSB= 0
##$STSI= 32768
##$STSR= 0
##$SW_p= 5175.98343685301
##$SYMM= 0
##$S_DEV= 0
##$TDeff= 65536
##$TDoff= 0
##$TI= <Analysis number 999999
Compound Code 99
Book Reference 9
Project Code 9>
##$TILT= no
##$TM1= 0
##$TM2= 0
##$TOPLEV= 0
##$USERP1= <user>
##$USERP2= <user>
##$USERP3= <user>
##$USERP4= <user>
##$USERP5= <user>
##$WDW= 1
##$XDIM= 32768
##$YMAX_p= 338493371
##$YMIN_p= -57744
$$ End of Bruker specific parameters
$$ ---------------------------------
##NTUPLES= NMR SPECTRUM
##VAR_NAME=  FREQUENCY,     SPECTRUM/REAL,   SPECTRUM/IMAG
##SYMBOL=    X,             R,               I
##VAR_TYPE=  INDEPENDENT,   DEPENDENT,       DEPENDENT
##VAR_FORM=  AFFN,          ASDF,            ASDF
##VAR_DIM=   32768,         32768,           32768
##UNITS=     HZ,            ARBITRARY UNITS, ARBITRARY UNITS
##FACTOR=    0.157963299565203, 1,           1
##FIRST=     4132.6476996994, 0,             0
##LAST=      -1043.33573715361, 0,           0
##MIN=       -1043.33573715361, -57744,      0
##MAX=       4132.6476996994, 338493371,     0
$$ Real data points
##PAGE= N=1
##DATA TABLE= (X++(R..R)), XYDATA
$$ [...]
20324 -12366 -8139 -6086 -15923 -18378 -17225 -7536 -1167 -6329 -11417 -17388 -17512 -21886 -24839 -15642 -18612
20309 -18612 -13632 -18455 -12099 -14517 -1254 5711 -6425 -13598 -8231 -4059 -22628 -18549 443
20296 443 8112 11227 15256 15666 18313 18395 16516 -25 -8745 -10239 -10623 1206 14928 20804 14392
20281 14392 5332 8464 5623 -4329 -14935 -14072 -19404 -32982 -20476 -20502 -17113 -20826 -19326 -18692 -37931
20266 -37931 -37533 -24446 -8693 -1838 -99 -11218 -15065 -12532 6772 5081 -5360 -13618 -17257
20253 -17257 -18634 -1073 4011 -7930 -18598 -14123 -7628 -14225 -29874 -30124 -23040 -10949 -25747
20240 -25747 -40613 -30808 -25738 -21919 -32082 -43584 -27243 -15316 -13118 -7292 -17764 -24908 -24393
20227 -24393 -19404 -12454 -11991 -18212 -27840 -35184 -22266 -5687 6904 4880 2014 4457 -5503 -12433
20213 -12433 -10142 -12736 -7262 -7046 -4300 -5158 4268 2137 -9125 -2801 1790 9173 13098 4360 -8584
20198 -8584 -16318 -18941 -14970 -9695 -15470 -8122 -3159 -4265 -4972 7357 11703 10759 10018 -2820 -16189
20183 -16189 -21841 -8579 289 -3484 -4782 -8780 -5851 -3300 -15373 -10232 -1515 3504 6810 1774
20169 1774 -1307 3701 9619 771 708 969 -5172 -14313 -21354 -22945 -7909 -10271 -7599 -8234 -18729
20154 -18729 -12735 -3637 -12755 -18147 -12121 -4119 -11215 -1023 -271 -6067 -10117 568 8442 9309
20140 9309 1651 -5604 -11304 -992 -3427 -13826 -8481 -7663 1375 7053 15043 6475 -1706 -2908
20126 -2908 -6233 4477 1886 -11106 -8048 -12982 -2450 -10047 -11843 -4801 -1013 -4810 -495 -3946
20112 -3946 -12142 -10823 -7969 -20629 -15085 -11601 -14716 -11482 -11552 -10516 -14638 9385 10090 -4961 -25685
20097 -25685 -36615 -35006 -26176 -25619 -29619 -29433 -29805 -29343 -22664 -21111 -23821 -21253 -32254 -30683 -15618
20082 -15618 -5375 -5845 -724 -9928 -2989 -769 -12046 -19866 -20379 -20829 -28647 -24147 -17945 -17123 -14815
20067 -14815 -7543 -5568 3337 9885 13932 17353 14880 10857 10232 2121 -10059 -25243 -33836 -27345
20053 -27345 -14677 -19184 -24647 -14112 8212 13255 6553 -1699 -14708 633 -11 -7277 -16895
20040 -16895 -11892 -9732 -4826 -7906 -21837 -24064 -26103 -23866 -31995 -22929 -16327 -30123 -30007 -18254
20026 -18254 -7760 -1906 -18777 -21314 -12819 -7651 190 -17089 -36617 -31388 -24155 -12669 -7193
20013 -7193 -2195 -12860 -16526 -11020 -8320 -4080 -6376 -10641 -23209 -34836 -28296 -15839 -19474 -17164
19999 -17164 -10637 -13732 -6537 -15076 -23414 -23043 -36270 -37048 -30363 -20133 -18362 -14167 -7667 -3266
19985 -3266 -4934 854 -784 -6987 -9844 -6908 -9488 -19865 -26359 -19072 -16601 -7526 2504 -375
19971 -375 -2026 -13194 -5305 -7137 -10966 -16923 -19866 -8908 -7171 -17501 -15210 -19673 -32649 -38976
19957 -38976 -36866 -32106 -22003 -23140 -29569 -39210 -31462 -19899 -14140 -14658 -27224 -21851 -23263 -18472
19943 -18472 -8228 -3579 -4236 -10088 -4765 -768 1136 -2598 -7383 -7954 -4458 -6949 -8312 -12627 -10416
19928 -10416 -13078 -4074 1651 4149 -6176 -22074 -19722 -13767 -372 -4930 -16215 -7640 -4080
19915 -4080 -10349 -14671 -15725 -22042 -14454 -3901 -11342 -23589 -26613 -26197 -25113 -24147 -7939 456
19901 456 -8276 -19181 -20796 -16131 -7833 -12094 -16390 -25452 -31342 -43009 -36971 -27816 -30452 -35545
19887 -35545 -33052 -37860 -22829 -8018 -10321 -21983 -14376 -23164 -25856 -31321 -16723 -5726 -12172
19874 -12172 -3000 152 -4287 -16237 -6223 237 -10441 5545 12099 -5789 -12130 -19191 -24130
19861 -24130 -8839 10156 7183 -2660 -3666 -11824 -20703 -23351 -19807 -13275 -13910 -15624 -15568 -17917 -28930
19846 -28930 -39021 -24308 -18404 -15007 -15665 -6964 -5500 -4437 1029 326 1355 -1869 -2506 2000 1185
19831 1185 11929 9736 7277 2758 5414 16558 23105 19205 1104 -11755 -24171 -34019 -12903
19818 -12903 10416 18944 5174 624 6232 14520 3081 -18626 -18810 -3253 -1081 -4980 3182
19805 3182 1817 3938 3708 -1749 -3931 -6620 -13058 -14247 -13339 -11604 -10270 -11172 -10253 -15621 -13539 -7071
19789 -7071 4871 1166 -17779 -12198 440 11132 -3733 -27892 -35497 -26939 -15060 -7334 -1035
19776 -1035 21940 19868 -6400 -13824 -6989 -344 6192 -2011 4240 -605 -9197 -21339 -21376 -6976
19762 -6976 -7402 -4534 1027 11594 4010 -2187 -6776 -3540 12629 24865 24640 15705 5017 15130
19748 15130 29895 26474 11666 11739 13339 8594 9526 15107 1125 2693 7839 3659 -397 6360
19734 6360 1955 -2184 -4448 636 10744 14674 18117 19725 19597 9316 1217 -10000 -10044 -3564 -5205
19719 -5205 -10775 -17071 -27342 -23756 -10946 -6673 -9357 -10201 -13668 -1630 3105 -489 2927 6548
19705 6548 5961 -2402 -14745 -21806 -23048 -13313 -7543 -19684 -19219 -14060 -16382 -26989 -23421 -23033 -18256
19690 -18256 -16203 -22882 -22278 -13624 -12139 -14561 -9491 -5592 -9820 -11262 -13888 -18799 -33597 -32192
19676 -32192 -12517 -1305 3314 3890 2762 -5056 8479 -1099 -15823 -18614 -13220 -7672 -9727 -12367
19662 -12367 -28042 -23446 -8848 -8075 -10063 -10630 4541 10333 10835 15200 22470 11813 -4896 -5112
19648 -5112 -12740 -10233 -14550 -11248 -16197 -16644 -15519 -324 13093 16694 24586 29901 25790 27371
19634 27371 29294 17889 13242 11563 7312 10070 -908 -1955 -7395 -7395 -4581 -2708 12705 12345 8154
19619 8154 11716 23642 26148 30284 34980 28312 17230 4728 16471 22651 28245 34981 36557 34284
19605 34284 34325 46380 62589 76465 93047 113823 126784 146760 177040 209753 236458 250038
19593 250038 267864 305281 347043 371351 378877 387291 409613 414327 405871 404266 388359 368453
19581 368453 353683 332687 306757 279147 251094 223903 198984 184197 174607 157719 130773 110358
19569 110358 109576 105787 94642 85702 62963 55962 65595 65955 60891 55357 48812 40359 44802 44009
19555 44009 39558 40841 44592 48280 55780 44661 43218 58443 69700 74118 60826 44848 35573
19542 35573 31687 40615 33718 28679 28307 34179 32089 20884 12018 929 12896 11606 -154 1094
19528 1094 6857 10150 10332 -705 -15025 -24532 -28968 -19816 -4843 1825 9024 2718 9729 13404
19514 13404 -151 2444 7686 2985 -13056 -25222 -15792 -7914 -19420 -11161 -12976 -13221 6056
19501 6056 3662 799 -7416 -4777 -6699 -5288 4272 16279 14876 9179 4374 4410 10261 11482 -3182
19486 -3182 4362 18433 20863 13793 15244 11477 13836 19730 772 -22394 -25591 -8438 7028
19473 7028 10461 6288 2137 -1148 -5104 -5339 -5946 -10965 -10176 -4196 4055 15399 16296 12742 1910
19458 1910 -6543 -1879 1637 2031 682 -15475 -33231 -36292 -25502 -10679 8152 9312 817 227
19444 227 2258 6996 9261 5907 7369 9119 12403 137 -5548 -15371 -22568 -22437 -31302 -30248 -26442
19429 -26442 -26700 -16990 -8766 -12373 -22721 -22073 -9712 -8892 -12138 -10879 -17694 -23074 -27301 -10345
19415 -10345 1200 -10757 -18531 -17827 -21292 -14336 -7697 -22774 -30981 -24957 -14427 -15219 -14546 -22934
19401 -22934 -24969 -31168 -26213 -11627 -2810 -8020 -20453 -25137 -19606 -16466 -3711 -4012 -9890 -31375
19387 -31375 -26545 -15364 -22188 -26880 -18601 -20370 -28459 -35351 -38842 -36444 -16108 -12788 -8301 -15264
19373 -15264 -14028 -16372 -19656 -26362 -21404 -19588 -9500 -7725 -2700 9419 9908 471 11751 14913
19359 14913 8726 289 -17071 -18085 -8281 -4873 -6314 -12890 -6371 -6133 -22314 -29709 -16347 -2257
19345 -2257 5625 9910 6260 6147 6836 -834 17140 23560 15013 15547 7328 -3476 -10629 -1944 9945
19330 9945 10044 -232 -9366 -15808 -4478 -104 -3533 -8574 -14833 -8729 -17596 -13268 -4967 2133 -95
19315 -95 -10578 -12398 -13515 -17714 -14090 -15954 -22535 -17122 -23141 -30854 -36102 -39305 -40155 -30789 -21424
19300 -21424 -14434 -28884 -30343 -17151 -9966 -7509 -10804 -5679 -5446 -4693 469 -2501 -5573 -7643
19286 -7643 5648 24694 27566 23382 20359 16240 2393 -9549 -20039 -24982 -33460 -31617 -23480
19273 -23480 -12927 -9737 -1414 14652 9607 3775 -5383 -9428 -12668 -19712 -13192 -6258 -13945 -14143
19259 -14143 -12725 -14351 -22581 -14382 -7400 4113 10270 -8000 -21190 -13637 -3370 2205 749
19246 749 -3267 -942 1649 439 -9149 -12029 -14541 -12417 4344 5545 -4771 1081 5079 -1681
19232 -1681 -15328 -28548 -38835 -43602 -29362 -24507 -25450 -26155 -19764 -27651 -33462 -34926 -26462 -15577
19218 -15577 -13376 -9900 -12156 -11317 -13225 -9984 -6160 -4507 -19189 -26079 -15230 -11053 -16763 -9334
19204 -9334 -7181 -11865 -8841 -10570 -3265 -793 -14730 -31977 -40461 -35598 -17585 -10101 -18646 -22570
19190 -22570 -10487 -4271 825 7137 -5789 -9401 -991 -8302 3563 1936 -6768 -4968 -10048 -10425
19176 -10425 1501 -2909 -8811 6059 8034 -3360 -10381 7747 15685 4240 -5217 -6650 717
19163 717 3650 -348 5721 7520 7443 4669 13995 16726 18084 20135 5734 -7426 -4222 4382 8212
19148 8212 10472 9435 2256 5752 20562 17964 17263 18978 14662 20249 25494 26679 21930 15007 15334
19133 15334 9473 -3134 -4614 1018 11946 15435 21201 16712 20910 14327 17631 25570 23496 21880
19119 21880 14185 13698 9606 -2452 -14628 -18548 -18647 -15538 -15033 -6838 866 6400 6834 -432 -3866
19104 -3866 -9762 -11626 -1674 12215 19080 13926 15650 19585 22531 22064 26099 34162 27535 37082 48401
19089 48401 60282 52851 46530 32999 35422 36852 28135 25159 17116 9632 17849 17985 5419 -3765
19075 -3765 -8724 -3274 -3568 -6091 6606 2516 -7060 -15970 -18816 -11787 -8017 -2135 4662 7986 4219
19060 4219 3824 -6566 -6808 -5151 -6939 2967 10684 19365 19957 11905 1183 -11469 -5554 -3627 -2787
19045 -2787 -12039 2252 19474 28205 17883 7050 8032 -5697 -7092 -2153 290 -3964 -829 10141
19031 10141 3173 7521 9109 6390 15340 14846 3551 -1422 -12320 -9879 -12854 -14884 -4061 3232
19017 3232 -3266 -2881 -10649 -3526 -1371 -7007 -13118 -8254 3203 9014 15192 18516 17253 24037 27158
19002 27158 20558 9082 5456 -2143 -5116 2077 -6786 -4802 -1120 -3817 8425 880 257 3427
18988 3427 -2023 -6066 3647 5226 22514 38181 32346 23803 17494 16516 19027 22208 30232 44487
18974 44487 62998 45983 21262 8702 10144 11587 400 10706 15896 11238 11474 18084 11977
18961 11977 4165 10924 14218 13384 11909 15854 24176 13212 -4042 4404 21408 20794 18312 21961
18947 21961 19835 9571 -449 -12361 -6175 1122 19644 21157 8283 5259 7650 15884 18925
18934 18925 7269 14701 12763 -545 -3084 11615 22377 17466 12341 14122 22891 26030 16475
18921 16475 1507 2601 6824 20422 28023 22314 13739 -654 -4571 1936 14401 23203 25954
18908 25954 30522 33081 32921 22987 9850 526 6989 20239 20201 20804 31701 25392 11155 11014 18578
18893 18578 14645 8710 1745 12885 16910 12054 10214 7678 -231 1892 16051 23619 27420 23589
18879 23589 10606 10557 26227 34650 27990 18438 15710 13376 14113 14845 12096 14629 17811 2926 1228
18864 1228 4690 19101 19075 16174 21043 28800 19218 17034 27805 45854 44704 39595 24964 7295
18850 7295 8202 17601 23466 18297 17428 12560 24441 20428 12800 2709 7689 7401 14016 25329 25173
18835 25173 33947 32085 32839 20027 15244 11438 25100 24265 21094 9279 -2073 -3103 4417 4127
18821 4127 12427 28917 27235 26790 26945 27188 25413 28119 32971 36257 20257 5197 7373 14172 22827
18806 22827 19460 1323 8495 16402 20560 11826 8798 19345 19126 10423 1801 -6210 4719 15578
18792 15578 14534 5994 11700 19382 27923 12099 14123 25130 32027 22914 18803 26742 24402 23213
18778 23213 30234 23694 25815 32797 50217 60979 68828 84727 92667 68714 73174 77804 56761
18765 56761 31907 19259 22762 25665 25501 22524 18316 15667 9252 3221 17902 13487 3833 12655
18751 12655 17494 13583 20199 16646 19842 25036 23673 17542 7984 2809 -6358 7924 18668 16242
18737 16242 19177 14563 12682 16099 27873 27482 17335 19380 30796 36455 32760 32504 39221 41616
18723 41616 37048 32921 50097 57086 53748 48097 45878 33849 23517 16103 17866 23290 17618 20399
18709 20399 28181 43207 46485 35012 30701 31890 40134 66524 99698 99037 97042 95057 90612 101941
18695 101941 90771 83783 91079 104150 106437 107807 105808 101397 112437 134860 169930 215413 284913
18682 284913 331608 366304 408813 452351 489458 512666 501449 453615 416093 371222 336674
18671 336674 310549 286714 253945 237530 226349 226746 222852 209080 198187 189511 165766 149523
18659 149523 140608 125139 110647 103318 102083 102236 98190 106619 113165 105187 89190 85662 93063 93235
18645 93235 80771 80132 69309 75816 90329 110976 129716 156783 176164 169905 186227 201864
18633 201864 226962 239180 254770 270879 301856 339120 383580 433433 466203 492655 521353
18622 521353 523384 522921 510536 474497 423430 373030 312417 239813 200540 177135 163893 161126
18610 161126 160465 139290 125077 126417 117854 121710 119551 125806 133288 121488 115349 100765 86110
18597 86110 71970 59745 61323 55807 59339 62147 68833 64308 57019 41792 26199 26782 22424 23088
18583 23088 29356 35175 45389 34875 25886 29468 27723 17982 21993 39638 46137 34546 36522
18570 36522 46520 42973 37623 24307 36297 34154 31051 23757 31682 46921 35342 26554 21556
18557 21556 20242 25192 22176 28829 33398 45720 51646 66691 61400 43597 50369 47610 49515 57521
18543 57521 46766 29954 39442 34572 22585 26872 32122 24296 11285 -1909 1091 4239 -4009
18530 -4009 -4060 1206 7077 10094 19647 23695 6888 4850 3790 -3834 -15245 -10436 11507 27816
18516 27816 27161 13601 10716 4599 11501 19804 15964 12365 19505 20774 29599 30956 37524 44089
18502 44089 42275 48994 50367 40092 33263 22226 14646 12518 12133 22629 18777 14300 25657 35550
18488 35550 25914 9994 6790 24798 22974 18506 24880 26165 8905 -5660 -2754 15822 24196
18475 24196 21329 20459 12839 25289 32459 32602 29343 13818 8187 12136 18194 20705 23562 21353
18461 21353 25531 45049 52350 47008 40942 39479 23736 19669 34804 33890 47174 71605 79927
18448 79927 86023 104479 115745 124586 130708 142363 144497 138217 148747 166913 183616 186912 190181
18435 190181 194956 208119 209507 227709 248444 255562 272024 284319 274612 285131 289357 290716 288141
18422 288141 280072 258869 238489 233237 229988 218221 208504 212399 209962 208156 192246 169736 144525
18409 144525 126647 109821 97252 93501 91599 89844 94643 112704 115233 119082 124860 126043 121058
18396 121058 123515 132402 133366 138854 155726 179063 180296 177351 176066 177268 180703 193177 215853
18383 215853 243219 254777 269889 272707 270462 287401 297801 287495 295349 293857 303905 301591
18371 301591 288889 289016 282636 269508 256743 243084 224859 218995 229299 223143 207983 199842 199212
18358 199212 192588 182287 158261 132862 111992 99609 103234 93742 86326 80094 82540 82697 77070
18345 77070 69615 57986 52223 45874 35541 26941 33177 39965 38770 53534 55882 41545 38013
18332 38013 33939 40109 49867 47747 38381 44424 49159 49322 49335 54964 51686 46065 42585 43741 30446
18317 30446 34013 32346 20563 20868 19393 32619 34910 25164 7680 -5666 2157 6704 8834 11046
18303 11046 18216 31971 20507 585 -795 -2333 -5076 2195 3005 -8927 -4555 7762 16572
18290 16572 17340 8745 5400 8341 15409 21123 32874 32870 29738 19568 3490 7571 21434 14937
18276 14937 16055 31733 37317 28202 19880 -3611 -2942 7289 8208 8490 1785 10804 9663 10236 12733
18261 12733 26798 26870 28986 38757 39465 38813 24639 18094 11672 6198 10216 24980 30483 25451 14130
18246 14130 6492 -2236 754 7694 16049 29150 39307 42091 40943 42410 45223 45873 48735 49042
18232 49042 42406 39718 31463 25306 34260 58828 61776 69792 67566 74267 89074 79309 64458 61340
18218 61340 74244 86733 87087 80771 88986 78138 62523 49690 55176 62944 68252 68642 69100 70900
18204 70900 72939 83828 99194 87376 89237 102248 119787 132546 130343 131250 132421 124903 113837
18191 113837 112424 110971 108128 109599 120967 125988 122502 125238 127834 139622 144923 151070 159092 164675
18177 164675 153931 138993 137660 142731 144709 147821 147241 143707 131637 140141 144174 143325 139411 135008
18163 135008 130551 132900 142270 161203 170028 176875 185941 208822 237488 251373 275712 300926 316121
18150 316121 347686 367848 363596 355510 343996 346637 346843 335597 334770 352815 365624 378566 408550
18137 408550 428709 439807 470523 511935 548796 592316 648921 698210 747310 788028 840520
18126 840520 859740 866656 897219 944614 1016540 1114379 1263683 1507943 1888739 2576976 3775611
18115 3775611 5644475 7774779 9257299 9939802 10245131 10643858 11783084 12029670 8794053
18106 8794053 5577784 3842544 2943739 2431141 2105073 1899948 1755135 1629942 1534344
18097 1534344 1465711 1392755 1339632 1302838 1282395 1257878 1220225 1173446 1127177 1096308 1071299
18086 1071299 1026678 1012645 995726 972725 984017 1019097 1042311 1072582 1123149 1164727 1180307
18075 1180307 1182345 1172278 1154950 1127776 1079360 1019612 944176 880425 853198 812729 791427
18064 791427 780342 767910 748140 728441 700540 694337 677335 648566 620463 609325 582330 549424
18052 549424 508177 484425 477545 461737 450608 450805 443513 433306 446584 452402 447479 440462 431002
18039 431002 412685 404950 414140 423173 418055 420860 419923 405679 412086 423461 424526 431197 444207
18026 444207 454009 459089 485280 504668 502456 494128 492038 490088 487959 484616 484644 472294 466339 449472
18012 449472 450469 451079 456827 455877 461614 483165 498434 513632 521522 548512 569812 576282 586160 605563
17998 605563 621716 649848 673852 693959 722562 728592 753549 778883 813174 845330 893289 937291
17986 937291 990210 1050444 1126198 1213149 1300327 1410949 1542093 1676426 1829470 1994507
17976 1994507 2170900 2363047 2594634 2851275 3141557 3501124 3942912 4448420 5028276
17967 5028276 5660731 6352624 7045584 7676421 8176949 8562935 8888783 9115034 9157020 9170648
17957 9170648 9374166 9826215 10602253 11934336 14114349 17397136 21827904 27256728 33676050
17948 33676050 41137657 49171443 56894897 63321900 67658826 70296997 71936280 71024559
17940 71024559 66164543 60034815 54855191 49882719 44538599 40031151 37139789 35427780
17932 35427780 34244910 33238376 32201830 31087687 29897353 28273659 26018099 23590745
17924 23590745 21422156 19468039 17687339 16219102 15122207 14341436 13783934 13400984
17916 13400984 13143096 12984974 12933766 13032236 13359576 13966454 14885098 16144754 17751297
17907 17751297 19689282 21921714 24321921 26678817 28760643 30488214 32006894 33532448
17899 33532448 34944055 36274194 38282677 41658671 46364960 52023818 58462827 65547261
17891 65547261 72827038 79407312 83929468 85141743 83787827 81518058 77069857 68452269
17883 68452269 58435133 50015770 42612167 35524733 29664447 25582534 22926613 21223882
17875 21223882 20134938 19487021 19152161 18983985 18829084 18578665 18168767 17652585 17054293
17866 17054293 16204500 15083000 13955130 12935807 11962016 11036394 10232212 9566551 9010293
17857 9010293 8527452 8099689 7723886 7382532 7062060 6747910 6470709 6219511 5985292
17848 5985292 5751176 5557143 5392143 5222970 5049480 4886756 4743447 4614645 4483079
17839 4483079 4363183 4230490 4097877 3975496 3861494 3746608 3635884 3516347 3407560
17830 3407560 3302549 3206160 3105446 3014671 2928480 2859475 2796845 2723633 2647647 2567689 2505138
17819 2505138 2452788 2398997 2335115 2263563 2203475 2150405 2087366 2016050 1948348 1886975 1823222
17808 1823222 1766088 1705644 1658639 1603811 1562410 1528613 1491590 1445482 1390729 1349213 1329647
17797 1329647 1302021 1269324 1249321 1243691 1236497 1222435 1204245 1176826 1153166 1125944 1109657 1087994
17785 1087994 1052396 1025332 1010727 1010868 998822 962251 953725 938698 913188 892598 861096 828645
17773 828645 802411 782499 751170 729134 714228 696792 669262 655148 643877 631039 610747
17762 610747 596590 566898 550732 533974 512382 502724 501862 502646 498165 497061 512480 534429 560514
17749 560514 572312 577959 579711 570914 552886 527085 506832 484096 458803 448139 445090 438629
17737 438629 430950 434209 426191 426462 418042 401200 398301 379785 354652 348109 345430 350462 329037
17724 329037 324552 328546 330006 327084 331914 337031 336041 327065 323826 316767 310456 310184 326161 343586
17710 343586 356427 368828 376012 378254 373810 352688 354126 361181 358017 344903 356313 388227 421856
17697 421856 467252 520263 566931 590355 618107 636496 643072 624040 589180 533944 471447 418232
17685 418232 378051 355760 349193 355108 359591 360413 370323 385953 386630 377057 386081 392283 390347 402656
17671 402656 417855 458697 494150 523674 551855 566333 571448 571707 577585 577518 568379 559056 563739
17658 563739 569036 597237 645898 717670 803506 904455 993560 1079929 1144703 1186316 1198402
17647 1198402 1182551 1140788 1080987 1028897 986898 966223 950158 937562 931594 912405 876089
17636 876089 831076 786933 731989 654986 585252 519208 471973 432834 419360 403652 401950 415649
17624 415649 419135 422686 417762 412851 396276 374663 358578 360478 371389 389226 413343 444564
17612 444564 471314 496811 518302 548365 580000 587587 601464 609180 624864 642720 663027 694054
17600 694054 735453 778363 809893 845245 868533 866475 864228 839912 776060 708066 655230 603029
17588 603029 550220 519100 501783 473655 440892 413040 390347 374282 356423 340661 312925
17577 312925 299791 300919 298137 286929 284668 285278 293073 293046 289589 291458 288843 286221 284310 285463
17563 285463 274270 250640 232982 217898 216900 216537 220074 221477 199005 190668 188775 175697 165061
17550 165061 166946 167045 171347 174800 184231 171824 164017 166811 164696 165285 173040 180407 169855 155541
17536 155541 157548 166113 167591 163253 165995 168085 167908 147756 144314 136921 140957 129192 123396 116609
17522 116609 112811 113129 117173 108316 88950 78673 82206 91423 95000 98835 104119 98229 95669 106632
17508 106632 99989 84423 86410 81577 76259 80800 84419 94565 91684 91470 105163 108448 92884
17495 92884 76670 83674 90276 94171 95160 106684 107785 88577 87068 94885 87018 77860 77584 77125
17481 77125 79076 92687 107383 124954 126923 114774 96793 90629 91585 94198 96982 98919 106372
17468 106372 104450 100958 115797 138770 168295 190549 207150 224342 229336 217752 220616 232172
17456 232172 259960 271143 265906 270523 274752 287167 312351 324298 332171 333993 337949 342650 329128
17443 329128 302833 284682 287080 275876 247365 228789 215695 212915 215351 201386 207357 222369
17431 222369 219869 188894 169306 175940 185482 183508 182304 188564 181997 190276 200259 210658 225953
17418 225953 235940 248596 267807 285999 300081 307248 324018 331794 338003 344320 362657 376139
17406 376139 377786 373832 391376 404914 406420 404168 394732 369215 349772 335038 326819 329172 325308
17393 325308 341847 357843 363528 360748 353911 348025 353175 339222 322822 318613 312340 288746 266141
17380 266141 241561 226834 216172 202838 185948 165325 162766 167920 174791 193106 196083 187046
17368 187046 194733 196431 190842 187889 200085 202642 199700 198875 191583 189543 190378 189787 172237 157257
17354 157257 139544 133455 141500 140202 127537 123031 122739 114636 108290 111715 110520 101304 103357 108677
17340 108677 101992 83262 78404 71737 71020 76127 74057 80943 90743 95955 96864 82996 80957 82005
17326 82005 96305 91071 85996 86470 75044 91357 101961 112181 117165 123635 140771 147159 144208
17313 144208 150881 159385 163746 160928 169785 168263 175360 189183 195536 185550 177746 164810 168235 192810
17299 192810 199664 189407 180314 182241 176124 180565 177857 184103 186910 181000 186868 181214 175643 180436
17285 180436 182277 183378 183129 183403 184272 200776 202395 198855 194465 188611 191019 197189 189893 181878 181102
17270 181102 193715 203165 211696 214094 209807 220183 233250 248520 251390 257455 280905 280595 279796
17257 279796 286298 297470 301868 291000 287114 294696 297725 305088 309119 304040 303385 297509 303666 320973
17243 320973 335162 360174 388899 426019 442253 461960 494568 522083 539681 552073 563748
17232 563748 568358 564638 552149 539081 528412 523028 524437 516484 514110 535300 548323 572499 582097
17219 582097 592555 607582 624934 646546 656919 671804 687258 709078 738490 781385 841401
17208 841401 892045 944167 992727 1050056 1108634 1166615 1233152 1324540 1420417 1520396 1655866
17197 1655866 1813799 1995874 2226950 2516009 2871228 3346052 3956527 4715092 5620680
17188 5620680 6608021 7628206 8615656 9517805 10263627 10833685 11187214 11302031 11225154
17179 11225154 11114874 11170282 11542411 12411052 13952981 16424394 20146036 25455787 32533796
17170 32533796 41232358 50926849 60731758 69781386 77445313 83196251 86348322 86135284
17162 86135284 82209043 75208718 66665294 58226811 50987923 45391494 41471062 39009243
17154 39009243 37622288 36874558 36359233 35781178 34891716 33479673 31436967 28841718 25986726
17145 25986726 23225620 20832874 18880135 17347518 16163289 15246538 14535726 13980748
17137 13980748 13580127 13338799 13225728 13272027 13509856 13982647 14764697 15914517 17488293
17128 17488293 19445744 21696211 24026491 26268709 28291019 30022915 31449168 32534879
17120 32534879 33337411 34160048 35485665 37845552 41625813 46935548 53512908 60687959
17112 60687959 67534197 73091244 76747891 78186730 77289045 73833169 67688917 59360688
17104 59360688 50081843 41280422 33972974 28459396 24526889 21801065 19955341 18743378
17096 18743378 17993478 17587048 17400617 17332328 17300247 17220976 17017722 16621118 15988335 15110483
17086 15110483 14048163 12891498 11779751 10780088 9922802 9216858 8634202 8144074 7712266
17077 7712266 7325344 7002191 6708284 6429031 6176190 5946655 5727851 5530030 5338654
17068 5338654 5155185 4976428 4808589 4657276 4505243 4375637 4247126 4114659 3982823
17059 3982823 3854103 3733655 3630601 3515605 3413380 3313425 3223225 3152683 3072640 2987757
17049 2987757 2898237 2821043 2738157 2653865 2573685 2493964 2432119 2374456 2324906 2266371 2206113
17038 2206113 2156331 2119291 2087012 2019387 1951247 1870069 1801157 1750905 1694351 1650747 1607767
17027 1607767 1568713 1525050 1493031 1474907 1446561 1415348 1384492 1350554 1319287 1276542 1226607
17016 1226607 1183900 1159520 1134234 1120244 1104672 1092724 1065185 1049543 1029692 1016735 999826
17005 999826 984958 981891 969166 952657 943618 931395 900484 880827 859380 840131 830085 817129
16993 817129 799350 769864 743810 717991 696317 682091 668552 634283 609886 611790 617360 611134
16981 611134 604312 579457 556061 539575 515246 493169 474939 450957 445467 434972 409789 406702
16969 406702 395417 385163 388649 380242 371419 365704 366462 363577 366513 349834 334898 336909 351487
16956 351487 351025 354030 340764 316773 301268 300816 308421 307441 289708 280460 274988 275501 268979 268171
16942 268171 260577 266414 257114 262015 269010 268032 267153 252856 252071 259137 255693 248580 227476 217544
16928 217544 219811 210143 210869 224111 232502 227245 201580 185537 185702 193499 203761 191417 177973
16915 177973 201258 218620 210075 204860 204885 204165 196689 192857 191864 196559 203967 201217 187205 166421
16901 166421 159546 165038 170213 172555 158882 157601 140488 152250 153125 145234 149958 145452 137736 152504
16887 152504 162351 158209 151590 146473 147161 150855 148126 146987 153597 157002 150423 145956 144088 134877
16873 134877 128608 115965 103315 98685 95582 98189 105516 115122 109746 104897 112767 124388 124842 124702
16859 124702 137536 148535 152131 158799 169666 168127 161800 166838 149412 134092 122045 125149 138542
16846 138542 145253 136756 127225 121739 127922 130857 135204 128510 109310 104658 107741 101382 101420 103807
16832 103807 90311 83585 71785 71493 78030 65417 55641 58267 55609 52484 53416 52491 56396 52246
16818 52246 52383 59273 60190 57113 50788 50936 60873 76244 78242 79663 92601 99535 92327 85278 84187
16803 84187 95881 109036 109069 106181 96317 92333 89058 75580 72070 79643 81342 71459 58878 60837
16789 60837 65977 76875 77244 64138 60963 65272 78360 83414 86613 69049 46457 41765 44316
16776 44316 38600 31447 42692 48244 45090 36513 37749 47092 41230 40879 36546 31030 34764 25787
16762 25787 26406 38354 45442 53914 58509 55510 38061 29209 34769 34995 32946 40500 35194 23419
16748 23419 28296 38427 38780 28293 25651 29205 26029 6268 8090 11548 15691 27504 28410 26557
16734 26557 36916 58462 52230 48069 40686 19495 10026 8891 13320 20508 33560 39346 34593
16721 34593 21292 25671 39182 30157 26441 10145 8480 14686 20552 25505 24678 17492 17023 23050
16707 23050 25037 21226 24366 31801 25041 20733 16399 15292 22811 32212 45610 45051 45647 42952 44861
16692 44861 54202 71701 80884 73149 60250 56039 58639 77687 101196 118263 141140 173419 200745
16679 200745 230998 243067 252926 272148 275248 255633 243738 252853 252887 260598 263616 261816 266435
16666 266435 266068 280576 290480 294179 306334 318108 306874 286924 269112 252101 229260 203250
16654 203250 175988 160604 143671 135782 127798 123884 118535 124729 117151 110593 98678 104044 124198
16641 124198 125913 120237 103490 106049 107960 104583 100584 111974 133802 150298 160993 187769 218283
16628 218283 227835 231423 258684 278862 276394 287182 303476 309311 291614 276372 266601 243853
16616 243853 212266 184759 170133 150657 150881 156976 169194 181482 187252 190679 220049 244047
16604 244047 266652 270864 274464 263226 241293 237922 227550 205075 181588 142056 108991 99724
16592 99724 95448 92890 88089 84598 87672 78011 81574 76056 72213 60545 54978 54393 49304 44012
16578 44012 44420 52045 52339 51452 61416 66473 58126 57327 49144 35209 40382 37522 25076 23885 26530
16563 26530 23348 21413 25461 26439 21277 16024 5186 -2051 -5588 1386 -2376 8235 13440 25472
16549 25472 42030 39350 35752 31058 31210 22455 9114 9351 17435 17779 9718 1297 -50 5427 9594
16534 9594 3410 9603 14865 32945 38962 22255 10548 16528 22588 23497 27719 10561 10990 15363
16520 15363 15485 16895 23320 20394 11330 2101 -5315 12173 23987 21865 20376 10875 2689 -12248
16506 -12248 -4424 -3085 1363 11037 15710 23251 19718 13440 11104 1473 962 -1586 4323 1790 -1423
16491 -1423 8739 6039 3949 8101 17166 16404 14831 13852 11698 10276 17744 20089 18628 14804 2276
16476 2276 6161 21325 18325 8501 13658 19005 24728 7898 5353 24542 25138 15650 8159 24367
16462 24367 30462 18035 8484 9378 8763 -3274 -11167 -12375 -10022 -4709 -13265 -13077 -11004 -6718 1503
16447 1503 1916 -1402 -3626 6281 19621 20399 11142 -8112 -6929 -1461 -12410 -14175 3274 12211
16433 12211 13238 9818 5969 3765 18131 19034 13029 -1843 -14544 -15702 -8439 -5771 11544 31313
16419 31313 18693 10755 19964 10770 15686 17620 21654 18363 19743 16831 13663 5925 3410 5044
16405 5044 4558 1803 3959 -1032 -771 -1313 -6106 -14446 -11167 5015 24862 29806 32497 34198 32163
16390 32163 24817 18493 3046 9755 17103 10774 328 1216 7083 -3809 -16354 -16692 -14563 -8246
16376 -8246 -8167 -8931 -5678 -9532 -12557 -11878 -12885 -12568 4546 10667 12764 18211 10717 -1848 -1199 11270
16360 11270 5424 -7991 -4298 1725 5391 -1573 -336 11481 4900 -6327 -20883 -29689 -8841
16347 -8841 2282 1716 -992 -5884 9766 13232 13262 9253 13638 17113 15575 11540 -3748 -14230
16333 -14230 -2954 -2754 -6617 8269 11512 17135 15327 18530 19368 11578 11518 2618 2470 6765 8375
16318 8375 11502 8631 -8989 -14853 -6946 -1944 -3323 7598 10170 -5026 -18461 -18796 -20690 -20288
16304 -20288 -16849 -8024 -16011 5776 6698 4860 8048 12106 -2054 -12497 -16630 -13425 562 7278
16290 7278 5972 -11450 -5764 5392 1928 -12891 -18042 -16080 -14005 -23155 -25673 -9477 -3993 -4041
16276 -4041 -5691 1641 -229 4841 -623 3728 11805 11190 30560 24317 10146 12792 12813 -3108 -11396
16261 -11396 -585 5240 -471 -23406 -24240 -20918 -10114 -9489 -18285 -16579 -22096 -13478 5533 6593
16247 6593 -5528 -18728 -17531 -5810 -6454 -7261 -16837 -7332 -4268 -8028 -6399 -8216 -13550 -5998
16233 -5998 -3284 -10337 -11468 -20893 -16704 -5471 -16023 -29940 -27664 -12670 -5343 2980 5948 7535
16219 7535 9652 -3003 -18922 -26991 -32014 -16847 -6209 -17863 -8983 -5469 -24188 -20011 -19038
16206 -19038 -20900 -7225 -10080 -11148 -7926 -7617 -12880 -16246 -8055 -7945 -19473 -12183 -11605 -13419 2199
16191 2199 3342 -10074 -7896 -4217 3187 453 10668 12938 7960 6109 14930 11526 -2586 -11858
16177 -11858 -5791 593 7819 -1955 -10191 -6878 -8262 -18983 -30368 -34248 -24937 -13974 -11932 1803
16163 1803 7905 2872 3722 5878 3607 -4977 -9872 -6687 3227 7308 3861 1850 -9126 -18239 -10969
16148 -10969 -431 10170 9517 7844 6769 2072 9674 -2900 -6917 -3876 -634 -4836 -3001 -1080
16134 -1080 -2978 -4806 -19325 -18964 -21052 -24642 -13205 -12556 -24685 -35354 -39096 -27316 -18576 -14261
16120 -14261 257 5190 -5063 -15433 -11978 -8352 -4197 -6310 -2779 -7740 -14449 -22921 -21414 -3730
16106 -3730 240 -3416 1275 20038 19404 13009 1298 -9915 -11170 -10608 -7100 -11173 -18956 -8964
16092 -8964 -4828 287 5211 -295 3740 6267 3559 8332 11349 6071 3501 -5709 -12735 -6354 1973
16077 1973 -195 -7648 -4072 -8700 -14534 -2241 8079 8990 720 822 12184 10050 10937 8562 4614
16062 4614 3710 4277 -6492 -13266 -15324 -23594 -24162 -19470 -10048 -16481 -28472 -31018 -13515 364
16048 364 -101 4625 10097 4299 7826 13848 6036 -4898 -5653 -6834 3141 8175 -1468 -3955 -10115
16033 -10115 -2200 3350 1969 -4349 -9051 -10835 -14504 -16639 -10688 4777 12274 18523 15437 12957
16019 12957 -6461 -15976 -6700 -3139 -9978 -15620 -14371 -16567 -14660 -18417 -7300 5646 7109 -11193
16005 -11193 -18308 -28032 -31423 -28696 -24361 -29617 -14720 -9205 -9778 -12409 -9938 3515 4468 -1006
15991 -1006 7926 9462 18292 12355 3107 -3419 -3701 1126 8383 14382 5379 -3277 6511 5444 -2735
15976 -2735 -4511 -12695 -2067 3122 -11336 -26011 -30923 -25613 -11174 -3648 -8706 -21123 -13935
15963 -13935 -3897 -461 -9036 -19766 -25494 -16883 -10753 -242 3189 -4379 -6947 -9106 -16362 -10688
15949 -10688 -14688 -21871 -10649 -1751 351 -12621 -27074 -31653 -24084 -10201 -3371 -3600 -9156 -3243
15935 -3243 -1602 -6877 -3724 -11837 -15455 -11012 -18379 -26269 -14549 -6890 -7462 -12612 -10513 -10514 -15566
15920 -15566 -6019 -3014 -11768 -18408 -22712 -27887 -35875 -25584 -21518 -15767 -17901 -13056 -10359 -426
15906 -426 3633 7171 10412 -21807 -31376 -30496 -33117 -21523 -16004 -18685 -32112 -18330 -13984 -20549
15892 -20549 -25606 -22379 -24536 -27548 -12727 -12594 -19411 -26122 -30947 -22873 -12796 -7541 -13468 -11046
15878 -11046 -12831 -19030 -29787 -34130 -21877 -10455 -9165 -10555 -1703 -11125 -26428 -24024 -23052 -21116
15864 -21116 -17118 -8015 -8321 -18543 -28411 -12917 -4860 -13561 -22530 -29734 -35189 -31738 -24613 -27412
15850 -27412 -16942 -10636 -430 -10467 -23418 -22602 -13060 -10486 -6192 -6550 8434 -3165 -18749
15837 -18749 -23261 -20142 -6305 -7924 -10685 -8839 -10637 -8571 -4304 -6540 -27863 -43483 -38422 -23372
15823 -23372 -20451 -12325 -8155 -3656 -2997 1624 -1811 -11144 -17917 -6359 -3866 -11920 -18529 -17522
15809 -17522 -20580 -19408 -13472 -3195 -10655 -16233 -16297 -28847 -38851 -35694 -37929 -29315 -18091 -16685
15795 -16685 -18666 -12093 -17243 -25833 -33509 -31465 -23286 -22361 -27214 -23478 -11119 -8607 -14474 -16973
15781 -16973 -11180 292 12063 20474 17947 -4400 -18269 -9626 4274 9693 7171 6960 -1241
15768 -1241 -5011 -6129 4918 16381 7390 -6687 4343 10721 -2929 -8383 -17684 -32041 -36983
15755 -36983 -23354 -3951 -9214 -9124 -10073 -23748 -26775 -19702 -25564 -27426 -16660 -19151 -25392 -17845
15741 -17845 -9668 -16063 -32943 -42866 -46660 -28327 -23152 -26830 -7652 -130 -774 -802 3908 -3586
15727 -3586 -17349 -20564 -20431 -27268 -31957 -24832 -11062 6799 22845 26179 28516 15719 23232 20673
15713 20673 22431 25538 31097 24868 15564 13383 9004 5637 7981 7718 1376 -18599 -22836 -23372 -29920
15698 -29920 -34949 -24684 -7882 1942 757 -9101 -12449 -20031 -31733 -28601 -27063 -27447 -29172 -35398
15684 -35398 -37804 -37968 -33609 -45247 -44120 -38980 -23051 -16080 -15811 -23120 -24288 -24785 -11807 -10970 -3960
15669 -3960 -7419 -13120 -17395 -29017 -26948 -16904 -10206 -13262 -3594 2709 9920 8920 5663 -10945
15655 -10945 -21580 -27800 -34398 -26734 1901 6491 -660 -13127 -12835 -4369 7765 10900 1176 -17315
15641 -17315 -27346 -17721 -14216 -22832 -28021 -39632 -36421 -29354 -26229 -17389 -16353 -21127 -30426 -33609
15627 -33609 -18577 -16590 -12775 -1993 617 -2852 -11296 -20488 -16627 -9384 -8596 -15254 -9271 -16215
15613 -16215 -7816 8756 16980 17651 13107 -726 -4923 -9165 -10707 -16763 -18813 -18455 -9742 -11682
15599 -11682 -20170 -28017 -27994 -27050 -25535 -15514 -4336 4140 -3185 -11048 -6532 -3143 2893 -5403 -3953
15584 -3953 3221 410 -5028 -16541 -22980 -21044 -21753 -24088 -26593 -21994 -5911 3697 -1498 -5600
15570 -5600 -8143 -21130 -16023 162 2461 3334 5304 2095 5015 -1165 -9697 -13022 -14939 -15779 4152
15555 4152 11144 -8192 -16878 -10766 -7905 -12115 -17645 -9350 -11218 -7260 -11945 -25852 -36846 -29177
15541 -29177 -27751 -40550 -32214 -18145 -6172 -1653 359 -7137 -6919 3007 6545 297 -12927 -26570
15527 -26570 -12146 -2383 -11847 -16897 -19053 -18044 -17253 -12574 -2190 -5373 -3885 -12027 -13492 -17790
15513 -17790 -17783 -15487 -13898 -5322 1252 6992 -411 -4439 270 -2319 -16443 -29696 -20419 -30876
15499 -30876 -44100 -44856 -36328 -35263 -31991 -27667 -13786 -12962 -13872 -15283 -3514 -10186 -7012 -3387
15485 -3387 -8811 -22618 -22311 -24835 -39720 -48242 -46430 -53862 -52377 -34629 -29996 -36173 -21086 -18187
15471 -18187 -24104 -18184 -18545 -17155 -4072 -6876 -15773 -11437 -11841 -16847 -27064 -32533 -24817 -14208
15457 -14208 -23991 -18051 -14135 -18670 -23408 -19846 -7742 -4265 -5098 131 -2795 -10917 -11177 -8394 -13473
15442 -13473 -12326 -18270 -16328 -12481 -10247 3058 -3189 -18765 -22745 -17806 -18188 -21472 -24207 -27335
15428 -27335 -23477 -14173 -16025 -9620 -19620 -26693 -9576 -1124 -8594 -13564 -3208 -4331 -5084 -13895
15414 -13895 -16212 -17472 -22079 -14313 -11193 -12062 -785 8684 18852 16092 2902 -3880 -20372 -27625
15400 -27625 -25060 -14400 -25794 -55811 -57744 -47147 -27061 -15265 -17410 -3515 1338 -9399
15388 -9399 -20187 -20300 -20362 -17221 -19647 -23188 -18286 -8909 -5420 -14878 -15069 3265 8262 7478 141
15373 141 -14656 -18218 -29157 -30200 -22767 -26508 -25431 -27033 -28353 -19792 -18781 -28051 -16252 -13311
15359 -13311 -16276 -23755 -32598 -28664 -18442 -1750 145 -15976 -21931 -23196 -22913 -28615 -31681 -40555
15345 -40555 -40991 -25637 -16397 -20197 -17280 -4713 -15865 -14921 -14435 -19851 -25142 -25282 -14086 -6744
15331 -6744 -14677 -18718 -6272 -4587 -11177 -10547 -12688 -15142 -7285 -9691 -17099 -13642 -25257 -35240
15317 -35240 -50265 -53172 -49018 -47402 -53599 -47250 -36536 -28353 -16702 -17381 -15965 -23136 -20092 -16471
15303 -16471 -26805 -30094 -24655 -20356 -8082 -10959 -25119 -27352 -30208 -27433 -9380 -12934 -28083
15290 -28083 -33971 -20396 -19064 -13066 -21186 -27136 -28881 -15174 -18399 -18434 -15877 -4827 -10248 -14657
15276 -14657 -7812 -2103 -13159 -10778 -5713 -11711 -1760 -4298 -7736 -22379 -23997 -17276 -12487 -2644
15262 -2644 -15381 -17894 -2320 1290 -19556 -24741 -14914 -8989 -8284 -17662 -29700 -39581 -24850 -10287
15248 -10287 -19293 -19101 -16197 -12700 -13117 -5661 -4900 -7969 -11034 -23334 -26809 -27066 -29977 -42535 -31192
15233 -31192 -21499 -24557 -27108 -30525 -31292 -31667 -27784 -23479 -7815 -6172 -20819 -13132 -11953 -8127
15219 -8127 -8731 -23495 -20804 -12335 -25448 -48031 -45286 -25697 -19174 -24913 -29381 -25972 -22679 -23676
15205 -23676 -32853 -22582 -24896 -30852 -26471 -18117 2393 12239 8108 -6581 -19398 -24393 -17048
15192 -17048 -18837 -20158 -23064 -19449 -12787 -3535 1529 9008 -1673 -8662 -14348 -14656 -15189 -10191 -9163
15177 -9163 -12672 -17948 -28546 -16721 -19089 -29821 -33455 -18805 -13044 -12769 -24028 -29147 -22171 -14013
15163 -14013 -10515 -2988 -4808 -21581 -30051 -29736 -23870 -17282 -28301 -34641 -40798 -36579 -22016 -13251
15149 -13251 -19469 -26183 -24020 -27255 -25366 -22723 -28133 -33325 -31768 -33484 -38678 -27425 -20351 -23552
15135 -23552 -31545 -34230 -27622 -29926 -34821 -30927 -8169 -7148 -20296 -31398 -20198 -7699 -7097
15122 -7097 -19573 -17478 -22917 -34269 -38307 -33322 -23236 -7051 2719 -4524 -21128 -29802 -16694
15109 -16694 1439 -3283 -16311 -23471 -23516 -27327 -35178 -34729 -26225 -8961 -3538 -922 255 14419
15095 14419 5447 -5033 -11969 -19639 -13969 -6181 1137 -8250 -8914 -8197 -13220 -21857 -31664 -14299
15081 -14299 -10435 -27343 -37985 -38062 -22826 -17954 -13122 -14442 -25484 -31073 -34581 -32531 -24000 -19837
15067 -19837 -20826 -10064 -6383 -15049 -10509 -18587 -23055 -22196 -35759 -43935 -19783 -3708 -6041 -17076
15053 -17076 -13960 6366 10373 -7416 -5471 -6430 -8809 -10776 -32436 -37265 -30851 -35801 -39684 -39384
15039 -39384 -30128 -16685 -11714 -8965 -12074 -9839 -24012 -32529 -36309 -33639 -30535 -16814 -5748
15026 -5748 -20621 -39153 -30707 -20101 -12783 -21337 -25236 -29758 -26903 -22655 -14832 -22339 -23113 -34120
15012 -34120 -31123 -30656 -38883 -21613 -12294 -16156 -10963 -14684 -13804 -15906 -17298 -29285 -21159 -25971
14998 -25971 -32019 -31549 -42165 -31051 -7990 11177 8563 1237 -2369 -13824 -24161 -20629 -2669
14985 -2669 -4934 -10167 -18503 -17813 -13028 -21508 -25930 -16369 -10400 -4379 -6932 -18558 -34634 -41448
14971 -41448 -40184 -29470 -28159 -35651 -40088 -36920 -33579 -31384 -34313 -35751 -29988 -39617 -31107 -18427
14957 -18427 -23116 -43192 -48232 -39501 -25980 -32426 -45685 -37937 -30489 -25960 -30478 -44056 -43216 -42834
14943 -42834 -39005 -36883 -28277 -23897 -21427 -19123 -9074 1420 8210 8459 16259 23904 22744 8494
14929 8494 -3616 -8366 -11180 -11730 -21025 -30339 -35297 -37951 -35338 -37668 -38751 -29358 -31440 -28163 -26159
14914 -26159 -30358 -21313 -10339 -1308 1674 4713 -9729 -6535 -5242 -18858 -30206 -36203 -30936
14901 -30936 -19322 -31460 -36645 -35508 -28710 -19685 -12920 -14818 -17248 -17650 -27229 -38538 -36304 -36161
14887 -36161 -52380 -47949 -45662 -45231 -45014 -37789 -26597 -17844 -10491 -5410 -13774 -19599 -19221 -15721 -21874
14872 -21874 -14849 -4669 -2756 -7419 -7213 -14153 -13832 -11299 -12074 -24213 -21839 -18664 -18151 -911 -5588
14857 -5588 -5114 -7071 -12048 -14534 -14130 2175 9473 -11610 -21804 -20364 -23998 -21411 -17720 -19555
14843 -19555 -31254 -28789 -17487 -8726 -12308 -18265 -24592 -22863 -22568 -19801 -8281 -7175 -9717 -13432
14829 -13432 -22626 -34402 -28226 -33997 -46213 -41658 -32383 -19962 -18529 -27646 -34112 -43808 -34258 -22057
14815 -22057 -15983 -11244 -6219 5071 3891 3712 -3211 -5519 5813 1951 -6706 -6543 -10878 -18909
14801 -18909 -20946 -9350 -9775 -9728 -4490 3132 -384 1633 -4026 -10228 -7005 -11197 -9393 -10228 -24272
14786 -24272 -16566 -9059 -9291 -3569 -6089 -6257 -14003 -15842 -17281 -29807 -33667 -17937 -19725 -23121
14772 -23121 -22055 -27371 -38389 -46119 -36727 -18014 -22437 -30749 -31862 -26033 -23934 -23027 -21176 -18064
14758 -18064 -24794 -29073 -34914 -37777 -23651 -20704 -6313 -18827 -26035 -17877 -14697 -22457 -26980 -27287
14744 -27287 -29998 -30007 -29906 -26011 -18631 -11392 2581 -272 -11974 -28142 -40482 -47173 -33198 -26346
14730 -26346 -19619 -11981 351 7953 7668 3559 -15956 -36449 -31800 -18983 -17373 -18656 -22285 -18627
14716 -18627 -21005 -19749 -16986 -15349 -22021 -29393 -44747 -31920 -26468 -31780 -28703 -3825 9284
14703 9284 -1269 -3475 -22476 -11654 -1564 -658 -205 -13453 -17848 760 7813 13318 20437 34007
14689 34007 36331 21979 7697 1241 -9185 -17570 -33818 -34869 -46278 -51263 -43985 -27647 -19188
14676 -19188 -31236 -45305 -31470 -28061 -30805 -27948 -34839 -20122 -12324 -16972 -9225 7144 12245
14663 12245 -2142 -13649 -18141 -21036 -24067 -28613 -25409 -26705 -30450 -32141 -33262 -37126 -40095 -34051
14649 -34051 -23639 -7772 -9535 -23141 -32524 -25064 -12538 -9136 -9666 -17953 -18972 -28166 -35174 -42332
14635 -42332 -40419 -17539 -13792 -24170 -29236 -21443 -34441 -28015 -28520 -29789 -27688 -35577 -28698 -28830
14621 -28830 -27625 -29520 -21802 -26712 -32124 -24734 -22134 -24272 -32293 -29109 -29367 -36496 -23505 -12325
14607 -12325 -24440 -24389 -16143 -9609 -23275 -26462 -21151 -20680 -29411 -41773 -41117 -34884 -34533 -34959 -28463
14592 -28463 -24571 -22253 -24378 -25055 -27803 -26067 -13268 -4887 788 388 12919 3316 4507 15614
14578 15614 5172 -10314 -13418 -13814 -11047 -11063 -10319 -2617 -3217 1519 -3642 -8080 -10265 1141 4455
14563 4455 -5004 7600 18391 25153 22870 21385 15041 12996 -2562 -3332 -4783 -3021 -2607 -1462
14549 -1462 4974 2443 -3053 -8112 -13529 -6781 -5886 -7241 -10568 -11854 -18213 -26264 -14540 -16119 -10491
14534 -10491 -17087 -30192 -17440 4661 2292 -1803 3175 2120 -13437 -6021 5606 1542 -5067
14521 -5067 -16528 -12599 -6376 -13962 -20253 -13601 -10173 -12452 -19773 -33104 -25846 -23022 -39890 -43491
14507 -43491 -31753 -17718 -15664 -9327 -18314 -18492 -21430 -22945 -20431 -8278 -10954 -16295 -11263 -6437
14493 -6437 -8112 -8582 -19363 -28802 -22213 -32826 -31883 -18967 -16989 -3346 -1912 1437 -5197 -15569
14479 -15569 -19942 -18287 -25437 -32505 -26705 -20203 -4113 -17208 -23252 -27013 -18680 -912 -957 -24260
14465 -24260 -39463 -35487 -32900 -32913 -25780 -33334 -32767 -40862 -42272 -29063 -19129 -23412 -26831 -20614 -18316
14450 -18316 -6430 -9236 -14401 -25653 -43487 -38549 -12384 -4613 -9100 -2809 4737 1761 307
14437 307 2929 -5619 -13330 -26023 -23593 -5026 8602 16433 7336 -8651 -18114 -20074 -19506 -12488
14423 -12488 3892 10956 2533 -4994 -14883 -24493 -23649 -12677 -2700 5402 3983 7141 12910 12193
14409 12193 4255 -3020 -14535 -15298 -10541 -12245 -6852 6725 12740 12212 5522 -13203 -23004 -24686
14395 -24686 -19340 -21041 -23552 -26379 -23437 -20005 -21945 -8748 -5827 -21303 -27188 -34010 -21178 -18624
14381 -18624 -5821 -7857 -4721 -2175 -47 -3429 5094 9138 11923 -4315 -7285 1047 -4380 -10757
14367 -10757 -3224 -2197 -3931 -4865 -10066 -22473 -21772 -23174 -26015 -38498 -42638 -35601 -14932 -19165
14353 -19165 -20271 -22634 -36561 -46217 -54201 -47718 -43448 -36089 -23751 -14947 -37468 -39641 -30609 -16401
14339 -16401 -7260 -8185 -15513 -16634 -32927 -45895 -48554 -39170 -26964 -23637 -8965 -6590 -12065 -25139
14325 -25139 -39092 -36919 -30206 -27654 -31496 -27611 -26519 -27526 -22003 -17618 -26300 -14672 -24647 -39078
14311 -39078 -19272 -8482 -3234 -8567 -14991 -19019 -10293 -10561 -16796 -18053 -21943 -12716 -623 -7627
14297 -7627 -21156 -21526 -8886 -4967 -12975 -15340 -9193 -10284 -9013 -3020 -17977 -15739 -26454 -26257
14283 -26257 -29551 -23664 -25742 -22195 -20075 -18712 -13554 -24958 -33230 -15356 -19129 -27247 -33106 -21128
14269 -21128 -739 8767 18648 21362 13009 13126 8667 12859 17768 16912 17581 11008 8492 -632 -3902
14254 -3902 2804 4154 -4413 -10864 -9867 -6485 -18582 -20924 -19207 -12359 -16407 -15572 -19979 -25131 -9364
14239 -9364 4678 17926 -2876 -26010 -19255 -2914 -4145 -15883 -25461 -16044 -8628 -1614 -2500
14226 -2500 15337 13455 -2886 -3956 2005 -550 -6212 5037 6433 -18223 -30018 -33184 -22369
14213 -22369 -7690 -7277 -16284 -23331 -25034 -11298 -12409 -1404 7853 14984 -1520 -23268 -22585 -12192
14199 -12192 1549 -1161 3250 7044 17783 18440 12814 10218 5292 -7222 -3488 -2015 -1747 -1123
14185 -1123 -738 -8115 -4805 -5528 2125 1855 1773 -2959 -8224 -8969 -12928 -17395 1989 12312 14652 7939
14169 7939 -1404 -7482 -5817 -4186 -8714 2643 1849 6998 -6608 -12529 -434 2415 -7761 -6227
14155 -6227 -9472 -14377 -8132 -4339 569 6652 -6688 -1869 5300 7891 14807 1235 4357 13451
14141 13451 19019 16161 18189 7701 -2821 -1556 19682 37321 38904 38839 23406 5514 720
14128 720 -11133 -10382 -708 6701 2894 -36 7218 14108 14226 11837 6113 14665 18139 17887 9802
14113 9802 2598 5673 -1030 -1287 -3736 2738 14215 18439 16970 11374 9199 7681 12917 14665 11898
14098 11898 -626 1316 1282 138 7350 -1603 -7491 4715 16678 17618 6449 12574 20337 14651
14084 14651 21318 16700 18788 16430 -2343 -4387 4140 23311 35767 23699 15377 15969 4039
14071 4039 -6186 -4867 3118 17626 31035 23501 24642 19133 4198 5804 -1515 3685 17171
14058 17171 18967 23677 21117 17954 12913 -7744 -2571 6622 24409 52526 58664 62286 55579 46338
14044 46338 31453 26519 31621 50083 43212 45553 52294 49615 48162 53959 59543 51979 53447 65732
14030 65732 71513 67486 70034 64973 55143 48348 35764 23869 36674 46065 52145 51541 42077 37781
14016 37781 36494 20445 10786 18443 28918 35337 36147 30577 29618 32114 30407 33791 35703 32456
14002 32456 32423 32636 35134 45408 48967 50474 51890 43084 41893 40957 51948 47462 28697 22930 24290
13987 24290 34462 49719 60686 51529 41294 44262 28358 36035 56656 63240 82923 100070
13975 100070 108737 117056 135097 159391 171892 180421 203218 248529 294826 324047 376134 447290
13963 447290 507506 559239 611623 673659 712688 741445 775819 798039 803340 816875 813361 791432
13951 791432 766998 723688 664079 615676 578855 529714 475973 428783 385427 325552 270433
13940 270433 242253 219166 204567 189477 171850 160981 151378 149742 147101 134085 129526 127490
13928 127490 105068 89196 73592 66993 68604 69990 72676 73744 76489 80810 81832 81311 63822
13915 63822 55730 79713 83299 61253 59045 60466 64429 62990 59238 53425 47197 44918 48871 32624
13901 32624 18601 10096 12700 22071 20380 14540 35390 43606 44711 49687 40651 30022 30117 31131
13887 31131 35542 35209 40426 34919 38744 47317 46913 43819 34112 31745 25085 33561 39081 43067 39979
13872 39979 35580 35239 39747 31510 25397 14845 8577 1572 7069 14522 22638 20225 13160 7568
13858 7568 11917 1976 -9676 -12209 -5164 8296 8318 12190 21354 29354 27974 20988 19366 16196 10757
13843 10757 9724 9222 16516 9206 8425 9065 6442 12042 11856 16880 10210 7386 10317 21959 10129
13828 10129 6766 18742 22936 17070 12956 3180 5704 15244 18987 14816 17294 26992 23104 12304
13814 12304 1873 17177 30699 32591 19636 16513 33870 44691 35852 25054 14308 12803
13802 12803 8588 9925 10356 14797 15055 7800 19135 28701 45129 46470 40469 31686 21369 15749
13788 15749 29643 27872 13678 7859 10971 8327 -4682 8893 23003 13912 4829 7524 14064
13775 14064 8373 6421 10491 4164 16480 20055 5253 -9064 -8600 -4392 478 7415 5208 2366
13761 2366 -14015 -22846 -11119 12077 24284 28286 30033 14469 -3057 -10913 -20066 -15584 -833
13748 -833 3249 7254 12138 14765 21215 26836 27710 34641 38398 48574 50207 38269 35230 38220 37097
13733 37097 31741 23121 11715 19272 39138 51103 63138 79907 92708 111077 113924 98832
13721 98832 95128 99927 97759 91772 96797 104167 106644 109548 117970 103792 85598 77590 75436 73778
13707 73778 79645 70405 62207 63390 66773 60596 59553 58225 55750 53819 29452 25739 27396 18790
13693 18790 15227 6806 6274 14387 25069 34326 32147 35618 38677 53003 64795 64719 60118 57801
13679 57801 62747 71314 72419 71724 69351 71177 79556 74496 76864 81742 81322 75273 74757 74753 82202 93569
13663 93569 81381 68618 69247 65179 76575 74818 54978 51308 60653 51704 38648 39654 48064
13650 48064 48740 29903 28941 35557 39471 33157 38951 39460 39542 37428 38605 42424 46521 63679 70628
13635 70628 79922 73147 60210 69471 80129 77095 69016 60221 69063 77680 86192 75053 67695 66883
13621 66883 48891 18600 18190 17579 20932 23531 20411 25222 26601 42700 35886 35482 39559 34347
13607 34347 23419 14030 2605 7752 11424 4998 6065 11114 12923 -8539 -10056 5862 14171
13594 14171 7554 -485 4613 7754 8698 10221 6830 3604 -8442 -13767 -15999 -22819 -33227 -20111
13580 -20111 -7795 -4439 -11920 -12702 -15155 -26902 -23880 -8679 250 7365 15575 3730 -1675 6748
13566 6748 -621 -3867 -2333 6086 14235 24731 27974 34050 13840 -4331 -9295 -8797 4277 2631
13552 2631 3975 14692 17135 5916 15771 6059 -6759 -14355 -9975 1956 8211 -18282 -42973
13539 -42973 -30956 -10488 -4345 -16818 -6908 20113 11373 11226 12978 8448 -2788 -1343 6392
13526 6392 7991 14639 5913 -4587 -14589 -12981 -13020 -6217 10829 3829 -8373 -4101 297 1949
13512 1949 18707 3760 148 8449 13685 25369 18510 6125 -2921 8051 16142 20503 16738
13499 16738 6473 6334 11918 9996 10307 3810 -1640 1863 2166 3222 -849 553 6931 6155 14914
13484 14914 24149 16167 10947 10069 7110 -892 7058 19040 15713 11290 6067 4591 6639 -2700
13470 -2700 -6126 5931 6738 8634 10897 13955 17254 20690 12833 8815 7016 11931 11879 9179 576
13455 576 1326 1922 -10191 2785 10831 15734 11424 -372 -4534 3467 1418 -4396 1113 4006 975
13440 975 3258 10210 19366 12692 12880 22575 24475 16436 19310 14283 13886 9470 10591 21819 29753
13425 29753 35411 53002 52073 33492 25746 20784 26738 24564 26053 22232 20678 11110 5364 15401
13411 15401 21733 15137 29208 24811 27023 32755 31339 38055 44539 42328 39000 38129 45707 43159
13397 43159 33852 43875 39227 29814 28470 31032 30472 26678 43056 59873 65738 55279 55140 58839
13383 58839 59052 72234 64778 51093 51992 55679 51960 62081 68153 65193 72210 70811 68566 62698
13369 62698 43721 42055 53803 67156 72350 69069 55234 45379 42451 52806 60888 70158 69142
13356 69142 67765 70273 65399 59408 58629 60573 60134 53054 53982 58892 60367 55146 59136 59943 59438 65966
13340 65966 67074 63578 64700 72629 83724 81983 81228 81270 74316 75372 75090 57636 59694 58211 56859
13325 56859 56299 78917 94556 89342 78179 64694 70196 82375 93883 92612 87889 87174 97428
13312 97428 103915 98621 98395 83638 83535 88358 91541 91429 92536 102911 112218 102800 94143 85865 87508
13297 87508 89150 82096 87225 85812 79943 78556 77099 75820 77034 79244 76346 72062 74755 77929
13283 77929 69790 64818 60559 67935 84374 85853 74986 66693 65385 69390 76934 78204 82879 72804
13269 72804 75594 81424 86334 100854 109555 117304 109376 96816 85236 83596 82269 81153 82209 76793
13255 76793 80745 89336 87135 81096 73719 79385 85496 85976 87199 81456 75899 86806 81033 59445
13241 59445 52226 46072 35532 47483 48222 53942 74474 73165 67901 64059 57310 56671 51475 60646
13227 60646 59074 51988 52534 38106 31211 34903 46036 59823 58801 49406 47074 47296 56633 55441
13213 55441 49043 54261 63377 68695 64171 48453 46867 43049 52663 55593 54093 58830 46420 32298
13199 32298 35818 28053 32279 46842 47669 47265 48708 54016 65812 61117 61036 56748 50579 51325 55350
13184 55350 59809 64208 48416 40697 49467 47527 56501 52545 43694 41008 42243 55914 66789 67348
13170 67348 60271 65430 68387 61856 56885 59925 70313 75211 75647 66882 61537 55276 33889 33461
13156 33461 52189 58155 64213 72611 73147 53279 41543 35464 44131 55309 54903 56857 55693 60953
13142 60953 68260 74234 77205 74848 85973 95371 93777 95031 105271 115612 136940 137924 129446 130694
13128 130694 138599 130935 127981 128082 121760 115019 106483 102253 94272 78755 72970 75465 67467 60827
13114 60827 57900 61177 61904 64323 61627 56682 55334 49356 47823 47168 62009 63319 50867 49166
13100 49166 45810 36620 43580 49291 49584 46720 41455 38906 39308 39446 47894 48372 44961 53244 52596 43593
13084 43593 48598 44363 42173 51224 63215 70124 62278 52310 43588 38889 54540 61186 51764 42158
13070 42158 52698 56744 58025 50709 57167 61935 76860 83572 74406 71359 65159 48677 36143
13057 36143 36779 37175 47384 47192 45531 42810 48429 33771 24489 24174 13036 8140 10542 17680 28984
13042 28984 60035 76453 63417 58122 41130 28970 28677 44414 44349 48059 61110 71928 70150
13029 70150 61977 58731 56058 68533 83365 76957 64758 72045 62152 62612 56618 57251 54006 55520
13015 55520 55420 51115 52862 50283 43136 27122 5021 3385 8921 26510 27195 11100 31670 53795
13001 53795 53477 51714 49007 51913 58768 73816 79050 77695 75739 81985 83990 63523 53720 47320
12987 47320 53687 44064 41589 56573 58923 60356 63800 66749 61767 69791 64982 64800 56684 56963 52682
12972 52682 54567 54672 56502 57542 59389 57689 64501 64546 49216 42227 58973 70146 72345 79935
12958 79935 87959 96561 104972 118639 140268 161090 167662 188095 201673 214326 247350 313431
12946 313431 406759 492087 589431 692598 785604 882419 955777 1007649 1029657 1012621 979238
12935 979238 911214 837763 740279 648142 548951 457287 385184 337384 298487 278409 244888
12924 244888 214971 200515 205596 201919 195138 192002 186742 180230 169263 158336 158072 154034 145054
12911 145054 149413 155294 148072 143157 146667 149691 155866 153304 149093 155230 156645 168794 186864 191599
12897 191599 193600 189518 179483 160419 158187 156218 149209 142469 128466 124639 135273 135315 142381 147650
12883 147650 169704 181016 192738 212823 230356 228022 230178 223280 203309 198350 175297 153939
12871 153939 118567 97937 80076 68365 79338 83629 77223 70343 62918 58271 51108 68004 75236
12858 75236 76756 76624 75283 75590 88321 96305 93575 74815 63141 61004 70806 69477 77155 81001
12844 81001 85500 91778 110105 111065 91422 84780 82473 85380 81512 74854 83243 85658 80776 83102
12830 83102 88945 77685 77459 86940 79235 71288 70828 78383 71641 71578 85472 94216 93840 92781 94653
12815 94653 84588 80224 96740 96318 95657 100547 97049 96171 98988 104811 106634 108331 99179 94798 94235
12800 94235 99371 112693 116508 118567 113737 116239 124378 112846 111301 118416 128197 142808 138108 140821
12786 140821 135061 122443 118376 132930 145756 155394 162979 169778 183890 193867 210755 225937 244797
12773 244797 251022 257145 263907 270915 274185 267026 266131 257048 252904 245486 245366 239034 239392 228211 209594
12758 209594 195727 177888 171159 166696 172299 174875 174523 170968 173629 183860 177858 182354 187592 188164
12744 188164 194825 186276 195459 196622 195314 173589 160736 164439 178632 179829 174646 171600 189754
12731 189754 196488 183021 177214 178584 182317 179568 175467 175669 188129 196952 197903 207355 214389 225431
12717 225431 228973 224155 235043 238384 238432 249015 237256 220107 221940 241912 257872 259195 254252
12704 254252 256700 259204 257582 251689 242879 250550 264033 276063 283704 295697 314527 329106 351023
12691 351023 385719 420682 460145 511123 568925 637601 696546 785579 868479 931882 1029308
12680 1029308 1160951 1307782 1443258 1556766 1651516 1734757 1805042 1844431 1860138 1830573
12670 1830573 1793120 1753463 1710892 1655207 1601731 1535331 1476569 1421736 1359899 1287693 1213906
12659 1213906 1142092 1069295 1008136 968761 946673 906293 877695 843288 800477 779624 765302
12648 765302 758863 754848 744173 745512 733239 713992 703500 705644 694618 668760 652745 638808
12636 638808 625928 628189 629622 630236 642072 658871 681300 699353 715888 738448 752668 769559
12624 769559 781152 790127 788955 785870 778339 757586 730653 699336 683617 674803 661004 664161 666021
12611 666021 665746 663326 664740 673758 692114 709336 724300 735243 747575 761161 765793 772535 770037
12598 770037 784245 787354 798693 789841 789571 805591 815621 821644 812968 795352 791951 788682 779885
12585 779885 779082 786613 787390 789700 804878 813500 818023 827262 851266 877654 911307 959194 1016420
12572 1016420 1073704 1132146 1180789 1224367 1250338 1287827 1340976 1406685 1469298 1538115 1616359
12561 1616359 1715461 1818213 1934989 2061904 2194477 2335442 2489262 2640546 2781024 2915262
12551 2915262 3047327 3178628 3310827 3450433 3606584 3777768 3970473 4207673 4478256
12542 4478256 4815703 5234608 5753997 6388207 7135154 8040325 9101577 10321119 11689041
12533 11689041 13257508 15004654 17001341 19375282 22333906 26210329 31437973 38608782
12525 38608782 48254850 60639363 75656230 92972027 112018433 131820935 150813352
12518 150813352 166975002 178556765 184722045 185264852 179856680 168469371 152310915
12511 152310915 133714652 114780414 96674532 80231669 66374221 55619392 47768746
12504 47768746 42086444 37874245 34638063 32029512 29836118 27929511 26220034 24648012
12496 24648012 23195287 21835331 20572344 19398492 18304484 17311913 16403650 15568000
12488 15568000 14795556 14101488 13477513 12880253 12337326 11839127 11378702 10946693 10529721
12479 10529721 10141227 9775283 9445855 9142707 8859307 8561029 8287624 8051773 7810439
12470 7810439 7560575 7317418 7080660 6837736 6606517 6370834 6143938 5921440 5737796
12461 5737796 5543336 5346202 5185455 5038287 4903370 4780071 4638661 4495603 4365613
12452 4365613 4260050 4146190 4034120 3932505 3842041 3754559 3658088 3568799 3495135 3421402
12442 3421402 3346934 3294498 3270614 3267253 3269360 3284473 3332821 3371814 3414448 3457089 3474670 3480680
12430 3480680 3467404 3423899 3341998 3213384 3066675 2910552 2756892 2597821 2451951 2329382
12420 2329382 2230977 2153196 2070379 2010211 1980737 1960024 1941767 1931588 1923092 1900322 1886111
12409 1886111 1852810 1810229 1769163 1712401 1658513 1603062 1533018 1472006 1419357 1364047 1321854
12398 1321854 1278331 1220860 1183622 1155493 1134173 1111638 1095221 1081791 1086478 1082512 1070075 1057873
12386 1057873 1057756 1060411 1065713 1067789 1085082 1108133 1120398 1129370 1134673 1134659 1114489 1083708 1053105
12373 1053105 1001384 954156 902092 853533 836320 838636 828841 817486 827219 843146 855373 845773
12361 845773 839647 833713 817413 807196 799609 792766 782948 786424 784167 783631 789287 791218 785861 787915
12347 787915 794380 808374 828726 849213 864624 864684 883564 909464 904405 913500 931159 931783 927945
12334 927945 931509 933606 930782 937765 950572 975542 989470 1008577 1036830 1071065 1090290 1112770
12322 1112770 1136174 1157821 1179788 1184539 1207391 1224781 1212279 1209766 1193002 1170684 1173802 1185082
12310 1185082 1194122 1221665 1240016 1257047 1278031 1312305 1346249 1379416 1429730 1485681 1538024
12299 1538024 1582687 1636852 1689592 1743495 1810517 1874404 1952393 2045335 2134471 2238477 2342202
12288 2342202 2462749 2607723 2766292 2947950 3150422 3372566 3650436 4007739 4407328
12279 4407328 4842947 5371868 6005429 6772202 7707089 8896106 10434400 12438748 15038986
12270 15038986 18371616 22496940 27289837 32497749 37785344 42752911 46988180 50142008
12262 50142008 51865742 51941774 50327067 47255593 43199139 38734556 34423579 30641371
12254 30641371 27593969 25332465 23856419 23121487 23087307 23701489 24897683 26565193 28555491
12245 28555491 30734113 32995346 35252260 37480673 39610066 41608185 43492839 45347957
12237 45347957 47253971 49231288 51191911 52935374 54211685 54786837 54575395 53601730
12229 53601730 52056800 50133994 48090722 46099509 44274632 42686207 41308658 40053293
12221 40053293 38815699 37442088 35822292 33967111 31972958 30091082 28556919 27550458
12213 27550458 27181931 27576484 28789475 30881502 33888317 37785413 42402609 47417974
12205 47417974 52389181 56833308 60260904 62281431 62639631 61164959 57869647 53012786
12197 53012786 47151229 41006590 35228326 30271687 26277397 23158884 20743120 18857584
12189 18857584 17344917 16090947 15040561 14118093 13301872 12578675 11928537 11331727 10797617
12180 10797617 10300531 9846105 9438824 9059013 8687673 8354149 8061795 7791184 7545900
12171 7545900 7306785 7087251 6902947 6742397 6609721 6494801 6376956 6274121 6177815 6086572
12161 6086572 6000896 5916716 5820315 5708493 5593095 5473031 5354030 5243607 5170308 5118897
12151 5118897 5093446 5097125 5121216 5194852 5317977 5485837 5695518 5953463 6264632 6656782
12141 6656782 7139728 7746402 8533023 9560908 10944634 12823642 15364014 18717847 22904391
12132 22904391 27835201 33186236 38458819 43195223 46975269 49465344 50334766 49364699
12124 49364699 46507770 42106435 36842842 31533350 26797141 22942230 20009173 17821216
12116 17821216 16199241 14978674 14059165 13346043 12799915 12422276 12192623 12088312 12101723
12107 12101723 12260669 12555322 12983384 13560641 14277502 15138588 16183972 17421014 18915562
12098 18915562 20829272 23327704 26691018 31207208 37155502 44606468 53399504 63045629
12090 63045629 72756050 81654520 88933276 93874067 95905241 94624420 89938229 82328598
12082 82328598 72857468 62879598 53548371 45583634 39233204 34403786 30785404 28052810
12074 28052810 25933585 24216089 22745103 21451662 20274417 19205022 18245800 17411749
12066 17411749 16708847 16152845 15750113 15477670 15361414 15392532 15565866 15929497 16542987
12057 16542987 17477518 18858983 20854568 23608936 27256203 31767600 36928270 42320178
12049 42320178 47419785 51713326 54790384 56337430 56070524 53808267 49612761 44012286
12041 44012286 37864755 32037372 27061039 23081895 20044009 17744299 15991869 14613669
12033 14613669 13480911 12518274 11701763 11001920 10387420 9836803 9335795 8889490 8488034
12024 8488034 8110589 7749784 7412982 7105803 6819681 6548862 6297020 6061795 5843467
12015 5843467 5632960 5433454 5257268 5087140 4929284 4784354 4657861 4527788 4396574
12006 4396574 4271904 4144530 4020615 3904477 3787151 3666848 3531033 3411381 3314545 3201554
11996 3201554 3094082 2998318 2882480 2777821 2702211 2626162 2572384 2500122 2429537 2373267 2321598
11985 2321598 2275237 2233386 2185199 2134529 2103362 2068867 2024602 1979852 1939455 1907887 1867006
11974 1867006 1811667 1762747 1727978 1698829 1657076 1605599 1549782 1498775 1450985 1410992 1382685
11963 1382685 1355174 1325133 1286925 1243793 1193407 1144732 1117631 1086169 1044429 1019264 989190
11952 989190 963686 922829 895288 855006 849325 860369 852382 832593 808340 800892 802026 799365
11940 799365 798157 788563 783794 791500 787522 767369 742999 730543 720623 709658 690908 670676 651594
11927 651594 640449 620354 594902 582672 565007 559088 570461 566288 549895 539562 529832 515788
11915 515788 504535 491456 479002 477765 466706 454064 448400 428953 428190 426034 433389 427608 411127
11902 411127 414329 426372 420638 407973 404125 401815 396284 396509 409498 415930 403212 383466 378769
11889 378769 374692 382274 385599 387506 385348 381551 370835 350028 352042 356337 348691 346671 344508 338962
11875 338962 332734 326919 323964 309997 294882 287760 295038 291283 289859 297252 289844 291264 290114 286839
11861 286839 281261 288280 300893 307108 302558 308757 320637 342821 371027 405694 461428 502061
11849 502061 526375 543761 562575 575269 587155 573636 549669 528434 505749 496205 493537 486239
11837 486239 494319 513593 523190 522868 520203 516205 507430 476237 443392 419674 406128 371712 338534
11824 338534 319631 295948 275710 282249 297950 312782 320221 325678 332776 342427 351803 358615 362615
11811 362615 366372 374858 390382 405306 405858 407681 416980 421227 418142 406571 401945 404096 404515 389078
11797 389078 370553 354943 345309 344269 336441 340987 345369 333634 310645 302543 299027 290472 293380
11784 293380 291943 290144 298338 307900 328699 351323 358326 392262 426243 449535 452069 440641 440313
11771 440313 418299 405535 385643 347458 314336 294662 274665 261606 251624 236463 215561 203679
11759 203679 197821 195592 207153 195613 176694 171685 168201 173522 167911 151209 139656 151638 163025
11746 163025 159712 151329 143050 140678 143624 143412 151523 154230 156635 147724 146038 145478 146578 136308
11732 136308 140177 136546 141223 144057 133953 122552 128350 129358 128071 123298 134763 122147 121930
11719 121930 136439 151454 147502 138604 134408 127970 132180 127483 123270 125196 126641 144082 157045
11706 157045 157202 149892 159290 171091 202384 230824 243036 264617 281563 309669 346828 363418
11694 363418 367623 357869 334909 320835 307399 286369 257076 221946 206546 206390 201039 189016
11682 189016 178874 170166 180806 191614 182571 191077 204665 201422 197564 205929 206305 200943 200902 208174
11668 208174 219448 228988 227738 244036 275234 290669 319969 350481 388006 442246 489158 525679
11656 525679 563086 583601 599009 603167 604620 580448 539647 501277 454097 403620 361742 337152
11644 337152 315628 289031 272383 271758 273232 269254 255609 243961 224943 221543 220201 214264 217234
11631 217234 212470 208243 208161 209474 205395 207988 203596 199599 204901 225879 251824 274400 282498 308673
11617 308673 348525 380436 387780 402169 415457 417873 419986 415549 377851 348647 327609 307469
11605 307469 291602 278488 262100 244203 232886 225906 215214 192928 194126 185335 174772 167159
11593 167159 160860 157096 166669 176096 175032 174459 165108 152032 155015 159406 157003 155981 141256 140296
11579 140296 140128 119378 104707 108301 122471 132565 143390 144836 116799 101584 117306 129305
11567 129305 140746 146107 130680 128165 125469 136221 156808 155825 133036 123843 122181 126044 115249
11554 115249 111241 113440 119111 129652 136426 122295 113082 126764 131656 139442 146512 140279 126512
11541 126512 125071 125815 108160 103530 110956 105656 103581 111647 109878 115356 102733 91382 81899 75042
11527 75042 77161 77695 75369 88941 99312 100577 111083 122818 119474 103960 103841 93949 99069 107084
11513 107084 100213 94224 87962 84593 80949 85827 79845 73114 67150 88800 95938 97868 93950 97667
11499 97667 96623 90851 86300 78532 75797 67841 86288 82195 81027 82875 78976 92755 93002 88442
11485 88442 85449 88769 94281 85193 83268 86134 90062 90522 86407 93591 96449 85596 76498 78456
11471 78456 80071 88729 80535 74905 66999 77562 79469 62376 65512 64671 61856 67857 73316 70717
11457 70717 51674 54828 54564 63813 77189 71259 79561 87189 85102 83142 90787 94484 100002 104703
11443 104703 98239 98717 98068 92677 81600 79745 79488 63686 54416 64899 70659 74234 80940 94220
11429 94220 90158 80106 86368 79741 89281 91992 95261 97151 95249 100477 100171 80140 74259 68564
11415 68564 74417 85937 97198 106166 109667 122208 134638 156473 198220 241676 263496 275757
11403 275757 280091 290518 297527 313220 286052 233681 184523 157143 139175 129011 124008 116055
11391 116055 120120 122711 129308 124328 120212 113199 110769 114626 92132 97124 111590 101746 116357
11378 116357 125356 133779 128489 131109 137317 140715 138528 133861 142946 138427 145887 160025 163691 169370
11364 169370 158136 155072 154971 146153 135621 138770 133929 134234 132834 119966 112543 105115 100967 111009
11350 111009 117445 111100 116066 114851 110380 110320 109117 98646 102438 124394 136857 134727 136637 150921
11336 150921 150606 153530 171634 161874 142736 136547 132078 133126 147380 143132 125787 125840 132552 132993
11322 132993 137310 148035 172094 172015 162348 173315 173821 169659 159918 156250 161816 180034 196066 200582
11308 200582 210316 227573 239395 254612 273084 289057 292060 293503 306206 339342 370543 394408
11296 394408 419651 430822 432335 437271 448936 435633 383812 348034 324333 300798 291164 291677
11284 291677 288043 291516 309541 328877 339969 366122 389722 410856 437283 453848 478018 491082
11272 491082 502746 518715 531893 549582 564174 554007 563034 567694 553441 531519 516320 495115
11260 495115 484085 482384 463321 449104 433016 421532 422538 408017 397498 408804 401518 401842
11248 401842 391206 390546 389419 379962 380641 381958 388829 419718 450231 470768 488152 531443 584622
11235 584622 626050 664738 696432 718978 738461 746133 746834 733629 687539 631487 573388 521494
11223 521494 491189 479633 466484 444288 412022 414892 409671 394085 367513 361439 354005 332419
11211 332419 311536 300659 300550 292725 290204 281122 284270 287835 280202 272679 272348 262909 253811 247161
11197 247161 236702 237558 229294 222822 220205 208933 207180 216128 222100 232367 239821 236664 254684
11184 254684 254926 246730 244081 238849 229632 220742 210182 195488 186970 181619 181213 178531 180391 173856
11170 173856 168499 178884 167536 162558 162349 149176 147299 158973 168257 170381 158614 158279 160574
11157 160574 159963 158642 161774 162755 165917 172417 178423 184391 180721 189774 193829 189835 174561 159441
11143 159441 163282 175429 172008 170829 183280 190678 176788 176094 180014 182076 195049 205815 209561
11130 209561 217776 218125 201207 192154 183469 195325 218510 227722 221584 220792 231594 236552 229501 221928
11116 221928 225839 219743 204841 205518 211386 208543 194321 188386 189319 200408 209105 215759 224861 224404
11102 224404 233693 243143 241767 238108 237756 238114 250728 258112 272122 273211 277406 288973 300539 305575
11088 305575 312170 327538 347203 360291 384398 408181 409626 408649 423713 457538 480610 489072
11076 489072 495850 506799 507160 492382 483170 469390 456443 447589 433090 436340 450890 476727 477108
11063 477108 480349 490244 501392 510967 526881 531679 511624 491832 485744 485598 483330 486919 496148
11050 496148 506696 514026 524784 515715 512323 511431 518202 533441 560864 581227 584450 586401 588664
11037 588664 581943 580716 595153 605493 613198 639144 667844 703757 719923 715882 716933 713945 686100
11024 686100 655514 639013 601932 564046 537051 537080 540584 537378 540908 545782 553232 574307 586291
11011 586291 607845 618392 626417 628801 631721 641505 634993 623225 605248 583642 555416 527848
10999 527848 499266 477267 461047 450083 443178 440825 431632 430490 435089 440676 442313 444406 454277
10986 454277 460323 455031 453495 459982 456858 440242 428787 429434 444489 457681 455367 442009 426045
10973 426045 422640 417704 408680 412716 419517 431086 450376 468102 482002 501037 508270 502341 515348
10960 515348 516216 529115 539105 551507 565555 574259 574506 573864 582812 600423 600680 583777 596714 599496
10946 599496 594175 592456 597767 617973 632857 641244 654157 668432 679798 686249 685124 691590 699378
10933 699378 719118 744135 766945 777850 803482 852738 893319 924222 950388 977664 1014700
10922 1014700 1055948 1098532 1151756 1193809 1234663 1280987 1338678 1397077 1453493 1508577 1566451
10911 1566451 1642749 1735721 1837712 1957162 2083679 2218130 2375733 2558400 2783935 3028639
10901 3028639 3294425 3599854 3969349 4404130 4909941 5509112 6237254 7141745 8265329
10892 8265329 9702065 11545706 13934289 17029379 20953409 25717859 31183045 37072245
10884 37072245 42961524 48382087 52878180 56005662 57385510 56837902 54441450 50475331
10876 50475331 45451131 40057231 35027118 30847565 27666061 25498366 24273190 23932455
10868 23932455 24401411 25548280 27181097 29114856 31152402 33203610 35139522 36838165
10860 36838165 38146603 39152711 40137489 41399217 43088029 45288344 47957214 50832236
10852 50832236 53512960 55596235 56794417 56962296 56049861 54189113 51724558 49126494
10844 49126494 46745038 44729629 43093522 41734196 40452253 39040995 37378342 35428508
10836 35428508 33188719 30772613 28536836 26878402 26016855 25972977 26705948 28235802 30562832
10827 30562832 33695329 37539660 41851711 46298153 50483924 54009040 56498302 57629728
10819 57629728 57149776 54983679 51327205 46600383 41307386 35956462 31007718 26803590
10811 26803590 23422093 20757908 18665583 17009446 15671111 14566822 13658933 12876171
10803 12876171 12206501 11613134 11082954 10585294 10120170 9675392 9254230 8853318 8451092
10794 8451092 8071265 7720763 7401151 7102146 6814677 6547635 6306403 6088727 5890610
10785 5890610 5699810 5513869 5343457 5176286 5039258 4909827 4787294 4668724 4566302
10776 4566302 4465794 4374285 4280046 4173011 4072843 3975926 3901664 3839551 3790110 3746028 3720182
10765 3720182 3757243 3841738 3970126 4117878 4250540 4328112 4367211 4382997 4364684 4240656
10755 4240656 3999011 3689528 3378169 3117144 2927442 2792096 2663107 2548049 2459468 2393000
10745 2393000 2338898 2276488 2218685 2176683 2141271 2101964 2073166 2040835 2008355 1968803 1946352
10734 1946352 1913807 1873395 1839051 1819977 1779556 1755313 1724328 1698229 1684815 1657345 1628286
10723 1628286 1615459 1601604 1583271 1580029 1580058 1571805 1566992 1568042 1573846 1571714 1558969 1553911 1543654
10710 1543654 1524758 1508106 1502478 1501649 1509575 1535498 1572001 1604646 1627007 1643245 1663282 1693412
10698 1693412 1717198 1740060 1776542 1810658 1854575 1903633 1955009 2011500 2074052 2160159 2262375
10687 2262375 2372725 2498312 2658865 2827593 3013944 3214596 3441428 3694108 3986444
10678 3986444 4308784 4699738 5163906 5740745 6464124 7375129 8544635 10064437 12049405
10669 12049405 14625327 17889505 21817107 26239913 30888961 35475709 39678122 43138752
10661 43138752 45473971 46354751 45719499 43850885 41101828 37757958 34209587 30944612
10653 30944612 28285249 26266174 24779239 23636721 22708360 21974300 21512736 21433378 21828033
10644 21828033 22750129 24154295 25912831 27819459 29726946 31520472 33097164 34381160
10636 34381160 35424233 36372490 37455648 38905023 40848035 43287104 46083332 48893210
10628 48893210 51292578 52898709 53457142 52815267 51025875 48304875 45058800 41786705
10620 41786705 38927257 36806361 35490057 34900233 34829295 34985003 35083434 34899673 34257456
10611 34257456 33124852 31620975 29946522 28316152 26954429 26073223 25805877 26151185
10603 26151185 27025822 28344952 30094438 32356296 35160697 38538605 42433365 46652354
10595 46652354 50836390 54616492 57681900 59697895 60303209 59185596 56223748 51599241
10587 51599241 45836037 39674531 33862180 28919343 24983191 21952533 19628982 17831538
10579 17831538 16416029 15263892 14297513 13475548 12786114 12201267 11673689 11194606 10735375
10570 10735375 10295497 9868686 9443043 9013892 8589975 8179779 7802993 7448273 7104949
10561 7104949 6794425 6517173 6257075 6000961 5770840 5559737 5354249 5156163 4975689
10552 4975689 4807806 4646229 4489767 4345382 4208840 4093072 3988944 3876023 3770624
10543 3770624 3659935 3558110 3447325 3350669 3264884 3175863 3086548 3028292 2962447 2888513 2829233
10532 2829233 2771724 2694894 2609462 2530923 2461121 2404520 2356009 2314579 2265930 2232891 2206342
10521 2206342 2163764 2118734 2084010 2025962 1937530 1853839 1791817 1740140 1686740 1631121 1587484
10510 1587484 1552463 1524579 1489308 1462791 1441026 1406933 1367172 1341592 1312198 1275405 1245304
10499 1245304 1214603 1179816 1139574 1104149 1086477 1081156 1074513 1075445 1073806 1065794 1093584 1105846
10487 1105846 1090912 1090155 1094541 1092741 1074994 1057695 1051265 1044210 1038867 1037606 1028650 1030812 1027937
10474 1027937 1023766 1030877 1048423 1073075 1098014 1118136 1142915 1177761 1240152 1291077 1311182 1322656
10462 1322656 1320872 1313933 1298845 1285648 1278634 1268833 1267887 1270519 1288834 1307218 1331716 1368595 1402672
10449 1402672 1427104 1433451 1429008 1411679 1377204 1343015 1312433 1282861 1281100 1290517 1290874 1276123
10437 1276123 1262642 1255583 1269849 1277156 1269741 1260839 1258881 1256102 1237408 1215423 1185015 1181478 1181619
10424 1181619 1196939 1220526 1244737 1272854 1307895 1333269 1352157 1364382 1383585 1409354 1414150
10413 1414150 1404400 1396983 1402494 1408294 1425020 1427794 1434560 1447205 1463634 1468148 1502862 1567151 1634188
10400 1634188 1703971 1766201 1806057 1841413 1885522 1926621 1974081 2016157 2058763 2096419 2158800
10389 2158800 2246046 2338948 2445302 2555275 2664193 2763976 2862282 2987324 3116597 3250813
10379 3250813 3385084 3535562 3690144 3873557 4088021 4325227 4573148 4854085 5160119
10370 5160119 5493710 5866373 6316557 6834924 7392321 8031059 8798921 9717916 10833961
10361 10833961 12126232 13558456 15122488 16819024 18646397 20684684 23059317 25797095
10353 25797095 28988232 33025315 38541141 46283616 57379201 73666403 97727593 132108643
10345 132108643 176663508 225175782 267115725 296375579 315052587 328563404 338493371
10338 338493371 331697832 291201534 229827740 174449367 134841435 108329707 90386517
10331 90386517 77840212 68787077 62089264 56968671 52886539 49520907 46700637 44296529
10323 44296529 42140092 40110930 38012019 35715763 33347981 31138681 29188952 27441978
10315 27441978 25869591 24465863 23217996 22120625 21137027 20232073 19398243 18614395 17866392
10306 17866392 17156157 16471482 15822563 15197947 14587442 14005738 13472095 12981305 12517730
10297 12517730 12072745 11656336 11275706 10931198 10593911 10255280 9912210 9568880 9213976
10288 9213976 8894373 8620695 8380923 8135385 7893018 7650730 7417627 7205927 7019043
10279 7019043 6834596 6644380 6449800 6274757 6108200 5939968 5785014 5629287 5457955
10270 5457955 5277836 5107289 4970386 4858047 4737658 4607372 4492886 4372841 4264519
10261 4264519 4164296 4072654 3976461 3878765 3783329 3699113 3607926 3520877 3440395 3377781 3287544
10250 3287544 3212374 3114833 3033113 2964156 2895189 2855058 2818313 2772390 2740500 2716127 2714044
10239 2714044 2694598 2663741 2627965 2597495 2569357 2528545 2474231 2416072 2360857 2279396 2190448
10228 2190448 2109397 2034218 1973137 1903423 1824730 1757842 1712655 1668766 1618910 1563311 1524768
10217 1524768 1529902 1549480 1568545 1568392 1546374 1522490 1500277 1463608 1403739 1335458 1281290 1240353
10205 1240353 1219251 1193802 1158852 1123645 1111584 1111662 1113700 1104094 1096984 1088941 1101780 1111202 1128037
10192 1128037 1133699 1124840 1115751 1095332 1074309 1056931 1033212 1006330 990079 975134 969367 976853
10180 976853 968365 965417 968857 984303 1004556 1010668 1012799 1019294 1030210 1033523 1040200 1043168 1034521
10167 1034521 1026356 1020921 987384 949580 917660 898804 886744 878543 860003 841559 836945 822747
10155 822747 819011 797286 785360 761037 740212 716582 692393 682936 678734 675762 674428 675266 673818
10142 673818 678966 691865 709581 731208 766222 831189 919018 1006001 1066160 1110813 1145425 1164610
10130 1164610 1157649 1088163 984061 877047 794811 732986 697305 674169 636441 612543 588462
10119 588462 589159 591342 573646 566647 555024 555416 536336 525595 511033 502324 482787 450195 435808
10106 435808 441859 439493 418231 400820 397202 397967 403437 392081 384806 395836 415076 424993 426185
10093 426185 431513 439828 452920 447350 435595 449324 462789 467384 460580 449089 421137 379227
10081 379227 347429 334021 321204 302033 281377 267655 262911 268787 266936 268453 261893 246094
10069 246094 243342 241223 232473 228998 237271 238066 229532 228256 233691 241807 251579 259108 271631 260749
10055 260749 245531 249355 247341 253122 245420 236457 222682 202303 192086 185348 189419 191133 185027
10042 185027 179058 187820 195974 207051 218196 232131 243733 234087 227944 234969 250971 250805 251523
10029 251523 237950 237411 260071 299234 337417 357019 355755 350450 361660 372017 374901 348258
10017 348258 329330 326661 300276 273052 255633 243602 237491 230232 222664 225038 228252 237888 242176
10004 242176 248573 255779 270240 275473 271207 278515 273850 290791 289493 278741 275851 293324 294960
9991 294960 301315 307927 321819 325526 352361 370987 371403 375868 387766 393211 395188 382641 364016
9978 364016 360332 357783 330925 315105 316286 302987 299146 297180 289957 291248 296958 308162 305521
9965 305521 300066 315536 316742 303572 313963 324974 325830 331917 330291 333228 330794 341084 350597
9952 350597 360274 370857 386135 410403 429298 465963 495461 507362 522187 534060 549518 541798
9940 541798 514632 492196 476456 471918 473223 469965 465429 466183 477728 490465 507835 518409 536448
9927 536448 560433 593631 642076 717627 803265 928894 1117727 1347272 1577984 1774427 1906189
9916 1906189 1997971 2059886 2073331 1969608 1729044 1468288 1259914 1102104 992375 918389
9906 918389 859234 813242 774137 747161 731259 717131 692809 685521 685947 669867 661270 638856
9894 638856 622738 617202 606466 593263 587059 590268 592880 590234 576025 579222 575050 592224 600500
9881 600500 617938 628906 640150 648842 656613 670607 688634 708337 724688 735522 759010 788660
9869 788660 803036 837676 867104 889615 922446 956595 1003662 1068110 1139973 1229814 1325347 1423352
9857 1423352 1547365 1704864 1892309 2119595 2398895 2727580 3145478 3688490 4407796 5371481
9847 5371481 6620136 8124726 9787068 11444455 12903068 14029894 14830255 15263662 15215784
9838 15215784 14563269 13366240 11942003 10683188 9742241 9083224 8624544 8303587 8076667
9829 8076667 7864873 7653226 7478764 7434917 7552060 7853058 8337556 8925480 9518799 10116337
9819 10116337 10734578 11361639 11950553 12413770 12798841 13274141 14025635 15105824 16481877
9810 16481877 18147514 20139260 22496642 25156898 27995166 30794099 33327415 35430092
9802 35430092 36986310 37805219 37803376 37157076 36044337 34379298 32171101 29767982 27634891
9793 27634891 25938926 24542840 23262229 22063532 21038580 20336213 20037184 20112191 20466178
9784 20466178 21054519 21845154 22730289 23622970 24483522 25334026 26230831 27118638 27956941
9775 27956941 28890705 30085610 31585091 33361718 35309773 37253931 38824760 39902392
9767 39902392 40704280 41452204 42120035 42457861 42281780 41620161 40606217 39417491 38127366
9758 38127366 36625785 34757036 32704415 30834561 29335663 28146313 27068903 25827439
9750 25827439 24449128 23182665 22159345 21412403 21020130 21002912 21342715 21958800 22699115
9741 22699115 23552440 24524249 25616425 26796109 27980998 29135445 30284031 31523032
9733 31523032 32822452 33906255 34483741 34540687 34184251 33456739 32295787 30634598 28561058
9724 28561058 26410757 24461766 22858760 21527696 20333719 19237154 18302750 17518636
9716 17518636 16807407 16118006 15429079 14756922 14067549 13270982 12395498 11583022 10961136
9707 10961136 10524727 10263011 10110521 10046628 10045333 10097070 10209697 10382296 10641667 10982854
9697 10982854 11478713 12172069 12981548 13783867 14450459 14889004 15065665 14935322 14445039
9688 14445039 13499239 12133191 10586990 9184922 8048168 7174949 6510139 5995847 5567386
9679 5567386 5213872 4917020 4639893 4401794 4205471 4033969 3877484 3723397 3580096 3444536
9669 3444536 3304321 3182776 3064656 2953317 2844420 2743098 2648160 2557209 2465015 2394518
9659 2394518 2323650 2258304 2189122 2129282 2068019 2006985 1956000 1899691 1843436 1792925 1745734
9648 1745734 1699983 1664430 1622101 1582406 1548513 1518184 1482790 1452605 1410256 1364683 1328134
9637 1328134 1302695 1283902 1253612 1229812 1201269 1183980 1160823 1140933 1130515 1105292 1069188
9626 1069188 1042851 1037520 1021150 999802 978110 951150 937540 927946 912583 899496 890087 869098
9614 869098 844170 827126 815568 815644 802351 779778 761340 738591 716192 711523 698996 675238
9602 675238 660150 657461 640581 627567 621021 613344 602572 598597 607321 628748 644442 651670 653234
9589 653234 637595 642691 654004 654997 646691 624401 596320 593304 590466 576176 561657 552215 547405
9576 547405 548651 540142 525425 522011 515789 523847 528261 525368 516855 526258 527650 515120 509591 488751
9562 488751 493189 508632 495642 500375 490270 477466 467555 456939 451145 462326 461216 475649 491999
9549 491999 493364 503477 518285 520830 518344 510911 497655 484269 486108 470605 441406 445743 444453
9536 444453 443144 448335 442629 434048 427989 426527 431671 419632 415753 418237 434079 447784 461247
9523 461247 475660 468694 466895 474829 476674 488264 490283 469421 454270 445779 442195 438584 424500
9510 424500 428271 424387 434545 448376 449382 453575 451292 449180 438974 437603 435128 430854 436516 435454
9496 435454 436621 428524 432965 421066 412641 403599 392601 392945 397933 399821 400735 411980 425250 437217
9482 437217 432703 428473 440690 442710 443745 442072 438559 444270 446900 434407 428864 433244 434492 432448
9468 432448 442918 458512 460984 456993 447144 431737 413636 417895 423252 417451 426103 431538 426816
9455 426816 431918 432473 437031 439890 442676 444122 448508 459182 471302 483369 501363 510627 508824 526353
9441 526353 543308 564541 573736 574375 587133 603840 594205 579555 578994 580551 578945 588632 590419 587887
9427 587887 579550 562221 555427 549478 554606 563374 556918 550954 553685 558942 573844 576621 567513 570011
9413 570011 584127 588571 592784 598377 629270 656000 680047 702449 710063 721873 727510 742735 770384
9400 770384 780093 802289 811565 824433 816834 807051 817595 810271 804814 802263 791934 762011 755713
9387 755713 739623 721364 717735 719426 724579 732988 744824 760483 771983 785481 784863 785715 787799
9374 787799 776932 769721 775966 803861 837785 853563 861845 872599 873355 875967 873468 873773 884603
9361 884603 902862 899146 896590 896499 891687 884603 877281 884153 907127 912961 903543 877761 863658 854005
9347 854005 842325 837983 829180 830786 843428 848746 849865 857272 864752 882010 893373 909847 911149
9334 911149 917925 935889 966406 984887 995450 995753 990237 985308 980616 975603 977528 977882 970878 962234
9320 962234 958914 952709 954469 954471 957894 951568 944135 951545 966642 966055 973626 980606 993660 1003866 1010652
9305 1010652 1021482 1018205 1024063 1036810 1052426 1063248 1069931 1072758 1076651 1076384 1091422 1104408 1131509
9292 1131509 1164831 1190200 1195799 1200385 1201069 1208827 1214101 1225414 1238542 1256092 1266374 1272088 1277036
9279 1277036 1300991 1322744 1340256 1358992 1374429 1390931 1398653 1409791 1428854 1456006 1478299 1504760
9267 1504760 1522779 1535595 1557425 1582975 1614264 1649504 1664941 1690131 1706478 1724616 1747242
9256 1747242 1772988 1804052 1829481 1869362 1899279 1919689 1946520 1983055 2012353 2041943 2081971
9245 2081971 2128013 2170089 2194612 2216306 2246538 2295642 2332864 2369188 2406027 2435209 2482608
9234 2482608 2523552 2553732 2593198 2652766 2702228 2752867 2803547 2846103 2903028 2962466 3023661
9223 3023661 3081029 3121668 3181736 3248599 3316422 3384636 3457473 3522829 3583559 3660329 3744460
9212 3744460 3821347 3910058 4022865 4142308 4244358 4331978 4430151 4539590 4646464 4750532
9202 4750532 4852343 4949452 5050520 5149652 5272313 5407565 5541004 5685906 5849596 6011634
9192 6011634 6182340 6365267 6550964 6722390 6908456 7128086 7348223 7574181 7802260 8058161
9182 8058161 8310376 8566363 8840364 9130420 9457089 9788388 10121511 10479628 10856908 11261883
9172 11261883 11705736 12167196 12644325 13132178 13640332 14190268 14775980 15383011 16031735
9163 16031735 16722832 17447766 18211176 19025653 19887317 20798308 21763855 22783702 23865602
9154 23865602 25005178 26216501 27483867 28819324 30221269 31701924 33249265 34851500
9146 34851500 36528494 38270746 40055112 41875662 43724129 45575053 47434927 49271261
9138 49271261 51068963 52775425 54379800 55868453 57215700 58373100 59322653 60070799
9130 60070799 60567903 60832206 60845016 60620564 60170396 59501503 58650547 57615085 56425825
9121 56425825 55094717 53667213 52177532 50634273 49043674 47445297 45842467 44247509
9113 44247509 42667161 41133577 39648070 38202722 36811051 35479712 34192622 32950986
9105 32950986 31749531 30601621 29511956 28452145 27450131 26500532 25594494 24723268 23864257
9096 23864257 23059659 22298665 21557505 20849536 20171263 19526110 18896106 18296962 17734957
9087 17734957 17191635 16672280 16164466 15680862 15228060 14787005 14352360 13941503 13563270
9078 13563270 13173410 12805896 12462736 12132110 11807771 11493240 11190052 10893203 10591216
9069 10591216 10321334 10066034 9806578 9556663 9311032 9076127 8847923 8630599 8428663
9060 8428663 8240715 8043316 7845645 7657843 7477673 7304776 7141211 6969055 6802788 6658964
9050 6658964 6513670 6360869 6220156 6093039 5971442 5846685 5719415 5591485 5463083 5337533
9040 5337533 5227797 5129619 5045962 4943786 4832516 4719854 4599562 4510410 4430189 4350590
9030 4350590 4272200 4197074 4106140 4008578 3917837 3841280 3773846 3707579 3643541 3568365 3504526
9019 3504526 3440538 3377499 3321020 3260016 3184105 3112393 3045905 3002872 2959456 2908130 2848293
9008 2848293 2783551 2739422 2687030 2624509 2575922 2534817 2495152 2431888 2391145 2349484 2311732
8997 2311732 2285762 2260874 2222408 2163885 2111685 2089967 2063400 2021000 1989417 1960320 1938415
8986 1938415 1899521 1865680 1830275 1794563 1756267 1732841 1716052 1696969 1659244 1638619 1621771
8975 1621771 1589990 1560187 1533231 1511393 1494629 1481410 1464590 1455830 1435222 1419009 1396397 1372180
8963 1372180 1354651 1336895 1326240 1312821 1302735 1289043 1279230 1257439 1243897 1229292 1215065 1187607
8951 1187607 1169327 1154594 1143021 1124986 1121763 1114361 1094738 1076422 1060310 1052843 1043877 1037463
8939 1037463 1034590 1018079 1009053 989107 959623 945279 934380 931220 942273 953208 938397 901870
8927 901870 887125 884784 876293 869492 867367 858935 842748 832931 823989 827373 830008 816903 793958
8914 793958 791472 790123 773901 762434 763291 763169 753287 747835 735005 724363 716783 721533 731313 722302
8900 722302 708279 700175 686176 680304 670074 651557 652531 658407 653747 635799 620043 615763 609235
8887 609235 603161 599299 599382 604499 607004 616012 616164 610567 594654 582195 586087 599250 600982 597011
8873 597011 589940 592786 586983 596560 617027 638119 660933 688076 752712 857370 982969 1096936
8861 1096936 1150627 1180671 1201522 1242782 1232265 1109539 933229 790417 700087 654018 614864
8850 614864 576065 559540 561437 560764 549781 534502 524535 513414 503002 477316 455342 459074 462446
8837 462446 453849 428583 415143 411106 418746 414134 400597 402879 405468 395516 390743 389332 387273 379162
8823 379162 369953 368036 370083 353581 340204 349576 344936 348345 353327 341852 323596 317614 327371
8810 327371 328688 335359 330256 322235 311009 300173 296065 296682 294856 293362 296192 287261 292719 312998
8796 312998 318798 311723 304167 293543 277410 274873 268587 271703 279900 286277 301752 292010 283831 280407
8782 280407 277919 272810 258783 255755 252668 264134 270328 263038 256242 255202 247300 234593 242356 252032
8768 252032 264568 265602 276207 272764 262579 241167 230509 229036 230885 230625 233906 240191 236025
8755 236025 237816 246303 247057 235385 226481 225451 228936 225864 224501 224754 220612 213060 206103 206657 207977
8740 207977 200754 188710 192302 197858 193145 193145 203342 217275 218728 214095 211819 220603 220499 206376
8726 206376 199927 192597 183399 172239 175020 179754 175058 166746 170218 174174 173128 180332 181976 188034
8712 188034 195277 202717 207456 204379 194828 180082 181269 189800 190164 204978 199911 193034 192889 190875
8698 190875 187314 194654 186247 174475 170742 178205 179696 185520 184240 165737 147570 137167 126252
8685 126252 125487 130047 147063 140782 129120 140064 155818 155300 173489 193074 194133 175769 169977
8672 169977 171524 155542 147220 140097 147941 144477 147069 148719 144185 138722 141913 126667 129388 137592
8658 137592 142579 154920 161378 146359 125245 125493 137411 139320 132214 132722 153766 161451 160322 165403
8644 165403 162995 159153 158354 160546 164377 163819 167673 167030 148983 138831 148456 152736 161572 165713 163759
8629 163759 157586 139686 129208 131224 141794 134318 136518 144881 149543 150430 145211 135888 139972 137505
8615 137505 133991 126059 133228 143908 143561 143890 144385 138702 128159 126786 132282 130077 130342 140292 150384
8600 150384 161603 167295 156638 160697 171942 171116 176270 190751 191290 198205 181108 170876 163311
8587 163311 164042 175273 172706 164827 161855 169372 185037 189009 196842 198865 198026 178025 164163 159032
8573 159032 158801 148112 147011 143267 142122 130297 119342 96376 88990 96773 95963 103525 102539 108243
8559 108243 109601 100413 96095 98724 104671 110003 110696 106502 106175 119852 128335 119905 113453 100464
8545 100464 88909 86676 80312 81273 74166 72961 79107 99933 113927 107964 107668 93812 100262 100482
8531 100482 94951 84229 84870 87003 86346 93274 90278 87839 90910 98119 91518 91713 86142 90484 80086
8516 80086 80798 85088 79886 80520 81090 92100 98728 105709 113551 115166 114233 122446 124326 115934 102586
8501 102586 122068 130252 132647 123268 117365 119457 114924 109720 103925 98020 112420 118566 124082 123536
8487 123536 125766 123572 136224 150930 146905 133074 138633 138174 124505 103683 97516 94985 98349
8474 98349 88470 78714 64433 42824 38708 53609 71743 81156 96154 110504 106185 101119 100756
8461 100756 110139 108139 106897 111911 112619 107339 97097 84429 76258 71153 76317 85001 76480 54769
8447 54769 53400 65591 75690 84079 83489 83024 74290 72434 76962 69549 68989 79291 85142 88432 74136
8432 74136 67842 68493 65034 58790 55005 56131 50197 49355 58612 70560 81046 68629 67012 71578
8418 71578 81143 73263 71472 74103 86080 94236 94630 80311 76658 74226 62933 46537 48414 50960
8404 50960 61164 59689 62197 60395 55787 54118 51598 58723 60276 70080 86109 73033 51643 48365
8390 48365 64251 63992 62089 68342 59838 56692 52106 48958 57931 62473 56807 65753 51152 42393
8376 42393 38057 47308 64585 68280 65200 61410 68447 72116 69666 62998 67806 69896 78935 81113
8362 81113 71617 66555 63381 54144 46682 58755 61738 64530 74684 82278 72715 77609 73929 57067
8348 57067 52391 44099 41429 44377 56355 65724 66739 71675 76809 88652 74839 63543 60215 61719
8334 61719 70043 72783 66086 70719 67637 59866 59513 59544 59132 66017 66209 51601 43301 48401 49013 48222
8318 48222 58630 56983 33022 41643 52037 45909 45906 31476 35493 38658 37144 42038 39259 41237
8304 41237 36068 36852 32489 46819 58600 55986 49826 57615 53728 48284 51473 61027 53675 39428
8290 39428 32029 34156 33152 39634 59518 73940 63650 48404 55749 56747 52686 44442 37421 40558
8276 40558 39087 49538 49427 42642 55394 62159 69657 61986 59090 54511 52270 46971 51453 55490
8262 55490 52779 44151 46551 60449 55677 35662 36355 42908 42658 31695 43425 48989 52082 47462
8248 47462 51545 52382 45527 41766 39576 46984 43125 32158 31535 28868 37925 46649 52546 55613 51441
8233 51441 51185 49243 63705 72951 66604 62589 54695 44079 32730 23311 19074 20110 31090 32812
8219 32812 33365 21946 24152 28999 20916 21186 18230 15500 3627 14875 19261 18033 17927 7155
8205 7155 7387 3263 4673 -5475 -19275 -4700 3317 -3735 11303 25871 36127 39275 36323 45936
8191 45936 35147 27108 11570 4425 -530 3798 30403 41612 28553 23638 34434 28350 11766
8178 11766 15734 10562 9515 9715 10022 20496 31311 57401 75767 80710 84529 92914 97921 96578
8164 96578 91715 94113 98438 89201 80462 64002 36631 16024 10796 10892 7965 10224 12616 9730
8150 9730 18551 24747 42042 53901 48458 40238 30748 26819 18845 22657 37420 36640 23623 13163
8136 13163 9893 18725 24223 28929 30899 15767 6866 12134 3412 -1070 6336 7575 8064 7613 14675
8121 14675 25585 31922 33187 39975 28603 12081 406 -4694 -15385 -10859 7670 17787 18944
8108 18944 22619 40554 34657 27359 21792 29500 40416 43221 47686 44589 35290 32989 28308 20741
8094 20741 17573 18115 26829 11635 1251 12015 13405 15585 12975 19589 17009 19899 23812 42809
8080 42809 43349 20639 12050 18221 21787 16773 12589 20392 36695 37313 34101 32055 18484 36314
8066 36314 48701 49405 50897 50545 38561 31364 26968 31813 46775 44000 35532 29430 32451 32091 18330
8051 18330 19930 29283 27128 25495 17854 27003 26748 23308 24787 28337 19317 19101 23427 22886 14529
8036 14529 10416 7900 9518 27089 21419 11377 2202 9177 23491 28922 25578 21423 35370 39321
8022 39321 46465 43611 42929 45823 53240 57620 58108 49116 38756 40633 47678 39922 38565 27524 21763
8007 21763 4774 -6601 5480 19017 30075 31306 40139 39559 37392 43100 36819 29259 25085 25949
7993 25949 22483 18720 21113 20345 14111 33435 46589 53351 54102 54688 45755 45817 27672 17120 22820
7978 22820 16999 20838 22994 23619 25351 21484 23234 25801 28427 34656 46356 44475 37726 39436 23787
7963 23787 16084 24395 31697 35947 36498 40576 43039 38586 40521 35009 39335 41712 47533 58370 51088
7948 51088 30933 29269 33913 36898 28872 29074 34507 41204 45736 51022 41100 37596 38249 39862 48697
7933 48697 63521 54146 36667 36311 34174 44671 46592 35281 42113 42926 35594 37256 38965 24035
7919 24035 24152 30163 28953 25636 24323 33326 35037 29304 27572 27582 30809 38815 32089 40219 56712
7904 56712 52701 47327 50402 57091 64491 52963 54554 45349 47339 47858 42189 45064 49520 48188 44988
7889 44988 36130 34904 31229 32317 33424 19538 16313 14000 17542 40016 39139 24071 13679 16015
7875 16015 23124 14517 13167 19782 27321 28519 32793 36641 35413 34841 28072 19940 9162 5760 2263
7860 2263 -7245 -9535 -36 14822 31966 26202 8564 4560 8288 18670 21560 6502 6232 -1135
7846 -1135 -9955 1551 13370 2640 11180 9725 6646 7293 9781 23064 30565 15828 15804 29778
7832 29778 32705 29704 38468 35510 34998 23243 16383 9537 6903 742 9095 16404 15612 2477 -36
7817 -36 3499 9108 8274 -4060 -4788 -3468 -7312 -4405 -913 -11459 1189 4794 921 -440 8251
7802 8251 -603 -3030 -4886 598 19228 17155 8633 1224 422 948 11011 19206 21929 8535 -1399
7787 -1399 11370 28077 22598 4019 185 4677 7453 6928 -8905 -24799 -37743 -34839 -16537
7774 -16537 -8562 -3344 5963 12331 21077 17781 21437 12181 344 647 738 -1186 -1107 4507 4989 -45
7758 -45 -4826 -4363 1549 -906 6031 12221 10211 1209 -10310 -6628 -2341 4516 6943 12029 5307
7743 5307 6458 9121 5013 5358 14600 7260 -7193 -7862 3876 5740 4441 11029 -5290 -5863 691
7728 691 2927 8008 21682 31876 24533 16898 7711 834 -3275 -6845 770 -930 3821 8662 9376
7713 9376 6509 3964 -1073 11162 14198 26270 35469 27289 14436 14929 6066 -66 -1435 8531
7699 8531 2743 7272 1537 -4000 7135 10057 7373 15774 12348 -4343 -5899 4084 7770 10555
7685 10555 9868 7479 1917 -9238 -11320 -9399 -10724 -15704 -11985 -12874 -16029 -10942 2633 11930 15834
7670 15834 6754 13000 6881 6397 -1285 1159 14053 18968 8837 7 -1967 -10917 -13012 -7200
7656 -7200 5890 12475 7454 13505 18268 21991 26334 29030 23968 15907 8182 5014 927 788 -479
7641 -479 2823 1727 -7469 -15408 1915 15505 12353 7543 11112 17442 12698 14433 19256 21481 14146
7626 14146 18719 11041 4997 13544 6227 4898 7522 8361 11707 7347 -5911 -17835 -18782 -11710 3279
7611 3279 10013 128 -10236 -14236 -191 15740 22014 21850 24666 25967 13197 10494 21865 17227
7597 17227 9399 10692 13070 18286 14765 16348 27793 30901 16520 7862 14828 23955 18535 16914
7583 16914 20277 11322 -3931 -5661 12074 21374 13720 5507 10077 5645 3684 15329 13804 3400
7569 3400 -13290 2511 19291 31129 25063 -728 -3050 4205 -2692 5036 -352 -2267 -6748 -20084
7555 -20084 -25605 -17046 -2318 9748 10880 8300 -388 4276 -2300 3370 14071 16726 4839 -5971
7541 -5971 -4006 -2268 -2638 -3918 -12032 1409 347 -3916 2286 -1025 1038 -2077 -3059 -2705 -5130
7526 -5130 -11137 -8946 8439 14552 12594 6221 1448 46 -13792 -1183 5153 -4270 -4371 6995
7512 6995 2246 10713 4971 2940 -3635 -6487 -2585 18841 34820 31094 14864 3245 5003 115
7498 115 -11088 -3181 -3783 -4674 -2117 -5770 -3249 6713 13430 3302 11353 18732 7894 -1351 214
7483 214 1565 8149 17324 15528 13604 8910 11629 6465 -1189 -15791 -7925 13117 27407 30283
7469 30283 13260 6914 11401 19034 7944 -7407 -9120 2113 12916 18712 13852 12636 12306 15947
7455 15947 11912 15846 19494 9727 4656 2086 11841 12233 7504 14426 12682 6755 -15654 -14972 -6027
7440 -6027 -6350 -2743 -7427 -8641 -11826 3565 427 -11952 -13591 -8294 -7550 -8389 -10371 -29232 -30327
7425 -30327 -27193 -25566 -26526 -13683 3890 18909 17877 16021 18472 28808 25300 11789 9692 11975
7411 11975 18590 12469 24166 31823 23939 17611 5212 102 -6929 -19082 -20784 -14844 -9732 -2844
7397 -2844 -1072 228 -2723 -7320 -1973 -7731 -16982 -21873 -11845 -10381 -22464 -25419 -16366 -20045
7383 -20045 -28618 -26102 -15842 -17758 -11801 -557 7245 11916 9384 3727 889 6197 17522 19044
7369 19044 10546 -887 2947 9029 11476 7036 -2510 -17420 -25843 -20314 -7660 -5851 -5609 2552
7355 2552 10980 8359 1316 -4434 -8924 -15281 -13690 -14161 -8463 -4156 -14516 -14430 -7614 -4219 -1808
7340 -1808 -6116 8756 20209 2202 -3971 -5599 -10650 -23776 -19441 -21927 -19370 -20747 -13943 -6575
7326 -6575 -8147 1420 7070 -2601 -11162 -18155 -20371 -25020 -20706 -9861 -8571 -12488 80 -1192
7312 -1192 13257 21872 19711 12557 4685 -4777 5096 1703 -7234 -1459 -5472 10901 12919 7459
7298 7459 13651 13014 8172 10170 7827 -2569 -8234 -7183 -6960 -2518 5393 11757 5603 -3746 -258
7283 -258 8150 8576 20418 31234 27858 23017 34702 35495 22622 11992 1835 279 1145 -2535
7269 -2535 -67 8399 14589 4626 5088 11586 25123 35925 15876 -1519 9744 2783 -5852 3488
7255 3488 8178 -2773 -7202 2992 1308 -13121 -20362 -28059 -20337 -10211 -13980 -15491 -2728 625
7241 625 0 5178 6674 14728 10984 10738 1957 -12321 -15127 -7110 7551 3894 5876 6324 14836
7226 14836 24146 17140 12883 11511 -1073 -6018 -1128 498 -5941 1632 12720 10365 7746 9180
7212 9180 -574 3105 11037 9281 1449 -6788 -14398 -10109 -1096 6281 10351 -13174 -19352 -11131 -7355
7197 -7355 -5365 -1011 15811 25509 18619 9428 -6421 1564 9770 -1339 -5260 -726 67 -15655
7183 -15655 -17657 -6086 -3756 -257 -4789 5068 13238 6514 -2282 -5060 3133 8946 -94 -6858
7169 -6858 -7410 -4630 -16226 -22712 -18472 -13468 -7913 -5122 -9481 -14766 -14431 -6888 4123 -1353 -21434
7154 -21434 -20949 -4354 -10898 -10630 -12649 -10716 -11696 -9081 -14554 -11374 -9212 804 14009 25157
7140 25157 27319 33240 20325 15455 16583 12821 -1666 -26487 -31339 -18066 -16147 -22508 -19660 -12880
7126 -12880 -10740 -11006 -2903 -1298 -9480 -12931 -9823 -14801 -17143 -8665 -5944 -9117 -19992 -34889
7112 -34889 -29676 -7108 -1595 221 -6469 -9403 -8228 -12385 -8576 -3758 4152 87 -4907 -8451
7098 -8451 -9909 -9879 -13900 -17807 -21681 -25167 -19875 -17677 -13300 -13214 -6231 -10881 -11320 -10736 -18076 -20211
7082 -20211 -17786 -16128 -16120 -24406 -28105 -9764 4253 3864 -12575 -24374 -39778 -31333 -11307 -1548
7068 -1548 6746 13511 9122 6212 1712 2444 -1368 -5372 -10218 -18397 -17573 -12490 -11906 -19457 -16530 -11160
7052 -11160 -10667 -2395 -8391 -17020 -24707 -14794 -8796 -4663 -1556 7357 26234 28041 16000 -1479
7038 -1479 -8841 -28388 -20369 -5551 -7128 -8794 -19514 -28207 -24800 -18653 -4770 -4415 -3832 -8378
7024 -8378 -17343 -11865 -6955 -3598 -1176 -3703 -6265 -12106 -8377 -3151 7697 19579 14742 3262
7010 3262 1463 7626 9950 -2960 -21164 -11754 5560 2156 -3670 2073 6197 10720 4018 11631
6996 11631 16958 19913 23764 21153 5554 -9452 -7830 7929 8016 7601 5440 -2504 3362 15573
6982 15573 13215 1691 3175 10550 6165 1767 -2235 586 -2464 -2663 -1837 -1480 -4627 -7853 10030
6967 10030 18892 18583 24439 26545 13627 7140 7255 -5460 -7811 8971 22040 14606 8152 -3132
6953 -3132 -5047 -2244 1933 4894 8898 716 -4300 1102 1720 -7643 -3704 3931 -9006 -20392 -16792
6938 -16792 -10883 -19728 -27535 -27377 -21385 -16894 -8022 3346 9221 -2107 -13681 -14553 -11531 -4834
6924 -4834 -11725 -19217 -30530 -25030 -18567 -12538 -8651 -26252 -25044 -9312 1864 -10560 -4979 -10718
6910 -10718 -12051 -13155 -16663 -18027 -19711 -24875 -17010 -6530 -1068 -13310 -19596 -31313 -29841 -26271
6896 -26271 -22973 -17057 -8631 -13102 -3097 2221 1049 -259 -12430 -12550 -2692 1222 4714 -2354
6882 -2354 368 -2254 -5006 -2494 -3079 -760 -2150 3834 9160 12321 10716 7192 5536 3781 -13485
6867 -13485 -23472 -32526 -25448 -35828 -33106 -14528 -4067 -7121 8072 -2051 3079 12713 6
6854 6 -17569 -32124 -27267 -3639 11513 1806 -4680 -5149 8573 11303 15370 22572 23355 13294 459
6839 459 -12864 -5698 -9274 -14275 -6585 -5800 -3180 -6290 -5055 6977 -4735 -6553 6862 22420
6825 22420 16366 21316 36330 27221 11921 15103 29182 25419 8249 5272 17074 47323 56676
6812 56676 47572 47510 41589 46405 76027 79870 53320 24474 12498 10331 14263 10190 18339 13749
6798 13749 -6348 -15506 -11729 5810 22233 13290 8311 7788 3385 10881 12389 8360 5959 13144
6784 13144 13242 10495 -13813 -26544 -15061 -19102 -13171 -1797 2821 2424 -2547 -11238 240 5815
6770 5815 -11287 -6990 -5974 2011 3232 -4615 177 3280 -4456 -6714 7390 16379 -3436 -22496
6756 -22496 -11752 -12788 -23664 -9158 -966 -1803 3495 9181 7082 5264 -758 3659 14584 10500
6742 10500 7544 2077 7727 19623 20062 11822 12857 17621 15919 17031 1011 2345 -2069 -7912
6728 -7912 -13949 -10679 651 4349 9742 25355 13470 5132 10141 3534 18765 23858 41065 40382
6714 40382 34054 47128 44803 52216 46309 36526 31299 15047 1586 8380 802 -988 -4 642
6700 642 -957 -3704 768 -1163 -7796 -14133 -4198 2758 272 -2548 -16818 -9626 7518 12655 -1905
6685 -1905 -11341 -20922 -19351 -9705 -2741 -2286 7868 570 -10686 -18783 -15722 -7566 -7274 -18733 -19832
6670 -19832 -18820 -7013 -4033 -14134 -20267 -18834 -25261 -29485 -16805 -17903 -24872 -24234 -10482 6106
6656 6106 6975 -2141 8175 9365 1593 5665 7326 -14 323 6345 -4291 -9159 4854 24399
6642 24399 18877 9871 17817 22996 14271 -1269 3114 6383 12854 9431 16146 23240 15358 117
6628 117 11335 2377 -7117 -8726 -1562 16008 15367 8441 3339 1220 -3436 -927 3843 729 -4724
6613 -4724 2552 -2259 -16014 -5864 -4069 -10765 -821 7507 -3402 -13050 -16082 -1521 -2379 -12238
6599 -12238 -13499 -4632 -3826 -9430 -11504 -6131 -14376 -25275 -29907 -19602 -4064 3622 -9127 -26835
6585 -26835 -22013 -1163 589 2738 -6456 -9436 -16297 -12238 1377 11760 24158 30640 23433 16341
6571 16341 -5068 -16281 -28744 -23091 -11257 -11705 -18863 -16403 -25399 -28316 -21573 -22919 -22233 -14484
6557 -14484 -6820 9964 25732 9926 -14886 -18693 -7293 1504 -1516 -3326 943 5820 13693
6544 13693 -1342 -9521 -20481 -30631 -22324 -27406 -30253 -13007 -14576 -24178 -23462 -20243 -12142 9806
6530 9806 -254 -9805 -9901 -9628 -13469 -6655 99 15084 18578 11139 5488 3117 4544 5595 -3031
6515 -3031 -4105 -9149 5571 17281 25770 26231 12618 -8177 -10722 3396 566 1259 6931 14247
6501 14247 14628 9574 7291 8369 7476 9996 12343 -1439 -8714 -17640 -25613 -14137 -2267 -9327
6487 -9327 -11440 -2496 -8256 -4649 -396 7785 18856 8881 -4153 -13558 -18335 -13064 132 375
6473 375 -6947 5068 6695 390 2210 2810 -11476 -20450 -19956 -15204 -4018 -3208 -9210 -11292 -9524
6458 -9524 -6309 2151 6096 8866 14107 -1222 -26161 -22614 -10251 5077 8506 9168 2600 -18046
6444 -18046 -20483 -9796 -5186 -18190 -16743 -9318 16311 29750 22830 2536 1482 10724 18457
6431 18457 34599 28378 15544 4070 -6499 3260 4147 -2702 344 7337 3258 -6625 -12937 -13453
6417 -13453 -17052 -13755 -19056 -27143 -23564 -11303 -9680 -8139 -2811 5283 8761 11899 9053 154
6403 154 -9670 -24595 -15419 -10283 -3008 2500 -252 -1296 2224 3848 6422 -1002 -5397 -14359 -16126
6388 -16126 -5066 7002 1487 -9542 -961 3901 2259 -1660 -12917 -18472 -9135 -10018 -14509 -15114
6374 -15114 -17909 -8807 8364 20833 12615 3262 1679 10279 14414 4464 15580 11659 19352 16214
6360 16214 9198 2053 -6212 -8303 -3363 -1793 -4458 -24161 -23272 -23109 -28911 -17566 -17730 -6589 -3043
6345 -3043 -8505 -8175 -3520 4539 2050 2459 -5163 -13621 -20205 -13387 -13942 -35843 -40502 -34740 -21795
6330 -21795 3740 13077 1234 -2043 -9976 -9700 -3890 -9752 -19534 -17624 -14687 -2991 10554 12788
6316 12788 7864 10777 -391 -5175 -290 -613 -6786 -11408 -23516 -27814 -25225 -21884 -24443 -19374
6302 -19374 -22819 -28943 -30211 -24930 -24908 -20069 -13517 -22922 -17950 -5940 -6186 -9292 -7857 -5100 8154
6287 8154 7860 -4634 -17181 -22269 -25138 -27817 -22301 -14578 -3551 -18370 -29637 -23154 -14676 -17780
6273 -17780 -26311 -21405 -9832 -4396 -14138 -24472 -29756 -17805 -10164 -10729 -7329 3201 14485 6036
6259 6036 -8986 -5289 -2312 -21969 -18383 -19382 -27230 -29129 -10518 -7836 -8321 4935 18751 23322
6245 23322 21179 17618 6767 7892 10182 4474 150 307 1486 -978 587 -6826 398 12701
6231 12701 1426 -17827 -9202 -7909 -15219 -7118 -11261 -2890 -532 -939 6457 478 -13951 -4971
6217 -4971 8083 17689 8608 -7022 503 2568 766 2278 7618 4354 -4328 6660 4246 -4529
6203 -4529 2815 1155 -142 -5187 -9057 -7239 -6259 -6019 2725 4213 2901 -2242 -9298 -10620 -12331
6188 -12331 -19135 -19565 -13291 -2914 -2857 -6238 -15691 -20659 -32371 -27104 -17102 -20559 -14159 -20018 -16583
6173 -16583 -7995 -4484 -11086 -8395 -9670 -11165 -14470 -20601 -25565 -29031 -18425 -18685 -11519 -8658 -14698
6158 -14698 -12118 -22793 -23818 -15844 -14226 -2794 621 1860 1001 -1613 7437 9866 -87 -9908
6144 -9908 -10358 2728 8176 13735 16344 4486 -10689 -18912 -12326 -9529 -13433 -14039 -20745 -10505
6130 -10505 8415 13179 4550 862 -784 -4230 -17056 -22202 -16250 -5112 -9760 -6159 -7376 -13871
6116 -13871 -10538 -16728 -12437 -14498 -26671 -24899 -21117 -32100 -25773 -17315 -19284 -20247 -16145 -18156
6102 -18156 -19128 -10577 -17270 -29616 -16451 -8008 -20837 -19705 -12957 -14277 -25558 -38333 -39886 -32269
6088 -32269 -20379 -9275 -12926 -24387 -14685 -4208 11780 9137 -1832 -15879 -14411 -17593 -2988
6075 -2988 -1005 -6647 -7587 -9003 -4124 -820 1975 11292 20260 3310 -8517 -15755 -20082 -17326 -15036
6060 -15036 -14382 -6453 -8521 -12656 -15598 -15000 -18115 -12030 -3514 -3828 8072 -84 -8188 -21153 -12053
6045 -12053 -4217 -10795 -16045 -14185 -21169 -22563 -19570 -25769 -30735 -16003 -5502 654 9958 11725
6031 11725 5358 4945 2597 -4838 -1423 5982 416 -4538 -2033 3356 858 -10294 -18739 -25986 -22947
6016 -22947 -10813 -9262 -13065 -2604 -2551 -8798 -12281 -14395 -13985 -17765 -16759 -29029 -29610 -23848 -23785
6001 -23785 -11287 -4053 -6731 -554 -12355 -24685 -27913 -24416 -27413 -21360 -16485 -16866 -15116 -11361
5987 -11361 -18448 -17118 -11722 -13527 -4133 -6200 -11485 -73 13955 2757 2648 -1202 -7611 -7226
5973 -7226 -15698 -7629 -5149 -4301 1763 2790 4016 7644 -3534 -26651 -23258 -9760 -825 15437
5959 15437 25255 14327 1318 -6346 -4744 -2650 1113 16152 8515 -9072 -9214 -13215 -19437 -19017
5945 -19017 -22314 -19604 -9476 -7607 -7965 -5378 -16460 -14998 -5201 -5747 -13329 -21021 -21969 -14137 -6306
5930 -6306 -6486 -8583 -6849 -20422 -23942 -29414 -34632 -17099 -12102 -17899 -20729 -13177 -4731 -19378
5916 -19378 -6081 3812 -2098 6387 10339 -5452 -11039 -16925 -20611 -21394 -19618 -20292 -19717 -16546 -4856
5901 -4856 18847 31614 18138 -2276 -4117 -1315 4709 1632 -10908 150 10828 10877 -11671
5888 -11671 -10285 -9762 -8861 -8758 -4709 -6238 -10435 -6925 -21757 -23332 -14692 -12625 -13974 -1530 -11369
5873 -11369 -24882 -24083 -25963 -34324 -19817 -5861 1584 2589 -8199 -13730 -23320 -18018 -8843 -10103
5859 -10103 -4342 -10119 -10770 -8054 -18153 -29005 -24989 -23322 -13162 -7073 -12284 -6854 1223 5304
5845 5304 11791 14269 -610 -17068 -16083 -1051 9 -591 4770 -2028 -7255 -18445 -29034 -23297
5831 -23297 -4885 -5526 -13022 -18482 -20796 733 10531 1349 -12696 -21407 -13939 -22998 -27988 -16273
5817 -16273 -11107 -7791 -8023 2428 3772 -5556 -956 3192 13291 8497 2069 -3306 -21424 -22114
5803 -22114 -19064 -29087 -21998 -8925 -6654 -7226 -9419 -26000 -32346 -26935 -17710 -24558 -21140 -19426
5789 -19426 -24638 -36549 -21104 8054 -5258 -25467 -25461 -34328 -39706 -39689 -40588 -28416 -21802 -10204
5775 -10204 -5502 -13034 -16333 -1601 6706 12302 20957 23073 16462 -2052 -23068 -27611 -22895 -16114
5761 -16114 -11536 -4969 -1601 -2234 -7647 -36214 -37534 -19509 -15528 -4506 5139 9987 18196 22577
5747 22577 20736 25355 21017 17896 18450 12370 4256 7558 -6410 -16097 -6870 11159 13795 1070
5733 1070 -2542 139 -10299 -17253 -11301 246 -304 2956 1776 -7467 -2814 998 3991 11261 10948
5718 10948 -874 -8093 -6301 -1514 2224 -4370 -25039 -21962 -10265 -4747 -4834 4878 15728 10127
5704 10127 4142 -1042 -10018 -16340 -18314 -8236 -5371 -6495 -6295 1242 17652 34853 37280 21878
5690 21878 8685 10139 15486 18067 9555 5841 4253 4676 274 -2849 -2495 -6085 -11135 -7742 -14681
5675 -14681 -20377 -13307 -7122 2093 2422 -12427 -16405 -6465 -9037 -18384 -25905 -31572 -28991 -24603 -21582
5660 -21582 -28872 -19821 -20494 -17248 -6326 -12128 1971 -12452 -26989 -33534 -23511 -22595 -30731 -26989
5646 -26989 -20211 -18620 -19383 -20691 -20526 -9470 -6516 -23842 -24685 -32523 -40153 -32782 -20577 -24545 -13006
5631 -13006 -2928 -7822 -7368 -14118 -16505 -16055 -2406 -3825 -344 -151 -1349 -14200 -10971 4297
5617 4297 2978 -7251 -14217 -8473 -5694 -15257 -15762 -23716 -33437 -30941 -20026 -8794 2765 -5315
5603 -5315 -16503 -17668 -15623 -16391 -13653 -17512 -19789 -15610 -12201 -9514 -16620 -16057 -5271 -5657 -11290
5588 -11290 -4985 7581 10831 -987 3114 -1363 -6900 -12987 -16965 -31338 -32662 -21668 -11133
5575 -11133 -6199 -18043 -15647 -6210 1123 -7999 -6321 3152 -501 7595 -2062 -10579 -21246 -21964
5561 -21964 -12166 -7665 -4559 -641 2662 -11623 -14452 -8887 -9022 -11104 1 418 622 -10014 -21540
5546 -21540 -21121 -15712 -9648 -10850 -16830 -21564 -13680 -9675 -8442 -9262 -24815 -40689 -46371 -42183 -32877
5531 -32877 -8367 -476 -5581 1937 11738 7656 7293 3696 8093 6064 7996 -4505 -9473 -19127
5517 -19127 -19136 -4082 12390 18656 -7189 -6624 2691 18708 17319 1855 -3377 -6120 -1701 6214
5503 6214 -118 -9158 -21965 -28448 -5707 12162 3212 943 2456 -3178 -16059 -9364 2120 14087
5489 14087 13439 4866 17502 21494 13799 7003 5904 -508 8632 12421 2716 -639 -5 12084 18330
5474 18330 9591 6926 17556 12042 -4267 5420 8802 8258 6378 -996 1440 2956 16045 16408
5460 16408 13160 16348 -463 -8239 -5766 2656 2086 -489 -23467 -24376 -13758 -13084 -9233 -23653
5446 -23653 -25135 -15145 1889 9374 2442 -2238 -2388 -4461 1846 7927 3339 -118 11164 16997
5432 16997 7176 14664 20643 12017 -4301 -6968 252 837 1884 -5870 397 -9600 -17215 -12818 -10244
5417 -10244 -8147 -85 -1763 2456 -1559 -19641 -26363 -14950 -3085 -2055 3402 6429 7109 3003
5403 3003 -3043 -21891 -30783 -25818 -14951 -4391 -2628 -8549 -4448 -2033 6472 11135 7768 6542
5389 6542 4574 3590 8345 6126 7756 5520 5489 3984 94 1825 7808 19849 14584 4023 -3021
5374 -3021 -9687 -13204 -19173 -19253 -12170 -4252 -1884 4174 3475 -3957 11535 20479 21974 26731 11988
5359 11988 2809 5693 -6646 -17027 -10837 -3240 -1562 -9595 -20203 -15285 -4771 -16085 -14966
5346 -14966 -13598 -19231 -25256 -16057 -12378 -13398 -8565 5146 427 -10812 -7360 -22346 -25604 -17773
5332 -17773 -15106 -4936 903 4125 -6624 -22903 -32924 -30623 -22437 350 8411 -1210 -5392
5319 -5392 -2998 -6902 -12805 -9166 1457 -4278 -3024 -8948 7014 -10600 -19991 -14987 -2500 7370
5305 7370 5732 1383 -6790 -12524 -6502 -510 4329 947 -7114 -5004 -11767 -14367 -10003 -8031 -16089
5290 -16089 -5271 9199 5230 -5944 -14876 -15127 -20747 -11361 -10108 -4268 4073 8315 8212 1697
5276 1697 380 5328 8182 2251 790 -8030 -13510 -6870 1213 5571 6762 10347 -1182 -4957 -4430
5261 -4430 5051 6182 7164 4849 14768 13735 15468 21852 20710 19631 2732 -7078 -12292 -8940 1249
5246 1249 1913 -786 -11777 -24047 -22262 -27740 -18722 -22516 -16934 -14632 -8948 -3642 -1451 5130 7918
5231 7918 6269 -6312 -17354 -23684 -24737 -27515 -29708 -29219 -21062 -15705 -20313 -24818 -21651 -19100 -17461
5216 -17461 -12961 -7800 -6407 -156 2810 4481 12275 17201 6113 867 8007 6818 7050 10086 10082
5201 10082 10252 -3867 -17386 -4769 5411 8284 -4095 -11350 -16489 -12126 -14652 -24781 -21328
5188 -21328 -8004 -4788 -8075 5036 4528 2010 15581 6439 -17374 -16949 -11750 -13811 -14295 -15374
5174 -15374 -21320 -17986 -7912 -157 13447 12709 -2333 -8925 6885 21788 6968 12315 17304
5161 17304 5634 -5459 -9034 -5342 5164 13633 8016 8447 7057 -12958 -25075 -14596 -2590
5148 -2590 -802 -18780 -21280 -7527 -1632 -88 -905 4296 6822 -6501 -14286 -15842 -10354 -3139
5134 -3139 8556 5294 1223 237 -4188 -12582 -12751 -9482 1163 938 -745 -21203 -31613 -26656 -14699
5119 -14699 -19860 -15252 -10797 -8922 -2742 -8540 -4966 -762 7152 2036 5383 -9610 -21289 -10634
5105 -10634 4724 -1383 -13914 -24362 -19655 -9252 -12360 -3477 3119 8552 -10123 -15158 2404
5092 2404 8696 1534 11602 12578 759 -2946 -8730 -14016 -18603 -14367 3699 2461 -4231 -19362
5078 -19362 -18010 -7647 -2637 -4347 -6640 -6838 -12264 421 4656 2431 12505 18666 7265 1684
5064 1684 4481 -5453 -12257 213 -11467 -12490 -4271 -19009 -17930 -21737 -21641 -8971 2161 -11604
5050 -11604 -16386 -1888 1211 1317 4709 7359 7100 1605 -4627 826 -112 -9155 1087 4075 -3463
5035 -3463 -3379 -3455 -2836 -2082 -8905 -7118 -10277 -15551 -8544 -1137 -8975 -17578 -11346 -8725 -18242 -26427
5019 -26427 -20568 -14712 -15444 -11924 -6042 -8512 -11996 -16460 -26765 -16464 -8064 -4785 -13196 -20075
5005 -20075 -24270 -25632 -9444 244 -9707 -15899 -15509 -15378 -25325 -17486 -10306 -18414 -22103 -21906 -21384
4990 -21384 -18395 -10078 -12557 -13963 -4919 -329 -12866 -15022 -11757 -13936 -8349 -1719 3666 14986
4976 14986 15141 19529 7024 3558 11604 22092 33153 39692 16748 7300 9349 10650 6639 2941
4962 2941 13293 22217 20717 13211 -5336 -5565 5819 16687 25982 26250 9818 -6273 -18898 -29508
4948 -29508 -29480 -23632 -25194 -28194 -25669 -9066 -2895 2102 4973 -7543 -12813 -21790 -21859 -19321 -4690
4933 -4690 -403 13227 6035 678 -6515 -10628 5991 -1247 -6258 -136 -1530 4030 2701 3484 13776
4918 13776 24667 26198 21718 22247 36070 27832 21550 15335 5925 11543 14059 13961 13702 4032 -7877
4903 -7877 -15286 -20771 -9591 -17488 -18200 -2250 4756 -4653 -10275 7720 16866 18559 15580 13512
4889 13512 1059 -10628 -17781 -15831 -11651 -8912 1374 6246 1716 -3671 -3884 -6199 -10508 -5272
4875 -5272 4014 2909 -1198 -131 -5095 997 13224 24317 18776 7435 12326 -3438 -3639 -5968
4861 -5968 -10851 -13815 -15818 -19492 -17987 -12976 -13547 -11212 -6869 -4964 -7572 1117 3159 -1501 -7873
4846 -7873 -4592 -15402 -16814 -13365 -8312 10742 8793 854 -11214 -25933 -18623 -10438 -13393 -12119
4832 -12119 -8700 569 584 -7956 -21194 -26172 -23127 -22141 -13416 -1658 -10274 -6745 -9629 -4314 77
4817 77 1059 -5092 2618 17229 19058 14514 17842 11074 52 -5262 -181 4834 9851 14356 3130
4802 3130 5413 3405 -1750 3245 -1923 2240 11306 14525 5270 -986 -8819 798 7805 -1249 -3212
4787 -3212 5491 15186 14748 6587 332 -6780 -10186 -8276 -6043 -11963 -13957 1630 7301 -1090 -4990
4772 -4990 -385 -6360 -14940 -19952 -13863 -5720 -11738 -9224 -1199 -926 -6565 -431 -919 -11691 -17760
4757 -17760 -15504 -2596 7840 2373 -5910 -7398 -10944 -13794 -18666 -14866 -15325 -8946 -3782 -6475
4743 -6475 -10767 -15021 -14745 -19887 -8220 -9566 -4742 3197 9317 6975 18799 22646 12454 -1059
4729 -1059 4159 11034 22088 24192 16831 4176 3884 -2875 -9525 11888 15339 2005 -1441 13398
4715 13398 29087 38055 23302 17365 13290 4362 -11420 -12783 2872 -5058 -291 8989 14823 11046
4701 11046 7122 -3385 -8819 -1979 4974 3627 -4154 -8656 -11419 -18814 -15377 -262 10973 1355
4687 1355 -2294 6872 764 1426 -7870 -9035 -9417 -12948 -7335 -15842 -15655 -4392 -2901 11563 16342
4672 16342 20224 22587 6517 -12621 -8862 -9523 -19309 -30301 -30190 -17624 -13536 -12731 2498 6445
4658 6445 1489 943 3486 3151 -4979 -5181 -8097 -18181 -14974 -8900 -8420 -15437 -4135 1731 -2725
4643 -2725 -1818 -11647 -10378 4258 2530 -9203 -1127 78 -874 2244 3163 8235 17642 21661 4718
4628 4718 2866 419 -18800 -25796 -22282 -22543 -9371 -7976 -7051 -13639 -13584 1614 -4429 -17164 -10095
4613 -10095 -13766 -10486 890 7801 -2466 -8949 -11858 -34 6785 -623 3548 5359 9101 14017
4599 14017 6884 -8476 -11207 -9934 -10708 -16921 -18702 -19586 -28932 -37804 -27583 -23274 -24253 -21356 -5962
4584 -5962 -6405 2682 17055 22263 14393 2061 -6655 -6133 799 6314 12822 4954 -8856 -14110 -13725
4569 -13725 1692 11119 6025 7195 8183 -7721 -13492 -2422 2804 -2020 -3774 -4059 -2996 -5638
4555 -5638 6715 1038 -2246 -11624 -7271 1617 13861 7987 -18986 -28974 -19023 -3738 4350 -269
4541 -269 -6149 -11139 -8937 -10606 -10226 -8606 -13769 -12432 -4136 -1317 5389 6847 6514 -2390 -2987 -11537
4525 -11537 -17431 -10541 5612 9277 5808 -1596 -13108 -19057 -17503 -12225 -9474 -675 170 -10921
4511 -10921 -16918 -21691 -19523 -20347 -1378 8395 8374 23303 26266 12218 10006 21177 30607 24103
4497 24103 21755 19119 18215 8191 -2907 -7166 -21650 -24151 -11398 -4264 -8059 -4395 -1379 -8452
4483 -8452 -6458 7014 9252 6203 4471 -6575 -2406 19629 15565 10023 1963 -4390 -14853 -18048
4469 -18048 -4484 3212 -6290 -9478 -3857 -3105 -3328 792 7699 2774 -12591 -35218 -35664 -24116
4455 -24116 -11811 -6809 1745 -4583 -6169 -9625 -3437 1114 3714 -15859 -21727 -11911 -2352 -3300
4441 -3300 -2656 -10622 -13450 6925 14614 12166 12266 11044 9885 6518 16203 15039 5881 6418 816
4426 816 2253 14460 18566 7523 5863 -7773 -15093 -22155 -11413 2334 10823 12671 12398 22230
4412 22230 13119 -6401 -11713 -1404 8113 19660 17648 13633 11663 13841 5972 -2756 -6605 -532
4398 -532 -541 -8511 -6243 4058 15545 19236 22185 24215 26426 16024 5982 2314 16350 22114 14685
4383 14685 7582 10187 22340 15922 -3717 -9431 992 4818 5912 1924 -2923 12705 8617 4697
4369 4697 13845 2249 -10285 -15925 -17972 -5063 7653 5472 3154 18741 23783 22971 25205 22452
4355 22452 21030 17013 17360 23133 15495 1933 -555 13821 14678 8364 -149 -8341 -2825 -5148 -3235
4340 -3235 950 -4028 -10772 -14681 -10027 -16702 -16653 -1726 4310 12536 13972 -78 -12984 -7807 6499
4325 6499 23173 19229 9747 -3565 -10148 -16282 -7370 1506 -4481 -807 4352 -15234 -26070 -21576
4311 -21576 -17491 -12565 -14589 -10343 -8347 -3767 -9146 -7315 -1582 -6367 -6061 -13011 -3880 -13401 -22645
4296 -22645 -6181 8525 20214 11284 1528 -4646 -8553 -13337 -14027 -9939 2849 10152 10509 10833
4282 10833 11721 4638 5387 2839 9550 10488 9427 19181 34175 39172 29756 3166 -13633 -14580 -9852
4267 -9852 -742 -7718 -12407 -8621 -11350 -14242 -16103 -5497 3327 -5523 -15372 -7040 4155 6777
4253 6777 8000 -2712 1213 13872 5706 -9883 -8982 -1542 -12905 -12665 -652 1097 -5241 -3258
4239 -3258 -293 -8037 -16209 -87 5120 822 5862 1347 -6648 2174 -3609 -13577 -13333 -2957 -3133
4224 -3133 -3860 -6673 10143 20030 15395 18592 11838 -3125 -777 -2149 7165 702 -3899 2750 -2039
4209 -2039 -13500 -8994 -3089 -8566 -11814 -9360 -6652 461 -5763 4638 4263 -400 -10996 -27984
4195 -27984 -20456 -17681 -20541 -24579 -19041 -25542 -31715 -18045 -9389 -9754 2549 7696 4525 8738
4181 8738 11792 2172 6212 5602 -6360 -10302 -6994 -3911 -4510 149 8972 4725 8325 11308 5349
4166 5349 -4369 -15193 -8327 4757 13268 7276 1112 1631 15648 16129 17155 12564 14541 15373 10546
4151 10546 5558 -12450 -16360 -19096 -2996 8965 10242 16198 3979 -2749 -952 -1047 -4680 -7470
4137 -7470 -8553 -6902 -1405 2338 8789 9270 468 -2615 -7726 -6302 1818 438 -2746 -8550 6298
4122 6298 12494 4400 -2781 -394 -7964 -3517 3662 8451 19243 20112 13902 14398 22145 17728 7010
4107 7010 8939 -5069 -5486 -14026 -12520 -16970 -11833 3601 -633 -1620 204 -2970 -5497 -13849 -15640
4092 -15640 -22733 -26178 -21376 -12582 -2786 2500 3231 7587 3340 -1253 -6442 -13141 -18461 -23049 -10198
4077 -10198 4001 6341 280 -4959 -10760 -11507 -4122 -6253 -12304 -17881 -8570 -13523 -11096 -8738 3655
4062 3655 13247 4996 3660 10999 15625 14379 6151 3226 1856 2617 8142 8787 6230 -6245 -16367
4047 -16367 -19943 -23922 -22175 -10530 3272 4494 1857 1837 6371 1629 12547 22457 19325 26755
4033 26755 13857 15962 17653 11542 16910 10492 8675 12413 5608 3145 16576 24499 18834 21081
4019 21081 19307 15127 13795 13758 15997 13313 14632 7329 1408 -4857 -8639 -10051 -14367 1271 16959
4004 16959 13506 -6284 -10762 -4885 -4039 -9876 -11331 -7681 -7240 -4171 -5100 -14740 -8493 5554 -6577
3989 -6577 -9300 -14975 -7522 -5374 -8800 -4839 8590 11388 1837 -4339 -8204 274 2466 -5691 3260
3974 3260 -3736 -8869 -5188 -15544 -24523 -15735 -11075 -569 12511 17647 2634 -10080 -6202 5774
3960 5774 8506 10157 6654 -8519 -13477 -14961 -13651 -7842 -11717 -9812 -12983 -9020 -11742 -20000 -4987
3945 -4987 5970 11430 11646 -288 -13727 -21760 -18397 -7753 -448 2754 3498 12268 10235 6343
3931 6343 6432 -8225 -18116 -11386 -970 14162 15481 10258 -5553 -11091 -2904 2475 4019 -12189
3917 -12189 -17228 -4777 1128 -4793 -10196 -4759 -3913 -14896 -31090 -26697 -9581 -1933 591 -2635
3903 -2635 -17130 -25773 -18505 -12567 -13226 -6299 -3961 4639 17512 33273 36665 26256 12619 11002
3889 11002 1820 1804 -7198 -15571 -5786 3199 13280 -115 -10786 -17854 -1565 12479 3853 -4395
3875 -4395 5724 8712 174 -3245 -6030 2093 1498 -5248 -4632 -11413 -35690 -26739 -15848 -15657 -10762
3860 -10762 -3897 3618 2992 -9260 -12721 -19836 -29568 -24463 -17843 -6919 18627 32312 15251 8415
3846 8415 2855 3903 -6572 -13723 -9978 -1948 3410 9570 9990 -348 -6447 -1494 14077 29001
3832 29001 17764 16403 8158 5516 8631 18273 -63 -15645 -6494 -2202 2603 -4922 -2299 621
3818 621 4465 8574 -6697 -11516 -273 -3223 -13220 -17948 -6835 616 1754 10741 17411 15885
3804 15885 27476 29278 20453 8363 7620 18880 20477 14361 6636 1901 -17690 -17952 -3167 1093
3790 1093 6661 -6727 -13432 -12436 -4546 10072 10532 9260 3724 2009 -1041 -1257 -1549 1851 -3617
3775 -3617 -24796 -24492 -8164 2366 8976 7859 -4452 -34285 -35005 -18971 675 13560 11073
3762 11073 2478 3668 10768 13823 9087 -6726 -16879 -25252 -35953 -36766 -25961 -12694 -2819 4237
3748 4237 8385 -1051 -12903 -11336 -8366 -972 4367 906 -2204 -6560 -6891 4581 13815 18901 10603
3733 10603 762 -9243 -11791 649 1066 32 -603 2904 3913 7386 5729 -2956 -11858 -9149 -4444
3718 -4444 -7394 -5574 -4027 -1844 -3756 -6293 -12708 -22415 -22037 -16476 914 2842 12708 15530 3987
3703 3987 -3121 4 10474 13904 3932 -4917 -2234 6034 366 -4980 -4366 -5861 -2159 13189 12593
3688 12593 7579 11760 22773 22078 11201 7017 5082 7682 11906 7941 -4620 -11785 -7437 7794
3674 7794 8887 1167 6216 12960 4797 -2230 315 13917 22597 15621 11284 5623 23075 28057
3660 28057 14187 3006 14300 19475 15157 22784 17614 14600 11690 -3486 -3541 2359 16762 27958
3646 27958 18113 12663 18100 27748 22091 19009 22257 17914 7962 8017 10311 7643 8849 10310 4420
3631 4420 2799 -8307 -10755 6416 12475 15602 10026 -6479 1877 19336 14877 12007 7962 7976
3617 7976 13088 -1610 -12115 -5771 -4719 -192 -186 1740 -1034 -1829 1979 7906 -1012 2086 4536
3602 4536 2801 5894 -2018 763 25032 25068 1120 -9279 -10598 -13965 -17004 -28866 -28495 -23147 -18584
3587 -18584 -6628 -5018 -17673 -31465 -29205 -23292 -23668 -15878 -12846 -15696 -7675 9965 8944 14335
3573 14335 9521 7742 15234 20208 18085 17922 16872 7994 9220 14862 14391 14427 14619 10526 9470 18126
3557 18126 20506 23212 30851 22379 6123 -2066 -8933 -4884 8769 14681 14385 8477 604 -171 4792
3542 4792 9848 12547 6590 8352 8383 11767 2253 3582 20061 15510 15455 12088 3923 7739 11779 9981
3526 9981 18069 13165 11441 11013 8612 6931 16804 21744 25262 15599 6635 11942 25772 19314 8305
3511 8305 340 -11414 -6069 -55 -7126 -13610 -13463 -18064 -26522 -10177 1436 7746 12375 1679
3497 1679 -1439 631 2032 -3583 -3369 -4981 -2408 -8684 -9198 -11470 -10672 265 2465 -14787 -19912
3482 -19912 -20465 -26218 -20708 -10921 3572 -1544 -4868 9376 14705 5839 11290 9216 14207 14033 5214
3467 5214 -7744 -3780 4570 11659 19852 25462 14235 11448 6240 8115 19670 18400 -2862 -9752
3453 -9752 -14903 -13583 -9401 -3205 6905 6265 9673 10674 -2257 -6868 5611 3681 -3786 -4924
3439 -4924 -1544 1973 3726 8803 12587 17866 13456 7410 21661 19840 6457 -2072 -3635 -14110
3425 -14110 -18687 -12864 -10711 -12857 -5258 -7990 313 2479 -380 -3456 -1901 -8090 -12388 -15294 -4730
3410 -4730 -2714 2169 457 -5193 -8087 -28847 -39034 -29959 -24621 -11071 2356 6505 8753 17448
3396 17448 11532 2923 -758 -14464 -18589 -18560 -15128 2229 7954 4242 1650 -4788 -2340 -7495 -9448
3381 -9448 -1492 4224 2081 1600 5810 1836 -2861 -9098 -8839 -6111 -2406 6364 14627 8301 13370
3366 13370 15731 -3103 -213 3836 -2663 -1009 -574 3375 -4292 -11318 -2162 6377 22160 25999
3352 25999 15989 21478 16732 -2429 -11786 -3507 -5920 -6385 -7169 -5833 3198 6098 2746 -2907 -21811
3337 -21811 -28282 -21545 -12774 -854 323 9927 14991 16253 9962 3670 -1683 -13335 -23645 -10235
3323 -10235 -6440 674 1494 -5759 5893 -1485 -5055 3813 8366 1381 2719 -356 11424 10174
3309 10174 -580 -10721 -12316 -13635 -4528 2646 7408 -5159 -3910 1630 9178 16822 13125 2303
3295 2303 -12390 -18103 -8145 -3813 -3242 -7654 -13239 -18101 -19469 -7575 -4353 2255 6305 -1307 9640
3280 9640 25230 24410 14272 5528 13608 20465 12733 11953 20378 9392 -10343 -21601 -14186 -14531
3266 -14531 -17627 -15555 -7837 -14206 -14641 -633 9355 11340 14313 11590 1931 323 6408 6074 8438
3251 8438 8373 10175 -2412 -7280 -12626 -19481 -15110 9469 15168 11966 12495 10698 12561 16077 11598
3236 11598 3611 -9080 -17421 -16211 -5841 451 -6625 3767 8512 14358 5607 -3954 -8797 -17313
3222 -17313 -11137 -4959 -3565 -18844 -27262 -28097 -13444 -7164 -4559 -13477 -19319 -17293 -11855 -2203
3208 -2203 14606 21952 15104 -2539 -5291 -3097 -4102 -12678 -15746 -6095 442 -13533 -5654 11775
3194 11775 16387 12130 12455 15707 3142 -7078 -2986 3049 -8018 -3372 2157 -157 -6675 -6942
3180 -6942 2351 15355 2506 -2541 2402 -3572 -3298 3865 -1943 -5826 -863 -2794 -1976 -2950 8627
3165 8627 4256 -6449 -11188 -10221 2717 7521 10800 25930 25319 23768 19407 16661 13228 5011 5201
3150 5201 -4455 4288 10980 2663 3334 5406 13482 13156 1741 -3400 3376 -2592 -229 6073 10652
3135 10652 16401 16714 8757 6272 1897 5709 11099 146 -391 1636 -10975 -16731 -24379 -20641 -6158
3120 -6158 -295 4414 7017 6916 -8624 -14234 -24064 -25193 -21806 -15433 -6837 1015 -4083 -615 1392
3105 1392 3534 -3559 -9701 -13499 -17321 -12191 8157 29182 22020 1053 -5781 -6272 -6591 6474
3091 6474 12550 8648 -707 644 -9174 -14788 -3454 3435 3449 -2836 740 10179 22637 23532 31069
3076 31069 33066 28778 31442 16934 15189 12747 358 -5951 6561 16042 3471 -1934 -12811
3063 -12811 -11353 2594 2863 -5276 -7082 -2132 3906 -4626 -5795 -300 10494 23252 20424 15853
3049 15853 12206 8352 -7208 -12781 -11904 -3895 -2018 -7832 -97 -5775 -11345 -10658 -14772 -6915 -10026
3034 -10026 -9545 7064 6292 -6048 -11822 -7150 -2980 -6567 -3159 -4730 -11935 -12777 7859 9600 2518
3019 2518 -6701 -10681 -13813 -8021 2653 4178 4606 12416 12246 11806 4918 3797 6687 1309 -1683
3004 -1683 -4666 -1933 -5232 -4961 -11014 -14473 -11493 -16217 -11669 13751 18356 -501 -6339 -14464 -23694
2989 -23694 -12611 633 6226 10362 13359 16376 19542 21774 13483 -2566 -17624 -12913 4693
2976 4693 13751 3827 -8346 -9688 3855 8628 1189 6275 13811 15273 14791 18515 3502 -10006
2962 -10006 -7860 -15320 -8301 -11169 -6518 1144 -2134 -2421 5280 11208 22375 21073 17911 10307 -1329
2947 -1329 -8438 -4750 -4320 -4725 2751 3097 15415 12816 7831 16412 11177 7919 7354 6475 -2738 -16188
2931 -16188 -18717 -1809 13573 23573 25898 18762 1257 -3998 13290 25773 17660 19529 27654
2918 27654 18095 4462 -3047 1939 -4570 -5335 -6218 -9528 -16459 -18221 -13900 -13119 -10196 4655 15958
2903 15958 10954 7828 5627 623 3527 -2786 -10494 -15513 -14470 -11297 5375 14258 7595 2098
2889 2098 -379 -534 -3274 -4394 -11539 -18815 -7734 2275 -2621 -3057 -6578 -3217 -15577 -25667
2875 -25667 -14486 -3979 -14268 -23219 -14165 -15629 -7219 -826 12369 10073 -3535 3961 -1392
2862 -1392 -12655 -7931 -10080 -11999 -3368 294 -3311 1986 3283 11252 8222 3549 -1694 -739 -1310
2847 -1310 -10914 -13939 -11448 -16560 -7999 -1208 -2797 -10315 -10854 -10628 -12128 -14008 964 7990 5161
2832 5161 3642 3372 5755 -2521 -18819 -25449 -24236 1062 9992 2108 -2149 -15373 -21494 -5599
2818 -5599 -5474 1176 -481 2312 6402 4190 -4974 1883 2459 5261 2012 1792 -6311 -4445 2780 -12391
2802 -12391 -12470 -2421 4012 3193 22677 31039 28683 27530 32137 34180 27724 17137 21908 29151 25310
2787 25310 22514 26055 13218 435 -12344 -20902 -17004 -7415 6877 19390 23108 20001 12096
2774 12096 3517 2435 -5702 -7469 -5316 12184 16197 17292 25553 21017 10662 9986 10357 15567 17910
2759 17910 8350 -7690 -7691 5208 1481 -594 11019 14345 17934 10845 5405 -2222 -7546 -14319 -30774
2744 -30774 -24984 -15613 4879 27023 19620 16730 27430 39279 21266 9611 16067 14586 7383
2731 7383 5228 183 -13156 -6474 6926 14613 9056 866 -750 15638 19013 15152 6268 11597
2717 11597 17066 12901 2330 -10987 -13764 -18497 -13011 -14490 -24667 -21243 -18529 -14158 -11555 -6784
2703 -6784 -12545 -6858 10445 17108 11198 -5999 -10647 -8736 -3323 -2138 -6372 -4302 -9903 -4238
2689 -4238 -3299 -7387 -4473 -2318 7214 8290 11686 6399 6268 -2366 -12117 -7964 -3334 -6590 -1726
2674 -1726 9661 7112 3736 3245 8693 5671 249 3927 -3622 -19543 -14598 -18470 -13741 -3026
2660 -3026 -4357 345 12681 12376 9013 6518 3297 -1176 -103 4236 -1904 -3000 7042 4563 3805
2645 3805 -1675 3096 16278 2438 1093 4789 -6588 -6692 -11155 -18352 -8085 -21925 -24355 -13831
2631 -13831 -6907 -11374 -8815 -7806 -2525 -2367 -4849 4686 23453 29476 21389 16108 7730 5373 11915
2616 11915 8860 7977 2770 -8062 -8743 9286 24383 21036 29746 24679 11723 6748 15267 35304
2602 35304 33976 20141 16698 23631 15254 2259 -2265 6123 10019 6076 -4015 -5873 -16638 -7368
2588 -7368 6937 22812 28008 16646 21029 24980 11888 -2495 3096 9357 11820 16930 13610 7523
2574 7523 3602 8666 10849 6773 14460 20423 7153 16125 30174 18979 7153 6166 6491 -1626
2560 -1626 -13159 -14470 -3643 11267 20853 17560 14090 19340 22047 20067 21471 26694 26425 25599 15578
2545 15578 -12627 -29080 -19130 -8534 -882 8250 585 -7593 -11105 309 3881 1013 -7451 -9220
2531 -9220 -18901 -15560 4044 20529 13500 10276 113 -6838 -12471 -11682 -6290 4913 19080 17644
2517 17644 2531 11259 22234 20568 10314 -1451 234 14728 11949 3967 -7019 -20009 -20221
2504 -20221 -18312 -16264 -6343 -5644 -6861 -11125 -15723 -15873 -24421 -17419 372 5723 7634 1999 -6273
2489 -6273 4883 6535 220 9522 11136 13122 12804 4620 -3870 -4159 5125 7292 -8524 -4764 256
2474 256 -1723 4859 3084 -6096 628 13319 11388 -1033 -3832 9073 24374 22675 20062 14824
2460 14824 7815 -2973 -1850 815 -4782 -2809 -5601 -11784 -15973 -6190 -13399 -16307 -9714 -2929
2446 -2929 247 8931 12762 17009 11225 4711 -2564 -5317 -3980 -1225 545 7901 -7656 -9553 -1919
2431 -1919 7009 15094 18614 18237 13131 10027 -9015 -4320 6897 402 -11089 -17500 -24871 -14467
2417 -14467 -3740 -544 -3758 -988 -454 11347 19488 19300 -1493 -13460 -10162 -8360 -6189 -1598
2403 -1598 -8246 -15601 -20148 -20934 -13261 -10635 -8884 -543 11238 17592 27112 11466 -5668 -7706
2389 -7706 -6293 1179 9165 8960 2639 573 10971 30678 20835 5854 1287 3465 -8728 -14107
2375 -14107 -145 17966 26267 23389 18180 17078 13997 12056 19629 22371 16316 8014 6332 5659
2361 5659 4740 9618 11722 10263 8902 -4979 -11462 -9605 12538 12010 11512 202 -600 12086 9744
2346 9744 5064 13740 14254 22497 24474 16106 1670 -3674 10040 6016 -11205 -23347 -6003 2478
2332 2478 1872 1994 619 4064 -7160 -15250 4147 5920 -1561 5410 11786 24189 18159 -10280
2318 -10280 -10615 1342 4016 1107 4522 14433 26559 16806 21724 15229 11166 17761 24804 22493
2304 22493 10478 -3686 -473 9128 19367 24379 27434 35512 30177 32230 29105 17370 28307
2291 28307 36768 35545 16107 20267 27545 23840 17992 12017 -2745 3192 6999 7343 2197 4270
2277 4270 11567 8481 3797 9155 13558 -4338 -21320 -15109 -9259 -11603 -21306 -17054 1795 14927
2263 14927 9557 -4952 -5047 2472 -287 -15767 -11097 -8122 1339 -4526 -8212 2875 -3053 -18635
2249 -18635 -21045 -6595 -11973 -1741 4223 5042 -2163 -7685 -4814 -8802 -10122 3184 6813 4599
2235 4599 4342 6229 9857 11295 1498 -2169 6905 -4398 846 3186 2517 -4167 -4152 -3033 -1892 2689
2219 2689 4362 5815 1728 1559 -453 4107 9071 6434 9051 16091 19907 19951 17843 11442 -13629
2204 -13629 -22915 -9853 6922 14620 6864 1808 -8085 -960 2004 4317 5079 -3634 -2521 -75
2190 -75 10524 13441 -570 -2669 2475 9513 7750 -4507 3550 5675 -1248 908 -8548 -10995 -2735
2175 -2735 913 -3384 -6831 -4478 3419 2253 -10101 -3935 7267 19214 15312 8667 4407 11632
2161 11632 9707 14052 21432 18309 18716 3535 2129 -1308 -418 -2097 -3962 -4425 -12602 -17506 -7614
2146 -7614 -5473 -20565 -19010 -3464 -10358 -15375 -19664 -17430 -10389 2675 2325 5365 1720 -8549
2132 -8549 -14639 -19343 -7149 976 -2078 -15232 -23840 -23178 -9375 -5177 -1589 361 -7730 -15613
2118 -15613 -18437 -13171 -2829 6303 15245 6026 -29 97 9323 8554 -9132 -9785 -4218 -9725 -13551
2103 -13551 -3385 -9020 -10001 -7855 -10956 -8775 -8996 963 9683 10771 9047 5891 9713 11084 495
2088 495 -5060 4008 3885 -1620 -5555 -2066 12287 21543 12004 10238 15453 8114 2424 -3948 -6686
2073 -6686 -5127 1598 4623 -4116 -14266 -8880 -2782 -13321 -13903 2555 -2293 -13135 -11514 -9910
2059 -9910 -19905 -12377 -3265 -3801 -3209 -4949 -14463 -10652 3588 1030 3515 -3600 2428 15283 24918
2044 24918 14972 -3322 -13167 -10208 -9143 -4449 -12439 -18668 -16297 -7282 -6297 -898 13374 6819
2030 6819 19820 20666 12971 7228 5688 215 -3703 -1453 -509 -13795 -19113 -16724 4204 6477 3572
2015 3572 5850 12665 6695 -4176 -11348 -5286 -2013 -5907 -6688 -11530 3574 -4966 -879 16596
2001 16596 12402 7327 9137 17495 30577 34783 25903 9159 8666 9287 9294 6738 9348 -1470 9185
1986 9185 23918 31819 27366 21820 15237 2044 -13299 -10549 -8983 -25847 -16691 -6736 -6022 -11138
1972 -11138 -13961 -5671 -4325 -20440 -7590 3742 -1407 4605 2081 -12751 -15910 -4255 2356
1959 2356 2815 9342 8355 -2445 -833 7168 2239 5518 11914 6891 11641 9440 5905 2784 2854 881
1943 881 261 3424 6106 -758 -5666 -2546 -4741 5993 15486 12529 -1147 -2954 -3536 -9835 2022
1928 2022 -708 -11832 902 20402 1950 -16722 -15573 -8760 5278 14459 10157 3015 5304
1915 5304 -1040 -2864 -71 3303 5170 5234 -3260 -12106 -11926 -20488 -31077 -29801 -24635 -15126 -22188
1900 -22188 -26210 -21038 -19195 -9820 -4217 -990 -9983 -10180 6248 10156 8455 12130 9135 9696 2070
1885 2070 -2502 -1738 -3517 8534 13998 7799 319 14566 14658 13205 -7306 -11051 -9861 -6354 988
1870 988 3251 -3352 -11823 -9083 1129 5652 2086 2032 515 -6680 -5439 -7753 -10313 -2506 6440
1855 6440 4457 -2494 -12904 -20527 -32342 -23012 -13536 -8683 -9918 -18405 -2294 7525 2949 -1070
1841 -1070 4900 8071 22108 27823 13192 2547 7558 13550 3452 -14093 -1961 12287 11364
1828 11364 18508 13104 23089 8671 -3786 -5699 -1187 -9368 -13773 -18904 -11454 65 -6778 -18299
1814 -18299 -18768 -9394 -5859 174 -1858 -5546 -4295 -10453 -10336 490 673 -5997 -8716 -4832 1672
1799 1672 -7556 -16508 -15249 -7546 2551 11799 14505 15192 10835 6934 1184 -2396 -1287 -11825 -12939
1784 -12939 -24438 -19190 3186 6968 -3081 -2440 -1425 3532 1179 7420 2271 -9627 -12374 -10442
1770 -10442 -16214 -5230 -6610 -13401 -2168 2799 2808 5797 3967 -4958 -13784 -12179 -13063 -9487 -12319
1755 -12319 -14538 -12543 -14121 -8050 -7505 951 7198 10944 18716 22768 19773 19556 15575 6148 -4623
1740 -4623 -266 -3845 -8658 -11623 -6804 7143 12675 14123 17827 7345 -5597 -17933 -4691 -8370
1726 -8370 -19214 -24039 -10795 -8401 -5743 -9661 -9801 -866 6132 10954 9569 13201 11773 2660 -662
1711 -662 -4062 -5812 -12503 1386 10467 20267 30762 23118 21202 13525 925 -20089 -29051 -18438
1697 -18438 -10996 -3540 4038 2821 2877 -6384 -3720 8029 -344 -11879 -9598 3995 2518 -9670
1683 -9670 -16291 -3746 20495 24406 11584 17878 -88 -15268 -11197 -5804 -398 -3522 -13652
1670 -13652 -18840 -10033 -7084 2232 6841 8977 14944 18138 23030 20105 1072 -17185 -18762 -14289
1656 -14289 -3484 761 -12450 -19430 -12916 -4333 1240 3781 11747 7248 -3785 -2739 2198 4062
1642 4062 6564 -10456 -14535 -7163 4554 1834 -2047 10210 6112 -10942 -12764 -4077 7454 9477
1628 9477 3250 446 12350 13566 17815 19192 8726 14881 17816 14469 12420 28018 32138 19791
1614 19791 13465 18365 7325 5119 4416 -1012 -5711 -7147 -2708 7839 5981 10255 337 13636
1600 13636 15019 16472 13842 10527 12175 7314 -1928 3012 15443 24584 14359 2998 10911 18696
1586 18696 18806 15925 7144 148 5594 3749 1065 5381 189 8078 24304 15538 -2190 4971
1572 4971 10497 12513 3075 2314 9626 3689 1819 2140 -5159 -9118 6231 12879 16346 10174 7691
1557 7691 8949 3340 -7589 -730 -5814 -10144 4782 3011 -11649 -5588 -889 -3329 3774 9911
1543 9911 10011 13607 23365 14558 10472 1752 3662 6488 7637 -7063 -5965 -9264 -3482 -3513 -4881
1528 -4881 -7310 3598 10575 4545 -1564 -57 -3771 -3809 -2021 890 8693 14413 10866 14846 3249
1513 3249 9587 4706 -118 -355 -1585 7415 3325 -2783 -14187 -8246 3348 4386 7710 -1211 4019
1498 4019 4355 -6246 -7033 1752 273 -2580 2865 -1362 -3650 -6079 -10744 -3683 1443 -4633 -12938
1483 -12938 -4452 -8193 -17767 -14274 -8916 -11951 -20796 -21052 -10986 -3596 -4727 -11720 -14005 -28334
1469 -28334 -34032 -34416 -28989 -11348 5634 14540 9636 983 4892 11373 8263 4905 -6123 -578
1455 -578 8966 16335 13966 6165 -1889 -11529 -5567 -8438 -4021 -10632 -12292 -11316 -6848 904 13266
1440 13266 14611 7630 5531 11982 16076 1655 -3712 -906 -7888 -10889 -8413 2848 -2255 -9353
1426 -9353 -10678 -15106 -8238 2486 197 -8242 7342 19742 22321 18379 6160 125 -7891 -14979
1412 -14979 -14648 -3378 -5496 -5193 -5778 898 24353 21376 15281 12357 10078 4922 -5788 -20328
1398 -20328 -25905 -33110 -24253 -18100 -13824 -26681 -34214 -33285 -27612 -6410 1973 -4716 -11736 -21387
1384 -21387 -17668 -270 4739 16130 18591 16139 20810 17426 11075 8030 9392 6625 3400 -6577
1370 -6577 -10651 -24035 -28021 -16803 -13557 -23893 -14808 -2393 4313 18019 10970 8224 4684 1568
1356 1568 -13797 -16090 -11290 -4672 13755 22116 11340 -4893 -2057 -172 212 -6482 2518 4002
1342 4002 -4773 -13023 -11611 -5585 -1314 6059 2254 -1653 -8699 -9384 -22450 -28351 -13727 648
1328 648 4241 7737 -1268 -4473 -1543 -10046 -15091 -13180 6597 9350 16845 19848 -2988 -12767 -11923
1313 -11923 -13019 -5834 -7414 -6859 9913 13028 4459 -10544 -17777 -14814 2435 11564 10208 4461
1299 4461 4349 8830 7098 395 9527 17208 483 -23955 -30253 -24726 -7355 -826 -4180 10425
1285 10425 8218 12347 19957 12695 7017 2666 -2358 -12205 -13481 -9970 -2133 -6071 -3742 275 179
1270 179 11968 14508 22667 19683 14910 8165 -1078 -18283 -5988 1568 12029 9783 4815 8421
1256 8421 11445 5864 -7591 -30917 -36407 -24604 -14229 -12671 -5679 -8746 -13015 -7404 5328 7670
1242 7670 13370 11540 9265 2562 9379 5459 9026 12614 23989 36862 27072 12194 10113 13648
1228 13648 15887 9983 15295 15521 30271 31319 15639 -1055 2454 4223 -7308 -5566 -9649 -13033
1214 -13033 -7744 -3162 1647 -742 7141 24447 13726 7516 5842 -3356 -6817 -14878 -28036 -19492
1200 -19492 -7859 -4437 3325 -336 1035 4447 9686 19050 16055 5997 3937 -5432 -1974 6835
1186 6835 8592 6224 -1157 -4404 -7658 -1644 -7396 -17084 -13205 -482 5393 -1375 634 10737
1172 10737 5753 2107 15140 12322 2209 -6634 -15282 -24346 -14434 -320 6658 -2189 -5465 7850
1158 7850 20203 17467 10047 4826 6586 8259 10504 2883 -909 5312 15056 7615 -7024 -9937
1144 -9937 -14387 -8081 -5398 -954 -5697 -8680 -8069 422 5367 -7909 -11071 -11092 -2789 -4037 -2713
1129 -2713 13879 10681 3289 -6229 -720 4451 13877 29421 34905 34534 25633 16419 11973 13735 16535
1114 16535 26899 26538 30620 21445 16650 12548 4848 5451 2352 11265 6295 6481 2753 -544 -5177
1099 -5177 752 3686 11802 9356 6096 4253 2874 16760 25777 18107 14429 1131 -1310 7640
1085 7640 20149 14667 8374 5747 12973 17913 14509 11953 706 -9803 2472 -9991 -10196 -8402
1071 -8402 -11914 -9003 478 1318 11492 11304 3039 4118 4231 19 -1530 1629 7387 4979 9760
1056 9760 20007 13795 -11653 -22751 -22251 -14136 -7681 -3910 -13724 -23196 -15420 -4523 -3678 -7292
1042 -7292 -6680 -5790 -722 -16242 -14245 -8186 -2831 -3846 3780 10072 -17 -3425 -7089 -20485 -24168
1027 -24168 -13266 -2016 1348 3745 18485 24707 18167 11832 13771 9506 8792 21007 29103 21840
1013 21840 21906 21976 25877 28824 22205 12407 12538 13462 17314 4496 -3136 1299 -13877 -19437 -14704 1262
997 1262 6768 -5360 -14926 -11772 -18711 -23930 -18289 -27868 -26558 -7541 8137 19216 11405 5794
983 5794 -8338 -21536 -20694 -16750 -10442 -11101 5448 2311 -591 -1560 -3950 -8702 -10783 -4946 -4138
968 -4138 899 3102 -8233 -3424 7829 7836 5493 5766 5664 419 -9234 -8610 3441 7874 1284 13266
952 13266 18963 15868 10806 8021 7329 -3095 8202 34293 30863 15741 6193 -2855 5439 10011
938 10011 5338 -4375 -18163 -26283 -24455 -16253 -3036 12565 8387 719 4735 -254 -281 -1268 -5099
923 -5099 5192 5865 15630 21072 14308 -7875 -6284 -14249 -24510 -19383 -12796 -5920 -1908 -7770 -16088
908 -16088 -14836 -8074 647 2608 2389 -9329 -16048 -22487 -15255 -7951 -5524 -115 -8244 2116 14366
893 14366 25653 13035 153 2221 -2362 1759 -7559 -3979 9343 10145 -4598 -2908 -4794 -501
879 -501 1391 -5130 -13545 -11469 -3167 6102 -12877 -17218 -21115 -4731 6518 11002 12138 14344 12159
864 12159 5844 5327 9399 9488 10703 19836 14100 5343 -1520 9502 8475 4680 -7013 -11668 -4059
849 -4059 13031 17310 2677 3362 5781 6635 8649 6365 8198 8890 446 -5736 -4577 -1202 3560
834 3560 10506 10281 6402 6098 -1581 -17860 -22809 -14915 -17508 -15246 -11958 -15467 -5459 7223 -3604
819 -3604 -4899 3273 2252 -3022 -11172 -5983 616 -2060 -9010 -9330 -18657 -12242 -6034 382 3459
804 3459 2051 -1858 -3702 -2526 14426 15685 2037 8346 9167 11602 2493 -6541 6753 5468 -16845
789 -16845 -17175 -12702 -13271 -16637 -6546 -10618 -3867 6316 5681 -32 3480 4637 358 -5524 -773
774 -773 -1776 -4894 -11044 1661 -4327 -883 4425 22274 27789 17776 11912 10924 9022 12731 9104
759 9104 4591 -2402 -7462 -5625 -3464 317 7574 10841 19543 26881 22519 7954 -2429 324 -3019
744 -3019 3457 -252 -23239 -20266 -9680 2649 17905 -310 -6636 -6633 -24369 -24811 -10790 -6373
730 -6373 -6287 2902 2458 -920 -3774 -1767 -2961 4995 -844 -11155 -8907 -6996 1810 11105 1874 -782
714 -782 11753 -2258 -9204 1073 4273 -6079 -16519 -13928 -6774 -590 -37 10367 14240 9146
700 9146 576 2209 9004 10132 -7840 -202 4217 -4024 -11860 -14156 -10069 -5774 -3336 2062 -4924
685 -4924 -22147 -26063 -19320 -5395 -65 -11034 -9611 -2627 8018 -2513 -10950 -8048 -9727 4737
671 4737 9538 9844 14946 2486 6532 7926 -6222 -933 -5719 -12585 -6108 1408 4485 2423 2488
656 2488 17189 20163 15452 15877 20457 27476 14036 13136 10764 734 1330 520 -2206 -6909 -3211
641 -3211 2972 1468 6297 15963 13955 19586 12272 413 -3519 4311 9876 11128 15944 13768 7416
626 7416 7821 2051 825 1897 3947 2042 -8114 -14568 -16972 -17655 -19854 -21150 -18239 11240 17537
611 17537 18200 25886 30753 24041 11542 -179 -13514 -10303 9649 6673 7268 12046 -800 -7741
597 -7741 -11562 -8211 435 -6552 -8704 -847 -126 9095 12000 -3914 -19651 -18664 -4756 8588 8040
582 8040 11831 9303 7827 -5126 -17765 -17446 -3021 8003 11999 -2780 -13733 -22372 -25723 -27308
568 -27308 -33295 -34867 -26059 -13991 -25370 -22507 -16746 -10983 -17798 -19439 -6506 8331 9679 12971
554 12971 17839 17352 14853 13036 5533 13061 16712 6428 13875 20909 8971 3698 11585 8887 5864
539 5864 13748 3791 -6304 1287 1325 -6446 -6784 -9218 -19622 -10995 1985 372 -4636 -5755 -9932
524 -9932 -11703 1299 1974 1688 7911 -1794 -9492 -7752 -11228 -7981 -8529 4140 18796 13062 8736
509 8736 2400 -11344 -16978 -16358 -20576 -7230 -144 483 792 -3297 -4888 -6606 -6149 -951 602 -8329
493 -8329 -5737 -8262 -9240 -16030 -12993 -12016 653 12226 20363 9385 3002 -2804 -6620 -15386 -15859
478 -15859 -7240 -2091 -5689 -3572 -1282 -5976 -12364 -14086 -11428 -21219 -31245 -30128 -31176 -19487
464 -19487 -24781 -29911 -12238 2697 11057 5891 -4515 -987 -1013 5780 16617 10150 9608 491 -1076
449 -1076 -3165 939 -6431 887 6940 -10380 -21966 -18295 -13342 -13925 56 298 -7138 -18411 -26555
434 -26555 -19063 -2922 6176 6701 5071 15288 17507 5189 1096 4092 1155 -2185 -6929 -8028
420 -8028 -21164 -21109 -17276 -34101 -30834 -26344 -14828 4661 16356 15523 22941 37512 34272 14005
406 14005 3541 6791 2737 -3317 -2669 7 -10396 -7338 4122 2372 -5369 -13410 -13334 -11315 6744
391 6744 12986 13122 7322 13651 -2102 -10058 -2092 -9151 392 10966 11466 1561 9686 11045 4112
376 4112 -9023 -9254 8558 16896 22643 18439 8750 3873 -4761 -8744 -7515 -9392 -3179 -2673 9430
361 9430 13827 779 -16532 -20606 -19666 -10465 -9918 -9549 -10349 -3500 4416 -491 -18036 -22746 -1902
346 -1902 9191 13178 2639 5777 11910 4007 3319 2077 -6013 -4532 371 6065 -9034 -12086 -1133
331 -1133 6765 -121 -9218 -11780 -13674 -2556 1004 294 9319 -1107 -14495 -22858 -13415 -4922 11021
316 11021 14736 6479 -2026 -5528 -5606 -657 6415 13426 18419 12122 12364 17207 19733 18672 17643 10778
300 10778 -2156 -10112 -9443 7480 2842 -2316 -1188 -3719 -8321 -9399 -10656 -5546 -1553 3247 7806
285 7806 7872 7040 7446 10428 3955 -4294 -2837 5441 18872 24168 20011 11368 11589 7263 10961 10265
269 10265 3769 1695 7942 6826 -5387 -4823 10470 8560 10535 9203 -5035 -7889 3654 7281
255 7281 4277 -3119 7382 15952 11564 3323 1662 8432 15573 6476 2630 -4089 -4325 1197 1037
240 1037 -2459 -3367 -527 15884 22523 19632 14237 2968 -3389 5068 -2416 -2062 14682 20144 15342
225 15342 20295 20441 16932 15611 13227 9013 -6793 -15193 -13206 -18394 -15506 -10156 -5225 -5719 -5016
210 -5016 1747 1332 -15310 -31291 -24286 -15815 -10044 -12321 -9572 -21277 -24174 -25988 -28015 -20863 -15615
195 -15615 -20043 -27016 -18646 -15539 -16041 -677 6357 424 1329 4315 408 -5995 -10847 -10655 -12576
180 -12576 -21295 -18263 -17433 -25116 -17372 -17538 -18621 -9428 -851 -7432 -12223 -4231 -5249 -6803 -6560 -8263
164 -8263 -5376 -2503 -11907 -15447 -17769 -26324 -22343 -8599 -7364 -12429 -9359 -1678 -2005 -2184 -6413
149 -6413 -9681 -10814 -3193 5311 -3799 -11408 -8618 -8264 -6039 -2905 245 5863 792 746 -2156 -2837
133 -2837 -8073 -8604 -1308 1893 -1296 -3149 -597 7304 13184 13367 7679 3045 -2317 -4844 -3503 -7303
117 -7303 -4819 4364 7809 7263 1339 -8091 -12220 -5634 -4526 1074 4597 -11208 -19339 -8823 1502
102 1502 11754 16172 16202 20997 19417 14935 10043 5645 -4884 -7191 -6341 -11370 -10035 2604 10833
87 10833 12387 2998 -5440 1522 7161 7862 3586 665 -1858 -3997 -5350 -6260 -4168 -12239 -17555 -9839
71 -9839 3700 15227 2884 -9021 -14036 -18847 -12543 -1983 4662 -6381 -16125 -10618 -4446 110
57 110 1447 6256 2623 9652 9556 2143 2702 487 2630 -1954 -2802 -1277 -8120 -12411 -12459 -12731 -5008
40 -5008 1387 -5860 -5463 -3660 8514 7108 155 2944 2150 -1319 -5725 -84 -599 -8751 -5938 -3586
24 -3586 -5616 2310 7706 13489 11816 2150 1395 5769 -3697 -9668 -2916 -9780 -12916 -21226 -15966 -8906
8 -8906 -2515 321 6401 7488 4894 2394 -706 -1350
0 -1350
$$ Imaginary data points
##PAGE= N=2
##DATA TABLE= (X++(I..I)), XYDATA
32767 129354 133655 123993 116966 116427 128025 138148 144023 141019 138574 138785 133715 133617 135657 138250 150023
32752 150023 153240 148875 152457 157205 159018 155385 152089 151762 159849 164932 174125 177177 168461 170076
32738 170076 174263 174172 177287 181389 183644 185589 185318 192979 198246 195056 191704 192997 192257 181119 194132
32723 194132 201078 189770 178875 191119 194646 194424 203396 209628 213600 208287 209318 209027 217227 228937
32709 228937 236870 237246 227593 226610 228111 229394 228274 236816 251219 257909 252284 244653 238506 240208
32695 240208 246435 253299 263503 257191 257612 260805 267731 268638 260868 246529 239990 243241 248845 261048
32681 261048 256127 258923 259530 263707 272763 274474 276288 285738 290766 293937 293123 302750 312400 303768 303943
32666 303943 305793 302473 293551 302657 310982 319548 321623 317182 305163 312485 319440 323313 327951 321600
32652 321600 316512 331193 338748 333061 334068 344651 339318 337910 343398 346675 359045 345727 341613
32639 341613 341302 335681 337578 332643 330317 330832 341592 345740 354596 354846 357000 370677 368192 362171
32625 362171 366089 364455 371100 384687 379683 389981 398809 395668 390812 384501 377402 368877 374991 381156
32611 381156 382036 382388 381160 382186 392686 394037 385406 388982 395619 400634 411010 414668 407866 404632
32597 404632 399017 396122 392034 383959 380587 384138 392334 391316 401560 409711 413159 411991 404822 407768
32583 407768 416097 427315 432478 431289 426752 418800 419934 431950 449513 453937 445222 439658 434448
32570 434448 429847 430088 440310 450631 442929 441237 442635 451579 455226 452567 442471 439772 443025 449836
32556 449836 461305 452989 449402 450965 453277 456652 465076 472472 474063 473702 480955 479714 480264 496625
32542 496625 493199 484879 483924 489400 493148 491602 479760 484639 488317 489591 487454 484778 485277 491113
32528 491113 510402 518138 514294 506817 498238 502671 501938 517511 520164 525245 520641 516722 517303 514941
32514 514941 528216 522402 522947 522341 522106 512095 507490 504208 511823 518236 516315 527003 523027 515593
32500 515593 516019 530224 541483 543629 535458 532561 524414 517478 521322 524619 545557 554257 561106 556044
32486 556044 552450 549364 548783 536792 538244 540231 545386 557331 557131 554499 551326 552089 559925 558456
32472 558456 552249 553146 553541 558674 554253 556600 562737 566605 564957 560368 561207 561772 568387 563737 548598
32457 548598 552824 561464 561053 561683 563648 567026 577250 570312 571468 576700 580352 578003 582804 581998 580915
32442 580915 579153 584975 581557 586137 576806 571727 570822 575340 585417 585478 573256 564490 568091 576070
32428 576070 584622 581684 577668 580667 585906 588004 584776 588271 595988 601185 608906 611680 603841 604848
32414 604848 613090 616351 607552 605763 603819 604319 606433 609077 610051 604335 612360 609894 609640 622481 620214
32399 620214 612282 618647 616534 608361 617957 622309 628987 629192 626795 620829 619151 617784 629266 623133
32385 623133 613916 614115 613536 615647 622457 626017 615954 605587 602410 618516 622147 623704 625575 625177
32371 625177 627211 627908 620776 617537 615184 624488 634563 634389 631048 636777 636247 633262 633402 641992 644809
32356 644809 649350 651959 645729 643078 643306 641744 642047 632266 624151 628877 630243 622729 630671 646784
32342 646784 654645 650937 646887 637764 639465 642188 652387 661463 665195 655002 646295 637461 632369 638355
32328 638355 655136 657299 646274 634090 640180 659118 660297 649483 653558 653473 667435 666778 658210
32315 658210 664381 665117 674448 680661 676718 660237 666854 692146 697028 678205 682467 675981 656038
32302 656038 644638 641160 640545 652280 666024 662204 664658 660526 667135 675653 678481 672225 667776 670734
$$ [...]
##END NTUPLES=NMR SPECTRUM
##END=
