##TITLE=Analysis number 321067
Compound Code cc 61114
Book Reference 482/140/2
Project Code adrs
Chemist Name johng
##JCAMPDX= 6.0         $$ Bruker NMR JCAMP-DX V2.0
##DATA TYPE= NMR SPECTRUM
##DATA CLASS= NTUPLES
##ORIGIN= Bruker BioSpin GmbH
##OWNER= nmr
$$ XWIN-NMR		Version 3.5
$$ Fri Jul 21 13:39:41 2006 GMT Daylight Time (UT+1h)  MAYBRIDGE\nmr@NMR_250MHZ
##.OBSERVE FREQUENCY= 250.131544655141
##.OBSERVE NUCLEUS= ^1H
##.ACQUISITION MODE= SIMULTANEOUS (DQD)
##.ACQUISITION SCHEME= undefined
##.AVERAGES= 16
##.DIGITISER RES= 18
##SPECTROMETER/DATA SYSTEM= dpx250
##.PULSE SEQUENCE= zg30
##.SOLVENT NAME= CDCl3
##.SHIFT REFERENCE= (INTERNAL, CDCl3, 0, 16.522)
##AUDIT TRAIL= $$ (NUMBER, WHEN, WHO, WHERE, WHAT)
$$ ##TITLE= Audit trail, XWIN-NMR		Version 3.5
$$ ##JCAMPDX= 5.01
$$ ##ORIGIN= Bruker BioSpin GmbH
$$ ##OWNER= nmr
$$ C:\u/data/dgb/nmr/ADRS/3270/pdata/1/auditp.txt
$$ ##AUDIT TRAIL=  $$ (NUMBER, WHEN, WHO, WHERE, WHAT)
(   1,<2006-07-21 13:39:09.14 +100>,<MAYBRIDGE\nmr>,<NMR_250MHZ>,
      <created by zg, POWCHK disabled, PULCHK disabled
       configuration hash MD5:
       E2 DF 36 D8 04 B2 41 60 5A D7 A3 38 5A 4B D0 FE
       data hash MD5: 64K
       5F 6B D2 FE 2A CB AC 7D DA 5F D9 F3 3B AF 82 CF>)
(   2,<2006-07-21 13:39:26.23 +100>,<MAYBRIDGE\nmr>,<NMR_250MHZ>,
      <Start of raw data processing
       ef LB = 0.3 FT_mod = 6 PKNL = 1 SI = 32K 
       data hash MD5: 32K
       BC 3B F1 A5 6E 63 E4 28 E3 C2 FD 82 EC 7B D0 AB>)
(   3,<2006-07-21 13:39:31.05 +100>,<MAYBRIDGE\nmr>,<NMR_250MHZ>,
      <apk 
       data hash MD5: 32K
       F5 2E AE EB FF DD F5 68 41 1E 97 DF 74 D4 CC 3F>)
(   4,<2006-07-21 13:39:32.53 +100>,<MAYBRIDGE\nmr>,<NMR_250MHZ>,
      <abs ABSG = 5 
       data hash MD5: 32K
       3B CD 13 95 54 C0 53 9F FA 4A DF B7 E5 AD 2C 38>)
$$ ##END=
$$ 
$$ hash MD5
$$ C8 5B C8 46 3A BE 09 75 29 CE 73 D9 5C 26 C1 58
##$RELAX= 
##$RELAX= 
##$RELAX= 
##$RELAX= 
##$RELAX= 
##$RELAX= 
##$RELAX= 
$$ Bruker specific parameters
$$ --------------------------
##$DU= <C:\u>
##$EXPNO= 3270
##$NAME= <ADRS>
##$PROCNO= 1
##$TYPE= <nmr>
##$USER= <dgb>
##$AMP= (0..31)
100 100 100 100 100 100 100 100 100 100 100 100 100 100 100 100 100 100 
100 100 100 100 100 100 100 100 100 100 100 100 100 100 
##$AQSEQ= 0
##$AQ_mod= 3
##$AUNM= <au_zg>
##$AUTOPOS= <24 >
##$BF1= 250.13
##$BF2= 250.13
##$BF3= 250.13
##$BF4= 250.13
##$BF5= 500.13
##$BF6= 500.13
##$BF7= 500.13
##$BF8= 500.13
##$BYTORDA= 1
##$CFDGTYP= 0
##$CFRGTYP= 5
##$CHEMSTR= <none>
##$CNST= (0..31)
1 1 145 1 1 1 1 1 1 1 1 1 1 1 1 1 1 1 1 1 1 1 1 1 1 1 1 1 1 1 1 1 
##$CPDPRG= <>
##$CPDPRG1= <>
##$CPDPRG2= <>
##$CPDPRG3= <>
##$CPDPRG4= <mlev>
##$CPDPRG5= <mlev>
##$CPDPRG6= <mlev>
##$CPDPRG7= <mlev>
##$CPDPRG8= <mlev>
##$CPDPRGB= <>
##$CPDPRGT= <>
##$D= (0..31)
0 1 0 0 0 0 0 0 0 0.06 0 0 0 0 0 0 0.0002 0 0 0 0 0 0 0 0 0 0 0 0 0 0 
0 
##$DATE= 1153485547
##$DBL= (0..7)
120 120 120 120 120 120 120 120 
##$DBP= (0..7)
150 150 150 150 150 150 150 150 
##$DBP07= 0
##$DBPNAM0= <>
##$DBPNAM1= <>
$$ [...]
##$SUBNAM7= <"">
##$SUBNAM8= <"">
##$SUBNAM9= <"">
##$SW= 20.6930455092707
##$SWIBOX= (0..15)
0 0 3 0 0 0 0 0 0 0 0 0 0 0 0 0 
##$SW_h= 5175.983436853
##$TD= 65536
##$TD0= 1
##$TE= 295.16
##$TE2= 300
##$TE3= 300
##$TEG= 300
##$TL= (0..7)
0 120 120 120 120 120 120 120 
##$TP= (0..7)
150 150 150 150 150 150 150 150 
##$TP07= 0
##$TPNAME0= <>
##$TPNAME1= <>
##$TPNAME2= <>
##$TPNAME3= <>
##$TPNAME4= <>
##$TPNAME5= <>
##$TPNAME6= <>
##$TPNAME7= <>
##$TPOAL= (0..7)
0.5 0.5 0.5 0.5 0.5 0.5 0.5 0.5 
##$TPOFFS= (0..7)
0 0 0 0 0 0 0 0 
##$TUNHIN= 0
##$TUNHOUT= 0
##$TUNXOUT= 0
##$USERA1= <user>
##$USERA2= <user>
##$USERA3= <user>
##$USERA4= <user>
##$USERA5= <user>
##$V9= 5
##$VALIST= <valist>
##$VCLIST= <CCCCCCCCCCCCCCC>
##$VD= 0
##$VDLIST= <DDDDDDDDDDDDDDD>
##$VPLIST= <PPPPPPPPPPPPPPP>
##$VTLIST= <TTTTTTTTTTTTTTT>
##$WBST= 1024
##$WBSW= 4
##$XGAIN= (0..3)
0 0 0 0 
##$XL= 0
##$YL= 0
##$YMAX_a= 510926
##$YMIN_a= -814214
##$ZGOPTNS= <>
##$ZL1= 120
##$ZL2= 120
##$ZL3= 120
##$ZL4= 120
##$ABSF1= 16.522
##$ABSF2= -4.171173
##$ABSG= 5
##$ABSL= 3
##$ALPHA= 0
##$AQORDER= 0
##$ASSFAC= 0
##$ASSFACI= 0
##$ASSFACX= 0
##$ASSWID= 0
##$AUNMP= <proc_1d>
##$AZFE= 0.1
##$AZFW= 0.1
##$BCFW= 0
##$BC_mod= 0
##$BYTORDP= 0
##$COROFFS= 0
##$CY= 12.5
##$DATMOD= 1
##$DC= 0
##$DFILT= <>
##$DTYPP= 0
##$F1P= 14.0000005364418
##$F2P= -0.99999901652339
##$FCOR= 0.5
##$FTSIZE= 32768
##$FT_mod= 6
##$GAMMA= 0
##$GB= 0
##$INTBC= 1
##$INTSCL= 1
##$ISEN= 128
##$LB= 0.3
##$LEV0= 0
##$LPBIN= 0
##$MAXI= 10000
##$MC2= 0
##$MEAN= 0
##$ME_mod= 0
##$MI= 0
##$NCOEF= 0
##$NC_proc= -5
##$NLEV= 6
##$NOISF1= 0
##$NOISF2= 0
##$NSP= 0
##$NTH_PI= 0
##$NZP= 0
##$OFFSET= 16.522
##$PC= 1
##$PHC0= 163.506
##$PHC1= 5.070854
##$PH_mod= 1
##$PKNL= yes
##$PPARMOD= 0
##$PSCAL= 4
##$PSIGN= 0
##$REVERSE= no
##$SF= 250.13
##$SI= 32768
##$SIGF1= 0
##$SIGF2= 0
##$SINO= 400
##$SIOLD= 32768
##$SREGLST= <1H.CDCl3>
##$SSB= 0
##$STSI= 32768
##$STSR= 0
##$SW_p= 5175.98343685301
##$SYMM= 0
##$S_DEV= 0
##$TDeff= 65536
##$TDoff= 0
##$TI= <Analysis number 999999
Compound Code 99
Book Reference 9
Project Code 9>
##$TILT= no
##$TM1= 0
##$TM2= 0
##$TOPLEV= 0
##$USERP1= <user>
##$USERP2= <user>
##$USERP3= <user>
##$USERP4= <user>
##$USERP5= <user>
##$WDW= 1
##$XDIM= 32768
##$YMAX_p= 331226673
##$YMIN_p= -241114
$$ End of Bruker specific parameters
$$ ---------------------------------
##NTUPLES= NMR SPECTRUM
##VAR_NAME=  FREQUENCY,     SPECTRUM/REAL,   SPECTRUM/IMAG
##SYMBOL=    X,             R,               I
##VAR_TYPE=  INDEPENDENT,   DEPENDENT,       DEPENDENT
##VAR_FORM=  AFFN,          ASDF,            ASDF
##VAR_DIM=   32768,         32768,           32768
##UNITS=     HZ,            ARBITRARY UNITS, ARBITRARY UNITS
##FACTOR=    0.157963299565203, 1,           1
##FIRST=     4132.6476996994, 0,             0
##LAST=      -1043.33573715361, 0,           0
##MIN=       -1043.33573715361, -241114,     0
##MAX=       4132.6476996994, 331226673,     0
$$ Real data points
##PAGE= N=1
##DATA TABLE= (X++(R..R)), XYDATA
$$ [...]
22917a41570J8314K4867P8243M3562n487L2397K3453m2320l6911k9216j4655L844
22905d5479K1250l0494j40P9438N9157l822m784j4591o3876K5481L8526L7409
22893I8075j4963q1596j0916k0285j0919J747M3767j2926k5961k5185l8744q292
22881a06198M8507L2727K1695L445J2599O20j0827M326K4236j941R297j6297j3669
22868H520l6992l6205J5692N473L9281k8451N5710J3718J0131J7430m9529l9896
22856b5118M0726n3283j3011n3574j4383M6426K6672M7771j9637K5632M0611N467
22844E4299k5291j7542l4511j6568M952k8110o7145J62J2077K5991m871L2692
22832f3865K0967K2767j2347k2224R257q670o6244J0179K2209O4819P7704k7158
$$ y = [-141570, -123256, -98389, -20146, 23416, 17929, 50326, 73779, 31459, -5452, -34668, -49323, -45479, -24229, -54723, -54863, 24575, 83732, 79910, 75126, 60535, -3341, 22140, 60666, 98075, 83112, 1516, -9400, -29685, -40604, -38857, 4910, -8016, -33977, -59162, -97906, -106198, -57691, -24964, -3269, 176, 12775, 13395, 2568, 6894, 31130, 29189, 38486, 22189, 8520, -28472, -64677, -48985, -43512, -4231, -32682, 23028, 36746, 46877, 64307, 14778, -25118, 15608, -37675, -50686, -104260, -118643, -72217, -45545, 2226, -17411, 8221, 48832, 54299, 29008, 11466, -23045, -39613, -34661, -62771, -129916, -129754, -117677, -91686, -96557, -63865, -42898, -20131, -32478, -54702, -45445, -54115, -120359, -110180, -87971, -23152, 54552, 27394]
22820B7394m2561J3702K912J6520j3893j9088O28K1198J7030p0486O037J9280
22808b1327N3300R106j5933k5565J4650O868J6017k1381p180K0608J9172n1431
22796c096K2546n819k0635P08l2123k2737j2014N0383K5577l108l3774k6126j6797
22783g7015j5812P789L7796O7505L1037j6950j3154K4297M812n7743l897m41j8444
22770c0220J4063J7561j192J6262M4017M322k5843J0040r808K8368J1939n0528
22758B8981J737J4173k1728o889P303J5797n550l2909j0805J6408l1073p854q339
22745d0748J3323K8747Q908K7228L1245j9152m4351O549l3895j1834O4724K9775
22733F0519Q197j6027P854nj1236j5914n3832m4662k4078O3452L4779L5339K1695
$$ y = [27394, -15167, -1465, 1447, 17967, 4074, -15014, -14386, 6812, 23842, -46644, -40607, -21327, 31973, 41079, 25146, -419, 14231, 21099, 37116, 15735, 8555, 29163, 48335, -3096, 19450, 13631, -7004, -6296, -38419, -61156, -73170, -22787, 2790, -318, -34092, -60218, -77015, -92827, -85038, -47242, 20263, 51300, 34350, 21196, 45493, 50305, -7438, -11335, -11776, -30220, -16157, 1404, 212, 16474, 60491, 64813, 38970, 49010, 39202, 67570, 79509, 28981, 30718, 44891, 23163, 16274, 23577, 39374, 33824, 915, -9890, 6518, -24555, -32409, -40748, -27425, 1322, 10230, 37458, 68703, 49551, 5200, 11749, -22146, -33980, 30744, 60519, 68716, 52689, 60543, 60538, 49302, 33388, -20444, -65106, -89184, -25732, 9047, 44386, 66081]
22720F6081m4778j7669j3052k8810J2824Q795L9184L3944k5138J7689k9621n5549
22708c6100K9004K6613k1808k5038k9552l5960J3025k1143R809O3192P664J8612
22696a682j1928O7491L8737l1344l0198o5789P735J6931Q6119O1220p1868n5340
22684A0084j9620j1125P2957k0034m2838K9414K0736K2146O122m5200k2105l8150
22672c7613j6448n310M1613P5867n646o7838o57L889n0746J4315k1323J694N8327
22659i876O6892m097k712k5877j4654j1972L7707k6098J4796k856k0256r331n054
22646a3388j7917J315J8701n6014N030l5098m1780J8463O5091L0908o1438P718
22634g8409n777l7175p776K2806O665J2134K1044o932O68k8267J965M5182K8380
$$ y = [66081, 21303, 3634, -9418, -38228, -25404, -16609, 22575, 56519, 31381, 49070, 19449, -36100, -7096, 19517, -2291, -27329, -56881, -92841, -79816, -100959, -91150, -27958, -20294, -1682, -13610, 53881, 92618, 61274, 31076, -34713, -26978, -10047, 76072, 137292, 65424, 10084, -9536, -20661, 52296, 32262, -10576, 18838, 39574, 61720, 67842, 22642, 537, -37613, -54061, -59371, -17758, 58109, 52463, -15375, -16032, -12143, -62889, -48574, -69897, -68203, -9876, 57016, 52919, 50207, 24330, 9676, -2296, 35411, 9313, 24109, 21253, 997, -8334, -13388, -31305, -29990, -11289, -67303, -62273, -97371, -139151, -120688, -55597, -24689, -86127, -78409, -84186, -121361, -129137, -106331, -99666, -87532, -66488, -73420, -72752, -101019, -99054, -53872, -25492]
22621b5492L737k7140k7040l0446J4528L9303R114k1342O8429K4747J8047K5547
22609G1992L9523K2012o4599p4238q375K1437R316l90j2577J5028K0507k1069
22597A8567m5496r4099l4617M2612O0930L0452K9706K5167O258K7035M237l0150
22585D0602p6814K258J5266k021J1687o1679j505N7936O2998Q1732L690q1628
22573E2522k34k7878R333j5832k7835K1462n692l8059l7968j7330m254Q4978N9590
22560E2803o232k8139p332l8291K9472L385p791M838k2935o1553j3600L3389P947
22547e4039L397N7375O0728N6791L4427m9790Q423l6651r1190o7905N051J7677
22535e5706k5581K6293O7492K9447j5355R039n0508j5039K0426K0493L0156K1336
$$ y = [-25492, -21755, -48895, -75935, -106381, -91853, -52550, -43436, -64778, 3651, 28398, 46445, 71992, 111515, 133527, 68928, -5310, -13685, 7752, 17068, 16678, 4101, 19129, 39636, 18567, -26929, -121028, -155645, -113033, -52103, -21651, 8055, 33222, 39480, 66515, 70752, 40602, -36212, -33954, -18688, -20709, -9022, -70701, -72206, -14270, 48728, 130460, 134150, 52522, 52288, 24410, 33743, 17911, -9924, 11538, 5846, -32213, -70181, -87511, -91765, -6787, 52803, 46571, 18432, 11100, -27191, 2281, 5666, -2125, 2713, -20222, -81775, -95375, -61986, -54039, -50642, 6733, 67461, 124252, 158679, 108889, 117312, 80661, -10529, -78434, -73383, -55706, -81287, -54994, 12498, 41945, 26590, 35629, -14879, -29918, -9492, 11001, 41157, 62493]
22523F2493N2374K7730o0015q9793k8338N387j6646M0952r469k1328J8334r437
22511b7756M4916j9799P476P6142j0887j01264M6472L9923l6146o6923k0424O5182
22499c088K481K0997j1023p961J3131j359j8086j8687K3428K6603j8243k8655
22487b0462j0971j7528L8053L1302k1770j1986L3334l426l0674J1420l4638j8766
22475e6112J1766m2463q235M0682k4598l2178j197o3398L217j2668J5984N3799
22463a15401L0894Q9064N230j6601K5260K7666j7756o603k5583n4421j9806R007
22451f9050K7589J1432L7472O3463l9737l5128l7764j2244J7995L9880P862l5733
22439b3963m5303R659M3237K547L988K8123L0849L5616J6450K666n1073o3136
$$ y = [62493, 114867, 142597, 82582, -7211, -35549, -30162, -46808, -5856, -15325, -36653, -18319, -27756, 17160, -2639, 4837, 80979, 70092, -31172, 15300, 55223, 19077, -47846, -68270, -3088, -607, 20390, 9367, 1406, 14537, 13178, -4908, -23595, -167, 26436, 8193, -20462, -31433, -48961, -10908, 20394, -1376, -13362, 19972, 16546, -14128, -2708, -37346, -56112, -44346, -86809, -95044, -54362, -78960, -111138, -112335, -175733, -172516, -185184, -169200, -115401, -84507, 4557, 9787, -6814, 18446, 46112, 28356, 21753, -3830, -58251, -78057, -69050, -41461, -30029, 7443, 70906, 31169, -3959, -41723, -53967, -35972, 3908, 11770, -23963, -69266, -59607, -16370, -13823, -9835, 18288, 49137, 84753, 101203, 103869, 52796, -10340]
22427a0340K1793J6904r954J1954j8851K6655M1502J5569o500m924o2955k326
22415A8527Q7625M984m8785l6604n685m0430L434Q040M1749L718p3472k1763K0023
22402c8639L5847N6511K6177l4043p4935J168O1483R907Q626K563K0938m0532
22390C5071k9538N7781k945k5190p7570j0395J7742K2359J9147K1727M6606K6588
22378A01383j1014m1916q3084k9492J6457J0875M6495L1977K4799j1773k225j1121
22366D1361j7938n0295j2697J7730P567j3865M1536J2828j5391J0830L7426K5129
22354H4221k9806m2879l8351L740J4773J1750n979O317P0563M458N558n328p9392
22341c55l8285j9225K2536K685K5496l709O26O4519j2236n805m067j5873j6615
$$ y = [-10340, 11453, 28357, 18403, 30357, 11506, 38161, 79663, 95232, 88732, 83808, 20853, 18527, 106152, 111136, 62351, 25747, 20062, -20368, -16934, -8894, 32855, 36573, -36899, -58662, -38639, -2792, 53719, 79896, 45853, -29082, -27914, 33569, 43476, 52102, 54665, 75603, 35071, 5533, 63314, 60369, 35179, -42391, -52786, -35044, -12685, 6462, 28189, 74795, 101383, 90369, 48453, -34631, -64123, -47666, -36791, 9704, 41681, 66480, 54707, 52482, 41361, 23423, -26872, -39569, -21839, -14272, -28137, 13399, 26227, 10836, 21666, 59092, 84221, 54415, 11536, -26815, -23075, -8302, 3448, -2531, 3786, 74349, 78807, 84365, 79037, -355, -38640, -57865, -35329, -32644, -7148, -10857, -10231, 54288, 42052, 36247, 32180, 16307, -308]
22328c08j6759k3287J6358m060m2480j130O6933K652J644p826m463j0224m2893
22315f5843j8381L6687j8028J4048q609P4857M1280l7025l2742j2347j1633J5163
22303b2573j5436l6211j7881j7155K9702O557K6793j5097K6170J7059K9174J9399
22291C0501p3325j9221Q7546j1065R615k8817j0224j5041k6612P7648R4158r849
22279A05314r206l8649n4582k1592K1544L6392r011k2083k5401k1811L181k858
22267c8762r586R778O4344N3952p095L548j0162l778J6775K694m1267n6209l0036
22254d5804J2457j294k1113j5346J9863j3203O804Q632K8249J7015K2218J788
22242B0266k6716J3389J7302l1875k8044M139O1762L8991n6139q6900M685L4366
$$ y = [-308, -17067, -40354, -23996, -28056, -70536, -71666, -4733, -2081, -437, -8263, -12726, -22950, -65843, -84224, -47537, -65565, -51517, -60126, 14731, 56011, 18986, -13756, -26103, -37736, -22573, -38009, -74220, -92101, -109256, -79554, -72997, -46204, -61301, -35131, -18072, 11102, 30501, -42824, -62045, 25501, 14436, 24051, -4766, -14990, -30031, -56643, 21005, 115163, 105314, 96108, 57459, 2877, -18715, 2829, 39221, 30210, 8127, -17274, -39085, -35904, -38762, -48348, -38570, 25774, 79726, 72631, 76179, 66017, 62239, 79014, 81708, 40441, -15768, -45804, -33347, -34641, -55754, -71100, -51237, -64440, -57636, -49004, -20755, -3740, 18478, 20266, -6450, 6939, 24241, -7634, -35678, -31539, 30223, 69214, 13075, -73825, -69140, -34774]
22230c4774j0023R050k6480M089O107L9404M6378K73n182j2301j79o7475l235
22217e4348M7258J1873J3976j2588J7349j5496j0677k8175l5947M3675K0955Q477
22205F332R360m044O4560R531k9204q5481j0443j7761o443N8403L9507k4504M7374
22192E7187l0251l4520j2240K2119k5594r838Q05l521M3822R203k3392j8725m590
22179b9535N77j5541k7951J0295N2960r546K8860j4290K567L8438j6080o7135
22167d6381j2548j1987M928M1678N7925m386n6889K084j1576K9606l652j7344
22155b8542n681j2444L8376L3573k9841l7887J1347R442J6032J1935K0303J1020
22143C7633j5058K434R792j1446L5672k6347k4124k4668k22o3889K532Q7350P1329
$$ y = [-34774, -44797, -35747, -62227, -58138, -52031, -12627, 33751, 34024, 28842, 16541, 16362, -51113, -54348, -7090, 4783, 18759, 6171, 23520, 8024, -2653, -30828, -66775, -23100, -2145, 6332, 15692, 11648, 76208, 85739, 56535, -28946, -39389, -57150, -63593, -5190, 34317, 9813, 57187, 26936, -7584, -19824, 2295, -23299, -33137, -32332, -35853, 7969, 17172, -6220, -24945, -29535, -28958, -44499, -72450, -62155, -9195, -18741, 10119, -4171, -1604, 36834, 20754, -46381, -58929, -70916, -65988, -24310, 33615, 29229, -27660, -25576, -37152, -7546, -11198, -28542, -34223, -46667, -8291, 25282, -4559, -42446, -31099, -21657, -5625, 6310, 26613, 37633, 22575, 25009, 34801, 23355, 59027, 32680, 8556, -16112, -16334, -80223, -77691, 9659, 80988]
22130H0988o3261m7955J4028l897l7471j8192L5306o958M397k6097L2543L8315
22118A746m3222k6751k8196J3968K8807K9275J3978K9274p679J9564k4411m1228
22106c4875j7368k5247m2420J2115K1164k849L2904P2249R039k452p654l2664
22094a8058j6403K6941M9044k697o9596O762N767j3082L5741M8690L1914o90j2974
22081G1359o719o1663l9431k2411N2969L7158j5858P622K9155j7633j4148J4099
22069C4499j5768O00Q230l9419J014M0896p6270j8188L722j977O8179L000j5672
22056g154j982R586L7302R3861l6077n3881P705J162r509l0247n4294o6405L8055
22043g1878O5L1615Q563m5210L4981Q2561J2772l7797l7061j2232l1845M6834
$$ y = [80988, 17727, -30228, -16200, -20097, -57568, -75760, -40454, -47412, -43015, -69112, -36569, 1746, -41476, -68227, -96423, -82455, -53648, -24373, -10395, 18879, 11200, 30764, 6353, -34875, -52243, -77490, -119910, -107795, -86631, -89480, -56576, 15673, 24712, 22260, 14606, -18058, -34461, -7520, 41524, 38827, -30769, -24007, -18240, -31322, 4419, 53109, 85023, 84333, 71359, 64640, 2977, -36454, -58865, -5896, 31262, 15404, 23026, 52181, 34548, 20400, 34499, 18731, 19331, 27561, -11858, -10844, 30052, -46218, -64406, -60684, -62661, 5518, 8518, -7154, -9136, 450, 37752, 131613, 95536, 41655, 49360, 50522, 41013, 10766, -43528, -109933, -71878, -71813, -40198, -31635, -76845, -41864, 40697, 53469, 15672, -21389, -33621, -65466, -18632]
22031a8632J0741q04K492K5706j1867m935J1163k6682m8210J0140k7737m1552
22019a20177M4839N2021j8338L3097j9444O645N91L3145l5550m8314L6797P2490
22007C7802j7552j6423k6323m3680p934J6384J0258N7733K3675R589N3448K9146
21995A26123l7378m4783J5365k7116l9996N7340j7280j8123J2165K6148m7074
21984E391m2703r584L3598n144j1757j4832M445K342L597L0862M859n4888K4674
21971b9140Q881k7001L4287K8130J7164k4013l7213r33j9886l695j7245k4048
21959i4712M9643K1151j1041N085M0964Q8362n8595q6135J6097o5453o2834l943
21947a61411M0116R7453M1813j6188J9311m16K0087K0764l412k2388k026l8791
$$ y = [-18632, -7891, -8695, -6203, 19503, 7636, 2701, 13864, -12818, -61028, -50888, -78625, -120177, -75338, -23317, -41655, -8558, -28002, -21357, -20766, 12379, -23171, -71485, -34688, 37802, 20250, 3827, -22496, -66176, -74110, -57726, -47468, 10265, 33940, 43529, 96977, 126123, 88745, 43962, 59327, 32211, -7785, 49555, 32275, 14152, 26317, 52465, 5391, -37312, -46896, -13298, -18442, -30199, -45031, -40586, -38244, -34647, -3785, 1074, -53814, -29140, -20259, -47260, -12973, 15157, 32321, 8308, -28905, -29838, -49724, -53419, -70664, -94712, -45069, -23918, -34959, -29874, 11090, 99452, 40857, -45278, -29181, -94634, -157468, -161411, -121295, -23842, 17971, 1783, 21094, 20678, 40765, 61529, 58117, 35729, 33703, -5088]
21935e088n1089k8601k8926l0844P0596O6872M79J2155k6652k7107P0179L2710
21923E4684k1884L31J8699l8434q873j6842l9468J935M4107Q4849o222l1204O934
21910D8612L7969k9103l1738l0981o6224k6261L6353J02779M982N737L517o043
21898D9599K4113k2805k0473J9332N8604k1673n0305l2527k4633r741m4635j7729
21886i2873J0511l1316k853L2894K6851M968K34k9751M2875N1498L4227j2203
21874C5062m9945l8543n4444K3662L3876o506J2058K1163n4884m9123L2936P8275
21862a6413l3881J8126O8427R31k7859o2978j2108M5006N1867Q388k0800o823
21850A1883k1734k9350l4277N6741N4751p3433k661O7913J1825P628J0290R374
$$ y = [-5088, -56177, -84778, -113704, -144548, -73952, -7080, -6601, 5554, -21098, -48205, 21974, 54684, 32800, 33131, 51830, 13396, 4523, -12319, -51787, -49852, -5745, 79104, 72882, 41678, 48612, 86581, 57478, 25740, -5241, -71465, -97726, -61373, 41406, 46388, 52125, 55642, 49599, 73712, 50907, 30434, 49766, 108370, 86697, 36392, 3865, -20768, -30509, -75144, -92873, -82362, -113678, -116531, -83637, -56786, -51818, -51584, -81335, -38460, 13038, 47265, 35062, -14883, -53426, -107870, -84208, -50332, -56838, -44780, -23617, -78501, -127624, -94688, -16413, -50294, -32168, 36259, 37190, 9331, -53647, -65755, -20749, 31118, 39506, 18706, 11883, -9851, -39201, -73478, -16737, 38014, -35419, -38080, 29833, 41658, 49286, 59576, 68950]
21838F8950N222q6412J8329M3427R019k2596n5251K369r475J011j1463j3408p4363
21825a24641K2607O5772L2561J447j4796J5998M1069j0179m1336M1198m6608r4194
21813a11102K6985M4357L3708Q619k4231j6504m9535j3124K1352R644m3601K0982
21801i2450M8068J4957K5479M1968j4933k2809M9327J6609m4400j5587j06445
21790a00216j3046L2755M2115j4480k722j4872K7639L7867K7855Q824o3494l0024
21778f1799J577J3419K3264N9024m0378p0487J4825P4032L8499n9498o4748l3756
21766a06026k4718j0047O9810M6500L7161K2480Q592R485K006j3241j6736m9262
21754b3996K289M9950l1659o499n9366o151O308J7107M5239J885k4983j3122J5874
$$ y = [68950, 74172, -12240, 6089, 49516, 58535, 35939, -19312, -16943, -26418, -25407, -36870, -50278, -124641, -102034, -36262, -3701, -2254, -17050, -1052, 40017, 29838, -11498, 29700, -16908, -111102, -84117, -39760, -6052, 2567, -21664, -38168, -87703, -100827, -79475, -69831, -113432, -92450, -44382, -29425, -3946, 38022, 23089, 280, 49607, 66216, 21816, 6229, -100216, -113262, -80507, -38392, -52872, -55594, -70466, -42827, -4960, 22895, 31719, -31775, -61799, -60222, -46803, -23539, 35485, -4893, -75380, -60555, 13477, 51976, -7522, -72270, -106026, -130744, -140791, -70981, -24481, 12680, 35160, 43752, 53237, 55243, 42002, 25266, -23996, -21707, 28243, -3416, -9915, -69281, -75432, -69124, -52017, -6778, -4893, -29876, -42998, -27124]
21741b7124P094J2025P959j8688j5123M367N1738L5534o0966k8696Q961N1530
21729B8611j2333l1827m6594n447J1930K3823k9172r254l6971K9567K0669l447
21717f0445O5217J197k5384J0937j0108M9338L4997j349n2928J4829o490p2411
21705e2600J3433K9598k0365P724K2360j0540k6195p0651o230M1075L9742m702
21693c7351L1440K1937j4377m2490k1993o809J498l866j0828O612K8747q159J2873
21680d2766m452k7705L0241K929m0138j2410j355L5729N4709M6544J1029J0302
21668F2657n0049m2463l0313l6139L0076K547m0415m6344K236Q1329M8538j9278
21656c7618l8088k6731J9307Q528K5371O2963r313k5101j0341l0863R681R89n885
$$ y = [-27124, -20030, -8005, -46, -18734, -33857, -29490, 22248, 57782, -3184, -31880, -22919, 28611, 16278, -15549, -62143, -67590, -55660, -31837, -61009, -70263, -107234, -77667, -56998, -60445, 4772, 5969, -19415, -8478, -18586, 30752, 65749, 64400, 11472, 26301, 19811, -52600, -39167, -9569, -29934, -22210, 150, -10390, -36585, -107236, -113466, -72391, -32649, -37351, -5911, 16026, 1649, -40841, -62834, -69643, -68145, -72011, -82839, -76227, -47480, -55639, -42766, -47218, -74923, -44682, -41753, -81891, -94301, -95656, -59927, -5218, 41326, 52355, 62657, 12608, -29855, -60168, -96307, -66231, -63684, -104099, -150443, -148207, -66878, -18340, -37618, -75706, -102437, -83130, -74602, -49231, 13732, 4419, -20682, -31023, -61886, -52205, -51216, -57101]
21643e7101j5557l1125O0097J9957m9917k2644J4618M9756K1873N2607K9072k2124
21631D9512n8676m044J3534m2715Q760k1328N794M0923j6915o927J1251j4875
21619c5706k6381J0900K129J6511M291q581L9158K0413k0412J474J1655J6562
21607C2013l09M7985l4164p0526l601k663K1875P87j9080k3786K5172N680j1882
21594c2499k4527L4479K8160k4103n900N441M2461j7979k6281l3603R9064J8639
21582F3352k551m0254J5170l0347J906l0481K7558m2706m9646R447N6796O9680
21570D7924k3080o2988l8640N5998J75J7446R559j7238K6128k9821K215j184K6292
21557A2786J2926m5420O2843J7283m8647J2122k9821p528M4373k7264l491K3346
$$ y = [-57101, -72658, -103783, -43686, -23729, -73646, -96290, -81672, -31916, -10043, 42564, 71636, 49512, -9164, -13208, 326, -42389, -33629, -54957, -49163, -8240, -25155, -32082, -20831, -35706, -62087, -51187, -49058, -32547, -28256, -36837, 2321, 22734, 2322, 3796, 15451, 32013, 31704, 79689, 45525, -25001, -28602, -31265, -9390, -8603, -27683, -51469, -26297, -20617, -32499, -57026, -22547, 5613, -18490, -24390, -18949, 23512, 5533, -20748, -54351, 44713, 63352, 60801, 20547, 35717, 5370, 7276, -23205, 4353, -38353, -87999, -78552, -21756, 47924, 24844, -38144, -76784, -20786, -20611, -3165, 6394, -10844, 15284, -14537, -12322, -13506, 12786, 25712, -19708, 43135, 60418, 11771, 23893, -5928, -13456, 30917, 3653, 162, 23508]
21545B3508l3152p1788J9470J7479J8819j9214J9414M2472l2809n2091O807L9082
21533b2003J6168j7127L655m0426K8765P3245j1841k2754l79l3890l0571J0013
21521d7145O1539N56l5043l5690K6228q87l3147L0910J7645m9935l6636M2500
21509e9105N1859p9697p804J5101k6282Q897L5136M7214k2908k9290M6808R340
21497a0731J7388o677j6874J305n1838K545P5981L169k9691K0860J1345L4720
21485E1502M1831k6608j8112J032P00l4344k8054m8617m4042M8511M2557j0457
21473b4101Q993K2555m6537J566J5653k5141m1801N8753L8557k7192j1657k9068
21461e9420J1887L3939p522k3517K6988l0976J2354q193O6508J1293n9568j7126
$$ y = [23508, -9644, -81432, -61962, -44483, -25664, -44878, -25464, 17008, -15801, -67892, -61085, -22003, -5835, -22962, -19307, -59733, -30968, 42277, 30436, 7682, 7303, -26587, -57158, -47145, 14394, 14950, -20093, -55783, -29555, -30442, -63589, -32679, -15034, -64969, -101605, -59105, -7246, -86943, -94747, -79646, -105928, -97031, -61895, -14681, -37589, -66879, -20071, -10731, 6657, -20, -16894, -15589, -67427, -64882, 11099, 14268, -15423, 5437, 16782, 51502, 93333, 66725, 48613, 49645, 50345, 16001, -12053, -60670, -104712, -56201, -13644, -24101, -15108, 7447, -39090, -37524, -21871, -47012, -88813, -30060, 8497, -18695, -30352, -59420, -47533, -13594, -21116, -44633, -17645, -48621, -36267, -44460, 22048, 33341, -26227, -43353]
21449d3353P4212M808P860m134K6892K921l9462J2229j0401p738J2067k1560j7354
21436c013k092J7590k6833O980J8689j7j5110l2124L1748K7650L6647j8881j8062
21423B3172K6926L19l0865l1778l5596J3246k701p772M5215j8725j8304J4814
21411b2049M8600K026m5484k670J5862p350p978j8349J4412K251k8201M773K4423
21398a9734n0689l013K3965M2815K7488l4165j2620L6794O873l6322K7770j9261
21386a0099K1933J6501n7543k0734L2446K4770q511k7187j5653r262L130J9321
21374c0888M4516J1056J39l9012l6917n1992K4689J2403R74p889K4290r844M673
21361e3802J7265R249k5899K8314O7110M6254l6337m2054o5511l6206j1915p0705
$$ y = [-43353, 30859, 35667, 43527, 39393, 66285, 69206, 29744, 41973, 31572, 23834, 35901, 14341, -3013, -5105, 12485, -14348, -7368, 11321, 11304, -3806, -35930, -4182, 23468, 60115, 41234, 23172, 50098, 50417, 19552, -12226, -47822, -34576, -37277, -45049, 166, -18559, -36863, -22049, 26551, 28577, -16907, -19577, -3715, -11065, -19043, -37392, -22980, -20729, -48930, -44157, -19734, -70423, -73436, -49471, -6656, 20832, -13333, -25953, 10841, 17714, -18608, 9162, -10099, 11834, 28335, -29208, -49942, -17496, 7274, -1237, -28424, -44077, -53339, -50209, -30888, 13628, 24684, 24823, -14189, -51106, -103098, -78409, -66006, -65032, -72921, -48631, -58475, -53802, -36537, -27288, -53187, -24873, 42237, 88491, 52154, 10100, -55411, -91617, -103532, -174237]
21349a74237L5937K8030Q0778N5795K2112l5298k6273O5378j0618N378M3303j0849
21337G9436l7400k3952L0560L7166k3173j9191J0088K0931l1094n063K6152R6953
21325A61413o8244q0481l3316O627J2803O2294k9686m9656l6846k3294N1244j3283
21313d0425j467L2315n8598L1964M7632n071k1298k1189n783J738K1355L473l0847
21300d6201k5787M9843J2631K6864j019L0087o368j0762r6102m474N9394N4182
21288D2288P908J1341k1502n352k0587n4589o5106l918L4120L9944J0795K5665
21276A007k94J7363J1773j8015p865J5149K433l5164l1052k2614M9859L5434N9414
21263G7428M3189j09852n3224K6878M3020j8151m599P943K046r768k3744m4291
$$ y = [-174237, -138300, -110270, -29492, 26303, 48415, 13117, -13156, 52222, 41604, 46982, 90285, 79436, 42036, 18084, 48644, 85810, 62637, 43446, 53534, 74465, 43371, 38308, 64460, 161413, 93169, 12688, -20628, -14001, -1198, 61096, 31410, -18246, -55092, -78386, -27142, -40425, -41892, -9577, -68175, -36211, 11421, 6350, -14948, -36137, -41920, -40182, -18827, -15354, -46201, -71988, -22145, -9514, 17350, 16331, 46418, 40050, 29288, -66814, -71288, -11894, 42288, 50196, 61537, 40035, 34683, 14096, -40493, -105599, -109517, -75397, -35453, -24658, 1007, 713, 18076, 29849, 11834, 3969, 19118, 21551, -13613, -44665, -67279, -17420, 18014, 77428, 120617, 10765, -42459, -15581, 27439, 9288, 4689, 12632, 14678, 4910, -18834, -63125]
21251f3125J1009o6919m1713N2399K9843J4948N457m2663L3138K5423N9408K8165
21239D5370K4707l2666l4561n621k1981j3097N1765M0607k63r992l7270q4242
21227g7244o5953M8059L5721M6436M1201J8093l1222n6615M2671j8706j2389M5170
21215A5222L7569l357n6680o528k1460O1529K3531L8805K027l4420l2077K7725
21203E1886p6402l6747O4527K3135n1242N3598K7102L5061k2106q2207o679r425
21191b9499k1781q471N2967K7189J3807k6723l3132l1576j0248N1841L7159L3568
21179E5101L451l5448m615k1054m8053J0715K0588L0655K1502J5109N415k1849
21167C1517n9110l0099j9146J4531p5798mQ6270L6947J0850m384k2197p682J0842
$$ y = [-63125, -52116, -119035, -160748, -108349, -78506, -63558, -58101, -100764, -67626, -42203, 17205, 45370, 70077, 37411, 2850, -2771, -24752, -37849, 13916, 54523, 54260, 44268, 6998, -77244, -143197, -95138, -59417, -12981, 28220, 46313, 15091, -41524, 1147, -17559, -29948, 15222, 52791, 49434, -7246, -13774, -35234, 26295, 49826, 88631, 90658, 56238, 24161, 51886, -24516, -61263, 3264, 26399, -24843, 28755, 55857, 90918, 68812, -13395, -20074, -29499, -51280, -59751, -6784, 20405, 34212, 7489, -25643, -57219, -67467, -15626, 21533, 55101, 58552, 23104, 18489, -2565, -50618, -39903, -19315, 11340, 32842, 47951, 53366, 31517, -27593, -57692, -76838, -62307, -138105, -138109, -51839, -14892, -4042, -8426, -30623, -38305, -27463]
21154b7463j523o120j8415l5252N2251M8374l3865k2383j0647L1918O606m3502
21142f0021P974p585k7014L703Q170j1841j2733K3172M4842K4521j2137K4839
21130E890L1372K201j440m5251K3972K8782j3563q4049m2706j5691L1175O6706
21118a2602j881J0945k8334k9590K4507k0675j6865j4541J7941J6556O7877l5272
21106b1934j703q040k3894j8270n91j2811L2152K4474O5701L2474n642J6038m9855
21093B8099m1717O4573m0507l5022m5646p2132p373O9596M6807p660p874o3499
21081a12355L6910M3400l0071J0582J0064p460n7798o067L2556M6953M0754k657
21069D811j5604k2526L363J8665n6268n1959L9180K1334m5941O7376J9319p9674
$$ y = [-27463, -28986, -35106, -53521, -88773, -36522, 11852, -22013, -44396, -55043, -23125, -16519, -60021, -52047, -59632, -86646, -82943, -74773, -86614, -99347, -76175, -31333, -6812, -18949, 5890, 37262, 39463, 38023, -7228, 16744, 45526, 31963, -52086, -94792, -110483, -79308, -12602, -14483, -3538, -31872, -61462, -36955, -57630, -74495, -89036, -71095, -54539, 13338, -21934, -23637, -31677, -55571, -73841, -74432, -87243, -55091, -30617, 35084, 67558, 61916, 77954, 28099, -13618, 50955, 10448, -24574, -70220, -142352, -149725, -80129, -33322, -40982, -48856, -112355, -75445, -32045, -62116, -51534, -41470, -48930, -106728, -112795, -80239, -33286, 7468, 4811, -10793, -33319, -29956, -11291, -67559, -119518, -80338, -59004, -104945, -37569, -18250, -97924]
21057i7924j1116l4891k1477Q3115R0941j2614j9687j8135p0968M5310L6700q1890
21045a12636j0031P729k9368O3894J8320J075K6301L6368k4244L550K9863k4k8663
21032a7866l4651m6296r750K8974N778L7653K5407k0703N699J7586j0169o9084
21020h7422M0807M4137j5796N668k9031L2011J3839o2301N14k3638M33j9230M3749
21007e6260M5266Q739m5838m6698L6768M4834J7596M3448k2338k1161p037Q122
20995E441p872N1848J9882K8549j4504q241m5642j023n4972m8506r24J5393L0448
20982c0123O0239n7817o9854L1246O6899M0258j6245N1174M4301l4244l1855n79
20970E3400k0788K3434k0690m1145n1647j9978j8237P5330L1294m0701q559O207
$$ y = [-97924, -109040, -143931, -165408, -82293, 8648, -3966, -23653, -41788, -112756, -67446, -30746, -112636, -122667, -114938, -144306, -80412, -62092, -61017, -34716, 1652, -22592, -19042, 10821, 10797, -17866, -52517, -98813, -108563, -79589, -73811, -36158, -10751, -31454, -25755, -8169, -18338, -87422, -46615, -2478, -18274, -12606, -41637, -9626, 4213, -58088, -57574, -81212, -80779, -100009, -56260, -10994, -2255, -48093, -94791, -58023, -13189, 4407, 47855, 25517, 4356, -2681, 5441, -2431, 49417, 69299, 97848, 83344, 75103, 29461, 28438, -26534, -75040, -75964, -60571, -30123, 30116, -27701, -97555, -66309, 590, 40848, 24603, 75777, 120078, 85834, 53979, 53400, 32612, 56046, 35356, -5789, -57436, -77414, -95651, -20321, 10973, -29728, -38287, -32080]
20958c2080J0357k4209R909O3166k832j5372K7497K252n6652q674M2648j4581
20946A429n1443K570L1225k8357j8543L5980L6734K64o5139Q492L4213K2288O260
20933A5973L2248M9936k5704l0403j2545k7125L6192J4927o526j8130J5048o0403
20921a6512q246K6963j757k7743K1276k0868O620j6926L2718n3775o1100n697
20909a25047l1538J1710N4504L0428K571L9890l0328k4095M305N9096O4384K0970
20897G6850j2494R336n2689l5516J0426n3118J9217L7055J5840J5137m5883j9539
20885c5378L667J1472l0847p6687L8773O1235m232P8972M1447m6820n5026j3333
20873b6757l7832O39M2203N0108O5965l4264m8860r2076J9822Q8100P0488J9042
$$ y = [-32080, -21723, -45932, -36023, 27143, 24311, 8939, 36436, 38688, -17964, -26638, 16010, 1429, -50014, -47444, -16219, -44576, -63119, -27139, 9595, 9859, -55280, -46788, -12575, 9713, 15973, 48221, 98157, 72453, 42050, 29505, 2380, 38572, 53499, 46973, 28843, 43891, -16512, -24758, 2205, 448, -27295, -6019, -26887, -20267, -37193, -4475, -58250, -119350, -125047, -156585, -144875, -90371, -59943, -57372, -17482, -47810, -71905, -67600, -8504, 55880, 76850, 64356, 73692, 21003, -14513, -4087, -57205, -37988, -933, 14907, 30044, -15839, -35378, -31711, -20239, -51086, -127773, -89000, -27765, -31997, 46975, 88422, 41602, -13424, -26757, -64589, -63950, -21747, 28361, 94326, 60062, 11202, -80874, -61052, 27048, 97536, 116578]
20861A16578k6720m7343p5408m6561K350k1395k7357K7191M5195k7585k2903L6717
20849f7241K5121J4790P877o0570n0430l1356K1606Q5013N1441N7411k299l3218
20837A8145l8395l3898l2876J6351M8219j8989N7198K8634k7430o9705j6749J3615
20825e5880Q956J7018M0897N4735m5083j02727J0928M3229l386j2811M3254K2261
20813B1391n8137K2708j0175k3083j2237k542O2682L5227l3725n2984j2048N2013
20801a0910O1670m6802J6348n066l9865j6206K7874K0699L6142j631o24j5461
20789B6168j3525L714j2050L907k0819j0761o9546M3429O7611n512j3069K2825
20777B2372q630n243J9963k0714j5548K2945J9275L6100j7107q460j6453J3625
$$ y = [116578, 89858, 42515, -32893, -79454, -77104, -98499, -125856, -98665, -53470, -81055, -103958, -67241, -42120, -27330, -19453, -80023, -130453, -161809, -140203, -55190, -3749, 53662, 51363, 18145, -20250, -54148, -87024, -70673, -22454, -41443, 15755, 44389, 16959, -52746, -69495, -55880, -46924, -29906, 10991, 65726, 20643, -82084, -71156, -27927, -31313, -44124, -870, 21391, -36746, -14038, -24213, -47296, -59533, -62075, 607, 35834, 2109, -50875, -62923, -10910, 50760, 3958, 20306, 15240, -24625, -40831, -12957, 7742, 43884, 42253, 41629, 26168, 12643, 16357, 4307, 8214, -12605, -23366, -92912, -49483, 18128, 12616, -453, 22372, 13742, 8499, 28462, 7748, -7800, 15145, 34420, 70520, 53413, 44953, 28500, 42125]
20765D2125j2772o220m9372j7125n7O1992J7398k5519o1862N441O819j5984p115
20752f2251q892J2156k1054j229P2829O0492m158p816k6183m3871J8231M0761
20740B9015n4276k0309J8062K5334N112K0757l775j2653j5376J8630J9564M38
20728C0523k4016q9736j860L7472M6112k6334o661k0161l6165K0474n4263n179
20716a29794M9122j746N953P2922L373m1692o9338j4852k6008O288M3868J1512
20704i0392J025N7673L48k4747l1409n1321m7600M6624N7275L6013Q691j7917
20692e5737J2731L7251K7014j0202J6919j5318l1264l9519n9747l354M1378K9575
20680e0273k4927K3235J2987K3074j986K8243N5320l8270m0715L3496L4530N989
$$ y = [42125, 29353, 23133, -26239, -43364, -43421, 18571, 35969, 10450, -51412, -45971, -39152, -55136, -62251, -71143, -58987, -80041, -81270, -8441, 52051, 47893, 40077, 13894, -29977, -11746, 29015, -25261, -45570, -27508, -2174, 2938, 23695, 19920, 7267, -8109, 10521, 30085, 30523, 6507, -83229, -85089, -47617, -1505, -27839, -34500, -54661, -90826, -70352, -124615, -129794, -80672, -82418, -76465, -3543, -170, -41862, -111200, -126052, -152060, -145772, -101904, -90392, -89367, -31694, -31346, -56093, -87502, -138823, -186423, -139799, -82524, -46511, -37820, -55737, -43006, -5755, 21259, 11057, 27976, 12658, -18606, -58125, -117872, -121226, -79848, -50273, -75200, -51965, -38978, -15904, -17890, 10353, 65673, 27403, -13312, 20184, 54714, 60703]
20668F0703K247n0694n8806j2625K5460L5496M3295l7165L0381L9256l1012m0306
20656F230L1073k4136l214L0583n270o6082m560J8019k9374K9961Q393L7193K2940
20643E1756l4072m5798P955L4191l5477l1036l6686l9502L925L2822Q0616N4898
20631D3592l9335p796J4220K3526p134o1527J0444K0298L6288p6623o7650j3373
20619a25070L1671O6723J290J1297l313J350K0683j3282j0548l9194M484L7787
20607a6122l2110k7293K227j1144J1333N8088P5024M7037Q05N114l4024m3727
20595C5208l0397R635j4564n2627j8958M1452J1757j6876m1276K2935Q258l3286
20583g8739J4057N1651J4228p0631l4823k3975L7956r978Q026k6324m1014P1327
$$ y = [60703, 62950, 12256, -46550, -59175, -33715, 1781, 45076, 7911, 38292, 77548, 46536, 6230, 37303, 13167, 9953, 40536, 35266, -30816, -35376, -17357, -46731, -16770, -8377, 28816, 51756, 17684, -28114, -20159, 14032, -21445, -52481, -89167, -128669, -124744, -91922, -11306, 43592, 4257, -3539, 10681, 34207, 27073, -34454, -24010, -3712, 32576, -44047, -111697, -125070, -93399, -26676, -25386, -14089, -17402, -16052, 4631, -8651, -19199, -58393, -53909, -16122, -48232, -75525, -73298, -84442, -73109, -15021, 60003, 107040, 107845, 112959, 78935, 35208, 4811, 14446, -118, -52745, -71703, -30251, -18494, -35370, -76646, -53711, -45453, -78739, -64682, -13031, 1197, -69434, -104257, -128232, -90276, -100254, -92228, -118552, -159566, -88239]
20571h8239R9060L1510o4052j5576P2608N2986R418q4868p1289l8465J3969q899
20559i1837J6736L267O339M445J6749j0202k5151N592K540j4896N4679L8543j1306
20546d502m3746l764J7490N657j2203o694j4669L9484K0363Q041n3699k0549M9261
20533a9530M4487K2853J415k8014k8057L5638J9614K3757k2230j01548j9521L4872
20521c6264J7031J0880k4345j2189Q234N4904l2440m8272J7005M9672L0930K9869
20509F5015j5152L6845j7115l0705l162l9099k6337O2522k850k0639Q974N0664
20497F8961l7326k4874o8508j4081K3968K7721j8069N777M163k2202L4249k5774
20485d5995j9521R1088N6220l9119l7715n4569K1981j4094P523k5413J2215K5325
$$ y = [-88239, 10821, 42331, -21721, -37297, 35311, 88297, 97715, 12847, -58442, -96907, -82938, -91837, -75101, -71834, -65495, -61050, -44301, -54503, -79654, -74062, -71522, -86418, -31739, 6804, -4502, -48248, -52012, -34522, -28865, -41068, -47762, -62431, -22947, -2584, 5457, -48242, -68791, -19530, 24957, 47810, 49225, 21211, -6846, 28792, 48406, 72163, 49933, -51615, -71136, -36264, -19233, -8353, -32698, -44887, -36653, 18251, -14189, -62461, -45456, 4216, 35146, 65015, 49863, 86708, 69593, 38888, 35726, -3373, -29710, 32812, 29962, 9323, 18297, 68961, 31635, 6761, -61747, -75828, -51860, -24139, -42208, -36431, -32268, -54470, -20221, -45995, -65516, 25572, 81792, 42673, 4958, -49611, -27630, -41724, -34201, -59614, -47399, -22074]
20473b2074K4627l0691k6241j9316K3112L2111k0570J6186L4614n1780j1930n134
20461e7086K8271N2839J3849r832r321J193P558J3789N1938r6776n9896J8689
20449d4785m604n6903K0693N4145j3666K5767M3094k6844K0270r782n9395j891
20437e3901n927Q8640K6633l481J7838J0559l2135r692J8832n5617j3079L9909
20425B8579M7839l5526l5945J0926j032k080j3453k2052l8372P133N6188m3955
20413d1750L4262n378N755j8823q228l6890Q494m5150K3710K5857K5226j6025
20401d8940K2785n469k4349q5436N7422O1870O1873O5709k4783j00553k4716J2894
20389c1693j3474k4508j4671M6571J9313J0951J1659k6517M4140L7503J415j5660
$$ y = [-22074, 2553, -28138, -54379, -73695, -50583, -18472, -39042, -22856, 11758, -40022, -51952, -57086, -28815, 24024, 37873, 28041, 18720, 19913, 27471, 41260, 93198, -3578, -63474, -44785, -49389, -106292, -85599, -31454, -45120, -19353, 23741, -3103, 17167, 7385, -52010, -53901, -59828, 28812, 55445, 51964, 69802, 80361, 48226, 38534, 57366, 1749, -11330, 28579, 76418, 40892, 4947, 15873, 14841, 12761, -692, -22744, -61116, -53983, 2205, -41750, -7488, -12866, -7111, -25934, -34162, -71052, -62558, -107708, -83998, -58141, -32915, -48940, -26155, -31624, -55973, -141409, -83987, -22117, 39756, 105465, 80682, -19871, -44587, -31693, -45167, -69675, -84346, -37775, -18462, -7511, 4148, -22369, 21771, 59274, 60689, 45029]
20377D5029o6648o5147Q765J6321P2992k6070L6943J3624m508m8156m4810M2631
20365a9034K3528O317m067m9977j7278j8153J5607L021j6252K7245k075K711L0058
20352a8349K0704J5769k9369k6862J651M0708j5239M802k2860k0834o912L4643
20340b2148p093m0916j4597L962j9251k4895J3015j2854K8147n4975p709L0020
20328a29294P0272N2486K7443M2920K7418R604k3110k5553K4469p546m2917n0605
20316b4413j8225k46J0028l1893o3165K3552K2118M6115K4573J2273l9125n7472
20304i5880J4195J3281K4956N592J869K0712j3928j8907j931M0109O842j9467
20292b2557K688J8619R890m38p443J7512K7191J7574l2000J6271j1437l6243m2817
$$ y = [45029, -21619, -86766, -78001, -61680, 11312, -14758, 22185, 35809, 31301, -16855, -61665, -19034, 4494, 10811, 6744, -43233, -60511, -78664, -63057, -60036, -76288, -49043, -51118, -48407, -18349, 2355, 18124, -11245, -38107, -36456, 4252, -10987, -6185, -29045, -49879, -56791, -22148, -29241, -70157, -84754, -80792, -100043, -124938, -111923, -124777, -96630, -151605, -159314, -129294, -59022, -6536, 20907, 63827, 91245, 100849, 77739, 52186, 76655, 69109, 26192, -24413, -42638, -42884, -32856, -64749, -127914, -104362, -82244, -36129, -11556, 717, -38408, -95880, -81685, -68404, -43448, -37856, -35987, -15275, -29203, -48110, -50041, -9932, -3090, -22557, -19869, -1250, 8640, 8202, 759, 18271, 45462, 63036, 31036, 47307, 35870, -373, -43190]
20279d3190j8978K8345R56N2212M8267L8347m9245k9372j2498K1915k8716l6629
20267b8586M0685O316M8210N5367k8954l3189J7213L649n3394k5177N3818L3930
20255H9888j363l0704m012P078J098n9852o6260k4246O1360M2633k9908j7005
20243c1293l7965j1799j6686j9111K7537p482N2375P0784o7961j7271K0482l975
20231d2365L502o023L0239L5590M237o6788k6939O6588k4132r892k282m0954K99
20218g8920N8726N1421j6990l8621O1054J2487R113k8865k5677j3155J6875K1775
20206B9223k7241L501k6358o0939n4382M3298J27786K5936o7629k1955J1532j7468
20194c4696J2814L0882J6612K2447m4148l5740L9751r288m2867M6184L7916k6021
$$ y = [-43190, -62168, -33823, -32867, 19345, 67612, 105959, 56714, 27342, 14844, 36759, 8043, -28586, 12099, 18415, 66625, 121992, 93038, 59849, 77062, 80711, 27317, 2140, 55958, 89888, 88525, 57821, 53809, 60887, 61985, 2133, -64127, -88373, -27013, 15620, -14288, -31293, -69258, -81057, -97743, -116854, -89317, -96799, -44424, 26360, -41601, -58872, -38390, -42365, -38863, -44886, -14647, 20943, 25180, -41608, -68547, -1959, -26091, -35983, -38265, -79219, -78920, -20194, 31227, 14237, -24384, 36670, 49157, 58270, 29405, 3728, -9427, 7448, 29223, 1982, 5483, -20875, -81814, -136196, -92898, 34888, 60824, -6805, -28760, -17228, -34696, -21882, 9000, 25612, 48059, 3911, -31829, 7922, -1366, -44233, 1951, 39867, 13846]
20182A3846k437J9033l3987K2016j6950j8538k1695k5868J2263K521l3892p406
20170i1094j223K8826J1786J6675j2876n2487Q228L3408Q805K7719J5176J0584
20158C527J082j8766q530K7426O982r832k1435K0892O0379n8366l0500M2610l6772
20145b1303p1311N5844K6424k7944l7687q765Q0485M0898n144k4889k1443J8080
20133C245J626P779P298n5114p2086L4878L7448M8180M7665n07m1217n6763m2402
20120g9970M544J5507L3708J3666n3153j1025L612o362K8020L2842j0809O967
20108b2453O682N0259j8186j8353q086k2383K6110l3630k3551m1258J120L2956
20096g0773M8202N3741Q694L2814K3733j9071r6145k2573K8590N624l9120k8453
$$ y = [13846, 11409, 30442, -3545, 18471, 1521, -17017, -38712, -64580, -52317, -49796, -83688, -91094, -92317, -63491, -51705, -35030, -47906, -100393, -92165, -58757, -49952, -22233, -7057, 3527, 4609, -14157, -22687, 4739, 11721, 1889, -19546, 1346, 61725, 3359, -27141, 15469, -21303, -92614, -36770, -10346, -38290, -75977, -84742, -4257, 36641, 31497, 6608, -14835, 3245, 4871, 12650, 19948, -35166, -107252, -72374, -34926, 13254, 60919, 60412, 19195, -37568, -79970, -75426, -59919, -26211, -12545, -65698, -76723, -73111, -79473, -51453, -18611, -29420, -22453, -15771, 34488, 16302, -2051, -10137, -32520, -6410, -40040, -63591, -104849, -103729, -70773, -22571, 31170, 39864, 72678, 96411, 77340, -18805, -41378, -12788, -7164, -46284, -74737]
20084g4737k2873M0963O734j0752j1631O7510N169k2388M1466n1957l4146L928
20072f2714N9981M8529k3079k9497q470j8174O4567o8053J498M6377L9247l3264
20060A6948o6829n34P2763P2830k3719p5183k9373M6637J0958j9878k5525L9289
20048A8384j8286k7876J5529P4079Q951m0980J284J4726k3578o6959J5882Q0018
20036E1174N3521m0361n5m7629m7563j673n802K9953L3012l2369l5817J8802L839
20023b0968k9170j0206M408j2278Q255J8809k6487K197k493o555N3322J2893k4406
20010c2679j5840M0892n0533m1324L814J07604N5172n4454j9649M1482o5552m3749
19998g4816J1387O9154k6555o3677K510L8978J7098P893R5922J158k7760m5745
$$ y = [-74737, -97610, -56647, -49913, -60665, -72296, -4786, 383, -22005, 19461, -32496, -66642, -62714, -2733, 45796, 22717, -6780, -15250, -33424, 31143, -36910, -35412, 10965, 50212, 16948, -49881, -50415, 22348, 95178, 71459, -3724, -33097, 13540, 24498, 4620, -20905, 18384, 98, -27778, -12249, 61830, 70781, 29801, 31085, 45811, 22233, -44726, -28844, 51174, 104695, 64334, 64279, 16650, -30913, -32586, -38388, -8435, 24577, -7792, -43609, -24807, -20968, -50138, -60344, -55936, -68214, -59959, -41150, -67637, -65440, -67933, -74488, -21166, -8273, -32679, -48519, -7627, -58160, -99484, -95670, 11934, 67106, 12652, -6997, 34485, -31067, -74816, -63429, 5725, -20830, -84507, -81997, -43019, -25921, -18028, 77894, 79052, 51292, 5547]
19986E547l6624M6861m446o2436j2562K776K9112N2551L1839N733k6313j5468
19974A6570O496M1526j2008o4506m6263K8346k3894k2378M7040m5139L093m914
19962g6031L3153n4486o2081N5901J0639R347K1418M3417q278j8563P3579N8655
19950H6670J6152j8848j9493l6357J8515J7046n007q1087j3941K5975m045M6765
19938C2345j3775m1853M144J7478K3604l2914k3807L0733K2312L5691R222M0934
19926A04114o7285n4272k0003K3310J248j5468m869n536p662J4642N887l452r723
19913c9069m0350O2913M3800l73J3379K1211k6822k3392K1644j9274m4304q820
19901c9457J0285J1736R222j6544k0408j2287j3138j2008l6100l1427Q916R3405
$$ y = [5547, -31077, 15784, 11338, -51098, -63660, -60884, -31772, 20779, 52618, 58351, 32038, 16570, 23066, 64592, 52584, -11922, -58185, -29839, -53733, -76111, -29071, -74210, -71117, -76031, -42878, -97364, -159445, -103544, -92905, -83558, -62140, -18723, -27001, -45564, 28015, 86670, 102822, 83974, 64481, 28124, 46639, 63685, 58678, -22409, -36350, -10375, -14420, 32345, 18570, -23283, -19139, -1661, 21943, -10971, -34778, -4045, 18267, 53958, 63180, 104114, 36829, -17443, -37446, -14136, -12888, -28356, -33225, -38761, -46423, -31781, -25894, -29346, -39069, -79419, -16506, 27294, 26921, 40300, 61511, 34689, 11297, 32941, 13667, -30637, -39457, -29172, -17436, -8214, -24758, -45166, -57453, -70591, -82599, -118699, -150126, -141210, -47805]
19889d7805k6987L2725O1763j8277o4724k1484N7747j1224J3149L4460j463J3179
19877B1059k689n1623k1740k3197J7534R180k0265r155J7571K9506L7097L2644
19865C5922n828k7759K4546L6760J9848j1354M272o753m4823l601M3606r531k0846
19852C4459K1560j5793r2547m5155J4445L766K7546l0853K4499M7188N186l3537
19840c9236M982R3358n1419m3268k2516n6267n707O8162k360L00K5750L5140o733
19827A86p225n6879k3780N7140J8745k332L7045K5688l999k5763L8002J8441m5011
19814C0258j3649J168m2285j6291k2572M4997L6410p859l3366l9185n1861K5843
19802h8392n905l1836l6520J3110N7853J7262K8026J5165m7888L3658k0594l3156
$$ y = [-47805, -74792, -42067, 19696, 1419, -63305, -84789, -27042, -38266, -25117, 9343, 7880, 21059, 18370, -33253, -54993, -78190, -60656, -51476, -71741, -80896, -63325, -33819, 3278, 35922, 30094, 2335, 26881, 63641, 83489, 72135, 76407, 69654, 24831, 21230, 64836, 55305, 34459, 56019, 40226, -52321, -97476, -83031, -79265, -51719, -82572, -58073, -10885, -5699, -39236, -34254, 59104, 7685, -35583, -58099, -114366, -120073, -51911, -54271, -53971, -28221, 6919, 186, -7039, -63918, -87698, -30558, -11813, -14145, 22900, 48588, 44589, 18826, 56828, 75269, 30258, 16609, 17777, -24508, -40799, -63371, -18374, 18036, 10177, -23189, -62374, -114235, -88392, -94297, -126133, -162653, -149543, -91690, -74428, -46402, -31237, -79125, -45467, -66061, -99217]
19790i9217N2014K0677q660m9397k3234L6500M0053j3905m7171K354L2895N9165
19778B074j7899p94K9236K9152k0964j9196j1756m7638m6579o914K418j8912L7821
19765h9951K6720j9165k1994P069M3665O150k5271K3183k3430j2157K6291L2847
19753b6043M6465l1988l552L7412j3711J4063l8232M039j6025k77L1609l150k2084
19740b1474P126j5571M1184j5708o7202j528J7180l15K2687l0257m4765p2082
19728a80725J9731M5234L6949j677J2199l8858L5292j5292M083N4923J01859K1544
19716I5262o2672m343m9377m906Q18m6201J3627K477J298K2762J945j8134L3021
19703a4423O8511K5459l6294j9046L2591K4973k2519k6315l4592m6129q881K8014
$$ y = [-99217, -47203, -26526, -35186, -84583, -107817, -71317, -31264, -45169, -92340, -89986, -57091, 2074, -15825, -16619, 12617, 41769, 20805, 1609, -10147, -57785, -104364, -111278, -108860, -127772, -89951, -63231, -82396, -104390, -97321, -53656, -47506, -72777, -49594, -73024, -85181, -58890, -26043, 20422, -11566, -15118, 22294, 8583, 22646, -15586, -11547, -27572, -27849, 3760, 610, -21474, -14348, -29919, 11265, -4443, -71645, -73173, -55993, -56308, -33621, -63878, -108643, -180725, -160994, -115760, -78811, -80488, -68289, -107147, -71855, -87147, -83064, -28141, 73718, 95262, 32590, 28247, -21130, -26036, -25218, -71419, -57792, -55315, -54017, -31255, -29310, -47444, -14423, 54088, 79547, 43253, 24207, 56798, 81771, 59252, 32937, -1655, -47784, -56665, -28651]
19691b8651m4652J8875J4500M3005L0293r471n9463J7646k4947j3355n288M4024
19679a7484N5582N8690O371o1599n6648j1214L971K2237P553O3634l1841l7942
19667A310K8252J1978o80n0479k461N822K051L4197k3853K9474j012K28M7556
19654H2383n7498j1758K116K2046J5857k3154M396K7422o2187m0011k5120L7769
19642b7739L2426M97Q426j2379m892M192j100j4582J751l0802K1029j0289O319
19629b7143M0010M3476K7926J1909m2372l1527o607k5343o1795l7503R458K1077
19617g8434M0626K1166O3699K0352j5334l3283m8789l1965K9168k0943L168P67
19605d9802J3779j5117L224N6009O950j283l978J581k2974j0744M3417o995o800
$$ y = [-28651, -73303, -54428, -39928, 3077, 33370, 23899, -35564, -17918, -42865, -56220, -61508, -17484, 38098, 96788, 103159, 41560, -15088, -26302, -22331, -94, 7459, 71093, 39252, 1310, 29562, 41540, 40860, -9619, -12080, -6258, -4207, 29990, 6137, 35611, 34599, 34827, 82383, 24885, 13127, 15243, 37289, 53146, 29992, 34388, 61810, -377, -40388, -65508, -27739, 4687, 5184, 13610, 1231, -3661, 531, -569, -15151, -13400, -44202, -23173, -33462, -27143, 12867, 56343, 84269, 96178, 53806, 22279, 15672, -9671, -71466, -108969, -99511, -78434, -37808, -16642, 47057, 67409, 52075, 18792, -29997, -61962, -32794, -53737, -50569, -49802, -36023, -51140, -47916, 8093, 15043, 13760, 9782, 11363, -11611, -22355, 21062, 14067, 7267]
19592G267R234j4775m1944J8096o23j4018j8441l530p8880L4652N6487O7635r401
19579A1759m6402k3736L9402L8382n398k684L0556m3635M011o0146j9235J6179
19567f0947P7295N3584j923k3725K929k3142n0034o8024K0402K3141M3473k9388
19555c6359r606J0363K7967J16421L5858m3350l6324j076o823m0623l5286Q310
19543a0528k1511K9510k9720J9498L856P323n5002m1910L209O0453M5912o1856
19531e0766n7596O2387O1035l0964p099M9085m0561n6827J600J7161L062R492
19519c9991n2185J0578K8950M5476K5716J0623k302j8322l0455L675J0875K3304
19507A5942N6261Q352k3168j710p012l191l1778k1251j8822N320J831J2914l3518
$$ y = [7267, 16501, 1726, -40218, -22122, -22745, -36763, -55204, -58734, -137614, -102962, -46475, 21160, 11759, -34643, -58379, -18977, 19405, 14007, 11323, 41879, -1756, 2255, -57891, -77126, -60947, 16348, 69932, 68009, 44284, 47213, 24071, -25963, -93987, -73585, -50444, -6971, -36359, -45965, -35602, -7635, 108786, 144644, 101294, 64970, 63894, 57071, 16448, -18838, -10528, -32039, -2529, -32249, -12751, -8895, -1572, -56574, -98484, -95275, -34822, 11090, -50766, -108362, -45975, 15060, -15904, -23003, 26082, -14479, -71306, -69706, -52545, -49483, -39991, -92176, -81598, -52648, -7172, 18544, 29167, 26865, 8543, -21912, -18237, -7362, 15942, 72203, 80555, 57387, 55677, 48665, 45474, 13696, -7555, -26377, -21057, -19226, -6312, -39830]
19494c9830o294O6977L8072p333J7832p083J5696M906m1261l1994q920P113k0026
19481a2145k4158J8527M9608K1419K4907j5482m6130k6228q22k3787r9928L0422
19469a03797j9271k5701L2794L4626j3366R3180L0242l4405r428M3257L9914J378
19457F9423k6996j00992M9491K2879m4613K5955R0867l6872j03156k5033J6445
19446f2602M5507k8801N9375O6210k9182j3192q251o6927K530L3087m6555O351
19434d2450N2865r605k170k296j9585J2427J0704J6350N484J0171J8954j1216
19422C9633m1696j0846m060L0012l7300K2916K7414l1624j4822Q3783m96k8549
19410C4365j6937Q159j5786k6823O225k4615l3119K8330J8856p5284K1927O6041
$$ y = [-39830, -46124, 20853, 58925, 51592, 69424, 62341, 78037, 82943, 41682, 9688, 768, 7881, -12145, -36303, -17776, 31832, 53251, 78158, 62676, 16546, -9682, -10504, -34291, -134219, -103797, -123068, -148769, -115975, -81349, -94715, -1535, 28707, -5698, -15126, 28131, 68045, 69423, 42427, -58565, -9074, 13805, -30808, -4853, 86014, 49142, -54014, -79047, -62602, -17095, -45896, 13479, 79689, 50507, 37315, 29064, -37863, -35333, -2246, -48801, -42450, 10415, 810, -1360, -3656, -23241, -10814, -110, 16240, 21724, 31895, 50849, 39633, -2063, -12909, -16969, 13043, -24257, -1341, 26073, -5551, -20373, 63410, 62914, 34365, 17428, 25587, 9801, -17022, -10797, -35412, -68531, -40201, -21345, -96629, -74702, -8661]
19398h661J9368O72j7003l9140N597q944N5075P776o4860k8272J9854J5554N1880
19385H896k9391m0770l456j3316O5994N5812n2977Q203j1504j0995P264n66m6611
19372f3417P7418Q4967j8161k3665k4569k995R925K8094j393q2325o4245K1250
19360e9116L6570o5650N951P1449Q7283O032l8525j2826k2155n5415m7817j2175
19348a06394N4104N8671P6917J8672n1127m9308M364k2305l5733K7026K60J4117
19336a0736P2099L4829k8464r532l2933l2675L9845k6662J1500K6023m5861l9539
19324d2106k5916j5567O0402L2160k6209o2651n283J6617O834l7380K0548M1373
19312c7178O0778N1162J7118m6163m9485J7013K1589o7897m2593l5983K2867M5505
$$ y = [-8661, 10707, 11379, -5624, -44764, -39167, -48111, 6964, 14740, -50120, -78392, -58538, -42984, 8896, -20495, -61265, -64721, -78037, -12043, 43769, -9208, -1005, -12509, -23504, -16240, -16806, -63417, 14001, 98968, 80807, 57142, 32573, 29578, 39503, 67597, 66204, -16121, -80366, -59116, -22546, -88196, -82245, -10796, 76487, 82519, 43994, 31168, 9013, -46402, -94219, -106394, -52290, 6381, 83298, 101970, 50843, 1535, 5899, -16406, -52139, -25113, -24853, -10736, 61363, 96192, 67728, 58196, 25263, -7412, 32433, 5771, 17271, 43294, -2567, -42106, -68022, -83589, -23187, 8973, -17236, -79887, -85170, -68553, -61719, -99099, -78551, -37178, 23600, 74762, 91880, 45717, -3768, 13245, 34834, -33063, -75656, -111639, -88772, -43267]
19300d3267l6051n1405N1053L1331J1668O049p418J2679M4320k2904N431J3460
19288A4946l895n9757l310O50M6090N1009K6113K562j6130m5062p0214m499L5504
19275b5993Q3809K2686o5154k0007O679K5266l920p6722j5186K8295L6738N5833
19263E2324J8701l7857o0081J5859L8219J6825l09m7605n444J3872J5241R806
19251B9551J410K7169l4227k4795j7790N6640M961q9811n8153L927M2546J2642
19239d5930J03249K0946m2074l1788j2312O1456l1804m0364O053J0054j7677k3547
19227d3738j7910J3890N1805L4305o0050j4803j0341J3469J3609o990K2760n234
19215i228k7427m6461K5045L7091o8291l4124N73q827O5415M4878j2928k2788
$$ y = [-43267, -79318, -130723, -79670, -48339, -36671, -30622, -38040, -25361, 18959, -3945, 1486, 14946, 11051, -48706, -52016, -51366, -5276, 45733, 71846, 74408, 58278, 13216, -56998, -61497, -25993, 57816, 80502, 15348, -4659, 2020, 27286, 23366, -53356, -68542, -40247, -3509, 52324, 71025, 33168, -26913, -11054, 27165, 43990, 43681, -3924, -9368, 4504, 19745, 29551, 30961, 58130, 23903, -892, -18682, 37958, 42919, -46892, -105045, -101118, -58572, -45930, 57319, 78265, 36191, 4403, -7909, 53547, 21743, -18621, -12568, -2514, -20191, -43738, -61648, -47758, 4047, 38352, -21698, -36501, -46842, -33373, -19764, -26754, -3994, -9228, -36655, -83116, -58071, -20980, -89271, -123395, -122822, -131649, -66234, -21356, -34284, -57072]
19203e7072j747r072P912j7774q111K538k6267Q838L8184j8644J8747L6865L6401
19190A0798K2417l1746m1295m8208J860J1926L7635M4238N1328p628j6285j4257
19178B0783L1456K5293o0395J2178O324m7994k9670R701K6134k7754p299J0754
19166c0489l1532m5097M3795P1207k1533k8738q3782L0660P9673J2618O3872m6226
19154A4428l7956j3335k369j6018m3878l2956K3215R1083P5583K1452k8726j2380
19142C8143O908k3138k736M4029q4911R645K9507j4430q602n9156J4115P128j5708
19129e9206L8059K1501O606N4014o9667l5336j4368J6818N5296M4238K547l6444
19117B4058q786M376j9819j6804k6238J2279M4195o0678j9261Q6939n1481r6737
$$ y = [-57072, -58819, -67891, -59979, -77753, -85864, -83326, -109593, -100755, -62571, -81215, -62468, -25603, 10798, 33215, 1469, -39826, -88034, -86174, -74248, -36613, 7625, 58953, 51325, 35040, 20783, 52239, 77532, 17137, 29315, 35639, -12355, -42025, -32324, -6190, -33944, -41243, -30489, -62021, -107118, -63323, 7884, -13649, -42387, -126169, -95509, -15836, -3218, 60654, 14428, -23528, -36863, -39232, -55250, -99128, -132084, -108869, -17786, 57797, 79249, 50523, 38143, 45051, 21913, 19177, 63206, -21705, -12060, 17447, 3017, -5585, -64741, -50626, -43498, -59206, -21147, 354, 6960, 60974, -8693, -44029, -58397, -41579, 13717, 57955, 60502, 24058, 15272, 19648, -171, -16975, -43213, -30934, 13261, -47417, -66678, 20261, -31220, -127957]
19105a27957L5828M3447P75p795K5396M7168O4821R621k5001l5904j1212k064
19093A7123J5275k3144P166j3002p538L1936L1805k7044q9640l8357M0378J1308
19081d3734j4531O5645j0495J4261M6932j3684l7990m6114m2338j1572N2400Q6545
19069D5325R456o4648k1246L0600P4058J4733m5117n4964l0508N2611N212r95
19057A4517J7973q843k5072q207k9476m134L2098M8316k4044k6354k9132n0254
19045i2612L3056L5793l948r587j2255M9808K6271j458P051k8140K8754M5194
19033G7927k932l1523n391l761m2248k514m799R345K1352j2694j5135j1199N8096
19020C4524O4443m5626l0835K4253j0444n391K8080j0565l5131m8887n1167l467
$$ y = [-127957, -92129, -48682, -47907, -55702, -30306, 16862, 81683, 91304, 66303, 30399, 19187, 17123, 32398, 9254, 16420, 3418, -4120, 27816, 59621, 32577, -57063, -95420, -55042, -43734, -58265, 7380, -3115, 11146, 58078, 44394, 6404, -39710, -82048, -93620, -41220, 45325, 54781, -9867, -31113, -513, 73545, 88278, 43161, -11803, -42311, 10300, 15512, 14517, 32490, 23647, -1425, -9632, -39108, -43242, -11144, 37172, 13128, -13226, -42358, -92612, -59556, -23763, -27711, -37298, -49553, 255, 26526, 25068, 32119, 3979, 32733, 77927, 74995, 43472, 38081, 34320, -7928, -10442, -15241, -5896, 15456, 2762, -12373, -23572, 34524, 98967, 53341, 22506, 46759, 36315, 30924, 59004, 48439, 13308, -35579, -86746, -90213]
19008i0213L7855N6043K5588k6071M7474K2071k0218j7704R253J6514j240o2917
18996c565K4214j782L952j3303q0103J3044M6966L6800k8104k9551j6121L4955
18984a2598j2233j862m4983K7202L2141p631r038m5516L9771j0008j0003L9486
18972a5272j811j2353m185k194J1099j9728j4927l0058j5739l531R365N3066k6895
18959g3163P46L3015M3866J267L7816J066m2941j4285K0645K3127o527o631j6373
18946A628L7585L183p7458J156O0156N2958K8441j9102n0234m8725N03N002p476
18933a2383M4015l016L4997n0772l3469l9578m3788J6874J7922N2831J5821j9316
18921a9862J2074k6327k336Q297q299J4648N9162L7731m2318j7752N3299m0761
$$ y = [-90213, -52358, 3685, 29273, 3202, 50676, 72747, 52529, 34825, 44078, 60592, 59352, -3565, 20649, 18867, 22819, 9516, -70587, -57543, -10577, 26223, -1881, -31432, -47553, -12598, -24831, -26693, -71676, -44474, -12333, -19964, -29002, -74518, -34747, -44755, -54758, -15272, -17083, -29436, -33621, -35815, -24716, -44444, -59371, -89429, -105168, -108699, -99334, -46268, -73163, -72417, -39402, 4464, 5731, 43547, 44613, 1672, -12613, 8032, 31159, 24632, 18001, 1628, 39213, 42396, -35062, -33906, 26250, 79208, 107649, 88547, 38313, -10412, -9909, -4907, -12383, 31632, 28616, 63613, 12841, -20628, -60206, -103994, -87120, -69198, -16367, -546, -19862, -7788, -34115, -36451, -28154, -36453, -21805, 37357, 75088, 32770, 15018, 68317, 27556]
18909B7556o3806L7607l92n1494M0314P7852N1669N0261n5339n5799o517j5140
18897C6772j8078J261k3139m8931k641p349M9070j4553l7987N281J6215k7291
18885g1370K5604j0506N316O7900O7868L3503n3293L0173J1205m6868o8899p207
18873a6574L2879L5173Q58O318N5803j3370n6134J956J0567k1009j8485l2793
18861a4811J8023j9986J8693O4740J994r695Q636q342n1531L5304M559j2547J6625
18848E1662L83O303j2348N386L5081J3213p291n6850n8903m6948o970K7363Q3761
18835C3842J4769J7758L655m9355L8262n898o69j1234k44k360j1725L234k6924
18822C111j9038m9517j8192L939p828O7349P2853m9596M3415J2510m3759m8100
$$ y = [27556, -36250, 1357, 965, -50529, -10215, 67637, 119306, 169567, 114228, 58429, 51912, 36772, 18694, 19955, -3184, -52115, -54756, -62105, -13035, -27588, -65575, -60294, -44079, -71370, -45766, -56272, -50956, 16944, 84812, 118315, 65022, 95195, 106400, 59532, -9367, -16574, 16305, 51478, 52336, 58654, 114457, 101087, 44953, 46909, 57476, 36467, 17982, -14811, 3212, -16774, 1919, 66659, 68653, 58958, 67594, 59252, 7721, 43025, 47584, 35037, 51662, 52045, 58348, 46000, 51386, 86467, 99680, 92389, 35539, -23364, -70312, -77282, -49919, 33842, 48611, 66369, 70024, 20669, 58931, 53033, 52364, 41130, 40886, 38526, 26801, 30035, 3111, -15927, -65444, -83636, -79697, -87525, -20176, 52677, 3081, 46496, 59006, 15247, -32853]
18810c2853J6614N451J4620K2036l3920k1899j51M3857l5356o9369m4575L5261
18798a00284J7930M10O7622L0311K1664P9552N6346l4105r4920l2413L4036j6884
18786B9265K7816M2349L0722l5314j6229k7042n9980q148J2722n296K0618L8626
18774E0109N9024R0501J1023J2978j6044l0097P5462O8619m4199l9619k1387o5070
18762A51300n3981K9949J8740m3608k7970q42p2998M058K7208k7705N6064K6570
18750H6785j3292j235k055j5975L2924J4307k5566k8384l5235q383L2766p66L3043
18737F8934M9230j708m0957k600m1229m926K3035j8741L153J3763m1286o8959
18725f2291K8750Q95Q360L8105o680N294N711M2284o5j0768j4815K4328K6785
$$ y = [-32853, -16239, -10788, 3832, 25868, -8052, -29951, -30102, 13755, -21601, -90970, -135545, -100284, -82354, -81944, -14322, 15989, 37653, 117205, 173551, 139446, 44526, 12113, 46149, 29265, 57081, 99430, 130152, 94838, 78609, 51567, -8413, -16561, -3839, -9135, 11483, 50109, 109133, 199634, 210657, 223635, 207591, 177494, 252956, 321575, 277376, 237757, 216370, 151300, 97319, 127268, 146008, 102400, 74430, 73588, 590, 4648, 31856, 4151, 60215, 86785, 73493, 72258, 70203, 54228, 87152, 101459, 75893, 47509, 12274, 3891, 36657, 35891, 68934, 118164, 116456, 75499, 72899, 31670, 26744, 49779, 31038, 34191, 47954, 6668, -62291, -33541, -32646, -24286, 13819, 7139, 12433, 18144, 60428, 60363, 49595, 34780, 59108, 85893]
18712H5893p891q848J0699r0435k2845j6259J376R962J8041J4709L7258N5062
18700H6722P0137k7834m3177k5896L2433O4028q805o9721p0800p412M1740l5870
18688E545J7620M9405m7330l5808L2661M9143M1637l9984k9899J7628l3453K7118
18676E4283N684M937k3834j6321L7942j4010l2239Q862K5781j2527k2135k0037
18664c614K087l2397j1518j3742L139M6524K1696k9657J2723J8061J4086l1901
18652d513L810Q2060N980n6643L1261K4209n8770n1268M7394K4289n0945k4665
18640b7801O700L803L884k165L5089L6209k4932L0982o189J273L1391J2323K3766
18627A24333n0250l0781J7627k1314r559l1508L9107j7813j4021J3343O575K0937
$$ y = [85893, 78002, 69154, 79853, -10582, -33427, -49686, -48310, -38348, -20307, -5598, 31660, 86722, 156859, 129025, 85848, 59952, 92385, 156413, 147608, 77887, 7087, -325, 41415, 5545, 23165, 72570, 25240, -10568, 22093, 71236, 112873, 72889, 42990, 60618, 27165, 54283, 59967, 64904, 41070, 24749, 62691, 48681, 16442, 25304, 51085, 38558, 16423, -3614, -1527, -33924, -45442, -59184, -56045, -9521, 12175, -17482, -4759, 13302, 27388, -4513, -703, 81357, 87337, 30694, 61955, 86164, 27394, -23874, 23520, 47809, -3136, -27801, -21101, -17298, -13414, -15579, 19510, 55719, 30787, 61769, 55580, 56853, 88244, 100567, 124333, 74083, 43302, 60929, 39615, 30056, -1452, 37655, 19842, 5821, 19164, 25739, 46676]
18615D6676K5275q68j229p702L7712N7655k8650o9567k0109m774L6686J2264j3994
18602F9375K5685j0214m6450o0430L2710O1222N6797o74o2198k7703n2820Q407
18590f293N9989K0875k8366j1337J4049M3726M7447L9888o7989O002j569j9293
18578I7129K472L703m9170j535K7008L5991M091N3681k5872l0156n0315j477M0560
18565A06110J953j7898K4836o543J4620m6677o0930N8014J3791K3448K7266J6177
18553A54167J0452J6022k3046n3859m3080k4523l7595j6795P0852K125r732l5151
18541I837m4956p958K0463L7772r06L3445J699N289L1636m107k9733l0728m8048
18528b6295L3753M2532r462N9513K0956j3427L1986k7109l7079K5443Q188q743
$$ y = [46676, 71951, 71083, 69854, 62152, 99864, 157519, 128869, 59302, 39193, 34419, 71105, 83369, 69375, 95060, 84846, 38396, -22034, 10676, 71898, 128695, 128021, 65823, 38120, -14700, -6293, 53696, 74571, 46205, 34868, 48917, 92643, 140090, 179978, 111989, 117991, 116422, 97129, 99601, 103304, 54134, 52599, 79607, 115598, 119689, 173370, 147498, 117342, 67027, 65550, 106110, 108063, 90165, 115001, 108458, 123078, 76401, 15471, 73485, 87276, 110724, 137990, 154167, 164619, 180641, 157595, 103736, 60656, 36133, -1462, -18257, 52595, 54720, 44988, 9837, -35119, -43077, -22614, 15158, 14252, 47697, 49396, 54685, 86321, 82214, 52481, 21753, -26295, 7458, 49990, 40528, 100041, 120997, 107570, 139556, 112447, 75368, 100811, 108999, 100256]
18516A00256J7132k3169q717o6455J2277Q3558k2243p0074m4216J8737Q1036P381
18504H5503j1047Q432l5347j8548Q258J6675j2724L2956M0946J3824j8886Q944
18492A18986r401j0959n2410R972L4190k0856j5021M1599P7914m2389k1224K0301
18480A30702N1138N4177k802l602k0035K9741Q530M0034J10350P8503N3073J20118
18468F49927J62144J63739J82919K00410R9429J6986r807J5580m8714m6599j11024
18457A274990j04118q2336r2641j49574j62355j06790n4695j1817m1792k6503
18447D42369K005n049j8864k2079n7398n8819K0885M1597J07976J68845P2522
18436F93990J04324J60753J36561K07159J30469L7285L903O5766P4098j0277p7333
$$ y = [100256, 117388, 94219, 85502, 19047, 31324, 114882, 92639, 22565, -21651, -2914, 78122, 85503, 74456, 82888, 47541, 28993, 37251, 53926, 41202, 74158, 115104, 128928, 110042, 118986, 109585, 98626, 46216, 56188, 90378, 69522, 54501, 96100, 174014, 131625, 110401, 130702, 181840, 236017, 233215, 229613, 209578, 239319, 247849, 287883, 398233, 476736, 529809, 649927, 812071, 975810, 1158729, 1359139, 1458568, 1475554, 1465747, 1481327, 1432613, 1386014, 1274990, 1170872, 1088536, 995895, 846321, 683966, 577176, 522481, 510664, 468872, 442369, 444374, 439325, 420461, 398382, 340984, 282165, 303050, 344647, 452623, 621468, 693990, 798314, 959067, 1095628, 1302787, 1433256, 1470541, 1474444, 1540210, 1614308, 1604031, 1526698]
18425A526698j19615j40473r1596j37919j42099j35217j33789j12834m3384p6688
18415C93084m0868n3123k3351L0726P8758p685n4207n1676m9372n1688J00k5934
18403A44764L7733M2171L7975K9941J9737J2898l1024m7370l6674o402k688m0714
18391A60347J3877j4184k9731J7590N9602L1208K3938J6965p8147m1502J9226
18380A79189L4422R58o5664n5110k0585N93N0714j1219n2016j8986J3105M4595
18368I9996K681l2854j278L7227J0991J1963j5715J0282M0377j5054K2171n174
18356A65613L560M660o2530k8378N8277N171k9971R522J3818m6265j4401P958
18344H7034M0471m133k4741l1026K333J7972M3014L6647k4604n4534J9114j4574
$$ y = [1526698, 1407083, 1266610, 1175014, 1037095, 894996, 759779, 625990, 513156, 469772, 393084, 352216, 299093, 275742, 306468, 385226, 377541, 323334, 271658, 222286, 170598, 170698, 144764, 182497, 224668, 262643, 292584, 312321, 325219, 294195, 246825, 210151, 203749, 201061, 160347, 174224, 160040, 130309, 147899, 207501, 238709, 262647, 279612, 201465, 159963, 179189, 213611, 214569, 148905, 93795, 73210, 73803, 124517, 113298, 61282, 42296, 55401, 99996, 102677, 69823, 68545, 105772, 116763, 128726, 113011, 123293, 163670, 148616, 170787, 165613, 169173, 173833, 111303, 82925, 141202, 146373, 116402, 125924, 139742, 93477, 79076, 87034, 127505, 123372, 98631, 67605, 69938, 87910, 130924, 167571, 142967, 88433, 107547, 92973]
18332I2973K5850N6418k357l2377k204J4061j6943k7354j2897M6882j7021l4569
18320I0462N9921m1712j6922J3651k1575m6849J6640J6731k4754J3855N4164j3303
18308A00309p5045k2755O9564N2738O7322J5704k3949o7892J7160J971N475l361
18296A37241k5104l3942M57K9359K7543M5668j5832j0478Q300l4145o103j7335
18284A05629o1047j7310M0466J4959K3066N680k0260j2948O8085M4109M257n5021
18272A39665l5159l073M3348o932p336o2623L4594L7279J2959J7901J9937k0847
18260A69713o7524K3834K4746q112J0546m5000K8539J6589n3499j0695k1127L3071
18248A01081J0830k706K4490n2061k4036P0611M4715l3168j9551J900N5183K3015
$$ y = [92973, 118823, 175241, 172884, 140507, 138303, 152364, 135421, 108067, 95170, 142052, 125031, 90462, 150383, 108671, 91749, 105400, 83825, 36976, 53616, 70347, 45593, 59448, 113612, 100309, 25264, 2509, 72073, 124811, 192133, 207837, 183888, 115996, 133156, 135127, 140602, 137241, 112137, 78195, 78652, 108011, 135554, 181222, 165390, 154912, 163212, 129067, 122964, 105629, 44582, 27272, 67738, 82697, 105763, 111443, 91183, 78235, 146320, 190429, 194686, 139665, 104506, 101433, 144781, 137849, 130513, 67890, 102484, 139763, 152722, 170623, 190560, 169713, 102189, 126023, 150769, 142657, 153203, 108203, 136742, 153331, 99832, 89137, 68010, 101081, 111911, 109205, 133695, 81634, 57598, 128209, 172924, 139756, 120205, 122105, 177288, 200303]
18236B00303K5065j5033k5610r398N445K5489m042J8596R673K4750k5700l0494
18224A99044N8322J5029L1423N5583J9630M027J356m3272k8189k1190p105m0789
18212B43869J0237L7086J0095J3506m24o8192r947K2129o2811n1966O9226N6091
18200B68899J5111R376m6598M0366M1403J9704M5039N3340l6623n7719o4978l211
18188B84109P242m84l679O2506M6322l4517m450K5374l7070N4773M1635o6730
18176C75031o9234m013o4250l2266K7500K4209L5019K3977N5548K3055n4697N731
18164C45610j4323m4632K0609K0986K087J1652j7094L8329r188K2517M5510M1927
18152D63990R2841N9347M5381n0635n6169N753m36K2980M7235M9291R5621k0209
$$ y = [200303, 225368, 210335, 184725, 175327, 180772, 206261, 202219, 220815, 230488, 255238, 229538, 199044, 257366, 272395, 303818, 359401, 379031, 383058, 384414, 341142, 312953, 291763, 284658, 243869, 254106, 291192, 301287, 314793, 314369, 246177, 236230, 258359, 195548, 143582, 212808, 268899, 284010, 293386, 246788, 287154, 328557, 348261, 393300, 446640, 410017, 352298, 287320, 284109, 291351, 290867, 287188, 349694, 396016, 361499, 357049, 382423, 345353, 400126, 441761, 375031, 305797, 301784, 237534, 205268, 232768, 256977, 291996, 315973, 371521, 394576, 339879, 345610, 331287, 286655, 307264, 328250, 330337, 341989, 324895, 363224, 354036, 376553, 422063, 463990, 556831, 616178, 661559, 610924, 554755, 560508, 560072, 583052, 630287, 679578, 775199, 754990]
18140G54990N4885P7877q133o3726P237J17823J48533R4622R6820P8897J4916
18129A374741N3576J16933J26124J54266K10651J99273K47671L69069N60555P15203
18119D128062Q97536J319002K100418L615591O148159Q458868O567723K126630
18111C5361989L311503P714057Q301341J985686j3622539j6036359q946291m859793
18103A3209594k868616j829127j225505q48314o78213n63588m59605k65394j11668
18094D359564j73874k73773k15390j37711j10094j24063p9657r2201j01934r3459
18084B957408j42822j34805j28735r8046q9534q2171p3423o9229k0503k5369j4096
18073B078675m6466p6386p5086m6005j1967k0558l8300j14605j16072q264j6711
$$ y = [754990, 809875, 887752, 879619, 815893, 823130, 940953, 1089486, 1184108, 1280928, 1359825, 1374741, 1428317, 1545250, 1671374, 1825640, 2036291, 2235564, 2483235, 2852304, 3412859, 4128062, 5025598, 6344600, 8445018, 12060609, 18208768, 26667636, 33235359, 35361989, 38673492, 46387549, 54688890, 56674576, 43052037, 27015678, 18069387, 13209594, 10340978, 8511851, 7286346, 6438032, 5759819, 5196231, 4736626, 4471232, 4359564, 4185690, 3911917, 3696527, 3558816, 3448722, 3324659, 3245002, 3152801, 3050867, 2957408, 2814586, 2679781, 2551046, 2453000, 2363466, 2281295, 2207872, 2138643, 2118140, 2092771, 2078675, 2032209, 1955823, 1880737, 1834732, 1822765, 1802207, 1763907, 1649302, 1533230, 1524966, 1508255]
18062A508255m4516K554j334j2276m5134r5961k5649J0320m1014m4677m8565n7071
18050A104932m3523l9808N5608l5989j19022m8405J1476K5806m9672J2063L6459
18039I09925J7466L7084K7727j0744j9973M2042N4098m1058L493j2789m5192l8541
18027I23538q476L1916r631m0907N0693K2432j1944j455l6298n9366j07013n3773
18015F99716K2121L4135l4359L841k8513k907k2600k4795L6249N7865N8606r088
18003G90271M1728K7430N5127L8141M8282k8666q918K4582m423o017l8785k1836
17991I16916L2698j3725O6348J9200n9652n7195K4298N6409L9824n825p1446m3317
17979I04533K4022L9221P4491L8314M7867J0933J149N0857R9499P6062K4415r04
$$ y = [1508255, 1463739, 1466293, 1464959, 1452683, 1407549, 1311588, 1285939, 1296259, 1255245, 1210568, 1162003, 1104932, 1061409, 1021601, 1077209, 1041220, 922198, 873793, 885269, 911075, 861403, 873466, 909925, 927391, 964475, 992202, 981458, 961485, 1003527, 1057625, 1016567, 1020060, 1007271, 962079, 923538, 915062, 946978, 937347, 896440, 947133, 969565, 957621, 956166, 919868, 860502, 753489, 699716, 721837, 755972, 721613, 725454, 696941, 694034, 671434, 646639, 682888, 740753, 799359, 790271, 831999, 859429, 914556, 952697, 1000979, 972313, 963395, 987977, 983554, 977537, 938752, 916916, 949614, 935889, 1002237, 1021437, 961785, 904590, 928888, 985297, 1025121, 1019296, 947850, 904533, 928555, 967776, 1042267, 1080581, 1128448, 1139381, 1140530, 1191387, 1290886, 1366948, 1391363, 1390459]
17967A390459p147K1188M6517R610l9543m4141r867L721o2851J7133Q091J825
17955A334995p691L0107O4207K4711p5428l377P6072L8536l696L0407N1993K9112
17943A589948L0781l9897K4463P7216K4677N9937N7013N2920M2691L9059M3225
17932B002033N4745J938k4286M6610J6639P3984O2129O8532M1274M2990O3310
17921B449898R6144J40347J08479J51470J84495K41395K62116K14384K48578L13273
17911D410579L67659L62725L87009L36500L28730L33343L68032L45888L25366
17902G565831M69126N11596N93727O78574O92448Q38178R70337J086346J259361
17893A4665524J466834J837682K317927L020009M293418O241556R307370J3269313
$$ y = [1390459, 1383312, 1404500, 1451017, 1460627, 1421084, 1376943, 1367076, 1370797, 1307946, 1325079, 1333170, 1334995, 1327304, 1357411, 1421618, 1446329, 1370901, 1367524, 1443596, 1482132, 1478436, 1508843, 1560836, 1589948, 1620729, 1580832, 1605295, 1682511, 1707188, 1767125, 1824138, 1877058, 1919749, 1958808, 2002033, 2056778, 2058716, 2034430, 2081040, 2097679, 2171663, 2233792, 2302324, 2343598, 2386588, 2449898, 2546042, 2686389, 2794868, 2946338, 3130833, 3372228, 3634344, 3848728, 4097306, 4410579, 4778238, 5140963, 5527972, 5864472, 6193202, 6526545, 6894577, 7240465, 7565831, 8034957, 8546553, 9140280, 9818854, 10511302, 11349480, 12319817, 13406163, 14665524, 16132358, 17970040, 20287967, 23307976, 27601394, 33842950, 43150320, 56419633]
17885E6419633J6711569J8550329K0579190K4756663K8690082K8753401K3079759
17878B17540626J4416930Q145025M720572j039585q315577j4481119j9381670
17871B01605202k1291109k1517178k4641246k6447629k1907736j4532188r007653
17864F2260463n609532l495509k119888j180230l80401L32211J117100K100115
17856E3024329L586424O050961R797739J4361964J7994438J9849722K2423180
17849A47088757K7251377L1327729L0501326K3294887J3532959P148173L281335
17842B83426543l586817j1462659j8254086k3371905k5030691k5457052k9293784
17835A46969549l0374998k4564961j6549374j0826351p351606n343519l966156
$$ y = [56419633, 73131202, 91681531, 112260721, 137017384, 165707466, 194460867, 217540626, 231957556, 240102581, 244823153, 243783568, 235467991, 220986872, 201605202, 180314093, 158796915, 134155669, 107708040, 85800304, 71268116, 62260463, 56650931, 53155422, 51035534, 49855304, 49474903, 49807114, 50924214, 53024329, 56610753, 62661714, 72459453, 86821417, 104815855, 124665577, 147088757, 174340134, 205667863, 236169189, 259464076, 272997035, 280145208, 283426543, 279839726, 268377067, 250122981, 226751076, 201720385, 176263333, 146969549, 116594551, 92029590, 75480216, 64653865, 57302259, 51958740, 47992584]
17828D7992584l035178k408626j964173j630382j446365j279057j171303j054370
17820C4003130j064529j125306j137638j201796j187117j272986j283626j145379
17812B4584753j053361r78948r14963q30433q22635q28266q06026p87883o51732
17803A6910506o31657n90616n65328m94584m83421m58527m05772l82637l98767
17794A2499197l27701k96152k71772k64894k24221k35615k24333k24307k18081
17785A0212121k85398l96095m10762l42297l34611l53084l22955k90692k35299
17776G240928j85494j61948k06916k37424j91823j88836j73122q8671j47485k12102
17766E447107j98302q0861o1386j38646j77902j50666j32539r7533m5892r0179
$$ y = [47992584, 44957406, 42548780, 40584607, 38954225, 37507860, 36228803, 35057500, 34003130, 32938601, 31813295, 30675657, 29473861, 28286744, 27013758, 25730132, 24584753, 23531392, 22552444, 21637481, 20807048, 19984413, 19156147, 18350121, 17562238, 16910506, 16278849, 15688233, 15122905, 14628321, 14144900, 13686373, 13280601, 12897964, 12499197, 12171496, 11875344, 11603572, 11338678, 11114457, 10878842, 10654509, 10430202, 10212121, 9926723, 9530628, 9119866, 8777569, 8442958, 8089874, 7766919, 7476227, 7240928, 7055434, 6893486, 6686570, 6449146, 6257323, 6068487, 5895365, 5806694, 5659209, 5447107, 5248805, 5167944, 5106558, 4967912, 4790010, 4639344, 4506805, 4409272, 4363380, 4273201]
17756D273201j07991p9102j64198n3111n3086o1191j25577j33375j18041j03884
17746C273645j42479o3728j06447j91574j72797o1049n1229n1572p1187l8288
17736B323295p0219r5437l2991l6175l9713j9085q9883o1626O880k6870p9690
17725A778486o8681k5326q9018l1012L7723r112m4128J7623k4873q9490n1747
17714A400445l8415l0671o1457p4808r872l8263o0945m4398o1958l8510n4286
17703H86862k8685l8946k870j5909p6089o6893k305n3870l8151L261l7149l6460
17691D92796J0727K0328j0128m713J6984L8706k1006J655L9931M6315p766l4379
17679E89450j9862n638L3759R195J5802L0153p6849j722j881j5790J9579m433
$$ y = [4273201, 4165210, 4086108, 3921910, 3868799, 3815713, 3754522, 3628945, 3495570, 3377529, 3273645, 3131166, 3067438, 2960991, 2769417, 2596620, 2535571, 2484342, 2432770, 2361583, 2323295, 2253076, 2157639, 2124648, 2088473, 2048760, 2029675, 1939792, 1878166, 1885046, 1858176, 1778486, 1709805, 1684479, 1595461, 1564449, 1602172, 1593060, 1548932, 1566555, 1541682, 1452192, 1400445, 1362030, 1331359, 1269902, 1195094, 1185222, 1146959, 1086014, 1041616, 979658, 941148, 886862, 858177, 819231, 816361, 800452, 724363, 657470, 655165, 601295, 563144, 566405, 529256, 492796, 503523, 523851, 513723, 509010, 525994, 564700, 543694, 545349, 585280, 631595, 623829, 589450, 569588, 563950, 597709, 606904, 622706, 652859, 576010, 574288, 572407, 556617, 576196, 571763]
17667E71763m1086q3090j8794J5142J1860k1763j8426k1950L55j6315m0680k6843
17655C10173L0458o508K8820k226N421J0742P5889N7147l6454o4425P7087P7464
17643E63588k3169m2599O718J7195J3894Q571K8619j4363M2716L5824n4180l5383
17631E47431l6584j5220J8675N4579l237q5953q248k6548M304L1830j744m0838
17619D38447j1030N774R6399p0773j01624j0155K9250L8298N9040K2793O970m785
17607D98604p678L2147l3299m9844k3613N978n597J1696J3102k1912m0881L925
17595C82628J9500J5805J1868m9469n6235M3111r09K4242J2841o820k7540K8337
17583C97359L5052m4484j0634K2816O7493Q5051Q653n1737k2715j1885j7927n9459
$$ y = [571763, 530677, 447587, 428793, 443935, 455795, 434032, 415606, 393656, 394011, 377696, 337016, 310173, 340631, 334123, 362943, 360717, 366138, 376880, 452769, 509916, 473462, 409037, 486124, 563588, 540419, 497820, 504538, 521733, 535627, 544198, 572817, 558454, 601170, 636994, 582814, 547431, 510847, 495627, 514302, 568881, 565644, 479691, 471443, 444895, 449199, 481029, 479285, 438447, 427417, 433191, 529590, 458817, 357193, 347038, 376288, 414586, 473626, 496419, 503389, 498604, 490926, 523073, 489774, 439930, 416317, 422295, 416698, 428394, 441496, 419584, 378703, 382628, 402128, 417933, 429801, 380332, 324097, 367208, 366299, 390541, 403382, 396562, 369022, 397359, 432411, 387927, 377293, 400109, 467602, 552653, 561306, 509569, 486854, 474969, 457042, 397583]
17571C97583k9519J7344J0984k8856m6995k6434L3837K6903L2534J6016K2161
17560D25558l5932l0025L6256M8309O2323J8908j265m3622m7734m774L8894l701
17548D63195q6040r221M0748K4756J2939J6073o4095m5155J8301r655Q815k6503
17536C44158m0390k0927L2116J6210M7655l354m56J3437k7027k7088M152L8855
17524C77341K5647J05793N0935l3280m2949L4442J080r1307o585K5665l2079l6377
17512C78326J080n2863k4821k892K296k682n3705k6855l4584n799R4753J050p6999
17499A96305j1182J9886Q8167O0815J7100J8681M2582j3605J1890M8536r846M618
17487D73947M4062L9920O3279l3391k9644n9382p3241p4681M2795L6683o9787
$$ y = [397583, 368064, 385408, 396392, 367536, 320541, 294107, 327944, 354847, 387381, 403397, 425558, 389626, 359601, 395857, 444166, 506489, 525397, 524132, 480510, 432776, 428002, 466896, 463195, 377155, 367934, 408682, 433438, 446377, 462450, 398355, 353200, 371501, 361846, 370661, 344158, 303768, 282841, 314957, 331167, 378822, 375468, 375012, 388449, 361422, 334334, 338486, 377341, 402988, 508781, 559716, 526436, 483487, 517929, 519009, 427702, 421117, 446782, 414703, 378326, 379406, 326543, 301722, 298830, 301126, 298444, 244739, 217884, 183300, 177501, 272254, 273304, 196305, 185123, 205009, 293176, 353991, 371091, 389772, 432354, 418749, 430639, 479175, 469329, 473947, 518009, 557929, 621208, 587817, 558173, 498791, 425550, 350869, 393664, 430347, 360560]
17476C60560l6152K0206K4350k6093k9400m146L0578m4777J5620J3354K4538P8395
17464D27033N4221O7288j3267j7465L3879Q2457M9861M6706P4633K9565P2806
17453I07717N7442l6865p3174k8448l2598q298j2516q73n240l6565m154O5P119
17440G33612p2210p3327j3304k0445j7839J1773M0537K5190O7810J08129N7606
17429H47532L6408j851k2798N8787J8433K9576K2332m3882m9741J0819j2957l679
17417H88979m021M0837L7440o2240l9589P3990L2547J1054k3057R074J4704n578
17405I74140l210j6846R158K3340k5056j114M4326K1818Q6541P1456R220J09209
17393A302982O7329M4414k7285o3955j4648R2194r211k7285K8440M501J5374m5400
$$ y = [360560, 324408, 344614, 368964, 342871, 313471, 309325, 339903, 295126, 310746, 324100, 348638, 427033, 481254, 548542, 535275, 517810, 551689, 634146, 684007, 730713, 805346, 834911, 907717, 965159, 928294, 855120, 826672, 794074, 785776, 773260, 772387, 767147, 730582, 726428, 726493, 733612, 661402, 588075, 574771, 554326, 536487, 548260, 588797, 613987, 681797, 789926, 847532, 883940, 882089, 859291, 918078, 936511, 966087, 988419, 944537, 894796, 905615, 892658, 888979, 884958, 925795, 963235, 900995, 861406, 935396, 967943, 978997, 955940, 965014, 979718, 974140, 970930, 954084, 963242, 986582, 961526, 960412, 1004738, 1026556, 1113097, 1184553, 1193773, 1302982, 1370311, 1414725, 1387440, 1323485, 1308837, 1401031, 1391820, 1364535, 1392975, 1397476, 1412850, 1367450]
17381A367450j7749j7054j2191J6700K942O4784M6610L5638N9103J1323P449J6447
17369A581452m909J1932K1685J9660k447K4098R3772L1746K1632O3462N1749K7552
17357A941384P2430N7239O1984J02052K2764N9518P2547O1191P9517M9025O3549
17346B643200Q2900J09599J99288J74156J35845J97456K99643K59392K89714L98765
17336D789958M66572M57967N08213N41226N46009N30114N24582N45021N46476
17327I456138O39281O06046O71855Q28621J006360J123850J238298J320512J377382
17318A8268343J558910J967263K628102L618566N141175P607475J1496325J6470988
17310F8757147K1733808K7321968L3833277L7680489L8288414L8262903L2265523
$$ y = [1367450, 1349701, 1332647, 1320456, 1337156, 1340098, 1404882, 1451492, 1487130, 1546233, 1557556, 1565005, 1581452, 1576543, 1588475, 1610160, 1629820, 1627373, 1651471, 1745243, 1776989, 1798621, 1862083, 1913832, 1941384, 2013814, 2071053, 2133037, 2235089, 2257853, 2317371, 2389918, 2451109, 2530626, 2579651, 2643200, 2726100, 2835699, 3034987, 3209143, 3344988, 3542444, 3842087, 4101479, 4391193, 4789958, 5256530, 5714497, 6222710, 6763936, 7309945, 7840059, 8364641, 8909662, 9456138, 10095419, 10701465, 11373320, 12201941, 13208301, 14332151, 15570449, 16890961, 18268343, 19827253, 21794516, 24422618, 28041184, 33182359, 40789834, 52286159, 68757147, 90490955, 117812923, 151646200, 189326689, 227615103, 265878006, 298143529]
17303B98143529K2378304J0704840q709554k3132952l2403279m4135673m3820965
17296A79024250l6327002l0823049k2690034j4823494r660891o338593m143712
17289E4217475k781322j737743j089936n37889k5517M57905J095939K082605L637196
17280E5318713O123550R815278J4484054J9146007K4363802L0181068L3039259
17273A92471731L3486430L3250711K7247538J8481106P266316j0534414k2459877
17266B79209541l0934314m0555362l8639006l2765113k8752486k1952453j4995469
17259G0615338j0047353o968796n047248l761497k880998k322064j917503j688145
17251C5981734j463006j420091j313042j183668j144177j094534j017892r23905
$$ y = [298143529, 320521833, 331226673, 322517119, 299384167, 266980888, 222845215, 179024250, 142697248, 111874199, 89184165, 74360671, 64699780, 58361187, 54217475, 51436153, 49698410, 48608474, 48070585, 48045068, 48502973, 49598912, 51681517, 55318713, 61442263, 71257541, 85741595, 104887602, 129251404, 159432472, 192471731, 225958161, 259208872, 286456410, 304937516, 312203832, 301669418, 279209541, 248275227, 207719865, 169080859, 136315746, 107563260, 85610807, 70615338, 60567985, 53599189, 48551941, 44790444, 41909446, 39587382, 37669879, 35981734, 34518728, 33098637, 31785595, 30601927, 29457750, 28363216, 27345324, 26421419]
17243B6421419q66519q19031q19279p95793q10569r03066q90818q58710q23414
17234A8834220p19035o08688o53911n96450n83479n96474n17569n64672n02861
17225A3491081m53778m22782m31139l75865m05782l80874l73581l18456l11521
17216A0017303l13048k89573j88919k76393l40385k58216k58515k61520k28718
17207G602016j69817j42882k04210k21693j93470k09137j97389j98619k07140
17198E857659j64679j05399j68419j88484j66398j38210j42887p0107r0403j21627
17188D501046j26883r7108j04415j33616j10020o8336j27365q4286j07739j23496
17178C417782j31565p8546o648p0883q9248p9431p1836j42703r2465m6344k7022
$$ y = [26421419, 25554900, 24735869, 23916590, 23120797, 22310228, 21407162, 20516344, 19657634, 18834220, 18115185, 17506497, 16852586, 16256136, 15672657, 15076183, 14558614, 13993942, 13491081, 13037303, 12614521, 12183382, 11807517, 11401735, 11020861, 10647280, 10328824, 10017303, 9704255, 9414682, 9225763, 8949370, 8608985, 8350769, 8092254, 7830734, 7602016, 7432199, 7289317, 7085107, 6863414, 6669944, 6460807, 6263418, 6064799, 5857659, 5692980, 5587581, 5419162, 5230678, 5064280, 4926070, 4783183, 4713076, 4622673, 4501046, 4374163, 4277055, 4172640, 4039024, 3929004, 3860668, 3733303, 3649017, 3541278, 3417782, 3286217, 3207671, 3201023, 3130140, 3040892, 2961461, 2889625, 2746922, 2654457, 2608113, 2581091]
17167B581091j10134j37556j59541j66256m6898J1991n0720o0072n6400o5525
17157A739980m8729n7786J1183k7535r6546k4130k6772m0466l1189l4549o3818
17146A299643j0544m4358k8832J2901q142p8363K5526L5482o388p7143j16094
17135A003688o7239J8623o3584l2066q7571n7597l5758j2456j0417n3577l2402
17124E69644n9492j8948n9113n185M2035j5055l5827j7678k01j4126o521m2538
17112C36995K4661r184k7105K2563P6064J2171K5228P5631M313P199o4309m4871
17100D39356p204l7616l1832k2474n7770J8672K0589p0460j7756L9144N872l7649
17088B40872n7693r960N5920n236k2516N7947m936k4631m2498l4114r816L1106
$$ y = [2581091, 2470957, 2333401, 2173860, 2007604, 1960706, 1972697, 1921977, 1861905, 1805505, 1739980, 1691251, 1633465, 1644648, 1617113, 1520567, 1496437, 1469665, 1429199, 1398010, 1363461, 1299643, 1289099, 1244741, 1215909, 1228810, 1220668, 1142305, 1167831, 1203313, 1196925, 1119782, 1003688, 936449, 955072, 891488, 859422, 771851, 714254, 678496, 666040, 655623, 602046, 569644, 510152, 491204, 432091, 426906, 468941, 453886, 418059, 400381, 400180, 386054, 379533, 336995, 361656, 352472, 325367, 347930, 423994, 436165, 461393, 537024, 541337, 548536, 484227, 439356, 432152, 394536, 362704, 340230, 282460, 301132, 321721, 251261, 233505, 272649, 278521, 240872, 183179, 173219, 229139, 223903, 201387, 259334, 254398, 229767, 187269, 153155, 143339, 174445]
17076A74445N7742p987l2638K0049L8614l8403l900K3361L4563l657K8971L9094
17064C30254k1928L512k3126N550j6832k4874j4327J1479K4305m887l5537j2596
17052B20993n3958J929n203j0723P614N3039L6094k9650l9689L7523P902J8492
17040B44363N0341j1495l7265q508n304p1969l4059L2827m0740k2089Q992J2683
17028A17777j9958k6938J8636M4575n0038o9570O203N2279N470J0469p282n9k8853
17015E2711J7974J40L5589L3506l2255K6482j0267k9947n0639R524k6742k9705
17003c629K1324L6141J1421k3970n7603J5238k2850k8670L9087L2722M445O448
16991C0104l6526j6260p541J8371n0649r9314Q636L5421M264J1482J6553K7756
$$ y = [174445, 232187, 224200, 191562, 211611, 250225, 211822, 207922, 231283, 265846, 262189, 291160, 330254, 308326, 311838, 288712, 294262, 277430, 252556, 238229, 249708, 274013, 269126, 233589, 220993, 167035, 168964, 163761, 153038, 160652, 213691, 249785, 220135, 180446, 217969, 225871, 244363, 294704, 283209, 245944, 237436, 232132, 160163, 126104, 158931, 118191, 96102, 105094, 117777, 97819, 70881, 89517, 134092, 84054, 14484, 20687, 72966, 78436, 88905, 81623, 81564, 52711, 70685, 70825, 106414, 139920, 107665, 134147, 123880, 93933, 43294, 52818, 26076, -3629, 17695, 53836, 65257, 41287, -16316, -1078, -23928, -52598, -13511, 19211, 23656, 30104, -6422, -22682, -30223, -11852, -62501, -161815, -153179, -117758, -113494, -102012, -85459, -57703]
16979e7703L805n267J1373k969n1870k0432K3653J5717L0134O300m3022k064j5808
16966a08153j5887L276K1719J1384L3375N7133K8214m2440l04r56l129k8593p5112
16953a19473K8680K9495L5413k0932k2610m5191J2635N3442N0758K6069l4902
16942f616k6426K8656l5219j8561k4027L2177k7790n2915L9336L4312K0119k291
16930c9245K4855J1733K5481l9516m6665K2296n070k1233j1794N2456m7079K733
16918g1048O3936K9308n9028m335J0572r60M7681k0571j3851N7774J1850o2767
16906a1439r0165J022N2041K3658K4117K0900M962m6286o5925m6497N9719L3653
16894d0240r564J9197k8584l3190K4301M3549q410k0286K3402N2229K5377n667
$$ y = [-57703, -53898, -59165, -47792, -50761, -102631, -123063, -99410, -83693, -53559, -47259, -90281, -92345, -108153, -124040, -120764, -99045, -87661, -54286, 2847, 31061, -11379, -11683, -12639, -15768, -44361, -119473, -90793, -61298, -25885, -46817, -69427, -114618, -101983, -48541, 2217, 28286, -6616, -33042, -4386, -39605, -58166, -82193, -50016, -77806, -130721, -91385, -57073, -36954, -39245, -14390, -2657, 22824, -16692, -63357, -41061, -46131, -67364, -79158, -26702, -73781, -71048, -7112, 22196, -36832, -41167, -30595, -31555, 16126, -4445, -18296, 39478, 51328, -11439, -101604, -100582, -48541, -24883, -766, 20134, 25096, -21190, -87115, -133612, -73893, -40240, -49804, -30607, -59191, -92381, -68080, -24531, -32941, -53227, -29825, 22404, 47781, 42114]
16882D2114J4116j2582k1518l802n987j6261m4850r842J013K1950m1584L7288
16870c9945J9079n2356N119K4016M8338k6929j9041l4147l2343J2597L4577k0935
16858h1970j1482m7667l028N026N962M0211P1655N2568k1363l8328J3248L3255
16846A8087K4864m9934l6426j0083k4815K2274L4721n0511k2078j6358J3108M6380
16834e0771N1824k671l6877O962K9178j3639l3511l7082j7485r325k0975K4291
16822a10081M0988N4471J1757k0230J0573L6165m1188l0481J686k5176R075k8334
16810i0775O497L8497k5478K8988K3695K00j2557L511K8340L1108L6809k9555
16798C9280k7596k4375J900Q960M314j1074O447Q679N0667K1261K8952K1157M4923
$$ y = [42114, 56230, 43648, 22130, 18328, 12341, -3920, -48770, -58612, -57599, -35649, -77233, -39945, -20866, -73222, -68103, -44087, 4251, -22678, -41719, -75866, -108209, -95612, -61035, -81970, -93452, -141119, -144147, -139121, -133159, -92948, -21293, 31275, 9912, -28416, -15168, 18087, 42951, -6983, -43409, -53492, -78307, -56033, -21312, -71823, -93901, -110259, -97151, -50771, 1053, -1618, -38495, -31533, -2355, -15994, -49505, -86587, -104072, -113397, -134372, -110081, -69093, -14622, -2865, -23095, -12522, 23643, -17545, -48026, -46340, -71516, -62441, -90775, -84278, -45781, -71259, -42271, -18576, -18376, -30933, -27422, 918, 32026, 68835, 39280, 11684, -12691, -10791, -1831, 2483, -8591, -2144, 6535, 57202, 78463, 107415, 128572, 173495]
16785A73495R8320K1370Q7767J03413K30337K03803J78383J73829J59217J05228
16775A535162L1083o508j07462j32229k50081k47019j76437j25321j24815n0677
16765C45696q2295k0121k7827l4785l0991K8941j2479L7431J1432r118K6915p196
16753B25603J5904L3259Q2565J17951J17819J55964J90373J43402J40136J37393
16743A360369J45669Q2967j6462j08693j92955j81533j62447j62719k05634j79324
16733C79238n7069J317k3870j7586o3365m6689k9591K776j009n4159o6086n413
16721A8494N5634j2948J1264L182j1337n0316m4699m3493K3918P4944P0798k6462
16709F8979j17198m281L5299j345j3365k7948M5375J4029j0195N5731J3130m056
$$ y = [173495, 271815, 293185, 380952, 484365, 714702, 918505, 1096888, 1270717, 1429934, 1535162, 1566245, 1559737, 1452275, 1320046, 1069965, 822946, 646509, 521188, 396373, 345696, 263401, 243280, 215453, 180668, 149677, 178618, 166139, 203570, 215002, 205884, 232799, 225603, 241507, 274766, 357331, 475282, 593101, 749065, 939438, 1082840, 1222976, 1360369, 1506038, 1589005, 1572543, 1463850, 1270895, 1089362, 926915, 764196, 558562, 379238, 322169, 323486, 299616, 282030, 218665, 171976, 142385, 145161, 144152, 89993, 23907, 18494, 74128, 61180, 72444, 75626, 64289, 13973, -30726, -74219, -50301, 24643, 95441, 68979, -48219, -52500, -17201, -18546, -31911, -59859, -14484, -455, -10650, 45081, 58211, 54155]
16697E4155p567j8n5432j2783j9641M4233K3903o2954n7948l8760k7226N972Q1480
16684g2586J7796M8307L0594m4680k7784m6139N9074M3782o75m3612j2917K6883
16672b1957j6035l5979m1746M535Q875K228K7650k6207m9010J101K4471q862Q687
16659a22249L3807O5573q2550l4266q44L422K0831M607L4572m2850J2888J4139
16647i2920L4551l165o181l1461k3660K7816j433L8746Q746n2153j9129m0110
16635a60353j1922P8212L0473j3152l4713k6484J8349K4707l0622m770J8680J5199
16623i6396j848M5460J3299n6133N6859M8614k4058R996l5040j0671k4899l3330
16611a08147M0020l2296j3585q571n760K4110K4388l3931j9197P754M7187l0900
$$ y = [54155, 46588, 46570, -8862, -21645, -41286, 2947, 26850, -36104, -94052, -132812, -160038, -154066, -72586, -54790, -6483, 24111, -20569, -48353, -94492, -35418, 8364, 7689, -35923, -48840, -21957, -37992, -73971, -115717, -111182, -102307, -100079, -72429, -98636, -147646, -146545, -122074, -130936, -122249, -88442, -22869, -105419, -139685, -140529, -137107, -116276, -111669, -77097, -119947, -107059, -92920, -58369, -61534, -67715, -99176, -122836, -95020, -96453, -57707, -48961, -101114, -120243, -160353, -172275, -94063, -63590, -76742, -111455, -137939, -119590, -94883, -125505, -130275, -111595, -96396, -98244, -52784, -39485, -95618, -38759, 9855, -14203, -4207, -39247, -49918, -74817, -108147, -68127, -100423, -114008, -122579, -128339, -104229, -79841, -113772, -132969, -125215, -78028, -108928]
16599a08928l1472L6315O0449J4826r742j3357L7484j8812Q000p516j314J5033
16587a9034n265k9837l477o3484l7714Q524R0092L911k2715n8650k5754N351j028
16574a59080K0705J3200J6633Q4969K3590n0751n1892j6668O513j3126M5560j9739
16562a00086j356Q666k2037L185j1601l723J6108j1168L2605j2771r217n9624
16550a71019J0670M1924j1379l8194M1083o871M4113r561J3822O848j0131l1662
16538a20357m5817l0609J4545K9616M5360L0960J8860m018K3786K4518K4388N3120
16526F4352k8378l6195n1977k0285L7140j8684P325q575n6004q83L4288M2457
16514c5419j7687n4062l0631J6105J7679j7672j0449m3478L9469P2956k974j0681
$$ y = [-108928, -140400, -104085, -43636, -28810, -38552, -51909, -14425, -33237, -25237, -32753, -34067, -19034, -24299, -54136, -57613, -121097, -158811, -150287, -60195, -56284, -78999, -137649, -163403, -158052, -159080, -138375, -125175, -108542, -23573, 17, -50734, -102626, -119294, -112781, -125907, -80347, -100086, -101442, -92776, -114813, -111628, -123229, -126952, -110844, -122012, -89407, -102178, -111395, -171019, -160349, -118425, -129804, -167998, -126915, -133786, -89673, -99234, -85412, -78564, -88695, -120357, -166174, -196783, -182238, -152622, -107262, -76302, -57442, -61460, -37674, -13156, 11232, 64352, 35974, -221, -52198, -72483, -35343, -54027, -46702, -55277, -111281, -112164, -77876, -35419, -53106, -107168, -137799, -121694, -104015, -121687, -132136, -175614, -136145, -63189, -66163, -76844]
16502g6844j861L490j5482J12549P651k481l8424l5666L5617k9736n8819j2269
16490a12275K3847k185o0018j9451J7041L1200K944L0112K1421n2161j051K5734
16478i4842j9892j3093k6426M7480R5430J9696j4338K6961m0123N949j0923k6581
16466e0702J3640L102m7917L673J7724R068j9356m1068j0331j5296k6361m387
16454a68211P6620Q6925L836p493j5598P902j1356l2282j129J7854J9203M24p1772
16441i5077k7935k0112L5911M1462K6823l2902o4976o0657K6513L1963N3082M9241
16429c6664J126N323j3306k8070n6415M360O4970L913n3805m3376j0809L9472
16417a23281N477J412J3179k0971m2854N176j4528k2783K8103J11369N7594m8711
$$ y = [-76844, -78705, -75215, -90697, 21852, 29503, 27022, -11402, -47068, -11451, -41187, -100006, -112275, -88428, -90613, -150631, -170082, -153041, -121841, -118897, -88785, -67364, -119525, -120576, -94842, -114734, -127827, -154253, -106773, -11343, 8353, -5985, 20976, -19147, -13198, -24121, -50702, -37062, -33960, -81877, -78204, -60480, -51412, -70768, -111836, -122167, -137463, -163824, -168211, -91591, -4666, -830, -8323, -23921, -16019, -27375, -59657, -60786, -42932, -23729, -23305, -95077, -123012, -143124, -107213, -65751, -38928, -71830, -136806, -197463, -170950, -138987, -85905, -36664, -35538, -30215, -43521, -71591, -128006, -123646, -58676, -54763, -108568, -151944, -162753, -123281, -117804, -116392, -103213, -124184, -167038, -161862, -176390, -199173, -171070, -59701, -2107, -50818]
16405e0818o0594M088N9523j4038p088J7031K5601K1438r5356j8656M1397L5715
16393d1757L8319j4316M4022p391m3252m3399o646r527n1552M4711K7639K7101
16381c6048j0597k003J2429l5358K5971N3367K45j1318o8228m8103J9213O7574
16369c2856N692j300Q23q10L7206J960n6002l9787j8996k7726n2328L449Q1981
16356i8694R6467n4608j2987Q544M2795R116K0465j0893p5501m4306j0138j651
16344a31391M9889K1302k4674k6783k923Q8174m9981n7229j6961o246K8835K2590
16332a05398j7496J9453K0364o1649m4538K1782J8789k6468k2442M2766k9064
16321a83901k0901P671L5532M0939j6689R547j723J3980L3309R4194l8197k1579
$$ y = [-50818, -111412, -107324, -47801, -61839, -68927, -51896, -26295, -4857, -100213, -118869, -77472, -41757, -3438, -17754, 26268, 18877, -24375, -67774, -74420, -83947, -135499, -90788, -63149, -36048, -46645, -48648, -36219, -71577, -45606, 7761, 8006, -3312, -71540, -119643, -100430, -32856, -27164, -28464, -27641, -28451, 8755, 10715, -45287, -85074, -104070, -131796, -184124, -180675, -98694, -2227, -56835, -69822, -61278, -18483, -9367, 11098, 205, -75296, -119602, -129740, -131391, -81502, -60200, -84874, -111657, -114580, -26406, -76387, -133616, -150577, -156823, -127988, -105398, -122894, -103441, -83077, -144726, -189264, -167482, -148693, -175161, -197603, -154837, -183901, -204802, -197131, -161599, -120660, -137349, -127802, -129525, -115545, -82236, 11958, -26239, -47818]
16309d7818K3926o9297n3546O4943K984l7154r530M963M9120L3076o3458M752
16297i7039j1981N2199l99l9617m052M9322m299M6556l0187p1851m0962R0354
16285f1956j5039o9523O3578N7800L0940J8354r329m3450l8158O307J4471m0872
16273h6877J2473L8653j5582j3692m5807L0541J1264p0242m0055K6239N6520M4218
16261e2347j1612n654j3287l4191n497M3759L3547j0219j8938q524Q860L1780
16249d2323L6769L4774m5659j0355j8831L2237L7731l6536j2721j7510M0360J7353
16237A5289m7310p9785r686k2068J2063L8896K4471N226K1996k677P22K7377P9149
16224F3663N2987j3748n7199j7019l3097K4449o361o1159J7314L6630j7758K4070
$$ y = [-47818, -23892, -93189, -146735, -81792, -78808, -115962, -125492, -120529, -71409, -38333, -101791, -97039, -109020, -56821, -57220, -96837, -100889, -51567, -55866, -9310, -39497, -111348, -152310, -61956, -76995, -146518, -82940, -25140, 5800, 24154, 14825, -28625, -66783, -60476, -46005, -86877, -74404, -35751, -51333, -65025, -110832, -80291, -69027, -139269, -179324, -153085, -96565, -52347, -63959, -69613, -82900, -117091, -122588, -78829, -45282, -55501, -74439, -82963, -74103, -42323, -5554, 29220, -16439, -26794, -45625, -13388, 24343, -12193, -24914, -42424, -2064, 15289, -32021, -111806, -121492, -143560, -131497, -92601, -68130, -62904, -40908, -43585, -42863, -15486, 63663, 116650, 102902, 45703, 28684, -4413, 20036, 13675, -47484, -30170, 6460, -11298, 12772]
16212A2772M5967J071m5515j2197L60j8475k2984M1393J8946k7999l6169o11j061
16199d4502l2164J4590j6518j5175J720K3660K8692N6648j305m8501p3230L104
16187a02981P5236L4768j1687J2153K9165j2870m045n037l4654j3967j6633n9427
16175a09979N554J0437l446j532m260N3697P4686n6323j7098J0830l8959r528
16163h5921L7491L9837J9856J7452q3311q7655J5830j5966j4325P1231L8451k8883
16151g5913M7999K9411n6052j5374J2809o3695j6485L9173Q0218K2391L2602n7126
16139b0042j4722k0910j5030M5526K7103k3026k0764k7784J6467K382j0767J9237
16127d2330j9461n9027O596m948J597M514O8042L8904K9484k9726n8927j8638
$$ y = [12772, 58739, 59810, 14295, 2098, 2458, -16017, -39001, 2392, 21338, -6661, -42830, -43441, -44502, -76666, -62076, -78594, -93769, -92049, -68389, -39697, 16951, 15646, -32855, -106085, -102981, -27745, 7023, -4664, 7489, 36654, 23784, 19739, 14702, -19952, -33919, -50552, -109979, -104425, -93988, -97434, -98966, -103226, -49529, 25157, -31166, -48264, -37434, -76393, -85921, -48430, -8593, 11263, 28715, -54596, -142251, -126421, -142387, -156712, -85481, -47030, -75913, -27914, 1497, -54555, -69929, -57120, -120815, -137300, -98127, -17909, 4482, 37084, -20042, -34764, -55674, -70704, -25178, 1925, -21101, -41865, -69649, -53182, -50800, -61567, -42330, -61791, -120818, -114222, -119170, -117573, -113059, -45017, -6113, 23371, -6355, -65282, -83920]
16115h3920K3311J365p432n3883L825K8657j8385q3416J1311J13772J990j7804
16103h0609J7574j2862M7310l1721p0800J5820Q5399M1157k2897k6071J2227k3812
16091d9285M5982J7350j6869k1437j2883m6361O748M216n0707q5142O0681J01684
16079d6023l7553P314L0423J2521J5312J9941n7924o4958L376L9798L6893O397
16067c4483j3053k8727k2909R072J8930K6151o786J9380J8333J0200J8154K9552
16055D3814l3482n0123K045M467K7338K0018J1993m66j1546m9663n1993Q936P3478
16042e184K4802m9239k4014P1606o054m8701O107J6988j2387Q632K633J1124J2462
16029H775P361M783J2556P554k440o604l1442m9782M6606M9127J7272l6287l336
$$ y = [-83920, -60609, -59244, -66676, -120559, -116734, -88077, -106462, -189878, -178567, -64795, -62805, -80609, -63035, -75897, -28587, -60308, -131108, -115288, -29889, 11268, -11629, -37700, -25473, -49285, -3303, 14047, -2822, -24259, -37142, -83503, -76755, -72539, -123246, -208388, -147707, -46023, -83576, -76262, -45839, -33318, -18006, 1935, -55989, -120947, -117571, -77773, -40880, -34483, -47536, -76263, -99172, -90100, -71170, -45019, -51805, -32425, -14092, -3892, 14262, 43814, 10332, -39791, -37746, -33279, -5941, 14077, 26070, 25604, 14058, -35605, -87598, -78662, -5184, 19618, -29621, -53635, 17971, 11917, -36784, -30677, -13689, -26076, -17444, -14811, -3687, 8775, 16136, 20919, 33475, 41029, 38589, 31985, 543, -49239, -2633, 46494, 63766, 27479, 24143]
16016B4143l5657J651K0966q488j4602j7682m0541k2185j7650l0908K3529K3440
16004i3984L9979L3616K9627L0723P783q0489m5430P71L9445m9162K4006M048
15992e9067m1971J7344J1343k2984l321M0980k2813l9493J2719k3109j7639N0646
15980i7365N5806k3131m1973J2214O9636p710o068N1979K9659k2868J7939K5273
15968F3391J8532N161q418k8750o0197j6340j2249M9768N205K4296p0078o5096
15956i4775J9127l0209j3006j3133O234M7308K0285K6759L1492J2275l4134o3298
15944h5075l3O6566O7048L465n8165l2715R486J0587L6415l5184l9520K3104m3088
15931g7109L5696K4163q999l5873N410M7103J2934L0779N4865j2407l0273p890
$$ y = [24143, -11514, -9863, 11103, 2615, -11987, -29669, -70210, -92395, -110045, -140953, -117424, -93984, -54005, -20389, 9238, 39961, 47744, -32745, -78175, -77404, -37959, -87121, -63115, -59067, -101038, -83694, -72351, -95335, -98656, -57676, -80489, -119982, -107263, -130372, -148011, -97365, -41559, -64690, -106663, -94449, -24813, -32523, -38591, 13388, 43047, 20179, 38118, 63391, 81923, 87084, 78666, 49916, -10281, -26621, -38870, 10898, 16103, 40399, -29679, -94775, -75648, -105857, -118863, -131996, -125762, -78454, -58169, -31410, 82, 12357, -21777, -85075, -85108, -18542, 48506, 51971, -6194, -38909, -29423, -18836, 17579, -17605, -57125, -34021, -77109, -41413, -17250, -26249, -62122, -56712, -9609, 3325, 34104, 88969, 76562, 46289, 38399]
15919C8399m3396o7430K439j6340j5391k5519O1538O5587K6670m0878M314J0999
15907I92L1657N019n4535n9426J9609j3765m1759o886L6141m134K1030j3495L3365
15894d6187L9749J7917j2142n5305N301N6170n365m8943q5392K4121O5213p527
15882e2390l0489L5313K9781l7596n3297j5258j8571K6323O8580l4361m1955K9211
15870i4709O338m051r932l2477N0239K6345K6984k1979l0181l2644j8989O742
15858a28314M6834L0862M6511o703k9206n6493M0031j507K925J2710O2819o434
15846A4035j2779O36J5328k6625m4217j1521J494J9116R097L2463l1611r460K8089
15833a5955L1207P997l2409n842J7526n8652P733k695k1405J5754L6828K706k5866
$$ y = [38399, -4997, -72427, -69988, -86328, -101719, -127238, -65700, -113, 26557, -14321, -10007, 992, 32649, 37668, -16867, -76293, -56684, -70449, -112208, -119094, -82953, -87087, -66057, -79552, -46187, -6438, 11479, -663, -55968, -50667, 5503, 138, -48805, -134197, -110076, -44863, -52390, -82879, -47566, -17785, -55381, -108678, -123936, -142507, -116184, -47604, -81965, -123920, -94709, -88371, -92422, -102354, -134831, -84592, -58247, -31263, -53242, -83423, -116067, -135056, -128314, -81480, -50618, -4107, -10810, -40016, -96509, -56478, -57985, -55060, -42350, 20469, 14035, 1256, 1892, 17220, -9405, -53622, -65143, -63649, -44533, -35436, -2973, -34584, -44044, -15955, 15252, 23249, -9160, -15002, 2524, -56128, -48395, -51090, -72495, -56741, -19913, -17207, -43073]
15820d3073J610L89l2566J883P6418N4956K7805J1328k1498r5383m494m7461Q95
15807f9191M0630n279N2737K6972q2424m605M7520J1875j0279o0483m8585j2598
15795a13710K990l0417M705L1766J5387O0350P4779j9946n5445j08P098M4374
15783B1823k1085L2742k3243l4577j1875m6870J4133K3346j6494l5485K8255m467
15771g3797p2866J8808J786R6376K9302J1548J0461k1162N586m645O442R740r500
15758H079n8322m7170j0467L781l395L0684N47R6953L3708m7508m7404O2823N0360
15745G2669m1713m4206k8346n2313L221K2553K9313l818J4506J0868p320K2721
15733a865l798k7541l0997N828M4320j480k8904J7668j4215J1655M4351N758j6005
$$ y = [-43073, -41463, -41074, -73640, -71757, 4661, 59617, 87422, 98750, 77252, -18131, -22625, -70086, -69191, -28561, -33840, 18897, 45869, -36555, -41160, 6360, 18235, 7956, -52527, -101112, -113710, -110720, -141137, -136432, -104666, -89279, -28929, 45850, 25904, -29541, -29649, -22551, 21823, 738, 33480, 10237, -24340, -36215, -83085, -68952, -45606, -62100, -97585, -69330, -73797, -146663, -127855, -126069, -29693, -391, 11157, 21618, 456, 6042, 1397, 7839, 17579, 8079, -50243, -97413, -107880, -104099, -107494, -76810, -76263, 20690, 54398, 6890, -40514, 22309, 72669, 30956, -13250, -41596, -93909, -90688, -68135, -38822, -42640, -28134, -17266, -24586, -1865, -5663, -33204, -64201, -58373, -14053, -15533, -44437, -26769, -40984, -29329, 15022, 20780, 4775]
15720D775l3137J714N1106J2962l6331J859l5095m3384K5994l317m1322J0054
15708h4122l0740M7715K0548j6509M0734K505j7426k1668n3215k123n896J8441
15696a01756J7422k1423K6131J056K581L6126J4364j2189L006j5753l5595J2934
15684g3096K179J0193K9316O0635m049k9876L810k8027k7840j6624M579P356K9508
15671c1936l6914k2960J1298j243P891n4102K8054P4057K2015k5049l3684J4411
15659d8162K7735J9642n215q205l500m206K3181J7807j4308l8351r099L0978N726
15646e977j1525k4468j1800J4857P1249n09j8304j6008k0382n340L8463k4907
15634a4651J831J3541J3260n1860L1215L6919n7495j03238J4272M9253J994J898
$$ y = [4775, -28362, -26648, 24458, 37420, 1089, 2948, -32147, -75531, -49537, -52854, -94176, -84122, -114862, -67147, -46599, -63108, -22374, -19869, -37295, -58963, -112178, -114301, -120197, -101756, -84334, -105757, -79626, -78570, -75989, -39863, -25499, -37688, -34682, -50435, -86030, -73096, -70917, -60724, -31408, 29227, 25178, -4698, -888, -28915, -56755, -73379, -68800, -61444, -31936, -68850, -91810, -80512, -81755, -73864, -127966, -99912, -25855, -3840, -28889, -62573, -48162, -20427, -785, -6000, -14205, -17705, -21911, 1270, 19077, 4769, -33582, -42681, -11703, -5977, -17502, -41970, -53770, -38913, 32336, 31827, 13523, -2485, -22867, -28207, 10256, -14651, -12820, 721, 13981, -37879, -6664, 30255, -27240, -130478, -116206, -66953, -64959, -63061]
15622f3061N9908O927l6713J7350j6943l84j7038K0806j0549k5936K0587Q520
15610c6526o301p397l2560j9285j4678N8756O3161M2717L9541K4463k9030k6852
15598E6009p4398n9062m7497l083J4717M302M8196Q3204p2241n4419N0873J4674
15586c8725l4909n506M2543R174m7883k6888J0956L7383J2025j8046j5268K5232
15574d9912P882j7053R368L8697J8334j8582n9031m4649M7674J0001J8324J8181
15562b0766R008J9086P212m3104p935P484K1580L2483K9115k1118q067j1421l2488
15549a8931l4798l5737K6429j2798r643l8094K862l6683R343M1160P6062L3959
15537C131j7673m155Q9617j0321j1684r56n0632l1038j2165M147k772j1767K3502
$$ y = [-63061, -3153, 3774, -32939, -15589, -32532, -32916, -49954, -29148, -39697, -65633, -45046, -36526, -42827, -50224, -82784, -102069, -116747, -57991, 5170, 47887, 87428, 111891, 82861, 56009, -18389, -77451, -124948, -128031, -113314, -109012, -60816, 22388, -49853, -104272, -53399, -38725, -73634, -79140, -36597, -27423, -75306, -102194, -91238, -53855, -41830, -59876, -75144, -49912, -42030, -59083, -49715, -11018, 7316, -11266, -70297, -114946, -67272, -57271, -38947, -20766, -11758, 7328, 14540, -28564, -36499, -29015, -7435, 25048, 54163, 33045, 24978, 13557, -18931, -53729, -89466, -63037, -75835, -85478, -123572, -120710, -157393, -148050, -106890, -30828, 3131, -14542, -18697, 70920, 60599, 48915, 47959, -2673, -33711, -45876, -41729, -44501, -56268, -32766]
15524c2766K1987n1679j2840M3371p287R227R443n9530l3189J1950J9732K558
15512g9023L1515n2724r769J8703j7174J8143k7130j6924L8443L0850m4992m1215
15500a51297K3679K4004J1892L3236k8994j2611J4310K201N6313O4147o461j840
15488B8579J6048l9209K2671L5935L3107k93m3585K5720R009n3158n4073j5254
15476c4503l4143j5175j138J3590J5834K1303K3867k6423l1186L8229N3686q196
15464A5745m8871j9638l2359r55K2794Q572j0499q044K8192j5895K9684J5304
15452a5970k355k5016M4995L3683O2907M1408o6023o8426l0848L361K6686m386
15440A6J4711K020J612O4612K8088j9741q4354k3738N2537k5208l2866o5594o3005
$$ y = [-32766, -10779, -62458, -75298, -31927, -39214, -29987, -20544, -80074, -113263, -101313, -81581, -79023, -47508, -100232, -110001, -91298, -108472, -90329, -117459, -134383, -95940, -65090, -110082, -151297, -127618, -103614, -91722, -58486, -87480, -100091, -85781, -83580, -27267, 36880, 30419, 28579, 44627, 5418, 28089, 64024, 97131, 96838, 53253, 78973, 87982, 34824, -19249, -34503, -68646, -83821, -84959, -71369, -55535, -34232, -10365, -36788, -67974, -29745, 23941, 15745, -33126, -52764, -85123, -86078, -63284, -54712, -65211, -73255, -45063, -60958, -31274, -15970, -18325, -43341, 1654, 35337, 98244, 139652, 73629, 5203, -25645, -22284, 4402, 16, 14727, 16747, 18359, 82971, 111059, 91318, 6964, -16774, 35763, 10555, -22311, -87905, -150910]
15427a50910K8993N8073P8295L7508l3261R740Q356K4723m8889o3417L3799J6441
15415e49k7310L7806K6334J4364J3670J6815J591m3629r1649K0384L5213m6416
15403d3376j997O9256K6360J1661k5378k8383M2744J7167m544k3227o1831L3937
15391A2389M8182K4664j2306m0205m0474k4116j2182L1498N5300k2206j7269K0463
15379B3738p243k89K9022l4108j9976K382J8998L9307J1297P934n7580J0530N7611
15366H1623p8098l7480J3651J9516m1075j608M2001l028j0515n659J0979l5708
15354d5401p2063K548L5186J9928k1917l4366j6014Q01M5456k812J0224M7002
15342c1428O9739N8958j5131m6558k4214p443q1183k2741N2543J2440j7224m473
$$ y = [-150910, -121917, -63844, 14451, 51959, 18698, 28438, 36794, 61517, 12628, -50789, -16990, -549, -27859, 9947, 36281, 50645, 64315, 81130, 82721, 39092, -52557, -32173, 3040, -43376, -45373, 23883, 50243, 61904, 36526, 8143, 50887, 68054, 63510, 40283, -21548, 12389, 60571, 85235, 72929, 32724, -7750, -31866, -44048, -12550, 42750, 20544, 3275, 23738, 16495, 16206, 45228, 11120, -8856, -6474, 12524, 51831, 63128, 71062, 13482, 24012, 81623, 3525, -33955, -20304, -788, -41863, -43471, -1470, -4498, -15013, -20672, -9693, -45401, -117464, -114916, -79730, -59802, -81719, -116085, -132099, -131298, -85842, -88654, -78430, -31428, 38311, 97269, 82138, 35580, 11366, 3923, -77260, -100001, -47458, -35018, -52242, -56715]
15330e6715N002J4704k2829K9821O0351L66k2956k6339j5351k1347j7068K2217
15318e0144j4659r058O1062j0430K8876l964R451o2668j8759K1175O6425K0301
15306C7608j2994j0437K0330k800J4840j3253m1459q7594j357L1308m11j5565
15294h1784r628M4212M3244J765q809M0635n519J6284o76N6207j6252m1130O878
15281D5427j9416j7215N3729l5095r3870k0178L9407J2550l3004k1299K8591P4544
15269A4171N5888l271j9504o6053R812Q4216l0334l107K2152k5964r406N814n0040
15256a5626Q074l102j2910j4289k4192J023J7884l677K4643J07214n511m7406
15244C2125n0357o5256J1092l913l102K7604J1772m038J5912p463M624L330J8674
$$ y = [-56715, -51713, -37009, -59838, -30017, 30334, 30700, 7744, -18595, -33946, -55293, -72361, -50144, -64803, -73861, -12799, -23229, 5647, 1683, 11134, -51534, -70293, -49118, 17307, 37608, 24614, 14177, 34507, 31707, 46547, 33294, -8165, -95759, -97116, -65808, -66219, -81784, -91412, -47200, -3956, -2191, -11000, 29635, 24116, 40400, 39724, 95931, 79679, 38549, 45427, 26011, 8796, 62525, 27430, -66440, -86618, -47211, -34661, -67665, -88964, -60373, 14171, 70059, 66788, 47284, -18769, -8957, 75259, 44925, 41818, 63970, 38006, 28600, 34414, -15626, -7552, -10654, -23564, -37853, -62045, -61022, -43138, -46815, -22172, 85042, 79531, 32125, -18232, -83488, -72396, -76309, -79411, -51807, -40035, -44073, -28161, -35624, -31000, -27670, -8996]
15231h996J715k4737P124M494N9314K5785m0930o6669k4134J0213K3505K5928
15219g388k2802R248M2793j903j0922l3004k234l4362n143j6451j3707K9957M4261
15206b1657R4534O2839k1178o1297l701K2302K0019Q41j2453q1265k1011o239
15194b8266k1618R225j1321N2212L9279J9589j404L9478k0155k8833l1518m0709
15182b4041j6867q299q2821p422R5846M7007K4774k8506n0474r840n020J3066
15170e2597K6170k8672q1820J423J7634l3613j2897L6443L4800K7131r063K3745
15158e1316L9812K1734j5897L4333p058o1256p718l61K8258N976l5846J36M7476
15145a727J8149J9918q710J8029L951L734k0249J9347j5982p2662k8166j9036
$$ y = [-8996, -7281, -32018, -24894, -20400, 38914, 64699, 23769, -42900, -67034, -56821, -33316, -7388, -30190, -20942, 21851, 19948, 9026, -23978, -26212, -60574, -65717, -82168, -95875, -65918, -21657, 72877, 135716, 114538, 53241, 49540, 71842, 91861, 92702, 80249, -1016, -22027, -28266, -49884, -40659, -51980, 232, 39511, 59100, 57696, 97174, 77019, 48186, 16668, -24041, -40908, -49207, -132028, -139450, -43604, 3403, 28177, -329, -50803, -60643, -65663, -52597, -26427, -55099, -136919, -135496, -117862, -151475, -164372, -127929, -93129, -65998, -75061, -51316, -11504, 10230, -5667, 28666, 21608, -39648, -47366, -47727, -19469, -13493, -49339, -49203, -1727, 16422, 36340, 27630, 45659, 49610, 53344, 33095, 52442, 36460, -36202, -64368, -83404]
15133h3404j4220j1117J3450K0834N2449l238J4785j9522K276Q3387K8783p587
15121G6876N125L1344o421k1025k4157j1193R782l233l3726O120O377r248K0061
15108D6682J8750j5609k127K1731L767p4943k132k5248K4345q2k7980O290Q333
15095a8223l2155K0918L4938K130L1620m256L0256j8552m2619l4747L5986L7911
15083D3207k7022k8407O642k4821n951m004J8426r966n339K1488K8404K7750N0739
15070I1146R500p304j7688j5489j8486K3272k7068k5941J3296o814r0683l4555
15058a06814P4971n4958m6431N0873K1204O023O5975N3074o1591J0975J5962l5519
15046f256k0403K0060o420l607J0511K2145L2724k0089j0127l3035K4462M123
$$ y = [-83404, -97624, -108741, -95291, -74457, -22008, -25246, -10461, -29983, -27707, 55680, 84463, 76876, 82001, 113345, 106924, 85899, 61742, 50549, 60331, 57098, 23372, 29492, 35869, 26621, 46682, 65432, 49823, 47696, 69427, 73194, -1749, -3881, -29129, -4784, -4866, -32846, -26556, -18223, -50378, -29460, 5478, 7608, 39228, 34972, 65228, 46676, 4057, -30690, 5296, 43207, 16185, -12222, -5580, -30401, -36352, -40356, -21930, -31896, -37235, -15747, 12657, 40407, 91146, 100646, 93342, 75654, 60165, 41679, 64951, 37883, 11942, 25238, 18424, -72259, -106814, -31843, -86801, -133232, -82359, -61155, -55132, 10843, 63917, 2326, 13301, 29263, -6256, -26659, -6599, -13019, -16626, -6115, 16030, 48754, 28665, 18538, -14497, 9965, 14088]
15034A4088j1379q963L7357o736O018P717O503k8217k3128R625J2017j3225K0671
15021B2348p35n6922J4622L2269m30q729J6910O722N3772k525m6838m9349J1562
15008g323n031q071M4763K3549k5993l8412p440k3333o44l4910J1210O1892q30
14995a0573k0529J1027J2373N0454j3679p9561k332L8674L1336O3917L4225n8013
14983E7319q0728o61K3880J6312J380n2830p537N3203P684L3912m0641l4653K5055
14970A695k9312m6341J7996J977k6562K6868O0010j5891M0980j7304m9656k9773
14958f5313N623K2509j716L0423P752J8433K5389n1104j1735l1057l796j2314
14946f6906R557k2466K4250M7695L3062L2277J174k1252k2867L9173l177m7879
$$ y = [14088, 2709, -6254, 31103, 24367, 30385, 38102, 44605, 16388, -6740, 2885, 14902, 1677, 22348, 21613, -35309, -20687, 11582, 11152, 2423, 19333, 26055, 79827, 77302, 30464, -18885, -7323, -12354, -20425, 24338, 47887, 21894, -16518, -23958, -47291, -47935, -82845, -71635, -9743, -10573, -31102, -20075, -7702, 42752, 29073, -50488, -52820, -14146, 17190, 81107, 115332, 57319, -23409, -24070, -190, 16122, 17502, -35328, -42865, 10338, 18022, 51934, 11293, -23360, 1695, -27617, -73958, -55962, -53985, -80547, -53679, 6331, -9560, 31420, 14116, -35540, -65313, -59690, -37181, -38897, -8474, -722, 17711, 43100, -8004, -19739, -50796, -54592, -66906, -57349, -79815, -55565, -7870, 25192, 57469, 58643, 37391, 14524, 53697, 50520, 2641]
14934B641K2962J7071l9160m7599M9933J5452j3127k267Q4021M465l6835J1694
14922F9251P9611K9845j8535J431p0994q7794M052J9044J7319j8816j8449L2381
14910C8346k7646j225J5729k0967J6289n3608j4276K4754N8794j0666J7496l5199
14898G821k1430K4863P983J3584R741r297m5810R245K1305N84O3874Q525l3973
14885E7015l3464k8801j117m079Q109l9353J6673P4204k3748l0720L6882L7365
14873F8966L39o3604m8044N8321L0266l0670k2619J0693k6499J7646O4616R947
14861F9358K1062L1965p7191o0090n216J4981L8172K3144L0380m3762J0037M3888
14849I6728m0958n0022k4465J4383J5464Q212M1367l0937l3800l0013k0066j1981
$$ y = [2641, 25603, 42674, 3514, -44085, 5848, 21300, 8173, 5906, 89927, 94392, 57557, 69251, 148862, 178707, 160172, 161603, 90609, 2815, 6867, 25911, 43230, 24414, 5965, 38346, 10700, 9475, 25204, 4237, 20526, -33082, -47358, -22604, 36190, 25524, 43020, 7821, -13609, 11254, 19237, 32821, 42562, 33265, -12545, -3300, 18005, 18589, 82463, 90988, 57015, 23551, -5250, -6367, -10446, -2337, -41690, -25017, 49187, 25439, -5281, 31601, 68966, 69305, 5701, -42343, 15978, 46244, 15574, -7045, 3648, -22851, -5205, 59411, 69358, 90420, 122385, 45194, -14896, -20112, -5131, 33041, 56185, 86565, 42803, 52840, 96728, 55770, 5748, -18717, -4334, 11130, 19342, 60709, 29772, -4028, -34041, -54107, -66088]
14837f6088L6959P8271J1096l0003l9238m1219K1949P2303j5383j5018J5193L3057
14825F1879p668j9884J39L8503K6818M152n5370r7774j9513R486L2307R892L5477
14812A8444J3967O955m4031l6719L0694l065N825m3995M4297K3174m9343J7209
14800a6588M6488J0210K8094l4680m5829k484J2632l4453L5324J4132L9898j8157
14788C4587n0224r361j603J2589J7096j8765o4063j8452K8016M2094J3120m051
14776a9017n740j0755K9164J6805m143k5601o4885N2476k5284M498K9806j290
14764b3966l264l0976J6015n8753K845K7859K7206L4316M2583R2279n8118m7883
14752B0143K180j207L0191J694K1608l2685l7146J9752L7075J9033L48p65o121
$$ y = [-66088, -29129, 49142, 60238, 30235, -9003, -50222, -28273, 44030, 28647, 13629, 28822, 61879, 54211, 34327, 34466, 72969, 99787, 103939, 48569, -49205, -68718, -59232, -26925, -17033, 18444, 32411, 39366, -4665, -41384, -10690, -13755, -7930, -51925, -7628, 15546, -33797, -16588, 29900, 40110, 68204, 33524, -12305, -14789, -2157, -36610, -1286, 12846, 52744, 34587, -15637, -24998, -26601, -14012, 3084, -15681, -79744, -98196, -70180, -28086, -14966, -19017, -24757, -35512, -6348, 10457, 6314, -19287, -84172, -31696, -56980, -52482, -22676, -23966, -27230, -58206, -42191, -100944, -98099, -70240, -43034, -8718, 33865, 126144, 68026, 20143, 22323, 21116, 51307, 53001, 74609, 41924, 4778, 24530, 61605, 80638, 80986, 80221, 74100]
14739G4100R08l0786k986j0067N0193l5660m0094N2134L1674J0591k5227q373
14727F6407P11p961K0109l448L2142K5146m4597l6668K8969q911n936n7258n40
14714H165J5704K0092N2296J5412k389k3050M5557J2203n3690k1431J6484J2158
14702I7511J3543J0318m2929j5798L3516L0381j5042k8824l3557J2062J6709L1336
14690A09226P356j03492k1080J4003L4063K2117J5358o060k3292K405l3048Q094
14678B5650M0856j3718o5106K8001Q6131l4695o0405K2930j022K4314L8116k5120
14666F5932N459K5274J9024l7384j2695m9342q009J3605J5084N6645M8501k2055
14654A20039l1704j3917L6957n189M7938J5281o9534k8757K2806j2580J2142K5931
$$ y = [74100, 75008, 44222, 41236, 31169, 81362, 45702, 5608, 57742, 89416, 100007, 74780, 66407, 67118, 59157, 79266, 75818, 107960, 133106, 88509, 51841, 80810, 71899, 65963, 8705, 8165, 23869, 43961, 96257, 111669, 109280, 86230, 131787, 143990, 90300, 68869, 85353, 97511, 111054, 121372, 78443, 62645, 96161, 126542, 111500, 82676, 49119, 61181, 77890, 109226, 116582, 13090, -7990, 6013, 40076, 62193, 77551, 71491, 48199, 50604, 17556, 25650, 66506, 52788, -12318, 15683, 101814, 67119, 6714, 29644, 28622, 52936, 91052, 65932, 71391, 96665, 115689, 78305, 65610, 16268, 8259, 21864, 36948, 93593, 142094, 120039, 88335, 74418, 111375, 106186, 154124, 169405, 99871, 71114, 93920, 81340, 93482, 119413]
14642A19413K183L100J192j3634J9345J5197k1492l039J8233j3545m6808o643
14630G3502J7037j7235N3097j6649p7442O4426O8509q573j3359K4588l2315j6080
14618A19506k0571l647p0629l0235j6411J9073M2684Q778K6671N8083M0467J7800
14606A91569J0178m0035j0777k7015n7272N1854J0243o1469j7228K3145M492J3653
14594I1338M8840K8732l5865o1304J0773K3835O137R508k2477m3100K2952M750
14582H4119K5265O1050o132l4149K1627J6546J228k7657l7624k8603J1517K7493
14570A14680j0800m4920K2928R820k8425m574L6219N7778m5517o1669O7947J6704
14558A30171j1035Q482O7455O975j5691m0719P02O3486R918n827m9288J7032J2597
$$ y = [119413, 121596, 124696, 125888, 112254, 131599, 146796, 125304, 122265, 140498, 126953, 80145, 73502, 90539, 73304, 126401, 109752, 32310, 96736, 165245, 156672, 143313, 167901, 135586, 119506, 98935, 95288, 24659, -5576, -21987, -2914, 39770, 48548, 75219, 133302, 173769, 191569, 201747, 161712, 150935, 123920, 66648, 118502, 128745, 67276, 50048, 73193, 77685, 91338, 140178, 168910, 133045, 71741, 82514, 106349, 112486, 121994, 99517, 56417, 79369, 84119, 109384, 170434, 164302, 130153, 151780, 168326, 169554, 141897, 104273, 75670, 87187, 114680, 103880, 58960, 81888, 91708, 63283, 58709, 94928, 152706, 107189, 45520, 113467, 130171, 119136, 127618, 195073, 202048, 186357, 145638, 146340, 209826, 219744, 213917, 164629, 181661, 194258]
14545A94258j3610K371k8464j3957k7002N5100l1991L187j0374k2403J8441m3712
14533H1844l9650O4190K828K5115J1565p637m1903o2928q457L7468R332K4342
14521I6109k052n6087J2374M916M6144N2420L2151m9745k922L9423N238o1142
14509A16827j6806L5405l0231k2089K2286N7406m14J081O3427L7899N391j4311
14497B55871l3316n3254l5516Q729R329J7849J7632J1510k9411R752k228m656
14485A72291k8256k0435n364M7736K4559j7216j1639l1297K4023k5082j1053L6715
14473A54982N6393o163k6201N2255R5036N6313l3069N458L4500J9769n3676n0056
14461C05541P8365N1465J1841O873J6730M1510O2934J6653L2290P2771L7008k0310
$$ y = [194258, 180648, 183019, 154555, 140598, 113596, 168696, 136705, 139892, 129518, 107115, 125556, 81844, 42194, 106384, 109212, 134327, 145892, 138255, 96352, 33424, 24967, 62435, 71767, 96109, 94057, 37970, 50344, 55260, 101404, 153824, 185975, 136230, 133308, 172731, 177969, 116827, 100021, 135426, 105195, 83106, 105392, 162798, 162384, 163465, 226892, 264791, 270182, 255871, 222555, 169301, 133785, 142514, 151843, 169692, 187324, 198834, 169423, 179175, 176947, 172291, 144035, 123600, 118236, 165972, 190531, 173315, 161676, 130379, 154402, 129320, 118267, 154982, 211375, 205212, 179011, 231266, 326302, 382615, 349546, 355004, 389504, 409273, 355597, 305541, 383906, 435371, 447212, 454085, 470815, 512325, 575259, 591912, 624202, 696973, 733981, 713671]
14449G13671J0732O885l2970k7305k7646R391L8618m5249K6120K0555R0817M0424
14437H24043o467l9979J6002r148p080r293l2906K0805N7235P1146j5741q1306
14425G87311q8987m9718J8207K0131Q744J7541J8276k0070j2665m691N384N174
14413G04637O6207K6014J0943k0289k0523j9568j2393r20j7082J7621J7943J8793
14401G71383J7216m3100l0083M3594j4215J7034l6957P907j447P137n5025k9067
14389F54377m9491m6138p9774p821p795k1832k0970k2240K1481N798J9955L2052
14377D77602O4590m9254p9873o5718J3199k5682j7453j6651l1636j0479P3423
14366C32068l8257n1149l5062K6738K0431J6485m5053l1077M864K8282M082r752
$$ y = [713671, 724403, 731288, 698318, 671013, 643367, 652758, 691376, 646127, 672247, 692802, 783619, 824043, 817576, 777597, 793599, 784451, 777371, 768078, 735172, 755977, 813212, 884358, 868617, 787311, 698324, 648606, 666813, 686944, 695688, 713229, 731505, 711435, 698770, 694079, 699463, 704637, 770844, 796858, 807801, 787512, 766989, 747421, 735028, 734108, 717026, 734647, 752590, 771383, 788599, 745499, 715416, 759010, 744795, 761829, 724872, 732779, 731332, 738469, 683444, 654377, 604886, 558748, 478974, 471153, 463358, 441526, 420556, 398316, 419797, 425595, 445550, 477602, 542192, 492938, 413065, 347347, 360546, 334864, 317411, 300760, 269124, 258645, 332068, 293811, 242662, 207600, 234338, 254769, 271254, 226201, 195124, 199988, 228270, 232352, 222600]
14354B22600J4030k5963p239K0272o737L1727K7623N091n0953q0762J9452L2904
14342B02045M4756J4029j9171l1090J4531k080Q953j971m0897j0489J915P1691
14330B52222Q823l4591Q736M3567M1983m2141m0611K9251N8196M58o8183o7100
14318A90610m7943N2561J1457K1431J7491k7750l6442k4387p288l9714L794N5096
14306A68916K8311N0865j7127J1229J7342m1027l9149K2899J5425k4613m154j3
14294A88904j7491L1205l0373L265k0169L4175P6241q45m3381j0492m0677K8370
14282A98732k0888M715M5038Q6188o514M280n3433k0100P898L5080l0845q222
14270B41929m066K3770m525K7063M5461J3025m4838n3456P5K7386J539L4778L2514
$$ y = [222600, 236630, 210667, 203428, 223700, 216963, 248690, 276313, 281404, 230451, 149689, 169141, 202045, 246801, 260830, 241659, 210569, 225100, 223020, 231973, 230002, 189105, 178616, 180531, 252222, 261045, 226454, 235190, 278757, 320740, 278599, 237988, 267239, 325435, 325893, 257710, 190610, 142667, 195228, 206685, 228116, 245607, 217857, 181415, 157028, 149740, 110026, 113820, 168916, 197227, 248092, 230965, 242194, 259536, 218509, 179360, 202259, 217684, 193071, 188917, 188904, 171413, 202618, 172245, 175510, 155341, 189516, 265757, 264912, 221531, 211039, 170362, 198732, 177844, 182559, 227597, 313785, 307271, 311551, 258118, 238018, 245916, 280996, 250151, 241929, 237863, 261633, 257108, 284171, 329632, 342657, 297819, 244363, 244438, 271824, 273363, 308141, 340655]
14257C40655L2929J8986K23p68k5640R9349J3016r3771m7263j6886K600L5660
14245C59090L2771J9700K4682k9849l5219l505P609l3353J1209L8476L5379j0512
14233D16478r23L4963O0649n7931n3214m4556l1788m90j9101J8653P0148q87o4622
14220C27379l6640J3479J3676N653P717K8115N6404O2140m254k9401L50m6501
14208C98117J7365L4090o048k7k9299J4574R174k2820K051L8169k6588n0216m6306
14195C32236O074M2254O2097K7242M2448K6634q4216k4836Q0053J5663j5715j870
14183E08064J622r780k9896K8043O5514J1112n674J5001j6216j6172K1258j5888
14171E56988j8214n990o9622j9642j1142M4329J8787r697M771j5737L9217L3552
$$ y = [340655, 373584, 392570, 392793, 392025, 366385, 465734, 478750, 384979, 337716, 320830, 323430, 359090, 391861, 411561, 436243, 406394, 371175, 367670, 375279, 341926, 353135, 391611, 426990, 416478, 415555, 450518, 511167, 453236, 400022, 355466, 323678, 323188, 304087, 322740, 392888, 392001, 327379, 290739, 304218, 317894, 323547, 331264, 359379, 415783, 477923, 473669, 444268, 444618, 398117, 415482, 449572, 443524, 443497, 414198, 428772, 437946, 415126, 417177, 455346, 428758, 378542, 332236, 338310, 380564, 442661, 469903, 512351, 538985, 454769, 429933, 509986, 525649, 509934, 508064, 509686, 499906, 470010, 498053, 563567, 574679, 569005, 584006, 567790, 551618, 572876, 556988, 538774, 532784, 463162, 443520, 432378, 476707, 495494, 485797, 490568, 474831, 514048, 547600]
14159E47600N375q2475l221J5157j7740j1657K4170q115p275K0722K3723K388
14147E08652k6903M251p550P777l2007k5348Q3250M1236N7098K1589m0985m51
14135E90609L3478N9218L9664n0572k1833N0906M9016M1807J9724j3044j7031
14124G81942n3020r242J8607J9432J3269k5853K6067K2726K871n1051q3415N6662
14112G18995K7247P4941R6515q160l0132p4039j5239N0126N2607L8308N5246K2966
14100A009381p8468k3980N2854j5955k3192P842R327N4128O3127L1764L9286J3329
14088A139443j4623P5275n5358J7188K0562K4399j4025j49m626K5331P6714K6331
14076A316462k222k838j4841K7860K4639Q6645R6411J1738M7759L1701o885K2204
$$ y = [547600, 552975, 470500, 467279, 482436, 464696, 453039, 477209, 469094, 461819, 482541, 506264, 508652, 481749, 486000, 478450, 486227, 454220, 428872, 512122, 553358, 610456, 632045, 591060, 590609, 624087, 683305, 722969, 672397, 650564, 701470, 750486, 792293, 812017, 798973, 781942, 728922, 719680, 738287, 757719, 770988, 745135, 771202, 793928, 796799, 745748, 662333, 718995, 746242, 821183, 917698, 909538, 879406, 805367, 790128, 840254, 892861, 931169, 986415, 1009381, 930913, 906933, 959787, 943832, 920640, 928482, 937809, 991937, 1055064, 1086828, 1126114, 1139443, 1124820, 1200095, 1144737, 1161925, 1182487, 1206886, 1192861, 1192712, 1188086, 1213417, 1290131, 1316462, 1314240, 1311402, 1296561, 1324421, 1349060, 1435705, 1532116, 1543854, 1591613, 1623314, 1616429, 1638633]
14064A638633J02794k619k0197J072N5654P3785L0058N7025L2277k0164N1147
14053A999465N1005Q4118M7756N5481O4556J01926J2407M6538Q8312Q6784J29732
14042B768080J40347J59088J26157J98905K14275J44656J93109K93351L03455
14033D541423K72544L61706M25382N40058O83510Q22946J039362J265539J642038
14024A1594508K192896K782061L347990L850932M372269M563595M569716M231685
14016D1505652L450144K347990J159270K13669q4348M20728J519331L179047N086732
14007E8798215O775102P843513Q336303Q101829P091770N262927K919940P39585
13999A05869184j021400k064301k337391k085852j675447j062233j97405R34970
$$ y = [1638633, 1741427, 1738808, 1718611, 1719683, 1775337, 1849122, 1879180, 1936205, 1968482, 1948318, 1999465, 2050470, 2134588, 2182344, 2237825, 2302381, 2404307, 2416714, 2463252, 2551564, 2638348, 2768080, 2908427, 3067515, 3193672, 3392577, 3606852, 3751508, 3944617, 4237968, 4541423, 4813967, 5175673, 5601055, 6141113, 6824623, 7647569, 8686931, 9952470, 11594508, 13787404, 16569465, 19917455, 23768387, 28140656, 32704251, 37273967, 41505652, 44955796, 47303786, 48463056, 48676725, 48592377, 49013105, 50532436, 53711483, 58798215, 65573317, 73416830, 81753133, 89854962, 96946732, 102209659, 105129599, 105869184, 104847784, 102783483, 100446092, 98360240, 96684793, 95622560, 95425155, 96360125]
13991I6360125K172978L198798L867726M025945L516129K588475J507112L28706
13983A17565994j018638k357854l325302l877838l694159k723039r81887P40089
13975A00327366K108206K723453K377991J281356j48032j312967j820761j792101
13967A03744511r97254N30144K219551L835953N054653N399271M717050K942958
13959A27446837N68028j664023l255860m123231l964088l204757k497508j662656
13951A07642742o19406O50513J804864K732346L197737K941122K039952Q06536
13943A21196406n71739k016446l802103n584668p193093q219954q465737p653669
13935G7688997n976686m100644k227751o75519J83531L87341j35857j157159k457282
$$ y = [96360125, 98533103, 101731901, 105599627, 109625572, 113141701, 115730176, 117237288, 117565994, 116547356, 114189502, 110864200, 106986362, 103292203, 100569164, 99587277, 100327366, 102435572, 105159025, 107537016, 108818372, 108670340, 107357373, 105536612, 103744511, 102747257, 103277401, 105496952, 109332905, 114387558, 119786829, 124503879, 127446837, 128014865, 126350842, 123094982, 118971751, 115007663, 111802906, 109305398, 107642742, 107023336, 107673849, 109478713, 112211059, 115408796, 118349918, 120389870, 121196406, 120624667, 118608221, 114806118, 109221450, 102028357, 93808403, 85342666, 77688997, 71712311, 67611667, 65383916, 64708397, 64891928, 65279269, 65143412, 63986253, 61528971]
13926F1528971l981413n271690n749015n598645m936194l989503l152484k429199
13918B6420828j908498j605020j253163j105213j039222r31683q14319p44472
13910A7019238o66065n97721n22798n07685m93650m66023m91457n14332m11527
13901A2347980m13500m59349m21931l60940l03620l13960l64518k85702k86724
13892I137736k72998k62780k59310k75666k12579j79170k32227k18638j55708
13883G068660j99169k25901k36998j96457j81020j88874j35344j82992j34439
13874E387466r3230j26499j60332j39132q0141r8678j43194j37780j40325j21081
13864D147074j50491j25760j11929j35269r3827q6253o5818n8791j03499j07347
$$ y = [61528971, 57547558, 52275868, 46526853, 40928208, 35992014, 32002511, 28850027, 26420828, 24512330, 22907310, 21654147, 20548934, 19509712, 18578029, 17763710, 17019238, 16353173, 15755452, 15232654, 14724969, 14231319, 13765296, 13273839, 12759507, 12347980, 11934480, 11475131, 11053200, 10692260, 10388640, 10074680, 9710162, 9424460, 9137736, 8864738, 8601958, 8342648, 8066982, 7854403, 7675233, 7443006, 7224368, 7068660, 6869491, 6643590, 6406592, 6210135, 6029115, 5840241, 5704897, 5521905, 5387466, 5294236, 5167737, 5007405, 4868273, 4788132, 4689454, 4546260, 4408480, 4268155, 4147074, 3996583, 3870823, 3758894, 3623625, 3529798, 3443545, 3377727, 3318936, 3215437, 3108090]
13854C108090r4406q7610l8135p7792j42504n3141q1855n3459m3669J0378o1370
13843B384527q8855q9851p6971m2974p8697r2092r7849n3210l9562k23k3042r4858
13831A606343n8347L163n4179m9109K6664J5964o8248l5088l9414q1308o0289
13820A206152p127J7641l5163l9753j6295k4207J5300L107k8516o411k4692m7325
13808A012711k0629K3532M127k2755k9376K0506M0195J04313R1749j0309o3873
13797A150191k7952l3182p5352n5609k2081n7687m8108P134M2274M3565P876L6575
13785I67644Q736K1670N534L6310l7332o5501k6344m2820o4129o1599n1437P451
13773F98183K4172l8730l6568J8373P0430P3865N6039K4481Q646L3548j0664j7642
$$ y = [3108090, 3013684, 2926074, 2887939, 2810147, 2667643, 2614502, 2532647, 2479188, 2435519, 2445897, 2384527, 2295672, 2205821, 2128850, 2085876, 2007179, 1915087, 1817238, 1764028, 1724466, 1724243, 1701201, 1606343, 1547996, 1551159, 1496980, 1447871, 1474535, 1490499, 1422251, 1387163, 1347749, 1266441, 1206152, 1199025, 1216666, 1181503, 1141750, 1125455, 1101248, 1116548, 1119655, 1091139, 1084728, 1060036, 1012711, 992082, 1015614, 1019741, 996986, 967610, 988116, 1028311, 1132624, 1224373, 1214064, 1150191, 1122239, 1089057, 1013705, 958096, 936015, 878328, 830220, 837354, 879628, 923193, 931069, 967644, 976380, 998050, 1003584, 1039894, 1002562, 937061, 910717, 867897, 803768, 742169, 690732, 698183, 722355, 683625, 647057, 665430, 735860, 809725, 865764, 890245, 898891, 932439, 921775, 904133]
13761I04133N5348n154o5028m9117o1093r8510J6677N5840R3610l655k4894L8404
13749H56561M8284L2880K9885k0394k3923r348n2292q5844n7180n1056l9968K9529
13737F57134J9493j6223L4099O2077M3150M7321k9269M8183L0301N8945l9316
13726I15895j1110j9554m7086l2323n5595J7169n4116j6764n7680k7637O0606
13715F71805Q7773R1711M4516N260M342j3626n5202o0260j08009j15747n9327
13704D93236P542l3583P842M6642L5328O3024J3052M1751L3695O8286L2037L6491
13692H45343M8408M1463k9041p7451n8878p6015l6489J598m2391k5840N7665K4953
13680F73325J0856O0719j6567L3827P0926n2391k5876l9045n8901p7530r0774
$$ y = [904133, 959481, 954327, 889299, 840182, 779089, 680579, 697256, 753096, 846706, 843051, 818157, 856561, 904845, 937725, 967610, 947216, 923293, 913945, 861653, 775809, 718629, 667573, 627605, 657134, 676627, 660404, 694503, 756580, 799730, 847051, 817782, 865965, 896266, 955211, 915895, 904785, 885231, 838145, 805822, 750227, 767396, 713280, 696516, 638836, 611199, 671805, 759578, 851289, 895805, 901065, 905407, 891781, 836579, 776319, 668310, 552563, 493236, 500778, 467195, 475037, 521679, 557007, 620031, 633083, 674834, 708529, 776815, 808852, 845343, 893751, 935214, 906173, 828722, 769844, 693829, 657340, 658938, 616547, 590707, 648372, 673325, 684181, 744900, 728333, 762160, 833086, 780695, 754819, 715774, 656873, 579343, 488569]
13669D88569q5011k0552M2628L3341K5744p7538o1754K2865j3459k0451m8016
13658B86366R051j3396l5168L44j3788l6653n033j4764K1391K9604M947O570P3342
13645C12813K982l1308K3270m779o9222k0070L081j088l1428j1410P3595O1549
13633C07985J4710j04486o5285J2034R320K5357Q216n9227l7284j7779J5645N0199
13621A59405J5355K9551L0572K5336k5602r957p145k5137j6692K5539M6241J874
13609B49340K3230J1336p789j1129P093j3327o0683R189K9188K4019k1186k7462
13597B11819M2350O1224K9170N8399J8810l8334J0789p2845k2683l251j7143K9126
13585C07431r685q143N3654L5110k5491k0644O6000l2197l0880K1133O4692o5216
$$ y = [488569, 403558, 383006, 425634, 458975, 484719, 407181, 345427, 368292, 354833, 334382, 286366, 295417, 282021, 246853, 247197, 233409, 196756, 191723, 176959, 198350, 227954, 232901, 239471, 312813, 315795, 284487, 307757, 302978, 233756, 213686, 216767, 215679, 184251, 172841, 246436, 307985, 322695, 218209, 152924, 164958, 174278, 199635, 207851, 148624, 111340, 93561, 109206, 159405, 174760, 204311, 234883, 260219, 234617, 224660, 217515, 192378, 175686, 201225, 247466, 249340, 272570, 283906, 276117, 264988, 272081, 258754, 198071, 207260, 236448, 260467, 239281, 211819, 254169, 315393, 344563, 402962, 421772, 383438, 394227, 321382, 298699, 295448, 278305, 307431, 297746, 289603, 343257, 378367, 352876, 332232, 398232, 366035, 335155, 356288, 420980, 355764]
13573C55764n4298M5896O084o3817l852P2059N5547P3575N7141J1321J1301k1189
13561E45532m753n4544Q4624N585L6844M1173K9114j629k2629L5212Q7112M0555
13549H22196j8954l5875N6307J26785Q2268k8977k2131n6725m0523m5427L086
13538H42030n5009o3177N1811Q4731M8115J9770L6135L7248m886j4106m9372L4629
13526I67919L0577n151M8396m5444K136K4773J3145j8521K8219J8204R072l8517
13514A034808M408q178n3516j340J5874K4507Q5208K0195M2232P618L7184J161
13502A210161Q052M203m1831r486j6501k7451p8124l419l052q891M0282Q4016
13490A157959j0745K6105O610j3837j836L2911m3727k0148p1977o8623k8339l6825
$$ y = [355764, 301466, 347362, 353446, 289629, 285777, 357836, 413383, 486958, 544099, 555420, 566721, 545532, 540779, 486235, 570859, 576444, 613288, 654461, 683575, 681946, 659317, 694529, 781641, 822196, 803242, 767367, 823674, 950459, 1032727, 1003750, 981619, 924894, 884371, 838944, 842030, 787021, 723844, 775655, 860386, 908501, 928271, 964406, 1001654, 996768, 982662, 933290, 967919, 998496, 993345, 1041741, 996297, 998433, 1023206, 1036351, 1017830, 1046049, 1064253, 1073325, 1034808, 1039216, 1031038, 977522, 976182, 992056, 1016563, 1101771, 1121966, 1164198, 1171816, 1209000, 1210161, 1218213, 1222416, 1180585, 1171099, 1154598, 1127147, 1049023, 1045604, 1042552, 1033661, 1073943, 1157959, 1147214, 1173319, 1179929, 1166092, 1164256, 1197167, 1153440, 1133292, 1061315, 992692, 964353, 927528]
13478I27528Q398l3600m7923q928J3116j7978j1003M2057J1451m9611q3465l936
13466G46106j4425j6488o284J925Q436J3079l6554Q121k4020m2616J5767p809
13454F45238j420l2964j6072k495M6920O348J7404q852j4617R421K1759O594P1530
13441G48794N3303o8118l6817N2337L5975k8081r2235N8766J68m8320L1149M2941
13429G49862n5553p7002Q0465M7685j2027K9366L8995J3093M3168J0336m641N2739
13417I16486J574K4437k3635K3351N0337M8971J6281k5405j3096R297L0117k3975
13405A034740J0942L3470J8285J8813K0504K9465K6124K201O6745J3693m3202
13394A231780n1993P3709L7164M432k6014L499N9751O6412Q0287R027n3073P725
$$ y = [927528, 935926, 902326, 854403, 845475, 858591, 840613, 829610, 871667, 883118, 833507, 750042, 746106, 731681, 715193, 708909, 710834, 719270, 732349, 695795, 703916, 679896, 637280, 653047, 645238, 643818, 610854, 594782, 592287, 639207, 645555, 662959, 654107, 639490, 648911, 670670, 677264, 748794, 802097, 733979, 697162, 749499, 785474, 757393, 665158, 723924, 724092, 675772, 706921, 749862, 694309, 617307, 697772, 745457, 733430, 762796, 801791, 814884, 858052, 868388, 863747, 916486, 918060, 942497, 918862, 942213, 992550, 1041521, 1057802, 1032397, 1019301, 1028598, 1058715, 1034740, 1045682, 1079152, 1097437, 1116250, 1136754, 1166219, 1192343, 1194544, 1261289, 1274982, 1231780, 1179787, 1253496, 1290660, 1295092, 1269078, 1272577, 1332328, 1398740, 1479027, 1488054, 1434981, 1442706]
13382A442706N7695P2721N3416O3954N1798N6265O1246Q8936J22943J45211Q1287
13371B298178L9741P4648J56777J36337J48377J67116R7964J62999K36936K94016
13361C813089K93132K19130J77367J99449K07525K33747K71775L28481M77577
13352F221272N79499P50397Q84645J163341J552067K113401K943039M197918N779713
13343B6185292P195842P806616Q085122Q217799Q042012O685418L813747l63178
13335G5668670m168462p230196r482781q840814n764897k309554P41683L663147
13327D2276796N947778O874620P231946P803685P646505O020444K742805k062816
13319H4481763o033877r265423j1760683j0606136p115980m133852k000735m03384
$$ y = [1442706, 1500401, 1573122, 1626538, 1690492, 1742290, 1798555, 1859801, 1948737, 2071680, 2216891, 2298178, 2337919, 2412567, 2569344, 2705681, 2854058, 3021174, 3119138, 3282137, 3519073, 3813089, 4106221, 4325351, 4502718, 4702167, 4909692, 5143439, 5415214, 5743695, 6221272, 6800771, 7551168, 8435813, 9599154, 11151221, 13264622, 16207661, 20405579, 26185292, 33381134, 41187750, 49272872, 57490671, 65532683, 72218101, 76031848, 75668670, 71500208, 64270012, 54787231, 45946417, 40181520, 37871966, 38613649, 42276796, 48224574, 55099194, 62331140, 70134825, 77781330, 83801774, 86544579, 84481763, 78447886, 69182463, 57421780, 46815644, 39699664, 35565812, 33565077, 33161693]
13311C3161693J251340L230873N312601P010390P688120P926217Q399949Q068560
13303H2049743O323888K865083j945711n826538r056176j1141537r575695n640481
13295D8052576j959364J141695M016082O000184O794021P107146P510427P122572
13287H5785339N128847J364038l402299p160395j0248989j1893563j0155137o852024
13279D2565817m161621k249335p54449O53860K109665M019602O337854Q264900
13271E6786293R026247R270145R699049R418392P552373L624324j789416o351482
13263I7235925j0015872j2442731j1041492o878964k631200J220242M849835P425869
13255F7721612Q294167Q745454R492459R141515O801183K000373m272758q799101
$$ y = [33161693, 34413033, 37643906, 42956507, 49966897, 57655017, 65581234, 73981183, 82049743, 88373631, 91238714, 89293003, 83466465, 74410289, 63268752, 53693057, 48052576, 46093212, 47234907, 51250989, 57251173, 64045194, 71152340, 78662767, 85785339, 90914186, 92278224, 88875925, 81715530, 71466541, 59572978, 49417841, 42565817, 38404196, 36154861, 35400412, 36054272, 38163937, 42183539, 48521393, 56786293, 65812540, 75082685, 84781734, 94200126, 101752499, 105376823, 103587407, 97235925, 87220053, 74777322, 63735830, 56856866, 54225666, 55445908, 60295743, 67721612, 76015779, 84761233, 94253692, 103395207, 110196390, 112196763, 107924005, 99124904]
13247I9124904j2667010j4936460j2502004q195097m685869k242706k77695J612807
13239D5230870L940766O389819Q320743Q991253R281447R817865R435837P201382
13231A08609982K798526k930897p473731j1043132j3075001j1049828o690525
13224E9145394k352050J448641M669604O804908P646888Q109168Q445411P629831
13216A01547795M970238J22682n500288r717198j3094098j4532617j2381233q926410
13208D2488871o193754m395109l291910k595017k072136j664035j411862j181255
13200A9683793r23713q04284o82406n99274n60287n12670n02631m57956m62152
13191A4178420n32343m86560n30825n35883n02084m99200m46150l25268k93735
$$ y = [99124904, 86457894, 71521434, 59019430, 50824333, 46138464, 43895758, 43618063, 45230870, 49171636, 55561455, 63882198, 72873451, 82154898, 91972763, 101408600, 108609982, 111408508, 108477611, 101003880, 89960748, 76885747, 65835919, 59145394, 56793344, 58241985, 62911589, 69716497, 77363385, 85472553, 93917964, 101547795, 106518033, 106640715, 101140427, 91423229, 78329131, 63796514, 51415281, 42488871, 36295117, 31900008, 28608098, 26013081, 23940945, 22276910, 20865048, 19683793, 18760080, 17955796, 17273390, 16674116, 16113829, 15601159, 15098528, 14640572, 14178420, 13646077, 13159517, 12628692, 12092809, 11590725, 11091525, 10645375, 10320107, 10026372]
13182A0026372m09223l28984k63856l01055l44208k59499k31965k02395k96679
13173G388508k89615k89185k29191k06458k02615j50960r7865j65163k13819j90833
13163E352804j47496j65933j31577j03795j10829j73148j20610j12847j15300
13154D171269j25195j61122j41557r3757o7486m5321l557j23884j45726j58431
13144C105233r6559o0870j2242n2217o3741j07976r4630m7753m4992j08562n1340
13133B364351k6052o0713j13102j17659q2573K0732k6065o3581o9769k8943m3748
13122A752878j1227j1968o1135m7012p2683n4142p2923j392J8529K3468j1295
13111A451098q8877j2373N0497M9032K7834P1949L199k8684M6619J5880m2524
$$ y = [10026372, 9617149, 9288165, 9024309, 8723254, 8379046, 8119547, 7887582, 7685187, 7388508, 7098893, 6809708, 6580517, 6374059, 6171444, 6020484, 5922619, 5757456, 5543637, 5352804, 5205308, 5039375, 4907798, 4804003, 4693174, 4520026, 4399416, 4286569, 4171269, 4046074, 3884952, 3743395, 3649638, 3582152, 3536831, 3533274, 3409390, 3263664, 3105233, 3008674, 2947804, 2935562, 2883345, 2819604, 2711628, 2616998, 2569245, 2524253, 2415691, 2364351, 2338299, 2277586, 2164484, 2046825, 1964252, 1984984, 1958919, 1895338, 1825569, 1796626, 1752878, 1741651, 1729683, 1668548, 1621536, 1548853, 1494711, 1421788, 1420396, 1438925, 1462393, 1451098, 1362221, 1349848, 1400345, 1449377, 1477211, 1549160, 1552359, 1523675, 1570294, 1586174, 1543650]
13100A543650j00695l7258n7793p5656n8311n5728p1756n5853k7129n5958J3979
13089I61492L6115N964m63L7844M4303k1989M4253N4320K0662j466J1423J3640
13077A206098m7135j34510j50151m2389o3305j5745j9770n1572o5982m7805j1610
13066E56124k3275k5275L2048M542k5076K371J2015j3886l0330P001k8469L3648
13054E01438M7031l3535o2694l1535l611K2833P3093N8105R934O9111O9027P7788
13042G96985M3412R6811J34495J12465P107q1907r6101n5376j6735n8538k3424
13031H59194L6578K0405j8027q8379r7023p6619o2942j7954K1694J19382P8896
13020G75205P6778L2017R522L9953J30606O8737l162l5179o0732o1251n4672K7254
$$ y = [1543650, 1442955, 1405697, 1347904, 1272248, 1213937, 1158209, 1086453, 1030600, 1003471, 947513, 961492, 997607, 1003571, 1003108, 1040952, 1085255, 1063266, 1107519, 1161839, 1182501, 1181035, 1192458, 1206098, 1158963, 1024453, 874302, 831913, 768608, 752863, 733093, 681521, 615539, 567734, 556124, 532849, 507574, 539622, 544164, 519088, 521459, 533474, 519588, 489258, 496259, 467790, 501438, 548469, 514934, 452240, 420705, 417094, 439927, 513020, 571125, 581059, 650170, 719197, 796985, 840397, 937208, 1071703, 1184168, 1191275, 1109368, 1013267, 957891, 941156, 882618, 859194, 895772, 916177, 898150, 809771, 712748, 636129, 573187, 555233, 576927, 696309, 775205, 851983, 884000, 893522, 933475, 1064081, 1132818, 1129656, 1094477, 1033745, 972494, 917822, 945076]
13008I45076K0857n4027j27321j12324l9344j17183q4634n4793J4403k682O781
12997C94809j1625m051k5862j6294k2856j6583O0128K6714K9025n02J4157n99
12985D26461J1525m5622m7985l2358k5955J2534K9111J9767o2752P495Q1325N5557
12973D29103J02584L9024L6754M4772K8200m4952J1458k2164l8558o7359j03990
12962D14872o0277k4955j7680k2213Q726K975L2885L0157P544Q04j468K9681K2739
12949D23790N1744Q3081K9672P489J02119J36787j8117r4823r3575r4183o8202
12938D65782o8490r4578l9550J802O1793j6220k0348j7511l3950J0480M2422J3728
12926C05360M0997j5976n4165m8954j4970r80l321l2050p567j2657L0221j0851
$$ y = [945076, 965933, 911906, 784585, 672261, 632917, 515734, 431100, 376307, 390710, 388028, 394809, 383184, 379133, 353271, 336977, 314121, 297538, 357666, 384380, 413405, 412903, 427060, 426461, 437986, 392364, 344379, 312021, 286066, 298600, 327711, 347478, 284726, 292221, 373546, 429103, 531687, 570711, 607465, 652237, 680437, 635485, 646943, 624779, 586221, 518862, 414872, 354595, 329640, 311960, 289747, 298473, 301448, 334333, 364490, 372034, 372838, 371370, 401051, 423790, 475534, 558615, 588287, 595776, 697895, 834682, 816565, 721742, 628167, 533984, 465782, 397292, 302714, 263164, 264966, 326759, 310539, 290191, 272680, 238730, 249210, 291632, 305360, 346357, 330381, 276216, 227262, 212292, 211312, 207991, 175941, 168374, 155717, 185938, 175087]
12914A75087m8153Q180k2854Q7309N9135K8780k3005k2887m8241J976K3924Q1237
12902C00488K2066k3324p3816n518N7042M6306m0433n7846j2590K3242M3663J4256
12890B93536O596K8862K5115k4632K2339N7549M4261m4943j02750p03L2980L4710
12878C72920R851l5918k214M7004O2555Q5103O0813Q6565P5651K3266n0509j5261
12866G19826q887p3773l9127j4654j6615r7634p360Q8866P3408P0338j5003n257
12854F74128L5050O283J4371J8146J9820k7600p3639l4143q978j0674O26m1793
12842E71597K4353K0284P1222P7038O3859k703J7341K5219k5368k0232L366l4716
12830G91260p0329p2719m6223j8482Q282Q5360P0392O5965K9219k1543K8058P8921
$$ y = [175087, 126934, 135114, 112260, 199569, 258704, 287484, 264479, 241592, 193351, 195327, 219251, 300488, 322554, 299230, 225414, 219896, 276938, 323244, 282811, 224965, 212375, 235617, 279280, 293536, 300132, 328994, 354109, 329477, 351816, 409365, 453626, 408683, 305933, 305230, 338210, 372920, 382771, 346853, 344639, 391643, 454198, 539301, 600114, 686679, 762330, 785596, 735087, 719826, 710939, 637166, 598039, 583385, 566770, 469136, 461776, 550642, 624050, 694388, 679385, 674128, 709178, 715461, 729832, 747978, 767798, 740198, 666559, 632416, 623438, 612764, 613390, 571597, 595950, 616234, 687456, 764494, 828353, 825650, 842991, 868210, 842842, 822610, 825976, 791260, 720931, 648212, 601989, 583507, 591789, 677149, 747541, 813506, 842725, 821182, 849240, 928161]
12818I28161M5721m7545p762K5277m9691q0741o2101n0179l1386k1051j4102l1742
12806F02859k4798O1519P2635M8104J0821P9593Q3803N4446L9419n629n3843j00297
12794H68632p1368P779N2686L2931m6940j8525L3006M8749J1985R7564L0086j4671
12782A031914Q0679O7616L919n9076q8832j10794o4726l3632j6641K2712K0962
12771H54101K3169L7581Q9613J11854m263k3069p031O7960N4012j6139p0463p3536
12759A043789l1349P872P0948o705j6535O2939L4780K2505N0218Q8619M0404M7633
12747A415118k9873n3343n894m7583r9551n0714j04321n9764l685K8932n9080
12736I30242k5194J1876m347K0962J5761J3607L7446n8403n3488L2187K5817N1709
$$ y = [928161, 973882, 926337, 918575, 943852, 894161, 813420, 751319, 701140, 669754, 648703, 634601, 602859, 578061, 639580, 712215, 760319, 771140, 850733, 934536, 988982, 1028401, 1022772, 968929, 868632, 797264, 805043, 857729, 890660, 843720, 825195, 858201, 906950, 918935, 1016499, 1046585, 1031914, 1112593, 1180209, 1184128, 1125052, 1036220, 925426, 860700, 827068, 810427, 833139, 854101, 877270, 914851, 1004464, 1116318, 1112055, 1088986, 1081955, 1149915, 1203927, 1187788, 1117325, 1043789, 1012440, 1020312, 1091260, 1084555, 1068020, 1130959, 1165739, 1188244, 1238462, 1327081, 1367485, 1415118, 1385245, 1331902, 1326008, 1278425, 1178874, 1128160, 1023839, 964075, 960390, 989322, 930242, 905048, 916924, 912577, 933539, 949300, 962907, 1000353, 941950, 888462, 920649, 946466, 998175]
12724I98175K640m5012k7721O8452L9582N4010l22K2782M1133N5706J7237J1711
12712A238373L7743P3672M2846o3507m0154K2618l651o8911O0291O0412L9370
12701A399102L0567K6508K7992M1671Q4783P5410M9522L0768J11319J22762P5113
12690B075517P0809R0603J06940J39034J63086N5649R3099J05439J89594K22692
12680C312462J89341K08347K05022K81977L40471L37891L39228M10008N06872
12671F131619N82717P64111R74255J213692J537734K014893K715871L898509N743139
12662B5576540Q462396J1286748J1857952Q784118O813322Q759237J0186312N582676
12654I7309301o602098j8274633j7920486j2307330p840344n075172l301234k134024
$$ y = [998175, 1000815, 955803, 928082, 996534, 1036116, 1090126, 1089804, 1112586, 1153719, 1209425, 1226662, 1238373, 1276116, 1349788, 1392634, 1329127, 1288973, 1311591, 1307940, 1239029, 1299320, 1359732, 1399102, 1429669, 1456177, 1484169, 1525840, 1610623, 1686033, 1735555, 1766323, 1877642, 2000404, 2075517, 2146326, 2236929, 2343869, 2482903, 2645989, 2701638, 2794737, 2900176, 3089770, 3312462, 3501803, 3710150, 3915172, 4197149, 4537620, 4875511, 5214739, 5624747, 6131619, 6714336, 7478447, 8452702, 9666394, 11204128, 13219021, 15934892, 19833401, 25576540, 34038936, 45325684, 57183636, 65967754, 72781076, 81540313, 91726625, 97309301, 90707203, 72432570, 54512084, 42204754, 34364410, 29289238, 25988004, 23853980]
12646B3853980j282314p11420k07900M09429J081403J890831L127368N176608
12638C3337985Q391699J2138224J3378644R133124N905572Q907402J2012209P806071
12630A11010930o885817k3283058k2044402j4083401q700682n656834l775919
12623B6580817k629998j915230j559761j270723r49525p98573o12663l72056k63587
12614A6208701k43551j91279o754R6011K21153L82025M69855O17877Q33283J184196
12604A9571517J599587J984009K706353L842816N644610Q524743J2141826J4491218
12596G0506679J2626838R153488J0425905J4541855J4587528O298421p756568
12589A30384146j2867224r883422n184788Q07279M185195J038860r189195j7630084
$$ y = [23853980, 22571666, 21860246, 21652346, 22061775, 23143178, 25034009, 28161377, 33337985, 41729684, 53867908, 67246552, 76379676, 82285248, 91192650, 103204859, 111010930, 104125113, 80842055, 58797653, 44714252, 36013570, 30356736, 26580817, 23950819, 22035589, 20475828, 19205105, 18255580, 17457007, 16844344, 16472288, 16208701, 15965150, 15773871, 15767117, 15863128, 16084281, 16466306, 16936161, 17554038, 18387321, 19571517, 21171104, 23155113, 25861466, 29704282, 35348892, 43873635, 56015461, 70506679, 83133517, 92287005, 102712910, 117254765, 131842293, 138140714, 130384146, 117516922, 107633500, 102448712, 103255991, 107441186, 108480046, 99290851, 81660767]
12581H1660767j5058763r323374n031013k049333L93630L105886O524722J0425040
12573G0647562J3278989J1813782Q367206R312018J3463750J4043435O476740
12566A47403482p341552j3448087j1363941o578610O1987L988781N67847j1499078
12558A01790829k1280991j7923205j1723123p590265n241703l729384k817261
12551C1484897k220504j888123j559519j258391j013988r30003q14271p58287
12543B1041811o12714m77777l82335k46077j44906q9803l3953Q8966K86521N24583
12533A9954316Q92079J289913J831064K609593M037975O488235R660518J1535000
12525E8298693R082754N579655O842164R948360Q341528j573342j6589834j9790999
$$ y = [81660767, 66602004, 57278630, 52247617, 50198284, 50591914, 53697800, 60222522, 70647562, 83926551, 95740333, 104107539, 113419557, 126883307, 140926742, 147403482, 140061930, 126613843, 115249902, 108671292, 108733279, 112722060, 113289907, 101790829, 80509838, 62586633, 50863510, 43273245, 38031542, 34302158, 31484897, 29264393, 27376270, 25816751, 24558360, 23544372, 22614369, 21800098, 21041811, 20429097, 19951320, 19568985, 19322908, 19178002, 19088199, 19054246, 19143212, 19429733, 19954316, 20846395, 22136308, 23967372, 26576965, 30614940, 37103175, 46763693, 58298693, 67381447, 72961102, 79803266, 89751626, 98093154, 96519812, 79929978, 60138979]
12517F0138979j3718737q507687n374314l420624k264516j422367q21568l64692
12509B4244474J78756Q04818J480026K463169M087839O498942R292095J0779164
12501E9829283Q731982N750246O521410Q731695O656318k829618j5981088j9051984
12493E8358244j3893614r057437o014115m128177k954021k209733j820501j459098
12485A6821548j141183r51459q67960q08420p16878n86719n48621m49143l73064
12476A0378101l84059m27110m16263m00321k79608k31217k34458k40367k46513
12467G518185k57421k41253k10463j98263j79276k40659k07269j77638j80720
12458E625223j63080j92499j99013j59546j58139j14786j32440j14394o3927j31778
$$ y = [60138979, 46420242, 37912555, 32538241, 29117617, 26853101, 25430734, 24609166, 24244474, 24423230, 25228048, 26708074, 29171243, 33259082, 39758024, 49050119, 59829283, 68561265, 74311511, 80832921, 89564616, 96220934, 93391316, 77410228, 58358244, 44464630, 35407193, 29393078, 25264901, 22310880, 20101147, 18280646, 16821548, 15680365, 14728906, 13860946, 13052526, 12335648, 11748929, 11200308, 10751165, 10378101, 9994042, 9566932, 9150669, 8750348, 8470740, 8239523, 8005065, 7764698, 7518185, 7260764, 7019511, 6809048, 6610785, 6431509, 6190850, 5983581, 5805943, 5625223, 5462143, 5269644, 5070631, 4911085, 4752946, 4638160, 4505720, 4391326, 4327399, 4195621]
12448D195621j48704j71646q1484j37330j09165o9158r3761j30635r7547m5540
12438C110651j00582j53138l5252o0324o1784l1133l1009o5970r3730p5972k4872
12427B376885n4830r2822j08583j5240K8609j17119j17535p6441l3657m6344l7910
12416A705013m3279m8754n8140n717M8530l2269j07842j07165l7018n3534r9346
12405A160479n4602l8489N03K2593l6929j7287M0995k9183q178K18J5520m2388
12393A013252m9991o4224K7771k5P371m2139j5269p1663p1892L0233l523p342
12381G52559l36k0966r0877l1735K4048M1008n0474k9680j6160L9472Q5384J5147
12369G17390m3800k3215M354k078j2602O833l7950m2573k4235j7977j4053j0180
$$ y = [4195621, 4046917, 3875271, 3793787, 3656457, 3547292, 3478134, 3384373, 3253738, 3156191, 3110651, 3010069, 2856931, 2821679, 2761355, 2699571, 2668438, 2637429, 2571459, 2477729, 2401757, 2376885, 2322055, 2229233, 2120650, 2105410, 2134019, 2016900, 1899365, 1822924, 1789267, 1742923, 1705013, 1661734, 1612980, 1554840, 1549123, 1597653, 1565384, 1457542, 1350377, 1313359, 1259825, 1160479, 1105877, 1067388, 1067891, 1090484, 1053555, 1036268, 1077263, 1048080, 1039902, 1040120, 1055640, 1013252, 963261, 899037, 926808, 926783, 934154, 892015, 876746, 805083, 733191, 763424, 759901, 752559, 752223, 731257, 640380, 608645, 632693, 673701, 623227, 593547, 577387, 616859, 702243, 717390, 673590, 650375, 654729, 652651, 640049, 646882, 608932, 566359, 542124, 524147, 510094, 499914]
12357D99914K4943m845o0402k1786J5351l0684k0136J6903L158k437j0707j1688
12345C97584p6304o5163p4451K1895N3259M4413k2870l6918j6649q879J5649J8174
12333B49740J4934K7118O4322M3153n5559l4326l8048N966R992J7585M3740j4459
12321C34158k1874O04n1019J2439n970K5191j4857m9215N3570j3513o5287J1911
12309B16138L7619j6024k3791K8143l3775k0964K908J0156J9794n7618n3849j1880
12297I6857J4385J1611K055J09120q576n0857k6638O002l8885k0381J3630M1964
12285A50287J534L3057L2917L4728m7507o2399J9481O3894l1825l6942k6728J6834
12273A47331L4569K1972L0658j0236n1847j9819L6788l1692k4003M6184Q229K9561
$$ y = [499914, 524857, 520012, 459610, 437824, 453175, 422491, 402355, 419258, 422416, 419979, 409272, 397584, 321280, 256117, 181666, 203561, 256820, 301233, 278363, 241445, 224796, 215917, 231566, 249740, 264674, 291792, 356114, 399267, 343708, 309382, 271334, 277300, 287292, 304877, 348617, 334158, 312284, 312888, 261869, 274308, 268338, 293529, 278672, 229457, 283027, 269514, 204227, 216138, 253757, 237733, 213942, 242085, 208310, 187346, 190254, 200410, 220204, 162586, 108737, 96857, 111242, 122853, 124908, 234028, 225452, 174595, 147957, 153959, 115074, 94693, 108323, 150287, 151821, 184878, 217795, 252523, 205016, 142617, 162098, 225992, 194167, 157225, 130497, 147331, 181900, 203872, 234530, 224294, 172447, 152628, 189416, 157724, 133721, 179905, 188134, 217695]
12261B17695N390R531m0732k6955l5921J3766L0615K6513j8493m4595j0349l705
12249A22760K6733K2229K6399L1696k4058l5660m6201P433L165O9125L1353n807
12237B29167l3790p3121K8816K6358K7328J0122K1446L1184l3383j7751j0923
12226B05453m2565O094M1032K3571l1103r855L57k1031n855J6036J5608J5561
12214B13303k7857M2278L2957n8697r807P1811R5032N4898N5045P6248K8307K8387
12202F01905M2704p668j7279j04815q4722o3942l5062l550k6381j6892o0290L7109
12190B61117k01k8744l420N2915N1287M1619J4386O7729R1273j1978K8102M5225
12178F09310J00538L2189k2327o5582n8344n7284j20501o7111K5085K5134k5561
$$ y = [217695, 223085, 232616, 191884, 164929, 129008, 142774, 173389, 199902, 181409, 136814, 126465, 122760, 149493, 171722, 198121, 229817, 205759, 170099, 123898, 131331, 134496, 203621, 234974, 229167, 195377, 122256, 151072, 177430, 204758, 214880, 236326, 267510, 234127, 216376, 205453, 162888, 168982, 210014, 233585, 202482, 192627, 192984, 171953, 166098, 182134, 197742, 213303, 185446, 227724, 260681, 201984, 192177, 263988, 359020, 413918, 468963, 545211, 573518, 601905, 644609, 636941, 619662, 514847, 430125, 366183, 331121, 327571, 301190, 284298, 224008, 261117, 260916, 232172, 228752, 281667, 332954, 374573, 388959, 456688, 547961, 535983, 564085, 609310, 709848, 742037, 719710, 654128, 595784, 538500, 417999, 350888, 375973, 401107, 375546]
12167C75546j9437m6992j8633l4933L2132k3026Q287n1035L3626k7077l7689K5658
12155B16427L6459J6467p416K6785R1120K3279k3812n0947k7815N3345R4534L0860
12143D79286O2527J34516O9235O0422R4095M0231m1636l3290o565o9120r5988
12132F93713n633L6433l5408m9375p8101m4769j3948j4192K7663N6151J5139K5216
12120F12889J17213J08477O0596p529M7142Q0826J01156J5563m683p8506q538
12109A044606o8642o9614l623L434m2021j47888p3738o6450l7527n9502n6874
12098D22161M300k6928j4091k4532K3708l2795Q083M2472N2696K4476R949M964
12086D94463k138J5542m9458j6475k3828n2464p1702M17L1038L4185O1291P723
$$ y = [375546, 356109, 309117, 290484, 255551, 287683, 264657, 272944, 221909, 255535, 228458, 190769, 216427, 252886, 269353, 261937, 288722, 379842, 403121, 379309, 328362, 300547, 353892, 448426, 479286, 541813, 676329, 745564, 805986, 900081, 940312, 898676, 865386, 858821, 789701, 693713, 688080, 724513, 689105, 639730, 561629, 516860, 502912, 488720, 516383, 572534, 587673, 612889, 730102, 838579, 899175, 891646, 938788, 1019614, 1120770, 1136333, 1131650, 1053144, 1044606, 975964, 906350, 902727, 906161, 864140, 716252, 642514, 576064, 538537, 479035, 422161, 426461, 399533, 385442, 360910, 384618, 351823, 359906, 402378, 455074, 479550, 489499, 494463, 492325, 507867, 458409, 441934, 418106, 365642, 293940, 294357, 325395, 359580, 420871, 428594]
12074D28594K9623N7599R9607M6108M7221O2642J2559R268j456q1064m6359o6082
12062E98260j00744q0472j8865N8015j410n3486j0167n3162J3771Q0279N5011
12051D87030l57K5232N4492N1075Q4080M7689O0691R234J9745n1081p3791o2777
12039F51262l4276l1830n8426k5335l5475o7069o5074n3459j6058M980R343P0266
12027C48849l6500l5270k219J2449L6274K3165k0192r816r274l376n293o645q839
12014B83313l101J5532O27k2861M3544P491P288K745M6063P075L0823M4850M3083
12001E06472Q7513J39410M3814O0656M4370P9646J9842j34910j23881p0332k747
11990F49853R865q5194l1659K506k7815L4557K2273M1102L7821L4195Q4941R4744
$$ y = [428594, 458217, 515816, 615423, 661531, 708752, 771394, 783953, 793221, 791765, 710701, 664342, 598260, 497516, 417044, 398179, 456194, 454784, 401298, 391131, 337969, 351740, 432019, 487030, 486673, 511905, 566397, 617472, 701552, 749241, 809932, 819166, 838911, 787830, 714039, 651262, 616986, 585156, 526730, 501395, 465920, 398851, 333777, 280318, 264260, 269240, 278583, 348849, 312349, 277079, 274860, 287309, 323583, 346748, 326556, 316740, 307466, 304090, 298797, 292152, 283313, 280212, 295744, 296371, 273510, 317054, 324545, 331833, 334578, 380641, 387716, 418539, 463389, 506472, 593985, 733395, 777209, 837865, 882235, 961881, 981723, 846813, 722932, 652600, 649853, 659718, 574524, 542865, 545371, 517556, 552113, 574386, 615488, 653309, 687504, 772445, 867189]
11978H67189N3431L9005k3811r1603o5175n7286q0306q4951q5131p4673k0812
11967C75877M570K1824K9089M0610M8705m7813l8016m038M206K0551O0186L680
$$ y = [867189, 920620, 959625, 935814, 844211, 779036, 721750, 641444, 556493, 471362, 396689, 375877, 380447, 402271, 431360, 471970, 520675, 472862, 434846, 430808, 435014, 455565, 515751, 519431]
$$ [...]
##END NTUPLES=NMR SPECTRUM
##END=
