##TITLE=Analysis number 319694
Compound Code mo 07288
Project Code adrs
Chemist Name synnovation
##JCAMPDX= 6.0         $$ Bruker NMR JCAMP-DX V2.0
##DATA TYPE= NMR SPECTRUM
##DATA CLASS= NTUPLES
##ORIGIN= Bruker BioSpin GmbH
##OWNER= nmr
$$ XWIN-NMR		Version 3.5
$$ Wed May 24 13:23:27 2006 GMT Daylight Time (UT+1h)  MAYBRIDGE\nmr@NMR_250MHZ
##.OBSERVE FREQUENCY= 250.131544655141
##.OBSERVE NUCLEUS= ^1H
##.ACQUISITION MODE= SIMULTANEOUS (DQD)
##.ACQUISITION SCHEME= undefined
##.AVERAGES= 16
##.DIGITISER RES= 18
##SPECTROMETER/DATA SYSTEM= dpx250
##.PULSE SEQUENCE= zg30
##.SOLVENT NAME= DMSO
##.SHIFT REFERENCE= (INTERNAL, DMSO, 0, 16.522)
##AUDIT TRAIL= $$ (NUMBER, WHEN, WHO, WHERE, WHAT)
$$ ##TITLE= Audit trail, XWIN-NMR		Version 3.5
$$ ##JCAMPDX= 5.01
$$ ##ORIGIN= Bruker BioSpin GmbH
$$ ##OWNER= nmr
$$ C:\u/data/dgb/nmr/ADRS/5100/pdata/1/auditp.txt
$$ ##AUDIT TRAIL=  $$ (NUMBER, WHEN, WHO, WHERE, WHAT)
(   1,<2006-05-24 13:23:00.26 +100>,<MAYBRIDGE\nmr>,<NMR_250MHZ>,
      <created by zg, POWCHK disabled, PULCHK disabled
       configuration hash MD5:
       84 BC 41 DB A1 6E 1D 46 DA 25 12 A5 C1 ED C5 3A
       data hash MD5: 64K
       98 0E 5D 19 8B D1 DF 2A 07 E4 66 67 8B BC 5E 6D>)
(   2,<2006-05-24 13:23:11.05 +100>,<MAYBRIDGE\nmr>,<NMR_250MHZ>,
      <Start of raw data processing
       ef LB = 0.3 FT_mod = 6 PKNL = 1 SI = 32K 
       data hash MD5: 32K
       31 47 7D 69 7D 63 15 BB A2 3F A9 08 F9 49 9F 23>)
(   3,<2006-05-24 13:23:12.71 +100>,<MAYBRIDGE\nmr>,<NMR_250MHZ>,
      <apk 
       data hash MD5: 32K
       35 A5 4A 28 4F 73 DD 52 E1 AF FE 00 5B FF 69 CC>)
(   4,<2006-05-24 13:23:13.52 +100>,<MAYBRIDGE\nmr>,<NMR_250MHZ>,
      <abs ABSG = 5 
       data hash MD5: 32K
       E1 23 C4 0F 96 F2 A4 06 05 DF 00 DD E1 CF DC A1>)
$$ ##END=
$$ 
$$ hash MD5
$$ 83 D0 3F 84 28 B4 44 6C 9C 87 03 A3 06 48 35 CE
##$RELAX= 
##$RELAX= 
##$RELAX= 
##$RELAX= 
##$RELAX= 
##$RELAX= 
##$RELAX= 
$$ Bruker specific parameters
$$ --------------------------
##$DU= <C:\u>
##$EXPNO= 5100
##$NAME= <ADRS>
##$PROCNO= 1
##$TYPE= <nmr>
##$USER= <dgb>
##$AMP= (0..31)
100 100 100 100 100 100 100 100 100 100 100 100 100 100 100 100 100 100 
100 100 100 100 100 100 100 100 100 100 100 100 100 100 
##$AQSEQ= 0
##$AQ_mod= 3
##$AUNM= <au_zg>
##$AUTOPOS= <32 >
##$BF1= 250.13
##$BF2= 250.13
##$BF3= 250.13
##$BF4= 250.13
##$BF5= 500.13
##$BF6= 500.13
##$BF7= 500.13
##$BF8= 500.13
##$BYTORDA= 1
##$CFDGTYP= 0
##$CFRGTYP= 5
##$CHEMSTR= <none>
##$CNST= (0..31)
1 1 145 1 1 1 1 1 1 1 1 1 1 1 1 1 1 1 1 1 1 1 1 1 1 1 1 1 1 1 1 1 
##$CPDPRG= <>
##$CPDPRG1= <>
##$CPDPRG2= <>
##$CPDPRG3= <>
##$CPDPRG4= <mlev>
##$CPDPRG5= <mlev>
##$CPDPRG6= <mlev>
##$CPDPRG7= <mlev>
##$CPDPRG8= <mlev>
##$CPDPRGB= <>
##$CPDPRGT= <>
##$D= (0..31)
0 1 0 0 0 0 0 0 0 0.06 0 0 0 0 0 0 0.0002 0 0 0 0 0 0 0 0 0 0 0 0 0 0 
0 
##$DATE= 1148473378
##$DBL= (0..7)
120 120 120 120 120 120 120 120 
##$DBP= (0..7)
150 150 150 150 150 150 150 150 
##$DBP07= 0
##$DBPNAM0= <>
##$DBPNAM1= <>
##$DBPNAM2= <>
$$ [...]
##$SUBNAM6= <"">
##$SUBNAM7= <"">
##$SUBNAM8= <"">
##$SUBNAM9= <"">
##$SW= 20.6930455092707
##$SWIBOX= (0..15)
0 0 3 0 0 0 0 0 0 0 0 0 0 0 0 0 
##$SW_h= 5175.983436853
##$TD= 65536
##$TD0= 1
##$TE= 294.16
##$TE2= 300
##$TE3= 300
##$TEG= 300
##$TL= (0..7)
0 120 120 120 120 120 120 120 
##$TP= (0..7)
150 150 150 150 150 150 150 150 
##$TP07= 0
##$TPNAME0= <>
##$TPNAME1= <>
##$TPNAME2= <>
##$TPNAME3= <>
##$TPNAME4= <>
##$TPNAME5= <>
##$TPNAME6= <>
##$TPNAME7= <>
##$TPOAL= (0..7)
0.5 0.5 0.5 0.5 0.5 0.5 0.5 0.5 
##$TPOFFS= (0..7)
0 0 0 0 0 0 0 0 
##$TUNHIN= 0
##$TUNHOUT= 0
##$TUNXOUT= 0
##$USERA1= <user>
##$USERA2= <user>
##$USERA3= <user>
##$USERA4= <user>
##$USERA5= <user>
##$V9= 5
##$VALIST= <valist>
##$VCLIST= <CCCCCCCCCCCCCCC>
##$VD= 0
##$VDLIST= <DDDDDDDDDDDDDDD>
##$VPLIST= <PPPPPPPPPPPPPPP>
##$VTLIST= <TTTTTTTTTTTTTTT>
##$WBST= 1024
##$WBSW= 4
##$XGAIN= (0..3)
0 0 0 0 
##$XL= 0
##$YL= 0
##$YMAX_a= 365171
##$YMIN_a= -474674
##$ZGOPTNS= <>
##$ZL1= 120
##$ZL2= 120
##$ZL3= 120
##$ZL4= 120
##$ABSF1= 16.522
##$ABSF2= -4.171173
##$ABSG= 5
##$ABSL= 3
##$ALPHA= 0
##$AQORDER= 0
##$ASSFAC= 0
##$ASSFACI= 0
##$ASSFACX= 0
##$ASSWID= 0
##$AUNMP= <proc_1d>
##$AZFE= 0.1
##$AZFW= 0.1
##$BCFW= 0
##$BC_mod= 0
##$BYTORDP= 0
##$COROFFS= 0
##$CY= 12.5
##$DATMOD= 1
##$DC= 0
##$DFILT= <>
##$DTYPP= 0
##$F1P= 14.0000005364418
##$F2P= -0.99999901652339
##$FCOR= 0.5
##$FTSIZE= 32768
##$FT_mod= 6
##$GAMMA= 0
##$GB= 0
##$INTBC= 1
##$INTSCL= 1
##$ISEN= 128
##$LB= 0.3
##$LEV0= 0
##$LPBIN= 0
##$MAXI= 10000
##$MC2= 0
##$MEAN= 0
##$ME_mod= 0
##$MI= 0
##$NCOEF= 0
##$NC_proc= -5
##$NLEV= 6
##$NOISF1= 0
##$NOISF2= 0
##$NSP= 0
##$NTH_PI= 0
##$NZP= 0
##$OFFSET= 16.522
##$PC= 1
##$PHC0= 165.4175
##$PHC1= 4.03145
##$PH_mod= 1
##$PKNL= yes
##$PPARMOD= 0
##$PSCAL= 4
##$PSIGN= 0
##$REVERSE= no
##$SF= 250.13
##$SI= 32768
##$SIGF1= 0
##$SIGF2= 0
##$SINO= 400
##$SIOLD= 32768
##$SREGLST= <1H.DMSO>
##$SSB= 0
##$STSI= 32768
##$STSR= 0
##$SW_p= 5175.98343685301
##$SYMM= 0
##$S_DEV= 0
##$TDeff= 65536
##$TDoff= 0
##$TI= <Analysis number 999999
Compound Code 99
Book Reference 9
Project Code 9>
##$TILT= no
##$TM1= 0
##$TM2= 0
##$TOPLEV= 0
##$USERP1= <user>
##$USERP2= <user>
##$USERP3= <user>
##$USERP4= <user>
##$USERP5= <user>
##$WDW= 1
##$XDIM= 32768
##$YMAX_p= 415767624
##$YMIN_p= -727905
$$ End of Bruker specific parameters
$$ ---------------------------------
##NTUPLES= NMR SPECTRUM
##VAR_NAME=  FREQUENCY,     SPECTRUM/REAL,   SPECTRUM/IMAG
##SYMBOL=    X,             R,               I
##VAR_TYPE=  INDEPENDENT,   DEPENDENT,       DEPENDENT
##VAR_FORM=  AFFN,          ASDF,            ASDF
##VAR_DIM=   32768,         32768,           32768
##UNITS=     HZ,            ARBITRARY UNITS, ARBITRARY UNITS
##FACTOR=    0.157963299565203, 1,           1
##FIRST=     4132.6476996994, 0,             0
##LAST=      -1043.33573715361, 0,           0
##MIN=       -1043.33573715361, -727905,     0
##MAX=       4132.6476996994, 415767624,     0
$$ Real data points
##PAGE= N=1
##DATA TABLE= (X++(R..R)), XYDATA
$$ [...]
$$ plain form
14822 -330408 -166391 -318327 -443136 -411815 -212026 -425782 -453711 -457502 -534964 -372748
14812 -372748 -356157 -488661 -326110 -115084 70182 178166 -25062 -18019 133953 111416
14802 111416 -8899 -165487 -247798 -159728 -259789 -186652 -48455 -208448 3150 126684
14792 126684 -180009 -360772 -446271 -309076 -158287 -201074 -274079 -197568 -6257 -55276
14782 -55276 -123607 -157232 -119343 -230635 -289526 -323296 -243416 11273 -55835 -179131 -337710
14771 -337710 -451961 -151427 -43687 269867 296692 36883 39266 21333 -45470 16219 -71001
14760 -71001 -136399 -173404 -186649 -200954 -75513 -56696 -365639 -83245 -218795 -348746 -283840
14749 -283840 -141221 95509 3935 -112684 14409 184738 181419 180923 104165 103704 101215 891
$$ packed form
14822c30408J64017j51936j24809L1321J99789k13756k7929l791p7462J62216
14812c72748J6591j32504J62551K11026J85266J07984k03228P043J51972k2537
14802A11416j20315j56588q2311Q8070j00061P3137J38197j59993K11598J23534
14792A26684l06693j80763q5499J37195J50789m2787p3005P6511J91311m9019
14782e5276o8331l3625L7889j11292n8891l3770P9880K54689o7108j23296j58579
14771c37710j14251L00534J07740L13554K6825k59809K383j7933o6803O1689q7220
14760g1001o5398l7005j3245j4305J25441J8817l08943K82394j35550j29951O4906
14749b83840J42619K36730r1574j16619J27093J70329l319m96p6758m61k489j00324
$$ plain form
14737 891 56601 337465 314943 292353 89206 50319 10849 697 234020 277728 152855
14726 152855 13759 140260 213240 153108 195186 202579 250151 243125 130547 191945 229909
14715 229909 -131104 -226508 -89723 46259 204840 82903 34855 239160 87748 8434
14705 8434 112100 108519 49486 147873 105791 197082 260690 92639 -56259 -83556 -75457 -33666
14693 -33666 -141332 -2137 49723 -51368 -106679 -164683 -173981 -180082 67757 287767 495812
14682 495812 246547 -134912 -207481 -189378 -369683 -155613 -198991 -62905 -4680 -71845
14672 -71845 50779 169757 167775 66749 13243 87874 -2708 -91781 -202333 -111623 -163114
14661 -163114 -136886 288617 503533 292833 -41527 -252571 -121098 -29308 -57212 -170886
$$ packed form
14737H91N5710K80864k2522k2590k03147l8887l9470j0152K33323M3708j24873
14726A52855j39096J26501P2980o0132M2078P393M7572p026j12578O1398L7964
14715B29909l61013r5404J36785J35982J58581j21937m8048K04305j51412p9314
14705H434J03666l581n9033R8387m2082R1291O3608j68051j48898k7297Q099M1791
14693c3666j07666J39195N1860j01091n5311n8004r298o101K47839K20010K08045
14682D95812k49265l81459p2569J8103j80305K14070m3378J36086N8225o7165
14672g1845J22624J18978j982j01026n3506P4631r0582q9073j10552R0710n1491
14661a63114K6228M25503K14916k10700l34360k11044J31473R1790k7904j13674
$$ plain form
14651 -170886 -236190 -230672 -237164 -110242 40574 118898 242252 280915 192940 231784 279239
14640 279239 153690 149726 71377 -43665 -14434 -4597 -12890 -1239 -21736 -248290 -271770
14629 -271770 -244862 -188936 -3042 164043 217800 153723 -32571 -147287 -253465 -18481
14619 -18481 129549 248943 76226 -84338 -38748 117726 770 -106558 58918 -57907
14609 -57907 -165914 -14695 104129 168599 80019 131690 172467 217444 90471 35543 -131909
14598 -131909 -66941 70228 210087 156249 88386 -126836 -312189 -334660 -325024 -236610 -237754
14587 -237754 -101316 303533 419062 395887 433878 475163 249432 9417 -183539 -249134
14577 -249134 -268693 -285333 -195637 -134577 -297631 -288926 29147 -54513 57482 242611 259584
$$ packed form
14651a70886o5304N518o492J26922J50816P8324J23354L8663q7975L8844M7455
14640B79239j25549l964p8349j15042K9231R837q293J1651k0497k26554k3480
14629b71770K6908N5926J85894J67085N3757o4077j86294j14716j06178K34984
14619a8481J48030J19394j72717j60564M5590J56474j16956j07328J65476j16825
14609e7907j08007J51219J18824O4470q8580N1671M0777M4977j26973n4928j67452
14598a31909O4968J37169J39859n3838o7863k15222j85353k2471R636Q8414j144
14587b37754J36438M04849J15529k3175L7991M1285k25731k40015j92956o5595
14577b49134j9559j6640Q9696O1060j63054Q705L18073q3660J11995J85129J6973
$$ plain form
14566 259584 183676 108287 61744 56716 -9882 -96063 -22813 67737 214862 211266 192955 91400
14554 91400 116857 231032 36076 74770 265501 388479 432942 295847 113948 34536
14544 34536 -9173 -155588 59732 179953 274813 449209 368177 80676 82658 40526 -236815
14533 -236815 -225299 -71634 -235441 -225534 -106847 -86496 -62387 26190 92989 63501 156565
14522 156565 241115 102639 7510 -17181 -125717 -63409 219951 201170 219508 232519 119794
14511 119794 -46143 -65456 49573 247734 110928 10392 -10392 71394 33717 -238941
14501 -238941 -294565 -49218 16760 -26371 -217942 -228190 -278438 -295606 -238421 -144058 78212
14490 78212 260015 140396 -145406 -303235 -360860 -473512 -536492 -444858 -215717 7809
$$ packed form
14566B59584p5908p5389m6543n028o6598q6181P3250R0550J47125l596j8311j01555
14554I1400K5457J14175j94956L8694J90731J22978M4463j37095j81899p9412
14544C4536m3709j46415K15320J20221R4860J74396q1032k87501J982m2132k77341
14533b36815J1516J53665j63807R907J18687K0351K4109Q8577O6799k9488R3064
14522A56565Q4550j38476r5129k4691j08536O2308K83360j8781J8338J3011j12725
14511A19794j65937j9313J15029J98161j36806j00536k0784Q1786l7677k72658
14501b38941n5624K45347O5978m3131j91571j0248n0248j7168N7185R4363K22270
14490G8212J81803j19619k85802j57829n7625j12652o2980R1634K29141K23526
$$ plain form
14480 7809 -74146 -180402 -152096 -53579 13526 229325 303365 374131 316466 377702 279238
14469 279238 64901 104984 92306 5252 -26506 14469 -3560 -52712 -249192 -171076 -63623
14458 -63623 34875 128168 331286 404698 409902 291934 296723 298786 374799 360659 251946 111235
14446 111235 -228344 -399597 -176968 -127546 -72556 -70912 -136490 -25966 69285 104483 130943
14435 130943 96484 6108 4358 27125 20638 -37491 -122408 -18046 -139316 -290925 -225137
14424 -225137 -121019 -221153 -297231 -334967 -394589 -262065 -101734 -5187 38719 -96921
14414 -96921 -99598 -110901 -39243 -70490 -281749 -137558 -66325 319352 334956 168432 -39523
14403 -39523 -120614 -30416 75201 59667 -31025 -183435 -271462 -180634 -181767 34875 -55123
$$ packed form
14480G809q1955j06256K8306R8517O7105K15799P4040P0766n7665O1236r8464
14469B79238k14337M0083j2678q7054l1758M0975j8029m9152j96480P8116J07453
14458f3623R8498R3293K03118P3412N204j17968M789K063P6013j4140j08713j40711
14446A11235l39579j71253K22629M9422N4990J644o5578J10524R5251L5198K6460
14435A30943l4459r0376j750K2767o487n8129q4917J04362j21270j51609O5788
14424b25137J04118j00134p6078l7736n9622J32524J60331R6547M3906j35640
14414i6921k677j1303P1658l1247k11259J44191P1233L85677J5604j66524k07955
14403c9523q1091R0198J05617j5534r0692j52410q8027R0828j133K16642q9998
$$ plain form
14392 -55123 -36072 17943 -92772 30486 148713 355627 314346 178066 116588 59566 126718
14381 126718 233899 157954 -105850 -239841 -244192 -208699 -93278 -26213 -280415 -352906 -160966
14370 -160966 -125820 85415 113432 1486 -115093 -62453 -64213 -139721 -185579 53688 268313
14359 268313 -29388 -198344 -174025 -158431 -133122 61504 123441 -142437 -134459 -124929 -208529
14348 -208529 -328830 -226419 114354 264977 196247 124315 49105 15537 -102719 45723
14338 45723 122170 -75343 23974 130702 97216 219030 425086 317119 238070 182797 7681
14327 7681 -188738 33610 139720 316721 286409 201462 69388 5654 38494 220183 278278
14316 278278 302870 149639 145641 205342 241553 367165 315394 160386 100331 35547 -140962
$$ packed form
14392e5123J9051N4015j10715J23258J18227K06914m1281j36280o1478n7022O7152
14381A26718J07181p5945k63804j33991m351L5493J15421O7065k54202p2491J91940
14370a60966L5146K11235K8017j11946j16579N2640j760p5508m5858K39267K14625
14359B68313k97701j68956K4319J5594K5309J94626O1937k65878P978R530q3600
14348b08529j20301J02411L40773J50623o8730p1932p5210l3568j18256J48442
14338D5723P6447j97513R9317J06728l3486J21814K06056j07967p9049n5273j75116
14327G681j96419K22348J06110J77001l0312q4947j32074o3734L2840J81689N8095
14316B78278K4592j53231l998N9701L6211J25612n1771j55008o0055o4784j76509
$$ plain form
14305 -140962 -307263 -286266 -204747 -98704 -98254 -123645 -277045 -259424 -107861 -325180 -342743
14294 -342743 -264365 38374 144272 -97283 -56421 155623 159700 44345 65382 -50955
14284 -50955 -170795 -428884 -488516 -298856 58887 150656 48964 -71346 -160287 -9277
14274 -9277 -18774 -152058 -21425 42387 215107 105505 -74942 -194841 -464216 -537179 -356720
14263 -356720 -347134 -453561 -479007 -250524 -128532 95026 117419 10639 -126663 -43878
14253 -43878 -190921 -215579 82938 85637 80997 285256 211753 58785 90503 293787 261686
14242 261686 48001 -100324 28201 293183 380615 368461 358765 405959 267871 -50237
14232 -50237 -51799 302165 307646 69575 -135664 -212917 -203968 -224926 -54543 182972 336649
$$ packed form
14305a40962j66301K0997Q1519J06043M50k5391j53400J7621J51563k17319j7563
14294c42743P8378L02739J05898k41555M0862K12044M077j15355K1037j16337
14284e0955j19840k58089n9632J89660L57743R1769j01692j20310q8941J51010
14274i277r497j33284J30633O3812J72720j09602j80447j19899k69375p2963J80459
14263c56720R586j06427k5446K28483J21992K23558K2393j06780j37302Q2785
14253d3878j47043k4658K98517K699m640K04259p3503j52968L1718K03284l2101
14242B61686k13685j48325J28525K64982Q7432j2154r696M7194j38088l18108
14232e0237j562L53964N481k38071k05239p7253Q949k0958J70383K37515J53677
$$ plain form
14221 336649 211963 157507 113141 174621 104162 78522 139213 289730 184767 34501 -195583
14210 -195583 -257179 -221160 -259834 -401580 -371087 -349158 -365021 -388113 -297124 -297756 -360555 -473626
14198 -473626 -396506 -182068 26719 -95458 13229 236363 155571 -94851 -110001 23753
14188 23753 -186717 -419737 -340994 -331275 -220580 -163987 10475 116470 63897 127768 -8403
14177 -8403 -174775 -127316 12844 251493 451170 352375 366256 267108 289221 228293 205640
14166 205640 90590 103912 252588 287390 -76656 -87925 19285 -125256 19889 31545
14156 31545 -80349 111779 78323 -226819 -182261 44207 237031 346953 293268 170391
14146 170391 112701 -102962 -307855 -329059 -262900 -149169 -24421 215752 229860 119139
$$ packed form
14221C36649j24686n4456m4366O1480p0459k5640O0691J50517j04963j50266k30084
14210a95583o1596L6019l8674j41746L0493K1929j5863k3092R0989o32o2799j13071
14198d73626P7120K14438K08787j22177J08687K23134q0792k50422j5150J33754
14188B3753k10470k33020P8743R719J10695N6593J74462J05995n2573O3871j36171
14177h403j66372M7459J40160K38649J99677r8795J3881r9148K2113o0928k2653
14166B05640j15050J3322J48676L4802l64046j1269J07210j44541J45145J1656
14156C1545j11894J92128l3456l05142M4558K26468J92824J09922n3685j22877
14146A70391n7690k15663k04893k1204O6159J13731J24748K40173J4108j10721
$$ plain form
14136 119139 -1716 87776 214016 377426 281668 204559 107088 253409 206472 -10513
14126 -10513 116223 153663 310761 330717 232833 11938 12544 -62104 23611 94059 -23859
14115 -23859 -178007 -208119 -293921 -242228 -347870 -350626 -87670 -32215 79981 85763 -33263
14104 -33263 -36574 120547 117220 32175 77259 171202 -79282 -233508 -140871 -18082 137230
14093 137230 313203 289413 120528 -125331 -58936 -42854 -35620 43422 7746 -139991 -281559
14082 -281559 -224689 -177160 -82212 -48512 65886 156952 136125 261248 272552 143602 -63379
14071 -63379 32377 215990 302144 313869 194820 -139846 -482541 -433501 -310412 -289394 -265444
14060 -265444 -108741 9936 83967 169874 115567 7956 -94580 -87196 63824 -4013 -137678
$$ packed form
14136A19139j20855Q9492J26240J63410r5758p7109r7471J46321m6937k16985
14126a0513J26736L7440J57098J9956r7884k20895O06p4648Q5715P0448j17918
14115b3859j54148l0112q5802N1693j05642k756K62956N5455J12196N782j19026
14104c3263l311J57121l327q5045M5084R3943k50484j54226R2637J22789J55312
14093A37230J75973k3790j68885k45859O6395J6082P234P9042l5676j47737j41568
14082b81559N6870M7529R4948L3700J14398R1066k0827J25123J1304j28950k06981
14071f3379R5756J83613Q6154J1725j19049l34666l42695M9040J23089K1018K3950
14060b65444J56703J18677P4031Q5907n4307j07611j02536P384J51020o7837j33665
$$ plain form
14049 -137678 -107206 -125827 -162432 -267929 -304920 -132451 -46290 62653 156447 229711 271131
14038 271131 100241 27783 -72975 -257469 -62734 262187 142379 140162 60714 52421 -144216
14027 -144216 -174200 -62286 -153576 -162057 136901 304004 234783 264051 199889 -151734 -129916
14016 -129916 -17327 -11588 -238362 -186520 -39226 326909 430902 149030 162126 96028
14006 96028 42472 -25637 62859 14918 -226151 -384065 -340928 -112775 -23309 57137 274986
13995 274986 242887 93331 13317 -184309 -25066 36046 -40731 -108603 -122940 -56134 95542
13984 95542 108653 69932 226439 158344 58722 72175 -9334 -184648 -228775 -270784 -292691
13973 -292691 12157 222889 142807 7810 38789 192056 254714 124118 48955 -63153
$$ packed form
14049a37678L0472j8621l6605j05497l6991J72469Q6161J08943R3794P3264M1420
14038B71131j70890p2458j00758j84494J94735L24921j19808k217p9448q293j96637
14027a44216k9984J11914r1290q481K98958J67103o9221K9268o4162l51623K1818
14016a29916J12589N739k26774N1842J47294L66135J03993k81872J3096o6098
14006I6028n3556o8109Q8496m7941k41069j57914M3137K28153Q9466Q0446K17849
13995B74986l2099j49556q0014j97626J59243O1112p6777o7872j4337O6806J51676
13984I5542J3111l8721J56507o8095r9622J3453q1509j75314m4127m2009k1907
13973b92691L04848K10732q0082j34997L0979J53267O2658j30596p5163j12108
$$ plain form
13963 -63153 -101209 -98437 188530 303309 313283 30688 -98962 70859 34772 147478 98340
13952 98340 30649 -57967 -192599 -159751 -172751 1058 53610 189623 180435 55446 122266
13941 122266 215794 163320 110143 204427 187932 118059 216794 44552 -46980 -90955 -74997
13930 -74997 140394 61506 47511 -79343 -125617 121146 210143 245020 231965 140184 50996
13919 50996 138940 127363 -7273 71712 88667 108509 140970 14654 -87428 -87039 -25776
13908 -25776 -97740 -114131 -192625 -301416 -163588 -100866 -138590 20164 83054 186423 2437
13897 2437 62401 181773 146966 -2719 -64575 -103610 -76504 117671 85273 -50548 -103649
13886 -103649 148531 225839 229925 36175 -157337 -424418 -291008 -112081 -193667 -237075
$$ packed form
13963f3153l8056K772K86967J14779R974k82595j29650J69821l6087J12706m9138
13952I8340o7691q8616j34632L2848j3000J73809N2552J36013r188j24989O6820
13941A22266R3528n2474n3177R4284j6495o9873R8735j72242r1532m3975J5958
13930g4997K15391p8888j3995j26854m6274K46763Q8997L4877j3055r1781q9188
13919E0996Q7944j1577j34636P8985J6955J9842L2461j26316j02082L89O1263
13908b5776p1964j6391p8494j08791J37828O2722l7724J58754O2890J03369j83986
13897B437N9964J19372l4807j49685o1856l9035K7106J94175l2398j35821n3101
13886a03649K52180P7308M086j93750j93512k67081J33410J78927q1586m3408
$$ plain form
13876 -237075 -177605 -139144 64720 264457 176796 128925 163236 34810 -15731 141921 15219
13865 15219 -80603 108695 183110 44570 95644 111514 326239 254189 48116 -12678 76383
13854 76383 115496 -91694 -59160 128339 152100 89382 56754 46057 -29503 13891 77848
13843 77848 127264 73687 -3943 23076 -2649 -30938 -77035 -101502 -253388 -82202 -40655
13832 -40655 -137751 26240 222520 109645 138449 271943 147114 -48491 -264837 -213062
13822 -213062 -98672 -159733 -375359 -234277 -139275 -80266 -191984 -289643 -105913 -44406
13812 -44406 -24846 -104364 -34140 -57895 -186283 -208015 47668 264589 167374 111243 190008
13801 190008 160885 -67906 -200477 -22409 133307 156927 119262 150182 71692 47125 103439
$$ packed form
13876b37075N9470L8461K03864J99737q7661m7871L4311j28426n0541J57652j26702
13865A5219r5822J89298P4415j38540N1074J5870K14725p2050k06073o0794Q9061
13854G6383L9113k07190L2534J87499K3761o2718l2628j0697p5560M3394O3957
13843G7848M9416n3577p7630K7019k5725k8289m6097k4467j51886J71186M1547
13832d0655r7096J63991J96280j12875K8804J33494j24829j95605k16346N1775
13822b13062J14390o1061k15626J41082R5002N9009j11718r7659J83730O1507
13812d4406J9560p9518P0224k3755j28388k1732K55683K16921r7215n6131P8765
13801A90008k9123k28791j32571J78068J55716K3620l7665L0920p8490k4567N6314
$$ plain form
13790 103439 72893 46420 3798 -47162 17102 -128882 -393838 -306895 -54627 34016 62386
13779 62386 -85853 -184692 -99525 19861 201239 330612 548243 323754 165205 165099 84678
13768 84678 42915 -57021 -12653 -16926 18214 -64783 -15033 218696 5601 -118306 125548
13757 125548 77680 140082 35706 -21646 -6857 46056 136571 317066 437584 314592 160580
13746 160580 66186 74442 -32834 -47992 -30770 -2711 36136 106369 188761 22506 -106877
13735 -106877 -154699 -159787 -48633 66406 101740 -24574 -14089 17511 23395 -53941 -200813
13724 -200813 -352060 -366329 -140394 -44350 -140510 -116242 -35692 -21747 49089 10467 32836
13713 32836 98734 42827 -127147 -118103 -88323 -116030 -181613 -72682 -196857 -163564 -162985 -251006
$$ packed form
13790A03439l0546k6473m2622n0960O4264j45984k64956Q6943K52268Q8643K8370
13779F2386j48239r8839Q5167J19386J81378J29373K17631k24489j58549j06q0421
13768H4678m1763r9936M4368m273L5140q2997M9750K33729k13095j23907K43854
13757A25548m7868O2402j04376n7352J4789N2913R0515J80495J20518j22992j54012
13746A60580r4394Q256j07276j5158J7222K8059L8847P0233Q2392j66255j29383
13735a06877m7822n088J11154J15039L5334j26314J0485L1600N884p7336j46872
13724b00813j51247j4269K25935R6044r6160K4268Q0550J3945P0836l8622K2369
13713C2836O5898n5907j69974R044K9780k7707o5583J08931j24175L3293N79q8021
$$ plain form
13701 -251006 -150797 105510 142651 155924 385458 298553 259371 232283 113897 -180562
13691 -180562 -288036 -300793 -351037 -331380 -252839 -132646 -109814 -100051 24491 -14498 -149971
13680 -149971 -187611 -103690 -157997 -26929 20464 139711 223158 259261 217864 256948 328044
13669 328044 99159 60248 -81210 -92807 63549 146090 125148 -7192 132088 194624
13659 194624 272466 306226 44605 -226766 -416410 -241067 -65970 110539 126832 29134
13649 29134 25162 39926 110761 131897 177371 129422 33878 319880 504704 221088 19327
13638 19327 -27044 8501 66812 67381 -69005 -281686 -158317 -58641 -55034 241413 322974
13627 322974 224415 219588 264428 256714 39613 2038 110762 44969 -180140 -247999 -171806
$$ packed form
13701b51006J00209K56307L7141J3273K29534q6905l9182k7088j18386k94459
13691a80562j07474j2757n0244J9657P8541J20193K2832R763J24542l8989j35473
13680a49971l7640Q3921n4307J31068M7393J19247Q3447L6103m1397L9084P1096
13669C28044k28885l8911j41458j1597J56356Q2541k0942j32340J39280O2536
13659A94624P7842L3760k61621k71371j89644J75343J75097J76509J6293r7698
13649B9134l972J4764P0835K1136M5474m7949r5544K86002J84824k83616k01761
13638A9327m6371L5545N8311N69j36386k12681J23369R9676L607K96447Q1561
13627C22974r8559m827M4840p714k17101l7575J08724o5793k25109o7859P6193
$$ plain form
13616 -171806 -137114 -179620 91925 216649 131366 -81753 -41700 137813 48034 50333 311902
13605 311902 323779 257216 294454 332679 258109 294450 284439 212502 209364 129920 123567 253154
13593 253154 226232 177248 130475 -32032 -349555 -196399 150029 303365 148563 30094
13583 30094 15605 -217396 -343365 -326542 -228162 -47761 -85187 -84472 73381 124877 17434
13572 17434 4094 101360 325029 242631 265816 303603 206190 31808 -100377 -22437 -33587
13561 -33587 -2720 -114825 -259445 -82049 123563 184450 131667 -89506 -205839 -59446
13551 -59446 2476 100404 133439 171526 358010 442766 222027 40112 25563 139608 128554
13540 128554 -20493 21485 95956 9590 22986 -150539 -326931 -142011 -75737 -75007 -95060
$$ packed form
13616a71806L4692m2506K71545J24724q5283k13119M0053J79513q9779K299K61569
13605C11902J1877o6563L7238L8225p4570L6341j0011p1937l138p9444o353J29587
13593B53154k6922m8984m6773j62507l17523J53156L46428J53336j54802j18469
13583C0094j4489k33001j25969J6823R8380J80401l7426P15J57853N1496j07443
13572A7434j3340R7266K23669q2398K3185L7787r7413j74382j32185P7940j1150
13561c3587L0867j12105j44620J77396K05612O0887n2783k21173j16333J46393
13551e9446O1922R7928L3035L8087J86484Q4756k20739j81915j4549J14045j1054
13540A28554j49047M1978P4471q6366J3396j73525j76392J84920O6274P30k0053
$$ plain form
13529 -95060 79189 106365 185224 47832 -45012 48705 250580 424648 338116 56010 8982
13518 8982 235655 276336 172331 66060 157341 409679 430062 143456 -121813 -216990 -244699
13507 -244699 -345330 -317389 -171255 -38149 -171372 -370530 -124431 147560 -7217 -22696
13497 -22696 -18215 -86308 157410 407335 335439 230596 131773 177791 227674 243936 174613
13486 174613 25055 -164545 -209939 -131300 -158481 -117872 189868 413291 390440 392319 334570
13475 334570 373634 406895 427372 355245 273127 121250 6763 -410507 -413730 -105374 -104588
13464 -104588 1507 29235 -54434 -92062 -109778 16346 -38904 -54069 136397 -244290 -277844
13453 -277844 -36966 -27318 35950 -123088 -252467 -392019 -213909 -116058 -90576 56608
$$ packed form
13529i5060J74249K7176P8859j37392r2844R3717K01875J74068q6532k82106m7028
13518H982K26673M0681j04005j06271R1281K52338K0383k86606k65269r5177k7709
13507b44699j00631K7941J46134J33106j33223j99158K46099K71991j54777j5479
13497b2696M481o8093K43718K49925p1896j04843r8823M6018M9883J6262o9323
13486A74613j49558j89600m5394P8639k7181M0609L07740K23423k2851J879n7749
13475C34570L9064L3261K0477p2127q2118j51877j14487m17270l223L08356P86
13464a04588J06095K7728q3669l7628j7716J26124n5250j5165J90466l80687l3554
13453b77844K40878R648O3268j59038j29379j39552J78110R7851K5482J47184
$$ plain form
13443 56608 63574 22390 91818 130239 -14256 -173950 -45729 -70294 -46101 -45046 -60300
13432 -60300 -124682 -125694 -26548 -121353 -58711 -225237 -364631 -314003 -205847 -14830 39199
13421 39199 -11327 -63121 92781 194949 123182 10208 45845 128100 246648 354092 316913
13410 316913 102198 79215 -52103 -4800 101033 27406 -176990 -188004 -144410 -256543
13400 -256543 -192619 -111839 -78370 -42245 -176429 -103477 93075 112600 192008 186284 79918
13389 79918 -136023 -310578 -374838 -248057 -99864 -23652 -145672 -72169 -17813 242566
13379 242566 407242 592599 535763 526660 450097 125990 -20697 192178 190462 30121 44372
13368 44372 91036 -16225 3020 -59601 -118530 30336 123940 180013 62891 173788 202969
$$ packed form
13443E6608O966m1184O9428L8421j44495j59694J28221k4565K4193J055j5254
13432f0300o4382j012R9146r4805O2642j66526j39394N0628J08156J91017N4029
13421C9199n0526n1794J55902J02168p1767j12974L5637Q2255J18548J07444l7179
13410C16913k14715k2983j31318M7303J05833p3627k04396j1014M3594j12133
13400b56543O3924Q0780L3469L6125j34184P2952J96552J9525P9408n724j06366
13389G9918k15941j74555o4260J26781J48193P6212j22020P3503N4356K60379
13379B42566J64676J85357n6836r103p6563l24107j46687K12875j716j60341J4251
13368D4372M6664j07261J9245o2621n8929J48866R3604N6073j17122J10897K9181
$$ plain form
13357 202969 -29349 -56126 -138963 -53916 133017 195632 138950 228540 263047 231065 56528
13346 56528 107598 198201 190942 -32985 1260 -20225 -88603 17487 188557 93478 60297
13335 60297 90813 56526 18646 -19231 -239297 7428 87816 34886 21392 64916 -79488
13324 -79488 41389 58658 28625 44777 82632 -9490 -18577 -25229 -43496 135665 319025
13313 319025 196696 235300 245404 39892 -102141 -25361 -135054 -219050 -182813 -199918 -287416
13302 -287416 -153573 90848 311796 292958 116328 139398 72015 -41891 -55072 91868
13292 91868 -25643 -16967 83894 123432 47484 36025 87998 106050 92133 322475 437727
13281 437727 503945 377688 343592 419405 327769 55730 -54924 -192986 -268692 -263569 -202094
$$ packed form
13357B02969k32318k6777q2837Q5047J86933O2615n6682Q9590L4507l1982j74537
13346E6528N1070R0603p259k23927L4245k1485o8378J06090J71070r5079l3181
13335F0297L0516l4287l7880l7877k20066K46725Q0388n2930j3494M3524j44404
13324g9488J20877J7269l0033J6152L7855r2122r087o652j8267J79161J83360
13313C19025j22329L8604J0104k05512j42033P6780j09693q3996L6237j7105q7498
13302b87416J33843K44421K20948j8838j76630K3070o7383j13906j3181J46940
13292I1868j17511Q676J00861L9538p5948j1459N1973J8052j3917K30342J15252
13281D37727O6218j26257l4096P5813r1636k72039j10654j38062p5706N123O1475
$$ plain form
13270 -202094 24625 53746 -97408 -123632 -195468 -255590 -101877 22735 -197121 -217320
13260 -217320 67454 54620 -35391 -204062 -212992 -238554 -271086 -102376 -103382 -26224 114037
13249 114037 274723 298298 144250 152953 117177 125752 22296 218865 442393 442779 396693
13238 396693 271297 137149 -15693 -90845 -175258 -347812 -438336 -315008 18925 197846
13228 197846 64313 -248591 -384935 -254582 -152577 -81662 -117314 -119705 -82533 174778
13218 174778 200618 52758 -224924 -22174 24731 -149426 -274362 -20676 -151865 -243464
13208 -243464 -57286 -32919 -17798 193560 308026 161211 -102382 -109679 -78402 -9784 385376
13197 385376 728859 538343 197859 155479 335546 310663 349787 152371 164710 170590 344567
$$ packed form
13270b02094K26719K9121j51154k6224p1836o0122J53713J24612k19856k0199
13260b17320K84774j2834r0011j68671q930k5562l2532J68710j006P7158J40261
13249A14037J60686K3575j54048Q703l5776Q575j03456J96569K23528L86m6086
13238C96693j25396j34148j52842p5152q4413j72554r0524J23328L33933J78921
13228A97846j33533l12904j36344J30353J02005P0915l5652k391L7172K57311
13218A74778K5840j47860k77682K02750M6905j74157j24936K53686j31189r1599
13208b43464J86178K4367J5121K11358J14466j46815k63593p297L1277O8618L95160
13197C85376L43483j90516l40484m2380J80067k4883L9124j97416J2339N880J73977
$$ plain form
13186 344567 188944 8575 -154263 -82666 17310 52595 63379 32745 48767 208255 256091
13175 256091 246806 281677 159705 133943 157971 127205 104332 49271 10025 2878 35829 235952
13163 235952 52055 -209845 -269725 -212452 -199460 -81900 168105 483045 472995 503134
13153 503134 457177 332113 92487 20322 113623 -126968 -279873 -304152 -412979 -527141
13143 -527141 -401531 -243872 -154720 76722 102818 -161904 -43928 91779 174681 203936
13133 203936 193073 151802 -34851 -277392 -385819 -275692 -237817 -158781 -120692 12356
13123 12356 147226 89384 71909 95836 160920 107110 54441 -71815 -128825 55168 90662
13112 90662 8910 -17914 -7925 72948 205327 275057 152185 244817 352976 270343 133525
$$ packed form
13186C44567j55623j80369j62838P1597R9976L5285J0784l0634J6022J59488M7836
13175B56091r285L4871j21972k5762K4028l0766k2873n5061l9246p147L2951K00123
13163B35952j83897k61900n9880N7273J2992J17560K50005L14940j0050L0139
13153E03134m5957j25064k39626p2165R3301k40591j52905k4279j08827j14162
13143e27141J25610J57659Q9152K31442K6096k64722J17976J35707Q2902K9255
13133B03936j0863m1271j86653k42541j08427J10127L7875P9036L8089J33048
13123A2356J34870n7842j7475K3927O5084n3810n2669j26256n7010J83993L5494
13112I0662q1752k6824R989Q0873J32379O9730j22872R2632J08159q2633j36818
$$ plain form
13101 133525 71668 41144 -56573 83234 65403 -5389 3186 2707 -9309 -34022 61689 91606
13089 91606 65560 94364 -44011 16251 27860 130660 142165 77963 200431 231673 352475
13078 352475 426029 582635 450545 365915 256316 415684 394866 172919 182105 394756
13068 394756 612143 695615 615757 591464 427957 549563 490031 467795 581030 652353 649832
13057 649832 489788 503479 417105 115726 -19752 94035 305516 303685 168068 140089
13047 140089 32487 -92388 14418 356116 515612 446119 515201 459115 431367 695891
13037 695891 696340 657130 665936 724601 559719 277974 155390 191059 205469 519061 644020
13026 644020 722110 969685 1460534 1743190 1974522 2150720 2082674 2085450 2248977 2052837
$$ packed form
13101A33525o1857l0524r7717J39807j7831p0792Q575m79j2016k4713R5711K9917
13089I1606k6046K8804j38375O0262J1609J02800J1505o4202J22468L1242J20802
13078C52475P3554J56606j32090q4630j09599J59368k0818k21947R186K12651
13068C94756K17387Q3472p9858k4293j63507J21606n9532k2236J13235P1323k521
13057F49832j60044J3691q6374l01379j35478J13787K11481j831j35617k7979
13047A40089j07602j24875J06806L41698J59496o9493O9082n6086k7748K64524
13037F95891M49l9210Q806N8665j64882k81745j22584L5669J4410L13592J24959
13026F44020P8090K47575M90849K82656K31332J76198o8046K776J63527j96140
$$ plain form
13016 2052837 1532620 1049505 879842 759059 641310 896384 839452 626846 514929 413779
13006 413779 668985 660147 425331 347345 439700 422517 291485 422209 373310 432700 435774
12995 435774 487339 458015 446899 498207 357181 346637 445429 346931 416546 430902 471893
12984 471893 357352 485267 568386 631060 840397 1216728 1625248 1836779 2051401 2077988
12974 2077988 2054776 2092121 2098499 1654475 1064306 685333 662318 838544 961475 1065301
12964 1065301 1080619 859161 751899 920306 887639 765193 656575 636070 545209 403485
12954 403485 494466 440545 204948 281651 402099 377862 345894 219884 105040 156858 174808
12943 174808 278014 595678 680940 449971 545812 482297 544203 784289 968991 957677
$$ packed form
13016B052837n20217m83115j69663j20783j17749K55074n6932k12606j11917j01150
13006D13779K55206q838k34816p7986R2355j7183j31032J30724m8899N9390L074
12995D35774N1565k9324j1116N1308j41026j0544R8792r8498O9615J4356M0991
12984D71893j14541J27915Q3119O2674K09337L76331M08520K11531K14622K6587
12974B077988k3212L7345O378m44024n90169l78973k3015J76226J22931J03826
12964A065301J5318k21458j07262J68407l2667j22446j08618k0505r0861j41724
12954D03485R0981n3921k35597P6703J20448k4237l1968j26010j14844N1818J7950
12943A74808J03206L17664Q5262k30969R5841o3515O1906K40086J84702j1314
$$ plain form
12933 957677 1032061 1002913 960729 777377 789709 845396 827633 827642 741858 567783 513096 570729
12921 570729 359194 201858 178240 245166 463557 581897 470409 358780 331437 433298
12911 433298 417551 294925 400226 277734 185555 261150 179591 210569 316585 415112 549677
12900 549677 589616 596928 506717 499583 446449 268148 336490 310633 417420 551262 535075
12889 535075 338549 274702 374461 334942 274424 433607 590491 613384 490339 384065
12879 384065 206300 174550 306326 276547 228644 154683 101177 246515 453082 270496
12869 270496 292326 273571 218147 424623 555450 520702 463257 510766 372633 246752 186611
12858 186611 123957 114003 150717 110498 170092 431837 304994 165747 143334 170415 129092
$$ packed form
12933I57677P4384k9148m2184j83352J2332N5687j7763Rq5784j74075n4687N7633
12921E70729k11535j57336k3618O6926K18391J18340j11488j11629k7343J01861
12911D33298j5747j22626J05301j22492r2179P5595q1559L0978J06016R8527J34565
12900E49677L9939P312r0211p134n3134j78301O8342k5857J06787J33842j6187
12889E35075j96526o3847R9759l9519o0518J59183J56884K2893j23045j06274
12879C84065j77765l1750J31776k9779m7903p3961n3506J45338K06567j82586
12869B70496K1830j8755n5424K06476J30827l4748n7445M7509j38133j25881o0141
12858A86611o2654r954L6714m0219N9594K61745j26843j39247k2413K7081m1323
$$ plain form
12847 129092 89479 156618 206683 45795 166461 296766 257730 281432 379868 542670 532693
12836 532693 324364 340264 199846 128641 241146 242465 311596 278141 304002 116673 154116
12825 154116 235964 232891 382161 643377 650636 374177 203534 80664 175578 198926 400970
12814 400970 431405 205873 221965 137263 163605 135635 155916 281818 297002 430198 415257
12803 415257 373968 281313 392234 530378 517207 421729 348849 35346 -39512 83818 65759
12792 65759 -1465 -144881 -129579 -77535 -53904 44436 -80085 -41992 112903 45398 -68487
12781 -68487 13324 131079 235406 284757 52798 -111434 13485 282455 555790 603680
12771 603680 710538 846088 627795 461331 434086 457234 401321 202278 313258 247527
$$ packed form
12847A29092l9613O7139N0065j60888J20666J30305l9036K3702R8436J62802r977
12836E32693k08329J5900j40418p1205J12505J319O9131l3455K5861j87329L7443
12825A54116Q1848l073J49270K61216P259k76459j70643j22870R4914K3348K02044
12814D00970L0435k25532J6092q4702K6342k7970K0281J25902J5184J33196j4941
12803D15257m1289r2655J10921J38144j3171r5478p2880l13503p4858J23330j8059
12792F5759o7224j43416J5302N2044K3631R8340j24521L8093J54895o7505j13885
12781f8487Q1811J17755J04327M9351k31959j64232J24919K68970K73335M7890
12771F03680J06858J35550k18293j66464k7245K3148n5913j99043J10980o5731
$$ plain form
12761 247527 162038 154118 33754 -5500 157352 190428 280732 516831 507767 297022 214463
12750 214463 230749 365789 525635 475395 340259 393804 427728 344652 138625 68158 67250
12739 67250 229953 407898 337430 378224 111593 -103484 157406 523501 570558 366341
12729 366341 193296 118701 101503 201063 183230 202964 241737 213837 197655 134674 152779
12718 152779 263331 337989 412995 367260 318768 332334 240639 155563 69112 14681 18537
12707 18537 120596 284507 180687 51797 248053 281923 237334 137557 -10013 219079
12697 219079 318065 551807 468917 310632 298235 249811 123957 90565 126691 348002 400145
12686 400145 189361 330248 259054 201745 301502 274464 55535 34345 235728 526932
$$ packed form
12761B47527q5489p920j20364l9254J62852L3076R0304K36099r064k10745q2559
12750B14463J6286J35040J59846n0240j35136N3545L3924q3076k06027p0467r08
12739F7250J62703J77945p0468M0794k66631k15077K60890L66095M7057k04217
12729C66341j73045p4595j7198R9560j7833J9734L8773k7900j6182o2981J8105
12718A52779J10552P4658P5006m5735m8492J3566r1695q5076q6451n4431L856
12707A8537J02059J63911j03820j28890J96256L3870m4589r9777j47570K29092
12697B19079R8986K33742q2890j58285j2397m8424j25854l3392L6126K21311N2143
12686D00145k10784J40887p1194n7309R9757k7038k18929k1190K01383K91204
$$ plain form
12676 526932 473281 457112 608665 518812 398489 313537 231496 242962 374503 580631 473009
12665 473009 541261 432435 451645 336057 350185 338152 352490 311985 123243 8990 100200
12654 100200 301797 517589 472817 342550 319142 186344 379304 494689 412063 431405
12644 431405 283218 233649 252851 173706 198743 273161 232746 123007 -49504 8437 60462
12633 60462 128587 -63435 38593 229226 158990 237562 254315 214332 295379 306449 402397
12622 402397 197180 247995 342003 338189 274952 377885 588751 670559 493477 269682 307530
12611 307530 407115 395465 337737 258439 272063 351658 393145 313404 244916 176479 30997
12600 30997 187039 297524 95165 -84598 -25122 64910 299651 471211 556356 560699 432211
$$ packed form
12676E26932n3651j6169J51553q9853j20323q4952q2041J1466J31541K06128j07622
12665D73009O8252j08826J9210j15588J4128j2033J4338m0505j88742j14253R1210
12654A00200K01597K15792m4772j30267k3408j32798J92960J15385q2626J9342
12644D31405j48187m9569J9202p9145K5037P4418m0415j09739j72511N7941N2025
12633F0462O8125j92022J02028J90633p0236P8572J6753l9983Q1047J1070R5948
12622D02397k05217N0815R4008l814o3237J02933K10866Q1808j77082k23795L7848
12611C07530R9585j1650n7728p9298J3624P9595M1487p9741o8488o8437j45482
12600C0997J56042J10485k02359j79763N9476R0032K34741J71560Q5145M343j28488
$$ plain form
12589 432211 386250 305506 418121 392878 258661 242320 224977 112906 132350 31616 -113366
12578 -113366 67524 205975 316276 219261 97146 52692 89430 255413 227915 261994
12568 261994 315426 254026 539894 520665 319195 542387 519926 460824 584229 429225
12558 429225 445638 376264 392845 581251 624613 432153 322174 210383 95985 218981
12548 218981 389148 426902 596152 593350 483577 422936 400529 278860 506338 370186
12538 370186 234961 162774 452863 609893 631324 607778 629801 461374 267240 456255
12528 456255 463926 390994 451291 495945 561695 463655 567378 584773 431045 522433 760482
12517 760482 718748 660590 712494 757262 941289 1035668 990308 870171 877790 684324 526716
$$ packed form
12589D32211m5961q0744J12615k5243j34217j6341j7343j12071J9444j00734j44982
12578a13366J80890J38451J10301r7015j22115m4454L6738J65983k7498L4079
12568B61994N3432o1400K85868j9229k01470K23192k2461n9102J23405j55004
12558D29225J6413o9374J6581J88406M3362j92460j09979j11791j14398J22996
12548B18981J70167L7754J69250k802j09773o0641k2407j21669K27478j36152
12538C70186j35225p2187K90089J57030K1431k3546K2023j68427j94134J89015
12528D56255P671p2932O0297M4654O5750r8040J03723J7395j53728R1388K38049
12517G60482m1734n8158N1904M4768J84027R4379m5360j20137P619j93466j57608
$$ plain form
12506 526716 471598 741894 851948 872887 705222 517827 628574 572736 690456 514488
12496 514488 346492 457934 631009 527619 507106 587151 651752 726187 850741 708978
12486 708978 632334 644510 471346 460681 388399 391194 408849 477546 513397 521745 521348 483694
12474 483694 503265 564845 610265 912853 1163989 1006586 789705 780104 736216 782861 646761
12463 646761 528583 493400 423011 552743 701881 680179 534981 547704 566103 687908
12453 687908 731993 718394 822320 878222 748837 688754 725287 785792 875571 1010135 1094538
12442 1094538 1085161 1070908 1073764 1052938 1167264 984596 921965 775885 722542 665129 1033178
12431 1033178 1021309 870740 750287 542129 544286 343969 322781 472743 725669 949330
$$ packed form
12506E26716n5118K70296J10054K0939j67665j87395J10747n5838J17720j75968
12496E14488j67996J11442J73075j03390k0513Q0045O4601P4435J24554j41763
12486G08978p6644J2176j73164j0665p2282K795J7655O8697L5851Q348l97l7654
12474D83694J9571O1580M5420L02588K51136j57403k16881r601m3888M6645j36100
12463F46761j18178l5183p0389J29732J49138k1702j45198J2723J8399J21805
12453F87908M4085j3599J03926N5902j29385o0083L6533O0505Q9779J34564Q4403
12442A094538r377j4253K856k0826J14326j82668o2631j46080n3343n7413L68049
12431A033178j1869j50569j20453k08158K157k00317k1188J49962K52926K23661
$$ plain form
12421 949330 1107139 1109795 1032084 1048020 993839 907810 888167 864863 707574 740395 661355
12410 661355 734088 883702 1073677 1147821 1151923 1265129 1260344 1099882 1073891 1092583 1028059
12399 1028059 938545 1124302 1270732 1279522 1108570 771856 675151 717240 780954 957501
12389 957501 1078778 1192145 1450327 1273121 862594 765618 828400 864347 821096 972400
12379 972400 967122 839397 857071 878454 858166 974104 1061496 948005 916367 986784 968336
12368 968336 812714 667574 487508 588300 821995 1064683 1178830 1214769 1071641 814866
12358 814866 945257 1073834 1029819 866867 906455 885587 735977 780063 870246 1078744
12348 1078744 1267424 1275335 913777 906891 1062313 1116978 1063680 1234068 1316385 1150854 1064852
$$ packed form
12421I49330J57809K656p7711J5936n4181q6029j9643k3304j57289L2821p9040
12410F61355P2733J49614J89975P4144M102J13206m785j60462k5991J8692o4524
12399A028059q9514J85757J46430Q790j70952l36714r6705M2089O3714J76547
12389I57501J21277J13367K58182j77206m10527r6976O2782L5947m3251J51304
12379I72400n278j27725J7674K1383k0288J15938Q7392j13491l1638P0417j8448
12368I68336j55622j45140j80066J00792K33695K42688J14147L5939j43128k56775
12358H14866J30391J28577m4015j62952L9588k0868j49610M4086R0183K08498
12348A078744J88680P911l61558o886J55422N4665n3298J70388Q2317j65531q6002
$$ plain form
12337 1064852 1121671 1035960 1038393 865492 1125950 1141244 958773 932414 926216 824232 881761
12326 881761 1018769 1090705 861929 812108 893262 932314 1030031 1090719 1037708 952606 946250
12315 946250 899081 881579 877713 885377 922978 1178472 1139293 1096370 1312795 1497932 1560804
12304 1560804 1581504 1668636 1906106 1950667 2036762 2322304 2377603 2210723 2094421 1964419
12294 1964419 1637894 1495946 1567886 1591262 1366228 1329678 1331602 1307222 1149765 1164234 1313082
12283 1313082 1434411 1421494 1336565 1481883 1454430 1553762 1462964 1173331 1129833 1097824 1162358
12272 1162358 1252640 999010 1147862 1288574 1335402 1386788 1369416 1402346 1491014 1351373
12262 1351373 1212277 1266148 1447645 1551216 1601020 1496374 1385705 1355068 1417196 1538764
$$ packed form
12337A064852N6819q5711K433j72901K60458J5294j82471k6359o198j01984N7529
12326H81761J37008P1936k28776m9821Q1154L9052R7717O0688n3011q5102o356
12315I46250m7169j7502l866P664L7601K55494l9179m2923K16425J85137O2872
12304A560804K0700Q7132K37470M4561Q6095K85542N5299j66880j16302j30002
12294A964419l26525j41948P1940K3376k25034l6550J924k4380j57457J4469J48848
12283A313082J21329j2917q4929J45318k7453R9332r0798k89633m3498l2009O4534
12272A162358R0282k53630J48852J40712M6828N1386j7372L2930Q8668j39641
12262A351373j39096N3871J81497J03571M9804j04646j10669l0637O2128J21568
$$ plain form
12252 1538764 1676269 1539198 1480301 1498644 1452731 1254950 1052314 1155393 1364204 1329808
12242 1329808 1300315 1473405 1524092 1479147 1397983 1452250 1337343 1221490 1366297 1460702
12232 1460702 1366146 1435117 1495116 1461062 1460900 1466731 1442943 1469552 1511430 1394209 1429321 1548210
12220 1548210 1392150 1665538 1905136 1799522 1736993 1695579 1778395 1729024 1630175 1416656
12210 1416656 1332718 1490921 1702385 1797640 1711772 1658979 1605203 1613304 1663520 1785399 1827568
12199 1827568 1738412 1691686 1734452 1805368 1866019 1881174 1745393 1848212 1867407 1663039 1528299
12188 1528299 1444101 1598552 1632818 1904476 2150177 2044487 2087994 2200847 2164753 1894039
12178 1894039 1819055 1878162 2053477 2230292 2192351 2219342 2228361 2076387 2146875 2265335 2358248
$$ packed form
12252A538764J37505j37071n8897J8343m5913j97781k02636J03079K08811l4396
12242A329808k9493J73090N0687m4945q1164N4267j14907j15853J44807R4405
12232A460702r4556O8971N9999l4054j62N831k3788K6609M1878j17221L5112J18889
12220A548210j56060K73388K39598j05614o2529m1414Q2816m9371r8849k13519
12210A416656q3938J58203K11464R5255q5868n2793n3776Q101N0216J21879M2169
12199A827568q9156m6726M2766P0916O0651J5155j35781J02819J9195k04368j34740
12188A528299q4198J54451L4266K71658K45701j05690M3507J12853l6094k70714
12178A894039p4984N9107J75315J76815l7941K6991R019j51974P0488J18460R2913
$$ plain form
12167 2358248 2382445 2400702 2338464 2333444 2586730 2774159 2769197 2462119 2669213 2862502 2906920
12156 2906920 3053351 3216731 3473458 3739037 4035621 4129889 4327612 4601311 5079893 5531333
12146 5531333 6034841 6450467 6880129 7314384 7719324 7867039 8057020 8428762 8824847
12137 8824847 9186209 8989866 8532488 8287695 8188648 8275875 8275591 8339979 8420861 8634785 9041831
12126 9041831 9598310 10314487 10980836 11608124 12460779 13205549 13985628 14789164 15463401
12117 15463401 15794827 15784332 15604405 15334070 14802828 14117527 13323683 12829726 12205819
12108 12205819 11459555 11042961 10734102 10482090 10192608 10020006 10205876 10492948 10768229
12099 10768229 10945097 11409029 11760398 11872296 12045041 12112710 12110522 12083708 11959803 11726191
$$ packed form
12167B358248K4197J8257o2238n020K53286J87429m962l07078K07094J93289M4418
12156B906920J46431J63380K56727K65579K96584R4268J97723K73699M78582M51440
12146E531333N03508M15626M29662M34255M04940J47715J89981L71742L96085
12137H824847L61362j96343m57378k44793r9047Q7227k84O4388Q0882K13924M07046
12126I041831N56479P16177O66349O27288Q52655P44770P80079Q03536O74237
12117A5463401L31426j0495j79927k70335n31242o85301p93844m93957o23907
12108A2205819p46264m16594l08859k52012k89482j72602J85870K87072K75281
12099A0768229J76868M63932L51369J11898J72745O7669k188k6814j23905k33612
$$ plain form
12089 11726191 11345505 10902112 10344375 9940251 9903155 9842347 9802608 9759667 9862542 10253722
12079 10253722 10663636 11033752 11496773 12115521 12771763 13484654 14677033 15818014 16752557
12070 16752557 17654106 18494522 18767907 19240307 19371683 19337950 19042840 18630774 18271025
12061 18271025 17677034 17355984 17032415 16945206 16979014 17156980 17837789 18801608 19675165 20918155
12051 20918155 22476631 24165062 26001443 27903790 29617113 31134540 32004084 32201470
12043 32201470 31967345 31034233 29738351 28463699 26942121 25345127 23865557 22406839
12035 22406839 21122072 20229510 19692150 19379088 19401010 19242085 19099952 19296451 19969235
12026 19969235 20667949 21355417 21877416 22367472 22425998 22238570 21795389 21121027 20361238
$$ packed form
12089A1726191l80686m43393n57737m04124l7096o0808l9739m2941J02875L91180
12079A0253722M09914L70116M63021O18748O56242P12891J192379J140981R34543
12070A6752557R01549Q40416K73385M72400J31376l3733k95110m12066l59749
12061A8271025n93991l21050l23569q7209L3808J77966O80809R63819Q73557J242990
12051B0918155J558476J688431J836381J902347J713323J517427Q69544J97386
12043C2201470k34125r33112j295882j274652j521578j596994j479570j458718
12035B2406839j284767q92562n37360l13062K1922j58925j42133J96499O72784
12026A9969235O98714O87468N21999M90056N8526j87428m43181o74362p59789
$$ plain form
12017 20361238 19524313 18625496 17810943 16892373 16192418 15661556 15018110 14501789 13918951
12008 13918951 13383163 13108076 13099830 13233641 13338843 13360693 13789541 14275279 14762455 15286268
11998 15286268 15843152 16299792 16677454 16879230 16883522 16737695 16362806 15817744 15286815 15098953
11988 15098953 14833991 14728541 14673029 14590938 14597813 14660340 15168666 15703985 16188485 16837013
11978 16837013 17852609 18713737 19478041 20360299 21158511 21812746 22251870 22492958 22057780
11969 22057780 21297212 20397770 19467039 18526340 17644621 16859144 16305983 15861792 15594525
11960 15594525 15488241 15281289 15082786 14994050 15184277 15571675 15815624 15936972 16084253
11951 16084253 16117605 16184462 16113250 15865951 15829159 15637993 15316727 14666085 13954434 13531202
$$ packed form
12017B0361238q36925q98817q14553r18570o99955n30862o43446n16321n82838
12008A3918951n35788k75087q246J33811J05202K1850M28848M85738M87176N23813
11998A5286268N56884M56640L77662K01776M292j45827l74889n45062n30929j87862
11988A5098953k64962j05450n5512q2091O875O2527N08326N35319M84500O48528
11978A6837013J015596Q61128P64304Q82258P98212O54235M39124K41088m35178
11969B2057780p60568q99442r30731r40699q81719p85477n53161m44191k67267
11960A5594525j06284k06952j98503q8736J90227L87398K43949J21348J47281
11951A6084253L3352O6857p1212k47299l6792j91166l21266o50642p11651m23232
$$ plain form
11941 13531202 13083645 12751177 12508739 12515409 12353256 12053699 11686299 11448385 11292927 11004653
11931 11004653 11064728 11075958 10821184 10885251 11045948 10912257 10882972 10788583 10752958 10807433
11921 10807433 10819226 10850344 10588307 10596303 10653059 10740765 10783749 10740574 10705274 10647027 10468656
11910 10468656 10614900 10938246 11042861 11097870 11044581 11024874 11027153 11101153 11277061 11316869
11900 11316869 11178455 11279266 11573120 11653063 11644147 11697383 11728971 11854319 11969409 11875914
11890 11875914 11771882 11812232 12086418 12150506 12274921 12355001 12271606 12212306 12385656 12724144
11880 12724144 12686855 12796940 12851866 12945949 13179915 13402004 13426354 13358609 13495150 13460686
11870 13460686 13571515 13781638 14099100 14019353 13942540 14023459 14151503 14314215 14492310 14593478
$$ packed form
11941A3531202m47557l32468k42438O670j62153k99557l67400k37914j55458k88274
11931A1004653O0075J1230k54774O4067J60697j33691k9285r4389l5625N4475
11921A0807433J1793L1118k62037P996N6756Q7706M2984m3175l5300n8247j78371
11910A0468656J46244L23346J04615N5009n3289j9707K279P4000J75908L9808
11900A1316869j38414J00811K93854P9943q916N3236L1588J25348J15090r3495
11890A1875914j04032M0350K74186O4088J24415Q0080q3395n9300J73350L38488
11880A2724144l7289J10085N4926R4083K33966K22089K4350o7745J36541l4464
11870A3460686J10829K10123L17462p9747p6813Q0919J28044J62712J78095J01168
$$ plain form
11860 14593478 14717199 14979031 15105008 15127378 15291729 15467177 15561214 15524109 15465298 15761804
11850 15761804 15983878 15905019 15860482 15988974 16260987 16410503 16404959 16641799 16797958 16904851
11840 16904851 17137846 17094285 17133285 17415645 17796507 18089733 18239320 18209328 18020516 17891458
11830 17891458 18066217 18356035 18471195 18485206 18638455 18653846 18781025 18929272 19123095 19545059
11820 19545059 19694553 19838410 19995681 20077658 20280332 20528592 20503092 20578391 20723541 20766930
11810 20766930 20989223 21238698 21578693 21740691 21769548 21844658 21912255 22059024 22308139 22244826
11800 22244826 22315751 22473588 22807765 22918948 23035779 23192211 23324460 23411321 23540208 23668764
11790 23668764 23710292 23852877 24120950 24308560 24240469 24333958 24638477 24824165 24908954 24983885
$$ packed form
11860A4593478J23721K61832J25977K2370J64351J75448R4037l7105n8811K96506
11850A5761804K22074p8859m4537J28492K72013J49516n544K36840J56159J06893
11840A6904851K32995m3561L9000K82360L80862K93226J49587k9992j88812j29058
11830A7891458J74759K89818J15160J4011J53249J5391J27179J48247J93823M21964
11820A9545059J49494J43857J57271Q1977K02674K48260k5500P5299J45150M3389
11810B0766930K22293K49475L39995J61998K8857P5110O7597J46769K49115o3313
11800B2244826P0925J57837L34177J11183J16831J56432J32249Q6861J28887J28556
11790B3668764M1528J42585K68073J87610o8091R3489L04519J85688Q4789P4931
$$ plain form
11780 24983885 24999630 25106091 25192431 25473053 25582622 25515598 25452355 25482611 25427840 25526756
11770 25526756 25674619 25729291 25790516 26006219 26068874 26189862 26241629 26392731 26645953 26910950
11760 26910950 26936205 26918351 27064018 27085117 27066896 27421637 27712807 27824651 27768152 27847056
11750 27847056 27755025 27751223 27665023 27772916 27976764 27994506 27974201 27712503 27651185 27937172
11740 27937172 27842103 27745983 27878250 27955334 28026247 28122445 28053165 28030789 28098000 28142554 28088292
11729 28088292 28048960 27956583 27848334 28063044 28198560 28228665 28050517 27910363 27869833 27883931
11719 27883931 27698118 27556180 27452534 27663128 27967721 28083374 27904166 27721690 27649425
11710 27649425 27689693 27770989 27576629 27349403 27121479 26946037 26769511 26862576 26739978 26516487
$$ packed form
11780B4983885J5745J06461Q6340K80622J09569o7024o3243L0256n4771R8916
11770B5526756J47863N4672O1225K15703O2655J20988N1767J51102K53222K64997
11760B6910950K5255j7854J45667K1099j8221L54741K91170J11844n6499P8904
11750B7847056r2031l802q6200J07893K03848J7742k0305k61698o1318K85987
11740B7937172r5069r6120J32267P7084P0913R6198o9280k2376O7211M4554n4262
11729B8088292l9332r2377j08249K14710J35516L0105j78148j40154m0530J4098
11719B7883931j85813j41938j03646K10594L04593J15653j79208j82476p2265
11710B7649425M0268Q1296j94360k27226k27924j75442j76526R3065j22598k23491
$$ plain form
11700 26516487 26507623 26610800 26655768 26621667 26627406 26518134 26464033 26550939 26493647 26275309 26027187
11689 26027187 25889026 25661606 25248239 24946280 25054591 25160139 24886417 24756049 24822720
11680 24822720 24822528 24778149 24651222 24602016 24537590 24386368 24087506 23776606 23793712 23590311
11670 23590311 23352702 23478925 23370942 23320196 23172079 23185504 23089360 23074437 22945890 22904806
11660 22904806 22705016 22537898 22321608 22222475 22228033 22193673 21799529 21793541 21918964 21989147
11650 21989147 21972998 21731755 21290092 21184697 21151684 21080513 21113040 21218857 21203421 21109681
11640 21109681 21097052 21315480 21453098 21662914 21743050 21782131 21530715 21222874 21047675 20460860
11630 20460860 20057540 20134738 19907606 19381217 18962253 18949167 18660798 18356654 18280779 18126625
$$ packed form
11700B6516487q864J03177M4968l4101N739j09272n4101Q6906n7292k18338k48122
11689B6027187j38161k27420m13367l01959J08311J05548k73722j30368O6671
11680B4822720j92m4379j26927m9206o4426j51222k98862l10900J7106k03401
11670B3590311k37609J26223j07983n0746j48117J3425r6144j4923j28547m1084
11660B2904806j99790j67118k16290r9133N558l4360l94144n988J25423P0183
11650B1989147j6149k41243m41663j05395l3013p1171L2527J05817j5436r3740
11640B1109681j2629K18428J37618K09816Q0136L9081k51416l07841j75199n86815
11630B0460860m03320P7198k27132n26389m18964j3086k88369l04144p5875j54154
$$ plain form
11620 18126625 18119518 17863583 17624876 17490121 17453530 17394252 17164918 17000063 16960941 17007714
11610 17007714 17102743 16997624 16797490 16612394 16510028 16402257 16137108 16090584 16019747 15878213
11600 15878213 15834499 15693746 15566510 15315105 15188094 15176650 15071243 14936586 14685975 14467997
11590 14467997 14402027 14338621 14277243 14363099 14420360 14322569 14303416 14268033 14060124 13944906 13812685
11579 13812685 13637278 13544149 13399499 13294084 12958429 12672309 12668165 12674760 12744661 12986102
11569 12986102 13208033 13148913 12974709 12947910 13214037 13021245 12649892 12319853 12254103 12273236
11559 12273236 12217390 12148795 12034644 11937059 11687556 11474790 11275576 11392265 11377631 11342784
11549 11342784 11285977 11208885 11194359 11381380 11132992 10759944 10633239 11000332 10925699 10679720
$$ packed form
11620A8126625p107k55935k38707j34755l6591n9278k29334j64855l9122M6773
11610A7007714R5029j05119k00134j85096j02366j07771k65149m6524p0837j41534
11600A5878213m3714j40753j27236k51405j27011j1444j05407j34657k50611k17978
11590A4467997o5970o3406o1378Q5856N7261r7791j9153l5383k07909j15218j32221
11579A3812685j75407r3129j44650j05415l35655k86120m144O595O9901K41441
11569A2986102K21931n9120j74204k6799K66127j92792l71353l30039o5750J9133
11559A2273236n5846o8595j14151r7585k49503k12766j99214J16689j4634l4847
11549A1342784n6807p7092j4526J87021k48388l73048j26705L67093p4633k45979
$$ plain form
11539 10679720 10492029 10632360 10895571 10626965 10270977 10129980 10086356 10264646 10210269 10138786
11529 10138786 10122809 10127541 10227217 10204395 10228813 10000556 9668035 9609842 9679337 9649211 9558700
11518 9558700 9459890 9480971 9428312 9306597 9289143 9251908 9294613 9299621 9185293 9334105 9337489
11507 9337489 9129227 8936163 8850448 8795652 8739930 8871432 8941402 8865722 8638869 8463288
11497 8463288 8397496 8536617 8461032 8450942 8369461 8382904 8442040 8448020 8358100 8180828 8059738
11486 8059738 8018754 7888896 7828387 8067301 8028704 7836920 7706612 7811056 7797845 7775362
11476 7775362 7749121 7742369 7742420 7826814 7639845 7483675 7272375 7259615 7273392 7195501 7100003
11465 7100003 7327768 7457054 7454590 7495868 7510548 7623768 7543776 7287170 7225861 7185201 7019530
$$ packed form
11539A0679720j87691J40331K63211k68606l55988j40997m3624J78290n4377p1483
11529A0138786j5977M732R9676k2822K4418k28257l32521n8193O9495l0126r0511
11518I558700r8810K1081n2659j21715j7454l7235M2705N008j14328J48812L384
11507I337489k08262j93064q5715n4796n5722J31502O9970p5680k26853j75581
11497H463288o5792J39121p5585j0090q1481J3443N9136N980q9920j77272j21090
11486H059738m0984j29858o0509K38914l8597j91784j30308J04444j3211k2483
11476G775362k6241o752N1Q4394j86969j56170k11300j2760J3777p7891r5498
11465G100003K27765J29286k464M1278J4680J13220p9992k56606o1309m0660j65671
$$ plain form
11454 7019530 7177265 7424257 7389515 7072733 6872525 6750556 6759618 6871146 6913146 6913345 7093183
11443 7093183 7172515 7255205 7270061 7322535 7326788 7145783 6906787 6857351 6944072 7101764 7090731
11432 7090731 7227189 7454221 7451598 7396345 7248489 7157650 7190209 7475330 7616289 7563541
11422 7563541 7611857 7567085 7490260 7401228 7688109 7832343 7812189 7999223 8215691 8465775
11412 8465775 8520878 8361026 8642963 9024487 9234902 9621024 10043035 10535375 10938992 11489586
11402 11489586 12226897 12990967 13913896 14879470 16080992 17253943 18843840 20602935 22136196
11393 22136196 23481498 24714054 25843549 26859096 27765013 28440052 29026454 29494346 29545288
11384 29545288 29703738 29865383 30319356 31100750 31864554 32666551 33554853 34745271 36119607
$$ packed form
11454G019530J57735K46992l4742l16782k00208j21969R062J11528M2000J99J79838
11443G093183P9332Q2690J4856N2474M253j81005k38996m9436Q6721J57692j1033
11432G090731J36458K27032k623n5253j47856r0839L2559K85121J40959n2748
11422G563541M8316m4772p6825q9032K86881J44234k0154J87034K16468K50084
11412H465775N5103j59852K81937L81524K10415L86122M22011M92340M03617N50594
11402A1489586P37311P64070R22929R65574J201522J172951J589897J759095J533261
11393B2136196J345302J232556J129495J015547R05917O75039N86402M67892N0942
11384B9545288J58450J61645M53973P81394P63804Q01997Q88302J190418J374336
$$ plain form
11375 36119607 37639356 39327626 40957227 42376924 43805445 44921057 45880116 46617975
11367 46617975 46975396 46862217 46493882 45833937 44959433 43763316 42623868 41274667 40049557
11358 40049557 38899809 37878688 37085767 36515805 36001909 35716799 35952853 36269663 36312692
11349 36312692 36391063 36485299 36203821 35848729 35310909 34423642 33315393 32126654 30749497
11340 30749497 29194898 27640701 26198257 24664402 23218375 22180029 21368457 20428979
11332 20428979 19559896 18999649 18681198 18674857 18812453 19298674 19623740 20191907 20995846 21799035
11322 21799035 22784475 24189695 25804956 27520923 29240919 31045718 33032408 34907877
11314 34907877 36867050 38482283 39672147 40668240 41440264 41876283 41966733 42054779 41989104
$$ packed form
11375C6119607J519749J688270J629601J419697J428521J115612R59059P37859
11367D6617975L57421j13179l68335o59945q74504j196117j139448j349201j225110
11358D0049557j149748j021121p92921n69962n13896k85110K36054L16810M3029
11349C6312692P8371R4236k81478l55092n37820q87267j108249j188739j377157
11340C0749497j554599j554197j442444j533855j446027j038346q11572r39478
11332B0428979q69083n60247l18451o341J37596M86221L25066N68167Q03939Q03189
11322B1799035R85440J405220J615261J715967J719996J804799J986690J875469
11314C4907877J959173J615233J189864R96093P72024M36019R0450Q8046o5675
$$ plain form
11305 41989104 42197395 42425813 42639301 43169235 44085519 45328314 46733522 48512147 50441929
11296 50441929 52304912 54237805 56164021 57856219 59057176 59875736 60187772 60145898 59925790
11287 59925790 59298503 58104287 56867250 55457586 53782454 52044734 50505014 48816776
11279 48816776 47227759 46063261 45127226 44586578 44008971 43491887 43314346 43105301 42682700
11270 42682700 42213998 41759616 41124394 39924950 38474680 37056208 35263225 33275114
11262 33275114 31161931 29157997 27137260 25367485 23744266 22222989 20725716 19516567
11254 19516567 18644279 17813717 16938728 16010366 15167270 14732847 14371588 13748887 13191990
11245 13191990 12803213 12352047 12047751 11883865 11635320 11063482 10784430 10665354 10203259
$$ packed form
11305D1989104K08291K28418K13488N29934R16284J242795J405208J778625J929782
11296E0441929J862983J932893J926216J692198J200957Q18560L12036m1874k20108
11287E9925790o27287j194216j237037j409664j675132j737720j539720j688238
11279D8816776j589017j164498r36035n40648n77607n17084j77541k09045m22601
11270D2682700m68702m54382o35222j199444j450270j418472j792983j988111
11262C3275114k113183k003934k020737j769775j623219j521277j497273j209149
11254A9516567q72288q30562q74989r28362q43096m34423l61259o22701n56897
11245A3191990l88777m51166l04296j63886k48545n71838k79052j19076m62095
$$ plain form
11236 10203259 9838700 9500341 9413754 9115914 8841344 8775245 8610513 8432782 8533294 8412994
11226 8412994 8278397 7893182 7601595 7499757 7554749 7470867 7335630 7342960 7360554 7186054
11216 7186054 7015036 6816741 6813363 6656231 6409097 6360941 6270907 5989318 5791537 5916413
11206 5916413 5872082 5739753 5643672 5713909 5639545 5446927 5197548 5265399 5352871 5370119 5331350
11195 5331350 5085243 5209719 5051294 4861587 4658041 4739100 4894604 4760727 4538854 4450104
11185 4450104 4390171 4410655 4405168 4333114 4254696 4137218 4177635 4309029 4050764 3821224 3884048
11174 3884048 3924107 4026336 3909490 3582578 3440421 3492912 3472318 3449173 3286103 3440628
11164 3440628 3273880 3238269 3321488 3339284 3231760 3196230 3310628 3400867 3437522 3148030
$$ packed form
11236A0203259l64559l38359q6587k97840k74570o6099j64732j77731J00512j20300
11226H412994j34597l85215k91587j01838N4992q3882j35237P330J7594j74500
11216G186054j71018j98295l378j57132k47134m8156r0034k81589j97781J24876
11206E916413m4331j32329r6081P0237p4364j92618k49379O7851Q7472J7248l8769
11195E331350k46107J24476j58425j89707k03546Q1059J55504j33877k21873q8750
11185D450104n9933K0484n487p2054p8418j17478M0417J31394k58265k29540O2824
11174C884048M0059J02229j16846l26912j42157N2491k0594k3145j63070J54525
11164C440628j66748l5611Q3219J7796j07524l5530J14398R0239L6655k89492
$$ plain form
11154 3148030 2933947 3027894 3113036 3189614 3040355 2818751 2765937 2804151 2855231 3010543
11144 3010543 3080521 3251258 3300488 3169735 2941650 2969329 2886258 2772422 2845721 2958365
11134 2958365 2876321 2816391 2786397 2665447 2651774 2736587 2713421 2658570 2657703 2759686 2887099
11123 2887099 2906167 2925786 3038095 2855893 2664544 2762152 2853749 2885584 2865150 2781031 2817782
11112 2817782 2735669 2680622 2725624 2575863 2518353 2594306 2689792 2578828 2545592 2567554 2566272
11101 2566272 2618998 2736123 2904269 2756277 2545355 2307641 2235624 2142913 1957125 2029580
11091 2029580 2261766 2326600 2458045 2550271 2462964 2378899 2407132 2391021 2265127 2255242 2274217
11080 2274217 2526778 2320232 2228417 2199884 2015547 1860582 2066189 2055472 2039986 2103625
$$ packed form
11154C148030k14083R3947Q5142P6578j49259k21604n2814L8214N1080J55312
11144C010543O9978J70737M9230j30753k28085K7679q3071j13836P3299J12644
11134B958365q2044n9930k9994j20950j3673Q4813k3166n4851q67J01983J27413
11123B887099J9068J9619J12309j82202j91349R7608R1597L1835k0434q4119L6751
11112B817782q2113n5047M5002j49761n7510P5953R5486j10964l3236K1962j282
11101B566272N2726J17125J68146j47992k10922k37714p2017r2711j85788P2455
11091B029580K32186O4834J31445R2226q7307q4065K8233j6111j25894r885J8975
11080B274217K52561k06546r1815k8533j84337j54965K05607j0717j5486O3639
$$ plain form
11070 2103625 2169976 2228593 2427566 2313447 2223134 2295497 2443453 2549966 2364030 2166185
11060 2166185 2142991 2191682 2291919 2079439 1983167 1947868 1984590 2124858 2202352 2166066 2228515
11049 2228515 2152182 2003627 1934742 1974239 2224238 2231239 2399441 2334699 2285860 2453522 2568193
11038 2568193 2664186 2489184 2297548 2303255 2448782 2633997 2450603 2298640 2306156 2361590
11028 2361590 2440466 2594667 2535718 2442617 2658879 2874398 2968597 2902787 2794300 2818005
11018 2818005 2974520 3070309 3075001 2958064 3143934 3330044 3393871 3535409 3391130 3255731
11008 3255731 3209470 3002235 3002720 3158401 3074934 3114088 3081683 2849889 2610369 2327259 2054435
10997 2054435 2135129 2438005 2384103 2288162 2457292 2595935 2418176 2126003 2136103 2293565
$$ packed form
11070B103625O6351N8617J98973j14119r0313P2363J47956J06513j85936j97845
11060B166185k3194M8691J00237k12480r6272l5299L6722J40268P7494l6286O2449
11049B228515p6333j48555o8885L9497K49999P001J68202o4742m8839J67662J14671
11038B568193R5993j75002j91636N707J45527J85215j83394j51963P516N5434
11028B361590P8876J54201n8949r3101K16262K15519R4199o5810j08487K3705
11018B818005J56515R5789M692j16937J85870J86110O3827J41538j44279j35399
11008C255731m6261k07235M85J55681q3467L9154l2405k31794k39520k83110k72824
10997B054435Q0694L02876n3902r5941J69130J38643j77759k92173J0100J57462
$$ plain form
10987 2293565 2355450 2310621 2268704 2208817 2191087 2264374 2364854 2335325 2322678 2153513 2201112
10976 2201112 2427957 2236160 2275752 2238090 2205758 2222985 2040587 1913072 1863197 2006218
10966 2006218 2051840 1993541 1891596 1978855 2277409 2312844 2203932 2003376 1761155 1872123
10956 1872123 2063163 1855672 1701819 1929914 2057203 2107149 2039357 1868584 1923800 2017690
10946 2017690 2156281 2210651 2168302 2147611 1982856 1798543 1662277 1586253 1641938 1877812
10936 1877812 2025756 2088326 2034556 2173149 2179721 2338662 2261019 1906925 1760125 1934433
10926 1934433 2310318 2380003 2306672 2157593 2131881 1986821 1941743 1856524 1873861 2078934
10916 2078934 2287479 2296111 2259084 2350289 2470722 2527207 2328748 2272546 2060910 2143635 2317547
$$ packed form
10987B293565O1885m4829m1917n9887j7730P3287J00480k9529j2647j69165M7599
10976B201112K26845j91797L9592l7662l2332J7227j82398j27515m9875J43021
10966B006218M5622n8299j01945Q7259K98554L5435j08912k00556k42221J10968
10956A872123J91040k07491j53853K28095J27289M9946o7792j70773N5216R3890
10946B017690J38591N4370m2349k0691j64755j84313j36266p6024N5685K35874
10936A877812J47944O2570n3770J38593O572J58941p7643l54094j46800J74308
10926A934433L75885O9685p3331j49079k5712j45060m5078q5219J7337K05073
10916B078934K08545Q632l7027R1205J20433N6485j98459n6202k11636Q2725J73912
$$ plain form
10905 2317547 2127363 2141841 2229551 2166876 2154071 2282409 2351041 2592791 2741859 2901585
10895 2901585 2826118 2746692 2861323 3079385 2978376 2716989 2712861 2945474 3229702 3557663
10885 3557663 3742306 3899281 4164998 4483074 4655683 4672540 5068948 5668807 6125562 6723019
10875 6723019 7405380 8166827 8800933 9598276 10619205 11953140 13408946 15133804 17422501
10866 17422501 19659146 21796457 24064152 26019869 27686077 29239339 30420311 31321977
10858 31321977 31628994 31444941 31003246 30515732 30209496 30128314 30276619 30648184 31267851
10849 31267851 32206154 33314457 34710528 35893690 36652427 37237383 37523870 37021471 35928907
10840 35928907 34180279 32193387 29707491 27013383 24551380 22441242 20699967 19187388
$$ packed form
10905B317547j90184J4478Q7710o2675j2805J28338O8632K41750J49068J59726
10895B901585p5467p9426J14631K18062j01009k61387m128K32613K84228L27961
10885C557663J84643J56975K65717L18076J72609J6857L96408N99859M56755N97457
10875F723019O82361P61447O34106P97343J020929J333935J455806J724858K288697
10866A7422501K236645K137311K267695J955717J666208J553262J180972R01666
10858C1321977L07017j84053m41695m87514l06236q1182J48305L71565O19667
10849C1267851R38303J108303J396071J183162P58737N84956K86487n02399j092564
10840C5928907j748628j986892k485896k694108k462003k110138j741275j512579
$$ plain form
10832 19187388 17803678 16405078 15231388 14280536 13513469 13169728 12669181 12209137 11633018
10823 11633018 11208040 10891716 10654291 10553190 10457582 10052146 9725927 9535521 9430848
10814 9430848 9285150 9077783 9210541 9492244 9672127 9719664 9938267 10108344 10198278 10330630
10804 10330630 10675534 11052834 11616334 12335729 13132186 14120134 15119289 16272864 17876233
10795 17876233 19697633 21924577 24622728 27857780 31390382 35353651 39904556 44199329
10787 44199329 48279352 52153449 55545781 58086424 59584626 60207701 59790580 58701097
10779 58701097 57244393 55502493 54206802 53653305 53496571 53874904 54654811 56299634 58285871
10770 58285871 60257103 62028095 63372371 63800787 63522585 61992060 59228188 56009432
$$ packed form
10832A9187388j383710j398600j173690r50852p67067l43741n00547m60044n76119
10823A1633018m24978l16324k37425j01101r5608m05436l26219j90406j04673
10814I430848j45698k07367J32758K81703J79883M7537K18603J70077Q9934J32352
10804A0330630L44904L77300N63500P19395P96457R87948R99155J153575J603369
10795A7876233J821400K226944K698151L235052L532602L963269M550905M294773
10787D4199329M080023L874097L392332K540643J498202O23075m17121j089483
10779E8701097j456704j741900j295691n53497j56734L78333P79907J644823J986237
10770E8285871J971232J770992J344276M28416k78202j530525k763872l218756
$$ plain form
10762 56009432 52449801 48386126 44104330 40191865 36326215 32952341 30014540 27549359
10754 27549359 25533559 23812019 22454184 20805785 19196625 18005691 16966324 15988370
10746 15988370 15253935 14891939 14543739 14088515 13390068 12766386 12413106 12191313 11808440
10737 11808440 11437924 11102904 10807382 10777021 10715227 10688063 10729005 10580373 10506566 10453438
10727 10453438 10337989 10349706 10573713 10726675 10925047 11211667 11733354 12224301 12837071
10718 12837071 13622641 14603579 15888557 17408980 19027265 21077598 23230697 25519173
10710 25519173 27696204 29680809 31166384 32154206 32868349 33157508 32789844 31798893 30505943
10701 30505943 29449840 28671241 28001947 27574216 27580698 27895849 28578433 29114146 29860274
$$ packed form
10762E6009432l559631m063675m281796l912465l865650l373874k937801k465181
10754B7549359k015800j721540j357835j648399j609160j190934j039367r77954
10746A5988370p34435l61996l48200m55224o98447o23682l53280k21793l82873
10737A1808440l70516l35020k95522l0361o1794k7164M0942j48632p3807n3128
10727A0453438j15449J1717K24007J52962J98372K86620N21687M90947O12770
10718A2837071P85570R80938J284978J520423J618285K050333K153099K288476
10710B5519173K177031J984605J485575R87822P14143K89159l67664r90951j292950
10701C0505943j056103p78599o69294m27731O482L15151O82584N35713P46128
$$ plain form
10692 29860274 30535109 30723670 30446373 29929634 29148401 28027273 26575085 24916942 22982481
10683 22982481 21153891 19538591 18127836 16698407 15336427 14108040 13105574 12159953
10675 12159953 11465723 10843342 10227226 9797458 9330352 8884760 8540665 8301204 8162674
10666 8162674 7927955 7606771 7302286 7105543 6774096 6622299 6560165 6597333 6516940 6536623
10656 6536623 6420945 6382210 6178831 5982980 6101357 6004962 5850861 6143271 6317998 6248182
10646 6248182 6117611 6315713 6687875 6818331 6828894 6563254 6223533 6054185 5842287 5688445
10636 5688445 5405584 5640563 6031044 6185654 6209651 6347681 6601488 6925037 7354648 7836580
10626 7836580 8420305 8774469 9236451 9873809 10542870 11195163 12111705 13088643 14110244
$$ packed form
10692B9860274O74835J88561k77297n16739p81233j121128j452188j658143j934461
10683B2982481j828590j615300j410755j429429j361980j228387j002466r45621
10675A2159953o94230o22381o16116m29768m67106m45592l44095k39461j38530
10666H162674k34719l21184l04485j96743l31447j51797o2134L7168q0393J9683
10656F536623j15678l8735k03379j95851J18377r6395j54101K92410J74727o9816
10646F248182j30571J98102L72162J30456J0563k65640l39721j69348k11898j53842
10636E688445k82861K34979L90481J54610K3997J38030K53807L23549M29611M81932
10626G836580N83725L54164M61982O37358O69061O52293R16542R76938J021601
$$ plain form
10617 14110244 15876595 18476313 21825329 26246512 31906865 39208993 48105307 57651355
10609 57651355 66702156 74789075 81994687 88470146 93757161 97260399 99394819 101748833
10601 101748833 107066843 117211498 131675265 147628349 162462678 174879775 185081354
10594 185081354 193466372 198752739 199158254 194484409 189492657 189931402 198633332 214168977
10586 214168977 232000588 247488573 259375197 267754699 272366247 271365073 261555425
10579 261555425 243117585 223048569 208977875 203622737 205267188 209518533 213090783
10572 213090783 214848803 214594779 211843037 205191097 192710976 174922545 156918633 143073634
10564 143073634 134645950 130260350 127745267 125741725 122977873 119550313 114770227 107972797
$$ packed form
10617A4110244J766351K599718L349016M421183N660353P302128Q896314R546048
10609E7651355R050801Q086919P205612O475459N287015L503238K134420K354014
10601A01748833N318010J0144655J4463767J5953084J4834329J2417097J0201579
10594A85081354Q385018N286367M05515m673845m991752M38745Q701930J5535645
10586B14168977J7831611J5487985J1886624Q379502M611548j001174r809648
10579B61555425j8437840k0069016j4070694n355138J644451M251345L572250
10572B13090783J758020k54024k751742o651940j2480121j7788431j8003912j3844999
10564A43073634q427684m385600k515083k003542k763852l427560m780086o797430
$$ plain form
10556 107972797 99012323 88075020 76775622 67234881 59656863 53735532 49120520 45529450
10548 45529450 42571656 40461246 38377440 36398722 34667898 33160336 31648903 30344904
10540 30344904 28986803 27929959 26869390 25892366 24961191 24197184 23486286 22714979 22084762
10531 22084762 21495810 20644244 20027517 19393158 18780629 18082590 17343236 16780451 16412145
10522 16412145 16240922 15909616 15392010 15046149 14450884 14082487 13909553 13566945 13195308
10513 13195308 12828460 12482746 12062387 11651099 11416911 11286190 11034680 10396135 10229460
10504 10229460 10240501 10000725 9705861 9354987 8884943 8647838 8429133 8377078 8305461 8211735
10494 8211735 8042891 7683410 7500878 7400317 7129412 6747259 6520281 6302861 6117243
$$ packed form
10556A07972797q960474j0937303j1299398r540741p578018n921331m615012l591070
10548D5529450k957794k110410k083806j978718j730824j507562j511433j303999
10540C0344904j358101j056844j060569r77024r31175p64007p10898p71307o30217
10531B2084762n88952q51566o16727o34359o12529o98039p39354n62785l68306
10522A6412145j71223l31306n17606l45861n95265l68397j72934l42608l71637
10513A3195308l66848l45714m20359m11288k34188j30721k51510o38545j66675
10504A0229460J1041k39776k94864l50874m70044k37105k18705n2055p1617r3726
10494H211735j68844l59481j82532j00561k70905l82153k26978k17420j85618
$$ plain form
10485 6117243 6170699 6104419 6040290 5684205 5361411 5332425 5182438 4990609 4851293 4793765
10475 4793765 4636852 4644919 4720200 4659879 4598217 4510970 4402257 4370264 4332951 4148644 4049076
10464 4049076 4006180 4001423 3842746 3579801 3607005 3673220 3650856 3669903 3758181 3698078 3429013
10453 3429013 3306948 3395991 3335294 3187388 2873020 2776482 2845291 2982864 3056063 3083854
10443 3083854 3105210 3054404 2992947 2772510 2705397 2573028 2567782 2780709 2914972 2757027
10433 2757027 2779872 2727304 2409816 2395135 2484552 2522961 2590358 2633349 2652706 2553784 2433568
10422 2433568 2174929 2023823 1973650 1870127 1621032 1685901 1764889 1833399 1713058 1741560
10412 1741560 1716444 1752142 1556850 1492397 1410819 1343053 1495677 1558571 1702191 1491851
$$ packed form
10485F117243N3456o6280o4129l56085l22794k8986j49987j91829j39316n7528
10475D793765j56913Q067P5281o0321o1662q7247j08713l1993l7313j84307r9568
10464D049076m2896m757j58677k62945K7204O6215k2364J9047Q8278o0103k69065
10453C429013j22065Q9043o0697j47906l14368r6538O8809J37573P3199K7791
10443C083854K1356n0806o1457k20437o7113j32369n246K12927J34263j57945
10433B757027K2845n2568l17488j4681Q9417L8409O7397M2991J9357r8922j20216
10422B433568k58639j51106n0173j03523k49095O4869P8988O8510j20341K8502
10412A741560k5116L5698j95292o4453q1578o7766J52624O2894J43620k10340
$$ plain form
10402 1491851 1242295 1177792 1412414 1737703 1795964 1651134 1427357 1286797 1353912 1239223
10392 1239223 875900 825060 1020480 979607 1063428 1212157 1183449 1305042 993251 879601
10382 879601 845967 857649 951549 1129630 1269858 1015431 1019067 1252437 1131088 982427
10372 982427 959364 1127717 1159471 1179802 1151050 1124891 1020952 1034416 1230138 1280562 1336493
10361 1336493 1215119 929316 1067580 1092485 1265809 1316257 1353753 1304699 1387783 1380528 1210686
10350 1210686 1272279 1417668 1534336 1459579 1194191 827211 927711 1190014 1374740 1483549
10340 1483549 1399499 1172811 1062089 1188943 1355766 1307728 1394185 1357093 1210285 1350714
10330 1350714 1419643 1368689 1412451 1461593 1597998 1626622 1844715 1936773 2142203 2355273
$$ packed form
10402A491851k49556o4503K34622L25289N8261j44830k23777j40560O7115j14689
10392A239223l63323n0840J95420m0873Q3821J48729k8708J21593l11791j13650
10382H79601l3634J1682R3900J78081J40228k54427L636K33370j21349j48661
10372I82427k3063J68353L1754K0331k8752k6159j03939J3464J95722N0424N5931
10361A336493j21374k85803J38264K4905J73324N0448L7496m9054Q3084p255j69842
10350A210686O1593J45389J16668p4757k65388l66980J00500K62303J84726J08809
10340A483549q4050k26688j10722J26854J66823m8038Q6457l7092j46808J40429
10330A350714O8929n0954M3762M9142J36405K8624K18093R2058K05430K13070
$$ plain form
10320 2355273 2623110 2878848 2918816 2640509 2295351 2289269 2308355 2222278 2107658 1790049
10310 1790049 1765760 1531289 1534621 1619920 1474427 1284781 1394753 1412529 1316470 1167335
10300 1167335 1114008 1098706 1118269 886811 716418 553026 604443 768224 748005 851766
10290 851766 942351 1014513 948625 727188 641473 803751 891912 894614 961434 1063285 1225215
10279 1225215 1185255 943125 881790 748992 782790 731367 780527 820534 829648 726279 568918
10268 568918 643117 733655 769093 673688 499659 345630 323059 306575 165728 376945 590310
10257 590310 692026 625108 517029 472283 570803 579742 485903 419196 516879 466048 423981
10246 423981 660420 699369 453973 441400 427805 317381 341556 385539 616505 655438 472620
$$ packed form
10320B355273K67837K55738L9968k78307l45158o082J9086q6077j14620l17609
10310A790049k4289k34471L332Q5299j45493j89646J09972J7776r6059j49135
10300A167335n3327j5302J9563k31458j70393j63392N1417J63781k0219J03761
10290H51766R0585P2162o5888k21437q5715J62278Q8161K702O6820J01851J61930
10279A225215l9960k42130o1335j32798L3798n1423M9160M0007R114j03369j57361
10268E68918P4199R0538L5438r5405j74029j54029k2571j6484j40847K11217K13365
10257E90310J01716o6918j08079m4746R8520Q939r3839o6707R7683n0831m2067
10246D23981K36439L8949k45396j2573j3595j10424K4175M3983K30966L8933j82818
$$ plain form
10235 472620 523788 567203 629352 569187 505862 606593 659635 662055 552807 445141 458466
10224 458466 455412 411645 448125 622641 491711 413839 350526 512748 868060 1045190 761013
10213 761013 678486 660562 649763 561293 500524 544501 493812 430045 345164 428737 379049
10202 379049 321144 287514 379146 360538 566330 716977 418250 394054 349541 127741 230133
10191 230133 300809 349354 361508 432481 377526 398566 681203 797849 959654 943776 971183
10180 971183 815016 711589 780151 881751 979261 945181 1224802 1290303 1195937 1275081 1389443
10169 1389443 1306847 1099171 1031661 1026994 1081053 1260209 1120697 989306 1093343 1153831
10159 1153831 1129121 1303847 1616584 1773071 1559832 1456433 1513207 1690804 1687114 1764774
$$ packed form
10235D72620N1168M3415O2149o0165o3325J00731N3042K420j09248j07666J3325
10224D58466l054m3767L6480J74516j30930p7872o3313J62222L55312J77130k84177
10213G61013q2527j7924j0799q8470o0769M3977n0689o3767q4881Q3573m9688
10202C79049n7905l3630R1632j8608K05792J50647k98727k4196m4513k21800J02392
10191B30133P0676M8545J2154P0973n4955K1040K82637J16646J61805j5878K7407
10180I71183j56167j03427O8562J01600R7510l4080K79621O5501r4366P9144J14362
10169A389443q2596k07676o7510m667N4059J79156j39512j31391J04037O0488
10159A153831k4710J74726L12737J56487k13239j03399N6774J77597l690P7660
$$ plain form
10149 1764774 1818725 1925077 2058386 2123866 2064977 1949366 1874405 1925903 2104728 1861887
10139 1861887 1665757 1585531 1642626 1758415 1653924 1557304 1696620 1777418 1737475 1465563
10129 1465563 1346461 1408191 1498354 1399956 1199812 1092705 934047 870024 1104969 1211350
10119 1211350 1285608 1221026 1044080 1186525 1363694 1167805 1000344 842591 690353 718867
10109 718867 719057 900429 870838 925992 985057 949886 931089 990721 799618 780650 783338 789636
10097 789636 662055 557745 524823 483682 422313 544245 508990 417096 499053 541989 744453
10086 744453 512521 451896 411887 451110 524314 405278 187641 245097 304856 336805 389726
10075 389726 395948 329402 327181 424654 538342 513703 573212 677714 567314 435587 350831
$$ packed form
10149A764774N3951J06352J33309O5480n8889j15611p4961N1498J78825k42841
10139A861887j96130q0226N7095J15789j04491r6620J39316Q0798l9943k71912
10129A465563j19102O1730R0163r8398k00144j07107j58658o4023K34945J06381
10119A211350P4258o4582j76946J42445J77169j95889j67461j57753j52238K8514
10109G18867J90J81372k9591N5154N9065l5171j8797N9632j91103j8968K688O298
10097G89636j27581j04310l2922m1141o1369J21932l5255r1894Q1957M2936K02464
10086G44453k31932o0625m0009L9223P3204j19036k17637N7456N9759L1949N2921
10075C89726O222o6546k221R7473J13688k4639N9509J04502j10400j31727q4756
$$ plain form
10064 350831 173531 255762 255580 218052 248015 299319 402141 599050 762993 494425 471481
10053 471481 694087 674447 703432 883178 903641 669270 521048 591082 704762 1014446
10043 1014446 1424613 1642338 1526581 1391873 1526230 1589644 1524894 1265966 1293054 1451164
10033 1451164 1379916 1337871 1401038 1335790 1202357 1169316 1121145 1147137 1303080 1306256 1131334
10022 1131334 1031879 918275 1169848 1301177 1386810 1468022 1343918 1475620 1553873 1394484
10012 1394484 1257982 1529450 1521327 1469216 1685463 1627162 1586500 1649718 1741098 1653490 1473030
10001 1473030 1415115 1400376 1614738 1818638 1840101 1871946 1905858 1992762 1976585 1930002 1851026
9990 1851026 1760143 1865465 1930117 2020868 2111569 2259331 2218949 2045538 2034645 2252079 2353906
$$ packed form
10064C50831j77300Q2231j82l7528K9963N1304J02822J96909J63943k68568k2944
10053D71481K22606j9640K8985J79746K0463k34371j48222P0034J13680L09684
10043A014446M10167K17725j15757j34708J34357O3414o4750k58928K7088J58110
10033A451164p1248m2045O3167o5248j33433l3041m8171K5992J55943L176j74922
10022A131334r9455j13604K51573J31329Q5633Q1212j24104J31702P8253j59389
10012A394484j36502K71468q123n2111K16247n8301m0662O3218R1380q7608j80460
10001A473030n7915j4739K14362K03900K1463L1845L3912Q6904j6177m6583p8976
9990A851026r0883J05322O4652R0751R0701J47762m0382j73411j0893K17434J01827
$$ plain form
9979 2353906 2489201 2723214 2845544 2787056 2955680 3087876 3207572 3283249 3082215 2985167
9969 2985167 3051785 3335330 3596656 3825885 3869392 3969764 4028624 4278700 4195800 4284140
9959 4284140 4639905 4860923 5021304 4895967 4992021 5228791 5574628 5821037 6290618 6693723
9949 6693723 7220450 7802188 8241886 8734645 9297975 10050717 10915455 11706076 12703085 13937512
9939 13937512 14890659 16115038 17742482 19452811 21374654 23669860 25983148 28752737
9931 28752737 32373794 36602998 41720193 48801816 58203466 68833670 80428977 95276903
9923 95276903 114336924 139700693 173461580 215168293 263999523 316203695 358566852
9916 358566852 387653868 406579371 415767624 415751770 399006096 352545944 288840737 233088570
$$ packed form
9979B353906J35295K34013J22330n8488J68624J32196J19696P5677k01034r7048
9969B985167O6618K83545K61326K29229M3507J00372N8860K50076q2900Q8340
9959D284140L55765K21018J60381j25337R6054K36770L45837K46409M69581M03105
9949F693723N26727N81738M39698M92759N63330P52742Q64738P90621R97009J234427
9939A3937512R53147J224379J627444J710329J921843K295206K313288K769589
9931B8752737L621057M229204N117195P081623R401650J0630204J1595307J4847926
9923I5276903J9060021K5363769L3760887M1706713M8831230N2204172M2363157
9916C58566852K9087016J8925503R188253j5854j6745674m6460152o3705207n5752167
$$ plain form
9908 233088570 191218387 160166506 137042313 119413430 105527017 94427945 85556143
9901 85556143 78114468 71804998 66601526 62340963 58647528 55320904 52426474 49953569
9893 49953569 47501345 45132367 42962409 40614529 38615276 36933725 35312573 33838923
9885 33838923 32418787 30968471 29815056 28687726 27595280 26526370 25476920 24453252
9877 24453252 23596874 22859845 22038886 21213845 20408811 19807173 19308319 18787044 18005296
9868 18005296 17322453 16853218 16270738 15714313 15407790 15010557 14660875 14212755 13922632
9859 13922632 13663307 12991620 12597783 12148327 11643051 11344450 11043349 10897473 10659083
9850 10659083 10323526 10144905 9995247 9861203 9706613 9651914 9533098 9407129 9580230 9480489
$$ packed form
9908B33088570m1870183l1051881k3124193j7628883j3886413j1099072q871802
9901H5556143p441675o309470n203472m260563l693435l326624k894430k472905
9893D9953569k452224k368978k169958k347880j999253j681551j621152j473650
9885C3838923j420136j450316j153415j127330j092446j068910j049450j023668
9877B4453252q56378p37029q20959q25041q05034o01638m98854n21275p81748
9868A8005296o82843m69235n82480n56425l06523l97233l49682m48120k90123
9859A3922632k59325o71687l93837m49456n05276k98601l01101j45876k38390
9850A0659083l35557j78621j49658j34044j54590n4699j18816j25969J73101r9741
$$ plain form
9840 9480489 9335825 9256142 9236740 9157470 8953879 8626739 8179637 7682669 7111759 6867911
9830 6867911 6631884 6453698 6203711 5926550 5546164 5323676 5360426 5393419 5163709 5100701
9820 5100701 5077913 4792139 4621702 4699724 4434902 4098344 4111509 4024829 4073659 3866814
9810 3866814 3674620 3656557 3601201 3486492 3312047 3307761 3067994 2902272 3025757 3149725
9800 3149725 3144430 2876414 2739444 2805276 2874150 2846062 2649240 2477430 2487645 2778745 2806747
9789 2806747 2791119 2662125 2599743 2652032 2718447 3051325 3122152 3243730 3253016 3130910 3086793
9778 3086793 3276830 3540041 4214422 5288054 6506685 7831495 8380576 8813487 9282675
9769 9282675 9784484 9964904 9002490 7234339 5313570 4009496 3649275 3351951 2900546
$$ packed form
9840I480489j44664p9683j9402p9270k03591l27140m47102m96968n70910k43848
9830F867911k36027j78186k49987k77161l80386k22488L6750L2993k29710o3008
9820E100701k2788k85774j70437P8022k64822l36558J3165q6680M8830k06845
9810C866814j92194j8063n5356j14709j74445m286k39767j65722J23485J23968
9800C149725n295k68016j36970O5832O8874k8088j96822j71810J0215K91100K8002
9789B806747j5628j28994o2382N2289O6415L32878P0827J21578R286j22106m4117
9778C086793J90037K63211O74381J073632J218631J324810N49081M32911M69188
9769I282675N01809J80420r62414j768151j920769j304074l60221k97324m51405
$$ plain form
9760 2900546 2648327 2666941 2339028 2095793 2009914 1928552 2045453 2050661 1926173 1824234
9750 1824234 1827457 1844817 1865189 1676791 1493909 1346630 1309909 1254694 1017473 1008181 1127566
9739 1127566 1200228 1332252 1349034 1341869 1505019 1539995 1316347 1242721 1237498 1336950 1251863
9728 1251863 1255933 1202881 920495 609035 530148 559597 655536 826533 821227 718078 699286
9717 699286 623055 639090 720099 652723 563770 393522 335325 501103 542907 326828 444179
9706 444179 564956 842740 1010603 1197735 1260179 1192000 805588 530379 490678 544385
9696 544385 776094 1070398 1013376 676439 645788 568984 507314 681513 956348 997440 905361
9685 905361 885159 974506 1006453 1007619 982837 784373 963428 1111328 1003768 598714 459438
$$ packed form
9760B900546k52219J8614l27913k43235q5879q1362J16901N208j24488j01939
9750A824234L223J7360K0372j88398j82882j47279l6721n5215k37221r292J19385
9739A127566P2662J32024J6782p165J63150L4976k23648p3626n223R9452q5087
9728A251863M070n3052k82386l11460p8887K9449R5939J70997n306j03149j8792
9717F99286p6231J6035Q1009o7376q8953j70248n8197J65778M1804k16079J17351
9706D44179J20777K77784J67863J87132O2444o8179l86412k75209l9701N3707
9696E44385K31709K94304n7022l36937l0651p6804o1670J74199K74835M1092r2079
9685I05361k0202Q9347L1947J166k4782j98464J79055J47900j07560m05054j39276
$$ plain form
9674 459438 616339 665857 702534 807618 916353 1024205 998238 913486 918183 1067590 1050523
9663 1050523 910373 843523 634473 712444 855495 864202 871661 855454 695564 484807 428220
9652 428220 436978 538206 687832 735318 693832 501442 176176 124889 314730 580505 670267
9641 670267 602919 609032 746259 722165 795790 832407 853093 762531 693129 626751 684626 788858
9629 788858 735072 716755 881315 952974 1004268 1008894 793439 621422 452877 167296 262853
9618 262853 502445 558067 445774 229980 279132 374838 334672 422497 678689 707839 611349
9607 611349 478668 563572 492865 568806 512951 430711 554531 761822 768095 568584 523335
9596 523335 707607 787444 808544 1028423 904267 703962 668819 601143 600165 553498 529376
$$ packed form
9674D59438J56901M9518L6677J05084J08735J07852k5967q4752M697J49407j7067
9663A050523j40150o6850k09050P7971J43051Q707P459j6207j59890k10757n6587
9652D28220Q758J01228J49626M7486m1486j92390l25266n1287J89841K65775Q9762
9641F70267o7348O113J37227k4094P3625L6617K0686r0562o9402o6378N7875J04232
9629G88858n3786j8317J64560P1659N1294M626k15455j72017j68545k85581R5557
9618B62853K39592N5622j12293k15794M9152R5706m0166Q7825K56192K9150r6490
9607F11349j32681Q4904p0707P5941n5855q2240J23820K07291O273j99511m5249
9596E23335J84272P9837K1100K19879j24156k00305l5143o7676r78m6667k4122
$$ plain form
9585 529376 448141 333333 325315 405033 578917 643200 559502 552941 422705 496818 601264
9574 601264 644139 675111 529548 588903 603998 644076 639572 588093 544523 444410 695159
9563 695159 734221 635117 475537 609018 761289 632546 580305 520898 544408 661809 592813
9552 592813 501057 342189 223426 298597 629611 499425 374046 395317 426549 440654 512588
9541 512588 1058294 1390966 1465858 1608654 1626042 1603192 1599139 1729196 1763440 1550982 1032790
9530 1032790 696611 625353 684612 440088 459514 692161 571765 543314 567818 606064 878174
9519 878174 1209391 1401245 1293354 1369920 1311412 1357540 1499607 1860854 2106531 2296191
9509 2296191 2295044 2586028 2546675 2599950 2691537 2661654 2469200 2218032 2002374 1778326 1355026
$$ packed form
9585E29376q1235j14808q018P9718J73884O4283q3698o561j30236P4113J04446
9574F01264M2875L0972j45563N9355J5095M0078m504n1479m3570j00113K50749
9563F95159L9062r9104j59580J33481J52271j28743n2241n9407K3510J17401o8996
9552E92813r1756j58868j18763P5171L31014j30186j25379K1271L1232J4105P1934
9541E12588N45706L32672P4892J42796J7388k2850m053J30057L4244k12458n18192
9530A032790l36179p1258N9259k44524J9426K32647j20396k8451K4504L8246K72110
9519H78174L31217J91854j07891P6566n8508M6128J42067L61247K45677J89660
9509B296191j147K90984l9353N3275R1587k9883j92454k51168k15658k24048m23300
$$ plain form
9498 1355026 1186709 1007887 1032221 982081 696603 571474 908721 957996 851300 934023
9488 934023 873803 698001 964939 1120586 1055027 630064 358356 518019 608430 549585
9478 549585 560257 630884 670657 605085 618762 751278 892180 772191 949687 1262137 1302412
9467 1302412 1397945 1128094 815647 676555 556106 616961 661277 630354 661441 792314
9457 792314 706031 442551 605764 408313 472181 764139 800625 691493 600695 698808 777996
9446 777996 799290 879468 1015498 942632 787353 866481 772462 840398 967073 929673 757896
9435 757896 580324 552558 470160 612679 820291 881258 803833 649074 632113 738823 1073572
9424 1073572 957811 764388 706684 805819 910666 599494 404981 638079 922587 766058
$$ packed form
9498A355026j68317j78822K4334n0140k85478j25129L37247M9275j06696Q2723
9488I34023o0220j75802K66938J55647o5559m24963k71708J59663R0411n8845
9478E49585J0672P0627L9773o5572J3677J32516J40902j19989J77496L12450M0275
9467A302412R5533k69851l12447j39092j20449O0855M4316l0923L1087J30873
9457G92314q6283k63480J63213j97451O3868K91958L6486j09132r0798R8113P9188
9446G77996K1294Q0178J36030p2866j55279P9128r4019O7936J26675l7400j71777
9435G57896j77572k7766q2398J42519K07612O0967p7425j54759j6961J06710L34749
9424A073572j15761j93423n7704R9135J04847l11172j94513K33098K84508j56529
$$ plain form
9414 766058 695171 610283 791738 856470 810220 728666 1023643 1108029 1007995 1078166 1171893
9403 1171893 1040923 943142 820004 774391 796454 838173 794689 801924 940975 1096050 1203875
9392 1203875 1214366 927419 891419 895512 963436 987582 1071568 1140084 890567 934490 896290
9381 896290 847401 600119 621487 811986 937131 975834 981423 849265 831020 876064 855140
9370 855140 649328 631741 792770 1050193 1203340 1336340 1283403 1127832 1252037 1251729 1241530
9359 1241530 999390 934955 1084088 1061785 1037962 889207 968732 1214004 1337087 1387784
9349 1387784 1215137 1034577 1274311 1398559 1229822 1074629 1070123 1372104 1515811 1528793
9339 1528793 1302290 1345844 1378135 1408145 1525075 1734064 1928249 2036168 2141464 2183754
$$ packed form
9414G66058p0887q4888J81455O4732m6250q1554K94977Q4386j00034P0171R3727
9403A171893j30970r7781j23138m5613K2063M1719m3484P235J39051J55075J07825
9392A203875J0491k86947l6000M093O7924K4146Q3986O8516k49517M3923l8200
9381H96290m8889k47282K1368J90499J25145L8703N589j32158j8245M5044k0924
9370H55140k05812j7587J61029K57423J53147J33000n2937j55571J24205l08j0199
9359A241530k42140o4435J49133k2303k3823j48755P9525K45272J23083N0697
9349A387784j72647j80560K39734J24248j68737j55193m506L01981J43707J2982
9339A528793k26503M3554L2291L0010J16930K08989J94185J07919J05296M2290
$$ plain form
9329 2183754 2303099 2469926 2513627 2402984 2603307 2950925 3046820 3112403 3183780 3233338
9319 3233338 3625971 4030249 4323323 4855281 5337318 6027962 6654755 7129096 7878596 8419992
9309 8419992 8829665 9364086 9842272 10413236 10891664 11734802 12470541 12955607 13754808 14673392
9299 14673392 15578046 16570605 17390627 18349251 19505157 20577565 21895937 22981129 24042787
9290 24042787 24888623 25831209 26706753 27533740 28131036 28867285 29579161 29995772 30432437
9281 30432437 30876498 31213907 31570989 32060367 32423646 32499186 32608267 32821495 32921912 33358567
9271 33358567 33815528 34039447 34213251 34316914 34325240 34185159 34311479 34054567 33234179 32611019
9261 32611019 32210785 31670612 30822058 30018716 29365168 28654369 27603367 26554572 25581377
$$ packed form
9329B183754J19345J66827M3701j10643K00323L47618R5895O5583P1377M9558
9319C233338L92633M04278K93074N31958M82037O90644O26793M74341P49500N41396
9309H419992M09673N34421M78186N70964M78428Q43138P35739M85066P99201R18584
9299A4673392R04654R92559Q20022R58624J155906J072408J318372J085192J061658
9290B4042787Q45836R42586Q75544Q26987N97296P36249P11876M16611M36665
9281C0432437M44061L37409L57082M89378L63279P5540J09081K13228J00417M36655
9271C3358567M56961K23919J73804J03663Q326j40081J26320k56912q20388o23160
9261C2611019m00234n40173q48554q03342o53548p10799j051002j048795r73195
$$ plain form
9252 25581377 24785461 24004106 23219374 22571009 21782422 20884929 20208196 19590753 19161185
9243 19161185 18873716 18512605 18305016 18005787 17694348 17634876 17599638 17402218 17275743 17544879
9233 17544879 17903276 18237360 18609225 18798695 19383207 20004125 20486268 21134713 21699363
9224 21699363 22393858 23110745 24104571 25173628 26372877 27813183 29048828 30495087 32151735
9215 32151735 33844383 35247452 36583705 38057648 39427213 40743158 42239598 43841530
9207 43841530 45348011 46653121 47792694 49179278 50144946 50996636 51381023 51609230 51924343
9198 51924343 52437327 52707593 52914326 52856646 52821327 52878493 52866034 52945532 53073013 53044922
9188 53044922 52883109 52721017 52391159 51972829 51675072 51117419 50451508 49798617 49133311
$$ packed form
9252B5581377p95916p81355p84732o48365p88587q97493o76733o17443m29568
9243A9161185k87469l61111k07589k99229l11439n9472l5238j97420j26475K69136
9233A7544879L58397L34084L71865J89470N84512O20918M82143O48445N64650
9224B1699363O94495P16887R93826J069057J199249J440306J235645J446259J656648
9215C2151735J692648J403069J336253J473943J369565J315945J496440J601932
9207D3841530J506481J305110J139573J386584R65668Q51690L84387K28207L15113
9198E1924343N12984K70266K06733n7680l5319N7166j2459P9498J27481k8091
9188E3044922j61813j62092l29858m18330k97757n57653o65911o52891o65306
$$ plain form
9179 49133311 48209478 47240125 46236038 44883756 43324520 41736571 40188646 38341608
9171 38341608 36659666 35117057 33434264 31616453 30214915 28920116 27666753 26628357
9163 26628357 25611653 24418782 23292206 22144133 21375609 20562953 19498157 18438633
9155 18438633 17332681 16438714 15609920 14603528 13449789 12503056 11760458 11258491 10775377
9146 10775377 10498339 10076098 9581505 9036557 8685409 8492530 8282117 7763061 7480569
9137 7480569 7395883 7064211 6656231 6389372 6181511 6059537 5948098 5786634 5569641 5152440
9127 5152440 5083405 5106634 5050362 4860277 4631181 4589312 4633491 4433636 4200187 3653549
9117 3653549 3700857 3842078 3765403 3541373 3358066 3502413 3602359 3611598 3574543 3555521 3399852
$$ packed form
9179D9133311r23833r69353j004087j352282j559236j587949j547925j847038
9171C8341608j681942j542609j682793j817811j401538j294799j253363j038396
9163B6628357j016704j192871j126576j148073p68524q12656j064796j059524
9155A8438633j105952q93967q28794j006392j153739r46733p42598n01967m83114
9146A0775377k77038m22241m94593n44948l51148j92879k10413n19056k82492
9137G480569q4686l31672m07980k66859k07861j21974j11439j61464k16993m17201
9127E152440o9035K3229n6272j90085k29096m1869M4179j99855k33449n46638
9117C653549M7308J41221p6675k24030j83307J44347R9946R239l7055j9022j55669
$$ plain form
9106 3399852 3421363 3329341 3169431 3051676 2849643 2784204 2722291 2760251 2774295 2878563 3027511
9095 3027511 2914480 2730277 2673152 2339034 2276899 2196920 2122069 2251203 2291449 2327762 2193344
9084 2193344 2110985 2201649 2186490 2155826 2048015 2114633 2015069 2046548 1851896 1582189 1614582
9073 1614582 1605630 1739634 1895061 1833943 1965570 2143821 2044052 1852243 1732920 1893809
9063 1893809 1783025 1778200 1745888 1785949 1753865 1778589 1619605 1517822 1455692 1529359 1660704
9052 1660704 1769742 1756792 1777592 1799900 1747960 1795613 1654637 1720608 1858316 1815320 1858113
9041 1858113 2106842 2222174 2140991 2027263 2005675 2212075 2457518 2572674 2464713 2347036
9031 2347036 2492888 2908966 3187959 3083333 3108913 3266075 3558278 3821027 4197675 4489180
$$ packed form
9106C399852K1511r2022j59910j17755k02033o5439o1913L7960J4044J04268J48948
9095C027511j13031j84203n7125l34118o2135p9979p4851J29134M0246L6313j34418
9084B193344q2359R0664j5159l0664j07811O6618r9564L1479j94652k69707L2393
9073A614582q952J34004J55427o1118J31627J78251r9769j91809j19323J60889
9063A893809j10784m825l2312M0061l2084K4724j58984j01783o2130P3667J31345
9052A660704J09038j2950K0800K2308n1940M7653j40976O5971J37708m2996M2793
9041A858113K48729J15332q1183j13728k1588K06400K45443J15156j07961j17677
9031B347036J45852M16078K78993j04626K5580J57162K92203K62749L76648K91505
$$ plain form
9021 4489180 4837212 5483022 6153767 6786029 7393400 8225985 9195854 10466652 11819617
9012 11819617 12968102 14131566 15372007 16361110 17053204 17568552 17599003 17211396 16789249
9003 16789249 16082840 15348446 14541121 13789656 13026078 12515103 12106869 11734197 11533701
8994 11533701 11646766 11978012 12163222 12543331 13189903 14055023 14982335 16123611 17274658
8985 17274658 18362876 19220005 19666823 19921920 20143215 20036984 19513943 18653577 17581051
8976 17581051 16523932 15471444 14700872 13683122 12750329 11919880 11152352 10333447 9783419
8967 9783419 9538946 9225996 9151754 8947473 8729303 8430367 8189958 8048132 8077020 8218710
8957 8218710 8128471 7882947 7978056 8203381 8421592 8559591 9137322 9793909 10453277 10900524
$$ packed form
9021D489180L48032O45810O70745O32262O07371Q32585R69869J270798J352965
9012A1819617J148485J163464J240441R89103O92094N15348L0451l87607m22147
9003A6789249p06409p34394q07325p51465p63578n10975m08234l72672k00496
8994A1533701J13065L31246J85210L80109O46572Q65120R27312J141276J151047
8985A7274658J088218Q57129M46818K55097K21295j06231n23041q60366j072526
8976A7581051j057119j052488p70572j017750r32793q30449p67528q18905n50028
8967I783419k44473l12950p4242k04281k18170k98936k40409j41826K8888J41690
8957H218710r0239k45524R5109K25325K18211J37999N77731O56587O59368M47247
$$ plain form
8947 10900524 11597859 12566489 13840029 15088514 16687617 18596600 20529839 22378855
8939 22378855 24549283 26770152 29015898 31318619 33359486 34974589 36184801 37167856
8931 37167856 37856761 38138177 37822764 37128889 36329034 35604115 35084834 34141242 33016564
8922 33016564 32132637 31200731 30352293 30055144 29804481 29835236 30554053 31733445 33002068
8913 33002068 34534551 36051398 37738870 39411133 40698005 41532177 41943144 42073194 41629097
8904 41629097 40613817 39564294 38189232 36389293 34612693 32894647 31109616 29101656
8896 29101656 27125110 25332163 23620123 22132626 20706526 19550497 18430965 17232837
8888 17232837 16410092 15494247 14724350 14091104 13634377 13299781 13050163 12746276 12518482
$$ packed form
8947A0900524O97335R68630J273540J248485J599103J908983J933239J849016
8939B2378855K170428K220869K245746K302721K040867J615103J210212R83055
8931C7167856O88905K81416l15413o93875p99855p24919n19281r43592j124678
8922C3016564q83927r31906q48438k97149k50663L0755P18817J179392J268623
8913C3002068J532483J516847J687472J672263J286872Q34172M10967J30050m44097
8904D1629097j015280j049523j375062j799939j776600j718046j785031k007960
8896B9101656j976546j792947j712040j487497j426100j156029j119532j198128
8888A7232837q22745r15845p69897o33246m56727l34596k49618l03887k27794
$$ plain form
8879 12518482 12538424 12521827 12441062 12773766 12990538 13135367 13466783 13817105 14342184 14793398
8869 14793398 15417346 16408818 17450487 18593383 19985644 21356587 22641637 24101491
8861 24101491 25472346 27224390 28785722 30256497 31489743 32500261 33222850 33860552
8853 33860552 34279094 34519522 34584974 33995366 33034358 31994182 30895348 29769149 28792826
8844 28792826 27821902 26877321 26457147 26251473 26420411 26676155 27493740 28454284 29662335
8835 29662335 30784207 31586766 32389615 33048729 33324486 33538350 33549807 33285126 32649483
8826 32649483 31861115 31017365 29875744 28496795 26890687 25180704 23460244 21580896
8818 21580896 19937411 18476171 17140552 15897073 14920370 14099753 12981537 12046876 11456924
$$ packed form
8879A2518482J9942j6597q0765L32704K16772J44829L31416L50322N25079M51214
8869A4793398O23948R91472J041669J142896J392261J370943J285050J459854
8861B4101491J370855J752044J561332J470775J233246J010518P22589O37702
8853C3860552M18542K40428O5452n89608r61008j040176j098834j126199r76323
8844B8792826r70924r44581m20174k05674J68938K55744Q17585R60544J208051
8835B9662335J121872Q02559Q02849O59114K75757K13864J1457k64681o35643
8826C2649483p88368q43750j141621j378949j606108j709983j720460j879348
8818B1580896j643485j461240j335619j243479r76703q20617j118216r34661n89952
$$ plain form
8809 11456924 10873238 10538959 10110361 9812224 9345897 9029772 8846221 8656943 8489804
8800 8489804 8208125 7998741 7843871 7765244 7521432 7388145 7428104 7646780 7739678 7692376
8790 7692376 7733082 8109526 8558880 8984845 9390974 9964444 10236312 10589896 10998094 11627684
8780 11627684 12269270 12985253 13324127 13771290 13749091 13694403 13454154 12957907 12352534 11548320
8770 11548320 10617701 9964690 9685198 9400801 8896169 8548526 8216006 8246660 8267441 8364520
8760 8364520 8685696 9085856 9409901 9555873 9945238 10593088 10933315 11179435 11288152 11218169
8750 11218169 11388206 11103579 10669782 10190545 9659956 8891508 8063264 7484093 6695097
8741 6695097 6147939 5812870 5309863 4883943 4532519 4179827 4037214 3698441 3494626 3382430
$$ packed form
8809A1456924n83686l34279m28598k98137m66327l16125j83551j89278j67139
8800H489804k81679k09384j54870p8627k43812j33287L9959K18676R2898m7302
8790G692376M0706L76444M49354M25965M06129N73470K71868L53584M08198O29590
8780A1627684O41586P15983L38874M47163k2199n4688k40249m96247o05373q04214
8770A1548320r30619o53011k79492k84397n04632l47643l32520L0654K0781R7079
8760H364520L21176M00160L24045J45972L89365O47850L40227K46120J08717o9983
8750A1218169J70037k84627m33797m79237n30589p68448q28244n79171p88996
8741F695097n47158l35069n03007m25920l51424l52692j42613l38773k03815j12196
$$ plain form
8731 3382430 2978681 2669077 2630249 2786688 2900257 2689546 2640094 2409250 2390668 2363710
8721 2363710 2249605 2234409 2093106 1813935 1791673 1785879 1719194 1739468 1768265 1633250 1627032
8710 1627032 1855782 1864340 1874327 1739853 1606386 1614907 1613152 1685786 1573776 1332684 1260508
8699 1260508 1311877 1368629 1420949 1146698 1041931 1036682 990836 902769 975089 1045676 1056896
8688 1056896 806227 912561 1290622 1274782 942813 865876 903779 884794 876072 951113 831608
8677 831608 866609 971896 962001 884729 808683 746856 849032 1009170 1081564 875285 690364
8666 690364 739500 787563 651852 412228 281755 400454 425184 572574 832926 818686
8656 818686 710333 644906 786545 677020 468281 487587 662246 716184 661253 666718 575446
$$ packed form
8731C382430m03749l09604l8828J56439J13569k10711m9452k30844j8582k6958
8721B363710j14105j5196j41303k79171k2262n794o6685K0274K8797j35015o218
8710A627032K28750Q558R987j34474j33467Q521j755P2634j12010k41092p2176
8699A260508N1369N6752N2320k74251j04767n249m5846q8067P2320P0587J1220
8688A056896k50669J06334L78061j5840l31969p6937L7903j8985q722P5041j19505
8677H31608L5001J05287r895p7272p6046o1827J02176J60138P2394k06279j84921
8666F90364M9136M8063j35711k39624j30473J18699K4730J47390K60352j4240
8656H18686j08353o5427J41639j09525k08739J9306J74659N3938n4931N465r1272
$$ plain form
8645 575446 518898 535427 442636 553146 626770 606669 662284 701019 642918 799110 936640
8634 936640 887563 795600 503077 282901 559714 668527 567243 402324 352852 210762
8624 210762 237646 345616 439676 423513 524135 556474 577686 607120 705676 679107 570419
8613 570419 287275 311476 490435 645336 675124 756569 735955 749544 605565 596218 890806
8602 890806 847961 804561 864678 887759 774812 629315 817469 844510 926828 896104 774239
8591 774239 737246 1007857 1137708 1124240 877977 801619 921748 1067312 1046552 949740 915118
8580 915118 862063 901817 743192 462123 395827 648539 678273 642876 764224 862027 783099
8569 783099 778709 771380 754635 750601 702285 525706 479065 656742 750606 586283 513416 577098
$$ packed form
8645E75446n6548J6529r2791J10510P3624k0101N5615L8735n8101J56192J37530
8634I36640m9077r1963k92523k20176K76813J08813j01284j64919m9472j42090
8624B10762K6884J07970R4060j6163J00622L2339K1212K9434R8556k6569j08688
8613E70419k83144K4201J78959J54901K9788Q1445k0614J3589j43979r347K94588
8602H90806m2845m3400O0117K3081j12947j45497J88154K7041Q2318l0724j21865
8591G74239l6993K70611J29851j3468k46263p6358J20129J45564k0760r6812l4622
8580I15118n3055L9754j58625k81069o6296K52712K9734l5397J21348R7803p8928
8569G83099m390p329j6745m034m8316j76579m6641J77677R3864j64323p2867O3682
$$ plain form
8557 577098 397409 424719 592923 333634 213557 139535 143342 97424 77913 93361 13480
8546 13480 57643 41400 112930 208381 238012 189639 245223 306337 399956 426352 444695 673401
8534 673401 631030 665193 638155 758278 822546 858167 1243809 1626695 2035425 2177644 2426602
8523 2426602 2327336 2211697 2445567 2348121 1664034 1044386 636515 549008 393707 410758
8513 410758 444657 471339 404302 296520 398652 623676 779805 721855 517581 664315
8503 664315 732577 444999 473774 591108 646010 525930 413136 434130 497605 365143 500601
8492 500601 496693 357682 318552 590550 729768 955870 1020818 1002754 1148782 1616094 2618747
8481 2618747 3574450 4005502 4128877 4029126 4048586 4257903 3812272 2717909 1956719 1500096
$$ packed form
8557E77098j79689K7310J68204k59289j20077p4022L807m5918j9511J5448p9881
8546A3480M4163j6243P1530R5451K9631m8373N5584O1114R3619K6396J8343K28706
8534F73401m2371L4163k7038J20123O4268L5621L85642L82886M08730J42219K48958
8523B426602r9266j15639K33870r7446o84087o19648m07871q7507j55301J7051
8513D10758L3899K6682o7037j07782J02132K25024J56129n7950k04274J46734
8503F64315O8262k87578K8775J17334N4902j20080j12794K0994O3475j32462J35458
8492E00601l908j39011l9130K71998J39218K26102O4948j8064J46028M67312J002653
8481B618747R55703M31052J23375r9751J9460K09317m45631j094363p61190m56623
$$ plain form
8471 1500096 1081809 1079505 940530 967478 867238 816978 852610 656501 694243 589116 764265
8460 764265 753837 690416 588762 403083 299206 295256 331183 494490 356618 399687 373728
8449 373728 352293 263187 337768 698249 1051647 963943 938248 877150 809500 767982 828609
8438 828609 942638 1221342 1772785 2328951 2532297 2605199 2330703 2237809 2018524 1770786
8428 1770786 1277556 831181 741693 773401 686132 598541 610997 695303 558072 626720 701509
8417 701509 679561 467258 509682 600805 605921 620563 351332 193169 66198 99195 263415
8406 263415 270876 273080 368706 396100 628027 719769 359970 163785 229768 337190 151197
8395 151197 184339 280948 357071 311166 151680 144493 192287 233849 146326 385409 534153
$$ packed form
8471A500096m18287k304j38975K6948j00240n0260L5632j96109L7742j05127J75149
8460G64265j0428o3421j01654j85679j03877l950L5927J63307j37872M3069k5959
8449C73728k1435q9106P4581L60481L53398q7704k5695o1098o7650m1518O0627
8438H28609J14029K78704N51443N56166K03346P2902k74496r2894k19285k47738
8428A770786m93230m46375q9488L1708q7269q7591J2456Q4306j37231O8648P4789
8417G01509k1948k12303M2424R1123N116J4642k69231j58163j26971L2997J64220
8406B63415P461K204R5626K7394K31927R1742l59799j96185O5983J07422j85993
8395A51197L3142R6609P6123m5905j59486p187M7794M1562q7523K39083J48744
$$ plain form
8384 534153 395059 77763 -160034 -119264 -26515 -117780 -124819 -26864 167322 272173 289079
8373 289079 333711 196631 96788 -126752 -68793 163156 215966 314510 363773 220169 156126
8362 156126 141750 166072 102656 230627 258924 180567 94088 41214 -48197 -170964 52991
8351 52991 286078 307032 107177 135704 152219 150681 -12867 -25920 250895 242869 82180
8340 82180 -183426 -153967 -193391 -49419 -70700 -194299 -169877 168192 516878 500676 380617
8329 380617 389748 156834 -20248 111838 227126 281176 209306 101887 162642 57445 -3615
8318 -3615 -153204 -108699 54380 2782 -88927 91339 165108 78446 82746 -59868 61986
8307 61986 131967 -184236 -235200 -173875 -45368 85334 107661 158314 312581 262752 40538
$$ packed form
8384E34153j39094l17296k37797M0770R2749r1265p039R7955J94186J04851J6906
8373B89079M4632j37080r9843k23540N7959K31949N2810R8544M9263j43604o4043
8362A56126j4376K4322o3416J27971K8297p8357q6479n2874q9411j22767K23955
8351E2991K33087K0954j99855K8527J6515j538j63548j3053K76815q026j60689
8340H2180k65606K9459l9424J43972k1281j23599K4422L38069L48686j6202j20059
8329C80617R131k32914j77082J32086J15288N4050p1870j07419O0755j05197o1060
8318c615j49589M4505J63079n1598r1709J80266P3769q6662M300j42614J21854
8307F1986O9981l16203n0964O1325J28507J30702K2327N0653J54267m9829k22214
$$ plain form
8296 40538 36684 37158 -181293 -133693 15270 51179 63268 -20379 14747 29678 137589 73334
8284 73334 6833 159754 185975 74625 161520 235562 473527 311235 115642 67124 37054
8273 37054 254100 283066 149198 182348 -56175 -197037 -244809 -104470 41305 28695 110250
8262 110250 200531 95794 -80509 120089 94733 53444 195580 94394 200367 104258
8252 104258 60012 94811 69115 52641 79494 -27280 103716 225243 80722 82352 137170
8241 137170 65329 -133604 -60944 136338 138300 124651 -15266 -221946 -180030 -217085 -242864
8230 -242864 -269510 60004 43726 -9003 64023 45883 -41851 82010 174715 282704 302152
8219 302152 282966 115231 74043 111789 122807 56581 -34703 -321608 -288766 79976 172514
$$ packed form
8296D0538l854M74k18451M7600J48963L5909J2089q3647L5126J4931J07911o4255
8284G3334o6501J52921K6221j11350Q6895P4042K37965j62292j95593m8518l0070
8273C7054K17046K8966j33868L3150k38523j40862m7772J40339J45775j2610Q1555
8262A10250R0281j04737j76303K00598k5356m1289J42136j01186J05973r6109
8252A04258m4246L4799k5696j6474K6853j06774J30996J21527j44521J630N4818
8241A37170p1841j98933P2660J97282J962j3649j39917k06680M1916l7055k5779
8230b42864k6646L29514j6278n2729P3026j8140q7734J23861R2705J07989J9448
8219C02152j9186j67735m1188L7746J1018o6226r1284k86905L2842L68742R2538
$$ plain form
8208 172514 -141310 -285746 -401400 -322898 -145283 73203 -19723 -157246 -198811 -108959
8198 -108959 -3466 59608 72190 -13078 29545 91938 67200 194085 94223 43832 56939
8187 56939 211196 125711 64476 191516 104968 18292 -10167 151967 184609 149979 343925
8176 343925 255765 120748 193262 164195 53815 169493 217667 197675 361823 321867 230358
8165 230358 42719 -16276 146433 165946 198426 272141 250399 230966 193401 163166 263750
8154 263750 86312 -191918 -275296 -183537 -108657 -211144 -45437 43737 7950 -51489 -61547
8143 -61547 207481 221113 318326 421918 307902 178592 114600 13849 -295566 -343973 -272878
8132 -272878 -57515 -12907 46084 185587 311696 257079 132413 184649 350302 218827
$$ packed form
8208A72514l13824j44436j15654P8502J77615K18486r2926j37523m1565Q9852
8198a08959J05493O3074J2582q5268M2623O2393k4738J26885r9862n0391J3107
8187E6939J54257q5485o1235J27040q6548q6676k8459J62134L2642l4630J93946
8176C43925q8160j35017P2514k9067j10380J15678M8174j9992J64148l9956r1509
8165B30358j87639n8995J62709J9513L2480P3715k1742j9433l7565l0235J00584
8154B63750j77438k78230q3378R1759P4880j02487J65707Q9174l5787n9439j0058
8143f1547K69028J3632R7213J03592j14016j29310o3992j00751l09415m8407P1095
8132b72878K15363M4608N8991J39503J26109n4617j24666N2236J65653j31475
$$ plain form
8122 218827 128962 244140 172281 91240 170230 196354 114304 333569 462222 354353 166337
8111 166337 93432 258958 184422 34878 40746 41458 -129067 -94926 -224654 -107977 117226
8100 117226 396925 594575 496083 219774 62496 -33304 105873 54699 92259 211570
8090 211570 258167 255261 336690 286221 112492 173646 273199 362605 495908 388635 131426
8079 131426 205630 175148 164529 166991 153928 154487 304117 290055 162404 148670 130853 30998
8067 30998 -18279 135285 132474 -45246 -79569 100570 -41075 52207 49696 -108009 -120314
8056 -120314 28219 242383 232399 320245 271736 82353 21011 14390 -97603 -321343 -394550
8045 -394550 -241135 -23982 -81179 -19664 -92989 -55296 -40433 -153168 -59159 -236532 -422942
$$ packed form
8122B18827q9865J15178p1859q1041P8990K6124q2050K19265J28653j07869j88016
8111A66337p2905J65526p4536j49544N868P12j70525L4141j29728J16677K25203
8100A17226K79699J97650r8492k76309j57278r5800J39177n1174L7560J19311
8090B11570M6597k906Q1429n0469j73729O1154R9553Q9406J33303j07273k57209
8079A31426P4204l0482j0619K462j3063N59J49630j4062j27651j3734j7817r9855
8067C0998m9277J53564k811j77720l4323J80139j41645R3282k511j57705j2305
8056a20314J48533K14164r984Q7846m8509j89383o1342o621j11993k23740p3207
8045c94550J53415K17153n7197O1515p3325L7693J4863j12735R4009j77373j86410
$$ plain form
8034 -422942 -466019 -204077 -78779 45090 38100 -59290 2281 44555 86884 100393 46121
8023 46121 -82620 -68123 62213 38946 165250 169034 162423 82029 208277 432990 352207
8012 352207 348383 279760 191281 85432 -75527 -148872 -145815 1430 100722 193615 400868
8001 400868 526763 512911 399816 183387 133814 204849 91046 232713 470371 471996 356610
7990 356610 380001 234579 344649 290699 184149 82765 139817 358880 573679 617802
7980 617802 815864 791613 865009 813251 604023 577594 479154 644025 655193 562355 448765
7969 448765 467753 583065 500624 715820 861020 560046 253542 223884 80217 71950 172759
7958 172759 276876 413409 232861 175884 86976 -104878 -181167 111273 260564 276860
$$ packed form
8034d22942m3077K61942J25298J23869o990r7390O1571M2274M2329J3509n4272
8023D6121j28741J4497J30336k3267J26304L784o611q0394J26248K24713q0783
8012C52207l824o8623q8479j05849j60959p3345L057J47245R9292R2893K07253
8001D00868J25895j3852j13095k16429m9573P1035j13803J41667K37658J625j15386
7990C56610K3391j45422J10070n3950j06550j01384N7052K19063K14799M4123
7980F17802J98062k4251P3396n1758k09228k6429r8440J64871J1168r2838j13590
7969D48765J8988J15312q2441K15196J45200l00974l06504k9658j43667q267J00809
7958A72759J04117J36533j80548n6977q8908j91854p6289K92440J49291J6296
$$ plain form
7948 276860 175690 326400 473189 405779 289281 159999 38010 102679 154525 112380
7938 112380 198554 396852 436399 364488 424258 543255 552108 498565 363235 375980 240159
7927 240159 242829 226828 358950 368593 471787 310557 455792 285364 206539 331930 419962
7916 419962 445510 230427 149182 195853 254752 373099 306638 256595 230585 180376 318355
7905 318355 424341 356172 134029 -41438 61070 258946 332073 249750 -53409 -257640
7895 -257640 -142448 -52377 -23907 -87811 -86242 -9523 -51654 -131910 -49438 -202830 -178997
7884 -178997 17322 248323 131223 -57660 -103596 -40459 -178433 -441948 -231929 -136636
7874 -136636 -184897 -94002 -34686 -38672 39891 -147598 -182732 -57241 -122827 -163267 -59054
$$ packed form
7948B76860j01170J50710J46789o7410j16498j29282j21989O4669N1846m2145
7938A12380Q6174J98298L9547p1911N9770J18997Q853n3543j35330J2745j35821
7927B40159K670j6001J32122R643J03194j61230J45235j70428p8825J25391Q8032
7916D19962K5548k15083q1245M6671N8899J18347o6461n0043k6010n0209J37979
7905C18355J05986o8169k22143j75467J02508J97876P3127q2323l03159k04231
7895b57640J15192R0071K8470o3904J569P6719m2131q0256Q2472j53392K3833
7884a78997J96319K31001j17100j88883m5936O3137j37974k63515K10019R5293
7874a36636m8261R0895N9316l986P8563j87489l5134J25491o5586m0440J04213
$$ plain form
7863 -59054 -81727 -47281 -20721 540 191017 112083 220902 315020 128443 -119848 -1156
7852 -1156 58032 -116124 -178954 -154797 -267463 -217898 -51850 83916 53170 135797 95607
7841 95607 35002 63466 133894 380551 371630 186052 114791 -39870 -173650 -104790 15050
7830 15050 -52506 -303977 -253542 -116370 -189133 -154001 -100122 -116364 38244 150336 -47665
7819 -47665 -80803 -152129 -333540 -352525 -186182 -32260 126261 108347 54669 -87093 -21483
7808 -21483 186446 301353 417074 578080 419074 297395 59280 55693 183391 79563
7798 79563 99444 -16712 -73888 -18401 -51852 -78923 -27555 30424 -85293 25973 213596
7787 213596 210900 66287 -57561 -96685 -81528 149380 32829 17198 98903 27174 29263
$$ packed form
7863e9054k2673L4446K6560K1261J90477p8934J08819R4118j86577k48291J18692
7852a156N9188j74156o2830K4157j12666M9565J66048J35766l0746Q2627m0190
7841I5607o0605K8464P0428K46657q921j85578p1261j54661j33780O8860J19840
7830A5050o7556k51471N0435J37172p2763L5132N3879j6242J54608J12092j98001
7819d7665l3138p1326j81411j8985J66343J53922J58521j7914n3678j41762O5610
7808b1483K07929J14907J15721J61006j59006j21679k38115l587J27698j03828
7798G9563J9881j16156n7176N5487l3451k7071N1368N7979j15717J11266J87623
7787B13596k696j44613j23848l9124J5157K30908j16551j5631Q1705p1729K089
$$ plain form
7776 29263 196024 119591 -28073 -15283 87549 107899 -40159 -137766 -198743 -265228 -347558
7765 -347558 34037 10893 -159614 -208839 -24019 199439 224657 89607 282150 214910
7755 214910 231040 186854 -6199 -230918 -65245 28221 -99652 -195257 280199 608945
7745 608945 395952 202339 180357 157478 290710 291594 201761 160709 75110 -85616 -52051
7734 -52051 -199831 -316301 -192228 -101019 -204254 -204441 25106 91937 6300 -139218 -163831
7723 -163831 -141928 -31143 -66920 -94369 -37346 170349 350414 201054 76959 24706 7911
7712 7911 326821 508390 398012 384830 273496 171839 211989 274627 248830 264569 166036
7701 166036 -17377 -172721 -37725 -29607 -109487 -84533 62543 47062 -31107 -138271 -262180
$$ packed form
7776B9263J66761p6433j47664J2790J02832K0350j48058r7607o0977o6485q2330
7765c47558L81595k3144j70507m9225J84820K23458K5218j35050J92543o7240
7755B14910J6130m4186j93053k24719J65673R3466j27873r5605M75456L28746
7745F08945k12993j93613k1982k2879J33232Q84q9833m1052q5599j60726L3565
7734e2051j47780j16470J24073R1209j03235j87K29547O6831q5637j45518k4613
7723a63831K1903J10785l5777k7449N7023K07695J80065j49360j24095n2253j6795
7712G911L18910J81569j10378j3182j11334j01657M0150O2638k5797J5739r8533
7701A66036j83413j55344J34996Q118p9880K4954J47076j5481p8169j07164j23909
$$ plain form
7690 -262180 -189555 -204232 -303475 -300886 -210057 -85567 -58611 -51997 -73225 -37022 -84945 -287659
7678 -287659 -504938 -236165 -13722 -14190 -156066 -179934 -57183 -68982 -92550 -142954 -125695
7667 -125695 -86351 -161692 -81770 -28151 -43232 -106186 -14721 21235 57973 90827 -46294
7656 -46294 -212403 -303268 -91242 -15511 -98038 -85980 44732 149621 190809 238860 549559
7645 549559 406628 347838 387062 424326 321423 349086 222912 38301 -149654 -94120 92825
7634 92825 206335 113213 -91473 -150935 101603 56782 -55891 -116833 -6022 -173995 -190146
7623 -190146 -239117 -213022 -44091 196642 30239 14917 139654 282098 327032 125994
7613 125994 22659 37736 -76699 -190616 -178379 8170 207161 119164 39447 10330 -87512
$$ packed form
7690b62180P2625j4677r9243K589R0829J24490K6956O614k1228L6203m7923k02714
7678b87659k17279K68773K22443m68j41876k3868J22751j1799k3568n0404J7259
7667a25695L9344p5341P9922N3619j5081o2954R1465L5956L6738L2854j37121
7656d6294j66109r0865K12026P5731q2527J2058J30712J04889M1188M8051L10699
7645E49559j42931n8790L9224L7264j02903K7663j26174j84611j87955N5534J86945
7634I2825J13510r3122k04686n9462K52538m4821j12673o0942J10811j67973j6151
7623a90146m8971K6095J68931K40733j66403j5322J24737J42444M4934k01038
7613A25994j03335J5077j14435j13917J2237J86549J98991q7997p9717k9117r7842
$$ plain form
7602 -87512 -92054 -9030 56019 114286 229723 326702 340299 228794 210302 145093 -103336
7591 -103336 -324772 -494027 -330214 -118804 -49434 -69382 -57879 -25608 -70240 -117701 45364
7580 45364 188591 144285 64587 24809 208520 153164 242872 22109 -264094 -149325 -180004
7569 -180004 72500 339810 459798 198329 -172865 -266472 -81321 92463 2970 55795
7559 55795 152323 -4640 -155975 -321486 -54010 109676 250399 131609 -1411 -148351
7549 -148351 -302601 -343492 -342653 -290070 -296214 -205415 -40725 81106 36496 130990 241108
7538 241108 278479 281517 21375 -73230 -71228 -3593 -50649 -211355 -283068 -352897 -188675
7527 -188675 26540 77311 33525 42092 -170950 -79867 335357 415339 378424 101337 -101871
$$ packed form
7602h7512m542Q3024O5049N8267J15437R6979J3597j11505j8492o5209k48429
7591a03336k21436j69255J63813K11410O9370j9948J1503L2271m4632m7461J63065
7580D5364J43227m4306p9698l9778J83711n5356Q9708k20763k86203J14769l0679
7569a80004K52504K67310J19988k61469l71194r3607J85151J73784q9493N2825
7559E5795R6528j56963j51335j65511K67476J63686J40723j18790j33020j46940
7549a48351j54250m0891Q39N2583o144R0799J64690J21831m4610R4494J10118
7538B41108L7371L038k60142r4605K002O7635m7056j60706p1713o9829J64222
7527a88675K15215N0771m3786Q567k13042R1083M15224P9982l6915k77087k03208
$$ plain form
7516 -101871 -176199 -157572 -114500 -125976 -119279 -141559 -276206 -127461 -38365 16920 -1942
7505 -1942 113908 64723 -23726 -118665 -263658 -311374 -104952 -81999 -78794 28678 100932
7494 100932 10847 2225 41459 -204333 -231279 -162068 -69736 -29954 -107948 -120692 -136124 -55280
7482 -55280 -219169 -271792 -215213 -167621 -74690 82854 270917 372456 262401 122354 251278
7471 251278 74930 -88640 -75571 -17241 42109 61288 114835 54968 -35381 37815 114273
7460 114273 80850 -16200 -95275 -74718 -51018 68739 27157 -118490 -290208 -300917 -48388
7449 -48388 42576 896 25070 -27997 -56706 -277581 -405899 -424479 -227957 -190914 -178959
7438 -178959 -115702 -98126 -73677 -15951 -88121 -221059 -60242 -88265 -64520 -26334 -109254
$$ packed form
7516a01871p4328J8627M3072j1476O697k2280j34647J48745Q9096N5285j8862
7505a942J15850m9185q8449r4939j44993m7716K06422K2953L205J07472P2254
7494A00932r0085q622L9234k45792k6946O9211R2332L9782p7994j2744j5432Q0844
7482e5280j63889n2623N6579M7592R2931J57544J88063J01539j10055j40047J28924
7471B51278j76348j63570J3069N8330N9350J9179N3547n9867r0349P3196P6458
7460A14273l3423r7050p9075K0557K3700J19757m1582j45647j71718j0709K52529
7449d8388R0964m1680K4174n3067k8709k20875j28318j8580J96522L7043J1955
7438a78959O3257J7576K4449N7726p2170j32938J60817k8023K3745L8186q2920
$$ plain form
7427 -109254 113650 241285 144257 203297 74588 12258 69572 193455 85956 -6644 -20316
7416 -20316 91944 176982 95850 45410 153283 166501 77599 -2841 6883 177654 263438
7405 263438 170802 97090 -8212 -3811 -96920 -141176 -35659 61925 82066 231565 250011
7394 250011 247340 42782 -72061 -29772 -67814 31299 183354 213243 317931 291189 201310
7383 201310 78390 -15360 -66110 -40726 -186320 -202560 -233880 -234510 -306173 -308094 -369140 -222397
7371 -222397 -101074 -83765 -86794 10517 73064 238592 365865 144831 95733 102986 -30545
7360 -30545 -28903 -227553 -198576 -138687 86624 89583 2534 -34890 -44397 -21987 -49709 -50647
7348 -50647 -52093 -119648 -203163 99896 203456 286622 402738 365746 197876 15684 -92542
$$ packed form
7427a09254K22904J27635r7028N9040j28709o2330N7314J23883j07499r2600j3672
7416b0316J12260Q5038q1132n0440J07873J3218q8902q0440R724J70771Q5784
7405B63438r2636p3712j05302M401r3109m4256J05517R7584K0141J49499J8446
7394B50011k671k04558j14843M2289l8042R9113J52055K9889J04688k6742q9879
7383B01310j22920r3750n0750K5384j45594j6240l1320o30p1663j921o1046J46743
7371b22397J21323J7309l029R7311O2547J65528J27273k21034m9098P253j33531
7360c0545J642j98650K8977N9889K25311K959q7049l7424r507K2410k7722r38
7348e0647j446o7555q3515L03059J03560Q3166J16116l6992j67870j82192j08226
$$ plain form
7337 -92542 -89163 -21175 -55910 -107567 -184604 -188414 -289256 -442342 -386773 -80842 -33584 -3565
7325 -3565 86144 66724 -44502 -47847 50070 102944 172124 267880 231450 -14276 -268067 -370591
7313 -370591 -352225 -201510 73539 87618 32083 -190462 -45916 58242 -29412 -156370
7303 -156370 -54549 -150866 -180544 -65383 57022 11728 113360 11595 -163864 -116164
7293 -116164 -24052 362040 261584 174967 -59843 8285 -128340 -70435 115630 37739 85049
7282 85049 134785 38847 -39926 -77880 -176059 -74873 -158132 -266236 -326504 -413680 -314289
7271 -314289 -220899 -252392 -271176 -141251 25725 58658 -2696 -55752 45970 296887 109066
7260 109066 17674 -16255 -44659 79799 135479 389965 585354 350707 360678 360841 232517
$$ packed form
7337i2542L379O7988l4735n1657p7037l810j00842j53086N5569L05931M7258L0019
7325c565Q9709j9420j11226l345R7917N2874O9180R5756l6430k45726k53791j02524
7313c70591J8366J50715K75049J4079n5535k22545J44546J04158q7654j26958
7303a56370J01821r6317k9678J15161J22405m5294J01632j01765j75459M7700
7293a16164R2112L86092j00456q6617k34810O8128j36625N7905J86065p7891M7310
7282H5049M9736r5938p8773l7954r8179J01186q3259j08104o0268q7176R9391
7271c14289R3390l1493j8784J29925J66976L2933o1354n3056J01722K50917j87821
7260A09066r1392l3929k8404J24458N5680K54486J95389k34647R971J63j28324
$$ plain form
7249 232517 206004 214058 37711 -17425 84000 133095 18232 -27900 -107640 88454 218220
7238 218220 245243 241247 444085 347382 128009 20061 -81843 -19855 -120223 -315201 -228222
7227 -228222 -208573 -255969 -128987 73893 169003 243599 86754 34458 -79374 -70376 -214080
7216 -214080 -423797 -266019 -160939 -42263 -4840 57143 -80173 -86675 164981 317331
7206 317331 220081 14802 -245892 -208211 -185373 -259823 -167030 -63148 -8176 -62622 -44093
7195 -44093 44171 177722 191079 15339 -307932 -334968 -245165 -241551 -168358 65159 66786
7184 66786 3864 -198003 -313457 -121048 116511 2573 -209247 -183023 -118737 -51781 37616
7173 37616 87457 -69152 -154689 -298766 -399964 -244995 -307615 -332641 -155027 -193573 -231591
$$ packed form
7249B32517k6513Q054j76347n5136J01425M9095j14863m6132p9740J96094J29766
7238B18220K7023l996K02838r6703k19373j07948j01904O1988j00368j94978Q6979
7227b28222J9649m7396J26982K02880R5110P4596j56845n2296j13832Q998j43704
7216b14080k09717J57778J05080J18676L7423O1983j37316o502K51656J52350
7206C17331r7250k05279k60694L7681K2838p4450R2793J03882N4972n4446J8529
7195d4093Q8264J33551J3357j75740l23271k7036Q9803L614P3193K33517J627
7184F6786o2922k01867j15454J92409K37559j13938k11820K6224O4286O6956Q9397
7173C7616M9841j56609q5537j44077j01198J54969o2620k5026J77614l8546l8018
$$ plain form
7162 -231591 -83494 -41968 -99507 -235137 20799 35068 -62237 129286 243308 122669
7152 122669 54580 82700 32033 -56633 65448 123449 74506 -18906 -372335 -586223 -633338
7141 -633338 -409282 62192 178831 24614 -187342 -114122 -128778 -334962 -258475 -149939
7131 -149939 -58567 -66425 -125025 -234892 -145015 28009 -91431 -172080 -206305 -51669 37338
7120 37338 -10945 -244600 -256123 -119067 32933 -43477 -172038 -218802 -296339 -328230 -236188
7109 -236188 -64039 4670 -81998 -94023 -156476 -141058 65504 206849 228973 -126536 -368005
7098 -368005 -218834 255058 374948 246724 266103 268143 123203 80425 99501 333496 348946
7087 348946 137877 108381 14507 -151460 -170143 -123924 -21456 49958 151850 117848 58171
$$ packed form
7162b31591J48097M1526n7539j35630K55936J4269r7305J91523J14022j20639
7152A22669o8089K8120n0667q8666J22081N8001m8943r3412l53429k13888m7115
7141f33338K24056M71474J16639j54217k11956P3220j4656k06184P6487J08536
7131a49939R1372p858n8600j09867Q9877J73024j19440q0649l4225J54636Q9007
7120C7338m8283k33655j1523J37056J52000p6410j28561m6764p7537l1891R2042
7109b36188J72149O8709q6668j2025o2453J5418K06562J41345K2124l55509k41469
7098c68005J49171M73892J19890j28224J9379K040j44940m2778J9076K33995J5450
7087C48946k11069k9496r3874j65967j8683M6219J02468P1414J01892l4002n9677
$$ plain form
7076 58171 138334 134820 -83515 -57501 46204 86007 186454 341077 282012 24542 -172311
7065 -172311 -185936 -112812 -34364 -170146 -99314 -1537 -27273 -68926 -66663 -27645 -44803 -131418
7053 -131418 5681 168652 190944 210837 290912 308336 292522 130142 140670 504872 398644
7042 398644 -92250 -121914 75292 248387 146487 141181 317285 539285 479454 408674 438369
7031 438369 399803 141823 -28450 21628 155982 207726 208189 63071 111926 107007 58817
7020 58817 56275 43350 15419 -99505 -276999 -330424 -296643 -40011 -25016 -261303 -180508
7009 -180508 57792 69288 22583 -37568 12226 -129632 -320654 -253160 -198845 -406006 -359602
6998 -359602 -234022 -280363 -187093 20019 103995 133343 231210 63009 -48374 -41870 141711
$$ packed form
7076E8171Q0163l514k18335K6014J03705L9803J00447J54623n9065k57470j96853
7065a72311j3625P3124P8448j35782P0832R7777k5736m1653K263L9018j7158q6615
7053a31418J37099J62971K2292J9893Q0075J7424j5814j62380J0528L64202j06228
7042C98644m90894k9664J97206J73095j01900n306J76104K22000n9831p0780K9695
7031D38369l8566k57980j70273N0078J34354N1744M63j45118M8855m919m8190
7020E8817k542j2925k7931j14924j77494n3425L3781K56632J4995k36287Q0795
7009a80508K38300J1496m6705o0151M9794j41858j91022O7494N4315k07161M6404
6998c59602J25580m6341R3270K07112Q3976K9348R7867j68201j11383O504J83581
$$ plain form
6987 141711 -10079 -61096 -66228 -120925 -79299 -66332 -5327 111453 32970 -45296 -246536
6976 -246536 -260860 -123473 -17432 80781 156973 279143 259492 220976 -48519 -12028 104061
6965 104061 33840 -101564 -2498 141251 258842 350810 462494 389244 250824 148791
6955 148791 182771 120661 104055 161237 15058 7276 -80420 25024 246476 185280 92746
6944 92746 -96931 -128098 -130146 -165382 -213435 -251880 -212605 -308145 -323470 -262953 -195944 -67259
6932 -67259 -216132 -28276 82523 -86636 -191427 -105822 -122932 -291055 -251596 -159712 -219719
6921 -219719 -206644 -123575 38564 147117 72006 103193 7419 -20391 -22597 4114 28816
6910 28816 -23934 -94897 -37530 -113966 -40884 -46329 10670 55636 37895 158373 196871 229809
$$ packed form
6987A41711j51790n1017n132n4697M1626J2967O1005J16780p8483p8266k01240
6976b46536j4324J37387J06041R8213P6192J22170j9651l8516k69495L6491J16089
6965A04061p0221j35404R9066J43749J17591R1968J11684p3250j38420j02033
6955A48791L3980o2110j6606N7182j46179p782q7696J05444K21452o1196r2534
6944I2746j89677l1167k048l5236m8053l8445L9275r5540j5325O0517O7009J28685
6932f7259j48873J87856J10799j69159j04791Q5605j7110j68123L9459R1884o0007
6921b19719J3075Q3069J62139J08553p5111L1187r5774k7810k206K6711K4702
6910B8816n2750p0963N7367p6436P3082n445N6999M4966j7741J20478L8498L2938
$$ plain form
6898 229809 189487 107207 182327 18629 -155672 -136896 12943 -37008 -231511 -199648 28918
6887 28918 137924 157648 212037 109744 -67977 -128672 -38759 -11181 102084 365484 340709
6876 340709 118107 -90593 -145744 -280514 -312013 -151362 133782 271869 232262 45899
6866 45899 -7008 89241 91547 -25656 -46108 -150056 -244143 -128204 -14832 -64536 -32723
6855 -32723 102425 132349 -67271 112655 257414 98945 56081 189920 219226 95696
6845 95696 -10991 -91757 -147232 -276954 -210060 -31192 3195 25261 -123601 -283309 -220663
6834 -220663 -69935 189380 134806 -34039 60692 13793 -12172 -90056 -119103 -145682 -124663
6823 -124663 -109584 -330112 -165993 -84078 -128761 58726 158711 64141 -95349 -24690 -36352
$$ packed form
6898B29809m0322q2280P5120j63698j74301J8776J49839m9951j94503L1863K28566
6887B8918J09006J9724N4389j02293j77721o0695Q9913K7578J13265K63400k4775
6876C40709k22602k08700n5151j34770l1499J60651K85144J38087l9607j86363
6866D5899n2907R6249K306j17203k0452j03948r4087J15939J13372m9704L1813
6855c2723J35148K9924j99620J79926J44759j58469m2864J33839K9306j23530
6845I5696j06687q0766n5475j29722O6894J78868L4387K2066j48862j59708O2646
6834b20663J50728K59315n4574j68845R4731m6899k5965p7884k9047k6579K1019
6823a24663J5079k20528J64119Q1915m4683J87487R9985r4570j59490P0659j1662
$$ plain form
6812 -36352 -48696 -47671 -18250 -2311 88179 7526 -150449 -98285 -55494 -122867 -238258 -367636
6800 -367636 15530 40297 -147806 -472870 -573766 -472600 -249727 -74697 57842 72330
6790 72330 40061 128397 -92849 20882 115144 129918 113780 -98793 29317 127280 167115
6779 167115 135138 147855 388964 387849 183862 213574 68630 -130792 35242 71639 -9469
6768 -9469 -26240 -82778 51150 52232 -126066 35951 96724 73694 -99388 61433 165111
6757 165111 169961 -96084 -119444 115640 197050 21997 34285 50673 -86287 -80046 -56492
6746 -56492 102293 231949 145469 94190 57657 11361 126210 264574 111080 -84401 -256139
6735 -256139 -448918 -295832 -225393 -111876 -70155 -42965 -93544 -98050 -8258 -3857 -23772
$$ packed form
6812c6352j2344J025K9421J5939R0490q0653j57975N2164M2791o7373j15391j29378
6800c67636L83166K4767j88103l25064j00896J01166K22873J75030J32539J4488
6790G2330l2269Q8336k21246J13731R4262J4774j6138k12573J28110R7963L9835
6779A67115l1977J2717K41109j115k03987K9712j44944j99422J66034L6397q1108
6768i469j6771n6538J33928J082j78298J62017O0773k3030j73082J60821J03678
6757A65111M850k66045k3360K35084Q1410j75053J2288J6388j36960O241K3554
6746e6492J58785J29656q6480n1279l6533m6296J14849J38364j53494j95481j71738
6735b56139j92779J53086P0439J13517M1721K7190n0579m506Q9792M401j9915
$$ plain form
6724 -23772 36035 75151 32996 187543 274812 30706 -61781 -130820 -106225 58547 -27105
6713 -27105 77153 122883 -38107 32808 -40199 -341283 -377235 -383521 -199866 49959 224244
6702 224244 173961 95460 296497 239206 114463 59106 -160684 -246215 75100 266423 255340
6691 255340 99070 14113 112253 127896 -126931 -162775 123290 109485 -99249 -150749 -273075
6680 -273075 -195473 -66291 -186669 -165240 -41862 -140047 -286803 -55327 78646 58006
6670 58006 107630 141376 74711 349132 321848 116421 -178415 -395128 -171609 -133054 -89105
6659 -89105 -285361 -134295 -30615 9948 -59011 -66660 -113956 45306 85151 122582 -38857
6648 -38857 -87520 15351 75465 28931 -112206 -334551 -146475 -42801 127798 84113 -158849
$$ packed form
6724b3772N9807L9116m2155J54547Q7269k44106r2487o9039K4595J64772q5652
6713b7105J04258M5730j60990P0915p3007l01084l5952o286J83655K49825J74285
6702B24244n0283p8501K01037n7291j24743n5357k19790q5531L21315J91323j1083
6691B55340j56270q4957R8140J5643k54827l5844K86065j3805k08734n1500j22326
6680b73075P7602J29182j20378K1429J23378r8185j46756K31476J33973k0640
6670E8006M9624L3746o6665K74421k7284k05427k94836k16713K23519L8555M3949
6659h9105j96256J51066J03680M0563o8959p649m7296J59262L9845L7431j61439
6648c8857m8663J02871O0114m6534j41137k22345J88076J03674J70599m3685k42962
$$ plain form
6637 -158849 -122426 -302677 -268320 -154247 -256757 -353923 -276776 -163112 -122433 -70891 104969
6626 104969 164702 58033 6174 -31233 -120761 -157026 -192185 -235998 -233393 -184807 -42734
6615 -42734 18909 253461 333040 455077 520000 305577 198190 169027 72759 -18306 114579
6604 114579 143891 36838 30378 13877 35455 16336 46794 134820 126637 302910 508342
6593 508342 441755 339883 347922 238930 97660 -805 -106833 -148906 -103378 170683 301628
6582 301628 194411 -645 111257 30204 191443 385852 329197 170688 182259 -15730
6572 -15730 -36361 107815 198221 93846 127306 73864 105393 183467 219078 153450 116703
6561 116703 70113 23804 159917 177247 141875 108965 260914 363340 246191 152127 265998
$$ packed form
6637a58849L6423j80251L4357J14073j02510r7166P7147J13664M0679N1542J75860
6626A04969N9733j06669n1859l7407q9528l6265l5159m3813K605M8586J42073
6615d2734O1643K34552P9579J22037O4923k14423j07387k9163r6268r1065J32885
6604A14579K9312j07053o460j6501K1578j9119L0458Q8026q183J76273K05432
6593E08342o6587j01872Q039j08992j41270r8465j06028m2073M5528K74061J30945
6582C01628j07217j95056J11902q1053J61239J94409n6655j58509J1571j97989
6572a5730k0631J44176R0406j04375L3460n3442L1529P8074L5611o5628l6747
6561A16703m6590m6309J36113J7330l5372l2910J51949J02426j17149r4064J13871
$$ plain form
6550 265998 308703 267847 -33074 -203145 -78049 222225 192966 97536 329913 705007
6540 705007 518435 210380 1423 -163565 -180869 -161801 4815 -132860 -335232 -267290
6530 -267290 -290530 -206770 -185800 -250745 -269187 -58795 241642 227362 223973 333037 409895
6519 409895 198404 22700 -54780 -46534 -71432 -186068 -182543 -152521 -77454 208830 211505
6508 211505 95499 -166630 71260 111206 -67558 -48195 -133632 -144095 18044 165180
6498 165180 331587 292251 237810 66723 76320 167451 -127849 -123558 44987 -25879 -211340
6487 -211340 -166008 -152272 -187584 -228793 -170119 161338 201560 133416 -60131 -87432 -197202
6476 -197202 -367216 -311932 -384997 -376592 -311130 -256821 -265390 -50251 54174 38276 -57394
$$ packed form
6550B65998M2705m0856l00921j70071J25096L00274k9259r5430K32377L75094
6540G05007j86572l08055k08957j64988j7304J9068J66616j37675k02372O7942
6530b67290k3240Q3760K0970o4945j8442K10392L00437j4280l389J09064P6858
6519D09895k11491j75704p7480Q246k4898j14636L525L0022P5067K86284K675
6508B11505j16006k62129K37890L9946j78764J9363q5437j0463J62139J47136
6498A65180J66407l9336n4441j71087R597R1131k95300M291J68545p0866j85461
6487b11340M5332J3736l5312m1209N8674L31457M0222o8144j93547k7301j09770
6476a97202j70014N5284p3065Q405O5462N4309q569K15139J04425j5898r5670
$$ plain form
6465 -57394 -116103 -295671 -597080 -445583 -302300 -156085 -121807 -167577 -52297 222944
6455 222944 173119 77412 16235 -72438 -203268 -218616 -185705 -89359 146724 158232 160661
6444 160661 49640 -151292 -145625 -49031 35059 -86049 -203424 -348518 -263542 -124020 -89746
6433 -89746 -112931 9252 49467 83130 23287 60442 83 -2211 -103051 -153787 11974
6422 11974 170128 193269 -69385 -76801 236160 345254 228767 233584 106786 -184128 -312148
6411 -312148 -32440 107645 -86425 -93572 371 145034 156791 169804 -129751 -48197 -127753
6400 -127753 -227113 5391 92102 -20284 -106519 26009 -132341 -60537 30256 94358 69587
6389 69587 71359 -65280 -51730 -31221 -211140 -286299 -295485 -370014 -478811 -254580 -169737
$$ packed form
6465e7394n8709j79568l01409J51497J43283J46215L4278m5770J15280K75241
6455B22944m9825r5707o1177q8673j30830j5348L2911R6346K36083J1508K429
6444A60661j11021k00932N667R6594Q4090j21108j17375j45094Q4976J39522L4274
6433h9746k3185J22183M0215L3663n9843L7155o0359k294j00840n0736J65761
6422A1974J58154K3141k62654p416L12961J09094j16487M817j26798k90914j28020
6411c12148K79708J40085j94070p147R3943J44663J1757J3013k99555Q1554p9556
6400a27753r9360K32504Q6711j12386q6235J32528j58350P1804R0793O4102k4771
6389F9587J772j36639J3550K0509j79919p5159r186p4529j08797K24231Q4843
$$ plain form
6378 -169737 -97785 79841 120801 40741 -213399 -212729 -119829 -380863 -502974 -145048 154422
6367 154422 197056 -25314 -78671 -187393 -255545 -233896 -384404 -230698 -110427 -145519 -115972
6356 -115972 -182870 -338141 -325764 -226135 -47080 40971 116943 141427 143412 80828 -100343
6345 -100343 94174 364285 427668 525933 401020 340931 345654 249233 243368 211563 220929 166251
6333 166251 109262 186042 305768 212865 344143 329598 101834 14222 17141 32438 -30893
6322 -30893 -247556 -234646 102307 218907 67846 44384 -36682 149933 232686 344868 361279
6311 361279 370491 18476 -180132 -315073 -394700 -170858 69783 88949 92542 16398 -151407
6300 -151407 -266484 -302175 -186861 142423 60539 -134964 -282540 -1527 7323 -166238
$$ packed form
6378a69737P1952J77626M0960q0060k54140O70R2900k61034j22111L57926K99470
6367A54422M2634k22370n3357j08722o8152K1649j50508J53706J20271l5092K9547
6356a15972o6898j55271J2377R9629J79055Q8051P5972K4484J985o2584j81171
6345a00343J94517K70111O3383R8265j24913o0089M723r6421n865l1805R366n4678
6333A66251n6989P6780J19726r2903J31278j4545k27764q7612K919J5297o3331
6322c0893k16663J2910L36953J16600j51061k3462q1066J86615Q2753J12182J6411
6311C61279R212l52015j98608j34941p9627K23842K40641J9166L593p6144j67805
6300a51407j15077l5691J15314L29284q1884j95503j47576K81013Q850j73561
$$ plain form
6290 -166238 -487793 -489862 -486259 -477941 -483681 -567408 -462089 -217658 -35730 -62468 -288961
6279 -288961 -264426 -160988 -233186 61349 350422 432465 407984 378624 90486 -138399 -176866
6268 -176866 -168455 -70344 110246 237390 321120 225017 89949 26141 -9712 57980 124649
6257 124649 67250 -173725 -274876 -45551 224682 83298 206405 97696 57891 180592
6247 180592 125328 228122 402750 328180 237461 207311 172908 386532 323812 211728 104135
6236 104135 -176902 -236680 -81956 262890 440744 333572 37068 187719 269141 150704
6226 150704 -36001 -246161 -193350 21415 105405 131172 98422 -103410 -79060 -59699 -83450
6215 -83450 -73636 -69842 29270 213791 50337 -70207 -27765 -127811 -156443 -19431 82279
$$ packed form
6290a66238l21555k069L603Q318n740q3727J05319K44431J81928k6738k26493
6279b88961K4535J03438p2198K94535K89073Q2043k4481k9360k88138k28885l8467
6268a76866Q411R8111J80590J27144Q3730r6103j35068o3808l5853O7692O6669
6257A24649n7399k40975j01151K29325K70233j41384J23107j08709l9805J22701
6247A80592n5264J02794J74628p4570r0719l0150l4403K13624o2720j12084j07593
6236A04135k81037n9778J54724L44846J77854j07172k96504J50651Q1422j18437
6226A50704j86705k10160N2811K14765Q3990K5767l2750k01832K4350J9361k3751
6215h3450R814L794R9112J84521j63454j20544M2442j00046k8632J37012J01710
$$ plain form
6204 82279 6218 40346 92843 260254 408240 287667 134568 98192 60305 -43374 -82234
6193 -82234 -59018 -129862 -130463 -109800 23434 -95822 -192732 -72555 72400 70644 47222 -47736
6181 -47736 -42754 -73861 25253 18633 -23428 -39046 -84041 -205677 -130751 -16267 105337 19844
6169 19844 173120 281159 169881 -30102 -1588 9780 35776 215958 128012 5858 143300
6158 143300 9211 -278318 -239959 -189447 -23781 66207 21100 -36697 -284469 -469439 -362842
6147 -362842 -157791 147434 242045 102852 -33040 -228323 -276137 -191910 -17795 96237
6137 96237 146195 187381 90808 168292 102865 -94278 -40423 -34549 217755 310795 -33954
6126 -33954 -90658 -80942 227748 445574 455676 353777 422915 589236 379964 6518 -165161
$$ packed form
6204H2279p6061L4128N2497J67411J47986j20573j53099l6376l7887j03679l8860
6193h2234K3216p0844o01K0663J33234j19256r6910J20177J44955j756k3422r4958
6181d7736M982l1107R9114o620m2061j5618m4995j21636P4926J14484J21604q5493
6169A9844J53276J08039j11278j99983K8514J1368K5996J80182q7946j22154J37442
6158A43300j34089k87529L8359N0512J65666Q9988m5107n7797k47772j84970J06597
6147c62842K05051L05225R4611j39193j35892j95283m7814Q4227J74115J14032
6137I6237M9958M1186r6573P7484o5427j97143N3855N874K52304R3040l44749
6126c3954n6704R716L08690K17826J0102j01899O9138J66321k09272l73446j71679
$$ plain form
6115 -165161 -42625 -124106 -80548 -143851 -163775 156461 47146 -265931 -140808 -150200 111936
6104 111936 128205 239015 362098 216182 205284 129960 172221 230653 109148 132418 188993
6093 188993 63392 -83873 -154057 -96810 38044 178386 185262 122368 5751 -19802 -82106
6082 -82106 -6022 68498 75725 -203286 -314862 -285344 -219573 -229885 -182818 -340255 -370097
6071 -370097 -361317 -167992 -173880 -42555 75653 -26512 -120464 -141483 -509122 -531096 -487146
6060 -487146 -457248 -363973 -120333 131193 230059 195956 63534 155955 -31440 -176923 -279091
6049 -279091 -222157 -32182 119251 -63290 -15425 -136804 6249 114072 -58972 105020
6039 105020 -96597 -145345 43633 -9243 -126209 80797 105187 47170 -15872 -202299 -253069
$$ packed form
6115a65161J22536q1481M3558o3303j9924L20236j09315l13077J25123r392K62136
6104A11936J6269J10810J23083j45916j0898p5324M2261N8432j21505K3270N6575
6093A88993j25601j47265p0184N7247J34854J40342O876o2894j16617k5553o2304
6082h2106P6084P4520P227k79011j11576K9518O5771j0312M7067j57437k9842
6071c70097Q780J93325n888J31325J18208j02165r3952k1019l67639k1974M3950
6060d87146K9898R3275K43640K51526R8866l4103j32422R2421j87395j45483j02168
6049b79091N6934J89975J51433j82541M7865j21379J43053J07823j73044J63992
6039A05020k01617m8748J88978n2876j16966K07006K4390n8017o3042j86427n0770
$$ plain form
6028 -253069 -41842 129921 176604 289919 260013 203518 130282 137909 7747 104376 285063
6017 285063 365844 299639 296392 333240 102624 21325 -146450 -57388 -58067 52462 202298
6006 202298 71424 -83252 -94355 -169651 -116436 -87821 -102989 -1547 98508 -46037 79327
5995 79327 122686 31685 -145004 -151829 -20739 -56915 24733 200986 268392 259165 174727 -8605
5983 -8605 -153563 -14316 148259 243709 195648 186863 97792 -16587 -109079 -230522 -243287
5972 -243287 -225411 50900 209217 61367 -92684 -292653 -81084 169067 176397 141794
5962 141794 262699 216684 -33706 -168771 -109004 71155 158004 41809 232055 295189
5952 295189 191603 76085 76046 120768 46304 -28054 -222008 -208596 -192152 -261210 -352105 -338709
$$ packed form
6028b53069K11227J71763M6683J13315k9906n6495p3236P627j30162R6629J80687
6017B85063Q0781o6205l247L6848k30616q1299j67775Q9062o79J10529J49836
6006B02298j30874j54676j1103p5296N3215K8615j5168J01442J00055j44545J25364
5995G9327M3359r1001j76689o825J31090l6176Q1648J76253O7406r227q4438j83332
5983h605j44958J39247J62575R5450m8061q785q9071j14379r2492j21443j2765
5972b43287J7876K76311J58317j47850j54051j99969K11569K50151P330l4603
5962A41794J20905m6015k50390j35065N9767J80159Q6849j16195J90246O3134
5952B95189j03586j15518l9M4722p4464p4358j93954J3412J6444o9058r0895J3396
$$ plain form
5940 -338709 -289616 -393390 -358729 -165155 18281 84941 281642 410148 438808 462280 314310
5929 314310 207325 200411 29098 64078 142232 175528 28047 -188282 -236829 -141731 -150858
5918 -150858 -170315 -232064 -93992 -16173 -140333 -195610 -211375 -130332 -112273 -139842 60258
5907 60258 377368 427693 367458 260945 41879 -130856 -151126 -161285 -113965 -146099 -256942
5896 -256942 -113167 54632 24289 -55945 91884 143297 170138 58329 -82383 112814
5886 112814 224150 214171 255809 167679 70618 210109 339250 218330 84756 123142 146161
5875 146161 152563 -9210 -51423 133013 294843 185627 34412 48652 -172518 -324881
5865 -324881 -282154 -45246 58534 38121 -67036 -220985 -306899 -234133 -161074 -200780 -61001
$$ packed form
5940c38709M9093j03774L4661J93574J83436O6660J96701J28506K8660K3472j47970
5929C14310j06985o914j71313L4980P8154L3296j47481k16329m8547R5098r127
5918a50858j9457o1749J38072P7819j24160n5277j5765Q1043J8059k7569K00100
5907F0258L17110N0325o0235j06513k19066j72735k0270j0159M7320l2134j10843
5896b56942J43775J67799l0343q0234J47829N1413K6841j11809j40712J95197
5886A12814J11336r979M1638q8130r7061J39491J29141j20920j33574L8386K3019
5875A46161O402j61773m2213J84436J61830j09216j51215J4240k21170j52363
5865c24881M2727K36908J03780k0413j05157j53949q5914P2766P3059l9706J39779
$$ plain form
5854 -61001 17853 8097 41629 310829 431095 396601 100791 -135205 -160378 -124412 19785
5843 19785 -74241 26448 -23403 -22991 -92156 26115 73428 -90769 -19652 48252 56867 59782
5831 59782 -127234 -233624 -177975 196261 301209 99074 -99638 -97000 -243096 -197244 -157589
5820 -157589 -100793 129199 305273 228567 130516 144766 213536 315268 355773 397141 241143
5809 241143 -11849 51449 -18431 90122 96449 -193164 -209647 -103048 -123563 -203399 -150491
5798 -150491 -135704 -29020 131295 -15756 -230385 -284242 -38425 85226 151373 193820
5788 193820 210614 182497 54478 73400 -25624 84908 52053 -12890 -185565 -214838 -94407
5777 -94407 -65563 -239233 -279111 -173130 -60482 -235638 -360351 -217121 -87303 -130001
$$ packed form
5854f1001P8854r756L3532K69200J20266l4494k95810k35996k5173L5966J44197
5843A9785r4026J00689m9851M12o9165J18271M7313j64197P1117O7904Q615K915
5831E9782j87016j06390N5649L74236J04948k02135j98712K638j46096M5852L9655
5820a57589N6796K29992J76074p6706r8051J4250O8770J01732M0505M1368j55998
5809B41143k52992O3298o9880J08553O327k89613j6483J06599k0515p9836N2908
5798a50491J4787J06684J60315j47051k14629n3857K45817J23651O6147M2447
5788A93820J6794k8117j28019J8922r9024J10532l2855o4943j72675k9273J20431
5777i4407K8844j73670l9878J05981J12648j75156j24713J43230J29818m2698
$$ plain form
5767 -130001 -291352 -394099 -300515 -241570 -166803 -104252 -160389 -423150 -372544 -120528 46940
5756 46940 162695 302075 364675 373233 210616 118690 -106273 -112170 -190990 -128400 -152385
5745 -152385 -173584 -155128 -276756 -439394 -436979 -307607 -55564 12335 2371 -9946 -84016
5734 -84016 50366 155438 219674 372198 414807 435558 401516 395545 301449 229007 213405
5723 213405 36047 96165 65363 162897 25822 -25570 -155830 -198734 -139266 -12365 34937
5712 34937 21625 -1786 42444 172612 258139 33805 -316436 -221988 9999 30020 -31478
5701 -31478 51508 172187 -12458 -59626 55570 -66429 -260441 -401146 -257159 -23583
5691 -23583 -10122 78629 -7018 69925 143225 39712 51080 -79480 -163707 -168665 -242841 -291139
$$ packed form
5767a30001j61351j02747R3584N8945P4767O2551n6137k62761N0606K52016J67468
5756D6940J15755J39380O2600Q558j62617r1926k24963n897p8820O2590k3985
5745a52385k1199J8456j21628j62638K415J29372K52043O7899r964j2317p4070
5734h4016J34382J05072O4236J52524M2609K0751l4042n971r4096p2442j5602
5723B13405j77358O0118l0802R7534j37075n1392j30260m2904N9468J26901M7302
5712C4937j3312k3411M4230J30168Q5527k24334l50241R4448K31987K0021o1498
5701c1478Q2986J20679j84645m7168J15196j21999j94012j40705J43987K33576
5691b3583J3461Q8751q5647P6943P3300j03513J1368j30560q4227m958p4176m8298
$$ plain form
5679 -291139 -372752 -266579 -169741 -124647 -295488 -239198 -179133 -125841 -26546 48366 4507
5668 4507 -16035 -24210 -10948 -136255 -333555 -251397 -73682 -119983 -324116 -384415 -390442 -605482
5656 -605482 -467259 -142685 25323 159302 302849 169343 115430 35266 59222 63534 144782
5645 144782 351598 366803 65577 13624 290 61683 -90579 -141331 -65410 -96123 15746
5634 15746 167540 37796 33939 -55533 -199197 -252243 -262026 -139204 -41561 14736 96760
5623 96760 82483 88352 162891 305685 219317 -14722 -399879 -489217 -376342 -364684 -139847
5612 -139847 17881 -6138 -207033 -150406 41889 113929 189193 99712 120058 108863 99445
5601 99445 11244 -94663 -251896 -243086 -41941 -512 -157226 -91463 103224 266885 115137
$$ packed form
5679b91139q1613J06173R6838M5094j70841N6290O0065N3292R9295P4912m3859
5668D507k0542q175J3262j25307j97300Q2158J77715m6301k04133o0299o027k15040
5656f05482J38223L24574J68008J33979J43547j33506n3913q0164K3956M312Q1248
5645A44782K06816J5205l01226n1953j3334O1393j52262n0752P5921l0713J11869
5634A5746J51794j29744l857q9472j43664n3046r783J22822R7643N6297Q2024
5623I6760j4277N869P4539J42794q6368k34039l85157q9338J12875J1658K24837
5612a39847J57728k4019k00895N6627J92295P2040P5264q9481K0346j1195r418
5601I9445q8201j05907j57233Q810K01145M1429j56714O5763J94687J63661j51748
$$ plain form
5590 115137 110717 186374 188010 222488 245209 143207 125174 251724 233619 274485 349750 177420
5578 177420 112708 225438 329408 432451 571595 425026 166494 27203 -144610 -192481
5568 -192481 61045 77474 22227 290870 367632 144553 127351 3654 66175 180412 145577
5557 145577 -74897 -418417 -607362 -593848 -392531 -28205 80543 -132726 -219852 -139198
5547 -139198 -271426 -261216 -22176 139812 65274 -58721 -320278 -357159 -311903 -211296
5537 -211296 -242117 -232779 -211697 -146907 43869 143085 223732 186395 58864 60637 183779
5526 183779 85503 134807 -16628 63020 142856 24437 -15047 96328 -11364 -103491 -154306
5515 -154306 -162713 115789 26392 -186698 -109067 -217706 -187130 54798 113094 226275 218125
$$ packed form
5590A15137m420P5657J636L4478K2721j02002j8033J26550j8105M0866P5265j72330
5578A77420o4712J12730J03970J03043J39144j46569k58532j39291j71813m7871
5568a92481K53526J6429n5247K68643P6762k23079j7202j23697O2521J14237l4835
5557A45577k20474l43520j88945J3514K01317L64326J08748k13269q7126Q0654
5547a39198j32228J0210K39040J61988p4538j23995k61557l6881M5256J00607
5537b11296l0821R338K1082O4790J90776R9216Q0647l7337j27531J773J23142
5526A83779r8276M9304j51435P9648P9836j18419l9484J11375j07692r2127n0815
5515a54306q407K78502q9397k13090P7631j08639L0576K41928N8296J13181q150
$$ plain form
5504 218125 220889 144184 38055 -18173 60099 161275 39986 251441 510387 552336 325782
5493 325782 145036 42872 -100870 -33646 -4176 79172 62667 -8061 -44277 123472 106256
5482 106256 -133525 -143020 -160096 -73250 -36495 44916 -35390 -26044 90278 224300 235889
5471 235889 299998 134519 6283 -52857 130704 190146 43028 239294 212037 -127794
5461 -127794 -168413 -57808 -152350 -245359 -235285 -169097 -273529 -209953 32675 30787 30960 -33581
5449 -33581 -144092 -100463 -68886 27090 29199 149885 208561 102001 -171555 11524 71483
5438 71483 28587 191939 345061 288071 222193 113045 69096 -113221 37005 212678 181699
5427 181699 142234 103733 -243206 -224352 -139265 -156883 -14923 75071 47694 -141537 -322511
$$ packed form
5504B18125K764p6705j06129n6228P8272J01176j21289K11455K58946M1949k26554
5493C25782j80746j02164j43742O7224K9470Q3348j6505p0728l6216J67749j7216
5482A06256k39781r495j7076Q6846L6755Q1411q0306R346J16322J34022J1589
5471B35889O4109j65479j28236n9140J83561N9442j47118J96266k7257l39831
5461a27794m0619J10605r4542r3009J0074O6188j04432O3576K42628j888J73o4541
5449c3581j10511M3629L1577R5976K109J20686N8676j06560k73556J83079N9959
5438G1483m2896J63352J53122n6990o5878j09148m3949j82317J50226J75673l0979
5427A81699l9465l8501l46939J8854Q5087j7618J41960Q9994k7377j89231j80974
$$ plain form
5416 -322511 -262992 57552 241617 297203 308614 180219 144629 221545 296446 -5723 -125370
5405 -125370 -206800 -38601 120309 82392 13646 131566 76024 11574 -165760 -104580 30731
5394 30731 94353 -81396 29821 178668 22519 -108582 -119229 -173788 -237602 -188426 -152456
5383 -152456 51728 132260 210229 155160 -37344 -70833 -154118 -78903 12224 11061 -17612
5372 -17612 -171275 -94301 -101258 -110754 -76089 -23845 -97298 -240917 -260617 -344007 -359513 -309215
5360 -309215 -186489 -160915 -299536 -61774 191751 57365 102145 246890 124615 109974
5350 109974 13997 -101042 6889 66458 209001 250935 124942 104027 128215 28068 -30777
5339 -30777 159044 170720 105696 263504 214651 -50127 -50726 -240533 -154882 -56665 -341
$$ packed form
5416c22511N9519L20544J84065N5586J1411j28395l5590P6916P4901l02169j19647
5405a25370q1430J68199J58910l7917o8746J17920n5542o4450j77334O1180J35311
5394C0731O3622j75749J11217J48847j56149j31101j0647n4559o3814M9176L5970
5383a52456K04184Q0532P7969n5069j92504l3489q3285P5215R1127j163k8673
5372a7612j53663P6974o957r496L4665N2244p3453j43619j9700q3390j5506N0298
5360c09215J22726K5574j38621K37762K53525j34386M4780J44745j22275j4641
5350A09974r5977j15039J07931N9569J42543M1934j25993k0915K4188j00147n8845
5339c0777J89821J1676o5024J57808m8853k64778n99j89807Q5651R8217N6324
$$ plain form
5328 -341 -47163 100526 22339 -17238 -33808 -45203 -221292 -349060 -285121 -260197 -176461 -89335
5316 -89335 125237 -103797 -347249 -229768 -143803 -89974 -115445 -84927 -60039 -233866 -242412
5305 -242412 -245777 -295218 -354659 -174634 -43455 49500 253665 127908 -898 -87448 -187471
5294 -187471 -96048 -169046 -194982 -63213 35102 56894 -15871 -8691 162229 99235 -79205
5283 -79205 -210159 -210717 -40673 -49799 94973 19868 201839 347660 257497 147845 -2563
5272 -2563 -127256 -44942 -2601 -113081 -45790 -13353 -219784 -80081 -79890 -303236 -305025 -200545
5260 -200545 -25467 128899 16626 35205 133891 11437 -62250 -37671 36422 95426 19423
5249 19423 -17908 -179216 -280688 -411509 -216800 -225814 -226337 -174592 24952 -161369 -544414
$$ packed form
5328c41m6822J47689p8187l9577j6570j1395j76089j27768O3939K4924Q3736Q7126
5316h9335K14572k29034k43452J17481Q5965N3829k5471L0518K4888j73827q546
5305b42412l365m9441n9441J80025J31179R2955K04165j25757j28806q6550j00023
5294a87471R1423p2998k5936J31769R8315K1792p2765P180J70920o2994j78440
5283g9205j30954n58J70044r126J44772p5105J81971J45821r0163j09652j50408
5272b563j24693Q2314M2341j10480O7291L2437k06431J39703J91k23346j789J04480
5260b00545J75078J54366j12273J8579R8686j22454p3687K4579P4093N9004p6003
5249A9423l7331j61308j01472j30821J94709r014n23N1745J99544j86321l83045
$$ plain form
5238 -544414 -578035 -486240 -296026 -149664 -119346 -87605 -185954 -104467 188372 116850 65845
5227 65845 242358 289521 42992 -64223 100867 180265 300371 309604 230912 113088 177630
5216 177630 275540 195724 123746 190196 217180 5282 -115758 -53579 156675 330276 11987
5205 11987 -191048 -132131 45840 26165 -76297 -145832 22498 208926 -18459 -23377 96496
5194 96496 112545 58596 -46226 -51071 -296232 -257169 -220109 -193778 70297 199526 239893
5183 239893 321620 429005 422536 282548 24095 -135797 -216686 -185673 -19543 87686 252931
5172 252931 276696 519870 387908 218292 112057 -30985 -110252 -255582 -83198 183438
5162 183438 227723 189096 11322 -55794 -238747 -266589 4525 129774 29486 -17529 19817
$$ packed form
5238e44414l3621R1795J90214J46362L0318L1741r8349Q1487K92839p1522n1005
5227F5845J76513M7163k46529j07215J65090P9398J20106R233p8692j17824O4542
5216A77630R7910p9816p1978O6450K6984k11898j21040O2179K10254J73601l18289
5205A1987k03035N8917J77971j9675j02462o9535J68330J86428k27385m918J19873
5194I6496J6049n3949j04822m845k45161L9063L7060K6331K64075J29229M0367
5183B39893Q1727J07385o469j39988k58453j59892q0889L1013J66130J07229J65245
5172B52931K3765K43174j31962j69616j06235j43042p9267j45330J72384K66636
5162A83438M4285l8627j77774o7116j82953k7842K71114J25249j00288m7015L7346
$$ plain form
5151 19817 52095 121834 38282 -116431 -257719 -150715 -10051 138100 214774 184158 41364
5140 41364 -199367 -174863 -57176 -99832 -109165 -86023 -113521 -95590 42923 154973 17722
5129 17722 -213601 -294915 17671 174174 219083 291989 202746 2444 -39242 -122145 -183720
5118 -183720 -96529 55888 38587 -90903 -282933 -217639 -128367 -82696 -99482 -214170 -189890
5107 -189890 -91445 -239221 -255589 63248 -97106 -165629 -134891 -91165 -41168 -195423 -301024
5096 -301024 -266902 -106263 -113043 -20457 -48201 -78352 26069 355422 396136 241701 140419
5085 140419 -91953 -252079 -321411 -168924 29848 -20507 -135425 -180199 -76677 -169484
5075 -169484 -221257 -272277 -444708 -241299 -236083 -175583 -277221 -184084 49888 -10039 -113069
$$ packed form
5151A9817L2278O9739q3552j54713j41288J07004J40664J48151P6674l0616j42794
5140D1364k40731K4504J17687m2656r333K3142k7498J7931J38513J12050j37251
5129A7722k31323q1314L12586J56503M4909P2906q9243k00302m1686q2903o1575
5118a83720Q7191J52417j7301j29490j92030O5294Q9272M5671j6786j14688K4280
5107a89890R8445j47776j6368L18837j60354o8523L0738M3726M9997j54255j05601
5096c01024L4122J60639o780R2586k7744l0151J04421L29353M0714j54435j01282
5085A40419k32372j60126o9332J52487J98772n0355j14918m4774J03522r2807
5075a69484n1773n1020j72431K03409N216O0500j01638R3137K33972n9927j03030
$$ plain form
5064 -113069 -62372 121208 172870 77103 -91685 30704 117009 -34320 -69843 149736 226641
5053 226641 -16834 -44270 -21602 -41610 -66832 148121 165217 4147 -92273 59659 -66062
5042 -66062 -73989 -134004 -277327 -199739 27485 199912 251328 316084 175082 151440 57492
5031 57492 -72814 81227 154633 38513 -42086 -19124 -166992 -183494 -128052 -182355 -258248
5020 -258248 -266047 -38877 -85592 -289887 -294748 -118069 -158395 -52336 225858 157440 254354
5009 254354 246980 -8235 -158548 -358912 -403985 -289232 -213826 81789 47693 -249282 -187511
4998 -187511 -249165 -298845 -528133 -556842 -499928 -405898 -245772 -326138 -378267 -223606 -154819
4987 -154819 -285924 -162318 23882 -161366 -341790 -256225 -121210 95544 486071 575015
$$ packed form
5064a13069N0697J83580N1662r5767j68788J22389Q6305j51329l5523K19579P6905
5053B26641k43475k7436K2668k0008k5222K14953J7096j61070r6420J51932j25721
5042f6062p927o0015j43323P7588K27224J72427N1416O4756j41002k3642r3948
5031E7492j30306J54041P3406j16120q0599K2962j47868j6502N5442n4303p5893
5020b58248p799K27170m6715k04295m861J76679m0326J06059K78194o8418R6914
5009B54354p374k55215j50313k00364m5073J14753P5406K95615l4096k96975O1771
4998a87511o1654m9680k29288k8709N6914R4030J60126q0366n2129J54661O8787
4987a54819j31105J23606J86200j85248j80424Q5565J35015K16754L90527Q8944
$$ plain form
4977 575015 242184 -34520 -183287 -350116 -378445 -187618 118901 295078 122374 57297
4967 57297 -139114 -210458 -127843 -89073 -184658 -172715 61492 168689 44127 16080 -23842
4956 -23842 -34691 -14024 -99730 -55913 35752 109568 33796 -90722 44370 191725 138958
4945 138958 102357 30742 -93723 -25374 72697 -46592 -177197 -75584 -121789 -205434 -187611
4934 -187611 -239093 -318838 -239356 -69070 -25784 -37127 -72288 -243421 -178599 -12102 132143
4923 132143 89461 44312 142860 144479 74012 194258 336240 135403 14921 -61494 -91392
4912 -91392 -203010 -205008 -303175 -238937 -132591 -151805 -204982 -229841 -241801 -102697 16789
4901 16789 -30511 47401 68107 -24003 -20382 -84895 -85289 -66164 -141916 -344924 -281240 -221984
$$ packed form
4977E75015l32831k76704j48767j66829k8329J90827L06519J76177j72704o5077
4967E7297j96411p1344Q2615L8770r5585J1943K34207J07197j24562k8047l9922
4956b3842j0849K0667q5706M3817R1665P3816p5772j24518J35092J47355n2767
4945A38958l6601p1615j24465O8349R8071j19289j30605J01613m6205q3645J7823
4934a87611n1482p9745P9482J70286M3286j1343l5161j71133O4822J66497J44245
4923A32143m2682m5149R8548J619p0467J20246J41982k00837j20482p6415k9898
4912i1392j11618j998r8167O4238J06346j9214n3177k4859j1960J39104J19486
4901A6789m7300P7912K0706r2110L621o4513l94J9125p5752k03008O3684N9256
$$ plain form
4889 -221984 -105186 186322 166913 -144715 -498659 -412490 -113834 -298456 -196810 -13724
4879 -13724 123906 146270 112009 99970 81695 59060 -1524 -84255 -192643 -209410 -118886
4868 -118886 -97207 -112560 -59990 -34991 -3587 -68375 5593 -131416 -134771 64244 146149
4857 146149 74524 80804 198475 233246 63641 -96318 -175095 -59423 -47013 86885 92126
4846 92126 79681 123966 36508 137043 71965 121730 169687 106838 -170929 -297531 -246832
4835 -246832 -66938 -47121 -134418 -206007 -367843 -322167 -110976 41166 123449 164466 88965
4824 88965 142261 283580 205682 250192 396250 343589 295953 158004 89889 333015 458858
$$ packed form
4889b21984J16798K91508j9409l11628l53944Q6169K98656j84622J01646J83086
4879a3724J37630K2364l4261j2039j8275k2635o0584q2731j08388j6767R0524
4868a18886K1679j5353N2570K4999L1404o4788P3968j37009l355J99015Q1905
4857A46149p1625O280J17671L4771j69605j59959p8777J15672J2410J33898N241
4846I2126j2445M4285q7458J00535o5078M9765M7957o2849k77767j26602N0699
4835b46832J79894J9817q7297p1589j61836M5676K11191J52142Q2283M1017p5501
4824H8965N3296J41319p7898M4510J46058n2661m7636j37949o8115K43126J25843
$$ [...]
##END NTUPLES=NMR SPECTRUM
##END=
