##TITLE=Analysis number 321136
Compound Code mo 07854
Book Reference 472/161/7
Project Code adrs
Chemist Name victoriam
##JCAMPDX= 6.0         $$ Bruker NMR JCAMP-DX V2.0
##DATA TYPE= NMR SPECTRUM
##DATA CLASS= NTUPLES
##ORIGIN= Bruker BioSpin GmbH
##OWNER= nmr
$$ XWIN-NMR		Version 3.5
$$ Wed Jul 26 11:04:02 2006 GMT Daylight Time (UT+1h)  MAYBRIDGE\nmr@NMR_250MHZ
##.OBSERVE FREQUENCY= 250.131544655141
##.OBSERVE NUCLEUS= ^1H
##.ACQUISITION MODE= SIMULTANEOUS (DQD)
##.ACQUISITION SCHEME= undefined
##.AVERAGES= 16
##.DIGITISER RES= 18
##SPECTROMETER/DATA SYSTEM= dpx250
##.PULSE SEQUENCE= zg30
##.SOLVENT NAME= CDCl3
##.SHIFT REFERENCE= (INTERNAL, CDCl3, 0, 16.522)
##AUDIT TRAIL= $$ (NUMBER, WHEN, WHO, WHERE, WHAT)
$$ ##TITLE= Audit trail, XWIN-NMR		Version 3.5
$$ ##JCAMPDX= 5.01
$$ ##ORIGIN= Bruker BioSpin GmbH
$$ ##OWNER= nmr
$$ C:\u/data/dgb/nmr/ADRS/3600/pdata/1/auditp.txt
$$ ##AUDIT TRAIL=  $$ (NUMBER, WHEN, WHO, WHERE, WHAT)
(   1,<2006-07-26 11:03:39.10 +100>,<MAYBRIDGE\nmr>,<NMR_250MHZ>,
      <created by zg, POWCHK disabled, PULCHK disabled
       configuration hash MD5:
       E2 DF 36 D8 04 B2 41 60 5A D7 A3 38 5A 4B D0 FE
       data hash MD5: 64K
       59 57 42 6D A3 21 50 4D AC 94 92 AC C7 B0 98 0D>)
(   2,<2006-07-26 11:03:51.91 +100>,<MAYBRIDGE\nmr>,<NMR_250MHZ>,
      <Start of raw data processing
       ef LB = 0.3 FT_mod = 6 PKNL = 1 SI = 32K 
       data hash MD5: 32K
       2E 1E 4F 34 26 FB 5D CC 11 26 02 9E 50 F4 7C 1F>)
(   3,<2006-07-26 11:03:53.45 +100>,<MAYBRIDGE\nmr>,<NMR_250MHZ>,
      <apk 
       data hash MD5: 32K
       B1 7B B0 EA BE ED 86 F2 A0 ED 20 14 86 69 F3 71>)
(   4,<2006-07-26 11:03:54.29 +100>,<MAYBRIDGE\nmr>,<NMR_250MHZ>,
      <abs ABSG = 5 
       data hash MD5: 32K
       1A 74 74 27 87 F1 E0 0D 79 52 63 8C AA 0F CA E7>)
$$ ##END=
$$ 
$$ hash MD5
$$ EA F3 96 F0 0E 31 0B 80 AD 6F 0E 96 5F FE 89 12
##$RELAX= 
##$RELAX= 
##$RELAX= 
##$RELAX= 
##$RELAX= 
##$RELAX= 
##$RELAX= 
$$ Bruker specific parameters
$$ --------------------------
##$DU= <C:\u>
##$EXPNO= 3600
##$NAME= <ADRS>
##$PROCNO= 1
##$TYPE= <nmr>
##$USER= <dgb>
##$AMP= (0..31)
100 100 100 100 100 100 100 100 100 100 100 100 100 100 100 100 100 100 
100 100 100 100 100 100 100 100 100 100 100 100 100 100 
##$AQSEQ= 0
##$AQ_mod= 3
##$AUNM= <au_zg>
##$AUTOPOS= <17 >
##$BF1= 250.13
##$BF2= 250.13
##$BF3= 250.13
##$BF4= 250.13
##$BF5= 500.13
##$BF6= 500.13
##$BF7= 500.13
##$BF8= 500.13
##$BYTORDA= 1
##$CFDGTYP= 0
##$CFRGTYP= 5
##$CHEMSTR= <none>
##$CNST= (0..31)
1 1 145 1 1 1 1 1 1 1 1 1 1 1 1 1 1 1 1 1 1 1 1 1 1 1 1 1 1 1 1 1 
##$CPDPRG= <>
##$CPDPRG1= <>
##$CPDPRG2= <>
##$CPDPRG3= <>
##$CPDPRG4= <mlev>
##$CPDPRG5= <mlev>
##$CPDPRG6= <mlev>
##$CPDPRG7= <mlev>
##$CPDPRG8= <mlev>
##$CPDPRGB= <>
##$CPDPRGT= <>
##$D= (0..31)
0 1 0 0 0 0 0 0 0 0.06 0 0 0 0 0 0 0.0002 0 0 0 0 0 0 0 0 0 0 0 0 0 0 
0 
##$DATE= 1153908218
##$DBL= (0..7)
120 120 120 120 120 120 120 120 
##$DBP= (0..7)
150 150 150 150 150 150 150 150 
##$DBP07= 0
##$DBPNAM0= <>
##$DBPNAM1= <>
$$ [...]
##$SUBNAM7= <"">
##$SUBNAM8= <"">
##$SUBNAM9= <"">
##$SW= 20.6930455092707
##$SWIBOX= (0..15)
0 0 3 0 0 0 0 0 0 0 0 0 0 0 0 0 
##$SW_h= 5175.983436853
##$TD= 65536
##$TD0= 1
##$TE= 295.16
##$TE2= 300
##$TE3= 300
##$TEG= 300
##$TL= (0..7)
0 120 120 120 120 120 120 120 
##$TP= (0..7)
150 150 150 150 150 150 150 150 
##$TP07= 0
##$TPNAME0= <>
##$TPNAME1= <>
##$TPNAME2= <>
##$TPNAME3= <>
##$TPNAME4= <>
##$TPNAME5= <>
##$TPNAME6= <>
##$TPNAME7= <>
##$TPOAL= (0..7)
0.5 0.5 0.5 0.5 0.5 0.5 0.5 0.5 
##$TPOFFS= (0..7)
0 0 0 0 0 0 0 0 
##$TUNHIN= 0
##$TUNHOUT= 0
##$TUNXOUT= 0
##$USERA1= <user>
##$USERA2= <user>
##$USERA3= <user>
##$USERA4= <user>
##$USERA5= <user>
##$V9= 5
##$VALIST= <valist>
##$VCLIST= <CCCCCCCCCCCCCCC>
##$VD= 0
##$VDLIST= <DDDDDDDDDDDDDDD>
##$VPLIST= <PPPPPPPPPPPPPPP>
##$VTLIST= <TTTTTTTTTTTTTTT>
##$WBST= 1024
##$WBSW= 4
##$XGAIN= (0..3)
0 0 0 0 
##$XL= 0
##$YL= 0
##$YMAX_a= 214728
##$YMIN_a= -371526
##$ZGOPTNS= <>
##$ZL1= 120
##$ZL2= 120
##$ZL3= 120
##$ZL4= 120
##$ABSF1= 16.522
##$ABSF2= -4.171173
##$ABSG= 5
##$ABSL= 3
##$ALPHA= 0
##$AQORDER= 0
##$ASSFAC= 0
##$ASSFACI= 0
##$ASSFACX= 0
##$ASSWID= 0
##$AUNMP= <proc_1d>
##$AZFE= 0.1
##$AZFW= 0.1
##$BCFW= 0
##$BC_mod= 0
##$BYTORDP= 0
##$COROFFS= 0
##$CY= 12.5
##$DATMOD= 1
##$DC= 0
##$DFILT= <>
##$DTYPP= 0
##$F1P= 14.0000005364418
##$F2P= -0.99999901652339
##$FCOR= 0.5
##$FTSIZE= 32768
##$FT_mod= 6
##$GAMMA= 0
##$GB= 0
##$INTBC= 1
##$INTSCL= 1
##$ISEN= 128
##$LB= 0.3
##$LEV0= 0
##$LPBIN= 0
##$MAXI= 10000
##$MC2= 0
##$MEAN= 0
##$ME_mod= 0
##$MI= 0
##$NCOEF= 0
##$NC_proc= -4
##$NLEV= 6
##$NOISF1= 0
##$NOISF2= 0
##$NSP= 0
##$NTH_PI= 0
##$NZP= 0
##$OFFSET= 16.522
##$PC= 1
##$PHC0= 172.3219
##$PHC1= 1.676901
##$PH_mod= 1
##$PKNL= yes
##$PPARMOD= 0
##$PSCAL= 4
##$PSIGN= 0
##$REVERSE= no
##$SF= 250.13
##$SI= 32768
##$SIGF1= 0
##$SIGF2= 0
##$SINO= 400
##$SIOLD= 32768
##$SREGLST= <1H.CDCl3>
##$SSB= 0
##$STSI= 32768
##$STSR= 0
##$SW_p= 5175.98343685301
##$SYMM= 0
##$S_DEV= 0
##$TDeff= 65536
##$TDoff= 0
##$TI= <Analysis number 999999
Compound Code 99
Book Reference 9
Project Code 9>
##$TILT= no
##$TM1= 0
##$TM2= 0
##$TOPLEV= 0
##$USERP1= <user>
##$USERP2= <user>
##$USERP3= <user>
##$USERP4= <user>
##$USERP5= <user>
##$WDW= 1
##$XDIM= 32768
##$YMAX_p= 522036636
##$YMIN_p= -511466
$$ End of Bruker specific parameters
$$ ---------------------------------
##NTUPLES= NMR SPECTRUM
##VAR_NAME=  FREQUENCY,     SPECTRUM/REAL,   SPECTRUM/IMAG
##SYMBOL=    X,             R,               I
##VAR_TYPE=  INDEPENDENT,   DEPENDENT,       DEPENDENT
##VAR_FORM=  AFFN,          ASDF,            ASDF
##VAR_DIM=   32768,         32768,           32768
##UNITS=     HZ,            ARBITRARY UNITS, ARBITRARY UNITS
##FACTOR=    0.157963299565203, 1,           1
##FIRST=     4132.6476996994, 0,             0
##LAST=      -1043.33573715361, 0,           0
##MIN=       -1043.33573715361, -511466,     0
##MAX=       4132.6476996994, 522036636,     0
$$ Real data points
##PAGE= N=1
##DATA TABLE= (X++(R..R)), XYDATA
$$ [...]
17846c25122M8580J81477K33208Q0072j5526J0255j98621j31066M3350J28441
17836E5048k0239P239o3864r9466O7487Q294N0121l4382o5907M4593j6524n6836
17824a24436J49171R7069N2453j09617P798j21836q372J6305k3225M5008k6601
17813d6283J28168j22830o0298j7290M2588M6984q0440j2631L1022l9262r7145
17802b27417M1729J35669R3216L4415L3987Q0035n9620j45150j3237j40462j1860
17791a78695K325L21J2650J31091J37m6900j09294m0177O892p941m145R8774K01811
17778F6849k485o0878n5108j2706p3432O4225J89172P7496n8970p0069N402K2114
17766I1610l8794q4228P8886L2171p1693P0792r2321p926J43123l9680K811J41095
$$ y = [-325122, -276542, -95065, 138143, 218215, 202689, 212944, 14323, -116743, -73393, 55048, 34809, 42048, -21816, -121282, -53795, -45501, 4620, -29762, -95669, -51076, -67600, -124436, 24735, 121804, 174257, 64640, 72438, -49398, -57770, -41465, -64690, -19682, -46283, 81885, -40945, -101243, -118533, -75945, -28961, -109401, -122032, -91010, -130272, -227417, -185688, -50019, 43197, 77612, 111599, 191634, 132014, -13136, -26373, -166835, -178695, -176370, -176049, -163399, -32308, -32171, -79071, -188365, -228542, -221650, -229591, -233736, -134962, 66849, 64364, 3486, -51622, -64328, -137760, -73535, 115637, 193133, 134163, 64094, 69496, 91610, 52816, -31412, 47474, 79645, 7952, 78744, -13577, -21503, 121620, 81940, 84751, 225846]
17754B25846P8351j03308p9672j13679j5019J47874J11722K8628l2610n6518q3629
17743A07986L2111n8636o8501K7392J74914J00381j07935j82932J46125J79411
17733C50316k7615j7297L1694j50516j00814p8563J06051P9670L1867M0178m3072
17722B21899o6280o1157j3274l2149j09562o8621M7940j505m455J06315K7955
17711D7106N600l6129J01359n6362j69437N1456K2067k712L1488j42004l9402
17700a86970k9353O4282J46887J23621J8958O1853l4619q9477j04772J420J29478
17689A01308k2538M3529M3345R783j32015j95438j47417n8113M1332J19302O8192
17678a28730j7093k7423J11070J47096R1076k2580q0349k6324m1315N5244J3252
$$ y = [225846, 304197, 200889, 121217, 7538, -7481, 140393, 252115, 280743, 248133, 191615, 107986, 140097, 81461, 12960, 40352, 215266, 315647, 207712, 24780, 170905, 350316, 322701, 305404, 337098, 186582, 85768, 7205, 113256, 192926, 224793, 264971, 221899, 155619, 94462, 81188, 49039, -60523, -129144, -81204, -82709, -87164, 19151, 47106, 52706, 16577, 117936, 61574, -107863, -56407, -34340, -37052, -5564, -147568, -186970, -216323, -152041, -5154, 118467, 137425, 199278, 164659, 75182, -29590, -28170, 101308, 78770, 122299, 165644, 175427, 43412, -152026, -299443, -357556, -316224, -196922, -128730, -145823, -173246, -62176, 84920, 175996, 153416, 73067, 46743, 5428, 60672, 73924]
17667G3924j31265k38028j32542O9249M1345M1262N1606L0529J58815J06348l9144
17656C2099k03617K8930j1792J2251N3747J06024Q0383j9670J1512o6787l2623
17645i543j34239j08131p9705R8196J61617K3216l1618m8714J79965M4323j13025
17634a7658j8462n7328K6067J66450j9648R5552j3190L681n7864l4815k44956
17623a72171n7903q6980J9800M5320J52847L0763K5577O6119q136o2454m3152
17612i0370k312J42412m054o8371l5427j11212j06674l2604K38072O0918q2368
17601i1990l3977p0709J9903M1757l6144O9690j15574L1762Q7470J43795K5888
17590G1871j68338j29705M6234m6279j26089Q853J10683N0078Q9122J22875k6446
$$ y = [73924, -57341, -295369, -427911, -358662, -317317, -276055, -224449, -193920, -35105, 71243, 32099, -171518, -142588, -154380, -142129, -88382, 17642, 98025, 78355, 89867, 23080, -9543, -143782, -251913, -331618, -233422, -71805, -48589, -80207, -128921, 51044, 95367, -17658, -36120, -93448, -67381, 99069, 79421, 174973, 161783, 165464, 107600, 72785, -172171, -230074, -317054, -297254, -251934, -99087, -68324, -42747, 23372, 15236, -47218, -90370, -92682, 49730, 45676, -22695, -58122, -169334, -276008, -308612, -70540, -9622, -91990, -125967, -196676, -176773, -135016, -171160, -101470, -217044, -185282, -97812, 45983, 71871, -96467, -226172, -179938, -226217, -352306, -343453, -232770, -182692, -93570, 29305, 2859]
17579B859k95r7672J9154j83313l3792K4231J21337P0838J09921J49143j57975
17568B4436r9127L8523Q0535m057m3079l664M707J13621K1235o6097j11848J6867
17556b7948J11356k5739M0569K8715j66602j71174j6165K8895J6549j21215j59560
17545d62319Q3546J05036J6063k0272J41810O7187o8156k0454O1313j2117n1761
17534a60124J22100J08686j1181n2847j8189p794K5194j2789K1740R304q2762
17523e8662J515l2902J11042K903j16539l7889j6133M2858J73898k4453k40806
17512a95168J5682O7660Q207J27331N3199n6088l3014j16191K689N5375J23012
17501E2694L2354K8424j9017j3131J00795j28761O6901j2057o0439j7028k9892
$$ y = [2859, 2564, -95108, -75954, -259267, -293059, -268828, -147491, -76653, 33268, 182411, 24436, -74691, -36168, 44367, 40310, -2769, -6433, -1726, 111895, 133130, 67033, -44815, -27948, 83408, 57669, 98238, 126953, -39649, -210823, -226988, -198093, -181544, -302759, -462319, -378773, -273737, -257674, -277946, -136136, -68949, -137105, -157559, -96246, -108363, -160124, -38024, 70662, 59481, 6634, -11555, -19349, 5845, -6944, 14796, 24100, -58662, -57147, -90049, 20993, 23896, -92643, -130532, -146665, -103807, 70091, 45638, -195168, -179486, -111826, -103619, 23712, 76911, 20823, -12191, -128382, -125693, -70318, 52694, 85048, 113472, 94455, 81324, 182119, 53358, 120259, 108202, 47763, 30735, 843]
17490H43Q093J11258l3961j26831L5574k2625P8292J3831j30497k6890P4099l1775
17478e0589l8895M9415n1325j5520M6360j2924M8542j37188K3963K357J02347
17467c3457j7202r4859o1953O3981M0580R0858O7703Q9470k4161j04371j5794
17456G95k6977o9158l952K7074K9969k599J42617O3840o2723J36243K13472K25333
17444F73934L1199q1022n0177k3913m0090j14661k01455m3019n2916K52Q1355
17433A79487j45023j07017P9041O5347J1773q8315q5186j50680o4264J11905J62821
17422c0111J35350l7277R931p970j02019p5226l5313J22782k3200J1951n8957
17411i0059O7298N296L7504R2836P0019j23898l7374J10406L761O209M4920j177
$$ y = [843, 8936, 120194, 86233, -40598, -5024, -27649, 50643, 64474, -66023, -92913, -18814, -50589, -89484, -40069, -91394, -106914, -60554, -73478, -24936, -162124, -138161, -135804, -33457, -50659, -145518, -207471, -143490, -102910, -12052, 55651, 145121, 120960, 16589, 795, -26182, -95340, -99292, -72218, -42249, -44848, 97769, 161609, 98886, 235129, 448601, 673934, 705133, 624111, 573934, 550021, 509931, 395270, 193815, 150796, 97880, 98132, 179487, 34464, -72553, 6488, 71835, 83608, -4707, -89893, -240573, -304837, -192932, -30111, 105239, 67962, 77893, 69923, -32096, -107322, -142635, -19853, -43053, -31102, -90059, -22761, -17465, 20039, 112875, 182894, 58996, 21622, 132028, 135789, 141998, 186918, 185741]
17399A85741l5381j93002q5162Q3692J31767k1332k3650Q1275J67546j27048k40257
17388g5811M78Q2028Q2856p0186m586M4636q1593O5738k7197J3858N8847n87J02535
17375A91016Q437J3173m529m7524m8866K2231j25503j77N4830n1408o5936O8890
17363A4634j5850m8961j25928J3772K25397J52287n80j58962j30957J4022P1463
17352A0337O0627q5387q1091Q2395L3814j8663R165o5404K8970M1248K747J55374
17340A74132q8919n8165P9985o2226L4238p0324k6331J0927P8319J6865p918p8597
17328A986o1708r9568j650j7606M3817L9652m9758m842P2676O3329J6955M0278
17316D3561J08500p0061j86468q5567N3691J15648O7680r1828m9944O3846J64073
$$ y = [185741, 150360, -42642, -127804, -44112, 87655, 66323, 42673, 123948, 291494, 164446, -75811, -75333, 6695, 89551, 19365, 14779, 59415, -22178, 43560, 16363, 30221, 89068, 88481, 191016, 199453, 212626, 208097, 160573, 111707, 133938, 8435, 8258, 63088, 11680, -54256, 14634, -1216, -50177, -176105, -162333, 63064, 215351, 214771, 55809, -75148, -61126, 10337, 70964, -14423, -95514, -13119, 20695, 2032, 11197, -54207, -25237, 16011, 18758, 174132, 85213, 27048, 107033, 44807, 79045, 8721, -17610, -6683, 71636, 88501, 80583, 1986, -59722, -159290, -160940, -178546, -134729, -95077, -144835, -149677, -77001, -13672, 3283, 43561, 152061, 82000, -104468, -190035, -136344, -20696, 46984, -44844, -94788, -30942, 133131]
17305A33131L1455o0882k9142q3484n141j9437P3788M0094J5909O1366j68607
17294a0950j17821k7190J11066L6461j37337p807j5392K01q4885L2087P9234M2969
17282i9364k5006k1918l4007M7140Q4616k1832K7106j3448J37517K594j0539P966
17270H0825P591l8334j89820j96582J04740J89480K7858P4057n8489j35525q8470
17259b22669J58582J6019m1810p7502M7423j601m4286j9555m831l5444r548M2032
17247a93190J54619K6929R4316j4030k5393j38837j57624N6150n6289Q9212Q9262
17236g4875N0551j21501m5405J1684j1028J17978J26961j1227r4666N262J45973
17225I9707m6877m6670L6953P0004o4616j0281J3525m1216j23634j28193k2980
$$ y = [133131, 164586, 103704, 74562, -8922, -14063, -33500, 40288, 80382, 96291, 157657, -10950, -128771, -155961, -44895, -8434, -145771, -153578, -168970, -168769, -253654, -221567, -142333, -99364, -124370, -146288, -180295, -133155, -48539, -70371, -43265, -56713, 80804, 83398, 72859, 80825, 88416, 50082, -139738, -336320, -231580, -42100, -14242, 59815, 1326, -134199, -222669, -64087, -48068, -89878, -167380, -119957, -121558, -165844, -185399, -190230, -225674, -235222, -193190, -38571, -11642, 82674, 68644, 43251, -95586, -253210, -197060, -253349, -164137, -74875, -24324, -145825, -191230, -179546, -190574, -72596, 54365, 43138, -51528, -46266, 99707, 52830, 6160, 43113, 113117, 48501, 38220, 51745, 10529, -113105, -241298, -264278]
17214b64278J17449Q3708J9661j30280j00611P7561N3801J23030P9623N706j08420
17203d3050j35718m3859k8013L6421M9569k0126k7133j2473J6410r245n7327Q9955
17191a84589M7984P0929M4353q7739o5004Q413J36049K0123K5452j67481o6095
17180b17605k9152L2697N3686p0800J3346K3298k7132L5157Q6122J01288l823
17169b918l982P5922m1029Q9154p2979R395o3763m0244j55428k0443J55686P8960
17157H331L1553l4828N6471j31264Q6637J26682J39515m9032j26722o5272m9540
17146g469L622L2052M0692O6849j37211r9698o6757K9704j01622P7115J64665
17135A942j7969o280J716R50k7683J5310M2061j07277j493J0397R7499N4331m9496
$$ y = [-264278, -146829, -63121, -43460, -173740, -274351, -196790, -142989, -19959, 59664, 65370, -43050, -178768, -222627, -250640, -214219, -164650, -184776, -211909, -224382, -207972, -217217, -274544, -184589, -136605, -65676, -21323, -109062, -174066, -165653, -29604, -9481, 15971, -151510, -217605, -246757, -214060, -160374, -231174, -217828, -194530, -221662, -186505, -100383, 905, -2918, -6900, 69022, 27993, 117147, 44168, 53563, -10200, -50444, -205872, -226315, -70629, 8331, 39884, 5056, 61527, -69737, 16900, 143582, 283097, 234065, 107343, 42071, -7469, -3847, 28205, 68897, 135746, -1465, -101163, -167920, -138216, -239838, -162723, 1942, -16027, -22307, -20591, -19641, -47324, -32014, 10047, -97230, -98723, -88326, 9173, 63504, 14008]
17122A4008J20202j00972p1817K49041J87727p3939q4969Q266N3457j06828j65792
17111B8384j67828M2162J5588P1174n8400J16796J9809M425k674K0778j9038R2737
17099A63913j0653j12332r2561m229Q2324P0025M5980o3161p8144J387N1474J15689
17087A69712n4749j79359q2221K7290k5127o0980l754K28898N4633o3469j14186
17076a03312n3653J34252J3316o6722j68393J15384L6732j10097o251J8985l4534
17065b24293m5017m180m2403P6117J80613M6871N8777M9565p0605l9631J88226
17054A74040J8960j35693j27466n0914J15917P6323M9977l4497o546K4231j16651
17043a2319K6954J43063P843P5609O1274j21171j85445m3024L6626l4539Q5554
$$ y = [14008, 134210, 33238, -38579, 210462, 398189, 324250, 239281, 247547, 301004, 194176, 28384, -139444, -97282, -81694, -10520, -68920, 47876, 67685, 72110, 69436, 90214, 71176, 163913, 153260, 40928, -51633, -55862, 26462, 96487, 142467, 79306, 1162, 2549, 54023, 169712, 114963, -64396, -146617, -119327, -144454, -205434, -209188, 19710, 74343, 10874, -103312, -156965, -22713, -9397, -76119, -244512, -129128, -92396, -202493, -208744, -189759, -224293, -269310, -273490, -315893, -239776, -59163, -12292, 46485, 96050, 25445, -14186, 174040, 193000, 57307, -70159, -121073, -5156, 71167, 121144, 86647, 80101, 104332, -12319, 14635, 157698, 165541, 241150, 302424, 181253, -4192, -47216, -10590, -45129, 40425]
17032D0425P244k2522n0279j08402m7579O6693K320k0909N172J6986L8431j57258
17020b29678L3785l1070k1082J67527N734j2137L567L1903L2237N8223l31q8141
17008d9463J9097J37221J1378n4331j74758k4472J10159M8439Q2711J33377o6400
16997A72958j18424j09754M659R3928Pj25547l1952P4634P7523O9662J9708L1195
16985A58597j36031m4729q6999M8974N3699j73070o4493Q5627M9223L983j8531
16974a23750O5418l2816O3278r2717l8286L6828N4532M6840J10646o8724m8977
16963b7728j48650K80J7226J05410j2275O6279J07774r5222k00836o6111n7478
16952c11331m0067L3433R5516R0692M8503L8844o4642N6852R9940r8132m7495
$$ y = [40425, 47669, 25147, -25132, -133534, -181113, -114420, -112100, -133009, -127837, -110851, -72420, -229678, -195893, -226963, -248045, -80518, -74784, -86921, -83354, -51451, -19214, 39009, 38678, -49463, -30366, 106855, 118233, 63902, -110856, -135328, -25169, 23270, 105981, 239358, 172958, 54534, -55220, -50561, 43367, 43374, -82173, -114125, -39491, 38032, 107694, 127402, 158597, 22566, -22163, -109162, -60188, -6489, -179559, -244052, -158425, -109202, -105219, -123750, -58332, -91148, -27870, -120587, -158873, -122045, -67513, -20673, 89973, 21249, -27728, -176378, -176098, -158872, -53462, -65737, 542, 108316, 13094, -187742, -253853, -311331, -351398, -317965, -222449, -131757, -83254, -44410, -109052, -52200, 47740, -50392, -97887]
16941i7887r3042Q6963J1970M6631J60763j49222j48823j2899M5054p3671j5753
16930b39916Q9474R7287K7205J0337k6925J6468m4306j3802m8987J17403L4857
16919A9095j73443m6250K0056J44750R5201J51838j4401J0375l7676p1804j6945
16908H0796j30085m9778O1802p674O4029K6029j6885j40433O4444J2296L9931
16897D472O914R7768P2335K5292j52807J6043K7699M586r8616k59990Q0321J62883
16885a3100M8813p5826P437P8400k8926n1329m0636R6117R9152p8707j09006j7568
16873h5179q426j40956O6217P0618Q5788m1436q1420q7664L96N4979Q4684K8206
16861e4193Q7918j55132L2315J84073k9506j06881j50180o6105J10571K0586j21333
$$ y = [-97887, -190929, -103966, -91996, -45365, 115398, -33824, -182647, -195546, -150492, -224163, -239916, -150442, -53155, -25950, -15613, -42538, -26070, -70376, -84178, -133165, -15762, 19095, -154348, -200598, -180542, -35792, 59409, 211247, 196846, 207221, 169545, 97741, 80796, -49289, -99067, -37265, -44939, 19090, 45119, 28234, -112199, -47755, -35459, 4472, 11386, 109154, 181489, 206781, 53974, 70017, 97716, 102302, 3686, -256304, -175983, -13100, 35713, -40113, -32676, 45724, 16798, -34531, -75167, 20950, 120102, 41395, -67611, -85179, -93605, -234561, -168344, -97726, -11938, -53374, -134794, -222458, -222062, -167083, -82399, -54193, 33725, -121407, -89092, 94981, 65475, -41406, -191586, -257691, -147120, -126534, -247867]
16850b47867J43073O9760m2238o4659K7575R2644J49387n3330j40309j6593J96310
16839A13753N1092J27255j02510j40664n033k9035J5397o337J63218m1245j81524
16828c5633j40686M2390L670m3897j6781M3636K79239n7120M0586Q1743l9208
16817A57939j0732Q9381J4941r6510j24360k11590j90175R3322R8941N4106M0752
16806h3985j49113K1329J67950l8272j4306P6425Q3522j20131l3330l8806M6068
16795h2649J5583j36750J9438M4920p546J539k4799J00070L2131O995K246j43433
16783a72255M1571J9062k9481j2821J24786O7882m1715o1233K09847K100K5999
16772A73742Q3832j04286j49817o4493m4601P2259j3560K5516P5098k5695j0027
$$ y = [-247867, -104794, -35034, -77272, -141931, -114356, -21712, 127675, 74345, -65964, -82557, 113753, 164845, 292100, 189590, 48926, 43893, 14858, 30255, 23918, 187136, 145891, -35633, -176319, -133929, -130259, -174156, -190937, -147301, 131938, 74818, 115404, 197147, 157939, 147207, 236588, 251529, 155019, 30659, -180931, -371106, -277784, -178843, -124737, -83985, -233098, -211769, -43819, -82091, -96397, -19972, 63550, -56581, -89911, -128717, -82649, -67066, -203816, -184378, -139458, -147004, -145465, -170264, -70194, -38063, -31068, -28822, -172255, -130684, -111622, -141103, -153924, -29138, 38744, -2971, -64204, 145643, 147743, 173742, 257574, 153288, 3471, -61022, -105623, -33364, -46924, -21408, 53690, 27995, 17968]
16761A7968L5134n6865N0593N8578j62870j26768k3069J01796R2917J23740K2308
16750A33462l0856j2703N948M3138m7865j65458p2344Q8703P7427j11375L445
16739h8478O0735L9151p6316M2883K31611j38939k72541l0238j12943o2701J1762
16728c96014k7625J48409J9964O7212q1114N7357J66722K6770N4940K5950J0404
16717G2975k7420P9234j5707q1121p9745K8052M5196j18335o4040r242J03728
16706f6425J61321O1917l881j8546K2577j16896q0283q257J68398l8334j46791
16695f5200Q9519P4844o8393K9763l8700j50565q4683M2849P2785P0263N6270
16684B8752j1813Q1643j07761m8467R4688J44532o5680j01042J19375J09992J760
$$ y = [17968, 53102, -3763, 46830, 105408, -57462, -184230, -207299, -105503, -12586, 111154, 133462, 102606, 89903, 95851, 138989, 91124, -74334, -146678, -57975, 19452, -91923, -88478, -27743, 11408, -64908, -22025, 209586, 70647, -201894, -232132, -345075, -407776, -396014, -423639, -275230, -255266, -188054, -269168, -211811, -45089, -18319, 36621, 62571, 72975, 45555, 124789, 109082, 27961, -51784, -23732, 21464, -96871, -160911, -170153, -66425, 94896, 156813, 152932, 134386, 156963, 40067, -40216, -48473, 119925, 81591, -65200, 24319, 99163, 30770, 60533, 21833, -128732, -213415, -170566, -97781, -27518, 28752, 16939, 98582, -9179, -57646, 37042, 181574, 115894, 14852, 134227, 244219, 245979]
16673B45979j43249j13326N1819n5563M8508N0321l3997l7601K0759q4303q7804
16662a38457M0619l1670J10794M6787P0790n1067j30720j7098j09119O5536P758
16651a35847k1997j8557M5319J35401O276o1133J41864n8600J0004j39485j07076
16640b03831O1867j3535R123m8303J89406J33754p5255o3599K22568O6537j47452
16629A31280j01343M0218P2499n0168j67721j10593J5194L0324J81509l1670n6366
16618d6837N360p4204q0615l3522Q9296k569j00794Q9078J04244m5822Q4939P7218
16606F5772o3383j37258K4256J02954j6244m9203R3932j30764k6381N6050K6768
16595e3501j06245m5168L1734j05583M5393J65229l5613M0671R1060N4491p238
$$ y = [245979, 102730, -10596, 41223, -14340, 34168, 84489, 50492, 12891, 33650, -50653, -138457, -97838, -129508, -18714, 28073, 98863, 47796, -82924, -100022, -209141, -143605, -135847, -157844, -176401, -131082, 4319, 10595, -50538, 91326, 32726, 42730, -96755, -203831, -141964, -155499, -146376, -194679, -5273, 128481, 53226, -10373, 212195, 278732, 131280, 29937, 70155, 142654, 92486, -75235, -185828, -170634, -140310, 41199, 9529, -46837, -41477, -115681, -196296, -229818, -140522, -143091, -243885, -154807, -50563, -96385, -11446, 65772, 2389, -134869, -110613, -7659, -23903, -73106, 20826, -109938, -136319, -80269, -53501, -159746, -204914, -173180, -278763, -233370, -68141, -103754, -63083, 27977, 82468, 75230]
16584G5230J5801n8680l9441L1637P8449P4720k9022j02896p1761j70328M0476
16573a55815P5555L7015j2191j33231j12079L2078p6418K47524J52301r3470j27457
16562a66188Q2980j467J37497M808p215k8730L5205J9848J22670n2807n3468n3244
16550C9889k9830k2212K7987J01762j01819j24393J69783J03254N9706j48202
16540G5925j83700r769J15759J11573n5500j04102L9754L9004o6055m5806K0868
16529f2049J74392p077n3649J6506J52498k2778k79000m6670k4856l3266K4877
16518a61072j40M1174J12540J05861k0075l4430N4164j92116r454J05201r9438
16507i7785j11221P7768K4401j1989m1579J37022J25549p1389j12685R5861J51024
$$ y = [75230, 91031, 32351, -7090, 24547, 102996, 177716, 148694, 45798, -25963, -196291, -155815, -80260, -43245, -55436, -188667, -300746, -268668, -345086, -97562, 54739, -38731, -166188, -83208, -84675, 52822, 57630, 50415, 21685, 56890, 76738, 199408, 146601, 93133, 39889, 10059, -12153, 15834, 117596, 15777, -108616, 61167, 164421, 224127, 75925, -107775, -117544, -1785, 109788, 54288, -49814, -10060, 28944, -37111, -82917, -62049, 112343, 105266, 51617, 68123, 220621, 197843, -81157, -127827, -152683, -185949, -161072, -161212, -120038, -7498, 98363, 78288, 43858, 98022, -94094, -103548, 1653, -97785, -209006, -131238, -106837, -118826, -160405, -23383, 102166, 30777, -81908, 13953, 164977]
16496A64977P9418M7674j13763j33371j73582k8539j1795m0828k0462J85759M0031
16485d481j33571N2873J96516j36289k1684Q4072L3987n762q361l5144j43548
16474a21392j44181P2333O4707O1679N3547k9670J22122R8464P0016N5952k00819
16463A02758k02208j8775J34439K17384O7620j35536o9043J1192l8990p6407P0027
16452F2461j0116r6821Q6981J3694R440n7508j01990O074K35595M4808j77895
16441A4723j42065m6893j13951L8157J44360m789M445J52121M6558j49785r6716
16430a53835J2337O6710J64714J9338j73697l7825j636J82022Q1603k6567n2288
16419H0876M2944K2544M9505j29496j12572M4125N1019j1036m5946j7150K8244
$$ y = [164977, 244395, 292069, 178306, 44935, -128647, -157186, -168981, -209809, -230271, -44512, -4481, -138052, -85179, 111337, -24952, -46636, 37436, 71423, 65661, 57300, 22156, -121392, -265573, -193240, -128533, -66854, -13307, -42977, 79145, 177609, 247625, 303577, 102758, -99450, -118225, 16214, 233598, 301218, 165682, 96639, 107831, 68841, -7566, 62461, 52345, -44476, 42505, 56199, 65639, 8131, -93859, -87785, 147810, 192618, 14723, -127342, -174235, -288186, -250029, -105669, -110458, -106013, 46108, 92666, -57119, -153835, -141498, -74788, 89926, 109264, -64433, -102258, -103894, 78128, 159731, 133164, 80876, 123820, 146364, 195869, 66373, -46199, -2074, 48945, 37909, -8037, -25187, 3057]
16408C057N2000K8417K2331P7147j93016l9588k6794n9729J12640N3688l7288
16397g135M995M0589m7914o6020o643L1574N7562L4085m6813P929P4431P3828
16385A50468l9880l7044L7494r0000J2038K4164j12030n0442n1674J1052P753
16374a38101L1266N6736L2676j0589k1302R2200m469o2M5951o6118j23604M6686
16362e8730M3936L3270L1300j53071o2010Q9182J15672o7797j02329R5000J19155
16351H3578k0816r7500L0145Q5360J83060J35843J6159K3113J3252n1804j09292
16340B91098m1043j33246l7808M4839J91483Q8428n2995j0458j41002J51254J38984
16329D89534J35526J9862J0450j37258l70788j71923p2950M488M3536k0219N4000
$$ y = [3057, 55057, 83474, 105805, 182952, -10064, -49652, -76446, -136175, -23535, 30153, -7135, -2140, 38449, -9465, -75485, -82128, -50554, 7008, 41093, -5720, 2209, 76640, 150468, 110588, 73544, 111038, 21038, 33076, 57240, -54790, -105232, -156906, -145854, -138101, -106835, -50099, -17423, -28012, -49314, 42886, 38417, 38355, 84306, 18188, -105416, -58730, -14794, 18476, 49776, -103295, -165305, -76123, 39549, -28248, -130577, -35577, 83578, 62762, -34738, -4593, 80767, 263827, 399670, 415829, 438942, 452194, 400390, 291098, 250055, 116809, 79001, 123840, 315323, 403751, 350756, 340298, 199296, 350550, 489534, 625060, 644922, 655372, 518114, 147326, -24597, -97547, -93059, -49523, -69742, -15742]
16318a5742J1871k34956j42674O2479K40410P6602L8484n7906j09557J00095K2524
16307h370n6945k21384j14688K01676J24979q920Q0388K7671k02621j10874J12897
16296a76191R3471l546N8413j24350r0051k8815n2473J12956J11967K1755k6788
16285a03652o0576p7787j7465L7185l7099q240N6872J90079N2406l6945P0872
16274F5650L6942Q6097l7500k36645j36722J49750J55322J42388n3873o1206o7090
16263D3113j47677k6426k8786K28978O9577J3596K1067k2842j2051m1232l7605
16252E9712R6954O5943K9042o417k1351Q6094L6421j91178o9207Q0489p7424j08217
16240a9139O491Q9898l9630q6311m7237M6441r972P0160K09272q0511m6451J51506
$$ y = [-15742, -3871, -238827, -381501, -319022, -78612, -2010, 36474, -21432, -130989, -30894, -8370, -65315, -286699, -401387, -199711, -74732, -83652, -3264, 24407, -178214, -289088, -176191, -82720, -86266, -27853, -152203, -242254, -271069, -323542, -210586, -98619, -76864, -103652, -164228, -242015, -259480, -222295, -259394, -267634, -210762, -20683, 31723, -5222, 65650, 102592, 188689, 151189, -85456, -222178, -72428, 82894, 225282, 171409, 110203, 43113, -104564, -130990, -159776, 69202, 138779, 152375, 173442, 150600, 138549, 97317, 59712, 156666, 222609, 251651, 245234, 223883, 309977, 346398, 155220, 86013, 166502, 89078, -19139, -12648, 77250, 37620, -48691, -95928, -49487, -59459, 10701, 219973, 139462, 93011, 244517]
16228B44517r2340j43658k5036M476N2641l7326L4280K019R6652K8047l8889N7563
16216A82946j69554q7618Q9917O3132q4954l5643j5633l7069N9711J17421k3183
16205E9473j27710r7944k3644J50030K6287J42183R6632m9663q3839M6652K3807
16194A62264N4949l8887j45111K7574r5307r4689k904j2456m2231M7238j7305
16183a56865j9502P4487l9428n5430L1100l1541O3935M1998N9747P2388K9567
16172G0456j66404j28551P0947Q3297R524n5067Q9460O8698j02800j691m3331
16161a05462J11406M7204o5978M1450n2555j62815Q849K00852l4490l8928J3825
16150c6642l3810J05829l8149j17042K8673m9314K2152K3278r3079K8738R0103
$$ y = [244517, 152177, 8519, -16517, -12041, 40600, 3274, 37554, 39573, 136225, 164272, 125383, 182946, 13392, -74226, 15691, 78823, -6131, -41774, -57407, -94476, -34765, 82656, 59473, -68237, -166181, -189825, -39795, -13508, 128675, 225307, 175644, 91805, 138457, 162264, 217213, 178326, 33215, 60789, -34518, -129207, -132111, -144567, -186798, -139560, -156865, -176367, -101880, -141308, -196738, -165638, -197179, -133244, -91246, -31499, 40889, 70456, -95948, -224499, -153552, -70255, -60731, -115798, -26338, 42360, -60440, -62131, -105462, 5944, 53148, -12830, 28620, -23935, -186750, -177901, 22951, -11539, -50467, -36642, -70452, 35377, -2772, -119814, -91141, -140455, -118303, -95025, -188104, -159366, -69263]
16139f9263K1808P063o9781j22070L1497K9073l9153R3441J62274J3976J7500
16128G6365n0334l3636O8698J3440M5938P926R2135l0552m01j72783j62907l5189
16116a81300k0104O297J90075N0660j040o4406m8611N4913O9630P9923j25605
16105A0432L0986Q3647j02544l1157n6339q2567k0147L4082J58927k1704j30070
16094a26454l1357k9950P5306J47694Q6139j22085j23989O6816p6429m3651J2689
16083a65271K976Q529O44o2579K0574j5189k4140J79165J74153j41899K8237o0607
16071e5407j29515n1882R8940J33608Q1049o3481o0615l6871Q7270j8331k8125
16060d3360o5364O2807R3954n6994m0499L7292O4188n9743j9038P6830J0338j08379
$$ y = [-69263, -47455, -40392, -110173, -232243, -200746, -171673, -210826, -117385, 44889, 58865, 76365, 26031, -7605, 61093, 74533, 120471, 128397, 220532, 189980, 189579, 16796, -146111, -181300, -201404, -195107, -5032, 45628, 44588, -19818, -68429, -13516, 56114, 136037, 10432, 41418, 125065, 22521, -8636, -64975, -147542, -167689, -133607, 25320, 3616, -126454, -157811, -187761, -112455, 35239, 121378, -707, -124696, -57880, -134309, -177960, -165271, -162295, -153766, -153122, -215701, -195127, -210316, -234456, -55291, 118862, -23037, 5200, -55407, -184922, -236804, -137864, -4256, 76793, 13312, -47303, -84174, 3096, -15235, -43360, -108724, -45917, 48037, -8957, -49456, -12164, 52024, -7719, -26757, 50073, 60411, -47968]
16048d7968p1019L8669j5739Q5210L8206J02492n217j23745j20838K11843q1165
16037A0729j03163K8564O7881O1528K9057j35359j07717Q7124J3837J07270L9281
16026I9032N8390j20233j95294k4254R5815L6638M8639r9370O0859J57745R3313
16015B11280k2083n8098q2757j89019o5381J38670J03962R6500j2947P7241J3821
16004B11189j04544j06853j3574J21812K6741l9306n8103R6613J960n1499k0305
15993F4131m3747j27777o2500K9797K67O6402l0394j08671j40603j293K18136
15982a36252J30687j10205p7492J4242J49826J1366m7265J18049J34120L6865
15972B23941p7046k04129j59222q5238J14624J42730l1936n4730m974L2705O6092
$$ y = [-47968, -118987, -80318, -96057, -10847, 27359, 129851, 124634, 889, -119949, 91894, 10729, -92434, -63870, 4011, 65539, 94596, -40763, -148480, -61356, -47519, 59751, 99032, 157422, 37189, -158105, -182359, -86544, -49906, -1267, -100637, -39778, 117967, 211280, 189197, 131099, 48342, -140677, -206058, -67388, 36574, 133074, 120127, 197368, 211189, 106645, -208, -13782, 108030, 134771, 95465, 37362, 133975, 135935, 84436, 64131, 20384, -107393, -169893, -140096, -139829, -73427, -103821, -212492, -353095, -354388, -136252, -5565, -115770, -193262, -179020, -29194, -17828, -65093, 52956, 187076, 223941, 146895, -57234, -216456, -301694, -187070, -44340, -76276, -131006, -135980, -103275, -37183]
15961c7183r0899q1254J45823J20491N3206p8546o5276K4650K9857m6274n0520
15950g5925K17035l594O63q8475j20186k6890R3395k1795j00643Q854l3863j03316
15938b54740M9851J0830k5759l5437J38002N3777k0666O085Q4620K99068o3773
15927B41858o5101M5297n691m7622j03922j52860n8222j8275o2274m7594J70485
15916a03921j7717J5875M8090J3909J00121J90928N2899l4266l2850j0224j15618
15905A07226r0307j4001j3412q4587J06508q4196R615L209J47351k3240k64781
15894b00615p4661N8721l8703J04449J59179P0456n2782j08207J11815J53281
15884A82933k18741j20779Q0794m817k3923l880N2219M8995q1272R0798N3424
$$ y = [-37183, -128082, -209336, -63513, 56978, 110184, 31638, -33638, -8988, 20869, -25405, -75925, 141110, 137516, 138179, 49704, -70482, -97372, -3977, -25772, -126415, -117561, -151424, -254740, -204889, -194059, -219818, -255255, -117253, -63476, -84142, -78057, 6563, 305631, 241858, 176757, 222054, 216363, 168741, 64819, -88041, -146263, -164538, -226812, -274406, -103921, -121638, -105763, -57673, -43764, 56357, 247285, 300184, 265918, 233068, 222844, 107226, 16919, 2918, -10494, -95081, 11427, -72769, -63154, -59945, 87406, 64166, -200615, -275276, -216555, -255258, -150809, 8370, 78826, 26044, -82163, 29652, 182933, -35808, -156587, -75793, -80610, -104533, -108413, -56194, -7199, -88471, 2327, 55751]
15873E5751J7962M560N008j00957o613K7183K1910J54427N5059J4330p3529m8212
15861A26879n1822m0268n5249P0833K081R9111P8679J07527j27533K3303p568
15850B25973j03134m8225m7984r6522j2765k636k9499M9389J28053J9937j26214
15839d3627r2341P6621J11907N5633N7044l0630l9117j13569j09180k3339J47009
15828c589O293k8567J75694J20937o0151q3791r5001K1120L9688r4257L203r147
15816g568n8641n1447M9160J78367m3486J43629r1228k30497l609N8437q2769
15805a39652M3672J22472N7780M0376j87213N8755J55618P7982o5760j79826n5228
15794g1024M3640J86758p069j04873O5382k3721L0604r09o1575L2988O7642j6232
$$ y = [55751, 73713, 78273, 83281, -17676, -24289, 2894, 24804, 179231, 234290, 248620, 175091, 126879, 75057, 34789, -20460, 50373, 52454, 151565, 230244, 337771, 210238, 233541, 225973, 122839, 74614, 26630, -69892, -82657, -85293, -114792, -65403, 62650, 82587, -43627, -135968, -59347, 52560, 108193, 165237, 134607, 95490, -18079, -127259, -150598, -3589, 2704, -25863, 149831, 270768, 210617, 126826, 31825, 52945, 92633, -1624, 1579, -7568, -66209, -117656, -68496, 109871, 66385, 210014, 118786, -111711, -115320, -56883, -139652, -95980, 26492, 84272, 124648, -62565, -3810, 151808, 229790, 164030, -15796, -71024, -27384, 159374, 152305, 47432, 112814, 89093, 119697, 118788, 57213, 90201, 157843, 141611]
15782A41611j92225k3148j8479p2575O5181J81612j01396j52208K080l3594m9399
15771b52540L5488o4214J29596K09594J46371M717j64794j26339q8991L8016K1177
15760a11919M7924j07728K484J5160J6196R1403J69983J8797k1267M7519K2815
15749A91367o8984m670L7275j36476J8235J02465l3110k2504N8927j16595p4045
15738d8115m4304l810n2643m003L6191r0564k2413p3662J0081r905J03927K43852
15726D4632J40738J3202j19712q641J07152k2068j33882j34799j04167N4714L2830
15715a30001j22453k6176P1408Q9567J29510M2025q0265K3142l5848j04968k5106
15704a69165r4927N4715J47719o1707j22475O4617R7022J35887m2284o5039J2505
$$ y = [141611, -50614, -73762, -92241, -164816, -99635, 81977, -19419, -171627, -169547, -203141, -252540, -217052, -281266, -151670, 57924, 204295, 209012, 44218, -82121, -171112, -133096, -111919, -63995, -171723, -169239, -154079, -137883, -46480, 123503, 142300, 121033, 168552, 191367, 122383, 117713, 154988, 18512, 36747, 139212, 106102, 83598, 142525, 25930, -48115, -92419, -96229, -148872, -152875, -116684, -207248, -229661, -303323, -293242, -303147, -199220, 44632, 185370, 198572, 78860, 70219, 177371, 155303, 21421, -113378, -217545, -162831, -130001, -252454, -278630, -207222, -117655, 11855, 53880, -26385, -3243, -39091, -144059, -169165, -264092, -209377, -61658, -123365, -245840, -181223, -84201, 51686, 9402, -55637, -43132]
15693d3132K0388l4973k194J05921P7664j2508j11750j38954M7642J9825Q3745
15682A1674J43828M999j32770j64797K6381r512K6046j9819J9751R0308O9110
15671F5199l3661j06162N8042J63177j9435j20234J47663N7543R5030l3580j71850
15660A01732j94466m4140J2209j2762O3584J55119l3668j932N9839N6992l1593
15649A30914l5098l4632L8506J0380N5574M5071l8815o5914O827M4467P5119j47947
15637H4452j68107j66859K29M9924J5700l8146q2842J42814K37134o1487J4322
15626B7134K3476p2748j86431M1794R0901P1988O110l8925n0666k3328k6277L6755
15614a00217m217l6084J27658n2858j0493M9026O5237k0406K806q4267k2050J29105
$$ y = [-43132, -22744, -57717, -59911, 46010, 123674, 111166, -584, -139538, -91896, -72071, 11674, 155502, 160501, 27731, -137066, -110685, -120197, -94151, -113970, -94219, -3911, 65199, 31538, -74624, -16582, 146595, 127160, 6926, 154589, 212132, 307162, 273582, 101732, -92734, -136874, -124665, -137427, -73843, 81276, 47608, 45676, 105515, 162507, 130914, 95816, 61184, 99690, 110070, 165644, 210715, 171900, 105986, 112813, 157280, 232399, 84452, -83655, -250514, -250285, -200361, -184661, -222807, -305649, -162835, 74299, 12812, 27134, 50610, -22138, -208569, -166775, -75874, -3886, 2224, -36701, -87367, -110695, -136972, -100217, -104434, -140518, -12860, -65718, -76211, -27185, 38052, 17646, 20452, -63815, -85865, 43240]
15602D3240j111l9659N1762P178o7656N6226N0716o2807M701J5638M2748M0363
15590A41339M9049L2604K1936j29221p0509R8171J5069p8333Q7051k1937L2275
15579A77494N055j96492m7850m4116l8980J28837J32031k9246q6285j30682l6801
15568a67035P0218j8440J8496r2416Q591J49095J93769N1042r0912k4867P4472
15557A72013P933j14450o7087L5564O7016m6742K4499P4318o3998r7057k7417
15546c5408n6509J26187J25767j62928j57329o7147P7898K36346p8071k5052R1814
15535G5568M1117q8144j56071p7778J23254J47515q8968K7732M1843j6081J01234
15524A31221O600p2933p8516Q2115J55510O4899j65087k13459J10919J68955k0667
$$ y = [43240, 42129, 2470, 54232, 61410, -6246, 49980, 100696, 37889, 42590, 58228, 100976, 141339, 190388, 222992, 244928, 115707, 45198, 143369, 158438, 80105, 167156, 145219, 177494, 182549, -13943, -61793, -105909, -144889, -16052, 115979, 86733, 448, -130234, -167035, -96817, -115257, -96761, -189177, -180586, -31491, 162278, 213320, 122408, 97541, 172013, 179946, 65496, -1591, 33973, 100989, 54247, 78746, 153064, 89066, -7991, -35408, -91917, 34270, 160037, -2891, -160220, -227367, -149469, 86877, 8806, -16246, 75568, 116685, 28541, -127530, -205308, -82054, 65461, -23507, 4225, 46068, 29987, 131221, 137821, 64888, -13628, 68487, 223997, 288896, 123809, -89650, 21269, 190224, 169557]
15513A69557o3193o796J4140Q4834M5893J652k12583M919P1472l7963k50768m9097
15501b27933R3549R5202m653k732l9744Q2574J02825J066O9050j7214j06236j29528
15489h3774r35K33281K25666j50725j67378O3116L5414o1920N5543P267L6800
15478A92355M3860O2545M828n9249N9744O533r6785J3864q5545k2838l7534L441
15466H5219L7597N0477K09111m1342j5438j77442j89847J896p5204j09195O8969
15455a55199J12554j247l5452k5951J3235q6891J2018J64459k3608l4418l1748
15444i2248k23863L3029M6207Q3054P8632Q7949P7070n8659N467j5235p8630J5317
15432d1910O6113J96647j29972r4543K0320p0445J5166M6813j47960j08247J71324
$$ y = [169557, 106364, 99568, 113708, 198542, 244435, 246087, 33504, 38423, 109895, 71932, -178836, -227933, -134384, -39182, -43835, -46567, -86311, -3737, 99088, 100154, 169204, 151990, 45754, -83774, -84709, 148572, 374238, 223513, 56135, 119251, 154665, 92745, 148288, 155555, 192355, 236215, 298760, 303588, 244339, 304083, 310616, 213831, 227695, 142150, 119312, 81778, 85219, 122816, 173293, 382404, 341062, 325624, 148182, -41665, -39769, -114973, -224168, -155199, -42645, -43892, -79344, -105295, -92060, -178951, -166933, -2474, -26082, -60500, -92248, -316111, -283082, -236875, -153821, -75189, 12760, 89830, 31171, 36638, 21403, -57227, -41910, 24203, 220850, 90878, -3665, 16655, -53790, -38624, 8189, -139771, -248018, -76694]
15421g6694K4588o8599m555J83611o4752J7839o3207J6763r7803K680J46148N4932
15409G0951K9113j9281j08506p5913K9613o5698M0684N539Q6469R9662m2058n1770
15397a195O3721o8685p9768J7948J12327O2689K5200p3885J40162M1737m5450
15386A94801p7689r991Q9114q826J5809J19471j43943q9786k1719K4299K9012
15375A20552o4586n1976j26752J06336J11170o076r5825n6297l9291Q9439J7729
15364D423P9311j30924l269O9461J02837o4883J7162J20771r7490m1144l8228
15353A8027J4138J26576l9505j01200P0003J7346L6529N5710j0612m1932M7024
15342A92104j8210l9819O957N0563Q2418k9767L9924L7195j9697n9775j89783
$$ y = [-76694, -52106, -120705, -125260, 58351, -6401, 11438, -51769, -35006, -132809, -130129, 16019, 70951, 100064, 80783, -27723, -103636, -74023, -139721, -99037, -93498, -7029, 92633, 50575, -1195, 62526, -6159, -85927, -67979, 44348, 107037, 132237, 58352, 198514, 240251, 194801, 117112, 107121, 196235, 187409, 203218, 322689, 178746, 88960, 67241, 91540, 120552, 55966, 3990, -122762, -16426, 94744, 88668, -7157, -63454, -102745, -13306, 4423, 83734, -47190, -50459, 19002, 121839, 56956, 74118, 194889, 97399, 56255, 18027, 32165, 158741, 119236, 18036, 88039, 105385, 141914, 197624, 187012, 145080, 192104, 173894, 134075, 141032, 191595, 274013, 244246, 284170, 321365, 301668, 241893, 52110]
15331E2110J2538J81689M4699M0329j0333j20649k8216j25325o8951J2897Q082
15320a130L6909q8488Q0885p8434P9548O560O7296J0247n901Q3951R1812j6680
15308B66575n7526j16203J8413K5695j15640j0489p8566l9417N0758j13282N3603
15297a16079l2182N845J70393J82639M7154j05335j09190N7727P9379l0441K0850
15286A70760Q4303n7208K0288l9885j41985m2470o8433L9340J42339J99396p236
15275B99209r6936r0556J25465j50694k40737K732J81745K7081j6942J7637R1633
15264A49637l5808p6812r075j77446Q6257R2989K9426K7497M7446Q1573J46146
15253C61830n1516q4399o7732k7079j2660M6445N2635m6016L3619j15159j10745
$$ y = [52110, 64648, 246337, 291036, 331365, 321032, 200383, 172167, 46842, -22109, -9212, -1130, 35779, -52709, 28176, -50258, 29290, 35850, 103146, 113393, 107492, 191443, 283255, 266575, 209049, 92846, 111259, 136954, 21314, 10825, -67741, -107158, -56400, -169682, -116079, -148261, -142416, 27977, 210616, 257770, 152435, 43245, 100972, 180351, 149910, 170760, 255063, 197855, 218143, 178258, 36273, -6197, -74630, -35290, 107049, 306445, 299209, 202273, 111717, 237182, 86488, -154249, -151517, 30228, 57309, 40367, 58004, 149637, 113829, 37017, 27942, -149504, -63247, 29742, 59168, 86665, 134111, 215684, 361830, 310314, 225915, 158183, 131104, 118444, 164889, 217524, 171508, 205127, 89968, -20777]
15242b0777K0350N4213k235N5182J31212J37147M6729m5437j26426J0164k2585
15231B37537r5314j4252r615K03888o9951j30135M6970K74093j6904j27999l1017
15220B67301j16687J2929l7688R4622r2701j40192K8945M1634p733o4208k2843
15209c6621Q0593Q3218l7985j528J22443M84j210J10650m9782m5635N9351j36256
15197A47722j75644N1302J01857J7274J7864Q6120m8810j1435P2147R0576N8712
15186D07685o5469j7780j19515q8476R0845J2218l3849J49138N5774O4738j68066
15175B87243j91299m2255j12147N521J53272j9458j13831L7935K7266m5579M9671
15164C6339n4297J79045J18968j01232m5292J03781p6990j9404j41858K3007J36662
$$ y = [-20777, -427, 53786, 51551, 106733, 237945, 375092, 421821, 376384, 249958, 260122, 237537, 142223, 127971, 118356, 322244, 252293, 122158, 169128, 443221, 426317, 298318, 267301, 150614, 163543, 125855, 220477, 127776, -12416, 16529, 58163, 50430, -13778, -36621, 43972, 127190, 89205, 87677, 210120, 210604, 209394, 320044, 270262, 224627, 283978, 147722, -27922, 23380, 125237, 142511, 160375, 246495, 197685, 186250, 258397, 348973, 407685, 342216, 324436, 204921, 116445, 207290, 219508, 185659, 334797, 390571, 455309, 287243, 95944, 53689, -58458, -52937, 100335, 80877, -32954, 4981, 32247, -13332, 36339, -17958, 161087, 280055, 178823, 133531, 237312, 160322, 140918, -940, 22067, 158729]
15153A58729n1571j35223K11818J95588J949q2361j5794Q239p7116K4494N2864
15142B91616L3469O1946j3727N2493L8604p0021r2278l2976o1048P6730J45799
15131D30607p3338j40450o2028J8773k7514J70055J85174N6134P627l1823j39912
15120C93305n4259J2358m5225j20201L9622O6225M1124J06130N1477O7032j04797
15109D52791K7635R6433J17133l9420k9245J904n4019j76948q5885J00386N3607
15098D64372j09669j49591P8621J10079R2564Q06j60661j43766L2502r743J20902
15087C26416Q8911J03913r6115o1055q6472j10711N5828J56698K04936R0221p9122
15076E93448j50415j30917J21568K9425o8240m0497Q0798K1120j04892l5098K3958
$$ y = [158729, 107158, -28065, 183753, 379341, 381290, 298929, 283135, 291374, 214258, 238752, 291616, 325085, 387031, 373304, 425797, 464401, 394380, 302102, 269126, 208078, 284808, 430607, 357269, 216819, 154791, 173564, 146050, 316105, 501279, 557413, 565040, 533217, 393305, 339046, 351404, 306179, 185978, 225600, 291825, 332949, 439079, 490556, 557588, 452791, 480426, 576859, 693992, 654572, 625327, 627231, 573212, 396264, 310379, 410765, 464372, 354703, 205112, 283733, 393812, 486376, 487182, 326521, 182755, 215257, 205514, 326416, 415327, 519240, 423125, 362070, 275598, 164887, 220715, 377413, 582349, 672570, 593448, 443033, 312116, 433684, 463109, 394869, 354372, 435170, 456290, 351398, 316300, 340258]
15065C40258K1904J08986P5382N0794n3782j21591r0220k7481k2307n3110j8437
15054B10396J4800N8559K6485J3950k5867J55203J39079m6892r402m3380l8710
15043D54221k2969o0487M2684J3110j1419K3558L3515l7776q8398R5620k2063
15032D19596j44895l4295O4851J04042R2895J75886o3001j08808j02140J04813
15022E08944Q290n3006J68772Q5057l4443j3777n7095K0106j06556r514P268p4628
15010D49418J9551O1669J18846Q0124j37546k2084P5473R6859j8678p8675j00687
14999E44270k6860J49766J16629n5888p4562Q4253Q1691m3369j16988K5795P6172
14988G60909K681m0574k9626Q3522j32127l8843L3739K45423K0329j12464L817
$$ y = [340258, 362162, 471148, 546530, 597324, 543542, 421951, 331731, 304250, 281943, 228833, 210396, 225196, 283755, 310240, 324190, 298323, 453526, 592605, 545713, 536311, 492931, 454221, 431252, 370765, 413449, 426559, 415140, 438698, 472213, 434437, 346039, 441659, 419596, 274701, 240406, 305257, 409299, 502194, 678080, 615079, 506271, 404131, 508944, 517234, 464228, 633000, 718057, 683614, 669837, 612742, 632848, 526292, 516778, 524046, 449418, 468969, 530638, 649484, 729608, 592062, 569978, 645451, 742310, 723632, 644957, 544270, 517410, 667176, 783805, 727917, 653355, 737608, 819299, 775930, 658942, 684737, 760909, 763590, 723016, 693390, 776912, 644785, 605942, 639681, 885104, 905433, 792969, 796786]
14977G96786n7443N1206k4395j24372k073k5469m979O3913R5309j17132l4343
14966F17008P3796K9516o2979l6477l846o2618J45623J32019M6376j35978m7370
14955F95070k1977n2177j43715j46408N4380K16154J12478j6720j73238n6225
14945D67622p3889m7782J55108K69221J4884J3940m7326n7288j16277N254j02404
14934D81063q9382J75425J63469r7263k24355J8422L8806Q8685O5814p3925K9994
14923E76753R6995p8826q1387K6889n383K9274R7418L0343m4462n4985j4847n2544
14911E25238J18548J57529j12416q7329L0637r376R3486P3740l3764M239J04754
14900H65286j7854j4867k07180j60814j02087K395J77744J01162J21569o1700
$$ y = [796786, 739343, 790549, 766154, 641782, 639709, 614240, 609261, 673174, 768483, 651351, 617008, 690804, 720320, 657341, 620864, 617018, 554400, 700023, 832042, 878418, 742440, 695070, 673093, 620916, 477201, 330793, 385173, 601327, 713805, 697085, 523847, 467622, 393733, 345951, 501059, 770280, 785164, 799104, 751778, 694490, 578213, 583467, 481063, 391681, 567106, 730575, 633312, 408957, 427379, 466185, 554870, 620684, 546759, 576753, 673748, 594922, 513535, 540424, 535041, 564315, 661733, 692076, 647614, 592629, 577782, 525238, 643786, 801315, 688899, 601570, 632207, 622831, 716317, 790057, 756293, 760532, 865286, 847432, 832565, 625385, 464571, 362484, 364879, 542623, 643785, 765354, 703654]
14890G03654q5688J4294P2731j61521m5865J15190J6714R346N399R1813K3565
14879G59632M732o6152p9710N8737M5920j4264o8412m2142J6138N5644P3933k5831
14867G18225j04212l8125K0041J97219J54092l0882j22827j47663n8970O0032
14857F46930K6794O53O6599J14765M2684M998k111n5223r4475J06148N1564K1135
14845I30461j38555n8336K7061J56474Q5632o6764j2950o8243j08168j15286M4858
14834F76184n4121K2843J7784P1002J01174J94777k2536K4089m1980R0741K2689
14823A102646m4344n8894k10513q9222O3123J63866L0510j04138l6458Q46m5064
14812G72358j61477J11686J98579L1832M3585M0223m4218r115j7362M4751O2158
$$ y = [703654, 617966, 632260, 704991, 543470, 497605, 612795, 629509, 638855, 644254, 736067, 759632, 764364, 698212, 618502, 677239, 723159, 708895, 640483, 598341, 614479, 670123, 744056, 718225, 614013, 575888, 595929, 793148, 947240, 916358, 793531, 645868, 586898, 646930, 673724, 674377, 740976, 855741, 898425, 903423, 901312, 846089, 751614, 857762, 909326, 930461, 791906, 733570, 760631, 917105, 1002737, 935973, 923023, 854780, 746612, 631326, 676184, 622063, 644906, 662690, 733692, 834866, 1029643, 1007107, 1031196, 989216, 1079957, 1102646, 1058302, 999408, 788895, 699673, 762796, 926662, 957172, 853034, 816576, 817422, 772358, 610881, 722567, 921146, 952978, 996563, 1036786, 992568, 983453, 966091, 1010842, 1073000]
14801A073000q6685j2845m8690K3771L670l2489O3476J00325J3028l0810j8530
14790A047221J7805j7875J02012J61235J29443Q1540o5374o6430l5805l2621P1753
14779A392904N063K0181P0524K28721J91442J12362N066K5991K308m1139j64457
14768A848966n9242j29306j8245R6336J05106r7657k5705L9944M5216o4831J7813
14757A758395R434j60422k8109m1799J17j30640J7316L8017K02371J51715p0532
14746A745863j09165r714J50558M9728m5758j6744K4672J07780j03226n6205j3561
14735A724228j16936J25289J50441N6370j56904o2073J8443L0179m4314l3850
14725A690873P2283J7600l5904j484K6152J02951P0326J41072p2285k190K16521
$$ y = [1073000, 986315, 973470, 924780, 948551, 952221, 919732, 983208, 1083533, 1096561, 1065751, 1047221, 1065026, 1047151, 1149163, 1310398, 1439841, 1521381, 1456007, 1389577, 1353772, 1321151, 1392904, 1397967, 1418148, 1488672, 1717393, 1908835, 2021197, 2026263, 2052254, 2054562, 2013423, 1848966, 1789724, 1660418, 1642173, 1738509, 1843615, 1745958, 1720253, 1760197, 1805413, 1740582, 1758395, 1767829, 1607407, 1579298, 1537499, 1537616, 1406976, 1424292, 1462309, 1664680, 1816395, 1745863, 1636698, 1626984, 1777542, 1827270, 1781512, 1764768, 1789440, 1897220, 1793994, 1737789, 1724228, 1607292, 1732581, 1883022, 1939392, 1782488, 1720415, 1738858, 1769037, 1724723, 1690873, 1763156, 1780756, 1744852, 1743368, 1769520, 1872471, 1942797, 2083869, 2011584, 2009394, 2225915]
14714B225915L3574m4790j1358K3987j20970j15733N4682J64807J4010r0122j3635
14703B120367P5999K34034J91049K213K3307p1369J6907m7477K9106q1725J02861
14692B595272M5413J2725P3318j1903M0934Q6391L9951j04393L3811q9072j68393
14681B554054J3869M6362R4850M1325Q44N4664N2626M5553J06883J21717N6107
14670C188854l8775o3355N0129J7500K49705K06157L08l2087J1854M9570l3426
14659C606434J57866m1936j1816N1847P782k4312N4337N6822k7265R1022N4476
14648C975257k6703K715J65931R6357j9819J46255P7165K1191J4268p1535r5477
14637D285605P9618K17216n7498J4822M3384K41593K67869K3767p510J18662N283
$$ y = [2225915, 2259489, 2214699, 2203341, 2227328, 2106358, 1990625, 2045307, 2210114, 2224124, 2134002, 2120367, 2196366, 2430400, 2621449, 2623662, 2646969, 2575600, 2592507, 2545030, 2574136, 2492411, 2595272, 2640685, 2653410, 2726728, 2714825, 2755759, 2842150, 2882101, 2777708, 2811519, 2722447, 2554054, 2567923, 2614285, 2709135, 2750460, 2751304, 2805968, 2858594, 2904147, 3011030, 3132747, 3188854, 3150079, 3086724, 3136853, 3154353, 3404058, 3610215, 3610523, 3578436, 3590290, 3639860, 3606434, 3764300, 3722364, 3710548, 3762395, 3770177, 3745865, 3800202, 3857024, 3829759, 3920781, 3975257, 3948554, 3951269, 4117200, 4213557, 4193738, 4339993, 4417158, 4438349, 4452617, 4381082, 4285605, 4365223, 4582439, 4524941, 4539763, 4583147, 4824740, 5092609, 5116376, 5108866, 5227528, 5232811]
14626E232811M1328R822Q7140K25447K18084m7430j20846L6283Q7741M3780J66318
14615E980478K25089J76049r637K0728r5223R6732J72372M8521J89033L41164
14605G145306J06383J75869J60083K7753J15312J21721j7897o0826R7016J97670
14595H068390O6793J54933K74010n7055r1852J75991K64162K55946K73267Q1785
14585I466370kJ30981K57836L2954P0552K78999K29478K30097K54962K51961K00130
14574A1404318J37975K09487J09784J62621K20333J85550J71103J18904L41333
14565A3061408L08968L42401J98658K31570J84735J32561K71941K08015K57252
14556A5197509K26721J96006K83911L23369K65245M55542M16757K53574K09553
$$ y = [5232811, 5274139, 5283961, 5371101, 5596548, 5814632, 5767202, 5646356, 5682639, 5770380, 5814160, 5980478, 6205567, 6381616, 6371979, 6392707, 6297484, 6394216, 6566588, 6615109, 6804142, 7145306, 7251689, 7427558, 7587641, 7615394, 7730706, 7852427, 7834530, 7773704, 7870720, 8068390, 8135183, 8290116, 8564126, 8507071, 8415219, 8591210, 8855372, 9111318, 9384585, 9466370, 9466368, 9597349, 9855185, 9888139, 9958691, 10237690, 10467168, 10697265, 10952227, 11204188, 11404318, 11542293, 11751780, 11861564, 12024185, 12244518, 12430068, 12601171, 12720075, 13061408, 13370376, 13712777, 13911435, 14143005, 14327740, 14460301, 14732242, 14940257, 15197509, 15424230, 15620236, 15904147, 16227516, 16492761, 16948303, 17365060, 17618634, 17828187]
14547A7828187K69748L25275M37208O8803J84849M01338N46691M55721K68489
14538B0786309K00459K80320J28926K94185K93879L14315M11018L89179K09931
14529B3308521L12684M16795K16462J48650K74140M18763L24320K65899L67928
14520B6054162L23781J69339K84757L11742K43103n250J30931J72961K73240K17188
14510B8175954K07834J51074K03334R3894l5982n3022m6269R2387J40725K6531
14500B8956460m769n4290l3094K2870j44112j3647j6175k40386l05908r3027j745
14489B8072177k0794j38649j49944k13495k34461r0189k57188k41933j32889k10618
14479B6382017l51643l29781j60428k09434l20291k90468k76750k79900l14539
$$ y = [17828187, 18097935, 18423210, 18860418, 18929221, 19114070, 19515408, 20062099, 20517820, 20786309, 20986768, 21267088, 21396014, 21690199, 21984078, 22298393, 22709411, 23098590, 23308521, 23621205, 24038000, 24254462, 24403112, 24677252, 25096015, 25420335, 25686234, 26054162, 26377943, 26547282, 26832039, 27143781, 27386884, 27381634, 27512565, 27685526, 27958766, 28175954, 28383788, 28534862, 28738196, 28832090, 28796108, 28743086, 28696817, 28789204, 28929929, 28956460, 28951691, 28897401, 28864307, 28887177, 28743065, 28729418, 28713243, 28472857, 28166949, 28073922, 28072177, 28051383, 27912734, 27762790, 27549295, 27314834, 27224645, 26967457, 26725524, 26592635, 26382017, 26030374, 25700593, 25540165, 25330731, 25010440, 24719972, 24443222, 24163322, 23848783]
14470B3848783k31884k80633k26714j24381k87186l62747l15782k42164k65212
14461B1512080n06447l83301j85612j54287k66354k23560k18625l71063l00496
14452A8902335k42947j83436k78053k47097k16647k76921k98535k48881j62083
14443A6747735l62722k83164j59997k56952l16099k59488k02950j46464l20093
14434A4439806k46223j80716k13712k48405l21975k72901k8829k3947j69936k26208
14424A2506954k46725k08347j02913k41398k53156k16839j2279j48403p8824q0887
14414A0917183k18512l78568j65211k5803j70747j05546n9183j19122j22084k16174
14404I336233j73146p2990L6153m9489k32454j85330j41982j40758j66870m1192
$$ y = [23848783, 23616899, 23336266, 23109552, 22985171, 22697985, 22335238, 22019456, 21777292, 21512080, 21005633, 20622332, 20436720, 20282433, 20016079, 19792519, 19573894, 19202831, 18902335, 18659388, 18475952, 18197899, 17950802, 17734155, 17457234, 17158699, 16909818, 16747735, 16385013, 16101849, 15941852, 15684900, 15368801, 15109313, 14906363, 14759899, 14439806, 14193583, 14012867, 13799155, 13550750, 13228775, 12955874, 12927045, 12903098, 12733162, 12506954, 12260229, 12051882, 11948969, 11707571, 11454415, 11237576, 11225297, 11076894, 10998070, 10917183, 10698671, 10320103, 10154892, 10129089, 9958342, 9852796, 9793613, 9674491, 9552407, 9336233, 9163087, 9090097, 9126250, 9076761, 8844307, 8658977, 8516995, 8376237, 8209367, 8168175]
14394H168175j79314p8305j28925j77076j53166K1119k6057j48558k18474j96705
14384F882714k79055l7994J4052k0949K4780j3592p2491r20l745q4173j66515
14373F242112k48383r7667j03287k9647J001J9567n0151r8166j12400j87283p3533
14362E262163J11449j71564P832J6502j09632r7891k296o3389P283j61855J6611
14351D815213m6366j15034k38305j33205o0122L4362p9268p7442j32018j7452
14341C950363J8780O9182J14532j17830j16961j02384R9053M1321o7206j12086
14331C776764p0420q7285m2250l2845k4787o8169K8930j08712p8159k06826J32538
14320C218779O5585r0146j28675r288M1474O178j8615q9664p4097l2339R848J4236
$$ y = [8168175, 7988861, 7910556, 7781631, 7604555, 7451389, 7472508, 7446451, 7297893, 7079419, 6882714, 6603659, 6565665, 6579717, 6558768, 6583548, 6569956, 6497465, 6496545, 6492800, 6408627, 6242112, 5993729, 5896062, 5792775, 5763128, 5764129, 5783696, 5733545, 5635379, 5522979, 5335696, 5262163, 5373612, 5202048, 5209880, 5226382, 5116750, 5018859, 5016563, 4953174, 4960457, 4798602, 4815213, 4768847, 4653813, 4415508, 4282303, 4222181, 4256543, 4177275, 4099833, 3967815, 3950363, 3969143, 4038325, 4152857, 4035027, 3918066, 3815682, 3914735, 3956056, 3888850, 3776764, 3706344, 3619059, 3576809, 3543964, 3519177, 3451008, 3479938, 3371226, 3293067, 3086241, 3218779, 3284364, 3194218, 3065543, 3056255, 3097729, 3103907, 3085292, 2995628, 2921531, 2889192, 2899040, 2913276]
14308B913276k585k50568q0355Q0829J655m3806o209Q1744o0093M1519N2259j24003
14296B603663o1699J48975L0430n5065p3029k02728j57559k2282j5755J05711
14286B300662Q6001L8085j08L6914j5355j12544m1367r6087j06281o544N495j69561
14274A919310J3247P1917J05678K8621m4155o4642o1253p5458q8666j8279R5084
14263A881404J48512M494o5707m9219K5026N5983O0775j03103J26472k9492k04362
14252A850783j46749o6481n329p7466q416R1919J29808N3677p8621k59181j45597
14241A338347L2989J85242J30292m7890M3840K05608j9629k761N4363k2366J11386
14230B009421p1387o2417j27390k22815j22584P752J12172n1007j35672j05276
$$ y = [2913276, 2910691, 2660123, 2579768, 2660597, 2662252, 2618446, 2612237, 2693981, 2633888, 2675407, 2727666, 2603663, 2541964, 2690939, 2721369, 2666304, 2593275, 2390547, 2232988, 2210706, 2194951, 2300662, 2386663, 2424748, 2424640, 2461554, 2446199, 2333655, 2292288, 2196201, 2089920, 2083376, 2088871, 1919310, 1932557, 2004474, 2110152, 2138773, 2094618, 2029976, 1968723, 1893265, 1804599, 1786320, 1881404, 2029916, 2034410, 1968703, 1919484, 1944510, 2000493, 2061268, 1958165, 2084637, 2055145, 1850783, 1704034, 1637553, 1632224, 1554758, 1546342, 1638261, 1768069, 1821746, 1743125, 1483944, 1338347, 1371336, 1556578, 1686870, 1638980, 1682820, 1888428, 1868799, 1866038, 1920401, 1898035, 2009421, 1938034, 1875617, 1748227, 1525412, 1402828, 1410580, 1522752, 1471745, 1336073, 1230797]
14220A230797K0321J9867J7875q3564J2632J5376k8922n4214l3234L470Q1859
14209A202263J13656J43024o2948j55226o3259m7791p6842m8378Q3848j43747
14199I44600L7266J39801Q371k2666n2324N848J28015K6082q9669j03911K3926
14188A045339K9734m0910n8018m7633O0872O7896j3660j3289N7208K92J22502
14177A210333K0033M9774O6248l0731j45818o0044j2144n4319q151O3388k9750
14166A068819J7182Q2999n1837j12880j86805L5663j29686r1884J05952N6383
14156G93906l1667j7138K6244k8571j5842K549l7490R6813J49719q3444m6598
14145H08481K6641J84089m8434j93418k489j9917j7147l9549j091N7085j18619
$$ y = [1230797, 1251118, 1270985, 1288860, 1205296, 1217928, 1233304, 1204382, 1150168, 1116934, 1120404, 1202263, 1315919, 1458943, 1395995, 1240769, 1177510, 1129719, 1052877, 1004499, 1088347, 944600, 981866, 1121667, 1130038, 1107372, 1055048, 1060896, 1188911, 1214993, 1125324, 1021413, 1045339, 1075073, 1034163, 976145, 928512, 989384, 1057280, 1043620, 1030331, 1087539, 1087831, 1210333, 1230366, 1280140, 1346388, 1315657, 1169839, 1109795, 1097651, 1043332, 1035181, 1098569, 1068819, 1086001, 1169000, 1117163, 1004283, 817478, 853141, 723455, 631571, 737523, 793906, 762239, 745101, 771345, 742774, 726932, 729481, 691991, 788804, 938523, 855079, 808481, 835122, 1019211, 970777, 777359, 774870, 754953, 737806, 698257, 697166, 754251, 635632]
14134F35632m5214Q7175j8416q9733p5914p6952N1057K03918J80569p092q7597
14123G57433P0650Q952O3129K05001N6903j31248j57261k4951l5666l228j6514
14112G93200K7366R2844o9648k07504L3411O7695P844n1390K0005q312j20577
14101E84934p4759L6869L0782m5516M5552O1294l6693m0480N9159N4922m2544
14090F33520m8412m8667P2385l2947J6471m6546q3039K2880J34847N0077j07909
14079E62660k3906J3214Q1757m0575r05j55726l9680n7383k4522M9304Q1490m8947
14067C96781J09916J3156j21281J73952K40781M9067M3246o1361j53400r0466
14057F00391J4396L2482m2067K5526R5173o6534j44542J09724o4569j16459m187
$$ y = [635632, 590418, 677593, 659177, 569444, 493530, 416578, 467635, 671553, 852122, 845030, 757433, 828083, 837035, 900164, 1105165, 1162068, 1030820, 873559, 848608, 812942, 809714, 793200, 820566, 913410, 843762, 636258, 669669, 737364, 745208, 693818, 713823, 705511, 584934, 510175, 547044, 577826, 532310, 577862, 639156, 602463, 561983, 621142, 676064, 633520, 585108, 536441, 608826, 575879, 592350, 545804, 462765, 485645, 620492, 670569, 562660, 538754, 551968, 633725, 593150, 592245, 436519, 396839, 339456, 314934, 364238, 445728, 396781, 506697, 519853, 398572, 572524, 813305, 862372, 905618, 844257, 690857, 600391, 614787, 647269, 605202, 630728, 725901, 659367, 514825, 624549, 559980, 443521, 439334]
14046D39334k9752m5997j2000J05646j6732o2254N5181R4116P3447K2034q5332
14035E37691j0075k6590R6228l574n2903J90263P0273j46301k2183o9360j35485
14024D27984o1917J29633J03140N1918m466k0909j68210o8960o5789j1475j5430
14013B95519j37599M0601n1175k4873l919O3442J00375q539L9270j8783j25095
14002A69224m8279l4155R7073O7140R1877R7744J10017J10948j89313j75928l0991
13991B65357J22299J74947j3563j24864k09612n3074P464P4512j3426M708L094
13980B37842K47324K472p4265m105M1951j41108k6489O9395R6226l872N9682J8864
13968E23917j44137M8282m0264J3578K5020J06793J40497j96165j27026j27689
$$ y = [439334, 409582, 363585, 351585, 457231, 440499, 378245, 433426, 527542, 600989, 623023, 537691, 527616, 501026, 597254, 593680, 540777, 731040, 801313, 655012, 632829, 563469, 427984, 366067, 495700, 598840, 650758, 646292, 625383, 457173, 388213, 322424, 310949, 295519, 157920, 198521, 147346, 122473, 118554, 181996, 282371, 273832, 313102, 294319, 169224, 120945, 86790, 183863, 251003, 342880, 440624, 550641, 661589, 472276, 296348, 265357, 387656, 562603, 549040, 424176, 214564, 161490, 168954, 243466, 230040, 234748, 237842, 485166, 487638, 413373, 409268, 451219, 310111, 283622, 353017, 449243, 445371, 505053, 523917, 379780, 428062, 387798, 401376, 426396, 533189, 673686, 477521, 350495, 222806]
13958B22806O5736R6218k7020l7686J08040K23141o62j30743K6262n4769N9995
13947E51318m8952j58746o9269o1532q6655r7906l9122P3383J80501N3857j05546
13936A91331P73L9213J528O1182N7501m4615j15184j3118J16757k7610M0899j28704
13924A79953j17083R4529J46876m2512k00320l149L4694K7613R6516J29695l2380
13913C14432J76909j05134j76813O0810P1551n8167j6043n5185p2882r2958Q4253
13902A30773K44800R2996o9036q7657p8187j91041p4713R0749N8390N2019J8432
13891A87525L462J00715l5615Q9983j1600M9000n3163j1716r1846l9532J70097
13880C57310N5196q3837Q9584k265l6756q1712j44781m6091m5267n1513P858J23116
$$ y = [222806, 288542, 384760, 357740, 320054, 428094, 651235, 650573, 519830, 546092, 491323, 551318, 502366, 343620, 274351, 212819, 126164, 28258, -10864, 62519, 243020, 296877, 191331, 192104, 231317, 232845, 294027, 351528, 306913, 191729, 178611, 295368, 267758, 308657, 179953, 62870, 157399, 304275, 261763, 61443, 58294, 92988, 120601, 217117, 346812, 314432, 491341, 386207, 209394, 270204, 341755, 283588, 267545, 212360, 139478, 46520, 130773, 375573, 468569, 399533, 311876, 233689, 42648, -32065, 58684, 117074, 169093, 187525, 190987, 291702, 256087, 346070, 334470, 383470, 330307, 318591, 226745, 187213, 357310, 412506, 328669, 418253, 415988, 379232, 297520, 152739, 106648, 61381, 9868, 17726, 140842]
13868A40842K34216J31413o0466j90836r1121R4600J5397M1146j09320j25408
13858H0463L248J86151J27936m7161M9350J31999p3514j70286j0194k2058K3318
13847B79252N9236Q1933O5230o2309j7525J72562k03812j63728O869N0134M7503
13836C15345J3406N4920L5129n9974j6950J1766j69024l7833J40459K0300m5319
13825B62225n4948J9777R4942j4850j34647j13509j7704L8365P3258j30731Q4702
13814A06880J35662p0563K5837N273m7545j75560R215L9736L2524j4466L1875
13803G8868J11295J33109q9638q9738r1035L519j37m382l8097r4588N6125J54130
13791A29431P907Q4151k2447n312M9224J46167r4580j36982l3098r9216Q3095
$$ y = [140842, 375058, 506471, 446005, 255169, 164048, 258648, 274045, 315191, 205871, 80463, 83711, 269862, 397798, 350637, 399987, 531986, 458472, 288186, 277992, 255934, 279252, 338488, 420421, 485651, 423342, 405817, 578379, 374567, 210839, 217708, 267842, 315345, 328751, 383671, 418800, 358826, 341876, 353642, 184618, 146785, 287244, 307544, 262225, 207277, 227054, 321996, 307146, 172499, 58990, 41286, 79651, 152909, 22178, 106880, 242542, 171979, 197816, 203089, 155544, -20016, -10801, 28935, 61459, 46993, 78868, 190163, 323272, 233634, 143896, 52861, 56380, 56243, 51861, 13764, -80824, -24699, 129431, 137338, 221489, 199042, 193730, 242954, 389121, 294541, 157559, 124461, 25245, 108340]
13780A08340J02787Q6474J10998L7656q9880q6269n7796o9717L7757O0328J92356
13769D33034j7071j16438n0229O5150m5758p5075M8383m903J8070k4337L7904
13758B68730O1337j57086k19127J9310J58378Q501q8486J48162Q0367l1233j38101
13747A10752J22624J35841R2548r6396q4176k75508k1641O020K9551l3290o9910
13736h3585R9752n0859N9943J65289o1369j38211J07496M1632j4288q1051o854
13725C7895J73153M0114N460L8318j5625l8382r5924j31670r9228K33766O1182
13714B09059j28918J9326J3380r7307N889J09103l0198k7990o970R3593J37382
13703B96349Q2593m6135l6294q5540j7767j1176M057k0393p571m0803m2036O1843
$$ y = [108340, 211127, 297601, 408599, 446255, 356375, 270106, 212310, 142593, 180350, 240678, 433034, 415963, 299525, 249296, 314446, 268688, 193613, 241996, 237093, 255163, 230826, 268730, 330067, 172981, -46146, -26836, 131542, 140043, 51557, 199719, 280086, 248853, 110752, 233376, 369217, 461765, 365369, 281193, 5685, -15956, -9936, 19615, -13675, -83585, 16167, -34692, 25251, 190540, 129171, -9040, 98456, 140088, 125800, 44749, 37895, 211048, 251162, 256622, 294940, 279315, 240933, 145009, 13339, -85889, 147877, 209059, 80141, 99467, 112847, 15540, 21429, 130532, 100334, 72344, 65374, 158967, 296349, 378942, 332807, 296513, 210973, 193206, 182030, 186087, 165694, 158123, 117320, 75284, 137127]
13691A37127L9766J03833p1209j33032N9432K3257q767o4783K6814Q5222o5208
13680A32452p9064j1017K8870J52150n4365m342J16792R5751K6383k8498j04280
13669B70832j11708p0911l784P7462p5634j3364K177J2950j1491j8990P9914k747
13657A34706q6714m447j7920N6852N1517J11227J64547K8389o1111j17127p5257
13646A84662l8709O8716R8736J32802n7442n0583m410j7008L3690j30169j77302
13635D2983r8010J34016K92136J5891j97431j10245j1701R3221P1829j0937n1683
13624A70069r4786m6837M4093K3450R6575O7552k683p7531q2053p3561n3830M2216
13612A2674O0974j98950J08723J37846q3557j53086M299K05596J14339o7949L8885
$$ y = [137127, 176893, 280726, 209517, 76485, 135917, 159174, 150407, 85624, 112438, 197660, 132452, 53388, 42371, 71241, 223391, 169026, 164684, 281476, 377227, 403610, 375112, 270832, 159124, 88213, 84429, 161891, 86257, 72893, 75070, 88020, 76529, 57539, 137453, 134706, 47992, 43545, 25625, 82477, 133994, 245221, 409768, 438157, 377046, 259919, 184662, 145953, 214669, 313405, 446207, 388765, 338182, 333772, 316764, 350454, 220285, 42983, -55027, 78989, 371125, 387016, 189585, 79340, 67639, 160860, 232689, 221752, 170069, 75283, 28446, 72539, 95989, 192564, 260116, 257433, 179902, 97849, 24288, -29542, 12674, 73648, -125302, -16579, 121267, 37710, -115376, -111077, 94519, 208858, 140909, 179794]
13601A79794M0868m0526J16724k8561m8016N2514r173J3113R101j68432o5669
13590E1737j15516O2512J86741J6108m5030k593k3948M3888J5312L1945p1630
13579A49526n9752n601N0637l796J64186o5160n1728P0760N2514q4397j37564
13568G9625m3999N7705j13554o4580N039j29534J58214J7161r8702M0327J13736
13557B1438J63242j23744j67624L3175J75878R9172k1642q803j72196q4846j4196
13546a00146M9031J2009P4425j5926L7312l9788K7620L2741O843K9094q0224L8500
13534G1491m5753j26580j5294p4519l0629p653J04100M2539J3716L6531L9666
13523G615j9150K408k5115M5931L2065K0134k7285L3621M9017M5809O3576O2476
$$ y = [179794, 220662, 180136, 296860, 268299, 220283, 272797, 263624, 276737, 285838, 117406, 51737, -63779, -1267, 185474, 201582, 156552, 153959, 130011, 173899, 189211, 221156, 149526, 89774, 84173, 134810, 131014, 295200, 230040, 178312, 249072, 301586, 217189, 79625, 35626, 93331, -20223, -84803, -79764, -209298, -51084, -33923, -132625, -92298, 21438, 184680, 60936, -106688, -73513, 102365, 201537, 179895, 171092, -1104, -85950, -100146, -51115, -39106, 35319, 19393, 56705, 16917, 44537, 77278, 84121, 113215, 32991, 71491, 25738, -100842, -116136, -190655, -221284, -228937, -124837, -82298, -68582, -32051, 7615, -11535, -9127, -34242, 11689, 43754, 63888, 36603, 70224, 119241, 165050, 228626, 291102]
13511B91102J8027k49804j94526m9349J85202K31477R7233l8854k00623j79228
13501h9343p4375K51738J19661l8028Q2632j7736m5188j66027p792M3837q4090
13490b4711m9549O858M8310J50784M3121j43415q0215J70975J39929k0959K6579
13479B67707J8088j57163j79263k3493M3977O4797K6657J1910P175J4572N1581
13468A46545q0727l9563O9650p9406r0875k0476L7913q3476q031J02915j4295
13457e9826K00149P8086J11025K6679q2779j6802j13115M475N7992q9012p8305
13446C8567J26392P3799K4498j3528N9599L29l7966J37437j50638k18134j17982
13435g7627n1188J7535J03923P7334l21N2188J03923N2206L6115r4687j30772
$$ y = [291102, 309129, 59325, -135201, -184550, 652, 232129, 329362, 290508, 89885, -89343, -163718, 88020, 207681, 169653, 252285, 234549, 189361, 23334, 15542, 59379, -24711, -74260, -67402, -19092, 131692, 174813, 31398, -48817, 122158, 262087, 241128, 267707, 285795, 128632, -50631, -74124, -30147, 34650, 61307, 73217, 80392, 94964, 146545, 65818, 26255, 95905, 16499, -74376, -94852, -56939, -140415, -148446, -45531, -59826, 140323, 218409, 329434, 356113, 273334, 256532, 143417, 147892, 205884, 116872, 38567, 164959, 238758, 263256, 249728, 309327, 309656, 271690, 409127, 258489, 40355, -77627, -128815, -111280, -7357, 69977, 69656, 121844, 225767, 277973, 314088, 219401, 88629]
13424H8629k1702O53J32123o659j5900Q992k5966j2558L5694O5545r3147k0141
13412A35563J3133K6123O6504p3009j30424j1763j23639m8385k4141J65923Q9262
13401H5147n6550p5848R3649R742L8106M0279L4835K5942Q4197j06537r1282l4986
13389D6694L6647J2494l317N6092J01728J3054n1372J13002o6556j87281M1313
13378A12498N1588j10268j47815O0788K5095K9688J1928q6725K697N1529J00439
13367A01442p0107j26502r695J4024J25966J31274P3283k8963k6495j34765k1410
13356B8052J11330J3941n5077m209j43296m2311J8422r0397j12307P1874J45637
13345e8341M4828K4942o2554n5986O7098k1447N0292J19552o8927M6754R05K2557
$$ y = [88629, 66927, 67580, 199703, 193044, 177144, 186136, 160170, 147612, 183306, 248851, 155704, 135563, 148696, 174819, 241323, 168314, 37890, 26127, -97512, -145897, -170038, -4115, 85147, 28597, -47251, 46398, 56140, 94246, 134525, 169360, 195302, 279499, 172962, 81680, 46694, 83341, 95835, 92518, 148610, 250338, 263392, 212020, 325022, 258466, 71185, 112498, 164086, 53818, -93997, -33209, -8114, 21574, 33502, -53223, -50526, 1003, 101442, 31335, -95167, -104862, -90838, 35128, 166402, 239685, 210722, 184227, 49462, 28052, 139382, 153323, 98246, 94037, -49259, -91570, -73148, -163545, -275852, -203978, -58341, -13513, 11429, -51125, -107111, -40013, -61460, -11168, 108384, 39457, 86211, 87116, 109673]
13333A09673o3416k8923J50651P7775j40882n5030K6590j20153K2695O1255N7438
13322I7673n1770J0597L4731p252L9163l3111r7560K3903p1022q5873J23680M1939
13310B5098j8784J5200N838P6279P9877R4271k2082j61673o4410J18302p734k8807
13298A11375l3396j3428o3775o6344P3517K12313J699o3089O2314n2273j05714
13287F3199l4339K5017J19615r4344j77325q2872N0032r8916k0945J41693N006
13276a04179k370P4119P6572r0464m9817K1941k700k9922J10629m2065k1813o2645
13264a22714l5691k1908L9763J46960P840j33798j9604P0919J60355O6262j43477
13253A4907r0887o705J10843R8418j04555P155j2263l4120O7225j848L577J22180
$$ y = [109673, 46257, 17334, 167985, 245760, 104878, 49848, 76438, -43715, -21020, 40235, 97673, 45903, 56500, 91231, 83979, 123142, 90031, -7529, 16374, -54648, -140521, -16841, 25098, 6314, 21514, 27352, 103631, 183508, 277779, 255697, 94024, 29614, 147916, 140182, 111375, 77979, 64551, 776, -65568, 7949, 220262, 221961, 158872, 221186, 168913, 63199, 28860, 53877, 173492, 79148, -98177, -181049, -131017, -229933, -250878, -109185, -104179, -106549, -32430, 44142, -46322, -96139, -74198, -76898, -106820, 3809, -38256, -60069, -122714, -158405, -180313, -140550, 6410, 14250, -119548, -139152, -68233, 92122, 158384, 14907, -75980, -82685, 28158, 126576, 22021, 29176, 16913, -17207, 50018, 48170, 51747, 173927]
13241A73927O6427r8151p0294O6839M7615o5331L1737l9401k1195J5698l4127
13230G3744j26276L011J129L9834N3756q0272N9467J0202o079r5827o6122J0593
13218a22840j5627j3492O23J01249R007n4071j8336P0204j00005j7703J16556
13207d4435J66380R6323j8544Q5380n5026j18251j13930l8939J20930m473q3851
13196h436n6055M9398J25309o3705k4109P0824J28722L3473j07272j10255k0812
13185A7082R5628P6442m2489l2601P3797j25850P075j20584o1492Q1008N8278
13174B6294p3103k3165P4220J41148k5221L415O916J18965l2215L0989n43J438
13162B49138M5399k12687o3954k7278O5055J46428p9452o1545k4826j19529l4175
$$ y = [173927, 240354, 142203, 71909, 138748, 186363, 121032, 152769, 113368, 92173, 107871, 73744, -52532, -49521, -48392, -8558, 45198, -35074, 24393, 34595, 28516, -67311, -133433, -122840, -138467, -151959, -151336, -50087, -41080, -95151, -113487, -43283, -143288, -160991, -44435, 121945, 218268, 199724, 285104, 230078, 111827, -2103, -41042, 79888, 75415, -8436, -64491, -15093, 110216, 46511, 22402, 93226, 221948, 255421, 148149, 37894, 17082, 112710, 189152, 146663, 114062, 187859, 62009, 69084, -51500, -112992, -31984, 26294, -46809, -69974, 4246, 145394, 120173, 123588, 130504, 249469, 217254, 248243, 247700, 249138, 294537, 81850, 17896, -9382, 55673, 202101, 122649, 61104, 36278, -83251, -117426]
13151a17426M1878J05085q0536q3280J7259N051j67167q608J318M5805p5195J2173
13139c03643J39394Q8648M7871J78064k250k25323r9721P896J06119Q7478l519
13128B1014r5883l5828M6472O6239J51791N9399o1095K2593j19969r5055Q2272
13117D1950K6992q7839j8811J50410J62878P2769L4977j00128k41076j29539j91901
13106b79318q9243P8887K00840P8314k153l9737R0640J8188R7928O4559M10j06065
13094A13250l1683j06202M1619K02494J7988k1734L2681L515N2046j5560k9673
13083B58741L6606M4956m3249j86773J10631j6229l9714j81526P7676Q0171p2024
13072F9266L7246Q2092r134o2709k6249o7070l7827J17957j7210q7544r3535q8558
$$ y = [-117426, -75548, 29537, -50999, -134279, -117020, -111969, -279136, -287744, -286426, -240621, -315816, -303643, -164249, -75601, -27730, 150334, 148084, -77239, -176960, -169064, -62945, 24533, 21014, -74869, -110697, -64225, 2014, 153805, 213204, 152109, 174702, 54733, -40322, 41950, 68942, -18897, -37708, 112702, 275580, 348349, 383326, 283198, 42122, -87417, -279318, -368561, -289674, -88834, -10520, -12673, -52410, 38230, 56418, 154346, 218905, 219315, 113250, 81567, -24635, 16984, 219478, 237466, 215732, 248413, 251928, 303974, 288414, 258741, 295347, 340303, 297054, 110281, 220912, 204683, 164969, -16557, 61119, 141290, 69266, 106512, 188604, 179470, 116761, 90512, 23442, -14385, 103572, 86362, -1182, -94717, -183275]
13060a83275j4096J60154K22207j9618j54221j5026K3611j33357k4591p1746P4774
13049a35184J2537O0262J35607J8351j97986j4346p9657O1020J73082J62661j3466
13038A82881j6219j01219j24570m6004J6210L5142r322J6595k3660O8851O8471
13027F7156J17082J1766n2430q0217O4533m1196j59251J07259J62658J16474j07670
13016B06164j00153j0273r997l7457M7985Q3125q5159l8756M9851k03009j7244
13005a14923J70411j6275O0788L0971l0858Q3078o017J07543P6271m9174l0426
12994B81389Q8110K32356N8635J56619K38762K58791L50247L93887L36285R6140
12984B491221n3385k23622k11286k90262j70627k53586l54380j24675k05211p3175
$$ y = [-183275, -197371, -37217, 184990, 165372, 11151, -3875, 19736, -113621, -138212, -209958, -135184, -122647, -62385, 73222, 91573, -106413, -120759, -200416, -139396, 33686, 196347, 182881, 166662, 65443, -59127, -105131, -88921, -53779, -63101, -46506, -70166, -1315, 67156, 184238, 196004, 143574, 63357, 127890, 86694, -72557, 34702, 197360, 313834, 206164, 106011, 95738, 85741, 48284, 96269, 179394, 94235, 55479, 105330, -97679, -114923, 55488, 39213, 100001, 130972, 100114, 183192, 177175, 284718, 360989, 311815, 281389, 369499, 601855, 660490, 817109, 1055871, 1314662, 1664909, 2058796, 2395081, 2491221, 2437836, 2214214, 2002928, 1712666, 1542039, 1288453, 934073, 809398, 604187, 531012]
12974E31012Q2092L719j12903j62208k04632k3133j3303Q5341J53505l9544k5755
12963B74191M01j01190l9308J5451m1212N5611J50750o801l9940q5909K8460J08937
12951C19441N7844k6992n7395n5485q0584M7087O3347P4594J972J8777M8694O1874
12939D73174q0603j50713p7474n5256o188k164r8575O489R606N0254N7551Q5466
12927B11567k0182Q391j36008j0128m3067m3403O9140J38291L9034j29789j55910
12916g2064L8571k7355L9101j9290K4999M0565k9551R5360l724M992k6959r871
12904E4774j46022J5222L15619K7538n7851m891o8822n6116J5246J02193j04814
12893I2076R4682M5422o5576k6492J03320O3661p8610j2164L0832K5053o2005
$$ y = [531012, 613104, 616823, 503920, 341712, 137080, 113947, 100644, 185985, 339490, 299946, 274191, 274592, 173402, 134094, 149545, 108333, 163944, 314694, 307893, 267953, 182044, 210504, 319441, 377285, 350293, 292898, 237413, 156829, 203916, 267263, 341857, 343829, 362606, 411300, 473174, 392571, 241858, 164384, 109128, 102940, 100776, 2201, 8690, 18296, 68550, 126101, 211567, 191385, 199776, 63768, 53640, 10573, -32830, 36310, 174601, 213635, 83846, -72064, -33493, -60848, -21747, -41037, -16038, 24527, -5024, 90336, 86612, 91604, 64645, 54774, -91248, -76026, 239593, 267131, 209280, 204389, 135567, 79451, 94697, 196890, 92076, 186758, 232180, 166604, 140112, 243432, 307093, 228483, 216319, 247151, 272204, 210199]
12882B10199P038L415j44819j63507J1550J70J68379L2867n2029K3453n2676j4144
12870B9896K7036N8030J22803j055j04525M0691o9823k47868j49995P2711R8650
12859a23449Q1035J0572o9056p8485J56555J16181M1326p1910M100r3569o5105
12848i1805J39246P8662j45535J1771m0827M0293J8361K2681K06130J15386M7164
12837D01527q3914r4856j53097Q1834j3531m1999J03588O6063p8011L618K3675
12826B14897J5077k8598J14788l9084L603o1361J76177P3537k47235L1653R8933
12815C52387L1258k8442N9365N5847p5011J4875o1899M3450K34519J37537j0418
12804G53468P3342J70076Q1965j51189k01447n2977O3583J6737q214j3949q4574
$$ y = [210199, 217237, 220652, 75833, -87674, -76124, -75954, 92425, 125292, 73263, 96716, 44040, 29896, 56932, 114962, 237765, 236710, 132185, 172876, 103053, -144815, -294810, -222099, -123449, -42414, -31842, -100898, -179383, -22828, 93353, 134679, 62769, 66869, -26700, -91805, 47441, 126103, -19432, -7661, -48488, -8195, 10166, 32847, 238977, 354363, 401527, 317613, 222757, 69660, 151494, 137963, 95964, 199552, 265615, 187604, 191222, 214897, 229974, 201376, 316164, 277080, 280683, 219322, 395499, 469036, 221801, 253454, 352387, 383645, 355203, 414568, 470415, 395404, 410279, 348380, 391830, 626349, 763886, 753468, 826810, 996886, 1078851, 927662, 726215, 673238, 736821, 753558, 745344, 731395, 646821]
12793F46821r0833r6720k0794O6154R6977j46689r9228R1736J34871J41712J7464
12782G41471J07976J26061Q6739J29278M1638q1033j72187k53513K1979J73654
12772I22063K17295l1175J48251j1795p2233L6260q9860j61543j12365j54530
12762F90368k32406p7397L7909R4126p6585r2750p291O0942L4405q8707Q1050
12751D23664J46120J1360l3047J9433l302o6456J4579J88953P8988O546J00994
12740H87832P0328J8458j10730l5445j4834R0871J91012J23630K85948M04958
12730A912028K93335M50281L87886K30832N6873R7218J89189j52598l32005m55790
12720B677249o54053o14774m25276l0596j10656j49363m2285L0221P67k04188
$$ y = [646821, 555988, 459268, 438474, 504628, 601605, 454916, 355688, 447424, 582295, 724007, 741471, 849447, 975508, 1062247, 1191525, 1233163, 1152130, 979943, 726430, 748409, 922063, 1139358, 1108183, 1256434, 1244639, 1172406, 1208666, 1118806, 957263, 844898, 690368, 457962, 380565, 418474, 512600, 436015, 343265, 335974, 396916, 431321, 342614, 423664, 569784, 581144, 548097, 567530, 564228, 497772, 512351, 701304, 780292, 786838, 887832, 958160, 976618, 865888, 830443, 815609, 906480, 1097492, 1221122, 1507070, 1912028, 2205363, 2655644, 3043530, 3274362, 3331235, 3428453, 3617642, 3465044, 3133039, 2677249, 2023196, 1408422, 983146, 952550, 841894, 692531, 650246, 680467, 681234, 477046]
12710D77046j03062N3185P0827J13275M1704o6099L7144J03505J55611q9658l8440
12699G55038k6514o7222n539l4090l2123J641O3693P2439K3128m3776J66685N9164
12687I32524m060N8190k06756o6262J8301j05446k884J07245k0676J5548N6134
12676G81858m0255m8550r1088l9007o3529l997P3393R9775p4362P5230L6144l0020
12664F75592n425J574R1481J2596N3388r8556l7141L1005K05880Q0464r322m8791
12652I52745k03657J26778L3739N6259L4454r9384n3589j06984L9788J71768J21868
12641A073785r5421J16677M1063k8739K1635p296k1190L829o0224J03942J05899
12630A253960j9515r9596j25230o689L9839J56N4161o6697l9272L6633Q0974J38288
$$ y = [477046, 373984, 427169, 497996, 611271, 652975, 586876, 624020, 727525, 883136, 793478, 755038, 728524, 661302, 655763, 621673, 589550, 591191, 654884, 727323, 750451, 706675, 873360, 932524, 928464, 986654, 779898, 713636, 731937, 626491, 623607, 730852, 710176, 725724, 781858, 741603, 693053, 601965, 562958, 499429, 495432, 568825, 668600, 594238, 669468, 705612, 675592, 670167, 671741, 763222, 775818, 829206, 730650, 693509, 724514, 930394, 1010858, 1001536, 952745, 749088, 875866, 909605, 965864, 1000318, 900934, 847345, 740361, 780149, 951917, 1073785, 978364, 1095041, 1136104, 1107365, 1129000, 1121704, 1100514, 1104343, 1044119, 1148061, 1253960, 1234445, 1134849, 1009619, 1002930, 1042769, 1042925, 1097086, 1030389, 991117, 1027750, 1108724, 1247012]
12618A247012K12711K48822Q5089r3743q0790Q5401J12488j671r2018J3153Q5390
12607A821844n8620r739l7691k8110Q4971R688J78329J19304O4916j24823M4279
12596B064348P8806O6930J40161J45752J13224O5041L04001J09225R5818J42743
12586C326049J3627L38376L70261L51615L03734J93900K24720J56089K46891L39235
12576E864497L55727M45132M36143M37873N26745N38251O09296N55091P19186
12567A0487941R69416J086610J247864J237758J445800J867626K089646K627781
12559B3060442L224039M232885M833798N781198P492949R945533J3198187J8157890
12551H9926921K6442014M0089951N8304956O8737046O0313812N3120001N6123870
$$ y = [1247012, 1459723, 1708545, 1793634, 1699891, 1619101, 1704502, 1816990, 1815319, 1723301, 1736454, 1821844, 1763224, 1753485, 1715794, 1687684, 1772655, 1782343, 1960672, 2079976, 2144892, 2020069, 2064348, 2143154, 2210084, 2350245, 2495997, 2609221, 2674262, 2978263, 3087488, 3183306, 3326049, 3339676, 3678052, 4048313, 4399928, 4703662, 4897562, 5122282, 5278371, 5525262, 5864497, 6220224, 6665356, 7101499, 7539372, 8066117, 8604368, 9213664, 9768755, 10487941, 11457357, 12543967, 13791831, 15029589, 16475389, 18343015, 20432661, 23060442, 26284481, 30517366, 35351164, 41132362, 48625311, 58570844, 71769031, 89926921, 116368935, 156458886, 214763842, 283500888, 343814700, 396934701, 453058571]
12544D53058571M8539986K0438079k7136401n8552097m7212211m8189015p5470403
12537B65476509p2054525m6427564k7909921j7774171j2273238r408968p550612
12530G2077510o010670m867074l949122l054765k496785k263546j959027j605376
12522D5871145j774849j864500j896735j849922j887363k112351k122829j863977
12514C0498619j741610j422794j311476j225079j068157q21931q06119p22312
12506B1379141o74493p22450p25756p80425p41067n63697m36280m61346n56181
12497A5717446m88548n45241l96773n20526n13552l62028m84990l96824m10424
12488A1598540k87739m46630l98524l56506k14075l13778k69500k29354j73969
$$ y = [453058571, 501598557, 522036636, 494900235, 436348138, 389135927, 340946912, 265476509, 193421984, 146994420, 119084499, 101310328, 89037090, 79628122, 72077510, 66066840, 61199766, 57250644, 54195879, 51699094, 49435548, 47476521, 45871145, 44096296, 42231796, 40335061, 38485139, 36597776, 34485425, 32362596, 30498619, 28757009, 27334215, 26022739, 24797660, 23729503, 22907572, 22101453, 21379141, 20704648, 19982198, 19256442, 18476017, 17734950, 17171253, 16734973, 16273627, 15717446, 15228898, 14683657, 14286884, 13766358, 13252806, 12890778, 12405788, 12008964, 11598540, 11310801, 10864171, 10465647, 10109141, 9895066, 9581288, 9311788, 9082434, 8908465]
12479H908465j75052k87388k05702j87276l26401k40260j7609n0369k93989k42788
12469F881631j24066p0240j73236j77656k45346k99084k14538j52186j17549j23743
12459E183987j96861j38562j81266j50014k08408p1131j29346k16892j73790M7570
12449C765287J1606m7440q8582l8537r2681l6422j21662j50440j6279N9997K3313
12438C268160j56801j96677k25697j26469j09291p8447p9515j04765J18558n0627
12428B258429M0378J32398k2100q8702o4955n1733n0072J8543Q6008j4293L6038
12417B279939k19507k66884q2509J5262q1229k76904q3697L311j22160r6772n93
12406A068257j30846r6524P1404L738l0132R0840Q617j17745J10225r9296j72331
$$ y = [8908465, 8733413, 8446025, 8240323, 8053047, 7726646, 7486386, 7468777, 7418408, 7124419, 6881631, 6757565, 6687325, 6514089, 6336433, 6091087, 5792003, 5577465, 5425279, 5307730, 5183987, 4987126, 4848564, 4667298, 4517284, 4308876, 4237745, 4108399, 3891507, 3717717, 3765287, 3776893, 3729453, 3640871, 3602334, 3509653, 3473231, 3351569, 3201129, 3184850, 3244847, 3268160, 3111359, 2914682, 2688985, 2562516, 2453225, 2374778, 2295263, 2190498, 2309056, 2258429, 2298807, 2431205, 2409105, 2320403, 2255448, 2203715, 2153643, 2172186, 2258194, 2243901, 2279939, 2060432, 1793548, 1711039, 1726301, 1645072, 1368168, 1284471, 1287782, 1165622, 1068850, 1068257, 937411, 840887, 912291, 916029, 885897, 976737, 985354, 867609, 977834, 878538, 706207]
12395G06207j14290j41203P6025N5577r1850k2429j51511J2820M3519J7201o3909
12384C26157J5382J46517N6220N9441m464j33281O5076N4199L3344k19361n8501
12373C40729J21853n4859j07601J7466R4912J62025P5756J3910q2634j97397j85155
12362A99005P5822k6025M4541J57518M1934j1109K3335j52583j07482k5813k415
12351B16728j962Q1023k8022J40703L7822Q2113j03886j05207p8844R746O6788
12340C17002j134O2872J09774Q7038n9431n8072q5667k7527j08091q6020O8746
12329B19490J27698j4976l9458R128L6334p2751O2481J31172N6613k952r2049
12318D20730j01278k6056J08714k83p7122N6399K5469l9471j04143j57276N2013
$$ y = [706207, 591917, 450714, 526739, 582316, 490466, 468037, 316526, 329346, 372865, 390066, 326157, 341539, 488056, 544276, 603717, 599253, 465972, 531048, 585247, 618591, 399230, 340729, 462582, 407723, 300122, 317588, 412500, 574525, 650281, 664191, 581557, 384160, 199005, 274827, 248802, 293343, 450861, 492795, 481686, 505021, 352438, 244956, 219143, 216728, 214766, 295789, 267767, 408470, 446292, 528405, 424519, 319312, 240468, 250214, 317002, 315868, 378740, 488514, 575552, 516121, 458049, 372382, 344855, 236764, 150744, 219490, 347188, 332212, 292754, 301882, 338216, 265465, 327946, 459118, 515731, 512779, 420730, 319452, 293396, 402110, 401827, 324705, 381104, 406573, 367102, 262959, 105683, 157696]
12307A57696J42618P3985J62326L8544j67687q7862m3653M776M6386r9963j73635
12296E3531J8837K34381j07574j2920N7565j7680J5816j3934j04495m9909R0706
12285A64324J57227j3090r6845r727M671k6071K0684n8504O7691K34841K3440
12274D68641j34406j26135J01663J08355O267j10307j24674n049m2838p0346j30647
12263e9476J07146J71160j81279J0808J82898J04369j8917j08300q3692O9174
12253A93891K8380k3218n8939p0904j068Q0082M2656J07032j6725j65486j2505
12242A03196R4267O3972j7772j5598J084J38237M508k25324j60784q2351Q0681
12231a5884J84416J8154q2948o2609K1551M8361J1705j5951j19466r475J8180
$$ y = [157696, 300314, 374299, 536625, 575169, 407482, 319620, 275967, 280743, 327129, 227166, 53531, 72368, 306749, 199175, 186255, 243820, 226140, 241956, 228022, 123527, 73618, 164324, 321551, 308461, 211616, 201889, 206560, 180489, 201173, 142669, 210360, 445201, 468641, 334235, 208100, 309763, 418118, 424385, 314078, 189404, 184355, 141517, 71171, -59476, 47670, 218830, 37551, 48359, 231257, 335626, 316709, 208409, 124717, 193891, 222271, 199053, 140114, 69210, 68142, 148224, 190880, 297912, 281187, 115701, 103196, 197463, 261435, 243663, 228065, 229149, 367386, 371894, 146570, -14214, -96565, -15884, 168532, 186686, 103738, 41129, 62680, 111041, 122746, 106795, -12671, -22146, -3966]
12220c966P2943k21219m4925P0092M1416Q6986J05343m4066k520q3852M5263l9822
12208a8327j33570P9287K27885J15665n4848m7572j01667n5570k6316P9406m3950
12197B0423j8670j11947J9545M3460j5594l9610m0876N588J13924K6050L8527
12186D0820r0306K0394n4840K0832M3648j12607j16751N658J73058J23270L9525
12175I2701P0817K0865l6788o8694l1841l0309K8771j701j37444k6924O9258l3381
12163h4670j85773K9232O2936L5431o4908n414l4906P6063J97388p0273l9943
12152h4837R0767p4460Q1947K9330o9784j5542J2757l0852M5145J67763r0064
12141F2170q5730j9309K2020j08125K6657R2312K5263O1744o9124q7411K6305
$$ y = [-3966, 68977, -152242, -197167, -127075, -85659, 1327, 106670, 62604, 60084, -23768, 21495, -18327, -151897, -72610, 155275, 270940, 216092, 168520, 66853, 11283, -15033, 64373, 20423, 1753, -110194, -90649, -47189, -62783, -102393, -143269, -137681, -23757, 2293, 40820, -49486, -29092, -83932, -63100, -19452, -132059, -248810, -243152, -70094, 53176, 92701, 163518, 184383, 147595, 78901, 47060, 16751, 45522, 43821, -93623, -120547, -51289, -84670, -270443, -241211, -178275, -142844, -207752, -213166, -248072, -172009, 25379, -44894, -84837, 5930, -68530, 13417, 42747, -27037, -42579, -29822, -60674, -15529, 152234, 62170, -23560, -42869, -20849, -128974, -102317, -10005, 15258, 77002, 7878, -79533, -53228]
12130e3228O4085J28308J10138Q7291n7219j36289j02780m3586q493J09399l3296
12119F4330n2498j30884N8520P7952J32884j5042q8667j12226J0001J83321O3202
12108A90893L74k9463J75805J22420R3237J49606J48472K94013L75883J25017
12098A646257L52934L51605K90164J32405j71802k03779j92873l15232m17460
12089A472219m54837k60276k76562K3593O7740p8838q1885q3116j6653P50k7535
12078B84600P5947J39996j926o5459n8873m2192k4411k1405M3668o2894K8876
12067B95927n0323q1023j73K9231q9636j10837R3884j77255K427O9664K8160O6320
12055G6366j06652k9704o82l6020N5963O5999o8107k836J9848J23153K1174j67070
$$ y = [-53228, 10857, 139165, 249303, 336594, 279375, 143086, 40306, -3280, -11773, 97626, 64330, 11832, -119052, -60532, 17420, 150304, 135262, 46595, -65631, -55630, 127691, 190893, 191267, 161804, 337609, 460029, 553266, 702872, 851344, 1145357, 1521240, 1646257, 1999191, 2350796, 2640960, 2773365, 2601563, 2397784, 2204911, 1889679, 1472219, 1017382, 757106, 480544, 504137, 571877, 493039, 411154, 328038, 311385, 312135, 284600, 360547, 500543, 498617, 433158, 374285, 332093, 307682, 286277, 329945, 267051, 295927, 245604, 164581, 164408, 193639, 104003, -6834, 87050, -90205, -87778, -18114, 10046, 76366, -30286, -59990, -60672, -96692, -40729, 25270, -42837, -45673, -25825, 97328, 118502, -48568]
12043d8568N7895M8751k9060k6478n783O37K2133J2838q1972J00350J13599N2174
12031B16516L1091k9298j61549n3745P541j738o4455M33M1782p8569L7904j0832
12019f4919o4251l3209q0957O1553J39453P1691J07519L8523j03035o9513m489
12008a634O2511l9068J1947J05038P0493j32706r9322Q9513l9200k6273L7021
11997C8320J54614R6313n6187j24722k8965j19419K4540K6714m9208j12056r267
11986a59323N6991O9021j189o4348P0130M5402K8769Q049J04835O6334j04518
11975A20153j48048n1316m9082J20346J05416K4516k2190j18782J6007L5943N5828
11964H8791P844M838N8099n6691o8552L0172m8695O5882J48730m6936k13906l6740
$$ y = [-48568, 9327, 58078, 29018, 2540, -3243, -2606, 19527, 32365, -49607, 50743, 164342, 216516, 247607, 218309, 56760, 3015, 10556, 8818, -55637, -55204, -13422, -91991, -54087, -64919, -129170, -162379, -243336, -181783, -42330, 29361, 136880, 175403, 72368, 2855, -1634, 60877, 21809, 33756, 138794, 209287, 76581, -22741, 66772, 27572, 1299, 38320, 192934, 289247, 233060, 108338, 79373, -40046, -15506, 11208, -38000, -150056, -159323, -102332, -33311, -34500, -98848, -28718, 16684, 45453, 53502, 158337, 224671, 120153, -27895, -79211, -128293, -7947, 97469, 121985, 99795, -18987, -2980, 32963, 88791, 96635, 101473, 159572, 102881, 34329, 64501, 15806, 81688, 230418, 183482, -30424, -67164]
11952f7164M0040q8773j30594P3823J05069N3457J7749q509L3589J24190k4160
11941A28717K0037K8659K8837J3562k55295j84421P698n5765o2896J29273J99734
11930a860M7032j15283M7503k0102J45366J1790k14488o8508Q690O1414J00536
11919B090J33087j00919J3267Q8250r5697M1200m5055j23076K2735J6101k2198
11908g0215j59923L9869J40917j31316R8497j0762O6086n2042R1845P2921n5131
11897C0746o3948q1263k7128O6466J423J12738J38835n9520q8119o7328j32812
11886a69910P1564J69503J40997m9433m670o9257j22507m4296K2222L9057j602
11875a8332j8869n5780J94151R0296N9464p2862o3895N2528k4264p9221j6569
$$ y = [-67164, -27124, -115897, -246491, -172668, -67599, -14142, 3607, -4902, 28687, 152877, 128717, 148754, 177413, 206250, 219812, -35483, -219904, -212206, -267971, -330867, -201594, -1860, 45172, -70111, -22608, -42710, 102656, 114446, -100042, -168550, -159860, -98446, 2090, 135177, 34258, 47525, 135775, 40078, 81278, 36223, -86853, -64118, -48017, -70215, -230138, -190269, -49352, -180668, -82171, -92933, -26847, -78889, 12956, 85877, 30746, -33202, -114465, -141593, -75127, -73704, 39034, 177869, 118349, 30230, -37098, -169910, -98346, 71157, 212154, 162721, 158051, 88794, -33713, -78009, -55787, -16730, -18332, -37201, -92981, 101170, 191466, 250930, 178068, 114173, 166701, 142437, 63216, 46647]
11864D6647m7520k3096K5277N0367k11270r0498K5205M0440J2381k7062J22145
11853g6984J25312O7552j7650n3743j28256j19881K8148J15722R10n0242O7594
11842d1518M2809K85P4667k1205N5524O3637J2711o1222j60066n1916k1211P5250
11830c2255R6795j4817l3704n1996j02845j15130R778r912p9257L3797N3343O8509
11818a77694O7037j5855Q8489K4247q5804k102P5730j9665l5411J9776J25268
11807F4016L2579q8090N9839j632J8983q4845m9074j24279j5226o263J08648m0851
11795a26195j65316O136O7366M9734K3752M320M9165J5530J415r1095L6124N4262
11783g4802p0436q4659r0196J32856o1698j57616J20544J71587P0517n7460k404
$$ y = [46647, -873, -23969, 1308, 51675, -159595, -250093, -224888, -184448, -172067, -199129, -76984, 48328, 115880, 98230, 44487, -83769, -203650, -175502, -59780, -58870, -109112, -41518, 1291, 1576, 76243, 55038, 110562, 174199, 186910, 125688, -34378, -86294, -107505, -32255, 64540, 49723, 16019, -35977, -138822, -253952, -244174, -254086, -333343, -299546, -246203, -177694, -110657, -126512, -38023, -13776, -99580, -101682, -25952, -45617, -81028, -61252, 64016, 96595, 8505, 68344, 66712, 85695, 850, -48224, -172503, -187729, -193992, -85344, -126195, -291511, -285375, -218009, -168275, -144523, -140203, -91038, -75508, -74093, -165188, -129064, -74802, -145238, -229897, -320093, -187237, -248935, -406551, -286007, -114420, -43903, -101363, -103767]
11772a03767J60870j19316p2297j1443q2774p8567Q4935O684j23716q5909N5538
11761c69762J48021R5044o248n1709P9947k6161R4498j4461l3382R225m3234j2521
11749a30743M5336P2581m616l286J13562j19656p9600J32283R7920n6438Q5421
11738A52764j9512k86976l8387O2432o5565L7016P0793M1719J08695J12931j51965
11727B3945j03721R2031L4818L594l5892k6038p6707m850m9035j44916K8730O4438
11715a93603k3750l7513R0917J0775J82533K3960p0034K1802k1741j20106M1877
11704i4883J2616L8955q860P7717j69949p3470o0126k9520J15017J2454N770J04439
11692f9840O8734l9596j58596l2315Q3685R9518P9086M9586r3913r9814R71Q4162
$$ y = [-103767, 57103, -62213, -134510, -145953, -228727, -307294, -222359, -215675, -339391, -425300, -369762, -221741, -126697, -132945, -184654, -104707, -130868, -36370, -50831, -84213, -74988, -118222, -130743, -85407, -12826, -17442, -20728, 92834, -26822, -106422, 25861, 123781, 67343, 152764, 133252, -153724, -192111, -129679, -195244, -158228, -87435, -45716, 62979, 175910, 23945, -79776, 12255, 47073, 50667, 14775, -11263, -87970, -92820, -141855, -286771, -258041, -193603, -217353, -254866, -163949, -153174, 29359, 53319, -16715, 5087, -16654, -136760, -94883, -82267, -43312, -52172, 25545, -144404, -217874, -278000, -307520, -192503, -180049, -174279, -69840, -1106, -40702, -199298, -231613, -147928, -48410, 30676, 80262, -13651, -113465, -112494, -28332]
11680b8332o197j17450J17476j3888n0733O0091J16083K290Q5921R8897p7406
11669A86752o7891n7891J16421n6410j60962j21700l9066J4934P0291R4505J02318
11658H1301P7792R182l6799j35118P153r9313j0123j10260m972n288j7442Q9239
11646a54648J14019J54284N0379j2318J7223p2487N9670J61650o2304p6790m305
11635A74373m842q2487j04061k28971m7971P6763N1267L3151J00985j7285L6501
11624a2577J14208j17067m7493p1369Q98O8597N7697j12465N8196R7179p205j73831
11612a45232J1250J64951M0310J2934R5857M4524r2908n5321n698Q1262k6962
11601A24967k3866j750o2549o8228M6361L8412j87165m0570P4728J57677P8294
$$ y = [-28332, -34529, -151979, -34503, -48391, -99124, -39033, 77050, 79340, 165261, 264158, 186752, 118861, 60970, 177391, 120981, -39981, -161681, -200747, -185813, -115522, -21017, 81301, 159093, 168275, 131476, -3642, 3511, -95802, -105925, -216185, -221157, -226445, -243887, -154648, -40629, 113655, 164034, 151716, 168939, 96452, 156122, 317772, 255468, 178678, 174373, 169531, 87044, -17017, -245988, -293959, -217196, -165929, -132778, -31793, -49078, -12577, 101631, -15436, -62929, -134298, -133400, -64803, -7106, -119571, -61375, 35804, 28599, -145232, -133982, 30969, 71279, 84213, 180070, 224594, 131686, 76365, 70667, 151929, 124967, 101101, 99351, 36802, -31426, 14935, 53347, -133818, -174388, -99660, 58017, 136311]
11590A36311q7274J6939J6039o4307P1035J22234m5513j52258k13197j65087p2906
11579d37984J41872K7084P2694L4134k3412O3783J07320j2293l9722J7296r653
11568e8881J13676R9806N837j8579k13844j63296j839J42838K01347p6674p211
11557B3180n483m7788j74235P755O0398j6193K00197j4320p4909r2469Q7173l0221
11545g6915k4190o4829m14N5924Q1492k7781j4749P5867k20935n8851J52337J39278
11533A6234j6682n5243l5087Q586O0073n10j3359K1929p7577j16771Q1442J46805
11521A9840J37860P274j11952k05404j25626j16790K7463K9343O0956J15638Q1689
11510g9709P977L1797j04560j8028N8070J35732k8122j27607j3770J1599J40522
$$ y = [136311, 49037, 65976, 82015, 17708, 88743, 210977, 165464, 13206, -199991, -365078, -437984, -296112, -269028, -196334, -162200, -185612, -121829, -14509, -26802, -66524, -49228, -58881, 54795, 154601, 160438, 141859, -71985, -235281, -237120, -94282, 107065, 30391, 23180, 17697, -30091, -204326, -196571, -136173, -152366, 47831, 33511, -41398, -133867, -46694, -76915, -101105, -165934, -166348, -110424, -28932, -56713, -71462, 4405, -216530, -275381, -123044, 16234, -448, -55691, -90778, -82192, -22119, -22629, -35988, -14059, -91636, -208407, -126965, 19840, 157700, 164974, 53022, -152382, -278008, -394798, -367335, -337992, -277036, -161398, -79709, -71732, -39935, -144495, -162523, -104453, 31279, 3157, -124450, -138220, -126621, 13901]
11499A3901R9847m3294O4506R7372O8045j56093q9492l0875J977k9490J01945
11488I8349K5239j45436j8305J22515k454Q1833O9523R51m0142M8402q3115r0316
11476F7044m17l9960N0274n7807j51686q6839J80730J41015J7495n4714L8856
11465A03991k0878q9148k07154n3197L1027J05454J50272K6166k8957k2198L563
11454a059j582n0208J8329N051p9761j3488l7265k4101j41315O1373Q1362O2544
11442a20120M0410L8785l634r2024L5648r3377j02236J49925J11016J5466n9770
11431g9911N4382M5946k9027n0745K7039m9559r0363l5830J85056J29961Q797
11420A15746l1938l065Q3921N6400n0493n0641K5038j20936q4910r325M8178R5321
$$ y = [13901, 113748, 70454, 134960, 232332, 300377, 144284, 54792, 23917, 25894, -3596, 98349, 123588, -21848, -40153, 82362, 79908, 161741, 231264, 232215, 192073, 240475, 157360, 67044, 66627, 26667, 76941, 19134, -132552, -219391, -38661, 102354, 119849, 65135, 103991, 83113, -6035, -213189, -266386, -235359, -129905, 20367, 46533, 17576, -4622, -1059, -2641, -52849, -34520, -29469, -109230, -122718, -159983, -184084, -325399, -264026, -182664, -120120, -79710, -40925, -44559, -136583, -100935, -194312, -296548, -146623, -35607, -20141, -79911, -25529, 20417, -8610, -59355, -32316, -81875, -172238, -208068, -23012, 106949, 115746, 83808, 80743, 164664, 221064, 170571, 119930, 144968, 24032, -60878, -70203, -22025, 73296]
11408G3296R794n6365n4706n169j36467k1443k4159r3558Q9300J23486J5653q4224
11396a64562j5400J60773L9415j91029j41230O7290N0536L0162m8069j8378j0911
11385b41403J15877O340j00598k7224L9180q9928m5239J61721K42516L4003n1789
11374D3456J33316J2980j28641m0980M8513J8889K1772k470r3914j89007K667
11363a73419M5502N6312m6634k7553j16820J48872K94218M9901j38267j09150
11353a7038k798J6636l2127n258J81748J16426o5847j6359p3655j7111o5788J4489
11341C3318N2075j12702r3004O1615N1242J3443j4182J2411N6542j9457j1638
11330B9663N2817j21564o2954p6688N3301n8296L7838k460L8602J53485M7783
$$ y = [73296, 83090, 26725, -27981, -33150, -169617, -191060, -215219, -308777, -219477, -95991, -80338, -164562, -179962, -19189, 20226, -170803, -312033, -244743, -194207, -164045, -212114, -230492, -241403, -125526, -119186, -219784, -247008, -207828, -297756, -342995, -181274, 61242, 95245, 43456, 176772, 189752, 61111, 20131, 68644, 87533, 109305, 106835, 12921, -176086, -173419, -127917, -71605, -118239, -145792, -262612, -113740, 180478, 230379, 92112, -17038, -19836, -3200, -35327, -40585, 141163, 257589, 191742, 175383, 101728, 84617, 18829, 33318, 85393, -27309, -120313, -58698, -7456, 5987, -8195, 4216, 60758, 41301, 29663, 82480, -39084, -102038, -178726, -125425, -183721, -145883, -148343, -109741, 43744, 91527]
11319I1527O1845l9550j22909j09166N569K1016r9045p7417J15153J83852q498
11308B2377J4491J8336j04708j0533k941m0649p2333k509J08720O5614P2390k5597
11296D2658j0644q1178l3912j29668l5208P5405o657J59649N4639J5926Q81J41272
11284A93163k8239j06356N8078m7031j88825l6813j7879O8034Q9036P3318Q738
11273F5224O6094k8450m7733k2483K7469n0971j16805J3445J36030K10163P0888
11262C22871k60287k72522o9102R3303J32861K6746L5630k1838j29100q3110P8793
11251a45755J9089j05102R3791J49948M4975l0682m5552Q9811n584l3649j4757
11240A6533j8662j4124M9724j26190O2309J45706L7838j6017j69344j37111K7805
$$ y = [91527, 153372, 113822, -9087, -118253, -112684, -91668, -190713, -268130, -152977, 30875, 22377, 36868, 55204, -49504, -60037, -62978, -103627, -175960, -178469, -69749, -4135, 68255, 42658, 32014, -49164, -83076, -212744, -247952, -172547, -179204, -19555, 35084, 51010, 51891, 193163, 164924, 58568, 116646, 69615, -119210, -156023, -173902, -105868, -16832, 56486, 65224, 131318, 102868, 55135, 32652, 60121, 9150, -107655, -94210, 41820, 251983, 322871, 62584, -209938, -279040, -185737, -52876, -26130, 9500, -12338, -141438, -224548, -145755, -126666, -231768, -137977, 11971, 56946, 26264, -19288, 70523, 64939, 31290, 16533, -2129, -16253, 33471, -92719, -30410, 115296, 153134, 137117, -32227, -169338, -141533]
11229a41533J14029K6614k1929j16270p3776J35792P0620k5040M5949J20960j01850
11218C3566o1570J09951l4178p0350j18205k3079L3290J33183J25153o5109m3765
11207A8887p1756j7875L0592o0119J76544N0383p3192O2998O6295N9123j0528
11196B31352r2867j30812j03489N9463J29264O5211L5641K6136K2447p5767r3926
11185G2653j92335r8103J95354O1913j3919o5533j69871O1296N1450r1438K5387
11174a63146n0540j2913k1255n3103P5994J36705L892k1191N8385P798M1154N0713
11162E2493M2718j48675p2772k0658n6049K3882L3820R051L4847N3006j09596
11151a57933J55914O4129J85244J77270l0207j07923j02486O4523l6260o5884
$$ y = [-141533, -27504, -890, -22819, -139089, -212865, -77073, -6453, -31493, 14456, 135416, 33566, -28004, 81947, 47769, -22581, -140786, -163865, -130575, 2608, 127761, 62652, 18887, -52869, -70744, -40152, -100271, 76273, 126656, 53464, 116462, 182757, 241880, 231352, 138485, 7673, -95816, -36353, 92911, 158122, 193763, 219899, 242346, 166579, 72653, -119682, -217785, -22431, 39482, 25563, -39970, -209841, -148545, -97095, -188533, -163146, -213686, -226599, -247854, -300957, -224963, -88258, -84366, -105557, -47172, -39374, 1780, 52493, 95211, -53464, -126236, -146894, -202943, -179061, -145241, -136190, -101343, -48337, -157933, -2019, 62110, 247354, 424624, 394417, 286494, 184008, 248531, 212271, 146387]
11141A46387l2891m4951R5397j37565j50668K4806P0381o4508n9382K2151j1591
11130a42434J7066K2733q7791P0937Q5593j6976o6218l1919l1096j8029L2823
11119a65311q7147k5798m5490R6397P9453P7482P4334K43l0750k2213L3094J2377
11107c329j6789Q4413j2338p8248j60879j06055j5599J50946J48815J38927p5650
11096E4214q3053O9899l4246k5717l0679l4574l3569P4121j3204m2089p234m0822
11084a46953l1282j03510N2755J72865j8480j1589j57921m2415J52110P0998k0053
11073h3475k3347M6577O5988m2798j01541N1375j8007q5466J5543J0849O7646
11062i6656J61426J05964J8763p7475k03030j55866L3280J33135Q3891M791j46562
$$ y = [146387, 113496, 68545, 163942, 26377, -124291, -99485, -29104, -93612, -152994, -130843, -142434, -125368, -102635, -190426, -119489, -33896, -50872, -117090, -149009, -180105, -198134, -165311, -252458, -278256, -323746, -227349, -147896, -70414, 3920, 4163, -26587, -48800, -15706, -3329, -20118, 64295, 51957, -26291, -187170, -293225, -308824, -157878, -9063, 129864, 54214, -28839, 41060, 6814, -18903, -49582, -84156, -117725, -43604, -56808, -98897, -106131, -146953, -178235, -281745, -228990, -56125, -74605, -86194, -244115, -286530, -134420, -63422, -83475, -106822, -60245, 5743, -37055, -138596, -87221, -105228, -190694, -175151, -164302, -96656, 64770, 170734, 189497, 112022, -91008, -246874, -213594, -80459, 3432, 8223, -138339]
11051a38339n6793p9575J71560P7346O9820l5010k02908m0952J8627K6922N5558
11040a33744P1642p5723K5475O4650j36374n2084m0580K9908o0010J04911N1984
11029a49945j8835O8043J11572r119n8868j29234M3937K2864N4257J37306o7742
11018D236K4795j7277m4267o845N8310M9860r2804j00047l4870K15239K33711
11007B90041r3500j57507j66481K8337L5791L8754R8180k7178m0875n7254j36309
10996a88001q2528R8908K14710o7959k3523Q2464o9098M5663n5965j28512L6180
10985a37661P689J12052r079J39396L0015k6914k0119j42531M593j426m9097J1309
10973h1773J9061n3885J91459J19553k06741r5265Q110N9689j6762M369l0915
$$ y = [-138339, -195132, -274707, -103147, -25801, 44019, 9009, -193899, -234851, -216224, -189302, -133744, -62102, -137825, -112350, -47700, -184074, -236158, -276738, -246830, -306840, -201929, -149945, -168780, -100737, 10835, 1716, -57152, -186386, -142449, -119585, -65328, 71978, 4236, 29031, 11754, -32513, -39358, 18952, 68812, -23992, -124039, -158909, 56330, 290041, 196541, 39034, -127447, -99110, -63319, -24565, 73615, 46437, 5562, -51692, -188001, -270529, -171621, 43089, -24870, -48393, 34071, -35027, 10636, -45329, -173841, -137661, -129972, -17920, -26999, 112397, 142412, 115498, 95379, -47152, -42559, -43985, -93082, -81773, -62712, -116597, 74862, 194415, -12326, -107591, -99481, -39792, -56554, -52185, -83100]
10962h3100Q3513N1240k6058R7085M5298j37240j91809m3840K041n0285L9076
10951b14079M7266m802J33545K6509k8488L2053j3672Q4884J32224p5172j63652
10940d3384j44765j3090M4097r105k548J4829P0225J48962o5206j64481N211O797
10928a52458M2209L8627r7155o881O8162P9091J8678j78389o5165M4929Q3124
10917a25228K26515l567j86793J0554r31Q20k6959R9189l4226j04442R9279k4495
10905g0284j72813J03875p7733N8532J57852j7336O508j74178M2950J60279O9601
10894H7253r0873J7826j4039l9304N1945j49361j8014O2188l8794M2309j6110
10883a04974r3639Q5621J14829l263j18J12844K8269K0223j08891k9144j06546
$$ y = [-83100, 413, 51653, 25595, 122680, 167978, 30738, -161071, -204911, -202870, -253155, -214079, -166813, -171615, -38070, -11561, -40049, -7996, -21668, 63216, 195440, 120268, -43384, -188149, -201239, -157142, -166247, -168795, -153966, -83741, 65221, 15, -164466, -159255, -152458, -110249, -71622, -168777, -175658, -107496, -28405, -9727, -188116, -253281, -208352, -125228, 101287, 97720, -89073, -78519, -79450, -78630, -105589, -6400, -40626, -145068, -45789, -70284, -243097, -139222, -216955, -158423, -571, -17907, -11399, -185577, -142627, 17652, 87253, -3620, 14206, 167, -39137, 12808, -136553, -154567, -92379, -131173, -88864, -104974, -198613, -112992, 1837, -1426, -1544, 111300, 139569, 159792, 50901, 21757, -84789]
10872h4789m6812M7775O9533J45332q3911r7724Q240J20795K9381o1881m3437
10861B502l6675j0320L0526J49503j35014o3625J41705l8125j06689P3931R7417
10850A05136r400j25071j09412p2178n3805K29776R9736j36753j478M3136j04819
10839a35132Q9739M1457n7227k49939M7755J26940P7909k4606q0841L8786l324
10828a28483m1256l2447k9172m712o350M0941N0998l5268r5681L9260O1300k6603
10816b07473l4328l5929J6239J74923J23746o7665j98433q534m2842P778J26586
10805a45932P2381L8304J73276N0752q5207j24421p6247P2785O8746o476l0233
10794G728j96436J29070R9946L6028k8947q5612j70757j11588J61711J31215P1251
$$ y = [-84789, -131601, -83826, -14293, 131039, 47128, -50596, -42356, 78439, 107820, 45939, 2502, -34173, -44493, -13967, 135536, 522, -63103, 78602, 40477, -66212, 7719, 105136, 95736, -29335, -138747, -210925, -264730, -34954, 64782, -71971, -73449, -30313, -135132, -45393, -3936, -61163, -311102, -263347, -136407, -58498, -83104, -163945, -125159, -128483, -169739, -202186, -231358, -236070, -242420, -201479, -150481, -185749, -281430, -242170, -180870, -207473, -241801, -277730, -261491, -86568, 37178, -30487, -228920, -237454, -280296, -272518, -145932, -73551, -35247, 138029, 188781, 103574, -20847, -97094, -24309, 44437, 37961, 7728, -188708, -59638, 40308, 76336, 47389, -38223, -208980, -320568, -158857, -27642, 43609]
10783D3609J36581J1518M8120Q2892j08864j31778q8979q9705J5068q4646l0034
10772a96218N951r8606j33715J18305K13260Q071l0624j1463k5716k7842O4001
10761a14596J00589r437j17207n71l7718q6229o4885J14990J09463j7964L5053
10750h8512K6178Q727j4175N7874j89504Q3164P3102Q2059K6823l8408j10459
10739h3131K5068P3885l0966R0026P1456j64393p5035n7394k4899l435J5704N1988
10727a11126J3095M5532l4926l5672J09275O7368q153j08721M9857J7126M3324
10716D6979K1337j12781p2462Q5803n03Q2713J19321J6536n0168j50051j14193
10705a27469R134L9833L2940K0836R3144M4969p3589J2705n0525k04085K3163
$$ y = [43609, 180190, 191708, 239828, 322720, 213856, 82078, -6901, -96606, -81538, -166184, -196218, -190267, -288873, -422588, -304283, -91023, -82952, -113576, -125039, -150755, -178597, -114596, -14007, -23444, -140651, -141222, -178940, -265169, -330054, -215064, -105601, -123565, -88512, -62334, -53607, -67782, -9908, -199412, -116248, -43146, 38913, 65736, 27328, -83131, -58063, 15822, -15144, 74882, 146338, -18055, -93090, -150484, -175383, -178818, -163114, -111126, -98031, -52499, -87425, -123097, -13822, 53546, 45393, -63328, -13471, 3655, 46979, 68316, -44465, -116927, -31124, -31627, 51086, 170407, 186943, 136775, -13276, -127469, -118335, -78502, -45562, -24726, 68418, 113387, 39798, 52503, 1978, -202107, -178944]
10694a78944L5887n5895P2283M3885J67734L3738r2987k0851n2058n7172O2699
10683d1681M2301L6222n1727L1438p5208j04697J01933N4327M4247o2256J582
10672b3519N8373M4743J4832n0861m3671R5462O7906j15670j0980J4650L3131
10661H4396p493N3409j1552j64523p0826J40453j6514R772J3300Q0743J00863
10650B12028k1259j10656J1080j7432N2150j7676j50957n4438M3264p0233J6707
10639a07422J58000N7863J3834J16509j14725k05395Q7584p178k35471j6411J96693
10628e6119n5796j50388M9680J02167Q6095n3475n3281j840j08913j384N5199
10617a88055P4194J39781L792q9444p093J3521j45252j2539J1808M7992M3476
$$ y = [-178944, -143057, -198952, -126669, -82784, 84950, 118688, 25701, 4850, -47208, -104380, -41681, 620, 36842, -14885, 16553, -58655, -163352, -61419, -7092, 37155, -25101, -23519, 34854, 79597, 94429, 43568, -103, 95359, 163265, 47595, 36615, 51265, 84396, 76903, 130312, 118760, -45763, -116589, 23864, 7350, 17122, 30422, 111165, 212028, 190769, 80113, 91193, 73761, 125911, 108235, -42722, -97160, -53896, -124129, -107422, 50578, 108441, 122275, 238784, 124059, -81336, 6248, -930, -236401, -252812, -56119, -111915, -262303, -212623, -110456, -24361, -77836, -131117, -132957, -241870, -243254, -188055, -113861, 25920, 29712, -59732, -66825, -53304, -198556, -211095, -199287, -151295, -107819]
10606a07819l9042J03612l4520j32376r105j22920j18377Q7611N7363L3821J35592
10595a46160J36504k0289J1011m5129j03307Q4775j22351Q1381J55221J00870
10585A32526j38768m2074N7842p1740J264M3807n6399n5459O207o0636o984P1670
10573a18744j8514Q0459R1664l5522R5771q0310l9360k6126o5642p0910J37565
10562d9669o349j14102R349J43058J7356L2100n6407l3665j27273m7416J0620
10551b22398J1401J44836R6568o0530p4670N3519j45269m8745N8415J48839J37817
10540I9783N8643M9064R6421n9700p4296p2347j67875j89819O091J21511L9016
10529i3508K7720K7157n3522K1256J19368j6294L4715K107n8743j44937K320J70140
$$ y = [-107819, -146861, -43249, -77769, -210145, -219250, -342170, -460547, -372936, -315573, -281752, -146160, -9656, -29945, -18934, -64063, -167370, -82595, -204946, -123565, 31656, 132526, -6242, -48316, 9526, -62214, -60950, -17143, -73542, -129001, -122794, -183430, -190414, -118744, -137258, -56799, 34865, -657, 95114, 14804, -24556, -50682, -116324, -187234, -49669, -56018, -170120, -160771, -17713, -357, 31743, -24664, -58329, -185602, -233018, -222398, -210997, -66161, 30407, -30123, -104793, -51274, -196543, -245288, -186873, -38034, 99783, 158426, 207490, 303911, 244211, 169915, 97568, -70307, -260126, -254035, -132524, -93508, -65788, -38631, -92153, -70897, 48471, 32177, 66892, 68999, 10256, -134681, -132361, 37779]
10517C7779J976J22270n9970r4584R0466l1200K7255J7384p3993M0631M3789n7435
10505F4368n8854m0613m9952L8656N7970p7674M1174O426l4925j12653J36585
10494b9492J6134l9670r8167J9256J53056M7361l9352l9507n8814J48313r9o9714
10482I305m3881r5371M677o3499J14895P2583m722O1682j14430J886L6881K1634
10470A640o8829K7241M9540j52902K3078n9983q5755J50435J72254P8767n5236
10459H0250r9181j59932J5345M3087r4055J7771J7074j8194n5028P5759O5585
10448a11519p3440M4396l0771Q8517J30624J5243O441L9707M1915n6136q0752
10437A4225R089n0886o7535Q315M3537J55686j07485m7586j9161P1006m9944O7091
$$ y = [37779, 39755, 162025, 102055, 7471, 97937, 66737, 93992, 111376, 37383, 78014, 121803, 64368, 5514, -35099, -85051, -46395, 11575, -66099, -24925, -18499, -53424, -166077, -29492, -13358, -53028, -151195, -131939, 21117, 68478, 29126, -10381, -69195, 79118, 79019, 9305, -34576, -129947, -125270, -188769, -73874, -1291, -6013, 55669, -58761, -56875, -19994, 1640, -67189, -39948, 9592, -143310, -120232, -180215, -265970, -115535, 56719, 135486, 80250, -18931, -178863, -163518, -120431, -214486, -196715, -179641, -197835, -252863, -177104, -111519, -184959, -140563, -171334, -82817, 47807, 63050, 69491, 109198, 151113, 94977, 14225, 23314, -27572, -95107, -86792, -43255, 112431, 4946, -42640, -61801, 9205, -40739, 26352]
10425B6352J08067L8863k9698j6280j99085j09563M934K5302k9517L4771q0497
10414b26351J06006K51904J9397q9826o2270J39562n5437J2646J06510p2157m4672
10403H5312Q8020n8693j26307l2657o2479R5733J2932k2596N1023n4153K6283
10392B418M1306q8925o2999K5462Q214M4158k6715P5772O1213k862k0769r8456
10380d2183L8922P3410P5868K2628m3655R6888j0020j52633p7420p416O1135M9352
10368H4876J17333m8036p3794K9625J34879q8829j6790J4711o606j13419J8784
10357E2734J15p0221j25917J6328Q6726O9355K5580P1029P9281j27921k01825
10346a24736M9909J29774J8369k9231j8952k8649o3133N477O7137Q9975k8672
$$ y = [26352, 134419, 173282, 143584, 127304, -71781, -181344, -176410, -151108, -180625, -145854, -226351, -120345, 131559, 150956, 61130, -1140, 138422, 82985, 95631, 202141, 129984, 85312, 173332, 114639, -11668, -44325, -106804, -11071, 1861, -20735, 30288, -23865, 2418, 43724, -45201, -108200, -82738, -74524, -30366, -57081, 18691, 79904, 77042, 56273, -42183, -3261, 70149, 146017, 168645, 124990, 221878, 211858, 59225, -18195, -25611, 35524, 84876, 202209, 154173, 80379, 110004, 244883, 156054, 139264, 153975, 147369, 33950, 52734, 52849, -17372, -143289, -126961, -40235, 29120, 54700, 125729, 205010, 77089, -124736, -74827, 54947, 73316, 44085, 25133, -3516, -66649, -61172, 5965, 95940, 67268]
10335F7268j25053n0122J49607L3704o1582P5050O8111k6943n1439j02226l5382
10324e9007R9254n8836L4616j20552r0459O5101J30311P9404J27238n043j96715
10313E312j19739J20333m4974k8825J18395m3531N9618q704L981J8681l20l132
10301G7095J53686O2362k76715j70814j926R8635j31322j06253N6611J68041J36085
10290F5485M813o3152n4028k3462m2127k04910p9711L3638J5558M4073O6849r4606
10278c31580L8835O9283J48801J0039j7681K6625J42067n8134j09521N2829q9594
10267a18031p1074q2724k5049m613J11613J25332L1076K7564q1403K5689n264
10256f6884n4528m1222K6489J08062n6281k0960N3705J9273J51042M67j89915
$$ y = [67268, -57785, -107907, 41700, 75404, 13822, 88872, 156983, 130040, 78601, -23625, -59007, 40247, -18589, 16027, -104525, -194984, -129883, 428, 79832, 207070, 202027, 5312, -114427, 5906, -39068, -67893, 50502, 6971, 66589, 57885, 61866, 80547, 80227, 77095, 230781, 293143, 16428, -154386, -156312, -57677, -188999, -295252, -238641, -70600, 65485, 70298, 7146, -46882, -70344, -112471, -317381, -397092, -363454, -347896, -303823, -236974, -331580, -292745, -223462, -74661, -64622, -82303, -55678, 86389, 28255, -81266, -28437, -118031, -189105, -271829, -296878, -301491, -189878, -64546, -33470, -5906, -87309, -61620, -66884, -121412, -162634, -136145, -28083, -84364, -105324, -51619, -32346, 118696, 119163, -70752]
10245g0752P456R6005q6527j11483n5513K2052N972J39333L5422o8584L8203J15901
10233F7485K0647q0160O2917k6067m2021j8332J122J27108L8570n7183j36752
10222d2666L770k1420J14933L0618k0219o4468j03356m773j2196L5099Q8483j133
10210B672p9376O5711n0820l1987O4771P9398J03899n8074j78293n2654P5672
10199e9081o2756Q900J4843m4853L3760j07598m1559J1469J54569P726n543m7242
10187a37365j00734O5794K1476K9653J703K2126J82248K9275o2171k3650j20407
10176i2052R3117n8465J66799P6134r7533n6591L1533j22888j06785j6678M492
10165a78917O8818J62960N3666o1841o0538J9256n4988J7179R1800J74708k6364
$$ y = [-70752, -63296, 32709, -53818, -165301, -220814, -198762, -192790, -53457, -18035, -86619, -48416, 67485, 88132, 7972, 70889, 44822, 2801, -15531, -14409, 112699, 151269, 94086, -42666, -38896, -60316, 54617, 85235, 65016, 548, -102808, -107581, -119777, -84678, 3805, 2672, -76704, -10993, -61813, -93800, -29029, 50369, 154268, 96194, -82099, -134753, -59081, -121837, -112937, -98094, -142947, -109187, -216785, -258344, -246875, -92306, -84580, -90123, -137365, -238099, -172305, -150829, -121176, -119473, -97347, 84901, 114176, 52005, 28355, -92052, 1065, -57400, 109399, 185533, 88000, 31409, 62942, -59946, -166731, -183409, -178917, -110099, 52861, 106527, 44686, -15852, 3404, -51584, -34405, 57395, 232103, 205739]
10154B05739N5875q4533j25341p4948q5280R7659J43616o5726j56660q5284J52015
10143b2868P6998K4948P09M9269p7095P5766j50820j21061O41P1796J12889N138
10131D6310o5638m6744j00867M2515O2940m5702n5138O346o9068Q6979K20348
10120H2281R9349O0001N534q2470j48574k0914K8236l460m6513k7804o5712n4897
10108a74943P3396M2399J29187Q271n7328p8386k5676J23349R9272L7621m6682
10097A30480q3700m0621L6471M0917J2971P255L4228P656j64303o1835J2564J1696
10085e6221k8535J00810J6105r7047k4901O2262l9828P043N3887k4187n0602J43742
10073F2528m6279k06510M7179Q3938Q3003P2426L6142J07732l2084j52955N1152
$$ y = [205739, 261614, 177081, 51740, -23208, -108488, -10829, 132787, 67061, -89599, -174883, -22868, 54130, 79078, 79787, 129056, 51961, 127727, -23093, -144154, -143513, -71717, 41172, 46310, -19328, -66072, -166939, -124424, -61484, -107186, -162324, -155978, -225046, -138067, 82281, 181630, 241631, 247165, 164695, 16121, -4793, 23443, 19983, -26530, -54334, -120046, -174943, -101547, -59148, 70039, 78310, 20982, -57404, -83080, 40269, 139541, 177162, 130480, 46780, 6159, 42630, 83547, 96518, 103773, 138001, 145657, -18646, -80481, -67917, -56221, -84756, 16054, 32159, -64888, -89789, -27527, -67355, -60312, -6425, -30612, -81214, 62528, 16249, -190261, -143082, -59144, 23859, 96285, 132427, 240159, 208075, 55120, 106272]
10062A06272q4808m1341M1355L8196O5225P10M2794R8474m3995J8416q0349m3238
10050A17711l0544J5916m5210j56586M7980K57166l8812k35226K7022L5402R3475
10039H8294R056N2394k23127j09861m6162J14240Q8021J6059P2164J4070k153
10028G2995j03915l8022O1652k9450p6599o8126Q596N9440J08754L1314r4288
10017f7649o7744j26610J10763J64182J59767J6682o3190l7854q5082p6215K2981
10006d9969L1970m8955l1576n6274l7650N6940K5414P172K2529J71261k707n758
9994H2397J36104L9920n0942m4812p8597m5859p6990J8138j3654M2763m6466o3336
9982a01334n4872N8380J54148l7309M0201l387k0348o4430K2484J21352N361L0578
$$ y = [106272, 21464, -19877, 21478, 59674, 124899, 125609, 168403, 266877, 222882, 241298, 160949, 117711, 87167, 103083, 57873, -98713, -50733, 206433, 167621, -67605, -40583, -5181, 88294, 97350, 149744, -73383, -183244, -229406, -115166, -27145, -11086, 61078, 75148, 72995, -30920, -68942, -7290, -36740, -113339, -181465, -172869, -113429, -4675, 26639, -67649, -135393, -262003, -151240, 12942, 172709, 189391, 126201, 88347, 3265, -72950, -49969, -17999, -66954, -98530, -154804, -192454, -135514, -110100, -102928, -80399, 90862, 88155, 82397, 218501, 258421, 207479, 162667, 84070, 38211, -38779, -20641, -34295, 8468, -37998, -101334, -156206, -97826, 56322, 19013, 59214, 55827, 35479, -28951, -6467, 114885, 120246, 150824]
9970A50824p3615j16246j39033J20698J17018k0714o6219j7956K9664m7365K7847
9959c5097N5312o3036j09513n6456J19725P1177M370j9535M8127R7122m6858j23136
9947e7798K7921J40699l6504N7454M7139J1508m5355p8466n6226o2114m7617P1984
9935b7375L9620l0195m851j02977R4210M4469k3582N8893j171j04556l0401M452
9923h3464N726O8416N6380N5067j43153q177J62924r3355m1283o1610q5404k3192
9911a91125J19957P8650n192R8642k3696l7022R4643o8503L1405k37025j50072
9900b89338N0858J56879K2974l5741P4842J06348k8622o8624J33626O5384r282
9889A79304j08868j02790m7470J01470N7636J02806o8827j89136k7673J88614
$$ y = [150824, 77209, -39037, -178070, -57372, 59646, 38932, -27287, -45243, -15579, -62944, -35097, 20215, -42821, -152334, -208790, -89065, -17888, -13518, -33053, 15074, 112196, 65338, -57798, -29877, 110822, 74318, 131772, 178911, 190419, 145064, 66598, 10372, -51742, -99359, -27375, 12245, -17950, -22801, -125778, -31568, 12901, -10681, 48212, 47041, -57515, -87916, -83464, -77738, -9322, 47058, 102125, -41028, -49205, 113719, 20364, -20919, -82529, -167933, -191125, -71168, 7482, 2290, 100932, 77236, 40214, 134857, 66354, 97759, -139266, -289338, -238480, -81601, -58627, -94368, -19526, 86822, 58200, -10424, 123202, 188586, 179304, 70436, -32354, -79824, 21646, 79282, 182088, 113261, -75875, -103548, 85066]
9879H5066K966j67083P2194M5646J55228O5564l0514j44453L2531M2983j27649
9868C2479L0797m8725j69775P8027J88774r9911j50389l149R4195m3028P8977
9857a1728R8160J0416m1475m330O2429j9996j87141m4103N8888J30919J1832o1453
9845B418j29710r1968R8157K560m8370J4697K0124K7250J8111J06047K8291j3270
9833C4337J12451R015n3326k2636N8653n4918n6141L1646N7210M7649M4500l0522
9821A77918q7029n1063j68860j66377Q6441J28179j1680m1732M9462J18688q3593
9810d9646j19067m789O6364J05127l9761p8161J46660l4504J7367n5277j20503
9799a66190j08679p8550L2021K42354J51870q4649k8852j43825j40046J1460J34703
$$ y = [85066, 88032, -79051, -6857, 38789, 194017, 259581, 229067, 84614, 117145, 160128, 32479, 63276, 14551, -155224, -77197, 111577, 11666, -138723, -141872, -47677, -90705, -11728, 86432, 96848, 55373, 51043, 113472, 93476, -93665, -137768, -78880, 52039, 63871, 2418, -127292, -219260, -121103, -118543, -166913, -152216, -132092, -104842, -86731, 19316, 47607, 34337, 146788, 155803, 102477, 79841, 138494, 83576, 27435, 59081, 116291, 163940, 208440, 177918, 90889, 39826, -129034, -295411, -208970, -80791, -92471, -134203, -84741, 33947, -49646, -168713, -173502, -107138, -2011, -41772, -119933, 26727, -7777, 9590, -45687, -166190, -274869, -353419, -321398, -79044, 72826, -11823, -40675, -184500, -324546, -313086, -178383]
9788a78383J54798N0761n0508P0359J22966L4689p3217j01056K3025M3676o5007
9777C2103j34677j31507Q574J4861n8738L1250L9065J49824J41311M2314r0404
9766D3976n2302Q0622j0898j1984R0083K5594j38915q0358N9615r369j48493q7870
9754b40299J71475K02854J52436j41328m2603q8200k24904M1641R0749m8510J4797
9743a11892L2537q2678M8303P3351m229j0738R2045K7143o0449M8105r2472N9895
9731A8921j106p1367j35807Q3952L8854J36155k45069j63377R0439K8597l5600
9720b55408J84990J35904R160o4623o8281q0074M9249j7556N1453J15947M5740
9709A06501L2637N78p0640p9094n3996m0235o6575L1565R3316J05714R5771r5211
$$ y = [-178383, -23585, 27176, -23332, 47027, 169993, 204682, 131465, 30409, 53434, 97110, 32103, -102574, -234081, -225507, -210646, -269384, -238134, -199069, -49245, 92066, 134380, 43976, -8326, 72296, 61398, 49414, 139497, 165091, 26176, -54182, 5433, -3936, -152429, -240299, -68824, 134030, 286466, 145138, 102535, 14335, -210569, -168928, -78179, -126689, -111892, -79355, -162033, -113730, -40379, -44608, -55346, 36699, 63842, 3393, 51498, -40974, 18921, 17815, -53552, -189359, -105407, -66553, 69602, -175467, -338844, -248405, -219808, -255408, -70418, 65486, 74646, 10023, -58258, -138332, -89083, -106639, -55186, 60761, 106501, 139138, 139716, 69076, -10018, -64014, -104249, -170824, -139259, -45943, 59771, 155542, 60331]
9697F0331k18414P9718P078M0237q7344L0306M5264K3231m7278J17423N0057L7490
9685A38099j03894j32346m5384P3657J20117l8579q4193L5949p2642o9842J25181
9674e3877K3878L5679r6125L7353Q4271J16437J08209o6848m1413J42473j543
9663B88494o1305j19893k2764l6416O6187R4650j05165m2471K8742N180q4161
9652A1078p6947r8518J03836J17161Q9183m6850r2521m4860L7344P2085p93j16196
9640d5998k9246L1851j49101O0623R3880J8806k1064m3509k5386o0801m3715J09758
9628a03902J41803K0099r9710L9131j02650J1016Q5584L2608m0678M9096K1473
9617E3870L4183j52732m9526L6013J00104K2806l6153m7669Q9846J24390j19448
$$ y = [60331, -158083, -78365, -71287, -31050, -118394, -88088, -42824, -19593, -66871, 50552, 100609, 138099, 34205, -98141, -143525, -69868, 50249, 11670, -72523, -36574, -109216, -179058, -53877, -29999, 5680, -90445, -53092, 31179, 147616, 255825, 188977, 147564, 290037, 288494, 227189, 107296, 84532, 48116, 114303, 208953, 103788, 61317, 90059, 95239, 11078, -65869, -164387, -60551, 56610, 145793, 98943, 6422, -38438, -1094, 70991, 70198, -45998, -75244, -43393, -192494, -131871, -37991, -19185, -40249, -83758, -109144, -169945, -213660, -103902, 37901, 58000, -41710, -2579, -105229, -94213, -8629, 23979, -16699, 32397, 53870, 88053, -64679, -114205, -78192, 21912, 44718, 8565, -39104, 50742, 175132, 55684]
9606E5684j03839J2759J09504L5605o6383n1146j9877J21330J1818p0316N2195
9595H7334J1730Q5848N2330r916j29321k4641m5082K363q924k351M0253p1778
9583a2155n96J60643R414o246k0204O3861q1775q1839j38911K384J51564Q2855
9571A28995j00968j13992Q9162O7697r9934P5334k2029O360Q5637O4272j779M7176
9559B25931m4486l5731j0330R9240J1460j10083j26396N5662J30074o205q6250
9548A02886o380q2487J37631K5674q6155k3113j14467j6096P2784r7905M8875
9537c8753J02438p6177r3199J42060K5293j619j43055m927j16714k4507J56318
9526g2842R375J51042P0699k0064O8383j07416j14287j57909m4885J00325J00488
$$ y = [55684, -48155, -35396, 74108, 109713, 43330, -7816, -27693, 93637, 105455, 35139, 87334, 99064, 184912, 237242, 227326, 98005, 73364, 28282, 30645, 21721, 19370, 59623, -12155, -12751, 147892, 157306, 151060, 130856, 194717, 112942, 31103, -107808, -105424, 46140, 128995, 28027, -85965, 3197, 70894, -29040, 46294, 24265, 30625, 116262, 180534, 178755, 225931, 181445, 145714, 135384, 234624, 246084, 136001, 9605, 65267, 195341, 189136, 102886, 96506, 14019, 151650, 177324, 91169, 68056, -46411, -62507, 10277, -87628, -38753, 63685, -12492, -105691, 36369, 61662, 60043, -83012, -87939, -204653, -229160, -72842, -63467, 87575, 158274, 138210, 206593, 99177, -15110, -173019, -217904, -117579, -17091]
9515a7091L4259o9892L5967O2721j2480M1923k0858n1277J40185J9389n0691l1131
9503H1024o1536r4173P5072J15745m8329J02932N2077j4677j18226j16198L3287
9492F998Q911l2021N0756n384j21216k9034P0195K04348J72778l2468q102l4551
9480B51210j13944m2078M5832P173J7832R0933k3683m2785K0733M0417j7324k1399
9468B12917j21672J2912R2189R9530Q8051j02073q8597p2769o8413K0513j1455
9457F1133l2249n6162k7483J61725Q837l035O6251p2347m0777J06105J00088r438
9445B62648j92998j25718q089P5356Q2596R4572J63263K4800j84721k10314k1928
9434d0533R1288O6070l190p1593r3759J63823Q4809q6887k4036J31449j5829P4908
$$ y = [-17091, 17168, -52724, -16757, 45964, 33484, 75407, 54549, 3272, 143457, 162846, 112155, 81024, 19488, -74685, 387, 116132, 67803, 170735, 222812, 208135, 89909, -26289, 6998, 15909, -16112, 34644, 29260, -91956, -120990, -50795, 153553, 326331, 293863, 285761, 251210, 137266, 95188, 141020, 148193, 166025, 256958, 233275, 190490, 211223, 251640, 234316, 212917, 91245, 104157, 196346, 295876, 383927, 281854, 193257, 120488, 52075, 72588, 61133, 28884, -27278, -54761, 106964, 115801, 112766, 179017, 106670, 65893, 171998, 272086, 262648, 69650, -56068, -64157, 11199, 93795, 188367, 351630, 376430, 191709, -18605, -40533, 50755, 116825, 113635, 42042, -51717, 112106, 196915, 110028, 85992, 217441, 201612, 276520]
9422B76520M9843j6030q9662j44575j70452O9381J59555O7276j47877o4057J56346
9411A46268P7486l6641j99385l3179O631J0024J45673o167J0163J0443Q342l9534
9399A00124L2392N0911k0431L2928m3350r7092M9825P1897p7140p7094J7355M820
9387D5145r132N8190J71668Q0737m9016m0521n7209q7233l7672R3456Q6525l2090
9375B22848q8089K0045n090o5332O048P6037J16567K18770l362K6833j02341j12682
9363C10252j62862M9517N1415r0828Q0119K7241M7012o490j2297Q1262o1309m9636
9351B63396p1680l1377J43759J7172k0841j6667j5476K7735K3702L3163M0256
9340C93142L8409o3179p3864l1850Q8435j8268k5259l8044N1828O576K8520M6681
$$ y = [276520, 326363, 310333, 220671, 76096, -94356, -24975, 134580, 201856, 53979, -10078, 146268, 223754, 187113, -12272, -45451, -38820, -28796, 116877, 110710, 120873, 131316, 139658, 100124, 132516, 183427, 162996, 195924, 152574, 55482, 105307, 177204, 100064, 22970, 40325, 45145, 36013, 94203, 265871, 346608, 297592, 257071, 199862, 112629, 74957, 168413, 254938, 222848, 134759, 154804, 149714, 84382, 90430, 166467, 283034, 501804, 498442, 525275, 422934, 310252, 147390, 196907, 248322, 157494, 237613, 264854, 311866, 305376, 293079, 374341, 313032, 263396, 191716, 160339, 304098, 321270, 300429, 283762, 268286, 296021, 319723, 352886, 393142, 431551, 368372, 294508, 262658, 351093, 332825, 307566, 269522, 321350, 327926, 356446, 403127]
9328D03127J05663R2013m5398j40917M1058J40189q6577n9935n895m2343k2999
9317C77986n3024k7271p3690J55390J52699J29612J20864p65k0853q5505j08022
9306E67421M9316L6551J08580p6919p7311J8666J21234O3488J9102N226L0873
9295H66227N3183P003j24983L3205J13119m0346j71472Q1513K03291O1230M2505
9284A124475m0641Q2747J28670Q1710k6632M7459K8028J30620l8985J7493J35847
9273A670791M8187j6534j34191k8623L9612J17037O2089P2958M3581J53750J30454
9262B159111J09183K06595J00994K24998J81514K10589J84946J45503L00287P9509
9252C903229K03563L59872L55271J94891K57878K68879M14521M11721M43650M54553
$$ y = [403127, 508790, 600803, 555405, 414488, 455546, 595735, 509158, 449223, 443328, 400985, 377986, 324962, 297691, 224001, 379391, 532090, 661702, 782566, 781801, 760948, 675443, 567421, 616737, 653288, 761868, 684949, 607638, 626304, 747538, 811026, 830128, 835354, 866227, 919410, 926413, 801430, 834635, 947754, 907408, 735936, 817449, 1020740, 1081970, 1124475, 1083834, 1166581, 1295251, 1376961, 1350329, 1397788, 1425816, 1556436, 1517451, 1534944, 1670791, 1718978, 1702444, 1568253, 1539630, 1579242, 1696279, 1758368, 1831326, 1874907, 2028657, 2159111, 2268294, 2474889, 2575883, 2800881, 2982395, 3192984, 3377930, 3523433, 3823720, 3903229, 4106792, 4466664, 4821935, 5016826, 5274704, 5543583, 5958104, 6369825, 6813475, 7268028]
9242G268028N96899P12174Q00103P87740R51894J295711J285509J460939J849666
9233A7008663K078101K426362K966281L642244M524488N644426P028778Q621731
9225E3941074J0508333J2592369J4802292J6541124J6957354J4460988R395272
9218A49198806K744873n102468j3215499j8466846j8935757j6440409j3045870
9211F6736830j0027770p705189n905687m786787l895152l135357k490080k416034
9203B6374774j942107j784376j554526j253800r98726r39882p72289p58530p34047
9194A5636491o40275o70947o81388p85922o34937o36682m77205m11015k98344
9185A0399776m15262n11587l18881m11555k28587l84235m35285k16603j96538
$$ y = [7268028, 7864927, 8577101, 9377204, 10164944, 11116838, 12412549, 13698058, 15158997, 17008663, 19086764, 21513126, 24479407, 28121651, 32646139, 38290565, 45319343, 53941074, 64449407, 77041776, 91844068, 108385192, 125342546, 139803534, 149198806, 151943679, 146841211, 133625712, 115158866, 96223109, 79782700, 66736830, 56709060, 49003871, 43098184, 38311397, 34416245, 31280888, 28790808, 26374774, 24432667, 22648291, 21093765, 19839965, 18841239, 17901357, 17129068, 16370538, 15636491, 14996216, 14325269, 13643881, 12857959, 12223022, 11586340, 11109135, 10698120, 10399776, 9984514, 9472927, 9154046, 8742491, 8513904, 8129669, 7694384, 7477781, 7281243]
9176G281243j50379j64577k68683l63768k57444j67884j64527j69067j02927j91336
9166E280651k26559k09206k36607k5062q2393K600m6478j46038j77872j42319
9156C990717j13264k90459N0297m8912k36747r2943L8911r1245j08483j51918
9146B945954q056j89018j36052j2517J05939j56849j1237n7262j77864p7177o3895
9135B161966l0964o0452j17597J9192k5569j10317K1081L7689o2144Q510m9746
9124A791649j33881n829o8241m3807J003m1632m5019m1960q6071P59j01445m7466
9112A178060Q3882J4100k02302j42014r4512j16438J67572R3639j03586l7802
9102H40599R8800M7111j63038N6455M6655k8749q0897j53700K6117J67355p3126
$$ y = [7281243, 7130864, 6966287, 6697604, 6333836, 6076392, 5908508, 5743981, 5574914, 5471987, 5280651, 5054092, 4844886, 4608279, 4583217, 4500824, 4503424, 4456946, 4310908, 4133036, 3990717, 3877453, 3586994, 3637291, 3588379, 3351632, 3258689, 3297600, 3206355, 3097872, 2945954, 2937898, 2748880, 2612828, 2600311, 2706250, 2549401, 2538164, 2480902, 2303038, 2225861, 2161966, 2131002, 2070550, 1952953, 1972145, 1946576, 1836259, 1857340, 1895029, 1832885, 1841395, 1791649, 1657768, 1651939, 1583698, 1539891, 1540894, 1499262, 1454243, 1412283, 1326212, 1326971, 1225526, 1178060, 1261942, 1276042, 1073740, 931726, 837214, 720776, 888348, 981987, 878401, 840599, 939399, 986510, 823472, 879927, 926582, 897833, 816936, 663236, 689353, 856708, 783582]
9091G83582p1588o161r8523J14658J78366P8477p2446r2513j22870j62090j32624
9080C96268n8269R3076j2079J41020j13506j1488N9444M7686M7131J6815J2197
9069F18295m452M209R3361P5572j00072L9637j12041k40200k7027K2333m1401
9058C28214o7890l1209J9827J72160O8454k6753m3108o6520n8671j3409j65541
9047A15554R0960L8588J3637K31076j38633k31484l6261R2915J1572J33685k3858
9036B97751j23175o8324Q4273J37802N9768Q654j532P4112J08445o084j59632
9025D12058k23587o0620Q2988P7817q9721j02882Q111j5128o0473K9417J5434
9014G3414k8482O2400j1743q8412j58023R6469O1803P0856n6792L7883r9342M0135
$$ y = [783582, 711994, 705833, 607310, 721968, 900334, 978811, 906365, 813852, 690982, 528892, 396268, 337999, 431075, 418996, 560016, 446510, 435022, 494466, 542152, 589283, 606098, 618295, 613843, 618052, 711413, 786985, 686913, 726550, 614509, 374309, 347282, 369615, 328214, 260324, 229115, 248942, 421102, 489556, 462803, 419695, 353175, 294504, 281095, 115554, 206514, 245102, 258739, 489815, 351182, 119698, 83437, 176352, 187924, 321609, 297751, 174576, 106252, 190525, 328327, 388095, 396749, 395217, 469329, 577774, 571690, 412058, 188471, 127851, 210839, 288656, 198935, 96053, 104164, 89036, 28563, 57980, 73414, 44932, 107332, 95589, 7177, -150846, -54377, 7426, 78282, 21490, 59373, -39969, 166]
9002A66J19225M9011q1232p1974Q506P5379p4k618Q7774J28840O4907J0563j31941
8989B56532j01834j08399J240L2644m0954L2565R301J10921J51324M3127k6430
8978C60037K7264j34369p8390J6318p4689r1073j39845n1535J09627M4093N4938
8967D2376M0790n664j66813k5818P9323J79760k7847N0765j1242Q670o1839N1038
8955A53499P5813M8696j1663m6607j01454r3469P4011p0267J19004L8645j14810
8944G1398p7752k0086q6544m6962J10449n7065J0448J85527o6948k6639P946n6940
8932e3168K6292j8601k105M3429J27392J32580n659J0644K6604L1517j80380j29313
8920I232K8449J07840l4382M7556N0360K8648P3120j18203q0256K251K8117n4672
$$ y = [166, 119391, 168402, 87170, 15196, 23702, 99081, 99007, 96389, 184163, 313003, 377910, 388473, 256532, 154698, 46299, 47539, 80183, 39229, 71794, 81095, 192016, 343340, 386467, 360037, 387301, 252932, 174542, 190860, 116171, 25098, -114747, -166282, -56655, -12562, 42376, 83166, 77502, -89311, -115129, -35806, 143954, 116107, 166872, 155630, 164300, 102461, 153499, 229312, 278008, 266345, 219738, 118284, 24815, 98826, 28559, 147563, 186208, 71398, -6354, -26440, -112984, -159946, -49497, -106562, -96114, 89413, 22465, -4174, 3772, -53168, -26876, -45477, -47582, -4153, 123239, 255819, 250160, 260804, 287408, 318925, 138545, 9232, 37681, 145521, 111139, 158695, 209055, 237703, 310823, 192620, 112364, 114615, 142732, 88060]
8908H8060j88582m0529j8766n8677J25622J54383L5040l3309J8284q3698J37611
8897A35439O6985k4817O8786p7270j80084l1359o728N5133J8106j6440l8932R0417
8885E9236Q4685l0109K9842l8603q6321R5953J2657m4458k3002j0614K374N5701
8873A07341o0370n4986j70437N6418N7197m5822L7955J11095N2985j28571j04032
8862a41227M2372L7878P4049O0660j13785o3209j12832M4462O8291J1349n8542
8851a50534p5838j4642J25359R5954R7950M1580j42136n9742M2731n8722P7713
8840b0327p4852l041K7995j15739N9675k0736m2571J09898R816j21434J31213
8829f0103J28028R6789j17543r3804J20944M4450o4259k18466o0062L6914j2444
$$ y = [88060, -100522, -141051, -159817, -218494, -92872, 61511, 96551, 63242, 81526, -2172, 135439, 202424, 177607, 246393, 169123, -10961, -42320, -49048, 6085, 24191, 7751, -31181, 59236, 143921, 113812, 143654, 105051, 18730, 114683, 127340, 82882, 59880, 49266, 51640, 107341, 46971, -8015, -178452, -122034, -64837, -110659, -72704, 38391, 91376, -37195, -141227, -98855, -60977, 13072, 73732, -40053, -103262, -216094, -171632, -103341, -91992, -150534, -226372, -241014, -115655, -19701, 78249, 119829, -22307, -82049, -39318, -98040, -20327, -95179, -98220, -70225, -185964, -126289, -147025, -189596, -79698, -69882, -191316, -60103, 67925, 164714, 47171, -46633, 74311, 118761, 54502, -163964, -224026, -187112, -199556]
8818a99556K2444R4029J13477j5085p1012p87k9087q1869j10163J16344Q6373
8807g4892J5139L4385R3632o043N7427l5634k7573j36021j39331Q4829J00717
8796c3365K8641j2570R3989j5984J7766O469m5780M7854k8713l7903J6282R2025
8784A28711L1456j98285n1474M3843O0640q9141j5697J84886K1680P5185j02397
8773H9407j12279n5842J997j1960J33432O930j05039j01264M5413J90990j7411
8762F4374k23840O0956K5040J1863l7083K0838L7573O031k4687n5083o7933J62476
8750a9475K63100r8006n5487K7428j16638j32877N064o0941O5724l178j38968
8739b64254J1962J00073P0669J9262J33455o0803J7907k5470r8479J16313K25757
$$ y = [-199556, -177112, -83083, 30394, 15309, -55703, -56490, -85577, -167446, -277609, -161265, -74892, -59753, -25368, 68264, 62221, 119648, 84014, 56441, -79580, -218911, -134082, -33365, -4724, -17294, 76695, 60711, 78477, 84946, 39166, 87020, 58307, 20404, 36686, 128711, 160167, -38118, -89592, -45749, 14891, -74250, -89947, 94939, 116619, 191804, 89407, -22872, -78714, -76717, -88677, 44755, 51685, -53354, -154618, -109205, 81785, 64374, -159466, -98510, -73470, -61607, -98690, -77852, -40279, -34248, -58935, -114018, -181951, -19475, 243625, 145619, 90132, 117560, 922, -131955, -126891, -187832, -122108, -125286, -264254, -252292, -152219, -81550, -62288, 71167, 10364, 28271, 2801, -95678, 20635, 246392]
8728B46392L65k4696l3270Q649R1202o0578j68851J37487K61426q0177k40089
8717A37860L8590J32862l1949m244m6130j20233K8062J33604j17870k67177j05408
8706b22033q654R326J20296J57112o5157m24J14871o9275j00388o0757J32271
8695G188O0828N8892J23094r010p0486K8934O6211J15432M8630K0193o6137n5582
8683C28187j30692j14657j09544K3660J76645K0977p4041k1990j3160n117O5046
8672A45314L0091M6922l7630n576j4156l1946j38691n4380q3135l9085J37301
8661d4971k8679n3106j386Q324J0569Q3311P2755l0989j5801Q8475j57412k359
8649g1269M5218O1119K0431Q7336P2037n5513P7345p3150o0180J94543N9661m9185
$$ y = [246392, 246757, 222061, 188791, 197440, 288642, 228064, 59213, 196700, 458126, 377949, 137860, 176450, 309312, 277363, 273119, 226989, 106756, 134818, 268422, 150552, -116625, -222033, -230687, -221361, -101065, 56047, -9110, -9534, 105337, 36062, -64326, -125083, 7188, 68016, 126908, 250002, 240992, 170506, 199440, 265651, 381083, 429713, 449906, 383769, 328187, 197495, 82838, -26706, -3046, 173599, 194576, 120535, 98545, 85385, 80268, 145314, 175405, 222327, 184697, 179121, 164965, 133019, -5672, -60052, -143187, -182272, -44971, -73650, -126756, -128142, -119818, -109249, -25938, 46817, 15828, 27, 88502, -68910, -71269, -26051, 35068, 55499, 142835, 214872, 159359, 236704, 163554, 103374, 297917, 357578, 308393]
8637C08393r6757j06993P9444J66537J42941n1129j32806r8613Q1389P0599M2397
8626D05402L6987j53799j18477o9754Q1190L8091p4007J2514Q8871j02839j3827
8615A30352M5333L6185R4810m2266k49o7886J14858j3319n1058o7903O4285M3866
8603B87008J98431k1589m9173K2831M1180q243M032N8386L9550O2823J99091J15519
8591I49846N0805m9180j39195M2702N8304n7287j90006p0660J3163n7554j81601
8580C69337j10480M7832l6483J9830M4529n4580p407j59998J2944J44628K2967
8569B93119p8898K3372o8005k4203J34241J30368j11218k54782M8684K9420Q3633
8558B05731L3802R3215K4459n244R7208j41424j72948p3846J19651O6044l7215
$$ y = [308393, 211636, 104643, 184087, 350624, 493565, 442436, 309630, 211017, 292406, 363005, 405402, 442389, 288590, 170113, 100359, 181549, 219640, 145633, 158147, 247018, 144179, 130352, 175685, 211870, 306680, 264414, 264165, 196279, 311137, 297818, 246760, 178857, 243142, 287008, 485439, 463850, 414677, 437508, 478688, 470445, 474477, 532863, 572413, 635236, 834327, 949846, 1000651, 951471, 812276, 854978, 913282, 855995, 665989, 595329, 608492, 550938, 369337, 258857, 306689, 270206, 290036, 334565, 279985, 272578, 112580, 125524, 270152, 293119, 214221, 237593, 169588, 145385, 279626, 409994, 298776, 43994, 92678, 122098, 205731, 239533, 332748, 357207, 351963, 449171, 307747, 134799, 60953, 180604, 246648, 209433]
8547B09433M545N1495J36338K9370M8656l2589j69626K0893r3900j67423K8996
8536F6188r1Q4699J25988N1613j04863r6540m4896Q4562Q8216n5324p0191K3530
8524A52891n0005p8774K2411L1244J43747r6932j08531r4457P2758K36530J61867
8513C92749j64451j41363M7724J64763q8635j48132q4545O9660J03789k3071O7372
8502A95860R3164n9700j68550j45440O4863J86629J12212J5570P2389q4490N7110
8491C39617R3245n7916k4822n7165l6149l9264k7299n986Q4428l6725j18463l6043
8479G7458K9234Q1937j02895N8014j9375n8923j03954M3671J36982n8064m7918
8468C6167j15962q462J51659j216j07120J57502R5608n90O8945j75566k064r2656
$$ y = [209433, 213978, 265473, 401811, 431181, 479837, 447248, 277622, 298515, 204615, 37192, 66188, 66097, 150796, 276784, 328397, 223534, 126994, 82098, 166660, 254876, 199552, 129361, 152891, 102886, 24112, 46523, 77767, 221514, 124582, 16051, -78406, -5648, 230882, 392749, 228298, 86935, 134659, 299422, 210787, 62655, -21890, 47770, 151559, 128488, 195860, 289024, 229324, 60774, -84666, -19803, 166826, 279038, 294608, 366997, 282507, 339617, 432862, 374946, 350124, 292959, 256810, 217546, 190247, 184261, 268689, 231964, 113501, 77458, 106692, 188629, 85734, 143748, 124373, 65450, -38504, 5167, 142149, 84085, 36167, -79795, -88257, 63402, 62186, -44934, 112568, 208176, 207586, 276531, 100965, 98901, 6245]
8456F245n5544L8509J3277j06962P9265L4991N8224J29413P2785j17116L0274
8445A83361o6628r2081J9203P5130l4448p3499J66231K2470k54722K0548J20223
8434H5788j240M5394J33160k4427O8402l6562l3827p1817j46174o4332j9349J7108
8422d7876J21754J04194N5238l7405l5764K4200Q7763q3370p6730j45384n0397
8411h3777Q0806L1161L2415K3057J58441j00695j28012n5447M7550J39351m4601
8400A00249j12076j07509P1782j915k6822K1930o1290M5501J16040P1723j2493
8389A05120q1593K8226J8229n375J0176j7311n2703O8661N4979m3031j23169j16588
8377a54379o9099J71117J37984j9428P0199j36515j61948j2370O298l4391O9881
$$ y = [6245, -49299, -10790, 2487, -104475, -25210, 9781, 68005, 197418, 270203, 153087, 183361, 116733, 24652, 43855, 118985, 84537, 11038, 177269, 199739, -54983, -34435, 85788, 84548, 129942, 263102, 238675, 307077, 270515, 236688, 164871, 18697, -45635, -64984, -47876, 73878, 178072, 233310, 195905, 160141, 184341, 272104, 188734, 112004, -33380, -83777, -2971, 28190, 60605, 83662, 242103, 141408, 13396, -42051, 5499, 144850, 100249, -11827, -119336, -47554, -49469, -76291, -54361, -115651, -70150, 45890, 117613, 105120, 23527, 51753, 69982, 64607, 74783, 57472, 4769, 73430, 128409, 85378, -37791, -154379, -223478, -52361, 85623, 66195, 136394, -121, -162069, -174439, -168141, -202532, -132651]
8366a32651J27351q0936L2579l1042R4974L9060j14508j49476J02112Q0274q6668
8355a18931m732J10880m024l0489Q168q8647J32316N1429O6026J54324p3765n9477
8343A43078r137p2676p2949J49288J29453j12579j35420L7960L225J5158N8382
8332A33783q6291k7730l7669M0307O1123k1010j30598O1635M8963j40176r0887
8321a88550N044P4192Q2808l8937L6402K6976J4638p2527j23644m06o2032l6180
8309b82216J23520O6003J8455M5116r399K2901k1351L1749j4955m9370k7536r415
8297a06498J0791J34955K0803j29040j3325j23388j22758O6875R8683R9733N3666
8286i503k4332M0158m9273N4798Q2937P8471o8578o5861k229K615k4375k06365
$$ y = [-132651, -5300, -86236, -53657, -84699, 10275, 49335, -65173, -214649, -112537, -32263, -118931, -123663, -12783, -16807, -47296, -39128, -127775, 4541, 55970, 121996, 276320, 202555, 143078, 133941, 61265, -11684, 137604, 267057, 154478, 19058, 57018, 60243, 75401, 133783, 47492, 19762, -17907, 22400, 83523, 62513, -68085, -6450, 42513, -97663, -188550, -183506, -109314, -26506, -65443, -29041, -2065, 12573, -59954, -183598, -184004, -246036, -282216, -158696, -92693, -74238, -29122, -38521, -15620, -36971, -5222, -20177, -69547, -97083, -106498, -95707, 39248, 60051, -68989, -82314, -205702, -328460, -261585, -162902, -63169, -9503, -33835, 6323, -42950, 11848, 94785, 173256, 104678, 38817, 36588, 39203, 14828, -191537]
8274a91537n5747O9220N8232R529J3751M5902P7222R0352R596K3024n6074k5511
8262F7959N4962p5300j32961O3432R7711J51616k6705j67596p8042k5486J6079
8251e4331l3636N0415J36980M5872j44605J7032n5004j69418J02504J22974K2243
8240D1026L3424M5066j06630N7139J10211j52480p4142R0421q295l409K2143k276
8228E2198N9244K4323j35470L8461P3822l4615R5223L6085q0693k8268l959k15453
8216a19102l6874J44043J08121P3323o7932q0606m704q1182o9028M9414J36835
8205E2308P1905j19879J04700J4509j84707M1652N7849R989m9131j15112O8786
8194d7131J59055N9729J20774o5583o8771j7391j09390o0156O4050p212l7260
$$ y = [-191537, -247284, -178064, -119832, -110303, -96552, -50650, 26572, 116924, 126520, 149544, 93470, 67959, 122921, 47621, -85340, -21908, 75803, 227419, 200714, 33118, -44924, -70410, -54331, -87967, -37552, 99428, 145300, 695, 17727, -37277, -206695, -104191, 18783, 41026, 74450, 119516, 12886, 70025, 180236, 27756, -46386, 44035, 35740, 32331, 54474, 52198, 111442, 135765, 295, 38756, 112578, 77963, 173186, 209271, 128578, 100310, 96351, -119102, -155976, -11933, 96188, 169511, 101579, 20973, 16269, -64913, -133941, -84527, 52308, 124213, 4334, 109034, 123543, -61164, -19512, 38337, 48326, -805, -115917, -47131, 111924, 171653, 292427, 226844, 158073, 140682, 31292, -28864, 35186, 27974, -9286]
8183i286l9548O6806k2178r7356J31949K24592r6110o3222P3412j90244o9002
8172i0187Q4940o8385J8960j49k1071J08286P5417q7605r7078p9318j2609j3394
8160a82193K03388M7575N0759O6399k9082j12435r2609n270J29888J40507K8274
8149B45201q5881k3695P5657m9577n4250J5974L5622o3703o0107n9516k5432J28484
8137G8777L1317r4681N0347J9300M4673j14332j27900p1675K1518R981M1535J13004
8125A864L3143j11987L7333k7076J5689q5205L9172J7501j1143J14905L2453l0237
8113B6412r091l9511J18876N163o0188P491J9914K3543j21391q7611O5576P3501
8101B2684N3313Q9504k6718l112k01936o5106J90660j05257o0939j68312n0097
$$ y = [-9286, -48834, 17972, -4206, -101562, 30387, 254979, 158869, 95647, 169059, -21185, -90187, -5247, -73632, -54672, -54821, -75892, 32394, 107811, 20206, -76872, -156190, -168799, -182193, 21195, 68770, 119529, 185928, 156846, 44411, -48198, -53468, 76420, 216927, 245201, 159320, 135625, 211282, 161705, 107455, 123429, 159051, 95348, 35241, -24275, -49707, 78777, 110094, 15413, 65760, 85060, 129733, 15401, -112499, -184174, -162656, -152675, -111140, 1864, 35007, -76980, -39647, -66723, -51034, -136239, -97067, -79566, -90709, 24196, 56649, 26412, 17321, -22190, 96686, 101849, 41661, 49152, 69066, 92609, -28782, -116393, -50817, 22684, 75997, 165501, 138783, 135671, -66265, -131371, 59289, -45968, -106907, -275219, -325316]
8090c25316P2098J65124O3723k631k47687L8857K19308J20208m6850j8522L3923
8079G2235q4837k3491p012o8280q4726J29096Q7976L2738N9122O9556N3819j21824
8067A14372j61972q4126k4010J17381J91106J8662l4048n979n177j32187j5620
8056b1598L5040M6925j7269J61623J73237j58538j23355n7395j03585J9953J77683
8045A32721q0772j05137k4941o1420Q6299O9428L3207N2921l7810Q3648J05262
8034B53406Q005o6628l0968L4495n2138l2586J53824j1193n1968Q127j20831J347
8022I2892j53330j3604n6432P1150M0631J47264K7255j26558j23490J3464M0487
8011d0271J274J16645o8543K6668O2972J17377l8169j8399j4276j3716l9560m352
$$ y = [-325316, -253218, -88094, -24371, -27002, -274689, -235832, -16524, 103684, 56834, 38312, 72235, -12602, -36093, -43105, -111385, -196111, -67015, 20961, 53699, 112821, 182377, 236196, 114372, -47600, -131726, -155736, -38355, 152751, 171413, 137365, 131386, 126209, -5978, -21598, 13442, 60367, 43098, 204721, 377958, 219420, 96065, 38670, -64915, -44962, 132721, 51949, -53188, -78129, -139549, -53250, 16178, 49385, 102306, 64496, 148144, 253406, 261411, 194783, 163815, 198310, 146172, 113586, 267410, 256217, 204249, 212376, 91545, 92892, -60438, -74042, -130474, -59324, -18693, 128571, 155826, 29268, -94222, -80758, -40271, -38997, 77648, 9105, 35773, 98745, 216122, 177953, 159554, 145278, 131562, 92002, 87650]
7999H7650J25856J29206k0123Q2380K3912q7974r4855j33469j62035N9360J19575
7988A29483J4387m0028R5604P4825q4869J46417l139K3072N7964J2198j26594
7977B99320m7212O8118R0236r3913p1875j1347O8934J7738p978K4497j00226p2792
7965A63500k64J02988Q0939J80466J05232m1158J4623n9707j8290r1350R688j46421
7953C00246j09290J9123l0202J69406K06954J04312p2500n1769Q9269M2919j07317
7942E61151k2495p0693j8166M6044j14566j7004n1004j13795m686R2852o8708
7931B18930J42641O2319P1578R8262j54801m7507J6852N1060J47584m3247K4778
7920E88449J80458O9667j9508l1738j72410q2395m9285q4112L5944P9144K8257
$$ y = [87650, 213506, 342712, 322589, 404969, 428881, 340907, 246052, 112583, -49452, 9908, 129483, 143870, 103842, 199446, 274271, 189402, 335819, 332680, 355752, 413716, 425914, 299320, 252108, 320226, 410462, 316549, 244674, 233327, 302261, 319999, 312021, 336518, 236292, 163500, 163236, 266224, 347163, 527629, 632861, 591703, 606326, 546619, 528329, 436979, 446667, 300246, 190956, 210079, 179877, 349283, 556237, 660549, 588049, 536280, 625549, 668468, 561151, 538656, 467963, 449797, 495841, 381275, 364271, 313267, 199472, 194786, 287638, 218930, 361571, 423890, 495468, 593730, 438929, 391422, 408274, 459334, 606918, 563671, 588449, 768907, 838574, 819066, 787328, 614918, 532523, 483238, 399126, 435070, 514214, 542471]
7909E42471J08332O6205o9469n2305k1063M4094q232j7690n7275l2266j37205
7898C65597k8729j1940m7682j4261Q1120N3628L6725J12779J18195L7563j46543
7887E56452k18754j7268M7013Q1988n5674n8495J1045R868K5785p0802j38622
7876A72536j6989J70334o9380n5285N5442J3776J8215O8298m6953o1406j60003
7865H8585m9809P8209Q9183k6931m3103m4338P2602k9262K5699m8648J9693M9077
7853A80957J0271l6233L5088Q880p1704L8660O0672J37521k5696l8043n4311M8261
7841B94323p3398K4740L0749n9701n0739n1280N5417J06896m2081o1679p1485
7830A01762q674k6400m8387J76006J5129N7048j1799o8724p6806J34999J2369
$$ y = [542471, 650803, 717008, 647539, 595234, 574171, 618265, 610033, 592343, 535068, 502802, 365597, 336868, 324928, 277246, 262985, 344105, 397733, 434458, 547237, 665432, 702995, 556452, 337698, 320430, 367443, 449431, 393757, 335262, 346307, 356175, 381960, 311158, 172536, 155547, 325881, 256501, 201216, 256658, 270434, 288649, 356947, 309994, 248588, 88585, 38776, 116985, 206168, 179237, 136134, 91796, 164398, 135136, 160835, 112187, 131880, 180957, 191228, 154995, 190083, 198963, 127259, 165919, 226591, 364112, 338416, 300373, 246062, 294323, 220925, 245665, 276414, 216713, 165974, 114694, 170111, 277007, 234926, 173247, 101762, 93088, 66688, 18301, 194307, 209436, 266484, 254685, 185961, 109155, 244154, 256523]
7819B56523p4123j04302j07167k9180n0412K7590p4788Q0174n6196L8940P0234
7808b2707J21571N7586k2272R8559j06988j64770J0650q6475r303J47556N9013
7797H2420j45987O1263Q2329r2886p7665n8360k5665J11766J32814O2229p4705
7786E7553n8802j6953r930r714J3724n8582k2108M9649O8918R6038p3060k1052
7774A5681r6332q3326Q9621K8365l5071P4600O6271q2365n1164m961k0320k7812
7762a26813J3880P0844L9297n2404J14884L7116J7582m6218j0506K0295m2383
7751C5574j3513m3171q6255p112Q8430O4711K5300j4595o4554o2699m0798K9172
7739h9510j09987j37902O4925J91301O7989N7703P2004K3798o2799J9250o4717
$$ y = [256523, 182400, 78098, -29069, -58249, -108661, -81071, -155859, -75685, -131881, -92941, -22707, 98864, 156450, 134178, 232737, 125749, -39021, -28371, -114846, -124149, 23407, 82420, -63567, -2304, 80025, -12861, -90526, -148886, -174551, -62785, 70029, 132258, 57553, -1249, -18202, -28132, -37846, -24122, -82704, -104812, -55163, 13755, 109793, 36733, 15681, -80651, -163977, -74356, -45991, -81062, -6462, 59809, -22556, -73720, -78681, -99001, -126813, -112933, -42089, -2792, -55196, 59688, 96804, 114386, 68168, 57662, 77957, 35574, 22061, -21110, -107365, -114477, -26047, 38664, 63964, 49369, -15185, -77884, -118682, -89510, -199497, -337399, -272474, -81173, -13184, 44519, 116523, 140321, 77522, 96772, 32055]
7728C2055l6485K8414N9576n1741j44807l9120l0025q6443K6474J14587j03851
7717b31366k2916J35835Q6630R7484r2075n2567P6152l9065j6749N7596q857r4267
7705a04165j1732p7799j8041N1127P2238r3493l6352k4032J2264J08445J46226
7694B4686p0938o849J09558L2606L5814J5639j48281j90390q5965N582L6616L6373
7682b05549J53210P0349r4225p531N2082N1152M7860L2719K6724j16102k1896
7671a1207P369J0298L1349k3968R4805J57946o10r1640j57619M830K2110O063
7659D9726O2215j8153j77122M8515P6105O3438N3191j0239q4185j26017n1458
7648a13984o8105R0696J80167J37225j50579k09975M8931J09621L9514N7340N9873
$$ y = [32055, -4430, 23984, 83560, 31819, -112988, -152108, -182133, -268576, -242102, -127515, -231366, -254282, -118447, -31817, 65667, -26408, -78975, -2823, -41888, -58637, -1041, -9898, -104165, -115897, -193696, -211737, -160610, -88372, -181865, -218217, -242249, -229985, -121540, 24686, -46252, -53101, 56457, 89063, 124877, 140516, -7765, -198155, -284120, -278538, -241922, -205549, -52339, 18010, -76215, -83746, -31664, 19488, 67348, 100067, 126791, 10689, -11207, -3838, 6460, 37809, 13841, 108646, 266592, 265982, 174342, 16723, 21553, 43663, 49726, 111941, 93788, -83334, -34819, 41286, 104724, 157915, 147676, 63491, -62526, -113984, -182089, -91393, 88774, 225999, 75420, -134555, -85624, 23997, 63511, 120851, 180724]
7637A80724l8459j4591o1261L69r3212p4805J0477p3144p2460L8622J56903N5803
7625A4966j54002Q0417K7438J70828l5224N8115N6387l2433P8969J9353m8140
7614B36674r9504p5948m4844K8955l9683j00861j2514O4983J27664j61946j14920
7603a91944n5940N9827Q2700j6262j8506j3195M7413J52663L5412j64281o2609
7592a44722L7670O9009J06425j1462m2674p6716o2201j16057J57444J55294P2619
7581A44629M886K6008l8331q1476q8333O5827o2367R3428N0616q0509Q2750n1587
7569F5541j8488K7738N1435l3393m3082p7795k1237O2425R51r0750k525N2047
7557b7133j1628j37336l4994L00n4349L5677R7070L9306p430n2194L3702O0326
$$ y = [180724, 142265, 127674, 66413, 66782, -26430, -101235, -90758, -163902, -236362, -197740, -40837, 14966, -139036, -58619, -31181, 139647, 104423, 162538, 218925, 186492, 265461, 284814, 236674, 137170, 61222, 16378, 45333, 5650, -95211, -107725, -42742, 84922, -77024, -191944, -247884, -188057, -105357, -121619, -140125, -153320, -105907, 46756, 82168, -82113, -144722, -107052, -38043, 68382, 56920, 14246, -62470, -124671, -240728, -83284, 72010, 144629, 149515, 175523, 137192, 55716, -32617, 33210, -29157, 64271, 114887, 34378, 117128, 65541, 47053, 74791, 126226, 92833, 49751, -28044, -49281, 13144, 14095, -76655, -79180, -27133, -38761, -176097, -211091, -210791, -265140, -229463, -132393, -93087, -100517, -152711, -119009, -58683]
7545e8683J4138j02706M969K9216n8467M6163J80629j2642k00863K3375K1600
7534a13271O2041R9344L3232j03239N4109J13279L4459K622n9786j52621L8932
7523I101N8312r1253j28601J30173P1858o2370M5272j8434r9540J27551M3254
7512H5323q9312Q9323R1308n2572j41849p2233l0619P9338m9330j27824j0599
7501b29046J48923M6793k354N6304K4478M5058j22434P9556J24829j03071q0802
7490a1766m4452j5586K888M9349N0262j04056j15797K4224L0153J72720l433k0847
7478A3659j20636j08064P232o744J3735O3562n1779N2736M8943q2591O9165J33301
7466C2519r2534m8895m0189n2251l2302J58084J01348J7898K904N7399o5568p1497
$$ y = [-58683, -44545, -147251, -142282, -113066, -171533, -125370, 55259, 42617, -158246, -134871, -113271, -51230, 48114, 81346, -21893, 32216, 145495, 179954, 182576, 122790, -29831, 9101, 67413, -23840, -152441, -22268, 49590, -12780, 32492, 14058, -85482, 42069, 85323, -3989, 85334, 176642, 124070, -17779, -90012, -120631, -41293, -90623, -218447, -229046, -80123, -33330, -35684, 20620, 45098, 90156, -32278, 47278, 172107, 69036, -11766, -56218, -71804, -68916, -19567, 30695, -73361, -189158, -164934, -134781, 37939, 34506, 13659, -106977, -215041, -207809, -214553, -200818, -137256, -189035, -136299, -87356, -169947, -100782, 32519, -60015, -108910, -149099, -201350, -233652, -75568, 25780, 43678, 46582, 103981, 38413, -33084]
7454c3084m3591J01927L3060q7858Q5575J9973p9745r7595m1509O4597Q9147r3864
7442h2967l6599N4738O651j24333NL5778Q5942R0997j73081J6161R2608M2044
7430G944j1120O0545Q2689j11205j59148j18718L3611R9159l2742q0022j35515
7419c64522L9712J57550J78133P4200M1451k0276l5481r1652K1439N4381k4825
7408C0110l6128N8210p2531j33557N6365J11459n8241P614L5619m8842q2690m6114
7396a78726q6812L4839J47955N3648o238L4843L2180K6477j36906n526J20827
7385C6561L6352j4785N9729n770q0595J1031K06164L3897k31335m9770j37986
7374a36507k5043N9855P7017J9799q5968n4360P9652J29980n1691n1847o2452
$$ y = [-33084, -76675, 25252, 58312, -29546, 56029, 76002, -3743, -101338, -142847, -78250, 10897, -82967, -119566, -64828, -58177, -182510, -182505, -146727, -60785, 30212, -142869, -126708, -34100, 7944, -3176, 57369, 140058, 28853, -130295, -249013, -215402, -116243, -148985, -229007, -364522, -324810, -167260, 10873, 85073, 126524, 106248, 70767, -20885, 554, 54935, 30110, -6018, 52192, -20339, -153896, -97531, 13928, -44313, -36699, -1080, -49922, -132612, -178726, -265538, -230699, -82744, -29096, -35334, -491, 31689, 58166, -78740, -84266, 36561, 72913, 58128, 117857, 112087, 31492, 42523, 248687, 282584, 51249, 1479, -136507, -161550, -101695, -24678, -4879, -90847, -145207, -65555, 64425, 12734, -39113, -101565]
7363a01565J9913L4558j6796q378O4831o2154p4726m276P4258J95236J60348M0641
7351C21890j34493j52437n0356j35452m8219P5502O663J378r4047q802J48930
7340f9443P2784N7077j69610L2424J12825M7697k4060q2032k4292j58134l9094
7329b43858m7486J31571M7363k2693j44777l3807J05053J34942K0731L643k1367
7318g0685J54663j37296j03662R1367N988J14873Q5912M6490j06205n0150Q0272
7307A11567l4680K3001m1345j15564o6917j6741J3884j02734k9967M2276P0792
7296a46428N2020k4082p4163j4261Q437R1558J31644Q6169m7110Q9696j7148j65970
7284b9638l3171O0664Q2522j02503K5655o7815J3343r2226p3386K00322P7587
$$ y = [-101565, -81652, -47094, -63890, -72268, -7437, -69591, -144317, -148593, -74335, 120901, 281249, 321890, 187397, 34960, -15396, -150848, -199067, -123565, -116902, -115524, -209571, -218373, -69443, 3341, 60418, -109192, -76768, 36057, 83754, 59694, -22338, -46630, -204764, -243858, -291344, -159773, -112410, -135103, -279880, -313687, -208634, -73692, -52961, -49318, -70685, 83978, -53318, -156980, -65613, -59625, 55248, 141160, 187650, 81445, 31295, 111567, 76887, 99888, 58543, -57021, -123938, -140679, -126795, -229529, -259496, -217220, -146428, -94408, -118490, -192653, -206914, -198477, -106919, 24725, 110894, 63784, 153480, 136332, -29638, -62809, -2145, 80377, -22126, 3529, -64286, -50943, -143169, -216555, -16233, 61354]
7273F1354O3065K1527j16541K6287j7655M9162m2052j05102m205J29859J39360
7262B05059n4828j40640l0929k1752j9385K9669j75055k4013O8419O1509l6625
7251a38571N6815K2889R7728R7638J7900J10370l6692k12451p1087j8305j0061
7240h3827J20939J3054k6241Q703O7614M1774J8397j32859n6363K3115p9369j30269
7228b15332O4568J64751p9214K7635K1051J39253O6773m7391j48804l8597j01121
7217a46428R8442J30134j16111q8592J38326P1266J07608q3126j77198m4535p6322
7206a86536J49144P5527J1711l4942J14657p421j41662k5431J12169Q9761j61072
7195d095j24697R4811M7389n7604Q2932m6606P4856R5382j28177j39448j6224
$$ y = [61354, 124419, 145946, 29405, 55692, 38037, 87199, 45147, -59955, -64160, 65699, 205059, 150231, 9591, -21338, -43090, -62475, -32806, -207861, -231874, -163455, -101946, -138571, -81756, -58867, 38861, 136499, 154399, 264769, 228077, 15626, -55461, -73766, -83827, 37112, 50166, 23925, 32628, 100242, 142016, 160413, 27554, -28809, -5694, -85063, -215332, -150764, 13987, -65227, -37592, -16541, 122712, 189485, 142094, -6710, -45307, -146428, -47986, 82148, -33963, -122555, 15771, 87037, 194645, 111519, -65679, -110214, -186536, -37392, 38135, 49846, 14904, 129561, 122140, -19522, -44953, 67216, 156977, -4095, -128792, -33981, 13408, -44196, 38736, -7870, 66986, 162368, 34191, -105257, -121481]
7184a21481j29659k3052K40241K0092q0697k9949J87186L4451r6620O3128k4050
$$ y = [-121481, -251140, -274192, -33951, -13859, -94556, -124505, 62681, 97132, 512, 63640, 39590]
$$ [...]
##END NTUPLES=NMR SPECTRUM
##END=
